##TITLE=Analysis number 320653
Compound Code cc 44246
Book Reference 468/101
Project Code adrs
Chemist Name colinb
##JCAMPDX= 6.0         $$ Bruker NMR JCAMP-DX V2.0
##DATA TYPE= NMR SPECTRUM
##DATA CLASS= NTUPLES
##ORIGIN= Bruker BioSpin GmbH
##OWNER= nmr
$$ XWIN-NMR		Version 3.5
$$ Tue Jul  4 12:03:41 2006 GMT Daylight Time (UT+1h)  MAYBRIDGE\nmr@NMR_250MHZ
##.OBSERVE FREQUENCY= 250.131544655141
##.OBSERVE NUCLEUS= ^1H
##.ACQUISITION MODE= SIMULTANEOUS (DQD)
##.ACQUISITION SCHEME= undefined
##.AVERAGES= 16
##.DIGITISER RES= 18
##SPECTROMETER/DATA SYSTEM= dpx250
##.PULSE SEQUENCE= zg30
##.SOLVENT NAME= CDCl3
##.SHIFT REFERENCE= (INTERNAL, CDCl3, 0, 16.522)
##AUDIT TRAIL= $$ (NUMBER, WHEN, WHO, WHERE, WHAT)
$$ ##TITLE= Audit trail, XWIN-NMR		Version 3.5
$$ ##JCAMPDX= 5.01
$$ ##ORIGIN= Bruker BioSpin GmbH
$$ ##OWNER= nmr
$$ C:\u/data/dgb/nmr/ADRS/2210/pdata/1/auditp.txt
$$ ##AUDIT TRAIL=  $$ (NUMBER, WHEN, WHO, WHERE, WHAT)
(   1,<2006-07-04 12:03:19.90 +100>,<MAYBRIDGE\nmr>,<NMR_250MHZ>,
      <created by zg, POWCHK disabled, PULCHK disabled
       configuration hash MD5:
       E2 DF 36 D8 04 B2 41 60 5A D7 A3 38 5A 4B D0 FE
       data hash MD5: 64K
       C1 F1 64 3B C6 6C 53 74 8F DD B5 B5 A7 E3 F9 9C>)
(   2,<2006-07-04 12:03:31.70 +100>,<MAYBRIDGE\nmr>,<NMR_250MHZ>,
      <Start of raw data processing
       ef LB = 0.3 FT_mod = 6 PKNL = 1 SI = 32K 
       data hash MD5: 32K
       E0 63 83 52 BC BD 5B 0D 09 F7 27 51 D0 8B B6 4E>)
(   3,<2006-07-04 12:03:33.24 +100>,<MAYBRIDGE\nmr>,<NMR_250MHZ>,
      <apk 
       data hash MD5: 32K
       C3 4E 5C 4F 00 25 63 48 A6 16 2D 66 4D A7 43 31>)
(   4,<2006-07-04 12:03:33.99 +100>,<MAYBRIDGE\nmr>,<NMR_250MHZ>,
      <abs ABSG = 5 
       data hash MD5: 32K
       D4 5A B0 F4 6E 45 31 A9 1C 87 7C 36 31 D3 17 F0>)
$$ ##END=
$$ 
$$ hash MD5
$$ F7 87 E5 FD 4B 0D 91 28 7D C1 23 0D 5D 17 0E FA
##$RELAX= 
##$RELAX= 
##$RELAX= 
##$RELAX= 
##$RELAX= 
##$RELAX= 
##$RELAX= 
$$ Bruker specific parameters
$$ --------------------------
##$DU= <C:\u>
##$EXPNO= 2210
##$NAME= <ADRS>
##$PROCNO= 1
##$TYPE= <nmr>
##$USER= <dgb>
##$AMP= (0..31)
100 100 100 100 100 100 100 100 100 100 100 100 100 100 100 100 100 100 
100 100 100 100 100 100 100 100 100 100 100 100 100 100 
##$AQSEQ= 0
##$AQ_mod= 3
##$AUNM= <au_zg>
##$AUTOPOS= <21 >
##$BF1= 250.13
##$BF2= 250.13
##$BF3= 250.13
##$BF4= 250.13
##$BF5= 500.13
##$BF6= 500.13
##$BF7= 500.13
##$BF8= 500.13
##$BYTORDA= 1
##$CFDGTYP= 0
##$CFRGTYP= 5
##$CHEMSTR= <none>
##$CNST= (0..31)
1 1 145 1 1 1 1 1 1 1 1 1 1 1 1 1 1 1 1 1 1 1 1 1 1 1 1 1 1 1 1 1 
##$CPDPRG= <>
##$CPDPRG1= <>
##$CPDPRG2= <>
##$CPDPRG3= <>
##$CPDPRG4= <mlev>
##$CPDPRG5= <mlev>
##$CPDPRG6= <mlev>
##$CPDPRG7= <mlev>
##$CPDPRG8= <mlev>
##$CPDPRGB= <>
##$CPDPRGT= <>
##$D= (0..31)
0 1 0 0 0 0 0 0 0 0.06 0 0 0 0 0 0 0.0002 0 0 0 0 0 0 0 0 0 0 0 0 0 0 
0 
##$DATE= 1152010998
##$DBL= (0..7)
120 120 120 120 120 120 120 120 
##$DBP= (0..7)
150 150 150 150 150 150 150 150 
##$DBP07= 0
##$DBPNAM0= <>
##$DBPNAM1= <>
$$ [...]
##$SUBNAM7= <"">
##$SUBNAM8= <"">
##$SUBNAM9= <"">
##$SW= 20.6930455092707
##$SWIBOX= (0..15)
0 0 3 0 0 0 0 0 0 0 0 0 0 0 0 0 
##$SW_h= 5175.983436853
##$TD= 65536
##$TD0= 1
##$TE= 296.16
##$TE2= 300
##$TE3= 300
##$TEG= 300
##$TL= (0..7)
0 120 120 120 120 120 120 120 
##$TP= (0..7)
150 150 150 150 150 150 150 150 
##$TP07= 0
##$TPNAME0= <>
##$TPNAME1= <>
##$TPNAME2= <>
##$TPNAME3= <>
##$TPNAME4= <>
##$TPNAME5= <>
##$TPNAME6= <>
##$TPNAME7= <>
##$TPOAL= (0..7)
0.5 0.5 0.5 0.5 0.5 0.5 0.5 0.5 
##$TPOFFS= (0..7)
0 0 0 0 0 0 0 0 
##$TUNHIN= 0
##$TUNHOUT= 0
##$TUNXOUT= 0
##$USERA1= <user>
##$USERA2= <user>
##$USERA3= <user>
##$USERA4= <user>
##$USERA5= <user>
##$V9= 5
##$VALIST= <valist>
##$VCLIST= <CCCCCCCCCCCCCCC>
##$VD= 0
##$VDLIST= <DDDDDDDDDDDDDDD>
##$VPLIST= <PPPPPPPPPPPPPPP>
##$VTLIST= <TTTTTTTTTTTTTTT>
##$WBST= 1024
##$WBSW= 4
##$XGAIN= (0..3)
0 0 0 0 
##$XL= 0
##$YL= 0
##$YMAX_a= 382151
##$YMIN_a= -616843
##$ZGOPTNS= <>
##$ZL1= 120
##$ZL2= 120
##$ZL3= 120
##$ZL4= 120
##$ABSF1= 16.522
##$ABSF2= -4.171173
##$ABSG= 5
##$ABSL= 3
##$ALPHA= 0
##$AQORDER= 0
##$ASSFAC= 0
##$ASSFACI= 0
##$ASSFACX= 0
##$ASSWID= 0
##$AUNMP= <proc_1d>
##$AZFE= 0.1
##$AZFW= 0.1
##$BCFW= 0
##$BC_mod= 0
##$BYTORDP= 0
##$COROFFS= 0
##$CY= 12.5
##$DATMOD= 1
##$DC= 0
##$DFILT= <>
##$DTYPP= 0
##$F1P= 14.0000005364418
##$F2P= -0.99999901652339
##$FCOR= 0.5
##$FTSIZE= 32768
##$FT_mod= 6
##$GAMMA= 0
##$GB= 0
##$INTBC= 1
##$INTSCL= 1
##$ISEN= 128
##$LB= 0.3
##$LEV0= 0
##$LPBIN= 0
##$MAXI= 10000
##$MC2= 0
##$MEAN= 0
##$ME_mod= 0
##$MI= 0
##$NCOEF= 0
##$NC_proc= -3
##$NLEV= 6
##$NOISF1= 0
##$NOISF2= 0
##$NSP= 0
##$NTH_PI= 0
##$NZP= 0
##$OFFSET= 16.522
##$PC= 1
##$PHC0= 161.3763
##$PHC1= 6.349722
##$PH_mod= 1
##$PKNL= yes
##$PPARMOD= 0
##$PSCAL= 4
##$PSIGN= 0
##$REVERSE= no
##$SF= 250.13
##$SI= 32768
##$SIGF1= 0
##$SIGF2= 0
##$SINO= 400
##$SIOLD= 32768
##$SREGLST= <1H.CDCl3>
##$SSB= 0
##$STSI= 32768
##$STSR= 0
##$SW_p= 5175.98343685301
##$SYMM= 0
##$S_DEV= 0
##$TDeff= 65536
##$TDoff= 0
##$TI= <Analysis number 999999
Compound Code 99
Book Reference 9
Project Code 9>
##$TILT= no
##$TM1= 0
##$TM2= 0
##$TOPLEV= 0
##$USERP1= <user>
##$USERP2= <user>
##$USERP3= <user>
##$USERP4= <user>
##$USERP5= <user>
##$WDW= 1
##$XDIM= 32768
##$YMAX_p= 322126607
##$YMIN_p= -83955
$$ End of Bruker specific parameters
$$ ---------------------------------
##NTUPLES= NMR SPECTRUM
##VAR_NAME=  FREQUENCY,     SPECTRUM/REAL,   SPECTRUM/IMAG
##SYMBOL=    X,             R,               I
##VAR_TYPE=  INDEPENDENT,   DEPENDENT,       DEPENDENT
##VAR_FORM=  AFFN,          ASDF,            ASDF
##VAR_DIM=   32768,         32768,           32768
##UNITS=     HZ,            ARBITRARY UNITS, ARBITRARY UNITS
##FACTOR=    0.157963299565203, 1,           1
##FIRST=     4132.6476996994, 0,             0
##LAST=      -1043.33573715361, 0,           0
##MIN=       -1043.33573715361, -83955,      0
##MAX=       4132.6476996994, 322126607,     0
$$ Real data points
##PAGE= N=1
##DATA TABLE= (X++(R..R)), XYDATA
$$ [...]
18505C96138j6396n198j1422r448j2272o695J2749L744O636r63p610q75j4350
18492C34038r753j0586j1169j1473l854j2097j9185j0214j1597j3606J5101k111
18480B33494j6629j9859j2332j9808j3937n854P492j300m433r10M83K774L143
18467A52324R138m060M009K4472p70L812n101j5259j0823p79j59P151L110l1O837
18452A73871L273j1155k5477J579J8457K511p571m303k0413j1976P446k138r362
18439A14742j2686J559K523P354J680R82R371J844o494j971k779o846J81l551
18425A05909o202J9849L433J6256K5462j3006k637M820j6013j5207L641J9231
18413A45536K6058Q289j1269j8942J5979O797j8808o405j4284J0670M923j0839
$$ y = [396138, 379742, 374544, 363122, 353674, 341402, 334707, 347456, 351200, 357836, 356873, 349263, 348388, 334038, 324285, 313699, 302530, 291057, 287203, 275106, 255921, 245707, 234110, 220504, 235605, 233494, 216865, 197006, 184674, 164866, 150929, 145075, 152567, 151267, 146834, 145924, 146407, 149181, 152324, 161462, 157402, 161411, 185883, 185113, 188925, 183824, 168565, 157742, 156963, 156804, 163955, 167065, 167034, 173871, 177144, 165989, 140512, 142091, 160548, 163059, 155488, 151185, 130772, 118796, 126242, 124104, 114742, 102056, 103615, 106138, 113492, 115172, 116154, 125525, 127369, 120875, 118904, 116125, 109279, 109460, 105909, 99707, 119556, 122989, 139245, 164707, 151701, 149064, 153884, 137871, 122664, 126305, 145536, 171594, 179883, 168614, 149672, 165651, 172448, 153640, 147235, 132951, 143621, 148544, 137705]
18401A37705k192J7257N983q456j8664j3684J3958k98o791n404j3777J5326J8233
18388A39196J1748j7813r647K0343J1945l172k03J415j7885j0419J4255j085M906
18375A43584k086k3703j7915R927k948J860L5982J0715o521o198J0772r228l894
18362A40347j167J4473Q500j4551j1937q963J4050J7720n764j9894j0896K384
18350A24302K1284K5113J06l342j2566j7517j2462K1893K1705K0589J606R371
18338B00082J448J4359K7289K4473N1990N8929M4371L7036K3154J6954K2192j4304
18326E07973j6032k2197k0591J558J9050l251j1314K673J3963n516M386L6737
18314E07439O5482N1249L0577j706j4008j4623l8366l6304n3584n4026m2979l8114
$$ y = [137705, 135513, 152770, 158753, 150297, 131633, 117949, 131907, 131609, 124818, 119414, 105637, 120963, 139196, 150944, 133131, 123484, 143827, 155772, 152600, 152397, 153812, 135927, 125508, 139763, 138678, 143584, 141498, 117795, 99880, 109807, 106859, 108719, 144701, 155416, 148895, 142697, 153469, 144241, 140347, 139180, 153653, 162153, 147602, 135665, 126702, 140752, 158472, 152708, 132814, 121918, 124302, 145586, 170699, 170805, 167463, 154897, 137380, 124918, 146811, 168516, 189105, 190711, 200082, 201530, 215889, 243178, 267651, 319641, 378570, 422941, 459977, 483131, 500085, 522277, 507973, 491941, 469744, 449153, 450711, 469761, 466510, 455196, 457869, 471832, 466316, 470702, 507439, 572921, 624170, 654747, 653041, 639033, 624410, 586044, 549740, 496156, 442130, 399151, 361037]
18302C61037k9881j9763k952J1828j613k2399N40J0917l153l40K1527n543j3388
18289C06817j9852j3047J4885p868r040M201J5277J8936j537N50J2228J3413J9558
18276C54521R164o824J3120J1505K5785R276P266O789p81J6056L870P921P3P607
18262D65348J4223m02J7909J8850j9384l8874k7329Q183J0341j3388k2753J5142
18250D27866J2097K362K6357K3762K6608K3826K9765K1459K7445J0274L0386L7375
18238F99582M0543K5373O9046N5116N6186O6243N8251P2326J27000J16920J10424
18227A497010J07337J46248J87250K01501K30359K50677K68077L36930M15242
18218C640631N18689O80531R39641J234259J501746J770790K196570K756491L164862
$$ y = [361037, 331156, 311393, 308441, 320269, 318656, 296257, 296797, 307714, 304561, 304221, 325748, 320205, 306817, 286965, 273918, 288803, 280935, 271895, 276096, 291373, 310309, 308772, 309322, 321550, 334963, 354521, 363685, 356861, 369981, 381486, 407271, 416547, 423813, 430602, 429821, 445877, 449747, 457668, 457741, 465348, 479571, 479169, 497078, 515928, 496544, 457670, 430341, 438524, 448865, 435477, 412724, 427866, 439963, 442325, 468682, 492444, 519052, 542878, 572643, 594102, 621547, 631821, 662207, 699582, 740125, 765498, 834544, 889660, 945846, 1012089, 1070340, 1142666, 1269666, 1386586, 1497010, 1604347, 1750595, 1937845, 2139346, 2369705, 2620382, 2888459, 3225389, 3640631, 4159320, 4839851, 5779492, 7013751, 8515497, 10286287, 12482857, 15239348, 18404210]
18209A8404210L227989L241420L580908M102497M044573L280710K696370K847866
18201D5426543L108152K428569J044089K81418M71392N00724n53440j933795k446975
18192D8326677k191438k255526l096108l896784l853282l324935l105608l252050
18184B3350946l223996k753380k135673j747405j521825j267372r90809p63085
18176H947401o00924n06875m39704l92950l62186l29937l02617k99008k93780
18167E419420k76921k52866k38270k34816k27756k08273j73804j78371j83506
18158C444837j73952j39933j38892j14248r3281j09092j05075q3953r1840p7453
18148B317118n8867o7761l8977l6247m1100n6044n9822m2099j4649J5637k1023
$$ y = [18404210, 21632199, 24873619, 28454527, 32557024, 36601597, 39882307, 42578677, 45426543, 48534695, 50963264, 52007353, 52288771, 52760163, 53260887, 52707447, 50773652, 48326677, 46135239, 43879713, 40783605, 36886821, 33033539, 29708604, 26602996, 23350946, 20126950, 17373570, 15237897, 13490492, 11968667, 10701295, 9710486, 8947401, 8346477, 7839602, 7399898, 7006948, 6644762, 6314825, 6012208, 5713200, 5419420, 5142499, 4889633, 4651363, 4416547, 4188791, 3980518, 3806714, 3628343, 3444837, 3270885, 3130952, 2992060, 2877812, 2784531, 2675439, 2570364, 2486411, 2394571, 2317118, 2258251, 2190490, 2151513, 2115266, 2074166, 2018122, 1958300, 1916201, 1901552, 1917189, 1896166]
18137A896166m3847m2360n2212l7682n4373n3668m8806k1007J039R896R034R65
18125A563145L5740M5557O1935P8543R9395J25993J42309J98100L48401N25929
18115C225047Q53489J461578K699207M610260M684363J623490M755K08324N37345
18106A9907858j704357n478824m539370k372956j304255p67911n07487l57787
18098B874911k94339k36622j59917j09961q0540r0129r0352o0959k8412m4123
18088A679557n6889o7004q1570p7693q0815o7469o7886o5451p7552q0355p0507
18077H86366m8098k1431l4324k7602k4200j9006j9982q250n613k1474l4622l3074
18065E88690l4442j6371j9209p171j5336q593n913k4602l7620j9878r383j319
$$ y = [1896166, 1852319, 1809959, 1757747, 1720065, 1665692, 1612024, 1563218, 1542211, 1543250, 1553146, 1562180, 1563145, 1598885, 1644442, 1706377, 1784920, 1884315, 2010308, 2152617, 2350717, 2699118, 3225047, 4078536, 5540114, 8239321, 12849581, 17533944, 19157434, 19162189, 19370513, 19907858, 18203501, 12724677, 8185307, 5812351, 4508096, 3740185, 3232698, 2874911, 2580572, 2343950, 2184033, 2074072, 1993532, 1903403, 1813051, 1752092, 1723680, 1679557, 1622668, 1555664, 1474094, 1396401, 1315586, 1248117, 1180231, 1114780, 1037228, 956873, 886366, 838268, 816837, 782513, 754911, 730711, 711705, 691723, 683473, 677860, 656386, 621764, 588690, 554248, 537877, 518668, 511497, 496161, 487568, 481655, 457053, 419433, 399555, 390172, 388853]
18053C88853l588n472n647q09K798O54o600n319j576k0253j848j8701j2315J0933
18039C21110K9991J4143k6763j5900k2071m7166m599L0741J377Q970q937j8820
18027B62076L965N744k5669j3236j4654q503J2447J4869Q429L941N016j0575J0140
18014B53990N170l013k8684k1592q96J7350K976p505J350o897m608p2O576j6017
18000A98128l488l377j0953P058K244j5074J0990p599k6144j7929j4527J6881
17988A36210N168o688N188J334O405j516o990r726q670J3234J1318K706M096P274
17974A59343r024j2308r1M434p948k733J9792J0000J1708K4275J803q032J6153
17961B07372K968K281K946M004r843m289L035K5093l107j8122j2806K378K1214
$$ y = [388853, 385265, 379793, 374146, 373337, 376135, 376789, 370189, 364870, 363294, 343041, 341193, 322492, 310177, 321110, 351101, 365244, 338481, 322581, 300510, 253344, 248745, 279486, 280863, 289833, 280896, 262076, 266041, 271785, 246116, 232880, 218226, 209723, 222170, 237039, 245468, 249409, 254425, 243850, 253990, 259160, 256147, 227463, 205871, 204975, 222325, 225301, 217796, 219146, 212249, 207641, 207569, 214145, 198128, 194640, 191263, 180310, 187368, 189612, 174538, 185528, 177929, 151785, 133856, 119329, 136210, 141378, 134690, 139878, 141212, 147617, 146101, 139111, 129385, 120715, 133949, 145267, 147973, 152069, 159343, 150319, 138011, 137920, 142354, 134406, 131673, 151465, 161465, 173173, 197448, 199251, 191219, 207372, 210340, 212621, 215567, 219571, 209728, 205439, 208474, 233567, 230460, 212338, 199532, 201910, 223124]
17948B23124J8870q113m541K0993N636j1560j5918j4644r684R148j1508j3431
17936A88372J5998J0305l641j4399j1758Q809m888M870N557P276q958o262j3365
17923A77916n43N547J1679Q498r247R034J9613O206j3973j4252j5243O563J923
17910A93721O429K4967N05k68J3700J2112N85J4770J5112r579j2195j1749N597
17897B53707R404l11M041L2484J9405o174J4854J9150J5589P830n469M426M0165
17884D09101J6293O0l492P6j380N637m505n199K1298r146J8787K9558K1330K0179
17870E18597Q534K8178M3116K9565M1649M5503K9114M1219M2020L0901N0419P1337
17858I80152M9808P5083P1806O1298O2693O3628O2768Q2427J09367J18444J27939
$$ y = [223124, 241994, 233881, 229340, 250333, 255969, 244409, 228491, 213847, 204163, 213311, 201803, 188372, 204370, 214675, 211034, 196635, 184877, 193686, 188798, 193668, 199225, 206501, 197543, 191281, 177916, 177373, 182920, 194599, 203097, 193850, 202884, 222497, 228703, 214730, 200478, 185235, 191798, 193721, 200150, 225117, 225622, 225354, 239054, 251166, 251751, 266521, 281633, 272054, 259859, 248110, 253707, 263111, 262800, 266841, 299325, 318730, 312556, 327410, 346560, 362149, 369979, 364510, 368936, 409101, 425394, 425454, 421962, 422038, 420658, 426295, 421790, 416591, 437889, 428743, 447530, 477088, 498418, 518597, 527131, 555309, 598425, 627990, 669639, 715142, 744256, 785475, 827495, 858396, 908815, 980152, 1029960, 1105043, 1176849, 1238147, 1300840, 1364468, 1427236, 1509663, 1619030, 1737474, 1865413]
17847A865413J56620J89294K13925K52143K97937L61110M91737P21838J142108
17838E692125J732831K501243L179919L663123M068831L861528K937739J887150
17830B9524489R43196K57336m58316q58782l20461M58262Q14066N81291L7941
17821C0979022p28245j585350k631929l697735l740122l268621k831481k156092
17813A0339447j460751j000489o82811m98301l82629l31946k41391k23751k09086
17804E308292j74759j37786j39225j15928o1243l5935j0675J8899L2325O9951
17794D753916J11485J27055J87866K64829L90122O10253R49756J485486K160173
17785A1040941K773505L233949L617292L532945K716921J777754R52770L78561
$$ y = [1865413, 2022033, 2211327, 2425252, 2677395, 2975332, 3336442, 3828179, 4550017, 5692125, 7424956, 9926199, 13106118, 16769241, 20838072, 24699600, 27637339, 29524489, 30467685, 30725021, 30266705, 29407923, 29087462, 29545724, 30359790, 30941081, 30979022, 30250777, 28665427, 26033498, 22335763, 18595641, 15327020, 12495539, 10339447, 8878696, 7878207, 7195396, 6697095, 6314466, 5982520, 5741129, 5517378, 5308292, 5133533, 4995747, 4856522, 4740594, 4679351, 4643416, 4632741, 4651640, 4683965, 4753916, 4865401, 4992456, 5180322, 5445151, 5835273, 6445526, 7395282, 8880768, 11040941, 13814446, 17048395, 20665687, 24198632, 26915553, 28693307, 29646077, 30024638]
17777C0024638k23553o51425j98088N37554R45613Q85761N61712O1806m87446
17768C1456572j043589j469329p15376J121899L305688N503608O662640O077490
17760E0899603M157783J822172n87792l294250n995728p742823p765562o280372
17752B5213031m264600k578855j382679n24212K42227J199279K514954M321713
17744B4740858O346132P779032P768470O160303L706745J089383j603831m570241
17736E1416851p263890q523143p940961o157994m249882k841478j941030j417373
17728A1081100j079520q04751o30169m93285m08068l54690k69212k34650k35594
17719F571161k26794k14035k10474k39072k48052k29127k34487k45875k24049
$$ y = [30024638, 29801085, 29149660, 28951572, 29489126, 30434739, 31320500, 31882212, 31944018, 31456572, 30412983, 28943654, 28228278, 29350177, 32655865, 38159473, 44822113, 50899603, 55057386, 56879558, 56291766, 52997516, 47001788, 39258965, 31493403, 25213031, 20948431, 18369576, 16986897, 16462685, 16704912, 17904191, 20419145, 24740858, 31086990, 38866022, 46634492, 52794795, 56501540, 57590923, 55987092, 51416851, 44152961, 35629818, 27688857, 21530863, 17280981, 14439503, 12498473, 11081100, 10001580, 9196829, 8566660, 8073375, 7665307, 7310617, 7041405, 6806755, 6571161, 6344367, 6130332, 5919858, 5680786, 5432734, 5203607, 4969120, 4723245, 4499196]
17710D499196k29268k31563k18836j85985j50480j01243r3673q1957p5534p4497
17700C056160q1843j00710r4845n7526o9090j00235j07670j22274r9907q4029
17690B138031q6100r1673o2542o6375o9864p7914n6747q1242n1226m4807m9184
17679A400357o9806m0387m2560l0170m0817m3896m1981l8331j6683p834k2558
17668A005334k9816m8266l0414k5286l0158m9426n9173l9685j2804j9853l2435
17657F28018m4761k8970j5064j0399j3675j9173l2954p901Q517r419m648r812
17645D39759j8018j9233l4374l2777k2422j6566k4185j6108r924r640L488J5732
17633B55732k954j8756L967j3988l0318j9556k4259m479j3833k9807J584J5823
$$ y = [4499196, 4269928, 4038365, 3819529, 3633544, 3483064, 3381821, 3288148, 3206191, 3130657, 3056160, 2974317, 2873607, 2778762, 2721236, 2652146, 2551911, 2444241, 2321967, 2222060, 2138031, 2051931, 1960258, 1897716, 1831341, 1761477, 1683563, 1626816, 1545574, 1494348, 1449541, 1400357, 1330551, 1290164, 1247604, 1217434, 1176617, 1132721, 1090740, 1052409, 1035726, 1027892, 1005334, 975518, 927252, 896838, 871552, 841394, 791968, 732795, 693110, 680306, 660453, 628018, 583257, 554287, 539223, 528824, 515149, 495976, 463022, 455121, 463638, 454219, 449571, 439759, 421741, 402508, 368134, 335357, 312935, 296369, 272184, 256076, 246152, 236512, 240000, 255732, 252778, 234022, 237989, 224001, 193683, 174127, 149868, 145389, 131556, 101749, 103333, 119156]
17621A19156o91J0258J9215j3630j7266j449J1917k781J021p652k043r45l890
17608A11220n166J143K159O512J5871K0530r9j3446k0842k943K697k2323o206
17595H9107M58k79j2310n306o535P312N603o598J4162J3489M021J1615n59j2322
17581A01858j0579p9N821j0694M662L375j2446j0878K094p624r926j1478J0618
17568E4724K1653m426j6170J0659l92J625l088o563o476Q887O856N685j1752l315
17554E7907j0039k5683l412P690P342K591L919R023J576J1190l348J2044J588
17541G2388j2906j0973J0813K6632N988j9022j1149r440J6136j2208J2666n621
17529F3304k829j5504n278K066Q727R02M585j1591k7400l689J0620J4468K0402
$$ y = [119156, 118465, 128723, 147938, 134308, 117042, 115593, 127510, 124729, 125750, 118098, 116055, 115110, 111220, 106054, 107197, 109356, 115868, 131739, 152269, 152170, 138724, 117882, 114939, 117636, 95313, 89107, 89565, 89286, 76976, 71670, 65135, 72447, 78050, 71452, 85614, 99103, 103124, 114739, 114180, 101858, 91279, 91200, 97021, 86327, 90989, 94364, 81918, 71040, 73134, 65510, 55584, 44106, 54724, 76377, 71951, 55781, 66440, 66048, 67673, 64585, 58022, 51546, 60433, 67289, 72974, 61222, 57907, 47868, 22185, 18773, 26463, 33805, 36396, 40315, 49338, 50914, 62104, 58756, 70800, 72388, 59482, 48509, 59322, 85954, 91942, 72920, 61771, 52331, 68467, 56259, 68925, 63304, 60475, 44971, 39693, 41759, 50486, 51388, 55973, 44382, 16982, 13293, 23913, 38381, 58783]
17516E8783P593m302O632K2813p895j8108p882r372J0093j6013j79P330p020j2069
17502C0404q825Q01r331j8472l395J0088j2640j2576J028P767J8726j291j7965
17489a5681M596J5746j01J01j485p486m240J7129Q829j1187j4412j2522n61O108
17475a5166J6041n133j6292O302J4452R666j3465k1454K1680J3362R642k425J2339
17462B9549j928j4428m841j3905q799q748N625Q026J6195k638J891Q164J5765
17449B9928m892l235J2640J0639K4379L508K793m501J4000J4019j0626l4388k1354
17436C2910m215j4058l152J0680k764k722j5525j7530j735p544J6793K6674J3722
17423C1534J0289j1060k2081r008J4032L1762P163O710J0182K7305L7714M1772
$$ y = [58783, 66376, 62074, 68706, 91519, 83624, 65516, 57634, 48262, 58355, 42342, 42163, 49493, 42473, 30404, 21579, 22380, 13049, -5423, -8818, 1270, -11370, -23946, -22918, -15151, 3575, 2284, -15681, -11085, 4661, 4560, 4661, 3176, -4310, -8550, 8579, 17408, 6221, -8191, -20713, -21274, -15166, 875, -4258, -20550, -14248, 204, 9870, -3595, -25049, -3369, 9993, 19635, 17210, 29549, 27621, 13193, 8352, -5553, -14352, -23100, -17475, -9449, 6746, 4108, 5999, 14163, 29928, 25036, 21801, 34441, 45080, 69459, 72967, 75760, 71259, 85259, 99278, 88652, 54264, 32910, 28695, 14637, 11485, 22165, 19401, 16679, 1154, -16376, -18111, -25655, -8862, 17812, 31534, 41823, 30763, 8682, -326, 13706, 45468, 52631, 59341, 69523, 96828, 134542, 176314]
17411A76314K0130J4332P888J4843k390j5381o157n420j9909m0904l5827j6897
17399I0622j7403r539K6057P509L0957L1692J3904k509J8028L0768J1935O104
17387B38125J0487L054j9856J232j0675k2299j1410j3548k5735k8831j5690l160
17375A01694j2940o046k809J6568j1750q845k4582j3314k05K23j2442L866M171
17362C3589j3113r132j882Q654k369m233J2745R640j0275P222j6648M556m230
17349A4524J2262l867j7223j2139p98K915J9044K2112J994n367L5727L9296K7411
17336A35891K9946j3497m804P052o490N485R727j1500o160k230K835j1923L3265
17323A67597K6284k2778m2897k8555k7419j8885j4791q033O578o654k304l51j2688
$$ y = [176314, 196444, 210776, 218664, 233507, 231117, 215736, 209579, 204159, 184250, 143346, 107519, 90622, 73219, 63680, 89737, 97246, 128203, 159895, 173799, 171290, 189318, 220086, 232021, 238125, 248612, 251666, 231810, 233042, 222367, 200068, 188658, 175110, 149375, 120544, 104854, 101694, 88754, 82708, 79899, 96467, 84717, 75872, 51290, 37976, 37771, 37994, 25552, 29418, 33589, 20476, 11344, 9462, 18116, 15747, 11514, 24259, 33899, 23624, 30846, 14198, 18754, 14524, 26786, 22919, 5696, -6443, -7241, -4326, 14718, 36830, 38824, 33457, 69184, 108480, 135891, 165837, 152340, 147536, 154588, 148098, 153583, 163310, 151810, 145650, 143420, 146255, 134332, 167597, 193881, 171103, 128206, 99651, 72232, 53347, 38556, 30523, 37101, 30447, 28143, 27792, 15104]
17310A5104p725q520l34n339M613K9968J7563q336r184m207j3560n16J424k2331
17296a1380R138J7456R361j6992N663J1623J877m965J5470K8599J3088K3815K5508
17283A28261M42P679J9223L048o719l239J1043j947j972M127j381m377j6329n579
17269A32280j5056m3702l3476j4480n949Q189o252p56P889j3757Q128J0137J2543
17256D5738q670l2591j9631J0685l877P89L94m722n569J4471M76N674j688j9239
17242a7760K12q791J1898j0079p050J3304r541j0J6881J8671q276k1546N02J6683
17228d902n931R250J0920j1321n876P512o445j4014K1219J312J7290l459j8516
17215b961J85m727j1139K637J4243J3007r549k3987J6540K3292O946k107m104
$$ y = [15104, 7379, -1141, -1475, -6814, -2201, 27767, 45330, 36994, 27810, 23603, 10043, 9527, 10951, -11380, -2242, 15214, 24575, 7583, 13246, 24869, 26746, 21781, 37251, 65850, 78938, 102753, 128261, 128703, 136382, 155605, 158653, 151934, 148695, 159738, 157791, 155819, 159946, 158565, 154188, 137859, 132280, 117224, 73522, 40046, 25566, 19617, 27806, 21554, 20798, 28687, 14930, 23058, 33195, 45738, 37068, 4477, -15154, -4469, -8346, -7557, -7163, -11885, -17454, -2983, -2507, 3167, 1479, -17760, -17548, -26339, -14441, -24520, -31570, -18266, -27807, -27817, -10936, 7735, -541, -22087, -21585, -4902, -10833, -1583, 9337, -1984, -7860, -348, -6793, -20807, 412, 1724, 19014, 15555, -2961, -2776, -7503, -18642, -16005, -1762, 11245, 1696, -22291, -5751, 17541, 24487, 22380, 18276]
17202A8276Q869j1226o321J5604J0887N143j294j7366k170N724N013J0163K4974
17189F6276J5274Q962J2557L0974O6885K6537J0167m692k2437n408Q778k5086
17177A88787l8396k2760k9862l1856K156O906J8646J2446K81K6047K3902L2569
17165A88866M8651M7210J9260l66l1670l3988k8092l7265l3771m5573m0627j1599
17153D1036N852j3279K310Q919n539n720P112m462r206k0383P943J5871L238l221
17139C0471K832p029r527m058r072j0935J0313J4474K745j9051r581J4603k412
17126C773P301L251o398J068j19J174J6376k336N182J0207p279J7J5531K2667
17112G0415N219n210j7867j9442j485J0494J4160j1914q683j0803k7309o295K5133
$$ y = [18276, 27145, 15919, 9598, 25202, 36089, 41232, 39938, 22572, 20402, 26126, 31139, 41302, 66276, 81550, 90512, 103069, 134043, 200928, 227465, 237632, 232940, 210503, 205095, 213873, 188787, 150391, 127631, 97769, 65913, 68069, 74975, 93621, 106067, 106348, 132395, 156297, 188866, 237517, 284727, 303987, 303621, 271951, 237963, 209871, 172606, 138835, 93262, 52635, 41036, 46888, 33609, 35919, 44838, 39299, 33579, 40691, 36229, 27023, 6640, 14583, 30454, 33692, 30471, 33303, 26274, 16747, 12689, 3617, -7318, 2995, 17469, 20214, 1163, -8418, 6185, 3773, 11074, 14325, 7927, 8995, 8876, 10050, 26426, 24090, 29272, 39479, 32200, 32217, 47748, 70415, 75634, 70424, 52557, 33115, 31630, 42124, 56284, 44370, 35687, 24884, -2425, -8720, 16413]
17099A6413J9472K8329j4528m687p202l516o347l384Q523q933J8304K5380o157
17086F1667j013j172m268n896j805l389q369m178M130J260m469J67J2011n12J3822
17071E7986j3179j2314j239J9665j2641l2954j8223J3246l177m192j153L516K974
17058a685J0657L469J7853R181l859j4422L97L5047J4700p152l468P189j3663
17045E4244j5216p419N422K475j568K759l297o223R059k253K1944o583n474Q898
17031E6768J8730P073R058n205O468J2852j8080j7890j2358n705q955k317J6040
17018E6479j1671q729Q167N248J1628M189M112j0013m675m823R968l71r238j0161
17004D0110j511L484r125K780R949P619r546J560L676M773Q53o597j7452k412
$$ y = [16413, 35885, 64214, 49686, 44999, 37797, 34281, 27934, 24550, 33073, 24140, 42444, 67824, 61667, 60654, 59482, 55214, 49318, 47513, 44124, 35755, 31577, 35707, 36967, 32498, 32665, 44676, 44164, 57986, 44807, 32493, 31254, 50919, 38278, 5324, -12899, 347, -2830, -7022, -8175, -4659, -1685, 8972, 12441, 30294, 39475, 35616, 21194, 21591, 56638, 71338, 64186, 60718, 67907, 54244, 39028, 31609, 37031, 39506, 37938, 40697, 37400, 31177, 40236, 37983, 59927, 53344, 47870, 56768, 75498, 82571, 91629, 86424, 92892, 105744, 87664, 69774, 57416, 51711, 42756, 40439, 56479, 44808, 36079, 44246, 49494, 61122, 65311, 69423, 59410, 54735, 49912, 59880, 59509, 50271, 40110, 38599, 42083, 32958, 35738, 45687, 53306, 43760, 45320, 48996, 53769, 54622, 48025, 30573, 28161]
16990B8161K5673J6845J7013M345k1064N144J0410J8404j1135J0655J0080j2712
16978A01819j7403K3283J1739P783n007J4124J99J4075K0345j0423K276J5334
16966A78144k8208j8648J9283j1840j6452K1936K0042r783j1542J2805J4135Q32
16954A70704j9654j4816O04p004L53P077N073J6127M245J8776k962q056l5r917
16940A60515j2523M479J5598p437M455J3624K4404O451j2462j1028J0423J2024
16928B08523p701l02J0739p31n006j172j6465K456J2726J4445J6961M24J4640
16915B49537J8983l922J0543R597J6217J5568J61L200K1992J3836J1377K6457
16903C93546K8445K0020K3189M5864L9251K5186L3489O0160M2379N5065Q1736
$$ y = [28161, 53834, 70679, 87692, 92037, 70973, 76117, 86527, 104931, 93796, 104451, 114531, 101819, 84416, 107699, 119438, 127221, 122214, 136338, 136537, 150612, 170957, 160534, 162810, 178144, 149936, 131288, 150571, 138731, 122279, 144215, 164257, 154474, 142932, 155737, 169872, 170704, 151050, 136234, 136838, 129834, 130187, 137264, 142337, 158464, 162709, 181485, 178523, 170467, 170432, 160515, 147992, 152471, 168069, 160632, 165087, 178711, 203115, 209566, 197104, 186076, 196499, 208523, 200822, 200520, 211259, 210528, 205522, 204350, 187885, 190341, 203067, 217512, 234473, 234897, 249537, 268520, 264598, 275141, 284738, 300955, 316523, 316684, 319884, 341876, 355712, 367089, 393546, 421991, 442011, 465200, 511064, 550315, 575501, 608990, 669150, 711529, 766594, 848330]
16892H48330Q7312P8862P4537Q5247J28773J28103R5429J10110J41905J61690
16882A940298K27815K02292J91997K27956L07120L52941L92100M90078P35083
16873E067680J031523J536302K382626L850322N706582O345243M653986K972875
16865C3547139L167812M324456L863794K50945l044838l278042k092736j720591
16857C5017939l622535n966345n415205l176743j273842J85068J635732L510762
16849B0894831N301450N187265L277488K267702K974905L880187K299081j617081
16841D4465828l792731l244355k156714k541377m972226o505835n166670l222621
16833A2863299j957587j305352r28721o79253n50264m46883l97305l57304l11543
$$ y = [848330, 935642, 1014504, 1089041, 1174288, 1303061, 1431164, 1526593, 1636703, 1778608, 1940298, 2168113, 2370405, 2562402, 2790358, 3097478, 3450419, 3842519, 4332597, 5067680, 6099203, 7635505, 10018131, 13868453, 19575035, 25920278, 30574264, 33547139, 36714951, 41039407, 44903201, 45154146, 42109308, 38831266, 36738530, 35017939, 31395404, 25429059, 20013854, 16837111, 15563269, 15748337, 17384069, 20894831, 26196281, 31383546, 34661034, 36928736, 39903641, 43783828, 46082909, 44465828, 40673097, 37428742, 35272028, 32730651, 27758425, 21252590, 16085920, 12863299, 10905712, 9600360, 8671639, 7992386, 7442122, 6995239, 6597934, 6240630, 5929087]
16824E929087k90257k88351k84196k71003k48270k12867k08300k14253k04187
16815C707403j82161j68851j47946j49199j29074j16431j03484j24759j35917
16806B449581j06069p4067q2733p9888q0633p0661n6234o5959o6108r1883p1044
16795A604302l9381k1395l8901o5853n4271m4246m3886l7332m1206n7039l5161
16784A125631k3495l8141m3447l6003k6671l8194l3380k2528k9823l1166q454
16773G94329j6332n504k7849l1712j8504j8010q055j9700j9456j8003l8376m7950
16761E24878j8533j2837j0174o556n4450l2239l1483j0709L0878p019k4921l1122
16749C15713l6597k7417O956J1533J474q522l6124o254j2755l4595j4877J957
$$ y = [5929087, 5638830, 5350479, 5066283, 4795280, 4547010, 4334143, 4125843, 3911590, 3707403, 3525242, 3356391, 3208445, 3059246, 2930172, 2813741, 2710257, 2585498, 2449581, 2343512, 2269445, 2186712, 2106824, 2026191, 1955530, 1899296, 1833337, 1767229, 1675346, 1604302, 1564921, 1543526, 1504625, 1438772, 1384501, 1340255, 1296369, 1259037, 1217831, 1160792, 1125631, 1102136, 1063995, 1020548, 984545, 957874, 919680, 886300, 863772, 833949, 802783, 794329, 777997, 772493, 744644, 712932, 694428, 676418, 668363, 648663, 629207, 611204, 572828, 524878, 506345, 493508, 483334, 476778, 422328, 390089, 358606, 347897, 378775, 371756, 346835, 315713, 279116, 251699, 258655, 270188, 271662, 263140, 227016, 220762, 208007, 173412, 158535, 160492]
16737A60492J071o301p865o762J1561j3106k0685K429P288j4080j1349n283n610
16724I1800K574k0564k647J4898j2743k7722j0725n478j2261Q68O802K7912J4006
16711F6720q544j7099J6913k858K627J0840r357P70r035R923p942k639M822p630
16697D7511r533O351K9221J0227q824j3369j2144L14P650k77L447J3647j6591
16684E7630o363n01J680P924J0255J9293P600k3939j1478K2042l179j2557o898
16671F1509M262j133j6262j2530j96Q045k0467J584J9042O231j3642k3565q826
16658D052j741L06p318L186j7842n941J3163O742J3139J8147P240R479j1479k2033
16644I100R141K340j2481j0286k985m021J5576l540j9804M027K497K1796J5851
$$ y = [160492, 161563, 155262, 147397, 140635, 152196, 139090, 118405, 120834, 128122, 114042, 102693, 97410, 91800, 94374, 73810, 71163, 86061, 73318, 45596, 34871, 29393, 17132, 18000, 24802, 52714, 66720, 58176, 41077, 57990, 55132, 57759, 68599, 59242, 60012, 50977, 60900, 52958, 50319, 55141, 47511, 37978, 44329, 73550, 83777, 74953, 61584, 49440, 49754, 57404, 57127, 60574, 74221, 57630, 51267, 50766, 52446, 60370, 70625, 89918, 97518, 73579, 62101, 84143, 80964, 68407, 61509, 65771, 64638, 48376, 35846, 35650, 43695, 23228, 24812, 43854, 50085, 36443, 12878, 4052, 2311, 2617, -4701, -1515, -19357, -25298, -12135, -5393, 7746, 25893, 33133, 42612, 31133, 9100, 18241, 20581, 8100, -2186, -5171, -9192, 6384, 2844, -16960, -12933, -10436, 11360, 27211]
16631B7211Q604K87j7127k3267l5546M017K3911K3971K427k2198J1086P182m530
16618F028O393M688J2894J0227j3188j5014q930m486m529J5757p837k2160M431
16605a5726R443n184k022J3785j1631j7224J514J081M2r863K519n286k547M629
16591c6470N949L697M17lN811l563j0965N892R650j1465N65J4535k715J0015p763
16576a6413m728R058K702j678j6209j1456K4861J703k187L940j2183r886m285
16563c6761R814J7002o65j058j2732L566m239R372P671K029n337n564Q020R721
16549H39l973n28J2954k7231j7962O466K4057J8847J1011O706p690j0041n29k401
16535A0525j2720n538J736p77k206m290l738L616N616J7579O336q291k4206k5113
$$ y = [27211, 35815, 36102, 18975, -4292, -39838, -35821, -11910, 12061, 14488, -7710, 3376, 10558, 6028, 12421, 17109, 30003, 40230, 27042, 12028, 3098, -1388, -5917, 9840, 2003, -20157, -15726, -6283, -11467, -13489, 296, -11335, -28559, -27045, -25964, -25922, -35785, -33266, -38552, -41099, -36470, -30521, -26824, -26407, -26410, -20599, -24162, -35127, -29235, -19585, -31050, -30485, -15950, -18665, -8650, -16413, -21141, -12083, -9381, -11059, -27268, -38724, -13863, -12160, -14347, -10407, -22590, -32476, -36761, -26947, -9945, -10610, -11668, -24400, -20834, -25073, -15701, -8030, -6001, -11338, -16902, -8882, 839, -3134, -3662, 9292, -17939, -35901, -29435, -5378, 13469, 24480, 31186, 23496, 13455, 12926, 10525, -2195, -7733, -5997, -6774, -8980, -13270, -17008, -13392, -7776, 9803, 16139, 7848, -16358, -41471]
16521d1471J809l978j2415K0227o684J093J3740O719J827j576P225j1524o176
16508c1184Q479j2593N536J4423k2980o761N537J800j7859k215L5763J2345k2609
16495c2318n196M629o326k018r981j1594J1424P705K944q63J2747J763L066J703
16481b2315R585L301N624p277l279l883m692J647LJ2531M388o624j2368k1690
16467d5049J2548J3299p029j0573P077q347Q031J184M696N437M489o64n774J2660
16453h015n467j0100M264L85O089K521p204j8590j3150o159J5230L619J758r68
16439c5787K488L49M617j0091o08J9408O611r724r366J1343P610m141l0349l196
16425e0836P285j5599k4805K5860K7561J9935J6764P25k1433j7123j0639N391
$$ y = [-41471, -39662, -43640, -56055, -35828, -42512, -41419, -27679, -20960, -19133, -20709, -13484, -25008, -31184, -22705, -35298, -29762, -15339, -38319, -45080, -39543, -37743, -55602, -57817, -22054, -9709, -32318, -37514, -32885, -39211, -41229, -51210, -62804, -51380, -43675, -40731, -41594, -28847, -27084, -24018, -22315, -12730, -9429, -3805, -11082, -14361, -18244, -22936, -21289, -21286, -8755, -4367, -10991, -23359, -45049, -32501, -19202, -26231, -36804, -29727, -38074, -30043, -28859, -24163, -18726, -14237, -14901, -20675, -8015, -13482, -23582, -19318, -18933, -12844, -10323, -17527, -36117, -49267, -55426, -40196, -36577, -34819, -35787, -33299, -32950, -28333, -38424, -39032, -19624, -13013, -22737, -32103, -20760, -13150, -17291, -47640, -50836, -43551, -59150, -83955, -58095, -30534, -10599, 6165, 6890, -14543, -31666, -42305, -36914]
16413c6914K33J1108N66j1003j7314O622L312P624J6091J4540q35J090m406j7368
16399b6654n530J4001P045L41Q940O690j3796O459J936j5305J516o693O010R234
16385e806j0549L151N209j3055j6026J8881M012N903j416p405P949P013M597k045
16371D13o309j7218k3731p98N652Q175O526J6139J4499k395N298J8098k53j5318
16357H778j6346l6830j1647l735O255N133L26J024j635m459K4892J8315p513q619
16343b6061M757q320J3561K3924n980j1951j853J9108o834m824J1278k215k0408
16330a5818q765J2090K062j0276M112J290J458K4120J7198k1856J1879K7362K4771
16317F9627M4109K6722J7518J2682M497L0644K0404l4920k7179P657l782k2646
$$ y = [-36914, -36681, -25573, -25007, -36010, -53324, -46702, -43390, -35766, -19675, -5135, -5970, -4880, -9286, -26654, -32184, -18183, -11138, -10797, -1857, 4833, -8963, -2504, -568, -15873, -14357, -21050, -15040, -5806, -16355, -13204, -7995, -21050, -37076, -18195, -14183, -8280, -9696, -17101, -9152, -2139, 2458, 413, -5896, -23114, -46845, -47643, -41991, -33816, -27290, -11151, 3348, 953, 6251, 24349, 24096, 8778, -7568, -44398, -56045, -59780, -53525, -48392, -48066, -47042, -48677, -53136, -28244, -9929, -17442, -26061, -21304, -29624, -16063, 7861, 1881, -10070, -11923, 7185, 351, -4473, 6805, 4590, -15818, -24583, -12493, -10431, -20707, -16595, -15305, -13847, 10273, 27471, 5615, 17494, 44856, 69627, 113736, 140458, 157976, 170658, 175155, 205799, 226203, 191283, 164104, 171761, 167979, 145333]
16305A45333l2634j098q132M835j6989n15J9961K3958J6124O819J5852J223J3716
16292A88453J3074r672j4479l689L17k726l1890l8881l1931J785K885k1834k2696
16279B8716o356r783r536j3540o247o30K4465R121k3711j3085J6105m896j9829
16266b9206k972K7462j476o156J2103J5006j7348p095J6747k561J2279R630j0629
16253A5784n409M306k0446M154K3911j3337j9501M561K4336K653K931n168k1571
16240b796p297j0219j749J0497J1764L850r938r640J8048J6208p439n848j3732
16227h291k386M05j1811M427L50K3164N343q969N041K540r796j0013R861j1451
16213a1586j1549j791K0179N774q398n608m260Q104K3329M1j3292P873L343j3773
$$ y = [145333, 112699, 111601, 103469, 108304, 91315, 90800, 110761, 134719, 150843, 157662, 173514, 174737, 188453, 201527, 191855, 177376, 173687, 174004, 171278, 139388, 100507, 68576, 70361, 73246, 51412, 28716, 22360, 12577, 3041, -10499, -16746, -17376, 7089, 16210, -7501, -20586, -4481, -9377, -29206, -32178, -4716, -6192, -12348, -245, 14761, -2587, -9682, 7065, 4504, 16783, 26413, 15784, 10375, 14681, -5765, -1611, 22300, 8963, -10538, -5977, 18359, 21012, 23943, 18775, -2796, -10093, -20312, -22061, -11564, 200, 4050, -5888, -15528, 2520, 18728, 11289, 5441, -8291, -10677, -10272, -22083, -17656, -17306, 5858, 11201, 2232, 7273, 9813, 17, -9996, -135, -11586, -23135, -24926, -4747, 1027, -7371, -12979, -17239, -9135, 14194, 14235, 943, 8816, 12159, -1614]
16199a614r74j3394N48Q941N072j325n325n334O663j369q872K391m666j4849J4021
16184b0086J8967N333l19O156Q636j6137k5p314p136P42r360k641j680J9393Q014
16169B543j7889l134P277J263r376O442j991k6649l357R635p524p492P861k65
16155d2656j1111J2622K827J42J6864J1800k155P059J248j8070k470P82L103M838
16141a5177R027R173j2895r687L92j219j2644J4301J0962m149m022j4697J171
16128b9464J2559K616M533J7823K438l371n024k100r003j9638n176J1033J1275
16115a1499j432j1228j5177l198J5105J4417r071p816l917O882P375j2353o016
16102c7928J5759J2984p7L04q325M692q021J4900P615n560p326P366j4745o845
$$ y = [-1614, -2588, -15982, -15434, -6493, -1421, -2746, -8071, -13405, -6742, -8111, -16983, -14592, -19258, -34107, -20086, -1119, 4214, 3895, 10051, 18687, 2550, 2525, -4789, -11925, -11183, -20543, -23184, -24864, -5471, 2543, -15346, -18480, -11203, -9940, -19316, -12874, -14865, -41514, -44871, -35236, -42760, -50252, -42391, -42656, -53767, -41145, -38318, -38176, -21312, -9512, -11667, -4608, -3360, -21430, -23900, -23118, -20015, -15177, -6150, 3023, -9872, -19559, -19167, -20386, -33030, -18729, -7767, -11916, -15938, -30635, -29464, -16905, -14289, -9756, 8067, 10505, 7134, 2110, 10, -8993, -28631, -33807, -22774, -11499, -12931, -24159, -39336, -42534, -27429, -13012, -22083, -29899, -33816, -26934, -19559, -31912, -37928, -22169, -9185, -9262, -8958, -17283, -12591, -20612, -5712, 1903, -3657, -10983, -3617, -18362, -25207]
16088b5207Q702M191J3474J8442k2039k159J090m693k1710l0336K903O626J3178
16075c7538k599O647J2501R987p095j3448j716L395L360l817l737J619J2363K3617
16061C539P521k7295j0046j208k1344j1390J6515J8438J2358K6301N090k9865
16049a1386r171o421m388o28j1389j6249K7726K7079j238k903l912j2002k666
16036b7548l871R278J1382p912j3127l107J5102L861L253rQ92k362J2329l542
16022e381n582l67l496j969O139J2366J222L130Q785N859p936j2224M748Q997
16008A4291j6099J2498k374j4543m35M307J863j9701J1238J121j0472n879l652
15995b7837L092o677j3010O492P41j2040J3285J3800J5775J222L487J2841j397
$$ y = [-25207, -16505, -12314, 1160, 19602, -2437, -4596, -3506, -8199, -29909, -60245, -57342, -50716, -37538, -40137, -33490, -20989, -11002, -18097, -31545, -33261, -29866, -26506, -30323, -34060, -32441, -20078, 3539, 11060, -16235, -26281, -27489, -48833, -60223, -43708, -25270, -12912, 13389, 18479, -11386, -20557, -26978, -31366, -31994, -43383, -59632, -31906, -4827, -6065, -8968, -12880, -24882, -27548, -31419, -22141, -10759, -18671, -31798, -34905, -19803, -15942, -12689, -12698, -11806, -14168, -1839, -5381, -10963, -11330, -14826, -16795, -10656, 1710, 2932, 6062, 14847, 20706, 12770, 546, 5294, 14291, -1808, 10690, 8316, -6227, -6662, -2355, -492, -20193, -8955, -7834, -18306, -24185, -27837, -24745, -31422, -44432, -37940, -37199, -49239, -35954, -22154, -6379, -5157, -1670, 11171, 9774]
15982I774P168J0126o253k148p968j4903j7832R281P551j4598j2987M695j4702
15969d2796j795J4477j9566J505J6408Q348P353k411j0126R397q454o541p302
15956d1503J2438j1097n982M542j2798K773J8152O289J7674n460r821K770J3871
15943h152J3734l140n452j1048q174J0662m505J1110J5861O046k0953m606N229
15930c388m422n111O833J8817J9926p926k3795o365L308Q12l103o622j6720l963
15916c1719J9927j7005k5789p164K3026J5026Q690R665k124J2934R446j6490k6364
15903b7941j9765kJ5384J1667N732j1121R28q280Q374J569n047R343R158J578
15889h423j132L521l830O376Q29k2674j802Q336o659k153L0790j441j2789q831
$$ y = [9774, 16942, 27068, 20815, 18667, 10699, -4204, -22036, -12755, -5204, -19802, -32789, -28094, -42796, -44591, -30114, -49680, -48175, -31767, -23419, -16066, -18477, -28603, -19206, -27660, -34201, -41503, -29065, -40162, -46144, -41602, -54400, -51627, -33475, -27186, -9512, -14972, -24793, -22023, -8152, 5582, 2442, -3010, -14058, -22232, -11570, -16075, -4965, 10896, 16942, -4011, -8617, -3388, -7810, -12921, -6088, 12729, 32655, 24729, 934, -5431, -2123, -1311, -4414, -11036, -27756, -31719, -11792, -28797, -54586, -61750, -38724, -23698, -15008, -5343, -7467, 5467, 14913, -1577, -27941, -47706, -47708, -32324, -20657, -14925, -26046, -25118, -33398, -25024, -23455, -28502, -19159, -10001, -8423, -9555, -6034, -9864, -3488, -2659, -25333, -27135, -18799, -25458, -27611, 3179, 1738, -11051, -19882]
15875a9882o910o337J6744J9422r24k0920j3012P17J9899L263L227J2842J2829
15862B0958k47j9079j2329L949Q04q23J0406L218p145k4102J103J1645j0158o837
15848b8637J6619J1464l89j540j2452Q207Q241j43L45J4040j1000k5361J3587
15835g019j7153j2368K1388l6J783j3672k8638k1641j82m63J1057P720K6723K2874
15821i627J423r668k166p288J3951L653k3837k814J9609K1544K980k4770k009
15808a9019o052J2527j0997M789R916j593k2667k5252p851J4197J5308L2325K871
15795a498o998j5882m482L716o162K371n737Q571P651j0656j2067J8663O768K1314
15781E572K0027q940k1527N20Q290K0188j4440k301q16j3404q923j5099o077N295
$$ y = [-19882, -26792, -33129, -16385, 3037, 2113, -18807, -31819, -31102, -11203, -7940, -4713, 8129, 20958, 20711, 1632, -10697, -6748, -5944, -6767, 3639, 6857, -288, -24390, -23287, -11642, -21800, -28637, -12018, -554, -943, -2483, -14935, -6728, 1513, 1370, 1715, 15755, 4755, -20606, -7019, -24172, -36540, -15152, -15188, -13405, -27077, -55715, -77356, -77538, -78001, -66944, -59224, -32501, -9627, -8204, -17872, -20038, -27326, -13375, -9722, -33559, -36373, -16764, 4780, 7760, -17010, -19019, -25071, -12544, -23541, -18752, -8836, -10429, -33096, -58348, -66199, -52002, -36694, -4369, -1498, -8496, -24378, -28860, -25144, -31306, -28935, -34672, -26101, -18450, -29106, -41173, -22510, -15742, 5572, 25599, 16659, -4868, -4348, 3942, 24130, 9690, 7389, 6573, -6831, -15754, -30853, -36930, -31635]
15767c1635J5979k331k313L032j0058K800j4404R158o862o837J2338Q519m301
15754b6915j3213j1690J7493m449o325J1762K96q375o674R315J6432O993J120
15741a4230j1993k860K0084J6471R255j0898q719N056j292m150N023q715k807
15728i775N655n207k2809K0533p02K141K109j4041j2461K6367J9852K06j6902
15715e034j1506M562K93r367n433n166Q006n465R956K1531J321o162l790K2607
15701A6353n204q014p245k917J0889n849j1601M299j0926q029j3594j1291k196
15688e5325J2562L242k330J7622P903j8858j0069L934J9656N637L154r049J0838
15675a1083J4239R293n435K480K490m87p497n32j1901m51n316j9926P866J5158
$$ y = [-31635, -15656, -17987, -20300, -17268, -27326, -24526, -38930, -29772, -36634, -43471, -31133, -22614, -26915, -40128, -51818, -34325, -38774, -45099, -33337, -33041, -41416, -48090, -38775, -22343, -15350, -14230, -26223, -29083, -8999, 7472, 16727, 5829, -2890, 2166, 874, -3276, 1747, -6968, -9775, -4120, -9327, -32136, -11603, -12305, -10164, -8055, -22096, -34557, -8190, 11662, 11868, -5034, -16540, -11978, -11685, -21052, -26485, -31651, -23645, -29110, -19154, 2377, 3698, -2464, -6254, 16353, 11149, 3135, -4110, -7027, 3862, -1987, -13588, -9289, -20215, -28244, -41838, -53129, -55325, -42763, -39521, -41851, -24229, -16326, -35184, -45253, -41319, -21663, -16026, -12872, -21921, -11083, 3156, 12449, 7014, 9494, 11984, 11497, 4000, 3468, -8433, -8884, -14200, -34126, -26260, -11102]
15661a1102P127N048O275L702k1094r398L627O88K81J0279J412J393J397j0206
15647a0571m797n482n14l254k866P012j1718m987K1574j1246j4529j1138k350
15634e4866J6514K2954k2127q893J3290J3220O360J0435O444j3529k4359J624
15622c2933Q271J3974N908k3766k1029M2119J1197m0707k1118J5770p086P6J1929
15609c7395K335M907q886j7123M926J0649K0166P842J527j6893N375Q434k880
15596a7016n930J146o737J4996K1554L095j1362n123m489r257M786O492j6639
15583b4484k2106n86J0093L592O816J1248l663J7406m634O868j1979Q26L468N757
15569a378j3124j8585r894J100P99l530L492j004K4611o601J0186J9532j3537
$$ y = [-11102, -3975, 1073, 7348, 11050, -10044, -19442, -15815, -15127, -14846, -4567, -3155, -1762, -365, -10571, -15368, -20850, -21364, -24618, -27484, -20472, -32190, -37177, -15603, -26849, -41378, -52516, -54866, -38352, -15398, -37525, -46418, -33128, -19908, -13548, -3113, 3331, -10198, -34557, -32933, -24662, -10688, -4780, -28546, -49575, -7456, 3741, -36966, -58084, -42314, -49400, -49324, -37395, -35060, -30153, -39039, -56162, -51236, -40587, -20421, -12579, -11052, -27945, -22570, -14136, -17016, -22946, -21800, -28537, -13541, 8013, 11108, -254, -5377, -9866, -19123, -14337, -7845, -24484, -46590, -47176, -37083, -33491, -26675, -15427, -19090, -1684, -6318, 550, -11429, -10603, -7135, -1378, -14502, -33087, -42981, -41881, -41082, -44612, -41120, -42124, -17513, -24114, -13928, 5604, -7933]
15556g933j0436j823J2627J004j9324L34O118O121l544q435j0853R792J0066j0595
15542b6881O764K5913m074p273l222O398m797j11K2066q6k3681q29J6397R479
15528A6063j7802J358L664Q877p211j7680p207P799L717L77O128j1685N004M751
15514c847L617J3672k3248k758J0700j2794m235N508j825j6064m260J1436K4091
15501gm76k1960j0870M347N059K5532J50l0504j176K3862r227k0940J6018K6128
15487E936J3602p89j6831j3714o573m555M472o599M676J9070K0527J4355o103
15474B7474m275k1592j7201l710n486l315K4807K1388J5872m155j5631j8915q347
15461a3086p270L050j29j0396M811r845J0931J9732J689k4061k5968M724J1723
$$ y = [-7933, -18369, -20192, -7565, -6561, -25885, -25551, -19433, -13312, -16856, -25291, -36144, -26352, -16286, -26881, -20117, 5796, 1722, -5551, -8773, -2375, -7172, -7283, 14783, 14697, -8984, -9813, 6584, 16063, -1739, -381, 3283, 12160, 4949, -12731, -19938, -12139, -8422, -8045, -1917, -13602, -8598, -3847, -230, 13442, -9806, -12564, -1864, -14658, -18893, -13385, -15210, -31274, -35534, -24098, -7, -483, -22443, -33313, -28966, -23907, 1625, 1775, -28729, -29905, -6043, -15270, -36210, -20192, 5936, 19538, 18749, 1918, -11796, -18369, -22924, -18452, -25051, -20375, -1305, 19222, 33577, 27474, 23199, 1607, -15594, -19304, -24790, -28105, -3298, 18090, 33962, 29807, 14176, -4739, -13086, -20356, -17306, -17435, -27831, -23020, -32865, -21934, -2202, -513, -24574, -50542, -45818, -34095]
15448c4095O987P715P393m196j4854O807J3963J5141j1568p283J6370n611L997
15435G66j0428k4720K599N037J3392j1109j941j6171p512J1167J8101J701l720
15422b2838q713o63p211J1742J2136Q584Q762j8230j2887L492L647K808J1438
15409g933J4193p764k3073J7541J9771L527m149J670R848j6112j9913J1259K5057
15396B3922n552o894j525m199j845M59m849r200Q235k738n425O538J6935K230
15382A6092p763j4691O957O247j05j5906Q304J575k0611k376l443J172l634k40
15368b8422L4192R228j9496j4736r936L364J6371R564j5611n911L3454J4059j4446
15355A1674j520L430k486M326J578j8722n10P997L97R296o885Q665J785j1805
$$ y = [-34095, -27108, -19393, -12000, -16196, -31050, -24243, -10280, 4861, -6707, -13990, 2380, -3231, 766, -9662, -34382, -31783, -26746, -13354, -24463, -26404, -42575, -50087, -38920, -20819, -19118, -22838, -31551, -32214, -39425, -27683, -15547, -6963, 1799, -16431, -29318, -25826, -22179, -19371, -7933, 6260, -1504, -24577, -7036, 12735, 16262, 12113, 13783, 23631, 7519, -12394, -1135, 23922, 18370, 11476, 9951, 5752, 3907, 4366, -483, -9683, -1448, -4186, -9611, -3073, 13862, 16092, 8329, -6362, 595, 6842, 6737, -9169, -865, 710, -19901, -22277, -25720, -24548, -28182, -28422, 5770, 14998, -4498, -19234, -29170, -25806, -9435, 129, -15482, -21393, 12061, 26120, 11674, 10154, 13584, 11098, 15424, 17002, -1720, -2230, 5767, 6164, 15460, 8575, 17240, 19025, 7220]
15341G220r017o425K208R435R178j44j4375K091k309R057k236q756j7319j271
15327b2663J7823l950J577p658L113J6939Q60j8594j5474j1690l648J7780K1840
15314c745J0654K0376J1147k5458J632j1291j3741m168n4j2819k162O90J6394
15301a2545m268K585J4273j1464n197O07j485N684K0089M94k74M611J0575M439
15287B8124r359k1972o077K696J550N195J362j407j1120k0732p6M909J6678N257
15273d972J0061Q443j0404j5018J402J1872k132n754L877Q416j5801r746q421
15260b8177q799K7714J4676k0690m0910l181K2218L230j0335P357K8077J2629
15248C809k0968j6843P502R9j4100q996J8401Q680J5587m415n875q687J055K619
$$ y = [7220, -1797, -8222, -6014, 3421, 12599, 12455, -1920, 171, -2138, 6919, 4683, -4073, -21392, -22663, -4840, -8790, -7213, -14871, -11758, 5181, 6041, -12553, -28027, -39717, -43365, -25585, -3745, 6909, 27285, 38432, 12974, 14606, 3315, -10426, -14594, -14648, -27467, -29629, -28939, -12545, -16813, -14228, 45, -11419, -16616, -16009, -17494, -11810, 8279, 8773, 8499, 13110, 23685, 28124, 18765, -3207, -9284, -6588, -5038, 157, 1519, 112, -11008, -31740, -31816, -26907, -10229, -4972, 5089, 13532, 3128, -11890, -10488, 1384, -748, -6502, -2625, 5791, -10010, -19756, -28177, -36976, -9262, 5414, -15276, -56186, -59367, -37149, -33919, -44254, -36897, -8820, 3809, -17159, -34002, -26500, -26401, -40501, -49497, -31096, -22416, -6829, -11244, -17119, -25806, -24751, -22132]
15234b2132r110K202K0592k62rm182j5659J7297J2092j188j5498n258L472j4498
15220c2141M183Q443J0166R143j52k188j5938j3678J3957k81j004J4577K6884
15207B1971R160j4459r614o58q100j9133j5016j3561k49J7351J3668K4451Q462
15194A4273L364n857j1726k749R057J7417j5118j0204R674k0046j4824l385J5252
15181a4872q017J7329Q568j3303O120q928k0637J9724J9977R88k4557q774K651
15168b3731J0452O037J586N271p602j3526j9353j334J1981J7287J9086O639k2514
15155i721j464l286p64Q635q722Q471J5140j7976p259L139J3063J760j8062l483
15141b0529N604K4376K518j325j558q892n174j1827K315J7740j882j8613j635
$$ y = [-22132, -31242, -29040, -8448, -8710, -8719, -12901, -28560, -11263, 829, -359, -15857, -21115, -17643, -32141, -27958, -19515, -9349, -206, -358, -2546, -18484, -32162, -18205, -18486, -19490, -4913, 21971, 31131, 16672, 7058, 6400, -1700, -20833, -35849, -49410, -49659, -32308, -18640, 5811, 14273, 17637, 11780, 54, -2695, 6362, 23779, 8661, -1543, 8131, -11915, -26739, -30124, -14872, -22889, -5560, 3008, -10295, -4175, -13103, -33740, -14016, 5961, 6949, -17608, -26382, -23731, -13279, -7242, -5656, -385, -7987, -21513, -40866, -42200, -30219, -12932, 6154, 12793, -9721, -11185, -14471, -15235, -6600, -15322, -6851, 8289, -9687, -16946, -13807, -744, 1016, -17046, -20529, -14925, 9451, 11969, 10644, 9086, 194, -4980, -16807, -14492, 3248, 1366, -17247, -18882]
15128a8882Q623K3305R639q371k1099M298J7247j1327j4870N436L211n339j810
15115i939J1547Q681j1662q64K2787j8361n981m694j88o677J8389J5423j8357
15102A04l7797k922L865L0920M155j8953K4662J1110j5064j5973k3448j806J2595
15089b8552K4945N212J4753k0988m880k5711j9474R552J8173J4740p033j737Q506
15076a2494J1404J6286j1486q946R7l713j7598l996J8663J3488Q220o086M437
15063H276j0737K729P014M25j4412o224l184R231O106M177j4791o0O88j2056j0386
15048c3204J8662J6597J3480j8855j6585J6813J3716J0060p251k867o306n92p134
15035c466j0346l518J239o44O980j6745j4879j5465N761P499K6295Q440n989p751
$$ y = [-18882, -10259, 13046, 22685, 14314, -6785, -2487, 14760, 3433, -11437, -6001, -2790, -8129, -9939, 1608, 10289, -1373, -2237, 20550, 2189, -3792, -8486, -8674, -15351, 3038, 18461, 104, -37693, -40615, -36750, -5830, -1675, -20628, 4034, 15144, 80, -15893, -39341, -41147, -28552, -3607, 1605, 16358, -4630, -9510, -35221, -54695, -45143, -26970, -12230, -19263, -21000, -12494, -1090, 15196, 3710, -5236, -5139, -8852, -26450, -30446, -11783, 1705, 9925, 3839, 8276, -2461, 268, 7282, 7707, -6705, -12929, -16113, -6882, -776, 3401, -11390, -11450, -10762, -22818, -33204, -14542, 2055, 15535, -3320, -19905, -3092, 10624, 20684, 13433, 10566, 4260, 3668, -3466, -13812, -17330, -16091, -16735, -9755, -26500, -41379, -56844, -51083, -43584, -17289, -8849, -14838, -22589]
15021b2589Q732J182j5830r047l587J4581N382p25l820j6423M912M44l813K5311
15007a5290j3954n222J5417q429n143N382N367j651J8296r467j352J4901R137
14994G992j1315j2514L225Q708j1730O242J1643R67l275n450q972p111O71R200
14980a1719K078j634r3l297o17Q263J4484j467j0192L391m005q815l885R328L46
14965g834j6656l303q64j682R648j082J0304J8095J172j0818Q93L046O548k1075
14951a3608M253k826j6795j0184k040N01M302J8561J0441j7620J007Q34N769m
14937a7409J1696J8695p337n506N107k6993p985J1939J4063J9019k5588j0706
14925b1005P853K93J8533K0751r684k0213q981N139J7192M304r136K042r558j2213
$$ y = [-22589, -13857, -12675, -28505, -37552, -41139, -26558, -21176, -21901, -25721, -42144, -37232, -36788, -40601, -15290, -29244, -34466, -19049, -27478, -32621, -27239, -21872, -23523, -5227, -14694, -16046, -1145, 7992, -3323, -15837, -12612, -3904, -15634, -9392, 2251, 3218, -57, -5507, -14479, -21590, -20919, -11719, -9641, -11275, -11368, -14665, -15282, -7019, 7465, 5998, -4194, -803, -4808, -13623, -17508, -8180, -7834, -24490, -27793, -28657, -30339, -20691, -21773, -11469, 6626, 7798, -3020, -2127, 919, 7467, -13608, -9355, -12181, -28976, -39160, -41200, -40699, -36397, -17836, -7395, -25015, -24008, -23174, -17405, -17409, -5713, 12982, 5645, 139, 5246, -21747, -29732, -17793, -3730, 15289, -10299, -21005, -13152, -12859, 5674, 26425, 16741, -3472, -12453, -7314, 9878, 14182, 5046, 7088, -2470, -14683]
14911a4683p612j2649K15l96p75L097J3543j071n001O349n12q576J0698K9191
14897A1818j5519j977o400j5800J545K5423K3050J1143l927m405j1650P017J2262
14884C2580r641L008J0729l420R192L110k9915k1871k931J9453k0576N996J0406
14871F120j2465k5252J933K8164J8869j0600p998J0736J659l739k1683j7958J3170
14858a9044R910L074r428k254O680Q660O206Pj8578l0578j2270P428P018n77R826
14843c3920R24L548K7759K798k7016l056L1494K658j5142j0500l0666n527K2228
14830c4418J3559J5402j3225j6169R216P164p58n810L263J6739P468n877P827
14817D381M548J7859J462Q08R175q342L423k903k6538j0792K2495J2005j6793
$$ y = [-14683, -22295, -34944, -34729, -35125, -35900, -32803, -19260, -20331, -25332, -18983, -19495, -28071, -17373, 11818, -3701, -5678, -12078, -27878, -26333, -910, 22140, 33283, 29356, 24951, 13301, 20318, 32580, 22939, 25947, 36676, 33256, 42448, 45558, 15643, -6228, -9159, 10294, -10282, -4286, 6120, -6345, -31597, -29664, -1500, 17369, 6769, -1229, 9507, 11166, 7427, -14256, -32214, -19044, -9134, -6060, -15488, -17742, -11062, -2402, 3804, 3811, -14767, -45345, -57615, -50187, -43169, -43746, -33920, -32996, -29448, -1689, 1109, -25907, -28963, 2531, 5189, -9953, -20453, -51119, -56646, -34418, -20859, -5457, -18682, -34851, -25635, -18471, -19229, -25039, -21776, -5037, 2431, -3446, 4381, 8929, 26788, 28250, 29058, 38233, 29891, 33314, 30411, 3873, -6919, 15576, 27581, 10788]
14804A0788k5331j8218K479J9602K0686R57o145j1716L872p943l731m988J1480
14791h208Q667p693J4363n440j2671j2354O682J6895K919j5549j0195O389J3081
14778c114l12j0562j1293n355J787Q701P285j2108k175J1332r521J4608J8922
14765H195j9739j0073K3411J2179j0136j9254J4955R198N119p718L089m622M280
14752H884K4466J4908k1990q323k0389q496P694p544j7497J1386N714J5454K4670
14739B8937J2138j7395j6308l4722j0121J4517L1057J556k2591m599j996l531
14727b3058N413J965K414j3095K324R517J0189J3831J3540r251j5268k916J4771
14714A0376K7662R793k3530m511n081J7748N554r568q884J4036k5101j3507R559
$$ y = [10788, -14543, -32761, -30282, -10680, 10006, 10963, 4818, -6898, -3026, -10969, -14700, -19688, -8208, 459, -7234, 7129, 1689, -10982, -23336, -16654, 241, 3160, -12389, -22584, -16195, -3114, -3426, -13988, -25281, -30636, -28849, -20148, -12863, -24971, -27146, -15814, -25335, -10727, 8195, -11544, -21617, 1794, 13973, 3837, -15417, -462, 8736, 13855, 6137, 9226, 4604, 8884, 33350, 48258, 26268, 17945, -2444, -10940, -3246, -10790, -28287, -16901, -11187, 4267, 28937, 41075, 23680, 7372, -27350, -37471, -22954, 8103, 9659, -12932, -17531, -19527, -23058, -17645, -15680, -13266, -26361, -24037, -14520, -4331, 9500, 23040, 13789, -1479, -4395, 10376, 38038, 47831, 24301, 19790, 14709, 32457, 38011, 28443, 19559, 33595, 8494, -5013, 4546]
14701D546K774j3145j002J0172L34l355M771P032k192j3369J3644m703j4831N097
14687d227J3350J3051m053l553P844R898r758j3382j1866k7581l959K2745q717
14674b0208j0338m344J3298Q294K0605o193P770L625J36O754J4443k9131j4630
14661i919n27o556n458K4439J157J0315J2569K577k3093k1164r184J0411P524
14648f909j2543k8597j470J5128K2182K2141M1003M745l613J955k0884j6776r657
14635F705k1638j3378M713K119J6454L1627k964o957R619q120j6263r815O175
14622a723p599R358r24k5390j8836R795J0425K025J4765M376K586R979K025j5510
14608d648j3111K6854R18o220j1606j414K346P781N915j2432r55l454P516l051
$$ y = [4546, 7320, -5825, -6827, 3345, 3679, 324, 5095, 12127, 9935, -3434, 10210, 5507, -9324, -4227, 9123, 22174, 18121, 14568, 22412, 32310, 22552, 9170, -2696, -30277, -34236, -11491, -20208, -30546, -34890, -21592, -13298, 7307, 1114, 8884, 12509, 12645, 19399, 33842, 4711, -9919, -10446, -17002, -22460, 1979, 3136, 13451, 26020, 28597, 5504, -15660, -24844, -14433, -6909, -19452, -48049, -49519, -34391, -12209, 9932, 50935, 55680, 52067, 54022, 33138, 16362, 6705, -14933, -28311, -23598, -21479, -5025, 26602, 23638, 16681, 26300, 18180, 1917, -7898, -1723, -9322, 36, -888, -26278, -45114, -35319, -24894, -22869, -8104, -3728, -1142, 8837, 10862, -4648, -17759, 9095, 10013, 3793, -7813, -9227, -6881, 900, 6815, -5617, -6572, -10026, -2510, -5561]
14594e561r574J2013R212P253j2388j0902k7072j7053J6387J0166J5709J8882
14582G072O851K622J0651J448j557k0437O090j1248K484p949N283M016j458K382
14568F250J28L363Q559q769q700j2324n793m716K6002J2495j6485k2717j7103
14555c9810l78J0050K2394J5459k6815q392N925L042J6492q977J0708J7518M894
14542B2110p528J3859L132j2577k426o913k152j0426p949L4K066o493r727k2426
14528d7416J5381J4134O050J8850k834k691R38j3216P525K3439j5636N859R095
14515A9478k0234k1399L055K358J970J3659J8218R848j1269n654M286n901m353
14502D062J694n945o664l941J4148J0513j7857N152R815Q771j7704p151k300J5220
$$ y = [-5561, -15135, -3122, 6090, 13343, 955, -9947, -37019, -54072, -37685, -27519, -11810, 7072, 13923, 16545, 27196, 28644, 27087, 6650, 12740, 1492, 3976, -3973, 1310, 5326, 3868, 6250, 6378, 9741, 18300, 9531, 831, -11493, -17286, -22002, 4000, 16495, 10, -22707, -39810, -40188, -30138, -7744, 7715, -19100, -27492, -21567, -18525, -2033, -11010, -302, 17216, 22110, 14582, 28441, 31573, 18996, 16570, 9657, 7505, -2921, -10870, -10836, -8770, -15263, -24990, -47416, -32035, -17901, -11851, 6999, 4165, 1474, 2412, -10804, -3279, 20160, 4524, 10383, 19478, -756, -22155, -19100, -16742, -14772, -1113, 17105, 26953, 15684, 10030, 14316, 8415, 4062, 5756, -189, -6853, -10794, 3354, 13867, -3990, 1162, 10977, 19748, 2044, -5107, -7407, 7813]
14488G813J393J476J038Q317j4808J0871P199q4M95j4182J10j9162n826J5770
14474D20J0102k2192j0891j4139N847N847M435R887R003j079n851j1392N035K0301
14460E333L0035q921k1734m395K64q33j387o109L261k18q751j1148R653K5346
14446A0396J3678Q045j2864j4216l207L634L924Q934L068m957k839r199n598P219
14432F018j440J6762N806M422j4192k120j1103q710j4362j0253L079O343J0542
14419i208k79k746j0383R450K2367l836o784p879L882R974K343j9727L843Q80
14405h103l688J864J9127j042J833n309K268l812K413j6254o761J0438N201K827
14391A002J3066o830q606n291P173M118J4425o254j7874p385r85Q265L222J2526
$$ y = [7813, 9206, 10682, 11720, 20037, 5229, 16100, 23299, 23215, 23710, 9528, 9638, -9524, -15350, 420, 10522, -11670, -22561, -36700, -30853, -25006, -20571, -10684, -1681, -2760, -8611, -20003, -14968, 5333, 35368, 26447, 4713, 318, 582, -251, -1638, -7747, -4486, -4704, -13455, -24603, -14950, 10396, 24074, 32119, 19255, 5039, 1832, 5466, 9390, 18324, 21392, 16435, 13596, 4397, -1201, 6018, 4578, 21340, 27146, 31568, 17376, 15256, 4153, -4557, -18919, -29172, -26093, -19750, -9208, -9487, -12233, -22616, -13166, 9201, 5365, -1419, -9298, -5416, 4558, 6901, -12826, -8983, -8103, -11791, -9927, 9200, 8158, 9991, 4682, 6950, 3138, 5551, -10703, -17464, -7026, -1825, 1002, 14068, 7238, -1368, -6659, 514, 4632, 19057, 12803, -5071, -12456, -13441, -5176, -1954, 10572]
14377A0572j4621j1820J6084M901p060k755k4764m880m70k613k8073j165M4096
14364b2568J2120m750J7249P715p157q627J2466J7001O321p887j6418j0516q51
14351e902J871n081l20J4838p050o759N091k678J7623K0726m756k999K371R469
14337C6444n864j7635j8523p443J0166J1821j4784K940Q777J2247k623k8784l02
14324a3563K437J1108Q71j1778j05M657m699p39K884N229j6443l408J0490J9677
14310F618J7508j1924k0709J0441o390j0395J206J1977j45Q834L441r952L573
14297D083J5191k2760k694J8095r072J904r265m130R725k348N888L336J3643K06
14283B1802n857j1141p525N453p55r786J5475k73J61j7276q140J6029N504n297
$$ y = [10572, -4049, -15869, 215, 5116, -1944, -4699, -29463, -34343, -34813, -37426, -65499, -66664, -22568, -10448, -15198, 2051, 9766, 2609, -6018, 6448, 23449, 29770, 21883, 5465, -5051, -5902, -4031, -9112, -9432, 5406, -1644, -8403, -3312, -5990, 11633, 32359, 27603, 24604, 26975, 36444, 30580, 12945, -5578, -13021, -2855, 8966, -5818, -2878, 5899, 18146, 15523, -13261, -13563, -11126, -18, 853, -10925, -11030, -6373, -11072, -11811, -8927, -3698, -20141, -23549, -13059, 6618, 24126, 12202, -8507, 1934, -4456, -14851, -13645, -1668, -1813, 7021, 10462, 510, 4083, 19274, -3486, -6180, 11915, 2843, 4747, -4518, -8648, 1077, -1271, 4617, 7953, 21596, 21802, 15945, 4804, -2721, 2732, 1977, -7809, 7666, 7393, 7554, -9722, -17862, -1833, 3671, -1626]
14269a626j4416R312p110j3667k089m068K1000J6102j3774j2385L0197L0293J3543
14256E1312L778j7375j8104q570Q091J4958J4136P509P50j6974j4171N468o569
14243B4239J0455L3932L260K4572L2643J9464J9971K1453Q843l1471j5407j3313
14231A38641k7468l0929p382O493j2679j0690q580o458l274o095L579L545j3374
14218B5329l746J8181r4k5406j0121J346P238P036M08j2736j3219J4574K9110
14205C7900K272M368n921j3066j2986m880j1197p344j617k120K0244J7342Q638
14192C1633j5312r454j2712q2O992o6O061K386J2216j7449J3994J3804J0339J255
14178D3605l2448j4704L605L001J2632p294J0043J6626j1741j8969M517J0974
$$ y = [-1626, -16042, -6730, -13840, -27507, -29596, -33664, -12664, 3438, -10336, -22721, 7476, 37769, 51312, 55090, 37715, 19611, 11041, 19132, 34090, 48226, 55735, 56485, 39511, 25340, 30808, 24239, 34694, 68626, 71886, 96458, 129101, 148565, 168536, 189989, 198832, 167361, 151954, 138641, 111173, 80244, 72862, 79355, 66676, 55986, 47406, 40948, 37674, 31579, 35158, 38703, 25329, 21583, 39764, 39670, 14264, 4143, 5489, 12727, 19763, 20171, 7435, -5784, 8790, 37900, 40172, 44540, 38619, 25553, 12567, 7687, -3510, -10854, -12471, -14591, 5653, 22995, 31633, 16321, 6867, -5845, -5927, 1065, 999, 7060, 9446, 21662, 4213, 18207, 32011, 42350, 43605, 11157, -3547, 58, 3059, 15691, 8397, 18440, 35066, 23325, 4356, 8873, 19847]
14166A9847J2404j7281k3119j345J8934R45m248K451n536p243P587j150p284r206
14152a4244O912Q007j3004J2121J2112J143l906o654N131M738p475m594j6645
14139a6358m721k681M2309L1122L749m011o649j8834r457j4293n140M536l990
14126d418n724J1101o00q38J0869j3804k0263J5302Q264M591K647O406N684Q864
14112B8081q737N49q920j3487N29N150k6470P012K666K923R478J0588J349j3349
14098b638J0936J8212o915k0792o455M627K2825M021n585j082o912p483j2263
14085i504p622J0264l520M277K3807j1721q856k369P742K3302J5589k5311j2063
14072D015l758J0368K1632J5186N50N781j2932k80k758r695j5405o491P974L429
$$ y = [19847, 32251, 14970, -8149, -9494, 9440, 10385, 6137, 8588, 3052, -4191, 3396, 2246, -5038, -14244, -7332, 675, -12329, -208, 11904, 13047, 9141, 2487, 7618, 12356, 4881, 287, -16358, -21079, -23760, 18549, 49671, 53420, 49409, 42760, 23926, 14469, 176, -4964, -428, -4418, -10142, 959, 359, -479, 10390, -3414, -23677, -8375, -111, 4480, 7127, 13533, 19217, 28081, 19344, 19893, 10973, -2514, -1985, 3165, -23305, -16293, -13627, -10704, -1226, 9362, 10711, -2638, 8298, 26510, 19595, -1197, -7652, -3025, 19800, 23821, 18236, 17154, 10242, 2759, -9504, -17126, -6862, -10382, -6105, 17702, 5981, -2875, -5244, 2498, 25800, 41389, 16078, 4015, 257, 10625, 32257, 47443, 47993, 53774, 40842, 40562, 37804, 28109, 12704, 6213, 14187, 17616]
14058A7616J1106L370O751r080P298j4688j4841j0170R470Q120K017J0233l031
14045B4171n89j595o642J1700M20j4841n057k356P985L2746Q810l6340m359k051
14031A2002J4361j1194K997J6499j073L524k0508j6364o425K387J0777K311L592
14018A2886J4464q51L358j3900q062K050M886J0789K325q584n458J4948n636j7310
14004E905R801k406j5332j206j1350J2594L313R441Q834N803R925J1807J151o155
13990D2125r127j2508j2767j072R66J2278N455k604j1220j3916K238n748m372
13977a0272Q401P03j0100J6318j676K982J0504Q517K377j2328j3718q111k931
13964i334n559m042J4603J0097M121k742J0299J1994N56J1830R041k3788r789
$$ y = [17616, 28722, 32092, 38843, 29763, 37061, 22373, 7532, -2638, 6832, 14952, 16969, 27202, 24171, 23582, 21987, 15345, 27045, 27465, 12624, 7567, 5211, 13196, 45942, 54752, 18412, 14053, 12002, 26363, 15169, 18166, 34665, 33592, 37116, 16608, 244, -6181, -3794, 6983, 9294, 12886, 27350, 26499, 29857, 15957, 7895, 9945, 14831, 25620, 27945, 19361, 13903, 28851, 23215, 5905, 15706, 13300, -2032, -3238, -14588, -1994, 1319, 10760, 19594, 25397, 35322, 47129, 48280, 42125, 32998, 20490, 7723, 6651, 7617, 19895, 25350, 22746, 11526, -2390, -152, -5900, -10272, -1871, -1168, -11268, 5050, 3374, 6356, 16860, 25377, 27754, 15426, 1708, -6403, -9334, -14893, -18935, -4332, 5765, 9886, 7144, 17443, 29437, 29993, 41823, 50864, 27076, 17287]
13951A7287o077N220J7229o502m625j2155P817j5301j8175L232k528N494J9308
13938A0224J7776Q262j0479j7335M640k073j1584Q337K3908N166m211K490j2418
13925B2703M299n998p296O15J4587M0k830n167j2135k217J2707N659P23n236J720
13910B2174L96k1742j9942O76J3037J5224O913J2903p025j7167j6484L947l908
13897a0998N942J9842K133J9880j5107J5947K559K795J6450J137l3587k0336J666
13884H323k738o39o450J3191P323j0444N381M755R74q718L225J0226L868P226
13870C5503O308j7686q882n65j1711K5300O916j7243j1653j2643k807J5110j15
13857E832L407J1558K630j0254O045M40p111N318Q905K03r439j1710M927J0496
$$ y = [17287, 11210, 16430, 33659, 27157, 22532, 10377, 18194, 2893, -15282, -12050, -14578, -9084, 10224, 28000, 36262, 25783, 8448, 13088, 11015, -569, 7768, 31676, 36842, 32631, 35121, 22703, 27002, 21004, 13708, 14323, 28910, 28950, 26120, 20953, 8818, 6601, 19308, 24967, 25690, 20454, 22174, 22570, 828, -19114, -18438, -5401, 9823, 16736, 29639, 22614, 5447, -11037, -7090, -10998, -5056, 14786, 16919, 36799, 21692, 37639, 40198, 42993, 59443, 60580, 26993, 6657, 8323, 5585, 4946, -1504, 11687, 19010, 8566, 13947, 18702, 19676, 10958, 14183, 24409, 28277, 35503, 41811, 24125, 15243, 14678, 2967, 28267, 35183, 17940, 6287, -6356, -9163, 5947, 5832, 9239, 20797, 23427, 13173, 19218, 19658, 12547, 17865, 26770, 26973, 17534, 5824, 10751, 21247]
13843B1247N244o817o624m373o080m298Q545j2686O806M160m90r196o696M189
13829g069Q773N415J5887J1429P562j5736j4121j1492L161K0826N276j7115j7624
13816d828N152m242k60J1260O322J423k444M151o139q515N44O583J2113m259l221
13801A3640j558j9774N339J1037J4998J1355q115L406J2181J0145o578j4013l426
13788B8637n50q453j2222m696J1566n565j037j5798o186K076J452J2625N694M506
13774A2049j3518k212j6814P551K5874m849L071j7937j6113J3970J3497J062r843
13761d212L422J7251R250n475O319l81k1564r154J7107o99q242J0374L726o682
13747A1040j7026j421l923K1228l68o353K15J8069R505j489j2091j8232q879q34
$$ y = [21247, 26491, 19674, 13050, 8677, 2597, -1701, 6844, -5842, 964, 5124, 4634, -4562, -11258, -7069, 1704, 7119, 23006, 34435, 41997, 26261, 12140, 648, 3809, 24635, 29911, 12796, -4828, 324, -3918, -4178, 7082, 13404, 14827, 12383, 16534, 10395, 1880, 2424, 9007, 21120, 16861, 13640, 12082, -7692, -2353, 8684, 23682, 35037, 26922, 30328, 42509, 52654, 46076, 32063, 28637, 28087, 19634, 7412, 2716, 14282, 8717, 7680, -8118, -14304, -12228, -10776, 1849, 7543, 12049, -1469, -3681, -20495, -12944, 12930, 8081, 11152, -6785, -22898, -8928, 4569, 5631, -4212, -790, 16461, 25711, 20236, 26555, 26174, 4610, -4544, 12563, 11864, 3622, 13996, 17722, 11040, -5986, -7407, -11330, 9898, 9530, 3177, 3392, 21461, 30966, 29477, 17386, -846, -9725, -10559]
13733a0559J4821k421m09K0558J6866J502J5382P541j2025J223k5855r149j7603
13720a28k937L912J4736J0859J7811j4581j0283J868Q325M206O113J0269O267
13707E6437j1181O248L783j8517j9327k1005m172Q017j2658J4529J7264m651j3128
13694A639m395R162O352J2448j356m306J8452J1223J100p442j8202P622J3597
13681D5894l503j8921l300k0082k886K873M888P378J3749o971j483J5402N074
13668C8112J880j1218K114o1k2798j0968J3505J1423o961J1192N465n699J72j5737
13654A0421m55J8736M545N935j7775L795p770n238q575q012l019r95K0547q284
13640C856m81J207L019o435L10R493K2125j3480j3096N17J6057J2464o585Q694
$$ y = [-10559, 4262, 1841, 1432, 21990, 38856, 40358, 55740, 63281, 51256, 52479, 26624, 17475, -128, -3065, 847, 15583, 26442, 44253, 29672, 19389, 21257, 29582, 33788, 39901, 50170, 56437, 45256, 51504, 55287, 36770, 17443, -3562, -7734, 283, -12375, 2154, 19418, 14767, 1639, -2756, 6406, 12758, 25206, 23850, 19544, 37996, 49219, 50319, 42877, 24675, 32297, 45894, 42391, 23470, 20170, 88, -2798, 75, 4963, 12341, 26090, 19119, 17636, 33038, 38112, 39992, 28774, 30888, 30827, 8029, -2939, 10566, 21989, 15028, 26220, 31685, 25986, 26158, 10421, 9966, 28702, 33247, 39182, 21407, 25202, 17432, 12194, 3619, -4393, -7412, -8407, 12140, 3856, 3375, 4582, 7601, 1166, 1476, 10969, 33094, 19614, 6518, 7035, 23092, 35556, 28971, 37665]
13626C7665J7830k953j7253j0513o699J6749n079o741J4642R437m296J2588k878
13613E2499Q49P655k207j0749q285R366N495m840o570j5066j2744J0451J1713
13600C7567j1486r4k6240n242O368o06J4712J8991P291j8459R394J4153K040n910
13586D2479q603n926j2453J76q411o481k747M223j1010m845o280L676J7614K2486
13572B3898J3853J0824Q910N18O475K786j194j0796p770j5957j9511K150J6605
13559C0791n510L604k946j037k779L873J2425J9760O814k0470j5785K720j622
13546B9838j5892O127L149r695k0192K2059J1235j253j8777m711J2910O777j41
13533B1434L739m712J9566L4518n343j9525L764o782M898j6817l23J4066N168
$$ y = [37665, 55495, 52542, 35289, 24776, 18077, 34826, 29747, 23006, 37648, 47085, 42789, 55377, 52499, 53348, 61003, 58796, 48047, 39762, 49128, 54623, 49783, 43213, 28147, 15403, 25854, 37567, 26081, 25987, -253, -5495, 873, 267, 14979, 33970, 41261, 22802, 32196, 46349, 48389, 42479, 33876, 27950, 15497, 15673, 7262, 781, -1966, 2257, -8753, -13598, -19878, -16202, 1412, 23898, 37751, 48575, 57485, 58003, 64478, 67264, 66070, 55274, 47504, 31547, 12036, 14186, 30791, 25281, 28885, 25939, 24902, 22123, 25996, 38421, 58181, 64995, 44525, 28740, 31460, 29838, 13946, 20073, 23222, 13527, -6665, 15394, 26629, 25376, 6599, 1888, 14798, 21575, 21434, 25173, 20461, 40027, 74545, 69202, 49677, 53441, 46659, 51557, 34740, 34417, 48483, 53651]
13520E3651J201j1143J5186j544j0022j0225k5300j6730J5692J2530j826m028
13508A7442n27J4986N380J5227o181r874j0703N374K6261Q836j6114r272P422
13495D8257m904n937o347L192K0164O472j0781l665k3194r384L2972j7332j6710
13482A2803l079K879R085O554P297r687k399K0753j782k9679m915N183P198O736
13468B6947N586l936j391R753J9609m52j0635q292j631o209L806J2942J401k2244
13454B5254k5241J9806L2530O14j0686J202N03j7451R221L124l0556p218J2401
13441A3503J5670M906Q752J1813j2511j2102q449n739L062n972j2519J6013K1720
13428C8147R306L760j1072m216j0676J483Q494q546p806j771p14j2249K445J1546
$$ y = [53651, 54852, 43709, 58895, 57351, 47329, 37104, 11804, -4926, 10766, 23296, 21470, 17442, 16915, 31901, 37281, 52508, 46327, 36453, 25750, 31124, 57385, 66221, 50107, 40835, 48257, 43353, 37416, 31069, 34261, 54425, 60897, 50116, 46451, 23257, 13873, 46845, 29513, 12803, 9724, 12603, 21688, 28242, 35539, 25852, 23453, 44206, 42424, 12745, 7830, 13013, 20211, 26947, 32533, 28597, 27206, 36959, 56568, 56116, 45481, 37189, 35558, 29349, 33155, 46097, 47498, 25254, 13, 19819, 52349, 52963, 42277, 43479, 43982, 26531, 35752, 38876, 8320, 1102, 13503, 29173, 34079, 42831, 54644, 42133, 30031, 21582, 15843, 18905, 12933, 414, 16427, 38147, 47453, 51213, 40141, 35925, 25249, 26732, 35226, 26680, 18874, 17103, 16389, 4140, 6585, 18131]
13414A8131p733p955K719L368O030Q18J0454M084k893J850J2068L928k0926J6852
13400D0795K2107l665j8973j5579O778m505P867Q882P14J5696l365j1307J1834
13387E7279k0600k0702Q893J5164l918j8836N668J9887K2462j9658j0303J446
13375C6782m515J4921J1271M423J4949K948l6421l3608K632J0726K3420J6562
13363F4090k396m490K0429n491l2782k847J6175J2514j6863n209J3405K2617J079
13350H0231j2541j5732J0398J3913J6518k065J448j281j4859j3671j058j4867
13338D6434k5669J3682L1538O343j5536o584q41K366j0219N316M521k445L905
13325E2811L027j820N80m082k447J2981R605J8639J223l758j5481J762j1410P118
$$ y = [18131, 10398, 2443, 5162, 8530, 14560, 15378, 25832, 29916, 27023, 28873, 40941, 44869, 23943, 40795, 62902, 59237, 40264, 24685, 31463, 26958, 34825, 43707, 44421, 60117, 56752, 45445, 57279, 36679, 15977, 24870, 40034, 36116, 17280, 22948, 42835, 65297, 45639, 35336, 36782, 32267, 47188, 58459, 62882, 77831, 80779, 44358, 10750, 13382, 24108, 47528, 64090, 61694, 57204, 77633, 72142, 39360, 36513, 52688, 65202, 48339, 43130, 56535, 79152, 80231, 67690, 51958, 62356, 76269, 92787, 90722, 92170, 90889, 76030, 62359, 61301, 46434, 20765, 34447, 65985, 72328, 56792, 50208, 49367, 51733, 41514, 46830, 51351, 48906, 52811, 55838, 54018, 54598, 50516, 48069, 61050, 70655, 89294, 90517, 86759, 71278, 73040, 61630, 68748]
13311F8748j2161j5740R373K2849l689q461j1302m213O321K44n348N018P624l4519
13297B4744q090M540K0165K7725P484m542j5665N21o886M270J3425J0631L875
13284H2197O73j6316j4949P862K9412J4892m158j4194k5449o52J2871n619j543
13271F5027r008M395j148J3669m985m443R668p896L765M085J0530O155K616m758
13257H7672N79l381j267j3742J2760K8887q832k6100o694j422J1900Q128o186
13244H2302O74n580j909P744J905j1396q450L65J309n36j2501m332J2744K0973
13230H3312N704j343J289N997j2362J4546K3345J099j64j0017j6194N705J9478
13217A20395K5972J6551n21J7578K0708K1386K3941L9704N5355Q4857R7493R5436
$$ y = [68748, 56587, 40847, 50220, 73069, 69380, 60919, 49617, 45404, 51725, 51969, 46621, 51639, 59263, 24744, 16654, 21194, 41359, 69084, 76568, 72026, 56361, 56882, 49996, 54266, 67691, 78322, 82197, 82870, 66554, 51605, 59467, 88879, 103771, 99613, 85419, 59970, 59318, 72189, 66570, 65027, 56019, 60414, 59266, 72935, 67950, 63507, 73175, 65279, 69044, 73129, 83659, 89814, 92430, 87672, 88251, 84870, 83603, 69861, 82621, 111508, 102676, 76576, 69882, 68460, 80360, 88488, 82302, 82976, 77396, 75487, 83231, 85136, 73740, 65290, 65655, 66964, 66428, 53927, 49595, 62339, 83312, 89016, 87673, 88962, 94959, 82597, 97143, 120488, 121587, 121423, 111406, 95212, 100917, 120395, 146367, 162918, 162397, 179975, 200683, 222069, 246010, 285714, 341069, 425926, 523419, 618855]
13205F18855J00716P7382O8665M2806Q800l816n2252q7210q1754r0854q7157o1070
13193D53111p5103o3487o348p377l9155l7914l3906m876r851N714J0788o841j6291
13180A68464j1215j4321o270k1988j0141p438j4532j791J8801J4416J8473J998
13168A34456k8872j4663Q815j544M680M079M13mp125k88J1755J1998j5824n389
13154A02487k090m570J7860J6323o62K2322k423j3702j7902r507K1825j7809k1599
13141I0553J3759K0030p855k625p695J1555j2496j2093J371N142M289q368k905
13128I2662R365m922Q67j510M222L066l085J5442N07Q658Q100j2127J487k976
13114A19756k469j0839j5172o554n028Q059J0199J6149J320k0417j3173k716r178
$$ y = [618855, 719571, 796953, 865618, 908424, 917224, 913408, 861156, 773946, 692192, 601338, 514181, 453111, 378008, 314521, 308173, 300796, 261641, 223727, 189821, 184945, 175094, 180808, 191596, 184755, 168464, 157249, 142928, 136658, 114670, 104529, 97091, 82559, 80768, 99569, 113985, 132458, 134456, 105584, 90921, 99736, 98192, 102872, 106951, 107364, 107360, 100235, 99947, 111702, 123700, 107876, 102487, 100397, 95827, 113687, 130010, 129348, 151670, 149247, 135545, 117643, 108136, 129961, 112152, 90553, 104312, 124342, 116487, 113862, 106167, 117722, 105226, 93133, 94504, 99646, 103935, 95567, 92662, 102027, 97105, 97972, 96462, 100684, 103750, 100665, 116107, 116614, 125272, 133372, 121245, 122732, 119756, 117287, 106448, 91276, 84722, 79694, 87753, 97952, 114101, 115421, 95004, 81831, 79115, 69937]
13101F9937m281L145J3074J829j4071j7154j419J2863M175o023P227j2536o156
13088E0610l645J7108J1241J4385J3437k174l764N059L379J5461M936l694N649
13075A27988K734J188j8603K82J3148K1993J4093k039N426P539o322R600J3503
13062A90530R457J2216Q323J9428K1859J53L1919L5773Q1261J07781J43842K32953
13050H95495K86407L02178J90373P9497K0137l1759j51428k61252l14686k46886
13040G68076j47654p7501n4870n0090l7477k2424m942j7647k8334r355N458j054
13028C22186k4832k0278Q338l694L378r507o669j2228k0417k0047L607P147n126
13015B21858j3717k7987j6793J0256K283P943m456K006j3688Q82J4455J5958j5176
$$ y = [69937, 65656, 68801, 81875, 83704, 69633, 52479, 51060, 63923, 68098, 62075, 69302, 56766, 50610, 46965, 64073, 75314, 89699, 103136, 100962, 97198, 102257, 105636, 121097, 126033, 122339, 127988, 130722, 131910, 113307, 113589, 126737, 148730, 162823, 160784, 166210, 173749, 167427, 177027, 190530, 199987, 212203, 220526, 239954, 261813, 261966, 293885, 329658, 410919, 518700, 662542, 895495, 1181902, 1484080, 1674453, 1753950, 1774087, 1742328, 1590900, 1329648, 1014962, 768076, 620422, 542921, 488051, 437961, 400484, 378060, 373118, 355471, 327137, 317782, 323240, 322186, 297354, 277076, 285414, 281720, 285098, 275591, 268922, 256694, 236277, 216230, 219837, 226984, 221858, 208141, 180154, 163361, 173617, 175900, 183843, 179387, 181393, 167705, 168587, 183042, 199000, 183824]
13002A83824J4193J3564j1833l3463j5273L0392K891j7440J7485J1693J2111L3259
12990B41403K2416j7482k1845q339r658N490K826l313K350j3534j898K631l955
12977A97092Q068m740N376J2224p374m877l44k667M978O134N360J3519O2l607
12963B29204l676L523k6409k3225J0739J0857N518K2680J8045J194k0803n834
12951B21813K898K7677Q893k7408k1234N446j242j7428J157M120k762j0757J793
12938A92966J4643J506K529q59R444R476J560p067j9984O585L3352J5128j1784
12925B47495r648j8984n309L89p601J1119J9596J8675k002l055K439L0618K5921
12912C09653J8330L2347K4209R695K3359J339N247J801J998O038Q818J487j478
$$ y = [183824, 198017, 211581, 199748, 166285, 151012, 181404, 184295, 166855, 184340, 196033, 208144, 241403, 263819, 246337, 224492, 216153, 206495, 211985, 214811, 211498, 213848, 200314, 198416, 201047, 197092, 205160, 200420, 205796, 218020, 210646, 205769, 205425, 202758, 207736, 213870, 219230, 232749, 232811, 229204, 225528, 229051, 202642, 179417, 190156, 201013, 206531, 229211, 247256, 248450, 227647, 221813, 224711, 252388, 261281, 233873, 212639, 218085, 216843, 199415, 200572, 204692, 201930, 191173, 192966, 207609, 209115, 211644, 210785, 220229, 229705, 231265, 224198, 204214, 210799, 244151, 259279, 247495, 237847, 218863, 213554, 213943, 206342, 217461, 237057, 255732, 253730, 250675, 253114, 283732, 309653, 327983, 360330, 384539, 394234, 417593, 418932, 424179, 425980, 427978, 434016, 442834, 444321, 442843]
12899D42843j9380l176P394M38q34K1596K1641m589m734j4956J198J429K4476
12886D73346L1360N719M35L09J7307L405J2440J5815O382p06k003K806L6908L4799
12872F38322K6307j4822k5795k7503Q906K2170J9149N981m135l126o740j1592
12860F27122J0271N418l568R070j0977j331O110L378M674P856J7310K4792J190
12847G01315j6939P11N650J1988Q667M115J9609M757K5552K6553L1820N1964N4152
12834I29914M6222N1201M4359J9914K1483L9681N0921O1137O6272O9486N0447
12823A451037P6403J06942J07953R1881J22747J50138J35235J15559J28573J39180
12813B625648J42297J42096J66790K13376K50802L11780L47912M26601N42427
$$ y = [442843, 423463, 420287, 427681, 428119, 427285, 448881, 470522, 465933, 461199, 446243, 447441, 448870, 473346, 504706, 510425, 510860, 511169, 528476, 531881, 544321, 560136, 566518, 565812, 563809, 566615, 603523, 638322, 664629, 649807, 624012, 596509, 605415, 627585, 646734, 652715, 648580, 645454, 638714, 627122, 637393, 642811, 639243, 648313, 637336, 636005, 642115, 645493, 650167, 658023, 675333, 700125, 701315, 684376, 685087, 690737, 702725, 711392, 715507, 735116, 739873, 765425, 791978, 823798, 875762, 929914, 976136, 1027337, 1071696, 1091610, 1113093, 1152774, 1203695, 1264832, 1331104, 1400590, 1451037, 1527440, 1634382, 1742335, 1834216, 1956963, 2107101, 2242336, 2357895, 2486468, 2625648, 2767945, 2910041, 3076831, 3290207, 3541009, 3852789, 4200701, 4627302, 5169729]
12804E169729P16240Q65264R36952J056886J184161J299017J402911J504380J690889
12795A5826429K059366K661438L665247N320028P873971J1163076J4420345J7038547
12787H0028447J8839894J9663888J8751831J5264379R741198L543068k702373
12780A63130332q893123j4319277j7695853j8624974j7911838j6236400j3732592
12773E5716275j0491521p267775m892484l372596k460505j930710j642721j465082
12765B2192881j381070j335845j328752j291282j207697j135887j005549q59643
12757A2647156p73709o94823o38139n75177n11966m34578m27560l80342l55640
12748G855222l20276k77237k46495k12785k13458k08319j88462j45583j21275
$$ y = [5169729, 5885969, 6751233, 7688185, 8745071, 9929232, 11228249, 12631160, 14135540, 15826429, 17885795, 20547233, 24212480, 29532508, 37406479, 48569555, 62989900, 80028447, 98868341, 118532229, 137284060, 152548439, 162289637, 165832705, 163130332, 154237209, 139917932, 122222079, 103597105, 85685267, 69448867, 55716275, 45224754, 37956979, 33064495, 29691899, 27231394, 25300684, 23657963, 22192881, 20811811, 19475966, 18147214, 16855932, 15648235, 14512348, 13506799, 12647156, 11873447, 11178624, 10540485, 9965308, 9453342, 9018764, 8591204, 8210862, 7855222, 7534946, 7257709, 7011214, 6798429, 6584971, 6376652, 6188190, 6042607, 5921332]
12739E921332j28259j65873j77242j92364j63221j67413j58411j22596j16350
12730D529603j29830j62101j42942j16530j34542j34637j07702q1751p8161r1470
12720C349937r7332p5452o2224o8480q0784m8047m3755m9429o8948p8622o2946
12709B613918p2930p1833o7518n7637n8020o1683l1123l9927n7993m6915m9860
12698A998479l2551n3092m8485m2214l9431k2264l2514l4717k6340l3522j9947
12687A613402k1401o070j6104j7687j1800k9714l0593k8849l4842l4773k1768
12676A359801r490m0887l4161j9823k8639n173p938P996J5566K6282M9456L3336
12664A346326M7150O7392M9347J6267K7729K6019M2271N1849O1257Q6543J11632
$$ y = [5921332, 5793073, 5627200, 5449958, 5257594, 5094373, 4926960, 4768549, 4645953, 4529603, 4399773, 4237672, 4094730, 3978200, 3843658, 3709021, 3601319, 3519568, 3441407, 3349937, 3252605, 3177153, 3114929, 3046449, 2965665, 2917618, 2873863, 2824434, 2755486, 2676864, 2613918, 2540988, 2469155, 2401637, 2344000, 2285980, 2224297, 2193174, 2153247, 2095254, 2048339, 1998479, 1965928, 1912836, 1864351, 1822137, 1782706, 1760442, 1727928, 1693211, 1666871, 1633349, 1613402, 1592001, 1585931, 1569827, 1552140, 1540340, 1510626, 1480033, 1451184, 1416342, 1381569, 1359801, 1350311, 1309424, 1275263, 1255440, 1226801, 1221628, 1213690, 1221686, 1237252, 1263534, 1312990, 1346326, 1393476, 1460868, 1510215, 1526482, 1554211, 1580230, 1622501, 1674350, 1735607, 1822150, 1933782]
12653A933782J46077J45622J55703J33826J35669J59640J29881J25928J29903
12644C196031J56145J95811K00182K42843K72330L02005L44809L70548M33139
12635E713843N05075N71312O56368Q15950J008168J217965J533264J905659K346017
12626A6273621K783339L224546L710002M487146O022629Q700235J3335835K1448649
12618G9986002L5170014N2567116O1461120N1441430K9087024J0882976J530925
12611C22126607j3885002m0239776o0658839n9568400m1765694k4809255j5012417
12604F6187224r856239p014102n355655m244334l439645k866767k446786k043533
12596B8920163j736305j545350j443772j400500j385439j337710j232890j129150
$$ y = [1933782, 2079859, 2225481, 2381184, 2515010, 2650679, 2810319, 2940200, 3066128, 3196031, 3352176, 3547987, 3748169, 3991012, 4263342, 4565347, 4910156, 5280704, 5713843, 6218918, 6790230, 7446598, 8262548, 9270716, 10488681, 12021945, 13927604, 16273621, 19056960, 22281506, 25991508, 30478654, 36501283, 45201518, 58537353, 79986002, 115156016, 167723132, 229184252, 280625682, 309712706, 320595682, 322126607, 308241605, 268001829, 207342990, 147774590, 106008896, 81199641, 66187224, 56330985, 49316883, 43961228, 39716894, 36277249, 33410482, 30963696, 28920163, 27183858, 25638508, 24194736, 22794236, 21408797, 20071087, 18838197, 17709047]
12588A7709047j001235q96210q12140p29406o94679o76066o33834n61419n04534
12579A1199524m66047m31341l50203l13386l21333k93416k86872k77783k64183
12570H194960k97751l11596k86033k98290k79125k71724k22539k03007j74689
12561E850206j54733j47691j38280j38613j66753j77876j72683j70891j48229
12552D434457j24558j18220j35422j45212j20502r6160j04143r9708j05297r9265
12542C285970j10738q1022o9680q5000r6633r1007r6326q9714q1622q2367p9539
12531B322322p4308r4997q6492o9815o5358l9508n3832k7681k6789k1533j4870
12520A747139k2466n626m7480l4470J1231K7345J5206r154j4705n0132p5907r0011
$$ y = [17709047, 16707812, 15811602, 14999462, 14270056, 13575377, 12899311, 12265477, 11704058, 11199524, 10733477, 10302136, 9951933, 9638547, 9317214, 9023798, 8736926, 8459143, 8194960, 7897209, 7585613, 7299580, 7001290, 6722165, 6450441, 6227902, 6024895, 5850206, 5695473, 5547782, 5409502, 5270889, 5104136, 4926260, 4753577, 4582686, 4434457, 4309899, 4191679, 4056257, 3911045, 3790543, 3694383, 3590240, 3490532, 3385235, 3285970, 3175232, 3094210, 3024530, 2939530, 2842897, 2751890, 2655564, 2565850, 2484228, 2401861, 2322322, 2248014, 2153017, 2066525, 1996710, 1931352, 1891844, 1838012, 1810331, 1783542, 1762009, 1747139, 1724673, 1719047, 1671567, 1637097, 1648328, 1675673, 1690879, 1681725, 1667020, 1616888, 1540981, 1450970]
12508A450970r9530j22386j20521j22320j10208q0194p0169n8031m7003l3390
12498E87218m8981m5375l5158m4694m4031j9170K953K6284M6012L0303L8231J6882
12486E10474j3623k2621j8624k2032m1343l8534k4310k1768j0242J2735K1309
12475C31421q847R134j71k1667m5225k0227l937o954j0015K0634j278j8704J3627
12462B37791K9947J5301R43m6R676J4193N943j9918j2563k1634l8914k2408k424
12449A95887O722P557l775n751P158L532k480k846M612j1041K004N589J85l6387
12435A70966k0980p439K244r22l566J402j4465k2610k4536M196J5509J214J5821
12422A16834L5375L0443R326k54j5907j2370n704j0230k0372k4951k7780l947
$$ y = [1450970, 1351440, 1229054, 1108533, 986213, 876005, 795811, 725642, 667611, 620608, 587218, 538237, 492862, 457704, 413010, 368979, 349809, 352762, 379046, 425058, 455361, 493592, 510474, 496851, 474230, 455606, 433574, 392231, 353697, 329387, 307619, 297377, 310112, 331421, 322574, 331708, 331537, 309870, 264645, 244418, 240481, 233527, 223512, 244146, 242868, 224164, 237791, 267738, 283039, 283982, 283936, 293612, 307805, 313748, 293830, 281267, 259633, 220719, 198311, 195887, 202609, 210166, 206391, 200640, 207798, 211330, 208850, 206004, 210616, 199575, 201579, 207168, 207353, 170966, 149986, 142547, 144791, 143869, 140303, 141705, 127240, 104630, 80094, 84290, 99799, 101013, 116834, 152209, 182652, 191978, 191724, 175817, 163447, 157743, 147513, 127141, 102190, 74410, 70463]
12410G0463O409L4368J090J5574R468j5110J0563K856L38j1208j9152K213O920
12397A14792M346l695r400J5693J1527N143J0519n268L493o43J1693J9680K1660
12384A99540J1437j2727k6864j7381j0357O275k077j6164P616q54l091J7331P692
12371A60376o270J7251J4965K4929J4834L2058M7592M9735O9701J03238J01072
12360F29481R0925Q5340Q9642L6688k1399n8694o9737q9849q2780r9376j14944
12349C95297r0785l4521l4045l6462m1716j1475J1567l722k3244j3725K3032j8029
12337A22172k4471j0906r758j2791l928R112j9585p704j1745O365j2924k5310
12325a473k0714J0570J7704N381q721j3285J1208R919K7716K6623k89j4007n821
$$ y = [70463, 76872, 111240, 112330, 127904, 137372, 122262, 132825, 135681, 136019, 124811, 105659, 107872, 114792, 119138, 115443, 106043, 121736, 133263, 138406, 148925, 143657, 147150, 146507, 158200, 177880, 199540, 210977, 198250, 171386, 154005, 143648, 149923, 147846, 131682, 139298, 138444, 135353, 152684, 160376, 154106, 171357, 186322, 211251, 226085, 258143, 305735, 355470, 425171, 528409, 629481, 720406, 805746, 895388, 932076, 910677, 851983, 782246, 692397, 609617, 510241, 395297, 304512, 269991, 235946, 199484, 157768, 146293, 157860, 154138, 130894, 117169, 140201, 122172, 97701, 86795, 77037, 64246, 60318, 69430, 49845, 42141, 30396, 36761, 23837, -1473, -22187, -11617, 6087, 11468, 2747, -10538, 670, 10589, 38305, 64928, 64639, 50632, 44811]
12312D4811P070j2904J5328K4621J1109K338r088j014J1833Q15j0207j7630j9961
12299D7121n642J7276j0801j9487l339J236K7588P22k2848j6637J6772J7765M849
12286E4575J0978P696j0979k227J2072P988P527J8823Q950P282K3444K8020Q688
12273A82837J6244J3938K8192O7961R2874J18240J58127J79980J81610K02296
12263A242299K05386J96781J50954O5766p843p5943j23292j73971k01132k05949
12253A073056j88985j56006j46745j05385n8081l8322l2993l7909l1087j9432
12243B58111l4775j3434p64j4001j9255j5268J6488p645J045j957k7446k2864
12231A18235j6724J4903K42m141j243J1187j2288j5076j1848q9N376P62j1247
$$ y = [44811, 51881, 38977, 54305, 78926, 90035, 92373, 83285, 82271, 94104, 94919, 84712, 67082, 47121, 41479, 58755, 47954, 28467, 25128, 26364, 53952, 54674, 31826, 15189, 31961, 49726, 54575, 65553, 73249, 62270, 60043, 72115, 80103, 87630, 106453, 115403, 122685, 146129, 174149, 182837, 199081, 213019, 241211, 309172, 402046, 520286, 678413, 858393, 1040003, 1242299, 1447685, 1644466, 1795420, 1861186, 1853343, 1777400, 1654108, 1480137, 1279005, 1073056, 884071, 728065, 581320, 475935, 417854, 379532, 346539, 308630, 277543, 258111, 223336, 209902, 209138, 195137, 175882, 160614, 177102, 169457, 170502, 168545, 141099, 118235, 101511, 116414, 116656, 112515, 111272, 122459, 110171, 95095, 83247, 83158, 88534, 89296, 78049]
12218G8049j6881r812K66L1299N15k8435j1480O112j0122k3342r789J0728J5516
12205C2624m228J761r489j3491J0116J3360j4109P355L13Q316M041o179K510M005
12191C6905L0707J7829N019J7618m307l465m653K3550J6054K1703L5168Q4693
12179B76821J01762J61707K01693K69311K81227J86078P6755L0190m2430j56319
12169A386795k75724l07837k60206j39935p1334l9694k8960k4164j5528j8226
12159B05187k8613l7178j9938J843R318N188j5139k763q51l038j5171q232r899
12146H0714k6241N553j783k554j3922j9966j5490j6557K402J9135J5697M83p974
12133A9497K732O644P610J9551J2045k0491p316m437j1028p659j5144n490M8O682
$$ y = [78049, 61168, 51356, 51622, 82921, 83436, 55001, 43521, 49633, 39511, 16169, 6380, 17108, 32624, 28396, 30157, 20668, 7177, 17293, 30653, 16544, 23899, 24212, 32528, 36569, 30390, 32900, 36905, 67612, 85441, 90460, 108078, 103771, 100306, 95653, 119203, 135257, 156960, 192128, 276821, 378583, 540290, 741983, 1011294, 1292521, 1478599, 1555354, 1585544, 1543114, 1386795, 1111071, 803234, 543028, 403093, 331759, 292065, 263105, 238941, 223413, 205187, 176574, 139396, 119458, 121301, 130619, 135807, 120668, 117905, 117054, 114016, 98845, 90613, 80714, 54473, 60026, 58243, 55689, 41767, 21801, 6311, -10246, -7844, 11291, 26988, 27471, 19497, 22229, 28873, 36483, 56034, 68079, 47588, 40272, 35835, 24807, 17148, 2004, -3486, -3438, 3244]
12119C244O960j4473k695j0999M960o93J8130K3553R924j0099j1929j6594j2311
12106a3022q158M689J1132J2497j2q45R273P491k1600J561L714o291q074j1985
12092a9630j2961k295o502m76Q152J2517j267j7214p082J9595Q890K5658k789
12079D596p172M281J548m018N279Q429N597j2448k1567m096J0208j1891K520K5802
12065G068q531p717p029R069J5284R330l84j2426k4789Q666Q929j0110K583k989
12051a3046k252J0876J3790j956k7518m329R196j839M840Q108l69j7117q204N182
12037b4638J353P692N42j823p413R596J6409k845P636o973j6329r879n99P327
12023a9944M127l746j7154M956J3020P461K4823Q067o128p380o10j806l801l69
$$ y = [3244, 10204, -4269, -6964, -17963, -13003, -13696, 4434, 27987, 37911, 27812, 15883, -711, -13022, -21180, -16491, -5359, 7138, 7126, 6281, 15554, 23045, 1445, 3006, 6720, 429, -7645, -19630, -32591, -34886, -41388, -41864, -33712, -21195, -22462, -39676, -46758, -27163, -18273, 7385, 4596, -2576, 1705, 3253, -765, 4514, 12943, 18540, 6092, -15475, -19571, -9363, -21254, -18734, 7068, -1463, -9180, -16209, -7140, 8144, 17474, 17090, 4664, -20125, -11459, -2530, -12640, -10057, -13046, -15298, -4422, 9368, 7412, -20106, -24435, -15239, -17078, -12238, -4130, -4499, -21616, -29820, -24638, -23285, -15593, -15051, -16874, -24287, -14691, 1718, -1127, 6509, -464, -16793, -26672, -27271, -19944, -15817, -19563, -36717, -31761, -18741, -11280, 13543, 21610, 15482, 8102, 7492, 5686, 1885, 1516]
12009A516p774R516M266n459j1560o001J1872k297n316k4581q250J3865j029J9997
11995a1235j543Q81M993j1558J0375j2577l231J4537j925j892P042J0143m48r163
11981e601k434o329L53j199j4029R95K181O945j538o191J531J3975J0929J1397
11967A0985p590n779L228q689j9161J1029l723r487J7752k599M04l540j9891l639
11953d0700J55M723J2323r530J947k38R906M969n974j8906l102j216N69J0799
11939c4275Q622J085m445j614Q949r233L483O624J2886p015j0493P259L326k6974
11925d1815Q795J973j0093Q091J5473K027N946p243j3985J0849J6238p290O96
11912a0338r800J3340M249m683J3372K958r200k495J0745p292r274M763P115j2829
$$ y = [1516, -6258, 3258, 7524, 2065, -9495, -15496, -3624, -5921, -11237, -35818, -44068, -30203, -31232, -11235, -12778, -11897, -6904, -18462, -8087, -20664, -23895, -9358, -11283, -13175, -6133, 4010, 3562, -5601, -8035, -14364, -14011, -15210, -29239, -28244, -26063, -19118, -20656, -26847, -25316, -11341, -412, 10985, 3395, -2384, 844, -7845, -27006, -15977, -19700, -29187, -11435, -14034, -13630, -17170, -37061, -40700, -40545, -35822, -23499, -33029, -31082, -31320, -21414, -16445, -22419, -41325, -44427, -45643, -45074, -34275, -25653, -24568, -29013, -30627, -21678, -30911, -27428, -20804, -7918, -14933, -25426, -18167, -14841, -41815, -33020, -31047, -41140, -33049, -17576, -15549, -9603, -16846, -30831, -19982, -3744, -11034, -10338, -20138, -6798, -2549, -7232, 6140, 9098, -102, -2597, 8148, 856, -8418, -3655, 3460, -9369]
11898i369J126J5232N420m043j1845P827j4138K435m14l922q517j4724K607L078
11884b9247j424R313P100n443q932Q569J6635J1853L562o122j2954k0957j69m401
11870c2617Q798J5199M556j720L323j2509p318P672k755N687j578k906J6572P205
11856G609J1635L966k941J353r343l957J2317L830o113J390k2503j579j24N834
11842A374j1836K547J9736n766J9320p323j3540l989q391P66j4657P023n510P928
11828a2318P987L327m63P002l032n366R484j1675p261l499J0691p96J257O03J3204
11813I145j1379m019o354r61K3754N373K1666K625n682j4954k7274K204o333m535
11799a6724J953m768P347J1571J4470m543j3650o331K4342J4871l290k4823j7940
$$ y = [-9369, -8243, 6989, 12409, 8366, -3479, 4348, -9790, -7355, -7769, -11691, -20208, -34932, -32325, -29247, -30671, -21358, -14258, -19701, -28633, -20064, -3429, 8424, 11986, 5864, -7090, -28047, -28216, -32617, -23819, -8620, -4064, -5784, -2461, -14970, -22288, -14616, -17371, -11684, -13262, -16168, 404, 7609, 19244, 23210, 20269, 21622, 12279, 8322, 20639, 24469, 18356, 19746, -2757, -4336, -4460, 1374, -10462, -7915, 11821, 6055, 25375, 18052, 4512, 523, -7868, -7102, -21759, -14736, -20246, -12318, -4331, -1004, -1467, 5535, 2503, -2863, 6621, -5054, -12315, -15814, -5123, -5919, -4662, -4059, 9145, -2234, -6253, -12607, -13568, 10186, 15559, 37225, 39850, 34168, 19214, -8060, -5856, -12189, -16724, -14771, -19539, -12192, -621, 13849, 9306, -4344, -10675, 13667, 28538, 25248, 425, -17515]
11786a7515O039J7265o512k1834r485j0956k572J9159k292j5966o499K6612K3494
11773a062l041o027M370j7453j6739J4660J1277J0882J9728k0103j9534l664J3289
11760a3417R930o421j0218p185O290K406m287K6695J2286j6000j366K6772J325
11747B6810l1170j6136N380K0689l336k540l354j7496r398J5891N315O507K514
11734c24J257k784m523N222J289K932R911p414o275p972l048J4443J9127j7157
11720D684k8897j6862q375Q656K5663K0605K971j6252j2591N368P173O810Q69
11707a78j6710n526n358j787j5868R602K3193p811O912M708j8829j0063K1106
11694a6609J7388R317j0692j0591j1836j0695L444J476J0361J9238O276L858j1344
$$ y = [-17515, -11476, 5789, -723, -22557, -32042, -42998, -45570, -26411, -28703, -44669, -51168, -24556, -1062, -4103, -10130, -5760, -23213, -39952, -25292, -14015, -3133, 16595, -3508, -23042, -26706, -13417, -3487, -9908, -20126, -27311, -21021, -18615, -22902, 3793, 16079, 79, -1287, 25485, 26810, -4360, -20496, -15116, 5573, 2237, -303, -3657, -21153, -30551, -14660, -9345, -2838, -324, 933, -1851, -6374, -1152, 137, 3069, 12980, 5566, -709, -8681, -11729, 2714, 21841, 4684, -24213, -41075, -49450, -40794, -15131, 5474, 8445, -7807, -20398, -15030, -7857, -1047, -178, -16888, -22414, -27772, -29559, -45427, -35825, -12632, -20443, -13531, -8823, -27652, -37715, -16609, 779, 10096, -596, -11187, -23023, -33718, -30274, -28798, -18437, 801, 7077, 10935, -409]
11681d09o859k118Q042k3431k3776j0596P547J659J5617J9979L179j1634m23J2083
11667a1140K452o375j2294M891p974R973J4563K414K240o707j2187p231K72P353
11653a9750J1808q599l091k201R554m697N844Q468J100L369j1404M676M164J0692
11639I933j6758q703J863P446R012J0396K0691j8135J059j6406r794Q069J8367
11626A7040J6422j4423p83J220m364J868k906j1089k292m697l5689n378J4321
11613c0750R413J7535Q199J0044k94q053M405J5890m54p277j4594n440J4527j355
11599A1796J2825P843r257k4558q710J129J1041R106J2693j8571p816q129p471
11586a8079J157P796J3016Q843k1710o890R30J362J752k9675P567L3422P348j082
$$ y = [-409, -7268, -9386, -1344, -24775, -48551, -59147, -51600, -49941, -34324, -14345, -11166, -22800, -23223, -11140, -8688, -15063, -27357, -22466, -30440, -20467, -5904, -3490, -1250, -7957, -20144, -27375, -27103, -19750, -7942, -16541, -19632, -21833, -12279, -16976, -11132, -2664, -1564, 1805, -9599, -4923, -759, 9933, -6825, -15528, -13665, -6219, 2793, 13189, 33880, 15745, 16804, 398, -9396, -1327, 17040, 33462, 19039, 18256, 19476, 15112, 16980, 14074, 2985, 693, -4004, -39693, -45071, -30750, -21337, -3802, 4397, 14441, 14147, 6094, 10499, 26389, 25935, 18658, 4064, -1376, 13151, 11796, 24621, 32464, 23207, -1351, -10061, -8932, 2109, 11215, 23908, 5337, -2479, -10608, -18079, -16922, -9126, 3890, 12733, -8977, -15867, -14937, -13575, -11823, -41498, -33931, -509, 6839, 5757]
11572E757j0518j2463N716o908J2245J7576N458J80j4474j0466Q466K0651L517
11559B4737j6212j5937j1944J9053O543j9524n003k568K5663p513r133J9631L830
11546A1623j6690k1787P799Q345P638Q893j4629r948P394j5253l671J3263J1709
11533e314j5948l605n947k894l881J3648K0845k725q903m717o734R712P917J371
11519g175M25r75o871J2109J839Q962q079p18J1122Q485o616m698p653J056j1011
11504i798J853P315J1537j4383l658j1541o304r929k556j521Q530L2612j803j0937
11490a0583J2002K1696J679M23m804P935j3063j0504r680j0992j3519J036Q541
11477a9833J086K5440l027q933K489R982J6713j542J1551R273o281l023M250p067
$$ y = [5757, -4761, -17224, -11508, -18416, -6171, 11405, 16863, 17043, 2569, -7897, 569, 21220, 24737, 8525, -7412, -19356, -303, 6240, -13284, -18287, -20855, 4808, -2705, -11838, 7793, 11623, -5067, -26854, -19055, -10710, -3072, 5821, -8808, -18756, -11362, -26615, -30286, -17023, -5314, -21262, -24867, -30814, -33708, -37589, -23941, -3096, -5821, -14724, -19441, -26175, -16463, -8546, -7175, -6750, -7725, -14596, -2487, -648, 8314, 235, -483, 10639, 19124, 12508, 7810, 157, 1213, -9798, -7945, -630, 10907, -3476, -7134, -18675, -24979, -34908, -37464, -38985, -30455, 2157, 354, -10583, 1419, 23115, 24794, 25217, 20413, 28348, 15285, 4781, -4899, -15891, -29410, -28374, -19833, -18747, 6693, 3666, -5267, -2778, 7204, 23917, 22375, 33926, 43199, 36918, 33895, 38145, 31078]
11463C1078n976j8609j3815k3305J0672M796K977q32k5265m115j8309J8593L5844
11450f266q210L549J9861J5855N533j1982Q017J4372k6294l3255J9988J1443j0771
11437A840J019R750l208P44j3789j2806K3148J8171k478q854l1241K298K5887
11424A0481O923k887k0711j6757J272J309J0685J0540K809J0942j1950j1989Q248
11411a085R797J6119R757J4852o407q795j4890j9799l588o500O981R1p835k5713
11397c7015j120J9404J2978N235k3968J1959J0695J6722K8112J1168k0631k8636
11385D903n920J6084j9774O820J4444r789J1379j202o735n784j983l075J5972
11372A5340o184o702O785P577n028O079m406K099N698l196j4095k2886L127J781
$$ y = [31078, 25102, 6493, -7322, -30627, -19955, -15159, -12182, -13014, -38279, -42394, -60703, -42110, -6266, -14476, -10927, 8934, 24789, 30322, 18340, 26357, 40729, 14435, -18820, 1168, 12611, 1840, 2859, 12609, 9401, 10145, -3644, -16450, 6698, 24869, 22391, 13537, -17704, -15406, 10481, 17404, 14517, -6194, -22951, -21679, -20370, -9685, 855, 3664, 14606, 2656, -9333, -1085, 8712, 24831, 34588, 49440, 43033, 34238, 19348, -451, -4039, -10539, -3558, -3467, -11302, -37015, -38135, -18731, -5753, -518, -24486, -12527, -1832, 14890, 43002, 54170, 33539, 4903, -1017, 15067, -4707, 2113, 16557, 6768, 18147, 16945, 10210, 4426, 2443, -632, 15340, 9156, 2454, 9239, 16816, 11788, 17867, 13461, 15560, 21258, 18062, 3967, -18919, -15792, -14011]
11358a4011j693M421J0013k387j0680j7404J9892j358L364J3003J0439K6004J6057
11345E5660n240j0285k4031o524m810K6174J6654J2675m037k2892j3459K684L276
11332B5845j4076l313j39J4047N5L446k137J239R744O659m744j0338j0834O345
11318B1799L163L900n136j2837L11j897N278R051l656o447k878N18K1396M571
11304C7136j9123J2902K0145N423j8187M457M832N481l155o572j0461j148K0261
11291E1991K6796j3712Q009m043r234K84K475j8250q911J3009K0762q71l6592
11278C1713l8589K4705M772k431L179j6456n879l803j422J821k134N356J7321
11265A8153Q596R554k0088k243J9416Q744n675N159j093q423K185K171p00k235
$$ y = [-14011, -15704, -11283, -1270, -3657, -14337, -31741, -11849, -13207, -9843, 3160, 13599, 39603, 55660, 50420, 40135, 16104, 9580, 4770, 30944, 47598, 60273, 56236, 33344, 19885, 22569, 25845, 11769, 8456, 8317, 22364, 22419, 25865, 23728, 24967, 34711, 41370, 36626, 26288, 15454, 21799, 24962, 28862, 23726, 10889, 11200, 9303, 14581, 23632, 19976, 13529, 10651, 11169, 32565, 37136, 18013, 30915, 51060, 56483, 38296, 42753, 47585, 53066, 49911, 43339, 32878, 31730, 51991, 78787, 65075, 73084, 69041, 59807, 60091, 62566, 44316, 35405, 48414, 69176, 68305, 31713, -6876, 17829, 22601, 20170, 23349, 6893, 1014, -2789, -4211, -2390, -4524, 832, 18153, 26749, 36303, 16215, 13972, 33388, 42132, 36457, 41616, 40523, 32100, 34285, 36456, 35756, 33521]
11251C3521j184j2267j7576J6537P323j6514K009o115r285P789K5694p704j9824
11238B404R293M764J9343J1715l255K558J1863L61l4912M32m882J1810O364j40
11224C7718l749R783k0180j5442K258J6665J371j2933J845P489J2343K7282o573
11211E7877k7902j4730q465o920J0939K668p716J0391K559p428k3603K56K2500
11198A0426O025r635P479J8649l937J6841P234j6664r445q556K192P353J3721
11185D1683P226K61n317j342m595q466J4377N720j4182j5427J896m808m209J6376
11171B9193J213k2164J190J4208M95J5450j486k065q248m181j4550n817J4971
11158A8209m962q652l400j0487N598J1778K426O741K5330K1087R228j5421n913
$$ y = [33521, 32337, 20070, 2494, 19031, 26354, 9840, 11849, 5734, -3551, 4238, 29932, 22228, 2404, 11697, 16461, 35804, 47519, 44264, 46822, 58685, 59046, 24134, 24566, 19684, 31494, 37858, 37718, 33969, 43752, 23572, 8130, 10388, 27053, 28424, 15491, 17336, 24825, 37168, 64450, 57877, 29975, 15245, 6780, -140, 10799, 13467, 5751, 16142, 18701, 11273, -12330, -12074, 10426, 16451, 6816, 14295, 32944, 29007, 45848, 53082, 36418, 26973, 18417, 20609, 27962, 41683, 48909, 49170, 43853, 42511, 37916, 29450, 43827, 49547, 35365, 19938, 21834, 17026, 12817, 29193, 30406, 8242, 9432, 23640, 24135, 39585, 38099, 36034, 27786, 23605, 9055, 3238, 18209, 13247, 4595, 1195, -9292, -3694, 8084, 10510, 17251, 42581, 63668, 72896, 57475, 51562]
11145E1562l937k524q50j710m617K062J745r246j0442l248N897l964m126Q790
11131B5392K923J0738j3998j6547L294n688l441J1673K0959K7456l174k2301j8100
11118A9186n660q780J9788J8037l593k1237l555O376J0917K247o566r4J360l56
11104B8070O712J5153J7221j0432M883K7224j0285m497j3464j1868n409l065j5480
11091B4763K9474p667m461j6416k525j4215P917J2347L75O865K778l666r548r65
11077B5056j0905m317p894M565L172Q006P874m074l324J0484J0542o602M299j626
11063C5256J2320k628l397L741M836k824j4160N689K3818J2527k2769q946M233
11050D7696j1003n334M8P247J3399J1319l811R966P732K3676Q690q130m198j3204
$$ y = [51562, 47625, 45101, 44251, 42541, 37924, 39986, 41731, 32485, 22043, 18795, 24692, 20728, 16602, 25392, 28315, 39053, 25055, 8508, 11802, 6114, 2673, 14346, 35305, 62761, 59587, 37286, 19186, 13526, 4746, 24534, 42571, 38978, 17741, 14186, 20562, 31479, 33726, 27160, 27066, 28426, 28070, 34782, 49935, 67156, 56724, 61607, 88831, 78546, 74049, 60585, 48717, 43308, 40243, 24763, 54237, 46570, 42109, 25693, 23168, 8953, 16870, 29217, 29592, 36457, 39235, 35569, 26021, 25056, 14151, 9834, 1940, 6505, 9677, 17683, 25557, 21483, 18159, 28643, 39185, 32583, 36882, 35256, 47576, 44948, 41551, 45292, 50128, 47304, 33144, 38833, 62651, 75178, 52409, 43463, 47696, 36693, 31359, 31407, 38654, 52053, 63372, 59561, 69527, 77259, 100935, 109625, 101495, 97297, 84093]
11036H4093K838N674J386J1792m347k3569j1893K1655J8544R135l868L218l635
11023A11023K7301J6920j4018k8142L404J3829q325o572J2682K7294L1043N9470
11011B45909P3526J08771J55516K29690K91895K90437J59081P8556L7400j7956
11001A652825j53089k88672k77418k08909j41046j01079o6036o8783m3071k5419
10991B79303j7329j2156p1O3j7011k1372j0217p256r890r908l1899k2081j0379
10978A09797o105j2939N278K1950j4680J898J6299J6466m331K12m908j8547j8630
10965I1760J5223R885k095O009J5164n908l0917j1167L057L440J1593J596m013
10952A03627j0289j1256k26K627Q313O325M905K9188N059k7196p806K32n361O371
$$ y = [84093, 86931, 92605, 93991, 105783, 101436, 77867, 65974, 87629, 106173, 115308, 111440, 114658, 111023, 138324, 155244, 141226, 113084, 116488, 130317, 121992, 115420, 128102, 155396, 186439, 245909, 319435, 428206, 583722, 813412, 1105307, 1395744, 1554825, 1633381, 1670781, 1652825, 1499736, 1211064, 933646, 724737, 583691, 482612, 416576, 347793, 304722, 279303, 261974, 249818, 249747, 249810, 232799, 211427, 201210, 193954, 184064, 174156, 142257, 120176, 109797, 103692, 90753, 96031, 117981, 103301, 105199, 121498, 137964, 133633, 133845, 128937, 110390, 91760, 106983, 116868, 114773, 120782, 135946, 130038, 99121, 87954, 91011, 94451, 106044, 107640, 103627, 93338, 82082, 81856, 84483, 92796, 99121, 104026, 133214, 138273, 111077, 103271, 103503, 98142, 104513]
10938A04513j556k1775j9102l33K0685j2095j4276R307j1832j1521j840J0584
10926E0759J7582J0842J1056j2124j3414m868o86J123J2232R717k2888Q805R907
10913G8043p716j953q761q667j0772r14J3565K761j4385j1159n874M41j819K297
10899B5087J6603j8276k2481j5809n665K1812K3218N380j92L080K4135J4565p045
10886F4412j7477j8807j685Q091J9393M390n382K1583j844O060j634l235P650
10873H1515N943j1014k446k137O38J5326L285j9579j6920O257R794K1127J5752
10860A07541J9244m887j5555k7069j770P008J8506R143p640J0288J8645J7591
10848A51045N35L866J1292K0666J7439J1793j3463k0016J0935N1581L0789J06
$$ y = [104513, 102957, 81182, 62080, 61747, 82432, 70337, 56061, 65368, 53536, 42015, 40175, 50759, 68341, 79183, 90239, 78115, 64701, 59833, 59147, 60270, 72502, 82219, 59331, 68136, 78043, 70327, 68374, 59613, 50946, 40174, 39260, 52825, 55586, 41201, 30042, 24168, 24609, 22790, 25087, 41690, 23414, 933, -14876, -20541, 1271, 24489, 29869, 29677, 32757, 56892, 71457, 64412, 46935, 28128, 26443, 34534, 53927, 58317, 52935, 74518, 72674, 78734, 77100, 73865, 81515, 87458, 76444, 73998, 71861, 72499, 87825, 91110, 71531, 54611, 60868, 70662, 91789, 107541, 126785, 121898, 106343, 79274, 77504, 84512, 103018, 112161, 104521, 114809, 133454, 151045, 151580, 155446, 166738, 187404, 204843, 216636, 203173, 183157, 194092, 245673, 276462, 276568]
10836B76568l0096m1022p490j5493k0321k3463j5152p584m972p963J9479J9083
10824A41574K501j0893q132j5836J1293N728k111j0680L474P598j8636j757K260
10811A06383n359R747K4272K0830J6711n95N804j0249p034R383j0200j1709q103
10798A39881j4172J050J4640M269J8715P454Q383L893O091m720J6421J1706l0777
10785A82834k8535l5421j2213o72J2485k475j3456O125L5832L8833K7051K7632
10773B38020J7889L1288j4480j8534k6432r864p396Q76J592j3344m595J4548k405
10760B07163J2177J0158o028j450K6376J6445O636n822Q5j6362K618j4656l4662
10747B02678j0281l913k4078j1029l847J6187P443q830J0912N323K3540K8878
$$ y = [276568, 246472, 205450, 197960, 182467, 162146, 138683, 123531, 115947, 110975, 103012, 122491, 141574, 144075, 133182, 125050, 109214, 120507, 126235, 124124, 113444, 116918, 124516, 105880, 104123, 106383, 101024, 110771, 135043, 155873, 172584, 171989, 177793, 167544, 160510, 169893, 159693, 147984, 139881, 125709, 126759, 141399, 145668, 164383, 171837, 180220, 184113, 190204, 185484, 201905, 213611, 182834, 154299, 118878, 106665, 105993, 118478, 116003, 102547, 108672, 144504, 183337, 210388, 238020, 255909, 287197, 272717, 254183, 227751, 217887, 210491, 211367, 212959, 199615, 195020, 209568, 207163, 219340, 229498, 223470, 222020, 248396, 264841, 271477, 265655, 265740, 249378, 251996, 237340, 202678, 192397, 188484, 164406, 153377, 149530, 165717, 173160, 164330, 175242, 180565, 204105, 232983]
10735B32983J7033O766p009l001Q960J0033J5516J0061J4880K009j7376j8699
10723B72156j5789N32K90J915J0170J7206L3976J0846j6389L0218Q9529P1186
10711E05846J9264j4147k2741j5734P854l559J762J4384J6215p407k8499L939
10699D77177j571k0121o746K2437K4792J8923J5756N125k264K9103J9590J0720
10687E92921O518J7562J5046K1265j3641k7941j5349J1268n691J0355J444J796
10675F15553P35k165L072M643L793K0647K301m319M884R10p862q353O523J6586
10661F56948L623Q317K7198K6405L2595M6053J1920P166R564L3830K3050J0455
10649H97124J3499J5337l294j2252J284J1490K6687J359L956M7900P8692P3801
$$ y = [232983, 250016, 256782, 249773, 246772, 255732, 265765, 281281, 291342, 306222, 308231, 290855, 272156, 256367, 256899, 257189, 259104, 269274, 286480, 320456, 331302, 314913, 345131, 434660, 505846, 525110, 510963, 488222, 472488, 480342, 476783, 478545, 492929, 509144, 501737, 473238, 477177, 475606, 455485, 448739, 471176, 495968, 514891, 530647, 535772, 533508, 562611, 582201, 592921, 599439, 617001, 632047, 653312, 639671, 611730, 596381, 607649, 601958, 612313, 613757, 615553, 616288, 614123, 617195, 621838, 625631, 646278, 648579, 644260, 649144, 650054, 642192, 633839, 640362, 656948, 660571, 668888, 696086, 722491, 755086, 801139, 813059, 820225, 829789, 863619, 886669, 897124, 910623, 925960, 922666, 910414, 911698, 923188, 949875, 951234, 955190, 1003090, 1081782, 1155583]
10637A155583P3894P8776Q3239M7461L3496J4085K5033M9888N1167O8255J31145
10626A812022J62871J88441J98558J79930J57452J55335J53000J32849J45549
10617C286007J78887K07394K25533K47110K95200L70616L97694M58694N53913
10608F221048O62423Q07045R46548J031652J072624J178040J340334J544535J703367
10599A6507616J923687K360715K958069L819637N156936P314085J0784757J6452334
10591F7277836K5947135M0979231N8195830O0469888L7446125J3519208M690481
10584C08525734m43278k1442770n5040298o3995403m6936965k9344431j8516184
10577G2806405j2269413q570042o298936m753096l562807k666824k022390j682383
$$ y = [1155583, 1229477, 1308253, 1391492, 1438953, 1472449, 1486534, 1511567, 1561455, 1612622, 1680877, 1812022, 1974893, 2163334, 2361892, 2541822, 2699274, 2854609, 3007609, 3140458, 3286007, 3464894, 3672288, 3897821, 4144931, 4440131, 4810747, 5208441, 5667135, 6221048, 6883471, 7690516, 8637064, 9668716, 10741340, 11919380, 13259714, 14804249, 16507616, 18431303, 20792018, 23750087, 27569724, 32726660, 40040745, 50825502, 67277836, 93224971, 134204202, 192400032, 252869920, 290316045, 303835253, 308525734, 308082456, 286639686, 231599388, 167603985, 120667020, 91322589, 72806405, 60536992, 51966950, 45668014, 40914918, 37352111, 34685287, 32662897, 30980514]
10569C0980514j552072j463211j379740j420356j545259j665918j617682j412139
10561A8924137j202529j058967r38828q17218p47637p22887o50135o09835n58736
10552A1617365n19437m68779l93178l56278l21486k83494k86953k74906k59348
10543H453506k74845l30357l13953k82152k85307k87801k91794k57578k06228
10534E923491j70809j35639j22861j21067j42525j50782j85643j91936j61069
10525D541160j26289j62487j60943j44138j14364j05966j10697j00986q5477r9334
10515C330479r4704p7499q8479r7056r3364r7096j13638j03246q8679p7819p9455
10504B319444r1168o1645o5994o5210n5358p9458n9197l6341l4980l1321k1942
$$ y = [30980514, 29428442, 27965231, 26585491, 25165135, 23619876, 21953958, 20336276, 18924137, 17721608, 16662641, 15723813, 14906595, 14158958, 13436071, 12785936, 12176101, 11617365, 11097928, 10629149, 10235971, 9879693, 9558207, 9274713, 8987760, 8712854, 8453506, 8178661, 7848304, 7534351, 7252199, 6966892, 6679091, 6387297, 6129719, 5923491, 5752682, 5617043, 5494182, 5373115, 5230590, 5079808, 4894165, 4702229, 4541160, 4414871, 4252384, 4091441, 3947303, 3832939, 3726973, 3616276, 3515290, 3429813, 3330479, 3235775, 3158276, 3069797, 2972741, 2879377, 2782281, 2668643, 2565397, 2476718, 2398899, 2319444, 2228276, 2166631, 2100637, 2035427, 1980069, 1900611, 1841414, 1805073, 1770093, 1738772, 1716830]
10493A716830k1445m9568m0767m1657r3012q5511r2211o8954o6034p8327q1000
10482I98344o8450o6405k7316n0168m3069k3346j3821q158m6583l3536k6978k3607
10470E66907m6956m4265m8643l6450k7592Q062k012Q038O8124N4675O812p788
10458D98912n664j1036m0087o4825l1577P521j4647k7107j6013j5718l034L67
10446B77092k1239j3608k946k0548k1364j6980M00O691J9169J0322J5621K0401
10434B53011J9391j0702l122J1476k4j9927l7118m08P078n271p737r876Q6J6734
10420B13591j2421J7800J5366j9218k2731J5046j1790r116l848J854m783r392
10408A70358j2438J1981j0853l0490k0812m658O413J6906j2955j4031j4261K0504
$$ y = [1716830, 1695385, 1645817, 1605050, 1563393, 1470381, 1384870, 1292659, 1223705, 1157671, 1079344, 998344, 929894, 863489, 836173, 786005, 742936, 719590, 705769, 697611, 651028, 617492, 590514, 566907, 519951, 475686, 427043, 390593, 363001, 371063, 369051, 377089, 445213, 499888, 506700, 498912, 493248, 482212, 442125, 377300, 345723, 353244, 338597, 311490, 295477, 279759, 276725, 277092, 255853, 242245, 239299, 218751, 197387, 180407, 180807, 187498, 206667, 216989, 232610, 253011, 272402, 261700, 258578, 270054, 270030, 250103, 212985, 212577, 219655, 214384, 206647, 196771, 196857, 213591, 201170, 218970, 234336, 215118, 192387, 207433, 195643, 186527, 182679, 184533, 179750, 170358, 157920, 169901, 159048, 128558, 107746, 103088, 109501, 126407, 113452, 99421, 85160, 105664]
10396A05664J2963j2668K7703K3138K5394P850q393n345j3903k1945P366j4365
10384A33459o457k145k2505Q264N061j3544J9991L647m023J4845J0673k3198j6741
10371A07327L853J3557J500q059j2213n425K476K1834J1846P023J6897J0478j394
10358A69700N523J1560N365p842j6309j6553p591k0684q91Q526K463L080q981
10345A27366J591K033k4435j6478L9034L9233j8989m3236l427J4892k909m025
10333A10650o983L345J0747p112k4137l907p517k4650j3069o97k798N394N966
10320D5232k92q666M376K101K327j3559p033O314K3029P041n432j5099J6044J440
10306E7823q563n599J1447L2258J3535n848r407J975L1162K3004M7134N7503K1493
$$ y = [105664, 118627, 105959, 133662, 156800, 182194, 190044, 181651, 176306, 162403, 140458, 147824, 133459, 127002, 124857, 102352, 110616, 115677, 102133, 122124, 125771, 121748, 136593, 147266, 124068, 107327, 111180, 124737, 126237, 118178, 105965, 100540, 103016, 124850, 136696, 143719, 160616, 171094, 169700, 175223, 186783, 192148, 184306, 167997, 151444, 143853, 123169, 122278, 130804, 133267, 136347, 127366, 128957, 130990, 106555, 90077, 129111, 168344, 149355, 106119, 102692, 117584, 114675, 110650, 103667, 107012, 117759, 110647, 86510, 82603, 75086, 50436, 37367, 36670, 33872, 39266, 45232, 44940, 36274, 40650, 42751, 45078, 31519, 24486, 30800, 53829, 60870, 55438, 40339, 56383, 57823, 49260, 43661, 55108, 87366, 100901, 95053, 85646, 87621, 118783, 141787, 188921, 246424, 267917]
10293B67917J8531J6365J0450K5993k035l3603k4091Q489J1985j2280m4970l3315
10281B09436J1851k442j0421J234k5574q940j0226r651k366n018k0900k0771R898
10268A16110K9816J5267m342K543o886n34j5178O180J3652K4363J3864J0716J724
10255B07295J3139O548J9020K0023L7653N0257K7206L0608K9510M4618N7438O3631
10243F06946Q9669J03861J46138K32472L45355N36510Q13510J083869J195678
10234E154008R57518N35578K23705j1173l84755r01759j210754j120161p95933
10225B446274n33602l58084k51063j83353j10484r8228o5592m3352n0427l1913
10215G20176l3553l0374n0171n7307k0341k2658l0890m3320j7742m3419j6517
$$ y = [267917, 286448, 302813, 313263, 339256, 337221, 303618, 279527, 288016, 300001, 287721, 242751, 209436, 221287, 218845, 208424, 209658, 184084, 175144, 164918, 155267, 152901, 147883, 126983, 106212, 116110, 145926, 161193, 156851, 159394, 152508, 151974, 136796, 142976, 156628, 180991, 194855, 205571, 207295, 220434, 226982, 246002, 266025, 303678, 353935, 381141, 411749, 441259, 485877, 543315, 606946, 696615, 800476, 946614, 1179086, 1524441, 2060951, 2874461, 3958330, 5154008, 6111526, 6647104, 6870809, 6859636, 6474881, 5573122, 4362368, 3242207, 2446274, 1912672, 1554588, 1303525, 1120172, 1009688, 911460, 845868, 802516, 752089, 720176, 686623, 656249, 606078, 548771, 528430, 505772, 474882, 431562, 413820, 370401, 353884]
10204C53884l228j986J703J538k9423k6600L590j6639j6548j1958n404l422k2883
10191B22624l657K617J247l071j5301R212L726j64L765j4704j7760j9015l188
10178A66331P944j3247P772K9198L1707M665J2850P504M2186O0257Q8284J28396
10166E73847J59393K46338L20382K49629J26191M3088J5665o7997k09567l41425
10156A115544k83711j73894j39030q8972o2755o6580l8050m1845k3411K07m034
10145A93469K370R44l878k2345j7542N240M872j4475j7368j6687k9232j5816l670
10132F5882J0270q360J369q242J3471N951r771J5901q106n879p109r543M029r196
10118E0667o061q611q444K9823K159q322n450k5028o3m740j2805o327M523J1530
$$ y = [353884, 350656, 348670, 350373, 351911, 322488, 295888, 299478, 282839, 266291, 254333, 248929, 245507, 222624, 218967, 221584, 222831, 219760, 204459, 213671, 217397, 217233, 220998, 206294, 188534, 169519, 166331, 174275, 161028, 168800, 197998, 229705, 234370, 247220, 254724, 296910, 357167, 445451, 573847, 733240, 979578, 1299960, 1549589, 1675780, 1718868, 1734533, 1666536, 1456969, 1115544, 831833, 657939, 518909, 429937, 367182, 300602, 262552, 220707, 197296, 197503, 193469, 195839, 196783, 192905, 170560, 153018, 158258, 163130, 148655, 131287, 114600, 85368, 69552, 65882, 76152, 67792, 69161, 60919, 74390, 80341, 70570, 86471, 78365, 72486, 65377, 55834, 59863, 50667, 44606, 35995, 27551, 57374, 59533, 51211, 45761, 20733, 20670, 15930, 3125, -3202, 1321, 12851]
10104A2851J1681J5126Q641K481j7500k1285q547L194J4685L329j4425p390m55
10091B386J035q852M512Q596j5055L185n938K0411J1128J2760j1339j5363j5221
10078g755n91j0498j412J1963j0964p545J7555J2063L354l342r189K662q943j6292
10064b8934p151K3722j9079r845M383J416n928N662J2446j417L197L306k917q647
10050b9786Q537p082P790K6162J3142m903k0135p953l946J0297J0103l196J434
10037D64M736j5714Q91p762l969J5294K0949L887j0024p415O780j536p40J0883
10023A6724L475j5336k2605Q702j2919r247k089J2804J2106m79j9755L74J5254
10010a2991J1338k3404L029L236k8935L986K2612K6373J6896O269o9r170J919
$$ y = [12851, 24532, 39658, 48299, 50780, 33280, 11995, 3448, 6642, 21327, 24656, 10231, 2841, 2386, 3421, -5431, -919, 7677, -7378, -4193, -10131, 10280, 21408, 34168, 22829, 7466, -7755, -8346, -18844, -20256, -8293, -19257, -26802, -9247, 2816, 6170, 2828, -6361, -3699, -12642, -28934, -36085, -12363, -31442, -41287, -36904, -35488, -41416, -35754, -23308, -24725, -21528, -18222, -21139, -29786, -21249, -28331, -20541, 5621, 18763, 13860, -6275, -14228, -18174, -7877, 2226, -970, 464, 5200, -10514, -9623, -17385, -21354, -6060, 14889, 18776, 8752, 1337, 8117, 6581, 5841, 16724, 20199, 4863, -17742, -9040, -21959, -31206, -33295, -20491, -8385, -8864, -28619, -28245, -12991, -1653, -25057, -22028, -18792, -47727, -43741, -21129, 5244, 22140, 28409, 28340, 19170, 21089]
9997B1089k587o200o173r408n345P6O653o207L032l787j222J403J3830J5056j4867
9982E343p278k495J5516K721J3378p562k4911N93O414L791J7774l068O444j636
9968B5024j8711K523j1516j6267J1614K212o372N307K822L462J2092p11j4355
9955b876k1774J4744K9576j1666q572L302l008J338J2635M121j4428J2698J1193
9942B7283o453k1554J51o874r741j474J3548P621J0324o503Q808R981M300O125
9928C5542j2407j2143j2988k4290j1024j096P580J5381q978m170J5475L024M449
9915e645Q926J5125J3291j8785j6458J0055j0156r388j1086O860K0813K7368q26
9902C0094k609R906q732j5319p350J332j098r278o837J5718N581k947K702J0226
$$ y = [21089, 18502, 12302, 6129, -3279, -8624, -8548, -1895, -8102, -5070, -8857, -10079, -8676, 5154, 20210, 5343, -1935, -4430, 11086, 13807, 27185, 19623, -5288, -4695, 1719, 5510, 23284, 20216, 26660, 25024, 6313, 8836, -2680, -18947, -7333, -5121, -11493, -6186, -3364, 98, 12190, 11479, -2876, -24650, -9906, 19670, 8004, -568, 2734, -274, 1064, 13699, 17820, 3392, 16090, 27283, 20830, -724, -573, -7447, -17188, -18662, -5114, 2507, 12831, 6328, 15136, 25117, 29417, 35542, 23135, 10992, -1996, -26286, -37310, -38406, -30826, -15445, -24423, -28593, -13118, -10094, -5645, 3281, 18406, 31697, 12912, -3546, 6509, -3647, -13035, -24121, -17261, 3552, 30920, 30094, 27485, 37391, 28659, 13340, 5990, 7322, 6224, -3054, -9891, 5827, 11408, 8461, 11163, 21389]
9888B1389L985R044p032j7635K4975L142j1218q623N94j557j0191o79M58M2K241
9873H935j7154P340m786j2613M226P517K190J7477K777O278k976l56p773j618
9859I464o665J491Q145j0099j7111J362L264J4052L254L028k1167j2217K8396
9846E197J8265m061J3567L94l1338k9476j7067J8580L952l300K520J4097J0209
9833A539L708J0079o97J94r541K345J4364N836J0632l993j3696l992l230K396
9819A5944l213O452J2185K0362j3173o545J2352l115j9960j1925N102J0949r39
9806B4476K5308J7020r106P70p85j3089j5822j5352k3534l374J62Q409J5235j4166
9792c848j1221j0P007P050K768k680L328J627J830j3132j1687N669O223m749j3611
$$ y = [21389, 25374, 34418, 27386, 9751, 34726, 37868, 26650, 18027, 18621, 17064, 6873, 6194, 6652, 6694, 8935, -8219, -879, -5665, -18278, -14052, -6535, -4345, 13132, 15909, 22187, 19211, 18855, 11082, 9464, 2799, 4290, 12435, 2336, -14775, -13413, -10149, 3903, 7157, 10185, -10982, -23199, 5197, 23462, 19401, 32968, 33362, 2024, -27452, -44519, -25939, -21987, -25287, -22767, -8670, 1539, 5247, 15326, 14629, 14823, 5282, 7627, 21991, 27827, 38459, 34466, 20770, 16778, 13548, 15944, 12731, 19183, 31368, 51730, 38557, 32012, 44364, 41249, 21289, 9364, 14466, 25415, 24476, 49784, 66804, 57698, 58468, 57683, 44594, 28772, 13420, -10114, -13488, -13326, -4917, 10318, -3848, -15069, -15079, -8072, -1022, 1746, -934, 2394, 4021, 5851, -7281, -18968, -13299, -7076, -11825, -25436]
9777b5436L964j7454N44K1305O542L666N195L210K0703j249j2789R593j9016r198
9763a0420K2319J9662q138q461m101N65R072R048M874K535o762J3545p074l2476
9749D188j6198j986j0944m242J437P213N576J0242j3564J3473q253j5539M904
9736b3693R438K3164J1996r125l770J5j875m711K724Q101N8j7924J589k369j0545
9721a6927O198K427Q990J7856l881j2797n170j6339K7938K0384J1086n609m0607
9708f451m732J372J708J3715L1683j4785n323J8926j3449j8338J4871J8040p237
9695C0000j4298N033N868j7264j8266J2694Q249Q312J0642L354m655r068k8434
9682g833L088J5744J7699o935L630j1060l1N033m388j0278q019k516j903J7719
$$ y = [-25436, -21472, -38926, -38382, -17077, -10535, -6869, -1674, 1536, 22239, 20990, 8201, 17794, -1222, -10420, 11899, 31561, 23423, 14962, 10861, 11426, 20498, 29546, 34420, 36955, 30193, 43738, 36664, 4188, -12010, -13996, -24940, -29182, -27745, -20532, -14956, -4714, -18278, -4805, -13058, -28597, -23693, -14255, 8909, 20905, 11780, 8010, 8025, 6150, 1439, 4163, 12264, 12322, -5602, -4013, -6382, -16927, -10729, -8302, 688, 18544, 14663, 1866, -3304, -19643, 8295, 28679, 39765, 34156, -6451, -11183, -9811, -8103, 5612, 37295, 22510, 17187, 36113, 22664, 4326, 19197, 37237, 30000, 15702, 20735, 26603, 9339, -8927, 3767, 12016, 20328, 30970, 34324, 29669, 20601, -7833, -4745, 10999, 28698, 21763, 25393, 14333, 14302, 19335, 14947, 4669, -3350, -5866, -7769, 9950]
9668I950K3939k3561j5657K489J0442J4055n472J5931R662r093J2884J2500j0780
9655D7289j0726j2005j8643r739Q346K6757p180m597J4684j4697j4973J2496j469
9642A5543J407n059O482O454L318j2245l834J229m567n507K0568J7787k1261k8061
9628g746K222K4969J0438J1327K178P906o035j2034J7124o198p059p95n732J2246
9614D2811R331j7625j2900j1664J1252J2078M170O824O752j3843j5029K665R751
9601C4573q056j3704j4302J1394j983O425j4097p791K825K1353L852m231O754
9588B3012n272m579J1331j3614j045j3324K771K5820K288j3961O332o247l539
9575I973K1533L94o990R29K906j2871q938N535J004l888O581J8474J7170m154
$$ y = [9950, 33889, 10328, -5329, -2840, 7602, 21657, 16185, 32116, 41778, 32685, 45569, 58069, 47289, 36563, 24558, 5915, -3824, 4522, 31279, 24099, 19502, 34186, 19489, 4516, 17012, 15543, 16950, 11891, 18373, 24827, 28145, 15900, 12066, 13295, 8728, 3221, 23789, 41576, 20315, -7746, -5524, 19445, 29883, 41210, 43388, 51294, 45259, 33225, 50349, 44151, 37092, 36297, 30565, 42811, 52142, 34517, 21617, 9953, 21205, 33283, 37453, 44277, 51029, 37186, 22157, 24822, 34573, 26517, 12813, -1489, 9905, 7922, 14347, 250, -7541, -4716, 16637, 20489, 16258, 23012, 17740, 13161, 24492, 10878, 9833, -3491, -720, 25100, 27388, 13427, 19759, 13512, 9973, 31506, 31900, 24910, 25839, 28745, 15874, 6936, 12471, 13475, 9587, 16168, 34642, 51812, 47658]
9561D7658j4233r162P130r631j0315J3414J2108j1488j4159m146N389J2306p474
9548A7397r077j0501J3748l311l0482M9K2037J33j7254L301J5056J4548J7582
9535C3226J6996k116j9119O462J5788L478k0303n382J1196K701k648m210r520
9522B6549J1870O455L859m521o215M353J657K038j0164O939r544m2054J7939J2666
9508B1827l044j1268q23P708J2145N549k779K0037r896k4594q365M84Q616N27
9494A6124J4235J5945j261J5601K0398k7818j792n424j3736j6936P588M861J0296
9481C8081J0322k24L055q994N863r264m88k358q999o067o430m977Q667K3701M282
9466D6170j7612j352K7739j2632m952J239l650q752m493J4466l021M441J352J4390
$$ y = [47658, 33425, 24263, 31393, 21762, 11447, 24861, 36969, 25481, 11322, 7176, 12565, 24871, 17397, 8320, -2181, 11567, 8256, -22226, -22177, -140, -7, -17261, -13960, 1096, 15644, 33226, 50222, 48106, 28987, 35449, 51237, 54715, 34412, 29030, 40226, 42927, 40279, 36069, 26549, 38419, 44874, 48733, 44212, 37997, 42350, 44007, 46045, 35881, 42820, 33276, -8778, 9161, 21827, 18783, 7515, 6692, 14400, 26545, 32094, 29315, 49352, 39456, 14862, 6497, 6981, 15597, 16124, 30359, 46304, 45043, 60644, 81042, 53224, 51432, 46008, 32272, 15336, 22924, 27785, 38081, 48403, 48179, 51234, 42240, 48103, 38839, 38351, 35993, 26994, 20927, 14497, 9520, 18187, 41888, 46170, 28558, 27206, 54945, 42313, 37361, 38600, 34950, 26198, 21705, 36171, 33150, 37591, 38943, 53333]
9452E3333J6203r297k4l625j3445j6067P379K5731j1085j3215J1203P494q825
9439D5760J1107J3409j6214j8343r72m870J941L180j814k883K175r643j3948j2786
9425c901P775J6097K0661p366j9277n636K4884P691K656r633o39R430L571k3631
9411B2682k1123J3783J3986Q875N345N187j7532J0550J4733J2304M640j0456j2777
9398E0197Q578K426k359J8510k861j1398j7886L043N791j8058K11K634R762o375
9384D2215j9298J6599j4673k2738K9137J4964K551n650J0704J4710K3277o105
9372H5693l0748j509j375J3335O271j0044r430R412R636k963Q74J2362j6365j7538
9358D7611L751J0684K041Q63j8772M544J2910P85o176k112N146K787N769J840
$$ y = [53333, 69536, 60239, 60215, 56590, 43145, 27078, 34457, 60188, 49103, 35888, 47091, 54585, 45760, 56867, 70276, 54062, 35719, 34747, 29877, 31818, 34998, 33184, 30301, 32476, 22833, 8885, -3901, 3874, 19971, 40632, 33266, 13989, 8353, 33237, 40928, 43584, 33951, 33312, 42742, 46313, 22682, 1559, 15342, 29328, 38203, 43548, 48735, 31203, 41753, 56486, 68790, 73430, 62974, 50197, 58775, 61201, 58842, 77352, 74491, 63093, 45207, 48250, 54041, 35983, 36194, 38828, 48590, 42215, 22917, 39516, 24843, 2105, 31242, 46206, 48757, 43107, 53811, 68521, 91798, 85693, 54945, 53436, 52061, 65396, 71667, 61623, 52193, 61605, 71241, 68278, 69152, 81514, 65149, 47611, 51362, 62046, 64087, 64950, 46178, 50722, 63632, 64417, 58241, 56129, 61275, 64062, 69831, 71671]
9344G1671k735J568n383j7476J5940K4145O779j8147j3276o679j822R606l192
9331F0999k965o496r95K1802J7959K458j8061j9823Q59r23l264L614l426M364
9317E6102J9678J0573j5702l711L458j1283J6914P766Q333n730k4284j3462J1696
9304F0348l112l626R729J5383R743J4681K1867m464j6925k0094q138l579q131
9291F3682j23p617o24R812K7658K9221j3454o668k2981j890P613J1235j3310K198
9277H4752K1219L457j2293m049j0505L870n333k0247P841J8214P630r149L790
9264H9197R675k836J8749J5428J59q204J5060M203q058n794j748j8172j4270l219
9250I0170j8814n628K2887k81O95J3284J1047k1749N333P785J1456k8240j2818
$$ y = [71671, 68936, 70504, 65121, 47645, 63585, 87730, 94509, 76362, 63086, 56407, 54585, 64191, 60999, 58034, 51538, 50543, 72345, 90304, 92762, 74701, 54878, 55737, 54814, 51550, 55164, 51738, 56102, 75780, 86353, 70651, 66940, 70398, 59115, 76029, 83795, 92128, 86398, 62114, 48652, 60348, 57236, 53610, 63339, 78722, 88465, 103146, 125013, 120549, 103624, 83530, 75392, 71813, 63682, 63559, 55942, 55318, 65130, 92788, 122009, 108555, 101887, 78906, 77016, 84629, 95864, 82554, 84752, 105971, 109428, 97135, 93086, 82581, 86451, 81118, 60871, 68712, 86926, 94556, 85407, 89197, 98872, 96036, 114785, 130213, 130372, 122168, 137228, 141431, 133373, 127579, 125831, 107659, 93389, 90170, 71356, 65728, 88615, 88334, 89029, 102313, 113360, 91611, 96944, 104729, 116185, 87945, 75127]
9237G5127N858R429L07p36J494J4241J8164l160j7565M921Q044p407J566N962
9223A16245j0864J7234N995r439J17J003J1997J6838j0193j7828m325p139J0762
9210A20403k833J6631Q35j2007J911j4828O114K2326M567p145r935K275J2729
9197A41043p181o927R076m556n869k964R176k362O041l08K358q327J8453J6366
9183A64019j256r682k3698j3183J2661J6880L936r186L976J708k577J3449J0783
9170A67830p107J42j1774N11K8898N26m898k8604j9506R397P241L431J1377p507
9156A49957j0862O055K1682J1148j6649j567j4341K561K3503L2379K118n506k1220
9143A79258p18J3509j9116j8185o740l295J1395p68J0039j520P697K0701K994
$$ y = [75127, 80985, 90414, 90721, 89985, 91479, 105720, 123884, 120724, 103159, 108080, 116124, 108717, 110283, 116245, 105381, 122615, 128610, 119171, 119288, 120291, 132288, 149126, 138933, 121105, 116780, 109641, 120403, 117570, 134201, 135036, 123029, 124940, 110112, 116226, 138552, 143119, 135974, 126039, 128314, 141043, 133862, 126935, 136011, 131455, 125586, 122622, 131798, 129436, 135477, 135169, 137527, 129200, 147653, 164019, 162763, 153081, 129383, 116200, 128861, 145741, 149677, 140491, 144467, 146175, 143598, 157047, 167830, 160723, 160865, 149091, 149602, 178500, 179026, 174128, 145524, 126018, 135415, 142656, 146087, 157464, 149957, 139095, 145150, 166832, 177980, 161331, 159764, 145423, 147984, 171487, 203866, 205984, 200478, 179258, 178540, 192049, 172933, 154748, 148008, 144713, 156108, 155340, 165379, 163859, 171556, 192257, 195251]
9130A95251n145P716k427m571J2125p052M654o656l176k1066J274J9276K680R192
9116B02075M160j5823j9717p863p34K905J9650J8159M627J4109J8318P292j3003
9103B34155J610J4405J2863O96k812m011N681Q783J383P741j1327k3846l406J3318
9089B55233N31R893M039m60J9418O756L711J6376l916m434m760J3385M589K939
9075C23300J5333j504j9895J409J9149j162r400k8217j7721K5460J1409r457P446
9062C16150O117N732O132l881Q320L159k2448k370J8807J2230n5J0588Q977K416
9048C69874p172P739j0534l949R766L1415K6267Q815K800j6280j448n36j302j0670
9034D04785j7500O818J7557O975j5796Q981J6239K4652J287K31P3K030P133O028
$$ y = [195251, 190106, 197822, 195395, 190824, 202949, 195897, 200551, 193895, 190719, 169653, 170927, 190203, 192883, 202075, 206235, 190412, 170695, 162832, 162098, 165003, 184653, 202812, 207439, 221548, 239866, 247158, 234155, 235765, 250170, 263033, 263729, 260917, 256906, 262587, 271370, 272753, 280494, 269167, 245321, 241915, 255233, 255764, 265657, 269696, 269236, 288654, 295410, 299121, 315497, 311581, 307147, 302387, 315772, 320361, 323300, 338633, 337129, 317234, 318643, 337792, 336630, 327230, 299013, 281292, 306752, 318161, 308704, 316150, 322267, 327999, 334131, 330250, 338570, 341729, 319281, 316911, 335718, 347948, 347893, 358481, 367458, 369874, 362702, 370441, 359907, 355958, 365724, 397139, 423406, 432221, 435021, 418741, 417293, 416757, 415455, 404785, 387285, 394103, 411660, 418635, 402839, 411820, 428059, 452711, 453998, 454229, 454302, 456332, 463465, 469493]
9020D69493k561j1796n659K644J6271J9086J1842N238K917R357K2036o9N698j3661
9006E30836j0020J8015K88K408R527O478J2878K566m866K0960J5100K0637J3813
8993F38620J048N610O153Q899l577r780J2868J346L467J1459p384M666J1510K7667
8979G12572K1909K4599M041M272N611J8086J7543P071Q758O783J9792L4387O466
8966H91890M582p502J0834J3765K3745J9488J6659K6722L699p327j0164J87M0107
8953A026685L8442J2405Q755L1006J2036M788J0468K2713L345j2430J3845L4460
8941A206518L0285K6806L4202J6044L1625L7403J2582Q684K5214J8296J6827K8444
8929A492930M028L7161L2134J8906K4464K8340L2737K8192K8143K8585J7875M0385
$$ y = [469493, 466932, 455136, 449477, 452121, 468392, 487478, 499320, 504558, 507475, 516832, 538868, 538799, 544497, 530836, 520816, 538831, 539119, 541527, 551054, 557532, 570410, 572976, 568110, 589070, 604170, 624807, 638620, 639668, 645278, 651431, 660330, 656753, 646973, 659841, 661187, 664654, 676113, 668729, 673395, 684905, 712572, 734481, 759080, 763121, 767393, 773004, 791090, 808633, 815704, 824462, 831245, 851037, 885424, 891890, 896472, 888970, 899804, 913569, 937314, 956802, 973461, 1000183, 1003882, 996555, 986391, 986578, 1026685, 1065127, 1077532, 1086287, 1117293, 1129329, 1134117, 1144585, 1167298, 1170643, 1158213, 1172058, 1206518, 1236803, 1263609, 1297811, 1313855, 1345480, 1382883, 1395465, 1404149, 1429363, 1447659, 1464486, 1492930, 1496958, 1534119, 1566253, 1585159, 1609623, 1637963, 1670700, 1698892, 1727035, 1755620, 1773495, 1813880]
8917A813880N2001L7644K7581K6907M3514N0424O2291N0148N3097N5057K5236
8906B297780M8801O0725N4043O3928N9173L8906L9254O6299N2033M3758N6856
8895B881556O2848O0440R5033R4339P5005O9857P5570O8626Q2166J06828Q9566
8884C761834J12901J21881J08812Q6735J03812J16572J45170J20265J14407J23151
8874D915540J30492J57338J82443J53217J57348J49087J71336J65230J73224J83121
8864F538376K19150K06217K13327K31640K17585K22324K50001K66197K74542K91451
8854H930810K88154K59731K77746K82948K89387K88720L11868L31847L14767K98260
8844A1874238K99501L26439L12009K97204K88968L12065L05461K65021K61367
$$ y = [1813880, 1865881, 1903525, 1931106, 1958013, 2001527, 2051951, 2114242, 2164390, 2217487, 2272544, 2297780, 2346581, 2407306, 2461349, 2525277, 2584450, 2623356, 2662610, 2728909, 2780942, 2824700, 2881556, 2944404, 3004844, 3099877, 3194216, 3269221, 3339078, 3414648, 3483274, 3565440, 3672268, 3761834, 3874735, 3996616, 4105428, 4192163, 4295975, 4412547, 4557717, 4677982, 4792389, 4915540, 5046032, 5203370, 5385813, 5539030, 5696378, 5845465, 6016801, 6182031, 6355255, 6538376, 6757526, 6963743, 7177070, 7408710, 7626295, 7848619, 8098620, 8364817, 8639359, 8930810, 9218964, 9478695, 9756441, 10039389, 10328776, 10617496, 10929364, 11261211, 11575978, 11874238, 12173739, 12500178, 12812187, 13109391, 13398359, 13710424, 14015885, 14280906, 14542273]
8835A4542273K32230K22126K11836J79437J64323J30015J08717Q8586N2260K1835
8825A5953638J0680l596m9252r3185j10738j35031j51271j70056j76024j74375
8815A4900790k08722k23613k34766k54615k53366k57814k93413k82321k80040
8806A2612120k78766k87871k93317k77683k86726k56871k39967k49218k68823
8797A0172878k56315k51931k47001k34146k32440k46289k20623k10468k19584
8788H054081k24732k10405k01385j77860j79099j81436j73688j53713j54833j55688
8778F241242j64111j60765j17871j49058j51460j30371j18253j17353j25865j20869
8768D885266r7054j20666j30677j12832j01174j01037r3088j01123q2393p7382
$$ y = [14542273, 14774503, 14996629, 15208465, 15387902, 15552225, 15682240, 15790957, 15879543, 15931803, 15953638, 15964318, 15960722, 15911470, 15818285, 15707547, 15572516, 15421245, 15251189, 15075165, 14900790, 14692068, 14468455, 14233689, 13979074, 13725708, 13467894, 13174481, 12892160, 12612120, 12333354, 12045483, 11752166, 11474483, 11187757, 10930886, 10690919, 10441701, 10172878, 9916563, 9664632, 9417631, 9183485, 8951045, 8704756, 8484133, 8273665, 8054081, 7829349, 7618944, 7417559, 7239699, 7060600, 6879164, 6705476, 6551763, 6396930, 6241242, 6077131, 5916366, 5798495, 5649437, 5497977, 5367606, 5249353, 5132000, 5006135, 4885266, 4788212, 4667546, 4536869, 4424037, 4322863, 4221826, 4128738, 4027615, 3945222, 3867840]
8758C867840p5934p4968o9186p4765p3073p5397o3503p1173p9325o0505o9004
8747C081007o7540p7306q0493o0779o5051m4346m6835n5545o5008l7819k8142
8736B452143l1835p2091m6203n3575m5994o0994n3745k6019l2188n5405n6224
8725A917870j4383k4857l1296l5506m2503m8282k0344r77q843l6043l9658j8183
8713A596995j8557l7113m6330k4229k5262l0167l7912k5529n22l850m0691l7027
8701A269806k0717l3999l6024k0400j6618n049k5613l6946k1709l450m385j0509
8689A034387L881l224l0069l3197q992k8332J529Q710K049n631j5311k5084j9156
8676H81560k7266j3596k785k2447j1188o918k724K772o687l0116l2584o826m902
$$ y = [3867840, 3791906, 3716938, 3647752, 3572987, 3499914, 3424517, 3361014, 3289841, 3210516, 3150011, 3081007, 3013467, 2936161, 2855668, 2794889, 2729838, 2685492, 2638657, 2583112, 2518104, 2480285, 2452143, 2420308, 2348217, 2302014, 2248439, 2202445, 2141451, 2087706, 2061687, 2029499, 1974094, 1917870, 1903487, 1878630, 1847334, 1811828, 1769325, 1721043, 1700699, 1699722, 1690879, 1654836, 1615178, 1596995, 1578438, 1541325, 1494995, 1470766, 1445504, 1415337, 1377425, 1351896, 1351374, 1347524, 1306833, 1269806, 1249089, 1215090, 1179066, 1158666, 1142048, 1136999, 1111386, 1074440, 1052731, 1049281, 1044896, 1034387, 1038268, 1035044, 1004975, 971778, 962786, 934454, 935983, 944693, 946742, 941111, 925800, 900716, 881560, 854294, 840698, 837913, 815466, 804278, 797360, 794636, 797408, 790721, 760605, 728021, 721195, 716293]
8663G16293j0314q500J535j939p439j1591j2044N6N561j2504r882k4700j9607
8650F04925q293p514j0242M997P836o036j1739p960R932P299j3986k0342n401
8637E43476K1885M570O672O012j7810j3860k3422j4850j0066p597R003R504n53
8624E12964j0507O100O477k5216L743m138o725k3289k6576N753O551j1358R300
8611D43079p36k030R891j7487l3365q229m934j4774j0653K7307j456J010l783
8598C83840n88m037j6557o590n042o580J547K455k599m009M907j3467J127m717
8584C29690L971n992j0790o942j223J252q568J853J6613M249l8118k4324m918
8571B56753J5481K5465j1029k4671j9235O81J168J5276R11l503j1380K0435M6330
$$ y = [716293, 705979, 697479, 699014, 697075, 689636, 678045, 666001, 666057, 671618, 659114, 649232, 624532, 604925, 596632, 589118, 578876, 583873, 591709, 585673, 573934, 565974, 575906, 583205, 569219, 548877, 543476, 565361, 569931, 576603, 582615, 564805, 550945, 527523, 512673, 502607, 495010, 504013, 513517, 512964, 502457, 508557, 515034, 489818, 493561, 489423, 482698, 459409, 432833, 438586, 445137, 433779, 443079, 442343, 440313, 450204, 432717, 399352, 391123, 386189, 371415, 360762, 388069, 386613, 387623, 383840, 383252, 379215, 362658, 356068, 351026, 344446, 345993, 348448, 345849, 341840, 346747, 333280, 334407, 329690, 333661, 327669, 316879, 309937, 308714, 309966, 301398, 303251, 319864, 324113, 285995, 261671, 256753, 272234, 297699, 286670, 261999, 242764, 243445, 244613, 259889, 260800, 257297, 245917, 266352, 312682]
8558C12682J396k0014l1043j2842J2403j1241j3903L875J8759J1093k731J2898
8546B81332j210k6554l4033j6924M966O076l629k4667J7386m9j8556P184R840
8533B01162q829J56N09P271n487K55L956q624m393L409o882l159o303o10j490
8518A70941j682J2499J5499J385n798j793j6166J0925J3540N027j0409k3412j916
8505A68640j5730K177R022J3872o240k1914q683k135J6432R348j0541J8851Q543
8492A81642j1128j5189r770j2671j0059q738j3050R742K0337J6367P838J526R440
8479A66287k1163j7429M270r728j270q205J6358J0421J335K033o664N252o208
8466A35289J826O157N459j5068k1562L724n990j9901J839K4202R147j93J2546
$$ y = [312682, 314078, 294064, 263021, 250179, 262582, 251341, 237438, 241313, 260072, 271165, 268434, 281332, 280122, 253568, 219535, 202611, 207577, 213653, 210024, 185357, 202743, 202694, 184138, 191322, 201162, 192333, 192489, 192998, 200269, 194782, 195037, 198993, 190369, 185976, 189385, 182503, 179344, 173041, 172431, 170941, 169259, 181758, 197257, 198642, 192844, 191051, 174885, 185810, 199350, 204377, 193968, 170556, 168640, 152910, 155087, 164109, 177981, 171741, 149827, 141144, 139009, 155441, 164789, 154248, 173099, 181642, 170514, 155325, 145555, 132884, 122825, 114087, 101037, 110779, 131116, 147483, 155321, 156847, 166287, 145124, 127695, 131965, 122237, 120967, 112762, 129120, 139541, 140876, 142909, 136245, 141497, 135289, 137115, 143272, 148731, 133663, 112101, 115825, 109835, 89934, 91773, 115975, 125122, 124929, 137475]
8453A37475j117l678k8639P648J2112o962p124L053j8707j745L703O439M793j544
8439A05707k328O332l942m522m932J0184n619j1356j1654N829J7731K4410r84
8426A24856p395j5609q570O096J2911l93j1742l4594M367J8579J5359n273K834
8413A01426L23l580J736j3299l451J046n234q443l71J7406M407p561j7429N992
8399G2968l030o341q698M199K980j6766J5594J0030j207J3849L910k533m355M310
8385H4910k787J0617O287n5j0817j2745j7041K248O114j2923m631P350l117j6354
8371C7056j7043K257J8020P460J2293j4893l635J1135R781J545P63J6616N658
8358H7013m440j0522j2173j836P181j569r620Q875J1323k066j1385j7681k1245
$$ y = [137475, 136358, 132680, 104041, 111689, 123801, 116839, 109715, 112768, 94061, 92316, 96019, 102458, 107251, 105707, 103379, 109711, 105769, 101247, 96315, 106499, 100880, 89524, 77870, 83699, 101430, 125840, 124856, 117461, 101852, 93282, 99378, 112289, 111896, 100154, 65560, 69927, 88506, 103865, 98592, 101426, 101749, 98169, 99905, 86606, 83155, 84201, 78967, 70524, 70153, 87559, 91966, 84405, 66976, 72968, 69938, 63597, 54899, 59098, 62078, 45312, 60906, 70936, 69729, 83578, 87488, 84955, 80600, 84910, 82123, 92740, 99027, 98972, 88155, 75410, 58369, 60617, 66731, 53808, 49177, 56527, 53410, 37056, 20013, 22270, 40290, 47750, 60043, 45150, 41515, 52650, 62431, 63976, 64739, 81355, 87013, 82573, 72051, 59878, 58042, 65223, 63654, 54034, 62909, 74232, 72166, 60781, 43100, 21855]
8345B1855J1318L9237J2901n56j2431j8229M239R995P074J0279j9243k8205n527
8332C2707J7746j605L895L237n108n931n548K054O800R15M076r375J922J1911
8318E7696J3927j4990j2756O497O861J507O282o936L889j0231o8P332j8910j8224
8304B1876N052J5565l213j4362n822n456J2204J4928j363J0913q894N97q220J9641
8290E3446n385k4542M277J2629j1955J27J205L491O418J4727j978l815N906Q135
8276F2686J504j067j1710j9101N132J1316j382q349j5419N061p45m521n158o750
8262A1497J8320M312o728M021n991q454j1700J1747L1545K8289j4396k6814r301
8249B6347J526Q424p040k689J0697n734q417J0412J163Q819p388Q899j8820l6124
$$ y = [21855, 33173, 72410, 85311, 84755, 72324, 54095, 58334, 68329, 75403, 85682, 66439, 38234, 32707, 50453, 48848, 52743, 55980, 50872, 44941, 39393, 41447, 48247, 49162, 53238, 43863, 45785, 57696, 71623, 56633, 43877, 50374, 57235, 58742, 65024, 58088, 61977, 51746, 51678, 59010, 40100, 21876, 26928, 42493, 39280, 24918, 19096, 13640, 25844, 40772, 39409, 50322, 41428, 42025, 33805, 53446, 48061, 23519, 27796, 40425, 28470, 28597, 29802, 33293, 39711, 54438, 52460, 48645, 54551, 62686, 64190, 63123, 51413, 32312, 37444, 48760, 47378, 39029, 23610, 28671, 27926, 23405, 18247, 11497, 29817, 34129, 27401, 31422, 25431, 16977, 5277, 17024, 48569, 76858, 62462, 35648, 26347, 27873, 36297, 29257, 26568, 37265, 31531, 23114, 33526, 34689, 43508, 36120, 45019, 26199, -9925]
8235i925p435J4513Q513O488J707o900p148L645J4298Q862L826N512k780M178
8221C7354j1934l4992R962L2374L95J898K206N205Q91J1458M38m550K706k208
8207E1203p10n241M364J6554J2434j9230k2000j3745l24o381p258J8166K0179
8194D8011M568J6138P380M689j7126l3619k810J0651N5L556p446n799L332j4317
8180A7263k004K0779R409j9806j8627Q471J1268J255M327J442K1546q323j9064
8167B7936J1110P857Q036j6233m747J9573O614j9527J4124J5609j3555k4274r399
8154B3124K208J3547J7272K775M21j1042k1865j2912K2272J0777n383R828j991
8141D9031l4497R539J6064r326q218K175n82k0314L355P720J2341K5093p85j1208
$$ y = [-9925, -17360, -2847, 5666, 12154, 13861, 6961, -187, 3458, 17756, 26618, 30444, 35956, 33176, 37354, 25420, -9572, 390, 32764, 33159, 35057, 37263, 42468, 43359, 54817, 55255, 50705, 53411, 51203, 50493, 45252, 49616, 66170, 78604, 59374, 37374, 23629, 23305, 16924, 9666, 27832, 48011, 52579, 68717, 76097, 80786, 63660, 30041, 27231, 37882, 37937, 41493, 34047, 28248, 31580, 17263, 15259, 36038, 45447, 25641, 7014, 15485, 26753, 28008, 32335, 33777, 55323, 47000, 27936, 39046, 46903, 54939, 38706, 33959, 53532, 60146, 40619, 54743, 70352, 56797, 32523, 23124, 25332, 38879, 56151, 58926, 59347, 48305, 26440, 13528, 35800, 46577, 41194, 51022, 49031, 14534, 24073, 40137, 30811, 22593, 24768, 24186, 3872, 7227, 14947, 27288, 52381, 51596, 40388]
8127D0388o913J6437j2685j0151L124J4736J1959j0490j9516N372m898M44L729
8114C1536J8539j0738r806J4494J090j7810j0472J4696L1985k312k8597k0623
8102A1982j5978m552j0757J0733J4524J7872q610q820N480j5226r53K517O686
8089D898k811J9807J4094K270O984M495k0080N205L064n177J29k14P831l1807
8075H688l411J6411R497q258O572J1728l602o87J0509m012j2328j3508P726P279
8061C2604o318j4486L968K3840L908k1831j5061K0815K1361k057j2626L700j0136
8048B7681M050N078j001j0194N267Q093j6021L248J7641k41j0405q416M483J9548
8034D8811l2763j3277P106q58J9362J4175m242q826j0667J2114Q795K765J4017
$$ y = [40388, 33475, 49912, 37227, 27076, 30200, 44936, 56895, 46405, 26889, 32261, 27363, 27807, 31536, 50075, 39337, 29531, 44025, 45115, 27305, 16833, 31529, 63514, 61202, 32605, 11982, -3996, -8548, -19305, -8572, 5952, 23824, 15214, 6394, 11874, -3352, -4305, -1788, 4898, 2087, 21894, 35988, 38258, 45242, 49737, 29657, 34862, 37926, 32749, 32878, 32664, 40495, 8688, 5277, 21688, 31185, 22927, 29499, 41227, 37625, 36938, 47447, 43435, 31107, 17599, 25325, 32604, 26286, 11800, 15768, 39608, 43516, 21685, 6624, 27439, 48800, 46743, 34117, 37817, 27681, 31731, 36809, 35808, 25614, 30881, 38974, 22953, 26201, 43842, 43601, 33196, 24780, 29263, 48811, 16048, 2771, 9877, 9019, 28381, 42556, 38314, 29488, 18821, 30935, 39730, 42495, 56512]
8021E6512j9974q571J598q740M042l348m392m807j5122M703Q554J548P474p604
8007A1873q040J6506J0303P560k586j1499j5313j2449Q935L7493M095j4271J1633
7994D4240O387L969q154j1872m245j4219j775J4902J2804J7621K8688k55p766
7981H0325k4557P422K723k0415j3082j4689k671p864K143L091j0770p174J6817
7968A1299K3594K764r907o305M360m485q796j94R943q584K322r896l20J5701L1350
7953E2846J6529K133J506n820j4890k0317n696o267O821j0404J0151l558K0316
7940D3350O999j1030n434j839O074o72J889r281K886R58k5822l646K4943j1675
7926A7700n972J9248Q43k0035N165L585O271j3533m129j283j9131j4943K4827
$$ y = [56512, 36538, 27967, 29565, 20825, 24867, 21519, 17127, 12320, -2802, 1901, 10455, 12003, 19477, 11873, 3833, 20339, 30642, 38202, 35616, 24117, 8804, -3645, 5290, 42783, 46878, 32607, 44240, 50627, 54596, 46442, 34570, 30325, 16106, 14331, 29233, 42037, 59658, 88346, 88091, 80325, 55768, 63190, 65913, 45498, 32416, 17727, 15056, 7192, 9335, 12426, 1656, -5518, 11299, 34893, 37657, 27750, 21445, 25805, 21320, 12524, 12330, 22273, 13689, 16011, 6115, 5795, 21496, 52846, 69375, 71508, 73014, 67194, 52304, 31987, 26291, 20024, 26845, 16441, 26592, 23034, 43350, 50349, 39319, 33885, 32046, 38120, 37448, 39337, 30056, 32942, 33900, 8078, 4432, 29375, 17700, 11728, 30976, 31819, 11784, 16949, 20534, 26805, 13272, 9143, 7860, -11271, -26214, -1387]
7913a387L2728O312j9341j1667j2797P737N443L1953O910l5242o142J558J6738
7900B2803P0k279J863m599r293j3959L243K419N410J1804k124o409j949J4180
7886B1180j995Q020Q55m058Q952p436k2356k8659M149L891j0819m451K2455P660
7872b612j4710l271J1854m561J05R651O449N694J5676k456j0540R918K4609j657
7858D4149k4061r792l031o242J9838J53j2000n863j0222k0163J753M2l401P760
7844b1080J0262K7888R437k958k3605P4J2395K356j2602j0455O855R613n843P315
7830I652l131J3097p258j9265n067Q070J8065J893j2389k0128K664K1235rO997
7816A4426Q339r083n808j0723Q821J4692o018J94l028j533J0157r268P364k369
$$ y = [-1387, 31341, 37653, 18312, 6645, -6152, 1585, 7028, 38981, 45891, 10649, 4507, 6065, 22803, 22873, 20594, 22457, 17858, 8565, -5394, -2151, 268, 5678, 17482, 15358, 8949, 7000, 21180, 19185, 27205, 28060, 24002, 32954, 25518, 3162, -25497, -21348, -17457, -28276, -32727, -10272, -2612, -17322, -20593, -8739, -13300, -13195, -3544, 2905, 8599, 24275, 21819, 11279, 21197, 45806, 44149, 20088, 10296, 7265, 1023, 20861, 21014, 9014, 3151, -7071, -27234, -25481, -25439, -28840, -21080, -10818, 17070, 26507, 23549, -56, 18, 12413, 14769, 2167, -8288, -1433, 8180, 2337, 9652, 6521, 19618, 12360, -6905, -11972, -3902, 14163, 16056, 3667, -16461, -13797, 7438, 7429, 14426, 22765, 13682, 7874, -2849, 5972, 20664, 14646, 14840, 11812, 10279, 20436, 11168, 18532, 16163]
7802A6163k756j920M29J1982L800j0327j0406j0339k71j373j0788j0022J458R745
7788a4625J7841J4258K0970N722p994m824j2053r835J4896L012j8244k19J003
7775I908O419R579j0598p800P856K0452L651n201k3864j3223P795N61j5742K1115
7761A0908j212R90P103j3708p039q474J95j151J1475M037j300k213l001k2352
7747b5742J332O683j5243P050J0921J5635M773J769j5541L950M364j447p896p921
7733a7313J6946J3003M968j457m80n793n643m039M736q9N613j7497N030J2670
7719A0655M968L711j1780j5852J2515K206j810J382j4566k7233p944J9583K1934
7706b231J1550k0799N766p741O895J832j783K3129n418k8893n671K0025L234M18
$$ y = [16163, 13407, 11487, 11916, 23898, 27698, 17371, 6965, -3374, -3645, -5018, -15806, -25828, -24370, -14625, 3216, 17474, 38444, 44166, 36172, 31348, 19295, 9460, 24356, 27368, 9124, 8905, 9908, 16327, 25906, 15308, 7508, 15364, 35816, 39467, 34266, 10402, -2821, 4974, 5535, -10207, 10908, 9696, 10686, 17789, 4081, -2958, -11432, -11237, -12388, -913, 3124, 1824, -389, -3390, -25742, -24410, -17727, -32970, -25920, -14999, 636, 5409, 7178, -8363, -4413, -49, -1496, -9392, -17313, -367, 12636, 17604, 16147, 15667, 9874, 4231, 192, 4928, 4839, 10452, -7045, -2015, 10655, 15623, 19334, 7554, -8298, 4217, 6423, 4613, 5995, -8571, -35804, -43748, -24165, -2231, 9319, -11480, -5714, -13455, -6560, -4728, -6511, 16618, 11200, -17693, -23364, -3339, -105, 313]
7692C13O441J1461M322k1307k358J3392J6505K547j2126r833L041m033j6294j2875
7678b0804j2860L272K2507J3472j7842o450M217J5446N328r454k4911j6521O667
7665c7933N3Q695L0677k677r151p568R086j517J0153J4815O076N54L963j8917
7651F309k2227J1869K283M026O153J3825o602j7501K747Q624o9P852J1566M041
7637C2896j7965M04K25j2704l981J8538m596j9908o948J932J5661q882j9421j3662
7623c8411k99J7942O617j351Q937l124O147k47K261J823P796r127l132j5098K201
7608a7065J5420j654R959R947k073R135j1867J783M441j1052j2277O160R950L317
7594A4124j2826Q653n884r932J7997N329N514K1465o527j9329r549l896k483J0266
$$ y = [313, 6754, 18215, 22537, 1230, -1128, 12264, 28769, 31316, 19190, 9357, 12398, 8365, -7929, -20804, -33664, -30392, -7885, 5587, -12255, -18705, -14488, 958, 6286, -3168, -28079, -44600, -37933, -37880, -29185, 1492, -1185, -10336, -17904, -8818, -10335, -182, 14633, 20709, 21263, 25226, 6309, -15918, -4049, -1766, 2260, 8413, 22238, 15636, -1865, 882, 9506, 9437, 17289, 28855, 32896, 14931, 15335, 15560, 2856, -1125, 17413, 12817, -7091, -14039, -12107, 3554, -5328, -24749, -38411, -38710, -20768, -14151, -15502, -6565, -9689, -3542, -3789, -1528, 295, 8091, -1036, -4168, -19266, -17065, -1645, -3299, 6660, 16607, 14534, 23669, 11802, 13585, 18026, 6974, -5303, 857, 10807, 14124, 1298, 9951, 4067, -5865, 12132, 17461, 22975, 44440, 37913, 18584, 9035, 5139, 2656, 12922]
7580A2922J250m619r956J8265K271r393O825M422j979j3164j0296M195P13k738
7566a282j241J762p692k778j2606J6349L09N618Q303k1704l408J7127L455r92
7552A220m717j3282p575N879J6661J2713K1048P747J709j6155m769r642j422o476
7538B939j0365J141R028r294n588M265m541j0605o475P765N787P716r109N856
7524a1480J3027J2769n416k3143j3779R421L346j864j18J6707J523m448o861J36
7510a0180K348J5837K968O957J534k0623o462L601K7355K347l644j5640k2471
7497a6073j4824M552K4041J9871p807Q603n566m452l148j1898L058M353J018N925
7483G653j1925K885K266j6056J1331K0764n05p830j4733L423J3150N645j5860
$$ y = [12922, 14172, 9553, -403, 17862, 20133, 10740, 17565, 21987, 20008, 6844, -3452, 743, 1456, -1282, -2523, -761, -8453, -11231, -23837, -7488, -7179, -1561, 6742, -14962, -18370, -1243, 2212, 1220, -3497, -16779, -24354, -18475, -1814, 10899, 31947, 39694, 41403, 25248, 20479, 10837, 9415, 2939, -7426, -6285, 2743, -6551, -12139, -7874, -12415, -23020, -29495, -21730, -15943, -8227, -17336, -11480, 1547, 14316, 8900, -14243, -28022, -18601, -15255, -17119, -17237, -530, 993, -3455, -10316, -10180, -7832, 8005, 10973, 17930, 19464, -1159, -7621, -4020, 23335, 25682, 22038, 6398, -16073, -30897, -26345, -2304, 17567, 9760, 18363, 12797, 8345, 5197, -6701, -3643, 710, 1728, 7653, -4272, -1387, 879, -15177, -3846, 16918, 16413, 8583, -6150, -2727, 10423, 16068, 208]
7470B08q569K453o994K6799J8888j8549k5703k677K518J6827l990p675k490Q62
7456h092K0094K803j8602n464q87o576j7453J3147J3257k889L681J502J4122j692
7442F951q235j3395j866J4096j2483j1540J592J9730n326j0882M41J6761j4065
7429a8221j840J9457J4092J0699L035O40J972J0564j3184j6221j0238L649J9846
7416B4250n518j5450l2146Q562K2133q427j650j1448K1661p7j4171Q788J60j7048
7402b0381j1827j2037J3409M3916l555o34l401o965n61K715K3730J0762l356j0597
7388B1218J1887J0546q611o287q260m137k1627O62R148J4979k1166j6762J6490
7375a920J4179K353p711P495J698r605J5214q053r878j2223J71L042n04m705M87
$$ y = [208, -8361, -5908, -12902, 13897, 32785, 14236, -11467, -14144, -11626, 5201, 1211, -6464, -8954, -8092, 12002, 14805, -3797, -9261, -10148, -16724, -34177, -21030, -7773, -10662, -6981, -5479, 8643, 6951, -1284, -14679, -16545, -2449, -14932, -26472, -24880, -5150, -10476, -21358, -20917, -4156, -18221, -20061, -604, 13488, 24187, 27222, 27862, 29834, 40398, 27214, 10993, 755, 4404, 24250, 18732, 3282, -28864, -20302, 1831, -6596, -8246, -19694, 1967, 1890, -12281, -3493, -3333, -20381, -32208, -44245, -30836, 13080, 9525, 8891, 5490, -1475, -2036, 679, 24409, 35171, 31815, 21218, 33105, 43651, 35040, 28753, 20493, 16356, -5271, -4609, 4539, 19518, -1648, -18410, -1920, 12259, 14612, 6901, 14396, 16094, 6489, 21703, 13650, 3772, -8451, -8280, -5238, -5742, -10447, -9960]
7360i960J300m325K1434J0540j880j8251L789P759k0304j7449O920R816p90J7441
7346F040k98J0621r209p602p277m203o363l31J1739O158p406J5971J4232L796
7332B5868k2654R97J1209o959j7952j1835P519N245k3602k798K2022L7932j486
7319B3506j3497r710l940j099q322K810L304J1258K2162j1555j8775J7514Q980
7306B2636J7569l742l1431k1134M109O244J0936k3996O022N907j4823n020J915
7293b4808J2792J0335j8459j9827J2654l912m476R885n550O349l14m185N91K3015
7279e910K927j9667j374J1896J7942n162j822L701j2333R08J2035K6222o875k4195
7265a707j7587p84N591J5430K7136M478n50j7624j505j0105r82n245j9951l995
$$ y = [-9960, -8660, -12985, 8449, 18989, 17109, -1142, 2647, 10406, -9898, -27347, -20427, -10611, -11401, 6040, 5742, 16363, 7154, -448, -7725, -11928, -18291, -18622, -6883, -725, -8131, 7840, 22072, 25868, 3214, 4211, 15420, 8461, -9491, -21326, -13807, -8562, -32164, -34962, -12940, 24992, 23506, 10009, 299, -3641, -4740, -13062, -10252, -6948, 4310, 26472, 14917, -3858, 13656, 22636, 40205, 36463, 5032, -16102, -11993, -5749, 5187, -18809, -12787, -6880, -21703, -26723, -24808, -12016, -1681, -20140, -39967, -27313, -31225, -35701, -25816, -31366, -25017, -25331, -29516, -28925, -5910, -2983, -22650, -24024, -12128, 5814, 652, -1170, 2531, -9802, -8894, 3141, 29363, 22488, -1707, -19294, -20078, -14487, 943, 28079, 32557, 32007, 14383, 12878, 2773, 1791, -3454, -23405, -27400]
7251b7400O773J2874J6793j4820m397J5156j6589j6092j0798J603N638J3845o00
7238a8014N680K2864K044p13n016o447r363q681J0455P053k2417N070k92p838
7224b5615N845J2495l705j5392j3773Q11N81P87M679K2769J1478L665j2737j4821
7210b2933K0027P236N826PJ1611K606j2124o14P334J3542r970q373j4540J915
7196A550M126J687Q280j850p335j3436q538j287p544j2501k393K2256J1331O055
7182D01r275N547M498q945M339P578r786p481Q170R009J5814M014k3695j890J3385
7167A1683K1217J0605j1270j8434j1098O232j1266o512p874J2692m421j5588J6981
7154g053M693k7589r955K0474n238j7640K263K9690J2767l422j466J0684k4612
$$ y = [-27400, -20627, -7753, 9040, -5780, -10177, 4979, -11610, -27702, -38500, -36897, -31259, -17414, -18014, -12334, 10530, 12574, 11861, 6845, 398, -8965, -17646, -7191, -138, -22555, -17485, -17777, -25615, -19770, -7275, -10980, -26372, -40145, -39334, -38753, -37966, -33287, -10518, 960, 4625, -8112, -22933, -2906, 4330, 10156, 10163, 21774, 24380, 12256, 11642, 18976, 32518, 22548, 14175, -365, 1550, 5676, 7363, 15643, 13793, 6458, -6978, -15516, -16803, -24347, -36848, -39241, -16985, -5654, 401, -8874, -3327, 1171, -7774, -3435, 4143, -5643, -13124, -4954, 4055, 19869, 23883, 188, -1702, 11683, 32900, 43505, 32235, 13801, 2703, 8935, -2331, -8843, -16717, -4025, -8446, -24034, -7053, -2360, -29949, -39904, -19430, -24668, -42308, -40045, -10355, 2412, -1010, -2476, 8208, -16404]
7141a6404j5928L074o695l068K3322J2486o358m909l002j2740M329j0403J5012
7128b1284K8145l183j4715k7521N702J2284o642L174K0467N089J50J6613J362
7115A9641p246K432l344j5684K293l955n33K562J5703o635n489J8936J990j1292
7101I379j8690j405q50l828J3668j0067l799K1252N536j710m867j2940q974J720
7087a5575K9871P922j8339n609q171k5201M326%j0988R73P757J1960L024k352
7073b0402L3230P926m847k1456m339k872k765J2999O939r489k428J3981M807o57
7059A0627j7807o951j4118Q529R397J1424L085j0808J0678o179j2492J3233m384
7046e766q135k0091k794R684N856J2899j466N828J1180J4202K1683m824k731j0155
$$ y = [-16404, -32332, -29258, -35953, -39021, -15699, -3213, -9571, -14480, -17482, -30222, -25893, -36296, -21284, 6861, 3678, -11037, -38558, -32856, -20572, -27214, -24040, -3573, 1516, 1666, 18279, 19641, 12395, 14827, 11483, -4201, -1908, -5863, -6396, -3834, 11869, 5234, -255, 18681, 20671, 9379, -9311, -10716, -11566, -15394, -1726, -11793, -15592, 5660, 11196, 9486, 4619, -8321, -17295, -15575, 14296, 22218, 3879, -1730, -9901, -35102, -30776, -30776, -41764, -40791, -33034, -21074, -18050, -20402, 12828, 20754, 15907, -5549, -9888, -12760, -15525, -2526, 4413, -5076, -7504, 6477, 11284, 10627, -7180, -14131, -28249, -19720, -10323, 1101, 4186, -6622, 4056, -2123, -14615, -1382, -5766, -13901, -33992, -36786, -27102, -21246, -8347, -9813, -3985, 7195, 21397, 43080, 38256, 35525, 25370]
7032B5370k0287O681k949K453Q835k394k7295j4546J1003m096p959O069j6757
7019c5872p982J9041J0801J2668L320n045j1084P51J3742J0721J3016R644j0029
7006B3692q918R66L744l234k061k714K522k2074j4638Q514Q389J0835P321n447
6992F897p356p150M430j0749j3783q719K2303J4677J7823O315K354k1030j8585
6979a2573q675O407J170P844J4306k784n568j1713q569K571o213Q547J9462k539
6965A673l600j70p473K872l421M694O711M63R958o721j0335N793m3j6244L478
6950a2365Q438o735j0505R599J6553M440J583p852m020R348k50k2155L514O490
6936c917J5307n425m504J2447R534j356J5973j8061o065j4851j3262K017M716
$$ y = [25370, 5083, 11764, 8815, 11268, 20103, 17709, -9586, -24132, -13129, -17225, -25184, -19115, -35872, -43854, -24813, -14012, -1344, 1976, -3069, -14153, -13402, 340, 11061, 24077, 33721, 23692, 14774, 15740, 19484, 16250, 14189, 11475, 13997, -8077, -22715, -14201, -5812, 5023, 12344, 6897, -459, -7609, -3179, -13928, -27711, -36430, -14127, 550, 18373, 24688, 27042, 6012, -12573, -21248, -14841, -13671, -5827, 8479, 5695, 127, -11586, -20155, -17584, -23797, -15250, 4212, 1673, -1927, -2097, -9570, -6698, -10119, -5425, 1286, 1749, 11707, 4986, -5349, 444, 401, -15843, -12365, -3927, -10662, -21167, -11568, 4985, 9425, 11008, 3156, -864, 8484, 8234, -13921, -10407, -3917, 11390, 5965, 1461, 13908, 23442, 22086, 38059, 19998, 13933, -918, -14180, -12163, -7447]
6923g447M354L700j1135k9529n349K3599J3103J0333k645J9750J172q281K1808
6910C3433k0709k0078J3022R3j618o64r730J1966Q661J7581O847r155k6269k0301
6896a6921l8043N771K6240M830J00J653q515j6504K297J0316R203j94K854K9924
6882A3011R153j0991l5471o451Q356r546J1190K1120R647k0879k3222l378K228
6869c5233J2346J786k85j956N002J4982M980M7R333J6620j081L043m752k7983
6855c151j5410J606K1196J3110m65l421k5822j4135N032J1410J1213p167l906
6842i910K1288n739r534r264j2140o723k876q20K2014J0825J426j6869K494j0748
6828b6576K1248L560k082j1459r090J1577J6928p697j7105q386K142r055L513
$$ y = [-7447, -3093, 607, -10528, -40057, -45406, -21807, -8704, 1629, -1016, 18734, 19906, 11625, 33433, 12724, -7354, 5668, 5761, 4143, 3479, -6251, 5715, 14376, 31957, 38804, 29649, 3380, -16921, -54964, -49193, -22953, -18123, -18023, -16370, -24885, -41389, -39092, -28776, -19573, -19767, -16913, 13011, 22164, 11173, -24298, -30749, -22393, -31939, -20749, 371, 10018, -10861, -34083, -37461, -35233, -22887, -21101, -21386, -23342, -18340, -3358, 1622, 1669, 11002, 27622, 26541, 29584, 24832, -3151, -18561, -16955, 4241, 17351, 16886, 13465, -12357, -26492, -21460, -10050, 1163, -6004, -9910, 11378, 5639, -3895, -13159, -25299, -32022, -34898, -35718, -13704, -2879, -1453, -18322, -15828, -26576, -5328, -1768, -3850, -15309, -24399, -12822, 4106, -3591, -20696, -29082, -26940, -35995, -32482]
6815c2482J8117R06Q775L650J7019M058p210m770O012m216M432K201L660P344
6801B7496R526R411q412j5142j1810k0906j3448o76Q756J7896J5182k824P073
6788B2122M276r296j250j590j6610r581P580J8401M552K872n793k1637m254j940
6774a2148k838Q381K385p248J9616K929k2185j7933J1394K4246j145q211j1568
6761a4325P549j890o94J6558n47p514j8157k548q077J8783J6436M765J768R959
6747B2066k417N758j7660o891o27J610j4544j0218p013J3255j3397k2828L27J3701
6733c8878P317P449L3727J4908k0983r915J5753r956k153j1390O847r400j0246
6720b6920j1129J3801J9957k717o508m686N396M949K733n102m993K0061J3903
$$ y = [-32482, -14365, -13459, -4684, -1034, 15985, 20043, 12833, 8063, 14075, 9859, 14291, 16492, 20152, 27496, 37022, 46433, 38021, 22879, 11069, -9837, -23285, -23961, -15205, 2691, 17873, 15049, 22122, 26398, 17102, 15852, 14262, -2348, -11929, -4349, 14052, 18604, 21476, 15683, -5954, -10208, -12148, -14986, -6605, -4220, -11468, 8148, 11077, -11108, -29041, -17647, 6599, 5454, -2757, -14325, -6776, -8666, -9360, 7198, 6651, -863, -19020, -21568, -29645, -10862, 5574, 10339, 12107, 22066, 19649, 25407, 7747, 856, 229, 1839, -12705, -22923, -29936, -16681, -30078, -52906, -52579, -38878, -31561, -24112, 9615, 24523, 3540, -6375, 9378, -578, -2731, -14121, -7274, -16674, -26920, -38049, -24248, -4291, -7008, -13516, -18202, -12806, -7857, -5124, -10226, -15219, 4842, 18745]
6707A8745J9451j3479j1164J0114p498j0480O98R514J1067n605o256l544n804
6694E759j3592j698K83j1457j8528M582J7580J4132J0068J3693j2432l21j5471
6681g402l6140K0463Q509N883J5304j216r39J1849l994m663j1036L169p009J096
6667f126J9824Q716p775k748k827rn728j4442j1846o765J1300k059L864J0556
6653f065N108Q586j0447j267k658k3890p990J3638K39L906j408J4704P849K358
6639B663J2748j1239j2293L46J6432R084j2728j1402j2216l266L8497J0213j2410
6626A4429j9148j9323M717k546P767k397J3861J849q66j2286P470J5425P088p344
6612H696Q980o034l332M976n606j878k5376k3998L096J1528N981j1200j704J7453
$$ y = [18745, 38196, 24717, 13553, 23667, 16169, 5689, 6387, 15901, 26968, 21363, 15107, 11563, 5759, -7833, -9531, -9248, -20705, -39233, -34651, -17071, -2939, 7129, 20822, 8390, 8069, -7402, -43542, -23079, -14570, -8687, 6617, 5401, 4462, 16311, 12317, 7654, -3382, -213, -7222, -6126, 13698, 22414, 14639, 11891, 9064, 9055, 3327, -11115, -22961, -29726, -18426, -20485, -16621, -6065, -957, 7629, -2818, -4085, -6743, -30633, -38623, -24985, -24746, -20840, -22248, -7544, 305, 2663, 15411, 4172, -8121, -7775, 8657, 17741, 5013, -6389, -18605, -21871, 16626, 26839, 14429, -4719, -24042, -19325, -21871, -14104, -16501, -2640, -791, -1657, -13943, -6473, 8952, 16040, 8696, 17676, 11642, 8310, 13286, 7680, 5802, -19574, -43572, -40476, -28948, -22967, -34167, -35871, -18418]
6598a8418k277Q779J227P772o664J196J1864J0932q092l819J248j5971K577O476
6584c170K5674L296K229P379k3645j9692p72k7185J78K1605N827J426J3342R581
6570A6073P195N141K0428k8590m3250j349Q905O170O24M074l547j328L645J5061
$$ y = [-18418, -20695, -11916, -10689, -2917, -9581, -8385, 3479, 14411, 6319, 2500, 3748, -12223, -9646, -3170, 22504, 25800, 28029, 35408, 11763, -7929, -8701, -35886, -35708, -14103, -8276, -6850, 6492, 16073, 23268, 28409, 48837, 20247, -23003, -24352, -15447, -9277, -8653, -4579, -8126, -9454, -5809, 9252]
$$ [...]
##END NTUPLES=NMR SPECTRUM
##END=
