##TITLE=Analysis number 320720
Compound Code cc 44809
Book Reference 438/158/2
Project Code adrs
Chemist Name antons
##JCAMPDX= 6.0         $$ Bruker NMR JCAMP-DX V2.0
##DATA TYPE= NMR SPECTRUM
##DATA CLASS= NTUPLES
##ORIGIN= Bruker BioSpin GmbH
##OWNER= nmr
$$ XWIN-NMR		Version 3.5
$$ Thu Jul  6 11:15:56 2006 GMT Daylight Time (UT+1h)  MAYBRIDGE\nmr@NMR_250MHZ
##.OBSERVE FREQUENCY= 250.131544655141
##.OBSERVE NUCLEUS= ^1H
##.ACQUISITION MODE= SIMULTANEOUS (DQD)
##.ACQUISITION SCHEME= undefined
##.AVERAGES= 16
##.DIGITISER RES= 18
##SPECTROMETER/DATA SYSTEM= dpx250
##.PULSE SEQUENCE= zg30
##.SOLVENT NAME= CDCl3
##.SHIFT REFERENCE= (INTERNAL, CDCl3, 0, 16.522)
##AUDIT TRAIL= $$ (NUMBER, WHEN, WHO, WHERE, WHAT)
$$ ##TITLE= Audit trail, XWIN-NMR		Version 3.5
$$ ##JCAMPDX= 5.01
$$ ##ORIGIN= Bruker BioSpin GmbH
$$ ##OWNER= nmr
$$ C:\u/data/dgb/nmr/ADRS/2430/pdata/1/auditp.txt
$$ ##AUDIT TRAIL=  $$ (NUMBER, WHEN, WHO, WHERE, WHAT)
(   1,<2006-07-06 11:15:33.27 +100>,<MAYBRIDGE\nmr>,<NMR_250MHZ>,
      <created by zg, POWCHK disabled, PULCHK disabled
       configuration hash MD5:
       E2 DF 36 D8 04 B2 41 60 5A D7 A3 38 5A 4B D0 FE
       data hash MD5: 64K
       AB A9 9C 14 33 B0 11 D8 B4 50 78 E5 85 DF 88 FB>)
(   2,<2006-07-06 11:15:46.42 +100>,<MAYBRIDGE\nmr>,<NMR_250MHZ>,
      <Start of raw data processing
       ef LB = 0.3 FT_mod = 6 PKNL = 1 SI = 32K 
       data hash MD5: 32K
       87 84 47 BC 64 0E 59 D7 D2 5A 46 EA 47 0C 63 F2>)
(   3,<2006-07-06 11:15:48.11 +100>,<MAYBRIDGE\nmr>,<NMR_250MHZ>,
      <apk 
       data hash MD5: 32K
       32 EA FA 75 7D 14 F3 5E F2 35 73 71 B9 6F 25 02>)
(   4,<2006-07-06 11:15:48.94 +100>,<MAYBRIDGE\nmr>,<NMR_250MHZ>,
      <abs ABSG = 5 
       data hash MD5: 32K
       14 9E 69 44 93 6E 7B 0E D0 32 53 05 6B C2 35 91>)
$$ ##END=
$$ 
$$ hash MD5
$$ E5 70 6D 7F 38 04 05 51 AC 19 56 83 F4 BE A4 71
##$RELAX= 
##$RELAX= 
##$RELAX= 
##$RELAX= 
##$RELAX= 
##$RELAX= 
##$RELAX= 
$$ Bruker specific parameters
$$ --------------------------
##$DU= <C:\u>
##$EXPNO= 2430
##$NAME= <ADRS>
##$PROCNO= 1
##$TYPE= <nmr>
##$USER= <dgb>
##$AMP= (0..31)
100 100 100 100 100 100 100 100 100 100 100 100 100 100 100 100 100 100 
100 100 100 100 100 100 100 100 100 100 100 100 100 100 
##$AQSEQ= 0
##$AQ_mod= 3
##$AUNM= <au_zg>
##$AUTOPOS= <19 >
##$BF1= 250.13
##$BF2= 250.13
##$BF3= 250.13
##$BF4= 250.13
##$BF5= 500.13
##$BF6= 500.13
##$BF7= 500.13
##$BF8= 500.13
##$BYTORDA= 1
##$CFDGTYP= 0
##$CFRGTYP= 5
##$CHEMSTR= <none>
##$CNST= (0..31)
1 1 145 1 1 1 1 1 1 1 1 1 1 1 1 1 1 1 1 1 1 1 1 1 1 1 1 1 1 1 1 1 
##$CPDPRG= <>
##$CPDPRG1= <>
##$CPDPRG2= <>
##$CPDPRG3= <>
##$CPDPRG4= <mlev>
##$CPDPRG5= <mlev>
##$CPDPRG6= <mlev>
##$CPDPRG7= <mlev>
##$CPDPRG8= <mlev>
##$CPDPRGB= <>
##$CPDPRGT= <>
##$D= (0..31)
0 1 0 0 0 0 0 0 0 0.06 0 0 0 0 0 0 0.0002 0 0 0 0 0 0 0 0 0 0 0 0 0 0 
0 
##$DATE= 1152180930
##$DBL= (0..7)
120 120 120 120 120 120 120 120 
##$DBP= (0..7)
150 150 150 150 150 150 150 150 
##$DBP07= 0
##$DBPNAM0= <>
##$DBPNAM1= <>
$$ [...]
##$SUBNAM7= <"">
##$SUBNAM8= <"">
##$SUBNAM9= <"">
##$SW= 20.6930455092707
##$SWIBOX= (0..15)
0 0 3 0 0 0 0 0 0 0 0 0 0 0 0 0 
##$SW_h= 5175.983436853
##$TD= 65536
##$TD0= 1
##$TE= 295.16
##$TE2= 300
##$TE3= 300
##$TEG= 300
##$TL= (0..7)
0 120 120 120 120 120 120 120 
##$TP= (0..7)
150 150 150 150 150 150 150 150 
##$TP07= 0
##$TPNAME0= <>
##$TPNAME1= <>
##$TPNAME2= <>
##$TPNAME3= <>
##$TPNAME4= <>
##$TPNAME5= <>
##$TPNAME6= <>
##$TPNAME7= <>
##$TPOAL= (0..7)
0.5 0.5 0.5 0.5 0.5 0.5 0.5 0.5 
##$TPOFFS= (0..7)
0 0 0 0 0 0 0 0 
##$TUNHIN= 0
##$TUNHOUT= 0
##$TUNXOUT= 0
##$USERA1= <user>
##$USERA2= <user>
##$USERA3= <user>
##$USERA4= <user>
##$USERA5= <user>
##$V9= 5
##$VALIST= <valist>
##$VCLIST= <CCCCCCCCCCCCCCC>
##$VD= 0
##$VDLIST= <DDDDDDDDDDDDDDD>
##$VPLIST= <PPPPPPPPPPPPPPP>
##$VTLIST= <TTTTTTTTTTTTTTT>
##$WBST= 1024
##$WBSW= 4
##$XGAIN= (0..3)
0 0 0 0 
##$XL= 0
##$YL= 0
##$YMAX_a= 542949
##$YMIN_a= -658425
##$ZGOPTNS= <>
##$ZL1= 120
##$ZL2= 120
##$ZL3= 120
##$ZL4= 120
##$ABSF1= 16.522
##$ABSF2= -4.171173
##$ABSG= 5
##$ABSL= 3
##$ALPHA= 0
##$AQORDER= 0
##$ASSFAC= 0
##$ASSFACI= 0
##$ASSFACX= 0
##$ASSWID= 0
##$AUNMP= <proc_1d>
##$AZFE= 0.1
##$AZFW= 0.1
##$BCFW= 0
##$BC_mod= 0
##$BYTORDP= 0
##$COROFFS= 0
##$CY= 12.5
##$DATMOD= 1
##$DC= 0
##$DFILT= <>
##$DTYPP= 0
##$F1P= 14.0000005364418
##$F2P= -0.99999901652339
##$FCOR= 0.5
##$FTSIZE= 32768
##$FT_mod= 6
##$GAMMA= 0
##$GB= 0
##$INTBC= 1
##$INTSCL= 1
##$ISEN= 128
##$LB= 0.3
##$LEV0= 0
##$LPBIN= 0
##$MAXI= 10000
##$MC2= 0
##$MEAN= 0
##$ME_mod= 0
##$MI= 0
##$NCOEF= 0
##$NC_proc= -4
##$NLEV= 6
##$NOISF1= 0
##$NOISF2= 0
##$NSP= 0
##$NTH_PI= 0
##$NZP= 0
##$OFFSET= 16.522
##$PC= 1
##$PHC0= 162.321
##$PHC1= 9.845742
##$PH_mod= 1
##$PKNL= yes
##$PPARMOD= 0
##$PSCAL= 4
##$PSIGN= 0
##$REVERSE= no
##$SF= 250.13
##$SI= 32768
##$SIGF1= 0
##$SIGF2= 0
##$SINO= 400
##$SIOLD= 32768
##$SREGLST= <1H.CDCl3>
##$SSB= 0
##$STSI= 32768
##$STSR= 0
##$SW_p= 5175.98343685301
##$SYMM= 0
##$S_DEV= 0
##$TDeff= 65536
##$TDoff= 0
##$TI= <Analysis number 999999
Compound Code 99
Book Reference 9
Project Code 9>
##$TILT= no
##$TM1= 0
##$TM2= 0
##$TOPLEV= 0
##$USERP1= <user>
##$USERP2= <user>
##$USERP3= <user>
##$USERP4= <user>
##$USERP5= <user>
##$WDW= 1
##$XDIM= 32768
##$YMAX_p= 342772263
##$YMIN_p= -208130
$$ End of Bruker specific parameters
$$ ---------------------------------
##NTUPLES= NMR SPECTRUM
##VAR_NAME=  FREQUENCY,     SPECTRUM/REAL,   SPECTRUM/IMAG
##SYMBOL=    X,             R,               I
##VAR_TYPE=  INDEPENDENT,   DEPENDENT,       DEPENDENT
##VAR_FORM=  AFFN,          ASDF,            ASDF
##VAR_DIM=   32768,         32768,           32768
##UNITS=     HZ,            ARBITRARY UNITS, ARBITRARY UNITS
##FACTOR=    0.157963299565203, 1,           1
##FIRST=     4132.6476996994, 0,             0
##LAST=      -1043.33573715361, 0,           0
##MIN=       -1043.33573715361, -208130,     0
##MAX=       4132.6476996994, 342772263,     0
$$ Real data points
##PAGE= N=1
##DATA TABLE= (X++(R..R)), XYDATA
$$ [...]
$$ plain form
19875 -23050 -18424 8031 8169 22404 33809 36068 32890 38720 59997 41999 2085 -4143 -37185
19862 -37185 -65396 -53492 -30578 4014 18084 -4951 -16366 -20252 -13929 6840 10360 13202
19850 13202 22817 33184 27744 13912 -9892 -10609 -28907 -17230 13620 25044 11385 8334 8018
19837 8018 13099 2244 -30688 -39504 -52505 -43462 -47246 -62132 -64708 -64787 -71164 -49267 -32692 -28067
19823 -28067 -24448 3553 -26400 -48741 -21795 -17851 3984 13679 -548 -6237 -18732 -34546
19811 -34546 -38267 -20641 -4619 -14046 1818 16572 -6720 -18277 -49885 -44408 -31097 -40388
19799 -40388 -60114 -49808 -2316 -13396 -27344 -18835 -21413 -9508 14104 14583 3217 25925
19787 25925 40717 35873 30321 20845 15693 36670 58464 43071 26588 30284 30258 50493 73146
$$ packed form
19875b3050M626K6455J38J4235J1405K259l178N830K1277j7998l9914o228l3042
19862c7185k8211J1904K2914L4592J4070k3035j1415l886O323K0769L520K842
19850A3202R615J0367n440j3832k3804p17j8298J1677L0850J1424j3659l051l16
19837H018N081j0855l2932q816j3001R043l784j4886k576p9o377K1897J6575M625
19823b8067L619K8001k9953k2341K6946L944K1835R695j4227n689j2495j5814
19811c4546l721J7626J6022r427J5864J4754k3292j1557l1608N477J3311r291
19799d0388j9726J0306M7492j1080j3948Q509k578J1905K3612M79j1366K2708
19787B5925J4792m844n552r476n152K0977K1794j5393j6483L696k6K0235K2653
$$ plain form
19774 73146 24307 -30430 -22596 4078 10266 -19408 -17351 -27434 -40273 -60660 -61482 -35975 -40500
19761 -40500 -39089 -29243 -32586 -2131 20811 39956 25566 -8414 -5543 -3405 -6720 -9702 -10026
19748 -10026 -20397 -39451 -46417 -17408 -515 -22814 -4185 -2598 -3063 -2901 1906 6347 -16894
19735 -16894 -37868 -53220 -49337 -43485 -13903 -550 -9637 -15997 -26777 -13428 -836 24378
19723 24378 34216 8803 -15669 -8052 4059 27595 27079 20113 7318 -30310 -29904 9394 179
19710 179 1911 -31099 -39411 -25827 -23044 -12012 -3075 14397 9540 12857 19966 27000 20707 12984
19696 12984 16004 19882 16308 27605 15572 -660 -12553 -39065 -46404 -23319 -19400 -6271 -10358
19683 -10358 -7913 -4203 -4937 -36354 -34582 -27655 -42093 -52746 -41180 -31792 -51327 -41492 -20662
$$ packed form
19774G3146m8839n4737P834K6674O188k9674K057j0083j2839k0387q22K5507m525
19761d0500J411R846l343L0455K2942J9145j4390l3980K871K138l315k982l24
19748a0026j0371j9054o966K9009J6893k2299J8629J587m65J62M807M441k3241
19735a6894k0974j5352L883N852K9582J3353r087o360j0780J3349J2592K5214
19723B4378R838k5413k4472P617J2111K3536n16o966j2795l7628M06L9298r215
19710A79J732l3010q312J3584K783J1032Q937J7472m857L317P109P034o293p723
19696A2984L020L878l574J1297j2033j6232j1893k6512p339K3085L919J3129m087
19683a0358K445L710p34l1417J772O927j4438j0653J1566R388j9535R835K0830
$$ plain form
19670 -20662 -15967 -2153 -7997 -1725 -6775 -31357 -23627 -28831 -35400 -27655 -15763 6130 -19526
19657 -19526 -10580 -9585 194 -18226 -18402 -42489 -94834 -75277 -50887 -56287 -50676 -9273 16679
19644 16679 17203 13372 1808 5047 4701 -13251 -8489 19273 20156 475 -10977 -5609 -13125 -26566
19630 -26566 -10902 19135 29389 14749 11936 28806 14684 -13590 -11146 -5054 -7497 5070
19618 5070 6083 -24012 -13724 21984 35989 23228 -13242 -28974 -18525 -15417 -10606 -19875 -17682
19605 -17682 -22693 -27403 -20433 -10268 -15301 -19481 1232 5101 11086 -333 -26296 -22696 16047
19592 16047 42528 28840 321 -22163 -9459 -28320 -32797 -37774 -43362 -50683 -37565 -24073
19580 -24073 -36522 -16392 26214 39253 27657 16125 13498 6503 -10265 -5494 8071 20167
$$ packed form
19670b0662M695J3814n844O272n050k4582P730n204o569P745J1892K1893k5656
19657a9526Q946R95R779j8420j76k4087n2345J9557K4390n400N611M1403K5952
19644A6679N24l831j1564L239l46j7952M762K7762Q83j9681j1452N368p516j3441
19630b6566J5664L0037J0254j4640k813J6870j4122k8274K444O092k443J2567
19618E070J013l0095J0288L5708J4005j2761l6470j5732J0449L108M811r269K193
19605a7682n011m710O970J0165n033m180K0713L869N985j1419k5963L600L8743
19592A6047K6481j3688k8519k2484J2704j8861m477m977n588p321J3118J3492
19580b4073j2449K0130M2606J3039j1596j1532k627o995j6768M771J3565J2096
$$ plain form
19568 20167 -3730 -34345 -22140 -6451 35986 31172 47495 24924 9203 26695 32560 10795
19556 10795 14501 28101 13026 -2819 -3605 -7678 6836 17328 -9656 -14977 -14297 12066 29915
19543 29915 39172 38044 43163 18288 16671 16240 21787 9941 -4481 -14118 -9834 29688 58587
19530 58587 41195 2481 725 -2882 8984 -2265 -18432 -7394 -16815 -37006 -25652 -28153
19518 -28153 -35670 -29525 -19077 -21960 -51723 -18783 -18185 -14931 -13195 -25877 -54231 -41918 -45126
19505 -45126 -42188 -15622 7953 19291 56385 46961 6187 -8396 -30889 -47856 -5658 15993
19493 15993 14532 20278 5539 -11085 -2976 5981 11748 3109 -21255 -15967 -2862 -13799 -6488
19480 -6488 3144 -10527 -29620 -16741 -2716 7827 18780 9057 -11654 3765 15878 13910
$$ packed form
19568B0167k3897l0615J2205J5689M2437m814J6323k2571j5721J7492N865k1765
19556A0795L706J3600j5075j5845p86m073J4514J0492k6984n321O80K6363J7849
19543B9915R257j128N119k4875j617m31N547j1846j4422r637M284L9522K8899
19530E8587j7392l8714j756l607J1866j1249j6167J1038r421k0191J1354k501
19518b8153p517O145J0448k883k9763L2940N98L254J736j2682k8354J2313l208
19505d5126K938K6566K3575J1338L7094r424m0774j4583k2493j6967M2198K1651
19493A5993j461N746j4739j6624Q109Q957N767q639k4364N288J3105j0937P311
19480f488R632j3671j9093J2879J4025J0543J0953r723k0711J5419J2113j968
$$ plain form
19468 13910 20964 -2674 -19104 -14475 -34161 -27259 -7505 -14392 -9297 -19374 -3481 -21774 -41107
19455 -41107 -22011 -3728 -12414 -22895 -25758 -25507 -22849 -3504 23031 1823 -8191 -22222 -51169
19442 -51169 -34209 -19408 -7725 -9205 -35684 -37628 -10767 -15872 -19711 -4235 -7658 -8665 -9952
19429 -9952 14954 28440 49868 63587 48791 24133 10726 6993 14183 -4778 -4585 -36956 -30718
19416 -30718 -8706 27 -17355 -24365 -31180 -44520 -51879 -61490 -54835 -71047 -98316 -81644 -35974
19403 -35974 -26061 -29580 -30090 -46246 -38919 -23906 -25153 -30727 -43014 -35570 -20065 -21802 1857
19390 1857 9470 -26250 -38173 -21256 -13319 8144 16801 1486 11544 12247 -13127 -26237 -31473
19377 -31473 -27574 -35876 -33115 -28531 -22155 6986 12878 -24329 481 21557 -4398 11373 -2577
$$ packed form
19468A3910P054k3638j6430M629j9686O902J9754o887N095j0077J5893j8293j9333
19455d1107J9096J8283q686j0481k863K51K658J9345K6535k1208j0014j4031k8947
19442e1169J6960J4801J1683j480k6479j944K6861n105l839J5476l423j007j287
19429i952K4906J3486K1428J3719j4796k4658j3407l733P190j8961J93l2371O238
19416c0718K2012Q733j7382p010o815j3340p359r611O655j6212k7269J6672M5670
19403c5974R913l519n10j6156P327J5013j247n574j2287P444J5505j737K3659
19390A857P613l5720j1923J6917P937K1463Q657j5315J0058P03k5374j3110n236
19377c1473L899q302K761M584O376K9141N892l7207K4810K1076k5955J5771j3950
$$ plain form
19364 -2577 -18643 -31874 -28741 773 23804 38130 37929 15002 -16581 -10180 1453 -3520 -1068
19351 -1068 -14884 -22479 -22408 -11815 -4566 4120 18833 14227 25993 33624 15847 -12795 -8238 -3513
19337 -3513 5617 -5035 -5039 20516 -3014 -9560 -28028 -34387 -7201 -6684 -25148 -21987 -26026 -34003
19323 -34003 -46821 -24241 -34048 -32261 -15388 -15173 -11196 -2235 -2845 -27709 -37932 -50076 -22430
19310 -22430 -14429 -34692 -28422 -15815 -21395 -37298 -38723 -23970 -14081 10169 -20712 -22841 -3144
19297 -3144 197 21837 33966 33185 15022 -14273 -32196 -22768 9512 8044 11131 9179 1503
19284 1503 4122 -615 2122 -14091 -17534 -31424 -23293 -19778 -15268 -6941 -993 7980 11436 10120
19270 10120 -4756 15970 37572 29372 2046 35284 48667 32678 5612 -32942 -36140 -17108
$$ packed form
19364b577j6066j3231L133K9514K3031J4326k01k2927l1583O401J1633m973K452
19351a068j3816p595P1J0593P249Q686J4713m606J1766P631j7777k8642M557M725
19337c513R130j0652mK5555k3530o546j8468o359K7186N17j8464L161m039p977
19323c4003j2818K2580r807J787J6873K15L977Q961o10k4864j0223j2144K7646
19310b2430Q001k0263O270J2607n580j5903j425J4753R889K4250l0881k129J9697
19297c144L341K1640J2129p81j8163k9295j7923R428L2280j468L087j952p676
19284A503K619m737K737j6213l443j3890Q131L515M510Q327N948Q973L456j316
19270A0120j4876K0726K1602q200k7326L3238J3383j5989k7066l8554l198J9032
$$ plain form
19258 -17108 -31449 -39796 -32441 -22136 -7577 2771 12232 15542 20416 26348 21753 16776 9406
19245 9406 807 -1305 -17571 -33682 -26928 -14285 -28155 -19897 44 7453 21087 32365 39470
19232 39470 18409 7971 10116 -6578 -24019 -11545 -31648 -31471 -944 20500 27789 10441
19220 10441 12917 20437 30191 36351 36413 14480 9049 6356 2212 -5417 -1161 -2671 12929 8474
19206 8474 15449 10946 4772 -16991 -25826 -3645 10419 -22201 -33469 -5159 20206 25388 -10252
19193 -10252 -15032 -3083 20113 43037 40113 13394 4377 -21710 -10267 5346 -11688 -11598 -7893
19180 -7893 2751 22364 16444 -2789 15411 23354 20225 19633 16609 -4086 -1365 19174 19842 -1955
19166 -1955 -48945 -38822 -27167 -28095 -19673 -9636 -20756 -27431 -11301 13972 43030 45635 54063
$$ packed form
19258a7108j4341q347P355J0305J4559J0348R461L310M874N932m595m977p370
19245I406q599k112j6266j6111O754J2643j3870Q258J9941P409J3634J1278P105
19232C9470k1061j0438K145j6694j7441J2474k0103J77L0527K1444P289j7348
19220A0441K476P520R754O160O2k1933n431k693m144p629M256j510J5600m455
19206H474O975m503o174k1763q835K2181J4064l2620j1268K8310K5365N182l5640
19193a0252m780J1949K3196K2924k924k6719r017k6087J1443J5613j7034R0L705
19180g893J0644J9613n920j9233J8200P943l129n92l024k0695K721K0539O68k1797
19166a955m6990J0123J1655r28Q422J0037j1120o675J6130K5273K9058K605Q428
$$ plain form
19153 54063 54752 16563 6260 12901 36495 53459 10969 -32824 -34610 -22123 -5755 -10039 -1419
19140 -1419 10174 17537 4579 -9924 -14606 -19814 -6820 11266 10273 35206 51614 13131 -12138
19127 -12138 -1504 -1763 29592 38806 47780 38983 37068 33583 33699 53484 39715 -3504 14984
19114 14984 42442 38598 25754 28129 -2880 -40866 -27061 -3936 17368 32822 24937 18250
19102 18250 29391 32345 10204 5011 9934 19612 29351 28528 58802 64179 83533 70397 20214
19089 20214 -11865 -8487 -14598 -6777 31812 46166 31899 19534 3472 6708 -9114 -22614
19077 -22614 -24500 -21740 -63824 -65212 -10633 3883 4902 10390 7371 -7190 -8287 -6836 19796
19064 19796 31309 39467 49745 41613 11253 14590 14817 20035 24814 52826 48262 23945 5825
$$ packed form
19153E4063O89l8189j0303O641K3594J6964m2490m3793j786J2487J6368m284Q620
19140a419J1593P363j2958j4503m682n208J2994J8086r93K4933J6408l8483k5269
19127a2138J0634k59L1355R214Q974q797j915l485J16J9785j3769m3219J8488
19114A4984K7458l844j2844K375l1009l7986J3805K3125K1304J5454p885o687
19102A8250J1141K954k2141n193M923R678R739q23L0274N377J9354j3136n0183
19089B0214l2079L378o111P821L8589J4354j4267j2365j6062L236j5822j3500
19077b2614j886K760m2084j388N4579J4516J019N488l019j4561j097J451K6632
19064A9796J1513Q158J0278q132l0360L337K27N218M779K8012m564k4317j8120
$$ plain form
19051 5825 3901 -10360 -32209 -34415 -27587 -20696 -7344 -1533 -10310 -34460 -28439 -34390 -21
19038 -21 22031 38445 2936 -9240 91 27164 64661 59662 20599 538 16998 16988 8017
19025 8017 -8355 -46681 -56429 -7339 14056 -4686 -13278 -14707 -35671 -33697 9509 45760 22270
19012 22270 18321 -2272 -12947 9030 36877 44042 49197 23002 6390 4870 16349 7589 -12393
18999 -12393 -17336 -23484 -16125 -12880 -7044 -6489 -189 17993 9757 -22108 -30595 -23196 -7356 -875
18985 -875 -18863 -10730 20614 17936 27723 13562 6545 19430 43134 37208 34115 1545 -4925
18972 -4925 -4855 21551 -11745 -31589 -14696 11709 21754 17804 42700 49654 71436 90752 70851
18959 70851 76656 76751 83731 84051 55310 33591 -7833 -26884 -12192 8625 8644 -10960 -5592 1273
$$ packed form
19051E825j924j4261k1849k206O828O891J3352N811q777k4150O021n951L4369
19038b1K2052J6414l5509j2176R331K7073L7497m999l9063k0061J6460j0q971
19025H017j6372l8326r748M9090K1395j8742q592j429k0964J974M3206L6251k3490
19012B2270l949k0593j0675K1977K7847P165N155k6195j6612j520J1479q760j9982
18999a2393m943o148P359L245N836N55O300J8182q236l1865q487P399J5840O481
18985h75j7988Q133L1344k678R787j4161p017J2885K3704n926l093l2570o470
18972d925P0K6406l3296j9844J6893K6405J0045l950K4896O954K1782J9316j9901
18959G0851N805R5O980L20k8741k1719m1424j9051J4692K0817J9j9604N368O865
$$ plain form
18945 1273 1069 12884 -3362 6637 -1972 -3829 6103 -8018 3568 -14921 -22610 -3785 -7975
18932 -7975 -17355 7053 15174 24147 8711 -17664 -12109 3126 -5818 -31324 -9265 2488 -7957
18919 -7957 -19373 -14816 -19347 -10720 -1415 -25681 -35057 -49837 -33741 12505 44421 36373 36354 48376
18905 48376 42514 35924 37231 45881 41242 19148 27858 52387 47547 51133 27793 -9947 -5356
18892 -5356 5735 -11898 -4787 -9971 1164 -1778 12269 3832 9169 22690 54920 41741 41408
18879 41408 26085 22129 6936 12392 -1577 -40997 -40622 -27386 -3923 -23820 -18987 -22503 -8323
18866 -8323 33067 61609 72929 73213 54614 17757 7110 7500 28224 29584 11499 -15518 -4662
18853 -4662 392 572 29130 38293 18449 5526 -9332 7257 9104 28389 21737 23239 7712
$$ packed form
18945A273k04J1815j6246R999q609j857R932j4121J1586j8489p689J8825m190
18932g975r380K4408Q121Q973j5436k6375N555J5235q944k5506K2059J1753j0445
18919g957j1416M557m531Q627R305k4266r376j4780J6096M6246L1916q048j9J2022
18905D8376n862o590J307Q650m639k2094Q710K4529m840L586k3340l7740M591
18892e356J1091j7633P111n184J1135k942J4047q437N337J3521L2230j3179l33
18879D1408j5323l956j5193N456j3969l9420L75J3236K3463j9897M833l516J4180
18866h323M1390K8542J1320K84j8599l6857j0647L90K0724J360j8085k7017J0856
18853d662N054J80K8558R163j9844j2923j4858J6589J847J9285o652J502j5527
$$ plain form
18840 7712 7674 18937 39514 38100 25967 1772 26578 30704 -6399 -31232 -22598 -28543 5553
18827 5553 25467 2387 3785 34492 64703 68533 75313 59271 34284 11612 7679 19926 7828
18814 7828 -6430 -13936 -18776 7719 5012 -7478 -7445 23688 40492 27510 2528 12281 38497
18801 38497 32555 19002 45881 46753 36797 48505 36086 20870 39241 38898 29164 31594 54608
18788 54608 39837 29823 39827 42161 16368 637 14265 25764 63263 85215 61617 29830
18776 29830 27058 30065 38811 43332 103768 132501 144151 168688 183520 159638 162044 182174 158528
18763 158528 114001 114358 105176 70434 51673 27110 5117 7502 24765 31498 18312 10881 -17058
18750 -17058 -28176 -26436 -20823 -33 10930 15551 26654 22214 1179 32029 53351 71640
$$ packed form
18840G712l8J1263K0577j414j2133k4195K4806M126l7103k4833Q634n945L4096
18827E553J9914k3080J398L0707L0211L830O780j6042k4987k2672l933J2247j2098
18814G828j4258p506m840K6495k707j2490L3L1133J6804j2982k4982R753K6216
18801C8497n942j3553K6879Q72r956J1708j2419j5216J8371l43r734K430K3014
18788E4608j4771j0014J0004K334k5793j5731J3628J1499L7499K1952k3598l1787
18776B9830k772L007Q746M521O0436K8733J1650K4537J4832k3882K406K0130k3646
18763A58528m4527L57r182l4742j8761k4563k1993K385J7263O733j3186p431k7939
18750a7058j1118J740N613K0790J0963M621J1103m440k1035L0850K1322J8289
$$ plain form
18738 71640 56832 30346 -2351 2088 5687 2171 26008 38647 46346 46022 33239 44851 44685
18725 44685 35489 24021 20000 12401 29825 18173 44062 53011 48771 14464 11123 46670 57999
18712 57999 62575 9506 10478 30854 17163 953 9437 14821 5156 22933 17511 37991 54294
18699 54294 58297 31866 29063 17215 5441 12682 27362 22650 45080 62697 48978 64339
18687 64339 29932 17735 10097 8905 7363 21712 31672 39594 61793 92437 79587 84619 91564
18674 91564 124243 145261 123129 119433 95039 57516 32896 52720 33061 14084 8666 -502
18662 -502 1595 30169 26886 28628 57910 66530 58853 65032 75211 81417 76419 71871 57718 34497
18648 34497 35178 49266 35965 28329 9191 7305 22456 58228 65013 27020 22300 47556 49815
$$ packed form
18738G1640j4808k6486l2697M439L599l516K3837J2639P699l24j2783J1612j66
18725D4685r196j1468m021p599J7424j1652K5889Q949m240l4307l341L5547J1329
18712E7999M576n3069R72K0376j3691j6210Q484N384r665J7777n422K0480J6303
18699E4294M003k6431k803j1848j1774P241J4680m712K2430J7617j3719J5361
18687F4339l4407j2197p638j192j542J4349R960P922K2199L0644j2850N032O945
18674I1564L2679K1018k2132l696k4394l7523k4620J9824j9659j8977n418r168
18662e02K097K8574l283J742K9282Q620p677O179J0179O206m998m548j4153k3221
18648C4497O81J4088j3301p636j9138j886J5151L5772O785l7993m720K5256K259
$$ plain form
18635 49815 74772 36657 18385 21143 22958 13400 8354 9415 10942 40010 23194 26667 64724
18622 64724 64285 50808 45735 43525 77176 82806 65253 86299 129749 168760 174972 172645 183181
18609 183181 151447 135423 128688 129739 167436 173520 164264 134299 120830 126533 139531 146670 126410
18596 126410 110512 117561 117302 111275 122182 114324 94481 106013 136983 149327 125448 139796
18584 139796 142595 118241 112721 99153 74865 79392 100611 87273 73907 98377 107513 134504
18572 134504 150335 159451 168636 194147 229450 260400 284116 303669 310520 331047 323559 278335
18560 278335 254655 272039 293525 287166 273040 296408 337801 373388 370453 346998 321432 299292
18548 299292 286725 250355 232134 224832 225616 193303 146594 161109 167213 173726 159028 165948 206623
$$ packed form
18635D9815K4957l8115j8272K758J815r558n046J061J527K9068j6816L473L8057
18622F4724m39j3477n073k210L3651N630j7553K1046M3450L9011O212k327J0536
18609A83181l1734j6024o735J051L7697O084r256k9965j3469N703J2998P139k0260
18596A26410j5898P049k59o027J0907p858j9843J1532L0970J2344k3879J4348
18584A39796K799k4354n520j3568k4288M527K1219j3338j3366K4470R136K6991
18572A34504J5831R116R185K5511L5303L0950K3716J9553O851K0527p488m5224
18560B78335k3680J7384K1486o359j4126K3368M1393L5587k935k3455k5566k2140
18548B99292j2567l6370j8221p302P84l2313m6709J4515O104O513j4698O920M0675
$$ plain form
18535 206623 233113 226787 226214 255775 273780 285504 305178 309496 324631 361394 346419 332115
18523 332115 336290 361683 390320 408942 441604 443587 450033 446360 424250 399418 367037 351998
18511 351998 350430 337807 319421 264646 251602 266546 292683 290233 275659 274541 251615 237845
18499 237845 225755 195983 183066 159693 165051 175411 180050 183938 187243 197215 187818 187938 240319
18486 240319 272439 288488 319111 327138 325060 328327 333911 344672 362344 384254 403536 418786
18474 418786 405464 383920 346618 341492 321922 341518 314391 273588 254142 261495 273143 228324
18462 228324 184495 176084 163843 141884 135263 173291 183162 150033 118734 118476 124253 119274 127116
18449 127116 115993 122299 139803 153589 112381 85895 92713 101504 106916 134395 153772 147824
$$ packed form
18535B06623K6490o326n73K9561J8005J1724J9674M318J5135L6763j4975j4304
18523C32115M175K5393K8637J8622L2662J983O446l673k2110k4832l2381j5039
18511C51998j568j2623j8386n4775j3044J4944K6137k450j4574j118k2926j3770
18499B37845j2090k9772j2917k3373N358J0360M639L888L305R972r397J20N2381
18486B40319L2120J6049L0623Q027k078L267N584J0761J7672K1910J9282J5250
18474D18786j3322k1544l7302n126j9570J9596k7127m0803j9446P353J1648m4819
18462B28324m3829q411j2241k1959o621L8028R871l3129l1299k58N777m979P842
18449A27116j1123O306J7504J3786m1208k6486O818Q791N412K7479J9377n948
$$ plain form
18437 147824 138767 133750 116961 109287 107576 94433 103141 116976 107988 70686 56436 72682 83078
18424 83078 51358 14506 30934 51201 50945 73426 71343 63404 52362 75407 91150 80031
18412 80031 73205 74463 59419 67815 86129 87294 94970 51080 44298 55881 54588 39858 31638
18399 31638 37753 83766 97237 72129 68909 73063 90509 93931 71974 72174 61702 38370 37124
18386 37124 76136 78712 32647 4819 19720 64201 64155 70033 82193 104206 140553 137144 128418
18373 128418 138611 166695 188907 209656 203851 222788 282828 360820 351324 330775 342177 362881
18361 362881 359692 348490 343697 322059 343487 359834 361688 349246 339241 306920 259416 209503
18349 209503 194502 180005 126883 114225 157025 156094 138434 129675 113649 123657 143896 143100
$$ packed form
18437A47824r057n017j6789p674j711j3143Q708J3835q988l7302j4250J6246J0396
18424H3078l1720l6852J6428K0267k56K2481k083p939j1042K3045J5743j1119
18412H0031o826J258j5044Q396J8314J165P676m3890o782J1583j293j4730q220
18399C1638O115M6013J3471k5108l220M154J7446L422k1957K00j0472k3332j246
18386C7124L9012K576m6065k7828J4901M4481m6N878J2160K2013L6347l409q726
18373A28418J0193K8084K2212K0749n805J8937O0040P7992r496k0549J1402K0704
18361C62881l189j1202m793k1638K1428J6347J854j2442j0005l2321m7504m9913
18349B09503j5001j4497n3122j2658M2800r31j7660q759j6026J0008K0239p96
$$ plain form
18337 143100 132610 116568 119387 126585 115134 165687 164631 140813 120558 117449 155291 192537
18325 192537 221838 232646 236122 231642 231849 295726 362723 385585 421942 435337 475578 512480
18313 512480 526803 539509 530726 549567 566688 554429 506770 480595 465736 433962 378235 322459
18301 322459 292054 264585 222812 191465 187755 185015 164258 155874 152087 145910 130243 119485
18289 119485 114761 101607 115066 126937 151396 133090 118241 135160 143193 181946 185993 164724
18277 164724 157030 177073 197484 196095 185347 166837 167859 191460 211268 203153 184384 157472
18265 157472 170481 188603 187781 175066 154116 150694 178954 189490 192291 170807 150217 159722
18253 159722 129771 124712 114544 98949 128875 132090 84567 63244 91378 82426 106293 164470
$$ packed form
18337A43100j0490j6042K819P198j1451N0553j056k3818k0255l109L7842L7246
18325A92537K9301J0808L476m480K07O3877O6997K2862L6357J3395M0241L6902
18313E12480J4323J2706q783J8841J7121j2259m7659k6175j4859l1774n5727n5776
18301C22459l0405k7469m1773l1347l710k740k0757q384l787o177j5667j0758
18289A19485m724j3154J3459J1871K4459j8306j4849J6919Q033L8753M047k1269
18277A64724p694K0043K0411j389j0748j8510J022K3601J9808q115j8769k6912
18265A57472J3009J8122q22j2715k0950l422K8260J0536K801k1484k0590R505
18253A59722k9951n059j0168j5595K9926L215m7523k1323K8134q952K3867N8177
$$ plain form
18241 164470 177909 163312 180302 192501 206449 235556 247214 241551 238930 191183 166003 184983
18229 184983 196662 219294 253170 242857 235873 228616 219599 202314 206543 185745 195685 206128
18217 206128 187262 198552 196354 184683 186732 196571 188923 195890 216410 224570 214222 205544 237126
18204 237126 241911 228647 205824 214402 254310 261077 244603 254351 284825 339369 376480 400095
18192 400095 435288 470041 503944 502133 480586 473911 475709 470435 475363 484248 486298 493019 498221
18179 498221 495035 487279 450887 387378 358104 343408 364914 353461 349058 354013 368093 353536
18167 353536 371924 356538 353634 389762 415176 445164 460905 457850 478031 506026 516945 515714
18155 515714 533186 571950 628131 658515 693312 758172 838064 908390 943056 980413 1026393
$$ packed form
18241A64470J3439j4597J6990J2199J3948K9107J1658n663k621m7747k5180J8980
18229A84983J1679K2632L3876j0313o984p257r017j7285M229k0798R940J0443
18217B06128j8866J1290k198j1671K049R839p648O967K0520Q160j0348q678L1582
18204B37126M785j3264k2823Q578L9908O767j6474R748L0474N4544L7111K3615
18192D00095L5193L4753L3903j811k1547o675J798n274M928Q885K050O721N202
18179D98221l186p756l6392o3509k9274j4696K1506j1453m403M955J4080j4557
18167C53536J8388j5386k904L6128K5414K9988J5741l055K0181K7995J0919j231
18155E15714J7472L8764N6181L0384L4797O4860P9892P0326L4666L7357M5980
$$ plain form
18144 1026393 1096834 1156380 1174751 1194297 1245961 1320386 1376148 1432098 1521801 1597470 1659930
18133 1659930 1741022 1850067 1941232 2026684 2147748 2323276 2540192 2797653 3092039 3506495
18123 3506495 4112423 4982488 6236706 7943887 10016197 12386745 15060292 17785413
18115 17785413 20494977 23732628 28155669 34527599 40190225 41076124 40412895 41245016
18107 41245016 43660069 45583969 40751595 34199663 30296120 27569862 25281143 22707357
18099 22707357 19595470 16871030 14434647 12247302 10680757 9592696 8857100 8343177
18091 8343177 7962742 7664644 7454707 7260616 7090305 6943342 6880966 6886661 6893994 6962138
18081 6962138 7117958 7364128 7722401 8234956 9003418 10194502 11872841 14002381 16523402
$$ packed form
18144A026393P0441N9546J8371J9546N1664P4425N5762N5950Q9703P5669O2460
18133A659930Q1092J09045R1165Q5452J21064J75528K16916K57461K94386M14456
18123C506495O05928Q70065J254218J707181K072310K370548K673547K725121
18115A7785413K709564L237651M423041O371930N662626Q85899o63229Q32121
18107D1245016K415053J923900m832374o551932l903543k726258k288719k573786
18099B2707357l111887k724440k436383k187345j566545j088061p35596n13923
18091H343177l80435k98098k09937j94091j70311j46963o2376N695P333O8144
18081F962138J55820K46170L58273N12555P68462J191084J678339K129540K521021
$$ plain form
18072 16523402 19481601 22644437 25715024 28843306 31810682 34607248 37332692 39335825
18064 39335825 41157357 43207478 45050801 47227412 49303286 50668151 52315584 53819412
18056 53819412 55070207 56265103 56005335 54712689 52866225 50063098 47060238 43554858
18048 43554858 39492189 36555314 34740777 33877318 34545888 37098719 40897051 44636739
18040 44636739 47936282 51342001 54624575 56541255 56707058 56128623 55858975 55037969 53296756
18031 53296756 52053369 51384195 50505838 49673311 49502263 49334944 48451148 47391121 47147968
18022 47147968 47020948 46142514 44950312 44079888 43132550 41982924 41236600 40730720 41216036
18013 41216036 43117558 45793548 49503729 53642070 56700963 58450997 58674773 57333524
$$ packed form
18072A6523402K958199L162836L070587L128282K967376K796566K725444K003133
18064C9335825J821532K050121J843323K176611K075874J364865J647433J503828
18056E3819412J250795J194896k59768j292646j846464k803127l002860l505380
18048D3554858m062669k936875j814537q63459O68570K552831L798332L739688
18040D4636739L299543L405719L282574J916680J65803n78435k69648q21006j741213
18031E3296756j243387o69174q78357q32527j71048j67319q83796j060027k43153
18022D7147968j27020q78434j192202q70424r47338j149626p46324n05880M85316
18013D1216036J901522K675990L710181M138341L058893J750034K23776j341249
$$ plain form
18005 57333524 54623405 49624853 43967450 39185376 35120796 32585631 32171201 33439967
17997 33439967 35862995 39757801 45593719 52218822 57698061 62293196 67738391 73432563
17989 73432563 76530910 75871573 74270351 73607265 72348697 68731963 64690143 61415114
17981 61415114 58239623 55306569 53017835 50369341 46171867 41852996 38649061 35546632
17973 35546632 31355297 27182771 24048950 21578770 19261523 17256831 15709197 14530669
17965 14530669 13610409 12877513 12214530 11603304 11083016 10592705 10127200 9677310 9250495
17956 9250495 8848259 8479317 8114973 7774293 7426877 7106488 6811445 6530148 6236835
17947 6236835 5957312 5706781 5487920 5271646 5046451 4867733 4688130 4529204 4384709
$$ packed form
18005E7333524k710119m998552n657403m782074m064580k535165m14430J268766
17997C3439967K423028L894806N835918O625103N479239M595135N445195N694172
17989G3432563L098347o59337j601222o63086j258568l616734m041820l275029
17981F1415114l175491k933054k288734k648494m197474m318871l203935l102429
17973C5546632m191335m172526l133821k470180k317247k004692j547634j178528
17965A4530669r20260p32896o62983o11226n20288m90311m65505m49890m26815
17956I250495m02236l68942l64344l40680l47416l20389k95043k81297k93313
17947F236835k79523k50531k18861k16274k25195j78718j79603j58926j44495
$$ plain form
17938 4384709 4246394 4134607 4037624 3932097 3831545 3737184 3630115 3521110 3398763 3327756
17928 3327756 3278722 3208562 3127890 3091408 3025707 2968803 2886936 2807299 2746163 2673857 2627581
17917 2627581 2575554 2514093 2434909 2391277 2329726 2289410 2272546 2242010 2221009 2193140 2169429
17906 2169429 2164311 2152718 2141386 2104681 2103091 2131514 2203314 2333533 2465806 2600474 2728180
17895 2728180 2895538 3116610 3326887 3555769 3840610 4098968 4332981 4553749 4777675
17886 4777675 4984001 5151001 5322159 5573618 5892843 6329125 6895211 7747341 8896025
17877 8896025 10548111 12898490 16213376 20727873 26425877 33084637 40254677 47442867
17869 47442867 54203453 60133616 65009879 68816272 71655883 73627901 74764762 75158801
$$ packed form
17938D384709j38315j11787r6983j05527j00552r4361j07069j09005j22347p1007
17928C327756m9034p0160q0672l6482o5701n6904q1867p9637o1136p2306m6276
17917B627581n2027o1461p9184m3632o1551m0316j6864l0536k1001k7869k3711
17906B169429n118j1593j1332l6705j590K8423P1800J30219J32273J34668J27706
17895B728180J67358K21072K10277K28882K84841K58358K34013K20768K23926
17886D777675K06326J67000J71158K51459L19225M36282N66086Q52130J148684
17877H896025J652086K350379L314886M514497N698004O658760P170040P188190
17869D7442867O760586N930163M876263L806393K839611J972018J136861L94039
$$ plain form
17861 75158801 75150688 74774520 73536042 70810953 66365481 60569505 53940846 46915520 39825336
17852 39825336 33159909 27484547 23057548 19818191 17523816 15873307 14683846 13768882
17844 13768882 13052783 12444561 11953948 11532109 11129646 10768247 10412460 10089061 9765296
17835 9765296 9499406 9288557 9136135 9097377 9129659 9209024 9414688 9785372 10392587 11350323
17825 11350323 12829979 14980312 17984220 21833722 26392792 31347495 36341572 41036443
17817 41036443 45169536 48469598 50853910 52282084 52779012 52436809 51482383 50155513
17809 50155513 48456134 46176663 43135860 39452945 35404886 31119753 26786886 22647358
17801 22647358 18987924 16069555 13922733 12352810 11243500 10417048 9760188 9238535
$$ packed form
17861G5158801q113l76168j238478k725089m445472n795976o628659p025326p090184
17852C9825336o665427n675362m426999l239357k294375j650509j189461r14964
17844A3768882p16099o08222m90613m21839m02463l61399l55787l23399l23765
17835I765296k65890k10849j52422l8758L2282P9365K05664L70684O07215R57736
17825A1350323J479656K150333L003908L849502M559070M954703M994077M694871
17817D1036443M133093L300062K384312J428174M96928l42203r54426j326870
17809E0155513j699379k279471l040803l682915m048059m285133m332867m139528
17801B2647358l659434k918369k146822j569923j109310q26452o56860n21653
$$ plain form
17793 9238535 8789843 8377571 7998886 7662423 7318152 6973364 6643782 6319086 6004701
17784 6004701 5740556 5498256 5305562 5093928 4918415 4771251 4605824 4428642 4198634
17775 4198634 4009985 3884077 3744730 3591720 3447294 3345639 3232505 3147849 3036143 2940591
17765 2940591 2872159 2812552 2759052 2696524 2598862 2536276 2487398 2429341 2389031 2355739 2328219
17754 2328219 2311395 2312432 2311233 2308547 2331626 2363226 2402913 2438282 2495166 2535462 2575724 2649281
17742 2649281 2717009 2742310 2818583 2913674 3033500 3151504 3317895 3531522 3806194 4149133
17732 4149133 4609159 5239115 6098178 7322983 9121600 11850844 15845273 21084268 26802841
17723 26802841 31849963 35392643 37879850 39879111 41428147 42118154 41584734 40786480
$$ packed form
17793I238535m48692m12272l78685l36463l44271l44788l29582l24696l14385
17784F004701k64145k42300j92694k11634j75513j47164j65427j77182k30008
17775D198634j88649j25908j39347j53010j44426j01655j13134q4656j11706r5552
17765B940591o8432n9607n3500o2528r7662o2586m8878n8057m0310l3292k7520
17754B328219j6824J037j199k686K3079L1600L9687L5369N6884M0296M0262P3557
17742B649281O7728K5301P6273R5091J19826J18004J66391K13627K74672L42939
17732D149133M60026O29956Q59063J224805J798617K729244L994429N238995N718573
17723B6802841N047122L542680K487207J999261J549036O90007n33420p98254
$$ plain form
17715 40786480 40063533 39171899 38121506 37094809 35724701 33265734 29013811 23764358
17707 23764358 18925494 15222322 12748104 11176674 10182577 9538945 9139953 8819812 8573020
17698 8573020 8359759 8173748 8052583 7964541 7851581 7778861 7738808 7738228 7807020 7902379 8077247
17687 8077247 8408995 8903039 9661789 10786051 12444449 14929374 18729326 24068494 30797336
17678 30797336 38253057 45395891 51626750 56654870 60504722 63412500 64773824 64613467
17670 64613467 62879313 60322203 58399303 57123692 55524275 52497446 47979463 43033879
17662 43033879 38043316 32844985 27413277 22587158 18828487 16223681 14439198 13187057
17654 13187057 12272771 11579696 10999444 10501169 10046085 9653999 9318710 9004554 8688049
$$ packed form
17715D0786480p22947q91634j050393j026697j370108k458967m251923n249453
17707B3764358m838864l703172k474218j571430r94097o43632l98992l20141k46792
17698H573020k13261j86011j21165q8042j12960p2720m0053n80O8792R5359J74868
17687H077247L31748M94044P58750J124262J658398K484925L799952N339168O728842
17678C0797336P455721P142834O230859N028120L849852K907778J361324j60357
17670F4613467j734154k557110j922900j275611j599417l026829m517983m945584
17662D3033879m990563n198331n431708m826119l758671k604806j784483j252141
17654A3187057r14286o93075n80252m98275m55084l92086l35289l14156l16505
$$ plain form
17645 8688049 8409767 8177327 7998790 7852138 7728059 7659473 7688512 7838348 8119854 8640232
17635 8640232 9563453 11088667 13397089 16386652 19598015 22329327 24183421 25484162
17627 25484162 26566495 27367513 27663051 27289315 26850604 26404861 25830549 25184868 24500012
17618 24500012 23516294 21765396 18841679 15462257 12397249 10090502 8556527 7525276
17610 7525276 6824437 6312305 5900078 5529478 5226035 4966746 4756366 4571828 4430640
17601 4430640 4287800 4163830 4015676 3874736 3716166 3528126 3366780 3219673 3060169
17592 3060169 2938275 2830015 2728051 2631922 2542436 2457723 2386610 2342429 2287412 2216988 2177406
17581 2177406 2124002 2037014 1911904 1811025 1742966 1701433 1659417 1613988 1564777 1516595 1474608
$$ packed form
17645H688049k78282k32440j78537j46652j24079o8586K9039J49836K81506N20378
17635H640232R23221J525214K308422K989563L211363K731312J854094J300741
17627B5484162J082333Q01018K95538l73736m38711m45743n74312o45681o84856
17618B4500012r83718j750898k923717l379422l065008k306747j533975j031251
17610G525276p00839n12132m12227l70600l03443k59289k10380j84538j41188
17601D430640j42840j23970j48154j40940j58570j88040j61346j47107j59504
17592C060169j21894j08260j01964r6129q9486q4713p1113m4181n5017p0424l9582
17581B177406n3404q6988j25110j00879o8059m1533m2016m5429m9211m8182m1987
$$ plain form
17570 1474608 1423014 1386894 1346893 1304175 1266784 1250608 1219397 1159414 1095217 1025672 986150
17559 986150 974551 946851 890509 867143 897606 880229 849408 872618 896196 918266 977178
17548 977178 1004777 959170 936084 940908 933616 918086 909469 922034 960405 1007081 1043154 1047533
17536 1047533 1031488 1045395 1052299 1041588 1011101 973976 968853 963297 926791 894272 866215 870987
17524 870987 875939 864030 836632 825760 798712 769075 727216 674245 625870 581379 508620 459826
17512 459826 459234 440729 413804 389227 389578 382388 375011 377827 379868 364270 386601 425074 408567
17499 408567 388484 393409 392633 377747 385217 395449 395975 405745 445571 491910 493593 505431 537075
17486 537075 524286 510595 530128 517807 494381 500407 513463 486715 497596 514527 524356 488155
$$ packed form
17570A474608n1594l6120m0001m2718l7391j6176l1211n9983o4197o9545l9522
17559I86150j1599k7700n6342k3366L0463j7377l0821K3210K3578K2070N8912
17548I77178K7599m5607k3086M824p292j5530q617J2565L8371M6676L6073M379
17536A047533j6045J3907O904j0711l0487l7125n123n556l6506l2519k8057M772
17524H70987M952j1909k7398j0872k7048k9637m1859n2971m8375m4491p2759m8794
17512D59826n92j8505k6925k4577L51p190p377K816K041j5598K2331L8473j6507
17499D08567k0083M925p76j4886P470J0232N26R770L9826M6339J683J1838L1644
17486E37075j2789j3691J9533j2321k3426O026J3056k6748J0881J6931R829l6201
$$ plain form
17474 488155 470224 465868 447237 410619 394488 369358 358048 353248 335094 301808 291279 283307
17462 283307 278482 253108 222715 188297 182715 170697 157031 188267 192992 179086 203539 214711
17450 214711 212695 222832 244256 241475 280881 343035 344364 339836 335248 327239 329619 314173 277692
17437 277692 265315 242830 229679 210715 180353 168988 187355 194119 180777 169437 180661 169365
17425 169365 169501 155956 148387 136048 129087 190281 203439 196448 170579 153655 147016 145705 132180
17412 132180 126483 140726 134837 137618 141118 146569 134053 130041 147816 138823 110479 90471 114686
17399 114686 132813 134546 150563 160149 144499 108042 96275 76703 70438 45867 38392 46606
17387 46606 80361 99428 140651 139280 167483 185966 178744 183459 191760 198185 213223 247458 279852
$$ packed form
17474D88155j7931m356j8631l6618j6131k5130j1310m800j8154l3286j0529p972
17462B83307m825k5374l0393l4418n582j2018j3666L1236M725j3906K4453J1172
17450B14711k016J0137K1424k781L9406O2154J329m528m588q009K380j5446l6481
17437B77692j2377k2485j3151j8964l0362j1365J8367O764j3342j1340J1224j1296
17425A69365J36j3545p569j2339o961O1194J3158o991k5869j6924o639j311j3525
17412A32180n697J4243n889K781L500N451j2516m012J7775q993k8344k0008K4215
17399A14686J8127J733J6017R586j5650l6457j1767j9572o265k4571p475Q214
17387D6606L3755J9067M1223j371K8203J8483p222M715Q301O425J5038L4235L2394
$$ plain form
17374 279852 284243 315049 373889 387800 387758 399016 417301 400306 375810 394158 422143 391112
17362 391112 351964 348953 325791 280074 216879 194290 153819 141861 120453 130469 135212 120282
17350 120282 93306 93476 98168 89848 60976 68509 48162 55436 62241 48653 52397 62019 65315
17337 65315 62561 33905 82934 119827 137021 140536 164141 142296 142041 167768 181824 184594 185987
17324 185987 213663 239038 278027 285440 303769 337740 358487 341824 313030 320527 328228 309505
17312 309505 275879 271005 243958 197891 186964 187246 184894 174058 146047 161635 165966 142855
17300 142855 129685 83892 31208 54138 79271 93066 97810 95557 68310 47860 58946 84110
17288 84110 88801 95966 116566 100265 99765 121319 115242 105289 114510 112974 110995 99990 76065
$$ packed form
17374B79852M391L0806N8840J3911m2J1258J8285j6995k4496J8348K7985l1031
17362C91112l9148l011k3162m5717o3195k2589m0471j1958k1408J0016M743j4930
17350A20282k6976J70M692q320k8872P533k0347P274O805j3588L744R622L296
17337F5315k754k8656M9029L6893J7194L515K3605k1845k55K5727J4056K770J393
17324A85987K7676K5375L8989P413J8329L3971K0747j6663k8794P497P701j8723
17312C09505l3626m874k7047m6067j0927K82k352j0836k8011J5588M331k3111
17300A42855j3170m5793n2684K2930K5133J3795M744k253k7247k0450J1086K5164
17288H4110M691P165K0600j6301n00K1554o077r953R221j536j979j1005k3925
$$ plain form
17275 76065 59761 67419 57627 12635 11097 30284 28976 35105 19793 -24347 -13656 -16167 -21580
17262 -21580 -6134 5913 19458 23659 11944 -13600 -5005 -23595 -24077 6233 17192 28813
17250 28813 75394 67647 47935 31326 11752 48150 75432 83741 96676 135109 158725 157613
17238 157613 163932 145896 153690 131025 117581 108275 78220 84968 88812 76971 76135 75981 43833
17225 43833 49513 57506 66736 49123 11738 11777 20171 40371 61576 81346 109831 129748 149050
17212 149050 153955 138013 145052 172354 192781 194112 209215 229188 226299 212604 208508 192083
17200 192083 177789 159675 129774 100316 84417 82992 64166 46779 48860 74081 69478 37185
17188 37185 36167 59791 57691 62025 60388 70897 79702 81967 80188 68497 83474 92570 87053
$$ packed form
17275G6065j6304P658r792m4992j538J9187j308O129j5312m4140J0691k511n413
17262b1580J5446J2047J3545M201j1715k5544Q595j8590m82L0310J0959J1621
17250B8813M6581p747j9712j6609j9574L6398K7282Q309J2935L8433K3616j112
17238A57613O319j8036P794k2665j3444r306l0055O748L844j1841q36j54l2148
17225D3833N680P993R230j7613l7385L9Q394K0200K1205J9770K8485J9917J9302
17212A49050M905j5942P039K7302K0427J331J5103J9973k889j3695m096j6425
17200A92083j4294j8114k9901k9458j5899j425j8826j7387K081K5221m603l2293
17188C7185j018K3624k100M334j637J0509Q805K265j779j1691J4977R096n517
$$ plain form
17175 87053 74354 84590 68516 101022 142220 155991 162250 202029 246725 292254 314403 311029
17163 311029 327237 326759 348151 365899 323703 286334 285053 310441 311522 285339 260004 221568
17151 221568 171892 148777 149728 145123 121419 90386 71786 84703 72347 57899 67144 56456
17139 56456 60694 67034 46499 46813 34301 24312 34239 36307 37195 38766 77880 74877 76316 65854
17125 65854 50632 27469 27586 43367 73897 116047 129573 127929 124154 132268 146832 184347 180456
17112 180456 151086 150661 144139 132113 123166 122101 113416 85947 71910 60690 41101 55484 73627
17099 73627 61591 33753 27451 28395 18262 14831 25001 25549 -12846 -12944 1354 11368 -2767
17086 -2767 -21052 3901 -5321 7741 35371 39493 21624 15491 9670 97 4580 1063 -7666
$$ packed form
17175H7053j2699J0236j6074L2506M1198J3771O259L9779M4696M5529K2149l374
17163C11029J6208m78K1392J7748m2196l7369j281K5388J081k6183k5335l8436
17151B21568m9676k3115R51m605k3704l1033j8600J2917j2356j4448R245j0688
17139E6456M238O340k0535L14j2512r989R927K068Q88J571L9114l003J439j0462
17125F5854j5222k3163J17J5781L0530M2150J3526j644l775Q114J4564L7515l891
17112A80456k9370m25o522j2026q947j065q685k7469j4037j1220j9589J4383J8143
17099G3627j2036k7838o302R44j0133l431J0170N48l8395r8J4298J0014j4135
17086b767j8285K4953r222J3062K7630M122j7869o133n821r573M483l517q729
$$ plain form
17073 -7666 -9335 7899 -3315 -5830 -6045 10644 -14182 -39471 -47956 -39923 -28335 -43514 -55936
17060 -55936 -55970 -28852 -28527 -35920 -43112 -42436 -26744 -11663 -24175 -33424 -24403 -18032 24770 35402
17046 35402 21362 6781 -6884 -13424 -4964 -15313 -26410 -19973 -14705 -5536 17851 19001 17873
17033 17873 11455 -1966 -12118 4374 11256 7102 5609 936 -10652 -30322 -31278 -13533 -7966
17020 -7966 -11391 -33369 -41126 -8494 12849 -5536 -29399 -8432 2420 3293 5768 13567 13318
17007 13318 -5020 -17769 -15699 4178 11853 3352 2083 2957 -39582 -49520 -33598 -23228 10191
16994 10191 14104 -17467 -28318 -7500 -970 20342 33948 1013 -14809 -3918 1755 -1943
16982 -1943 -2913 -13295 -29768 -19397 -15529 -44854 -24163 -2061 -8196 -23884 -21159 -3736 -12665
$$ packed form
17073g666j669J7234j1214k515k15J6689k4826k5289q485Q033J1588j5179j2422
17060e5936l4K7118L25p393p192O76J5692J5081j2512r249R021O371M2802J0632
17046C5402j4040j4581j3665o540Q460j0349j1097O437N268R169K3387J150j128
17033A7873o418j3421j0152J6492O882m154j493m673j1588j9670r56J7745N567
17020g966l425k1978p757L2632K1343j8385k3863K0967J0852Q73K475P799k49
17007A3318j8338j2749K070J9877P675q501j269Q74m2539r938J5922J0370L3419
16994A0191L913l1571j0851K0818O530K1312J3606l2935j5822J0891N673l698
16982a943r70j0382j6473J0371L868k9325K0691K2102o135j5688K725J7423q929
$$ plain form
16969 -12665 -42059 -44909 -1638 -5223 8116 15599 23160 23746 3797 36206 41931 34881 29595
16956 29595 28569 48093 44896 39412 26877 -3740 -15752 -17560 -31674 -28247 -21613 -26739 -16188
16943 -16188 -13951 -8976 -8394 515 -17419 -45744 -43093 -25756 -24637 -26173 -29155 -18170 -3163
16930 -3163 5784 12932 2396 -3343 -6039 -6441 10818 6191 -16016 -17870 -12311 1825 18391 59
16916 59 6001 7866 -25342 -45403 -16667 -28240 -38719 -5290 -19930 -62124 -76323 -72352 -64704
16903 -64704 -34225 -8334 -6328 15907 8479 8456 5710 -29294 -3958 13202 3739 -20814 -21111
16890 -21111 -15210 -20039 -23730 -33300 -16043 -11698 -18457 -1319 53 -45979 -71981 -48169 -18714
16877 -18714 -30603 -55480 -58399 -28785 -15451 -43550 -55637 -50797 -49938 -48746 -64215 -76341 -61309
$$ packed form
16969a2665k9394k850M3271l585J3339P483P561N86j9949L2409N725p050n286
16956B9595j026J9524l197n484j2535l0617j2012j808j4114L427O634n126J0551
16943a6188K237M975N82Q909j7934k8325K651J7337J119j536k982J0985J5007
16930c163Q947P148j0536n739k696m02J7259m627k2207j854N559J4136J6566j8332
16916E9N942J865l3208k0061K8736j1573j0479L3429j4640m2194j4199L971P648
16903f4704L0479K5891K006K2235p428k3k746l5004K5336J7160r463k4553k97
16890b1111N901m829l691r570J7257M345o759J7138J372m6032k6002K3812K9455
16877a8714j1889k4877k919K9614J3334k8099j2087M840Q59J192j5469j2126J5032
$$ plain form
16864 -61309 -46561 -37941 -18017 -8019 -3813 -3894 -4298 -22877 -30808 -20400 -37721 -44455 -33711 -55960
16850 -55960 -75566 -94669 -87158 -64586 -30436 -18074 -52863 -47497 -17581 -7663 -6055 -4400 -7941
16837 -7941 -7262 17033 21554 34089 29795 29343 11637 12422 -4216 -25728 -35337 -12251 -20456 -41408
16823 -41408 -56306 -48051 -40726 -40283 -37290 -46480 -34509 -45047 -61964 -76707 -84462 -68740 -63949
16810 -63949 -59575 -13631 -2675 -36257 -40746 -14798 5225 -7580 -5063 -11066 -5797 -11002 2422
16797 2422 28566 38196 25289 17274 10020 -25675 -32096 -49347 -77037 -75394 -29903 -23100 -35375
16784 -35375 -26002 -2421 -8485 -2745 -19281 -17120 -14689 -16920 -29926 -23398 -11394 818 10418
16771 10418 983 -2984 -89 8133 35169 16412 -47 15984 18144 -5381 -14234 988 -15772
$$ packed form
16864f1309J4748Q620J9924R998M206q1m04j8579p931J0408j7321o734J0744k2249
16850e5960j9606j9103P511K2572L4150J2362l4789N366K9916R918J608J655l541
16837g941O79K4295M521J2535m294m52j7706P85j6638k1512r609K3086q205k0952
16823d1408j4898Q255P325M43K993r190J1971j0538j6917j4743p755J5722M791
16810f3949M374M5944J0956l3582m489K5948K0023j2805K517o003N269n205J3424
16797B422K6144R630j2907q015p254l5695o421j7251k7690J643M5491O803j2275
16784c5375R373K3581o064N740j6536K161K431k231j3006O528J2004J2212R600
16771A0418r435l967K895Q222K7036j8757j6459J6031K160k3525q853J5222j6760
$$ plain form
16758 -15772 -42649 -63534 -65106 -32607 -5514 -14427 -15260 -5091 32177 7558 -14180 2494
16746 2494 -20885 -30058 -17163 -19036 -17903 -8216 -15736 -22394 5166 -2826 -37126 -32749 4704
16733 4704 39568 35906 20567 7200 5996 6809 6897 -14567 -49896 -26907 9074 -9827 -7293
16720 -7293 -6308 -28051 -60068 -86738 -91662 -51743 -35446 -25749 -3739 -9421 -52019 -52100 -35621
16707 -35621 -29972 -38562 -29453 -28459 -21698 -25740 -24301 -26115 -16684 -21891 -10799 -23381 -31485 -42721
16693 -42721 -70370 -41991 -35173 5709 40574 30317 2326 -23220 -43956 -35699 -13875 -11358
16681 -11358 -25061 -43499 -51427 -32610 -62744 -63052 -30137 -22292 -40307 -69644 -54049 -47807 -47015
16668 -47015 -27409 -40860 -24470 -25264 -50373 -45770 -20757 14313 23125 5403 3500 -22573 -21542
$$ packed form
16758a5772k6877k0885j572L2499K7093q913q33J0169L7268k4619k1738J6674
16746B494k3379r173J2895j873J133R687p520o658K7560p992l4300M377L7453
16733D704L4864l662j5339j3367j204Q13Q8k1464l5329K2989L5981j8901K534
16720g293R85k1743l2017k6670m924L9919J6297R697K2010n682m2598q1J6479
16707c5621N649q590R109R94O761m042J439j814R431n207J1092j2582q104j1236
16693d2721k7649K8379O818M0882L4865j0257k7991k5546k0736Q257K1824K517
16681a1358j3703j8438p928J8817l0134l08L2915P845j8015k9337J5595O242P92
16668d7015J9606j3451J6390p94k5109M603K5013L5070Q812j7722j903k6073J031
$$ plain form
16655 -21542 6431 -19753 -65938 -60417 -50773 -58727 -53528 -33706 -13870 -15520 -19886 -33358 -30234
16642 -30234 -15784 10827 26410 4468 -7281 -27034 -38304 -31680 -24605 -27497 -12556 -24116
16630 -24116 -48259 -61952 -56794 -53305 -51704 -42139 -64023 -55988 -38741 -29288 -21525 -21783 -19873 -13906
16616 -13906 -17529 -24597 -15476 -13957 14480 -7597 3985 22401 36140 3934 -11671 -12717 5022
16603 5022 -525 -19373 -5102 -1657 -30070 -23804 -16915 -46510 -23553 -15629 -10797 -34331 -61065
16590 -61065 -71494 -61686 -75897 -57767 -24814 -10755 -14689 -19442 -17404 -22864 -32119 -13189 7112
16577 7112 17756 4488 13847 31542 32689 42240 49908 32063 14688 2041 -10062 -4452 -2649
16564 -2649 -8105 4580 -958 -27242 -30572 -7127 -15746 -32996 -41577 -16303 5432 -4276 3659
$$ packed form
16655b1542K7973k6184m6185N521R644p954N199J9822J9836j650m366j3472L124
16642c0234J4450K6611J5583k1942j1749j9753j1270O624P075k892J4941j1560
16630b4116k4143j3693N158L489J601R565k1884Q035J7247R453P763k58J910N967
16616a3906l623p068R121J519K8437k2077J1582J8416J3739l2206j5605j046J7739
16603E022n547j8848J4271L445k8413O266O889k9595K2957P924M832k3534k6734
16590f1065j0429R808j4211J8130L2953J4059l934m753K038n460r255J8930K0301
16577G112J0644j3268R359J7695J147R551P668j7845j7375j2647j2103N610J803
16564b649n456J2685n538k6284l330K3445q619j7250q581K5274K1735r708P935
$$ plain form
16551 3659 2631 -14470 -30917 -19365 -40769 -44109 -32405 -47183 -18632 -16304 -17349 -17889 -44439
16538 -44439 -44148 -44840 -40572 -12008 -2174 -9247 -9336 -10317 -30559 -41983 -47741 -35508 -25921 -30885 -22814
16523 -22814 -8198 -10752 -27217 -10614 -19327 -13234 -36180 -39675 -34523 -28605 -34395 -14850 -11019
16510 -11019 -9566 -27095 -44350 -33616 -12099 8223 8700 -7556 -17787 -28784 -16623 -5818
16498 -5818 -823 -6820 9843 -18863 -54632 -52772 -41703 -9957 -12184 -38296 -48681 -20169 -21679
16485 -21679 -15265 -42959 -52174 -41489 -51501 -60308 -44687 -31913 -28662 -45370 -55469 -47725 -32803
16472 -32803 -15088 -20702 2058 -8138 -16066 -8707 -25743 -35938 -41097 -34124 -39579 -48334 -41899
16459 -41899 -52000 -58114 -43761 -38054 -47159 -76844 -78444 -61317 -30311 -26974 -76195 -76600 -75305
$$ packed form
16551C659j028j7101j6447J1552k1404l340J1704j4778K8551K328j045n40k6550
16538d4439K91o92M268K8564R834p073q9r81k0242j1424n758J2233R587m964Q071
16523b2814J4616k554j6465J6603q713O093k2946l495N152N918n790J9545L831
16510a1019J453j7529j7255J0734K1517K0322M77j6256j0231j0997J2161J0805
16498e818M995n997J6663k8706l5769J860J1069L1746k227k6112j0385K8512j510
16485b1679O414k7694r215J0685j0012q807J5621J2774L251j6708j0099P744J4922
16472c2803J7715n614K2760j0196p928P359j7036j0195n159O973n455q755O435
16459d1899j0101o114J4353N707r105k9685j600J7127L1006L337m9221m05J295
$$ plain form
16446 -75305 -66346 -19854 21408 -9695 -24080 -33378 -40622 -36795 -35574 -45692 -76555 -77825 -52884
16433 -52884 -22995 -33174 -40413 -26316 -3429 -14797 -12184 -34978 -53530 -71769 -60686 -64551
16421 -64551 -45999 -63938 -93949 -75459 -36291 -23173 -17214 -13270 -37556 -59025 -69274 -57364
16409 -57364 -4739 6063 -15596 -26682 -11085 513 -37502 -79622 -78735 -50696 -24074 420
16397 420 -10709 -9140 -15520 -32360 -56954 -45514 -25349 -50779 -35188 -50839 -93083 -99241 -59104
16384 -59104 -31514 -38050 -39127 -40135 -40808 -24008 -15597 -31776 -28921 -52147 -60714 -55096 -61492 -45565
16370 -45565 -30202 -17742 -5649 -5103 -6246 -32520 -15121 24229 27111 23879 10881 -30421 -41253
16357 -41253 -36417 -32704 -45269 -48716 -29413 -26647 -31913 -34194 -49661 -38654 -20472 -30006 -39201
$$ packed form
16446g5305Q959M6492M1262l1103j4385r298p244L827J221j0118l0863j270K4941
16433e2884K9889j0179p239J4097K2887j1368K613k2794j8552j8239J1083l865
16421f4551J8552j7939l0011J8490L9168J3118N959L944k4286k1469j0249J1910
16409e7364N2625J0802k1659j1086J5597J1598l8015m2120Q87K8039K6622K4494
16397D20j1129J569o380j6840k4594J1440K0165k5430J5591j5651m2244o158M0137
16384e9104K7590o536j077j008o73J6800Q411j6179K855k3226q567N618o396J5927
16370d5565J5363J2460J2093N46j143k6274J7399L9350K882l232j2998m1302j0832
16357d1253M836L713j2565l447J9303K766n266k281j5467J1007J8182r534r195
$$ plain form
16344 -39201 -53184 -43319 -40596 -56558 -55073 -25740 -4239 -14577 -29778 -53331 -65042 -49788
16332 -49788 -16432 -18126 -26929 -43649 -45061 -55881 -47830 -28263 -18817 -46214 -49982 -9677 -13182
16319 -13182 -42149 -26036 -12635 22314 26919 -15604 -25334 -10700 -51210 -33646 -8760 -18758
16307 -18758 -6539 -9995 -8284 7698 9747 7000 7009 -18344 -34506 -67009 -69058 -36934 -41755 -25574
16293 -25574 -36061 -46470 -43424 -11244 -4414 -8338 -2566 18796 9524 -9155 11686 8686 -10715
16280 -10715 -4830 -2145 15438 3129 -24614 -37414 -46901 -21078 -5349 -20776 -24275 -638
16268 -638 16042 37231 36364 16328 4645 -5506 -15043 -10373 -22427 -10688 -14041 7385 27189
16255 27189 21317 10201 17281 19610 11834 1567 -7857 34182 44951 30060 4957 -17382 4649
$$ packed form
16344c9201j3983R865K723j5962J485K9333K1501j0338j5201k3553j1711J5254
16332d9788L3356j694q803j6720j412j0820Q051J9567R446k7397l768M0305l505
16319a3182k8967J6113J3401L4949M605m2523r730J4634m0510J7564K4886r998
16307a8758J2219l456J711J5982K049k747Rk5353j6162l2503k049L2124m821J6181
16293b5574j0487j0409L046L2180O830l924N772K1362r272j8679K0841l000j9401
16280a0715N885K685J7583j2309k7743j2800r487K5823J5729j5427l499K3637
16268f38J6680K1189q67k0036j1683j0151r537M670j2054J1739l353K1426J9804
16255B7189n872j1116P080K329p776j0267r424M2039J0769j4891k5103k2339K2031
$$ plain form
16242 4649 24522 2590 4864 14986 -5545 -13199 4532 4919 -15210 -48725 -37763 -34293 -23838
16229 -23838 -4490 1351 -8485 -1794 -2119 4100 7704 -10370 -10723 1711 16923 28305 7024
16216 7024 -7752 -10378 -30754 -3699 -5566 8767 41034 50256 19315 11012 18804 -2795 -13918
16203 -13918 -178 7050 17122 5778 -209 -38340 -52147 -44589 -18194 -5916 -17946 -30722
16191 -30722 -47406 -52037 -58916 -69262 -79772 -38529 -10669 -16986 -50358 -54289 -64349 -56241 -28101
16178 -28101 -36985 -40393 -52177 -51334 -36297 -13270 -11140 -22251 -63284 -95600 -73445 -18514 -5608
16165 -5608 9421 -9706 -31212 -67578 -68657 -39792 -16420 -28301 -27039 -30322 -27544 -22625 -49796
16152 -49796 -44963 -20707 -21553 -34362 -31322 -13860 -3521 4677 1055 -24485 -57816 -67823 -52459
$$ packed form
16242D649J9873k1932K274J0122k0531p654J7731L87k0129l3515J0962L470J0455
16229b3838J9348N841r836O691l25O219L604j8074l53J2434J5212J1382k1281
16216G024j4776k626k0376K7055j867J4333L2267R222l0941q303P792k1599j1123
16203a3918J3740P228J0072j1344n987l8131j3807P558K6395J2278j2030j2776
16191c0722j6684m631o879j0346j0510M1243K7860o317l3372l931j0060Q108K8140
16178b8101q884l408j1784Q43J5037K3027K130j1111m1033l2316K2155N4931J2906
16165e608J5029j9127k1506l6366j079K8865K3372j1881J262l283K778M919k7171
16152d9796M833K4256q46j2809L040J7462J0339Q198l622k5540l3331j0007J5364
$$ plain form
16139 -52459 -47857 -29312 -33702 -12094 -159 -51668 -39621 -16868 -13817 -19970 -21071 -9493 -16475
16126 -16475 -12581 -5676 -9003 -17678 -57775 -53531 -42198 -59938 -46777 -52551 -55143 -33037 -2395
16113 -2395 10768 -12557 -26710 -25021 -16996 -6329 -24975 -29806 -20907 -863 4877 -12020 -6154
16100 -6154 -730 -13525 -48116 -69063 -87756 -97277 -74685 -33595 -29938 -23608 3624 -10058 -21859
16087 -21859 -3444 25327 18729 -1202 17677 5264 -26983 -31965 -25692 -18048 -27168 -34397 -39407
16074 -39407 -6135 5058 -10698 -13780 -11234 -33745 -50285 -51790 -54879 -48871 -34274 -42374 -20023
16061 -20023 -19097 -67847 -58290 -48227 -30164 -21439 -39390 -31879 -13836 -18458 -38106 -41677 -65438
16048 -65438 -47249 -29050 -36973 -39104 -24042 -20084 -15449 -6772 -7178 -6032 11437 20960 15703 16371
$$ packed form
16139e2459M602J8545m390K1608J1935n1509J2047K2753L051o153j101J1578o982
16126a6475L894O905l327q675m0097M244J1333j7740J3161n774k592K2106L0642
16113b395J3163k3325j4153J689Q025J0667j8646m831Q899K0044N740j6897N866
16100f154N424j2795l4591k0947j8693r521K2592M1090L657O330K7232j3682j1801
16087b1859J8415K8771o598j9931J8879j2413l2247m982O273P644r120p229n010
16074c9407L3272J1193j5756l082K546k2511j6540j505l089O008J4597q100K2351
16061b0023R26m8750R557J0063J8063Q725j7951P511J8043m622j9648l571k3761
16048f5438J8189J8199p923k131J5062L958M635Q677m06J146J7469R523n257O68
$$ plain form
16034 16371 -1818 -30260 -19143 -19385 -20278 -12206 -33516 -24661 -29639 3075 3813 1431 -4437 3867
16020 3867 -22689 -46030 -33497 -12715 -12121 -24492 -20442 -48094 -62945 -26347 -7979 -1735 -6911
16007 -6911 -16310 -13133 13853 7795 -9697 2714 13146 17060 11519 -31571 -53506 -22959 -8359
15994 -8359 32712 42886 14661 2427 7346 -22040 -21722 -18972 -10892 -25373 -46706 -48607 -32281
15981 -32281 -23289 6006 -8381 -25686 -6132 -4470 -39603 -65982 -75518 -43403 -49290 -35831
15969 -35831 -20666 -30845 -30154 -28238 -30950 -43299 -36737 -5461 -15989 -36280 -55546 -26663 23227
15956 23227 18408 12496 9072 19765 20054 11627 -9280 -30150 -24715 -27801 -45399 -38379 -23572
15943 -23572 -31692 -8870 4592 -6340 -27958 -31682 -29419 -35575 -35853 -16011 -2463 -10533 -14127
$$ packed form
16034A6371j8189k8442J1117k42q93Q072k1310Q855m978L2714P38k382n868Q304
16020C867k6556k3341J2533K0782N94j2371M050k7652j4851L6598J8368O244n176
16007f911r399L177K6986o058j7492J2411J0432L914n541m3090k1935L0547J4600
15994h359M1071J0174k8225j2234M919k9386L18K750Q080j4481k1333j901J6326
15981c2281Q992K9295j4387j7305J9554J662l5133k6379r536L2115n887J3459
15969c5831J5165j0179O91J916k712j2349O562L1276j0528k0291j9266K8883M9890
15956B3227m819n912l424J0693K89q427k0907k0870N435l086j7598P020J4807
15943b3572q120K2822J3462j0932k1618l724K263o156k78J9842J3548q070l594
$$ plain form
15930 -14127 -17344 -24757 -22981 -23834 -16174 -22826 -12367 -24276 -36263 -53038 -29484 -45173 -66176
15917 -66176 -50368 -23133 -21018 -4614 -15049 -34598 -54293 -67039 -40449 -35096 -19602 5568
15905 5568 -10510 -27113 -26873 -4624 13225 -2512 -2965 -791 -28397 -50447 -49760 -51987 -45215 -10661
15891 -10661 -28015 -30475 -27130 -25508 -58976 -70269 -46676 -24074 7431 32977 31102 28057 -14256
15878 -14256 -40238 -29064 -1611 -161 13984 36813 77423 92471 51929 21065 21494 -11931
15866 -11931 -19950 -12616 1465 26109 21727 10030 -14038 -43236 -36258 -27103 -13285 -13698 -29707
15853 -29707 -51568 -57289 -34789 8072 2707 -17059 -32665 -43734 -32854 -24143 2322 -6081
15841 -6081 2365 7304 -16067 -9741 12076 14496 -28193 -64991 -72698 -61418 -61334 -24505 -8525
$$ packed form
15930a4127l217p413J776q53P660o652J0459j1909j1987j6775K3554j5689k1003
15917f6176J5808K7235K115J6404j0435j9549j9695j2746K6590N353J5494K5170
15905E568j6078j6603K40K2249J7849j5737m53K174k7606k2050O87k227O772L4554
15891a0661j7354k460L345J622l3468j1293K3593K2602L1505K5546j875l045m2313
15878a4256k5982J1174K7453J450J4145K2829M0610J5048m0542l0864M29l3425
15866a1931q019P334J4081K4644m382j1697k4068k9198O978R155J3818m13j6009
15853b9707k1861n721K2500M2861n365j9766j5606j1069J0880Q711K6465q403
15841f081Q446M939k3371O326K1817K420m2689l6798p707J1280Q4L6829J5980
$$ plain form
15828 -8525 -9618 -8959 -31258 -49384 -39925 -42631 -6501 7760 10160 -3285 -2220 -5656 -8039 1154
15814 1154 7572 10477 11487 -6991 -27837 -23267 -12059 -32990 -51836 -51655 -30815 -40814 -71196
15801 -71196 -72606 -35259 -13584 -25197 -6367 36089 34861 8364 -23403 -19852 -28671 -24549 15447
15788 15447 -1370 -7502 -24247 -16410 -25118 -32602 -29745 2804 -6002 -17233 -32590 -52428 -59070
15775 -59070 -75235 -68486 -48373 -32732 -44945 -60315 -38101 -49819 -46924 -25831 1523 17350
15763 17350 14552 -19709 -56871 -41054 -11321 -17400 -45794 -43790 -32832 -3284 -2402 -5454 -14728
15750 -14728 -43701 -57063 -70890 -79135 -76755 -71855 -68694 -39062 -23854 -13753 -20981 -36905 -48195
15737 -48195 -56972 -68270 -89709 -77573 -42116 -48970 -32924 -25972 -42451 -41483 -22871 -2470 7097
$$ packed form
15828h525j093O59k2299j8126R459k706L6130J4261K400j3445J065l436k383R193
15814A154O418K905J010j8478k0846M570J1208k0931j8846J81K0840r999l0382
15801g1196j410L7347K1675j1613J8830M2456j228k6497l1767L551q819M122L9996
15788A5447j6817o132j6745P837q708p484K857L2549q806j1231j5357j9838o642
15775e9070j6165O749K0113J5641j2213j5370K2214j1718K895K1093K7354J5827
15763A7350k798l4261l7162J5817K9733o079k8394K004J0958K9548Q82l052r274
15750a4728k8973j3362j3827q245K380M900L161K9632J5208J0101p228j5924j1290
15737d8195q777j1298k1439J2136L5457o854J6046O952j6479R68J8612K0401R567
$$ plain form
15724 7097 -8567 -11175 -21613 -28125 -41629 -30173 -56885 -67144 -58869 -24292 -21492 -41632 -48432
15711 -48432 -51330 -40972 -25783 -37750 -51556 -55948 -40863 -63620 -53192 -42060 -28742 -21116
15699 -21116 -6553 -3326 -10685 -19422 -24680 -19251 -26223 -27247 -20089 -22423 -18754 -17380 -20067 -50412
15685 -50412 -68913 -66193 -55885 -34752 -35218 -8977 24445 9537 7586 1121 -33296 -32079 -42080
15672 -42080 -25558 1066 -14184 -28061 -34701 1255 12154 -7935 -24817 -33208 -22616 -40945
15660 -40945 -28439 -19999 -20960 -12042 -38011 -29293 -18375 -42983 -40699 -35748 -16661 -1191 -3225
15647 -3225 -6319 -5493 -11514 -5812 2393 37315 33337 45329 32788 -5170 -44990 -75548 -79163
15634 -79163 -50844 -11083 -43419 -82733 -67612 -32836 -6088 -34936 -32754 -12453 -19582 -21769
$$ packed form
15724G097j5664k608j0438o512j3504J1456k6712j0259Q275L4577K800k0140o800
15711d8432k898J0358J5189j1967j3806m392J5085k2757J0428J1132J3318P626
15699b1116J4563L227p359q737n258N429o972j024P158k334L669J374k687l0345
15685e0412j8501K720J0308K1133m66K6241L3422j4908j951o465l4417J217j0001
15672d2080J6522K6624j5250j3877o640L5956J0899k0089j6882q391J0592j8329
15660d0945J2506Q440r61Q918k5969Q718J0918k4608K284M951J9087J5470k034
15647c225l094Q26o021N702Q205L4922l978J1992j2541l7958l9820l0558l615
15634g9163K8319L9761l2336l9314J5121L4776K6748k8848K182K0301p129k187
$$ plain form
15622 -21769 -34710 -56009 -69746 -53646 -64635 -57682 -33500 -27089 -16760 7210 -5655 -14438
15610 -14438 -16167 -27184 -35750 -33932 -13151 7070 -22835 -19627 4876 22170 35386 11498
15598 11498 10820 26978 45999 19227 22366 39334 27115 39364 22596 -7347 -28452 -14548
15586 -14548 -6702 -25391 -54665 -48950 -29505 -29005 -45264 -44606 -1138 1891 -45034 -62093 -50472
15573 -50472 -52581 -49988 -55799 -43564 -25452 -30497 -30677 -36475 -11250 -18501 -16926 15297 27400
15560 27400 16169 -41071 -70349 -61689 -48117 -36492 -34594 -39732 -47957 -19296 -10000 -23646 -21516
15547 -21516 -32902 -33992 -13728 -7116 -15018 6310 12309 -1828 -18065 -27193 -40886 -71987 -76031
15534 -76031 -46987 -19092 -5549 -23661 -14639 -12535 -25566 -28808 -24498 -18963 -19081 -23831 -3936
$$ packed form
15622b1769j2941k1299j3737J6100j0989O953K4182O411J0329K3970j2865q783
15610a4438j729j1017q566J818K0781K0221k9905L208K4503J7294J3216k3888
15598A1498o78J6158J9021k6772L139J6968j2219J2249j6768k9943k1105J3904
15586a4548P846j8689k9274N715J9445N00j6259O58M3468L029m6925j7059J1621
15573e0472k109K593n811J2235J8112n045j80n798K5225p251J575L2223J2103
15560B7400j1231n7240k9278Q660J3572J1625J898n138q225K8661R296j3646K130
15547b1516j1386j090K0264O612p902K1328N999j4137j6237r128j3693l1101m044
15534g6031K9044K7895J3543j8112R022K104j3031l242M310N535j18m750J9895
$$ plain form
15521 -3936 -8945 -13379 5545 16471 2995 -17714 -28730 -18712 -6666 -11163 -15262 -19368 -22429
15508 -22429 -7561 -6793 -5231 -11729 838 -278 -46057 -54220 -33018 -25082 -31711 -54482 -24596
15495 -24596 3949 19121 13105 15101 -11931 -40527 -46787 -22847 -5960 -2072 26508 37713
15483 37713 3836 -6979 2465 9758 -2255 -30588 -24974 -4148 2341 6418 -10067 -3965 -2185
15470 -2185 -11117 -27708 -9794 -4564 27924 11559 19646 4791 -22333 -30380 -41774 -15801 -17055
15457 -17055 -10315 -33253 -54650 -52430 -60364 -66305 -38774 -22729 -25967 -14772 -448 7247 -1511
15444 -1511 -36282 -45199 -28900 -13413 -1618 -23324 -46057 -49908 -34625 -47308 -39615 -28495
15432 -28495 -32470 -27205 -18065 -12804 -139 -25899 -39672 -50307 790 30459 17950 -2629
$$ packed form
15521c936n009m434J8924J0926j3476k0709j1016J0018J2046m497m099m106l061
15508b2429J4868P68J562o498J2567j116m5779q163K1202P936o629k2771K9886
15495b4596K8545J5172o016J996k7032k8596o260K3940J6887L888K8580J1205
15483C7713l3877j0815R444P293j2013k8333N614K0826O489M077j6485O102J780
15470b185q932j6591J7914N230L2488j6365Q087j4855k7124q047j1394K5973j254
15457a7055O740k2938k1397K220p934n941K7531J6045l238J1195J4324P695q758
15444a511l4771q917J6299J5487J1795k1706k2733l851J5283j2683P693J1120
15432b8495l975N265R140N261J2665k5760j3773j0635N1097K9669j2509k0579
$$ plain form
15420 -2629 -29062 -34410 -35437 -41879 -56075 -24480 2584 26262 15946 -4265 -7263 -15710 -36401
15407 -36401 -55362 -49427 -40096 -34987 -8666 -16136 -27863 -27482 -41332 -75599 -93478 -60933 -39881
15394 -39881 -20251 -16344 -28280 -29124 -7062 -26035 -22290 -5429 -1068 -12438 -2827 10833 19045
15381 19045 -244 -1010 -6348 6092 -18278 -33533 -29001 -25921 -25311 -2299 18462 2117 -19033
15368 -19033 -15244 -8771 -20480 -18083 -18499 -17679 -57768 -72700 -69480 -69019 -60984 -14547 2966 3511
15354 3511 -14296 -11925 -8914 -17779 -22569 -34384 -29983 272 -2425 -5001 -2923 -4654 -3592 -35344
15340 -35344 -42527 -17644 6859 -6288 -20600 -20898 -27325 -2401 18425 9915 15733 3073 -82
15327 -82 -10020 -16364 -3065 -6305 6878 -14817 -33749 -39584 -30176 -22960 -2312 16085 16689 -4974
$$ packed form
15420b629k6433n348j027o442j4196L1595K7064K3678j0316k0211k998q447k0691
15407c6401j8961N935R331N109K6321p470j1727L81j3850l4267j7879L2545K1052
15394c9881J9630L907j1936q44K2062j8973L745J6861M361j1370R611J3660Q212
15381A9045j9289p66n338J2440k4370j5255M532L080O10K3012K0761j6345k1150
15368a9033L789O473j1709K397m16Q20m0089j4932L220M61Q035M6437J7513N45
15354C511j7807K371L011q865m790j1815M401L0255k697k576K078j731J062l1752
15340c5344p183K4883K4503j3147j4312k98o427K4924K0826q510N818j2660l155
15327h2r938o344J3299l240J3183k1695j8932n835R408P216K0648J8397O04k1663
$$ plain form
15313 -4974 -14096 8127 20081 37381 70792 72075 39787 32554 37965 48704 28783 28372 34529
15300 34529 30350 35212 53274 45724 14541 -6473 -3493 9708 19938 46188 39821 28293 15175
15287 15175 15698 14762 12325 11197 13494 -3666 291 9157 -3829 12585 19098 -21474 -9290 -10559
15273 -10559 -20867 524 -7628 -24000 -7861 10323 -5078 -12690 -18108 -17885 -40354 -59959 -55900
15260 -55900 -51833 -52765 -11828 1681 -30855 -30332 -29831 -24756 -29091 -35916 -7681 19844 19679 -970
15246 -970 -5804 -12931 -34393 -36717 -29802 -1557 7553 9355 22886 46481 47258 24258 -2113 -44419
15232 -44419 -56195 -49812 -55175 -24965 -30412 -23392 -38979 -43571 -17153 -18142 -19369 4104 -7822
15219 -7822 -23447 -38614 -13252 -8805 -20925 -5919 20068 7667 -19795 -25778 -43685 -40193
$$ packed form
15313d974r122K2223J1954J7300L3411J283l2288p233N411J0739j9921m11O157
15300C4529m179M862J8062p550l1183k1014K980J3201J0230K6250o367j1528j3118
15287A5175N23r36k437j128K297j7160L957Q866j2986J6414O513m0572J2184j269
15273a0559j0308K1391q152j6372J6139J8184j5401p612n418K23k2469j9605M059
15260e5900M067r32M0937J3509l2536N23N01N075m335o825K8235K7525j65k0649
15246i70m834p127k1462k324O915K8245R110J802J3531K3595P77k3000k6371m2306
15232d4419j1776O383n363L0210n447P020j5587m592K6418r89j227K3473j1926
15219g822j5625j5167K5362M447j2120J5006K5987j2401k7462n983j7907L492
$$ plain form
15207 -40193 -49444 -11115 12664 1418 -20993 -31867 -35015 -55493 -56453 -60900 -50888 -18648 -7970
15194 -7970 -3779 6440 25484 19618 1792 -2227 -24268 -41765 -12153 6864 23442 53621
15182 53621 59227 56050 15170 -20663 -15621 14318 10729 -8354 -22719 -31733 -36621 -37157 -10836
15169 -10836 20791 -443 -24064 -24051 -30401 -41128 -63969 -45160 -28790 -39890 -70472 -68286 -37892
15156 -37892 -29018 -12204 -43152 -52544 -36879 -3773 10985 21240 20458 16647 5795 7796 22512
15143 22512 24235 22820 31129 38990 32798 27468 6110 2310 -11807 -3592 3326 -30664 -44771
15130 -44771 -40738 -23758 -4649 11775 23276 17546 20848 33881 7884 2286 13972 10527 9213
15117 9213 4833 11847 19858 18406 34188 27808 22642 23320 17758 24461 55241 59037 38804 21789
$$ packed form
15207d0193r251L8329K3779j1246k2411j0874l148k0478r60m447J0012L2240J0678
15194g970M191J0219J9044n866j7826m019k2041j7497K9612J9017J6578L0179
15182E3621N606l177m0880l5833N042K9939l589j9083j4365r014m888n36K6321
15169a0836L1627k1234k3621J3o350j0727k2841J8809J6370j1100l0582K186L0394
15156c7892Q874J6814l0948r392J5665L3106J4758J0255p82l811j0852K001J4716
15143B2512J723j415Q309P861o192n330k1358l800j4117Q215O918l3990j4107
15130d4771M033J6980J9109J6424J1501n730L302J3033k5997n598J1686l445j314
15117I213m380P014Q011j452J5782o380n166O78n562O703L0780L796k0233j7015
$$ plain form
15103 21789 36202 41896 35683 16495 827 -7085 -3993 -21708 -21918 -34352 -33962 -37115 -45368 -24889
15089 -24889 -15724 26367 38044 13478 -20165 -10828 -5713 17110 11957 -22082 -34841 -59771
15077 -59771 -39085 -3528 9126 -6221 21904 10174 9211 37632 42393 10608 4555 14776
15065 14776 6859 -19879 -29999 -48900 -51160 -31219 -15803 -5565 -10765 -13781 -814 24864
15053 24864 27694 39062 26504 14275 11028 6743 -682 7809 -8652 -3449 31169 15855 17463
15040 17463 30546 17727 -25837 -37916 -27898 -30664 -49199 -20627 -10110 1206 4977 2771
15028 2771 -6769 -1643 23831 41910 32606 33373 52424 60671 52186 21956 32182 55899 27420
15015 27420 20872 24791 -38644 -64020 -44316 -18594 -29472 1907 33280 5039 -1067 6921
$$ packed form
15103B1789J4413N694o213j9188j5668p912L092j7715k10j2434L90l153q253K0479
15089b4889R165M2091J1677k4566l3643R337N115K2823n153l4039j2759k4930
15077e9771K0686L5557J2654j5347K8125j1730r63K8421M761l1785o053J0221
15065A4776p917k6738j0120j8901k260J9941J5416J0238n200l016J2967K5678
15053B4864K830J1368j2558j2229l247m285p425Q491j6461N203L4618j5314J608
15040A7463J3083j2819m3564j2079J0018k766j8535K8572J0517J1316L771k206
15028B771r540N126K5474J8079r304P67J9051Q247q485l0230J0226K3717k8479
15015B7420o548L919o3435k5376J9704K5722j0878L1379L1373k8241o106P988
$$ plain form
15003 6921 18159 22602 51080 50946 35567 8633 17195 18879 -14232 -32214 -59334 -27163 9717
14990 9717 25630 26168 -4840 -35001 -48604 -19948 -8163 -22129 -11897 19439 41039 50884
14978 50884 23014 20182 10903 20666 38963 37347 45361 35946 24501 55929 78536 60476 42709
14965 42709 41087 70216 49259 9660 -11887 -10211 -621 -11077 -22601 -48619 -50619 -54692 -25549
14952 -25549 7260 10562 -13847 1304 45505 52693 54519 51949 40571 13519 13445 13313 12718 11350
14938 11350 13740 -6672 -18035 3117 19251 6195 16595 -14117 -14975 17209 37387 12608
14926 12608 11029 5347 12299 28493 22320 8290 4312 38293 40575 44215 28743 14132 13419
14913 13419 16621 26033 20412 9145 22037 37956 70023 67635 42435 34391 24239 40211 48032
$$ packed form
15003F921J1238M443K8478j34j5379k6934Q562J684l3111j7982k7120L2171L6880
14990I717J5913N38l1008l0161j3603K8656J1785j3966J0232L1336K1600R845
14978E0884k7870k832r279R763J8297j616Q014r415j1445L1428K2607j8060j7767
14965D2709j622K9129k0957l9599k1547J676R590j0456j1524k6018k000m073K9143
14952b5549L2809L302k4409J5151M4201P188J826k570j1378k7052p4j32n95j368
14938A1350K390k0412j1363K1152J6134j3056J0400l0712q58L2184K0178k4779
14926A2608j579n682O952J6194o173j4030l978L3981K282L640j5472j4611p13
14913A3419L202R412n621j1267J2892J5919L2067k388k5200q044j0152J5972P821
$$ plain form
14900 48032 56815 50658 35013 32702 28196 29201 48141 69882 40374 27725 32370 52285 30371
14887 30371 17531 28071 19972 34468 73874 78556 67693 45092 48820 53365 66059 72418 69985
14874 69985 46673 14292 24268 53597 87720 69368 35526 35721 21673 27851 34726 34171 62497
14861 62497 39459 13227 -1884 21558 53267 46689 39968 22672 32346 39754 16390 22534 18396
14848 18396 18428 15352 5387 -12481 1435 18569 33408 47509 64336 99611 107773 84927 80273
14835 80273 87743 102658 119404 126872 124594 136834 113377 64909 69144 67861 46836 56301 72429
14822 72429 54604 44501 16869 15273 -3319 643 41466 41716 25081 36655 23720 2530
14810 2530 9705 17763 -9099 1451 19858 3152 -184 21447 67971 83825 74151 73335 101819
$$ packed form
14900D8032Q783o157j5645k311m506J005J8940K1741k9508j2649M645J9915k1914
14887C0371j2840J0540q099J4496L9406M682j0863k2601L728M545J2694O359k433
14874F9985k3312l2381R976K9329L4123j8352l3842J95j4048O178O875n55K8326
14861F2497k3038k6232j5111K3442L1709o578o721j7296R674P408k3364O144m138
14848A8396L2l076r965j7868J3916J7134J4839J4101J6827L5275Q162k2846m654
14835H0273P470J4915J6746P468k278J2240k3457m8468M235j283k1025R465J6128
14822G2429j7825j0103k7632j596j8592L962M0823K50j6635J1574j2935k1190
14810B530P175Q058k6862J0550J8407j6706l336K1631M6524J5854r674q16K8484
$$ plain form
14797 101819 99946 73741 75393 51670 55559 80821 94433 92082 84638 92185 65370 67934 88402
14784 88402 95674 85719 76440 77230 81252 78866 55932 64188 91137 110949 97200 76488 64022
14771 64022 37327 34232 36298 45233 52906 70957 82828 77562 91665 98489 72240 70899 70263
14758 70263 63151 36915 23628 59207 48688 32299 51768 52657 52424 67536 53924 37266 48714
14745 48714 36760 30041 32129 21336 20341 40914 65239 62150 52407 60091 67170 43647 43476 77910
14731 77910 88865 80067 66690 42907 28759 70665 102388 130192 157673 137915 114481 115869
14719 115869 116029 117583 106226 76500 78880 110133 124323 91634 81547 91429 82506 82263 80851
14706 80851 84599 91922 111089 132153 136177 103546 89619 82432 102790 117411 120235 107977 111445
$$ packed form
14797A01819j873k6205J652k3723L889K5262J3612k351p444P547k6815K564K0468
14784H8402P272r955r279P90M022k386k2934Q256K6949J9812j3749k0712j2466
14771F4022k6695l095K066Q935P673J8051J1871n266J4103O824k6249j341o36
14758G0263p112k6236j3287L5579j0519j6389J9469Q89k33J5112j3612j6658J1448
14745D8714j1954o719K088j0793r95K0573K4325l089r743P684P079k3523j71L4434
14731G7910J0955q798j3377k3783j4148M1906L1723K7804K7481j9758k3434J388
14719A15869J60J554j1357k9726K380L1253J4190l2689j0087R882q923k43j412
14706H0851L748P323J9167K1064M024l2631j3927p187K0358J4621K824j2258L468
$$ plain form
14693 111445 104927 99509 98430 108051 97529 96898 97283 102120 127412 122190 99409 99907 82833 84895
14679 84895 91643 112551 113530 118213 120357 105262 107930 79200 88034 110133 75973 85547 115547
14666 115547 137910 192894 234874 243567 254237 270338 294043 295955 330176 396455 492529 610223
14654 610223 757652 925731 1131947 1367761 1607196 1813693 1949206 1995068 1956530 1876172
14644 1876172 1747542 1576637 1400285 1190519 984754 803636 624774 481344 374709
14635 374709 338060 353983 377174 374902 324725 279282 267353 266994 274511 250620 228216 242297
14623 242297 259869 242329 209044 203294 217565 227782 231335 208002 168250 135812 119984 121557
14611 121557 158759 162324 152179 136931 120606 123481 120621 136768 124940 108509 105185 107484
$$ packed form
14693A11445o518n418j079R621j0522o31L85M837K5292n222k2781M98j7074K062
14679H4895O748K0908R79M683K144j5095K668k8730Q834K2099l4160R574L0000
14666A15547K2363N4984M1980Q693J0670J6101K3705J912L4221O6279R6074J17694
14654F10223J47429J68079K06216K35814K39435K06497J35513M5862l8538q0358
14644A876172j28630j70905j76352k09766k05765j81118j78862j43430j06635
14635C74709l6649J5923K3191k272n0177m5443j1929l59P517k3891k2404J4081
14623B42297J7572j7540l3285n750J4271J0217L553k3333l9752l2438j5828J573
14611A21557L7202L565j0145j5248j6325K875k860J6147j1828j6431l324K299
$$ plain form
14599 107484 117906 144272 149867 137731 126858 141980 163473 156700 160334 172389 153822 164727
14587 164727 167851 170812 154627 143829 165049 184359 209979 196304 194263 194319 185385 166846 140855
14574 140855 143686 157417 151657 153409 140441 137598 143377 166545 180963 171688 158134 165429 206763
14561 206763 206399 180335 150151 137800 145121 133123 132643 151551 149603 143150 139038 131580 132450 112983
14547 112983 112732 146563 160126 152059 159939 181156 170315 163656 159361 152161 146568 136781 141724
14534 141724 115368 89181 72290 87404 118575 150852 150635 143737 144108 123778 124554 145525 148983
14521 148983 135161 131810 123855 123328 109749 115593 152254 153986 133433 128205 105885 103711 97267
14508 97267 105141 125985 126857 128613 107656 108846 127648 115496 118569 149167 176375 165508 159805
$$ packed form
14599A07484J0422K6366N595j2136j0873J5122K1493o773L634J2055j8567J0905
14587A64727L124K961j6185j0798K1220J9310K5620j3675k041N6q934j8539k5991
14574A40855K831J3731n760J752j2968k843N779K3168J4418r275j3554P295M1334
14561B06763l64k6064l0184j2351P321j1998m80J8908j948o453m112p458Q70j9467
14547A12983k51L3831J3563q067P880K1217j0841o659m295p200n593r787M943
14534A41724k6356k6187j6891J5114L1171L2277k17o898L71k0330P76K0971L458
14521A48983j3822l351p955n27j3579N844L6661J732k0553n228k2320k174o444
14508I7267P874K0844Q72J756k0957J190J8802j2152L073L0598K7208j0867n703
$$ plain form
14495 159805 160632 145654 130432 135380 149718 151312 168301 185896 172415 199996 221826 236171
14483 236171 239459 242336 219388 224229 245861 264907 256185 257240 240793 212881 204657 205101 210841
14470 210841 209960 221919 231226 243891 235284 218820 243364 250042 244829 247492 269693 295554 294588
14457 294588 288071 284735 298824 277457 295105 312394 303732 311307 319731 332684 330253 329156 307630
14444 307630 327276 309404 324218 301009 308902 322328 293028 315061 301958 266111 272439 281543
14432 281543 262552 253954 292289 281397 293870 297726 313375 280078 300636 348028 374941 355288
14420 355288 337564 342403 350474 319907 315280 336285 364689 356363 319921 343826 368909 349120
14408 349120 334914 332683 330861 336407 337293 323467 326806 305338 294528 264205 207228 158768 155569
$$ packed form
14495A59805Q27j4978j5222M948J4338J594J6989J7595j3481K7581K1830J4345
14483B36171L288K877k2948M841K1632J9046q722J055j6447k7912q224M44N740
14470B10841q81J1959R307J2665q607j6464K4544O678n213K663K2201K5861r66
14457B94588o517l336J4089k1367J7648J7289q662P575Q424J2953k431j097k1526
14444C07630J9646j7872J4814k3209P893J3426k9300K2033j3103l5847O328R104
14432B81543j8991q598L8335j0892J2473L856J5649l3297K0558M7392K6913j9653
14420C55288j7724M839Q071l0567m627K1005K8404q326l6442K3905K5083j9789
14408C49120j4206k231j822N546Q86j3826L339k1468j0810l0323n6977m8460l199
$$ plain form
14395 155569 120516 84443 91036 78021 59069 27210 21082 59243 116565 177325 244962 299942
14383 299942 292893 297272 302960 305294 291705 270289 273320 288764 283900 290693 334723 341060 281363
14370 281363 229780 262120 273380 258758 267209 275066 311272 302628 290380 308099 310030 325313
14358 325313 319809 322696 320142 325172 341930 359860 368463 377386 353044 343137 322818 363401 375556
14345 375556 369969 370050 395556 409902 430782 441548 437232 426464 423515 439698 425619 369016 343559
14332 343559 350482 359202 364851 406127 452994 489838 503900 523845 564677 597199 610487 627738
14320 627738 643848 649825 671787 666778 663316 664819 646140 646188 654523 667104 684353 677383 673920
14307 673920 712441 730167 705222 675784 682170 725524 744277 764049 765180 790371 800765 786669
$$ packed form
14395A55569l5053l6073O593j3015j8952l1859o128L8161N7322O0760O7637N4980
14383B99942p049M379N688K334j3589k1416L031J5444m864O793M4030O337n9697
14370B81363n1583L2340J1260j4622Q451P857L6206q644j2248J7719J931J5283
14358C25313n504K887k554N030J6758J7930Q603Q923k4342r907k0319M0583J2155
14345C75556n587Q1K5506J4346K0880J0766m316j0768k949J6183j4079n6603k5457
14332C43559O923Q720N649M1276M6867L6844J4062J9945M0832L2522J3288J7251
14320F27738J6110N977K1962n009l462J503j8679M8Q335J2581J7249o970l463
14307F73920L8521J7726k4945k9438O386M3354J8753J9772J131K5191J0394j4096
$$ plain form
14295 786669 820883 844827 814854 830398 849507 859322 866855 862897 845215 838553 840944 832505 850484
14282 850484 855606 833678 844737 893216 916710 920416 918429 917984 932207 937346 950435 964784 992270
14269 992270 1010426 1003424 985220 981488 989798 970813 983473 1005626 1058058 1104179 1119164 1127824
14257 1127824 1157018 1223188 1276959 1327569 1356034 1416405 1488927 1550436 1582936 1613409 1699033
14246 1699033 1789759 1899242 1994502 2042661 2127819 2233326 2330424 2415158 2471438 2537142 2576905
14235 2576905 2670495 2799655 2941830 3129124 3342952 3592583 3897983 4262244 4683148 5129918
14225 5129918 5622305 6119399 6728169 7414594 8223466 9210444 10398262 11824845 13553983
14216 13553983 15631164 18079227 20979398 24354433 28379134 33317166 39715383 48531618
$$ packed form
14295G86669L4214K3944k9973J5544J9109R815P533l958j7682o662K391q439J7979
14282H50484N122k1928J1059M8479K3494L706j987m45J4223N139J3089J4349K7486
14269I92270J8156p002j8204l732Q310j8985J2660K2153N2432M6121J4985Q660
14257A127824K9194O6170N3771N0610K8465O0371P2522O1509L2500L0473Q5624
14246A699033R0726J09483R5260M8159Q5158J05507R7098Q4734N6280O5704L9763
14235B576905R3590J29160J42175J87294K13828K49631L05400L64261M20904M46770
14225E129918M92387M97094O08770O86425Q08872R86978J187818J426583J729138
14216A3553983K077181K448063K900171L375035M024701M938032O398217Q816235
$$ plain form
14208 48531618 61267252 79624016 104217671 134762394 170386442 209161892 249066460
14201 249066460 286147769 315957063 335811958 342772263 336711355 317633880 288481049
14194 288481049 252836504 214924746 177987560 144021941 115735313 94006685 78945654
14187 78945654 68873607 61860280 56654771 52549063 49051157 45920472 43040005 40345435
14179 40345435 37795656 35361405 33048443 30871624 28838993 27018790 25395025 23978989
14171 23978989 22734400 21615406 20652830 19767304 18995537 18290391 17591687 16923187 16278903
14162 16278903 15683424 15092266 14517834 13979829 13435420 12909457 12404295 11948477 11474466
14153 11474466 11054637 10655681 10313443 10000388 9684328 9393908 9113481 8870442 8633606
$$ packed form
14208D8531618J2735634J8356764K4593655L0544723L5624048L8775450L9904568
14201B49066460L7081309K9809294J9854895O960305o060908j9077475k9152831
14194B88481049l5644545l7911758l6937186l3965619k8286628k1728628j5061031
14187G8945654j0072047p013327n205509m105708l497906l130685k880467k694570
14179D0345435k549779k434251k312962k176819k032631j820203j623765j416036
14171B3978989j244589j118994r62576q85526p71767p05146o98704o68500o44284
14162A6278903n95479n91158n74432n38005n44409n25963n05162m55818m74011
14153A1474466m19829l98956l42238l13055l16060k90420k80427k43039k36836
$$ plain form
14144 8633606 8372012 8155006 7950434 7735956 7525000 7343755 7165263 6978936 6775479
14135 6775479 6602342 6427697 6239844 6064068 5908053 5748792 5628423 5471224 5323331
14126 5323331 5179289 5023780 4860002 4741553 4637841 4541206 4420422 4321846 4241125 4181406
14116 4181406 4142421 4094168 4002357 3957161 3882143 3816213 3773648 3746443 3717978 3668434 3617369
14105 3617369 3557317 3525087 3505590 3472897 3430952 3391922 3351147 3287892 3211341 3149701 3106915
14094 3106915 3032028 2942757 2896253 2833275 2780015 2762990 2685488 2628250 2591908 2546971 2496077
14083 2496077 2457133 2425025 2375373 2324715 2298949 2299631 2295341 2279321 2269535 2278679 2263839 2258714
14071 2258714 2259429 2266990 2285645 2291342 2291605 2270277 2243953 2250966 2260477 2226583 2203857 2224984 2227553
$$ packed form
14144H633606k61594k17006k04572k14478k10956j81245j78492j86327k03457
14135F775479j73137j74645j87853j75776j56015j59261j20369j57199j47893
14126E323331j44042j55509j63778j18449j03712r6635j20784r8576q0721n9719
14116D181406l8985m8253r1811m5196p5018o5930m2565k7205k8465m9544n1065
14105C617369o0052l2230j9497l2693m1945l9030m0775o3255p6551o1640m2786
14094C106915p4887q9271m6504o2978n3260j7025p7502n7238l6342m4937n0894
14083B496077l8944l2108m9652n0658k5766O82m290j6020r786R144j4840n125
14071B258714P15P561J8655N697K63k1328k6324P013R511l3894k2726K1127K569
$$ plain form
14058 2227553 2234415 2270563 2292274 2304446 2342268 2334389 2330261 2333153 2327724 2320780 2321697 2338157 2358800
14045 2358800 2343629 2339972 2353237 2363653 2371221 2361235 2376139 2393036 2428390 2439754 2455403 2460496
14033 2460496 2444128 2444978 2457981 2488313 2533471 2526365 2524601 2567926 2574189 2582412 2625267 2643938
14021 2643938 2668686 2675375 2692238 2737098 2755463 2768475 2803049 2808516 2881202 2929353 2990376 3076440
14009 3076440 3138362 3199460 3239548 3220562 3191588 3183763 3182279 3168427 3135795 3122971 3108358 3064852
13997 3064852 3046369 3061321 3081521 3105254 3124281 3132589 3155799 3151094 3165485 3175402 3180149 3198688
13985 3198688 3216505 3238610 3242809 3283883 3329503 3338929 3360692 3390457 3419297 3464448 3506597 3542913
13973 3542913 3570954 3573480 3614009 3659477 3675225 3716292 3762103 3794922 3812965 3833695 3834619 3839771
$$ packed form
14058B227553O862L6148K1711J2172L7822p879m128K892n429o944R17J6460K0643
14045B358800j5171l657J3265J0416P568r986J4904J6897L5354J1364J5649N093
14033B460496j6368Q50J3003L0332M5158p106j764M3325O263Q223M2855J8671
14021B643938K4748O689J6863M4860J8365J3012L4574N467P2686M8151O1023Q6064
14009C076440O1922O1098M0088j8986k8974p825j484j3852l2632j2824j4613m3506
13997C064852j8483J4952K0200K3733J9027Q308K3210m705J4391R917M747J8539
13985C198688J7817K2105M199M1074M5620R426K1763K9765K8840M5151M2149L6316
13973C542913K8041K526M0529M5468J5748M1067M5811L2819J8043K0730R24N152
$$ plain form
13961 3839771 3870436 3926724 3962018 4008357 4037096 4051271 4099624 4144909 4168483 4194534 4230564
13950 4230564 4259568 4283803 4323746 4336875 4348029 4398358 4426995 4432948 4460164 4475096 4508792
13939 4508792 4564750 4597925 4614686 4649700 4687698 4709161 4758320 4794102 4806931 4826113 4869967
13928 4869967 4896731 4940639 4989602 5026336 5037573 5077475 5130691 5176177 5223051 5272483 5306503
13917 5306503 5322276 5344431 5377888 5455499 5501864 5520926 5516511 5560433 5587683 5630556 5691544
13906 5691544 5756252 5820861 5900048 5922481 5909685 5908502 5944000 5989623 6052878 6094354 6113831
13895 6113831 6140937 6173607 6217921 6267646 6331599 6356281 6400567 6420314 6475848 6559800 6603935
13884 6603935 6622659 6612217 6625991 6685793 6745271 6771497 6790780 6816892 6844839 6890595 6911270
$$ packed form
13961C839771L0665N6288L5294M6339K8739J4175M8353M5285K3574K6051L6030
13950D230564K9004K4235L9943J3129J1154N0329K8637N953K7216J4932L3696
13939D508792N5958L3175J6761L5014L7998K1463M9159L5782J2829J9182M3854
13928D869967K6764M3908M8963L6734J1237L9902N3216M5486M6874M9432L4020
13917E306503J5773K2155L3457P7611M6365J9062m415M3922K7250M2873O0988
13906E691544O4708O4609P9187K2433j2796j183L5498M5623O3255M1476J9477
13895F113831K7106L2670M4314M9725O3953K4682M4286J9747N5534Q3952M4135
13884F603935J8724j0442J3774N9802N9478K6226J9283K6112K7947M5756K0675
$$ plain form
13873 6911270 6951994 7005466 7028682 7064143 7076978 7078152 7109726 7121858 7156285 7214781 7241873
13862 7241873 7239976 7263082 7259610 7259751 7300734 7328022 7369767 7406282 7415246 7399002 7397085 7413085
13850 7413085 7427236 7443344 7465199 7479332 7496766 7511613 7518737 7540386 7574059 7591056 7588453 7566975
13838 7566975 7549903 7560377 7591331 7607757 7618591 7611276 7583029 7557211 7552695 7559724 7559433 7558241
13826 7558241 7566824 7573148 7552202 7530877 7540958 7510161 7507130 7520501 7502799 7487887 7458143 7444581
13814 7444581 7414836 7377812 7373006 7362263 7327791 7315743 7313577 7293929 7296109 7284344 7243449 7171610
13802 7171610 7152669 7146377 7138283 7116968 7070928 7038405 7023770 7000493 6971185 6930831 6936388 6906185
13790 6906185 6901572 6874948 6858803 6804703 6764187 6747204 6730862 6675746 6616346 6597759 6537349
$$ packed form
13873F911270M0724N3472K3216L5461J2835J174L1574J2132L4427N8496K7092
13862G241873j897K3106l472J41M0983K7288M1745L6515Q964j6244j917J6000
13850G413085J4151J6108K1855J4133J7434J4847P124K1649L3673J6997k603k1478
13838G566975j7072J0474L0954J6426J0834p315k8247k5818m516P029k91j192
13826G558241Q583O324k0946k1325J0081l0797l031J3371j7702j4912k9744j3562
13814G444581k9745l7024m806j0743l4472j2048k166j9648K180j1765m0895p1839
13802G171610j8941o292q094k1315m6040l2523j4635k3277k9308m0354N557l0203
13790F906185m613k6624j6145n4100m0516j6983j6342n5116n9400j8587o0410
$$ plain form
13779 6537349 6485386 6452715 6446701 6422062 6417344 6407497 6359212 6285065 6238699 6217280 6225436 6229594
13767 6229594 6212879 6169523 6113893 6109352 6094479 6042344 6033835 6029157 5965469 5905916 5870884 5846208
13755 5846208 5834983 5837466 5854348 5904671 6000514 6119674 6242297 6401243 6588090 6771107
13745 6771107 6927494 7022895 7061855 7029515 6885286 6686019 6482106 6258448 6028058 5796351
13735 5796351 5587555 5412114 5283112 5191820 5138437 5058453 5001305 4972561 4923941 4872168 4842597
13724 4842597 4814921 4749374 4670792 4601842 4572329 4538243 4515270 4483562 4423225 4381983 4361864
13713 4361864 4326944 4282374 4241253 4220544 4171856 4119850 4082803 4062475 4035972 4023455 4011500
13702 4011500 3982012 3922502 3861218 3860427 3848889 3838276 3808248 3754318 3721266 3707008 3672782 3642731
$$ packed form
13779F537349n1963l2671o014k4639m718r847m8285p4147m6366k1419Q156M158
13767F229594j6715m3356n5630m541j4873n2135q509m678o3688n9553l5032k4676
13755E846208j1225K483J6882N0323R5843J19160J22623J58946J86847J83017
13745F771107J56387R5401L8960l2340j44229j99267k03913k23658k30390k31707
13735E796351k08796j75441j29002r1292n3383p9984n7148k8744m8620n1773k9571
13724D842597k7676o5547p8582o8950k9513l4086k2973l1708o0337m1242k0119
13713D361864l4920m4570m1121k0709m8688n2006l7047k0328k6503j2517j1955
13702D011500k9488n9510o1284p91j1538j0613l0028n3930l3052j4258l4226l0051
$$ plain form
13690 3642731 3614420 3602799 3559469 3534266 3495749 3452447 3427650 3421309 3405220 3405669 3362940 3290914
13678 3290914 3281010 3267749 3227167 3203593 3178484 3179357 3177147 3162108 3094007 3042171 3039384 3037526
13666 3037526 3036406 3010723 2961299 2942621 2938125 2896448 2865901 2861561 2839541 2823218 2820407 2833444
13654 2833444 2802792 2779672 2714262 2678728 2650538 2655813 2666957 2669990 2618485 2595608 2602527 2607073
13642 2607073 2587040 2568199 2564777 2527685 2523564 2511131 2483671 2463529 2429803 2427200 2378517 2375969
13630 2375969 2381997 2355850 2321604 2299837 2285449 2295315 2284576 2260218 2253488 2239309 2218936 2180443
13618 2180443 2126029 2141195 2155480 2127751 2144904 2163384 2132644 2110044 2106064 2056230 2002802
13607 2002802 1986104 1966934 1970790 1977702 1974700 1942826 1952133 1939694 1933882 1925633 1890906 1878084
$$ packed form
13690C642731k8311j1621m3330k5203l8517m3302k4797o341j6089M49m2729p2026
13678C290914r904j3261m0582k3574k5109Q73k210j5039o8101n1836k787j858
13666C037526j120k5683m9424j8678m496m1677l0547m340k2020j6323k811J3037
13654B833444l0652k3120o5410l5534k8190N275J1144L033n1505k2877O919M546
13642B607073k0033j8841l422l7092m121j2433k7460k0142l3726k603m8683k548
13630B375969O028k6147l4246k1767j4388R866j0739k4358o730j4179k0373l8493
13618B180443n4414J5166J4285k7729J7153J8480l0740k2600l980m9834n3428
13607B002802j6698j9170L856O912l002l1874R307j2439n812q249l4727j2822
$$ plain form
13595 1878084 1882331 1858536 1853135 1836326 1805816 1811462 1834039 1836738 1822568 1770189 1758857 1733394
13583 1733394 1723304 1717878 1718387 1705743 1689174 1685210 1675647 1670410 1669429 1657792 1667247 1659726 1658944 1668948
13569 1668948 1670822 1615689 1577526 1572091 1581605 1594833 1601919 1593461 1580474 1574053 1550398 1526438
13557 1526438 1515316 1520164 1501358 1491137 1470805 1423912 1383136 1389585 1408936 1402777 1382356 1395550
13545 1395550 1391481 1382811 1388689 1371051 1368712 1379600 1361394 1357669 1377812 1391934 1381598 1383869
13533 1383869 1365024 1350082 1335005 1296946 1281003 1281426 1294472 1278289 1255438 1260464 1276888 1252678
13521 1252678 1264036 1245472 1220214 1235053 1195512 1199786 1217410 1196030 1168859 1166512 1169739 1164271
13509 1164271 1136373 1157067 1197013 1198281 1158662 1116928 1106370 1092676 1103476 1107577 1119984 1117638
$$ packed form
13595A878084M247k3795n401j6809l0510N646K2577K699j4170n2379j1332k5463
13583A733394j0090n426N09j2644j6569l964r563n237r81j1637R455p521p82J0004
13569A668948J874n5133l8163n435R514J3228P086q458j2987o421k3655k3960
13557A526438j1122M848j8806j0221k0332m6893m0776O449J9351o159k0421J3194
13545A395550m069q670N878j7638k339J0888j8206l725K0143J4122j0336K271
13533A383869j8845j4942j5077l8059j5943M23J3046j6183k2851N026J6424k4210
13521A252678J1358j8564k5258J4839l9541M274J7624k1380k7171k347L227n468
13509A164271k7898K0694L9946J268l9619m1734j0558j3694J0800M101J2407k346
$$ plain form
13497 1117638 1111664 1070186 1051688 1060794 1058497 1056704 1039341 1039123 1068696 1073493 1058362 1069146 1078850
13484 1078850 1053754 1026419 1002673 988808 994947 999269 983633 956505 933835 956965 987038 972364
13472 972364 974332 998144 1012381 983527 965961 985803 991585 980773 940573 947024 983857 1010671
13460 1010671 992088 953254 925243 909658 887714 872092 899738 900193 880769 876458 873740 897278
13448 897278 888371 882309 873754 879704 889488 892247 862795 869293 887471 876933 815692 792804 779409
13435 779409 787178 787637 776522 775717 795179 782389 768803 799068 839934 833468 825059 831281 831657
13422 831657 806339 799886 797211 817557 847402 827752 804227 773638 735483 728943 729580 720218 715100
13409 715100 735733 754225 748157 731228 707387 696969 715808 711554 717367 746965 744012 729616
$$ packed form
13497A117638n974m1478j8498R106k297j793j7363k18K9573M797j5131J0784R704
13484A078850k5096k7335k3746j3865O139M322j5636k7128k2670K3130L0073j4674
13472I72364J968K3812J4237k8854j7566J9842N782j0812m0200O451L6833K6814
13460A010671j8583l8834k8011j5585k1944j5622K7646M55j9424m311k718K3538
13448H97278q907o062q555N950R784K759k9452O498J8178j0538o1241k2888j3395
13435G79409P769M59j1115q05J9462j2790j3586L0265M0866o466q409O222L76
13422H31657k5318o453k675K0346K9845j9650k3525l0589l8155o540O37r362n118
13409G15100K0633J8492o068j6929k3841j0418J8839m254N813K9598k953j4396
$$ plain form
13397 729616 729937 715342 704256 702566 686683 684667 684975 700312 716131 716570 723379 695872 697150
13384 697150 694575 694537 685893 668191 649777 644321 643235 630598 648077 676234 677253 693578 678636
13371 678636 631312 627490 625132 624157 625802 652733 604125 579417 580683 604189 625519 633064 609916
13358 609916 595767 613712 600312 583427 582993 557105 563478 579972 577755 548303 554537 558472 558488
13345 558488 549902 549874 564525 580373 569316 565035 571367 559141 573421 554891 553298 566075 584212
13332 584212 560422 518221 506480 497375 516418 527559 557493 545674 539289 520011 531751 541702
13320 541702 516621 513011 536719 522565 494343 472837 467359 466353 472739 511445 529693 524814
13308 524814 528652 515084 498235 506845 486988 484734 474713 481256 490168 472556 472776 460776 456120
$$ packed form
13397G29616L21j4595j1086j690j5883k016L08J5337J5819M39O809k7507J278
13384F97150k575l8q644j7702j8414n456j086j2637J7479K8157J019J6325j4942
13371F78636m7324l822k358r75J645K6931m8608k4708J266K3506K1330P545k3148
13358F09916j4149J7945j3400j6885m34k5888O373J6494k217k9452O234L935J6
13345E58488q586k8J4651J5848j1057m281O332j2226J4280j8530j593J2777J8137
13332E84212k3790m2201j1741r105J9043J1141K9934j1819o385j9278J1740R951
13320E41702k5081l610K3708j4154k8222k1506n478j006O386L8706J8248m879
13308E24814L838j3568j6849Q610j9857k254j0021O543Q912j7612K20j2000m656
$$ plain form
13295 456120 459897 480221 486057 490629 493366 481779 499328 495074 441603 403665 401066 402738 430551
13282 430551 411901 413511 438455 445922 414250 426967 431823 413233 426372 447703 440371 431678
13270 431678 438304 455159 469382 469313 454701 454949 477359 464846 463856 430470 387232 403974 453450
13257 453450 464124 458614 440628 443457 455087 464460 439330 405325 393251 401628 409737 394845
13245 394845 423037 416109 414395 410819 412337 409228 390678 374598 417276 415770 403410 430725 426859
13232 426859 417431 408899 412345 450959 447769 464396 453832 422857 395659 370451 366017 365276 359167
13219 359167 333452 351234 388385 378960 388217 374684 358809 337642 299215 312997 335742 374707
13207 374707 370204 338874 336199 343427 350568 368554 367642 354340 358928 369448 383054 345383 318036
$$ packed form
13295D56120L777K0324N836M572K737j1587J7549m254n3471l7938k599J672K7813
13282D30551j8650J610K4944P467l1672J2717M856j8590J3139K1331p332q693
13270D31678O626J6855J4223o9j4612K48K2410j2513r90l3386m3238J6742M9476
13257D53450J0674n510j7986K829J1630R373k5130l4005j2074Q377Q109j4892
13245C94845K8192o928j714l576J518l109j8550j6080M2678j506j2360K7315l866
13232D26859r428q532L446L8614l190J6627j0564l0975k7198k5208m434p41o109
13219C59167k5715J7782L7151r425R257j3533j5875k1167l8427J3782K2745L8965
13207C74707m503l1330k675P228P141J7986r12j3302M588J0520J3606l7671k7347
$$ plain form
13194 318036 316034 330774 316811 317342 348091 358644 351532 345618 354747 332006 344898 369838 338543
13181 338543 314445 334137 346502 352166 336927 327361 310600 323717 332211 306816 297960 294521
13169 294521 295517 287363 291268 318740 336144 346115 327978 310233 343520 366040 336867 304780
13157 304780 302635 304095 293914 286054 290851 290566 294507 320996 326609 318106 320368 312650 308241 321719
13143 321719 331192 347597 333073 323232 313780 305290 317940 317425 315421 312602 303516 274711 264711
13130 264711 253780 264944 282107 295195 279525 276424 279476 267080 304759 335926 339642 305417
13118 305417 311249 287457 297399 288909 271560 287822 287209 275057 251226 245819 265776 264123 250034
13105 250034 247679 247328 236121 247384 250122 249408 271107 265586 251679 255136 245475 237561 236549 233715
$$ packed form
13194C18036k002J4740j3963N31L0749J0553p112n914R129k2741J2892K4940l1295
13181C38543k4098J9692J2365N664j5239r566j6761J3117Q494k5395q856l439
13169B94521R96q154L905K7472J7404R971j8137j7745L3287K2520k9173l2087
13157C04780k145J460j0181p860M797k85L941K6489N613q503K262p718m409J3478
13143C21719R473J6405j4524r841r452q490J2650n15k004k819r086k8805j0000
13130B64711j0931J1164J7163J3088j5670l101L052j2396L7679L1167L716l4225
13118C05417N832k3792R942q490j7349J6262o13j2152k3831n407J9957j653j4089
13105B50034k355l51j1207J1263K738p14K1699n521j3907L457r661p914j012k834
$$ plain form
13091 233715 266146 295266 303077 280714 282443 275265 269950 260205 248667 259640 249647 232303 237667
13078 237667 250671 249172 235642 245738 250581 251366 258257 236481 193586 189681 222621 237400 230478
13065 230478 222057 238018 251921 229003 224020 230911 223912 208917 183306 204728 195272 218363
13053 218363 249753 238011 216091 219990 249491 255201 258413 268652 224964 196134 208824 203912
13041 203912 219955 216145 243931 245635 231920 226405 223430 201870 182598 209694 231013 247678
13029 247678 263627 249662 236676 202107 218571 228526 258557 258441 245985 230329 209944 193469
13017 193469 183775 175911 206093 215417 207182 234154 259474 240180 206055 191404 209696 222497
13005 222497 211012 202913 232609 245447 232189 221494 240671 236435 211413 176599 174110 174948
$$ packed form
13091B33715L2431K9120P811k2363J729p178n315r745j1538J0973r993j7344N364
13078B37667J3004j499j3530J0096M843P85O891k1776m2895l905L2940J4779o922
13065B30478q421J5961J3903k2918m983O891o999j4995k5611K1422r456K3091
13053B18363L1390j1742k1920L899K9501N710L212J0239m3688k8830J2690m912
13041B03912J6043l810K7786J704j3715n515k975k1560j9272K7096K1319J6665
13029B47678J5949j3965j2986l4569J6464R955L0031j16j2456j5656k0385j6475
13017A93469r694p864L0182R324q235K6972K5320j9294l4125j4651J8292J2801
13005B22497j1485q099K9696J2838j3258j0695J9177m236k5022l4814k489Q38
$$ plain form
12993 174948 219524 233991 232545 241076 244994 237357 242714 232473 212799 201673 180920 182634 199118
12980 199118 214500 212127 198493 209188 181596 154065 164885 173219 144272 156823 196839 214648
12968 214648 183481 154746 156970 168085 176334 144568 137909 107181 111408 137535 177952 208616
12956 208616 184351 180166 192256 184887 175494 158671 159102 144934 147703 154177 149545 134279 146492
12943 146492 174089 201205 180064 206613 206387 160003 131621 147939 171282 190540 179840 179854
12931 179854 166837 170202 164140 169686 163454 158271 161398 168707 150297 149740 150720 132119 129440 148758
12917 148758 140123 149510 175166 193886 188068 194833 182554 155598 120909 131762 135928 142347 147089
12904 147089 143679 133201 120242 125218 110429 130387 141452 137876 132885 140875 144135 152560 154313
$$ packed form
12993A74948M4576J4467j446Q531L918p637N357j0241j9674j1126k0753J714J6484
12980A99118J5382k373j3634J0695k7592k7531J0820Q334k8947J2551M0016J7809
12968B14648l1167k8735K224J1115Q249l1766o659l0728M227K6127M0417L0664
12956B08616k4265m185J2090p369r393j6823M31j4168K769O474m632j5266J2213
12943A46492K7597K7116k1141K6549k26m6384k8382J6318K3343J9258j0700J4
12931A79854j3017L365o062N546o232n183L127P309j8410n57R80j8601k679J9318
12917A48758q635R387K5656J8720n818O765j2279k6956l4689J0853M166O419M742
12904A47089l410j0478j2959M976j4789J9958J1065l576m991P990L260Q425J753
$$ plain form
12891 154313 152418 155660 155275 157401 156742 166513 173760 180524 182524 161087 105607 101659 122678 133795
12877 133795 155054 159817 158313 164492 177829 179980 164262 158799 165976 144327 145144 112347 106679
12864 106679 116580 132757 151348 166626 158734 149930 129760 119789 141562 145833 149811 170388 163616
12851 163616 160673 175621 184825 175546 156166 158239 155772 120948 111980 131920 151410 158075 157516
12838 157516 157550 165722 149199 125922 134713 146836 145369 141918 110305 109938 133566 128901 132645 147047
12824 147047 140675 152361 153234 160632 153013 131398 122441 108830 89132 100504 119079 123119 108861
12811 108861 100819 103917 114987 143554 152174 142927 123459 106661 133720 112558 110251 132654
12799 132654 133634 107436 104277 88260 81859 109810 148761 184059 160182 150404 134588 152237
$$ packed form
12891A54313j895L242l85K126o59R771P247O764K000k1437n5480l948K1019J1117
12877A33795K1259M763j504O179J3337K151j5718n463P177k1649Q17l2797n668
12864A06679R901J6177J8591J5278p892q804k0170r971K1773M271L978K0577o772
12851A63616k943J4948R204r279j9380K073k467l4824q968J9940J9490O665n59
12838A57516L4Q172j6523k3277Q791J2123j467l451l1613l67K3628m665L744J4402
12824A47047o372J1686Q73P398p619k1615q957j3611j9698J1372J8575M040j4258
12811A08861q042L098J1070K8567Q620r247j9468j6798K7059k1162k307K2403
12799A32654R80k6198l159j6017o401K7951L8951L5298k3877r778j5816J7649
$$ plain form
12787 152237 144331 153638 160882 143563 141156 125182 124059 117914 112151 144375 191932 203679 190168
12774 190168 161026 158223 148452 118344 96891 78719 78679 123033 136316 136558 135850 140039 159934
12761 159934 161815 155279 139666 145157 140395 129081 102134 97685 66902 64447 59426 63308 102816
12748 102816 128629 122725 107261 109185 113576 112844 93277 102425 116236 104240 116676 112579 108833
12735 108833 112459 135261 148292 152762 150664 128402 114972 119312 124961 126022 142953 141211 121229
12722 121229 109271 97474 107282 109578 97571 104211 111242 121190 111478 99073 139991 155232 169715
12709 169715 197656 259787 273505 283052 290581 289431 305001 324029 343231 324070 291664 262412
12697 262412 259983 291184 273988 241111 193384 163284 200023 199216 174911 140365 136493 125930
$$ packed form
12787A52237p906R307P244j7319k407j5974j123o145n763L2224M7557J1747j3511
12774A90168k9142k803r771l0108k1453j8172m0M4354J3283K42p08M189J9895
12761A59934J881o536j5613N491m762j1314k6947m449l0783k455n021L882L9508
12748A02816K5813n904j5464J924M391p32j9567R148J3811j1996J2436m097l746
12735A08833L626K2802J3031M470k098k2262j3430M340N649J061J6931j742j9982
12722A21229j1958j1797R808K296j2007O640P031R948r712j2405M0918J5241J4483
12709A69715K7941O2131J3718R547P529j150J5570J9028J9202j9161l2406k9252
12697B62412k429L1201j7196l2877m7727l0100L6739q07k4305l4546l872j0563
$$ plain form
12685 125930 136986 122611 119770 126997 128678 122966 131617 111664 101665 99087 92871 86146 103061
12672 103061 126278 142572 135880 115359 80729 79483 79281 94418 127163 134371 98384 69369
12660 69369 68085 76020 96508 89553 78194 92504 101340 114665 121865 97922 87100 81723 94891
12647 94891 101790 106133 116292 126838 134364 120968 127302 124304 124707 100889 90812 69582 69163
12634 69163 66311 69347 65527 84847 94663 101417 113002 92237 110754 103056 71444 46058 63329
12621 63329 91868 138358 150333 154044 121173 84447 45140 51921 59577 63338 87920 57814
12609 57814 64452 87568 78608 66536 95568 106264 110407 93775 107776 91925 111229 127893
12597 127893 140194 136891 128917 132857 128144 117040 92935 71086 64426 53089 58543 58662 51380
$$ packed form
12685A25930J1056j4375k841P227J681n712Q651j9953r999k578o216o725J6915
12672A03061K3217J6294o692k0521l4630j246k02J5137L2745P208l5987k9015
12660F9369j284P935K0488o955j1359J4310Q836J3325P200k3943j0822n377J3168
12647I4891O899M343J0159J0546P526j3396O334k998M03k3818j0077k1230m19
12634F9163k852L036l820J9320R816O754J1585k0765J8517p698l1612k5386J7271
12621F3329K8539M6490J1975L711l2871l6726l9307O781P656L761K4582l0106
12609E7814O638K3116q960j2072K9032J0696M143j6632J4001j5851J9304J6664
12597A27893J2301l303p974L940m713j1104k4105k1849o660j1337N454J19p282
$$ plain form
12584 51380 70060 64584 60259 79174 71945 76515 98252 118134 127011 149714 146647 138720 118936
12571 118936 96199 73924 49724 55723 42721 66844 89605 93739 87257 46888 39126 35465
12559 35465 56629 78257 86114 88043 77197 75143 73210 61833 68640 79467 72246 98875 128375
12546 128375 107152 83037 87313 93131 114588 101115 83956 108086 110568 106936 80057 78392
12534 78392 71988 87967 90570 100676 109545 103043 120034 129664 120180 114190 79396 96881 100218
12521 100218 103140 106516 114671 112319 105925 78949 57737 47777 76283 84859 96834 82451 77171
12508 77171 93673 106510 85706 65249 62397 63429 63084 84600 95020 72860 32991 28052 49293
12495 49293 68506 63150 65488 35068 9278 25405 31069 42316 49019 45630 45591 54622 47669 59025
$$ packed form
12584E1380J8680n476m325J8915p229M570K1737J9882Q877K2703l067p927j9784
12571A18936k2737k2275k4200N999j3002K4123K2761M134o482m0369p762l661
12559C5465K1164K1628P857J929j0846k054j933j1377O807J0827p221K6629K9500
12546A28375k1223k4115M276N818K1457j3473j7159K4130K482l632k6879j665
12534G8392o404J5979K603J0106Q869o502J6991R630r484n990l4794J7485L337
12521A00218K922L376Q155k352o394k6976k1212r960K8506Q576J1975j4383n280
12508G7171J6502J2837k0804k0457k852J032l45K1516J0420k2160l9869m939K1241
12495D9293J9213n356K338l0420k5790J6127N664J1247O703l389l9R031o953J1356
$$ plain form
12481 59025 81934 110372 118049 89483 59533 88445 71396 38888 45911 66511 78120 99990
12469 99990 98822 77180 68389 89465 86771 83883 78622 56026 13603 4282 7524 37612 62456
12456 62456 35853 9628 18914 66041 75165 49571 40255 59571 71948 70663 81183 115056
12444 115056 85080 63008 50369 21587 45703 70025 94551 91385 70680 46566 64271 87260
12432 87260 81229 63398 52904 51189 39986 40371 70669 106228 132012 127168 121461 123381 133159
12419 133159 104396 103368 80773 76745 94673 127699 134422 112386 81751 73599 61302 46710
12407 46710 72701 65922 47386 39965 35265 44967 69795 64884 43517 10261 32583 38729 42832
12394 42832 66196 76002 70270 75517 74475 68406 91730 101213 91482 95142 99334 74676 47032
$$ packed form
12481E9025K2909K8438P677k8566k9950K8912j7049l2508P023K0600J1609K1870
12469I9990j168k1642q791K1076k694k888n261k2596m2423r321L242L0088K4844
12456F2456k6603k6225R286M7127R124k5594r316J9316J2377j285J0520L3873
12444A15056k9976k2072j2639k8782K4116K4322K4526l166k0705k4114J7705K2989
12432H7260o031j7831j0494j715j1203L85L0298L5559K5784m844n707J920R778
12419A33159k8763j028k2595m028J7928L3026O723k2036l0635q152j2297j4592
12407D6710K5991o779j8536p421m700R702K4828m911k1367l3256K2322O146M103
12394D2832K3364R806n732N247j042o069K3324R483r731L660M192k4658k7644
$$ plain form
12381 47032 37780 33511 73894 89008 91229 124403 142233 115175 136565 168442 160411 139486
12369 139486 121599 115195 120827 102932 72150 63979 69994 46021 43554 64309 84981 89967 68759
12356 68759 64182 75653 74627 72983 67524 52144 69333 108395 128145 135985 111594 87527 54285
12343 54285 49764 69817 69820 35451 54913 79416 86216 89173 84840 67689 87902 103977 96250
12330 96250 79964 93676 99625 93804 50499 35376 60675 81513 72059 76280 94550 86115 72326
12317 72326 88582 96664 91574 111600 123223 92542 75331 90239 122543 119247 132852 157411
12305 157411 119411 112632 128134 110011 77242 64105 76644 83464 81820 94024 94271 85211 107945
12292 107945 107182 102440 71740 54264 78197 116149 110401 77737 65694 40379 39297 53832
$$ packed form
12381D7032r252m269M0383J5114K221L3174J7830k7058K1390L1877q031k0925
12369A39486j7887o404N632j7895l0782q171O015k3973k467K0755K0672M986k1208
12356F8759m577J1471j026j644n459j5380J7189L9062J9750P840k4391k4067l3242
12343E4285m521K0053Ll4369J9462K4503O800K957m333j7151K0213J6075p727
12330I6250j6286J3712N949n821m3305j5123K5299K0838r454M221J8270q435j3789
12317G2326J6256Q082n090K0026J1623l0681j7211J4908L2304l296J3605K4559
12305A57411l8000o779J5502j8123l2769j3137J2539O820j644J2204K47r060K2734
12292A07945p63m742l0700j7476K3933L7952n748l2664j2043k5315j082J4535
$$ plain form
12280 53832 62671 75408 114374 121051 95938 77598 84463 102163 114448 100201 82144 82040 92609
12267 92609 86892 78275 98191 106965 69923 61604 37116 20761 21870 21198 18960 37980 67395
12254 67395 64286 41456 48916 48409 37720 32647 40263 42428 52256 63016 69791 49117 35162
12241 35162 39085 23158 30477 29668 40041 70497 70615 48602 48286 63056 42120 50411 58219 47672
12227 47672 22997 33795 35654 55308 49976 49563 55976 56061 66729 63571 66976 79920 82432 66054
12213 66054 49624 61882 53376 23295 40666 58284 76629 64331 53235 62099 68522 74600
12201 74600 55757 34703 51311 57375 63117 44827 44498 20204 -2188 -15358 8591 25477
12189 25477 36214 52052 70857 79736 83913 56331 41951 31379 16918 27015 45420 53711
$$ packed form
12280E3832Q839J2737L8966O677k5113j8340O865J7700J2285j4247j8057j04J0569
12267I2609n717q617J9916Q774l7042q319k4488j6355J109o72k238J9020K9415
12254F7395l109k2830P460n07j0689n073P616K165R828J0760O775k0674j3955
12241C5162L923j5927P319q09J0373L0456J18k2013l16J4770k0936Q291P808j0547
12227D7672k4675J0798J859J9654n332m13O413Q5J0668l158L405J2944K512j6378
12213F6054j6430J2258q506l0081J7371J7618J8345j2298j1096Q864O423O078
12201G4600j8843k1054J6608O064N742j8290l29k4294k2392j3170K3949J6886
12189B5477J0737J5838J8805Q879M177k7582j4380j0572j4461J0097J8405Q291
$$ plain form
12177 53711 53603 51951 45607 19953 40356 37061 46813 28372 1429 7940 42814 64521 82425
12164 82425 97314 105548 115221 73883 36909 34886 47322 59748 88379 101809 119381 133040
12152 133040 113070 85805 89818 80122 91315 90996 98052 83742 62297 90502 81804 82345 85725
12139 85725 77070 77882 68708 78630 99110 119732 113422 110436 113592 102864 112620 95972 90222 115607
12125 115607 115615 119113 107616 120405 147281 166191 192019 197880 213213 238883 253189 288912 346542
12112 346542 396272 427852 482588 513259 471684 454887 471252 464097 444758 428327 410591 387298
12100 387298 373592 370822 370762 388408 395430 396555 398569 438526 436734 437890 459939 452388 458021 465787
12086 465787 451971 424174 418512 443561 472456 451833 465322 465246 476878 486309 500366 547595
$$ packed form
12177E3711j08j652o344k5654K0403l295R752j8441k6943O511L4874K1707J7904
12164H2425J4889Q234R673m1338l6974k023J2436J2426K8631J3430J7572J3659
12152A33040j9970k7265M013r696J1193l19P056j4310k1445K8205q698N41L380
12139H5725q655Q12r174R922K0480K0622o310k986L156j0728R756j6648n750K5385
12125A15607QL498j1497J2789K6876J8910K5828N861J5333K5670J4306L5723N7630
12112C46542M9730L1580N4736L0671m1575j6797J6365p155j9339j6431j7736k3293
12100C87298j3706k770o0J7646P022J125K014L9957j792J156K2049p551N633P766
12086D65787j3816k7797n662K5049K8895k0623J3489p6J1632R431J4057M7229
$$ plain form
12074 547595 594830 698633 805595 936717 1070716 1170885 1203267 1237523 1267280 1266193 1204801
12063 1204801 1075392 954128 843040 768031 719135 657845 658441 674724 654531 621706 623529
12052 623529 649721 660275 622578 594171 595025 576635 568769 536518 512540 488186 459961 434011
12040 434011 412266 428599 417334 440296 433061 415219 395881 395039 392474 412432 428582 464002
12028 464002 469110 483103 504544 493612 494453 523565 518860 447643 376412 321671 266283 222045
12016 222045 226258 235845 206194 161747 173164 169106 157560 169556 162508 145648 135370 135455 125670
12003 125670 126889 120359 110868 100139 93580 86409 72965 67075 67554 75140 98609 107893 84144
11990 84144 80078 68614 77013 85744 56937 31882 62867 81586 68426 56173 56020 59465 46226
$$ packed form
12074E47595M7235J03803J06962J31122J33999J00169L2382L4256K9757j087o1392
12063A204801j29409j21264j11088p5009m8896o1290N96J6283k0193l2825J823
12052F23529K6192J0554l7697k8407Q54j8390p866l2251k3978k4354k8225k5950
12040D34011k1745J6333j1265K2962p235j7842j9338q42k565J9958J6150L5420
12028D64002N108J3993K1441j0932Q41K9112m705p1217p1231n4741n5388m4238
12016B22045M213R587k9651m4447J1417m058j1546J1996p048j6860j0278Q5r785
12003A25670J219o530r491j0729o559p171j3444n890M79P586K3469R284k3749
11990H4144m066j1464Q399Q731k8807k5055L0985J8719j3160j2253j53L445j3239
$$ plain form
11977 46226 45654 48234 13263 4996 -5321 -5116 -7814 -4483 -35727 -19217 -7864 -3531 11010
11964 11010 3991 17910 28648 21444 33934 39062 55444 55738 53267 45639 2597 -27049 -34805
11951 -34805 22873 24542 21226 23066 -2185 6863 19186 42607 34592 29862 44759 28196 38142
11938 38142 41808 73067 72261 34521 34387 59938 63941 49400 45227 31493 17757 6290 -17640
11925 -17640 -7288 19053 57504 66776 56036 28286 27768 23245 14779 12854 14225 3682 -12903
11912 -12903 16899 54828 45455 50789 59560 44992 19047 19142 18083 13737 52409 91146 98720
11899 98720 50366 52675 66988 60790 60876 73753 74033 84032 98833 89185 96431 98067 99274 69785
11885 69785 82453 114214 118058 97102 102499 79792 85599 70474 46024 28840 23443 38676
$$ packed form
11977D6226n72K580l4971q267j0317K05k698L331l1244J6510J1353M333J4541
11964A1010p019J3919J0738p204J2490N128J6382K94k471p628m3042k9646p756
11951c4805N7678J669l316J840k5251R048J2323K3421q015m730J4897j6563R946
11938C8142L666L1259q06l7740j34K5551M003j4541m173j3734j3736j1467k3930
11925a7640J0352K6341L8451R272j0740k7750n18m523q466j925J371j0543j6585
11912a2903K9802L7929r373N334Q771j4568k5945R5j059m346L8672L8737P574
11899I8720m8354K309J4313o198Q6J2877K80R999J4801r648P246J636J207k9489
11885F9785J2668L1761L844k0956N397k2707N807j5125k4450j7184n397J5233
$$ plain form
11873 38676 87974 83714 55452 60494 65045 48262 35910 38201 16140 -4835 4904 29627 40108
11860 40108 35351 48809 61959 81976 83604 67213 55852 57502 61730 73603 90260 75834
11848 75834 65865 61291 49239 37690 40589 29847 26134 33622 53980 25276 1957 2194 -31471
11835 -31471 -9318 -4385 -11033 8023 -934 -18878 -18736 -44336 -75133 -81873 -78726 -89004 -89519
11822 -89519 -104180 -112376 -106936 -107402 -114022 -94348 -74035 -29082 16940 23507 -8758 -609 25205
11809 25205 4515 8380 10238 8217 10913 431 -5177 -5526 27722 56969 73268 104911 149363
11796 149363 127646 127443 133988 135129 116505 95185 107083 111774 133773 164704 180748 161406
11784 161406 172123 188178 197757 203015 188573 196843 253188 265767 285270 350435 363714 426235
$$ packed form
11873C8676M9298m260k8262N042M551j6783j2352K291k2061k0975R739K4723J0481
11860D0108m757J3458J3150K0017J628j6391j1361J650M228J1873J6657j4426
11848G5834r969m574j2052j1549K899j0742l713P488K0358k8704k3319K37l3665
11835c1471K2153M933o648J9056q957j7944J42k5600l0797o740L147j0278n15
11822h9519j4661q196N440m66o620J9674K0313M4953M6022O567l2265Q149K5814
11809B5205k0690L865J858k021K696j0482n608l49L3248K9247J6299L1643M4452
11796A49363k1717k03O545J141j8624k1320J1898M691K1999L0931J6044j9342
11784A61406J0717J6055R579N258j4442Q270N6345J2579J9503O5165J3279O2521
$$ plain form
11772 426235 469857 501077 525384 549182 562230 577311 580570 558286 578702 599306 633937 719889
11760 719889 790717 892962 1021842 1182668 1370944 1540342 1686878 1801936 1873880 1904156
11750 1904156 1889760 1808305 1727948 1659357 1601501 1557029 1529768 1539384 1592458 1623572 1693881
11739 1693881 1741587 1799531 1898537 2011098 2086646 2160927 2227116 2288346 2305571 2275272 2220701
11728 2220701 2155826 2090772 2034287 1992055 1969176 1935239 1949027 2036584 2149495 2274124 2457265
11717 2457265 2690729 2971007 3284613 3623970 3961525 4264914 4508525 4697933 4881517
11708 4881517 5052711 5210254 5402957 5695207 6098787 6608290 7200525 7755976 8299595
11699 8299595 8854795 9433447 10018848 10468336 10786289 11067654 11478408 12107422 12936174
$$ packed form
11772D26235M3622L1220K4307K3798J3048J5081L259k2284K0416K0604L4631Q5952
11760G19889P0828J02245J28880J60826J88276J69398J46536J15058P1944L0276
11750A904156j4396q1455q0357o8591n7856m4472k7261R616N3074L1114P0309
11739A693881M7706N7944R9006J12561P5548P4281O6189O1230J7225l0299n4571
11728B220701o4875o5054n6485m2232k2879l3937J3788Q7557J12911J24629J83141
11717B457265K33464K80278L13606L39357L37555L03389K43611J89408J83584
11708D881517J71194J57543J92703K92250M03580N09503N92235N55451N43619
11699H299595N55200N78652N85401M49488L17953K81365M10754O29014Q28752
$$ plain form
11690 12936174 13950378 15208608 16760483 18542063 20358254 22003679 23498241 25075324
11682 25075324 26962411 29435481 32935602 38149485 45490430 53974170 61687657 67505858
11674 67505858 72186715 76849805 81035434 82670897 80726562 76825265 73349437 71202647
11666 71202647 69894069 68498173 66696704 65187815 64728897 65347320 66453559 67689100
11658 67689100 69275647 71382428 73682218 75503111 76767151 78420625 81361631 85280743
11650 85280743 89097843 92210577 94935733 97807041 100571089 102690015 104337272 106365762
11642 106365762 109212983 113023326 117968447 124430108 132943969 144250160 158762437 175337268
11634 175337268 190414592 200660233 206280876 209620875 211087853 208003983 197872696
$$ packed form
11690A2936174J014204J258230J551875J781580J816191J645425J494562J577083
11682B5075324J887087K473070L500121N213883P340945Q483740P713487N818201
11674F7505858M680857M663090M185629J635463j944335l901297l475828k146790
11666G1202647j308578j395896j801469j508889m58918O18423J106239J235541
11658F7689100J586547K106781K299790J820893J264040J653474K941006L919112
11650H5280743L817100L112734K725156K871308K764048K118926J647257K028490
11642A06365762K847221L810343M945121O461661Q513861J1306191J4512277J6574831
11634A75337268J5077324J0245641N620643L339999J466978l083870j0131287
$$ plain form
11627 197872696 182858379 167874325 155752521 146939322 140811720 136349749 132798498
11620 132798498 130047918 127883839 125745878 123288102 120695354 118124668 115131051 110984593
11612 110984593 105772670 100693175 96931371 94580328 92842651 90904238 88766294 86873665
11604 86873665 85475524 84288383 83001926 82006008 81996445 83200372 85221512 87520626 89899960
11595 89899960 92768048 96637185 101265039 104938561 105448779 102801833 99177014 95903322
11587 95903322 91764447 84454007 74245629 64276161 56816025 51864825 48587181 46209588
11579 46209588 44343134 42723336 41017666 39065243 36941850 34869149 32945300 31237342
11571 31237342 29787726 28614623 27689195 26895488 26094338 25195752 24243187 23275161 22340061
$$ packed form
11627A97872696j5014317j4984054j2121804q813199o127602m461971l551251
11620A32798498k750580k164079k137961k457776k592748k570686k993617m146458
11612A10984593n211923n079495l761804k351043j737677j938413k137944j892629
11604H6873665j398141j187141j286457r95918r563J203927K021140K299114K379334
11595H9899960K868088L869137M627854L673522N10218k646946l624819l273692
11587I5903322m138875p310440j0208378r969468p460136m951200l277644k377593
11579D6209588j866454j619798j705670j952423k123393k072701j923849j707958
11571C1237342j449616j173103r25428p93707q01150q98586r52565r68026r35100
$$ plain form
11562 22340061 21403395 20451835 19513412 18616042 17782373 17007127 16380386 15849506 15365079
11553 15365079 14847130 14316773 13751658 13172887 12579187 11962822 11312050 10734540 10258098
11544 10258098 9818004 9422727 9109403 8840802 8634510 8446488 8268303 8135302 8033381
11535 8033381 7930336 7813350 7727445 7641488 7552289 7406308 7217945 7026146 6823516 6607194
11525 6607194 6413504 6203011 6016767 5832494 5662810 5526754 5426475 5345496 5282109 5279967
11515 5279967 5317356 5346357 5355053 5325889 5272907 5165473 4983178 4756938 4511219 4242316
11505 4242316 3997110 3795031 3586149 3428396 3301861 3169801 3075685 3039007 2992110 2914438
11495 2914438 2858782 2824133 2774250 2681224 2599411 2528045 2438734 2382531 2333757 2237869 2179568
$$ packed form
11562B2340061r36666r51560r38423q97370q33669p75246o26741n30880m84427
11553A5365079n17949n30357n65115n78771n93700o16365o50772n77510m76442
11544A0258098m40094l95277l13324k68601k06292j88022j78185j33001j01921
11535H033381j03045j16986q5905q5957q9199j45981j88363j91799k02630k16322
11525F607194j93690k10493j86244j84273j69684j36056j00279q0979o3387k142
11515E279967L7389K9001Q696k9164n2982j07434j82295k26240k45719k68903
11505D242316k45206k02079k08882j57753j26535j32060r4116l6678m6897p7672
11495B914438n5656l4649m9883r3026q1813p1366q9311n6203m8774r5888n8301
$$ plain form
11484 2179568 2153460 2102312 2065844 2027283 1993188 1974145 1891537 1823362 1788472 1760596 1729509
11473 1729509 1732235 1722134 1683624 1646177 1622850 1598434 1590377 1542986 1505933 1484727 1455398 1403142
11461 1403142 1413749 1418844 1397873 1376481 1350012 1302948 1281164 1280901 1283924 1254578 1260310 1247712
11449 1247712 1215593 1213071 1206904 1228775 1240828 1248922 1223650 1210461 1178076 1157828 1156756 1168375
11437 1168375 1141081 1134572 1123508 1093326 1072038 1045670 1053864 1052433 1039003 1025031 986006 959382
11425 959382 969332 951654 938662 937081 922352 907391 926767 924440 904626 880231 853755 847390
11413 847390 846835 840006 820256 806576 787536 808905 827597 835862 832160 844737 830017 817942
11401 817942 794506 805447 795096 792923 808421 792682 769258 761760 741135 733110 735915 700716
$$ packed form
11484B179568k6108n1148l6468l8561l4095j9043q2608o8175l4890k7876l1087
11473A729509K726j0101l8510l7447k3327k4416q057m7391l7053k1206k9329n2256
11461A403142J0607N095k0971k1392k6469m7064k1784k63L023k9346N732j2598
11449A247712l2119k522o167K1871J2053Q094k5272j3189l2385k0248j072J1619
11437A168375k7294o509j1064l0182k1288k6368Q194j431j3430j3972l9025k6624
11425I59382R950j7678j2992j581j4729j4961J9376k327j9814k4395k6476o365
11413H47390n55o829j9750j3680j9040K1369J8692Q265l702J2577j4720j2075
11401H17942k3436J0941j0351k173J5498j5739k3424p498k0625q025K805l5199
$$ plain form
11389 700716 686705 684321 696711 684291 659746 645955 635798 604449 594754 596019 597564 608035
11377 608035 618416 597237 569246 573619 595800 576681 518927 488347 504901 513837 502954 516822
11365 516822 537106 534670 563671 560216 532417 540441 529911 509475 476596 442150 446145 455297
11353 455297 460369 436478 420461 440150 459769 455446 453818 445768 429783 405608 401340 417814
11341 417814 426356 415220 411065 433597 437340 421037 397974 401703 432441 463887 444819 399254
11329 399254 377110 395194 401916 408806 417132 406278 416954 413494 410240 381660 409557 403358 384013
11316 384013 381850 390279 408259 381374 351127 348642 343163 343121 352638 350704 365423 348875 345687
11303 345687 360461 360980 364074 348896 318724 307055 294249 281599 303447 321115 317070 319911
$$ packed form
11389G00716j4011k384J2390j2420k4545j3791j0157l1349r695J265J545J0471
11377F08035J0381k1179k7991M373K2181j9119n7754l0580J6554Q936j0883J3868
11365E16822K0284k436K9001l455k7799Q024j0530k0436l2879l4446L995R152
11353D55297N072k3891j6017J9689J9619m323j628q050j5985k4175m268J6474
11341D17814Q542j1136m155K2532L743j6303k3063L729L0738L1446j9068m5565
11329C99254k2144J8084O722O890Q326j0854J0676l460l254k8580K7897o199j9345
11316C84013k163Q429J7980k6885l0247k485n479m2R517j934J4719j6548l188
11303C45687J4774N19L094j5178l0172j1669j2806j2650K1848J7668m045K841
$$ plain form
11291 319911 315177 308962 288072 307321 334659 353022 364482 342849 325765 322060 304547 295604
11279 295604 267034 234589 225220 215244 202573 197264 236830 269434 277114 283133 288384 293749 283146
11266 283146 266021 289440 282507 300520 326374 326662 318447 294065 289292 293577 304864 320617 336952
11253 336952 349821 331119 338312 341461 378160 369339 384825 389108 371869 345697 319544 321317
11241 321317 368832 375384 399140 441783 479050 492630 534582 605021 641975 665184 702225 726716
11229 726716 715630 693524 648779 650543 622373 579282 561490 572842 603301 617135 642145 614771
11217 614771 583129 591591 637168 627504 635862 618840 611725 631857 668110 707788 741395 760195
11205 760195 799857 808276 810908 822054 816060 816323 805180 789622 820179 874353 917787 995270
$$ packed form
11291C19911m734o215k0890J9249K7338J8363J1460k1633j7084l705j7513q943
11279B95604k8570l2445r369r976j2671n309L9566L2604P680O019N251N365j0603
11266B83146j7125K3419o933J8013K5854K88q215k4382m773M285J1287J5753J6335
11253C36952J2869j8702P193L149L6699q821J5486M283j7239k6172k6153J773
11241C21317M7515O552K3756M2643L7267J3580M1952P0439L6954K3209L7041K4491
11229G26716j1086k2106m4745J764k8170m3091j7792J1352L0459J3834K5010k7374
11217F14771l1642Q462M5577r664Q358j7022p115K0132L6253L9678L3607J8800
11205G60195L9662Q419K632J1146n994K63j1143j5558L0557N4174M3434P7483
$$ plain form
11193 995270 1090803 1234644 1358268 1446191 1495680 1507816 1523245 1477489 1380192 1259316 1135894
11182 1135894 1022279 953938 908494 850741 796519 766084 758773 749927 733847 715193 723426 694422
11170 694422 688629 661220 660606 688663 684774 676041 663810 660037 670891 695818 720661 719618 700446
11157 700446 666048 690568 679099 633103 598147 609666 656074 713554 767597 807215 814853 785751
11145 785751 769250 725655 635293 578594 535964 464513 386550 340636 344843 350824 385739 387975
11133 387975 358036 333324 325988 323607 311642 282322 287004 289957 248926 255472 263658 250829 249524
11120 249524 223113 230988 240094 247445 224514 219801 233335 208398 195331 200676 225827 216535 212875
11107 212875 204834 199445 228130 276345 287490 251685 222834 207730 194984 182528 203236 227696
$$ packed form
11193I95270R5533J43841J23624Q7923M9489J2136J5429m5756r7297j20876j23422
11182A135894j13615o8341m5444n7753n4222l0435p311q846j6080j8654Q233k9004
11170F94422n793k7409o14K8057l889q733j2231l773J0854K4927K4843j043j9172
11157G00446l4398K4520j1469m5996l4956J1519M6408N7480N4043L9618P638k9102
11145G85751j6501m3595r0362n6699m2630p1451p7963m5914M207N981L4915K236
11133C87975k9939k4712p336k381j1965k9320M682K953m1031O546Q186j2829j305
11120B49524k6411P875R106P351k2931m713J3534k4937j3067N345K5151r292l660
11107B12875q041n389K8685M8215J1145l5805k8851j5104j2746j2456K0708K4460
$$ plain form
11095 227696 222773 184620 157975 182121 207907 198025 190021 150805 167757 182206 177997 169258
11083 169258 144735 146882 156173 183359 185024 160568 169744 142991 112551 109213 148667 176082
11071 176082 179260 175954 176892 167250 158584 176767 185891 171128 206174 219671 190008 172699 149700
11058 149700 127658 124746 146839 156371 160520 139699 135298 139791 149878 150059 151767 174046 164432
11045 164432 160981 149886 131244 134137 136770 163382 175327 170616 160647 166987 143530 139171 112513
11032 112513 97452 83806 97165 110879 118543 124688 139453 158845 159321 169796 165945 147759
11020 147759 140856 111846 91443 105301 97403 100578 103390 126069 163118 182609 172270 177232
11008 177232 170269 168700 180310 178577 174424 174808 169207 164811 171724 159703 184416 178975 143834
$$ packed form
11095B27696m923l8153k6645K4146K5786r882q004l9216J6952J4449m209q739
11083A69258k4523K147R291K7186J665k4456R176k6753l0440l338L9454K7415
11071A76082L178l306R38r642q666J8183R124j4763L5046J3497k9663j7309k2999
11058A49700k2042k912K2093R532M149k0821m401M493J0087J81J708K2279r614
11045A64432l451j1095j8642K893K633K6612J1945m711r969O340k3457m359k6658
11032A12513j5061j3646J3359J3714P664O145J4765J9392M76J0475l851j8186
11020A47759o903k9010k0403J3858p898L175K812K2679L7049J9491j0339M962
11008A77232o963j569J1610j733m153L84n601m396O913j2021K4713n441l5141
$$ plain form
10995 143834 106132 96312 72252 54394 95500 155064 150244 150306 142406 143237 155524 175248 152495
10982 152495 127424 112510 97285 89960 69160 98274 134478 123916 125779 163343 166295 118935
10970 118935 108535 106693 100943 101295 117809 137336 130774 145921 149934 147267 168581 153478 141008
10957 141008 113195 65925 53330 60755 91148 127732 123901 148406 123606 110579 108396 126630
10945 126630 128226 142465 145270 139555 135710 116572 105476 95688 100677 102199 113105 121579 124164
10932 124164 120341 128680 113016 116223 131261 130351 152204 157272 179091 172744 154171 153278 132336
10919 132336 108954 90333 71474 98312 106823 114186 117198 119048 116048 119343 110993 130590 139678
10906 139678 131797 130957 110468 104381 142568 154718 140747 116217 91557 86027 95644 94520 109050
$$ packed form
10995A43834l7702r820k4060j7858M1106N9564m820O2p900Q31J2287J9724k2753
10982A52495k5071j4914j5225p325k0800K9114L6204j0562J863L7564K952m7360
10970A18935j0400j842n750L52J6514J9527o562J5147M013k667K1314j5103j2470
10957A41008k7813m7270j2595P425L0393L6584l831K4505k4800j3027k183J8234
10945A26630J596J4239K805n715l845j9138j1096r788M989J522J0906Q474K585
10932A24164l823Q339j5664L207J5038r10K1853N068K1819o347j8573q93k0942
10919A32336k3382j8621j8859K6838Q511P363L012J850l000L295q350J9597R088
10906A39678p881q40k0489o087L8187J2150j3971k4530k4660n530R617j124J4530
$$ plain form
10893 109050 101589 79518 75564 115935 132858 135373 130348 117967 112761 126625 142575 118310
10881 118310 112613 144824 156848 137114 120716 89877 89984 108453 113572 97879 86721 97237
10869 97237 114741 113327 69480 67587 93350 100565 121286 103612 75997 80547 114074 120937 134169
10856 134169 135640 126144 101687 96057 110400 123350 122880 104030 78407 61009 71692 81200 99138
10843 99138 108909 99153 93984 92363 108724 113154 117961 111862 95761 97968 88897 107952 117267 100166
10829 100166 110566 82229 87090 95214 110007 120768 117088 122108 122190 134185 129975 105809 74492
10816 74492 47717 49543 86979 128688 124943 117117 105715 95199 105615 90821 68081 84170
10804 84170 123460 117036 87139 91774 79011 73758 65056 74631 72304 62773 51988 57773 70685
$$ packed form
10893A09050p461k2071l954M0371J6923K515n025j2381n206J3864J5950k4265
10881A18310n697L2211J2024j9734j6398l0839J07J8469N119j5693j1158J0516
10869I7237J7504j414m3847j893K5763P215K0721j7674k7615M550L3527O863J3232
10856A34169J471r496k4457n630J4343J2950m70j8850k5623j7398J0683R508J7938
10843I9138R771r756n169j621J6361M430M807o099j6101K207r071J9055R315j7101
10829A00166J0400k8337M861Q124J4793J0761l680N020Q2J1995m210k4166l1317
10816G4492k6775J826L7436M1709l745p826j1402j0516J0416j4794k2740J6089
10804H4170L9290o424k9897M635j2763n253q702R575k327r531j0785N785J2912
$$ plain form
10791 70685 108026 107148 84380 76247 74706 81328 67889 56606 74219 77716 71347 73522 56857
10778 56857 39489 32562 37600 26428 47056 41311 53694 54075 49249 70078 68185 51132 72061
10765 72061 69264 80259 72206 57892 55890 41836 77876 89798 76269 65660 94235 117518
10753 117518 116331 92605 84555 62177 86715 92087 82957 94785 97916 115117 117077 101179 96476
10740 96476 97688 98392 107096 119259 78823 50008 39935 43587 73564 79858 82844 90405 99277
10727 99277 120096 126019 114926 89157 74327 95720 75185 73682 63500 36332 47619 71092
10715 71092 61938 70859 62340 38945 37756 74274 104728 93927 100599 92500 76535 91965 48721
10702 48721 24250 28754 49811 66347 55196 50464 73270 56915 50305 27842 36299 37859 49274
$$ packed form
10791G0685L7341q78k2768q133j541O622j3439j1283J7613L497o369K175j6665
10778E6857j7368o927N038j1172K0628n745J2383L81m826K0829j893j7053K0929
10765G2061k797J0995q053j4314k002j4054L6040J1922j3529j0609K8575K3283
10753A17518j187k3726q050k2378K4538N372r130J1828L131J7201J960j5898m703
10740I6476J212P04Q704J2163m0436k8815j0073L652K9977O294K986P561Q872
10727I9277K0819N923j1093k5769j4830K1393k0535j503j0182k7168J1287K3473
10715G1092r154Q921q519k3395j189L6518L0454j0801O672q099j5965J5430m3244
10702D8721k4471M504K1057J6536j1151m732K2806j6355o610k2463Q457J560J1415
$$ plain form
10689 49274 41806 46715 68384 102570 88160 81096 68293 68430 55174 64916 91580 79683 58350
10676 58350 39063 31789 13166 -3879 23155 31749 15257 20364 39793 53960 70479 64564
10664 64564 71811 72883 73056 61508 33668 15834 36715 46916 60365 70829 63478 72250 86454
10651 86454 82217 87075 70724 64934 75025 29853 33079 52236 51581 39703 44736 30050 34492
10638 34492 36241 47393 65497 42220 37919 29922 18057 33516 57637 65526 82439 85561 71364
10625 71364 71568 86279 118741 129140 110740 84889 93331 86981 69466 72838 77869 77350 105402
10612 105402 93261 84088 61148 62217 104064 110243 95065 92725 79833 49646 27001 28457
10600 28457 27324 21814 31791 58581 64775 62001 58809 78993 71197 74080 79661 111877 114238 108058
$$ packed form
10689D9274p468M909K1669L4186j4410p064j2803J37j3256R742K6664j1897k1333
10676E8350j9287p274j8623j7045K7034Q594j6492N107J9429J4167J6519n915
10664F4564P247J072J73j1548k7840j7834K0881J0201J3449J0464p351Q772J4204
10651H6454m237M858j6351n790J0091m5172L226J9157o55j1878N033j4686M442
10638C4492J749J1152J8104k3277m301p997j1865J5459K4121P889J6913L122j4197
10625G1364K04J4711L2462J0399j8400k5851Q442o350j7515L372N031n19K8052
10612A05402j2141r173k2940J069M1847O179j5178k340j2892l0187k2645J456
10600B8457j133n510R977K6790O194k774l192K0184p796K883N581L2216K361o180
$$ plain form
10586 108058 121075 111688 105525 74919 64782 73335 60952 31548 38807 35806 26959 20167 34605
10573 34605 55586 40841 34123 45842 42850 43426 59718 45284 45531 41997 56365 63941 51912
10560 51912 24622 18328 9904 16175 17158 14445 18748 13105 6341 -5842 -7112 29505 50372 47220
10546 47220 37706 31377 27957 34443 24174 33443 52486 55576 33238 29970 26647 6516 29309
10533 29309 47466 57306 65702 57366 43687 57405 54403 40947 35581 21319 54135 53720 38322
10520 38322 26066 50412 32401 6770 6533 27430 15270 30641 40038 55292 63777 50154
10508 50154 67974 80991 73951 70535 87536 73250 46748 48193 54141 55195 51096 62596 78999
10495 78999 79245 75632 77215 49588 43656 54609 51986 35821 62470 78528 72422 57325 46795
$$ packed form
10586A08058J3017r387o163l0606j0137Q553j2383k9404P259l001q847o792J4438
10573C4605K0981j4745o718J1719k992N76J6292j4434K47l534J4368P576j2029
10560E1912k7290o294q424O271R83k713M303n643o764j2183j270L6617K0867l152
10546D7220r514o329l420O486j0269R269J9043L090k2338l268l323k0131K2793
10533B9309J8157R840Q396q336j3679J3718l002j3456n366j4262L2816m15j5398
10520C8322j2256K4346j8011k5631k37K0897j2160J5371R397J5254Q485j3623
10508E0154J7820J3017p040l416J7001j4286k6502J445N948J054m099J1500J6403
10495G8999K46l613J583k7627n932J0953k623j6165K6649J6058o106j5097j0530
$$ plain form
10482 46795 59373 91137 100914 89733 95149 108644 96722 69788 78210 102121 89458 86441
10470 86441 75657 70387 58175 49206 55830 95794 119028 108027 108847 113445 114106 94357 69089
10457 69089 50953 49586 85342 101549 83446 80157 91158 89188 103485 114547 120300 120023 93996
10444 93996 124467 172953 171984 182080 190891 175801 171434 177147 150005 156574 196412 226626 241675
10431 241675 297576 375138 459695 464680 465836 485441 478585 438043 378167 296622 220837 201604
10419 201604 193410 198214 190096 199707 174086 150454 135151 106355 89970 87196 90442 86374 116448
10406 116448 143406 135148 139168 150172 113383 74269 62265 65335 92794 122956 142763 127871
10394 127871 97366 67260 80448 105962 120765 106280 73861 74430 70151 55850 60033 55194
$$ packed form
10482D6795J2578L1764R777j1181N416J3495j1922k6934Q422K3911j2663l017
10470H6441j0784n270j2212q969O624L9964K3234j1001Q20M598O61j9749k5268
10457F9089j8136j367L5756J6207j8103l289J1001j970J4297J1062N753k77k6027
10444I3996L0471M8486r69J0096Q811j5090m367N713k7142O569L9838L0214J5049
10431B41675N5901P7562Q4557M985J156J9605o856m0542n9876q1545p5785j9233
10419B01604q194M804q118R611k5621k3632j5303k8796j6385k774L246m068L0074
10406A16448K6958q258M020J1004l6789l9114j2004L070K7459L0162J9807j4892
10394A27871l0505l0106J3188K5514J4803j4485l2419N69m279j4301M183m839
$$ plain form
10382 55194 36082 35275 56828 86639 98161 78760 93600 88876 85467 86063 93546 89722 73865
10369 73865 57949 60266 46373 46009 75810 102805 94873 109418 141733 127399 100089 78442
10357 78442 88681 73943 70233 110291 104612 68492 67868 84593 93489 103064 81260 91469 84767
10344 84767 88741 101468 121454 137910 126312 112793 133102 129537 110724 92841 103251 110112
10332 110112 131470 140436 145034 127771 135504 149818 153863 121008 90434 89329 91647 98946 71677
10319 71677 59741 82425 76266 102579 135109 148491 137572 110361 117624 121185 125289 131637 132123
10306 132123 157005 189985 235376 243105 206867 177702 192477 183562 162520 137514 143143 160523
10294 160523 162554 139048 146011 147347 135199 138549 130081 82625 62803 89004 91293 119096 140523
$$ packed form
10382E5194j9112q07K1553K9811J1522j9401J4840m724l409N96P483l824j5857
10369G3865j5916K317j3893l64K9801K6995p932J4545L2315j4334k7310k1647
10357G8442J0239j4738l710M0058n679l6120o24J6725Q896R575k1804J0209o702
10344H4767L974J2727J9986J6456j1598j3519K0309l565j8813j7883J0410O861
10332A10112K1358Q966M598j7263P733J4314M045l2855l0574j105K318P299k7269
10319G1677j1936K2684o159K6313L2530J3382j0919k7211P263L561M104O348M86
10306A32123K4882L2980M5391P729l6238k9165J4775q915k1042k5006N629J7380
10294A60523K031k3506O963J336j2148L350q468m7456j9822K6201K289K7803K1427
$$ plain form
10281 140523 146460 159408 150883 120963 108143 88013 71179 67213 79206 94331 92717 81649
10269 81649 86884 90614 96851 109408 96793 67093 43957 55206 79814 81706 107318 83972
10257 83972 77900 113107 100449 75842 82656 84278 73176 72897 82716 65322 40530 21998 34255
10244 34255 56585 63798 71395 93475 98962 103574 96748 120509 145942 154736 174931 192824 229039
10231 229039 267168 286382 285202 273877 260113 225625 242308 239231 187066 140400 89472 75879
10219 75879 68901 90930 106066 121406 118352 104270 98624 116355 114220 103066 96718 83998 79304
10206 79304 87819 92332 98287 101625 83735 68464 72015 90410 124672 159584 180976 216213 274486
10193 274486 349061 403709 453444 504232 560012 607132 643710 667175 657651 642438 627807 598472
$$ packed form
10281A40523N937J2948q525k9920j2820k0130j6834l966J1993J5125j614j1068
10269H1649N235L730O237J2557j2615k9700k3136J1249K4608J892K5612k3346
10257H3972o072L5207j2658k4607O814J622j1102k79R819j7394k4792j8532J2257
10244C4255K2330P213P597K2080N487M612o826K3761K5433Q794K0195J7893L6215
10231B29039L8129J9214j180j1325j3764l4488J6683l077n2165m6666n0928j3593
10219G5879o978K2029J5136J5340l054j4082n646J7731k135j1154o348j2720m694
10206G9304Q515M513N955L338j7890j5271L551J8395L4262L4912K1392L5237N8273
10193B74486P4575N4648M9735N0788N5780M7120L6578K3465r524j5213j4631k9335
$$ plain form
10181 598472 562943 522142 473954 442800 397696 349129 321021 277307 268006 291924 293453 265617
10169 265617 249121 249858 221483 219291 209652 213464 205377 177498 161628 131311 128117 131668 142681
10156 142681 141450 112202 143980 176560 210907 251411 304599 391255 497073 576942 665902
10145 665902 754466 795219 861545 918350 920918 876733 849578 836110 811742 792012 771533 704764
10133 704764 646383 605579 589130 569447 536240 510199 476085 472176 419582 379734 356424 330998
10121 330998 314304 301834 269430 245754 246321 240849 246975 260287 261173 253976 240703 237047 245360
10108 245360 257888 267819 286210 283939 289191 332642 398317 437458 456902 530127 609327 630885
10096 630885 681727 708501 732562 748702 771845 764124 723366 651108 574513 520472 465408 430058
$$ packed form
10181E98472l5529m0801m8188l1154m5104m8567k8108m3714r301K3918J529k7836
10169B65617j6496P37k8375k192r639L812q087k7879j5870l0317l194L551J1013
10156A42681j231k9248L1778L2580L4347M0504N3188Q6656J05818P9869Q8960
10145F65902Q8564M0753O6326N6805K568m4185k7155j3468k4368j9730k0479o6769
10133G04764n8381m0804j6449j9683l3207k6041l4114l909n2594l9848k3310k5426
10121C30998j6694j2470l2404k3676N67n472O126J3312Q86p197j3273l656Q313
10108B45360J2528R931J8391k271N252M3451O5675L9141J9444P3225P9200K1558
10096F30885N0842K6774K4061J6140K3143p721m0758p2258p6595n4041n5064l5350
$$ plain form
10084 430058 397671 367909 331787 309742 281985 275764 240540 193629 183068 195128 199594 189292
10072 189292 161623 178548 217608 225673 199425 180627 206615 208342 237954 276580 311627 381086
10060 381086 431382 532818 716466 1027330 1604973 2486286 3417786 3720610 3635378 3693564
10050 3693564 3963043 4184064 3374243 2236629 1570469 1148992 899747 747884 628369
10041 628369 549794 467274 415099 371400 348354 328765 316551 317500 298162 269430 254813 241432
10029 241432 231516 226015 191766 161203 153673 140898 138542 156551 130820 138108 113227 88837
10017 88837 103829 118583 114420 137641 137438 121336 127267 152180 130969 122207 113427 114280 88367
10004 88367 62127 60085 67372 79019 66561 51896 53976 48151 75365 66062 58917 76727 100100
$$ packed form
10084D30058l2387k9762l6122k2045k7757o221l5224m6911j0561J2060M466j0302
10072A89292k7669J6925L9060Q065k6248j8798K5988J727K9612L8626L5047O9459
10060C81086N0296J01436J83648L10864N77643Q81313R31500L02824q5232N8186
10050C693564K69479K21021q09821j137614o66160m21477k49245j51863j19515
10041F28369p8575q2520n2175m3699k3046j9589j2214R49j9338k8732j4617j3381
10029B41432r916n501l4249l0563p530j2775k356J8009k5731P288k4881k4390
10017H8837J4992J4754m163K3221k03j6102N931K4913k1211q762q780Q53k5913
10004H8367k6240k042P287J1647j2458j4665K080n825K7214r303p145J7810K3373
$$ plain form
9991 100100 108349 93348 82062 80537 78160 79917 93318 105652 104668 109425 97709 84740 85874
9978 85874 81808 53724 45727 50007 65241 70097 77473 71815 75280 87876 75559 82343 103631
9965 103631 93067 103974 123023 113687 103414 68811 71352 62992 65446 58320 24823 10367 25553
9952 25553 33826 43430 24338 -5921 7857 35712 51768 54444 51900 39033 16402 -4595 -29256
9939 -29256 -17162 -3452 -20199 -10574 1156 11114 -664 21487 17910 -22405 -30283 -38863 -61593
9926 -61593 -62201 -51768 -46388 -47707 -40553 -42639 -61649 -79299 -93376 -118320 -154349 -189558 -208130
9913 -208130 -204005 -199986 -168026 -124589 -86858 -74610 -77140 -44585 -27919 -26343 -11407 -6465 2139
9900 2139 -24540 -47540 -31884 -38455 -51693 -70916 -88200 -107073 -92300 -76826 -78982 -58483
$$ packed form
9991A00100Q249j5001j1286j525k377J757J3401J2334r84M757j1716j2969J134
9978H5874m066k8084p997M280J5234M856P376n658L465J2596j2317O784K1288
9965A03631j0564J0907J9049r336j0273l4603K541q360K454p126l3497j4456J5186
9952B5553Q273R604j9092l0259J3778K7855J6056K676k544j2867k2631k0997k4661
9939b9256J2094J3710j6747R625J1730R958j1778K2151l577m0315p878q580k2730
9926f1593o08J0433N380j319P154k086j9010j7650j4077k4944l6029l5209j8572
9913b08130M125M019L1960M3437L7731J2248k530L2555J6666J576J4936M942Q604
9900B139k6679k3000J5656o571j3238j9223j7284j8873J4773J5474k156K0499
$$ plain form
9888 -58483 -23508 1608 23259 17844 46523 75219 84048 45254 16129 24394 44258 53945 66808
9875 66808 90276 110744 92370 86677 90186 94410 111601 139743 191479 236718 259292 273466
9863 273466 312263 342292 349434 350582 356332 383660 407998 440472 487416 536629 580481 642893
9851 642893 748639 855660 971233 1143012 1305988 1472578 1660016 1838768 2002213 2144372
9841 2144372 2236887 2383451 2630770 2972963 3336047 3585861 3703598 3772112 3873805 3942737
9831 3942737 3817963 3465191 3060840 2768571 2593245 2483635 2396570 2374058 2381756 2401745
9821 2401745 2476077 2578193 2707789 2920320 3197843 3599843 4143274 4882168 5751349 6582352
9811 6582352 7328021 8025106 8715576 9243780 9325444 8995335 8513860 8048284 7557060 6959426
$$ packed form
9888e8483L4975K5116K1651n415K8679K8696Q829l8794k9125Q265J9864R687J2863
9875F6808K3468K0468j8374n693L509M224J7191K8142N1736M5239K2574J4174
9863B73466L8797L0029P142J148N750K7328K4338L2474M6944M9213M3852O2412
9851F42893J05746J07021J15573J71779J62976J66590J87438J78752J63445J42159
9841B144372R2515J46564K47319L42193L63084K49814J17737O8514J01693O8932
9831C942737j24774l52772m04351k92269j75326j09610q7065k2512P698J9989
9821B401745P4332J02116J29596K12531K77523M02000N43431P38894Q69181Q31003
9811F582352P45669O97085O90470N28204Q1664l30109m81475m65576m91224n97634
$$ plain form
9801 6959426 6341839 5825662 5438648 5140780 4919651 4806598 4713355 4685341 4785546 4964711
9791 4964711 5219088 5513843 5848785 6185003 6543179 6968909 7495268 8185601 9067289 10274971
9781 10274971 11907384 13981844 16281300 18528643 20579965 22524182 24504025 26579981
9773 26579981 28707302 31230098 34814409 40281712 48222156 57952227 66846485 73048905
9765 73048905 77616638 82003635 85727549 86206745 81909060 75361834 69195556 64212804
9757 64212804 60593746 57964353 56078556 55579528 57271971 61224901 66850211 73803121
9749 73803121 81867309 90227822 97694964 103483118 107682606 110683305 112153606 111641662
9741 111641662 109673773 106921975 103889707 100904861 98232800 96107574 94549814 93819985
$$ packed form
9801F959426o17587n16177l87014k97868k21129j13053r3243k8014J00205J79165
9791D964711K54377K94755L34942L36218L58176M25730N26359O90333Q81688J207682
9781A0274971J632413K074460K299456K247343K051322J944217J979843K075956
9773B6579981K127321K522796L584311N467303P940444R730071Q894258O202420
9765G3048905M567733M386997L723914M79196m297685o547226o166278m982752
9757F4212804l619058k629393j885797m99028J692443L952930N625310O952910
9749G3803121Q064188Q360513P467142N788154M199488L000699J470301n11944
9741A11641662j967889k751798l032268k984846k672061k125226j557760p29829
$$ plain form
9733 93819985 94628778 97727054 103410634 111457894 122543456 138398253 160157099 186211013
9725 186211013 210340286 225486746 231929546 234451681 234184399 226942529 207556314 180456380
9717 180456380 155447066 136485017 123376539 115035185 109851490 106512501 104668501 104565317
9709 104565317 106065197 108424278 110858543 113422895 116485300 119987431 123308210 125547431
9701 125547431 126113973 124772494 121274779 115728007 108814306 100993703 92582640 84384244
9693 84384244 77020017 71487097 68552833 68073946 69271508 71439245 74504951 78781952
9685 78781952 84217860 90136950 94927775 96598143 95223923 92607709 89611122 85411103
9677 85411103 78105210 68251068 59271671 52736795 48229178 45080983 42701463 40749894
$$ packed form
9733I3819985Q08793L098276N683580Q047260J1085562J5854797K1758846K6053914
9725A86211013K4129273J5146460O442800K522135k67282p241870j9386215k7099934
9717A80456380k5009314j8962049j3108478q341354n183695l338989j844000j03184
9709A04565317J499880K359081K434265K564352L062405L502131L320779K239221
9701A25547431N66542j341479l497715n546772o913701p820603q411063q198396
9693H4384244p364227n532920k934264m78887J197562K167737L065706M277001
9685G8781952N435908N919090M790825J670368j374220k616214k996587m200019
9677H5411103p305893r854142q979397o534876m507617l148195k379520j951569
$$ plain form
9669 40749894 38986576 37237475 35304577 33068875 30633442 28270552 26204240 24485318
9661 24485318 23098282 21914607 20885364 19953111 19104907 18292571 17529669 16824239 16172397
9652 16172397 15605666 15139719 14784095 14474568 14248686 14080994 14002862 14015314 14113422 14311273
9642 14311273 14578660 14859401 15129431 15364791 15475820 15277406 14803702 14125758 13375318
9633 13375318 12525708 11537182 10552454 9733459 9121627 8666258 8278829 7956996 7694817
9624 7694817 7507119 7326714 7148573 6959023 6805903 6689287 6606661 6585230 6589375 6619911
9614 6619911 6693931 6718563 6671118 6571753 6419290 6277683 6150404 5924181 5646551 5425549
9604 5425549 5219577 5068097 4938074 4778618 4610677 4404525 4217329 4021667 3851643 3694377
$$ packed form
9669D0749894j763318j749101j932898k235702k435433k362890k066312j718922
9661B4485318j387036j183675j029243r32253q48204q12336p62902p05430o51842
9652A6172397n66731m65947l55624l09527k25882j67692p8132J2452R8108J97851
9642A4311273K67387K80741K70030K35360J11029j98414m73704o77944p50440
9633A3375318q49610r88526r84728q18995o11832m55369l87429l21833k62179
9624G694817j87698j80405j78141j89550j53120j16616q2626k1431M145L0536
9614F619911P4020K4632m7445r9365j52463j41607j27279k26223k77630k21002
9604E425549k05972j51480j30023j59456j67941k06152j87196j95662j70024j57266
$$ plain form
9594 3694377 3519172 3348934 3223680 3107971 3015187 2939675 2903448 2845057 2781856 2693134 2612138
9583 2612138 2549964 2481648 2425884 2380056 2317084 2281838 2256693 2234307 2199068 2147565 2100305
9572 2100305 2054129 2009618 1961533 1889999 1866756 1860647 1823789 1781033 1726747 1694382 1679034 1657928
9560 1657928 1632661 1635544 1645152 1613816 1566415 1569800 1557050 1519241 1526928 1536145 1527846 1524345 1495331
9547 1495331 1470215 1449730 1450229 1434088 1425468 1404977 1374041 1358958 1322438 1279471 1294511 1330363
9535 1330363 1359679 1376007 1370702 1380104 1350471 1332573 1381194 1362065 1308898 1278904 1246910 1192008
9523 1192008 1164514 1174699 1184920 1172861 1125922 1092469 1078393 1060867 1033177 1010764 1039976
9512 1039976 1059765 1050777 1037545 1050877 1055038 1054674 1042896 1038732 1001564 994735 984712 973323 949213
$$ packed form
9594C694377j75205j70238j25254j15709r2784p5512l6227n8391o3201q8722q0996
9583B612138o2174o8316n5764m5828o2972l5246k5145k2386l5239n1503m7260
9572B100305m6176m4511m8085p1534k3243o109l6858m2756n4286l2365j5348k1106
9560A657928k5267K883R608l1336m7401L385j2750l7809P687R217q299l501k9014
9547A495331k5116k0485M99j6141q620k0491l0936j5083l6520m2967J5040L5852
9535A330363K9316J6328n305R402k9633j7898M8621j9129n3167k9994l1994n4902
9523A192008k7494J0185J0221j2059m6939l3453j4076j7526k7690k2413K9212
9512A039976J9789q988j3232J3332M161l64j1778m164l7168o829j0023j1389k4110
$$ plain form
9499 949213 931449 946465 935765 956295 960892 952061 936349 915933 906737 920685 899674 864473
9487 864473 876330 852133 856671 902640 915032 884635 851328 853276 832794 794486 772740 761878
9475 761878 784455 777342 751791 749363 761981 773992 757410 742347 750137 729665 734319 717893
9463 717893 701142 723737 725403 730906 695607 667858 694592 687217 653350 635240 615692 615415 630104
9450 630104 605253 597721 591837 576668 601470 623506 609605 587323 586829 600830 593685 599356 583644
9437 583644 596676 612823 606583 577452 561507 580690 577238 563042 564143 608207 617238 573059
9425 573059 550257 545994 549303 541331 524312 517559 529816 528536 542989 511055 476403 488191 506563
9412 506563 531088 522437 523332 518441 533682 518756 499509 511986 527686 549090 523619 502157
$$ packed form
9499I49213j7764J5016j0700K0530M597q831j5712k0416r196J3948k1011l5201
9487H64473J1857k4197M538M5969J2392l0397l3307J948k0482l8308k1746j0862
9475G61878K2577p113k5551k428J2618J2011j6582j5063P790k0472M654j6426
9463G17893j6751K2595J666N503l5299k7749K6734p375l3867j8110j9548k77J4689
9450F30104k4851p532n884j5169K4802K2036j3901k2282m94J4001p145N671j5712
9437E83644J3032J6147o240k9131j5945J9183l452j4196J101M4064R031m4179
9425E73059k2802m263L309p972j7019o753J2257j280J4453l1934l4652J1788J8372
9412E06563K4525q651Q95m891J5241j4926j9247J2477J5700K1404k5471k1462
$$ plain form
9400 502157 492987 476961 497240 529835 556273 592712 614422 647793 704023 740645 736561 733203
9388 733203 710446 696911 698206 676206 659865 652498 618430 561918 498766 517365 545827 553965
9376 553965 560832 560362 539752 509142 486533 489270 499746 486716 502853 518566 528946 529996 546875
9363 546875 544244 525729 534174 532933 551508 592916 601526 622242 648701 684810 746890 814710
9351 814710 882855 947073 1008848 1056881 1068340 1111876 1141822 1135163 1096561 1035595 1001690 975849
9339 975849 928853 864610 843310 835110 806852 774994 711536 666906 636131 631053 637609 618386
9327 618386 606254 597101 590148 568038 550977 544290 551169 538148 535991 547930 568839 588349 632006
9314 632006 676578 736095 768891 787431 805549 842480 878027 891303 897330 938841 970494 1027698
$$ packed form
9400E02157r170j6026K0279L2595K6438L6439K1710L3371N6230L6622m084l358
9388G33203k2757j3535J295k2000j6341p367l4068n6512o3152J8599K8462Q138
9376E53965O867m70k0610l0610k2609K737J0476j3030J6137J5713J0380J050J6879
9363E46875k631j8515Q445j241J8575M1408Q610K0716K6459L6109O2080O7820
9351H14710O8145O4218O1775M8033J1459M3536K9946o659l8602o0966l3905k5841
9339I75849m6996o4243k1300q200k8258l1858o3458m4630l0775n078O556j9223
9327F18386j2132r153o953k2110j7061o687O879j3021k157J1939K0909J9510M3657
9314F32006M4572N9517L2796J8540J8118L6931L5547J3276O027M1511L1653N7204
$$ plain form
9302 1027698 1083073 1126705 1155666 1190547 1247010 1288063 1265570 1214546 1198942 1150074 1107375
9291 1107375 1029512 937355 857068 791848 701430 607742 570508 537837 527692 533984 524553 517601
9279 517601 499273 471268 464619 491483 488517 466283 473071 499165 510295 512515 504077 499897 558505
9266 558505 573656 548182 553403 556209 535836 565814 618998 668893 710406 732195 775297 827002
9254 827002 881911 916414 917191 913030 880502 840708 786920 693031 610036 574213 532589 479372
9242 479372 461017 430441 396148 377463 366207 363884 373326 363408 381929 375692 354874 326386
9230 326386 310946 311783 320507 359739 360868 344417 352857 329839 310623 341860 327348 305257 313556
9217 313556 332803 371901 421040 441741 435906 447823 436951 439129 439165 455675 437391 419511 417058
$$ packed form
9302A027698N5375M3632K8961L4881N6463M1053k2493n1024j5604m8868m2699
9291A107375p7863r2157q0287o5220r0418r3688l7234l2671j0145O292r431o952
9279E17601j8328k8005o649K6864k966k2234O788K6094J1130K220q438m180N8608
9266E58505J5151k5474N221K806k0373K9978N3184M9895M1513K1789M3102N1705
9254H27002N4909L4503P77m161l2528l9794n3788r3889q2995l5823m1624n3217
9242D79372j8355l0576l4293j8685j1256k323R442r918J8521o237k0818k8488
9230C26386j5440Q37Q724L9232J129j6451Q440k3018j9216L1237j4512k2091Q299
9217C13556J9247L9098M9139K0701n835J1917j0872K178L6J6510j8284j7880k453
$$ plain form
9204 417058 407992 412928 385643 315777 299701 286313 270818 253193 246439 249201 282542 309950
9192 309950 294735 282038 281607 286744 281484 294927 300884 275226 252341 260601 285384 288526 288879
9179 288879 246892 217634 237274 234949 250982 267580 276061 264062 257481 233804 213544 208690
9167 208690 202881 205574 195044 202937 224425 260422 260797 214123 176880 162717 171600 172600 160412
9154 160412 168967 216998 240977 247534 207999 218472 226204 216340 220317 244163 255720 262812 236032
9141 236032 229483 242432 242949 221598 211412 209828 234421 242536 224102 215185 210929 172088 163688
9128 163688 183784 205530 216928 229362 229874 236103 240401 211651 186450 210519 213842 184761 175863
9115 175863 204614 207122 209577 229841 235767 227307 205449 218443 212874 192518 184013 202300 205315
$$ packed form
9204D17058r066M936k7285o9866j6076j3388j5495j7625o754K762L3341K7408
9192C09950j5215j2697m31N137n260J3443N957k5658k2885Q260K4783L142L53
9179B88879m1987k9258J9640k325J6033J6598Q481j1999o581k3677k0260m854
9167B08690n809K693j0530P893K1488L5997L75m6674l7243j4163Q883J000j2188
9154A60412Q555M8031K3979O557l9535J0473P732r864L977K3846J1557P092k6780
9141B36032o549J2949N17k1351j0186j584K4593Q115j8434q917m256l8841q400
9128A63688K0096K1746J1398J2434N12O229M298k8750k5201K4069L323k9081q898
9115A75863K8751K508K455K0264N926q460k1858J2994n569k0356q505J8287L015
$$ plain form
9102 205315 204282 199719 207057 194012 180885 189452 202087 213536 220319 209817 198372 205008 201963
9089 201963 198018 205209 209476 227595 257560 216109 170384 179429 209178 208675 203477 211914 206692
9076 206692 211958 194899 195611 213166 192748 181585 182362 162019 152919 152362 184372 194911 186334
9063 186334 171825 166403 167078 185019 195709 218422 217862 208813 222956 211662 197062 202701 182404
9050 182404 174242 184212 176843 173136 168891 181661 191915 191753 190162 221767 218660 180976 159413
9037 159413 173108 142954 124996 152812 153978 149795 146659 152209 156690 141124 112948 128722 140634
9024 140634 179467 189803 173485 172225 161872 136270 120762 112332 102862 105701 140211 160194
9012 160194 155944 143575 164414 176765 168504 168042 184371 180796 145828 141991 133696 117194 148459
$$ packed form
9102B05315j033m563P338j3045j3127Q567J2635J1449O783j0502j1445O636l045
9089B01963l945P191M267J8119K9965m1451m5725R045K9749n03n198Q437n222
9076B06692N266j7059P12J7555k0418j1163P77k0343r100n57L2010J0539q577
9063A86334j4509n422O75J7941J0690K2713n60r049J4143j1294j4600N639k0297
9050A82404q162R970p369l707m245J2770J0254j62j591L1605l107l7684k1563
9037A59413J3695l0154j7958K7816J166m183l136N550M481j5566k8176J5774J1912
9024A40634L8833J0336j6318j260j0353k5602j5508q430r470K839L4510J9983
9012A60194m250j2369K0839J2351q261m62J6329l575l4968l837q295j6502L1265
$$ plain form
8999 148459 173330 163154 168717 170141 155546 147371 151104 189207 180075 172212 190001 196609 172704
8986 172704 142140 137251 148804 184961 182772 164997 167520 143837 120510 118255 116640 113336 99749
8973 99749 106370 112943 144560 156045 162494 193737 216599 194460 176408 144839 110382 135140
8961 135140 152505 154481 149389 175043 188777 190587 177548 177979 145390 118869 147960 174332 175401
8948 175401 155987 148404 137132 132822 140719 157225 165486 175800 181546 193493 181833 184161 156933
8935 156933 155120 179771 155083 139928 155181 166668 178104 178745 150348 146001 137480 128732 153736
8922 153736 171158 143376 123522 109958 125308 132075 108829 113019 119846 126748 159932 135068
8910 135068 119684 126847 126175 124551 141869 159611 156585 136031 127047 120727 131637 118027 140156
$$ packed form
8999A48459K4871j0176N563J424j4595q175L733L8103r132p863J7789O608k3905
8986A72704l0564m889J1553L6157k189j7775K523k3683k3327k255j615l304j3587
8973I9749O621O573L1617J1485O449L1243K2862k2139j8052l1569l4457K4758
8961A35140J7365J976n092K5654J3734J810j3039M31l2589k6521K9091K6372J069
8948A75401j9414p583j1272m310P897J6506Q261J0314N746J1947j1660K328k7228
8935A56933j813K4651k4688j5155J5253J1487J1436O41k8397m347q521q748K5004
8922A53736J7422k7782j9854j3564J5350O767k3246M190O827O902L3184k4864
8910A35068j5384P163o72j624J7318J7742l026k0554q984o320J0910j3610K2129
$$ plain form
8897 140156 159504 143129 150339 149042 128181 164776 156856 171834 213154 235137 250782 229073
8885 229073 189020 158619 159096 163530 164344 160595 167775 163925 160297 167607 164598 151286 126903 97030
8871 97030 100932 120063 118979 123613 131470 148953 138243 129527 143750 136696 135187 145392 174854
8858 174854 182441 177891 162582 145520 163948 182752 176991 180774 141078 106165 115958 111950 89548
8845 89548 101191 122945 114661 114352 111562 115869 105562 88991 115308 121506 125899 134823 140634 118342
8831 118342 121031 129173 101010 74740 90624 101788 84461 75152 89625 107609 112033 100783
8819 100783 64831 46967 67644 101425 119430 118346 116225 128735 136723 122716 97250 105994
8807 105994 124975 121759 114084 102227 96650 110476 129808 153687 173492 187080 161388 140998
$$ packed form
8897A40156J9348j6375P210j297k0861L6595p920J4978M1320K1983J5645k1709
8885B29073m0053l0401M77M434Q14l749P180l850l628P310l009j3312k4383k9873
8871I7030L902J9131j084M634P857J7483j0710q716J4223p054j509J0205K9462
8858A74854P587m550j5309j7062J8428J8804n761L783l9696l4913R793m008k2402
8845H9548J1643K1754q284l09k790M307j0307j6571K6317O198M393Q924N811k2292
8831A18342K689Q142k8163k6270J5884J1164j7327r309J4473J7984M424j1250
8819A00783l5952j7864K0677L3781J8005j084k121J2510P988j4007k5466Q744
8807A05994J8981l216p675j1857n577J3826J9332K3879J9805J3588k5692k0390
$$ plain form
8795 140998 113260 110768 129455 160168 162813 147757 159712 143999 123320 138827 146450 149689
8783 149689 152176 166754 133391 130654 152622 185102 188060 160561 160483 154877 139592 120499 119492
8770 119492 128706 137107 156177 137963 110234 123176 156171 137554 115917 123638 136237 145670
8758 145670 150795 155033 160039 166828 167713 156508 135306 119223 122905 112443 133470 157687 129930
8745 129930 100609 82963 84800 80082 76821 67636 84644 116708 133352 149837 148791 129852 107294
8732 107294 94598 81791 100849 97424 109332 120268 113654 128808 150820 156018 147514 114877
8720 114877 93992 67573 76060 111189 116045 102680 89078 91045 104182 119049 118132 128134 120461
8707 120461 117924 111870 121838 120480 130345 144622 186148 190645 193702 182909 153958 148108 159553
$$ packed form
8795A40998k7738k492J8687L0713K645j5056J1955j5713k0679J5507P623L239
8783A49689K487J4578l3363k737K1968L2480K958k7499p8n606j5285j9093j007
8770A19492R214Q401J9070j8214k7729J2942L2995j8617k1637P721J2599R433
8758A45670N125M238N006O789Q85j1205k1202j6083L682j0462K1027K4217k7757
8745A29930k9321j7646J837m718l261r185J7008L2064J6644J6485j046j8939k2558
8732A07294j2696j2807J9058l425J1908J0936o614J5154K2012N198q504l2637
8720A14877k0885k6419Q487L5129M856j3365j3602J967J3137J4867r17J0002p673
8707A20461k537o054R968j358R865J4277M1526M497L057j0793k8951n850J1445
$$ plain form
8694 159553 145149 156633 167024 172508 153245 114836 124086 139317 133223 149489 141509 130262
8682 130262 126938 110102 124890 156124 154447 154507 147961 118874 109569 144774 134685 120928 132782
8669 132782 148556 138429 166718 207502 193031 162265 152358 152304 121539 115080 84987 88806 104566
8656 104566 140858 180854 159950 122604 118817 143077 149974 137524 130582 149508 167123 172119
8644 172119 198148 195534 189874 189932 187789 196563 173083 177373 181909 171616 196172 182931 152868
$$ packed form
8694A59553j4404J1484J0391N484j9263l8409R250J5231o094J6266p980j1247
8682A30262l324j6836J4788L1234j677O0o546k9087r305L5205j0089j3757J1854
8669A32782J5774j0127K8289M0784j4471l0766r907n4l0765o459l0093L819J5760
8656A04566L6292L9996k0904l7346l787K4260O897j2450o942J8926J7615M996
8644A72119K6029k614n660N8k143Q774k3480M290M536j0293K4556j3241l0063
$$ [...]
##END NTUPLES=NMR SPECTRUM
##END=
