##TITLE=Analysis number 320999
Compound Code cc 44814
Book Reference 438/174
Project Code adrs
Chemist Name antons
##JCAMPDX= 6.0         $$ Bruker NMR JCAMP-DX V2.0
##DATA TYPE= NMR SPECTRUM
##DATA CLASS= NTUPLES
##ORIGIN= Bruker BioSpin GmbH
##OWNER= nmr
$$ XWIN-NMR		Version 3.5
$$ Thu Jul 20 10:28:45 2006 GMT Daylight Time (UT+1h)  MAYBRIDGE\nmr@NMR_250MHZ
##.OBSERVE FREQUENCY= 250.131544655141
##.OBSERVE NUCLEUS= ^1H
##.ACQUISITION MODE= SIMULTANEOUS (DQD)
##.ACQUISITION SCHEME= undefined
##.AVERAGES= 16
##.DIGITISER RES= 18
##SPECTROMETER/DATA SYSTEM= dpx250
##.PULSE SEQUENCE= zg30
##.SOLVENT NAME= CDCl3
##.SHIFT REFERENCE= (INTERNAL, CDCl3, 0, 16.522)
##AUDIT TRAIL= $$ (NUMBER, WHEN, WHO, WHERE, WHAT)
$$ ##TITLE= Audit trail, XWIN-NMR		Version 3.5
$$ ##JCAMPDX= 5.01
$$ ##ORIGIN= Bruker BioSpin GmbH
$$ ##OWNER= nmr
$$ C:\u/data/dgb/nmr/ADRS/3120/pdata/1/auditp.txt
$$ ##AUDIT TRAIL=  $$ (NUMBER, WHEN, WHO, WHERE, WHAT)
(   1,<2006-07-20 10:28:24.84 +100>,<MAYBRIDGE\nmr>,<NMR_250MHZ>,
      <created by zg, POWCHK disabled, PULCHK disabled
       configuration hash MD5:
       E2 DF 36 D8 04 B2 41 60 5A D7 A3 38 5A 4B D0 FE
       data hash MD5: 64K
       73 A1 D9 AB F8 1D 77 E4 32 ED A6 0A BB CA 83 11>)
(   2,<2006-07-20 10:28:37.14 +100>,<MAYBRIDGE\nmr>,<NMR_250MHZ>,
      <Start of raw data processing
       ef LB = 0.3 FT_mod = 6 PKNL = 1 SI = 32K 
       data hash MD5: 32K
       82 3B 8E A6 91 BE C2 37 5E D9 82 C3 AC 67 83 DF>)
(   3,<2006-07-20 10:28:38.87 +100>,<MAYBRIDGE\nmr>,<NMR_250MHZ>,
      <apk 
       data hash MD5: 32K
       BF B2 76 70 63 77 67 06 46 25 F8 84 F8 DE 3A 60>)
(   4,<2006-07-20 10:28:39.66 +100>,<MAYBRIDGE\nmr>,<NMR_250MHZ>,
      <abs ABSG = 5 
       data hash MD5: 32K
       C5 DD C6 13 6F 21 5E 3A 22 53 D8 80 F9 78 79 5C>)
$$ ##END=
$$ 
$$ hash MD5
$$ 29 DD B7 65 6E D0 CA 60 F6 10 4A 40 86 A7 9B 94
##$RELAX= 
##$RELAX= 
##$RELAX= 
##$RELAX= 
##$RELAX= 
##$RELAX= 
##$RELAX= 
$$ Bruker specific parameters
$$ --------------------------
##$DU= <C:\u>
##$EXPNO= 3120
##$NAME= <ADRS>
##$PROCNO= 1
##$TYPE= <nmr>
##$USER= <dgb>
##$AMP= (0..31)
100 100 100 100 100 100 100 100 100 100 100 100 100 100 100 100 100 100 
100 100 100 100 100 100 100 100 100 100 100 100 100 100 
##$AQSEQ= 0
##$AQ_mod= 3
##$AUNM= <au_zg>
##$AUTOPOS= <23 >
##$BF1= 250.13
##$BF2= 250.13
##$BF3= 250.13
##$BF4= 250.13
##$BF5= 500.13
##$BF6= 500.13
##$BF7= 500.13
##$BF8= 500.13
##$BYTORDA= 1
##$CFDGTYP= 0
##$CFRGTYP= 5
##$CHEMSTR= <none>
##$CNST= (0..31)
1 1 145 1 1 1 1 1 1 1 1 1 1 1 1 1 1 1 1 1 1 1 1 1 1 1 1 1 1 1 1 1 
##$CPDPRG= <>
##$CPDPRG1= <>
##$CPDPRG2= <>
##$CPDPRG3= <>
##$CPDPRG4= <mlev>
##$CPDPRG5= <mlev>
##$CPDPRG6= <mlev>
##$CPDPRG7= <mlev>
##$CPDPRG8= <mlev>
##$CPDPRGB= <>
##$CPDPRGT= <>
##$D= (0..31)
0 1 0 0 0 0 0 0 0 0.06 0 0 0 0 0 0 0.0002 0 0 0 0 0 0 0 0 0 0 0 0 0 0 
0 
##$DATE= 1153387703
##$DBL= (0..7)
120 120 120 120 120 120 120 120 
##$DBP= (0..7)
150 150 150 150 150 150 150 150 
##$DBP07= 0
##$DBPNAM0= <>
##$DBPNAM1= <>
$$ [...]
##$SUBNAM7= <"">
##$SUBNAM8= <"">
##$SUBNAM9= <"">
##$SW= 20.6930455092707
##$SWIBOX= (0..15)
0 0 3 0 0 0 0 0 0 0 0 0 0 0 0 0 
##$SW_h= 5175.983436853
##$TD= 65536
##$TD0= 1
##$TE= 295.16
##$TE2= 300
##$TE3= 300
##$TEG= 300
##$TL= (0..7)
0 120 120 120 120 120 120 120 
##$TP= (0..7)
150 150 150 150 150 150 150 150 
##$TP07= 0
##$TPNAME0= <>
##$TPNAME1= <>
##$TPNAME2= <>
##$TPNAME3= <>
##$TPNAME4= <>
##$TPNAME5= <>
##$TPNAME6= <>
##$TPNAME7= <>
##$TPOAL= (0..7)
0.5 0.5 0.5 0.5 0.5 0.5 0.5 0.5 
##$TPOFFS= (0..7)
0 0 0 0 0 0 0 0 
##$TUNHIN= 0
##$TUNHOUT= 0
##$TUNXOUT= 0
##$USERA1= <user>
##$USERA2= <user>
##$USERA3= <user>
##$USERA4= <user>
##$USERA5= <user>
##$V9= 5
##$VALIST= <valist>
##$VCLIST= <CCCCCCCCCCCCCCC>
##$VD= 0
##$VDLIST= <DDDDDDDDDDDDDDD>
##$VPLIST= <PPPPPPPPPPPPPPP>
##$VTLIST= <TTTTTTTTTTTTTTT>
##$WBST= 1024
##$WBSW= 4
##$XGAIN= (0..3)
0 0 0 0 
##$XL= 0
##$YL= 0
##$YMAX_a= 607067
##$YMIN_a= -454468
##$ZGOPTNS= <>
##$ZL1= 120
##$ZL2= 120
##$ZL3= 120
##$ZL4= 120
##$ABSF1= 16.522
##$ABSF2= -4.171173
##$ABSG= 5
##$ABSL= 3
##$ALPHA= 0
##$AQORDER= 0
##$ASSFAC= 0
##$ASSFACI= 0
##$ASSFACX= 0
##$ASSWID= 0
##$AUNMP= <proc_1d>
##$AZFE= 0.1
##$AZFW= 0.1
##$BCFW= 0
##$BC_mod= 0
##$BYTORDP= 0
##$COROFFS= 0
##$CY= 12.5
##$DATMOD= 1
##$DC= 0
##$DFILT= <>
##$DTYPP= 0
##$F1P= 14.0000005364418
##$F2P= -0.99999901652339
##$FCOR= 0.5
##$FTSIZE= 32768
##$FT_mod= 6
##$GAMMA= 0
##$GB= 0
##$INTBC= 1
##$INTSCL= 1
##$ISEN= 128
##$LB= 0.3
##$LEV0= 0
##$LPBIN= 0
##$MAXI= 10000
##$MC2= 0
##$MEAN= 0
##$ME_mod= 0
##$MI= 0
##$NCOEF= 0
##$NC_proc= -5
##$NLEV= 6
##$NOISF1= 0
##$NOISF2= 0
##$NSP= 0
##$NTH_PI= 0
##$NZP= 0
##$OFFSET= 16.522
##$PC= 1
##$PHC0= 11.23796
##$PHC1= 8.517187
##$PH_mod= 1
##$PKNL= yes
##$PPARMOD= 0
##$PSCAL= 4
##$PSIGN= 0
##$REVERSE= no
##$SF= 250.13
##$SI= 32768
##$SIGF1= 0
##$SIGF2= 0
##$SINO= 400
##$SIOLD= 32768
##$SREGLST= <1H.CDCl3>
##$SSB= 0
##$STSI= 32768
##$STSR= 0
##$SW_p= 5175.98343685301
##$SYMM= 0
##$S_DEV= 0
##$TDeff= 65536
##$TDoff= 0
##$TI= <Analysis number 999999
Compound Code 99
Book Reference 9
Project Code 9>
##$TILT= no
##$TM1= 0
##$TM2= 0
##$TOPLEV= 0
##$USERP1= <user>
##$USERP2= <user>
##$USERP3= <user>
##$USERP4= <user>
##$USERP5= <user>
##$WDW= 1
##$XDIM= 32768
##$YMAX_p= 481346373
##$YMIN_p= -110909
$$ End of Bruker specific parameters
$$ ---------------------------------
##NTUPLES= NMR SPECTRUM
##VAR_NAME=  FREQUENCY,     SPECTRUM/REAL,   SPECTRUM/IMAG
##SYMBOL=    X,             R,               I
##VAR_TYPE=  INDEPENDENT,   DEPENDENT,       DEPENDENT
##VAR_FORM=  AFFN,          ASDF,            ASDF
##VAR_DIM=   32768,         32768,           32768
##UNITS=     HZ,            ARBITRARY UNITS, ARBITRARY UNITS
##FACTOR=    0.157963299565203, 1,           1
##FIRST=     4132.6476996994, 0,             0
##LAST=      -1043.33573715361, 0,           0
##MIN=       -1043.33573715361, -110909,     0
##MAX=       4132.6476996994, 481346373,     0
$$ Real data points
##PAGE= N=1
##DATA TABLE= (X++(R..R)), XYDATA
$$ [...]
$$ plain form
15247 -70693 -77476 -69003 -71887 -64890 -39833 -36077 -29084 -36757 -40860 -45755 -40232 -30220 -36952 -50411
15233 -50411 -60262 -68133 -78245 -83848 -64388 -48581 -39629 -37009 -44151 -42232 -43616 -42412 -36941 -32576
15219 -32576 -39678 -50139 -55163 -64891 -76351 -80466 -67445 -75004 -66030 -64005 -60955 -62505 -72722
15206 -72722 -71678 -69427 -62961 -60107 -55103 -50272 -42498 -40307 -46682 -37516 -23040 -30256 -36556 -43263
15192 -43263 -47140 -52756 -52841 -61575 -71783 -62306 -52404 -62023 -61966 -58787 -54773 -60078 -72027 -86540 -79862
15177 -79862 -67131 -40835 -32000 -46365 -58914 -65043 -62311 -64752 -53813 -42676 -35307 -47052 -57903
15164 -57903 -64792 -61385 -77610 -86334 -75869 -79243 -84770 -78587 -77114 -75166 -77375 -77799 -66285 -63456
15150 -63456 -64737 -75816 -76105 -67854 -68805 -82475 -81019 -79365 -81958 -93439 -110211 -102401 -85752 -76034
$$ packed form
15247g0693o783Q473k884O997K5057L756O993p673m103m895N523J0012o732j3459
15233e0411r851p871j0112n603J9460J5807Q952K620p142J919j384J204N471M365
15219c2576p102j0461n024r728j1460m115J3021p559Q974K025L050j550j0217
15206g2722J044K251O466K854N004M831P774K191o375R166J4476p216o300o707
15192d3263l877n616q5q734j0208R477R902r619N7L179M014n305j1949j4513O678
15177g9862J2731K6296Q835j4365j2549o129K732k441J0939J1137P369j1745j0851
15164e7903o889L407j6225q724J0465l374n527O183J473J948k209m24J1514K829
15150f3456j281j1079k89Q251r51j3670J456J654k593j1481j6772P810J6649R718
$$ plain form
15136 -76034 -58712 -46855 -47115 -53286 -60231 -68242 -91714 -100741 -92884 -83164 -70423 -65889 -50674
15123 -50674 -44320 -50688 -58708 -64313 -82417 -84179 -76577 -60906 -53192 -55665 -61767 -67662 -69704 -72209
15109 -72209 -83587 -90176 -79355 -78626 -80553 -91744 -101089 -92507 -81143 -87624 -92144 -92972 -92431 -86578
15095 -86578 -80203 -65735 -51401 -58346 -73971 -72093 -69992 -85490 -73732 -59530 -58909 -44504 -33037
15082 -33037 -34869 -58304 -60235 -81241 -96096 -97907 -87469 -77399 -72870 -64440 -61306 -56997 -54338
15069 -54338 -42600 -36791 -43054 -63838 -62466 -61041 -61575 -76367 -65087 -57129 -62166 -65927 -63500 -55222
15055 -55222 -56083 -68672 -84372 -88004 -70509 -81097 -91714 -83501 -87537 -101307 -99189 -79022 -62701
15042 -62701 -59812 -58017 -61988 -76243 -63403 -60797 -61328 -55894 -67229 -75162 -69959 -66880 -52370 -52137
$$ packed form
15136g6034J7322J1857k60o171o945q011k3472r027P857R720J2741M534J5215
15123e0674O354o368q020n605j8104j762P602J5671P714k473o102n895k042k505
15109g2209j1378o589J0821P29j927j1191r345Q582J1364o481m520q28N41N853
15095h6578O375J4468J4334o945j5625J878K101j5498J1758J4202O21J4405J1467
15082c3037j832k3435j931k1006j4855j811J0438J0070M529Q430L134M309K659
15069e4338J1738N809o263k0784J372J425n34j4792J1280P958n037l761K427Q278
15055e5222q61j2589j5700l632J7495j0588j0617Q213m036j3770K118K0167J6321
15042f2701K889J795l971j4255J2840K606n31N434j1335p933N203L079J4510K33
$$ plain form
15028 -52137 -64406 -66295 -74697 -76103 -76289 -75461 -73909 -67954 -60862 -61270 -76095 -78459 -69569 -67387 -54347
15013 -54347 -57313 -62680 -48543 -58280 -56753 -46534 -49409 -48469 -51463 -60538 -65154 -65026 -83063 -74573
14999 -74573 -73555 -79497 -82846 -86792 -81677 -65153 -61654 -64497 -57287 -51969 -60128 -75975 -77443 -82219
14985 -82219 -71364 -73648 -70477 -71419 -69036 -64358 -56491 -41963 -33776 -26184 -39305 -47266 -37491 -42472
14971 -42472 -52625 -44557 -47284 -55856 -66433 -68014 -67003 -69202 -77813 -64848 -55328 -54824 -57433 -68031
14957 -68031 -69364 -50374 -16111 4935 27977 50112 78128 90758 108834 130365 166963 178767
14945 178767 166281 135811 111958 88312 64643 30810 15173 8178 279 -3866 -3569 -17525
14933 -17525 -33885 -41445 -44695 -31653 -26281 -35812 -38249 -24710 -19227 -14148 -5019 982 25476
$$ packed form
15028e2137j2269j889q402j406j86Q28J552N955P092m08j4825k364Q890K182J3040
15013e4347k966n367J4137r737J527J0219k875R40k994r075m616J28j8037Q490
14999g4573J018n942l349l946N115J6524L499k843P210N318q159j5847j468m776
14985h2219J0855k284L171r42K383M678P867J4528Q187P592j3121p961R775m981
14971d2472j0153Q068k727q572j0577j581J011k199q611J2965R520N04k609j0598
14957f8031j333J8990L4263K1046K3042K2135K8016J2630J8076K1531L6598J1804
14945A78767j2486l0470k3853k3646k3669l3833j5637o995p899m145K97j3956
14933a7525j6360p560l250J3042N372r531k437J3539N483N079R129O001K4494
$$ plain form
14920 25476 69671 112321 161455 206708 243762 280290 311474 352391 367103 364619 360128 331154
14908 331154 269595 225650 193803 168601 134941 110553 101731 91410 82755 64499 63684 60431
14896 60431 54010 53564 57045 65138 68441 69783 78994 89602 82374 83308 94886 102861 99551 97602
14882 97602 105855 109913 129092 117634 95805 99227 99049 86597 60720 27515 4498 -5128 -7609
14869 -7609 -5230 -4131 -17589 -15488 -33356 -52492 -42289 -41639 -42800 -37779 -30357 -20973 -23736 -42992
14855 -42992 -51831 -39031 -37333 -35748 -42839 -54322 -57185 -54987 -42020 -35360 -34429 -39143 -40949 -47395
14841 -47395 -57609 -55408 -59019 -62787 -62283 -48979 -50066 -56605 -43701 -32752 -31455 -32736 -50300
14828 -50300 -60935 -60554 -74287 -91605 -103958 -99161 -71757 -61614 -58450 -61350 -67224 -81394 -89256
$$ packed form
14920B5476M4195M2650M9134M5253L7054L6528L1184M0917J4712k484m491k8974
14908C31154o1559m3945l1847k5202l3660k4388q822j0321q655j8256q15l253
14896F0431o421m46L481Q093L303J342R211J0608p228R34J1578P975l310j949
14882I7602Q253M058J9179j1458k1829L422j78j2452k5877l3205k3017r626k481
14869g609K379J099j3458K101j7868j9136J0203O50j161N021P422R384k763j9256
14855d2992q839J2800J698J585p091j1483k863K198J2967O660R31m714j806o446
14841d7395j0214K201l611l768N04J3304j087o539J2904J0949J297j281j7564
14828e0300j0635L81j3733j7318j2353M797K7404J0143L164k900n874j4170p862
$$ plain form
14815 -89256 -70755 -53455 -45255 -49201 -66123 -82280 -90667 -93414 -85979 -79104 -70329 -75340 -68905
14802 -68905 -65475 -66107 -68540 -78534 -90351 -89276 -84609 -86966 -81381 -82079 -74228 -67002 -69444 -70073 -64860
14787 -64860 -66575 -65867 -62630 -59664 -45946 -38320 -30754 -28681 -38657 -66962 -66414 -63144 -60586 -58807
14773 -58807 -61798 -64166 -65700 -69310 -67770 -69673 -60774 -52078 -67086 -67909 -60715 -61069 -57925 -53680 -64391
14758 -64391 -69505 -63409 -71238 -53357 -53241 -52405 -46682 -36943 -43230 -47054 -56552 -60406 -59238 -57862 -67420
14743 -67420 -69983 -63592 -69993 -81021 -83884 -77543 -68767 -72671 -82217 -87250 -81022 -67864 -66365 -78694
14729 -78694 -81818 -60475 -56715 -70080 -76410 -61493 -55652 -59942 -74230 -72373 -63461 -66222 -66243 -71833
14715 -71833 -75095 -61558 -58098 -60402 -64188 -58532 -56383 -50071 -38679 -40899 -53116 -55086 -62677 -69946
$$ packed form
14815h9256J8501J7300Q200l946j6922j6157q387k747P435O875Q775n011O435
14802f8905L430o32k433r994j1817J075M667k357N585o98P851P226k442o29N213
14787f4860j715P08L237K966J3718P626P566K073r976k8305N48L270K558J779
14773e8807k991k368j534l610J540j903Q899Q696j5008q23P194l54L144M245j0711
14758f4391n114O096p829J7881J16Q36N723R739o287l824r498l854J168J376r558
14743f7420k563O391o401j1028k863O341Q776l904r546n033O228J3158J499j2329
14729g8694l124K1343L760j3365o330J4917N841m290j4288J857Q912k761k1n590
14715g1833l262J3537L460k304l786N656K149O312J1392k220j2217j970p591p269
$$ plain form
14701 -69946 -76970 -83318 -86602 -72574 -63135 -65643 -63834 -59210 -60436 -68788 -71169 -62704 -71240 -93716
14687 -93716 -88504 -70957 -72408 -80744 -69891 -55176 -61909 -74110 -59201 -51110 -47974 -51673 -54159
14674 -54159 -64365 -79607 -75614 -80932 -96093 -101673 -96715 -89369 -82432 -74983 -70170 -75514 -73188 -76591
14660 -76591 -90508 -89191 -92278 -92107 -88102 -78461 -64607 -64783 -67599 -73744 -79668 -79009 -84855 -80412 -76434
14645 -76434 -65555 -56117 -71287 -66317 -65289 -72185 -83684 -83152 -75967 -79628 -93514 -87174 -75174
14632 -75174 -71421 -66270 -59180 -61678 -65553 -75710 -83240 -80031 -80251 -80385 -74957 -68494 -68018 -63687 -65469
14617 -65469 -72792 -75219 -71212 -83900 -89161 -87534 -85395 -79144 -73451 -73445 -68801 -71513 -74725 -88305 -78989
14602 -78989 -70230 -69763 -54858 -48253 -61232 -67393 -65235 -56097 -52336 -55954 -76745 -92126 -94255 -90017
$$ packed form
14701f9946p024o348l284J4028R439k508J809M624j226q352k381Q465q536k2476
14687i3716N212J7547j451q336J0853J4715o733j2201J4909Q091L136l699k486
14674e4159j0206j5242L993n318j5161n580M958P346O937P449M813n344K326l403
14660g6591j3917J317l087J71M005R641J3854j76k816o145n924O59n846M443L978
14645g6434J0879R438j5170M970J028o896j1499N32P185l661j3886O340J2000
14632g5174L753N151P090k498l875j0157p530L209k20j34N428O463M76M331j782
14617f5469p323k427M007j2688n261J627K139O251N693OM644k712l212j3580R316
14602g8989Q759M67J4905O605j2979o161K158R138L761l618k0791j5381k129M238
$$ plain form
14588 -90017 -71277 -56990 -55013 -63972 -64030 -59281 -63815 -63412 -59309 -56646 -41338 -52802 -56971 -64745
14574 -64745 -68214 -55619 -42241 -39044 -46240 -63986 -63835 -40601 -39965 -44212 -60129 -69863 -69891 -65132
14560 -65132 -66831 -71100 -76018 -77843 -67523 -79445 -82758 -69745 -55351 -50814 -51338 -56391 -50751 -59011
14546 -59011 -81476 -81672 -80194 -89815 -91532 -87811 -87542 -84677 -79287 -76130 -88749 -90665 -73289 -70912
14532 -70912 -70133 -72277 -81148 -83018 -84536 -81517 -83046 -83226 -88707 -88709 -88989 -77569 -80150 -78370 -78748 -64946
14516 -64946 -78002 -98637 -104434 -90353 -83320 -87267 -96983 -97190 -86084 -75231 -68925 -71580 -71342 -83794
14502 -83794 -80182 -77221 -80487 -97667 -94980 -88713 -84817 -81845 -91196 -86651 -81112 -82079 -82460 -87273 -72899
14487 -72899 -76241 -71226 -66949 -69035 -83270 -88001 -90260 -68071 -61283 -63762 -69263 -57267 -53460 -63936
$$ packed form
14588i0017J8740J4287J977q959n8M749m534M03M103K663J5308j1464m169p774
14574f4745l469J2595J3378L197p196j7746J51K3234O36m247j5917r734k8M759
14560f5132j699m269m918j825J0320j1922l313J3013J4394M537n24n053N640q260
14546e9011k2465j96J478r621j717L721K69K865N390L157j2619j916J7376K377
14532g0912P79k144q871j870j518L019j529j80n481kk80J1420k581J780l78J3802
14516f4946j3056k0635n797J4081P033l947r716k07J1106J0853O306k655K38j2452
14502h3794L612K961l266j7180K687O267L896K972r351M545N539r67l81m813J4374
14487g2899l342N015M277k086j4235m731k259K2189O788k479n501J1996L807j0476
$$ plain form
14473 -63936 -62661 -62373 -82167 -93918 -92389 -85494 -83403 -71346 -62269 -51446 -52980 -64107 -78016
14460 -78016 -90017 -92985 -85445 -78966 -78518 -57047 -40101 -47874 -57693 -70313 -67525 -75244 -84174 -74610
14446 -74610 -62698 -52941 -62454 -73406 -78193 -88734 -94139 -95718 -86887 -101884 -110909 -94447 -70935
14433 -70935 -59862 -64549 -65874 -65259 -65933 -71913 -71642 -68593 -68787 -65687 -52584 -43010 -39513 -55496 -53784
14418 -53784 -48582 -55662 -67495 -73159 -63614 -62775 -61178 -65128 -61177 -62366 -68524 -58861 -70359 -86672
14404 -86672 -87350 -71516 -67321 -77011 -99275 -96410 -103330 -96309 -90362 -81762 -75881 -78310 -76376 -64276
14390 -64276 -75174 -90435 -85736 -69745 -77442 -79229 -72351 -65698 -42660 -41003 -43439 -47152 -42810
14377 -42810 -51171 -56010 -60250 -81696 -81657 -74321 -75927 -87197 -97939 -92559 -82083 -77870 -85118 -86265
$$ packed form
14473f3936J275K88j9794j1751J529O895K091J2057R077J0823j534j1127j3909
14460g8016j2001k968P540O479M48K1471J6946p773r819j2620K788p719q930R564
14446g4610J1912R757r513j0952m787j0541n405j579Q831j4997r025J6462K3512
14433g0935J1073m687j325O15o74n980K71L049j94L100J3103R574L497j5983J712
14418e3784N202p080j1833n664R545Q39J597l950L951j189o158R663j1498j6313
14404h6672o78J5834M195r690k2264K865o920P021N947Q600N881k429J934J2100
14390f4276j0898j5261M699J5991p697j787O878O653K3038J657k436l713M342
14377d2810q361m839m240k1446L9P336j606j1270j0742N380J0476M213p248j147
$$ plain form
14363 -86265 -100244 -103784 -87624 -82284 -80917 -76693 -69261 -68781 -79044 -77023 -69140 -73506 -78091 -76068
14349 -76068 -81714 -101152 -101801 -87814 -66278 -73370 -74999 -67815 -62287 -63233 -79919 -79476 -80056 -95129
14335 -95129 -97328 -97018 -85774 -69865 -73841 -84902 -72859 -74389 -69700 -71274 -88606 -95791 -79858
14322 -79858 -62233 -56165 -65266 -86943 -92153 -85804 -78851 -69070 -63091 -56334 -59815 -39999 -45503 -44305
14308 -44305 -41417 -64667 -77755 -67970 -43674 -48033 -66119 -67918 -78432 -81345 -75102 -69817 -75878
14295 -75878 -70802 -60375 -58282 -69466 -67295 -74851 -66854 -63749 -67470 -69115 -77091 -82752 -80328 -87867
14281 -87867 -99174 -104161 -97253 -87211 -86427 -87344 -76179 -80319 -87762 -96728 -88602 -87262 -85939 -81453
14267 -81453 -68934 -68306 -71832 -69921 -66879 -62068 -54628 -66530 -80250 -75546 -82036 -83421 -79173 -82786
$$ packed form
14363h6265j3979l540J6160N340J367M224P432M80j0263K021P883m366m585K023
14349g6068n646j9438o49J3987K1536p092j629P184N528r46j6686M43n80j5073
14335i5129k199L10J1244J5909l976j1061J2043j530M689j574j7332p185J5933
14322g9858J7625O068r101k1677n210O349O953R781N979O757l481J9816n504J198
14308d4305K888k3250j3088R785K4296m359j8086j799j0514k913O243N285o061
14295g5878N076J0427K093j1184K171p556P997L105l721j645p976n661K424p539
14281h7867j1307m987O908J0042P84r17J1165m140p443q966Q126J340J323M486
14267h1453J2519O28l526J911L042M811P440j1902j3720M704o490j385M248l613
$$ plain form
14253 -82786 -86847 -77845 -81942 -82166 -78220 -65976 -71204 -75899 -68952 -68120 -68406 -65641 -69445 -80015 -75200
14238 -75200 -76476 -73005 -70481 -75171 -88853 -94234 -107532 -102368 -75846 -48078 -45095 -51177 -63643
14225 -63643 -70320 -69759 -76806 -69707 -58736 -73685 -73128 -72495 -80945 -67540 -64714 -73173 -75610 -73218
14211 -73218 -64047 -49913 -56316 -68947 -73949 -68927 -53205 -60212 -65737 -84773 -89661 -93386 -81332
14198 -81332 -81499 -75591 -79528 -77934 -82579 -85464 -86183 -85578 -93654 -93431 -92275 -90393 -78435 -73695 -91107
14183 -91107 -91610 -81834 -80737 -65560 -54260 -56799 -75245 -78037 -73975 -61569 -53841 -65474 -76532
14170 -76532 -73583 -76102 -63796 -60879 -67130 -72731 -74846 -67615 -60133 -61155 -73647 -79015 -83746 -87666
14156 -87666 -96111 -77651 -60385 -46107 -43216 -38669 -47951 -80561 -92542 -79840 -95809 -101562 -96820
$$ packed form
14253h2786m061R002m097k24L946J2244n228m695O947Q32k86K765l804j0570M815
14238g5200j276L471K524m690j3682n381j3298N164K6522K7768K983o082j2466
14225f3643o677N61p047P099J0971j4949N57O33q450J3405K826q459k437K392
14211g3218R171J4134o403j2631n002N022J5722p007n525j9036m888l725J2054
14198h1332j67N908l937J594m645k885p19O05q076K23J156J882J1958M740j7412
14183i1107n03R776J097J5177J1300k539j8446k792M062J2406P728j1633j1058
14170g6532K949k519J2306K917o251n601k115P231P482j022j2492n368m731l920
14156h7666q445J8460J7266J4278K891M547r282l2610j1981J2702j5969n753M742
$$ plain form
14143 -96820 -102931 -99847 -81523 -93923 -81294 -63857 -59667 -77177 -86953 -89263 -74975 -58859 -52465
14130 -52465 -52499 -61233 -75226 -90360 -82241 -71723 -57122 -48386 -61962 -68087 -61974 -57168 -63836 -68826
14116 -68826 -79892 -76969 -73254 -71876 -83235 -75698 -59851 -47562 -35944 -50098 -62825 -64843 -71714
14103 -71714 -74853 -61735 -43088 -35825 -52541 -62686 -60786 -58462 -42586 -40784 -48215 -50608 -57883
14090 -57883 -63582 -74276 -80776 -84133 -70065 -65347 -60315 -50744 -58078 -69003 -73940 -65310 -56707 -65585
14076 -65585 -57505 -52480 -60895 -67973 -74831 -69008 -62207 -54710 -59059 -57155 -73661 -71635 -50282 -42098
14062 -42098 -49117 -57419 -61486 -70436 -78830 -77919 -73909 -70100 -78686 -77898 -69156 -66959 -68740 -79417 -74531
14047 -74531 -70594 -78030 -84612 -74213 -52961 -48200 -51977 -61922 -57104 -73561 -76089 -66024 -51246
$$ packed form
14143i6820o111L084J8324j2400J2629J7437M190j7510r776k310J4288J6116O394
14130e2465l4q734j3993j5134Q119J0518J4601Q736j3576o125O113M806o668m990
14116f8826j1066K923L715J378j1359P537J5847J2289J1618j4154j2727k018o871
14103g1714l139J3118J8647P263j6716j0145J900K324J5876J802p431k393p275
14090e7883n699j0694o500l357J4068M718N032R571p334j0925m937Q630Q603q878
14076f5585Q080N025q415p078o858N823O801P497m349J904j6506K026K1353Q184
14062d2098p019q302m067q950q394R11M010L809q586P88Q742K197j781j0677M886
14047g4531L937p436o582J0399K1252M761l777r945M818j6457k528J0065J4778
$$ plain form
14034 -51246 -42866 -47500 -43021 -42028 -42212 -34616 -35965 -46241 -46595 -51474 -73302 -79602 -75591 -67304 -50927
14019 -50927 -53065 -57576 -50134 -42994 -42104 -47427 -64375 -81454 -78223 -66731 -69994 -83378 -87568 -77698
14005 -77698 -66089 -57937 -59222 -60862 -71273 -72369 -57654 -39754 -25111 -31353 -38681 -41142 -58603
13992 -58603 -74180 -72719 -63676 -56519 -55535 -35503 -31797 -29601 -42958 -51156 -65701 -50656 -46084
13979 -46084 -47299 -60526 -66902 -71892 -63074 -60557 -50803 -36853 -29133 -34109 -42626 -52958 -47610 -53837
13965 -53837 -60443 -57367 -53352 -50323 -51726 -60204 -74093 -80684 -81882 -80545 -71948 -68101 -71174 -65194
13951 -65194 -57071 -58596 -61251 -61513 -68270 -62322 -53453 -52266 -47991 -28344 -13878 -12198 -6812 -6165
13937 -6165 -19852 -44272 -56681 -53063 -36812 -42246 -51653 -61438 -61987 -76209 -67825 -55244 -56895
$$ packed form
14034e1246Q380m634M479R93j84P596j349j0276l54m879k1828o300M011Q287J6377
14019e0927k138m511P442P140Q90n323j6948j7079L231J1492l263j3384m190R870
14005g7698J1609Q152j285j640j0411j096J4715J7900J4643o242p328k461j7461
13992e8603j5577J461R043P157R84K0032L706K196j3357q198j4545J5045M572
13979d6084j215j3227o376m990Q818K517R754J3950P720m976q517j0332N348o227
13965e3837o606L076M015L029j403q478j3889o591j198J337Q597L847l073N980
13951f5194Q123j525k655k62o757N948Q869J187M275J9647J4466J680N386O47
13937f165j3687k4420j2409L618J6251n434r407r785n49j4222Q384J2581j651
$$ plain form
13924 -56895 -67852 -62964 -48774 -51524 -43842 -37978 -37360 -28163 -26920 -51554 -63648 -77265 -72605
13911 -72605 -44927 -37448 -37725 -44210 -47038 -43949 -55958 -52239 -49183 -49841 -44471 -55398 -41147 -39359
13897 -39359 -46861 -51484 -28755 -18844 -16411 -27464 -37019 -38161 -38431 -47076 -47013 -37867 -21902 -12024
13883 -12024 -23634 -29764 -41235 -41356 -49647 -51492 -53248 -61417 -66047 -53642 -35888 -41752 -32158 -24363
13869 -24363 -32729 -29145 -24915 -32751 -36916 -31992 -35777 -24913 -13234 -9123 -17242 -4767 -3608 -2113
13855 -2113 -3246 -17403 -16354 -26628 -44070 -50685 -59936 -61774 -55479 -45644 -29201 -26873 -20987 -20335
13841 -20335 -20805 -20299 -33438 -49144 -49257 -49964 -48122 -44414 -43838 -49838 -50618 -39903 -28437 -40954 -37213
13826 -37213 -44257 -47541 -49091 -38910 -40775 -46135 -46255 -59229 -52534 -55135 -61263 -69968 -55255 -55156
$$ packed form
13924e6895j0957M888J4190k750P682N864O18R197J243k4634j2094j3617M660
13911g2605K7678P479k77o485k828L089j2009L719L056o58N370j0927J4251J788
13897c9359p502m623K2729R911K433j1053r555j142k70q645O3R146J5965R878
13883a2024j1610o130j1471j21q291j845j756q169m630J2405J7754n864R594P795
13869b4363q366L584M230p836m165M924l785J0864J1679M111q119J2475J159J495
13855b113j133j4157J049j0274j7442o615r251j838O295R835J6443K328N886O52
13841b0335m70N06j3139j5706j13p07J842L708N76o000p80J0715J1466j2517L741
13826c7213p044l284j550J0181j865n360j20j2974O695k601o128q705J4713R9
$$ plain form
13812 -55156 -57321 -49523 -41067 -31202 -34303 -41536 -46422 -49027 -42923 -30668 -39660 -37767 -20349 -27987
13798 -27987 -40512 -44023 -51727 -39166 -33713 -11648 -12395 -34460 -52008 -52636 -52995 -41694 -40582 -37355
13784 -37355 -38837 -34572 -30914 -50043 -60098 -50901 -37933 -35572 -25956 -25026 -36078 -36382 -23186 -30303
13770 -30303 -21957 -15162 -30587 -28702 -16990 -17538 -8885 -14192 -18946 -8949 -2174 -5941 -4296 -8813
13756 -8813 -11952 -9781 -14894 -42859 -54659 -38910 -30081 -32019 -26686 -17843 -23364 -26234 -24734 -14391
13742 -14391 -19736 -27100 -25152 -6386 4437 -5548 -11081 -17138 -20561 -20689 -7051 4275 -923 -10878
13728 -10878 -14232 356 609 -10265 -12034 -20895 -6310 9834 13533 5343 958 -6964 -13533 -14901
13714 -14901 1741 10681 2888 -10422 -26707 -21259 -6225 -3565 -1191 8944 18102 11817 8661
$$ packed form
13812e5156k165P798Q456R865l101p233m886k605O104J2255q992J893J7418p638
13798b7987j2525l511p704J2561N453K2065p47k2065j7548o28l59J1301J112L227
13784c7355j482M265L658j9129j0055R197J2968K361R616R30j1052l04J3196p117
13770c0303Q346O795j5425J885J1712n48Q653n307m754R997O775l767J645m517
13756h813l139K171n113k7965j1800J5749Q829j938N333Q843n521k870J500J0343
13742a4391n345p364J948J8766J0823r985n533o057l423j28J3638J1326n198r955
13728a0878l354J4588K53j0874j769q861J4585J6144L699q190m385p922o569j368
13714a4901J6642Q940p793j3310j6285N448J5034K660K374J0135R158o285l156
$$ plain form
13701 8661 8207 4509 -924 -3017 1343 -13860 -23954 -16306 2981 -3377 12148 18334 7499 -1298
13687 -1298 8681 -1057 -6054 -14565 -6292 -3232 2049 182 11811 24109 28385 24649 20639 18507
13673 18507 9708 -2405 16474 28045 15512 12235 12718 11279 14290 26566 37187 39602 19336
13660 19336 17944 11162 -4814 -11829 -1121 6647 21225 29644 24153 4340 -1206 1766 13178
13647 13178 26789 20335 7481 3444 21948 22946 12924 17008 26681 38913 36060 36499 26224
13634 26224 26712 13244 17007 26376 27082 20871 15925 6890 2264 17874 17382 31089 49888 57505
13620 57505 68414 68036 69047 46805 32688 30267 38027 49294 59394 52213 47969 55532 56385 57877
13606 57877 43656 45619 40738 42468 34745 22610 19705 33496 39147 45934 42329 41960 34672 38130
$$ packed form
13701H661m54l698n433k093M360j5203j0094P648J9287o358J5525O186j0835q797
13687a298R979r738m997q511Q273L060N281j867J1629J2298M276l736m010k132
13673A8507q799j2113J8879J1571j2533l277M83j439L011J2276J0621K415k0266
13660A9336j392o782j5976p015J0708P768J4578Q419n491j9813n546K972J1412
13647A3178J3611o454j2854m037J8504R98j0022M084R673J2232k853M39j0275
13634B6224M88j3468L763R369P06o211m946r035m626J5610m92J3707J8799P617
13620E7505J0909l78J011k2242j4117k421P760J1267J0100p181m244P563Q53J492
13606E7877j4221J963m881J730p723j2135k905J3791N651O787l605l69p288L458
$$ plain form
13592 38130 36184 24001 34257 55326 50833 51399 60599 67172 63219 65278 60940 57791 58901 63815
13578 63815 59917 66238 64561 54525 50408 47700 54197 60127 59892 59747 54482 48638 35442 30037
13564 30037 41215 41381 38029 49389 55913 62471 68157 64045 64322 63813 49939 47641 66734 66874
13550 66874 64995 72210 64997 63293 78855 81217 82169 81620 82703 78021 73642 73484 79047 78965 83914
13535 83914 78643 76985 76115 64598 58521 64122 81729 95740 88428 81306 88495 95102 98916 105173
13521 105173 99530 93251 89684 102558 115902 114588 108782 96393 92732 94722 102388 112182 110513
13508 110513 93681 86844 91035 100301 105217 115509 124674 117786 109515 110916 105559 101021 123431
13495 123431 142264 132498 122660 125218 129959 122648 122215 109228 120620 120948 128755 135371 139173 143071
$$ packed form
13592C8130j946j2183J0256K1069m493N66R200O573l953K059m338l149J110M914
13578F3815l898O321j677j0036m117k708O497N930k35j45n265n844j3196n405
13564C0037J1178J66l352J1360O524O558N686m112K77n09j3874k298J9093J40
13550F6874j879P215p213j704J5562K362R52n49J083m682m379j58N563q2M949
13535H3914n271j658q70j1517o077N601J7607J4011p312p122P189O607L814O257
13521A05173n643o279l567J2874J3344j314n806j2389l661J990P666R794j669
13508A10513j6832o837M191R266M916J0292R165o888q271J401n357m538K2410
13495A23431J8833r766r838K558M741p311m33j2987J1392L28P807O616L802L898
$$ plain form
13481 143071 131332 136040 135928 144152 154288 138756 121190 132051 149090 162518 150989 139056
13469 139056 137332 137794 146630 157243 152218 151368 148517 137703 144704 150098 154409 160401 171230 173940
13455 173940 173390 150614 141243 144898 156667 163675 170550 162302 150053 147706 153545 159340 158179 170177
13441 170177 198593 206723 211440 203120 204637 189183 180904 181168 176063 174504 196351 190566 174569
13428 174569 168271 163168 171080 180085 183901 173661 168829 182773 196685 209485 207767 204262 203395
13415 203395 205329 221226 235853 219261 202917 194491 174378 171978 178089 181322 197209 199270 215770
13402 215770 214716 208882 199116 195657 189067 189521 210561 217265 215418 210266 221226 226697 211187 219479
13388 219479 227892 226538 243718 251834 238929 228192 238174 233124 221249 219587 228958 248917 266134
$$ packed form
13481A43071j1739M708j12Q224J0136j5532j7566J0861J7039J3428j1529j1933
13469A39056j724M62Q836J0613n025q50k851j0814P001N394M311N992J0829K710
13455A73940n50k2776r371L655J1769P008O875q248j2249k347N839N795j161J1998
13441A70177K8416Q130M717q320J517j5454q279K64n105j559K1847n785j5997
13428A74569o298n103P912R005L816j0240m832J3944J3912J2800j718l505q67
13415B03395J934J5897J4627j6592j6344q426k0113k400O111L233J5887K061J6500
13402B15770j054n834r766l459o590M54K1040O704j847n152J0960N471j5510Q292
13388B19479Q413j354J7180Q116j2905j0737R982n050j1875j662R371J9959J7217
$$ plain form
13375 266134 272083 279599 268604 269313 263236 258237 267815 274107 262798 250518 244640 241608 245335 258944
13361 258944 267499 271654 272334 283384 291421 289759 285109 288325 282682 273029 281054 297759 294211 287461
13347 287461 295912 299294 314416 335521 349107 357229 361193 359913 336359 322593 338783 355203
13335 355203 368049 367711 361998 344532 331481 319986 308829 323074 329407 325138 319413 317853 322496
13322 322496 331479 341172 372173 381160 374313 358361 355488 354463 357560 357029 346754 340752 344523 344968
13308 344968 356922 373645 384581 390739 405229 395840 385011 394927 411507 412633 407916 393547
13296 393547 375740 369482 363294 367923 384315 400535 399216 403763 398963 389707 383751 377896 387243
13283 387243 394382 413864 408129 408782 399035 386121 398098 428837 458784 461026 459107 456030 456553
$$ packed form
13375B66134N949P516j0995P09o077m999R578O292j1309j2280n878l032L727J3609
13361B58944Q555M155O80J1050Q037j662m650L216n643r653Q025J6705l548o750
13347B87461Q451L382J5122K1105J3586Q122L964j280k3554j3766J6190J6420
13335C55203J2846l38n713j7466j3051j1495j1157J4245O333m269n725j560M643
13322C22496Q983R693L1001Q987o847j5952k873j025L097n31j0275o002L771M45
13308C44968J1954J6723J0936O158J4490r389j0829R916J6580J126m717j4369
13296C93547j7807o258o188M629J6392J6220j319M547m800r256n956n855R347
13283C87243P139J9482n735O53r747j2914J1977L0739K9947K242j919l077N23
$$ plain form
13270 456553 461545 470481 483284 469573 477631 480491 477540 475652 472291 468932 451623 460878 489841
13257 489841 501327 510680 505629 487758 479473 485107 496018 496027 511255 534801 523204 512346 506317
13244 506317 505854 513303 533549 539866 544408 548399 561791 566920 574628 563070 542063 527219 523818
13231 523818 537740 546926 556936 570007 576163 580409 594655 598728 598213 612949 618370 604839 585091
13218 585091 584084 601059 609469 610708 608780 619709 633724 648387 661425 668250 687653 695012 686871
13205 686871 686566 675990 678191 683114 693656 703415 712093 716892 725744 732295 736468 742113 739518 746084
13191 746084 752953 757095 779171 787557 771551 775199 787113 800357 820856 843582 860601 874810
13179 874810 896735 936093 974615 1019096 1077276 1139857 1199648 1250059 1292378 1305250 1300981 1272587
$$ packed form
13270D56553M992Q936J2803j3711Q058K860k951j888l361l359j7309R255K8963
13257D89841J1486R353n051j7871q285N634J0911RJ5228K3546j1597j0858o029
13244E06317m63P449K0246O317M542L991J3392N129P708j1558k1007j4844l401
13231E23818J3922R186J0010J3071O156M246J4246M073n15J4736N421j3531j9748
13218E85091j007J6975Q410J239j928J0929J4015J4663J3038O825J9403P359q141
13205F86871l05j0576K201M923J0542R759Q678M799Q852O551M173N645k595O566
13191G46084O869M142K2076Q386j6006L648J1914J3244K0499K2726J7019J4209
13179H74810K1925L9358L8522M4481N8180O2581N9791N0411M2319J2872m269k8394
$$ plain form
13167 1272587 1213085 1155283 1101252 1033909 1001131 985420 973948 988224 997389 996056 1000746 1012824
13155 1012824 1022542 1026834 1037708 1036198 1054890 1075983 1092345 1105739 1105930 1115095 1124343 1140237 1142069
13142 1142069 1137491 1151765 1174455 1185538 1199192 1226654 1265013 1310081 1368522 1449397 1514200
13131 1514200 1587359 1677874 1751174 1818780 1868006 1906530 1910437 1878945 1816452 1770494 1734912
13120 1734912 1683644 1621885 1568750 1500001 1468858 1453405 1439862 1439170 1448401 1434833 1434008 1449115
13108 1449115 1450816 1463980 1489642 1510865 1509748 1504455 1521034 1522884 1524870 1533974 1541091 1544255 1558047
13095 1558047 1572651 1586202 1607419 1642655 1665555 1705414 1748681 1788779 1845532 1924590 1985301
13084 1985301 2034802 2096946 2145865 2192724 2210971 2181651 2117473 2048811 1996073 1960540 1940467
$$ packed form
13167A272587n9502n7802n4031o7343l2778j5711j1472J4276R165j333M690J2078
13155A012824R718M292J0874j510J8692K1093J6362J3394J91R165R248J5894J832
13142A142069m578J4274K2690J1083J3654K7462L8359M5068N8441Q0875O4803
13131A514200P3159R0515P3300O7606M9226L8524L907l1492o2493m5958l5582
13120A734912n1268o1759n3135o8749l1143j5453j3543o92R231j3568q25J5107
13108A449115J701J3164K5662K1223j117n293J6579J850J986R104P117L164J3792
13095A558047J4604J3551K1217L5236K2900L9859M3267M0098N6753P9058O0711
13084A985301M9501O2144M8919M6859J8247k9320o4178o8662n2738l5533k0073
$$ plain form
13073 1940467 1929991 1908721 1898490 1901639 1912023 1916177 1922642 1932760 1945929 1958139 1979324 2007003
13061 2007003 2029750 2038153 2054593 2062548 2068965 2086488 2104028 2112970 2129026 2139757 2151527 2170179
13049 2170179 2187199 2207767 2229778 2244374 2260350 2279097 2301509 2327012 2337560 2353304 2353850 2370941
13037 2370941 2398807 2425151 2454024 2483376 2492384 2509454 2539194 2561184 2580415 2587595 2605063 2647500
13025 2647500 2677364 2694989 2718536 2729493 2748039 2751395 2762960 2783569 2809127 2852523 2895347
13014 2895347 2914199 2930297 2951851 2967966 2993935 3042860 3078346 3106498 3122809 3148820 3183924
13003 3183924 3214816 3249396 3271393 3295022 3327344 3359976 3389942 3426121 3472359 3511332 3534038
12992 3534038 3564457 3591419 3634552 3678839 3713860 3748311 3783798 3822963 3865039 3906034 3939060
$$ packed form
13073A940467j0476k1270j0231L149J0384M154O465J0118J3169J2210K1185K7679
13061B007003K2747Q403J6440P955O417J7523J7540Q942J6056J0731J1770J8652
13049B170179J7020K0568K2011J4596J5976J8747K2412K5503J0548J5744N46J7091
13037B370941K7866K6344K8873K9352R008J7070K9740K1990J9231P180J7468M2437
13025B647500K9864J7625K3547J0957J8546L356J1565K0609K5558M3396M2824
13014B895347J8852J6098K1554J6115K5969M8925L5486K8152J6311K6011L5104
13003C183924L0892L4580K1997K3629L2322L2632K9966L6179M6238L8973K2706
12992C534038L0419K6962M3133M4287L5021L4451L5487L9165M2076M0995L3026
$$ plain form
12981 3939060 3979532 4031136 4060536 4087470 4129524 4177506 4235010 4278143 4311390 4356066 4409213
12970 4409213 4454251 4507897 4567044 4619866 4661847 4728854 4774145 4813324 4866401 4933618 4998518
12959 4998518 5051942 5107385 5176836 5249432 5310932 5352769 5415672 5478325 5539621 5606190 5666527
12948 5666527 5734844 5823035 5909760 5982096 6057857 6137090 6198839 6272070 6351977 6430905 6508053
12937 6508053 6596968 6693238 6783515 6866752 6955189 7052556 7162894 7256024 7339292 7437940 7530960
12926 7530960 7638190 7754771 7878408 7997712 8090172 8197022 8316718 8431858 8558508 8685357
12916 8685357 8810493 8935624 9084287 9218627 9353670 9496387 9629013 9785750 9949479
12907 9949479 10100771 10252712 10404348 10551674 10717521 10890181 11079839 11271391 11450140
$$ packed form
12981C939060M0472N1604K9400K6934M2054M7982N7504M3133L3247M4676N3147
12970D409213M5038N3646N9147N2822M1981O7007M5291L9179N3077O7217O4900
12959D998518N3424N5443O9451P2596O1500M1837O2903O2653O1296O6569O0337
12948E666527O8317Q8191Q6725P2336P5761P9233O1749P3231P9907P8928P7148
12937F508053Q8915R6270R0277Q3237Q8437R7367J10338R3130Q3268R8648R3020
12926G530960J07230J16581J23637J19304R2460J06850J19696J15140J26650J26849
12916H685357J25136J25131J48663J34340J35043J42717J32626J56737J63729
12907I949479J51292J51941J51636J47326J65847J72660J89658J91552J78749
$$ plain form
12898 11450140 11633897 11823608 12018767 12217750 12404388 12609812 12818238 13030314 13259701
12889 13259701 13481660 13707459 13944608 14194660 14443402 14714299 14978374 15256183 15541519
12880 15541519 15826941 16120480 16417164 16712711 17021901 17347776 17688803 18035965 18398824
12871 18398824 18767404 19139610 19508939 19891208 20297689 20721032 21146438 21579295 22018745
12862 22018745 22470974 22937434 23422452 23919455 24423698 24969323 25520920 26089392 26665053
12853 26665053 27260096 27872138 28497810 29139426 29797791 30483853 31197324 31930785 32656162
12844 32656162 33416267 34216532 35032787 35858788 36719851 37590500 38487038 39410728 40357265
12835 40357265 41331456 42327258 43349304 44384850 45449207 46546617 47673458 48815872
$$ packed form
12898A1450140J83757J89711J95159J98983J86638K05424K08426K12076K29387
12889A3259701K21959K25799K37149K50052K48742K70897K64075K77809K85336
12880A5541519K85422K93539K96684K95547L09190L25875L41027L47162L62859
12871A8398824L68580L72206L69329L82269M06481M23343M25406M32857M39450
12862B2018745M52229M66460M85018M97003N04243N45625N51597N68472N75661
12853B6665053N95043O12042O25672O41616O58365O86062P13471P33461P25377
12844C2656162P60105Q00265Q16255Q26001Q61063Q70649Q96538R23690R46537
12835D0357265R74191R95802J022046J035546J064357J097410J126841J142414
$$ plain form
12827 48815872 49978908 51159455 52369182 53594741 54840845 56096564 57362983 58665498
12819 58665498 59980206 61308488 62645771 63982755 65326468 66679280 68028405 69346961
12811 69346961 70664449 71971133 73250163 74509373 75760449 76965072 78128576 79262163
12803 79262163 80354984 81378639 82359410 83284312 84144462 84919448 85612397 86235745 86789236
12794 86789236 87247010 87637251 87969353 88189804 88329524 88381184 88350544 88222985 88003651 87721470
12784 87721470 87358761 86916869 86408478 85825359 85180566 84472503 83694718 82865219 81991172
12775 81991172 81067827 80117399 79142294 78107207 77047596 75970923 74873608 73732396
12767 73732396 72575675 71449013 70302323 69146810 67993215 66843747 65689183 64511893
$$ packed form
12827D8815872J163036J180547J209727J225559J246104J255719J266419J302515
12819E8665498J314708J328282J337283J336984J343713J352812J349125J318556
12811F9346961J317488J306684J279030J259210J251076J204623J163504J133587
12803G9262163J092821J023655R80771R24902Q60150P74986O92949O23348N53491
12794H6789236M57774L90241L32102K20451J39720N1660l0640j27559k19334k82181
12784H7721470l62709m41892n08391n83119o44793p08063p77785q29499q74047
12775H1991172r23345r50428r75105j035087j059611j076673j097315j141212
12767G3732396j156721j126662j146690j155513j153595j149468j154564j177290
$$ plain form
12759 64511893 63359709 62236095 61120305 60002863 58901762 57807447 56734678 55665783
12751 55665783 54623087 53591964 52580518 51587427 50600471 49620445 48665405 47743670 46840412
12742 46840412 45943265 45042536 44174572 43313213 42475549 41673245 40878598 40102910 39322179
12733 39322179 38562207 37824575 37107534 36401270 35722860 35051963 34396157 33746418 33101641
12724 33101641 32474313 31875944 31306823 30748502 30194078 29641302 29101662 28583158 28073970
12715 28073970 27583077 27089242 26604668 26133931 25679333 25239442 24805034 24389216 23992614
12706 23992614 23619751 23250982 22864376 22482780 22112883 21755818 21391787 21019945 20632118
12697 20632118 20262823 19904289 19567154 19241111 18905809 18584185 18286446 17991005 17689031
$$ packed form
12759F4511893j152184j123614j115790j117442j101101j094315j072769j068895
12751E5665783j042696j031123j011446r93091r86956r80026r55040r21735r03258
12742D6840412q97147r00729q67964q61359q37664q02304p94647p75688p80731
12733C9322179p59972p37632p17041p06264o78410o70897o55806o49739o44777
12724C3101641o27328n98369n69121n58321n54424n52776n39640n18504n09188
12715B8073970m90893m93835m84574m70737m54598m39891m34408m15818l96602
12706B3992614l72863l68769l86606l81596l69897l57065l64031l71842l87827
12697B0632118l69295l58534l37135l26043l35302l21624k97739k95441l01974
$$ plain form
12688 17689031 17389441 17118118 16864645 16602947 16348652 16104858 15858990 15602228 15337296
12679 15337296 15093244 14862106 14641544 14421437 14205854 14009905 13817800 13623011 13414656
12670 13414656 13214274 13034733 12862396 12683637 12515107 12363779 12250693 12118293 11968385
12661 11968385 11823298 11692756 11540226 11364876 11184425 10999495 10821099 10638642 10465996
12652 10465996 10319708 10156005 9984797 9836013 9690396 9552855 9441376 9326744 9194325
12643 9194325 9070177 8962286 8847578 8740728 8636033 8525456 8412107 8311065 8199782
12634 8199782 8095799 8003456 7908738 7818390 7733532 7642646 7546362 7467324 7383978 7299318 7242546
12623 7242546 7187661 7118080 7057782 7001204 6941172 6877009 6801819 6726735 6668413 6596851 6495561
$$ packed form
12688A7689031k99590k71323k53473k61698k54295k43794k45868k56762k64932
12679A5337296k44052k31138k20562k20107k15583j95949j92105j94789k08355
12670A3414656k00382j79541j72337j78759j68530j51328j13086j32400j49908
12661A1968385j45087j30542j52530j75350j80451j84930j78396j82457j72646
12652A0465996j46288j63703j71208j48784j45617j37541j11479j14632j32419
12643I194325j24148j07891j14708j06850j04695j10577j13349j01042j11283
12634H199782j03983r2343r4718r0348q4858r0886r6284p9038q3346q4660n6772
12623G242546n4885o9581o0298n6578o0032o4163p5190p5084n8322p1562j01290
$$ plain form
12612 6495561 6404064 6305174 6210308 6138715 6062165 5984415 5898209 5817645 5744976 5690618 5647856
12601 5647856 5600859 5528879 5478327 5416370 5345054 5290086 5241216 5198619 5162716 5119917 5072914
12590 5072914 5038081 4978701 4935623 4881305 4831651 4779595 4744816 4714272 4670580 4636064 4611604
12579 4611604 4568300 4541153 4523408 4484153 4434651 4401216 4370190 4333574 4279346 4224975 4177880
12568 4177880 4129645 4084841 4039236 4001972 3972943 3936066 3888613 3844421 3821618 3800252 3769495
12557 3769495 3739861 3696861 3666430 3636715 3603047 3574982 3538897 3507849 3478840 3442556 3418147
12546 3418147 3405133 3370489 3319540 3295737 3272911 3262634 3256966 3221774 3190943 3181905 3161625 3160276
12534 3160276 3146512 3119963 3081261 3048664 3014653 2976106 2934864 2897001 2864910 2849277 2844554
$$ packed form
12612F495561r1497r8890r4866p1593p6550p7750q6206q0564p2669n4358m2762
12601E647856m6997p1980n0552o1957p1316n4968m8870m2597l5903m2799m7003
12590E072914l4833n9380m3078n4318m9654n2056l4779l0544m3692l4516k4460
12579D611604m3304k7147j7745l9255m9502l3435l1026l6616n4228n4371m7095
12568D177880m8235m4804m5605l7264k9029l6877m7453m4192k2803k1366l0757
12557C769495k9634m3000l0431k9715l3668k8065l6085l1048k9009l6284k4409
12546C418147j3014l4644n0949k3803k2826j0277n668l5192l0831r038k0280j349
12534C160276j3764k6549l8702l2597l4011l8547m1242l7863l2091j5633m723
$$ plain form
12523 2844554 2832465 2790753 2767028 2741225 2713630 2700273 2676213 2636953 2608276 2585550 2576462
12512 2576462 2573911 2554404 2533368 2517841 2491875 2466784 2450075 2420960 2403919 2390645 2375127
12501 2375127 2374404 2355153 2328888 2304464 2299905 2287996 2267848 2239235 2227182 2228398 2212536 2188849
12489 2188849 2180124 2165063 2151546 2137916 2101345 2077124 2058740 2037915 2027702 2012439 2007085 1992852
12477 1992852 1982792 1968931 1957080 1945446 1924879 1909423 1886947 1873410 1856156 1844384 1839653
12466 1839653 1812013 1795694 1811481 1810875 1796372 1771509 1754976 1751974 1733768 1727467 1702881 1680507
12454 1680507 1671315 1671230 1663635 1647182 1641677 1637072 1629801 1627411 1623634 1617556 1598514 1579903 1573242 1547078
12440 1547078 1534435 1524058 1529437 1521522 1506780 1504481 1485175 1477341 1468089 1449746 1448958 1450400 1444577
$$ packed form
12523B844554j2089m1712k3725k5803k7595j3357k4060l9260k8677k2726r088
12512B576462k551j9507k1036j5527k5966k5091j6709k9115j7041j3274j5518
12501B375127p23j9251k6265k4424m559j1909k0148k8613j2053J216j5862k3687
12489B188849q725j5061j3517j3630l6571k4221j8384k0825j0213j5263n354j4233
12477A992852j0060j3861j1851j1634k0567j5456k2476j3537j7254j1772m731
12466A839653k7640j6319J5787o06j4503k4863j6533l002j8206o301k4586k2374
12454A680507r192q5p595j6453n505m605p271k390l777o078j9042j8611o661k6164
12440A547078j2643j0377N379p915j4742k299j9306p834r252j8343p88J442n823
$$ plain form
12427 1444577 1442999 1434920 1408028 1397314 1393572 1376372 1358247 1351007 1342908 1329377 1318634 1319143 1306094
12414 1306094 1296376 1289856 1299878 1299211 1284035 1264622 1243030 1239459 1236777 1220829 1217645 1210937 1211355
12401 1211355 1203469 1191119 1194903 1215783 1225222 1208541 1198114 1193616 1182596 1168579 1152419 1142976
12389 1142976 1147712 1132212 1117832 1115233 1107918 1111308 1118739 1107581 1092784 1088128 1075884 1062257
12377 1062257 1052337 1044327 1050252 1044942 1031237 1024872 1025999 1026916 1024833 1021070 1018596 1018262 1002397 994334
12363 994334 979631 976103 985995 996381 983932 963948 959809 955518 944839 942658 935532 923098 923516
12350 923516 923670 912123 917020 920488 909102 907635 905166 895809 886525 895101 896231 894339 864217 854144
12336 854144 871311 869463 857851 841293 838513 837441 835692 823358 804242 793396 785699 783283 787614
$$ packed form
12427A444577j578q079k6892j0714l742j7200j8125p240q099j3531j0743N09j3049
12414A306094r718o520J0022o67j5176j9413k1592l571k682j5948l184o708M18
12401A211355p886j2350L784K0880R439j6681j0427m498j1020j4017j6160r443
12389A142976M736j5500j4380k599p315L390P431j1158j4797m656j2244j3627
12377A062257r920q010N925n310j3705o365J127R17k083l763k474l34j5865q063
12363I94334j4703l528R892J0386j2449j9984m139m291j0679k181p126j2434M18
12350I23516J54j1547M897L468j1386j467k469r357r284Q576J130j892l0122j0073
12336H54144J7167j848j1612j6558k780j072j749j2334j9116j0846p697k416M331
$$ plain form
12323 787614 782079 784883 771889 763590 758389 747419 745060 742116 747523 755787 749059 741517 735929 748606
12309 748606 751921 737032 708302 710778 728296 734533 728480 717907 725686 727004 707178 687776 696576
12296 696576 688014 687295 692077 693976 679546 663757 659434 657830 666285 651314 637594 639552 645331
12283 645331 646546 639514 622976 616188 605484 601250 617773 640202 644679 650486 656447 665532 664667
12270 664667 651202 642975 637384 630498 634047 629483 621520 612409 613981 614410 618834 620339 612063 605950
12256 605950 597370 574148 577417 582652 577949 567397 576966 577552 573729 584343 583602 588150 598419 593552
12242 593552 583692 559667 543133 539619 547903 548861 543410 532951 528272 530851 534569 539032 550735
12229 550735 536696 522100 523325 525925 528535 532358 513862 501929 510527 505526 515325 514345 513950 514727
$$ packed form
12323G87614n535K804j2994q299n201j0970k359k944N407Q264o728p542n588J2677
12309G48606L315j4889k8730K476J7518O237o053j0573P779J318j9826j9402Q800
12296F96576q562p19M782J899j4430j5789m323j604Q455j4971j3720J958N779
12283F45331J215p032j6538o788j0704m234J6523K2429M477N807N961R085q65
12270F64667j3465q227n591o886L549m564p963r111J572M29M424J505q276o113
12256F05950q580k3222L269N235m703j0552R569N86l823J0614p41M548J0269m867
12242E93552r860k4025j6534l514Q284R58n451j0459m679K579L718M463J1703
12229E50735j4039j4596J225K600K610L823j8496j1933Q598n001R799r80l95P77
$$ plain form
12215 514727 531618 543278 532098 526906 522980 514351 508863 494585 507866 519879 523344 504051
12203 504051 506221 493205 475408 465520 464970 475327 480251 474677 461639 465438 473186 475101 474843 471189
12189 471189 488703 475926 461635 462938 454141 447339 445601 437403 429654 426250 439479 432456 419724
12176 419724 423683 430748 427039 424792 418536 408289 408975 423996 431995 434862 415024 403986 408768
12163 408768 404928 397941 408279 415455 422139 422280 415979 408140 397152 388122 407051 406180 386034 370902
12149 370902 369448 376710 386734 392381 393257 387838 386405 385024 380984 386772 382180 390729 374377 373812
12135 373812 362330 359032 360561 350911 352174 354386 347550 353917 350541 346633 361272 371083 372685 372245
12121 372245 368736 366130 363168 382419 373317 354369 328363 324435 336307 336501 332074 332953 341714 343646
$$ packed form
12215E14727J6891J1660j1180n192l926q629n488j4278J3281J2013L465j9293
12203E04051K170j3016j7797r888n50J0357M924n574j3038L799P748J915k58l654
12189D71189J7514j2777j4291J303q797o802j738q198p749l404J3229p023j2732
12176D19724L959P065l709k247o256j0247O86J5021P999K867j9838j1038M782
12163D08768l840o987J0338P176O684J41o301p839j0988r030J8929q71k0146j5132
12149C70902j454P262J0024N647Q76n419j433j381m040N788m592Q549j6352n65
12135C73812j1482l298J529r650J263K212o836O367l376l908J4639R811J602m40
12121C72245l509k606k962J9251r102j8948k6006l928J1872J94m427Q79Q761J932
$$ plain form
12107 343646 336552 336110 342449 343699 354175 367055 366502 375964 379992 390787 387911 370715 357827
12094 357827 346667 330457 317020 322679 330276 330921 335706 333662 332274 338784 336257 342607 347329 356631
12080 356631 357768 346238 339923 334122 340348 348227 365351 382707 380284 370604 380549 403420 408589
12067 408589 421111 432103 426647 434014 445147 460664 467225 473429 469739 451911 421270 401421
12055 401421 394995 370415 345133 351321 363619 365782 361653 356496 356910 368474 380254 396890 403442
12042 403442 406408 416293 452683 503431 526736 539540 555997 577228 583877 583378 570627 570662 576482
12029 576482 604097 611712 634236 670381 730998 809058 879453 956717 1027294 1093204 1148576 1206435
12017 1206435 1237259 1198950 1139404 1101405 1072911 1041779 1031239 1044122 1066387 1088212 1113475
$$ packed form
12107C43646p094m42O339J250J0476J2880n53R462M028J0795k876j7196j2888
12094C57827j1160j6210j3437N659P597O45M785k044j388O510k527O350M722R302
12080C56631J137j1530o315n801O226P879J7124J7356k423r680R945K2871N169
12067D08589J2522J0992n456P367J1133J5517O561O204l690j7828l0641j9849
12055D01421o426k4580k5282O188J2298K163m129n157M14J1564J1780J6636O552
12042D03442K966R885L6390N0748K3305J2804J6457K1231O649m99j2751L5N820
12029E76482K7615P615K2524L6145O0617P8060P0395P7264P0577O5910N5372N7859
12017A206435L0824l8309n9546l7999k8494l1132j0540J2883K2265K1825K5263
$$ plain form
12006 1113475 1144810 1180529 1201353 1221960 1255215 1272603 1294368 1317307 1329707 1343475 1349805
11995 1349805 1348156 1327871 1291137 1263009 1246880 1234216 1244089 1263479 1284266 1322141 1386010 1497437
11983 1497437 1638283 1799206 1973662 2156656 2325785 2493123 2632233 2714308 2698948 2563012
11973 2563012 2357279 2147513 1972811 1824867 1733624 1664146 1625543 1620992 1634156 1672140 1712610
11962 1712610 1720279 1682713 1631979 1580416 1530327 1488231 1446540 1405668 1362646 1306988 1242526
11951 1242526 1187532 1150803 1132741 1116319 1100575 1098175 1105243 1110488 1098832 1100957 1118693 1158461
11939 1158461 1197643 1240556 1272665 1283122 1283132 1281387 1259843 1177545 1055553 939106 830999
11928 830999 754880 703123 654117 632974 616442 618629 613273 613719 595602 562801 536450 513899
$$ packed form
12006A113475L1335L5719K0824K0607L3255J7388K1765K2939J2400J3768O330
11995A349805j649k0285l6734k8128j6129j2664R873J9390K0787L7875O3869J11427
11983A497437J40846J60923J74456J82994J69129J67338J39110Q2075j5360j35936
11973B563012k05733k09766j74702j47944r1243o9478l8603m551J3164L7984M0470
11962A712610P669l7566n0734n1563n0089m2096m1691m0872m3022n5658o4462
11951A242526n4994l6729j8062j6422j5744k400P068N245j1656K125J7736L9768
11939A158461L9182M2913L2109J0457J0j745k1544q2298j21992j16447j08107
11928H30999p6119n1757m9006k1143j6532K187n356M46j8117l2801k6351k2551
$$ plain form
11916 513899 496501 484450 466580 444412 428786 420770 401367 384952 390253 374720 369595 369255
11904 369255 368709 370318 370642 364108 360041 343825 321557 313223 313224 309375 281543 266466 264790 265794
11890 265794 273394 287395 274958 255690 260745 257371 256917 234725 218914 221054 219327 222393 220987
11877 220987 221078 230846 223672 217735 222699 210754 207306 211238 207800 197410 205594 209036 201680 196872
11863 196872 171948 165229 165544 160942 161741 176536 195968 193132 173293 164276 173054 179735 172486 156360
11849 156360 143715 143746 145308 147778 157436 171965 189003 209480 229846 233021 231127 233287 228151
11836 228151 226394 231715 241056 235812 213642 211211 209984 200032 186501 188040 200830 198740 211687
11823 211687 221415 209345 204893 211983 214334 212401 208012 214941 228019 233461 240733 253261 262521
$$ packed form
11916E13899j7398j2051j7870k2168j5626q016j9403j6415N301j5533n125l40
11904C69255n46J609L24o534m067j6216k2268q334Jl849k7832j5077j676J004
11890B65794P600J4001j2437j9268N055l374m54k2192j5811K140j727L066j406
11877B20987R1R768p174n937M964j1945l448L932l438j0390Q184L442p356m808
11863A96872k4924o719L15m602P99J4795J9432k836j9839r017Q778O681p249j6126
11849A56360j2645L1J562K470R658J4529J7038K0477K0366L175j894K160n136
11836B28151j757N321R341n244k2170k431j227r952j3531J539J2790k090J2947
11823B11687R728j2070m452P090K351j933m389O929J3078N442P272J2528R260
$$ plain form
11810 262521 272450 280545 266781 263561 268697 269313 274871 294461 302711 322807 330909 337054 346052 342270
11796 342270 339836 354662 382641 398589 384661 376785 369892 353952 349595 347005 347764 346222 347677
11783 347677 349814 342607 339040 342177 352661 363610 368432 378638 376936 371369 342594 319725 294252
11770 294252 273076 242234 232701 229720 244024 259107 246407 236977 229901 246484 275390 304554
11758 304554 320758 330496 345938 330855 304872 293951 295164 301429 287671 273516 269386 287713
11746 287713 305000 293621 295033 298628 315751 338107 369002 379664 358530 337405 327779 326940
11734 326940 346749 366278 378785 389848 396902 393972 380853 372412 368225 360466 358209 369088 377840
11721 377840 376618 371536 389367 417951 443529 465648 497649 531100 583895 644035 671214 677087
$$ packed form
11810B62521R929Q095j3764l220N136O16N558J9590Q250K0096Q102O145Q998l782
11796C42270k434J4826K7979J5948j3928p876o893j5940m357k590P59j542J455
11783C47677K137p207l567L137J0484J0949M822J0206j702n567k8775k2869k5473
11770B94252k1176l0842r533k981J4304J5083j2700r430p076J6583K8906K9164
11758C04554J6204R738J5442j5083k5983j0921J213O265j3758j4155m130J8327
11746B87713J7287j1379J412L595J7123K2356L0895J0662k1134k1125r626q39
11734C26940J9809J9529J2507J1063P054k930j3119q441m187p759k257J0879Q752
11721C77840j222n082J7831K8584K5578K2119L2001L3451N2795O0140K7179N873
$$ plain form
11709 677087 677257 679251 678953 683896 691197 724447 747811 771475 782727 800829 828747 863829 880280
11696 880280 864021 849596 844743 835775 860493 907145 971823 1039841 1104302 1184176 1265171 1355042
11684 1355042 1429905 1486922 1525869 1540006 1530206 1554857 1623622 1718296 1842054 1983418 2180403
11673 2180403 2432387 2745132 3047990 3305151 3554883 3802620 4037156 4258501 4373503
11664 4373503 4293359 4106161 3900964 3769200 3681357 3650476 3668843 3736319 3833582 3924804 3975688
11653 3975688 4022718 4084627 4147056 4239367 4379355 4554265 4701232 4768331 4726319 4631168 4548317
11642 4548317 4505378 4431170 4309809 4183566 4128312 4181637 4327001 4512502 4751931 5079168
11632 5079168 5513497 6022365 6573237 7104625 7590116 8105157 8645803 9163843 9607477
$$ packed form
11709F77087J70J994k98M943P301L3250K3364K3664J1252J8102K7918L5082J6451
11696H80280j6259j4425m853q968K4718M6652O4678O8018O4461P9874Q0995Q9871
11684A355042P4863N7017L8947J4137r800K4651O8765R4674J23758J41364J96985
11673B180403K51984L12745L02858K57161K49732K47737K34536K21345J15002
11664D373503q0144j87198k05197j31764q7843l0881J8367O7476R7263R1222N0884
11653C975688M7030O1909O2429R2311J39988J74910J46967O7099m2012r5151q2851
11642D548317m2939p4208j21361j26243n5254N3325J45364J85501K39429L27237
11632E079168M34329N08868N50872N31388M85491N15041N40646N18040M43634
$$ plain form
11623 9607477 9932950 10142490 10333545 10709888 11359541 12248410 13205855 14161083 15210437
11614 15210437 16510496 18038800 19483390 20588537 21473046 22482062 23795138 25378379
11606 25378379 26988395 28332688 29449635 30566821 31669840 32581001 33181209 33478256
11598 33478256 33429269 33215473 33608345 35675837 40250385 47894124 58952958 72820940
11590 72820940 87469934 100819900 113201357 127238396 144201547 160244222 167693101
11583 167693101 163175383 152393789 143349306 139527412 140654757 144840069 149199804 150964119
11575 150964119 148810176 143742309 138679191 136427504 138247137 143696809 150529526 155367602
11567 155367602 157136587 158765276 163377511 170880963 179290838 187407708 195555912 204449100
$$ packed form
11623I607477L25473K09540J91055L76343O49653Q88869R57445R55228J049354
11614A5210437J300059J528304J444590J105147Q84509J009016J313076J583241
11606B5378379J610016J344293J116947J117186J103019R11161O00208K97047
11598C3478256m8987k13796L92872K067492M574548P643739J1058834J3867982
11590G2820940J4648994J3349966J2381457J4037039J6963151J6042675P448879
11583A67693101m517718j0781594r044483l821894J127345M185312M359735J764315
11575A50964119k153943n067867n063118k251687J819633N449672O832717M838076
11567A55367602J768985J628689M612235P503452Q409875Q116870Q148204Q893188
$$ plain form
11559 204449100 213144314 219160513 221623592 222237690 222963587 225348392 231285171 242353431
11551 242353431 258276223 277058089 296729931 315514333 331843441 346314965 362215948
11544 362215948 381586271 401137757 410703393 398846633 368489046 335609108 310326414
11537 310326414 293444271 283749939 279754658 278585256 276445830 271033072 263473381 257068376
11529 257068376 254200003 254284307 253890330 248629451 236989624 222695140 210709222 202259914
11521 202259914 195637407 189534806 184758584 183035003 184480948 186627091 186364767 183394975
11513 183394975 180266092 179033565 180443805 184837842 191542042 198505761 203698925 205918289
11505 205918289 204459050 200048744 196175180 196828692 201904910 204345713 193833142 169029660
$$ packed form
11559B04449100Q695214O016199K463079O14098P25897K384805N936779J1068260
11551B42353431J5922792J8781866J9671842J8784402J6329108J4471524J5900983
11544C62215948J9370323J9551486R565636j1856760l0357587l2879938k5282694
11537C10326414j6882143r694332l995281j169402k139426n412758p559691o405005
11529B57068376k868373Q4304l93977n260879j1639827j4294484j1985918q449308
11521B02259914o622507o102601m776222j723581J445945K146143k62324k969792
11513A83394975l128883j232527J410240M394037O704200O963719N193164K219364
11505B05918289j459239m410306l873564O53512N076218K440803j0512571k4803482
$$ plain form
11497 169029660 140472985 117554898 101840321 91466684 84684623 80375291 77698302
11490 77698302 75968881 74860733 74321283 74221245 74053728 73241267 71735527 69730507 67300651
11481 67300651 64648266 62096571 59836098 57713686 55485662 53199712 51072465 49120370
11473 49120370 47320596 45543911 43571728 41469418 39551114 37959034 36553629 35229873
11465 35229873 34031827 33012919 32151761 31332493 30412535 29311299 28058856 26763755
11457 26763755 25528069 24399288 23378374 22445288 21630747 20916225 20288559 19763788 19319115
11448 19319115 18924927 18586264 18309948 18096079 17895535 17685432 17424861 17119703 16809162
11439 16809162 16506753 16205191 15820404 15334908 14855838 14437779 14092732 13781503 13479471
$$ packed form
11497A69029660k8556675k2918087j5714577j0373637o782061m309332k676989
11490G7698302j729421j108148n39450j00038j67517q12461j505740k005020k429856
11481F7300651k652385k551695k260473k122412k228024k285950k127247j952095
11473D9120370j799774j776685j972183k102310j918304j592080j405405j323756
11465C5229873j198046j018908q61158q19268r19958j101236j252443j295101
11457B6763755j235686j128781j020914r33086q14541p14522o27666n24771m44673
11448A9319115l94188l38663k76316k13869k00544k10103k60571l05158l10541
11439A6809162l02409l01562l84787m85496m79070m18059l45047l11229l02032
$$ plain form
11430 13479471 13193397 12943685 12719337 12531169 12424680 12389671 12402486 12391253 12330086 12243337
11420 12243337 12138304 11895868 11444200 10809549 10135846 9546570 9074559 8693567 8381382
11411 8381382 8054505 7728940 7455226 7235589 7050972 6886518 6730347 6594275 6484089
11402 6484089 6397736 6291623 6104261 5878918 5659009 5471846 5300933 5144847 5030953 4923305
11392 4923305 4809463 4714467 4605270 4509239 4416373 4297970 4183072 4081502 4008310 3935839
11382 3935839 3861998 3790633 3704273 3633120 3584865 3549034 3511155 3469900 3386022 3311263 3221959
11371 3221959 3115870 3028989 2954584 2898015 2845756 2795957 2739025 2697034 2667903 2629162 2565229
11360 2565229 2524797 2500885 2476223 2463137 2447729 2414431 2371249 2327412 2288613 2275401 2271613
$$ packed form
11430A3479471k86074k49712k24348j88168j06489l5009J2815j1233o1167q6749
11420A2243337j05033k42436m51668o34651o73703n89276m72011l80992l12185
11411H381382l26877l25565k73714k19637j84617j64454j56171j36072j10186
11402F484089q6353j06113j87362k25343k19909j87163j70913j56086j13894j07648
11392D923305j13842r4996j09197r6031r2866j18403j14898j01570p3192p2471
11382C935839p3841p1365q6360p1153m8255l5831l7879m1255q3878p4759q9304
11371C221959j06089q6881p4405n6569n2259m9799n6932m1991k9131l8741o3933
11360B565229m0432k3912k4662j3086j5408l3298m3182m3837l8799j3212l788
$$ plain form
11349 2271613 2250025 2242415 2243103 2244772 2229404 2208073 2195986 2230187 2278270 2286323 2252510 2207371
11337 2207371 2174209 2150295 2127560 2117205 2089432 2051897 2012003 1993234 1978500 1965456 1949657
11326 1949657 1934575 1933296 1918464 1903168 1895162 1902597 1898332 1881079 1855923 1841654 1840809 1849704 1841072
11313 1841072 1822509 1799625 1791296 1792522 1801750 1817541 1819127 1828059 1864342 1911462 1930956 1947781
11301 1947781 1946997 1948599 1962276 1989523 1985286 1931522 1868423 1830622 1803166 1767150 1738483 1702265
11289 1702265 1661741 1633298 1606470 1579204 1549057 1531865 1531756 1514839 1485042 1463447 1424646 1399967
11277 1399967 1378556 1367217 1354494 1333440 1310710 1277550 1255235 1241393 1222526 1203315 1195582
11266 1195582 1187190 1186028 1175592 1177860 1182000 1181085 1189424 1184805 1161363 1165331 1166787 1166489 1147742 1093128
$$ packed form
11349B271613k1588p610O88J669j5368k1331j2087L4201M8083Q053l3813m5139
11337B207371l3162k3914k2735j0355k7773l7535l9894j8769j4734j3044j5799
11326A949657j5082j279j4832j5296q006P435m265j7253k5156j4269q45Q895q632
11313A841072j8563k2884q329J226R228J5791J586Q932L6283M7120J9494J6825
11301A947781p84J602J3677K7247m237n3764o3099l7801k7456l6016k8667l6218
11289A702265m0524k8443k6828k7266l0147j7192j09j6917k9797k1595l8801k4679
11277A399967k1411j1339j2723k1054k2730l3160k2315j3842j8867j9211p733
11266A195582q392j162j0436K268M140r15Q339m619k3442L968J456k98j8747n4614
$$ plain form
11252 1093128 1040503 1006016 975773 951533 926546 907815 906531 900061 879749 865662 854505 851526
11240 851526 841044 843001 835144 816244 800224 783698 780364 776910 764826 755059 746690 738605 738564
11227 738564 727000 704796 681690 677651 678991 676627 680064 687378 677249 657985 650096 650821 639566
11214 639566 635209 630635 636650 643095 637389 634736 637345 617586 617425 615379 621467 636212 637413 630172
11200 630172 621616 609206 610138 616739 603222 582576 571158 559779 549461 547665 532006 516352
11188 516352 503803 505034 506935 503321 504681 500495 510112 522437 514341 518664 522764 524871 520562 536180
11174 536180 540194 531512 541085 550194 548393 548693 549382 548328 566655 582746 592513 590274 576956 565421
11160 565421 583603 596789 602309 610074 638308 653348 657691 692372 740180 778535 828971 912156
$$ packed form
11252A093128n2625l4487l0243k4240k4987j8731j284o470k0312j4087j1157k979
11240H51526j0482J957p857j8900j6020j6526l334l454j2084r767q369q085m1
11227G38564j1564k2204k3106m039J340k364L437P314j0129j9264p889P25j1255
11214F39566m357m574O015O445n706k653K609j9759j61k046O088J4745J201p241
11200F30172q556j2410R32O601j3517k0646j1418j1379j0318j796j5659j5654
11188E16352j2549J231J901l614J360m186R617J2325q096M323M100K107m309J5618
11174E36180M014q682R573R109j801L00O89j054J8327J6091R767k239j3318j1535
11160E65421J8182J3186N520P765K8234J5040M343L4681M7808L8355N0436Q3185
$$ plain form
11148 912156 993150 1079367 1166128 1225654 1256911 1267681 1239125 1193801 1150823 1105678 1054108
11137 1054108 1025648 1027343 1037855 1043204 1066275 1081349 1112575 1134805 1149831 1171853 1197337 1229515
11125 1229515 1267924 1302069 1333638 1367208 1405299 1449898 1491455 1520916 1553641 1590369 1602446
11114 1602446 1606238 1611429 1621993 1665389 1745998 1870027 2027555 2177817 2328763 2493285 2637909
11103 2637909 2765240 2833822 2821666 2696011 2493215 2272080 2069369 1913150 1795671 1710962
11093 1710962 1639285 1602408 1590633 1578389 1558411 1545267 1524977 1507928 1497160 1480689 1459837
11082 1459837 1440933 1428408 1403747 1392090 1378663 1363804 1362963 1372595 1361072 1343045 1333252 1313454
11070 1313454 1294439 1284580 1292899 1319192 1372325 1434889 1489487 1525278 1539227 1537309 1536079 1491482
$$ packed form
11148I12156Q0994Q6217Q6761N9526L1257J0770k8556m5324m2978m5145n1570
11137A054108k8460J695J0512N349K3071J5074L1226K2230J5026K2022K5484L2178
11125A229515L8409L4145L1569L3570L8091M4599M1557K9461L2725L6728J2077
11114A602446L792N191J0564M3396Q0609J24029J57528J50262J50946J64522J44624
11103B637909J27331O8582j2156j25655k02796k21135k02711j56219j17479q4709
11093A710962p1677l6877j1775j2244j9978j3144k0290j7049j0768j6471k0852
11082A459837j8904j2525k4661j1657j3427j4859q41R632j1523j8027r793j9798
11070A313454j9015r859Q319K6293N3133O2564N4598L5791J3949j918j230m4597
$$ plain form
11058 1491482 1392107 1252305 1108563 981232 902489 840610 804646 772627 761196 749966 733722
11047 733722 724790 712215 709653 690907 675250 658384 640871 627769 610748 600667 589146 564113
11035 564113 549642 544378 531041 525130 525196 519158 513039 510576 520024 518479 512529 509360 507072 506762
11021 506762 518421 525758 544712 567422 585791 595962 586585 563681 550460 543114 530018 510615
11009 510615 483636 455554 434482 422865 425662 409464 407358 403948 394775 401113 402913 399371 394125
10996 394125 386395 388478 386655 378003 362366 362384 370119 364073 348000 340077 341619 358104 371232 370155
10982 370155 377090 387065 398156 415152 437796 452537 470037 509492 560521 589930 622404 642381
10970 642381 654436 652837 657844 648449 623652 586452 561492 544475 515116 470145 425262 389132
$$ packed form
11058A491482r9375j39802j43742j27331p8743o1879l5964l2019j1431j1230j6244
11047G33722q932j2575k562j8746j5657j6866j7513j3102j7021j0081j1521k5033
11035E64113j4471n264j3337n911O6o038o119k463R448j545n950l169k288l10
11021E06762J1659P337J8954K2710J8369J0171r377k2904j3221p346j3096j9403
11009E10615k6979k8082k1072j1617K797j6198k106l410r173O338J800l542n246
10996C94125p730K083j823q652j5637J8P735o046j6073p923J542J6485J3128j077
10982C70155O935R975J1091J6996K2644J4741J7500L9455N1029K9409L2474J9977
10970F42381J2055j599N007r395k4797l7200k4960j7017k9359m4971m4883l6130
$$ plain form
10958 389132 370975 368342 374468 377748 374397 367151 355665 350442 342310 332267 326654 323019 329525
10945 329525 325272 328644 331252 330527 339622 347200 371868 382226 390762 373089 377860 398948 423546
10932 423546 436620 450405 475204 510334 551811 602972 650042 700160 721792 714938 686119 661480
10920 661480 639977 623045 601565 575501 543682 513060 477093 443467 419792 392894 372995
10909 372995 353867 348746 338624 328824 322164 301030 309644 313950 311145 322249 334289 333731 322265
10896 322265 314607 316779 306058 274025 266138 281361 292144 294662 300396 312494 334460 355788
10884 355788 393247 433212 486306 535362 584173 653419 715081 736963 758302 795748 846520
10873 846520 861825 756327 614141 531458 475395 433903 389301 344767 321449 296782 282848
$$ packed form
10958C89132j8157k633O126L280l351p246j1486n223q132j0043n613l635O506
10945C29525m253L372K608p25R095P578K4668J0358Q536j7673M771K1088K4598
10932D23546J3074J3785K4799L5130M1477N1161M7070N0118K1632o854k8819k4639
10920F61480k1503j6932k1480k6064l1819l0622l5967l3626k3675k6898j9899
10909C72995j9128n121j0122r800o660k1134Q614M306k805J1104J2040n58j1466
10896C22265p658K172j0721l2033p887J5223J0783K518N734J2098K1966K1328
10884C55788L7459L9965N3094M9056M8811O9246O1662K1882K1339L7446N0772
10873H46520J5305j05498j42186q2683n6063m1492m4602m4534k3318k4667j3934
$$ plain form
10862 282848 280522 278903 276666 263000 253970 249624 247261 238296 233534 240198 238537 231665 227169 220057
10848 220057 216337 209416 211007 216260 223295 230225 233893 238668 234021 215924 226721 240029 252724
10835 252724 247135 228321 231343 247741 255103 271222 289179 285278 278063 266535 253158 234658
10823 234658 222105 209986 201192 189314 174658 170665 173813 171522 179736 197654 197505 190803 180839
10810 180839 182577 183604 171179 159173 154756 166339 171676 160971 163064 169548 165220 161343 150937
10797 150937 143212 123004 132386 146716 163895 171767 172825 159662 144711 143225 131718 134198 138201
10784 138201 141370 140728 139103 149094 154213 145301 129326 118987 127347 136604 127985 115305 131509
10771 131509 134067 125247 133509 118813 113104 112766 119966 129069 132607 110262 94899 107915 135567
$$ packed form
10862B82848k326j619k237j3666r030m346k363q965m762O664j661o872m496p112
10848B20057l720o921J591N253P035O930L668M775m647j8097J0797J3308J2695
10835B52724n589j8814L022J6398P362J6119J7957l901p215j1528j3377j8500
10823B34658j2553j2119q794j1878j4656l993L148k291Q214J7918j49o702r964
10810A80839J738J027j2425j2006m417J1583N337j0705K093O484m328l877j0406
10797A50937p725k0208R382J4330J7179P872J058j3163j4951j486j1507K480M003
10784A38201L169o42j625R991N119q912j5975j0339Q360R257q619j2680J6204
10771A31509K558q820Q262j4696n709l38P200R103L538k2345j5363J3016K7652
$$ plain form
10758 135567 148485 150169 147231 156691 148108 139938 130243 117039 116780 109857 111811 126148 120801 120151
10744 120151 123807 127124 117711 114893 111597 112770 126493 128074 128617 119779 99928 104333 117221 119509
10730 119509 117100 123963 116216 117991 115642 112971 113256 103256 95027 87530 95301 104378 100887 99221
10716 99221 106930 101640 106023 105675 107080 101747 101032 101405 99548 99151 91061 80964 72905 66376 87286
10701 87286 81814 80266 82008 86508 97483 95692 97312 83800 69453 68902 79038 80425 75262 71684
10687 71684 78895 83022 76263 80442 77759 76034 70128 65793 57714 76457 81438 88869 86657 75699
10673 75699 84208 95877 96009 97458 92332 94303 85265 92683 104878 106901 107633 104414 102737 91548
10659 91548 105523 115324 88372 76604 69114 63942 66313 62002 51433 64965 79279 70433 57394
$$ packed form
10758A35567J2918J684k938R460q583q170r695j3204k59o923J954J4337n347o50
10744A20151L656L317r413k818l296J173J3723J581N43q838j9851M405J2888K288
10730A19509k409O863p747J775k349k671K85j0000q229p497P771R077l491j666
10716I9221P709n290M383l48J405n333p15L73j857l97q090j0097q059o529K0910
10701H7286n472j548J742M500J0975j791J620j3512j4347n51J0136J387n163l578
10687G1684P211M127o759M179k683j725n906m335q079J8743M981P431k212j0958
10673G5699Q509J1669J32J449n126J971r038P418J2195K023P32l219j677j1189
10659I1548J3975R801k6952j1768p490n172K371m311j0569J3532J4314q846j3039
$$ plain form
10646 57394 61147 66957 67874 54323 40454 64639 84819 79662 66140 50536 58403 63696 65416
10633 65416 73303 79717 86868 93748 87383 75985 85645 94590 95699 92236 87089 68978 64353 61370
10619 61370 59944 55285 55842 63069 66021 67897 71790 54662 48763 28933 22902 20782 22446 39565
10605 39565 49200 55239 52533 48243 58181 57896 62969 62656 78961 76375 73018 65960 62151 59202 47625
10590 47625 51189 51067 48150 46739 47108 55738 58707 69250 84486 76774 73047 80482 71358 69555
10576 69555 56179 56936 48066 49810 52678 48374 48950 56970 71670 77907 55787 42651 64842 64481
10562 64481 53242 64463 74445 73126 79479 74077 51199 42985 49957 63946 78723 95798 107546
10549 107546 92899 94247 103192 109523 102503 84857 69399 49011 37382 26262 25131 31750 35441
$$ packed form
10646E7394L753N810R17j3551j3869K4185K0180n157j3522j5604P867N293J720
10633F5416P887O414P151O880o365j1398R660Q945J109l463n147j8111m625k983
10619F1370j426m659N57P227K952J876L893j7128n899j9830o031k120J664J7119
10605C9565R635O039k706m290R938k85N073l13J6305k586l357p058l809k949j1577
10590D7625L564j22k917j411L69Q630K969J0543J5236p712l727P435r124j803
10576F9555j3376P57q870J744K868m304N76Q020J4700O237k2120j3136K2191l61
10562F4481j1239J1221R982j319O353n402k2878q214O972J3989J4777J7075J1748
10549A07546j4647J348Q945O331p020j7646j5458k0388j1629j1120j131O619L691
$$ plain form
10536 35441 52787 44227 29741 37834 55548 63029 65142 57160 59540 64751 51744 41117 41775
10523 41775 41797 52329 66229 59296 44998 47490 48365 55447 58057 69736 81871 68463 63570 60990
10509 60990 62759 58250 62442 72487 97132 105881 90146 73335 76405 79811 60677 45515 48618
10496 48618 63644 58943 44219 44158 43084 42608 41015 36525 41780 46565 45365 31614 24611 22927
10482 22927 31114 40234 48191 38929 32777 24843 29126 46732 39197 33556 40092 47919 54340 62256
10468 62256 69163 74317 58387 76098 82662 67881 59743 53036 45242 42484 44102 53969 59310 59689
10454 59689 58659 64758 70169 59068 46023 44776 44993 49355 24544 17189 24991 51591 53071 53667
10440 53667 42257 31683 26421 23542 19653 19303 32565 43721 38522 29120 18104 12066 18167
$$ packed form
10536C5441J7346q560j4486Q093J7714P481K113p982K380N211j3007j0627O58
10523D1775K2J0532J3900o933j4298K492Q75P082K610J1679J2135j3408m893k580
10509F0990J769m509M192J0045K4645Q749j5735j6811L070L406j9134j5162L103
10496D8618J5026m701j4724o1j074m76j593m490N255M785j200j3751p003j684
10482B2927Q187R120P957r262o152p934M283J7606p535n641O536P827O421P916
10468F2256O907N154j5930J7711O564j4781q138o707p794k758J618R867N341L79
10454E9689j030O099N411j1101j3045j247K17M362k4811p355P802K6600J480N96
10440E3667j1410j0574n262k879l889l50J3262J1156n199r402j1016o038O101
$$ plain form
10427 18167 26409 30110 31928 36436 32839 35958 40050 40588 40250 52201 49611 43654 56627 62655
10413 62655 56228 49965 48834 57828 50185 52797 63620 60980 60652 58082 68732 69564 66406 55921
10399 55921 61167 58996 43806 35369 18409 7499 15537 22017 16011 19379 21678 10308 16324
10386 16324 25880 28559 28901 12217 9359 19425 18336 12640 13263 17620 26545 28989 27220 28078 20389
10371 20389 12948 11585 12151 4501 8258 31363 37460 39749 49148 58661 48048 20836 9982 5221
10357 5221 5770 3756 22542 21863 18644 15307 17005 14919 5189 15534 26385 29975 32168 25745
10343 25745 17702 15497 14426 8554 5096 5424 6747 9099 14121 2 -16358 -9288 -5905 -907
10329 -907 -2195 -7003 -1464 3379 5656 5021 -7064 -9109 -11939 -9254 -14280 -10368 -8391 -18995 -22670
$$ packed form
10427A8167Q242L701J818M508l597L119M092N38l38J1951k590n957J2973O028
10413F2655o427o263j131Q994p643K612J0823k640l28k570J0650Q32l158j0485
10399E5921N246k171j5190q437j6960j0910Q038O480o006L368K299j1370O016
10386A6324R556K679L42j6684k858J0066j089n696O23M357Q925K444j769Q58p689
10371B0389p441j363N66p650L757K3105O097K289R399R513j0613k7212j0854m761
10357E221N49k014J8786o79l219l337J698k086r730J0345J0851L590K193o423
10343B5745q043k205j071n872l458L28J323K352N022j4119j6360P070L383M998
10329i07j288m808N539M843K277o35j2085k045k830K685n026L912J977j0604l675
$$ plain form
10314 -22670 -11753 4391 1971 -15062 -25129 -25020 -22981 -26076 -35698 -34279 -21777 -8718 -8805 -26548
10300 -26548 -15722 156 2389 8685 8484 -13399 -27867 -24518 -32001 -29120 -17092 -23153 -35116
10287 -35116 -26829 -9403 -14523 -11296 -6713 -842 2206 1196 154 -14673 -11079 -2232 -3283 -9495
10273 -9495 -10347 398 878 -7124 867 3471 21268 20370 36847 79211 113222 131989 161663 202247
10259 202247 250570 304371 344942 379125 410511 409443 399287 358710 320723 273528 205898 139227
10247 139227 108267 95952 85975 66276 42815 36858 29497 36873 42711 48189 36932 33271 38176
10234 38176 37516 51704 64260 68725 79366 88991 93160 107284 125294 142781 180154 243932 317519
10221 317519 391074 462913 554420 660790 777709 888366 980012 1026851 1030238 1029920 1039279 1036903
$$ packed form
10314b2670J0917J6144k420j7033j0067J09K039l095r622J419J2502J3059q7j7743
10300b6548J0826J5878K233O296k01k1883j4468L349p483K881J2028o061j1963
10287c5116Q287J7426n120L227M583N871L048j010j042j4827L594Q847j051o212
10273i495q52J0745M80q002P991K604J7797q98J6477M2364L4011J8767K9674M0584
10259B02247M8323N3801M0571L4183L1386j068j0156m0577l7987m7195o7630o6671
10247A39227l0960j2315r977j9699k3461n957p361P376N838N478j1257l661M905
10234C8176o60J4188J2556M465J0641R625M169J4124J8010J7487L7373O3778P3587
10221C17519P3555P1839R1507J06370J16919J10657R1646M6839L387l18R359k376
$$ plain form
10209 1036903 1039886 1047416 1012119 931639 797374 634405 525666 437630 379718 361257 360712
10198 360712 363225 369755 386795 420890 445979 440637 444030 444827 440457 424962 381361 328912 275563
10185 275563 255602 256574 269772 297919 333498 384852 456497 538555 622040 730332 839930
10174 839930 949868 1056133 1154283 1236076 1281384 1316318 1343457 1356142 1348010 1338151 1352848
10163 1352848 1389770 1447692 1453534 1396048 1280027 1162427 1070359 1017353 992072 965211 948352
10152 948352 912513 859700 824972 826187 835963 806583 750950 662238 586291 529034 497623 478570
10140 478570 480195 487558 489129 496504 495518 517999 532425 556270 588199 631420 686165 725460 750164
10127 750164 784608 834321 891201 923161 976272 1046922 1132888 1256437 1366508 1421215 1462075
$$ packed form
10209A036903K983P530l5297q0480j34265j62969j08739q8036n7912j8461n45
10198C60712K513O530J7040L4095K5089n342L393P97m370j5495m3601n2449n3349
10185B75563j9961R72J3198K8147L5579N1354P1645Q2058Q3485J08292J09598
10174H39930J09938J06265R8150Q1793M5308L4934K7139J2685q132r859J4697
10163A352848L6922N7922N842n7486j16021j17600r2068n3006k5281k6861j6859
10152I48352l5839n2813l4728J215R776k9380n5633q8712p5947n7257l1411j9053
10140D78570J625P363J571P375r86K2481J4426K3845L1929M3221N4745L9295K4704
10127G50164L4444M9713N6880L1960N3111P0650Q5966J23549J10071N4707M0860
$$ plain form
10116 1462075 1521766 1552151 1506490 1364675 1197602 1046112 929764 833125 737742 677778
10106 677778 646361 634011 612263 578973 516318 452433 409246 384464 356148 336563 313282
10095 313282 293771 259827 246706 247815 235107 221234 223710 231753 230488 221121 200428 187968
10083 187968 186917 202880 237784 272718 315695 357924 421980 479194 535781 576079 614692 626551
10071 626551 604358 561429 506841 418750 317658 253398 198815 165878 141875 121050 109743
10060 109743 90517 71721 81644 81051 64056 61100 64369 64989 64494 71266 82812 76846 72370 79903
10046 79903 100121 112795 102217 90016 106480 118363 116908 116643 113521 102716 110009 101776 108191
10033 108191 97543 72151 70024 86697 110452 115758 130991 143481 154108 170602 177792 175440
$$ packed form
10116A462075N9691L0385m5661j41815j67073j51490j16348r6639r5383n9964
10106F77778l1417j2350k1748l3290o2655o3885m3187k4782k8316j9585k3281
10095C13282j9511l3944j3121J109j2708j3873K476Q043j265r367k0693j2460
10083A87968j051J5963L4904L4934M2977M2229O4056N7214N6587M0298L8613J1859
10071F26551k2193m2929n4588q8091j01092o4260n4583l2937k4003k0825j1307
10060A09743j9226j8796R923n93j6995k956L269O20m95O772J1546n966m476P533
10046G9903K0218J2674j0578j2201J6464J1883j455k65l122j0805P293q233O415
10033A08191j0648k5392k127J6673K3755N306J5233J2490J0627J6494P190k352
$$ plain form
10021 175440 161026 145604 132980 104357 102201 97018 91025 105494 109246 121930 127243 137254
10009 137254 163944 200018 240148 273969 298163 316272 325822 326531 313635 309725 330437 355187
9997 355187 353514 313205 257587 214829 202262 193857 184477 170216 161258 182181 191620 197042 195794
9984 195794 216767 230741 250147 284018 304545 309122 317246 331828 333058 343867 351284 359932 356641
9971 356641 362203 359294 336478 302295 278362 271755 276001 269173 270908 261878 276203 280564 268880
9958 268880 250298 231859 216443 200599 184387 160403 159168 184977 213530 228766 221769 222133
9946 222133 255333 287590 306430 312362 293084 286158 294319 322751 349373 356357 347494 329526 324508
9933 324508 300713 259168 233195 231753 236961 247251 248208 244454 238023 247619 267879 287515 302304
$$ packed form
10021A75440j4414j5422j2624k8623k156n183n993J4469L752J2684N313J0011
10009A37254K6690L6074M0130L3821K4194J8109R550P09j2896l910K0712K4750
9997C55187j673m0309n5618m2758j2567q405r380j4261q958K0923R439N422j248
9984A95794K0973J3974J9406L3871K0527M577Q124J4582J230J0809P417Q648l291
9971C56641N562k909k2816l4183k3933o607M246o828J735r030J4325M361j1684
9958B68880j8582j8439j5416j5844j6212k3984j235K5809K8553J5236o997L64
9946B22133L3200L2257J8840N932j9278o926Q161K8432K6622O984q863j7968n018
9933C24508k3795m1545k5973j442N208J0290R57l754o431R596K0260J9636J4789
$$ plain form
9920 302304 318519 322351 354157 388671 404505 397093 373313 370862 413584 468636 498287 520692
9908 520692 532447 532013 520929 516244 531566 573256 600064 622189 628447 641238 680927 753338
9896 753338 812798 855768 909405 980686 1055634 1115117 1137882 1128518 1122771 1150361 1196658 1241706
9884 1241706 1304263 1395957 1526584 1688338 1870693 2065595 2290825 2564729 2891568 3249956
9874 3249956 3523443 3687055 3864277 4147300 4535980 4935183 5302769 5674416 6010696 6258496
9864 6258496 6507807 6843203 7138395 7108339 6613014 5970559 5484404 5161007 4898612 4665585
9854 4665585 4492489 4386246 4351003 4376351 4504619 4684543 4931953 5339085 5937185 6781590
9844 6781590 7877638 9185263 10583633 11982554 13517306 15294909 17144729 18492290
$$ packed form
9920C02304J6215L832L1806L4514J5834p412k3780k451M2722N5052K9651K2405
9908E20692J1755m34j1084m685J5322M1690K6808K2125O258J2791L9689P2411
9896G53338N9460M2970N3637P1281P4948N9483K2765r364n747K7590M6297M5048
9884A241706O2557R1694J30627J61754J82355J94902K25230K73904L26839L58388
9874C249956K73487J63612J77222K83023L88680L99203L67586L71647L36280K47800
9864F258496K49311L35396K95192l0056m95325o42455m86155l23397k62395k33027
9854D665585j73096j06243l5243K5348J28268J79924K47410M07132N98100Q44405
9844F781590J096048J307625J398370J398921J534752J777603J849820J347561
$$ plain form
9836 18492290 18797459 18312345 17631513 16777738 15609690 14310904 13056234 11899003 10953637
9827 10953637 10268378 9814053 9517003 9295406 9135384 9157267 9406090 9827647 10350375 10937853
9817 10937853 11660965 12618718 13883793 15615385 17847095 20422270 22903335 25019077
9809 25019077 27012026 29407998 32192913 34342565 34659780 33528763 32321382 32205807
9801 32205807 33867739 37306068 42709907 50862087 62633080 78114050 95412384 111063068
9793 111063068 123711450 135994287 150819095 166390890 174085044 166741334 151476935
9786 151476935 138240240 128920267 122641182 120120635 122138729 126990395 131157196 133581164
9778 133581164 137118588 144701004 156912973 172382452 188659024 203368451 215634583
$$ packed form
9836A8492290L05169m85114o80832q53775j168048j298786j254670j157231r45366
9827A0953637o85259m54325k97050k21597j60022K1883K48823M21557N22728N87478
9817A0937853P23112R57753J265075J731592K231710K575175K481065K115742
9809B5019077J992949K395972K784915K149652L17215j131017j207381j15575
9801C2205807J661932L438329N403839Q152180J1770993J5480970J7298334J5650684
9793A11063068J2648382J2282837J4824808J5571795P694154p343710j5264399
9786A51476935j3236695r319973o279085k520547K018094M851666M166801K423968
9778A33581164L537424P582416J2211969J5469479J6276572J4709427J2266132
$$ plain form
9771 215634583 225751084 232582373 234035745 230622211 224504574 218043516 212242897 206771489
9763 206771489 201204228 195496866 190838720 188938980 190958464 197555174 209521336 228203413
9755 228203413 254694676 288390237 325138431 358953352 385627301 409244028 436681485
9748 436681485 465328823 481346373 462912424 408896730 347022008 298194659 263862009
9741 263862009 240622129 226411934 218402735 214077342 212083346 212271294 214695643 218090118
9733 218090118 222377362 228653168 237209020 246798571 254518961 258690996 259803441 257579402
9725 257579402 251866333 243847300 233178094 218649660 201759451 184639664 169436918
9718 169436918 158187383 151439288 149188256 151232131 156124514 161232911 165046355 168554876
$$ packed form
9771B15634583J0116501O831289J453372l413534o117637o461058n800619n471408
9763B06771489n567261n707362m658146j899740K019484O596710J1966162J8682077
9755B28203413K6491263L3695561L6748194L3814921K6673949K3616727K7437457
9748D36681485K8647338J6017550j8433949n4015694o1874722m8827349l4332650
9741B63862009k3239880j4210195q009199m325393j993996J87948K424349L394475
9733B18090118M287244O275806Q555852R589551P720390M172035J112445k224039
9725B57579402n713069q019033j0669206j4528434j6890209j7119787j5202746
9718A69436918j1249535o748095k251032K043875M892383N108397L813444L508521
$$ plain form
9710 168554876 172802564 176537884 179147839 182231876 186671482 189111124 181549428 160769833
9702 160769833 136227814 116102198 100839103 89279785 80895063 75191118 71580581
9695 71580581 69430585 68109904 67090660 66006561 65083779 64548868 63900289 62306869 59235961
9686 59235961 54983355 50753115 47392042 44790013 42543419 40590600 38908293 37417988
9678 37417988 36046755 34801468 33689630 32690514 31819319 31086536 30555489 30247552 30082601
9669 30082601 30003004 30073884 30353448 30845232 31451122 32033567 32414322 32510966 32335674 31857757
9659 31857757 31057929 29924654 28239982 25945884 23607479 21709753 20290708 19201436
9651 19201436 18363979 17699434 17153010 16643177 16170065 15760966 15397238 15111077 14870561
$$ packed form
9710A68554876M247688L735320K609955L084037M439606K439642p561696k0779595
9702A60769833k4542019k0125616j5263095j1559318q384722n703945l610537
9695G1580581k149996j320681j019244j084099r22782n34911o48579j593420l070908
9686E9235961m252606m230240l361073k602029k246594j952819j682307j490305
9678C7417988j371233j245287j111838r99116q71195p32783n31047l07937j64951
9669C0082601p9597P0880K79564M91784O05890N82445L80755R6644j75292m77917
9659C1857757p99828j133275j684672k294098k338405j897726j419045j089272
9651A9201436q37457o64545n46424n09833m73112m09099l63728k86161k40516
$$ plain form
9642 14870561 14660566 14494660 14418169 14482524 14632582 14767675 14736368 14570799 14447894 14439784
9632 14439784 14368610 13979070 13313602 12635395 12073708 11601974 11183237 10845879 10584034 10347435
9622 10347435 10052623 9689861 9334849 8999654 8628707 8231794 7874964 7560098 7301722
9613 7301722 7087444 6905736 6742702 6587153 6448490 6328736 6202393 6076544 5969240 5852591
9603 5852591 5732031 5584561 5423578 5267058 5114967 4969728 4826428 4676067 4524425 4391120
9593 4391120 4282625 4174001 4062260 3983086 3935501 3886014 3831064 3774466 3720466 3647517 3581356
9582 3581356 3529036 3492221 3467399 3460982 3438005 3401099 3336450 3266234 3230111 3214566 3201178 3179640
9570 3179640 3148127 3125392 3126203 3120786 3105598 3066439 2995147 2954311 2930828 2907290 2875248 2827312
$$ packed form
9642A4870561k09995j65906p6491O4355J50058J35093l1307j65569j22905q110
9632A4439784p1174l89540o65468o78207n61687m71734m18737l37358k61845k36599
9622A0347435k94812l62762l55012l35195l70947l96913l56830l14866k58376
9613G301722k14278j81708j63034j55549j38663j19754j26343j25849j07304j16649
9603E852591j20560j47470j60983j56520j52091j45239j43300j50361j51642j33305
9593D391120j08495j08624j11741p9174m7585m9487n4950n6598n4000p2949o6161
9582C581356n2320l6815k4822o417k2977l6906o4649p0216l6123j5545j3388k1538
9570C179640l1513k2735Q11n417j5188l9159p1292m0836k3483k3538l2042m7936
$$ plain form
9558 2827312 2749646 2660176 2625498 2592973 2550224 2516279 2491632 2462583 2419551 2369694 2339918
9547 2339918 2332778 2350128 2362181 2369930 2351500 2327783 2324939 2341709 2356562 2371527 2381989 2380766
9535 2380766 2391080 2403124 2423187 2433724 2446006 2426943 2403177 2391900 2380167 2359219 2321163
9524 2321163 2278690 2220044 2159174 2097265 2046136 2003120 1973434 1933972 1907081 1891980 1897813 1929631
9512 1929631 1939402 1938918 1970017 2020623 2052157 2061769 2056534 2027235 2002613 1986299 1941935 1877284
9500 1877284 1840250 1826168 1830338 1837877 1824698 1778710 1741966 1716454 1681260 1636249 1599194 1581642
9488 1581642 1578765 1560545 1537896 1513767 1486376 1460355 1446379 1424442 1420375 1418337 1415871 1408493
9476 1408493 1412719 1424514 1435275 1433604 1423456 1401809 1379979 1359513 1323812 1305305 1301068 1287636
$$ packed form
9558B827312p7666q9470l4678l2525m2749l3945k4647k9049m3032m9857k9776
9547B339918p140J7350J2053P749j8430k3717k844J6770J4853J4965J0462j223
9535B380766J0314J2044K0063J0537J2282j9063k3766j1277j1733k0948l8056
9524B321163m2473n8646o0870o1909n1129m3016k9686l9462k6891j5101N833L1818
9512A929631R771m84L1099N0606L1534R612n235k9299k4622j6314m4364o4651
9500A877284l7034j4082M170P539j3179m5988l6744k5512l5194m5011l7055j7552
9488A581642k877j8220k2649k4129k7391k6021j3976k1937m067k038k466p378
9476A408493M226J1795J0761j671j0148k1647k1830k0466l5701j8507m237j3432
$$ plain form
9464 1287636 1251558 1236185 1229725 1223661 1238957 1260621 1264502 1260185 1272814 1303887 1308424 1302127 1293126
9451 1293126 1287211 1267085 1261877 1265469 1240375 1207425 1181120 1180800 1186568 1201443 1210695 1221336 1237957
9438 1237957 1270751 1292939 1312032 1328358 1324907 1295121 1266340 1244662 1238608 1255286 1281316 1307741
9426 1307741 1330148 1360952 1393098 1423399 1480409 1552745 1642466 1705206 1745189 1773310 1803412
9415 1803412 1822418 1823637 1800417 1759817 1722005 1671109 1540930 1405638 1288962 1199597 1162632
9404 1162632 1127120 1095002 1079361 1074118 1078280 1085392 1094934 1137289 1171032 1204732 1231119 1256617
9392 1256617 1279568 1304540 1328170 1345858 1359397 1389173 1439881 1484877 1503146 1525029 1549404
9381 1549404 1591650 1668755 1767065 1873821 1987076 2117352 2258927 2354713 2344883 2242961 2112964
$$ packed form
9464A287636l6078j5373o460o064J5296K1664L881m317J2629L1073M537o297r001
9451A293126n915k0126n208L592k5094l2950k6305l20N768J4875R252J0641J6621
9438A237957L2794K2188J9093J6326l451k9786k8781k1678o054J6678K6030K6425
9426A307741K2407L0804L2146L0301N7010P2336Q9721O2740L9983K8121L0102
9415A803412J9006J219k3220m0600l7812n0896j30179j35292j16676q9365l6965
9404A162632l5512l2118j5641n243M162P112R542M2355L3743L3700K6387K5498
9392A256617K2951K4972K3630J7688J3539K9776N0708M4996J8269K1883K4375
9381A549404M2246P7105R8310J06756J13255J30276J41575R5786r830j01922j29997
$$ plain form
9370 2112964 1992925 1915074 1867717 1807865 1734498 1651945 1572660 1517731 1469516 1429583 1397060
9359 1397060 1357889 1314064 1244079 1191190 1148676 1106706 1061469 1025521 1019367 1035204 1049144 1080201
9347 1080201 1113401 1142516 1184020 1237740 1298964 1357897 1404439 1446534 1477069 1500061 1532930
9336 1532930 1556700 1594352 1652989 1732443 1819642 1893764 1923078 1966232 2002583 2023332 2035503
9325 2035503 2052232 2054682 2056182 2065988 2069807 2047505 1990353 1912373 1817645 1716164 1604209 1484038
9313 1484038 1370354 1257330 1181812 1123804 1099889 1094078 1084849 1073860 1045195 1038035 1051407 1063418
9301 1063418 1079352 1095392 1104482 1100987 1103480 1081982 1062066 1028713 997518 980977 984767 1020396
9289 1020396 1071000 1127039 1195428 1261139 1356858 1470284 1587618 1654391 1676727 1660925 1638991
$$ packed form
9370B112964j20039p7851m7357n9852p3367q2553p9285n4929m8215l9933l2523
9359A397060l9171m3825o9985n2889m2514m1970m5237l5948o154J5837J3940L1057
9347A080201L3200K9115M1504N3720O1224N8933M6542M2095L0535K2992L2869
9336A532930K3770L7652N8637P9454Q7199P4122K9314M3154L6351K0749J2171
9325B035503J6729K450J500R806L819k2302n7152p7980r4728j01481j11955j20171
9313A484038j13684j13024p5518n8008k3915n811r229j0989k8665p160J3372J2011
9301A063418J5934J6040R090l495K493k1498j9916l3353l1195j6541L790L5629
9289A020396N0604N6039O8389O5711R5719J13426J17334O6773K2336j5802k1934
$$ plain form
9278 1638991 1609428 1568304 1534519 1511719 1497509 1461709 1390577 1269608 1138440 1019273 927680
9267 927680 862368 816700 777597 758649 732903 708480 691208 672968 669813 680081 683003 677229
9255 677229 666829 652265 641582 635978 635403 622580 603478 602490 613447 614585 632143 658217 691232
9242 691232 707936 726891 747502 762735 804157 838005 847225 840190 816314 799680 799400 784805
9230 784805 750130 699628 650213 617444 588064 579107 578063 568032 559081 546488 533376 522193
9218 522193 518275 520888 512819 508398 507650 499503 495748 487035 490108 497885 494397 492484 489775 485174 476817
9203 476817 464913 456294 444354 446886 456616 453558 451737 446495 456859 453148 456391 456716 457678 451214
9189 451214 452145 462817 455562 435734 425857 421736 418698 413470 409457 421058 430109 429955 425444 415501
$$ packed form
9278A638991k9563m1124l3785k2800j4210l5800p1132j20969j31168j19167r1593
9267I27680o5312m5668l9103j8948k5746k4423j7272j8240l155J0268K922n774
9255F77229j0400j4564j0683n604n75j2823j9102r88J0957J138J7558K6074L3015
9242F91232J6704J8955K0611J5233M1422L3848R220p035k3876j6634k80j4595
9230G84805l4675n0502m9415l2769k9380q957j044j0031q951j2593j3112j1183
9218E22193l918K613q069m421p48q147l755q713L073P777l488j913k709m601q357
9203D76817j1904q619j1940K532R730l058j821n242J0364l711L243L25R62o464
9189D51214R31J0672p255j9828r877m121l038n228m013J1601R051j54m511r943
$$ plain form
9175 415501 401964 396337 398754 410429 398933 388496 386234 399892 414277 423031 405467 386678
9163 386678 380504 376049 366492 366220 380367 393753 386968 389023 382524 392880 399965 401464 402279 411559
9149 411559 411342 386878 369617 359903 370153 399693 401180 395919 389061 372669 368192 370212 373331
9136 373331 373832 368797 361976 377592 378101 372894 378135 379903 378113 366773 366096 354959 335117 329370
9122 329370 344217 350048 359869 360352 369669 365195 356162 349859 349422 349310 354376 357077 345429 332239
9108 332239 340935 345385 354611 361998 367483 366630 356943 362536 373632 370552 364757 356010 349045 355848
9094 355848 358898 360994 348909 332728 324042 338189 338885 342223 350695 365780 369205 351062 346220
9081 346220 337969 337974 354817 350274 339929 320072 329091 331619 326762 321631 325758 331029 326776 308248
$$ packed form
9175D15501j3537n627K417J1675j1496j0437k262J3658J4385Q754j7564j8789
9163C86678o174m455r557k72J4147J3386o785K055o499J0356P085J499Q15R280
9149D11559k17k4464j7261r714J0250K9540J487n261o858j6392m477K020L119
9136C73331N01n035o821J5616N09n207N241J768j790j1340o77j1137j9842n747
9122C29370J4847N831R821M83R317m474r033o303m37j12N066K701j1648j3190
9108C32239Q696M450R226P387N485q53r687N593J1096l080n795q747o965O803
9094C55848L050K096j2085j6181q686J4147O96L338Q472J5085L425j8143m842
9081C46220q251NJ6843m543j0345j9857R019K528m857n131M127N271m253j8528
$$ plain form
9067 308248 302657 313479 310980 312089 330284 348192 342826 322502 311389 309142 311300 320162 325033
9054 325033 337954 352404 347632 343749 341601 341590 344336 337028 333282 320083 313551 310217 309496 323258
9040 323258 325994 302103 293322 304029 301991 301500 312498 323902 313070 313520 306740 307304 317602 318085
9026 318085 319778 313857 320242 340347 341699 335011 333934 340769 330648 315733 324917 329336 324538 330159
9012 330159 327627 319065 309991 329867 324435 321416 314932 307115 306173 295455 281605 300611 307134 291848
8998 291848 283991 278925 284613 288758 287898 291963 299870 301985 303197 297852 275318 261595 277978 301560
8984 301560 320203 323430 310329 285992 283213 296088 310531 318756 315387 307633 312439 311805 315576
8971 315576 306642 298365 296930 301726 286677 279204 285127 289421 291969 281138 286199 283991 272932 272456
$$ packed form
9067C08248n591J0822k499J109J8195J7908n366k0324j1113k247K158Q862M871
9054C25033J2921J4450m772l883k148j1K746p308l746j3199o532l334p21J3762
9040C23258K736k3891q781J0707k038m91J0998J1404j0832M50o780N64J0298M83
9026C18085J693n921O385K0105J352o688j077O835j0121j4915R184M419m798N621
9012C30159k532q562r074J9876n432l019o484p817r42j0718j3850J9006O523j5286
8998B91848p857n066N688M145q60M065P907K115J212n345k2534j3723J6383K3582
8984C01560J8643L227j3101k4337k779J2875J4443Q225l369p754M806o34L771
8971C15576q934q277j435M796j5049p473N923M294K548j0831N061k208j1059m76
$$ plain form
8957 272456 272338 273057 264065 259982 273963 270666 268532 279732 285181 286425 286570 284735 286181 274630
8943 274630 263803 272060 273113 263117 267790 287386 281093 268035 262686 263173 277833 290117 303327
8930 303327 300021 297838 297173 291032 294457 285445 278815 257594 246848 260241 261976 265716 275673 284343
8916 284343 281911 274926 258960 251711 260990 264195 269129 250908 243691 248868 241892 237132 237019 243653
8902 243653 248009 262214 256163 243797 244144 251100 250273 240985 249702 245034 232818 232763 230900 237983 247313
8887 247313 248154 246704 255450 261272 259052 253119 243613 235565 230783 226883 242664 244326 238265 230870
8873 230870 222298 219932 223375 224225 229593 243447 243885 236085 234850 229245 222174 221801 222249 228170 232900
8858 232900 214049 220600 224480 224350 229216 233757 227427 223844 230056 216486 218528 229700 213134 226503
$$ packed form
8957B72456j18P19q992m083J3981l297k134J1200N449J244J45j835J446j1551
8943B74630j0827Q257J053r996M673J9596o293j3058n349M87J4660J2284J3210
8930C03327l306k183o65o141L425r012o630k1221j0746J3393J735L740R957Q670
8916B84343k432o985j5966p249R279L205M934j8221p217N177o976m760j13O634
8902B43653M356J4205o051j2366L47O956q27r288Q717m668j2216n5j863P083R330
8887B47313Q41j450Q746N822k220n933r506q048m782l900J5781J662o061p395
8873B30870q572k366L443Q50N368J3854M38p800j235n605p071l73M48N921M730
8858B32900j8851O551L880j30M866M541o330l583O212j3570K042J1172j6566J3369
$$ plain form
8844 226503 231793 228894 221908 209014 215329 225526 234348 233731 224325 215005 226195 239124 226018
8831 226018 219526 209102 220895 232692 246013 245426 231033 234861 240831 241359 246173 244492 229490
8818 229490 228440 228339 232632 241085 239612 248981 256980 231605 226865 238059 244343 256660 252429 238652
8804 238652 240532 234652 241586 247009 244358 242868 252751 250298 248647 249078 242123 239815 240347 239048 231606
8789 231606 230564 233034 233352 223981 226345 235574 249195 251630 257837 257947 264569 266368 270612 263718 255903
8774 255903 240321 236686 237860 252207 260951 272484 275316 274885 284119 281154 277559 266554 270405 281963
8760 281963 280737 287644 289708 283967 290709 299801 297752 280306 281493 273659 286927 306081 315505 314878
8746 314878 306684 306666 318042 309018 304411 293957 293359 291540 292503 288179 280057 274506 287200 286114 271528
$$ packed form
8844B26503N290k899o986j2894O315J0197Q822o17r406r320J1190J2929j3106
8831B26018o492j0424J1793J1797J3321n87j4393L828N970N28M814j681j5002
8818B29490j050j01M293Q453j473R369P999k5375m740J1194O284J2317m231j3777
8804B38652J880n880O934N423k651j490R883k453j651M31o955k308N32j299p442
8789B31606j042K470L18r371K364R229J3621K435O207J10O622J799M244o894p815
8774B55903j5582l635J174J4347Q744J1533K832m31R234k965l595j1005L851J1558
8760B81963j226O907K064n741O742R092k049j7446J187p834J3268J9154R424o27
8746C14878q194j8J1376r024m607j0454n98j819R63m324q122n551J2694j086j4586
$$ plain form
8731 271528 255518 244150 237413 228743 235352 253628 245904 244486 254549 271134 280955 284767 273383
8718 273383 260218 263378 266661 287761 300955 316251 334578 348150 360951 372351 405672 442051
8706 442051 508657 620551 762135 923006 1093289 1272343 1444769 1595950 1712271 1799715
8696 1799715 1809020 1711479 1515587 1256922 1025391 839203 715583 628846 564100 528164 501321
8685 501321 476116 467544 456413 453771 451734 444510 438075 423916 422623 419594 413524 400024 379264
8672 379264 374057 391118 396820 411565 418683 430219 458297 500694 542528 601077 679303 780023
8660 780023 903991 1051101 1214035 1359632 1493409 1637390 1740371 1812875 1765766 1630248
8650 1630248 1408942 1158779 948826 785741 688503 618667 575323 533694 504368 474354 453222
$$ packed form
8731B71528j6010j1368o737q670O609J8276p724j418J0063J6585R821L812j1384
8718B73383j3165L160L283K1100J3194J5296J8327J3572J2801J1400L3321L6379
8706D42051O6606J11894J41584J60871J70283J79054J72426J51181J16321Q7444
8696A799715R305r7541j95892k58665k31531j86188j23620q6737o4746l5936k6843
8685E01321k5205q572j1131k642k037p224o435j4159j293l029o070j3500k0760
8672C79264n207J7061N702J4745P118J1536K8078M2397M1834N8549P8226J00720
8660G80023J23968J47110J62934J45597J33777J43981J02981P2504m7109j35518
8650A630248k21306k50163k09953j63085r7238o9836m3344m1629k9326l0014k1132
$$ plain form
8639 453222 457991 451196 447665 441258 441574 450372 459672 453664 445417 436454 445323 472766 500313 528477
8625 528477 574128 670601 819533 973042 1154040 1334160 1509575 1684772 1839592 1947425
8615 1947425 1957526 1864327 1652753 1389082 1152050 939504 792098 680938 617888 565116
8605 565116 526078 505335 480846 458907 441530 424220 422662 430098 438445 428242 420605 433168
8593 433168 443744 460607 459286 465983 469821 497432 518383 519980 520705 537669 576503 677554 809101
8580 809101 948324 1113150 1285941 1441523 1593757 1738377 1855196 1903684 1821314 1602197
8570 1602197 1342960 1102811 892864 743602 652704 592853 536736 481860 450127 430885 419465
8559 419465 402260 391349 389082 380061 378594 361783 338533 319731 323174 334791 337764 343061 340905
$$ packed form
8639D53222M769o795l531o407L16Q798R300o008q247q963Q869K7443K7547K8164
8625E28477M5651R6473J48932J53509J80998J80120J75415J75197J54820J07833
8615A947425J0101r3199k11574k63671k37032k12546j47406j11160o3050n2772
8605E65116l9038k0743k4489k1939j7377j7310j558P436Q347j0203p637J2563
8593D33168J0576J6863j321O697L838K7611K0951J597P25J6964L8834J01051J31547
8580H09101J39223J64826J72791J55582J52234J44620J16819M8488q2370k19117
8570A602197k59237k40149k09947j49262r0898n9851n6117n4876l1733j9242j1420
8559D19465j7205j0911k267r021j467j6811k3250j8802L443J1617K973N297k156
$$ plain form
8546 340905 327598 319183 327299 328145 328733 332638 313162 300010 287975 279434 284300 274637 259650 255474
8532 255474 250875 249420 247622 231843 222726 215892 229666 222984 210610 214886 205875 209935 210238 212419
8518 212419 214012 200714 180313 175540 173835 176021 192504 206885 208866 201225 202464 201953 196081 195447
8504 195447 177196 180707 171517 170139 186560 194335 200301 203956 204292 199889 194541 186179 189483 181684
8490 181684 169380 171154 169313 177483 185312 189389 199493 196966 180130 161946 153955 149333 147128
8477 147128 148144 141451 158899 169715 164637 160913 137696 144190 152876 154380 158296 156247 154853 154126
8463 154126 155167 151392 156786 160832 149187 136674 131135 135127 138197 135468 132864 132509 140121 131184
8449 131184 127344 138589 152964 149315 134571 132429 130021 132744 126768 130943 138686 136231 121516
$$ packed form
8546C40905j3307q415Q116Q46N88L905j9476j3152j2035q541M866r663j4987m176
8532B55474m599j455j798j5779r117o834J3774o682j2374M276r011M060L03K181
8518B12419J593j3298k0401m773j705K186J6483J4381J981p641J239n11n872o34
8504A95447j8251L511r190j378J6421P775N966L655L36m403n348q362L304p799
8490A81684j2304J774j841Q170P829M077J0104k527j6836j8184p991m622k205
8477A47128J016o693J7448J0816n078l724k3217O494Q686J504L916k049j394p27
8463A54126J041l775N394M046j1645j2513n539L992L070k729k604l55P612q937
8449A31184l840J1245J4375l649j4744k142k408K723n976M175P743k455j4715
$$ plain form
8436 121516 131807 136187 150469 157940 143358 131252 130551 126656 121238 130219 131106 132573 132366 122363
8422 122363 123554 131980 144803 151269 140857 146768 162192 167373 151855 150344 144575 131123 133907
8409 133907 140904 153917 163455 169288 165972 155950 146793 140448 143288 149815 153851 154018 156639 147210
8395 147210 133196 135116 138721 131683 120665 109509 113699 111834 110308 114049 144313 155091 149962
8382 149962 146679 149087 138247 123750 122275 132931 128549 122156 137384 155770 160676 154751 146251
8369 146251 127458 119078 133329 136240 138361 131328 125259 128492 125578 123782 118690 112460 126571 136759
8355 136759 140452 154380 143202 134811 129153 136027 130067 112868 122536 130220 139678 148355 137678
8342 137678 133250 137456 139709 139702 124888 104246 88771 97258 108379 102082 108449 113169 113920 114818 122232
$$ packed form
8436A21516J0291M380J4282P471j4582j2106p01l895n418Q981Q87J467k07j0003
8422A22363J191Q426J2823O466j0412N911J5424N181j5518j511n769j3452K784
8409A33907O997J3013R538N833l316j0022r157o345K840O527M036J67K621r429
8395A47210j4014J920L605p038j1018j1156M190j865j526L741L0264J0778n129
8382A49962l283K408j0840j4497j475J0656m382o393J5228J8386M906n925q500
8369A46251j8793q380J4251K911K121p033o069L233k914j796n092o230J4111J0188
8355A36759L693J3928j1178q391n658O874n960j7199R668P684R458Q677j0677
8342A37678m428M206K253pj4814k0642j5475Q487J1121o297O367M720P51Q98P414
$$ plain form
8327 122232 118218 124539 128364 128531 138235 151283 154059 145266 133877 133793 138731 143664 144564 160604 169918
8312 169918 160358 150568 147224 129158 116382 115356 117914 108623 110532 110542 120239 129988 127126 137001
8298 137001 133917 133180 136088 140805 129597 119256 118564 126390 134214 126197 127830 133233 117936 126858
8284 126858 128901 131551 124381 120309 122002 125132 125341 122654 123328 126976 140156 144836 141173 139190 134101
8269 134101 141391 147013 157205 164246 172948 173464 164209 152651 129871 121675 120585 120034 134178 142909
8255 142909 145179 146765 142386 139113 137273 147250 146930 147787 176814 173908 164236 160048 155379 150375 139717
8240 139717 135434 132886 128982 121640 138043 142556 134488 137656 140353 151025 148295 148633 160039 161966
8226 161966 145864 143967 152403 158074 158893 153871 151561 158917 164929 158798 147572 139323 129966 131072
$$ packed form
8327A22232m014O321L825J67R704J3048K776q793j1389q4M938M933R00J6040R314
8312A69918r560r790l344j8066j2776j026K558r291J909J0R697R749k862R875
8298A37001l084p37K908M717j1208j0341o92P826P824q017J633N403j5297Q922
8284A26858K043K650p170m072J693L130K09k687O74L648J3180M680l663j983n089
8269A34101P290N622J0192P041Q702N16r255j1558k2780q196j090n51J4144Q731
8255A42909K270J586m379l273j840R977l20Q57K9027k906r672m188m669n004j0658
8240A39717m283k548l904p342J6403M513q068L168K697J0672k730L38J1406J927
8226A61966j6102j897Q436N671Q19n022k310P356O012o131j1226q249r357J106
$$ plain form
8212 131072 124635 121241 117840 130413 131305 142689 164207 170993 173152 162742 171270 174672 179684 186001
8198 186001 185846 171072 155166 149337 161450 163523 147155 145058 146653 145821 158528 174518 183083
8185 183083 179040 162247 148500 143335 150053 149642 148223 149308 145572 160525 164909 157050 158099 159687
8171 159687 160245 156363 150561 145511 148384 164494 167903 175466 180859 179598 164816 163726 170929 172948
8157 172948 182655 185810 177103 166643 161007 162529 166202 163743 173072 170336 151087 152742 175999 193180
8143 193180 190888 181243 173198 173801 174229 170272 157886 158959 174825 173580 158161 156622 171491 173898
8129 173898 149201 152945 166042 165713 151723 149447 163887 163776 162306 162425 169098 174451 165418 155129
8115 155129 137521 137515 138853 152637 164198 182090 202273 199549 179988 149266 143163 142222 144620 137202
$$ packed form
8212A31072o437l394l401J2573Q92J1384K1518O786K159j0410Q528L402N012O317
8198A86001j55j4774j5906n829J2113K073j6368k097J595q32J2707J5990Q565
8185A83083m043j6793j3747n165O718m11j419J085l736J4953M384p859J049J588
8171A59687N58l882n802n050K873J6110L409P563N393j261j4782j090P203K019
8157A72948R707L155q707j0460n636J522L673k459R329k736j9249J655K3257J7181
8143A93180k292r645q045O03M28l957j2386J073J5866j245j5419j539J4869K407
8129A73898k4697L744J3097l29j3990k276J4440j11j470J19O673N353r033j0289
8115A55129j7608oJ338J3784J1561J7892K0183k724j9561l0722o103r41K398p418
$$ plain form
8101 137202 144065 145105 147258 148442 148901 145463 134754 130392 116115 118073 126646 130958 124849 124524
8087 124524 127701 133363 132854 117980 109827 111818 116378 128405 121598 121943 125661 136172 131457 131647
8073 131647 134447 137451 153326 153089 156770 161562 153125 145904 140772 130245 116088 117753 117711 131815
8059 131815 112518 87462 85421 101774 110699 123251 138378 130613 113544 115227 109128 98409 90803
8046 90803 97719 103329 100707 89391 96866 112407 111315 100420 101238 79127 78826 90624 111049 116778
8032 116778 109712 98155 98492 75332 55449 57028 56400 58618 72595 76018 67305 65079 58092 58491
8018 58491 75098 83297 81056 69326 74152 78041 92830 85500 91968 81190 53867 32636 34995
8005 34995 31560 45812 46113 56730 79403 104280 117025 118677 104594 95104 101801 107234 109882
$$ packed form
8101A37202O863J040K153J184M59l438j0709m362j4277J958Q573M312o109l25
8087A24524L177N662n09j4874q153J991M560J2027o807L45L718J0511m715J90
8073A31647K800L004J5875k37L681M792q437p221n132j0527j4157J665m2J4104
8059A31815j9297k5056k041J6353Q925J2552J5127p765j7069J683o099j0719p606
8046I0803O916N610k622j1316P475J5541j092j0895Q18k2111l01J1798K0425N729
8032A16778p066j1557L37k3160j9883J579o28K218J3977L423q713k226o987L99
8018E8491J6607Q199k241j1730M826L889J4789p330O468j0778k7323k1231K359
8005C4995l435J4252L01J0617K2673K4877J2745J652j4083r490O697N433K648
$$ plain form
7992 109882 117058 125375 135390 123197 85698 58074 46910 64553 63370 65900 69037 66633 87035
7979 87035 103430 106251 106580 112449 101780 85288 82800 104296 107342 95452 100754 95666 85268
7966 85268 64448 52956 70327 86886 87168 90710 105147 116342 134251 158462 159616 153616 133153
7953 133153 101744 88777 104108 122713 139981 142358 150135 132168 90446 69063 56546 47059
7941 47059 60768 69327 67231 76616 93471 101951 120812 116735 101698 91905 96178 92372 81137
7928 81137 88276 85694 59748 52667 62189 55148 48965 53335 63767 62280 82077 84050 86685 97972
7914 97972 120720 142530 134506 108702 92928 92375 97007 77530 66414 56620 36208 14843 12807
7901 12807 78 1671 14134 25180 53099 65043 80604 79873 75139 67777 56551 50237 43153
$$ packed form
7992A09882P176Q317J0015j2193l7499k7624j1164J7643j183K530L137k404K0402
7979H7035J6395K821L29N869j0669j6492k488K1496L046j1890N302n088j0398
7966H5268k0820j1492J7371J6559K82L542J4437J1195J7909K4211J154o000k0463
7953A33153l1409j2967J5331J8605J7268K377P777j7967m1722k1383j2517r487
7941D7059J3709Q559k096R385J6855Q480J8861m077j5037r793M273l806j1235
7928H1137P139k582k5946p081R522p041o183M370J0432j487J9797J973K635J1287
7914I7972K2748K1810q024k5804j5774n53M632j9477j1116r794k0412k1365k036
7901A2807j2729J593J2463J1046K7919J1944J5561p31m734p362j1226o314p084
$$ plain form
7888 43153 32145 23564 26993 31685 34441 44336 46494 38472 41074 51307 48580 43954 55550 72822
7874 72822 94341 79770 48828 39350 40026 54466 47796 57249 70429 76681 75594 70050 56445
7861 56445 66142 66669 65541 74285 70371 58988 63213 65906 66329 76534 81241 73743 70790 64105 59123
7846 59123 53665 59198 74220 71283 63569 79568 95039 95051 94915 66669 53015 55451 49486 67604
7832 67604 63893 40968 29159 45039 48131 44667 39948 34551 52994 67688 70212 65016 60759
7819 60759 62684 52859 33173 19726 19543 24521 22962 30134 42585 48892 62249 66556 60755 50982
7805 50982 52938 56940 55527 50865 62541 48925 43487 32194 39928 41402 46530 47048 54683 47409
7791 47409 50702 56026 65804 68590 71801 70697 72623 73926 70463 56928 54610 48607 57824 52365
$$ packed form
7888D3153j1008q581L429M692K756R895K158q022K602J0233k727m626J1596J7272
7874G2822K1519j4571l0942r478O76J4440o670R453J3180O252j087n544j3605
7861E6445R697N27j128Q744l914j1383M225K693M23J0205M707p498k953o685m982
7846E9123n458N533J5022k937p714J5999J5471J2j36k8246j3654K436n965J8118
7832F7604l711k2925j1809J5880L092l464m719n397J8443J4694K524n196m257
7819F0759J925r825j9686j3447j83M978j559P172J2451O307J3357M307n801r773
7805E0982J956M002j413m662J1676j3616n438j1293P734J474N128N18P635p274
7791D7409L293N324R778K786L211j104J926J303l463j3535k318o003R217n459
$$ plain form
7777 52365 33593 34553 44338 44888 47284 50104 41201 34778 33104 22676 21851 26543 39437 47909 65671
7762 65671 81113 69041 53658 46415 48083 49998 50217 52359 61919 75964 75169 83919 84418 65660
7748 65660 61589 67528 70204 55023 48798 46195 42929 50849 55223 51700 55909 36832 31773 39699
7734 39699 42332 50405 54735 59900 62885 57161 52989 43687 57563 62360 60227 63806 47757 51960
7720 51960 59631 56377 47509 48955 45481 42615 50004 42312 45443 44110 41504 46102 47612 38216 43192
7705 43192 55661 57162 45001 38809 36355 30185 35064 39396 45561 34295 29927 42143 50135 49250
7691 49250 58297 58657 68670 73912 61734 54239 45845 53489 53803 46872 45174 30795 41002 56326
7677 56326 53221 52013 50183 52994 44631 45558 42842 42851 44020 43203 35895 29722 21617 24605 41445 58465
$$ packed form
7777E2365j8772R60R785N50K396K820q903o423j674j0428q25M692J2894Q472J7762
7762F5671J5442j2072j5383p243J668J915K19K142R560J4045p95Q750M99j8758
7748F5660m071N939K676j5181o225k603l266P920M374l523M209j9077n059P926
7734C9699K633Q073M330N165K985n724m172r302J3876M797k133L579j6049M203
7720E1960P671l254q868J446l474k866P389p692L131j333k606M598J510r396M976
7705D3192J2469J501j2161o192k454o170M879M332O165j1266m368J2216P992q85
7691D9250R047L60J0013N242j2178p495q394P644L14o931j698j4379J0207J5324
7677E6326l105j208j830K811q363R27k716RJ169q17p308o173q105K988J6840J7020
$$ plain form
7661 58465 51955 45583 39309 55574 73926 76385 64149 49207 30040 32802 38635 31864 39383
7648 39383 42299 53173 60332 60588 43412 39152 34499 38905 46942 37592 32987 39818 52555 51867
7634 51867 40512 28583 23868 23319 31334 42952 46881 56213 45592 45725 46156 49093 43122 52664
7620 52664 54293 53850 55723 49344 59867 52833 56300 66127 58767 43494 48709 56925 61847 61519 42758
7605 42758 50808 62558 59087 59361 50686 41260 50808 53591 50281 56251 55402 49083 42907 39532 35316
7590 35316 36339 23418 13070 10957 24818 35657 42111 26416 23325 26129 35833 36333 40435 55927
7576 55927 54472 50442 49489 41229 30314 12776 13270 19005 5564 13496 25633 25521 24526 34855
7562 34855 41451 36487 40443 41250 28144 14573 21792 24974 30599 33512 44510 39902 56023 53785
$$ packed form
7661E8465o510o372o274J6265J8352K459j2236j4942j9167K762N833o771P519
7648C9383K916J0874P159K56j7176m260m653M406Q037r350m605O831J2737o88
7634E1867j1355j1929m715n49Q015J1618L929R332j0621J33M31K937n971R542
7620E2664J629m43J873o379J0523p034L467R827p360j5273N215Q216M922l28j8761
7605D2758Q050J1750l471K74q675r426R548K783l310N970q49o319o176l375m216
7590C5316J023j2921j0348k113J3861J0839O454j5695l091K804R704N00M102J5492
7576E5927j455m030r53q260j0915j7538M94N735j3441P932J2137j12r95J0329
7562C4855O596m964L956Q07j3106j3571P219L182N625K913J0998m608J6121k238
$$ plain form
7548 53785 47941 40881 20411 28746 40874 41736 27845 15798 21722 37872 50852 58727 57687
7535 57687 54065 41551 25016 30548 32686 29435 37362 49118 57165 41233 27355 36527 40740
7522 40740 33995 26636 27047 32283 25581 16038 520 5108 13532 13706 5661 3521 3194 -3163 6543
7507 6543 13822 21656 23051 30405 24187 29876 16934 12814 25078 30992 30775 26316 37303 42262
7493 42262 39865 51823 47865 28318 32451 16405 20797 15867 13901 36865 45292 42521 36447 38871
7479 38871 39124 16390 7459 4468 6009 5186 10134 25406 27440 17765 31281 35029 17783 20027
7465 20027 32138 29310 30320 15589 5851 6283 37390 33838 34203 42849 54255 61788 57610 47330
7451 47330 50920 52662 47121 55392 49106 39022 21954 8571 6670 12282 15754 16018 30130 40295
$$ packed form
7548E3785n844p060k0470Q335J2128Q62j3891j2047N924J6150J2980P875j040
7535E7687l622j2514j6535N532K138l251P927J1756Q047j5932j3878R172M213
7522D0740o745p359M11N236o702r543j5518M588Q424J74q045k140l27o357R706
7507F543P279P834J395P354o218N689j2942m120J2264N914k17m459J0987M959
7493D2262k397J1958l958j9547M133j6046M392m930j966K2964Q427k771o074K424
7479C8871K53k2734q931k991J541q23M948J5272K034r675J3516L748j7246K244
7465B0027J2111k828J010j4731r738M32L1107l552L65Q646J1406P533m178j0280
7451D7330L590J742n541Q271o286j0084j7068j3383j901N612L472K64J4112J0165
$$ plain form
7437 40295 39534 29439 48114 59658 52309 44316 43952 45721 55714 54552 45875 45726 59286 56204
7423 56204 47539 46564 50157 50521 39140 41922 56159 50143 41675 27004 22226 28387 28932 29223 26167
7408 26167 29000 34034 35861 29985 19323 27720 44948 48678 36842 38871 34967 34596 30414 36731
7394 36731 45774 46566 40360 30498 29108 32809 32923 38871 41782 33877 15283 13875 16427 20265 29001
7379 29001 36997 38471 35468 23604 6760 25865 58259 53760 42250 36113 37716 32110 36227
7366 36227 38079 40537 49774 45983 39849 19939 7238 28139 37174 46191 51457 52130 42834 37603
7352 37603 31930 17664 13361 12414 18504 22307 29999 41804 42166 21572 13633 22144 18794 8368
7338 8368 21786 25977 27138 22560 19584 34042 37876 20296 24657 44645 62270 54816 38290
$$ packed form
7437D0295p61j0095J8675J1544p349p993l64J769R993j162q677j49J3560l082
7423E6204q665r75L593L64j1381K782J4237o016q468j4671m778O161N45K91l056
7408B6167K833N034J827n876j0662Q397J7228L730j1836K029l904l71m182O317
7394C6731R043P92o206r862j390L701J14N948K911p905j8594j408K552L838Q736
7379B9001P996J474l003j1864j6844J9105L2394m499j1510o137J603n606M117
7366C6227J852K458R237l791o134j9910j2701K0901R035R017N266O73r296n231
7352C7603n673j4266m303r47O090L803P692J1805L62k0594p939Q511l350j0426
7338H368J3418M191J161m578k976J4458L834j7580M361J9988J7625p454j6526
$$ plain form
7325 38290 22971 20190 41437 45111 41288 42972 37750 27870 19481 26129 39831 46988 51474 49761
7311 49761 41415 39921 41237 35424 29519 25722 23961 19267 30679 21674 17936 11390 27752 34344
7297 34344 30035 16894 17533 15752 25495 39112 36457 18269 16106 31462 31530 25618 17932 20946
7283 20946 35372 38479 28031 18714 16558 27039 33003 34482 28632 13329 9605 9626 1102 -1719
7269 -1719 10735 28287 23062 10148 21704 32931 28178 29748 31225 29010 10059 6443 12899
7256 12899 22479 17551 21009 17167 14003 7214 14965 23371 24439 25735 24291 28777 20506 26420 27990
7241 27990 26543 26736 9031 28420 36198 29821 31516 31757 27612 27682 38369 36096 30495 25542 24345
7226 24345 20710 11042 13406 17985 24051 23036 19890 17056 13528 17759 17513 17861 12911 15767 11970
$$ packed form
7325C8290j5319k781K1247L674l823J684n222r880q389O648J3702P157M486j713
7311D9761q346j494J316n813n905l797j761m694J1412r005l738o546J6362O592
7297C4344m309j3141O39j781R743J3617k655j8188k163J5356O8n912p686L014
7283B0946J4426L107j0448r317k156J0481N964J479n850j5303l724K1q524k821
7269a719J2454J7552n225j2914J1556J1227m753J570J477k215j8951l616O456
7256A2899R580m928L458l842l164o789P751Q406J068J296j444M486q271N914J570
7241B7990j447J93j7705J9389P778o377J695K41m145P0J0687k273n601m953j197
7226B4345l635r668K364M579O066j015l146k834l528M231k46L48m950K856l797
$$ plain form
7211 11970 16399 16497 14012 17402 23837 22970 22762 27566 39364 34351 24725 20056 12328 14671 20213
7196 20213 19326 17297 11933 15903 17691 23437 21180 14445 9016 11534 12280 16407 18709 18953 15983
7181 15983 12413 8791 17670 17549 20253 20673 16935 11406 1285 -2364 6450 8304 5576 17667 29485
7166 29485 26162 20776 5163 2986 11441 13663 9122 15834 24270 37714 44554 47131 53282 48814
7152 48814 33331 22172 28464 19071 4341 9539 15016 23167 24736 27526 32543 38624 38184 36454
7138 36454 28626 26041 34170 33774 23334 18764 4885 7171 13956 26906 33757 54244 62378 47856
7124 47856 29268 9378 17925 26178 30146 21234 18353 27358 22830 25996 34191 34339 26526 27459 22529
7109 22529 10791 26053 30117 16748 14781 18346 15704 10210 10376 26358 34501 27347 42394 53256
$$ packed form
7211A1970M429R8k485L390O435q67k08M804J1798n013r626m669p728K343N542
7196B0213q87k029n364L970J788N746k257o735n429K518P46M127K302K44k970
7181A5983l570l622Q879j21K704M20l738n529j0121l649Q814J854k728J2091J1818
7166B9485l323n386j5613k177Q455K222m541O712Q436J3444O840K577O151m468
7152D8814j5483j1159O292r393j4730N198N477Q151J569K790N017O081m40j730
7138C6454p828k585Q129l96j0440m570j3879K286O785J2950O851K0487Q134j4522
7124D7856j8588j9890Q547Q253L968q912k881R005m528L166Q195J48p813R33m930
7109B2529j1738J5262M064j3369j967L565k642n494J66J5982Q143p154J5047J0862
$$ plain form
7095 53256 47839 50099 40524 26866 19218 27812 41706 36718 24200 17596 13609 4100 8189 31172
7081 31172 48688 42629 31111 25842 13964 5830 13561 13680 13283 13504 15088 14918 24861 40429 38032
7066 38032 16153 14891 31294 37269 20385 16776 17652 11199 10704 19498 14926 11792 22508 21966
7052 21966 16645 31752 26487 21439 20561 29233 25205 23151 18452 13864 9486 8454 16583 4849
7038 4849 -7189 -3870 -2246 10293 26438 33082 36227 25960 22257 5906 10909 18068 12116 2603
7024 2603 6465 9812 8228 18947 24384 17371 13789 -216 -13898 -12598 1016 16804 16432 19016
7010 19016 27832 22516 17984 11022 12537 10969 13087 11807 2845 9199 32678 36997 38042 27292
6996 27292 18137 6966 14614 12482 33624 34084 27262 25524 18882 13921 14166 14389 17050 4538 -525
$$ packed form
7095E3256n417K260r575j3658p648Q594J3894m988j2518o604l987r509M089K2983
7081C1172J7516o059j1518n269j1878q134P731J19l97K21J584j70R943J5568k397
7066C8032k1879j262J6403N975j6884l609Q76o453m95Q794m572l134J0716n42
7052B1966n321J5107n265n048q78Q672m028k054m699m588m378j032Q129j1734
7038D849j2038L319J624J2539J6145O644L145j0267l703j6351N003P159n952r513
7024B603L862L347j584J0719N437p013l582j4005j3682J300J3614J5788l72K584
7010A9016Q816n316m532o962J515j568K118j280q962O354K3479M319J045j0750
6996B7292r155j1171P648k132K1142M60o822j738o642m961K45K23K661j2512n063
$$ plain form
6981 -525 2931 7967 12810 14700 29312 21565 8849 -6640 -9686 7593 8754 -649 -2884 -2634
6967 -2634 5626 14598 13673 15890 19597 33679 42409 23679 21382 31029 28696 23406 16947 19487 16322
6952 16322 26187 47202 45041 29121 28194 28419 32458 44778 53346 43729 37006 24398 16406 25864
6938 25864 20203 7965 10480 12684 23439 31620 25255 35105 36831 31997 16620 13665 9340 12334
6924 12334 43676 52622 50030 36226 29084 15054 14088 29208 37602 48047 38143 35308 36979 26019
6910 26019 23619 23634 23881 32222 28687 30546 35502 40735 34226 44440 36508 38737 36231 19903 11643
6895 11643 3038 6954 27765 37201 45874 28039 24961 11976 2420 2581 15340 15734 18412 26775
6881 26775 21870 22928 15379 10005 16637 20309 17963 11052 15853 12048 12705 19915 16324 2791 -10627
$$ packed form
6981e25L456N036M843J890J4612p747j2716j5489l046J7279J161r403k235K50
6967b634Q260Q972r25K217L707J4082Q730j8730k297R647k333n290o459K540l165
6952A6322R865K1015k161j5920r27K25M039J2320Q568r617o723j2608p992R458
6938B5864n661j2238K515K204J0755Q181o365R850J726m834j5377k955m325K994
6924A2334L1342Q946k592j3804p142j4030r66J5120Q394J0445r904k835J671j0960
6910B6019k400J5K47Q341l535J859M956N233o509J0214p932K229k506j6328q260
6895A1643q605L916K0811R436Q673j7835l078j2985r556J61J2759L94K678Q363
6881B6775m905J058p549n374O632L672k346o911M801l805O57P210l591j3533j3418
$$ plain form
6866 -10627 -16707 -27626 -17762 -5957 -2045 -4512 173 -10978 -26710 -9988 -1352 638 2226
6853 2226 20930 22537 17768 20415 22868 6972 -3901 -4243 5621 7776 10338 10921 4154 6255 5988
6838 5988 10920 20256 10038 -9592 -6309 -10816 -3308 -3686 -1562 -315 -646 4662 9702 16296 15679
6823 15679 6399 14968 17613 22193 25407 14458 17325 14770 9831 22942 40067 30374 30553 25657
6809 25657 -2268 -11084 9378 25332 27760 26199 24409 13348 12536 15112 27506 21178 10131
6796 10131 6546 19253 20860 22083 10424 -3503 -6888 -11177 -2179 -4105 -14654 -6653 -1800 6291
6782 6291 26411 24625 13232 2789 -1453 10651 20182 15784 15114 10429 10635 6129 2957 -1158
6768 -1158 -1288 5053 8493 5144 3840 3474 6521 11174 10140 -6247 5267 2249 -3285 -1166 1736
$$ packed form
6866a0627o080j0919R864J1805L912k467M685j1151j5732J6722Q636J990J588
6853B226J8704J607m769K647K453j5896j0873l42R864K155K562N83o767K101k67
6838E988M932R336j0218j9630L283m507P508l78K124J247l31N308N040O594o17
6823A5679r280Q569K645M580L214j0949K867k555m939J3111J7125r693J79m896
6809B5657k7925q816K0462J5954K428j561j790j1061q12K576J2394o328j1047
6796A0131l585J2707J607J223j1659j3927l385m289Q998j926j0549Q001M853Q091
6782F291K0120j786j1393j0443m242J2104R531m398o70m685K06m506l172m115
6768a158j30O341L440l349j304l66L047M653j034j6387J1514l018n534K119K902
$$ plain form
6753 1736 -680 2750 14455 17537 21573 28955 30281 24235 18630 5396 -4652 -8415 -8287 -9431
6739 -9431 -3433 11122 930 -14618 -12498 -6007 -2489 -9148 11243 12655 12854 13669 8437 1854
6725 1854 -922 -8600 -1922 3805 221 3994 -3453 1907 20466 29062 12162 7835 -5385 -15855
6711 -15855 -2783 16099 8799 14473 8304 8541 17484 4252 4439 20560 17524 12470 8702 -1901
6697 -1901 6339 20511 17516 10248 32124 48418 47567 28433 11975 13851 33736 22985 9870
6684 9870 18893 15466 -4128 -10971 -15265 -11929 -11441 -4066 16701 23775 26121 24736 17769 5795
6670 5795 -3712 -798 6557 -5114 -18754 -11039 -10584 -10768 -9401 5987 16524 16008 18115 7459
6656 7459 1398 2399 -9125 -3124 -7042 7594 11335 1581 -766 -4191 -3842 10655 20329 21589
$$ packed form
6753A736k416L430J1705L082M036P382J326o046n605j3234j0048l763J28j144
6739i431N998J4555j0192j5548K120O491L518o659K0391J412J99Q15n232o583
6725A854k776p678O678N727l584L773p447N360J8559Q596j6900m327j3220j0470
6711a5855J3072J8882p300N674o169K37Q943j3232J87J6121l036n054l768j0603
6697a901Q240J4172k995p268K1876J6294q51j9134j6458J876J9885j0751j3115
6684I870R023l427j9594o843m294L336M88P375K0767P074K346j385o967j1974
6670E795r507K914P355j1671j3640P715M55j84J367J5388J0537n16K107j0656
6656G459o061J001j1524O001l918J4636L741r754k347l425L49J4497R674J260
$$ plain form
6642 21589 7999 12884 4602 385 4007 9497 6674 -3461 -10327 3596 1747 -3679 -7968 -5019
6628 -5019 14979 15710 35 76 5885 10720 13797 8858 13267 24414 30570 19650 1532 -7012
6614 -7012 4681 15932 18036 13260 2427 1521 -4422 4254 14769 4667 16027 19979 10327 11110
6600 11110 689 -3745 -5235 -9656 -8912 1542 -2315 3407 2209 -1808 -2846 -345 -2774 -14132
6586 -14132 -26368 -21031 -5681 -1864 -21948 -18116 -10944 -7877 -2914 238 -1284 17788 21103 19358
6572 19358 24777 25739 21556 37677 44125 29889 20528 32156 40482 40392 37959 38938 27951 18556 22294
6557 22294 29395 29571 32698 28582 29998 20955 7680 9009 8086 12475 2882 -8409 -4896 18911
6543 18911 22075 10862 17805 30376 24092 26555 15439 -9190 -25182 -9629 -4249 5811 -5143
$$ packed form
6642B1589j3590M885q282m217L622N490k823j0135o866J3923j849n426m289K949
6628e019J9998P31j5675M1N809M835L077m939M409J1147O156j0920j8118q544
6614g012J1693J1251K104m776j0833r06n943Q676J0515j0102J1360L952r652P83
6600A1110j0421m434j490m421P44J0454l857N722j198m017j038K501k429j1358
6586a4132j2236N337J5350L817k0084L832P172L067M963L152j522J9072L315j745
6572A9358N419R62m183J6121O448j4236r361J1628Q326r0k433R79j0987r395L738
6557B2294P101J76L127m116J416r043j3275J329r23M389r593j1291L513K3807
6543A8911L164j1213O943J2571o284K463j1116k4629j5992J5553N380J0060j0954
$$ plain form
6530 -5143 -9936 -17068 -24561 -14361 -2678 9378 8204 15013 6502 -21798 -33920 -4732 5959
6517 5959 1467 15026 18915 8516 -7427 -8762 -11408 -15465 -18084 -20824 -15187 -6822 -15649 -9270
6503 -9270 -18632 -14099 -2880 5987 -1658 -5301 7689 -4684 -12644 -10754 -11549 -20025 -2021 14394
6489 14394 8599 7669 1997 -8180 -24307 -14526 -13834 -11281 -1958 12621 14352 13500 20304 30977
6475 30977 27771 9140 16744 18437 19636 13096 7153 -1194 -696 -11539 -11472 14219 20107 -5843
6461 -5843 -21961 -26180 -7155 2100 -6631 7141 16175 14339 4039 6117 11802 15452 19365 24107
6447 24107 20584 7076 9463 10117 4962 5514 -7063 475 4895 -10200 -25334 -9792 -1659 3406
6433 3406 4517 -270 -5825 -10027 -7813 -9404 -14037 -16560 -20393 1285 1988 -7304 -10106 1046 645
$$ packed form
6530e143m793p132p493J0200J1683J2056j174O809q511k8300j2122K9188J0691
6517E959m492J3559L889j0399j5943j335k646m057k619k740N637Q365q827O379
6503i270r362M533J1219Q867p645l643J2990j2373p960J890p95q476J8004J6415
6489A4394n795r30n672j0177j6127R781O92K553R323J4579J731q52O804J0673
6475C0977l206j8631P604J693J199o540n943q347M98j0843O7K5691N888k5950
6461e843j6118m219J9025R255q731J3772R034j836j0300K078N685L650L913M742
6447B4107l523j3508K387O54n155N52j2577P538M420j5095j5134J5542Q133N065
6433C406J111m787n555m202K214j591m633k523l833K1678P03r292k802J1152m01
$$ plain form
6418 645 -6539 -14288 -23722 -18204 -4609 -3273 -1736 8432 10828 8193 2994 2125 -2782 -1864 3705
6403 3705 13888 15604 5749 -161 -3594 -1040 -3416 -1901 -2492 -3790 -4009 4683 -1866 -6654 -7559
6388 -7559 3640 14156 8618 6820 3546 -88 10271 -11796 -16391 406 5318 4376 588 -5742
6374 -5742 -9914 -2945 3928 261 -16018 -27033 -28504 -13730 -2397 -7721 -12159 -4023 -7826 -14605
6360 -14605 -4241 4413 -6114 -14850 -12137 -15979 -21572 -4614 2978 5695 -8618 -21071 -17203
6347 -17203 -6539 -11990 -21572 -32940 -16165 3146 8707 11876 3592 -10877 -11381 -8088 -12797 -12249
6333 -12249 -5807 -3974 -10037 -7396 -13192 -11406 -14231 -23107 -11965 -5040 1129 3574 20734 24687
6319 24687 13422 5134 -15096 -31825 -18470 -9188 -15222 -11223 3005 6064 -498 1650 11858
$$ packed form
6418F45p184p749r434N518J3595J336J537J0168K396k635n199q69m907R18N569
6403C705J0183J716r855n910l433K554k376J515n91j298k19Q692o549m788r05
6388g559J1199J0516n538j798l274l634J0359k2067m595J6797M912r42l788o330
6374e742m172O969O873l667j6279j1015j471J4774J1333n324m438Q136l803o779
6360a4605J0364Q654j0527q736K713l842n593J6958P592K717j4313j2453L868
6347a7203J0664n451r582j1368J6775J9311N561L169q284j4469n04L293m709N48
6333a2249O442J833o063K641n796J786k825q876J1142O925O169K445J7160L953
6319B4687j1265q288k0230j6729J3355R282o034L999J4228L059o562K148J0208
$$ plain form
6306 11858 342 -7986 1646 7193 1265 4148 1435 -237 -2890 -5916 -15500 -14812 -10420 -1284 6505
6291 6505 13137 24886 15276 -8395 -27791 -26098 -6658 3595 14073 10811 8426 17493 19510
6278 19510 23602 19993 16757 16978 2431 -11695 -9935 -6267 -5395 4476 14549 21177 2338 -5307
6264 -5307 -5965 -16565 -13247 -12804 -12113 -12023 -18214 -23705 -30225 -12908 7373 23292 13179 1861 -8243
6249 -8243 -13888 2797 2618 3583 -3680 -8012 -4882 -10929 -8321 -12878 -19124 -14387 5205 26477 25293
6234 25293 11357 11321 17556 16852 28860 36106 39497 49958 48569 36417 16626 6010 7368 10425
6220 10425 3866 -19477 -22666 -11834 -16027 -2356 7632 2752 -1254 -27063 -30551 -27172 -14009
6207 -14009 -11173 -21816 -28439 -28211 -10719 -7363 -3291 -110 -3334 -7408 -17074 -33907 -37715 -40921
$$ packed form
6306A1858j1516q328R632N547n928K883k713j672k653l026r584O88M392R136P789
6291F505O632J1749r610k3671j9396J693J9440J0253J0478l262k385R067K017
6278A9510M092l609l236K21j4547j4126J760L668Q72R871J0073O628j8839p645
6264e307o58j0600L318M43O91R0o191n491o520J7317K0281J5919j0113j1318j0104
6249h243n645J6685j79R65p263m332L130o047K608m557o246M737J9592K1272j184
6234B5293j3936l6O235p04J2008P246L391J0461j389j2152j9791j0616J358L057
6220A0425o559k3343l189J0832m193J3671R988m880m006k5809l488L379J3163
6207a4009K836j0643o623K28J7492L356M072L181l224m074r666j6833l808l206
$$ plain form
6193 -40921 -36039 -26543 -18640 -5943 -11892 -14407 6151 -4997 -12714 -13548 -19763 -9399 -9452 -20606
6179 -20606 -35371 -30575 -25567 -21972 -13417 -24967 -18899 797 9921 -2607 -1550 -4850 -19485
6166 -19485 -21620 -22770 -18129 -11058 -13332 -33069 -36044 -37246 -22625 -26206 -30453 -23099 -26461 -30468
6152 -30468 -23861 -23005 -19659 -8107 -5557 7013 15987 11535 9031 2046 -21069 -21091 -24660 -27793 -37969
6137 -37969 -28138 -18378 -20608 -18972 -5426 1692 -2878 -1453 -7497 -12816 -6039 -11740 -17056 -7801
6123 -7801 -8253 -13971 -10055 -4972 5197 9321 9913 2694 -3987 -13251 -21300 -11367 -5835 -3369 10064
6108 10064 8324 6951 -2099 17566 23816 35452 27612 -1147 -21663 -27949 -16677 -10561 -15040
6095 -15040 2768 11040 14514 11166 1283 -4503 -7024 3067 -1010 -6456 -3266 3078 5049 -14230
$$ packed form
6193d0921M882R496P903J2697n949k515K0558j1148p717q34o215J0364n3j1154
6179b0606j4765M796N008L595Q555j1550O068J9696R124j2528J057l300j4635
6166a9485k135j150M641P071k274j9737k975j202J4621l581m247P354l362m007
6152c0468O607Q56L346J1552K550J2570Q974m452k504o985k3115k2l569l133j0176
6137c7969R831R760k230J636J3546P118m570J425o044n319O777n701n316R255
6123g801m52n718L916N083J0169M124N92p219o681r264q049R933N532K466J3433
6108A0064j740j373r050J9665O250J1636p840k8759k0516o286J1272O116m479
6095a5040J7808Q272L474l348r883n786k521J0091m077n446L190O344J971j9279
$$ plain form
6081 -14230 -24709 -22364 -11759 -6124 -8084 1501 5857 -6050 4454 11373 -7624 -10810 -3800
6068 -3800 -3224 2016 -7305 -22002 -12855 -6147 -8840 -14509 -15262 -6228 -10897 -13415 -7142 -15011 -25276
6053 -25276 -12600 -15681 -28392 -20592 -8074 -401 2904 -5571 -23976 -24974 -17567 -15557 -18041 -21332
6039 -21332 -10554 -6144 -9857 -2067 2736 -3487 -15875 -18249 -15225 -15224 -150 16073 9401 -6519
6025 -6519 -4458 -6713 1036 7638 11817 7921 9146 15194 24256 15280 9338 15618 10048 3103 -1878
6010 -1878 -18110 -16017 -5506 -676 7532 6979 1573 -5269 -8050 -21915 -35520 -32375 -25476 -20357
5996 -20357 -17389 -14191 -16333 -21874 -14748 -13884 -28821 -24135 -14344 -16572 -21842 -22665 -12649 -3355 9547
5981 9547 1068 56 7663 6585 5310 12934 33663 33909 12364 -3015 -13848 -17728 -24065 -32884
$$ packed form
6081a4230j0479K345J0605N635j960R585M356j1907J0504O919j8997l186P010
6068c800N76N240r321j4697R147O708k693n669p53R034m669k518O273p869j0265
6053b5276J2676l081j2711P800J2518P673L305q475j8405r98P407K010k484l291
6039b1332J0778M410l713P790M803o223j2388k374L024JJ5074J6223o672j5920
6025f519K061k255P749O602M179l896J225O048R062q976n942O280n570o945m981
6010a878j6232K093J0511M830Q208n53n406o842k781j3865j3605L145O899N119
5996b0357K968L198k142n541P126Q64j4937M686R791k228n270q23J0016R294J2902
5981I547q479j012P607j078j275P624K0729K46k1545j5379j0833l880o337q819
$$ plain form
5967 -32884 -28201 -17049 -12606 -12803 -12855 -23029 -22379 -23823 -18657 -20010 -29002 -23231 -8379 -4542 -5573
5952 -5573 -2242 -12579 -22822 -19379 -16012 -4009 626 -14353 -14454 -7781 195 -5253 -1212 -6041
5938 -6041 10291 4468 6960 2333 -5347 4378 23516 18687 11560 8307 -6998 -14208 -14131 -14338 -8339
5923 -8339 -10605 -16171 -14159 -29294 -25813 -26350 -15082 -2880 7507 -2745 -5899 -15629 -29596 -30253
5909 -30253 -27357 -17120 -11832 -4597 -6782 -5417 -14110 -15910 -11058 6704 5188 7611 4417 4301
5895 4301 7227 1984 -5184 -4763 -7287 -3444 -2330 6535 3568 -3106 -13811 -12565 -11466 -16108 -12854
5880 -12854 -8138 -11314 3714 -7093 -31855 -33045 -28766 -17093 -12749 -106 -5493 1112 6984
5867 6984 6235 10137 9657 6006 -5887 4818 3138 5553 930 686 -3397 5771 14182 8239 -7382
$$ packed form
5967c2884M683J1152M443j97n2j0174O50j444N166j353q992N771J4852L837j031
5952e573L331j0337j0243L443L367J2003M635j4979j01O673P976n448M041m829
5938f041J6332n823K492m627p680R725J9138m829p127l253j5305p210P7k07N999
5923h339k266n566K012j5135L481n37J1268J2202J0387j0252l154r730j3967o57
5909c0253K896J0237N288P235k185J365q693j800M852J7762j516K423l194j16
5895D301K926n243p168M21k524L843J114Q865k967o674j0705J246J099m642L254
5880a2854M716l176J5028j0807k4762j190M279J1673M344J2643n387O605N872
5867F984p49L902m80l651j1893J0705j680K415m623k44m083R168Q411n943j5621
$$ plain form
5852 -7382 -6893 -10568 -17533 -21834 -11424 -15784 -1371 -1687 -11287 -24011 -9127 612 4776 -4351
5838 -4351 -13852 -17811 -14415 -15129 -14378 -16012 -10028 -9606 -7518 8557 7457 16241 6709 -5666 -10932
5823 -10932 -15313 -2745 10662 4578 2771 4279 2709 620 258 -607 -4107 -3203 5623 1970 -10969
5808 -10969 -18963 -17690 -14191 5629 14696 11763 8614 3122 3863 -1704 9929 16823 10809 18377
5794 18377 -7563 -20021 -11132 -21576 -28382 -32085 -25708 -14960 -19069 -18684 -16580 -24727 -29171 -27100
5780 -27100 -14619 -7454 -15711 -21872 -26510 -30166 -22713 -14655 -4535 -5911 -7935 -13346 -11581 -8073
5766 -8073 -11329 -9893 -8694 -2797 -2621 -6845 -8403 -22165 -7566 -4929 -15558 -7481 -6274 234
5752 234 -5872 2427 10600 -987 -15857 -14856 -30542 -32673 -28130 -15381 -2783 4810 7595 12729
$$ packed form
5852g382M89l675o965m301J0410m360J4413l16r600j2724J4884R739M164r127
5838d351r501l959L396p14P51j634N984M22K088J6075j100Q784r532j2375n266
5823a0932m381J2568J3407o084j807J508j570k089l62q65l500R04Q826l653j2939
5808a0969p994J273L499J9820R067k933l149n492P41n567J1633O894o014P568
5794A8377k5940j2458Q889j0444o806l703O377J0748m109L85K104q147m444K071
5780b7100J2481P165q257o161m638l656P453Q058J0120j376k024n411J765L508
5766h073l256J436J199N897J76m224j558j3762J4599K637j0629Q077J207O508
5752B34o106Q299Q173j1587j4870J001j5686k131M543J2749J2598P593K785N134
$$ plain form
5738 12729 4369 -8971 -17781 -22986 -28110 -29544 -21122 -22626 -30727 -29500 -13054 -9182 -29310 -38199
5724 -38199 -33052 -28179 -31534 -27264 -26233 -19942 -17270 -19317 -5772 13624 256 -11626 -6279 -1747
5710 -1747 -15370 -36102 -29762 -16176 -20211 -39407 -43664 -25008 -7470 2999 1359 6363 -143
5697 -143 -10168 -7303 -7195 -16345 -17849 -17428 -21135 -39259 -25834 -19049 -16220 -14655 -16023 -17107 -17001
5682 -17001 -16946 -19657 -28349 -32492 -28227 -28891 -27802 -24229 -24270 -24790 -11057 -1809 -2377 -4902 -19225 -23261
5666 -23261 -15072 -13446 -19505 -23642 -10180 -1870 -18437 -7678 -854 -17051 -30722 -26017 -14895
5653 -14895 -3858 -11715 -16535 -14190 -10847 2739 -3859 -20763 -24483 -21328 -22374 -19003 -12357 -4566
5639 -4566 -591 -4242 -19554 -27790 -28410 -32263 -26277 -25093 -21440 -3719 6814 -10620 -15844 -10030
$$ packed form
5738A2729q360j3340q810n205n124j434Q422j504q101J227J6446L872k0128q889
5724c8199N147M873l355M270J031O291K672k047J3545J9396j3368j1882N347M532
5710a747j3623k0732O340J3586m035j9196m257J8656J7538J0469j640N004o506
5697a43j0025K865J08r150j504M21l707j8124J3425O785K829J565j368j084J06
5682a7001N5k711q692m143M265o64J089L573m1n20J3733R248n68k525j4323m036
5666b3261Q189J626o059m137J3462Q310j6567J0759O824j6197j3671M705J1122
5653a4895J1037p857m820K345L343J3586o598j6904l720L155j046L371O646P791
5639d566L975l651j5312q236o20l853N986J184L653J7721J0533j7434n224N814
$$ plain form
5625 -10030 -9485 -14145 -27234 -26086 -19645 -17625 -21691 -10883 -13215 -23003 -17979 -5652 4063 -1248
5611 -1248 -2811 7935 11317 -8983 -11616 -7948 -26176 -31241 -22365 -17016 -16261 -22938 -26992 -27309 -17180
5596 -17180 -25168 -33036 -16966 -7221 -5080 -15368 -27002 -18324 -11972 -1698 -4167 -18535 -14926
5583 -14926 -2958 8230 6885 5911 5384 5353 -14674 -12016 -3521 -18377 -12998 2235 -5378 -13951
5569 -13951 -355 -9361 -17455 -21732 -25238 -24752 -31530 -31099 -26529 -28268 -32870 -32662 -30251 -3727 34
5554 34 -2483 -1025 7291 16962 15514 8130 -3207 -3509 16206 9449 4080 8598 19315 9330 2303
5539 2303 9177 2385 5707 -3312 -11411 2928 -5879 -12253 -17081 -18118 -12269 -4073 -6042 -12969 -12507
5524 -12507 -7404 -2220 -8469 -19372 -19859 -17705 -30064 -37902 -27615 -25076 -27868 -18264 -17392 -11848
$$ packed form
5625a0030N45m660j3089J148O441K020m066J0808k332r788N024J2327R715n311
5611a248j563J0746L382k0300k633L668j8228n065Q876N349P55o677m054l17J0129
5596a7180p988p868J6070R745K141j0288j1634Q678O352J0274k469j4368L609
5583a4926J1968J1188j345r74n27l1k0027K658Q495j4856N379J5233p613q573
5569a3951J3596r006q094m277l506M86o778M31M570j739m602K08K411K6524L761
5554C4k517J458Q316R671j448p384j1337l02J9715o757n369M518J0717r985p027
5539B303O874o792L322r019q099J4339q807o374m828j037N849Q196j969o927M62
5524a2507N103N184o249j0903m87K154j2359p838J0287K539k792R604Q72N544
$$ plain form
5510 -11848 -18528 -24450 -29263 -37686 -44576 -38825 -25802 -17445 -19770 -15940 -980 5528 930 2781
5496 2781 7810 -2940 -16753 -22824 -18282 -19362 -21009 -21237 -24610 -19515 -4846 -2179 247 -14419
5482 -14419 -18094 -19543 -24673 -21768 -40719 -51166 -55298 -46915 -48362 -55937 -54885 -34375 -34033 -44510
5468 -44510 -39407 -31303 -25126 -30805 -17479 699 5672 -9056 -24420 -33790 -25870 -22130 -31269 -15762
5454 -15762 -14520 -25037 -18529 -12785 -12398 -19976 -19424 -32457 -28139 -27398 -33639 -19571 -11580 -13109 -36135
5439 -36135 -39234 -33599 -14886 -5873 5189 825 -10021 -15587 -22237 -20310 -32696 -38077 -22640
5426 -22640 -12796 -12482 -19705 -34892 -27358 -4522 309 773 8534 -350 -8006 -16615 -22046 -21333 -10669
5411 -10669 -11523 -17739 -8806 -7530 -3477 -412 6253 3470 -3663 1510 5896 6498 -2850 -11817 -11725 -14317
$$ packed form
5510a1848o680n922m813q423o890N751J3023Q357k325L830J4960O508m598J851
5496B781N029j0750j3813o071M542j080j647k28l373N095J4669K667K426j4666
5482a4419l675j449n130K905j8951j0447m132Q383j447p575J052K0510L42j0477
5468d4510N103Q104O177n679J3326J8178M973j4728j5364r370P920L740r139J5507
5454a5762J242j0517O508N744L87p578N52j3033M318P41o241J4068P991j529k3026
5439c6135l099N635J8713R013J1062m364j0846n566o650J927j2386n381J5437
5426b2640R844L14p223j5187P534K2836M831M64P761q884p656q609n431P13J0664
5411a0669q54o216Q933J276M053L065O665k783p133N173M386O02r348q967R2k592
$$ plain form
5395 -14317 -1036 12447 8837 224 -7199 -10555 -8257 -15648 -12630 -891 -5769 -30530 -32104 -17361
5381 -17361 -9857 -22643 -24727 -8974 6306 4890 6404 5035 -3042 2162 -5762 -20997 -23754 -20948
5367 -20948 -18416 -19624 -32446 -34001 -32580 -23760 -21354 -18703 -18605 -25182 -23484 -7580 -13505 -11472 -6088
5352 -6088 -5870 -5018 -11688 -18072 -27044 -29529 -22255 -13408 -15941 -24348 -19859 -12403 -12252 -12142 -3747 5647
5336 5647 1521 5678 12896 22170 17209 9243 8041 -2133 -27766 -29936 -16838 -12549 -8076 -4434
5322 -4434 6156 -5002 -10581 -3704 -1622 -1391 1636 4525 3434 -8081 -9401 -9958 -15507 -23085 -22360
5307 -22360 -21778 -24163 -12107 -7431 -359 8145 -3651 -19456 -21531 -19987 -10309 -8686 -15462 -18934
5293 -18934 -10041 -8043 6290 10581 3487 -9784 -21157 -17775 -20994 -21009 -15207 -13903 -9745 -13205
$$ packed form
5395a4317J3281J3483l610q613p423l356K298p391L018J1739m878k4761j574J4743
5381a7361P504j2786k084J5753J5280j416J514j369q077N204p924j5235k757K806
5367b0948K532j208j2822j555J421Q820K406K651R8o577J698J5904n925K033N384
5352f088K18Q52o670o384q972k485P274Q847k533q407M489P456J51J10Q395R394
5336E647m126M157P218R274m961p966j202j0174k5633k170J3098M289M473L642
5322d434J0590j1158n579O877K082K31L027K889j091j1515j320n57n549p578P25
5307b2360N82k385J2056M676P072Q504j1796j5805k075J544R678J623o776l472
5293a8934Q893J998J4333M291p094j3271j1373L382l219j5N802J304M158l460
$$ plain form
5279 -13205 -12047 -8621 -8707 13903 20139 8998 -2481 1416 1100 -3310 511 -19098 -40239 -36571
5265 -36571 -31121 -22588 -22997 -22816 -19215 -15632 -6051 -5845 -7020 -7067 -1417 -3774 -19853 -24891 -14949 -23771
5249 -23771 -27232 -23341 -15997 -18738 -23696 -30792 -27255 -27781 -22588 -22355 -13128 -18049 -22888 -33856 -43461
5234 -43461 -48351 -45444 -48168 -35354 -27563 -23098 -27625 -41310 -39694 -31481 -34012 -30314 -20487 -25860
5220 -25860 -34774 -30208 -33979 -31430 -8694 -9038 -25875 -12200 -10064 -12065 -10212 6052 3989 -2117
5206 -2117 -10659 -28580 -27641 -11055 -4524 -11587 -5625 -5576 -15478 -16862 -28360 -30749 -16789 -13438 -12868
5191 -12868 -16669 -19155 -9074 -3595 -8930 -9887 -2530 -4068 -25582 -28891 -20680 -13409 -16266 -5924
5177 -5924 -4338 -3323 -12196 -23141 -19258 -19033 -5563 -16300 -25699 -20042 -16618 -10739 -23165 -35987
$$ packed form
5279a3205J158L426q6K2610O236j1141j1479L897l16m410L821j9609k1141L668
5265c6571N450Q533m09J81L601L583R581K06j175m7N650k357j6079n038R942q822
5249b3771l461L891P344k741m958p096L537n26N193K33R227m921m839j0968r605
5234d3461m890K907k724J2814P791M465m527j3685J616Q213k531L698R827n373
5220b5860q914M566l771K549K2736l44j6837J3675K136k001J853J6264k063o106
5206b117q542j7921R39J6586O531p063N962M9r902j384j1498k389J3960L351N70
5191a2868l801k486J0081N479n335r57P357j538k1514l309Q211P271k857J0342
5177e924J586J015q873j0945L883K25J3470j0737r399N657L424N879j2426j2822
$$ plain form
5163 -35987 -22237 -24015 -23129 -7594 -22713 -28987 -14515 -17711 -22498 -15725 -10616 -2231 -7655 -18957
5149 -18957 -14652 -14804 -10374 -3075 -11577 -15606 -15516 2314 18555 14456 -4359 1267 11193 329
5135 329 -20810 -21323 -8058 9160 9229 6048 13636 5675 -11569 -12029 -9422 -2142 -9449 -22794 -35994
5120 -35994 -31711 -22180 -5299 -23110 -27686 -36171 -32345 -22716 -20191 -13590 -23101 -23837 -23580 -27454 -19919
5105 -19919 -21747 -26556 -34227 -34652 -36339 -36217 -33150 -22661 -12810 -18414 -28834 -42901 -45963 -30078
5091 -30078 -26708 -22726 -17356 -7738 -11991 -7407 -6389 -16943 -20363 -9307 449 2517 -16098 -16798
5077 -16798 -8694 -16301 -29948 -28745 -22554 -18560 -27222 -22456 -23803 -29564 -34519 -30246 -23309 -14003
5063 -14003 -1271 -5324 -862 -14402 -19841 -8234 -13705 -18470 -8295 -10341 -7384 -9697 2606
$$ packed form
5163c5987J3750j778Q86J5535j5119o274J4472l196m787O773N109Q385n424j1302
5149a8957M305j52M430P299q502m029R0J7830J6241m099j8815N626R926j0864
5135C29k1139n13J3265J7218O9l181P588p961j7244m60K607P280p307j3345j3200
5120c5994M283R531J6881j7811m576q485L826R629K525O601r511p36K57l874P535
5105a9919j828m809p671m25j687J22L067J0489R851n604j0420j4067l062J5885
5091c0078L370L982N370R618m253M584J018j0554l420J1056R756K068j8615p00
5077a6798Q104p607j3647J203O191L994q662M766j347n761m955M273O937R306
5063a4003J2732m053M462j3540n439J1607n471m765J0175k046K957k313J2303
$$ plain form
5050 2606 13600 -658 -8240 -5474 -6227 -12604 -6525 6062 -365 -16528 -19637 -26947 -14145 -9967
5036 -9967 -10586 -16068 -25125 -21632 -13774 -9412 -17429 -22654 -11676 3224 12032 8084 -2247 -11178
5022 -11178 -4355 -7887 -12630 -10133 -13866 -12503 -21920 -21201 -7302 2671 4391 -17815 -39807 -28050
5008 -28050 -7952 -12487 -14551 -18693 -5713 -421 -4005 -5944 -8781 -14156 -16272 -9291 -6126 -8271
4994 -8271 3076 -32 -6358 -95 -736 -12251 -14966 -19292 -24527 -30465 -13299 -13719 -11197 -17488 -27527
4979 -27527 -22195 -11101 -17744 -30228 -19685 -14766 -24524 -27249 -24515 -31800 -25136 -19107 -5351 -12308
4965 -12308 -24384 -16106 -16763 -23487 -21180 -27799 -17936 -9766 -13423 -17030 -15683 -14782 -23344 -17589 -12191
4950 -12191 -10242 -6958 -8088 -11804 -9083 -2561 11118 23898 -69 -6972 -12745 -26196 -45900
$$ packed form
5050B606J0994j4258p582K766p53o377O079J2587o427j6163l109p310J2802M178
5036i967o19n482r057L493P858M362q017n225J0978J4900Q808l948j0331q931
5022a1178O823l532m743K497l733J363r417P19J3899R973J720k2206k1992J1757
5008b8050K0098m535k064m142J2980N292l584j939k837n375k116O981L165k145
4994h271J1347l108o326O263o41j1515k715m326n235n938J7166m20K522o291j0039
4979b7527N332J1094o643j2484J0543M919r758k725K734p285O664O029J3756o957
4965a2308j2076Q278o57o724K307o619R863Q170l657l607J347R01q562N755N398
4950a2191J949L284j130l716K721O522J3679J2780k3967o903n773j3451j9704
$$ plain form
4937 -45900 -38352 -37306 -35805 -33478 -37355 -41382 -24602 -17976 -24793 -26512 -19998 -16267 -20185 -28843
4923 -28843 -27245 -21108 -19366 -21036 -19869 -17924 3541 10415 -2820 1579 -2672 -6835 -17183 -10024
4909 -10024 -13320 -9516 3043 -5936 -3379 1704 -1776 -26142 -43690 -29872 -14987 -19694 -31981
4896 -31981 -41206 -46172 -27953 -7542 -12631 -23284 -19693 -34554 -39852 -26917 -23699 -15925 -18194
4883 -18194 -14300 -11579 -12470 -6982 -10604 -7701 -9862 -13294 -19857 -22618 -8764 -3027 -11702 -7494 -800
4868 -800 11247 21424 1780 -28960 -38759 -27948 -27739 -27231 -31129 -26874 -17230 -8387 859 -14012
4854 -14012 -32607 -28133 -27581 -32521 -26411 -20954 -12705 -9642 -12437 -20505 -9695 6371 8209 6458
4840 6458 13817 6168 165 -2649 -1502 9611 -279 -15845 -22718 -17432 -16883 -23537 -32730 -35120 -45521
$$ packed form
4937d5900P548J046J501K327l877m027J6780O626o817j719O514L731l918q658
4923b8843J598O137J742j670J167J945K1465O874j3235M399m251m163j0348P159
4909a0024l296L804J2559q979K557N083l480k4366j7548J3818J4885m707j2287
4896c1981r225m966J8219K0411n089j0653L591j4861n298J2935L218P774k269
4883a8194L894K721q91N488l622K903k161l432o563k761J3854N737q675M208O694
4868h00J2047J0177j9644l0740r799J0811K09N08l898M255R644Q843R246j4871
4854a4012j8595M474N52m940O110N457Q249L063k795q068J0810J6066J838j751
4840F458P359p649o003k814J147J1113r890j5566o873N286N49o654r193k390j0401
$$ plain form
4825 -45521 -35147 -23431 -18913 -22546 -26642 -26514 -35758 -36351 -22386 -5764 6328 12277 -7860 1981
4811 1981 6187 -8278 -27383 -22758 -14958 -15486 -9340 7129 8746 -16501 -31049 -33363 -39811 -26619
4797 -26619 -23530 -1797 6435 -3036 -3622 -15474 -17383 -10722 -11632 -14445 -20424 -24716 -30865 -27830 -27799
4782 -27799 -21485 -18699 -31837 -35228 -21757 -17221 -13111 -12901 -16096 -20809 -22084 -17567 -21712 -35102
4768 -35102 -23505 -15941 -16196 -4468 -5028 -8329 -14357 -26193 -21183 -16440 -24718 -31168 -22902 -21338
4754 -21338 -24794 -22104 -31930 -32175 -29610 -28603 -20051 -15713 -13612 -29536 -35241 -36099 -33010 -32184 -34906
4739 -34906 -32942 -15155 -5689 713 -21170 -39916 -32927 -15628 -22492 -25145 -16347 -17863 -20319 -41864
4725 -41864 -48214 -43929 -33197 -21253 -26184 -31311 -44592 -28658 -16370 -8092 -7548 -1664 -5687 -14813
$$ packed form
4825d5521J0374J1716M518l633m096J28r244n93J3965J6622J2092N949k0137R841
4811A981M206j4465j9105M625P800n28O146J6469J617k5247j4548k314o448J3192
4797b6619L089K1733Q232r471n86j1852j909O661r10k813n979m292o149L035L1
4782b7799O314K786j3138l391J3471M536M110K10l195m713j275M517m145j3390
4768c5102J1597P564k55J1728n60l301o028j1836N010M743q278o450Q266J564
4754b1338l456K690r826k45K565J007Q552M338K101j5924n705q58L089Q26k722
4739c4906J964J7787R466O402k1883j8746O989J7299o864k653Q798j516k456k1545
4725d1864o350M285J0732J1944m931n127j3281J5934J2288Q278N44N884m023r126
$$ plain form
4711 -14813 -20733 -20760 -21056 -10036 -3259 -4870 -20289 -26432 -31468 -31771 -26920 -15865 -7080 -14096 -27593
4696 -27593 -33512 -29682 -24533 -28407 -23750 -14863 -13485 -5143 1336 -9787 -20751 -26479 -23921 -7369
4682 -7369 -6910 -7484 -8890 -16158 -15633 -17216 -20919 -26029 -29858 -11249 -8064 -7469 -7707 -6862 -6445 -11524
4666 -11524 -15412 4233 15938 -7196 -25651 -36287 -47797 -43916 -33615 -39302 -47408 -50061 -27792
4653 -27792 -13291 -6414 8921 1704 -7785 -15289 -24440 -20428 -25541 -19756 -16023 -16903 -20211 -13570
4639 -13570 -14559 -22598 -13914 -22512 -27656 -26383 -23297 -19547 -19451 -7628 -1076 -18218 -19025 -28940 -24722
4624 -24722 -27264 -46137 -35058 -25546 -15246 -2415 -9324 -14936 -24490 -38736 -32756 -17855 -10713
4611 -10713 -11783 -21849 -8393 3817 10660 12704 -2060 -13487 -19986 -23362 -30752 -27022 -10420
$$ packed form
4711a4813n920k7k96J1020O777j611j5419o143n036l03M851J1055Q785p016j3497
4696b7593n919L830N149l874M657Q887J378Q342O479j1123j0964n728K558J6552
4682g369M59n74j406p268N25j583l703n110l829J8609L185N95k38Q45M17n079
4666a1524l888J9645J1705k3134j8455j0636j1510L881J0301n687q106k653K2269
4653b7792J4501O877J5335p217r489p504r151M012n113N785L733q80l308O641
4639a3570r89q039Q684q598n144J273L086L750R6J1823O552j7142q07r915M218
4624b4722k542j8873J1079R512J0300J2831o909n612r554j4246N980J4901P142
4611a0713j070j0066J3456J2210O843K044j4764j1427o499l376p390L730J6602
$$ plain form
4598 -10420 -7098 -8766 -9791 -12535 -24410 -25650 -17105 -6042 6970 1873 -9121 -15915 -19578 -11140
4584 -11140 3423 7573 -2757 -13679 -9440 -5323 -3655 -11373 -21574 -37048 -34312 -39935 -40505 -35331
4570 -35331 -31534 -19942 -11576 -6448 -8598 -11233 -28443 -25293 -7947 3605 -2728 -8333 -6506 -11583
4556 -11583 -14411 -10532 -20053 -23188 -33088 -35851 -36841 -27955 -22756 -19006 -14740 -13181 -4970 6735 -831
4541 -831 -2911 -1603 -3661 -7081 -10941 -16212 -11062 -6240 -6628 -11288 -20733 -23233 -5481 -318 748
4526 748 -5592 -10664 -17940 -24202 -23741 -27458 -21787 -28916 -45143 -41002 -37749 -25952 -9736 630
4512 630 -2625 -7792 -25127 -19289 -20354 -25112 -20099 -23234 -18873 -12518 -8094 -4117 3127 1646 -14912
4497 -14912 -19570 -16557 -9964 -5505 -18906 -16331 -4727 -3496 -18678 -27476 -30544 -24542 -27973 -27229
$$ packed form
4598a0420L322j668j025k744j1875j240Q545J1063J3012n097j0994o794l663Q438
4584a1140J4563M150j0330j0922M239M117J668p718j0201j5474K736n623n70N174
4570c5331L797J1592Q366N128k150k635j7210L150J7346J1552o333n605J827n077
4556a1583k828L879r521l135r900k763r90Q886N199L750M266J559Q211J1705p566
4541h31k080J308k058l420l860n271N150M822l88m660r445k500J7752N163J066
4526G48o340n072p276o262M61l717N671p129j6227M141L253J1797J6216J0366
4512F30l255n167j7335N838j065m758N013l135M361O355M424L977P244j481j6558
4497a4912m658L013O593M459j3401K575J1604J231j5182q798l068O002l431P44
$$ plain form
4483 -27229 -13076 -5726 -10136 -11480 -16637 -17821 -16424 -20409 -30351 -46795 -59583 -57170 -51744 -44566
4469 -44566 -33904 -15261 -15465 -2106 -290 -6551 -4833 5664 1784 -16450 -22952 -12326 -17258
4456 -17258 -20889 -17994 -22214 -24926 -15941 -22834 -23556 -14198 -5240 446 12826 10555 1931 4409 12230
4441 12230 1056 -14813 -27620 -19088 -24751 -32134 -16452 -5794 -10330 2608 -1882 -8500 -7148
4428 -7148 -765 -639 -13081 -15770 -3088 -12523 -17075 -13281 -22512 -27365 -20274 -7382 4493 3301
4414 3301 12249 11491 -13354 -23396 -26818 -6832 2402 6769 2410 -5795 -6076 -13803 -25155 -27119
4400 -27119 -25823 -20677 -19337 -15748 -21423 -31555 -40186 -37686 -39775 -26789 -19446 -17917 -25670 -31265
4386 -31265 -29543 -17722 -16638 -11089 -3911 -4102 -14005 -16751 -21277 -18833 -16216 -14343 -17326 -10055 -15097
$$ packed form
4483b7229J4153P350m410j344n157j184J397l985r942j6444j2788K413N426P178
4469d4566J0662J8643k04J3359J816o261J718J0497l880j8234o502J0626m932
4456a7258l631K895m220k712Q985o893p22R358Q958N686J2380k271q624K478P821
4441A2230j1174j5869j2807Q532n663p383J5682J0658m536J2938m490o618J352
4428g148O383J26j2442k689J2682r435m552L794r231m853P091J2892J1875j192
4414C301Q948p58k4845j0042l422J9986R234M367m359q205k81p727j1352j964
4400b7119J296N146J340L589n675j0132q631K500k089J2986P343J529p753n595
4386c1265J722J1821J084N549P178j91r903k746m526K444K617J873k983P271n042
$$ plain form
4371 -15097 -25614 -25094 -15278 -8976 -9466 -1717 -6777 -3744 4330 13150 13048 -8374 4150 15872
4357 15872 13407 7445 -1475 -35 6946 10863 2746 -3115 -8106 -254 -523 -7476 -17021 -32883 -30768
4342 -30768 -27812 -12415 -13895 -17926 -15324 -17932 -22877 -24615 -21074 -16364 -23976 -32119 -19310 -22421
4328 -22421 -25738 -23652 -45799 -50262 -28045 -23719 -30686 -44656 -38986 -38370 -50734 -51066 -38754 -27718
4314 -27718 -17979 -10790 -12519 -22466 -21589 -24901 -21415 -18694 -27220 -36343 -34338 -31383 -21682 -16754 -9129
4299 -9129 -2653 -5341 -14920 -39051 -40455 -25808 -17726 -8587 -14735 -15195 -24338 -28956 -23636 -24070 -24165
4284 -24165 -18144 -5745 -11911 -10153 -13048 -5766 -19814 -34388 -27555 -19782 -17535 -12854 -6121 -14914
4270 -14914 -20203 -8354 -12916 -19176 -17843 -29757 -28403 -10295 -7861 -9944 -21332 -21007 -11926 -12520
$$ packed form
4371a5097j0517N20R816O302m90P749n060L033Q074Q820j02k1422J2524J1722
4357A5872k465n962q920J440O981L917q117n861m991P852k69o953r545j5862K115
4342c0768K956J5397j480m031K602k608m945j738L541M710p612q143J2809l111
4328b2421l317K086k2147m463K2217M326o967j3970N670O16j2364l32J2312J1036
4314b7718R739P189j729r947Q77l312L486K721q526r123K005K955R701M928P625
4299i129O476k688r579k4131j404J4647Q082R139o148m60r143m618N320m34r5
4284b4165O021J2399o166J758k895P282j4048j4574O833P773K247M681O733q793
4270a4914n289J1849m562o260J333j1914J354J8108K434k083j1388L25R081n94
$$ plain form
4256 -12520 -17494 -24021 -24254 -11443 -10483 -13021 -9805 -15325 -18351 -14808 -12659 -23210 -17384 -16286 -6880
4241 -6880 -8274 -13399 -2396 1961 -6482 -19542 -34538 -40435 -28436 -21502 -17567 -3570 17775
4228 17775 13782 15483 14366 12060 1580 917 -11619 -27219 -35828 -16690 -5321 2112 -5526 -5193
4214 -5193 -7094 -12345 -22961 -29023 -28020 -22446 -19980 -18104 -26619 -22341 -24870 -26493 -22497 -15311 -7221
4199 -7221 -3660 -16895 -26555 -32653 -23365 -8999 -3451 -9982 -9148 -11192 -16491 -15996 -13985 -13285 -11413
4184 -11413 -16087 -15284 -22089 -22126 -17628 -7325 -7170 -26881 -38005 -36412 -33943 -25099 -19854 -26323 -26358
4169 -26358 -21061 -12056 -9480 -4172 -3705 -15659 -30878 -25181 -14509 -15054 -20561 -22593 -27952 -27290 -18910
4154 -18910 -12483 -8603 -3460 -5974 -85 4070 9535 4873 1719 -9372 -33714 -35245 -15079 -9710
$$ packed form
4256a2520m974o527k33J2811R60k538L216n520l026L543K149j0551N826J098R406
4241f880j394n125J1003M357q443j3060j4996n897J1999O934L935J3997K1345
4228A7775l993J701j117k306j0480o63j2536j5600q609J9138J1369P433p638L33
4214e193j901n251j0616o062J003N574K466J876q515M278k529j623L996P186Q090
4199g221L561j3235r660o098R288J4366N548o531Q34k044n299M95K011P00J872
4184a1413m674Q03o805l7M498J0303J55j9711j1124J593K469Q844N245o469l5
4169b6358N297R005K576N308M67j1954j5219N697J0672n45n507k032n359O62Q380
4154a8910O427L880N143k514N889M155N465m662l154j1091k4342j531K0166N369
$$ plain form
4140 -9710 -19547 -27299 -27004 -29988 -41438 -51338 -51134 -53459 -58077 -41753 -28630 -28766 -35873 -29090 -16007
4125 -16007 -7976 -1181 -4140 -12143 -6823 -4078 -3253 -15090 -20241 -10895 -22970 -28211 -25334 -22256
4111 -22256 -24841 -33324 -35123 -33339 -36023 -27299 -13243 -15378 -17687 -15774 -6500 -13922 -13683 -12500 -20619
4096 -20619 -23246 -27068 -27638 -31552 -35441 -42742 -50600 -35296 -31851 -23763 -23370 -24119 -23556 -17655 -17843 -18344
4080 -18344 -7662 -19456 -32352 -41457 -37113 -32269 -37020 -39649 -24825 -16324 -5192 -13882 -21606
4067 -21606 -25978 -34946 -32723 -25897 -20881 -16131 -6325 -3945 -3818 8346 5118 -9649 -26756 -38734
4053 -38734 -35906 -33442 -26687 -19738 -18826 -7950 -10936 -13813 -12207 -7187 -5083 -14977 -12128 -15914 -21518
4038 -21518 -16957 -11402 -12731 -9272 -22677 -34273 -23665 -23445 -17235 595 5466 -9550 -20190
$$ packed form
4140i710r837p752K95k984j1450r900K04k325m618J6324J3123j36p107O783J3083
4125a6007Q031O795k959q003N320K745Q25j1837n151R346j2075n241K877L078
4111b2256k585q483j799J784k684Q724J4056k135k309J913R274p422K39J183q119
4096b0619k627l822n70l914l889p301p858J5304L445Q088L93p49N63N901j88n01
4080a8344J0682j1794j2896r105M344M844m751k629J4824Q501J1132q690p724
4067b1606m372q968K223O826N016M750R806K380J27J2164l228j4767j7107j1978
4053c8734K828K464O755O949R12J0876k986k877J606N020K104r894K849l786n604
4038b1518M561N555j329L459j3405j1596J0608K20O210J7830M871j5016j0640
$$ plain form
4025 -20190 -28897 -25807 -13405 -11079 -11334 -25021 -38474 -34823 -24826 -21753 -21731 -15088 -18296 -27886 -27148
4010 -27148 -18136 -3556 -4214 -10910 -11053 11033 18333 15738 -6781 -11989 -9023 -12180 -16802 -24474
3996 -24474 -32013 -32410 -28485 -11024 2750 2412 -18982 -25030 -29291 -30664 -20890 -23067 -36022 -34782
3982 -34782 -19823 2103 -2703 9094 6234 -15694 -21370 -16638 -5705 -8412 -9906 -18786 -24297
3969 -24297 -30718 -27924 -20082 -28063 -21533 -2214 9148 2553 -5926 -2524 -2398 -8561 -14363 -16366
3955 -16366 -2461 4862 1355 4115 7772 1726 5891 15982 12057 -2258 -6293 3055 2509 3627
3941 3627 -10782 -9629 -14987 -26601 -25537 -22778 -25961 -20489 -5664 -4053 -4155 -3113 -4292 -19979
3927 -19979 -29347 -25157 -19388 -16090 -13218 -9040 -7522 -6655 -7977 -4005 4260 15082 18798 4911
$$ packed form
4025b0190q707L090J2402K326k55j3687j3453L651R997L073K2O643l208r590P38
4010b7148R012J4580o58o696j43K2086P300k595k2519n208K966l157m622p672
3996b4474p539l97L925J7461J3774l38k1394o048m261j373R774k177j2955J240
3982c4782J4959K1926m806J1797k860k1928n676M732J0933k707j494q880n511
3969b4297o421K794P842p981O530J9319J1362o595q479L402J26o163n802k003
3955a6366J3905P323l507K760L657o046M165J0091l925j4315m035R348n46J118
3941C627j4409J153n358j1614J064K759l183N472J4825J611j02J042j179j5687
3927a9979r368M190N769L298K872M178J518Q67j322L972Q265J0822L716j3887
$$ plain form
3913 4911 5228 1433 -13555 -23717 -19196 946 5488 16238 19115 -7126 -17941 4870 27311
3900 27311 18754 7048 -12276 -4936 -3311 -1975 -8698 -27508 -40287 -29688 -31083 -21390 -9225
3887 -9225 -8755 7071 16185 955 -4490 -4232 -19630 -21682 -25737 -26683 -10701 -12756 -24573 -29855
3873 -29855 -31625 -29976 -34399 -30959 -23376 -29046 -15012 220 7416 9112 -7758 -51303 -77547
3860 -77547 -69588 -39293 -19514 -10924 -8909 -10112 -11647 -8469 -264 -11757 -26919 -19729 -20583 -18403
3846 -18403 -21216 -18841 -26246 -31495 -21656 -20407 -18175 -30436 -39985 -30943 -12848 -11350 -16288 -22286
3832 -22286 -20730 -21650 -22673 -25882 -30727 -38549 -39255 -25086 -17607 -12404 -5270 -9510 -23740 -16534 -16789
3817 -16789 -7130 2046 1032 -3167 -8539 -8456 -4201 -4399 -14208 -15447 -29942 -24195 -19263 -33451 -36080
$$ packed form
3913D911L17l795j4988j0162M521K0142M542J0750K877k6241j0815K2811K2441
3900B7311q557j1706j9324P340J625J336o723j8810j2779J0599j395R693J2165
3887i225M70J5826R114j5230n445K58j5398k052m055r46J5982k055j1817n282
3873b9855j770J649m423L440P583n670J4034J5232P196J696j6870m3545k6244
3860g7547P959L0295J9779Q590K015j203j535L178Q205j1493j5162P190q54K180
3846a8403k813K375p405n249R839J249K232j2261r549R042J8095J498m938n998
3832b2286J556r20j023l209m845p822p06J4169P479N203P134m240j4230P206k55
3817a6789R659R176j014m199n372Q3M255j98r809j239j4495N747M932j4188k629
$$ plain form
3802 -36080 -25910 -4486 9849 4028 -371 -17658 -25187 -23738 -10141 -6812 -14504 -14716 -4519
3789 -4519 5362 3827 -4977 -7087 -2407 -604 -237 -1380 -11955 -7848 -9005 -7162 -1723 -9184 -17256
3774 -17256 -29958 -33063 -28791 -19749 -37005 -59413 -70584 -69217 -68652 -64253 -54733 -37419 -29079 -27357
3760 -27357 -30081 -40759 -46077 -49253 -53325 -55290 -53185 -45542 -14847 -2563 -10591 -26751 -24920 -8867
3746 -8867 3392 4453 4705 748 2548 -3087 8618 9630 2948 6440 -131 -4599 -9637 -20161
3732 -20161 -14828 3003 2027 -6331 -6914 -9098 3570 3058 -7625 -17419 -20032 -24054 -22638 -18745 -14191
3717 -14191 -4321 13824 18217 8412 8987 15602 5222 -5457 4066 -430 2216 6438 12151 2911
3703 2911 -685 5331 545 631 -7271 -12217 -4351 -1226 -7238 -21347 -24376 -13704 -7697 -3359 -14114
$$ packed form
3802c6080J0170K1424J4335n821m399j7287p529J449J3597L329p692k12J0197
3789d519R881j535q804k110M680J803L67j143j0575M107j157J843N439p461q072
3774a7256j2702l105M272R042j7256k2408j1171J367N65M399R520J7314Q340J722
3760b7357k724j0678n318l176m072j965K105P643L0695J2284q028j6160J831J6053
3746h867J2259J061K52l957J800n635J1705J012o682L492o571m468n038j0524
3732b0161N333J7831r76q358n83k184J2668n12j0683r794k613m022J416L893M554
3717a4191R870J8145M393r805N75O615j0380j0679R523m496K646M222N713r240
3703B911l596O016m786Q6p902m946P866L125o012j4109l029J0672O007M338j0755
$$ plain form
3688 -14114 -24544 -22689 -18739 -23154 -31846 -30577 -23944 -30568 -28648 -20122 -17690 -8049 4038 -671
3674 -671 -4939 -16974 -23842 -16484 -12090 -8998 -3150 7790 13550 15015 1736 -8691 -18237 -2276
3660 -2276 12773 7361 -3509 -3930 -11351 -11182 -2267 -443 -11680 -14600 -15730 -15202 -15807 -17618 -20003
3645 -20003 -22210 -23551 -28914 -31513 -10298 2527 2070 -5448 -2672 6603 15321 10405 -10111 -10885
3631 -10885 -13991 -14418 -6228 127 -9868 -10501 -835 8438 14662 18522 23083 20015 16885 30518 24656
3616 24656 11816 6064 3868 2130 -1557 -2631 -16076 -20209 -10564 -9122 -6451 -7139 3441 -5383
3602 -5383 30 4793 17240 4874 -14358 -21450 -17595 -33836 -26343 -12184 983 -2829 -9792
3589 -9792 -11762 -15229 -5104 -3034 -13649 -26637 -39764 -52647 -44912 -33993 -15014 -17800 -25425
$$ packed form
3688a4114j0430J855L950m415q692J269O633o624J920Q526K432R641J2087m709
3674f71m268j2035o868P358M394L092N848J0940N760J465j3279j0427r546J5961
3660b276J5049n412j0870m21p421J69Q915J824j1237k920j130N28o05j811k385
3645b0003k207j341n363k599K1215J2825m57p518K776R275Q718m916k0516p74
3631a0885l106m27Q190O355r995o33R666R273O224L860M561l068l130J3633n862
3616B4656j2840n752k196j738l687j074j3445m133R645J442K671o88J0580q824
3602e383N413M763J2447j2366j9232p092L855j6241P493J4159J3167l812o963
3589i792j970l467J0125K070j0615j2988j3127j2883P735J0919J8979k786p625
$$ [...]
##END NTUPLES=NMR SPECTRUM
##END=
