##TITLE=Analysis number 320826
Compound Code cc 44846
Book Reference 438/152/2
Project Code adrs
Chemist Name antons
##JCAMPDX= 6.0         $$ Bruker NMR JCAMP-DX V2.0
##DATA TYPE= NMR SPECTRUM
##DATA CLASS= NTUPLES
##ORIGIN= Bruker BioSpin GmbH
##OWNER= nmr
$$ XWIN-NMR		Version 3.5
$$ Wed Jul 12 11:54:33 2006 GMT Daylight Time (UT+1h)  MAYBRIDGE\nmr@NMR_250MHZ
##.OBSERVE FREQUENCY= 250.131544655141
##.OBSERVE NUCLEUS= ^1H
##.ACQUISITION MODE= SIMULTANEOUS (DQD)
##.ACQUISITION SCHEME= undefined
##.AVERAGES= 16
##.DIGITISER RES= 18
##SPECTROMETER/DATA SYSTEM= dpx250
##.PULSE SEQUENCE= zg30
##.SOLVENT NAME= CDCl3
##.SHIFT REFERENCE= (INTERNAL, CDCl3, 0, 16.522)
##AUDIT TRAIL= $$ (NUMBER, WHEN, WHO, WHERE, WHAT)
$$ ##TITLE= Audit trail, XWIN-NMR		Version 3.5
$$ ##JCAMPDX= 5.01
$$ ##ORIGIN= Bruker BioSpin GmbH
$$ ##OWNER= nmr
$$ C:\u/data/dgb/nmr/ADRS/2610/pdata/1/auditp.txt
$$ ##AUDIT TRAIL=  $$ (NUMBER, WHEN, WHO, WHERE, WHAT)
(   1,<2006-07-12 11:54:12.13 +100>,<MAYBRIDGE\nmr>,<NMR_250MHZ>,
      <created by zg, POWCHK disabled, PULCHK disabled
       configuration hash MD5:
       E2 DF 36 D8 04 B2 41 60 5A D7 A3 38 5A 4B D0 FE
       data hash MD5: 64K
       D7 AD AE F4 2C BA AD 21 EE 15 32 88 C1 6D D1 B1>)
(   2,<2006-07-12 11:54:25.07 +100>,<MAYBRIDGE\nmr>,<NMR_250MHZ>,
      <Start of raw data processing
       ef LB = 0.3 FT_mod = 6 PKNL = 1 SI = 32K 
       data hash MD5: 32K
       00 F5 B4 31 87 CA 88 7E 5A 3E 6D 13 8E 9C DB 00>)
(   3,<2006-07-12 11:54:26.82 +100>,<MAYBRIDGE\nmr>,<NMR_250MHZ>,
      <apk 
       data hash MD5: 32K
       9B 81 4B 04 CA 5A EC 48 A7 CB 73 99 C0 B6 02 48>)
(   4,<2006-07-12 11:54:27.61 +100>,<MAYBRIDGE\nmr>,<NMR_250MHZ>,
      <abs ABSG = 5 
       data hash MD5: 32K
       6A D9 12 8D 38 43 14 3F BB 40 36 BB FC E9 6A 9E>)
$$ ##END=
$$ 
$$ hash MD5
$$ 15 2A C3 AB 7C 14 BB C5 C6 64 2B A7 A6 CB 72 5B
##$RELAX= 
##$RELAX= 
##$RELAX= 
##$RELAX= 
##$RELAX= 
##$RELAX= 
##$RELAX= 
$$ Bruker specific parameters
$$ --------------------------
##$DU= <C:\u>
##$EXPNO= 2610
##$NAME= <ADRS>
##$PROCNO= 1
##$TYPE= <nmr>
##$USER= <dgb>
##$AMP= (0..31)
100 100 100 100 100 100 100 100 100 100 100 100 100 100 100 100 100 100 
100 100 100 100 100 100 100 100 100 100 100 100 100 100 
##$AQSEQ= 0
##$AQ_mod= 3
##$AUNM= <au_zg>
##$AUTOPOS= <18 >
##$BF1= 250.13
##$BF2= 250.13
##$BF3= 250.13
##$BF4= 250.13
##$BF5= 500.13
##$BF6= 500.13
##$BF7= 500.13
##$BF8= 500.13
##$BYTORDA= 1
##$CFDGTYP= 0
##$CFRGTYP= 5
##$CHEMSTR= <none>
##$CNST= (0..31)
1 1 145 1 1 1 1 1 1 1 1 1 1 1 1 1 1 1 1 1 1 1 1 1 1 1 1 1 1 1 1 1 
##$CPDPRG= <>
##$CPDPRG1= <>
##$CPDPRG2= <>
##$CPDPRG3= <>
##$CPDPRG4= <mlev>
##$CPDPRG5= <mlev>
##$CPDPRG6= <mlev>
##$CPDPRG7= <mlev>
##$CPDPRG8= <mlev>
##$CPDPRGB= <>
##$CPDPRGT= <>
##$D= (0..31)
0 1 0 0 0 0 0 0 0 0.06 0 0 0 0 0 0 0.0002 0 0 0 0 0 0 0 0 0 0 0 0 0 0 
0 
##$DATE= 1152701651
##$DBL= (0..7)
120 120 120 120 120 120 120 120 
##$DBP= (0..7)
150 150 150 150 150 150 150 150 
##$DBP07= 0
##$DBPNAM0= <>
##$DBPNAM1= <>
$$ [...]
##$SUBNAM7= <"">
##$SUBNAM8= <"">
##$SUBNAM9= <"">
##$SW= 20.6930455092707
##$SWIBOX= (0..15)
0 0 3 0 0 0 0 0 0 0 0 0 0 0 0 0 
##$SW_h= 5175.983436853
##$TD= 65536
##$TD0= 1
##$TE= 296.16
##$TE2= 300
##$TE3= 300
##$TEG= 300
##$TL= (0..7)
0 120 120 120 120 120 120 120 
##$TP= (0..7)
150 150 150 150 150 150 150 150 
##$TP07= 0
##$TPNAME0= <>
##$TPNAME1= <>
##$TPNAME2= <>
##$TPNAME3= <>
##$TPNAME4= <>
##$TPNAME5= <>
##$TPNAME6= <>
##$TPNAME7= <>
##$TPOAL= (0..7)
0.5 0.5 0.5 0.5 0.5 0.5 0.5 0.5 
##$TPOFFS= (0..7)
0 0 0 0 0 0 0 0 
##$TUNHIN= 0
##$TUNHOUT= 0
##$TUNXOUT= 0
##$USERA1= <user>
##$USERA2= <user>
##$USERA3= <user>
##$USERA4= <user>
##$USERA5= <user>
##$V9= 5
##$VALIST= <valist>
##$VCLIST= <CCCCCCCCCCCCCCC>
##$VD= 0
##$VDLIST= <DDDDDDDDDDDDDDD>
##$VPLIST= <PPPPPPPPPPPPPPP>
##$VTLIST= <TTTTTTTTTTTTTTT>
##$WBST= 1024
##$WBSW= 4
##$XGAIN= (0..3)
0 0 0 0 
##$XL= 0
##$YL= 0
##$YMAX_a= 502526
##$YMIN_a= -776227
##$ZGOPTNS= <>
##$ZL1= 120
##$ZL2= 120
##$ZL3= 120
##$ZL4= 120
##$ABSF1= 16.522
##$ABSF2= -4.171173
##$ABSG= 5
##$ABSL= 3
##$ALPHA= 0
##$AQORDER= 0
##$ASSFAC= 0
##$ASSFACI= 0
##$ASSFACX= 0
##$ASSWID= 0
##$AUNMP= <proc_1d>
##$AZFE= 0.1
##$AZFW= 0.1
##$BCFW= 0
##$BC_mod= 0
##$BYTORDP= 0
##$COROFFS= 0
##$CY= 12.5
##$DATMOD= 1
##$DC= 0
##$DFILT= <>
##$DTYPP= 0
##$F1P= 14.0000005364418
##$F2P= -0.99999901652339
##$FCOR= 0.5
##$FTSIZE= 32768
##$FT_mod= 6
##$GAMMA= 0
##$GB= 0
##$INTBC= 1
##$INTSCL= 1
##$ISEN= 128
##$LB= 0.3
##$LEV0= 0
##$LPBIN= 0
##$MAXI= 10000
##$MC2= 0
##$MEAN= 0
##$ME_mod= 0
##$MI= 0
##$NCOEF= 0
##$NC_proc= -3
##$NLEV= 6
##$NOISF1= 0
##$NOISF2= 0
##$NSP= 0
##$NTH_PI= 0
##$NZP= 0
##$OFFSET= 16.522
##$PC= 1
##$PHC0= 164.4311
##$PHC1= 4.601192
##$PH_mod= 1
##$PKNL= yes
##$PPARMOD= 0
##$PSCAL= 4
##$PSIGN= 0
##$REVERSE= no
##$SF= 250.13
##$SI= 32768
##$SIGF1= 0
##$SIGF2= 0
##$SINO= 400
##$SIOLD= 32768
##$SREGLST= <1H.CDCl3>
##$SSB= 0
##$STSI= 32768
##$STSR= 0
##$SW_p= 5175.98343685301
##$SYMM= 0
##$S_DEV= 0
##$TDeff= 65536
##$TDoff= 0
##$TI= <Analysis number 999999
Compound Code 99
Book Reference 9
Project Code 9>
##$TILT= no
##$TM1= 0
##$TM2= 0
##$TOPLEV= 0
##$USERP1= <user>
##$USERP2= <user>
##$USERP3= <user>
##$USERP4= <user>
##$USERP5= <user>
##$WDW= 1
##$XDIM= 32768
##$YMAX_p= 302869660
##$YMIN_p= -54296
$$ End of Bruker specific parameters
$$ ---------------------------------
##NTUPLES= NMR SPECTRUM
##VAR_NAME=  FREQUENCY,     SPECTRUM/REAL,   SPECTRUM/IMAG
##SYMBOL=    X,             R,               I
##VAR_TYPE=  INDEPENDENT,   DEPENDENT,       DEPENDENT
##VAR_FORM=  AFFN,          ASDF,            ASDF
##VAR_DIM=   32768,         32768,           32768
##UNITS=     HZ,            ARBITRARY UNITS, ARBITRARY UNITS
##FACTOR=    0.157963299565203, 1,           1
##FIRST=     4132.6476996994, 0,             0
##LAST=      -1043.33573715361, 0,           0
##MIN=       -1043.33573715361, -54296,      0
##MAX=       4132.6476996994, 302869660,     0
$$ Real data points
##PAGE= N=1
##DATA TABLE= (X++(R..R)), XYDATA
$$ [...]
20844 1386 7159 11707 -7933 -28660 -29964 -13006 -5918 -3827 -244 2438 -10990 -14373 -24118 -21092
20830 -21092 -14746 -16405 -14132 -14630 5254 5193 -4205 -21648 -21428 -11367 -2922 5280 4894 -13608 -15068
20815 -15068 -3878 -9045 -4837 7243 4222 4257 12609 21724 13925 1409 -836 1167 -6838 -14771
20801 -14771 -21602 -18046 -12683 -8964 -10153 -5661 -3423 -4513 -9191 -20419 -8251 16710 26253 7811
20787 7811 -6423 -12071 8479 30217 21693 18632 3524 -1465 -4100 -7107 -18833 -18752 -16706 -6831
20773 -6831 2474 -6894 -16650 -16178 -14799 -16452 -10028 -26789 -32977 -22516 -3228 9869 -2746 -8791
20759 -8791 -5357 -9577 -12701 -20154 -7394 7346 20159 16715 -6139 -21116 -15803 -8552 -6401
20746 -6401 -10680 -6592 -9699 -333 19535 24992 23599 29003 11289 5265 -2575 -10651 -7805 -7032
20732 -7032 1953 2857 1735 2323 3980 -8249 -11502 -5413 9480 11975 3296 -6073 -9180 -12218 -10103
20717 -10103 -22674 -25269 -26260 -25204 -21605 -16069 -13572 -8999 -12556 -7803 -9708 -13396 -24930 -22468
20703 -22468 -11205 2428 -5829 -19699 -28681 -23855 -26813 -14146 66 5623 7660 7914 9892
20690 9892 19983 14370 9737 21926 4349 -13284 -15961 -16515 -22824 -17984 -26021 -34010 -33441 -20476
20676 -20476 -213 9262 20972 15025 3970 -11502 -11803 29 8896 6533 6986 -4147 -12740
20663 -12740 -10560 -17245 -15497 -12991 -9418 1708 1425 2652 -1236 6369 4312 10615 -8883 -20657
20649 -20657 -13491 2040 -6782 -13681 -41 512 -16312 -28461 -22844 -28066 -19516 -10079 2696
20636 2696 296 -12773 -17743 -21372 -20489 -16076 -11688 -8922 -16366 -12740 -2178 5425 -428 -15853
20622 -15853 -9828 -10789 -12816 -10946 -17701 -25190 -14673 -11651 -14831 -9077 7088 19374 18926 8400
20608 8400 1411 -2036 -6984 7082 3840 5078 -9830 -10543 -16802 -20444 -9973 -1069 -5319 -25816
20594 -25816 -32269 -28441 -23738 -19415 -6121 10675 15661 -297 -5695 2580 3395 -11799 -7080 -4860
20580 -4860 -10106 -5745 -4425 -5925 -13894 -18348 -16615 3745 -1973 -4911 -11351 -7651 3893 -5619
20566 -5619 -4997 2196 6472 12310 8954 18588 17361 12263 2935 -891 1836 6892 131 -2343 15391
20551 15391 17530 1805 1240 8131 2305 -3008 7350 3330 -5360 -13485 -2991 -5765 -18011 -27630
20537 -27630 -13064 -9968 -10223 -19288 -18779 -2820 7097 10197 1482 -2040 7197 7811 15045 14969 -158
20522 -158 -13499 -11001 8314 1333 2595 8121 -4643 -12627 -13394 -12452 -14130 -19638 -20475 -24591 -19924
20507 -19924 -19372 -21667 -16153 -1215 6884 5476 7249 -3790 -1203 6777 2704 -12083 -13272 172
20493 172 9888 -8915 -15930 -12717 -3962 -4151 -6468 -9538 -6104 -2523 -3144 -10408 -7321 -21175 -36136
20478 -36136 -33489 -14914 -22103 -9089 -2098 2461 12708 10705 -288 -8672 595 5237 -4228
20465 -4228 -9141 -16629 -15546 -13973 -10429 -16536 -12364 -2117 -7002 -2375 -8699 -10291 -6412 -18643
20451 -18643 -15368 1794 -1232 862 14631 9587 -1258 1528 -3215 -24781 -32916 -31392 -13736
20438 -13736 -9976 -3378 -7229 -12888 -3342 -8074 -19171 -9866 -290 218 -1247 -14188 -33576 -52456
20424 -52456 -31578 -18724 -21173 -21400 -17899 -5781 4900 10578 -2339 -11544 -2800 2506 -12300
20411 -12300 -15261 -123 8411 1589 7400 17361 18585 10145 -1605 -3225 7315 8032 5464 7294
20397 7294 -10049 -11979 -10124 -17111 -13391 -22622 -28032 -29342 -12393 411 -6073 666 16438 8661
20383 8661 6318 2133 -931 -3679 -23664 -45291 -37628 -15240 2717 -10560 4001 5956 -1114
20370 -1114 411 6900 13070 15935 8728 -6350 -10575 -14542 -11312 -17528 -20748 -5995 -4479 -5508
20356 -5508 787 4859 5889 -2137 -12756 -15371 -13063 -8519 -8027 -5514 185 8125 2961 -10475
20342 -10475 -15991 -11164 -7429 5186 13636 19156 27884 31052 18517 13817 11638 18548 9378 6245
20328 6245 5224 2518 -8260 -18143 -21893 -22913 -14646 -12381 -5632 -4690 -14863 -15468 2177 8542
20314 8542 9664 11524 6337 -2898 4356 -3932 -10344 -8103 -5804 4985 21296 19632 20971 23995
20300 23995 16329 11383 12729 19422 17068 -1093 -9614 -8905 -10333 -10698 -10381 1954 1305 -4061 1583
20285 1583 -9331 19 5351 4666 3429 -13349 -29183 -17526 -20229 -22623 -10372 -2939 -3015 -13290
20271 -13290 -15320 -4250 4502 169 7947 5522 6223 18748 7951 -3058 -11011 -7973 16175
20258 16175 26035 27805 26373 10668 -11096 -6143 -4397 -4026 -19413 -18883 -8315 -11624 10473 27997
20244 27997 15234 -5365 -12987 -20297 -21373 -20873 -16906 -15536 -6075 -12950 -18982 -12424 -9109 -13564
20230 -13564 -9546 -7695 -11353 -10269 4571 4890 -11623 -23780 -20970 -15528 -22726 -24868 -20704 -13387
20216 -13387 -17312 -16891 -12947 -9648 -973 877 -1871 3939 -6983 -17843 -14674 -2979 -7819 -4587
20202 -4587 -10049 -1111 9862 7925 5603 4913 -4816 -4651 1308 7804 15509 14377 16928 15896 1656
20187 1656 -298 -3419 -2631 -4241 -735 -4154 -3021 -1981 -952 2199 -1347 -714 3856 -777 7182
20172 7182 12604 -922 -16541 -23608 -21453 -22329 -9328 3693 6385 10065 14017 -658 -19560
20159 -19560 -20705 -12112 -10716 -15302 67 4984 -523 -626 -3111 3633 14527 15451 11094 3214
20145 3214 10714 1026 3169 9915 6832 -6886 -24978 -28269 -15329 6606 17119 11624 17698
20132 17698 1731 -2259 6650 10642 10940 20063 19541 15691 13467 1500 -7230 -5424 11083 8022
20118 8022 6646 16240 17609 916 -19684 -27516 -27264 -18206 -9233 3470 15142 -3497 -11246 -4635
20104 -4635 7338 11708 -9233 -12150 -16308 -15080 -12846 -10647 -6763 -8990 -9292 -6446 5903 20909
20090 20909 10978 7200 8279 -426 -12503 -24 10904 5816 10029 15845 1298 -30 -1816
20077 -1816 -14826 -7805 -3058 -6719 2005 17986 28098 8707 4404 2909 14996 20861 11612
20064 11612 10074 4561 -3821 -3443 7545 13029 -1549 -18425 -24885 -15776 -9796 -23069 -29157 -18308
20050 -18308 -20000 -6068 -2730 146 7309 7719 11968 13686 1365 -11784 3313 8118 1609 -6361
20036 -6361 -3657 -10683 -12701 -8997 3642 5136 -7886 -10744 -15773 -4700 -4905 -3508 12000 14480
20022 14480 19768 21778 15211 2937 -14552 -22606 -27294 -27574 -29726 -12071 4999 2513 -2874 -3647
20008 -3647 -16127 -13489 8762 13514 -2344 -16440 -7556 -309 -5367 -3550 6589 7436 2607 429
19994 429 -2962 -6960 -13541 -10309 -5999 -6501 -1905 212 1699 9065 492 -4508 -4011 7529 24563
19979 24563 7836 -295 895 -2060 7776 -7399 -13948 -5815 1479 -8734 -21618 -12907 -1408
19966 -1408 -3642 -24004 -30119 -21574 -10423 -9015 -11194 -10405 -11988 -4536 -10406 -10293 -6765 -1059 5314
19951 5314 1276 -4939 -6134 -14248 -20479 -20061 -13228 -2122 2388 4081 9251 13224 15619 10095 -3589
19936 -3589 -4290 9614 425 -9087 -9864 -2540 -6400 -8641 -15151 -16630 -4434 -15446 -20199 -11624
19922 -11624 -6532 -6035 3175 13963 21549 14397 4650 5711 -5935 1540 14704 22559 8136 -1524
19908 -1524 -1158 1684 -1769 628 3322 365 -13302 -26857 -19397 -3142 5899 6337 11169 2708
19894 2708 -9728 -4613 15802 20584 25510 13914 -4993 -6999 -13226 -11932 -23729 -9471 -998
19881 -998 -1088 2638 847 9892 4352 -5754 -16589 -21903 -2153 -6333 -2541 -8307 -7471 -10896 -8863
19866 -8863 -6083 -8278 -3153 2555 -9865 -12637 -30522 -28277 -16741 -9485 -18315 -26107 -21239 -12808
19852 -12808 -2665 -15424 -11346 -11807 -7696 5706 5036 1518 -9922 -6848 -1583 2659 5018 -8061
19838 -8061 -11526 9557 17769 8791 -8776 2489 10019 12456 5923 -13936 -24314 -25636 -22761
19825 -22761 -18628 -12123 -16697 -25702 -37450 -34191 -26569 -28853 -28621 -34329 -13166 -7654 -19980 -22486
19811 -22486 -7683 -282 15213 9386 3180 -9506 -21635 -17926 -12917 -14968 -3652 1318 -5005
19798 -5005 -6487 -4190 6645 6983 972 -551 14613 6727 6124 7776 5360 11365 11315 7627 9993
19783 9993 2142 -11642 -23831 -24300 -8218 8437 14907 15435 -5050 -5199 -10752 -20267 -19360 -12442
19769 -12442 -9682 -7661 -19469 -28069 -28442 -28474 -27287 -24588 -17756 -13979 -22465 -24210 -23015 -24699 -26465
19754 -26465 -20424 -9908 -7443 -12927 -15990 -23770 -18345 -11828 -11724 -9993 -7180 -16868 -24555 -28211
19740 -28211 -19591 -6015 4480 3494 -34 8115 6352 -5747 -11565 -1675 -189 -4330 -12912 -21304
19726 -21304 -24896 -18117 -12364 -9554 -2247 5739 771 -3327 -10610 -11845 -2600 3072 18 -13805
19712 -13805 -4454 11541 4793 1104 2123 -1187 10034 2774 -11514 -4515 -6001 -12693 -6890 13730
19698 13730 9032 7795 5729 6004 9804 12136 3748 -4899 1832 -7183 -21681 -13767 -10560 -8771
19684 -8771 -2425 1780 1380 6768 3253 5334 12380 15446 9491 8674 10220 -189 -8565 -13288 -10892
19669 -10892 -6283 3705 -3059 -1585 -10799 10349 29265 26257 22173 24370 12070 11234 13829 8242
19655 8242 -7660 -5944 -3800 569 6408 -1494 -522 7439 21923 29264 30551 12196 3153 20009
19641 20009 32471 28263 27350 10145 -6949 -9297 -4332 -3235 11488 11140 16723 10217 -3496 -6278
19627 -6278 -7349 -8788 -6451 -7590 -6135 -16366 -18060 -29315 -41595 -22865 -10575 -7592 -18313
19614 -18313 -23051 -14963 -14865 -19052 -13850 -14938 -7306 -14567 -15883 -24088 -27116 -13632 -4930 -12039 -9626
19599 -9626 -13417 -3734 11867 7343 2511 27 -10504 -11533 -13400 -7210 -7127 -10183 -14942 -11866 -9443
19584 -9443 -18759 -675 19024 18631 10431 -6291 -33928 -26588 -20628 -20670 -17706 -5565 -5101 4722
19570 4722 9026 15397 16365 10516 9001 12808 12391 7168 6292 14294 6457 20242 24587 16732 3073
19555 3073 -887 1837 3467 -2465 -7592 -15547 -13403 -28 960 3589 14057 4758 -2484 -640
19541 -640 9874 8719 10816 9308 -1311 -10221 -8677 -9559 -15140 -3027 3979 4514 1531 -9588
19527 -9588 -20743 -22246 -32033 -25079 -4695 -3274 -7503 -14613 -33485 -36730 -21513 -7085 7137
19514 7137 5558 986 -13883 -18970 -25600 -21070 -15332 -5659 -11578 -13662 -7861 -17806 -22718 -6908
19500 -6908 3405 7978 5730 -5616 -15450 -11874 -615 11677 11088 22061 15936 3516 4601
19487 4601 11808 16388 7602 4588 2962 -6108 1324 13453 3162 -5148 -15315 -16053 1546 21809
19473 21809 18610 7753 -2870 -9953 -20766 -14682 -11718 -7752 -8933 -8900 -3992 4579 -11833 -15993
19459 -15993 -3079 -3569 -8251 -11413 -9560 -18237 -4635 11168 7707 4032 6986 -12053 -25969
19446 -25969 -17031 1930 -2273 -3551 3009 -4145 -16275 -15193 -8704 -318 -1614 -992 2622 14919
19432 14919 7023 4522 -1351 -13774 -16169 -26091 -38471 -33210 -16328 -19885 -11997 1564 -12817
19419 -12817 -16578 -7168 -10193 3001 15621 21996 8139 -4272 -14696 -28916 -34162 -26861 -21383
19406 -21383 -20818 -26688 -28923 -26105 -25349 -29373 -20392 -1454 -8616 -19350 -6008 11445 11999 -8262
19392 -8262 -6422 -8925 -7349 -7894 -1241 -9840 -13517 9168 24950 22325 5415 -6054 -4114 12679
19378 12679 23893 13739 6751 6724 -412 5277 469 -13617 -13067 -1229 -12674 -16590 -21668 -25866
19364 -25866 -26265 -29931 -27187 -26416 -32026 -18955 -14800 -7249 3806 1700 792 -10910 -27040 -6597
19350 -6597 8012 13574 9521 -5431 -1094 10239 10744 5736 6665 16710 12533 -1350 -2602 12835
19336 12835 10930 -6280 -14337 -12904 -14086 -34590 -36842 -22431 -12562 -8296 -5964 -8008 -3329 14841
19322 14841 5652 8248 904 -1938 -3398 -6637 -13670 -8366 -17207 -11850 -3771 4226 7565 4621
19308 4621 11569 4753 -3753 -14658 -20903 2029 2814 5025 -6226 -25846 -24843 -20666 -7148 1010
19294 1010 -12068 -6095 -8676 -15335 -29575 -19775 1959 19985 17249 8764 4310 -10418 -14707
19281 -14707 -1756 10427 6165 -1189 4219 9171 11719 8566 900 -4108 15052 30686 27785
19268 27785 7002 6977 3848 3265 -484 6593 10803 15924 1863 -14798 -14200 -15107 -14969 -3307 -8073
19253 -8073 -14907 -13946 -14741 -6049 -7830 -7513 9157 10893 18588 5762 -5970 -1348 -8998 -7626 5815
19238 5815 1289 8747 14469 587 -452 10377 5973 -10077 1522 -7527 -16279 -4611 -11282
19225 -11282 -22185 -17026 -10865 1203 -6963 -8168 -8597 -7142 -2495 -10703 -9673 -284 7262 11895
19211 11895 17125 6792 6102 10594 13395 -220 -1975 -9221 -2009 3643 -1420 1290 3612 10403
19197 10403 7202 1814 -9353 -15495 -19710 -17614 -8957 3236 -805 -2044 -4941 -919 4769 3730
19183 3730 -881 -4089 -634 -1594 -810 6540 -623 -7075 -8994 6052 442 -4053 7666 9335 19936
19168 19936 25573 20487 16599 4663 2888 11571 3445 636 273 933 8906 11828 5652 7110 -1908
19153 -1908 6730 9270 7265 -3529 -8254 -10814 -15932 -10994 -4224 3234 -6078 -17833 -17319 -19447
19139 -19447 -20902 -13168 -2232 -13501 -16247 -14791 -9105 2546 19000 -417 -3940 -2844 -9057
19126 -9057 -11422 -6052 -5082 7583 900 297 -7898 -2431 2221 3428 11346 17023 17606 15385 -2512
19111 -2512 -15271 -8923 6312 10126 6813 13542 12103 13924 7752 -4459 -8409 -2716 -3010 -1933
19097 -1933 6159 22179 17211 776 -4542 167 -1997 2461 13071 10386 4402 -4537 -2738 -4901
19083 -4901 -3135 -3326 1385 4682 1222 -5802 -14930 -20337 -19638 -22346 -13145 -12901 -15751 -12004 -4606
19068 -4606 6085 14532 15168 18737 10069 4461 1655 19985 25912 6142 1336 -13692 -14858 1413
19054 1413 9192 13988 -4037 -12592 -8809 -11257 -12671 -18570 -6165 5664 -3367 -3037 4430 11938
19040 11938 15043 -480 -2723 2489 994 8738 8294 4543 9609 7787 -14052 -33957 -31886 -23952
19026 -23952 -27500 -19524 -6453 -15215 -7567 7458 5137 5311 2845 -3247 -4060 -4065 -5795 -9624 -11656
19011 -11656 -14263 -21323 -13113 -772 -6747 4564 9101 3809 -10842 -12774 -6579 -2531 -15667
18998 -15667 -23490 -16249 -14233 -21986 -23603 -25113 -22843 -8591 -7503 -17973 -18069 -10753 -4147 -7018
18984 -7018 -21396 -8839 -5561 -7338 -847 -4589 -8737 -10720 -15313 -19834 -13466 -7615 3690 6265
18970 6265 -1305 -7650 -9551 -6055 -5323 -5161 -10165 9217 2070 14634 8082 -8351 3337 -2542
18956 -2542 343 16 -4398 -9421 -12209 -16384 -4264 -10249 -5855 10534 13133 16669 20900 7716
18942 7716 3811 5685 6960 7120 -6501 -11581 -23104 -13946 -3430 -7606 -408 -16445 -31065 -22501
18928 -22501 -12038 10668 6458 -8884 -269 -2871 98 -1522 -3147 6567 14834 24936 36935
18915 36935 27702 8124 -12305 -28279 -28452 -26139 -8280 5263 -1770 -7556 -2518 5831 -628
18902 -628 759 -6398 9595 25325 25434 20819 13022 18001 11782 16738 11679 18397 20221 2869
18888 2869 -5293 2151 16404 16233 4793 4920 18806 23186 1073 -5112 -1676 5396 7084 420
18874 420 4840 -6222 -290 5209 -4886 -7302 -11931 -18985 -8275 -13392 -19519 -22330 -16973 -787
18860 -787 -6615 -4515 -5028 -10234 -6598 366 2121 10258 8959 16681 20260 18410 20974 24728 22919
18845 22919 17379 18539 2255 -365 9783 10013 -9681 -18262 -9378 7575 11029 1328 -7829 -4910
18831 -4910 522 14769 6540 -11039 -16126 -815 -2975 -12800 -6144 8692 20509 14607 6662
18818 6662 -9226 -11968 -8470 -4789 -8928 -18800 -21313 -25203 -16693 4943 15991 18219 14689 15168
18804 15168 18233 9431 -1490 -2573 8318 16498 20501 23092 16905 17120 11715 8629 8526 20193
18790 20193 19027 10296 6510 22968 17940 3456 9159 20833 13107 1864 3758 10212 -100
18777 -100 -7470 -8584 -609 13263 14102 2289 8427 16356 31500 57847 73815 81799 74691 63104
18763 63104 54520 28322 17899 26446 24204 33594 42770 27831 20013 18842 10965 2891 4809 2260
18749 2260 6392 5142 -7784 -5664 17788 15122 20137 27116 30034 34484 20808 5348 1108 11174
18735 11174 -1035 4566 199 7040 11987 25185 16186 4129 5963 12135 15821 6515 5068 18534
18721 18534 37170 30708 21747 18341 11793 9228 13014 24867 15405 5414 -6753 82 5474 11037
18707 11037 25380 17662 17481 25775 28492 23802 18241 3483 -5917 -9810 -5974 1079 5819 1337
18693 1337 2810 8626 32025 40481 33393 39924 36383 27164 24865 30031 20362 15402 21316 41469
18679 41469 55798 67208 67484 76201 86262 103369 112199 126566 151837 164301 159684 147306 133083
18666 133083 129403 134559 130585 141147 158881 130351 126519 132706 122225 109542 107089 108548 98565
18653 98565 77649 72635 68814 59993 56644 52470 31286 27432 35249 20428 9486 14738 30835
18640 30835 48093 37874 28744 33803 58926 56906 63535 81802 78467 75598 89630 97627 111134
18627 111134 131919 135832 140961 152189 149199 149322 154568 151741 144855 156179 171879 175879 179392
18614 179392 179034 170973 167369 159234 142487 137081 123500 114382 99102 94079 79736 61798 54953
18601 54953 49110 48254 59047 55748 77174 72733 57945 52565 40651 35488 29233 34414 29524 23010
18587 23010 23701 31485 27458 34422 42855 41960 41202 41013 43814 41806 41366 33829 33690 29651 38465 48814
18571 48814 35898 28748 22962 17647 19901 15051 15122 35548 41415 30705 30567 19454 9912 2843
18557 2843 17549 22206 18499 10268 17062 22200 22788 19119 17537 27822 34622 34338 20540 10596
18543 10596 20943 24951 32022 16907 14715 19567 15678 19156 7223 2495 22585 25304 26279 34799
18529 34799 37584 31676 41417 46099 34521 40928 45349 61818 77374 77200 78803 74085 69136 65144
18515 65144 74059 100290 102932 92649 83035 88691 98169 86466 66927 57066 57377 70950 71290 67741
18501 67741 66212 60768 57916 56395 50850 49754 33653 36135 43935 52893 52852 38486 30302 36957
18487 36957 52488 58986 71941 65960 65165 65629 69949 75161 82652 90118 91851 89807 99785 120596
18473 120596 124932 132794 133644 138483 147980 162217 172519 166350 155604 163087 165974 167715 172636 162329
18459 162329 159401 152482 146419 139177 138557 127442 115983 109926 99727 102948 91606 70591 70202
18446 70202 77062 79525 70567 79769 87004 84669 92502 84663 89142 79255 72601 76646 95461 100890
18432 100890 102483 109617 126023 140980 153043 152846 147715 165889 155510 149224 155120 156755 159143
18419 159143 171200 181187 177826 186597 218316 236389 228955 225005 226187 214317 205325 207662 200589
18406 200589 197170 193856 186959 186875 200363 190189 167200 165376 162766 158832 143868 127327 127218 124130
18392 124130 116909 100673 89867 87667 87105 73639 84384 100215 106711 118587 109211 101266 100815
18379 100815 98263 94152 99869 103461 101464 109389 123269 129521 139829 151640 158043 166307 169913
18366 169913 163866 169675 180874 191135 195889 197786 187568 185449 177690 175201 184422 177337 176564 180409
18352 180409 187403 183570 172588 159145 141019 131485 135930 131084 120429 115769 112841 110220 103836
18339 103836 105660 97519 104997 107449 97405 90998 99135 110451 94128 90661 94678 112722 110608
18326 110608 106344 91519 81328 89311 100000 110310 115986 112951 110687 109180 108068 109846 119800
18313 119800 109066 98781 108771 120117 130682 134454 139630 144543 140738 129943 139407 133610 132378
18300 132378 127900 123511 117426 112206 111600 102251 111355 116625 106804 105275 113913 108303 96867 93199
18286 93199 102490 123156 134634 140559 124434 119044 120963 128619 141707 150323 139915 132342 135519
18273 135519 143980 155358 165122 174291 180224 174502 177528 181489 185352 189717 203774 219587 227726
18260 227726 222899 241226 243443 245767 248218 251165 262554 254671 240353 229889 213997 209340 211488
18247 211488 219662 228450 232098 220781 215501 211559 223929 227885 232882 233090 230711 244421 244673 253739
18233 253739 261204 265391 262638 258674 260815 251721 266016 272146 290103 291542 306292 304464 315662
18220 315662 339534 369632 393899 412883 428092 455794 481548 524429 575212 621111 650604
18209 650604 691482 731559 770067 804579 851063 898555 963315 1044338 1137653 1235283 1337337
18198 1337337 1468162 1628098 1804563 2043260 2380762 2866667 3585051 4602545 5885286
18189 5885286 7466036 9429422 11700185 14035970 16243709 18212846 19797130 20923356
18181 20923356 21562238 21740661 21798707 21831295 21883313 22287822 23061236 23880895 24477838 24758188
18171 24758188 24650397 23966689 22514686 20615574 18427650 15947025 13585511 11599774
18163 11599774 9929929 8519439 7457294 6723582 6213169 5867186 5601986 5405540 5257658
18154 5257658 5155279 5089958 5064561 5071583 5109343 5224121 5403246 5673702 6110767 6800585
18144 6800585 7820332 9180741 10877477 12997116 15474421 18069786 20530869 22744892
18136 22744892 24510969 25743611 26424168 26579362 26567523 26524528 26461467 26790235 27624650
18127 27624650 28592584 29352953 29782738 29795501 29186702 27679273 25542088 23051786 20194196
18118 20194196 17388153 15007836 13079098 11557904 10609744 10445348 11296449 13347863
18110 13347863 15503036 16468673 16841708 16871368 16813178 16395278 13614992 10220033 8160341
18101 8160341 7022820 6315705 5797979 5416603 5122507 4882365 4667312 4454056 4249795
18092 4249795 4074932 3915207 3770207 3634804 3509420 3396325 3278211 3159377 3058401
18083 3058401 2966896 2886063 2773419 2667433 2569653 2467251 2362810 2268179 2194013 2128952
18073 2128952 2066938 2013380 1962607 1911043 1855375 1799566 1764509 1724116 1670290 1616270 1564130
18062 1564130 1537027 1505752 1469778 1448232 1440049 1422260 1400839 1382057 1371169 1377211 1403859 1427555
18050 1427555 1432776 1428772 1415838 1397195 1394216 1394008 1403589 1422390 1432725 1468395 1523505 1574164
18038 1574164 1635202 1736819 1874489 2065398 2335731 2753636 3422313 4357493 5569814
18029 5569814 6991681 8439816 9664759 10604169 11133186 11208335 10933587 10284491 9533372
18020 9533372 9098424 9044009 9393420 10026545 10653238 11090376 11211624 10910041 10257937 9189021
18010 9189021 7873438 6646191 5584386 4758690 4207835 3846775 3605796 3430776 3301223
18001 3301223 3186880 3091889 3026510 2980288 2958658 2956039 2964216 2998631 3069524 3182774 3332097
17990 3332097 3560796 3886975 4331198 5017424 6051625 7465428 9239231 11332053 13521866
17981 13521866 15624620 17645374 19445703 20993035 22310012 23078332 23528977 23980152
17973 23980152 24299975 24607242 24811905 24567403 24241729 23987397 23745236 23593623 23130676
17964 23130676 22292417 21273808 19885949 18288146 16496485 14377481 12310508 10521499
17956 10521499 9035176 7929116 7160350 6601280 6157668 5781784 5492812 5269550 5099781
17947 5099781 4948568 4849190 4766681 4698852 4658907 4628869 4631481 4686092 4812523 5011679 5351107
17936 5351107 5918009 6849817 8229758 10034439 12229360 14609499 16696426 18318437
17928 18318437 19311173 19506045 19101310 18088979 16683304 15645610 15214133 15450739 16284205
17919 16284205 17237560 17963641 18261088 17910666 16961817 15389532 13244900 11108343 9212066
17910 9212066 7672898 6543894 5781370 5246167 4843086 4517001 4244992 4018215 3825854
17901 3825854 3650950 3482045 3350598 3246946 3149082 3055789 2954276 2865845 2785118 2704975
17891 2704975 2617392 2516075 2402644 2298352 2195249 2096856 2021535 1952204 1883976 1823171
17881 1823171 1760186 1697884 1646007 1594578 1527363 1474664 1425039 1363225 1317298 1284397 1251544
17870 1251544 1215366 1169501 1139867 1117114 1100805 1078584 1037398 1009370 993991 968904 948840
17859 948840 939311 924057 919108 891776 865973 841859 811104 782547 769064 759610 747071 737956
17847 737956 717941 719179 705976 674683 656189 645485 631664 610545 592298 593519 592630 592417 569699
17834 569699 543990 527432 523697 520807 492302 479756 462119 443993 442480 441633 430402 416163
17822 416163 420236 416722 390218 352207 343773 352004 350756 349853 336605 318648 315374 309863 294334
17809 294334 291457 304330 298994 306238 315763 291573 279528 269922 258248 260415 259218 259843 268794
17796 268794 273621 280328 273219 266468 270280 284132 284863 285022 295516 286735 293727 288545 290636 273017
17782 273017 256091 254094 266624 275365 281379 298754 315425 326251 327724 295266 262547 269668
17770 269668 286991 280143 267597 262464 259808 271070 261319 231578 218561 214968 199328 189484 185415
17757 185415 192922 188404 190349 193984 200357 203867 212024 211239 221465 230869 227952 237544 246846 263422
17743 263422 268982 281627 296914 304750 296235 290475 289542 281068 278236 294127 311728 320856 329245
17730 329245 330176 328168 325430 319578 327131 334219 339432 339478 341426 335054 331847 338993 336612 314767 310657
17715 310657 303388 295847 296318 281511 289755 293476 308293 322603 320434 308223 308203 300795 305792 307831
17701 307831 303601 306922 314894 336585 344383 354364 368607 364020 362092 376896 410627 430631 449905
17688 449905 458460 462894 464894 480678 495439 522903 548622 553417 573605 602776 645400 690044
17676 690044 738324 806372 860825 909674 964654 1010859 1051065 1097926 1161690 1242923 1342674
17665 1342674 1450707 1559797 1694001 1876016 2085144 2331597 2654912 3071534 3641921
17656 3641921 4470110 5651883 7320774 9592095 12467587 15829476 19440064 23001906
17648 23001906 26259047 29058643 31344026 33218054 34807395 36157965 37275176 38107940
17640 38107940 38482791 38150343 36836288 34383528 30899619 26744643 22395170 18345194
17632 18345194 14966987 12389122 10544580 9263469 8352694 7693400 7173298 6777600 6473293
17623 6473293 6208075 5987520 5794361 5609038 5451729 5317899 5215703 5129709 5048975 4973768
17613 4973768 4928187 4910800 4914840 4938980 5020234 5147704 5353946 5641507 6081974 6785764
17603 6785764 7839313 9354516 11420803 14012441 16955991 19985267 22811412 25264462
17595 25264462 27237170 28742777 29889592 30821633 31733459 32781225 34101216 35739194
17587 35739194 37442009 38771088 39212419 38539465 36961016 34836639 32523354 30188827
17579 30188827 27963328 26166322 24860516 23885514 23074102 22142380 20893376 19118722
17571 19118722 16817171 14440963 12369010 10757327 9609266 8820570 8266945 7844769
17563 7844769 7524409 7231449 6967394 6741882 6532677 6337738 6185662 6055036 5927637
17554 5927637 5834186 5778836 5761878 5769215 5803461 5886286 6029469 6300220 6760077 7504640 8669363
17543 8669363 10458111 13081958 16585918 20676453 24774413 28352143 31081755 32954677
17535 32954677 34013698 34246457 33813493 33120128 32491373 31998122 31445968 30576595 29078428
17526 29078428 26692661 23412410 19619061 16007852 13086858 10982384 9555759 8590328
17518 8590328 7905110 7407012 7024839 6696748 6404851 6147459 5926224 5739794 5551424
17509 5551424 5402979 5274400 5167525 5065842 4979956 4889527 4803439 4733009 4690705 4725264
17499 4725264 4847138 5102186 5589368 6401606 7598840 9159670 10929164 12559087 13850727
17490 13850727 14789300 15369395 15621868 15550242 15240040 14965013 14765886 14582459 14341116
17481 14341116 13873927 13042454 11752653 10039755 8282718 6800469 5702432 4954228
17473 4954228 4431071 4062193 3803029 3597017 3412469 3260781 3109433 2964486 2843327
17464 2843327 2749719 2666629 2586071 2512606 2425103 2341353 2272986 2183146 2095169 1998697 1887700
17453 1887700 1801160 1711208 1638837 1593174 1558511 1510460 1464208 1435256 1391857 1347555 1315074
17442 1315074 1267762 1227013 1173239 1139528 1107504 1060375 1018206 976751 953210 927780 897287
17431 897287 875079 857637 848395 834187 813495 785053 771253 760748 749219 745270 732516 717171
17419 717171 705512 679781 647390 624711 614745 608050 598846 585195 574564 541020 512839 470448
17407 470448 433734 417329 415054 403527 407392 406741 401881 395057 393712 373437 368092 358089 352168
17394 352168 331571 311198 300169 293224 290221 292309 299203 288626 273888 264888 265892 278347 273480
17381 273480 257237 252945 251543 247284 235545 225519 218577 213663 207457 203309 211227 204279 184312
17368 184312 175157 173718 169205 167338 166530 169593 177210 152215 152971 155388 160075 166488 172616 176082
17354 176082 156437 159576 147654 128997 129328 130146 128132 145584 141907 121837 105871 103778 100155
17341 100155 91976 93651 95748 96077 105871 106728 101795 78719 68669 71146 72972 71087 71586 80809
17327 80809 79061 66115 74435 84574 90066 83384 79342 73854 65196 63243 61347 66010 79141 94176
17313 94176 74158 72937 74203 68267 60039 58354 58639 63429 64283 68480 65821 77169 87760 92792
17299 92792 107445 91787 90284 84563 68934 64689 70412 72326 71905 73355 76650 72642 63323 58620
17285 58620 43804 40719 46714 41475 43348 45459 47983 48521 42209 41723 52120 60245 58568 38442
17271 38442 22703 23375 27352 26704 28256 26306 17695 14406 27877 38146 48772 48864 42710 25295
17257 25295 10739 4218 7088 16006 35722 31398 24146 34076 42217 57866 54883 44455 47148
17244 47148 50850 53842 56033 52933 49767 40588 37591 24860 22023 29957 29668 29115 24316 41815
17230 41815 45627 24844 22375 33409 24337 10793 12283 20095 16758 19155 19988 19394 11896 25270
17216 25270 21319 22294 28857 27803 43349 51777 46096 52220 60591 49206 42222 34335 29945 34838
17202 34838 50034 43416 38374 29544 21961 24953 27485 21860 14940 20368 32329 40886 34087 10197
17188 10197 10040 15233 19644 32627 36207 24489 9055 8279 5277 11913 18371 13384 5432 5339 12130
17173 12130 4406 4025 2354 16840 21329 25779 14720 15136 23614 28238 22856 34907 47838 58135
17159 58135 53487 58848 77243 92647 104368 135215 162800 178209 196806 211835 214711 213916 219054
17146 219054 214880 213313 222008 215439 200239 185250 154847 137709 118090 91211 76824 78226
17134 78226 69007 67147 68352 66518 62640 56016 44169 55134 53140 49358 48170 41050 43220 39274
17120 39274 44800 51587 57275 58167 51531 44019 39036 36134 33704 33802 36962 44108 44016 48748 69628
17105 69628 83913 90446 119634 150240 162462 177561 191986 205652 207649 216443 211758 199263
17093 199263 191638 184393 191716 191034 176716 149961 126584 118189 113063 94672 83994 92892 97868
17080 97868 98102 103365 106241 104312 96582 106425 117797 142199 153960 149442 145925 133139 136210 130182
17066 130182 129018 116741 110646 117231 105135 84999 73883 65019 54335 61467 79839 89699 82471
17053 82471 82180 87952 92441 98533 96325 92013 89184 94224 104442 112621 117919 106828 85857 74005
17039 74005 58347 59472 61672 57307 70095 78478 79126 101975 122516 137850 145578 148258 145539
17026 145539 160333 165788 176327 207082 202107 184042 174213 179167 177509 166497 143278 129880
17014 129880 108457 95426 75419 62849 67188 58590 58265 61926 67454 81108 82535 62138 57087
17001 57087 51146 43601 53472 64001 75356 61651 56535 42848 37504 38007 40995 53682 56686
16988 56686 42959 44817 52241 44580 67079 90289 94801 96257 112284 136266 134112 130502 117821
16975 117821 108940 104928 107183 92862 91561 87501 87712 79891 60040 50466 38936 42128 49730 46254
16961 46254 30176 33597 30925 17141 17782 20055 22083 22679 10435 4486 10768 21059 38514 36221
16947 36221 24704 15625 23824 32879 26276 14611 14825 26406 17143 11616 19917 40821 47762 33917
16933 33917 29760 38857 31490 5828 1443 -3169 -16059 -3490 18923 30305 36488 23889 7965
16920 7965 9784 6083 9385 5926 4022 -15099 -26884 -10969 11169 14371 10765 20503 31135
16907 31135 31081 19167 9407 11824 11144 4876 4592 7466 -4818 -13390 7121 1596 -1665 7267 23492
16892 23492 22843 14614 2130 -3840 -2002 -5050 3759 13919 15375 17151 6864 -5166 2280 175
16878 175 9008 -6039 -13284 -4570 -19144 -28039 -11797 -17942 -5133 5075 10412 5554 4850 3242
16864 3242 -117 -3855 546 5726 14781 13673 14088 18118 18543 8022 -2508 -7995 -6395 629 10039
16849 10039 10800 18672 14853 12499 8379 441 1910 3834 6471 3556 -2730 7782 21591 24480
16835 24480 16899 18355 10804 -6000 -4181 -435 -263 7751 27336 54983 67292 54663 55990
16822 55990 64072 59491 78379 93621 97116 90865 82342 78753 75289 52147 32657 29568 22072
16809 22072 14602 16633 26186 26528 21592 18374 23178 23751 15797 11227 13971 9697 5962 10615 8636
16794 8636 -3153 -4129 5584 7694 5123 1625 7225 -556 -10959 1234 12808 7515 -1841 -8941
16780 -8941 17414 32812 28701 34193 39616 41919 38359 48177 68836 66901 58961 54606 59610 67821
16766 67821 65404 68469 68778 62470 47299 27535 39740 31917 12976 7470 6646 9100 864 -659
16752 -659 14916 22967 26302 32108 32037 26194 13995 22542 20290 12034 -2681 -8944 -6073 2725 1559
16737 1559 10656 13962 14871 27238 28649 7065 -3961 -12642 -21985 -11958 -3540 -11893 -15404 -14339
16723 -14339 -24595 -25810 -10565 -688 10011 11883 10708 12378 5040 689 -1562 5948 4025 -25425
16709 -25425 -34773 -28779 -1572 8232 7140 7272 7368 -1609 -13778 -12778 -22795 -17461 -21539 -25614
16695 -25614 -16025 -10079 1883 1292 887 -6107 -23194 -22426 -15574 -17335 -15647 -12463 -8691 -2348 10476
16680 10476 3858 -2865 -231 2278 2134 1763 -175 4299 7712 8205 -7370 -1398 3663 1379 371
16665 371 -5309 -9152 -16505 -19970 -14412 -12921 -20798 -18225 -20334 -11656 -2072 -10471 -14839 -3487 -8231
16650 -8231 -7969 -1232 9906 6851 1557 -13761 -3951 3248 -5233 -4597 18700 7587 -15447 -21934
16636 -21934 -29801 -29699 -18011 -13980 -4145 -7437 -13116 -9672 -16494 -18802 -11480 3260 3055 -10034
16622 -10034 -20207 -15669 -18767 -13183 -3697 -4179 -16497 -12475 631 1992 -10686 -19400 -20921 -29623
16608 -29623 -22517 -2698 2035 -7155 -14032 -15622 -11185 -13200 -17472 -2214 1986 -13661 -3698 3784
16594 3784 5504 2199 15463 17214 5384 -9545 -3567 -455 3737 17270 11513 3565 -532 -21798
16580 -21798 -16340 -6630 -13309 -16262 -5392 8150 -12078 -28534 -14839 -2253 -5718 -6015 -2414
16567 -2414 2383 7621 8681 9697 5635 11734 4614 -4932 -17013 -17127 -1554 1821 -2267 3726
16553 3726 12396 22975 15272 11289 5150 2754 6965 -8263 -8323 -10105 -20991 -12223 -6431 -4217
16539 -4217 -14029 -12343 -13560 -19223 -22494 -24573 -22305 -20825 -16465 -4356 1494 -8067 -19110 -17971
16525 -17971 -3190 2537 -9869 -8964 -14560 -10087 -5954 2013 6858 -5065 -17183 -13392 -11625 -16120
16511 -16120 -13803 -20557 -24945 -16518 -11346 -13181 -8922 -12395 -12279 -13624 -14986 -11138 -9669 -18613 -15011
16496 -15011 -8535 -16579 -13971 943 7769 8870 2545 -310 8102 1790 -2545 3805 2736 1281
16482 1281 -4013 -2666 -4583 -18259 -14804 -2577 -2686 -5601 8727 26903 12627 1554 9400
16469 9400 5362 -14971 -23832 -28229 -21689 -10498 -533 12727 20938 14239 12727 -5143 -15867
16456 -15867 -11727 -18633 -14039 -16542 -27201 -21987 -34462 -49947 -31789 -20330 -36075 -40538 -26926
16443 -26926 -14390 -8491 -14345 -16771 -1376 11218 10492 7656 10103 9246 3278 3701 -7122 -20295
16429 -20295 2303 2588 -13511 -11508 -10357 1512 4685 -5839 -2475 -6995 -14317 -3254 -7480
16416 -7480 -18518 -10923 -11996 -18126 -12228 1199 760 8565 7271 734 -6067 -2353 -15879 -26278
16402 -26278 -29168 -16057 -4349 -10748 -1952 11902 12089 -3197 -23566 -37761 -40146 -34316 -24834
16389 -24834 -18311 -26966 -28131 -9922 4236 -13024 -23202 -23822 -17105 -3741 -10745 -22198 -28759
16376 -28759 -31456 -33724 -24566 -13854 1647 19288 26074 19003 17875 12951 1551 6569 9184
16363 9184 -412 996 705 -5413 -8453 -2783 9182 11704 9116 -7704 -9898 2649 7191 -2277
16349 -2277 -5316 -3971 -14996 -13318 0 -6700 -17983 -16174 -8455 -16281 -24986 -18478 861 12895
16335 12895 15448 22041 15424 11602 8704 11503 3640 -15032 -13314 -7524 -2193 -12498 -18204 -12494
16321 -12494 -11340 2428 -5067 -16181 -17168 -2934 7049 972 2642 -345 -5663 1836 -2231 -6173
16307 -6173 -6703 -11970 2024 12817 1968 -1125 -10998 -14066 -7721 -6018 -5301 -12647 -28654 -43619
16293 -43619 -43770 -37369 -24365 -27921 -19834 2371 3140 -1518 5850 11407 55 -1083 -9771 -22717
16279 -22717 -24773 -35224 -30319 -19322 -12804 -12443 -17121 -11301 -10839 -14080 -13274 3112 17054 13934
16265 13934 -139 -5711 -5458 1330 -3412 -3704 356 -9243 -15067 -22678 -23403 -9048 -10648 -12905 -6965
16250 -6965 -12530 -10013 -4247 1678 9505 11747 9586 1198 1920 -1585 3092 1645 1712 -6932 2088
16235 2088 15044 12600 6412 -102 -11696 -18137 3555 1361 467 10140 2571 -10223 -4340 4322
16221 4322 5861 7894 16056 -1100 -16100 -22167 -19411 -21034 -24323 -26275 -31212 -41554 -30317 -35417
16207 -35417 -21387 -14003 -5690 -14391 -9106 -5395 -18634 -12541 -2325 -3321 -9354 -1625 -17 -4458
16193 -4458 -18145 -13939 -21350 -16466 -6290 2964 4355 9301 13198 15591 14651 6912 -2152 -5823
16179 -5823 -151 -6090 -9985 -5988 3126 15008 24121 8253 -8673 -20060 -18830 -32197 -42878
16166 -42878 -31194 -21419 -24939 -34027 -42669 -29621 -7719 6798 12746 17888 3080 -5884 3531
16153 3531 4518 3905 7338 14834 12396 -5351 -6531 -14516 -11082 -12569 -21335 -29039 -28353 -20669 -16839
16138 -16839 -10983 -14482 920 15268 15423 11145 -904 -536 -4101 -3519 4774 15138 18116 12486
16124 12486 5297 2815 6915 5967 13300 25645 29910 27808 19055 8436 1582 -12408 -17012 -9960
16110 -9960 -3373 4362 -996 8761 9664 7893 -11664 -16615 -16686 -9976 442 13026 2694 2834 5675
16095 5675 5850 8470 2392 21067 14279 17277 23422 21632 7466 5611 12749 10611 -2576 -3172
16081 -3172 3063 17914 20875 19941 15083 1519 8182 28685 26165 3453 -5361 3434 1777 1105
16067 1105 4714 5972 -2687 2912 13667 12583 8122 9356 12545 18922 38936 41216 39186 35604
16053 35604 33355 26195 13988 11566 22263 5957 -6691 -3291 -270 453 562 4251 2285 -15434
16039 -15434 -22799 -9298 -1884 -2913 -10769 5610 13192 10220 8492 6325 11811 -3424 -6671 9761
16025 9761 751 -18184 -29273 -22411 -3629 12518 25019 21844 18360 29458 15540 1715 -8074
16012 -8074 -6126 12904 -2573 -2649 -9119 492 7837 -8425 -8283 1502 6423 8212 871 9874 -590
15997 -590 6533 21281 29127 24937 18509 18642 10755 -1424 -6036 -1009 2665 4809 13143 16816 14637
15982 14637 8977 23172 29567 16282 16558 8362 2945 15258 24834 17552 13678 29080 21877 11749
15968 11749 5101 -8977 -12599 -12154 -3772 1352 -2214 -5052 -10217 -16352 -19213 -11003 -5069 -698
15954 -698 1046 -2708 -11797 -21513 -17429 -9988 -12515 -8085 10059 5693 4698 9998 13901 24749 6649
15939 6649 -12287 -4550 14109 16902 15120 6024 -3572 6597 1736 -5599 -19331 -20285 -17296 -9053
15925 -9053 -6720 8889 3721 -14619 -4552 8179 9961 7070 4279 -3202 4420 7180 13777 9529
15911 9529 2899 -1883 -4131 7833 6281 6208 4569 11030 15207 -1615 -13002 -23190 -25025 -15299
15897 -15299 -9187 -5687 -18448 -14297 -3186 3932 8489 11272 15710 13768 15840 -3769 -2477 -296
15883 -296 -6477 -7243 -14065 -11828 -3791 4238 4573 172 4055 10286 8194 19299 24153 12230 11028
15868 11028 21939 16452 9152 1561 -9138 -11727 -9771 -27305 -31759 -25865 -34862 -37098 -36252 -36606
15854 -36606 -34773 -26164 -17951 -18821 -25462 -23455 -36097 -18688 -10223 -8612 -1770 -1878 -8820 -7684
15840 -7684 -390 -4934 -11698 -6159 7758 1129 -19177 -30583 -38832 -21808 695 6386 -7217
15827 -7217 -23388 -23660 -14205 -5898 7880 4007 1809 2473 -4660 -10168 -14133 -23074 -13852 -15078 -6828
15812 -6828 3099 19469 26715 16162 4817 8798 -6469 -10015 844 6680 1887 2906 507
15799 507 -198 1413 -6062 -4423 -170 -8986 -9064 -12492 -22983 -25362 -31732 -25191 -8852 -5712 -3790
15784 -3790 -2787 -526 10988 -2176 -17974 -31104 -34043 -34935 -26450 -22211 -31636 -18072 -22400 -21441
15770 -21441 -15543 -8674 -5832 -969 11672 6406 -2822 -3295 -9314 -9163 -3995 15744 14417 5016
15756 5016 5936 5823 2245 -16726 -27620 -19786 -12049 -1640 -10556 -14618 -18365 -5677 4313 11522
15742 11522 18726 2201 -718 -11732 -11677 -2944 -7601 -23405 -19403 -22955 -26684 -31777 -20903 522
15728 522 -1623 -15485 -27588 -31913 -33311 -15071 -13166 2747 58 -9535 -12624 -17501 -14972 -4634
15714 -4634 4214 -4296 -15365 -16173 -13221 301 4735 19340 24398 14026 15764 14326 14367 -6831
15700 -6831 -17708 -14469 -8857 -22138 -20233 -14531 -18035 -13802 -8844 -6767 -3227 5847 6101 4216
15686 4216 -2617 -10489 -13193 -5187 15007 15212 -2605 -21494 -15894 577 -3613 1754 10762 -1362
15672 -1362 -10480 -13117 -16125 -18266 -21701 -25019 -20033 -7687 -13214 -14438 -18801 -26683 -25959 -26972 -16369
15657 -16369 -5271 -257 -10547 -15313 -16007 1044 -779 -15396 -22944 -27865 -23872 -13793 -5863
15644 -5863 983 -5118 2946 6313 7336 12074 9661 1290 -2943 -8333 -5913 -4338 -2514 -4426 -6310
15629 -6310 3817 7050 -5145 625 -7063 -15205 -14362 -18306 -1682 6313 11990 12782 7275 332
15615 332 -11781 -20115 -23352 -24248 -14380 -5108 -489 -7416 -6414 -13606 -20050 -21073 -16631 -292 6666
15600 6666 13766 16598 23636 26356 21429 14903 4977 7665 10425 4350 -7065 -6814 -18588 -17408
15586 -17408 -189 19047 27678 18732 9986 14164 8770 5535 3143 15451 27779 16976 500
15573 500 -3564 -8103 -6223 -8094 -22020 -25604 -12282 -9939 -10338 -2228 2142 1135 9665 12474 7883
15558 7883 699 -14513 -15977 -2426 -13076 -11181 -1481 4889 -349 -7210 -11797 -6216 -586 -1803
15544 -1803 6842 2168 -1326 7676 14306 -637 -14923 -8615 8304 11579 6092 690 4157 5621
15530 5621 -5510 -5281 -5838 8264 19776 10943 15880 15739 -92 -8192 -12670 -10779 -10076 -13565 -19868
15515 -19868 -15056 1044 6297 -3629 -19615 -9347 -14741 -26139 -35256 -35416 -29428 -16060 -150
15502 -150 3277 5734 2626 587 -6185 -5950 -596 2097 -2970 -11859 -7115 -2516 8629 21087 7032
15487 7032 -231 -5691 -20254 -17390 -13252 -15900 -10431 -7184 -725 -3035 -3756 -5151 1883 -1913 -4278
15472 -4278 -10452 -18390 -15679 -13072 -2118 -6347 -18759 -16224 -12013 -16966 -17155 -11429 -15787 -11479
15458 -11479 -19174 -27999 -10474 -248 -8450 -10214 -8875 -16264 -12172 -12045 -15492 -935 -4848 -15756
15444 -15756 -24139 -13387 8816 13554 -5432 -6824 -10436 3424 15997 3806 -12197 -10823 -4189
15431 -4189 2701 -616 -11251 -16255 -8010 -2627 -9638 -11010 -19919 -21046 -22281 -24116 -11941 6051
15417 6051 1042 -7353 -9678 -5053 -9538 -23996 -24535 -18952 -24174 -23669 -21781 -14018 -15926 -21338 -11903
15402 -11903 -13892 -10361 -12237 -11522 -5008 12728 18935 6916 -3170 -11123 -22881 -23527 -9498 -1273
15388 -1273 -8226 -15318 -18764 -26582 -26454 -25346 -15836 -6032 -3125 -12288 -218 8411 8679 3793 1236
15373 1236 2510 8550 -4191 -24894 -15143 1472 -3967 -13079 -12345 -17317 -9069 -2819 -19102 -22859
15359 -22859 -7760 -8817 -15979 -15844 -14260 -12144 -15690 -11917 -15063 -16219 3673 963 -12752 -11568
15345 -11568 -11449 -8712 -9396 -11870 -9240 -4332 -11930 -16333 -9382 1578 -2338 -715 5022 -2679 -9997
15330 -9997 88 1170 -8655 -19650 -24600 -23310 -13592 -10773 3288 2974 -1725 -8524 -14284 -13624
15316 -13624 -15811 -19475 -19347 -17677 -18413 -18029 -10342 8032 8850 -3592 240 8530 15797 10852 4317
15301 4317 -1234 -6001 -1299 -4746 200 -6243 7475 19556 21757 17345 4445 -5704 -14485 -18872
15287 -18872 -13364 -1289 16870 18151 2170 -17594 -27220 -21800 -23601 -15538 -12478 -17317 -18216 -12354
15273 -12354 -18767 -18941 -19208 -21603 -13918 -21698 -12917 -4253 7178 6972 12837 11652 -3150 -9203 -5132
15258 -5132 4977 9166 14899 6462 2029 -517 -3014 2782 8815 8245 -2765 -2079 -783 3511 5752
15243 5752 -5775 -4005 -7564 -12721 -5093 8521 9898 2659 8358 11640 23704 6038 -7292
15230 -7292 -961 1667 4314 19146 16636 9838 6808 6839 13419 32007 33641 15555 11388 4807
15216 4807 3350 -3528 -15432 -16711 -18758 -9784 361 6078 7181 3207 7070 8834 -12026 -25767
15202 -25767 -24658 -14910 -21743 -26132 -27756 -16673 -14486 -13066 -20997 -32741 -19647 -11232 -23488
15189 -23488 -28608 -29387 -16083 289 5919 -2388 -16103 -20182 -18917 -5052 -7192 -7479 -6843 -11761
15175 -11761 -19950 -20293 -17603 -12013 -9077 -6568 -11728 -12667 -15359 -18192 -19333 -22237 -15284 -11872 -6365
15160 -6365 7762 1071 -9169 -18357 -6046 -88 6012 -3334 2793 -1394 2755 12918 11586 -4102
15146 -4102 -10588 -9202 -16746 -19222 -15604 -7139 -7314 30 9288 9360 -11905 -26587 -21207 -16980 -7356
15131 -7356 -4384 -2481 -4518 -6873 867 4407 6938 11614 -1523 -5264 -4553 -9457 -14881 -10914 -4045
15116 -4045 -9390 -5419 3425 7732 3472 12394 4732 -13209 -16890 -28090 -23701 -3643 -6494 5935
15102 5935 11402 6341 8691 8855 3602 -13409 -12109 -3604 5859 4765 -1519 -8371 -18751 -23227
15088 -23227 -16241 -16282 -13507 -22867 -25733 -31086 -30545 -23214 -21618 -22400 -21029 -11752 -26037 -23224 -27669
15073 -27669 -12940 -11800 -16322 -21088 -18116 -18593 -4964 14755 10125 -4527 -4193 1381 1838 -10385
15059 -10385 -27622 -39320 -23948 -4711 2584 -1655 -16363 -19226 -19290 -23019 -17825 6045 10151
15046 10151 5127 -3377 169 11659 15497 6013 958 -156 -6665 -8068 23 7320 -7170 -15490
15032 -15490 150 -7032 -9347 2726 1028 -3002 6168 -4616 -9999 -13348 -25114 -33943 -23481
15019 -23481 -12983 -16676 -26099 -22062 -16667 -4611 3447 -704 -5280 -4456 -9987 6782 17460 3575
15005 3575 -8317 -12416 -27708 -38321 -34039 -30216 -27556 -20372 -14285 -507 -2093 -33891 -29787
14992 -29787 -20486 43 -627 -2170 -7004 -12799 -12327 -6826 -901 -1731 2841 -3014 -11472 -20094 -8719
14977 -8719 1910 -9614 1264 6954 14597 16886 2551 -7974 -12472 -9245 -15136 -9618 -6893
14964 -6893 -11686 -23234 -17241 -20343 -15349 -18215 -27040 -15878 -14152 -19643 -22734 -15807 -6633 4591
14950 4591 16562 9248 -3833 -3469 10401 20399 9348 13556 30125 20775 11438 -6113 -19111
14937 -19111 -16453 -12357 -8472 8443 6915 -2127 -14535 -24563 -11288 -4399 -14824 -17787 -8224
14924 -8224 -6335 -4049 -14093 -17984 -12232 1710 2827 -12325 -22876 -20767 -22988 -18049 -6211
14911 -6211 5888 12118 382 -6157 -10030 -21484 -15506 -16399 -10876 -4744 2976 8607 10179 -4902
14897 -4902 -2050 -3967 -14966 -10879 -2471 -5110 -11698 -9621 -4064 -16322 -22699 -26796 -20216 -19879
14883 -19879 -15169 871 -10623 -22251 -17333 -11817 -19052 370 18339 15382 612 -10910 -9819
14870 -9819 -10341 -15228 -10689 -3747 -2378 -22242 -26991 -8853 308 14173 3045 -7091 -1389 -13982
14856 -13982 -24304 -26998 -15494 -992 4881 8189 918 11537 13308 9239 1441 -14252 -16070
14843 -16070 -12267 -15967 -4982 -648 2225 534 2101 6620 -5929 5940 10819 -8435 -2758
14830 -2758 7197 6740 1615 -12941 -25310 -6481 9309 7822 11428 9252 14523 10590 14074 3213
14816 3213 15657 19394 12003 -1888 -1844 10907 12763 7679 3017 -1732 -8523 -3799 -9658 -12959
14802 -12959 585 -10731 -9647 -8285 -2454 4135 13007 7654 -504 -3524 -12077 -5821 14556 3780
14788 3780 876 10519 6003 -2621 18553 20573 5703 -12144 -14877 -16563 -5093 -3998 3402 -12447
14774 -12447 -25795 -33832 -28719 -20648 -20631 -18928 -13425 -4494 4157 -5284 -11775 -14408 -17259 -19802 -15718
14759 -15718 -27979 -29841 -14147 -12994 -4453 -9592 -14936 -20528 -26821 -27690 -26875 -14635 475 5719
14745 5719 6802 8137 3066 98 -11149 -17357 -8606 -2037 6738 19805 23750 12232 -2578 -16999
14731 -16999 -24964 -16794 -8404 -20319 -36758 -41252 -34970 -8050 -11560 -20945 -25879 -36989 -20162
14718 -20162 -7256 -17204 -12361 -13958 -10542 -3118 11697 6609 -5133 -24246 -16422 -12798 -11421
14705 -11421 162 -3780 -7699 -10425 -3755 4253 9801 485 -13563 -20302 -29101 -30836 -27224 -26479
14691 -26479 -29336 -33832 -31956 -26931 -21409 -20897 160 14125 18854 13657 10438 1222 -18252 -29615
14677 -29615 -24571 -21664 -26245 -24669 -22947 -28857 -22150 -17936 -31376 -27448 -16391 -26895 -23253 -19651
14663 -19651 -13629 -18877 -14586 -17593 -28573 -17745 -11555 -10176 -25372 -17758 4503 22776 11173
14650 11173 4556 3727 1879 -1007 -2248 17340 30009 21886 13035 -1824 -14228 -12601 -8908 -8125
14636 -8125 -8253 -10960 -13493 -15696 -26176 -27663 -24294 -13343 5230 16267 1879 -18211 -20073
14623 -20073 -17380 -8829 -9503 -6485 -3102 -13754 -11411 -2784 2699 5383 3752 -2555 -13210 -17384
14609 -17384 -7517 4604 7323 -3756 -13777 3143 14668 13757 10317 5925 12055 24198 22360
14596 22360 16590 -3882 -12597 -9520 -18968 -24240 -21880 -22292 -24504 -41277 -35086 -21247 -2498 1266
14582 1266 4693 -3575 -17069 -12873 -14262 -12081 -1052 -1686 -15961 -15276 -19408 -22576 -22763 -21930 -36861
14567 -36861 -36062 -25772 -12081 -10599 -9927 -10324 -12322 -11868 -9511 -10866 -17140 -4014 3823 -7930
14553 -7930 -18143 -24272 -18791 -11175 -4128 7041 4470 -7698 -34095 -29993 -13951 -8964 -7166
14540 -7166 -16302 -12954 -1342 3069 13471 2737 2376 6588 6044 7135 -11697 -21649 -21408 -35936
14526 -35936 -36726 -37618 -34266 -18794 -15232 -6192 8693 9570 19807 20657 -2246 -19050 -21855 -23628
14512 -23628 -2533 7638 8543 5825 10363 5490 2533 -3148 3927 15045 29745 23009 3284
14499 3284 -7555 2619 739 -4735 -6384 -2295 -9339 -15795 -18009 -14515 -12216 -8339 -7963 -12873
14485 -12873 -13231 -16473 -9778 -13018 -27928 -30518 -32774 -28285 -31352 -28694 -12274 8915 5399 -9274
14471 -9274 -4246 10971 -5848 -7516 5365 8803 5314 2859 -5304 -8179 -11053 -7027 -559 9819
14457 9819 8233 -7199 -9273 -15211 -14641 -15205 -8815 -11783 408 13414 13024 2135 -11147 -24206
14443 -24206 -28004 -31441 -20407 511 -4999 -15330 -22448 -13934 -12050 -9610 -7733 6097 9788
14430 9788 9869 8829 -1432 -10461 -8982 5833 20345 21227 15181 676 -24358 -16971 -2332 2863
14416 2863 -12530 -26059 -32895 -27377 -17635 -7787 -10471 -4164 -6691 -10660 -15465 -18770 -9242 -19107
14402 -19107 -13150 -9022 -10960 -7644 -14654 -36308 -23699 -7247 -6157 -22880 -21513 -16004 -12588
14389 -12588 -3368 -2277 8531 6776 5341 9427 13613 14442 8655 11059 13009 8186 3572 -3071
14375 -3071 -379 369 -4915 -8731 -7297 -6319 7340 3961 -7558 -21311 -17517 -10001 -13621 -23197
14361 -23197 -26017 -3891 15756 27533 17862 2652 -2454 -8120 -1526 2687 -4763 -14548 -8890
14348 -8890 -7976 -14849 -11938 -8185 7252 12641 12934 -1292 -4346 -2852 -11654 719 4287 -6976
14334 -6976 -8623 -14234 -20872 -15970 -6160 -7853 -763 6418 -2648 -11117 -20062 -30339 -32684 -29281
14320 -29281 -36763 -23246 -12138 163 3176 7998 3360 10673 13499 2277 2950 11430 11717 2203
14306 2203 1897 2086 -10685 -19191 -18011 -17925 -16432 -8060 11597 9843 -3986 648 -5072 -12312 -9807
14291 -9807 -8184 -7341 4668 11065 12555 5122 388 6645 6391 -3719 3167 -5662 -7055 -3436 -3738
14276 -3738 2100 -4995 -16122 -19023 -5484 5934 -3895 -6717 -6331 -6320 -23867 -15374 671 9044
14262 9044 332 -3087 -522 -5402 -11618 -18477 -21995 -12920 -5292 2293 -12025 -13920 -1505 4468
14248 4468 3484 6131 12979 17237 4563 -9485 -18175 -27211 -28502 -31782 -16196 -9944 -8967 -15368
14234 -15368 -12628 -1176 -4464 -23500 -28638 -33211 -35799 -27777 -17111 -24232 -17777 -13725 252
14221 252 -1600 -2363 7213 17099 22582 24615 14725 8479 2559 -7982 -18392 -16735 -8390 -8199 -8704
14206 -8704 -6283 6893 6375 13217 12822 12911 1825 -8191 530 -5117 -4985 -957 -1397 -7164 -6155
14191 -6155 7082 9451 85 -6113 5027 3213 -6249 -8537 -11323 -15890 -27355 -19742 -24255 -24261 -18303
14176 -18303 -11082 2076 21190 20614 9763 5213 650 -5922 -4742 -3232 7660 9627 1384 -9955
14162 -9955 -9401 11809 18370 5654 3547 11565 3957 -6747 -5073 -10409 -10325 -13980 -18479 -21469 -11815
14147 -11815 2198 19991 15541 10495 4827 -93 6293 9606 17805 3222 -9250 -2192 4589
14134 4589 -295 9212 15600 17370 15523 6251 2939 1237 4640 -1497 -1908 -8548 -13403 -10618 -13859
14119 -13859 -1334 18697 15446 1591 4619 9217 258 6585 10568 12003 3921 14737 13607
14106 13607 -7498 -10014 -5553 -2568 -5918 2305 -7830 -21016 -12742 -5205 2139 17423 26343
14093 26343 17192 7625 -18243 -29124 -31393 -15944 -19278 -22033 -23554 -26281 -11525 -9343 -14349
14080 -14349 -18068 -23987 -11669 7261 26836 14563 1704 12158 8124 8902 17607 8749 -18165
14067 -18165 -14585 -11426 -9604 750 -3455 -4182 -5505 -13758 -9862 625 3769 19 7872 11999
14053 11999 13050 3861 8736 7741 -6279 -8005 2000 10048 -779 -15135 -6936 4789 8573
14040 8573 6265 -7300 -22435 -17009 -14345 -3371 -3215 -3021 7431 21266 13639 -2130 -3333 -3186
14026 -3186 -10812 372 1720 5596 10607 14797 11862 19832 20645 11084 -1040 -20652 -22438 -20500
14012 -20500 -14149 -7613 -9957 -3806 -4877 -1827 3735 26401 21753 16942 7954 -2945 -5734 -6460
13998 -6460 -2579 -5093 -9999 -16059 -22718 -15542 -7352 -9066 -6226 -7900 -9609 -11901 -12216 -14727 -12667
13983 -12667 -2905 -3210 2372 10114 10382 6003 5374 11705 16223 8694 -6111 -11150 -3236 6522 17334
13968 17334 35318 25562 19881 8818 -1163 -7747 -13869 -18262 -13114 -11703 -25002 -25678 -21147 -24438
13954 -24438 -23293 -37576 -20644 -8491 -12835 -21094 -17462 -13437 -4149 -11580 -15550 -5394 -4092
13941 -4092 -3431 -1 1480 15369 -558 -3692 17467 15284 561 -4696 -9157 1655 -2670 8646
13927 8646 17356 16664 3166 -13396 -9839 3014 3428 9370 13930 7610 1551 -2621 1721 9651
13913 9651 -2765 -16845 -6575 4748 17649 18122 20114 14509 -556 -5977 -1667 -1870 -14434
13900 -14434 -9916 1227 4772 -3076 -16181 -17998 -1018 4117 -462 -15145 -16774 -21561 -14092
13887 -14092 5424 15049 14816 5430 -3393 2457 4212 -2057 -1604 4987 7410 -635 -5049 -1309 11942
13872 11942 14068 14198 28696 41315 38642 41509 38864 40280 41835 35050 22383 21883 28394 25260
13858 25260 20295 26188 34877 25446 21660 27949 26242 21777 16005 19842 21193 12796 21855 30670
13844 30670 36193 38625 35858 41732 40093 44172 36027 28427 27297 16787 9156 11357 8196 210
13830 210 -8745 -8163 -500 -5632 -10667 -8082 -4548 -2323 4647 12953 20111 10523 2750 9795 9825 -1321
13814 -1321 80 17950 19094 12956 15260 14725 9737 12831 8442 575 700 4107 -6788 -9675 -7094
13799 -7094 -2855 3012 1797 349 6750 897 5647 6274 -73 3448 14840 24604 20971 18331 28006
13784 28006 27676 21884 18494 13776 10732 5277 31689 23266 10803 9435 20254 38262 40098 26936
13770 26936 22658 36053 42550 33947 34098 32725 50105 47564 43390 31669 17751 29505 37731
13757 37731 21893 30945 33503 37045 32900 23869 23793 30027 31793 38866 35921 33381 28841 27100 22745
13742 22745 9666 -3512 981 -755 10233 19411 14742 16749 6824 -5006 3121 -3639 -25810
13729 -25810 -24417 -21065 -15032 -2421 3122 9015 786 -1604 -11523 -1307 -9407 -13223 -13911 -24499
13715 -24499 -19475 -17589 -15358 -12302 -3972 8740 95 -1601 -5238 -7178 -5171 -2116 -3332 -6265
13701 -6265 3957 -5123 -19168 -12536 -1942 -4794 9253 23163 15705 -12309 -18448 -15960 -21815
13688 -21815 -17303 -9635 -8343 -11538 -2759 3910 9654 4364 -3814 -4199 -13470 -20960 -14106 -15880 -15793
13673 -15793 -4062 -2474 -7252 828 -4253 -5269 4471 7491 13515 14110 20885 26570 13470 5923
13659 5923 8742 6337 5694 -4072 -11264 -13711 9103 15663 12907 8625 -5078 -14769 -5405 7674
13645 7674 9337 15865 19458 28514 21814 19000 17394 12730 4321 -1294 7479 8411 1013 -2484 -7074
13630 -7074 638 21755 37775 32560 3055 -9703 -14218 -14591 -18718 -7710 8638 23142 30098
13617 30098 27764 8764 -15233 -17899 -858 -9549 -5330 10224 15766 18545 16225 15876 25429 26878
13603 26878 13495 18144 32458 40052 28174 18932 9917 -696 6773 12154 14077 20489 10970
13590 10970 -1944 -875 8853 8318 16019 11115 6032 -2537 -620 -3286 6867 5133 -11 7719
13576 7719 8911 77 -82 -3812 -3933 -7172 -2834 -9913 -9452 -14614 -8403 9308 6009 -5014 5974
13561 5974 4501 -2901 9141 16168 19565 30537 19742 1392 -20781 -30024 -20219 -20267 5579 21695
13547 21695 14553 12323 11135 28162 29299 19854 7418 2045 9197 4226 -7984 -15578 -21083 -15457
13533 -15457 3723 9237 3061 11873 12162 11004 15590 12045 19855 7811 1010 7264 9170 5737
13519 5737 -3773 6926 -1432 -7156 6808 8931 1701 -261 1931 9098 1208 11105 15351 11110
13505 11110 8723 -2565 1576 -841 1591 3927 7861 7620 9234 8602 14682 15544 19672 14518 4090
13490 4090 6630 9484 -2207 -4197 -7885 -11050 -1889 5082 7448 -3703 5010 4754 -1759 5300
13476 5300 11917 15240 22357 14457 17319 14862 9383 13389 18752 18801 12732 14417 20147 17146 15961
13461 15961 23188 27003 22795 9624 6741 1326 4725 4615 -140 -8823 -10424 -9619 -9281 -776 723
13446 723 -5642 -818 13690 14111 6646 7214 14644 12040 16521 28960 35880 19599 13584 12483 4523
13431 4523 -1075 6058 12309 20214 19253 11064 10041 6438 -10322 -7039 16723 16134 14225 12551 14905
13416 14905 16983 17812 19588 27141 21616 6300 16950 15480 3655 -7472 -16019 -14653 -5661 13335
13402 13335 29173 25802 18698 11132 8055 6434 1638 2833 473 -887 1803 5208 19800 9932
13388 9932 10197 9959 1498 -6451 -4862 -7224 -7677 -2892 4840 2089 11245 20199 38477 36997 29028
13373 29028 16601 729 8347 12121 10996 10646 17080 18722 2506 3482 10970 21187 21967 19490
13359 19490 27455 32267 19629 -4033 -9154 -3072 12367 22533 14711 12549 12158 27467 15802
13346 15802 4701 -6757 1617 14537 19498 16300 14041 16725 25113 36385 30291 27960 26059
13333 26059 19041 28358 18855 26553 20192 13119 3476 -16975 -19076 -6040 6705 15247 20130 21895
13319 21895 32484 40307 36116 26512 19366 6023 11890 11178 18401 29508 41617 48243 39276 32117
13305 32117 25337 15791 16725 25809 10711 17769 21825 20450 14419 12787 14834 21435 10196 10384
13291 10384 16760 12168 18840 21133 30572 33954 24267 14414 10001 11040 24214 14911 16531 20005
13277 20005 22668 45626 45499 40589 37424 26682 27091 33562 19368 8233 5178 9162 15049 14425
13263 14425 -3616 -12305 -10627 2326 22009 21278 16863 20358 25000 21959 20322 16636 6181 15201
13249 15201 22873 27113 23917 9927 583 10395 33379 42138 36009 20852 25454 23581 19962 12911
13235 12911 -3430 -3762 8411 7971 -1154 -10289 -1025 16418 16382 12846 9314 1027 -5509 -15769
13221 -15769 -7071 -5435 7479 12592 16926 25449 25510 27605 26870 25205 36454 44076 42678 19675
13207 19675 18156 21286 21227 14616 15578 20377 25108 23260 20383 20938 23261 12141 11853 14934 10524
13192 10524 12707 18651 23627 10417 5454 -2813 -15590 -15610 -9918 12120 27576 35872 50729 52818
13178 52818 50788 39499 43932 47364 41439 34154 33999 47062 57209 42573 33012 29646 20949 19863
13164 19863 27716 29970 32491 23294 28219 37784 30443 27065 25848 16391 7949 -10276 -22064 -15426
13150 -15426 -529 -3722 -425 -1577 5107 22439 31944 34004 45005 50580 54275 52296 48908 45086
13136 45086 40096 37941 36646 34000 23129 6109 -1261 7029 22516 24254 14448 5858 3921 31545
13122 31545 46712 53655 55280 58764 50453 52376 54178 51538 40186 37160 42975 23655 22817 33600
13108 33600 20028 11220 14673 19652 35126 57438 54657 40376 31762 46099 68307 81468 70564
13095 70564 67366 60952 50267 45079 45672 49645 40207 37745 42953 45538 47720 54670 59926 57799
13081 57799 53665 56212 63939 78140 69640 73674 75723 70498 79025 99771 111265 115417 107909 103725
13067 103725 106393 116698 123794 130892 142035 167025 193019 235966 298633 375772 462196 564324
13055 564324 654294 730401 783031 830798 856491 842514 799869 733009 653254 581039 488466
13044 488466 400942 348850 291409 244456 222367 219556 220370 208884 194765 180952 159747 138039
13032 138039 125703 116721 111676 94998 72922 58305 44246 54346 62097 55822 66645 67441 73038
13019 73038 83741 86831 81310 80745 81290 81717 92152 88118 83303 84794 75393 73496 86590 86032 87053
13004 87053 79273 70122 80341 75854 80306 83383 72373 63441 62854 59379 57103 57797 65273 71848
12990 71848 78759 75266 82047 96219 91176 70741 54010 54665 65365 61357 63341 58631 41971
12977 41971 38400 31110 25634 41299 40517 44540 56719 58125 40638 41521 39566 40367 45687 50494
12963 50494 56221 55749 60519 66565 61751 61720 69788 68887 58952 57944 65644 57898 55844 42720 22098
12948 22098 21546 36820 51101 52352 60082 61487 71506 74814 66996 72409 79988 91500 87177 81800
12934 81800 76186 72955 60730 50613 40173 43837 46988 44373 37827 33244 31816 25737 37036
12921 37036 38069 43032 42395 38359 26722 17731 9138 20614 25775 23496 30357 41327 47557 35009
12907 35009 29871 36107 31919 27951 38424 50288 63990 56162 51979 57240 59865 58464 54861 54675
12893 54675 66759 76112 85672 98867 109684 116760 138930 152961 147519 134350 141583 142980 153777
12880 153777 150830 157110 158252 147561 143438 128192 113518 114648 113035 108794 104957 104962 107337 108188
12866 108188 103810 88643 89170 109042 114592 103926 83735 69621 65437 80067 75155 67849 75469
12853 75469 62182 58382 64883 77573 80799 80094 66963 86864 104064 98002 80397 77473 81638
12840 81638 90545 101944 100537 91939 98313 114345 108109 105919 93340 87874 84620 84237 78994 74191
12826 74191 65037 47566 40095 50198 65195 66488 69657 56174 51149 59882 75017 96391 104143
12813 104143 115557 114146 95514 77466 74190 75539 83718 78839 76302 68011 69973 83596 109969
12800 109969 120504 130734 125407 135320 159604 163068 156427 155740 153179 156892 151477 149355 142289 139216
12786 139216 141868 156097 174214 177854 189344 191603 202652 199746 194423 186813 194937 207860 214224
12773 214224 205327 218122 225033 227608 222757 233402 243999 260045 282978 299497 307005 317700
12761 317700 342674 343112 325745 321959 328655 330275 326002 315407 294708 269430 248292 237926 236483
12748 236483 227957 227149 239394 243480 234692 240377 246424 261185 270066 277052 284971 298235 298117 302773
12734 302773 309489 314161 322193 333457 357552 374854 374771 380355 381219 378748 374797 376724 379059 392601
12720 392601 423437 431213 435034 446408 468435 487271 511875 528127 529569 523799 528527 530690 531371
12707 531371 540008 537214 548100 542756 538785 537917 541497 558754 583017 578455 566232 584733 616622
12694 616622 628369 642655 674675 694125 717386 743877 766546 790733 818842 835608 857832
12683 857832 877009 894847 901877 929911 959027 983661 1002630 1028923 1064720 1113021 1153544 1210585
12671 1210585 1286423 1366259 1452681 1539441 1645111 1746258 1848933 1956739 2089906 2229562
12661 2229562 2370364 2518390 2679921 2882756 3123122 3384952 3705251 4110344 4600403
12652 4600403 5176619 5859571 6674955 7637347 8754375 10027660 11472528 13133508 15064075
12643 15064075 17383002 20318005 24257631 29779858 37471271 47788194 60885400 76521214
12635 76521214 93987244 112148750 129425767 144035882 154341665 159129605 157848026
12628 157848026 150706814 138740742 123492159 106654336 89837702 74366883 61199680
12621 61199680 50788443 43061510 37509893 33493328 30469549 28084225 26099342 24395316
12613 24395316 22861514 21468008 20192295 19014659 17900684 16890429 15969431 15117399
12605 15117399 14325825 13606434 12911674 12269583 11682059 11133810 10635199 10168002 9714248
12596 9714248 9292088 8925318 8586164 8265198 7933349 7626532 7338985 7073334 6813114
12587 6813114 6574580 6359023 6141700 5937153 5745865 5557357 5368250 5194460 5017143
12578 5017143 4844858 4674091 4494405 4343411 4196160 4055390 3928143 3800142 3679547
12569 3679547 3576923 3463899 3354917 3254514 3157779 3083897 3014432 2925884 2846143 2772908
12559 2772908 2701520 2637852 2568294 2498448 2427168 2328996 2248702 2187253 2120573 2065770 1992331
12548 1992331 1927863 1877634 1823924 1788430 1756072 1704426 1661344 1608738 1570005 1532186 1503606
12537 1503606 1472406 1429016 1385704 1361315 1316910 1279107 1264296 1268568 1261693 1233741 1222323 1201486
12525 1201486 1185762 1168118 1152092 1124044 1097098 1046380 995705 961772 933394 899416 863255
12514 863255 829094 812351 787975 762255 743179 724870 711184 687530 655566 621739 598273
12503 598273 589940 570864 539495 513508 486562 457253 433808 420524 394736 373413 359885 343763
12491 343763 330210 315467 305713 300007 291752 268939 256569 256902 245655 237762 227141 223941 225857
12478 225857 237072 260102 268596 258851 263480 267342 250970 242792 240306 232939 237683 242573 271898
12465 271898 282356 273961 289877 306369 327976 351624 338336 341291 348267 348820 334398 338019 348739
12452 348739 344256 322264 325687 324856 315642 288958 285206 285015 275738 274191 256705 254884 247053 242060
12438 242060 245973 236584 234504 234823 245210 237884 220748 207412 191843 187342 182710 184778 196238
12425 196238 185970 198109 196567 199915 215874 253877 277348 276677 294935 326393 365473 417865
12413 417865 484166 566698 659924 759453 845928 926452 976203 1000507 999993 978894 926708 865546
12401 865546 787957 712767 641349 584672 523098 474301 445832 406272 379137 347805 333009
12390 333009 317240 301613 292744 270212 265877 270588 253435 238957 230816 227371 227836 225634 222975
12377 222975 221192 221957 236486 216222 197477 187546 176858 163222 149173 129915 106670 103321
12365 103321 101411 109973 105355 104736 113548 110121 113702 113406 115375 116235 117797 103415 105141 111804 116623
12350 116623 101143 89746 86288 82813 86736 85509 92789 112155 110811 121164 131055 133801 127283
12337 127283 126802 107660 92312 96071 103405 95664 87373 89895 84015 83872 87403 88095 79170 77281
12323 77281 80844 85468 95717 90765 84669 82573 95263 101283 97655 101652 98104 102477 109800 117833
12309 117833 118254 114199 120042 121588 117772 108493 92689 95205 101200 98499 91577 96764 89264 83892
12295 83892 75341 60595 50440 59026 76285 86978 90528 79817 73322 67259 70451 82202 88656
12282 88656 92932 90415 81542 79103 87565 79274 72675 80481 74867 73738 78042 80789 85642 81106
12268 81106 61324 56929 52573 54872 60305 62916 52215 48915 49665 51700 79264 73502 60729 60308
12254 60308 66605 73757 72884 64720 67102 68143 81957 96345 109711 104818 87756 79407 70922 61347
12240 61347 64849 76498 89234 96524 94704 90562 88773 93188 112328 100589 106400 107304 107254 109430
12226 109430 115662 103748 105912 107812 104250 110255 122709 133721 131832 142250 172825 194263 208514
12213 208514 224685 251939 288421 338558 414055 502666 599344 694050 791191 879616 938695
12202 938695 951419 943972 909712 834301 746147 658940 560951 492362 437100 394974 365909 354800
12190 354800 345742 342542 334668 332194 315100 305274 307291 298241 272074 239061 215839 200791 194004
12177 194004 180522 159424 159679 158573 154421 148524 151367 150756 139374 143036 156286 143597 124543
12164 124543 102982 97390 107809 108859 114079 119724 114897 118117 132283 137407 133622 139548 136447
12151 136447 123322 118526 116267 116295 130049 146075 153412 166260 191752 201076 213508 232587 243829
12138 243829 263844 290499 316180 318133 327823 316607 319324 307128 297512 281014 264326 244369
12126 244369 260558 294809 322515 313878 285202 294169 290654 280101 269010 270643 294922 297629
12114 297629 294787 299270 294215 289494 307351 305961 287658 286698 289136 294711 323575 340039 345956
12101 345956 366557 406389 453851 523332 598693 684204 754811 818257 870076 892401 886503 855490
12089 855490 799212 729011 655107 598266 562730 517171 483278 472980 466798 479262 489156 486163
12077 486163 491000 495943 476980 459541 454764 440375 429300 419736 400547 389067 384236 372680
12065 372680 346430 338571 330179 327788 319318 316495 317217 316505 332173 331590 328662 337780 356918 380443
12051 380443 390277 404643 408364 392615 350957 305466 273719 247378 218623 200840 192342 202842
12039 202842 198618 193887 203665 204976 229562 227710 222438 223039 230018 229835 226393 223650 221144 223846
12025 223846 228809 227649 226193 222605 221407 220295 215813 214161 207518 196923 192336 187673 177437 177720
12011 177720 169126 164846 159708 159034 163826 154806 151980 155410 158604 164136 171822 174374 173388 166155 156417
11996 156417 150822 153356 165546 171861 182607 184181 186409 174775 160504 151792 140065 120869 125834
11983 125834 122214 128484 131686 126999 130413 134080 128783 138704 142864 128737 131793 133391 139062 148007
11969 148007 145669 129210 126218 121676 116325 114543 127133 125768 124075 122078 112537 105079 107886 120041
11955 120041 121246 125655 138214 142852 149576 158411 144656 131184 141332 140471 134606 129176 140316
11942 140316 136606 139506 150181 151601 156481 151309 138654 148454 159805 182368 188761 189060 188309 191293
11928 191293 189389 190591 188199 178045 173035 177177 163474 152117 155172 155498 154872 157747 161169 167461
11914 167461 175631 184139 197921 210216 214787 202814 193538 186126 187010 185001 184365 188667 202044 209251
11900 209251 210925 205721 199047 185192 183891 192290 182426 176762 180785 179482 181719 191931 198797 190882
11886 190882 186325 177959 164170 159785 157216 168667 176574 183673 187379 172204 167694 168165 179093
11873 179093 188515 191883 191670 199014 196208 198420 198709 190764 188010 201783 208114 212072 216095 221506
11859 221506 218444 225498 225535 217934 213340 200812 184592 184133 198539 208598 223691 243224 249642
11846 249642 243748 240572 229588 232615 246492 249477 253670 267899 277104 275512 280141 287198 285671
11833 285671 296271 310916 317645 325075 320215 325457 318163 312734 322812 332318 336760 330473 336297
11820 336297 350890 364584 357942 349007 366884 365910 365048 364547 358132 354736 372036 386039 400923
11807 400923 404797 420340 439273 447636 459174 458085 462309 489515 513372 523931 543075 568761
11795 568761 582393 597715 622876 644993 677285 691282 701239 712149 728390 750369 769954 804859
11783 804859 842053 899066 960931 1036758 1118704 1211168 1290359 1337257 1347976 1334842 1309287
11772 1309287 1244140 1196893 1164328 1144842 1132896 1127087 1146650 1190498 1222782 1257091 1310401
11761 1310401 1368810 1421779 1472192 1505337 1532916 1550349 1559834 1552085 1525296 1498873 1469601 1444975
11749 1444975 1437216 1441559 1444469 1458004 1500619 1564179 1641449 1745413 1902054 2069406 2241689
11738 2241689 2430786 2609297 2797521 2948517 3069372 3171184 3258363 3352886 3488307 3686619
11728 3686619 3949325 4252364 4556563 4848551 5145148 5403474 5658875 5874061 6043490
11719 6043490 6186153 6377956 6629085 6916759 7259998 7711026 8349870 9269014 10445746
11710 10445746 11853168 13404817 15101698 17078170 19524250 22610320 26320020 30292040
11702 30292040 34040793 37323432 40071915 42193845 43313219 42951869 41237058 38956692
11694 38956692 36832359 35044633 33441007 32092569 31268143 31097951 31558671 32416117 33423646
11685 33423646 34455382 35495537 36510724 37390648 38075020 38751120 39738008 41212704 43003654
11676 43003654 44750637 46233985 47404749 48247394 48725250 48945990 49191355 49888938 51357877
11667 51357877 53751804 57196343 61882124 68080197 75994895 85419320 95252802 103878530
11659 103878530 110189728 113988018 115386293 114035572 109265765 101437483 92439267 84226188
11651 84226188 77522342 72234865 68079157 64834562 62443290 60871706 59935635 59363069
11643 59363069 58838984 58155385 57121544 55551922 53499203 51297414 49432563 48110734
11635 48110734 47173110 46355071 45514967 44619253 43667767 42653283 41539781 40458018 39713568
11626 39713568 39580722 40173775 41401786 43080629 45111993 47517764 50280341 52938407
11618 52938407 54697576 55074715 54220255 52520851 50001921 46383397 41806423 37087487
11610 37087487 33074875 30000257 27608487 25581567 23698981 21917798 20316816 18981517
11602 18981517 17923054 17098838 16423376 15861991 15393959 14990404 14621695 14255882 13854271
11593 13854271 13404349 12929503 12465759 11965833 11419671 10873387 10355136 9884490 9511784
11584 9511784 9206952 8922322 8658699 8371863 8070609 7735434 7375670 7014802 6664696
11575 6664696 6326538 6039922 5793481 5582786 5390071 5221113 5082177 4949456 4845200
11566 4845200 4749666 4657368 4575970 4528239 4478178 4413125 4358176 4285656 4187405 4077549 3965456
11555 3965456 3856335 3743273 3641660 3542012 3437526 3353583 3268962 3194691 3128654 3108642
11545 3108642 3088229 3070508 3067962 3058363 3027693 2977837 2912328 2812967 2678523 2520688 2364377
11534 2364377 2216651 2073910 1948783 1851593 1775373 1706329 1643710 1584003 1539719 1512394 1483248
11523 1483248 1449156 1405638 1350883 1312080 1275325 1227841 1186803 1155835 1121030 1084706 1045970
11512 1045970 1011281 987999 965117 943103 907673 868792 843246 824196 812660 803292 800908 785628
11500 785628 757119 740181 704220 673120 661439 630896 612343 607348 592701 570560 547095 536407
11488 536407 525057 511894 492737 474464 472683 466349 453744 442105 429822 425446 409684 398329
11476 398329 399942 405990 394467 402969 399850 379163 369250 371593 375947 376020 374584 361775 354186 352785
11462 352785 356548 350072 336078 326099 318664 308218 286711 281601 276889 285667 295874 312131 305293
11449 305293 297995 297474 299306 289542 297478 292255 280523 280467 278978 285024 288088 283853 273859 277076 267053
11434 267053 256082 257173 266343 250284 242282 250469 250503 262446 267236 253708 249649 253639 251687 253969
11420 253969 254338 240702 230508 216865 224453 229683 216080 209184 204871 196347 187989 181529 189530
11407 189530 180460 170050 169739 174060 193599 188341 194166 191710 170203 159006 145281 157041 152853
11394 152853 151329 153681 148354 139233 143898 138041 140455 133162 122074 121767 120265 126268 134530 121538
11380 121538 109794 100182 99500 98301 99775 107063 111668 100336 90510 91178 96004 106329 111029 108252
11366 108252 112779 109523 98309 94303 92188 84928 74226 59778 57232 72052 72438 69902 66862
11353 66862 67621 73620 73452 69688 72427 72906 75943 68748 66304 64570 61605 67152 64105 51636 58389
11338 58389 63773 61540 59815 62443 62422 49267 36907 32291 44827 63995 68152 60848 52172 40908
11324 40908 41183 48227 55138 56529 63744 79544 68460 60516 62411 66471 68091 64022 67901 65578
11310 65578 52404 45434 46560 53003 59852 72614 67246 59145 50866 47530 42158 33895 36587 39727
11296 39727 34075 39717 46274 47072 43530 40713 55427 42580 40426 40475 47093 59569 67840 75169
11282 75169 69624 67205 67844 70157 72170 74353 57486 53191 59739 67756 80196 95165 104900 117479
11268 117479 129390 155515 174018 182004 187437 197644 209955 218281 226617 250905 256811 258107 264146
11255 264146 263010 247557 225553 219575 212462 194160 195099 199998 200418 205680 202470 207489 224441 233289
11241 233289 223571 213472 220867 238559 252242 262012 268595 270602 271877 275756 293486 314325 316766
11228 316766 317236 316953 312588 307889 320269 337314 360984 410511 467026 540018 606145 661950 693947
11215 693947 711139 705875 673530 613535 550226 490503 423390 364434 334768 320284 305296 294604
11203 294604 299401 291356 279815 277435 276537 279783 274519 284886 294394 289941 291353 289831 303698 312738
11189 312738 295811 292897 292195 294675 289231 286197 285126 298356 303349 304539 317155 338409 361470
11176 361470 384113 392555 386634 374099 357063 346534 316797 280025 250841 228544 202437 183693
11164 183693 172003 160451 161295 166401 176225 187484 186075 171350 160049 144376 137485 138861 118361
11151 118361 112067 114741 119225 130825 134589 144210 145148 140246 126166 121173 113369 123093 127313 130618
11137 130618 143751 141014 137966 145759 135215 136762 139578 137242 116492 101244 97729 102537 110254
11124 110254 125682 136106 134264 133917 137326 143790 149480 142542 139986 137102 154130 165510 147599
11111 147599 141729 139128 140138 117765 96163 93535 122185 119264 113434 113214 95893 91651 93036
11098 93036 96979 89065 88895 88782 95598 87278 78959 62401 65060 78695 94403 96092 99104 96187
11084 96187 96319 93629 79391 91569 98198 76547 74902 85577 73890 59655 62969 69053 71075
11071 71075 77351 85159 90026 71365 52999 60279 62481 62720 80892 79369 66190 59287 64213 82501
11057 82501 93886 104308 91173 68993 70636 69935 71822 60598 63759 63076 66000 59948 66031 63289
11043 63289 54287 55902 67150 68605 59578 61315 73029 76903 69769 48956 36066 43580 45233
11030 45233 38714 39449 43228 53631 62181 63046 57008 50963 37379 44392 46644 39689 45791 52859
11016 52859 62901 61043 58213 68281 71016 64852 48604 62080 55944 40426 42723 41327 39840
11003 39840 36402 46889 52563 69116 73072 74389 73987 72333 67318 67121 68242 59646 43171 30536
10989 30536 19066 40163 33523 36540 58986 68155 61210 59237 72569 77031 74370 64046 53531
10976 53531 54906 53755 68404 62395 51486 53491 58459 55800 56360 62525 67545 72605 78395 64111
10962 64111 49111 39361 36532 35810 31574 27257 51149 59847 65820 73443 68444 53805 49927 45335
10948 45335 46629 50857 54910 48850 44561 39416 33728 35899 38426 52086 56236 49552 57079 60440
10934 60440 64197 64836 73833 86464 91685 89824 89662 92965 84702 82400 86944 85353 80604 82803 92738
10919 92738 112658 134187 144437 139921 124096 123501 131385 131301 134228 143480 141672 141301 142190 141202 156081
10904 156081 161458 174939 188278 226872 275874 337286 438116 597006 823674 1091220 1348145
10893 1348145 1517467 1611644 1664814 1644429 1519318 1264816 965018 737009 565143 472231
10883 472231 407843 348159 300001 276769 259997 255374 248669 224715 205398 201961 211198 189100
10871 189100 176136 184057 183789 188630 172251 143921 139981 148586 149949 157635 156703 137999 130391 133258
10857 133258 147508 164447 149691 130806 130475 125597 118357 117131 122945 131291 122503 117714 118910
10844 118910 124463 127283 124123 114633 124437 125147 126237 121901 112992 97026 82358 82381 91530 79685
10830 79685 79910 87155 91525 96204 96557 83827 93228 93865 87588 77489 80901 89676 81503 65109
10816 65109 55667 65601 84334 95824 82862 79466 91586 83222 65810 69692 70745 78171 94815
10803 94815 95165 89084 87537 84257 100027 98680 92363 94095 87400 79536 76538 90897 95750 92819
10789 92819 89313 91428 89490 90999 104782 101536 107741 108696 99760 100254 91049 89901 86919 84587 78006
10774 78006 79322 85948 97918 110240 110395 108747 84744 70368 69213 65628 59518 61749 56407 63052
10760 63052 66146 85019 95666 89842 96751 102748 106788 114802 117435 117200 120044 134660 138750 127255
10746 127255 127078 134749 116131 114122 118812 129273 139797 141622 131262 135162 151171 173780 187780
10733 187780 205674 220891 233826 237361 239779 237183 231079 243985 248835 255170 275304 270609 257781
10720 257781 251968 227921 205180 196773 183263 171101 156548 151586 147679 148179 152579 165472 163874
10707 163874 168517 186426 182671 186457 203015 201295 187791 183695 173090 167910 178029 181693 187642
10694 187642 177673 174501 179875 177428 165156 187956 217802 231108 232124 240188 244668 252998 276310
10681 276310 314556 345229 356046 373035 385183 377182 368659 358683 344977 337166 323329 309877
10669 309877 307571 313394 328946 349458 345600 343234 360682 368804 372451 373827 386946 405576 418620
10656 418620 439051 459372 458927 461446 469628 468835 476766 475807 468214 453748 455529 469678 490289 516496
10642 516496 535218 559919 597431 629700 668261 698128 708580 714602 722163 728638 719638 698796
10630 698796 670211 647207 648223 664544 681514 685915 682051 681964 669903 656805 666185 668176 645605
10617 645605 628031 627370 608482 616663 622552 633606 652078 682004 712484 745536 763202 772126
10605 772126 781353 769367 757386 785649 827753 847592 828300 756290 653837 560985 525334
10594 525334 534737 545600 562268 554353 553070 561871 554086 556067 549390 545612 527236 526110 530397
10581 530397 524855 529580 538695 538607 554233 570500 586622 589384 602912 614368 619820 613463 607315
10568 607315 613485 613113 605522 606258 611609 641312 664563 662830 672296 700597 719663 736328 758162
10555 758162 777549 785754 807194 826125 835488 842009 827867 819159 809427 808269 809382 818531 826978
10542 826978 837891 850669 860498 886713 925739 963268 995753 1020480 1031722 1067905 1089705 1097251
10530 1097251 1122980 1153737 1189944 1223714 1261065 1281557 1292221 1304947 1323407 1345132 1389059
10519 1389059 1456150 1527393 1609134 1709473 1814905 1923777 2041391 2160641 2273872 2395065
10509 2395065 2534445 2703702 2865469 3002751 3148363 3354869 3587088 3832973 4107813
10500 4107813 4418670 4799254 5270596 5875379 6629769 7473490 8372312 9308332 10330525
10491 10330525 11465287 12733997 14123698 15718690 17713737 20326647 23801700 28431442
10483 28431442 34723979 43613662 56828858 77259239 109256820 156170442 211287422
10476 211287422 256586664 283772968 297918453 302869660 297758000 269451767 213646019
10469 213646019 156646529 116105347 90266474 73475169 62011529 53832500 47776043
10462 47776043 43156867 39522159 36661022 34421406 32600712 31142752 29926528 28842906
10454 28842906 27809548 26665336 25344867 23965084 22639993 21399269 20234366 19166719
10446 19166719 18179143 17286191 16472836 15723057 15050970 14417254 13801181 13217778 12675863
10437 12675863 12165476 11678926 11248990 10869341 10496869 10144723 9809560 9488541 9179152
10428 9179152 8875753 8589079 8317519 8038299 7767668 7497629 7213168 6952719 6726401
10419 6726401 6506829 6280883 6083005 5890109 5692550 5501541 5325695 5151409 4983098
10410 4983098 4856713 4744475 4603571 4467241 4354660 4254502 4154159 4053774 3941276
10401 3941276 3815159 3705717 3612726 3498884 3384417 3282597 3178421 3069797 2964238 2875932
10391 2875932 2785649 2711455 2642588 2559775 2480053 2418371 2367349 2321039 2271471 2221959 2169157
10380 2169157 2117238 2075706 2052841 2009588 1947415 1898364 1870580 1859828 1853895 1850103 1865901 1858602
10368 1858602 1831351 1805022 1766386 1720583 1659495 1588660 1513190 1464150 1400301 1329327 1269006
10357 1269006 1232977 1216440 1226173 1237546 1264683 1311679 1360368 1409530 1442110 1436405 1418227 1353312
10345 1353312 1224820 1067256 878194 715133 608598 545859 514264 493488 497006 493010 484444
10334 484444 477758 464256 451824 435923 419782 394163 385797 387035 374730 350600 337471 344307
10322 344307 347611 338314 327677 326934 344905 361500 362803 361143 359995 352160 331518 327775 333361
10309 333361 341630 355166 367915 393862 420800 432845 445907 466567 483113 509919 516586 515116
10297 515116 527053 539107 541239 521846 489672 464237 453110 431665 402613 389538 368123 367234
10285 367234 376337 379003 370219 373386 372453 367054 349959 343267 345295 331443 299257 283358 265940
10272 265940 254548 240076 219325 219328 225592 233294 228818 236463 254011 258816 246489 256180 271049
10259 271049 266360 256683 250762 259047 269312 279151 278072 272135 253170 249276 256639 265491 266987 263718
10245 263718 263137 268511 258357 260615 270548 279775 278562 266804 253650 249994 246291 245648 245331 250114
10231 250114 253514 239295 242562 236926 241473 235286 224486 226282 228296 219267 209959 202048 204626 214386
10217 214386 218962 203705 192571 170427 149335 154576 167329 177250 174281 163656 143993 127708
10205 127708 125361 121481 118939 114269 106109 106079 112873 127107 131199 142547 154150 162044 161902 157358
10191 157358 170373 194614 222693 241196 250252 248564 241613 251147 253724 241487 244934 230681 208134
10178 208134 213554 216150 210780 230425 248320 264638 273807 275542 301596 312259 325128 335820
10166 335820 348800 355299 379151 399903 431206 480486 524494 550815 578290 583504 588100 564013
10154 564013 528451 479904 421692 397588 387821 404622 446644 466896 473021 482064 495050 507913
10142 507913 519478 525216 513746 501849 487054 480831 477375 481613 491965 487190 487650 485135 486863
10129 486863 470921 456712 433799 413366 387255 347508 317949 306708 297649 287981 268841 245935
10117 245935 241617 242652 246156 258978 261485 272849 285735 300648 323550 345319 377542 421635
10105 421635 470246 510045 561213 609212 641870 667198 673116 686908 693363 700938 698695 707049
10093 707049 723641 734602 745129 743489 723223 698501 654483 609940 545931 470577 395868 342991
10081 342991 328125 313992 314486 322216 324247 314834 313366 307853 308851 319219 315871 310466 312835 320074
10067 320074 318831 342027 356117 375965 400334 454500 512085 556140 641425 745176 867200
10056 867200 1037501 1308274 1678114 2087707 2371730 2536880 2619997 2627627 2545633 2232747
10046 2232747 1771381 1376607 1109139 934103 794459 689220 629207 572083 523783 490088
10036 490088 450146 426767 414401 395370 374988 352168 330148 332558 322879 303195 295969 300719
10024 300719 310231 325637 315644 296832 287358 278201 276547 283600 303185 316359 315397 325717 345361
10011 345361 356022 357229 355076 347612 342714 320312 297469 276603 267980 258219 241382 231289 226091
9998 226091 233868 225224 224829 239110 242550 239251 242057 240232 240426 237593 233192 238936 235835 209493
9984 209493 203159 215526 217997 222375 225994 210421 200038 193108 194702 190610 182115 189347 198083 201968
9970 201968 191763 190843 191110 195387 194271 199535 202808 212695 213818 211908 211984 211848 204643 199290 215593
9955 215593 206581 194300 199973 215344 228167 220925 205341 209130 213094 217325 220928 228880 235497
9942 235497 237592 231645 223839 218307 221190 230359 224734 225392 249968 257146 260483 240411 235993 243347
9928 243347 250226 253683 243948 236886 228684 232025 216763 214976 225245 224910 237164 257274 261658 245399
9914 245399 228839 224823 220528 222598 226047 223344 219469 208978 199524 202319 207306 213842 225467 237815
9900 237815 241934 241033 251637 268617 270371 276578 288663 287096 290104 298552 304963 294305 286489 281840
9886 281840 283727 293315 289923 280317 269490 256969 255881 257143 265317 263940 264947 269700 262723 257024
9872 257024 263937 267843 274818 266491 260495 251431 271416 273545 285046 289594 298002 317027 315315 312399
9858 312399 307996 315205 327222 327543 329338 339313 335455 346519 362146 371080 389251 378428 367545
9845 367545 373571 379064 382550 394274 408889 412564 416666 427296 448045 451342 452381 461414 475380
9832 475380 471344 473518 490065 504554 492082 494794 509651 534672 545795 541787 546455 560481 593190
9819 593190 618779 636185 647864 673283 701599 714295 733964 756095 800551 834906 857477 897992
9807 897992 951504 1003954 1070254 1139658 1226425 1323278 1409470 1496952 1579494 1669378 1736962 1831335
9795 1831335 1943324 2064140 2194749 2329212 2487626 2700019 2997207 3292346 3471377 3525989
9785 3525989 3518920 3495764 3446230 3201377 2752099 2415025 2242682 2166677 2162256 2214008 2322761
9774 2322761 2477909 2714210 3040383 3456144 3909030 4349877 4751650 5086677 5295195 5341118
9764 5341118 5225573 5004982 4745389 4450746 4150123 3872496 3653592 3481845 3336360 3210196
9754 3210196 3121731 3054848 3037904 3084593 3168134 3283874 3429067 3619341 3822078 4048391
9744 4048391 4290968 4549233 4818075 5169003 5609793 6202152 7045618 8214567 9687203
9735 9687203 11389510 13223253 15160859 17276912 19665066 22473408 25913936 30038935
9727 30038935 34365866 38248453 41541370 44205637 45921197 45976138 43793984 40160731
9719 40160731 36361873 32882071 29822390 27379749 25896761 25656375 26717319 28893520
9711 28893520 31870164 35455723 39476781 43647720 47552536 50802237 53250358 54950166
9703 54950166 55853409 55869375 55126213 53866581 52234317 50450663 48716658 47195921 46049797
9694 46049797 45445479 45649108 47019082 49853279 54360975 60810451 69689754 81345377
9686 81345377 95025651 108109230 117823027 123336901 125087382 123356836 117177600 105641017
9678 105641017 91445897 78674607 68921012 61986158 57220769 54052942 52151775 51267968
9670 51267968 51246354 52013656 53324077 54982153 56864922 58813723 60694206 62325503 63334775
9661 63334775 63500394 62646246 60657924 57674109 53991192 49797192 45372548 41094302
9653 41094302 37333244 34498730 32892978 32574504 33409134 35212532 37754631 40851858
9645 40851858 44375672 47982673 50796938 52003331 51612727 50024621 47646511 44443890
9637 44443890 40241627 35814006 32098666 29202280 26843155 24792616 22875345 20980313
9629 20980313 19114691 17413709 16003930 14905765 14068402 13416005 12879952 12406029 11960287
9620 11960287 11516522 11086896 10689175 10281364 9873590 9481012 9125020 8820596 8586412
9611 8586412 8397215 8249445 8159902 8106638 8088844 8109515 8194069 8334673 8457800 8558897
9601 8558897 8638973 8648211 8540317 8288912 7914413 7456444 6943322 6418195 5929862 5509769
9591 5509769 5176573 4921826 4712368 4522221 4353629 4210464 4098946 3995783 3895316 3817329
9581 3817329 3762518 3732954 3740109 3747387 3756050 3772451 3778752 3753989 3674892 3585721 3457691 3329111
9569 3329111 3224613 3108220 2990684 2884646 2789444 2705971 2619889 2521613 2413927 2288540
9559 2288540 2155072 2043660 1945578 1868187 1796534 1701047 1607598 1537953 1478829 1422378 1376292
9548 1376292 1348256 1313881 1279455 1251083 1230863 1207221 1186785 1159344 1116101 1071103 1034461
9537 1034461 1004549 976717 944672 922766 901867 874437 851544 816523 800632 785927 770360
9526 770360 757210 747049 734129 727562 716279 695154 681515 675498 651176 638445 637939 642807 634963
9513 634963 625663 606479 603794 595554 579986 563484 560537 549672 537073 546332 531214 505403 498345
9500 498345 505578 498652 494867 484845 474319 477263 502797 500514 495388 490849 499444 509878 520204
9487 520204 531264 546209 546507 546418 524159 496633 477181 462888 455410 458085 464765 461262 481317
9474 481317 487348 505388 510113 506477 507718 528861 538807 552207 560998 571401 583892 603080 607465
9461 607465 606033 614441 606207 579761 571911 559483 548831 556642 572872 586665 593459 598351 619546
9448 619546 632297 661093 678531 703924 726371 744566 756334 763234 743096 723042 708746 702164
9436 702164 701980 682460 664079 670489 688521 692452 694199 695163 696797 712810 734582 764887 796401
9423 796401 855308 910507 941611 965367 977245 974201 941285 897903 851532 788787 741084 718296
9411 718296 695067 674507 676604 679757 674881 672880 697372 708445 708983 723608 734906 757084 770637
9398 770637 760882 756500 754390 746266 725098 705713 696857 684017 676770 666471 665972 651694 651502 659492
9384 659492 656147 638078 642722 650750 672633 671808 676559 678513 684656 692348 681204 677116 660945 653430
9370 653430 641534 616529 615242 626315 634959 647898 666357 669290 667097 667584 683152 697749 693848
9357 693848 699247 734232 769133 799816 834224 861700 888745 902410 905287 923221 922395 920379 922557
9344 922557 915384 913283 905183 915290 926085 935893 945212 968441 995400 1007571 1023239 1045888 1075050
9331 1075050 1088959 1113012 1141403 1168907 1208503 1228755 1253234 1275014 1304544 1347646 1394063
9320 1394063 1435333 1484789 1544561 1604791 1673254 1753043 1828047 1911984 2013372 2113412 2224737
9309 2224737 2333537 2449323 2565803 2690049 2827939 2950768 3054707 3170345 3290800 3420425
9299 3420425 3538640 3691336 3860330 4035524 4238387 4469595 4734542 5014569 5336317 5698517
9289 5698517 6095666 6527364 7030114 7604612 8226004 8926683 9719848 10611034 11633405
9280 11633405 12801481 14138536 15648901 17361700 19337294 21581558 24093248 26889307
9272 26889307 29927415 33168250 36513182 39789493 42823657 45426881 47397862 48587775
9264 48587775 48940095 48411862 47056183 45042244 42516952 39674832 36734051 33813011
9256 33813011 31033264 28461916 26108192 23991218 22115497 20456926 18993378 17696755
9248 17696755 16552915 15517802 14588681 13753847 13007072 12330021 11690804 11086353 10530280
9239 10530280 10027073 9554842 9120101 8723669 8356363 8008733 7654410 7334978 7028962
9230 7028962 6752392 6513978 6285811 6065968 5851827 5643946 5453722 5277272 5119862 4976029
9220 4976029 4848611 4726885 4606282 4488320 4356978 4222123 4086914 3959677 3832990 3686001
9210 3686001 3543327 3410575 3275934 3157793 3061242 2979423 2883603 2780938 2682700 2594292
9200 2594292 2526097 2454721 2378086 2319587 2250375 2183576 2117228 2061401 2016121 1974542 1917257
9189 1917257 1868361 1822708 1769335 1726694 1695526 1663438 1619496 1581796 1540614 1499644 1472961
9178 1472961 1438521 1405611 1385831 1365337 1336905 1312808 1282853 1253645 1222710 1202415 1182535
9167 1182535 1144919 1120088 1084438 1055577 1040891 1024730 994412 957092 926798 911093 900272
9156 900272 881156 856768 810687 793110 780866 769429 740583 704819 693459 680518 664458 644410
9144 644410 612907 596803 594644 586986 563164 534108 507559 479584 470917 456662 443949 434297
9132 434297 431668 424364 414914 407636 395590 384462 382502 378541 361931 343233 323678 312093 315341
9119 315341 312101 306082 306892 306159 302155 292063 280136 269897 256797 242627 241063 234723 232549 241099
9105 241099 237752 244967 253268 267512 265739 250660 239521 229477 225128 217118 210739 213442 219123
9092 219123 220158 220556 231648 231939 238767 240904 224586 233615 231867 211604 199409 194408 196164 209492
9078 209492 224983 220732 224039 225155 224708 218049 216468 210569 199730 184254 180652 191501 195506 186538
9064 186538 171905 155664 153798 155591 166784 164404 161466 156785 158738 160838 156538 154986 147859 144778
9050 144778 136176 142188 162109 172581 174632 161297 150704 136871 140824 149429 146062 140832 132355
9037 132355 130473 129480 124977 122427 117862 128201 133986 131549 130488 135479 141042 140565 129698 117090
9023 117090 114993 125513 132803 131682 116626 108496 126159 132137 110837 96414 96377 98563 82409
9010 82409 71969 81891 73573 71945 76246 83649 85718 75351 84425 90518 92421 97212 92883 89979
8996 89979 94454 89360 70508 56690 62445 67977 63191 62739 67456 62363 54498 59636 66018 66654 73073
8981 73073 66489 64224 59803 73761 74710 63010 49291 37399 40889 41729 48224 59484 48740 31607
8967 31607 20490 21722 39496 47301 64082 58359 46441 55909 49975 49797 59971 58126 54218 57193
8953 57193 62314 61801 63082 55438 50172 49619 45851 50947 50225 42436 33203 27036 25818 30429 33459
8938 33459 29017 19979 20166 26519 25837 24037 21411 37057 32132 24882 37795 44474 52336 59518 62300
8923 62300 54735 47443 59349 57865 60641 50817 44710 33848 38947 29975 36733 47543 50726 47025
8909 47025 42906 40459 36690 37345 35303 41497 36810 21363 28454 36079 42553 21816 15881 20446
8895 20446 25505 37471 38487 48772 57861 49886 43477 49595 41037 34727 40155 40130 34591 29704 35192
8880 35192 35791 30598 28336 20887 18673 22662 38890 29463 22992 19142 27613 29125 33804 49638
8866 49638 51425 32021 15500 27005 46659 38878 32749 29541 39707 35496 36440 33383 33636 36833
8852 36833 29506 17801 21613 31449 25419 17188 10091 20227 30498 40184 24970 13704 -10904
8839 -10904 -2711 4947 13752 4026 14518 42881 45140 33625 28595 30816 33796 30758 27420 27747
8825 27747 23562 15148 10360 14487 23006 13690 16791 17505 8701 8531 3322 7345 4905 -3785 13493
8810 13493 26196 31848 17917 -99 -2976 6742 13250 20632 31686 35679 30997 31201 28904 15710
8796 15710 16223 31084 42405 52515 37340 22122 28361 27897 21506 14564 24621 31832 34342 33833
8782 33833 23248 8492 10446 8007 9267 23253 28722 33460 49396 57171 50288 35527 20567
8769 20567 25582 20447 27203 31676 30982 34720 23732 11031 2384 -1390 -732 7811 93 5502 5053
8754 5053 7482 25875 37828 48446 51888 36153 18482 5602 -4678 -11783 3218 12425 7001
8741 7001 7838 15149 9655 16691 24084 10898 -8400 -4999 -3865 7002 10270 1991 13647 4836
8727 4836 7399 13506 24780 15296 1778 6507 16671 25477 21617 20592 12240 23694 26356 5160
8713 5160 -4085 -3238 -2191 -1358 -1777 5995 6003 8483 -1608 -10022 -5596 -11362 -11149 -308 8326 13707
8697 13707 25487 30724 33097 30278 26097 22071 9851 3019 4595 -1317 -6974 -2071 -6995 -9328
8683 -9328 -1698 2565 1403 3125 -3731 -4698 2225 10772 4439 -3401 -1552 3873 -10470 -2293 -3477
8668 -3477 -6966 -7357 -734 17362 18124 14812 14592 12421 5006 16386 6624 -1612 4091 7979 4710
8653 4710 8714 23891 30098 20465 33525 44865 29726 30985 37172 34525 21590 28871 31640 26038
8639 26038 30184 29013 17812 11421 -1181 -2709 -49 2310 2741 3029 -3875 5387 -13259 -19802
8625 -19802 -12175 -7463 1506 8388 1298 14524 33010 47484 52529 42926 53516 42834 55880
8612 55880 70528 66551 62748 62712 66492 56701 43715 36812 25612 32402 30222 29124 20863 9932
8598 9932 13719 17012 16494 -1013 -5142 4819 8906 8808 7940 3396 -3310 -9507 -9281 5782 17672
8583 17672 12235 10292 332 5604 13052 21165 30539 31880 28166 20166 16607 31371 59507 72365
8569 72365 75484 60796 58972 51115 43784 46851 55212 58277 42070 27958 7074 3988 12246 23767
8555 23767 13566 9958 14178 12630 15003 14889 19112 12895 6901 11706 17290 10994 6201 2194 -2723
8540 -2723 7585 16301 13810 2334 7690 22000 26109 24742 19569 13440 8063 2419 12319 19897
8526 19897 19416 8288 7688 11854 4304 7055 16232 16878 23421 30336 20338 4890 16499 12396 10776
8511 10776 10893 -1033 -6564 636 -6944 -14062 -29482 -28821 -21403 -2097 5519 -3228 -4409 -5293 9676
8496 9676 10720 -420 -1097 -9050 -17166 -9341 -17052 -11356 -12121 -10473 -10831 -8921 -1449 -12823 -10523
8481 -10523 -6113 6386 11692 11841 13880 13913 13919 17023 6446 3561 17252 24658 24923 21455 20756 968
8465 968 3364 6188 17364 22053 20511 16647 5853 5842 4743 -4504 -6322 -3259 -1258 -8257 -7632
8450 -7632 -8402 4527 4212 -1937 -9780 -7235 -2345 4026 -187 5747 971 -7463 -22757 -27203 -2449
8435 -2449 -2961 1315 8690 18666 33421 26135 21669 18386 28068 22874 -3359 -5803 5936 1406
8421 1406 -16128 -3649 8723 4944 8121 15675 31863 28973 16740 19846 30844 31179 13162
8408 13162 10330 7375 -3067 -6902 -832 8876 7325 3527 7768 -4917 -276 14051 17306 4967
8394 4967 1845 10794 13662 4601 16280 28530 41054 41748 48450 60017 67675 70301 69665 86079
8380 86079 99377 78182 66446 47283 26955 23669 27978 14142 -3495 7113 21709 18374
8368 18374 10207 12136 9294 10885 24256 19065 6335 8348 15089 8322 8375 3303 1666 17208
8354 17208 29144 28014 16119 9064 -7447 -4725 366 2131 8686 22387 31236 62960 96915
8341 96915 119678 124285 134475 141653 148401 159885 151915 128177 95585 60163 32868 12334 2558
8328 2558 -1964 -11565 -16733 -5627 14923 19948 10059 24446 44448 63536 66822 61415 57283 40014
8314 40014 25826 39882 49124 48869 43922 38282 46684 47129 34472 29065 38476 34752 32784 41871
8300 41871 43510 45351 47387 61317 59015 61182 65125 77294 92429 87402 79340 68209 61893 42190
8286 42190 16078 6685 -3299 3835 19034 25986 19203 16863 13717 -4140 -13007 -17797 -10719 -1282
8272 -1282 2185 22557 41335 42040 54964 59462 55524 58788 44530 31736 19388 10828 8834 11842
8258 11842 5116 4822 947 -2340 7240 9207 80 8803 9550 5160 20786 30793 25540 9076
8244 9076 14130 9483 14689 11506 6881 442 -729 2444 20443 18857 6607 1272 -992 -708 37
8229 37 -3503 -7604 -9652 9962 6675 -480 4832 6870 4868 -14288 -32217 -36386 -30987 -8044
8215 -8044 -3408 4897 4868 -11516 -8428 2910 2767 -1003 -1522 -5521 6103 20628 22224 5977 11435
8200 11435 13199 8397 -1625 -14148 -12598 -103 -2582 -5976 -13996 -19439 -18579 273 4176 -2010
8186 -2010 -2423 -1718 7598 -704 -14230 -9799 -913 1453 -13139 -16130 -3820 -1627 -9560 -18726 -20964
8171 -20964 -31318 -23323 -16965 2757 9234 13839 16915 4068 -3577 988 -161 2368 15679 11852
8157 11852 -12125 -21080 -19839 -11718 -7873 -9449 -3282 -15740 -18858 -8691 460 -10146 -13654 4457
8143 4457 8728 10353 13743 7397 33 -7935 -7354 -3982 -3164 -7915 -4297 390 9705 9154 2255 2521
8127 2521 4366 1122 -4905 -2986 -2991 -11063 -10564 -7971 -1977 3680 1945 -8919 -16243 -9948 -10243 -10971
8111 -10971 -11532 -13642 -16285 -11473 2930 5680 -3589 -10013 -13200 -13152 685 -9215 -5499 -775 -5151
8096 -5151 -981 1527 -11495 -24058 -27035 -23631 -18870 -23427 -29382 -13353 7744 1930 1493 6421
8082 6421 -392 3060 -6214 -6162 -3137 -5796 -14289 -4508 -5100 -5226 -9687 -11978 -1290 5366 14445 13748
8066 13748 17743 12493 12554 1266 -3902 -2434 -1033 12835 8482 -1282 790 12665 10885 474
8052 474 -21727 -21992 106 10820 13039 18270 11226 2591 -7163 -10760 -4601 2424 -1824 -3459 8134
8037 8134 12761 20888 16155 6375 9596 7012 1806 -9217 11050 34875 30351 28145 9480 7872
8023 7872 12675 332 -13547 -9508 -2746 5799 11150 4966 -1823 4347 14486 7383 3009 2993 -37
8008 -37 8007 3685 4971 -7875 -4152 -3858 11420 16396 5910 10784 27686 26190 13666 13936 10512
7993 10512 4632 6498 1882 10456 14384 12351 19365 15558 -2115 -14030 -4095 3644 -8821 -1066
7979 -1066 -8938 -11745 4022 7970 -12649 -10848 2266 -2747 -7281 -16615 -12700 -14465 -16012 -8385
7965 -8385 4121 -3981 13390 27394 18403 21001 18272 16415 7962 9399 12008 7705 3340 837
7951 837 -228 5705 19121 17434 -651 -9363 -6497 8725 23351 9944 3067 -6458 -6082 600
7937 600 -5670 2682 1999 -202 4632 8069 210 1818 -3471 -9425 -7119 -11945 -10364 -9466 618
7922 618 5133 -960 -4451 -6530 -4989 -19757 -8705 -3618 -5683 -6417 -12758 -13237 -8528 -20040 -2611
7907 -2611 -761 -3404 9719 16524 1927 -15366 2176 12899 -131 -7790 -12448 -17788 -11839
7894 -11839 -7737 179 -2556 8508 7177 -2433 -5324 -7440 -17112 -9316 337 1515 -11705 -20302
7880 -20302 -32017 -38614 -17881 1572 7171 2849 -18039 -18676 -19963 -23702 -20516 -9825 13027
7867 13027 15705 11449 9145 -310 -6475 -399 274 -12645 -10335 -1014 -3893 -16420 -18790 -8247
7853 -8247 -12781 2838 12514 15790 13160 -8396 -22856 -10448 -9966 2549 3045 18109 19624 16972
7839 16972 12328 8311 7065 573 -10696 -16380 -3085 8948 -12007 -7752 7640 -7311 -12706
7826 -12706 -25404 -12861 -11305 -36438 -33887 -23528 -13763 -17342 -24424 -24695 -18383 3411 -84 -16864
7812 -16864 -18187 -16186 -16571 -15832 -6224 929 -2405 -14318 4316 -1508 4630 21793 13656 9111
7798 9111 12532 1541 -15426 -17689 -18637 -17041 -18649 -18867 -20227 -12309 -7357 -6068 -10175 -7428 -10582
7783 -10582 -483 2850 2401 -6294 -7653 -382 -1785 -836 8461 7361 -4615 -9736 -730 -4623 -9579
7768 -9579 -8668 -6013 11789 4342 -6020 -4025 -3180 -17966 -25732 -15659 -9813 -8507 -12722 -14649
7754 -14649 -12333 -347 8420 13925 10526 12093 -2809 -2729 3042 386 -9043 -8019 -12317 -5773 13359
7739 13359 9703 4398 -10477 -17474 -16274 -6819 -4697 -7714 -19506 -18714 -11697 -19399 -32949 -26643
7725 -26643 -1478 3923 -6988 -8102 -15201 -22361 -20091 -4428 11728 24387 25396 10126 12003
7712 12003 4894 5232 -6941 -16659 -18203 -17255 -16508 -12572 -12777 -9650 -4099 -1954 2243 9938 10079 -4413
7696 -4413 -17413 -13069 -9002 -19365 -30361 -16292 4228 80 6011 10036 6657 -8187 -14215
7683 -14215 -26224 -33682 -30959 -15350 -11118 -5792 -19804 -22830 12328 9606 -10930 -11016 -11584 -10793
7669 -10793 -10442 -12156 -13079 -14410 -20675 -18610 -24452 -22293 -14696 -29737 -30399 -29019 -22524 -19358 -13851
7654 -13851 -13532 -25220 -23219 -21265 -17058 -25060 -40733 -28756 -9904 -931 -1623 1994 -9989 -2008
7640 -2008 -1708 6466 10275 3734 3575 5774 7204 3853 2524 1177 -5331 10708 31922 26630 8448
7625 8448 8065 6034 11390 -1444 -4112 7302 1805 -8417 -12368 -11129 -9891 -13133 -14648 -23074
7611 -23074 -21346 -24827 -13295 -1059 -847 2596 -6290 4102 12726 5416 -5039 -5362 403 -7094
7597 -7094 -10968 -8233 -19830 -28524 -15533 -257 -3394 -8314 -8907 -20259 -22407 -28771 -27532 -19364
7583 -19364 -24334 -19880 -11953 -5356 -8454 -9282 -14015 -10310 -10578 -19191 -3551 562 -9286 12885 17649
7568 17649 8198 7200 18896 17765 16451 13226 11651 568 -17770 -29149 -23224 -19817 -18138 -8943
7554 -8943 -7071 -6145 -10037 -7968 -16473 -26796 -21195 -5601 13434 22552 29114 14099 -2238 -3235
7540 -3235 2485 -6955 -16475 -25825 -23577 -15471 -11671 -10308 -1020 -13147 -9270 13539 14165 7334 9798
7525 9798 16916 17451 14729 17579 6129 -3274 -14046 -10783 -5718 -5286 -5594 -10129 -17507 -14447 -21153
7510 -21153 -13023 -15229 -15701 -13913 -5363 -2540 -6531 -24240 -13842 -5004 -5554 -2459 3247 1458 1604
7495 1604 -18926 -22966 -6447 -11292 -13876 -4821 6528 -515 6363 -1495 -3714 -9318 -13807 86
7481 86 1925 -14565 -16696 -21423 -26225 -17731 -12510 -9607 -5016 -8933 -7676 -4657 -22587 -28581 -17313
7466 -17313 -16172 -28324 -21746 5768 8686 2807 -8194 -14595 1271 11604 11964 -446 -17525
7453 -17525 -23462 -7966 12918 7414 2072 3146 -5635 -15409 -21699 -11041 -17479 -33336 -39089 -42187
7439 -42187 -50072 -54296 -51587 -39775 -30438 -9726 -23101 -37759 -25473 -18217 -7664 -4615 -11413
7426 -11413 -18249 -21833 -10672 -17815 -21944 -16928 -21811 -19048 -23195 -29219 -27900 -10262 -9002 -918
7412 -918 -4841 -10795 -11701 -10352 -8125 -5197 -205 -2773 -11759 -17003 -17042 -5318 -7462 -4738 -5238 -10649
7396 -10649 -12198 -20054 -20140 -11924 -8625 -9978 -17018 -16180 -21917 -10843 6597 5803 48 -2981 7319
7381 7319 -1997 -9921 -18814 -11882 -12103 -13954 -25684 -30529 -21776 -24544 -16954 -10886 -354 511 8521
7366 8521 3644 -4057 -11724 -11338 -1949 -2133 -16871 -21086 -10777 -625 -8246 -17699 -9735 6385
7352 6385 4875 -9626 -25833 -25129 -15585 -21198 -22498 -7677 2469 7895 -1555 -3647 -4557 -1871
7338 -1871 -1171 -6539 1345 13385 -3882 -5941 -16155 -29287 -33113 -25785 -23363 -10102 -4212 -3784
7324 -3784 -14453 -10437 -12356 -13667 -14397 -4618 6044 8294 -206 4090 9044 17304 18689 22541 16227
7309 16227 10978 13401 8620 -912 -2398 -10439 -18789 -15813 -7157 -3451 -16367 -16899 -10630 -9802 -16170
7294 -16170 -19428 -11972 -15500 -18970 -12304 -14240 -18519 -15080 -8322 -5228 15412 23535 15091 6852
7280 6852 4342 -7921 -15133 -18482 -3105 14200 15056 -156 503 3750 -1933 -3439 -14669 -20150
7266 -20150 -10701 853 9153 18031 14578 4268 7341 8724 -3697 -13410 -14092 -15567 -12338 -9066
7252 -9066 -7339 -21519 -24103 -11832 -4010 8169 1374 -164 -2379 11258 12219 4518 112 -11338
7238 -11338 -8887 -13783 -11965 -16482 -19631 -12340 -20989 -11735 5067 -9504 -13871 -13489 -15175 -17494
7224 -17494 -22445 -20467 -16856 -4844 -2554 -5262 -6311 -11557 -5834 -11058 -11368 -4293 -3254 -10316 -23681
7209 -23681 -20326 -14849 -14808 -13881 -19623 -23142 -10006 -5269 -5814 -1636 -2456 4780 10701 14612 20295 12330
7193 12330 18047 23531 19312 12577 -2657 -12963 56 11190 508 -16428 -23555 -6837 188
7180 188 12219 7583 -3125 -5626 -15994 -9854 1257 6157 11521 14360 15590 -9182 -16977 -3956
7166 -3956 391 -7890 -10555 -21678 -37395 -32096 -19837 -14128 -15839 -27714 -24884 -17356 -11800 -2616
7152 -2616 -934 483 -1120 -11767 -13243 -20939 -9666 -1661 -10018 -20405 -23479 -27089 -24969 -29844
7138 -29844 -33048 -26658 -23906 -22601 -22288 -39240 -40734 -37869 -29927 -29465 -23808 -18650 -22077 -35286 -35597
7123 -35597 -33963 -26411 -19417 -661 652 -6509 -6458 12 -6412 -13623 -13840 -5617 -13310 -24956 -27647
7108 -27647 -25524 -28357 -29760 -13219 866 7187 22273 -1786 -22532 -16283 -9495 -1648 -6410
7095 -6410 -16329 -25741 -31708 -25572 -12226 -17906 -13179 -7641 4179 27092 27869 16605 -4383 6190
7081 6190 10922 -1037 -12116 -2469 -279 -3075 8112 8499 13091 12453 7878 8233 3437 -9099 -12360
7066 -12360 -20262 -13950 -26090 -28150 -28519 -23144 -17017 -9042 -5879 -24139 -21575 -11237 -19742 -16369
7052 -16369 -15132 -24782 -21992 -14629 -6179 2648 18231 28195 19422 -4748 -12504 -9744 2444 14453
7038 14453 11689 -14708 -30643 -24332 -15069 -7365 -9365 -403 21379 20779 7556 -10323 -4600 -624
7024 -624 -2131 -6614 -6726 -3170 2650 20813 15870 8438 14573 9714 15055 3465 -6348 -834 -10939
7009 -10939 -11422 907 11948 11987 25156 31845 19606 -5557 -14070 -14986 -19783 -9545 2161 -2376
6995 -2376 -11776 -4463 11458 18163 10455 -2639 -27369 -21906 -14973 -25505 -37620 -36437 -35747 -25717
6981 -25717 -25128 -32742 -20206 -9635 -1443 2055 -6654 -5053 4777 2584 -2776 -3272 -9816 -13738 -14085
6966 -14085 -8464 3277 709 2051 -63 -7744 -16805 -26231 -17705 -20345 -9344 -9239 -8822 -15903 -18693
6951 -18693 -6524 -5296 -9155 -11786 -15337 -18842 -12806 -9587 -350 -9613 -12592 -19202 -25094 -10074
6937 -10074 -380 -6685 -2139 -13896 -21251 -10296 -3133 1514 -14327 -16606 -1958 10223 15162
6924 15162 15313 6174 -9817 -3513 5067 -2768 12190 13696 4310 -7280 -12111 -3474 8001 11217
6910 11217 2628 61 -821 214 -10398 -32149 -20415 -5915 -11407 -17413 -6183 -5277 -6239 182
6896 182 -5234 -8534 -18171 -14842 -7049 -2316 -3339 11322 6752 7308 14642 25003 28878 12215 -7111
6881 -7111 -20100 -14727 -25808 -37756 -23865 -16640 -29248 -33385 -29508 -19107 -18621 -19903 -17251 -10302
6867 -10302 -9775 -20042 710 13743 29657 18257 -4398 -13580 -24454 -15584 -7402 -5664 -11602
6854 -11602 -5605 -346 -4712 -19395 -14797 -12442 -8680 -4777 -13762 -16581 8605 10645 12670 9405
6840 9405 -1350 -9562 -13664 -8229 -6850 -1770 3097 4051 -15736 -39392 -31515 -28605 -23709 -16335
6826 -16335 -7862 -1448 -9535 -19693 -28624 -26030 -15126 -10239 -4809 2428 -960 678 -3848 13808
6812 13808 14812 8635 9089 29537 24780 18178 9427 550 -22538 -20191 -14336 -8121 -13733 -21912
6798 -21912 -10833 3378 1870 2646 -7545 -17687 -28773 -35542 -28343 -16087 -10363 -19072 -18169 -8738
6784 -8738 3556 5689 -7071 -21527 -21318 -11442 2324 -855 -16669 -14594 -655 5129 15124 19871
6770 19871 12850 5980 -6317 -8402 1140 -4598 6897 8117 5207 1278 -950 -943 -3752 -473 1408
6755 1408 8093 23723 25224 17673 15028 12946 7119 1709 16307 23264 16814 19722 19392 11544 10052
6740 10052 -6971 -21067 -24729 -25663 -21414 -8522 1271 -8259 -22081 -19527 -6914 -10286 -2516 -10348
6726 -10348 -17434 7737 16239 8580 -4097 -1045 1403 1039 -13300 -20906 -19694 -9917 -10014 3803
6712 3803 6129 858 2281 10834 6282 -4020 -560 590 -4400 -5544 -10877 -5680 1877 4633 557
6697 557 -3409 -2548 1646 -1004 -12570 -7248 -7308 -8253 4735 14594 5392 -9880 -3922 -14490 -24191
6682 -24191 -11318 -1159 -6877 -9228 -14659 221 15070 22537 8182 -12672 -11482 -933 -78
6669 -78 4018 -12671 -14838 -7207 -4928 -1990 -6447 -932 -4022 -4600 -4709 -2537 6796 3882 -6098 -15880
6653 -15880 -10828 -16092 -14728 -16983 -10821 -10156 -12895 -10968 2732 3309 -7080 6910 9887 -7998
6639 -7998 -16037 9788 19125 5651 -16691 -14279 -31228 -36234 -16863 1610 6042 5374 1634 -6468
6625 -6468 3745 2765 -9566 -11207 -19504 -15909 2925 5846 -566 338 880 1244 8669 10679 -2553
6610 -2553 -16742 -16149 -14370 -27689 -31063 -25992 -20142 -9080 -22153 -22999 -18561 -14680 -13236 -11957
6596 -11957 -9946 -23097 -21470 -12419 -18286 -24401 -17504 -11456 -10205 -16148 -23350 -8761 -1983 1846
6582 1846 -7353 -20916 -18019 -3014 -11763 -19136 -13172 -7587 -7425 -3349 -3920 -7331 -19652 -14787 -5874
6567 -5874 -12200 -22798 -19912 962 2642 2441 463 -4767 -3888 9264 10943 -5726 -24874 -34103
6553 -34103 -34916 -22434 -13452 -25234 -30974 -26702 -34751 -25121 -4755 -5053 -5516 -8249 -870 1088 -15460
6538 -15460 -24077 -26185 -13512 423 6413 -1087 2600 455 -4593 2273 -2640 -7327 -9541 -18372
6524 -18372 -17343 -2155 3246 -1522 -13023 -7037 -290 3257 -9447 -34464 -43832 -40842 -14835
6511 -14835 -3170 1175 -3824 -9861 774 -2519 -5293 -1573 6130 9336 18266 22689 17152 -5527
6497 -5527 -14015 -4948 7376 25389 29446 17864 1936 -7236 -28944 -47427 -32473 -9537 -5979
6484 -5979 -12512 -8957 1905 15200 11188 -2775 -6440 -9949 765 18010 10133 1705 -10739
6471 -10739 -8420 -12240 -1999 5152 2806 -141 -3072 -13923 -4767 189 -8634 -5059 -5708 154
6457 154 -2065 -14015 -17678 -31657 -28451 -22344 -19696 -5700 -8354 -2104 11340 13656 15530 6820
6443 6820 1224 5237 1051 4551 -124 -1318 6928 10521 11517 10480 -1538 -3637 3212 1822 -13578
6428 -13578 -19884 -31380 -29016 -22266 -16408 -24975 -23705 -4388 -5301 -14726 -15012 -7697 -6090 4079
6414 4079 807 -17903 -27948 -25045 -13698 -11758 948 -5754 -7955 -6919 -2364 -7125 -11953 -22405
6400 -22405 -22519 2222 20891 23124 6617 6625 5437 1407 2896 -14794 -7979 6323 -3746 -17802
6386 -17802 -25437 -20366 -10160 -3795 503 -8448 -21473 -24227 -31840 -28146 -10780 -11825 -11138 4807
6372 4807 10143 3338 -4872 -6826 -2489 -5977 -8029 -16630 -14642 -21234 -25822 -10704 -9265 -14237 -19098
6357 -19098 -17387 -2110 9649 14036 7302 20438 20073 10993 9642 6514 -2590 -8846 2848 -9269
6343 -9269 -20788 -21852 -23593 -7924 4482 10088 10994 10953 18059 4485 -8097 -15302 -24468 -31067
6329 -31067 -19039 -11833 8040 17157 20698 20270 14659 6356 -3238 921 22421 33238 17410 -6426
6315 -6426 -7139 7160 13346 8472 3083 6602 13476 26952 29624 37362 30029 22318 9592 788
6301 788 9492 -5949 -20184 -26069 -19112 -5988 1268 -1243 -4306 485 -4340 -3656 -10297 -7399 -539
6286 -539 9230 3043 -10586 -13382 -22437 -24665 -21883 -3264 7520 -2804 704 1920 -8731 -23550
6272 -23550 -23523 -11528 -18234 -15577 8598 16182 21515 20843 4166 178 -2049 -213 2800 1532 2036
6257 2036 2089 39 -2892 195 545 2685 -2072 -7431 -13492 -7581 -6199 -14342 -9826 -9117 -3903 -5972
6241 -5972 14948 16756 -6367 -14674 -13380 -16162 -18598 -11334 -22353 -18609 -18022 -11277 9176 14411
6227 14411 8323 6930 17453 12289 8980 2403 -7552 -23405 -11975 -9483 -17728 -18898 -19774 -15102
6213 -15102 -10665 5325 14603 4770 -14768 -7298 -13803 -9940 -12037 -900 -8658 -9849 296 8392
6199 8392 2391 1276 -8063 -10312 -4884 -12001 -19795 -9575 9354 16108 26152 14377 -10471 -27881
6185 -27881 -22599 -1438 11869 -3503 -15086 -9861 -13354 -2081 11237 9935 2189 5166 10355
6172 10355 1430 -11077 988 13383 2273 61 -102 -23476 -24744 -27264 -20250 -14004 -7794 -11549
6158 -11549 7265 4163 -7263 -11112 -6529 5294 11254 6349 -2907 -15333 -21855 -15123 -22421 -23004
6144 -23004 -15686 -6233 382 15047 21966 19243 11962 14799 22782 13041 2357 -1363 -13062 -23114
6130 -23114 -9037 -4499 1590 14008 5526 -4687 538 13169 16513 28008 37605 38174 16564
6117 16564 2534 -3603 -4510 2902 4789 8753 -4889 -4191 4214 -3617 -2150 405 8654 21477
6103 21477 18126 6941 -6565 -9426 -8482 -13613 -15552 -14197 -21660 -24014 -16486 -19767 -14251 -4375
6089 -4375 1574 2701 -3344 2416 -7630 -9659 -5795 -6966 3722 14912 7201 -9096 -11531 -1835
6075 -1835 3652 -5687 -2695 -18084 -29327 -19513 -10396 -8896 -12389 -7499 -5837 -1546 -5591 -8238
6061 -8238 -2135 13725 11363 8752 9114 8250 9259 6374 3828 -3451 10745 24381 17718 9282 4915
6046 4915 -1119 -4304 -17177 -19412 -18560 -7738 -2848 -4275 -5914 -13403 -23932 -35005 -23477 -16740
6032 -16740 -8738 -8183 -12646 -14688 -21194 -36248 -21448 -9980 -23504 -25163 -14513 -9148 -12048 -6045
6018 -6045 -2838 -1322 7291 1578 -12048 -13902 -3897 -698 -12854 -21356 -21404 -15959 -11856 -9084 -10101
6003 -10101 6150 14400 14828 22474 18912 12314 9633 5325 6802 9531 4121 15882 5433 -17074
5989 -17074 -21333 -20885 -17009 -12529 -4151 4371 12693 11329 -9433 -18421 -18141 -12585 -16209 -17923 -16704
5974 -16704 -17512 -17016 -11814 -1094 2321 1371 8298 1558 4578 2285 -6219 -10264 -12405 -13745 -17088
5959 -17088 -12989 -11490 -14144 -1724 4059 1036 -1483 -8806 -15470 -18436 -8393 -13033 -13565 -10715
5945 -10715 -11577 -2473 9317 5216 -6512 -15860 -15082 -8619 -18265 -21024 -18568 -10766 -8829 -15401 -17589
5930 -17589 -13917 -8404 -5319 -4132 -66 -914 -4474 -13322 -6085 17099 23578 18215 8379 2847 -2475
5915 -2475 -8790 -11459 -5161 5018 3047 521 -6550 -12214 -1829 5863 133 -3864 1298 5343
5901 5343 11841 8624 3183 1915 -7986 91 17429 26992 24714 21499 14923 14760 21568 8954 -3137
5886 -3137 -2431 2503 -2160 2400 10754 9208 11788 6475 3411 -3388 4249 8583 5393 6098 -8984
5871 -8984 -13866 -2647 -7052 -13171 -19310 -13259 9691 9606 6044 33 -3403 -3146 -274 835 -8584
5856 -8584 -16194 -29319 -36220 -33683 -40578 -26012 -25960 -19949 -17874 -16167 -16301 -8285 -6975 -6683 -3614
5841 -3614 -15400 -23544 -27379 -16582 -9153 -9786 -6143 -4143 6629 15275 13572 1015 -14094 -13930
5827 -13930 -15083 3573 14495 11221 8706 8411 2675 4072 14459 19972 15711 17855 7520 -3049
5813 -3049 13689 21878 24156 18457 5711 4560 1698 7510 16495 9718 3071 -1253 -22339 -25081
5799 -25081 -15357 -20589 -16215 -15697 -22011 -13426 -8744 -10644 -15049 -19417 -7140 -10907 -11896 -15473 -16149
5784 -16149 -26352 -21116 -13404 -13094 263 4091 6701 9896 14245 6091 2986 16947 14389 1672
5770 1672 -4002 3999 5439 -672 -8685 -10097 -21023 -27120 -22335 -25034 -10123 -2997 7293 9997
5756 9997 8047 -618 -844 -3427 -3452 10967 6925 -3543 -10853 -19297 -12135 -4324 -7409 -7697 519
5741 519 5468 10937 -930 5841 9068 10277 -1700 -12574 -13137 -12016 -15280 -13509 -7286 -2118 4561
5726 4561 1479 -2351 -3844 -7878 -12850 -4744 -14601 -31166 -28726 -18964 -2758 1348 -783 -11310
5712 -11310 -17440 -15179 -11483 -1100 -20639 -30973 -21447 -6815 -13711 -7735 -13828 -18477 -8814 8026
5698 8026 14261 29388 41062 31050 10048 6437 6659 12435 18770 3050 -6350 136 -1792 -15558
5684 -15558 -16086 -19243 -10714 -8305 -8337 -1897 9891 9983 6966 3554 -3197 -18790 -24606 -16157 -7691
5669 -7691 -7065 1476 -8927 -24805 -13662 -22 -5630 -9928 -787 -3565 -9327 -10506 -12757 -7440
5655 -7440 -13035 -7811 -9037 11193 16056 10147 1478 6569 1753 -7416 -9832 -2149 -2815 -3795 15108
5640 15108 16646 16276 9601 1813 -3315 -2153 -4370 6618 7976 -961 -8351 -19636 -13832 -3785
5626 -3785 2037 459 -15969 -24752 -34167 -33007 -30737 -35558 -36574 -21513 -10956 -9892 -5367 -7007
5612 -7007 -5533 -10060 -15479 -14800 -10100 -4700 2803 10981 10980 28188 33696 27104 22356 20293 14229 -7328
5596 -7328 -19862 -13816 -3753 -9480 -10816 2660 7850 -6372 -18044 -15194 -9828 -6410 -4174 -11562
5582 -11562 -21597 -16426 10508 28781 31447 25893 14260 1301 454 10559 5657 16058 9453
5569 9453 9511 13986 15422 13078 6313 2499 -9477 -11289 -5714 -6250 1213 876 -11280 -10581 -9967 7728
5553 7728 24490 27547 18172 27814 24295 7848 1338 1119 3119 -8028 -10296 -12310 3307 4454
5539 4454 10652 12829 220 5301 15303 1132 -11600 -15613 -13235 -13281 -7400 -1028 -629 -11726
5525 -11726 -10492 -17951 -25577 -28627 -20281 -23020 -17207 -17430 -5496 8517 9673 11195 20435 18911
5511 18911 14517 19866 22117 16507 18029 9417 11688 7639 1427 -5128 -16752 -5311 3447 7141
5497 7141 4711 -9752 -16207 4250 9145 -4647 1620 11298 3035 10581 15687 5739 308 -8858
5483 -8858 -1076 504 828 -13265 -10139 -13131 -17505 -19843 -16228 -3879 12803 8927 1934 -8925
5469 -8925 -20216 -25475 -19391 -26051 -29773 -23349 -28448 -24774 -19821 -1148 9954 5923 -5551 -9301
5455 -9301 1346 8790 13366 -887 -13655 -6767 -1934 -2244 5741 3732 -7275 -4177 334 -11984
5441 -11984 774 13686 12905 693 537 133 -15744 -29117 -24530 -21539 -31398 -26780 -16069 -13589
5427 -13589 -19500 -8199 4723 2824 2578 677 10316 18082 13137 3976 11689 14245 -5167 -14973
5413 -14973 -23973 -27243 -20000 -14940 -21551 -35565 -29819 -16245 -6497 8518 10732 9647 3059 -6511
5399 -6511 9830 11945 8043 -6586 -14659 -27646 -28665 -19092 -20043 -7051 16843 27361 11813
5386 11813 10583 15257 8511 2242 3008 5045 -5118 -17005 -26824 -24412 -30388 -29052 -21073 -18481
5372 -18481 -7128 4727 3019 782 -5237 -19114 -15519 58 2536 11673 19280 15266 8419 -13292
5358 -13292 -29133 -17940 -11723 -4788 2587 15840 3601 -5693 5275 45 273 14027 10384
5345 10384 10249 9661 1479 9017 6447 -1337 3960 2231 1771 6393 8975 9601 8948 5819 -3386 4257
5329 4257 7739 -6838 -7800 -2217 84 -9475 -13916 -4577 -2408 -233 -5336 -8986 -9919 1256 685
5314 685 -9833 -16532 -6490 -13196 -9418 4782 17471 3893 -3255 -2121 4403 6400 971 3762
5300 3762 9284 1189 4170 6281 -7428 -20310 -31054 -31141 -17565 -4135 -118 574 -4362 -5340 -16422
5285 -16422 -19753 -11594 -5774 -3226 -8989 -16676 -9999 -3009 9109 10284 3631 475 1632 5495
5271 5495 13362 25755 35689 15279 9324 -620 -15982 -25417 -21294 -16623 -12496 -26905 -19973 -3517
5257 -3517 -7247 -7226 1111 138 -12994 -24441 -28897 -20137 -18971 -11112 -5938 -5338 -14253 -23345 -22692 -8017
5241 -8017 -13159 -10537 14188 14229 -163 -14297 -11914 -15959 -15384 -22752 -34036 -29188 -29511 -35988 -34716
5226 -34716 -30341 -29456 -10348 -6333 -9033 1847 1317 -3583 -19041 -12180 -8616 -6416 -7285 -9731 -20938
5211 -20938 -18563 -18638 -10665 10513 14806 20070 16928 9618 -3977 -4938 -1926 4329 12078 10050 -2166
5196 -2166 -6870 -7156 -23031 -32252 -17317 -7158 6413 11311 -17553 -10681 169 6735 12221 7145
5182 7145 2600 5115 3001 2418 -5093 839 16386 19024 298 -5147 -15 -690 820 465 953
5167 953 17764 24251 13454 16597 9680 3993 6053 -5055 -7348 -4102 -1419 7937 -2389 -4603
5153 -4603 785 3988 -12087 -14262 -8359 -11398 -18207 -18912 -20015 -15246 -13168 -19441 -26019 -21982 -13942
5138 -13942 -14011 -10623 -14234 -10270 -17326 -23604 -20932 -8024 1901 -2996 -19774 -19234 -3751 -2654 -11386
5123 -11386 -10885 -5682 -6546 -17025 -16696 -13841 -13800 -9251 -10473 -19927 -28285 -18902 -17783 -28529 -30397
5108 -30397 -17791 -7986 11368 22445 15240 5274 -6035 -15286 -4958 8380 -6663 -13086 -1460
5095 -1460 820 3752 187 -14901 -9433 -1819 -5010 -6483 4703 -448 3630 -28 -4525 -3013
5081 -3013 6682 11533 19117 21531 12117 3483 -188 2398 1794 -14376 -26495 -18173 -3361 656
5067 656 -9640 -21682 -25315 -20456 -1908 5014 2462 -10614 -10328 -4106 -9717 -14776 -13326 -7929
5053 -7929 -12119 -4632 -6020 -1922 870 7299 17642 16081 19148 10400 -1138 703 -398 -2248
5039 -2248 4917 17899 19818 12260 2995 -18285 -35261 -19995 -7657 8990 17528 7651 -7060
5026 -7060 8688 25944 9819 5346 7326 7054 -3187 -7195 -3347 -12672 -10458 -6210 -2737 -3019
5012 -3019 -8210 -8239 -4345 -2374 -4311 1999 4007 -5620 -128 -9118 -3501 676 -3108 -3291 7331
4997 7331 858 -18490 -10133 -16966 -24493 -17931 -14894 1239 2196 -13943 -24069 -22571 -9353 2610
4983 2610 -4150 -2658 14164 27401 28361 22931 509 -8261 -6984 8653 6983 -5300 -5609 815
4969 815 4231 -2757 11798 17511 5870 -5684 -557 -2464 -14932 -9955 1071 -6921 -2410 -5283
4955 -5283 -1677 -10901 -15010 -13664 -22634 -16318 -5056 -5900 -15119 -19412 -2212 6537 1591 -2383 7945
4940 7945 -1784 -222 4448 -1248 -17401 -19915 -19520 -5750 9028 14637 17327 29731 27068 21464
4926 21464 13023 6912 4074 3265 14370 21537 11864 6998 3661 2970 15156 31976 34823 24662
4912 24662 3699 -7503 11390 25258 15412 4733 -2312 286 7982 9093 22580 13383 -2821
4899 -2821 -9241 1083 -3910 -4841 3321 356 4207 13959 13254 -262 -17322 -16954 -6588 2065 5594
4884 5594 4640 2841 7705 14689 22949 18891 10899 7998 -2573 -20679 -29629 -8364 5527 -1727
4870 -1727 -5039 -20812 -20734 -21841 -27055 -15538 -5047 10736 24681 20001 11158 9168 2267 -1865
4856 -1865 725 -4167 -13006 -26243 -27392 -16584 -7920 337 2130 864 6702 10238 4326 -2979
4842 -2979 1159 10678 23255 18621 13364 8407 -2989 -7923 3602 8070 -761 -14983 -11116 -6706
4828 -6706 1150 9387 9867 602 -3112 2380 9948 13021 7227 -11308 -14748 -9477 -1285 -8127 -4730
4813 -4730 -12080 -23238 -12382 -192 15962 3220 -15250 -19102 -8606 1766 19716 30549
4801 30549 30864 32613 21238 7383 8006 6346 -706 -3712 -5507 -5121 965 -328 -35 337 3002
4786 3002 8555 7963 19972 7466 -8041 -2246 7877 4912 -3966 4455 7613 5267 7653 16735
4772 16735 13912 3387 -559 1780 -573 8238 19177 2280 -3605 -2675 -2431 -5381 2599 7898
4758 7898 7681 8800 20686 9213 -9563 -20039 -9619 4832 1419 -3073 -10512 6066 2919
4745 2919 -2447 11477 20933 24333 32638 38808 41292 42675 39179 31223 23470 15891 1978 6094
4731 6094 -5216 -10990 -2632 -5588 -8537 -4423 1583 146 -6297 -2642 584 -3047 -8596 -10157 -2529
4716 -2529 -9405 -8825 -6385 3225 4531 7040 6706 4113 871 3470 -3588 -15847 -11171 -11931 -2483
4701 -2483 -2151 -6260 -14667 -17818 -18466 -5852 17843 17641 6303 -2108 -1572 6005 6574 -5369 -3505
4686 -3505 8538 15231 13203 6356 13245 14301 793 -12742 -12505 -23634 -22104 -18840 -13556 -14268
4672 -14268 -9740 5372 27289 17530 12231 9449 -600 20 -2865 -11053 -15388 -5958 -8476 -15144
4658 -15144 -8477 -1564 -316 -8805 -4173 14943 22850 17420 4175 236 10645 13384 12869 3807
4644 3807 14344 8862 6266 -2895 -18224 -23651 -26954 -16130 -3957 -1023 -10520 -2732 4675 3990
4630 3990 -1686 -8023 -17795 5985 1662 -3680 1705 5271 -1517 4834 -1702 -2509 -3489 -7392 -11231
4615 -11231 -4505 98 -4817 -10481 -15626 -2810 5634 476 8950 1950 -8576 -1649 6751 10257
4601 10257 4413 -11464 -19116 -15991 -15774 -8977 -25403 -22026 -4190 3875 1125 -8714 -10607 -15855
4587 -15855 -10670 -5464 -3513 -135 5008 8381 12077 21646 17971 8404 7053 6674 11573 7954 10293
4572 10293 1324 3080 14258 12753 19720 27598 13384 1635 -4550 -15904 -15962 -16690 -7799 9239
4558 9239 17083 8475 10283 14877 2297 -6371 -9436 -6222 19212 34996 24878 25076 14859 -6936
4544 -6936 -9305 -2718 13535 19766 11871 2805 21809 20636 10817 22806 14828 5008 13669 18436
4530 18436 16581 4987 1117 1009 13468 17575 24488 6638 -408 164 -1613 -1775 -1489 184 -5804
4515 -5804 -9966 -14354 -8794 9894 11523 12037 14228 12366 6101 7141 2051 9411 12361 5893 40
4500 40 -10586 -7336 3431 2968 432 -3721 8913 25138 13573 9869 4514 953 7643 14897
4486 14897 10661 4585 1984 -6806 -8297 -15181 -16790 -12284 -19438 -12362 -6900 -21189 -8889 -1759
4472 -1759 -14616 -21212 -5802 1711 8139 16713 16732 17006 28017 40448 40332 32812 22617 8702
4458 8702 -5503 -2447 1970 -9545 -20976 -32737 -27660 -11889 5725 12333 4727 11051 22737
4445 22737 13137 -6162 -16123 -21851 -7549 -2909 1522 1160 -5009 11482 16620 -815 -15738 -16902
4431 -16902 -20415 -15469 -22605 -16387 -4018 -10741 -17016 -1814 1232 -3849 -4568 7737 17363 9834
4417 9834 4031 2532 6070 -970 10051 12945 20742 9557 6761 10944 -5064 -22138 -23077 -17220
4403 -17220 290 8404 1713 2927 -609 3557 3226 -3093 -187 7937 19060 4450 8255 11323
4389 11323 -304 -465 -782 -16246 -18871 -12407 -12276 -2865 -14126 -24853 -25773 -18150 -18928 -15004 -7489
4374 -7489 6318 12450 13364 16470 15553 1139 10408 11701 7990 6752 13601 16596 17879 21035 25361
4359 25361 35557 27325 22025 24079 36931 26375 2777 -22405 -25036 -7623 -13216 1032 22902
4346 22902 28168 12827 -307 -8847 -20434 -30944 -19880 -5702 19550 21770 19372 11558 -2334
4333 -2334 -6681 -551 -6501 -12171 -25017 -33672 -28330 -12970 -7429 -17003 -19342 -17801 -20492 -13081
4319 -13081 -5551 -2412 -4799 -2335 5713 4774 1204 -11163 6119 24501 24907 33961 30573 13283
4305 13283 15444 22569 2457 -4392 -5472 -11934 -17565 -19232 -13395 -3932 13521 16460 7282 6979
4291 6979 384 2358 161 -5056 -10065 -6212 2031 9981 2888 -5076 -12029 -17716 -9355 -6346 -4460
4276 -4460 -7965 -7478 -8317 7935 10663 12159 13656 22624 16017 2303 9700 17115 18662 22015 22646
4261 22646 22926 24769 26490 9867 -6650 -3954 881 -10888 -16028 -12982 -16678 -15473 -12588 -9673
4247 -9673 -2310 -3037 -8453 -4187 -6067 -8811 1582 15642 10761 -1628 -4396 -10380 -12961 -11772
4233 -11772 -7670 -8874 -2744 3748 10437 16967 13193 3779 1395 11882 8271 2757 -12209 -24087
4219 -24087 -23231 789 10076 8532 -5988 -7656 2981 10415 18278 9896 13180 18484 18855 24683
4205 24683 8977 10801 14914 7257 20762 22614 11363 6157 8159 6209 -5412 -16324 -23168
4192 -23168 -1533 6883 3866 468 -2559 -6700 3661 3352 -2513 -1718 -836 -3739 -11356 -8200 -11185
4177 -11185 -10504 -18863 -15639 2643 8525 10499 3263 3317 -10385 -13189 -6752 7081 4828 -3319 4341
4162 4341 8767 10302 8915 19271 30525 26053 14833 8476 4590 -811 3102 4395 8557 16761
4148 16761 19177 6464 740 -3914 -10352 -10959 -5151 -9237 -11596 -15249 -5087 8507 16581 8438
4134 8438 -2342 -1284 -4403 -14104 -25103 -39729 -29123 -2629 -4746 -1376 -6680 -6532 669 5491
4120 5491 -4250 -15891 -22597 -21595 -8454 -2120 2501 -2214 -6734 -7767 -8880 -11819 -13559 -18651
4106 -18651 -12992 -5188 4164 10911 18508 13273 7756 -6543 -9462 -575 12522 8834 -1414 -4870
4092 -4870 -7623 -10929 10639 19245 9240 -4805 -12075 -3723 1784 4661 7321 -1743 -5754 5383
4078 5383 9705 -3005 -12210 11457 24100 27857 30592 19546 10283 -10674 -15581 -8126 -1582 -13303
4064 -13303 -12418 -18683 -25532 -32156 -36168 -21361 -8729 6685 17364 21434 3134 -10238 -7145
4051 -7145 -4406 -2079 -42 116 -5964 -23308 -20673 -15026 -8250 2877 12540 7960 382 1272 -4543
4036 -4543 -13123 -15381 -11212 -5432 1862 6019 -1269 3328 4980 930 4392 12300 15472 11902 5654
4021 5654 506 11261 21698 17503 7547 627 -1442 7934 20407 29112 44088 41398 16251 -2246
4007 -2246 -10003 8540 13640 10487 195 -2489 -9580 -7859 8144 21808 28346 34406 29177 11691
3993 11691 3613 -13570 -34198 -27665 -25718 -29603 -30426 -27749 -28035 -20010 -9923 -9928 -16153 -15612 -3481
3978 -3481 8333 -744 -2446 -13003 -11042 -1255 -5370 4672 17727 13609 14628 7067 -2256 -257
3964 -257 6958 3725 24567 37131 31576 23571 10423 10452 2982 692 9263 -2602 -8544 -8301 -14199
3949 -14199 -14927 -14110 -18397 -21411 -25360 -22391 -18783 -19819 -18745 -16261 -20033 -9318 -18413 -7715 4952
3934 4952 10926 7055 3981 16371 24688 20156 16494 18562 22275 2579 820 11372 18277 13139
3920 13139 18617 14921 23089 17752 9047 1221 11294 15884 -4461 -9078 -1403 -5509 -15274 -11606
3906 -11606 6566 13569 -3087 -7609 -8374 -7234 -7278 -3053 -14614 -14640 1477 7614 1663 1538 3033
3891 3033 10071 4167 -2411 1794 5039 6333 581 -663 -16093 -11898 6780 5644 4813 -7140
3877 -7140 -17268 -8100 -1922 -12268 -13416 3048 2618 -9157 -16630 -22343 -30660 -20193 -10968 -9553
3863 -9553 -8327 -9648 -4190 5584 -2243 1681 9514 -3566 -12689 -9894 -18907 -17501 -13418 -6602 -1325
3848 -1325 -5217 -12014 -10573 2704 4577 2528 2278 -10352 -9459 -7011 3493 3667 7621 15003 7405
3833 7405 -7762 -10386 -531 6436 3446 3870 13148 10749 5355 13356 8044 -7363 -13990 -6790 2832
3818 2832 10510 7483 -6550 -2228 10954 11878 14616 22656 23254 9269 -10888 -18408 -18569 -11222 -208
3803 -208 6215 8470 9309 -12025 -14947 -23855 -21746 -7525 -3784 -14284 -8145 -3397 -8223 -8694 -18059
3788 -18059 -18424 -15883 -9762 -5805 -3252 3258 2066 6816 9181 -2354 -6451 6972 -207 4804
3774 4804 8047 1830 642 -3523 6290 3128 10199 20593 18666 4754 -2300 -6214 -3551 1599
3760 1599 -4638 -4065 -13913 -16633 -18641 -12646 -2064 5950 6597 2717 -7905 -10561 1892 11573 7128
3745 7128 -8170 -11569 -4659 -9526 -15735 -15659 -22127 -29696 -23960 -10728 9484 23164 13535 -5460
3731 -5460 -9103 -10023 -4572 -5868 -9644 -7839 -14662 -10468 11869 11237 11574 3521 -3307 7227 7504
3716 7504 5777 11401 11586 1801 844 3722 -1743 5436 20950 24088 14017 -1149 -17616 -17352 -3950
3701 -3950 5260 7295 -5470 -4124 161 -2942 -9615 -23780 -31145 -32462 -41942 -39259 -17681 1600
3687 1600 -7707 2726 16200 19247 15472 23249 15812 6072 -4950 -5917 -4697 -8106 -7247 4425
3673 4425 -14920 -20874 -11818 -10586 -11534 -2606 6184 -37 -14135 -14406 -5321 -954 17190 23551 2443
3658 2443 -16755 -17707 -14046 -14088 -3659 2476 2575 12105 6611 1949 -2529 -415 3197 10208 116
3643 116 2575 -9146 -9114 7149 20708 18948 24366 21300 -5211 -19881 -19131 -797 -5525 -5233 4849
3628 4849 16172 16311 8690 -954 867 3915 3424 -1647 1463 9997 29422 33577 29860 17694 14671
3613 14671 18732 15290 17460 22716 23724 15122 21959 19145 15661 12961 9899 -7712 -4571 14655
3599 14655 10718 4702 2221 -126 -4708 -17447 -14593 -12636 -8020 -10825 -7368 -7899 4308 1621
3585 1621 -1312 -7634 55 10467 13335 10481 6347 10397 -3735 -11844 -14660 2738 15214 9603
3571 9603 8042 15014 17140 10825 11242 11707 10413 7974 2806 5251 8333 3096 -9305 197 -11271
3556 -11271 -2323 23536 34977 31808 40870 26185 23924 25879 18724 22220 16399 10546 13291 14663
3542 14663 6962 10496 16857 13762 9419 20077 30536 35590 31075 17089 264 1335 6438 -2940
3528 -2940 -151 849 -741 -7063 -3217 8316 2813 -6466 -2913 845 -3619 -13771 -13827 -14818 -19611
3513 -19611 -17566 1567 3009 -5523 -7788 -1111 -15232 -8707 -2980 -6900 -9817 -7297 -4390 -2921
3499 -2921 -14960 -16837 -19412 -13317 -3093 -2429 -14986 -27434 -31448 -18576 -12579 -16253 -12267 -10048
3485 -10048 -17110 -17222 -4313 1752 -2737 -6694 -6099 572 -13253 -12038 1080 5108 7228 -410
3471 -410 10170 17545 26009 22983 19736 4550 8706 6353 7539 8023 22609 18773 10476 3785 7879
3456 7879 24068 24093 14746 -496 -11106 -18549 -5017 9001 18438 11728 3031 6948 15963 21104
3442 21104 6899 -7820 -12329 -19536 -24751 -29841 -31650 -14861 16815 9303 -16197 -23813 -16763
3429 -16763 -3329 -1322 -982 7065 2509 2876 7460 10518 7725 6122 10960 7297 13856 10236 6697
3414 6697 13909 1456 3195 19775 25640 21974 4781 975 2615 5697 7343 6182 7071 2831
3400 2831 -789 3760 12341 15890 4699 4189 8846 7007 21173 37907 32789 29885 25641 26321 16087
3385 16087 -2772 -3522 -7695 -8305 -3416 -2905 2647 4664 -5077 -4462 8049 16406 16561 17562 12629
3370 12629 5272 -6887 -81 18415 23878 20629 15244 5881 4591 2263 12193 19319 2391 -5853
3356 -5853 -14546 -7337 -1506 -2198 -6523 -10833 3266 12126 22217 27869 17066 5293 -10213 -25128
3342 -25128 -31610 -18503 -5097 -5223 -13109 -13396 -1229 9890 18027 11422 642 2636 3527 4816
3328 4816 -15267 -16333 -9320 -14713 2660 12067 1088 2686 -189 5201 13617 28493 34187 26455
3314 26455 12444 12976 15539 19258 15408 -3975 -2213 -23339 -24803 -6284 4563 23423 32708
3301 32708 35483 39522 28713 18988 -3779 -4075 11486 11755 23011 12023 12833 3070 -7360 -1443
3287 -1443 20912 26372 10972 527 -5571 -4455 -2002 -4057 -8908 -1740 -1169 -1903 -1580 -11951 -17007
3272 -17007 -2938 13961 9121 -5144 -9899 2668 10905 -1271 -9850 -16023 -9147 -3146 -3480 -1457
3258 -1457 -7345 -13837 -859 -7683 -16690 -15067 -3332 -1489 1512 -1097 -5734 -6310 9523 20672
3244 20672 15937 -262 3728 16664 25897 23471 20320 3100 -18513 -19256 -17914 -7540 -10189 -14890
3230 -14890 -20806 -19545 -9476 -23593 -27156 -28641 -26908 -13947 -7874 -16218 -10993 -9076 -10986 -11533
3216 -11533 -17413 -13374 8979 8835 7819 10184 4400 -9570 -18564 -34199 -28186 -17207 -3589 1354
3202 1354 10437 16379 11590 5598 2707 -3433 343 -8578 -24930 -11031 878 12044 9701 10194
3188 10194 10203 6996 -4473 -14290 -22848 -19751 -12936 8028 -1648 -5741 3985 12004 6998 -2087 -10828
3173 -10828 -10694 -13513 -15442 -12853 5024 20965 28474 26279 21949 23631 29271 34170 33925 16512
3159 16512 6892 13253 12676 10827 20721 16941 8044 -5622 -12180 -8990 -13161 -16625 -14416 -5116 15014
3144 15014 1470 15472 20409 16661 2263 7231 21023 23424 22939 12327 -4743 7096 16699
3131 16699 30418 41613 22342 2961 -5013 -4912 11885 12082 11256 8482 9711 17636 12838 22325
3117 22325 17541 13398 -6412 -20192 -9881 -2095 -6232 1447 13295 663 240 24 -9860 -15769
3103 -15769 -24692 -21905 -4941 -14318 -23807 -12714 -4632 -8472 2409 11336 15200 10570 -7447 -14584
3089 -14584 -15089 -9201 -8920 -143 18821 12072 15974 26563 26176 25673 16403 13060 1561 -9044 -11334
3074 -11334 -3961 -9655 -15416 -21136 -27279 -25318 -12018 -14960 -11053 1525 9173 5119 4121 9077
3060 9077 -6 -13310 -19905 -27054 -10491 -7589 -2344 11698 3874 -2465 2816 4702 4893 -2288
3046 -2288 -11887 -12281 -10233 -5494 195 1736 1801 -3442 -6500 -2199 -1625 -12365 -14476 -5336 4203 14244
3030 14244 15855 5923 3165 -9538 -22975 -28655 -21086 -15801 -16258 -14055 -11240 -13845 -17353 -5646
3016 -5646 12 -666 8763 5133 3915 6646 -4996 -16996 -13204 -6923 -240 526 6781 3464 -7041
3001 -7041 -15914 -12080 -588 9029 5528 16668 17999 27109 15758 1786 1086 7427 7023 7661 -466
2986 -466 9845 12522 7963 2760 -14501 -17498 -7986 1136 1118 -367 1899 183 -1679 -1652 486 6983
2970 6983 11299 13361 743 -8675 -20443 -12323 -5361 -11233 -23171 -13337 -5888 -17286 -19369 -25213
2956 -25213 -17704 -8231 -4113 -11475 -16734 -12751 -3613 4669 9090 3154 3408 -5857 -7472 5203 395
2941 395 -8814 -9575 1376 4799 6194 13714 14801 10416 30059 35176 24010 17846 4599 -3359
2927 -3359 9662 13969 5573 19778 30060 24231 17000 4208 4590 8629 5473 10581 6569 -4787
2913 -4787 -11982 -13348 1419 5758 3463 4194 7088 13324 13926 -1384 -12598 -5520 2390 1953 -5306
2898 -5306 -11602 -5176 455 -4363 -12122 -14701 -7184 -178 8985 4281 6756 6238 9336 -238 -10216
2883 -10216 -1463 14038 22037 27555 17789 -2736 -18757 -13260 -2438 3066 5038 10600 16214 5917
2869 5917 -809 -8464 -2237 10910 24976 14384 9607 14129 20072 12497 4469 6885 12585 11529
2855 11529 -8697 -5790 3063 9483 23254 21691 25690 25627 23061 10792 685 -726 -1935 -4606
2841 -4606 3098 10145 7928 6316 4190 6818 17303 9590 1339 -5263 -3796 4675 12305 8652 5519
2826 5519 -14660 -20747 -12553 -7765 -3706 6101 4952 15781 3644 -600 69 -3637 3835 2172
2812 2172 -4495 12651 20087 27810 24869 25417 25838 32837 46200 41221 24770 24271 20514 14452 7762
2797 7762 -4366 -5513 -8853 -3802 -8016 -21992 -18535 -15071 -16279 -15645 -17724 -12788 2556 11444
2783 11444 -4983 -6989 -7371 -5540 -6268 -7584 -5826 4656 14870 -2635 -6902 -9021 -3316 2838
2769 2838 16741 26896 24428 11191 2627 -4168 -9746 -9378 2352 7510 546 -6428 2802 813
2755 813 -5673 8908 23596 16510 -5124 -10738 2019 6119 -4829 -7458 -4876 -6105 -4714 4797
2741 4797 -3069 -15678 -28346 -29082 -22017 -2601 -2527 -24578 -32270 -32540 -24636 -16929 -10399 -10456 -13297
2726 -13297 -3987 5362 9566 20305 16457 -11417 -5374 17765 17470 16354 8810 4801 6622 8559
2712 8559 -490 3469 -6011 -9888 -8367 -12161 2422 664 15468 15939 5248 9873 13508 19083
2698 19083 16238 20331 19734 8489 3315 1776 -3307 -9224 -399 3236 15794 8590 12969 9148
2684 9148 5876 7336 8231 3232 1564 -3677 -4127 -6158 -7664 -1722 9369 18205 22835 21002 22722
2669 22722 20320 21115 23940 29327 14026 12992 5389 8961 11945 11146 5086 -794 -5111 -10058 -1806
2654 -1806 -160 -7997 -16828 -2180 16247 16694 3650 2480 1794 4804 1313 8791 2542 11348 10830
2639 10830 -4979 -7268 3269 19653 18849 12653 12006 214 -2282 8530 13372 -2240 2972 15148
2625 15148 19811 11225 16330 20618 10366 2942 10702 17047 15054 18446 8300 104 -6267 29
2611 29 11190 500 -4975 5113 -1270 -15825 -20797 -28045 -27553 -11822 -5047 -2474 1374 -2504
2597 -2504 -7528 -11426 -15667 -17480 -12648 -9561 -6889 -2290 3302 4663 10000 10635 2597 5509 7847
2582 7847 10449 23805 13236 6478 -3583 -1542 18852 18498 6528 9365 9931 12918 19094 24254
2568 24254 22511 25029 32332 26856 17612 12529 2821 2931 -8394 2029 15529 21286 9533 -5720
2554 -5720 -6340 -10262 5 15145 18012 -2158 -5012 -7324 -6566 -10312 -754 -6883 -11931 -15626 2325
2539 2325 14733 16959 23790 30592 20488 6271 11478 5874 5794 9121 5905 6956 15221 34494
2525 34494 29717 20796 6265 369 12775 15182 11806 6151 5128 -730 -8784 -23173 -19557 -13533
2511 -13533 -3730 13637 11562 8649 4739 16181 23157 21601 19369 12802 3366 5598 3322 -5227
2497 -5227 6422 2724 14744 18548 26114 28443 29612 16844 7840 7746 11136 19066 18547 -3983 -12713
2482 -12713 -22342 -26879 -25698 -12374 -4301 2984 -9861 -13344 -9345 403 17876 14415 6386 13571
2468 13571 14870 5370 -4814 -13496 -8579 -11109 -10383 -16985 -7355 -3859 -2361 -5171 -4751 -3432 12257
2453 12257 19042 18711 25207 15027 6036 10730 10250 12629 19705 19431 12640 8553 151 -9672 -14096
2438 -14096 -12635 -14300 -13763 -8179 -7082 -2065 8663 11628 21396 23924 21543 14325 1413 -3388
2424 -3388 3428 14464 4247 2846 -4270 -17542 -6270 2807 8806 4633 909 -6221 -7527 -16610
2410 -16610 -27704 -17267 3313 5681 8357 2585 -1404 -3885 -1579 -4795 -10983 -1790 1614 4064
2396 4064 10168 9801 -6515 -14820 -11930 -7577 -4811 -3291 -3493 -3491 -15157 -16924 -17049 -2972 9780
2381 9780 8876 6353 3 1518 11815 21267 26978 29900 23079 23401 17782 8663 1179 5551 6796
2366 6796 -4584 2587 -6417 -13859 -10219 -1602 6115 -172 -6607 1105 4692 17412 14141 4415
2352 4415 -996 6350 4577 -3229 -2662 6523 10579 10349 2060 -9282 -19136 -20183 -16587 -5380 5049
2337 5049 -10730 -14377 -18727 -24398 -32990 -30599 -18521 -11410 -16886 -24693 -9471 -6807 -593 7948
2323 7948 14286 16286 18471 15515 5638 1976 -2023 -7699 -14152 -15537 -3483 10728 10669 16499 17473
2308 17473 4171 -5462 -2848 -7631 593 5749 -883 -4805 -15352 -14748 -19059 -11735 -4665 746
2294 746 187 2697 -2196 -10832 -17627 -15020 7621 16737 13133 16260 14128 16950 24678 26480 7241
2279 7241 -10610 -1623 4541 11274 15949 8795 1175 8472 3206 -1082 -9653 -11916 -1283 -3730
2265 -3730 -2248 4725 284 -5843 8078 15833 11980 2057 -10089 -11616 -291 2978 611 -5357
2251 -5357 -4635 4914 6237 8122 5634 14087 6156 10604 1577 2823 4389 9734 15416 26218 13695
2236 13695 845 844 -13609 -6094 -3392 -5726 1236 527 2739 144 -3575 -6526 4750 3736 -8899
2221 -8899 -1309 -3827 -10398 -15720 -4470 6801 25056 6889 -2016 -5888 -15346 -23216 -26151 -30032
2207 -30032 -17723 -15886 -10836 -9575 -13146 -7581 -10142 -19261 -21457 -25430 -22179 -10629 9561 3684
2193 3684 -3672 -14937 -6501 -3224 4307 9420 -1497 2478 3124 547 3976 4469 16374 10707 -2919
2178 -2919 -1513 -3875 1841 -2144 -9307 -8809 3141 21907 10453 2480 -4931 -19741 -13976 -22001
2164 -22001 -29896 -25788 -3840 8573 -4213 -15181 -16949 -12473 -7884 -9667 -16711 -22293 -1312
2151 -1312 18433 12268 8671 18209 23044 20042 9490 1675 -6 5116 3924 913 1435 4246 13680
2136 13680 1310 2313 -611 3565 1680 6596 22037 18190 6896 7757 23486 22926 16620 9159
2122 9159 19073 25750 28054 30214 27305 13451 7593 10393 7123 -11736 -18566 -18482 -15413 -5307 9595
2107 9595 13882 17310 23893 15275 15785 25306 21894 6060 -441 -512 8125 6887 -1934 8464 12330
2092 12330 10400 16598 18853 17540 11807 -3892 -10966 -26796 -36585 -22432 -6228 -7564 -12593 -13376
2078 -13376 3829 8405 13970 12838 10192 10853 6468 7036 14341 15721 6983 -3812 -18248 -17765 -21926
2063 -21926 -37562 -33375 -15861 -16615 -14409 -5503 -9369 -11199 4407 8138 -5588 -4582 -3422 -7633
2049 -7633 -4378 9697 32731 35542 34709 16576 932 -7021 -14747 -9722 10664 19136 1922 9406
2035 9406 22874 1693 -20050 -6025 12030 19761 16912 17002 5517 207 -10111 310 -7897
2022 -7897 -5132 5929 10830 14748 12623 1823 -7268 -10233 -8956 -17402 -14854 -8237 -17080 -23514
2008 -23514 -12472 -18814 -24491 -27173 -26164 -15223 -16726 -27034 -28142 -19967 -23330 -17536 -10183 -8196
1994 -8196 -7040 -22765 -18754 1226 4241 -4777 3562 17010 15657 2859 5231 12570 11367 -3195
1980 -3195 2465 1732 8834 -4612 -8559 -20902 -23296 -9956 -610 12141 5226 11318 18820 18968
1966 18968 18890 27322 19817 23960 17815 -2783 1501 7309 18971 13719 1509 4853 -5117 -9355
1952 -9355 -4903 -5096 -15919 -13305 491 6844 -2213 -6851 -5220 -10378 -16267 -3499 4506 3199
1938 3199 5043 13839 5229 -3293 622 2462 3504 -9136 -18715 -27512 -20476 1666 3279 -5728
1924 -5728 -488 -1469 -6879 -9362 -15379 -4065 2203 12313 20124 12296 15719 14391 -1961 -6420
1910 -6420 -16612 -21924 -13946 -8388 -3359 -5583 -4424 -2982 213 11785 20865 15115 4880 5260
1896 5260 12071 8916 5254 4432 2568 -3775 3116 11755 8208 -1127 -6930 -6092 2473 9167 5513
1881 5513 -8519 -21634 -20226 -20920 -23966 -16909 -2097 4022 -7014 -4753 4659 -1282 8088 14188
1867 14188 12770 15439 14789 11407 401 -2879 -7396 -13662 -14485 -18411 -23804 -22087 -28045 -30291 -30250
1852 -30250 -23179 -18216 -13605 -7621 -16341 -8926 -2198 9357 10903 14133 10547 9843 16376 10261 -5224
1837 -5224 -4737 3481 -1835 -13499 -6289 4191 3705 -6568 4055 21728 31883 14814 6781 18491
1823 18491 7329 -3125 -11661 -15037 751 19996 25717 16664 1936 -7287 -17746 -8441 1874
1810 1874 -850 8380 27211 25893 15872 -1368 -11516 -8674 -1989 15148 34141 23713 12638
1797 12638 3642 -12297 -11735 863 -6408 235 11795 20339 23831 16857 23884 16858 8600 -9020
1783 -9020 -15159 -2760 -524 -5923 5175 19118 13054 -3530 -332 10100 11582 3602 7858 12395
1769 12395 2335 6372 10924 -10705 -16118 -8557 -7379 2148 376 -6210 935 -6579 -10100 -5935
1755 -5935 -5737 -4101 -6780 -15928 -32105 -26548 -21187 -19479 -23625 -11694 1243 8766 23080 21113
1741 21113 8440 4033 12162 6194 3855 4615 -9675 -4715 21026 30313 26438 6975 -5125 5366
1727 5366 10967 6845 6114 -5558 535 6332 906 -9307 -7560 6285 14964 22718 25880 24900 22930
1712 22930 21186 30543 35006 30516 14925 13091 22012 28473 26517 23960 13948 13829 3384 6360
1698 6360 11204 22626 26181 37723 30952 22452 8544 21047 22542 24686 26529 11089 17809 16871
1684 16871 22343 17508 3585 -4712 1633 11939 10016 14839 4281 -7708 -13596 -31452 -16382
1671 -16382 -7753 -4325 -2326 -8888 -6599 -1129 3563 5184 9295 3199 -10287 -14513 -15841 -27412
1657 -27412 -29663 -11676 618 9968 10481 -186 -5644 -10476 2494 3883 11448 15060 10822 14104
1643 14104 14204 7511 -4725 -13269 -16215 -10344 -14790 -15382 -6856 3167 8640 4182 4529 8898 -1552
1628 -1552 -4420 12030 12093 1879 1842 11338 10152 10979 24986 38546 31191 20249 19480 19232 3324
1613 3324 -9019 -15686 -14873 -6840 2659 16149 3867 8701 14355 19103 16174 16860 26190 17716 -6488
1598 -6488 -17125 -10667 3867 4616 5127 -2608 -17939 -1442 5278 -3400 -7719 1786 7847 -10083
1584 -10083 -15365 -20309 -14531 -8238 -2855 1579 -12392 -13067 -9942 -10321 -4686 -540 -3950 -20975 -29753
1569 -29753 -11693 -4029 3643 3731 2643 11224 13277 17721 15771 20526 15204 8935 -3768 -3976 4389
1554 4389 1673 -6459 8752 12556 -4244 -13290 -3824 -2592 -22456 -18399 -3817 192 -4929 -5753
1540 -5753 -2349 5023 5431 -1193 4050 13155 15158 12795 6887 780 -1245 -1352 -4351 -3910 -8817 -18174
1524 -18174 -17540 -21486 -32588 -28349 -16424 -16052 -3412 18297 20034 18400 4868 516 -8957 -23554
1510 -23554 -22961 -15084 -13014 -7241 -6893 -7087 -18473 -15006 -1068 6324 15811 24699 2569 -7547
1496 -7547 -4682 -20977 -21968 -26781 -30632 -30076 -39910 -36729 -31544 -31095 -22929 -11638 -9901 -10265 -18442
1481 -18442 -19752 -10154 -9455 -17549 -9971 11042 23012 24880 23518 23639 20236 17052 -98 -9258
1467 -9258 -10031 -7883 -9079 -7603 -2821 1068 14751 16526 8660 2485 1955 2736 19933 23258 28507
1452 28507 19854 9392 1963 -2805 -4996 -1302 12297 10837 -4966 -9480 -17939 -12457 -1414 -3165
1438 -3165 -4498 1532 2514 -10895 -20761 -17485 -1715 10850 9036 -5999 -4709 8328 2825 -19677
1424 -19677 -27950 -25540 -25655 -7559 6599 7996 8532 15499 14835 1999 -1583 -9441 -17495 -3215
1410 -3215 16227 21894 9846 13574 23995 20845 24781 16909 18504 20471 18588 15823 6234 95
1396 95 7273 9442 6814 9608 7772 7218 -8650 -26830 -17227 -8338 -14083 -308 6103 10752 11494
1381 11494 7566 1221 5217 8026 5971 -2737 13186 16165 4934 -4477 1445 9695 19013 17665
1367 17665 -10101 -9830 507 4619 -1501 -3048 3032 -1804 -7843 -2132 3807 3462 -1972 -13415
1353 -13415 -15307 2286 11375 13889 15515 -1338 -10965 -1301 1828 -3570 -3279 47 1011 12944
1339 12944 13782 -1734 -17131 -30884 -36573 -26502 -13568 180 -5912 -1230 11014 5012 -2273
1326 -2273 -6399 -3300 -7466 -20543 -12956 -10630 -14410 -12084 -9076 -9185 -4200 4576 9298 3237 5169
1311 5169 10490 16282 14426 8077 -4207 -856 -113 -2655 4357 5154 211 1384 3392 3168 1634
1296 1634 6335 17091 27522 19684 4261 4514 -10336 -15200 -15687 -21337 -13047 4694 8557 4169
1282 4169 2054 10304 4269 8533 17971 26474 24901 21315 12935 2412 -4952 432 957 -24835 -25591
1267 -25591 -6453 4620 5269 14578 13374 12957 19261 14530 17815 13058 711 3145 -861 -6861
1253 -6861 1829 11646 10358 19036 5498 -539 1384 5957 16500 7223 -10937 -8340 -3170 -4867
1239 -4867 1398 692 6396 10979 9776 14743 14712 2888 -8879 386 -2769 -3506 -2888 -6772 -5430 861
1223 861 7188 6781 -1501 12012 15862 15383 17809 24824 15317 660 -8248 -17895 -17284 -7014 4883
1208 4883 -6758 -18087 -7759 -3841 -4319 -14901 -15566 -5006 6515 18587 9561 2240 2974 -2421
1194 -2421 -6726 2157 8973 12737 14106 13972 7491 11101 2783 -4247 -6518 -19901 -11568 -3496 4970
1179 4970 -1732 -7158 -3709 5030 -314 -496 -3875 -343 13200 16270 19453 23996 27101 26353 24057
1164 24057 23908 17870 18287 14160 4127 1455 -3860 -6721 -531 3943 3734 -3559 -4187 6150 4170
1149 4170 -7291 -3812 4459 7874 4308 16492 12714 3588 -727 -6732 -19248 -19398 -1862 -9326
1135 -9326 -21716 -13203 4364 19318 20180 6272 -2579 -1550 5273 7975 2705 6288 7873 4637
1121 4637 -9441 -19267 -5309 4784 17690 21989 9076 -3172 -9282 -4107 -4538 -903 -10138 -13420
1107 -13420 -8395 7156 27094 5453 -16915 -15050 -13438 -17970 -20324 -24928 -17532 2281 1854 7467
1093 7467 853 5602 -2125 -3184 -16626 -30819 -16406 -9887 -18136 -13511 -11397 -10192 -1282 6887
1079 6887 940 -17919 -14007 -7170 -7559 -13567 -20125 -7288 -10653 -16395 -18206 -15034 -24437 -10931
1065 -10931 -6698 13351 14571 2391 -23243 -21150 -5929 -5612 4517 11105 7292 13487 19923 21368
1051 21368 11402 20078 20715 8300 -259 -11556 -14947 -10902 -13404 -13188 987 23186 16623 -6590
1037 -6590 -10627 -7803 -6515 -6186 -4249 4641 568 -4852 -2023 11530 15159 15007 11157 -4440 -19342
1022 -19342 -19287 -23021 -11787 4944 12848 15462 15938 2853 -8270 -10083 -1292 3555 5628 6044 3423
1007 3423 -5052 -6912 -8052 -3304 -4886 -10693 3785 11471 20016 2044 -2471 1491 6195 8733
993 8733 10964 916 -7327 -6076 -5466 -1333 3533 8511 -7236 -6370 -11609 -7905 8368 6543 427
978 427 -9296 -11218 -3885 -9010 -24069 -7702 8092 266 -9983 -8584 -7982 -16014 -5162 8807
964 8807 4692 0 -4958 -14380 -17959 -25602 -13994 5793 13944 6431 -245 559 1368 -4329 5001
949 5001 6340 4641 4111 -3962 -7380 -4047 -2212 -2335 -15006 -11567 -11265 -13682 -11462 -5042 8596
934 8596 15189 16587 18493 9412 15550 16118 4403 7818 13833 5781 2836 -5649 -966 3461 9956
919 9956 -386 753 6208 -549 1801 -5575 -16727 -22976 -16305 5054 22848 13500 4538 -6643
905 -6643 -9630 -19367 -20168 -19585 -13763 -16355 -25828 -35061 -25288 -14477 -8304 -15657 -22826 -17067 -10767
890 -10767 -8648 -7567 -22763 -28601 -14468 -8947 -1234 2504 -4548 -5499 164 4996 2315 325 -3064
875 -3064 -9255 -8910 -3696 9286 14263 25688 29380 17542 2500 3926 7525 11360 -625 4136
861 4136 -2635 -17370 -21281 -18220 -16672 -6249 7702 1561 3436 8318 8452 7377 9707 5039 -5623
846 -5623 -13278 -13564 -22236 -23737 -19717 -15639 -8145 7453 1017 1456 12368 -1276 -20394 -14649 -69
831 -69 7403 344 -5465 3200 -825 -4565 -11116 -28389 -31952 -33373 -34529 -27618 -9418 -22375 -6189
816 -6189 8800 11867 -4763 -15162 -25699 -26882 -24351 -30619 -32946 -30678 -23389 -26954 -22599 -9734
802 -9734 -532 2729 -1051 3054 9994 17176 11759 -1285 -10673 -2168 -3329 6212 -804 -5052 -47
787 -47 -3332 802 7841 9795 7575 8219 2400 -2873 -2807 -5357 6189 13314 9433 -2876 -22536 -37263
771 -37263 -44964 -40739 -32985 -24051 -34544 -25299 -25721 -25797 -15782 -7849 -9838 -14315 -18814 -5876 -10321
756 -10321 -25444 -25319 -12444 -10299 -12066 -10994 -10019 -22460 -32485 -23013 -14259 -20143 -14517 -5233
742 -5233 -1589 -18709 -33823 -29481 -11200 -13640 -24941 -19973 -17154 -10074 2105 13960 17386 11959
728 11959 4081 -6345 -4520 495 -3722 -8757 -10873 -10031 -1986 -5914 904 3981 8939 12092 2234
713 2234 -3916 -1969 -20419 -12312 -13272 -10164 -15911 -18795 -17364 -16039 -19301 -22983 -32451 -20122 -19299
698 -19299 -26249 -10150 5674 4249 -797 10816 9302 15302 22349 12620 -1407 -1520 3030 9731
684 9731 -8287 -14777 -8904 -16418 -26728 -28102 -30001 -19714 -398 -3893 -15475 -17540 -14315 -7160
670 -7160 -9419 -19524 -21505 -8630 -5054 -4950 -18733 -10281 1225 7702 -3426 -4310 6791 657
656 657 -7999 -14741 -18005 -20147 -15991 -15598 -10338 -13202 -5959 -743 1358 929 3304 -4602 -27962 -20263
640 -20263 -1514 5353 -5131 -13402 -19977 -10137 -12001 -20587 -22463 -27044 -13649 -15007 -13101 5120
626 5120 5031 -15394 -10710 -4144 -18968 -19669 -17502 -10990 -11626 -6666 -2868 -2090 4507 -1769 -5888 -28548
610 -28548 -28716 -15660 -20126 -26963 -17368 -13745 -15980 -12276 -1519 1646 -10865 -21061 -18828 -20047
596 -20047 -24657 -25110 -13750 -9578 3528 5625 468 -9295 -6070 4510 4316 3552 -4084 -9869 -13523
581 -13523 -20480 -24003 -16749 -10761 -19735 -22150 -18826 -24188 -14794 4815 4842 -5846 -7571 -2713 1689
566 1689 2917 5118 16950 14900 2908 387 -7681 -9406 -14857 -20889 -21288 -29639 -38077 -6287 8506
551 8506 -4801 -10867 -4159 -6520 119 3502 624 -3724 1950 -1439 -15260 -19207 -23135 -24600 -17794
536 -17794 -2798 2423 9871 21748 18265 19352 6351 -15845 -14001 -12953 -18505 -19474 -24031 -22499
522 -22499 -16731 2162 11985 19958 9900 3904 1566 3716 5348 -16326 -17629 -10481 -14338 -20718
508 -20718 -32430 -28881 -16333 -17529 -18273 -2357 11054 16125 12034 -5783 -22546 -18908 -22910 -26562
494 -26562 -22476 -33157 -31873 -23032 -710 11375 529 -10631 -199 -4039 -23929 -31087 -29889
481 -29889 -16406 -7796 -10196 -15290 -26905 -23937 -22160 -33946 -36071 -31433 -25660 -23709 -28340 -23623
467 -23623 -15452 -15274 -20200 -21855 -12546 -1563 -6229 -16834 -19852 -21393 -17769 -21676 -18552 -21315 -17841
452 -17841 -10674 -6927 6801 11010 10552 5451 -1215 -6385 1544 3323 -643 3970 -6276 -5403 -6708
437 -6708 -15916 -11814 -15686 -12499 -8975 -11285 -25761 -10632 -7866 -20829 -29723 -28117 -20554 -17717
423 -17717 -20913 -13987 -11317 -21353 -26894 -25123 -24452 -19464 -11932 -17579 -28074 -23074 -13485 -16945 -22145
408 -22145 -31829 -18156 -4899 6397 -2076 -11190 -12316 -5358 -18175 -24314 -18091 -14875 -7039 -8915
394 -8915 -10761 -927 -1306 -6942 -7990 1225 -3841 5721 -4304 -11573 -24722 -24047 -12139 -10097 -9246
379 -9246 -17573 -11169 -3326 -10017 -18976 -29202 -25434 -17792 -17077 -11707 -8710 -563 1608 -1032 4992
364 4992 9636 -299 -16331 -27736 -28602 -28350 -19590 -27211 -30363 -31460 -24712 -12931 -15015 -28439 -22500
349 -22500 -18367 -5240 3425 4849 4336 12397 12233 339 -11869 -18974 -20184 -14947 -10951 2537
335 2537 2049 850 1388 -1251 -11658 -28964 -13507 4473 3488 1722 3050 5876 11271 16972 -3063
320 -3063 -15791 -28220 -31601 -13950 -3571 14686 23370 4300 -11294 -18860 -29503 -22054 -17652
307 -17652 -21902 -18117 -18421 -24223 -11935 -7207 -7693 -12436 -235 -1121 -3397 1034 -5548 -11145 -15138
292 -15138 -4577 -1670 -2852 -3924 -7060 -18133 -16323 -9430 -2857 -426 -4710 -4113 -8690 -12439 -13572
277 -13572 -12239 -21676 -24489 -25441 -31691 -31434 -27681 -27677 -16621 -5407 4091 1211 -8494 -16934 -12413 -11777
261 -11777 -8237 -21462 -27547 -21517 -11377 4847 11837 6347 5542 10636 7658 7309 7207 4886 -888
246 -888 -4073 -9758 -14195 -4313 -1449 -8637 -21353 -21953 -15262 -9601 -2845 -3276 -5142 -727 4990 -6027
230 -6027 -8839 -11713 -9955 -9065 -14414 -21594 -17683 -3476 -9445 -20753 -25444 -16951 -10191 -7764 -259
215 -259 -1841 -11758 -12098 -6028 -7678 -7332 -16514 -7920 -3012 -14276 -10931 -2783 2668 -2518 -25202
200 -25202 -29014 -24866 -30417 -21897 -17861 -14215 -14761 -15849 -1994 6370 -709 -12515 -23455 -20674
186 -20674 -12216 -20394 -20245 -3597 2217 8040 6353 5417 6962 3067 -5241 -21506 -23505 -19957 -20394
171 -20394 -14793 -11379 -16760 -21114 -17526 -13717 -13581 -6272 -1646 -4472 -8795 -8314 -991 4874 3875 -3971
155 -3971 -16449 -22053 -31986 -30150 -30492 -28836 -18812 -22820 -29122 -32816 -28252 -18418 70 6196 2893
140 2893 -13923 -12124 -6414 -9020 -14987 -16679 -19523 -8637 -5448 -13478 -10551 -14419 -10302 -10526 -20713
125 -20713 -22600 -19518 -26784 -24138 -18682 -8122 1315 -3542 -5443 -12719 -9449 -10200 -10189 -11808 -13967
110 -13967 -11815 -16919 -20127 -19467 -15634 -7838 -20139 -13829 -12198 -10831 -12206 -9296 -16741 -26746 -18208
95 -18208 -10093 -12353 -14517 -5950 -6702 -13785 -15373 -5699 -13341 -16908 -17555 -13094 -3768 4258 3179 5637
79 5637 -3779 -16642 -17355 -13038 -19507 -21465 -19271 -17806 -15570 -20301 -28676 -25460 -28326 -31648 -29863
64 -29863 -24515 -23188 -16106 -20087 -27697 -21602 -22542 -25186 -25297 -17136 -22344 -21252 -8769 -9221 -14752 -12991
48 -12991 -13837 -15419 -10762 -17499 -24229 -22790 -16515 -14662 -20655 -19641 -11317 -6141 -4614 -6047 6857
33 6857 9765 3066 581 -454 -4430 -43 5982 4936 -1482 -10896 -11569 -4011 -651 -6231 -9062 -14772
17 -14772 -14202 -14029 -13412 -6047 -1270 1370 3083 -548 -12213 -12327 -10832 -6457 -14065 -24045 -19797 -17846
1 -17846 -24467
0 -24467
$$ Imaginary data points
##PAGE= N=2
##DATA TABLE= (X++(I..I)), XYDATA
32767 98473 99806 99812 97805 97763 95356 95112 109898 125139 111757 106699 107571 99966 87038 97758 105327
32752 105327 114374 115510 96585 96271 108124 115942 117765 119159 118187 117360 121594 126938 125258 125748 137214
32737 137214 145384 134224 129699 126074 117180 119298 128746 139251 149007 145280 148368 144783 143415 146633
32723 146633 149572 146165 132930 146444 151471 151839 155411 147830 147943 155786 159621 157768 145374 144408
32709 144408 149984 152152 156554 157164 160060 169547 168980 168967 170718 173824 173812 182515 185726 194345 184239
32694 184239 183889 186676 175958 177494 177193 183396 187383 182931 178971 192574 199584 201927 196218 194108
32680 194108 196040 205101 199999 187764 186910 191709 188759 194131 200927 200876 188868 176333 174192 180448
32666 180448 191144 196986 201764 202556 199384 196695 208218 222390 226785 221701 221267 223176 234641 236441
32652 236441 238076 242331 245550 242445 243504 249153 243913 239093 238946 241911 242046 243907 239272 253598
32638 253598 247488 243234 240622 243129 259045 262743 254502 240966 242289 247156 260409 275969 281325
32625 281325 280265 277900 274794 269639 267981 253320 249489 264664 274921 283209 282338 279984 273218 277309
32611 277309 282883 272994 273474 277022 283664 284285 277288 284582 285343 280130 283790 295858 296534 288190 279906
32596 279906 278683 287367 299674 298484 293020 302776 307838 310305 306153 298494 295775 304688 299699 294769
32582 294769 297504 300173 297540 298953 310719 315024 311421 315304 316918 318991 319377 304418 300126 299497
32568 299497 298186 297540 298468 318215 330703 329352 331973 329365 321122 316165 312250 323559 320993 325339
32554 325339 339124 340205 330475 331209 339850 344175 332891 338786 345970 339017 326102 312660 309998
32541 309998 319463 324388 326211 336976 342356 343711 346025 333104 329198 333630 338080 343680 338480 330590
32527 330590 337326 337362 342114 353773 366533 359206 361231 364798 363552 365745 372511 378302 377661 366082
32513 366082 359900 366955 366834 344815 332604 335186 368175 389724 377655 358766 354953 360022 372660
32500 372660 372421 364212 371260 386484 388002 375362 374521 386914 392829 385367 384110 385104 388778 397802
32486 397802 397963 390728 381091 387564 396959 381956 373196 366928 379579 386719 388953 397223 391382 381014
32472 381014 377592 388504 383685 376368 374154 387227 395684 394711 385626 385587 400239 407973 409469 419425
32458 419425 411938 403663 402350 403316 401544 391052 384122 387553 401858 405888 402067 390097 391432 403570
32444 403570 407274 415095 409069 408687 405240 415112 416269 412730 418509 420286 418299 416571 413566 417017
32430 417017 424682 438301 436234 425949 415980 413422 423801 423186 418505 410021 406455 405246 411635 416093
32416 416093 432946 431104 438182 447570 431677 421215 410600 391872 399688 398601 410847 424709
32404 424709 417221 429120 435495 426630 421766 429441 420466 428426 432339 446194 460556 449686 431538
32391 431538 435670 442297 424224 417338 425812 436113 437419 432040 435629 443010 453205 452469 448767 440747
32377 440747 445888 450054 441582 438898 442621 438330 428294 425287 425719 440625 435288 436018 445103 448240
32363 448240 445018 440967 444218 439306 444347 454296 459756 451384 455881 453607 444829 449602 446828 446357
32349 446357 430832 422950 426190 437145 446067 445472 449629 456044 457887 445875 463510 482771 489404
32336 489404 488653 477006 468700 455859 450500 444763 441371 441099 435354 444342 455425 454559 463111 481798
32322 481798 482303 468021 447905 441340 454154 468341 475884 473278 481158 479494 470592 466471 453344
32309 453344 444415 460808 464759 473701 480962 477975 480230 467199 459376 461351 477433 477700 467935 471054
$$ [...]
##END NTUPLES=NMR SPECTRUM
##END=
