##TITLE=317083
cc 45416
440/140
adrs
craig
##JCAMPDX= 6.0         $$ Bruker NMR JCAMP-DX V2.0
##DATA TYPE= NMR SPECTRUM
##DATA CLASS= NTUPLES
##ORIGIN= Bruker BioSpin GmbH
##OWNER= nmr
$$ XWIN-NMR		Version 3.5
$$ Wed Jul 12 08:56:10 2006 GMT Daylight Time (UT+1h)  MAYBRIDGE\nmr@NMR_250MHZ
##.OBSERVE FREQUENCY= 250.131544655141
##.OBSERVE NUCLEUS= ^1H
##.ACQUISITION MODE= SIMULTANEOUS (DQD)
##.ACQUISITION SCHEME= undefined
##.AVERAGES= 1
##.DIGITISER RES= 18
##SPECTROMETER/DATA SYSTEM= dpx250
##.PULSE SEQUENCE= zg30
##.SOLVENT NAME= CDCl3
##.SHIFT REFERENCE= (INTERNAL, CDCl3, 0, 16.522)
##AUDIT TRAIL= $$ (NUMBER, WHEN, WHO, WHERE, WHAT)
$$ ##TITLE= Audit trail, XWIN-NMR		Version 3.5
$$ ##JCAMPDX= 5.01
$$ ##ORIGIN= Bruker BioSpin GmbH
$$ ##OWNER= nmr
$$ C:/u/data/dgb/nmr/ADRS/15660/pdata/1/auditp.txt
$$ ##AUDIT TRAIL=  $$ (NUMBER, WHEN, WHO, WHERE, WHAT)
(   1,<2006-02-07 14:05:39.79 +000>,<MAYBRIDGE\nmr>,<NMR_250MHZ>,
      <created by zg, POWCHK disabled, PULCHK disabled
       terminated by command 'halt'
       configuration hash MD5:
       84 BC 41 DB A1 6E 1D 46 DA 25 12 A5 C1 ED C5 3A
       data hash MD5: 64K
       53 70 C4 F3 E0 80 61 40 93 F6 AF B1 BD B2 E0 C3>)
(   2,<2006-02-07 14:05:48.85 +000>,<MAYBRIDGE\nmr>,<NMR_250MHZ>,
      <Start of raw data processing
       ef LB = 0.3 FT_mod = 6 PKNL = 1 SI = 32K 
       data hash MD5: 32K
       DC 26 B6 C5 14 33 CE 6D 60 B6 F6 79 42 88 4F AA>)
(   3,<2006-02-07 14:05:52.15 +000>,<MAYBRIDGE\nmr>,<NMR_250MHZ>,
      <apk 
       data hash MD5: 32K
       B9 33 86 33 0D 70 A3 AE 2C EA 23 54 24 58 D5 69>)
(   4,<2006-02-07 14:05:53.65 +000>,<MAYBRIDGE\nmr>,<NMR_250MHZ>,
      <abs ABSG = 5 
       data hash MD5: 32K
       E4 9F 24 DD 19 93 BF 1D 45 A3 C3 59 57 8A EC 20>)
$$ ##END=
$$ 
$$ hash MD5
$$ FE DE D8 C3 CF 8B 4E 88 72 97 C0 62 69 08 99 89
##$RELAX= 
##$RELAX= 
##$RELAX= 
##$RELAX= 
##$RELAX= 
##$RELAX= 
##$RELAX= 
$$ Bruker specific parameters
$$ --------------------------
##$DU= <C:\Restored>
##$EXPNO= 15660
##$NAME= <ADRS>
##$PROCNO= 1
##$TYPE= <nmr>
##$USER= <dgb>
##$AMP= (0..31)
100 100 100 100 100 100 100 100 100 100 100 100 100 100 100 100 100 100 
100 100 100 100 100 100 100 100 100 100 100 100 100 100 
##$AQSEQ= 0
##$AQ_mod= 3
##$AUNM= <au_zg>
##$AUTOPOS= <9 >
##$BF1= 250.13
##$BF2= 250.13
##$BF3= 250.13
##$BF4= 250.13
##$BF5= 500.13
##$BF6= 500.13
##$BF7= 500.13
##$BF8= 500.13
##$BYTORDA= 1
##$CFDGTYP= 0
##$CFRGTYP= 5
##$CHEMSTR= <none>
##$CNST= (0..31)
1 1 145 1 1 1 1 1 1 1 1 1 1 1 1 1 1 1 1 1 1 1 1 1 1 1 1 1 1 1 1 1 
##$CPDPRG= <>
##$CPDPRG1= <>
##$CPDPRG2= <>
##$CPDPRG3= <>
##$CPDPRG4= <mlev>
##$CPDPRG5= <mlev>
##$CPDPRG6= <mlev>
##$CPDPRG7= <mlev>
##$CPDPRG8= <mlev>
##$CPDPRGB= <>
##$CPDPRGT= <>
##$D= (0..31)
0 1 0 0 0 0 0 0 0 0.06 0 0 0 0 0 0 0.0002 0 0 0 0 0 0 0 0 0 0 0 0 0 0 
0 
##$DATE= 1139321138
##$DBL= (0..7)
120 120 120 120 120 120 120 120 
##$DBP= (0..7)
150 150 150 150 150 150 150 150 
##$DBP07= 0
##$DBPNAM0= <>
##$DBPNAM1= <>
##$DBPNAM2= <>
##$DBPNAM3= <>
$$ [...]
##$SUBNAM7= <"">
##$SUBNAM8= <"">
##$SUBNAM9= <"">
##$SW= 20.6930455092707
##$SWIBOX= (0..15)
0 0 3 0 0 0 0 0 0 0 0 0 0 0 0 0 
##$SW_h= 5175.983436853
##$TD= 65536
##$TD0= 1
##$TE= 293.16
##$TE2= 300
##$TE3= 300
##$TEG= 300
##$TL= (0..7)
0 120 120 120 120 120 120 120 
##$TP= (0..7)
150 150 150 150 150 150 150 150 
##$TP07= 0
##$TPNAME0= <>
##$TPNAME1= <>
##$TPNAME2= <>
##$TPNAME3= <>
##$TPNAME4= <>
##$TPNAME5= <>
##$TPNAME6= <>
##$TPNAME7= <>
##$TPOAL= (0..7)
0.5 0.5 0.5 0.5 0.5 0.5 0.5 0.5 
##$TPOFFS= (0..7)
0 0 0 0 0 0 0 0 
##$TUNHIN= 0
##$TUNHOUT= 0
##$TUNXOUT= 0
##$USERA1= <user>
##$USERA2= <user>
##$USERA3= <user>
##$USERA4= <user>
##$USERA5= <user>
##$V9= 5
##$VALIST= <valist>
##$VCLIST= <CCCCCCCCCCCCCCC>
##$VD= 0
##$VDLIST= <DDDDDDDDDDDDDDD>
##$VPLIST= <PPPPPPPPPPPPPPP>
##$VTLIST= <TTTTTTTTTTTTTTT>
##$WBST= 1024
##$WBSW= 4
##$XGAIN= (0..3)
0 0 0 0 
##$XL= 0
##$YL= 0
##$YMAX_a= 16694
##$YMIN_a= -19858
##$ZGOPTNS= <>
##$ZL1= 120
##$ZL2= 120
##$ZL3= 120
##$ZL4= 120
##$ABSF1= 16.522
##$ABSF2= -4.171173
##$ABSG= 5
##$ABSL= 3
##$ALPHA= 0
##$AQORDER= 0
##$ASSFAC= 0
##$ASSFACI= 0
##$ASSFACX= 0
##$ASSWID= 0
##$AUNMP= <proc_1d>
##$AZFE= 0.1
##$AZFW= 0.1
##$BCFW= 0
##$BC_mod= 0
##$BYTORDP= 0
##$COROFFS= 0
##$CY= 12.5
##$DATMOD= 1
##$DC= 0
##$DFILT= <>
##$DTYPP= 0
##$F1P= 14.0000005364418
##$F2P= -0.99999901652339
##$FCOR= 0.5
##$FTSIZE= 32768
##$FT_mod= 6
##$GAMMA= 0
##$GB= 0
##$INTBC= 1
##$INTSCL= 1
##$ISEN= 128
##$LB= 0.3
##$LEV0= 0
##$LPBIN= 0
##$MAXI= 10000
##$MC2= 0
##$MEAN= 0
##$ME_mod= 0
##$MI= 0
##$NCOEF= 0
##$NC_proc= -8
##$NLEV= 6
##$NOISF1= 0
##$NOISF2= 0
##$NSP= 0
##$NTH_PI= 0
##$NZP= 0
##$OFFSET= 16.522
##$PC= 1
##$PHC0= 97.71489
##$PHC1= 22.06221
##$PH_mod= 1
##$PKNL= yes
##$PPARMOD= 0
##$PSCAL= 4
##$PSIGN= 0
##$REVERSE= no
##$SF= 250.13
##$SI= 32768
##$SIGF1= 0
##$SIGF2= 0
##$SINO= 400
##$SIOLD= 32768
##$SREGLST= <1H.CDCl3>
##$SSB= 0
##$STSI= 32768
##$STSR= 0
##$SW_p= 5175.98343685301
##$SYMM= 0
##$S_DEV= 0
##$TDeff= 65536
##$TDoff= 0
##$TI= <Analysis number 999999
Compound Code 99
Book Reference 9
Project Code 9>
##$TILT= no
##$TM1= 0
##$TM2= 0
##$TOPLEV= 0
##$USERP1= <user>
##$USERP2= <user>
##$USERP3= <user>
##$USERP4= <user>
##$USERP5= <user>
##$WDW= 1
##$XDIM= 32768
##$YMAX_p= 368416612
##$YMIN_p= -1467980
$$ End of Bruker specific parameters
$$ ---------------------------------
##NTUPLES= NMR SPECTRUM
##VAR_NAME=  FREQUENCY,     SPECTRUM/REAL,   SPECTRUM/IMAG
##SYMBOL=    X,             R,               I
##VAR_TYPE=  INDEPENDENT,   DEPENDENT,       DEPENDENT
##VAR_FORM=  AFFN,          ASDF,            ASDF
##VAR_DIM=   32768,         32768,           32768
##UNITS=     HZ,            ARBITRARY UNITS, ARBITRARY UNITS
##FACTOR=    0.157963299565203, 1,           1
##FIRST=     4132.6476996994, 0,             0
##LAST=      -1043.33573715361, 0,           0
##MIN=       -1043.33573715361, -1467980,    0
##MAX=       4132.6476996994, 368416612,     0
$$ Real data points
##PAGE= N=1
##DATA TABLE= (X++(R..R)), XYDATA
$$ [...]
$$ plain form
20039 488180 393033 156084 69477 10335 -6381 -270656 -368616 -386227 -307855 70505 -29153
20028 -29153 -267090 -299729 -183595 -197670 -133848 -246185 -351446 -3958 -29146 175765
20018 175765 398878 341528 192370 144917 -202376 -622498 -842953 -569430 -442868 -292829
20008 -292829 175432 504960 487013 369604 321800 258973 16851 141467 394816 374133
19998 374133 181781 143470 265068 42461 -122285 1430 -14235 -196635 -137775 -216686
19988 -216686 33711 -203927 -257790 -198681 212956 408134 171987 59893 123114 7619
19978 7619 -147881 -262846 199236 447368 379837 80376 286713 432309 410205 261370
19968 261370 206840 288272 414149 135778 73517 -42314 -157570 -167869 -61685 247333
$$ packed form
20039D88180r5147k36949q6607n9142j6716k64275r7960j7611P8372L78360r9658
20028b9153k37937l2639J16134j4075O3822j12337j05261L47488k5188K04911
20018A75765K23113n7350j49158m7453l47293m20122k20455K73523J26562J50039
20008b92829M68261L29528j7947j17409m7804o2827k42122J24616K53349k0683
19998C74133j92352l8311J21598k22607j64746J23715j5665j82400N8860p8911
19988b16686K50397k37638n3863N9109M11637J95178k36147j12094O3221j15495
19978G619j55500j14965M62082K48132o7531k99461K06337J45596k2104j48835
19968B61370n4530Q1432J25877k78371o2261j15831j15256j0299J06184L09018
$$ plain form
19958 247333 402313 686274 682708 419351 456700 445237 -69 292738 136027 380425
19948 380425 678667 455291 418996 569934 774667 780294 931655 899736 1213520 1018361
19938 1018361 803130 423263 189965 -36975 -35181 268692 379745 416364 538636 392836
19928 392836 196287 151925 -54086 -247072 -309182 -261427 -159952 -6991 -236417 -359599
19918 -359599 -409791 -468803 76076 28998 117229 -133041 -77541 15514 -230276 -95339 374887
19907 374887 631722 333793 2706 231672 13076 -153620 -216908 -487993 -156346 146785
19897 146785 215860 170845 70719 227615 -5101 -366372 -288338 316906 747907 793721
19887 793721 630572 372571 254285 22191 118383 -160595 -280458 -306706 -339337 -340651
$$ packed form
19958B47333J54980K83961l566k63357L7349j1463m45306K92807j56711K44398
19948C80425K98242k23376l6295J50938K04733N627J51361l1919L13784j95159
19938A018361k15231l79867k33298k26940J794L03873J11053L6619J22272j45800
19928C92836j96549m4362k06011j92986o2110M7755J01475J52961k29426j23182
19918c59599n0192n9012N44879m7078Q8231k50270N5500R3055k45790J34937M70226
19907C74887K56835k97929l31087K28966k18596j66696o3288k71085L31647L03131
19897A46785O9075m5015j00126J56896k32716l61271P8034O05244M31001M5814
19887G93721j63149k58001j18286k32094R6192k78978j19863k6248l2631j314
$$ plain form
19877 -340651 -198773 -23497 241653 271647 -187400 -230315 396514 650633 324734 183071
19867 183071 5341 -109659 90597 139667 230149 177090 -151650 22353 317722 357606
19857 357606 675921 750385 529054 251224 212478 26011 -89333 -313131 -472888 -85653
19847 -85653 -93723 -71964 -144161 -180281 191776 570362 287670 171741 110082 205531 708536
19836 708536 634290 230279 362033 684892 592318 578288 25945 -325057 -444477 -133310
19826 -133310 -173845 -135892 -118319 -109155 145112 -333166 -432410 -255032 -35659 56060 -278103
19815 -278103 -556394 -298750 -16796 231651 260968 267752 423201 374405 320565 330992 231740
19804 231740 386295 571339 811490 589566 555445 766144 947467 973111 883762 739055
$$ packed form
19877c40651J41878J75276K65150K9994m59047m2915O26829K54119l25899j41663
19867A83071j77730j15000K00256M9070R0482n3059l28740J74003K95369L9884
19857C57606L18315P4464k21331k77830l8746j86467j15344k23798j59757L87235
19847h5653q070K1759p2197l6120L72057L78586k82692j15929o1659R5449N03005
19836G08536p4246m04011J31754L22859r2574j4030n52343l51002j19420L11167
19826a33310m0535L7953J7573R164K54267m78278r9244J77378K19373R1719l34163
19815b78103k78291K57644K81954K48447K9317O784J55449m8796n3840J0427r9252
19804B31740J54555J85044K40151k21924l4121K10699J81323K5644q9349j44707
$$ plain form
19794 739055 913550 1132044 568723 149979 143541 341781 447349 459968 519357 709155
19784 709155 561125 598952 868971 677282 300537 105376 259561 220005 109645 182163
19774 182163 313216 70427 -389366 -389202 -206816 -45283 -29114 55986 95608 114800 -79268
19763 -79268 -203476 -91193 48396 11369 4519 140381 56146 -126991 -340011 -230860
19753 -230860 107027 34222 -49413 -26501 -164327 -378702 -561070 -622316 -552903 -563863 -456074
19742 -456074 -405992 -572470 -448887 -148879 133262 109614 18816 53870 177438 -161313
19732 -161313 -632064 -483393 -410644 -596968 -454478 -324089 -277415 -193251 -264165 -219645
19722 -219645 69212 97660 -26453 -75260 -116630 79852 164254 -106640 -49998 203192
$$ packed form
19794G39055J74495K18494n63321m18744o438J98240J05568J2619N9389J89798
19784G09155j48030L7827K70019j91689l76745j95161J54185l9556j10360P2518
19774A82163J31053k42789m59793J64J82386J61533J6169Q5100L9622J9192j94068
19763g9268j24208J12283J39589l7027o850J35862q4235j83137k13020J09151
19753b30860L37887p2805q3635K2912j37826k14375j82368o1246O9413j0960J07789
19742d56074N0082j66478J23583L00008K82141k3648r0798L5054J23568l38751
19732a61313m70751J48671P2749j86324J42490J30389M6674Q4164p0914M4520
19722b19645K88857K8448j24113m8807m1370J96482Q4402k70894N6642K53190
$$ plain form
19712 203192 121067 -69853 -156235 -204765 -389502 -482644 -409016 -672661 -893859 -645770
19702 -645770 -556959 -303336 -31457 104670 277048 524253 743169 365017 57846 -7414
19692 -7414 69983 74533 66874 1259 354931 536156 227766 -293345 -621040 -398109 -28854
19681 -28854 73355 287259 52350 63949 178456 -31917 58890 -145638 185178 546379
19671 546379 532216 646024 575157 620788 677222 817027 967154 966933 594776 68422 4243
19660 4243 123297 -165264 54404 116300 -69048 -278817 -422376 -230293 35425 18420
19650 18420 33709 68397 417238 809740 921696 654377 552987 588969 629509 472587
19640 472587 525921 670464 397279 608572 499479 554663 643234 928740 1036308 467142
$$ packed form
19712B03192q2125j90920q6382m8530j84737r3142P3628k63645k21198K48089
19702f45770Q8811K53623K71879J36127J72378K47205K18916l78152l07171o5260
19692g414P7397M550p659o5615L53672J81225l08390n21111l27695K22931L69255
19681b8854J02209K13904k34909J1599J14507k10373R0807k04528L30816L61201
19671E46379j4163J13808p0867M5631N6434J39805J50127k21l72157n26354o4179
19660D243J19054k88561K19668O1896j85348k09769j43559J92083K65718j7005
19650A8420J5289L4688L48841L92502J11956k67319j01390L5982M0540j56922
19640D72587N3334J44543k73185K11293j09093N5184Q8571K85506J07568n69166
$$ plain form
19630 467142 494160 562885 603280 813969 349201 53732 333795 461479 669392 725530
19620 725530 905037 753242 901777 870647 871457 833010 942708 830196 586673 571483 559705
19609 559705 530346 703026 507371 581866 825354 908626 1035466 1464901 1100034 988303
19599 988303 923058 1102606 1248009 1136672 1114107 955172 923736 659549 708402 1013581
19589 1013581 1181952 1217092 1303883 1432691 1352120 1442918 1317359 1320039 1208108 1383063
19579 1383063 1586565 2172529 2633663 2312499 1726654 1689194 1485288 1255230 1305743 1403608
19569 1403608 1286180 1358485 1133011 1112547 1221410 1645970 1962004 1794182 1954847 2207944
19559 2207944 2165427 2272098 2868474 3393938 3949269 3977408 3979260 3912204 3819889 3654146
$$ packed form
19630D67142K7018O8725M0395K10689m64768k95469K80063J27684K07913N6138
19620G25530J79507j51795J48535l1130Q10l8447J09698j12512k43523j5190j1778
19609E59705k9359J72680j95655P4495K43488Q3272J26840M29435l64867j11731
19599I88303o5245J79548J45403j11337k2565j58935l1436k64187M8853L05179
19589A013581J68371L5140Q6791J28808q0571R0798j25559K680j11931J74955
19579A383063K03502N85964M61134l21164n85845l7460k03906k30058N0513R7865
19569A403608j17428P2305k25474k0464J08863M24560L16034j67822J60665K53097
19559B207944m2517J06671N96376N25464N55331K8139J852o7056r2315j65743
$$ plain form
19549 3654146 4240839 4692132 4472369 4423643 4753262 5441433 5649211 5667193 5632740 5868473
19539 5868473 6096566 6683359 7228005 7867270 8364883 9221315 10341476 11917269 13808534
19530 13808534 15726862 18459940 22069229 26978657 34211267 44009279 57290071 75110442
19522 75110442 97265167 122044226 146383713 166367766 177177395 176562357 165072744
19515 165072744 144986769 121572324 98671985 78558802 62116103 49799740 40505896
19508 40505896 33078645 27273072 23120727 19779217 17126152 15182479 13454538 11703910
19500 11703910 10266857 9191365 8442249 7635091 6771208 5921249 5367627 5005362 4618020
19491 4618020 4348908 4130011 3902035 4143320 3736623 3234845 3398176 3686393 3609943 3617697
$$ packed form
19549C654146N86693M51293k19763m8726L29619O88171K07778J7982l4453K35733
19539E868473K28093N86793N44646O39265M97613Q56432J120161J575793J891265
19530A3808534J918328K733078L609289M909428P232610R798012J3280792J7820371
19522G5110442K2154725K4779059K4339487J9984053J0809629o15038j1489613
19515A65072744k0085975k3414445k2900339k0113183j6442699j2316363r293844
19508D0505896p427251n805573m152345l341510k653065j943673j727941j750628
19500A1703910j437053j075492p49116q07158q63883q49959n53622l62265l87342
19491D618020k69112k18897k27976K41285m06697n01778J63331K88217p6450P754
$$ plain form
19481 3617697 3753825 3814397 3705294 3181709 2864108 2732821 2238168 1901824 1628750 1456484
19471 1456484 1313527 1133763 1376649 1487379 1568636 1274800 913049 681606 588593 420734
19461 420734 183696 267369 388003 115747 -56911 -44401 -337717 -208334 97046 -148545
19451 -148545 -248830 130681 426327 205102 72917 174238 407913 329022 196043 278491
19441 278491 222841 190468 -40076 17584 365872 813793 747300 1089295 676101 346031
19431 346031 438141 444717 99332 301404 410803 306441 160890 -9507 -31780 1413
19421 1413 268489 300734 594874 729701 822693 895298 918336 976167 637696 447968 128267
19410 128267 79470 346280 473447 683676 668121 700893 765925 516168 466008 632187
$$ packed form
19481C617697J36128O0572j09103n23585l17601j31287m94653l36344k73074j72266
19471A456484j42957j79764K42886J10730Q1257k93836l61751k31443r3013j67859
19461D20734k37038Q3673J20634k72256j72658J2510k93316J29383L05380k45591
19451a48545j00285L79511K95646k21225j32185J01321K33675p8891j32979Q2448
19441B78491n5650l2373k30544N7660L48288M47921o6493L41995m13194l30070
19431C46031R2110O576l45385K02072J09399j04362j45551j70397k2273L3193
19421A413K67076L2245K94140J34827R2992P2605K3038N7831l38471j89728l19701
19410A28267m8797K66810J27167K10229j5555L2772O5032k49757n0160J66179
$$ plain form
19400 632187 585316 233970 15970 -33830 -324348 -345465 -492053 -94130 529309 567150
19390 567150 351969 433858 454412 440985 734436 1056130 1099832 1026285 694137 546688
19380 546688 773030 950253 947331 887419 911115 826448 702901 895769 1050935 673937
19370 673937 454632 187437 -161942 174532 518669 380177 452454 491601 474501 620655
19360 620655 762251 879310 1105339 1108211 1510050 1297400 1243169 1117009 638394 533413
19350 533413 650313 785625 581528 573288 665601 1021229 1243216 1304689 1492954 1256414
19340 1256414 1245511 1108986 977427 1198416 1155654 1412809 1933107 1962207 2030147 1969089
19330 1969089 1887603 2441774 2844049 2687197 2245345 2032586 2258666 2406924 2979977 3296149
$$ packed form
19400F32187m6871l51346k18000m9800k90518k1117j46588L97923O23439L7841
19390E67150k15181Q1889K0554j3427K93451L21694M3702p3547l32148j47449
19380E46688K26342J77223k922n9912K3696q4667j23547J92868J55166l76998
19370F73937k19305k67195l49379L36474L44137j38492P2277L9147j7100J46154
19360F20655J41596J17059K26029K872M01839k12650n4231j26160m78615j04981
19350E33413J16900J35312k04097q240R2313L55628K21987O1473J88265k36540
19340A256414j0903j36525j31559K20989m2762K57155N20298K9100O7940o1058
19330A969089q1486N54171M02275j56852m41852k12759K26080J48258N73053L16172
$$ plain form
19320 3296149 3244523 3470946 3248373 3256104 3770127 4169053 4701257 5140367 5227765 5563015
19310 5563015 6189391 6782606 7204214 7753735 8474832 9039489 9588830 10127023 11092599
19301 11092599 12353905 13863603 15379252 17225891 20022266 23742335 28572616 34723163
19293 34723163 43707336 56419310 73302040 94941565 120427675 146486359 167208512
19286 167208512 177132329 173814409 158296420 135782187 111466445 89648916 71986985
19279 71986985 58062513 47745291 39882067 33663369 28581700 24537425 21152765 17793297
19271 17793297 15625495 14346598 13022314 11601817 10473105 9566114 9069835 8461028
19263 8461028 7726759 6745082 6544084 6320931 5947109 5716210 5161830 4338596 4204589
$$ packed form
19320C296149n1626K26423k22573P731N14023L98926N32204M39110Q7398L35250
19310E563015O26376N93215M21608N49521P21097N64657N49341N38193R65576
19301A1092599J261306J509698J515649J846639K796375L720069M830281O150547
19293C4723163Q984173J2711974J6882730K1639525K5486110K6058684K0722153
19286A67208512R923817l317920j5517989k2514233k4315742k1817529j7661931
19279G1986985j3924472j0317222p863224o218698n081669m044275l384660l359468
19271A7793297k167802j278897j324284j420497j128712r06991m96279o08807
19263H461028p34269r81677k00998k23153l73822k30899n54380q23234j34007
$$ plain form
19254 4204589 4023979 3624580 3139874 2868394 2800137 2681630 2790196 3136327 3381399 3547934
19244 3547934 3329573 3037253 2951626 2900686 2710599 2466831 2225838 2168399 1993086 1754067
19234 1754067 1394976 1309455 1426953 1347309 1208826 916829 715138 556197 565497 763862
19224 763862 750629 512954 260299 198806 235861 253765 -59849 -179279 -248409 -393319
19214 -393319 -343473 -19769 261500 570414 1008412 651790 181894 -24997 264917 252364
19204 252364 155505 328814 580329 767380 650243 420240 183089 -92466 -287375 -471042
19194 -471042 -290676 -231421 12306 259988 201093 -48440 37188 -72511 -77212 273066
19184 273066 518839 476469 216232 -89669 -90259 -190174 -199019 -42070 -272989 -247773 272378
$$ packed form
19254D204589j80610l99399m84706k71480o8257j18507J08566L46131K45072J66535
19244C547934k18361k92320q5627n0940j90087k43768k40993n7439j75313k39019
19234A754067l59091q5521J17498p9644j38483k91997k01691j58941R300J98365
19224G63862j3233k37675k52655o1493L7055J7904l13614j19430o9130j44910
19214c93319M9846L23704K81269L08914M37998l56622m69896k06891K89914j2553
19204B52364r6859J73309K51515J87051j17137k30003k37151k75555j94909j83667
19194d71042J80366N9255K43727K47682n8895k49533Q5628j09699m701L50278
19184B73066K45773m2370k60237l05901n90r9915q845J56949k30919K5216N20151
$$ plain form
19173 272378 372501 160076 202540 -55910 231283 320217 309866 588583 491057 223607
19163 223607 -14304 57970 381663 29524 -133789 83046 270218 205436 152385 24183
19153 24183 -86184 -160512 -324424 -354040 -295347 -7056 10660 66809 282976 448452 492546
19142 492546 211556 237505 541677 584021 351237 38453 -9258 -300594 -315997 -121725
19132 -121725 133824 250047 87625 -127529 -150616 -416556 -354394 -204451 218772 291958
19122 291958 285425 31189 -95149 -221181 76253 129177 12286 63153 -180421 -217165
19112 -217165 -159985 179584 210948 363150 247092 278140 244988 278427 232654 378330 308658
19101 308658 253570 431909 727186 680764 323883 -66230 -228068 -203118 67370 131835
$$ packed form
19173B72378J00123k12425M2464k58450K87193Q8934j0351K78717r7526k67450
19163B23607k37911P2274L23693l52139j63313K16835J87172o4782n3051j28202
19153B4183j10367p4328j63912k9616N8693K88291J7716N6149K16167J65476M4094
19142D92546k80990K5949L04172M2344k32784l12784m7711k91336j5403J94272
19132a21725K55549J16223j62422k15154k3087k65940O2162J49943M23223P3186
19122B91958o533k54236j26338j26032K97434N2924j16891N0867k43574l6744
19112b17165N7180L39569L1364J52202j16058L1048l3152L3439m5773J45676o9672
19101C08658n5088J78339K95277m6422l56881l90113j61838K4950K70488O4465
$$ plain form
19091 131835 283309 704723 673345 808960 685497 491792 160364 281656 359407 476773
19081 476773 441609 630448 583094 522619 513378 631235 815047 682095 516941 855818
19071 855818 1219239 1377942 1369638 1351626 1012922 795523 936498 1011856 1039204 1068510 797360
19060 797360 1020783 1354774 1433074 1539691 1843809 1722911 1262903 825504 823862 457517
19050 457517 270324 118130 44740 209881 285538 567927 436306 413494 568195 225214
19040 225214 -71753 -97132 162013 -4145 104276 439633 583948 275590 -46013 223620
19030 223620 372204 199503 -102411 -350972 -57544 172172 32385 -4168 -64448 -39357
19020 -39357 390948 705437 554648 580286 370341 246890 276557 794719 1025231 926165
$$ packed form
19091A31835J51474M21414l1378J35615j23463j93705l31428J21292P7751J17366
19081D76773l5164J88839m7354o0475r241J17857J83812j32952j65154L38877
19071H55818L63421J58703q304j8012l38704k17399J40975P5358K7348K9306k71150
19060G97360K23423L33991P8300J06617L04118j20898m60008m37399j642l66345
19050D57517j87193j52194p3390J65141P5657K82389j31621k2812J54701l42981
19040B25214k96967k5379K59145j66158J08421L35357J44315l08358l21603K69633
19030B23620J48584j72701l01914k48561K93428K29716j39787l6553o0280K5091
19020c9357M30305L14489j50789K5638k09945j23451K9667N18162K30512r9066
$$ plain form
19010 926165 1098385 1203650 1037288 837288 949060 1434311 1275514 648621 311653 257843
19000 257843 491064 519807 633786 789893 848762 765684 485103 269149 315976 77418
18990 77418 103211 122450 238950 480953 773554 1046847 951836 886729 842566 606588 365208
18979 365208 459867 691303 628096 156998 91553 155768 217069 407525 358536 333670 225029
18968 225029 257060 170244 286929 54756 26797 271851 504127 456736 449369 515920 760042
18957 760042 961092 1103360 1053179 858531 531398 513804 634253 504514 617387 382479
18947 382479 189135 95314 55702 499171 630387 380867 401632 493564 679160 328852
18937 328852 23668 -121029 -654687 -601160 -353407 -441574 -465349 -395352 -249583 -450641
$$ packed form
19010I26165J72220J05265j66362k00000J11772M85251j58797o26893l36968n3810
19000B57843K33221K8743J13979J56107N8869q3078k80581k15954M6827k38558
18990G7418K5793J9239J16500K42003K92601K73293r5011o5107m4163k35978k41380
18979C65208R4659K31436o3207m71098o5445O4215O1301J90456m8989k4866j08641
18968B25029L2031q6816J16685k32173k7959K45054K32276m7391p367O6551K44122
18957G60042K01050J42268n0181j94648l27133j7594J20449j29739J12873k34908
18947C82479j93344r3821l9612M43469J31216k49520K0765R1932J85596l50308
18937C28852l05184j44697n33658N3527K47753q8167k3775O9997J45769k01058
$$ plain form
18927 -450641 -598113 -451548 -192987 163522 283948 349538 315379 148790 32914 210752
18917 210752 216890 266961 359065 382622 248488 168945 348981 494320 446404 371273 482499
18906 482499 466165 170308 -61599 90603 173059 369338 111372 -10776 29845 124294
18896 124294 1428 -233764 -259916 -207183 -72235 116911 287476 293179 100622 65218
18886 65218 230672 -4297 -343350 -298479 175188 282974 -9887 -27784 59707 117142
18876 117142 391588 725301 437484 -71198 -46295 188043 339048 666019 852712 937582
18866 937582 451385 161572 45713 292283 421641 319931 431632 297437 314786 628141
18856 628141 908937 967709 949696 1022573 1075378 1197701 1362940 1214039 1322160 1268812
$$ packed form
18927d50641j47472J46565K58561L56509J20426O5590l4159j66589j15876J77838
18917B10752O138N0071R2104K3557j34134p9543J80036J45339m7916p5131J11226
18906D82499j6334k95857k31907J52202Q2456J96279k57966j22148M0621R4449
18896A24294j22866k35192k6152N2733J34948J89146J70565N703j92557l5404
18886F5218J65454k34969l39053M4871M73667J07786k92861j7897Q7491N7435
18876A17142K74446L33713k87817n08682K4903K34338J51005L26971J86693Q4870
18866I37582m86197k89813j15859K46570J29358j01710J11701j34195J7349L13355
18856F28141K80796N8772j8013P2877N2805J22323J65239j48901J08121n3348
$$ plain form
18846 1268812 1051613 890749 682248 402025 355143 454391 500739 613277 547976 260411
18836 260411 288710 377068 114304 27272 47406 226656 339723 387964 586441 742500
18826 742500 685820 198119 -98407 5431 -249856 -162012 442959 1053452 1099912 937158
18816 937158 679738 495954 147474 375604 425512 581073 420427 300516 395969 449549
18806 449549 456804 693373 869962 904106 644416 679916 910147 954414 841048 956725
18796 956725 1079338 1023538 697165 297012 -16477 316763 937112 1441706 1418821 1467301
18786 1467301 1404705 1350975 1320702 1634157 2345357 3216992 3861887 4056707 3807879 3080517
18776 3080517 2859206 2860580 3562065 4061746 4431678 4372350 3871836 3325970 2992538 3498738
$$ packed form
18846A268812k17199j60864k08501k80223m6882R9248M6348J12538o5301k87565
18836B60411K8299Q8358k62764q7032K0134J79250J13067M8241J98477J56059
18826G42500n6680m87701k96526J03838k55287Q7844O04971O10493M6460j62754
18816I37158k57420j83784l48480K28130M9908J55561j60646j19911R5453N3580
18806D49549P255K36569J76589L4144k59690L5500K30231M4267j13366J15677
18796I56725J22613n5800l26373m00153l13489L33240O20349N04594k2885M8480
18786A467301o2596n3730l0273L13455P11200Q71635O44895J94820k48828p27362
18776C080517k21311J374P01485M99681L69932n9328n00514n45866l33432N06200
$$ plain form
18766 3498738 3522554 3589603 3906629 4367247 4352903 4247223 4342241 4588432 4601194 5123199
18756 5123199 6204861 7940325 11023730 14830108 18162639 21709581 25488022 25963507
18748 25963507 23632548 21657460 19800510 18023473 18533004 21366760 24530983 27447658
18740 27447658 30654651 30683248 27181768 24217964 21276896 18467545 17543260 19273749
18732 19273749 24135485 31351627 37403449 36542106 29947671 24222072 22068915 23482537
18724 23482537 28573009 35872248 41607127 41266704 35662734 30566307 28140424 26281746
18716 26281746 24349798 24732459 28330944 31747924 29628267 24740482 22981358 23927274
18708 23927274 24821880 24735404 25456067 26057042 25550715 26097217 30545744 36195143 36832306
$$ packed form
18766C498738K3816O7049L17026M60618j4344j05680R5018K46191J2762N22005
18756E123199J081662J735464L083405L806378L332531L546942L778441M75485
18748B5963507k330959j975088j856950j777037N09531K833756L164223K916675
18740B7447658L206993K8597l501480k963804k941068k809351r24285J730489
18732A9273749M861736P216142O051822q61343o594435n725599k153157J413622
18724B3482537N090472P299239N734879l40423n603970n096427k425883j858678
18716B6281746j931948L82661L598485L416980k119657m887785j759124R45916
18708B3927274Q94606q6476P20663O00975n06327N46502M448527N649399O37163
$$ plain form
18699 36832306 33493328 33812581 39012838 43538966 44970624 46625333 47458511 43379411
18691 43379411 38232382 33959812 30026872 28337123 30436862 34795956 39376170 44200380
18683 44200380 47601720 44704026 38662354 32906004 25680851 18822710 14627086 11700148
18675 11700148 9952290 8828048 8108109 7465731 7271322 7608487 7401703 7370343 7432644
18666 7432644 7321245 7604985 8438096 8236440 7061913 6070219 5789107 6238564 6515332
18657 6515332 5908532 5604661 5328552 5219232 5568072 6316586 6537992 5485687 4336556
18648 4336556 3797749 3458880 3307059 3323622 3179546 3021096 2379367 1914555 1824622 2212670
18638 2212670 2258521 2414674 2593324 2345042 2386075 2163868 2304430 2434544 2431710 2082015
$$ packed form
18699C6832306l338978L19253N200257M526128J431658J654709Q33178m079100
18691D3379411n147029m272570l932940j689749K099739M359094M580214M824210
18683D4200380L401340k897694o041672n756350p225153o858141m195624k926938
18675A1700148j747858j124242p19939o42378j94409L37165k06784l1360O2301
18666G432644j11399K83740Q33111k01656j174527r91694k81112M49457K76768
18657F515332o06800l03871k76109j09320L48840P48514K21406j052305j149131
18648D336556n38807l38869j51821J6563j44076j58450o41729m64812q9933L88048
18638B212670M5851J56153J78650k48282M1033k22207J40562J30114k834l49695
$$ plain form
18628 2082015 2017433 1990410 2128880 2083081 1923645 2179278 2894126 2886344 2515155 2394082
18618 2394082 2415774 2456440 2600877 2482200 2422508 2163509 1529249 1096299 1320639 1515715
18608 1515715 1336965 1265147 1471554 1936148 1969700 1987771 1746638 1776437 2218566 2207115
18598 2207115 2176306 2480013 2740346 3048867 3314832 3607768 3688066 3974013 4424716 4417063
18588 4417063 4534296 4727023 4913690 5292539 5756608 6218392 7423216 8279017 9235932
18579 9235932 10235225 11694404 14611408 18585667 22234953 24594176 27802028 34719760
18571 34719760 41811087 45625665 47672786 50624469 58169065 69164629 74679348 71649693
18563 71649693 71826561 80956787 91191519 92661687 89760811 91635508 98296572 102700657
$$ packed form
18628B082015o4582k7023J38470m5799j59436K55633P14848p782l71189j21073
18618B394082K1692M0666J44437j18677n9692k58999o34260m32950K24340J95076
18608A515715j78750p1818K06407M64594L3552J8071k41133K9799M42129j1451
18598B207115l0809L03707K60333L08521K65965K92936Q0298K85947M50703p653
18588D417063J17233J92727J86667L78849M64069M61784J204824Q55801R56915
18579I235932R99293J459179K917004L974259L649286K359223L207852O917732
18571C4719760P091327L814578K047121K951683P544596J0995564N514719l029655
18563G1649693J76868R130226J0234732J470168k900876J874697O661064M404085
$$ plain form
18555 102700657 102985056 101827227 100315043 93485979 85330036 80909253 78562287 75031226
18547 75031226 70574280 66116064 62233697 57266045 53287440 52161709 48943472 39674428
18539 39674428 29883441 23042882 19128710 16196773 14239349 12920654 11447221 10394120
18531 10394120 9635210 8707565 8159973 7587228 7193530 7095616 7111197 6859188 6344981 5704655
18521 5704655 5653337 5472047 5695536 6344161 6509188 6249337 5902554 5642745 6238794 6925446
18511 6925446 7155568 7215122 7888224 8867656 9805470 10951426 12564673 14809081 18444556
18502 18444556 24432292 33855276 50446255 76347462 102914413 109345843 93897462
18495 93897462 80492680 80926096 92003996 98613946 87275701 66223445 50414677
$$ packed form
18555A02700657K84399j157829j512184o829064q155943m420783k346966l531061
18547G5031226m456946m458216l882367m967652l978605j125731l218237r269044
18539C9674428r790987o840559l914172k931937j957424j318695j473433j053101
18531A0394120p58910r27645n47592n72745l93698r7914J5581k52009n14207o40326
18521E704655n1318j81290K23489O48625J65027k59851l46783k59809N96049O86652
18511F925446K30122N9554O73102R79432R37814J145956J613247K244408L635475
18502A8444556N987736R422984J6590979K5901207K6566951O431430j5448381
18495I3897462j3404782M33416J1077900O609950j1338245k1052256j5808768
$$ plain form
18488 50414677 42294476 39778760 42446232 49689067 58199844 65623227 73966921 78370227
18480 78370227 72391608 64706015 58990263 53152025 49731521 50727393 54613529 58487599
18472 58487599 63693732 67624413 64738126 58992937 55388398 52540847 51680008 58065637
18464 58065637 76597898 111595088 155330129 178354302 158330136 118661913 90363860
18457 90363860 80753800 87483832 110437780 142132856 155176459 131492872 94546794
18450 94546794 65577220 47135645 36135611 29488487 24966883 21663722 18890458 16656960
18442 16656960 14252992 12383001 11348665 10805778 10741676 10789062 11215302 11795610 11693181
18433 11693181 12087419 13058852 12970093 11685619 10871872 10050388 9123064 8513014 8468862
$$ packed form
18488E0414677q120201k515716K667472P242835Q510777P423383Q343694M403306
18480G8370227n978619p685593n715752n838238l420504R95872L886136L874070
18472E8487599N206133L930681k886287n745189l604539k847551q60839O385629
18464E8065637J8532261L4997190M3735041K3024173k0024166l9668223k8298053
18457I0363860r610060O730032K2953948L1695076J3043603k3683587l6946078
18450I4546794k8969574j8441575j1000034o647124m521604l303161k773264k233498
18442A6656960k403968j869991j034336n42887o4102M7386M26240N80308j02429
18433A1693181L94238R71433q8759j284474q13747q21484r27324o10050m4152
$$ plain form
18424 8468862 8779742 9379575 10732288 11137233 9988981 8855790 7789018 6608903 5578398
18415 5578398 4552562 4060396 4113760 3933789 3850335 3451380 2998499 2481678 2120747 2285714
18405 2285714 2505254 2691904 3261572 3658820 2988572 2330567 1836689 1511018 1267966
18396 1267966 1205239 918888 1111186 1016615 1187136 1399697 1172187 1143859 1315776 1121868
18386 1121868 923158 1353877 1091978 910128 780424 559402 545119 623560 515063 342384
18376 342384 327650 601441 802174 823099 1101905 1436545 1222412 980673 641238 575921
18366 575921 706686 1101904 1246760 1435363 1371822 1099710 818241 614828 473017 384931
18356 384931 493795 743977 492741 429437 716611 652293 808493 680836 502406 422441
$$ packed form
18424H468862L10880N99833J352713M04945j148252j133191j066772j180115j030505
18415E578398j025836m92166N3364j79971q3454l98955m52881n16821l60931J64967
18405B285714K19540J86650N69668L97248o70248o58005m93878l25671k43052
18396A267966o2727k86351J92298r4571J70521K12561k27510k8328J71917j93908
18386A121868j98710M30719k61899j81850j29704k21022j4283P8441j08497j72679
18376C42384j4734K73791K00733K0925K78806L34640k14133k41739l39435o5317
18366E75921J30765L95218J44856J88603o3541k72112k81469k03413j41811q8086
18356C84931J08864K50182k51236o3304K87174o4318J56200j27657j78430p9965
$$ plain form
18346 422441 343390 301906 408093 285527 58563 203866 368532 213077 419805 182719
18336 182719 -156286 125800 406337 153628 -67254 -183944 -221136 193936 456663 736431
18326 736431 951846 588027 481820 322631 543658 639534 760377 877677 1094375 1235332
18316 1235332 1039270 443379 304839 631607 943993 921951 539689 318932 411484 587528
18306 587528 881788 843242 777866 803728 762564 647725 611498 635605 448411 507068 929923
18295 929923 974341 669898 485598 539177 808049 414485 12783 462983 682927 840878
18285 840878 652869 366398 600067 534052 486310 268618 215194 549770 738385 531943
18275 531943 298625 603819 484393 67378 6533 110752 -63478 -207201 41480 228096
$$ packed form
18346D22441p9051m1484J06187j22566k26964J45303J64666j55455K06728k37086
18336A82719l39005K82086K80537k52709k20882j16690l7192M15072K62727K79768
18326G36431K15415l63819j06207j59189K21027R5876J20843J17300K16698J40957
18316A235332j96062n95891j38540L26768L12386k2042l82262k20757R2552J76044
18306E87528K94260l8546o5376K5862m1164j14839l6227K4107j87194N8657M22855
18295I29923M4418l04443j84300N3579K68872l93564m01702M50200K19944J57951
18285H40878j88009k86471K33669o6015m7742k17692n3424L34576J88615k06442
18275E31943k33318L05194j19426m17015o0845J04219j74230j43723K48681J86616
$$ plain form
18265 228096 514411 569676 298595 269601 162471 30214 -159463 -173743 -318776 -120975
18255 -120975 12911 341958 456226 183865 152223 164478 143741 275387 303913 260404
18245 260404 403906 477087 290996 -185269 -324654 -194691 -34863 160862 383830 314533
18235 314533 268289 197402 385107 625859 819927 1049142 756172 183656 120002 169927
18225 169927 154803 258189 96320 -100047 -279307 -210527 164649 414739 485715 248584
18215 248584 -216901 28783 187013 -55313 -250 218609 253827 36807 -151878 -65998
18205 -65998 106090 295678 443389 898289 858578 476719 410668 519072 602228 737239
18195 737239 688455 489206 366016 586900 560168 276028 -112342 -38918 169661 106550
$$ packed form
18265B28096K86315N5265k71081k8994j07130j32257j89677j4280j45033J97801
18255a20975J33886L29047J14268k72361l1642J2255k0737J31646K8526m3509
18245B60404J43502P3181j86091m76265j39385J29963J59828J95725K22968o9297
18235C14533m6244p0887J87705K40752J94068K29215k92970n72516o3654M9925
18225A69927j5124J03386j61869j96367j79260O8780L75176K50090P0976k37131
18215B48584m65485K45684J58230k42326N5063K18859L5218k17020j88685Q5880
18205f5998J72088J89588J47711M54900l9711l81859o6051J08404Q3156J35011
18195G37239m8784j99249j23190K20884k6732k84140l88370P3424K08579o3111
$$ plain form
18185 106550 -169385 -92947 180665 231773 208105 72975 195404 723756 679218 179766
18175 179766 5987 131999 420146 497147 296332 18020 -78693 263615 241890 477727
18165 477727 411689 33117 149944 -37133 -273894 -275593 95181 169094 116222 302316
18155 302316 448068 369639 118675 229237 575833 386500 427005 488332 348301 223590
18145 223590 496767 721987 839719 609622 748637 837230 905480 819784 832420 695148
18135 695148 848443 946968 1112774 1177915 1085813 1085850 948532 1085399 1125483 1098661 1414663
18124 1414663 1512175 1404978 1468325 1543635 1651147 1973736 2403377 2665681 2845574 3153946
18114 3153946 4294893 5918209 7784661 10254999 15328150 24152517 39567915 70642201
$$ packed form
18185A06550k75935P6438K73612N1108k3668j35130J22429N28352m4538m99452
18175A79766j73779J26012K88147P7001k00815k78312r6713L42308k1725K35837
18165D77727o6038l78572J16827j87077k36761j699L70774P3913n2872J86094
18155C02316J45752p8429k50964J10562L46596j89333M0505O1327j40031j24711
18145B23590K73177K25220J17732k30097J39015Q8593O8250q5696J2636j37272
18135F95148J53295R8525J65806O5141r2102L7j37318J36867M0084k6822L16002
18124A414663R7512j07197O3347P5310J07512L22589M29641K62304J79893L08372
18114C153946J140947J623316J866452K470338N073151Q824367J5415398L1074286
$$ plain form
18106 70642201 128820661 188104411 172205234 105624812 62049169 40584411 29682483
18099 29682483 23213295 18111164 14535472 12011014 9958216 7970398 6153175 5141974
18091 5141974 4657398 4350238 4141006 3805816 3541566 3094716 2636536 2415398 2069720
18082 2069720 1561555 950534 1041766 980993 942124 870406 1027254 1251483 1209753 795486
18072 795486 280660 172725 244208 377506 392204 194498 111434 294419 435630 487425
18062 487425 598743 330908 633999 946981 942084 690340 287282 271774 436904 731007
18052 731007 468130 226126 208382 -202475 -291381 174739 388999 -130235 5424 374382
18042 374382 628936 771352 441293 182663 28769 -118238 121286 592598 975303 983157
$$ packed form
18106G0642201N8178460N9283750j5899177o6580422m3575643k1464758j0901928
18099B9682483o469188n102131l575692k524458k052798j987818j817223j011201
18091E141974m84576l07160k09232l35190k64250m46850m58180k21138l45678
18082B069720n08165o11021R1232o0773l8869p1718J56848K24229m1730m14267
18072G95486n14826j07935P1483J33298J4698j97706q3064J82985J41211N1795
18062D87425J11318k67835L03091L12982m897k51744m03058j5508J65130K94103
18052G31007k62877k42004j7744m10857q8906M66120K14260n19234J35659L68958
18042C74382K54554J42416l30059k58630j53894j47007K39524M71312L82705P854
$$ plain form
18032 983157 1049623 670752 117820 95855 216504 37128 -76964 -174435 -58283 191537
18022 191537 217410 -161459 -55400 -220937 -354638 -124991 -51344 -55820 225643 284516
18012 284516 258760 -37800 317294 688898 671182 523995 523579 708865 374259 29311
18002 29311 -181785 -483446 -582464 -316493 -98676 -64580 133557 471495 685805 344919
17992 344919 11899 25824 57654 -11920 -174348 -142237 -12104 -141201 -292345 -281726
17982 -281726 57883 328636 503559 508124 230672 189153 591495 683526 518269 514371 40459
17971 40459 -102270 271685 317232 16170 -31925 -9065 180544 396417 514528 471360
17961 471360 470465 597141 830341 1076838 754626 613214 307933 -57522 106654 192345
$$ packed form
18032I83157O6466l78871n52932k1965J20649j79376j14092r7471J16152K49820
18022A91537K5873l78869J06059j65537j33701K29647P3647m476K81463N8873
18012B84516k5756k96560L55094L71604j7716j47187m16J85286l34606l44948
18002B9311k11096l01661r9018K65971K17817L4096J98137L37938K14310l40886
17992C44919l33020J3925L1830o9574j62428L2111J30133j29097j51144J0619
17982b81726L39609K70753J74923M565k77452m1519M02342R2031j65257l898m73912
17971D0459j42729L73955M5547l01062m8095K2860J89609K15873J18111m3168
17961D71360q95J26676K33200K46497l22212j41412l05281l65455J64176Q5691
$$ plain form
17951 192345 322887 254138 395543 675537 819329 550687 342543 -62557 -470712 -398996
17941 -398996 -501631 -561544 -279972 63562 19897 31698 63120 156801 120671 82245 22653
17930 22653 41885 90450 -176640 -231754 49627 174304 -149742 3593 373474 287641
17920 287641 -48494 -7968 115588 135078 110346 413298 164711 100048 250187 -14263
17910 -14263 225817 398776 138866 -76421 -32838 -135401 -16624 60837 81747 330
17900 330 -69813 -47117 -213153 -17299 385515 368613 -40046 -51148 125616 56670 47281
17889 47281 42010 16581 236990 -10929 -84899 -172362 -217658 18286 -149903 -348823 -332363
17878 -332363 -380271 -370321 -387650 -323365 -755040 -722536 -556533 -310292 -429706 -579940 -441533
$$ packed form
17951A92345J30542o8749J41405K79994J43792k68642k08144m05100m08155P1716
17941c98996j02635n9913K81572L43534m3665J1801L1422R3681l6130l8426n9592
17930B2653J9232M8565k67090n5114K81381J24677l24046J53335L69881q5833
17920B87641l36135M0526J23556J9490k4732L02952k48587o4663J50139k64450
17910a4263K40080J72959k59910k15287M3583j02563J18777P7461K0910q1417
17900C30p0143K2696j66036J95854M02814j6902m08659j1102J76764o8946r389
17889D7281n271k5429K20409k47919p3970q7463m5296K35944j68189j98920J6460
17878c32363m7908R950j7329O4285m31675L2504J66003K46241j19414j50234J38407
$$ plain form
17867 -441533 -468971 -209683 -28556 80672 303975 497460 167789 -39243 -120211 -298363
17857 -298363 9037 176183 356439 54204 -68312 35574 -224142 137766 240426 1042
17847 1042 429005 749121 847637 549540 194374 -67357 111317 101085 52507 -169558
17837 -169558 -58280 -168821 -422255 -365998 -399467 -266579 -269596 -40123 106070 -231642
17827 -231642 -386296 -533183 -695654 -627554 -779182 -562056 -111739 -110510 -494026 -810697
17817 -810697 -503410 -200699 113538 -7154 -148716 -471064 -890062 -503094 -199118 118496
17807 118496 184787 -40154 -281599 -165300 -319847 -182093 -244638 -412736 -106446 239139
17797 239139 155437 1961 -140897 -392412 -657648 -694484 -219236 -845 125499 55674
$$ packed form
17867d41533k7438K59288J81127J09228K23303J93485l29671k07032q0968j78152
17857b98363L07400J67146J80256l02235j22516J03886k59716L61908J02660k39384
17847A042M27963L20116R8516k98097l55166k61731J78674j0232m8578k22065
17837a69558J11278j10541k53434N6257l3469J32888l017K29473J46193l37712
17827b31642j54654j46887j62471O8100j51628K17126M50317J229l83516l16671
17817h10697L07287L02711L14237j20692j41562l22348m18998L86968L03976L17614
17807A18496O6291k24941k41445J16299j54547J37754o2545j68098L06290L45585
17797B39139q3702j53476j42858k51515k65236l6836M75248K18391J26344o9825
$$ plain form
17787 55674 30645 36102 135732 54264 -174564 -89851 130675 140925 -8024 74893 341933
17776 341933 264247 116773 79814 135892 246938 314699 400459 495435 178540 -289733 -502584
17765 -502584 -362979 -210922 -408018 -563226 -794840 -981923 -708644 -328055 -273243 -438290
17755 -438290 -457946 -105105 -227270 -279042 -11649 138906 249028 263616 -143605 -199197
17745 -199197 281831 637668 475112 446080 -50238 -441938 -356193 -95546 258393 172922
17735 172922 115390 248874 225101 -55833 -225122 -188587 -414254 -441235 -167007 -129784
17725 -129784 -196268 -302190 -29556 573880 721076 388110 190398 65483 -65527 -40737
17715 -40737 105284 -2919 -55395 27379 143255 162621 6619 -57464 -176880 -413164
$$ packed form
17787E5674k5029N457R9630q1468k28828Q4713K20526J0250j48949Q2917K67040
17776C41933p7686j47474l6959N6078J11046O7761Q5760R4976l16895m68273k12851
17765e02584J39605J52057j97096j55208k31614j87083K73279L80589N4812j65047
17755d38290j9656L52841j22165n1772K67393J50555J10122J4588m07221n5592
17745a99197M81028L55837j62556k9032m96318l91700Q5745K60647L53939q5471
17735A72922n7532J33484k3773k80934j69289L6535k25667k6981K74228L7223
17725a29784o6484j05922K72634O03436J47196l32966j97712j24915j31010K4790
17715d0737J46021j08203n2476Q2774J15876J9366j56002o4083j19416k36284
$$ plain form
17705 -413164 -404916 -125329 230791 186390 115665 489054 251943 189935 20669 241852
17695 241852 65227 -306196 100499 -2702 134010 -49066 31784 23175 -153263 -76735
17685 -76735 173877 242101 76704 -39543 -220814 -330832 -374227 -711216 -550562 -337439
17675 -337439 -288569 46875 364275 413157 370380 122182 62127 -423676 -788081 -820738
17665 -820738 -929651 -994461 -672822 -474797 -645064 -548373 -522228 -173070 -319898 -296719
17655 -296719 -5701 139651 189423 145489 -27415 80781 184830 223994 40493 -108437
17645 -108437 -93091 -224191 -401192 -130863 50154 91409 170097 150544 24677 -240666
17635 -240666 -158054 -376950 -491755 -337664 -349642 -706470 -676137 -187934 -313811 -294660
$$ packed form
17705d13164Q248K79587L56120m4401p0725L73389k37111o2008j69266K21183
17695B41852j76625l71423M06695j03201J36712j83076Q0850q609j76438P6528
17685g6735K50612O8224j65397j16247j81271j10018m3395l36989J60654K13123
17675c37439M8870L35444L17400M8882m2777k48198o0055m85803l64405l2657
17665h20738j08913o4810L21639J98025j70267R6691K6145L49158j46828K3179
17655b96719K91018J45352M9772m3934j72904J08196J04049L9164j83501j48930
17645a08437J5346j31100j77001K70329J81017M1255P8688j9553j25867k65343
17635b40666Q2612k18896j14805J54091j1978l56828L0333M88203j25877J9151
$$ plain form
17625 -294660 -306523 -513927 -212225 -93057 -257578 -283432 -546968 -316274 -68429 -424369
17615 -424369 -333348 30003 149342 495378 821845 726768 603916 178782 -273857 233653
17605 233653 223382 38494 24819 -208837 -197384 185537 241389 -156570 -517540 -280517
17595 -280517 -128595 -180721 -384120 -239977 -92523 -13115 205355 389884 346866 212818
17585 212818 -83456 -251937 -330167 -447524 -409861 -534121 -359632 -450464 -653188 -402868
17575 -402868 -202883 -150523 209839 370309 330093 158343 209716 281526 210859 106071
17565 106071 18654 -200692 90789 38118 277834 285142 158872 156341 328477 359536 556023
17554 556023 77461 -11035 88984 -47654 -273373 88701 273403 302002 131440 -115963
$$ packed form
17625b94660j1863k07404L01702J19168j64521k5854k63536K30694K47845l55940
17615d24369R1021L63351J19339L46036L26467r5077j22852m25134m52639N07510
17605B33653j0271j84888j3675k33656J1453L82921N5852l97959l60970K37023
17595b80517J51922n2126k03399J44143J47454P9408K18470J84529m3018j34048
17585B12818k96274j68481p8230j17357L7663j24260J74489r0832k02724K50320
17575d02868J99985N2360L60362J60470m0216j71750N1373P1810p0667j04788
17565A06071q7417k19346K91481n2671K39716P308j26270k531J72136L1059J96487
17554E56023m78562q8496J00019j36638k25719L62074J84702K8599j70562k47403
$$ plain form
17544 -115963 47953 203146 147494 285641 280907 84291 -444312 -372002 -541848 -346984
17534 -346984 -26951 -86429 -72474 167375 178251 -8870 -282363 -470711 -576508 -407598
17524 -407598 -311617 -192170 -143295 -115824 70107 -130989 -232678 -308015 -139793 -243542
17514 -243542 -189756 -20144 -89511 -173686 -258308 -553829 -796363 -774779 -262469 195256
17504 195256 140274 -101361 -113749 -251300 -129506 -217486 -222209 -196386 -81797 -65306 -166798
17493 -166798 82954 -209734 -528723 -525875 -234841 226421 325109 406459 204143 -112476
17483 -112476 -488607 -745484 -458450 -342557 -306629 -426820 -277761 -230974 -68512 -50419
17473 -50419 -215163 -113761 -302282 -323357 -157225 203956 158218 -125958 -68788 -196312
$$ packed form
17544a15963J63916J55193n5652J38147m734j96616n28603P2310j69846J94864
17534c46984L20033n9478J3955K39849J0876j87121k73493j88348j05797J68910
17524d07598R5981J19447M8875K7471J85931k01096j01689p5337J68222j03749
17514b43542N3786J69612o9367q4175q4622k95521k42534K1584N12310M57725
17504A95256n4982k41635j2388j37551J21794q7980m723K5823J14589J6491j01492
17493a66798K49752k92688l18989K848K91034M61262R8688Q1350k02316l16619
17483a12476l76131k56877K87034J15893L5928j20191J49059M6787J62462J8093
17473e0419j64744J01402j88521k1075J66132L61181m5738k84176N7170j27524
$$ plain form
17463 -196312 -502223 -536522 -648085 -716616 -596083 -370949 -402979 -489095 -603328 -539268
17453 -539268 -621190 -655757 -634002 -226840 -239177 -341899 -308926 -21170 169316 367769
17443 367769 265343 -210313 -320 178008 290444 810598 957697 798711 621643 253702
17433 253702 262386 300731 169200 427964 431613 -209099 -356540 -234181 -440765 -379335 -103656
17422 -103656 -105649 -113135 140886 279619 121699 -89875 -230308 -269998 -323731 -332722 -462303
17411 -462303 -471904 -238712 -136929 142543 -25895 -209960 -62203 290185 549473 289942
17401 289942 -128635 -97957 119888 37248 -168300 17892 127611 -170878 -200398 -22560
17391 -22560 51309 -276235 -360054 -182241 -5953 164341 -145466 -352098 -307215 -438672
$$ packed form
17463a96312l05911l4299j11563o8531J20533K25134l2030q6116j14233O4060
17453e39268q1922l4567K1755M07162j2337j02722L2973K87756J90486J98453
17443C67769j02426m75656K09993J78328J12436N20154J47099j58986j77068l67941
17433B53702Q684L8345j31531K58764L649o40712j47441J22359k06584O1430K75679
17422a03656j993p486K54021J38733j57920k11574j40433l9690n3733q991j29581
17411d62303r601K33192J01783K79472j68438j84065J47757L52388K59288k59531
17401B89942m18577L0678K17845q2640k05548J86192J09719k98489k9520J77838
17391b2560P3869l27544q3819J77813J76288J70294l09807k06632M4883j31457
$$ plain form
17381 -438672 -341341 -48774 -196807 -273243 -451202 -422320 -491940 -439706 -186402 -78251
17371 -78251 -324415 -314869 -87183 -169551 -261410 -231463 -136073 -135839 -201103 -365449 -352290 -34466
17359 -34466 -73774 -514277 -711769 -545811 33483 277690 491640 415693 512762 471081
17349 471081 207922 -314775 -494411 -201984 -336882 -249345 -361459 -189830 64836 -121463
17339 -121463 -59355 -15948 -277692 -309372 53528 -142903 -282051 -132200 -163224 -106001
17329 -106001 -49187 61282 152477 277507 520159 522165 209058 41389 193370 142316
17319 142316 323888 160354 104779 186327 259054 -40291 -152724 -273209 -19829 115169
17309 115169 284760 33799 -141218 69223 451190 324207 269144 574030 403906 222835
$$ packed form
17381d38672R7331K92567j48033p6436j77959K8882o9620N2234K53304J08151
17371g8251k46164R546K27686q2368r1859K9947R5390K34o5264j64346J3159L17824
17359c4466l9308m40503j97492J65958N79294K44207K13950p5947R7069m1681
17349D71081k63159n22697j79636K92427j34898Q7537j12114J71629K54666j86299
17339a21463O2108M3407k61744l1680L62900j96431j39148J49851l1024N7223
17329a06001N6814J10469R1195J25030K42652K006l13107j67669J51981n1054
17319A42316J81572j63534n5575Q1548P2727k99345j12433j20485K53380J34998
17309A15169J69591k50961j75017K10441L81967j26983n5063L04886j70124j81071
$$ plain form
17299 222835 -75929 -39113 255945 499572 246623 148019 225555 76627 73715 -149549
17289 -149549 -317055 3641 99514 -64542 -337578 -253576 -86146 156142 257473 81798
17279 81798 -128432 -357061 -472707 -178853 -135629 24828 -108222 -159858 -110387 227803
17269 227803 350053 389207 343796 373893 469550 439223 191372 250131 191284 48971 -249878
17258 -249878 -477590 -601256 -410882 -420927 -438583 -27970 -19479 99217 281492 188847
17248 188847 266328 227291 100068 202982 209131 26999 -212133 -386503 -556416 -651023
17238 -651023 -546835 -256497 -104229 -118164 -227438 -387627 -399771 -161766 -266558 -525745
17228 -525745 -295552 -219194 -281868 106979 277610 348556 283153 -18548 -283997 -595554
$$ packed form
17299B22835k98764L6816K95058K43627k52949r8604P7536j48928k912k23264
17289a49549j67506L20696R5873j64056k73036Q4002J67430K42288J01331j75675
17279H1798k10230k28629j15646K93854M3224J60457j33050n1636M9471L38190
17269B27803J22250L9154m5411L0097R5657l0327k47851N8759n8847j42313k98849
17258b49878k27712j23666J90374j0045j7656M10613Q491J18696J82275r2645
17248A88847P7481l9037j27223J02914O149j82132k39132j74370j69913r4607
17238f51023J04188K90338J52268j3935j09274j60189j2144K38005j04792k59187
17228e25745K30193P6358o2674L88847J70631P0946o5403l01701k65449l11557
$$ plain form
17218 -595554 -519275 -84087 10066 46593 169803 161628 -35142 180745 255794 619568 408927
17207 408927 69873 131140 493035 502624 478065 97530 45158 5906 -174322 -455375 -677750
17196 -677750 -834103 -826495 -855733 -354647 -292085 -403905 -504140 -306797 -270178 -154348
17186 -154348 316914 453238 294756 313115 -186500 -8057 417451 51105 -391272 -310313
17176 -310313 -323421 -363960 -257257 -572837 -755723 -944995 -589292 -200583 -61404 -406527
17166 -406527 -536573 -559465 -445389 -142892 30234 48527 -348978 -579075 -543473 -378783
17156 -378783 -400238 -227774 62103 142351 195311 -32970 -106838 104499 35165 259066
17146 259066 361825 278161 206974 -119578 -165616 127407 -182223 -637923 -516581 -563731
$$ packed form
17218e95554P6279M35188R4153L6527J23210q175j96770K15887P5049L63774k10641
17207D08927l39054O1267L61895R589k4559l80535n2372l9252j80228k81053k22375
17196f77750j56353P608k9238N01086O2562j11820j00235J97343L6619J15830
17186a54348M71262J36324j58482J8359m99615J78443M25508l66346m42377Q0959
17176c10313j3108m0539J06703l15580j82886j89272L55703L88709J39179l45123
17166d06527j30046k2892J14076L02497J73126J8293l97505k30097L5602J64690
17156c78783k1455J72464K89877Q0248N2960k28281p3868K11337o9334K23901
17146B59066J02759q3664p1187l26552m6038K93023l09630m55700J21342m7150
$$ plain form
17136 -563731 -681562 -729564 -361006 -239143 -230961 -167052 -301090 -457480 -659197 -574486
17126 -574486 -259277 -50147 -758 23632 100116 267672 414944 598414 543289 674910
17116 674910 743563 367201 98968 -226801 -199568 -182494 -182988 38858 -12808 -62311 90729
17105 90729 -23910 -361205 -694477 -491675 -639164 -652908 -305285 -212002 -631463 -775905
17095 -775905 -621621 -152241 110805 114969 126373 8592 -276014 -284080 -146515 -7994
17085 -7994 6387 442730 680687 842671 770814 1093331 986859 696161 821177 547198
17075 547198 71095 -116710 -136263 -95729 -72539 -14119 71165 -18748 -243919 25612 275446
17064 275446 152184 31176 -104988 -153663 -452576 -620886 -615940 -507999 -356741 -589278
$$ packed form
17136e63731j17831m8002L68558J21863Q182O3909j34038j56390k01717Q4711
17126e74486L15209K09130M9389K4390P6484J67556J47272J83470n5125J31621
17116F74910O8653l76362k68233l25769K7233J7074m94K21846n1666m9503J53040
17105I0729j14639l37295l33272K02802j47489j3744L47623R3283m19461j44442
17095g75905J54284M69380K63046M164J1404j17781k84606q066J37565J38521
17085g994J4381M36343K37957J61984p1857L22517j06472k90698J25016k73979
17075E47198m76103j87805j9553M0534K3190N8420Q5284q9913k25171K69531K49834
17064B75446j23262j21008j36164m8675k98913j68310M946J07941J51258k32537
$$ plain form
17054 -589278 -416158 -351000 -69770 220471 230963 263060 491646 274320 -60230 -118051
17044 -118051 -1265 -124302 -479994 -344932 -138520 353215 617814 247548 -209504 -379049
17034 -379049 -92028 -294459 -143001 -165660 -97237 -460647 -677234 -405413 -48363 204758
17024 204758 -118765 14304 136054 78594 57972 64365 94419 50334 -12109 -35223 -162634
17013 -162634 -278698 -174467 3107 -33661 -451264 -679044 -453263 -319448 -274573 -307314
17003 -307314 -232751 -346737 -145152 -120028 -204767 189279 67037 -46475 -203062 -235062
16993 -235062 -138926 248782 232715 173545 -41545 -9213 -22872 28009 139554 312296 155732
16982 155732 -59200 -49474 -188433 -247341 -132131 -36921 -137874 -379759 -410493 -212865
$$ packed form
17054e89278J73120O5158K81230K90241J0492L2097K28586k17326l34550n7821
17044a18051J16786j23037l55692J35062K06412M91735K64599l70266m57052j69545
17034c79049K87021k02431J51458k2659O8423l63410k16587K71821L57050K53121
17024B04758l23523J33069J21750n7460k0622O393L0054m4085o2443k3114j27411
17013a62634j16064J04231J77574l6768m17603k27780K25781J33815M4875l2741
17003c07314P4563j13986K01585K5124q4739L94046j22242j13512j56587l2000
16993b35062R6136L87708j6067n9170k15090L2332j3659N0881J11545J72742j56564
16982A55732k14932R726j38959n8908J15210R5210j00953k41885l0734J97628
$$ plain form
16972 -212865 -347114 -312557 -69761 -350720 -231939 -15120 -119262 -383896 -417334 -396075
16962 -396075 -455724 -261358 -216646 -121501 -145134 -87842 29497 449401 604643 320686
16952 320686 82592 282597 232548 232911 181955 -268694 -191942 -64171 -105136 -242072 -78575
16941 -78575 43495 238442 317573 -22875 -243087 -190746 -201165 -28570 258336 -143148
16931 -143148 -226337 -98968 37046 25878 397478 388485 175340 155382 283263 258457 68358
16920 68358 -404670 -397462 -330102 -63674 233499 116155 133087 201411 241297 151311 199723
16909 199723 181094 5050 297159 438622 18069 -312823 -360218 -293363 -270268 -486175
16899 -486175 -444716 -411485 -533075 -253716 -278477 -530598 -368571 -532258 -420867 -153260
$$ packed form
16972b12865j34249L4557K42796k80959J18781K16819j04142k64634l3438K1259
16962c96075n9649J94366M4712R5145k3633N7292J17339M19904J55242k83957
16952C20686k38094K00005n0049L63n0956m50649P6752J27771m0965j36936J63497
16941g8575J22070J94947P9131l40448k20212N2341j0419J72595K86906m01484
16931a43148q3189J27369J36014j1168L71600q993k13145j9958J27881k4806j90099
16920F8358m73028P208O7360K66428K97173j17344J6932O8324L9886q9986M8412
16909A99723j8629j76044K92109J41463m20553l30892m7395O6855K3095k15907
16899d86175M1459L3231j21590K79359k4761k52121J62027j63687J11391K67607
$$ plain form
16889 -153260 -278455 -449747 -565270 -154309 76883 -212806 -209674 -191813 -227597 -613755
16879 -613755 -200997 124715 186200 225195 88185 226 212821 116204 -180469 -365166
16869 -365166 -329370 -459828 -240353 -180042 -251105 -23411 430274 492366 388850 157813
16859 157813 46230 299002 318526 188358 62565 65103 -193204 -357295 -378710 -368831 -398798
16848 -398798 -268645 5846 231158 197490 -71962 -268971 -295389 -311449 -205703 -49831
16838 -49831 193630 116083 -232095 -13769 119609 220046 170479 455545 203373 -196177
16828 -196177 -112465 -92967 -121550 147095 106288 -100027 79754 115399 -506163 -887265
16818 -887265 -591377 -365543 -35866 -48062 18693 436730 491897 262093 41980 -368253
$$ packed form
16889a53260j25195j71292j15523M10961K31192k89689L132J7861l5784l86158
16879f13755M12758L25712O1485L8995j37010q7959K12595r6617k96673j84697
16869c65166L5796j30458K19475O0311p1063K27694M53685O2092j03516k31037
16859A57813j11583K52772J9524j30168j25793K538k58307j64091k1415R879k9967
16848c98798J30153K74491K25312l3668k69452j97009k6418j6060J05746J55872
16838d9831K43461p7547l48178K18326J33378J00437m9567K85066k52172l99550
16828a96177Q3712J9498k8583K68645m0807k06315J79781L5645o21562l81102
16818h87265K95888K25834L29677j2196O6755M18037N5167k29804k20113m10233
$$ plain form
16808 -368253 -201215 -53646 -114115 -130547 -29387 174824 187905 -96275 -324685 -442658
16798 -442658 -258344 -435474 -373708 -199502 -365362 -85212 134003 -184431 -639616 -482447
16788 -482447 -416691 -375174 -208283 -114117 69543 246739 91956 15573 -70011 -10420 80009
16777 80009 147847 -92413 -6767 27442 123441 131983 -105375 -389688 -340598 -1837 -6805
16766 -6805 -21742 87281 -133832 -221804 75483 7616 -192699 -395075 -298736 -187876 -366994
16755 -366994 -776999 -601902 -462694 -343713 -704967 -691784 -369939 -340425 14005 280323
16745 280323 162817 -200381 -294475 -306360 -394871 -471867 -386391 -76463 120370 271476
16735 271476 219646 -141034 -270679 -258925 -363846 -422255 -730316 -885490 -640170 -361268
$$ packed form
16808c68253J67038J47569o0469j6432J01160K04211J3081k84180k28410j17973
16798d42658J84314j77130O1766J74206j65860K80150K19215l18434m55185J57169
16788d82447O5756M1517J66891R4166J83660J77196j54783p6383q5584N9591R0429
16777H0009O7838k40260Q5646L4209R5999Q542k37358k84313M9090L38761m968
16766f805j4937J09023k21113q7972K97287o7867k00315k02376R6339J10860j79118
16755c66994m10005J75097J39208J18981l61254J3183L21845K9514L54430K66318
16745B80323j17506l63198r4094j1885q8511p6996Q5476L09928J96833J51106
16735B71476n1830l60680j29645J1754j04921n8409l08061j55174K45320K78902
$$ plain form
16725 -361268 -227797 -164961 -359590 -277735 133870 263439 117503 -10759 28457 -174047
16715 -174047 -226368 143653 219243 52379 75588 19660 -192762 -52804 276354 411965
16705 411965 418485 436369 245083 263424 357897 241305 38232 -93412 -48571 -36970 -354902
16694 -354902 -615912 -421767 6966 -85915 -179572 -202620 -249068 -417937 -401083 -170260
16684 -170260 319478 351840 -123427 -519320 -295143 67604 41087 -344669 -203612 -82473
16674 -82473 -5797 -239246 -964199 -947068 -321333 -182371 -281867 -146449 -143663 65016 723589
16663 723589 1026914 674490 280219 -140690 -288468 -240735 -267990 -245846 -48538 105709
16653 105709 225227 297096 331477 186278 52598 79381 28251 147541 -234 -207143
$$ packed form
16725c61268J33471O2836j94629Q1855M11605J29569j45936j28262L9216k02504
16715a74047n2321L70021P5590j66864K3209n5928k12422J39958L29158J35611
16705D11965O520J7884j91286J8341R4473j16592k03073j31644M4841J1601l17932
16694c54902k61010J94145M28733r2881r3657k3048m6448j68869J6854K30823
16684a70260M89738L2362m75267l95893K24177L62747k6517l85756J41057J21139
16674h2473P6676k33449p24953J7131O25735J38962r9496J35418K786K08679O58573
16663G23589L03325l52424l94271m20909j47778M7733k7255K2144J97308J54247
16653A05709J19518P1869L4381j45199j33680K6783n1130J19290j47775k06909
$$ plain form
16643 -207143 -147173 -168806 -70162 252764 660998 601058 159306 -202694 -138710 -272467
16633 -272467 -605581 -623817 -548162 -192153 -49614 56125 24309 232824 205868 352211
16623 352211 291587 -3144 -269412 -71516 -153859 -441596 -242493 227316 74015 -350929
16613 -350929 -353718 -344915 -515802 -184854 178224 73218 -156561 -275671 -219415 -257599 -247052
16602 -247052 -129611 235576 -159950 -234482 -122489 -405544 -526965 -691370 -438723 -521426
16592 -521426 -800087 -797266 -715935 -682205 -287855 -120724 -158095 -389102 -892079 -1000694
16582 -1000694 -619355 -450914 -375551 -198112 -504634 -536088 -322870 -180135 -316238 -278811
16572 -278811 -193945 -235771 -417271 -336886 11949 -3142 3628 -53456 79527 259669 -10438
$$ packed form
16643b07143N9970k1633R8644L22926M08234n9940m41752l62000O3984j33757
16633b72467l33114j8236P5655L56009J42539J05739l1816K08515k6956J46343
16623C52211o0624k94731k66268J97896q2343k87737J99103M69809j53301m24944
16613c50929k789Q803j70887L30948L63078j05006k29779j19110N6256l8184J0547
16602b47052J17441L65187l95526p4532J11993k83055j21421j64405K52647q2703
16592e21426k78661K821Q1331L3730L94350J67131l7371k31007n02977j08615
16582a000694L81339J68441P5363J77439l06522l1454K13218J42735j36103L7427
16572b78811Q4866m1826j81500Q0385L48835j5091O770n7084J32983J80142k70107
$$ plain form
16561 -10438 113675 242234 111959 72727 -137290 -594640 -545044 -51050 223277 -258942
16551 -258942 -350857 -324726 -144450 204502 349748 129396 140280 289654 66875 255318
16541 255318 181310 155578 133428 -67743 -106469 -37512 -48020 -119820 -41876 -274622 -386209
16530 -386209 -491813 -220850 -334256 -159549 -47711 -71385 51999 -170599 -359835 -347149
16520 -347149 -551190 -379043 -91447 -205100 -398862 -80052 86530 14905 -154193 -326760
16510 -326760 -207694 -154694 -43004 -96312 -251576 -160581 -243109 26198 253930 121805
16500 121805 339161 462523 137419 -78327 -133341 343629 416987 499763 418234 345876
16490 345876 136245 394202 341625 132121 50278 202164 348333 415156 800140 474339
$$ packed form
16561a0438J24113J28559j30275l9232k10017m57350M9596M93994K74327m82219
16551b58942r1915K6131J80276L48952J45246k20352J0884J49374k22779J88443
16541B55318p4008k5732k2150k01171l8726O8957j0508p1800P7944k32746j11587
16530c86209j05604K70963j13406J74707J11838k3674J23384k22598j89236J2686
16520c47149k04041J72147K87596j13653j93762L18810J66582p1625j69098j72567
16510c26760J19066N3000J11690n3308j55264R0995q2528K69307K27732j32125
16500A21805K17356J23362l25104k15746n5014M76970P3358Q2776q1529p2358
16490C45876k09631K57957n2577k09504q1843J51886J46169O6823L84984l25801
$$ plain form
16480 474339 -67688 -81428 -295005 -419728 56013 458176 343549 347409 452548 322437
16470 322437 33729 120121 -241605 -575607 -494324 -238377 -35208 -37102 176028 213705
16460 213705 -71283 -170212 122626 149481 25717 -110875 23473 29175 -371212 -456019
16450 -456019 -379029 -250514 -349000 -363576 -148667 128867 -37628 -162292 -244171 -334330
16440 -334330 -352649 -134889 13906 -243360 -275317 -128139 -245531 -338310 -493073 -502548
16430 -502548 -668136 -509177 8745 108488 226715 -3476 -291029 -554827 -274449 3057
16420 3057 -90400 -181791 -231104 -565739 -537287 -408082 -401804 -359566 -80242 361051 138732
16409 138732 -111319 19027 181622 -95450 -35142 -162635 -335260 -188884 -100534 -146156
$$ packed form
16480D74339n42027j3740k13577j24723M75741M02163j14627L860J05139j30111
16470C22437k88708Q6392l61726l34002Q1283K55947K03169j894K13130L7677
16460B13705k84988r8929K92838K6855j23764j36592J34348N702m00387q4807
16450d56019P6990J28515r8486j4576K14909K77534j66495j24664q1879r0159
16440c34330j8319K17760J48795k57266l1957J47178j17392r2779j54763r475
16430e02548j65588J58959N17922R9743J18227k30191k87553k63798K80378K77506
16420C057r3457r1391m9313l34635K8452J29205O278M2238K79324M41293k22319
16409A38732k50051J30346J62595k77072O0308j27493j72625J46376Q8350m5622
$$ plain form
16399 -146156 -138311 -323822 -62506 71603 -57846 -154166 28664 17838 -149588 -77190
16389 -77190 -1720 43825 -244154 -302196 -314779 -265328 158607 173147 -48238 -8856 -227258
16378 -227258 -271082 -263775 -322761 -400553 -219526 -16107 87571 -43022 -190221 -212160 -547142
16367 -547142 -456381 -76802 61810 164969 426357 136895 -135180 -148089 -111159 -138203
16357 -138203 -102688 -82761 95522 -117705 -226987 -124517 -422554 -479254 -211432 -234342
16347 -234342 -299968 -46998 115556 279573 5320 -203936 -142782 -109077 -45212 292073
16337 292073 12630 -34625 1837 -106833 53844 353059 208931 129268 -27077 137410
16327 137410 13585 -328240 -318216 -100886 -79461 -118789 201239 615943 610237 434981
$$ packed form
16399a46156P845j85511K61316J34109j29449r6320J82830j0826j67426P2398
16389g7190P5470M5545k87979n8042j2583M9451M23935J4540k21385L9382k18402
16378b27258m3824P307n8986p7792J81027K03419J03678j30593j47199k1939l34982
16367e47142R0761L79579J38612J03159K61388k89462k72075j2909L6930k7044
16357a38203L5515J9927J78283k13227j09282J02470k98037n6700K67822k2910
16347b34342o5626K52970J62554J64017k74253k09256O1154L3705O3865L37285
16337B92073k79443m7255L6462j08670J60677K99215j44128p9663j56345J64487
16327A37410j23825l41825J0024K17330K1425l9328L20028M14704n706j75256
$$ plain form
16317 434981 70797 -24689 -78865 -514700 -486225 -189010 65456 505380 302405 -69654
16307 -69654 -76538 -129643 -763570 -995479 -953587 -666398 -331212 -196750 65622 269088
16297 269088 170875 -98361 -501077 -501024 -455260 -393616 -235499 -284741 -267224 -25484 -52682
16286 -52682 158009 46646 -352812 -353055 -131296 -108633 -345215 -658809 -603195 -420197 -154395
16275 -154395 44404 -299428 -144235 -7935 -65589 -92581 -264602 -256446 -379263 -247830
16265 -247830 -247276 -234127 -235392 -32415 -124322 -76947 -58219 -19481 274715 136902 110737
16254 110737 -164325 -662868 -578809 -333093 -370778 -360078 -413358 -300012 -180333 -57131
16244 -57131 82263 -139771 -232839 -191275 -178444 -105052 -380412 -316700 -326848 -8533 461818
$$ packed form
16317D34981l64184r5486n4176m35835K8475K97215K54466M39924k02975l72059
16307f9654o884n3105o33927k31909M1892K87189L35186J34462K62372K03466
16297B69088r8213k69236m02716N3M5764O1644J58117m9242J7517K41740k7198
16286e2682K10691j11363l99458k43K21759K2663k36582l13594N5614J82998K65802
16275a54395J98799l43832J55193J36300n7654k6992j72021Q156j22817J31433
16265b47830N54J3149j265K02977r1907M7375J8728L8738K94196j37813k6165
16254A10737k75062m98543Q4059K45716l7685J0700n3280J13346J19679J23202
16244e7131J39394k22034r3068M1564J2831P3392k75360O3712j0148L18315M70351
$$ plain form
16233 461818 393962 169253 135204 382236 440220 279777 117582 194584 287577 108532
16223 108532 195866 440284 270120 -293150 -326470 -145169 -230515 139443 105649 85813
16213 85813 260749 -86038 -361927 -159985 218963 120430 -282049 -307815 -58373 -308010
16203 -308010 -137346 -115746 -482270 -376858 -96857 218719 319508 361295 -102818 -307935
16193 -307935 -128799 -158205 -190257 -250562 -151983 -125669 -44666 105787 287518 370350 417557
16182 417557 446745 336767 38049 17259 -277453 -337344 -272486 -428008 -872503 -830334
16172 -830334 -666564 -429128 84118 429877 423620 328840 411341 681373 620786 58107
16162 58107 54638 -207721 -178844 10999 -118805 -187683 -336028 -216833 -276655 -324905 41642
$$ packed form
16233D61818o7856k24709l4049K47032N7984j60443j62195P7002R2993j79045
16223A08532Q7334K44418j70164n63270l3320J81301q5346L69958l3794j9836
16213H5813J74936l46787k75889K01942L78948r8533m02479k5766K49442k49637
16203c08010J70664K1600l66524J05412K80001L15576J00789M1787m64113k05117
16193c07935J79136k9406l2052o0305R8579K6314Q1003J50453J81731Q2832M7207
16182D17557K9188j09978k98718k0790k94712n9891O4858j55522m44495M2169
16172h30334J63770K37436N13246L45759o257r4780Q2501K70032o0587n62679
16162E8107l469k62359K8877J89843j29804o8878j48345J19195n9822m8250L66547
$$ plain form
16151 41642 319495 400628 556857 115505 271044 343675 210147 -89950 -257156 -308170
16141 -308170 -640615 -464639 -222493 55465 314651 141668 55031 26568 151011 -103259
16131 -103259 -207072 -36003 187884 382870 220323 266302 664896 840184 762734 690180
16121 690180 507841 422835 213348 -3171 -121778 340975 435020 247942 149740 220747
16111 220747 419617 377253 19661 -180450 10309 -51215 -25577 -28160 -17416 -63288 387525
16100 387525 704801 458565 222453 282086 290539 49415 -154574 -153782 257263 377497 258746
16089 258746 -93237 -294611 -531425 -625796 -361232 7015 152376 -186327 -256723 -360779
16079 -360779 -374513 -405783 -42778 223430 20395 -377700 -175379 384345 667405 664321
$$ packed form
16151D1642K77853Q1133J56229m41352J55539P2631j33528l00097j67206n1014
16141c08170l32445J75976K42146K77958K59186j72983q6637k8463J24443k54270
16131a03259j03813J71069K23887J94986j62547M5979L98594J75288p7450p2554
16121F90180j82339q5006k09487k16519j18607M62753R4045j87078r8202P1007
16111B20747J98870m2364l57592k00111J90759o1524K5638k583J0744m5872M50813
16100C87525L17276k46236k36112N9633Q453k41124k03989P92M11045J20234j18751
16089B58746l51983k01374k36814r4371K64564L68247J45361l38703p0396j04056
16079c60779j3734l1270L63005K66208k03035l98095K02321N59724K83060l084
$$ plain form
16069 664321 118627 -300446 -376889 -256382 -189929 -45924 -206114 -420578 -522722 -413463
16059 -413463 -258136 -8028 81724 159538 50197 -60293 -20781 -78110 -124230 -220613 126128
16048 126128 128770 -197345 -557760 -377121 -118532 8349 -72416 -327027 -530469 -661709
16038 -661709 -506272 28196 59964 289541 357699 286093 323516 300434 115669 242329
16028 242329 266069 265047 595030 592415 367516 40647 24821 219744 290652 218537 154128
16017 154128 378440 611597 627720 586851 328904 175763 59545 -322731 -268132 -640942
16007 -640942 -739894 -597982 -753137 -700895 -574425 -325898 -204004 -71660 -83167 -90960
15997 -90960 233116 137404 -124875 -328375 -96858 -69062 -454459 -454394 -443948 -533454 -363928
$$ packed form
16069F64321n45694m19073p6443J20507O6453J44005j60190k14464j02144J09259
16059d13463J55327K50108Q9752P7814j09341j10490L9512n7329m6120r6383L46741
16048A26128K642l26115l60415J80639K58589J26881q0765k54611k03442j31240
16038f61709J55437N34468L1768K29577O8158p1606L7423k3082j84765J26660
16028B42329K3740j022L29983k615k24899l26869j5826J94923P0908p2115o4409
16017A54128K24312K33157J6123m0869k57947j53141j16218l82276N4599l72810
16007f40942r8952J41912j55155N2242J26470K48527J21894J32344j1507p793
15997i0960L24076r5712k62279k03500K31517K7796l85397O5J0446q9506J69526
$$ plain form
15986 -363928 -407649 -299822 -388018 -460317 -519575 -212622 -56449 231319 71863 -225175
15976 -225175 -508113 -411494 -177792 -12534 272315 24395 -1755 -113173 -166798 -117923
15966 -117923 -152352 295020 512307 364536 69444 3013 159573 167632 -10498 -62347
15956 -62347 -214701 118433 349823 569780 242295 -609537 -951166 -791921 -243344 248564
15946 248564 436788 178871 152029 425333 407337 344085 69318 -3125 -140462 74475
15936 74475 133883 -217000 -63549 -43115 -204685 -56342 55539 96068 -17865 -214463
15926 -214463 -204383 -124648 -27100 -75917 63838 228470 15720 -51723 496987 550844 -159900
15915 -159900 -267123 -291869 -460539 -252700 -63092 6827 -63097 275171 78716 -82225
$$ packed form
15986c63928m3721J07827q8196p2299n9258L06953J56173K87768j59456k97038
15976b25175k82938R6619K33702J65258K84849k47920k6150j11418n3625M8875
15966a17923l4429M47372K17287j47771k95092o6431J56560Q059j78130n1849
15956f2347j52354L33134K31390K19957l27485q51832l41629J59245N48577M91908
15946B48564J88224k57917k6842K73304j7996o3252k74767p2443j37337K14937
15936G4475N9408l50883J53451K0434j61570J48343J11881M0529j13933j96598
15926b14463J0080P9735R7548m8817J39755J64632k12750o7443N48710N3857p10744
15915a59900j07223k4746j68670K07839J89608O9919o9924L38268j96455j60941
$$ plain form
15905 -82225 5953 53523 205534 -80291 -371826 -126785 23936 -190321 -215774 -207789 -421696
15894 -421696 -336326 61588 -26835 -253918 -516987 -329037 -7601 284593 197080 324709
15884 324709 537530 344291 -28477 -99664 291165 548506 308184 148826 119227 12099
15874 12099 -192464 -155572 -102167 -411929 -392712 -6666 310039 -129395 -282255 -59530
15864 -59530 139552 -293829 -714422 -725271 -579367 -170586 67649 -12869 -361839 -645155
15854 -645155 -409829 -219898 -67773 50744 -82715 -130383 -152177 5934 66068 150163
15844 150163 511755 923913 811641 364407 187419 461777 586036 618842 448560 406127
15834 406127 468650 560784 757233 687584 522953 286912 154045 -69731 -108328 -109001 165542
$$ packed form
15905h2225Q8178M7570J52011k85825k91535K45041J50721k14257k5453P985k13907
15894d21696Q5370L97914q8423k27083k63069J87950L21436K92194q7513J27629
15884C24709K12821j93239l72768p1187L90829K57341k40322j59358k9599j07128
15874A2099k04563L6892N3405l09762J9217L86046L16705m39434j52860K22725
15864e9530J99082m33381m20593j0849J45904M08781K38235q0518l48970k83316
15854f45155K35326J89931J52125J18517j33459m7668k1794J58111O0134Q4095
15844A50163L61592M12158j12272m47234j76988K74358J24259L2806j70282m2433
15834D06127O2523R2134J96449o9649j64631k36041j32867k23776l8597o73K74543
$$ plain form
15823 165542 -68589 -235698 -152323 196586 363929 194447 327930 308651 -29090 -137480
15813 -137480 -53420 -156815 -206677 117990 226849 273230 290811 193214 218930 220205 161780
15802 161780 2219 -21509 158544 130242 -284534 -309663 -168023 3123 107261 -182506
15792 -182506 -475661 -562270 -908307 -636118 -284154 -284509 -360491 -398799 -75408 264431 444505
15781 444505 242793 -103553 -239535 -280291 -108898 -3320 -102089 -359501 -406708 -618945
15771 -618945 -637518 -785563 -527245 -191278 -16394 436260 255837 -33393 28118 58295
15761 58295 -105028 -47786 -176036 -108327 202109 131092 350567 230980 14963 -362253
15751 -362253 -126602 50922 223020 173936 40120 -120652 -375569 -488098 -144757 -60615
$$ packed form
15823A65542k34131j67109Q3375L48909J67343j69482J33483j9279l37741j08390
15813a37480Q4060j03395m9862L24667J08859M6381J7581r7597K5716J275n8425
15802A61780j59561k3728J80053k8302m14776k5129J41640J71146J04138k89767
15792a82506k93155q6609l46037K72189L51964l55p5982l8308L23391L39839J80074
15781D44505k01712l46346j35982m0756J71393J05578r8769k57412m7207k12237
15771f18945j8573j48045K58318L35967J74884M52654j80423k89230O1511L0177
15761E8295j63323N7242j28250O7709L10436p1017K19475j19587k16017l77216
15751c62253K35651J77524J72098m9084j33816j60772k54917j12529L43341Q4142
$$ plain form
15741 -60615 -326998 -349376 27976 -9651 -430740 -368185 -273399 -31709 195412 172372 -15802
15730 -15802 -288866 -385729 -462221 -369751 -137701 131184 141683 5108 -17872 226835 322464
15719 322464 145027 429864 414161 534937 572148 437908 86281 -5287 -200144 -224821
15709 -224821 395608 344220 368557 108315 14614 -61675 -234462 -356783 -559498 -483328
15699 -483328 -180233 136325 114293 -264369 -385040 -338930 -582906 -816144 -850980 -417319
15689 -417319 -130777 -215666 -41041 17242 -87879 150577 356712 282639 -33667 -59339
15679 -59339 -173069 36761 75291 -237683 -548433 -199763 173364 2665 -32655 69413
15669 69413 -280483 -336905 -361822 -453257 -319768 -381106 -431336 -168859 199546 -19653 -563487
$$ packed form
15741f0615k66383k2378L77352l7627m21089O2555R4786K41690K27121k3040j88174
15730a5802k73064r6863p6492R2470K32050K68885J0499j36575k2980K44707R5629
15719C22464j77437K84837j5703J20776L7211j34240l51627r1568j94857k4677
15709b24821O20429n1388K4337k60242r3701p6289j72787j22321k02715P6170
15699d83328L03095L16558k2032l78662j20671M6110k43976k33238l4836M33661
15689d17319K86542q4889J74625N8283j05121K38456K06135p4073l16306k5672
15679e9339j13730K09830L8530l12974l10750L48670L73127j70699l5320J02068
15669F9413l49896n6422k4917r1435J33489o1338n0230K62477L68405k19199n43834
$$ plain form
15658 -563487 -782975 -559942 -867019 -627949 -333965 -217792 -52697 -22992 155354 325359
15648 325359 311587 320222 442451 485241 -13083 -38249 -64445 35635 -6157 -113258 83032
15637 83032 55418 245911 289270 252373 195151 203636 -256214 39946 42322 -225893 -405549
15626 -405549 -511247 -198604 144185 17327 -53590 119317 110467 -98525 -474886 -479379
15616 -479379 -315931 -54831 66207 66271 130865 375555 344729 376710 574378 603456 520973
15605 520973 161789 -13660 -14008 304319 569204 541020 849485 889302 935447 1191634 1637672
15594 1637672 1559033 1408773 1195042 881350 1017066 1207983 847253 302618 279025 458420
15584 458420 702046 706282 392759 258132 261460 -52042 1229 -85300 -349285 -86285 -252152
$$ packed form
15658e63487k19488K23033l07077K39070K93984J16173J65095K9705J78346J70005
15648C25359j3772Q635J22229M2790m98324k5166k6196J00080m1792j07101J96290
15637H3032k7614J90493M3359l6897n7222Q485m59850K96160K376k68215j79656
15626d05549j05698L12643L42789j26858p0917J72907q850k08992l76361m493
15616d79379J63448K61100J21038O4O4594K44690l0826L1981J97668K9078q2483
15605E20973l59184j75449l48L18327K64885k8184L08465L9817M6145K56187M46038
15594A637672p8639j50260k13731l13692J35716J90917l60730n44635k3593J79395
15584D58420K43626M236l13523j34627L328l13502N3271q6529k63985K63000j65867
$$ plain form
15573 -252152 -320687 -139040 67491 150252 137756 424612 852531 1132122 944365 1014804
15563 1014804 910430 439503 -62931 -542192 -479876 -426380 -202581 -69034 -129546 162597
15553 162597 128619 128796 194504 50794 156174 -220723 -359764 -135017 74716 253629
15543 253629 -52234 -269092 -415488 -410501 -258564 -87820 -80193 70857 -73928 -473621
15533 -473621 -257570 -41365 127425 357863 401958 -59122 -141842 34255 -96250 -416063
15523 -416063 -491279 -308723 -310436 -124832 7231 -71517 -482794 -677261 -454968 -109041
15513 -109041 175937 614833 425706 276457 42597 -113470 136962 363697 119091 13694
15503 13694 -19839 -477683 -630792 -528724 -233182 -164077 -173769 81164 192334 -37354
$$ packed form
15573b52152o8535J81647K06531Q2761j2496K86856M27919K79591j87757P0439
15563A014804j04374m70927n02434m79261O2316N3496K23799J33547o0512K92143
15553A62597l3978J77O5708j43710J05380l76897j39041K24747K09733J78913
15543B53629l05863k16858j46396M987J51937J70744P627J51050j44785l99693
15533d73621K16051K16205J68790K30438M4095m61080q2720J76097j30505l19813
15523d16063p5216J82556j713J85604J32063p8748m11277j94467K22293L45927
15513a09041K84978M38896j89127j49249k33860j56067K50432K26735k44606j05397
15503A3694l3533m57844j53109J02068K95542O9105r692K54933J11170k29688
$$ plain form
15493 -37354 -222358 -64927 107919 82484 -32443 -171305 85652 -41434 -102477 11658
15483 11658 -46093 -136451 190457 247645 -89882 -470784 -288328 100279 56851 119361 113038
15472 113038 78835 -415329 -604679 -345887 -298590 -230952 -395746 -522825 -241481 158397
15462 158397 273321 31417 -9767 319585 240638 -277300 -353009 -271677 -126906 -163321
15452 -163321 -252228 295847 565819 378493 55586 -201212 -206568 1007 122143 -71577
15442 -71577 36705 4068 -14383 -96893 -405607 -124567 12446 -28149 -52884 60605 299027
15431 299027 210794 106367 170236 67143 38862 172874 588699 693221 656228 312489
15421 312489 16173 88067 142433 -62632 -329160 -619273 -215795 263507 121510 152929
$$ packed form
15493c7354j85004J57431J72846k5435j14927j38862K56957j27086o1043J14135
15483A1658n7751r0358L26908N7188l37527l80902J82456L88607m3428O2510o323
15472A13038l4203m94164j89350K58792M7297O7638j64794j27079K81344L99878
15462A58397J14924k41904m1184L29352p8947n17938p5709Q1332J44771l6415
15452a63321q8907N48075K69972j87326l22907k56798n356K07575J21136j93720
15442g1577J08282l2637j8451q2510l08714K81040J37013m0595k4735J13489K38422
15431B99027q8233j04427O3869j03093k8281J34012M15825J04522l6993l43739
15421C12489k96316P1894N4366k05065k66528k90113M03478M79302j41997L1419
$$ plain form
15411 152929 129020 -10863 65009 229294 348562 175154 9022 -278677 -375446 -390783
15401 -390783 -370304 -230189 62033 263936 46410 -277753 13372 48915 -381197 -197841
15391 -197841 -113858 -185460 -62571 77883 60022 3650 -130344 -323559 -388499 -511399
15381 -511399 -343917 -533087 -488035 -612121 -472645 -182527 -386519 -487196 -321060 -333466
15371 -333466 -309253 -220977 -297272 -368805 -540517 -621722 -614641 -497185 -271807 -264784 -174585
15360 -174585 -104738 -197736 40080 392942 270184 606408 683991 419046 -44724 -476732
15350 -476732 -457862 -612436 -760630 -714405 -399763 -64160 24733 86877 -139516 -186304
15340 -186304 -298859 -696933 -859166 -647330 -565991 -600311 -240056 198522 271897 140598
$$ packed form
15411A52929k3909j39883P5872J64285J19268j73408j66132k87699r6769j5337
15401c90783K0479J40115K92222K01903k17526l24163K91125L5543m30112J83356
15391a97841Q3983p1602J22889J40454j7861n6372j33994j93215o4940j22900
15381e11399J67482j89170M5052j24086J39476K90118k03992j00677J66136j2406
15371c33466K4213Q8276p6295p1533j71712q1205P081J17456K25378P023R0199
15360a74585O9847r2998K37816L52862j22758L36224P7583k64945m63770m32008
15350d76732J8870j54574j48194M6225L14642L35603Q8893O2144k26393m6788
15340a86304j12555l98074j62233K11836Q1339l4320L60255M38578P3375j31299
$$ plain form
15330 140598 -5664 -47927 -523846 -760145 -538331 -166948 -271653 -313381 -721601 -1143204
15320 -1143204 -903218 -610010 -327907 -450308 -562272 -565890 -714532 -765210 -705226 -836570
15310 -836570 -864718 -596959 -330084 -92306 81425 -191364 368031 1034535 1047883 578783
15300 578783 434502 397225 301987 469049 530155 401592 230977 -57773 -363041 -62017
15290 -62017 260878 212897 176394 27463 -387608 -240511 206315 194767 194887 440470 625306
15279 625306 533126 423710 645958 624496 585784 876526 819648 488053 544249 504289 659439
15268 659439 532363 444709 556985 891702 834905 457815 350688 304656 77813 -207420
15258 -207420 -303676 -452349 -477300 -375510 -6840 92222 200786 337452 -17673 -166852
$$ packed form
15330A40598j46262m2263m75919k36299K21814L71383j04705m1728m08220m21603
15320a143204K39986K93208K82103j22401j11964l618j48642n0678N9984j31344
15310h36570k8148K67759K66875K37778J73731k72789N59395O66504J3348m69100
15300E78783j44281l7277r5238J67062O1106j28563j70615k88750l05268L01024
15290f2017L22895m7981l6503j48931m15071J47097M46826j1548J20K45583J84836
15279F25306r2180j09416K22248k1462l8712K90742n6878l31595N6196l9960J55150
15268F59439j27076q7654J12276L34717n6797l77090j07127m6032k26843k85233
15258b07420r6256j48673k4951J01790L68670R9062J08564J36666l55125j49179
$$ plain form
15248 -166852 -467203 -238262 -116396 28321 434878 156942 27510 224980 416203 481989
15238 481989 427426 655848 749735 638820 511065 687644 482580 529328 421683 209357
15228 209357 294604 523024 256846 158229 13440 -14045 -212029 -272111 -32346 202165
15218 202165 266126 188766 187091 358506 683899 814957 697175 420652 299255 357142
15208 357142 499889 843241 1118895 932866 628034 628050 451667 82781 -99289 -157186
15198 -157186 -180419 364969 313522 336839 565790 633122 719580 431287 731643 1300970
15188 1300970 1647076 1791018 1748301 1848788 2264406 2015407 1989035 2201082 2457091 2757010
15178 2757010 2996490 3559936 4332753 4615578 4717912 5311209 6041051 6875497 8006068
$$ packed form
15248a66852l00351K28941J21866J44717M06557k77936j29432J97470J91223O5786
15238D81989n4563K28422R3887j10915j27755J76579k05064M6748j07645k12326
15228B09357Q5247K28420k66178r8617j44789k7485j97984o0082K39765K34511
15218B02165O3961p7360j675J71415L25393J31058j17782k76523j21397N7887
15208C57142J42747L43352K75654j86029l04832J6j76383l68886j82070n7897
15198a57186k3233N45388n1447K3317K28951O7332Q6458k88293L00356N69327
15188A300970L46106J43942m2717J00487M15618k48999k6372K12047K56009K99919
15178B757010K39480N63446P72817K82825J02334N93297P29842Q34446J130571
$$ plain form
15169 8006068 9253576 10741072 12782219 14936502 17081291 19076355 21606254 24852404
15161 24852404 28913811 35158553 45358138 61894607 87486882 124086961 169184560
15154 169184560 218087666 265870748 309855526 344338733 364677480 368416612 355889021
15147 355889021 328659211 289271532 243446233 197956968 158504702 126117470 99642823
15140 99642823 79165314 64380567 53964337 46301994 40720903 36032586 31822719 27827248
15132 27827248 24309319 21741758 19161263 16815978 15122116 13424485 11942332 10699880
15124 10699880 9649430 9195048 8457710 7771731 7181711 6669768 6101920 5601208 5258893
15115 5258893 4879758 4844013 4491941 4180329 3954189 3817630 3384951 3128062 2927409 2978617
$$ packed form
15169H006068J247508J487496K041147K154283K144789J995064K529899L246150
15161B4852404M061407O244742J0199585J6536469K5592275L6600079M5097599
15154A69184560M8903106M7783082M3984778L4483207K0338747L739132j2527591
15147C55889021k7229810l9387679m5825299m5489265l9452266l2387232k6474647
15140I9642823k0477509j4784747j0416230p662343n581091m688317m209867l995471
15132B7827248l517929k567561k580495k345285j693862j697631j482153j242452
15124A0699880j050450m54382p37338o85979n90020n11943n67848n00712l42315
15115E258893l79135l5745l52072l11612k26140j36559m32679k56889k00653N1208
$$ plain form
15105 2978617 2980897 2963981 3085844 3181268 3143258 2853322 2706894 2436091 2341931 2104469
15095 2104469 2208704 1967646 1579321 1440938 1697786 1822270 1665408 1333466 1103316
15086 1103316 684938 334076 253915 583661 708605 506211 433934 304837 362695 832220
15076 832220 879035 851133 810299 752226 771801 357530 227463 112676 267978 330849 237720
15065 237720 221023 427465 595907 535836 310071 249406 143535 278146 241974 196503
15055 196503 8644 -340216 -422048 270990 702161 610048 925700 664883 88248 26378
15045 26378 544799 648050 817227 644533 518619 491946 190905 62386 131867 51691
15035 51691 26693 -28532 54489 287928 308215 191427 132924 288127 511896 639559 564714
$$ packed form
15105B978617K280j6916J21863R5424l8010k89936j46428k70803r4160k37462
15095B104469J04235k41058l88325j38383K56848J24484j56862l31942k30150
15086A103316m18378l50862q0161L29746J24944k02394p2277j29097N7858M69525
15076H32220M6815k7902m0834n8073J9575m14271j30067j14787J55302O2871r3129
15065B37720j6697K06442J68442o0071k25765o0665j05871J34611l6172m5471
15055A96503j87859l48860q1832O93038M31171r2113L15652k60817n76635o1870
15045B6378N18421J03251J69177j72694j25914k6673l01041j28519O9481q0176
15035E1691k4998n5225Q3021K33439K0287j16788n8503J55203K23769J27663p4845
$$ plain form
15024 564714 312954 143240 346027 240397 210746 345119 164723 177545 638434 596440
15014 596440 217914 -90469 -58221 402476 535050 596001 707863 655916 361407 314660
15004 314660 112185 17046 -81832 -506195 -419798 -112582 13490 -111613 -57536 60487
14994 60487 518322 909586 868134 1109650 1298200 1322694 1166429 1164065 1279495 1136874
14984 1136874 974616 914254 861055 952996 843753 582026 215304 119222 354323 333213
14974 333213 433636 648297 543586 502717 766017 984584 772772 849757 1043075 925887
14964 925887 779855 471730 592016 804872 597278 435296 500686 373142 253730 222950
14954 222950 260070 296988 354797 353107 405883 544506 620910 261693 -98161 -733766 -856305
$$ packed form
15024E64714k51760j69714K02787j05630k9651J34373j80396J2822M60889m1994
15014E96440l78526l08383L2248M60697J32574O0951J11862n1947k94509m6747
15004C14660k02475r5139r8878m24363Q6397L07216J26072j25103N4077J18023
14994F0487M57835L91264m1452K41516J88550K4494j56265k364J15430j42621
14984A136874j62258o0362n3199R1941j09243k61727l66722r6082K35101k1110
14974C33213J00423K14661j04711m0869K63300K18567k11812P6985J93318j17188
14964I25887j46032l08125J20286K12856k07594j61982O5390j27544j19412l0780
14954B22950L7120L6918N7809j690N2776J38623P6404l59217l59854o35605j22539
$$ plain form
14943 -856305 -668546 -457373 -391905 -389399 -368137 -246320 -296620 78270 246551 -63026
14933 -63026 -302868 -196094 -9824 4804 5076 -20628 41346 196255 48111 -60949 239619
14922 239619 664071 747629 736702 610239 576081 447479 480385 713546 843234 679578
14912 679578 595371 428635 379138 283527 284054 213458 162061 -51902 11307 -16887 -53641
14901 -53641 99618 287849 556465 653578 535725 42756 79621 309989 157193 280928
14891 280928 411447 247942 232482 323790 112738 266194 535211 569427 394565 -104986
14881 -104986 -203082 -34023 -21216 -83642 4559 -3388 157765 129108 32401 -110128 -82480
14870 -82480 392020 562717 954123 578756 276132 440138 406755 -45300 -283071 -72197
$$ packed form
14943h56305J87759K11173O5468K506K1262J21817n0300L74890J68281l09577
14933f3026k39842J06774J86270J4628K72k5704O1974J54909j48144j09060L00568
14922B39619M24452Q3558j0927j26463l4158j28602L2906K33161J29688j63656
14912F79578q4207j66736m9497r5611N27p0596n1397k13963O3209k8194l6754
14901e3641J53259J88231K68616R7113j17853m92969L6865K30368j52796J23735
14891B80928J30519j63505j5460R1308k11052J53456K69017L4216j74862m99551
14881a04986r8096J69059J2807o2426Q8201p947J61153k8657r6707j42529K7648
14870h2480M74500J70697L91406l75367l02624J64006l3383m52055k37771K10874
$$ plain form
14860 -72197 27871 257342 386640 361355 341618 253971 -108620 47909 295138 71052
14850 71052 64356 187618 -36920 18015 100778 83334 276344 322455 228586 88571 152741
14839 152741 90804 360775 268355 235835 359248 276505 488915 816848 1213232 1355741
14829 1355741 999091 611275 -52844 -357073 -407992 10045 210000 93407 477147 561306
14819 561306 575781 714382 458098 57788 -248804 -145585 -201196 -103209 193738 418358
14809 418358 585268 507487 537203 743601 915370 630988 281241 -44544 -222642 -452851
14799 -452851 -314946 -27285 90418 65867 120393 -55256 12173 160434 153260 293918
14789 293918 397905 463099 249576 44029 122512 442955 362612 359320 529149 211398
$$ packed form
14860g2197J00068K29471J29298k5285j9737q7647l62591J56529K47229k24086
14850G1052o696J23262k24538N4935Q2763j7444J93010M6111r3869j40015O4170
14839A52741o1937K69971r2420l2520J23413q2743K12410L27933L96384J42509
14829A355741l56650l87816o64119l04229n0919M18037J99955j16593L83740Q4159
14819E61306J4475J38601k56284m00310l06592J03219n5611R7987K96947K24620
14809D18358J66910p7781K9716K06398J71769k84382l49747l25785j78098k30209
14799d52851J37905K87661J17703k4551N4526j75649O7429J48261p174J40658
14789B93918J03987O5194k13523k05547P8483L20443q0343l292J69829l17751
$$ plain form
14779 211398 -48578 -101166 -112347 -54855 235577 -229384 -146486 245755 255044 48956 294618
14768 294618 173241 -11509 -188046 -80139 63891 11132 207347 295581 511302 337326
14758 337326 105217 88413 22231 206212 -1140 -426547 -539220 -319381 -206591 -482423
14748 -482423 -706944 -322786 -381880 -377392 76486 241993 293171 233673 160029 204930 135894
14737 135894 37182 -86348 -109635 -125077 207126 615043 737332 677136 634279 289337
14727 289337 190478 211833 490923 411789 151218 447599 568545 143181 -356959 -310546
14717 -310546 -103207 -536792 -723331 -528480 -249442 777 108785 134236 132148 142996
14707 142996 163322 372400 847017 1168774 1174891 1234768 1388987 1507826 1834790 1912092
$$ packed form
14779B11398k59976n2588j1181N7492K90432m64961Q2898L92241R289k06088K45662
14768B94618j21377j84750j76537J07907J44030n2759J96215Q8234K15721j73976
14758C37326k32109j6804o6182J83981k07352m25407j12673K19839J12790k75832
14748d82423k24521L84158n9094M488M53878J65507N1178n9498p3644M4901o9036
14737A35894r8712j23530k3287j5442L32203M07917J22289o0196m2857l44942
14727B89337r8859K1355K79090p9134k60571K96381J20946m25364n00140M6413
14717c10546K07339m33585j86539J94851K79038K50219J08008K5451k088J0848
14707A42996K0326K09078M74617L21757O117N9877J54219J18839L26964P7302
$$ plain form
14697 1912092 1856341 1664683 1660361 1355987 902285 755475 1020948 1074747 790993 856036
14687 856036 735631 327122 17923 10150 97508 176720 -173562 -249570 -411089 -569187
14677 -569187 -507513 -442478 -525013 -188531 175376 208360 74952 40620 4400 160647 188838
14666 188838 75417 516486 595641 550373 848268 804668 652298 385140 543338 703975
14656 703975 355357 293633 436818 321144 513422 405340 287888 232057 226183 619479
14646 619479 928786 702440 140475 129271 259229 294315 483032 140288 247934 293204
14636 293204 437221 269180 -38419 -13329 -63566 -49703 -97292 150456 209662 74364
14626 74364 -118569 -64195 335187 -11562 26980 413009 605105 381176 308847 341156
$$ packed form
14697A912092n5751j91658m322l04374m53702j46810K65473N3799k83754O5043
14687H56036j20405m08509l09199p773Q7358P9212l50282p6008j61519j58098
14677e69187O1674O5035q2535L36482L63907L2984j33408l4332l6220J56247K8191
14666A88838j13421M41069P9155m5268K97895m3600j52370k67158J58198J60637
14656G03975l48618o1724J43185j15674J92278j08082j17452n5831n874L93296
14646F19479L09307k26346n61965j1204J29958L5086J88717l42744J07646M5270
14636B93204J44017j68041l07599K5090n0237J3863m7589K47748N9206j35298
14626G4364j92933N4374L99382l46749L8542L86029J92096k23929p2329L2309
$$ plain form
14616 341156 272158 -48560 -22385 -86256 -11470 77686 248636 13929 -224556 -185559 -34755
14605 -34755 -25165 272824 263004 293032 210697 152283 118570 138082 118083 -66893 -133819 -39949
14593 -39949 -229820 -442543 -239362 -83184 -319653 -378411 -412963 -444422 -491028 -233791
14583 -233791 120757 137550 290892 376853 464258 486884 189378 34912 94929 -305052
14573 -305052 -273332 -159818 -540046 -912686 -1075176 -907509 -512898 -550610 -486712 -443472
14563 -443472 -307711 -489373 -504635 -144033 -89798 -14436 373662 180666 414500 324202
14553 324202 -226959 -285001 -20509 -122412 -206046 77654 180273 -19380 61079 -977
14543 -977 260635 246230 303863 399644 209007 -8866 392737 654833 226186 -155480 403098
$$ packed form
14616C41156o8998l20718K6175o3871P4786Q9156J70950k34707k38485L8997J50804
14605c4755R590K97989r820L0028q2335n8414l3713J9512j9999j84976o6926R3870
14593c9949j89871k12723K03181J56178k36469n8758l4552l1459m6606K57237
14583b33791L54548J6793J53342Q5961Q7405K2626k97506j54466O0017l99981
14573c05052L1720J13514l80228l72640j62490J67667L94611l7712O3898M3240
14563d43472J35761j81662j5262L60602N4235P5362L88098j92996K33834r0298
14553C24202n51161n8042K64492j01903q3634K83700J02619j99653Q0459o2056
14543i77K61612j4405N7633R5781j90637k17873M01603K62096m28647l81666N58578
$$ plain form
14532 403098 569249 431123 405253 141409 -31211 -45561 -112025 -4285 116639 -160601
14522 -160601 89325 247201 80676 313879 417073 437133 387240 236613 -111336 -260144
14512 -260144 -167442 16238 -161142 30165 218664 290239 693647 518122 361856 404990
14502 404990 307202 131300 -94949 -57868 483087 468815 191606 91506 544 -149764
14492 -149764 -114982 -100161 -14766 -92354 -46948 351669 397248 276347 426063 469569 607821
14481 607821 794682 576919 335208 264580 209172 350691 447714 292809 275486 111581
14471 111581 -203283 -169798 -456708 -235334 -78841 -4635 278862 433978 196609 168921
14461 168921 195829 30303 -14444 -9585 -134770 14010 -51090 473819 682646 514540
$$ packed form
14532D03098J66151j38126k5870k63844j72620j4350o6464J07740J20924k77240
14522a60601K49926J57876j66525K33203J03194K0060m9893j50627l47949j48808
14512b60144R2702J83680j77380J91307J88499P1575M03408j75525j56266M3134
14502D04990r7788j75902k26249L7081N40955j4272k77209j00100r0962j50308
14492a49764L4782J4821Q5395p7588M5406L98617M5579j20901J49716M3506J38252
14481F07821J86861k17763k41711p0628n5408J41519R7023j54905j7323j63905
14471A11581l14864L3485k86910K21374J56493P4206K83497J55116k37369k7688
14461A68921K6908j65526m4747M859j25185J48780o5100N24909K08827j68106
$$ plain form
14451 514540 384716 -42031 -219953 -33305 -40096 20579 -165290 -205058 7922 142170
14441 142170 385954 503900 349751 84242 -216540 -544200 -332318 24400 35934 -51633
14431 -51633 -258599 -200544 -137386 -58003 -253001 27160 111823 -45265 -274918 -240879 -429568
14420 -429568 -491876 -100795 24463 29485 164498 280139 196979 35646 -76977 12122
14410 12122 -67601 -155423 -281158 -361595 -400293 -73722 -117860 -418651 -500288 -397948 -243864
14399 -243864 -152301 25 83738 -319115 -715500 -737742 -694749 -228521 79644 -44031
14389 -44031 -53854 212930 180204 387561 558508 432020 282528 83609 -103931 -55631
14379 -55631 107685 63225 104576 90686 -75699 -209468 321414 243615 17240 -46015 50102
$$ packed form
14451E14540j29824m26747j77922J86648o791O0675j85869l9768K12980J34248
14441A42170K43784J17946j54149k65509l00782l27660K11882L56718J1534q7567
14431e1633k06966N8055O3158P9383j94998K80161Q4663j57088k29653L4039j88689
14420d29568o2308L91081J25258N022J35013J15641q3160j61333j12623Q9099
14410A2122p9723q7822j25735q0437l8698L26571m4138l00791q1637J02340J54084
14399b43864R1563J52326Q3713m02853l96385k2242M2993M66228L08165j23675
14389d4031r823K66784l2726K07357J70947j26488j49492j98919j87540M8300
14379e5631J63316m4460M1351j3890j66385j33769N30882p7799k26375o3255R6117
$$ plain form
14368 50102 264417 443406 258237 572208 553933 602128 577359 563418 550542 257091 12280
14357 12280 -44511 -55842 177043 239860 305639 118696 170045 349327 629370 598570 517873
14346 517873 361650 350098 567713 345236 -101197 217249 267665 -11138 -193717 -395941
14336 -395941 -314326 -36416 164635 144131 41301 69242 -84827 -358169 -449150 -342966
14326 -342966 -83468 -135871 -341948 -229061 11154 8200 76325 461860 435730 254219
14316 254219 144079 -66735 -210673 -69824 86058 317084 551378 431136 211689 116596
14306 116596 259449 451812 315596 408908 564598 371675 212462 91434 -19985 165058
14296 165058 43799 -269471 -373447 -258964 76673 341176 77895 -11519 6845 59029
$$ packed form
14368E0102K14315J78989j85169L13971j8275M8195k4769j3941j2876k93451k44811
14357A2280n6791j1331K32885O2817O5779j86943N1349J79282K80043l0800q0697
14346E17873j56223j1552K17615k22477m46433L18446N0416k78803j82579k02224
14336c95941Q1615K77910K01051k0504j02830K7941j54069k73342r0981J06184
14326c42966K59498n2403k06077J12887K40215k954O8125L85535k6130j81511
14316B54219j10140k10814j43938J40849J55882K31026K34294j20242k19447r5093
14306A16596J42853J92363j36216R3312J55690j92923j59213j21028j11419J85043
14296A65058j21259l13270j03976J14483L35637K64503k63281q9414J8364N2184
$$ plain form
14286 59029 52595 23035 -7743 337775 273727 262995 356744 199924 112837 21014 334206
14275 334206 364930 488502 496491 199801 296621 313070 24269 40770 37660 116675 169943
14264 169943 252809 332335 -165772 -124243 23267 -42609 196815 320093 171440 126708
14254 126708 475971 277456 574014 581346 -202713 -557497 -465124 -617902 -340438 -396614
14244 -396614 -519782 -575129 -249917 -314710 -178843 -302140 -522498 -491989 -366780 -288036
14234 -288036 -149148 -85696 -146451 -196222 -172551 -54299 -257978 10554 235517 116589
14224 116589 -3205 163224 130322 180151 215807 176930 211680 360424 493390 342616
14214 342616 1605 30415 123573 87009 5255 -203236 -202127 25295 104570 -21909 -244334
$$ packed form
14286E9029o434k9560l0778L45518o4048j0732R3749j56820q7087r1823L13192
14275C34206L0724J23572P989k96690R6820J6449k88801J6501l110P9015N3268
14264A69943Q2866P9526m98107M1529J47510o5876K39424J23278j48653m4732
14254A26708L49263j98515K96558P332p84059l54784R2373j52778K77464n6176
14244c96614j23168n5347L25212o4793J35867j23297k20358L0509J25209P8744
14234b88036J38888O3452o0755m9771K3671J18252k03679K68532K24963j18928
14224A16589j19794J66429l2902M9829L5656l8877L4750J48744J32966j50774
14214C42616l41011K8810R3158l6564q1754k08491J109K27422P9275j26479k22425
$$ plain form
14203 -244334 -299829 -171619 -29762 -109108 -150740 90572 235503 148087 -5103 -83612
14193 -83612 32774 269401 382327 251148 -209733 -950901 -849840 -338623 -308619 -351346
14183 -351346 -432793 -354134 -354234 51077 369454 -51635 -247641 -114352 -482863 -308695
14173 -308695 -58294 27450 -59788 -91542 17940 -70636 -220754 -207524 55617 230470
14163 230470 103273 -253082 -626148 -546809 -240740 -114155 -125792 -313990 -554540 -772630
14153 -772630 -675022 -189838 210194 469398 827549 446808 74217 23215 247301 216775
14143 216775 -19248 -55414 -37407 46208 139341 182563 429135 188518 -254534 -135854
14133 -135854 95259 325973 335265 -127423 -404490 -276558 -272898 139859 78818 -235010
$$ packed form
14203b44334n5495J28210J41857p9346m1632K41312J44931q7416j53190p8509
14193h3612J16386K36627J12926j31179m60881p41168J01061N11217L0004m2727
14183c51346q1447P8659j00M05311L18377m21089j96006J33289l68511J74168
14173c08695K50401Q5744q7238l1754J09482q8576j50118J3230K63141J74853
14163B30470j27197l56355l73066P9339L06069J26585j1637j88198k40550k18090
14153g72630R7608M85184M00032K59204L58151l80741l72591n1002K24086l0526
14143B16775k36023l6166J8007Q3615R3133M3222K46572k40617m43052J18680
14133a35854K31113K30714R292m62688k77067J27932L660M12757o1041l13828
$$ plain form
14123 -235010 -175940 -15300 173871 34877 213872 99253 -184775 -272538 -223555 -162149
14113 -162149 -268862 -96518 -42362 34267 177466 209318 121121 38978 -262820 -204960 354494
14102 354494 100528 -426691 -172609 120959 -96721 -248796 -317857 -274873 -207202 -459237
14092 -459237 -626230 -74565 308942 187050 -125952 -280091 -389272 -397764 -228827 -34629
14082 -34629 10964 29796 273249 200835 -70237 -181704 -96470 -78589 -237237 -336512 -350586
14071 -350586 -274755 -22082 184207 440739 542231 439983 318135 -22510 -278612 -267242
14061 -267242 -303327 -267245 -59052 -378331 -504231 -593618 -613697 -418013 -88573 112437
14051 112437 254619 125333 -292879 -177433 156504 194464 39767 134409 118047 140247
$$ packed form
14123b35010N9070J60640J89171j38994J78995j14619k84028q7763M8983O1406
14113a62149j06713J72344N4156P6629J43199L1852q8197q2143l01798N7860N59454
14102C54494k53966n27219K54082K93568k17680j52075o9061M2984O7671k52035
14092d59237j66993N51665L83507j21892l13002j54139j09181q492J68937J94198
14082c4629M5593J8832K43453p2414k71072j11467Q5234J7881j58648r9275j4074
14071c50586P5831K52673K06289K56532J01492j02248j21848l40645k56102J1370
14061b67242l6085L6082K08193l19279j25900q9387k0079J95684L29440K01010
14051A12437J42182j29286m18212J15446L33937L7960j54697R4642j6362K2200
$$ plain form
14041 140247 276876 400262 481283 492417 227183 15971 -115309 -172474 -440666 -806354
14031 -806354 -465117 -121766 300927 442290 164831 -5294 304769 655768 761594 760210
14021 760210 769525 925178 814553 786697 370598 624901 871571 768883 882241 1087104
14011 1087104 1321163 1961847 2531525 2801521 3073584 2830325 3013144 3100845 3093792 3574653
14001 3574653 3442334 2821401 2681065 2138914 1606034 1468068 1279446 1221449 964445 730791
13991 730791 716567 1109515 1205137 1523024 1653220 1832793 1772926 1196280 748669 553583
13981 553583 644473 478552 765297 1311218 1501249 1215615 797272 607438 600693 555376
13971 555376 407836 320774 446119 772703 700722 454620 583888 443919 -200766 -224948
$$ packed form
14041A40247J36629J23386Q1021J1134k65234k11212j31280n7165k68192l65688
14031h06354L41237L43351M22693J41363k77459j70125L10063L50999J05826j384
14021G60210R315J55653j10625k7856m16099K54303K46670j02688J13358K04863
14011A087104K34059O40684N69678K69996K72063k43259J82819Q7701p053M80861
14001C574653j32319o20933j40336n42151n32880j37966j88622n7997k57004k33654
13991G30791j4224L92948R5622L17887J30196J79573n9867n76646m47611j95086
13981E53583R0890j65921K86745N45921J90031k85634m18343j89834o745m5317
13971E55376j47540q7062J25345L26584p1981k46102J29268j39969o44685k4182
$$ plain form
13961 -224948 84522 -150867 -216255 -78593 126633 151524 112050 337367 136019 -107289
13951 -107289 -165429 -223280 -305955 -441112 -17158 317412 114601 188500 -114328 -51232
13941 -51232 276766 357221 172233 -216178 -135135 -110868 -111817 185087 21055 -10721 -113966
13930 -113966 210313 459997 221991 283792 435095 353579 188953 229177 73319 96061
13920 96061 281098 440708 273545 242483 -132107 102917 448651 670842 693824 483113
13910 483113 426728 238768 22737 -204135 81095 175085 449340 606335 455360 141105
13900 141105 -6359 315180 756584 762195 888563 1052429 1097602 1023344 550280 246020
13890 246020 434351 488772 198985 185972 365533 455957 223095 9812 -207097 -42100
$$ packed form
13961b24948L09470k35389o5388J37662K05226K4891l9474K25317k01348k43308
13951a07289n8140n7851q2675j35157M23954L34570k02811P3899l02828O3096
13941e1232L27998Q0455j84988l88411Q1043K4267r49K96904j64032l1776j03245
13930a13966L24279K49684k38006O1801J51303q1516j64626M0224j55858K2742
13920I6061J85037J59610j67163l1062l74590K35024L45734K22191K2982k10711
13910D83113n6385j87960k16031k26872K85230R3990K74255J56995j50975l14255
13900A41105j47464L21539M41404N611J26368J63866M5173p4258m73064l04260
13890B46020J88331N4421k89787j3013J79561R0424k32862k13283k16909J64997
$$ plain form
13880 -42100 -71345 -6523 151850 570926 419660 531430 502303 394916 267130 112803
13870 112803 304886 222684 -396857 -399925 -74241 132794 10757 -371313 65205 436697
13860 436697 350141 52888 -64616 -124643 -55527 123250 -274374 -440357 -174416 -149274
13850 -149274 -113094 229076 -89449 -205924 -304133 -314875 181770 441757 476970 745984
13840 745984 568220 453321 508404 503085 462595 295363 181652 345342 596253 547182
13830 547182 697128 480948 531774 495614 430321 640345 475243 17094 -301103 -451609
13820 -451609 -453040 -198230 71171 -36614 61119 256293 615717 655443 767911 649784
13810 649784 358927 321191 536797 716462 630613 477913 306660 161853 467070 915995
$$ packed form
13880d2100k9245O4822J58373M19076j51266J11770k9127j07387j27786j54327
13870A12803J92083q2202o19541l068L25684K07035j22037l82070M36518L71492
13860D36697q6556k97253j17504o0027O9116J78777l97624j65983K65941K5142
13850a49274L6180L42170l18525j16475r8209j0742M96645K59987L5213K69014
13840G45984j77764j14899N5083n319m0490j67232j13711J63690K50911m9071
13830E47182J49946k16180N0826l6160o5293K10024j65102m58149l18197j50506
13820d51609j431K54810K69401j07785R7733J95174L59424L9726J12468j18127
13810F49784k90857l7736K15606J79665q5849j52700j71253j44807L05217M48925
$$ plain form
13800 915995 1140461 1147389 657671 225837 311443 338032 140845 -112487 122821 295950
13790 295950 317512 232430 -231054 -437392 -263088 206983 144330 11982 91957 -133215
13780 -133215 -270070 -315015 -466401 -518863 -80222 646928 377093 140633 233903 316028
13770 316028 781840 907258 906838 850130 1056435 795179 394812 535601 650611 904180
13760 904180 991957 414445 160867 513811 604089 327960 201954 407805 784968 759365
13750 759365 712814 812996 542273 217045 -22730 -55374 246170 477617 225932 178492
13740 178492 318202 110860 112008 17102 -101860 -314497 -180486 -181637 211405 376563
13730 376563 -122706 -3351 279514 375474 442535 141861 27265 312084 531089 691680
$$ packed form
13800I15995K24466O928m89718m31834Q5606K6589j97187k53332K35308J73129
13790B95950K1562q5082m63484k06338J74304M70071o2653j32348P9975k25172
13780a33215j36855m4945j51386n2462M38641P27150k69835k36460R3270Q2125
13770C16028M65812J25418m20n6708K06305k61256m00367J40789J15010K53569
13760I04180Q7777n77512k53578L52944R0278k76129j26006K05851L77163k5603
13750G59365m6551J00182k70723l25228k39775l2644L01544K31447k51685m7440
13740A78492J39710k07342J148r4906j18962k12637J34011j151L93042J65158
13730C76563m99269J19355K82865R5960O7061l00674j14596K84819K19005J60591
$$ plain form
13720 691680 573842 475823 416923 40664 116789 272503 304408 118062 500959 579906
13710 579906 347341 176070 271433 554748 352788 251588 253885 445085 401676 590290
13700 590290 580215 351059 78884 -18738 291250 730811 677241 472725 123766 -280376
13690 -280376 -393897 -472844 -152963 -15367 7209 72144 101790 100426 32322 -115071 -29183
13679 -29183 -375006 -394892 -252666 -226341 -359016 -142889 -182601 -81380 -23567 -188054
13669 -188054 -178073 324322 445995 269545 205140 187861 212963 236918 369277 336186 365485
13658 365485 686531 788638 452433 420992 728721 628595 463999 457061 332928 147346
13648 147346 107517 407571 675362 831927 1044319 896215 455293 364991 160383 -50613
$$ packed form
13720F91680j17838r8019n8900l76259P6125J55714L1905j86346L82897P8947
13710E79906k32565j71271R5363K83315k01960j01200K297J91200m3409J88614
13700E90290j0075k29156k72175r7622L09988M39561n3570k04516l48959m04142
13690b80376j13521p8947L19881J37596K2576O4935K9646j364o8104j47393Q5888
13679b9183l45823j9886J42226K6325j32675K16127l9712J01221N7813j64487
13669a88054R981N02395J21673j76450o4405j7279K5102K3955J32359l3091K9299
13658C65485L21046J02107l36205l1441L07729j00126j64596o938j24133j85582
13648A47346l9829L00054K67791J56565K12392j48104m40922r0302k04608k10996
$$ plain form
13638 -50613 -437496 -351658 -359347 -550356 -183172 113217 119678 365404 448034 227310 51
13627 51 187437 166319 174027 111358 274575 324748 655304 617307 370759 278724 541090
13616 541090 738005 577813 518075 328290 116651 -122160 -449997 -199831 114795 -315744
13606 -315744 -518107 -311498 30829 -135952 -339520 -215955 84031 105852 211265 138622
13596 138622 -250700 -350566 -457149 -556443 -196703 262452 535864 475137 19748 83578
13586 83578 73027 -34606 -64780 -18902 -79519 -216459 -416803 -302338 -166182 -213977 -69970
13575 -69970 15705 170932 187896 154951 -9516 78932 199701 507966 400788 270490
13565 270490 338433 -86653 -147744 58411 42569 -157431 -326061 -233752 -386328 -158868
$$ packed form
13638e0613l86883Q5838p689j91009L67184K96389O461K45726Q2630k20724k27259
13627E1J87386k1118P708o2669J63217N0173L30556l7997k46548r2035K62366
13616E41090J96915j60192n9738j89785k11639k38811l27837K50166L14626m30539
13606c15744k02363K06609L42327j66781k03568J23565K99986K1821J05413p2643
13596A38622l89322r9866j06583r9294L59740M59155K73412o0727m55389O3830
13586H3578j0551j07633l0174M5878o0617j36940k00344J14465J36156m7795J44007
13575f9970Q5675J55227J6964l2945j64467Q8448J20769L08265j07178j30298
13565B70490O7943m25086o1091K06155j5842k00000j68630R2309j52576K27460
$$ plain form
13555 -158868 159771 367668 508559 742966 765895 334699 -386740 -319147 131855 313536
13545 313536 221823 165016 127715 -183016 -485854 -334991 28165 308689 152411 115911
13535 115911 189357 116891 -62415 -224308 -101842 -6200 79557 247343 248555 397603 231193
13524 231193 442651 287000 43391 -155354 -317030 -380935 -146159 45804 -27628 -209831
13514 -209831 -403845 -413905 -302631 -333186 -134599 -56041 -17507 -140317 -264043 -68723
13504 -68723 76494 81412 -79877 168986 -169467 -512635 -478440 -392902 -416470 -323848 60941
13493 60941 -31665 176702 108581 -180497 -145154 -295276 248368 572202 524434 569253 235771
13482 235771 -47718 -46392 112171 237438 353087 100257 210802 424947 716396 512085
$$ packed form
13555a58868L18639K07897J40891K34407K2929m31196p21439O7593M51002J81681
13545C13536r1713n6807l7301l10731l02838J50863L63156K80524j56278l6500
13535A15911P3446p2466j79306j61893J22466R5642Q5757J67786J212J49048j66410
13524B31193K11458j55651k43609j98745j61676o3905K34776J91963p3432j82203
13514b09831j94014j0060J11274l0555J98587P8558L8534j22810j23726J95320
13504f8723J45217M918j61289K48863l38453l43168L4195Q5538k3568R2622L84789
13493F0941r2606K08367o8121k89078L5343j50122N43644L23834m7768M4819l33482
13482B35771k83489J326J58563J25267J15649k52830J10545K14145K91449k04311
$$ plain form
13472 512085 274399 -21306 -84609 13767 14202 -288371 -297653 -71438 -21945 47096 -105499
13461 -105499 -86229 41121 -255289 -220495 -37982 159011 301315 154996 -332191 -180054
13451 -180054 -230092 -173398 -297258 -86694 -44078 -408158 -165606 184902 85082 -96293
13441 -96293 -197851 -268282 -161553 -218058 -401351 -90175 218056 -20068 -23947 630903
13431 630903 658017 437811 353656 307965 192354 -70532 -26766 35263 173936 157088 266560
13420 266560 256361 37315 -296010 -609238 -425483 -398472 -168231 -198743 -353967 -237368
13410 -237368 172434 142169 26057 -53708 -132395 -198191 -172419 -104244 -36597 -87517 -185819
13399 -185819 -639347 -752106 -342186 -110859 195122 273975 149955 225189 -128825 -216023
$$ packed form
13472E12085k37686k95705o3303R8376M35l02573r282K26215M9493O9041j52595
13461a05499J9270J27350k96410L4794J82513J96993J42304j46319m87187J52137
13451a80054n0038N6694j23860K10564M2616l64080K42552L50508r9820j81375
13441i6293j01558p0431J06729n6505j83293L11176L08231k38124l879O54850
13431F30903K7114k20206q4155m5691j15611k62886M3766O2029J38673j6848J09472
13420B66560j0199k19046l33325l13228J83755K7011K30241l0512j55224J16599
13410b37368M09802l0265j16112p9765p8687o5796K5772O8175O7647n0920r8302
13399a85819m53528j12759M09920K31327L05981P8853j24020P5234l54014q7198
$$ plain form
13389 -216023 5559 208370 159066 320132 271461 108197 -123667 -401605 -290298 -173292
13379 -173292 -83204 -56753 -327271 -773172 -1082514 -691608 -252779 -92497 -41402 -182507
13369 -182507 -466850 -400074 -638095 -801260 -442085 -150671 -416234 -425480 -265053 -452488
13359 -452488 -216279 -154039 -87071 -130507 -31018 65758 136362 -168780 -139994 -169836 -97704
13348 -97704 -32289 112015 -46992 -166150 -424163 -503814 -353957 -364231 -204352 -72530
13338 -72530 -365346 -334415 -291864 -308732 -746371 -536812 -263417 180373 327814 156223
13328 156223 75966 229854 -71786 -72456 -120640 52664 166473 388437 522440 75470
13318 75470 56704 71747 -61567 -331262 -301960 -245649 188802 91558 -109187 233836 46367
$$ packed form
13389b16023K21582K02811m9304J61066m8671j63264k31864k77938J11307J17006
13379a73292R0088K6451k70518m45901l09342L90906M38829J60282N1095j41105
13369a82507k84343O6776k38021j63165L59175K91414k65563r246J60427j87435
13359d52488K36209O2240O6968m3436R9489R6776P0604l05142K8786k9842P2132
13348i7704O5415J44304j59007j19158k58013p9651J49857j0274J59879J31822
13338g2530k92816L0931M2551j6868m37639K09559K73395M43790J47441j71591
13328A56223q0257J53888l01640o70m8184J73304J13809K21964J34003m46970
13318G5470j8766J5043j33314k69695K9302N6311M34451r7244k00745L43023j87469
$$ plain form
13307 46367 23605 202539 125173 -73290 -528531 -414220 106814 556608 507376 42558
13297 42558 -290966 -164402 61587 240433 145942 -98681 -472751 -771632 -811049 -867780
13287 -867780 -856030 -755469 -683689 -558636 -833540 -863708 -553884 -398353 -420311 -182565
13277 -182565 -232511 -176617 -111714 -12661 11594 -350862 -335114 -361908 -489927 -305411 -121663
13266 -121663 -169256 -465534 -520235 -406310 -227702 -194592 -104787 -366029 -544826 -570733
13256 -570733 -750679 -540959 -65395 157025 69427 106955 346269 398812 417644 501380
13246 501380 488038 554028 184075 -27512 172764 166135 45379 13160 214503 261098 364740
13235 364740 145752 -188189 -510003 -310581 33141 104251 60162 111968 -2294 52461
$$ packed form
13307D6367k2762J78934p7366j98463m55241J14311N21034M49794m9232m64818
13297D2558l33524J26564K25989J78846r4491k44623l74070k98881l9417n6731
13287h67780J1750J00561P1780J25053k74904l0168L09824J55531k1958K37746
13277a82565m9946N5894O4903R9053K4255l62456J5748k6794j28019J84516J83748
13266a21663m7593k96278n4701J13925J78608L3110Q9805k61242j78797k5907
13256e70733j79946K09720M75564K22420q7598L7528K39314N2543J8832Q3736
13246E01380j3342O5990l69953k11587K00276o629j20756l2219K01343M6595J03642
13235C64740k18988l33941l21814J99422L43722P1110m4089N1806j14262N4755
$$ plain form
13225 52461 -63688 20732 377152 204149 80537 85165 581417 627278 32038 -135601
13215 -135601 -199188 119078 200316 -6135 186234 420421 473063 451825 -47164 -22963
13205 -22963 -304239 -298196 -136728 161604 288129 58646 47223 42595 308953 313850 134757
13194 134757 -137351 81409 38049 189662 459296 629350 475247 429485 296462 260542
13184 260542 21210 172138 335823 -151258 -581600 -581612 -621262 -506258 -437095 -223760 24865
13173 24865 69817 222536 -99322 -153701 -294500 -283709 -173030 -388140 -642221 -457139
13163 -457139 -353338 -336676 -219664 -231516 10688 169439 536328 608779 255308 -71271
13153 -71271 154788 536550 649294 372750 490703 787929 697634 1033620 1543659 1910858
$$ packed form
13225E2461j16149Q4420L56420j73003j23612M628M96252M5861n95240j67639
13215a35601o3587L18266Q1238k06451J92369K34187N2642k1238m98989K4201
13205b2963k81276O043J61468K98332J26525k29483j1423m628K66358M897j79093
13194A34757k72108K18760m3360J51613K69634J70054j54103m5762j33023l5920
13184B60542k39332J50928J63685m87081m30342j2l9650J15004O9163K13335K48625
13173B4865M4952J52719l21858n4379j40799J0791J10679k15110k54081J85082
13163d57139J03801J6662J17012j1852K42204J58751L66889P2451l53471l26579
13153g1271K26059L81762J12744k76544J17953K97226r0295L35986N10039L67199
$$ plain form
13143 1910858 1933006 1459258 905041 527583 327457 259372 219081 230919 162582 99236
13133 99236 219848 -184361 -298173 136587 153073 95477 291084 424869 288756 20220
13123 20220 -186417 -306110 -198425 84845 353873 148399 368018 443495 126405 137059
13113 137059 596338 507485 76909 -170802 -243557 -343218 -315856 -38410 173058 -31561
13103 -31561 -144577 239022 865613 1283407 1621353 1659111 1497194 928654 680085 498560
13093 498560 570812 399554 267464 720976 770509 498141 519159 609747 660314 835832
13083 835832 815206 601461 641501 465410 171989 -123884 -492894 -625593 -886263 -714480
13073 -714480 -282721 -221525 -367522 -71697 107625 -39140 -338819 -294589 -395932 -284958
$$ packed form
13143A910858K2148m73748n54217l77458k00126o8085m0291J1838o8337o3346
13133I9236J20612m04209j13812M34760J6486n7596J95607J33785j36113k68536
13123B0220k06637j19693J07685K83270K69028k05474K19619P5477l17090J0654
13113A37059M59279q8853m30576k47711p2755r9661K7362K77446K11468k04619
13103c1561j13016L83599O26591M17794L37946L7758j61917n68540k48569j81525
13093D98560P2252j71258j32090M53512M9533k72368K1018R0588N0567J75518
13083H35832k0626k13745M0040j76091k93421k95873l69010j32699k60670J71783
13073g14480M31759O1196j45997K95825J79322j46765k99679M4230j01343J10974
$$ plain form
13063 -284958 -317937 -392004 -204596 -16790 163456 268468 357311 370485 585358 859049
13053 859049 769254 587882 469688 381898 574361 252376 -64871 55987 19208 -23960
13043 -23960 122921 -64535 -219756 -108871 32533 25953 -185050 -243290 -522699 -417412
13033 -417412 -233088 -261693 -47764 -181643 -265113 -231466 -135055 -295529 -4616 495779
13023 495779 565962 494950 320562 41541 -178498 -386814 -428130 93103 252230 329846
13013 329846 247975 130480 84688 262722 333067 -49831 -156807 -154141 -77652 -35756 65704
13002 65704 32462 -222748 141542 159485 10590 586948 828789 656256 515671 576088
12992 576088 747697 778076 591260 297425 202503 278347 35402 -81855 -29680 -21089 52659
$$ packed form
13063b84958l2979p4067J87408J87806J80246J05012Q8843J3174K14873K73691
13053H59049q9795j81372j18194q7790J92463l21985l17247J20858l6779m3168
13043b3960J46881j87456j55221J10885J41404o580k11003n8240k79409J05287
13033d17412J84324k8605K13929j33879q3470L3647R6411j60474K90913N00395
13023D95779P0183p1012j74388k79021k20039k08316m1316N21233J59127P7616
13013C29846q1871j17495m5792J78034P0345l82898j06976K666P6489M1896J01460
13002F5704l3242k55210L64290J7943j48895N76358K41841j72533j40585O0417
12992E76088J71609L0379j86816k93835r4922P5844k42945j17257N2175Q591P3748
$$ plain form
12981 52659 27399 120814 173366 130784 156056 318992 41721 -71698 -86477 -52119 -183382
12970 -183382 -791976 -758429 -347985 -36031 -56330 -672917 -872420 -747228 -275405 -341038
12960 -341038 -524094 -81408 -25139 -187370 -135718 -133886 59157 -99118 26782 302667
12950 302667 149091 70263 -166175 -434077 -438308 -327310 -656568 -429086 -242897 -122109
12940 -122109 71789 -5349 -571477 -663090 -294053 -50039 -91535 -47612 -85667 -345151
12930 -345151 -488983 -488876 -113489 140826 189708 45770 -7444 66531 269198 257074 288573
12919 288573 591861 397086 260578 87833 -135826 -209810 -327157 -436779 -581755 -601765
12909 -601765 -517409 -282918 -309450 -319411 -392801 6637 199583 204855 182296 140006 -36738
$$ packed form
12981E2659k5260R3415N2552m2582K5272J62936k77271j13419j4779L4358j31263
12970a83382o08594L3547M10444L11954k0299o16587j99503J25192M71823o5633
12960c41038j83056M42686N6269j62231N1652J832J93043j58275J25900K75885
12950C02667j53576p8828k36438k67902m231J10998l29258K27482J86189J20788
12940a22109J93898p7138n66128r1613L69037K44014m1496M3923l8055k59484
12930c45151j43832J07L75387K54315M8882j43938n3214P3975K02667j2124L1499
12919B88573L03288j94775j36508j72745k23659p3984j17347j09622j44976k0010
12909f01765Q4356K34491k6532r961p3390L99438J92946N272k2559m2290j76744
$$ plain form
12898 -36738 20133 7636 -400443 -490459 -131888 224502 603352 586697 239532 331800 428836
12887 428836 554086 562155 514737 452344 464173 631687 673244 254432 -149139 -86046 -3378
12876 -3378 29203 4450 -182022 -257771 -616508 -580042 -435826 -369348 -78496 -123776 -94073
12865 -94073 7984 -195863 -503731 -491997 -146705 90766 -17944 -264474 -92485 52665
12855 52665 102615 62030 -105998 -38382 305452 162388 -51362 -286249 -460009 -305022
12845 -305022 -456809 -366903 -252870 -2914 7463 230609 164141 353800 339847 498910
12835 498910 349743 -15439 267398 -14869 -315435 -286248 -199650 2802 314764 281388
12825 281388 222911 -265554 -449955 -468455 -242800 181719 455478 315122 108593 -143020
$$ packed form
12898c6738N6871j2497m08079r0016L58571L56390L78850j6655l47165R2268R7036
12887D28836J25250Q069m7418o2393J1829J67514M1557m18812m03571O3093Q2668
12876c378L2581k4753j86472p5749l58737L6466J44216O6478K90852m5280K9703
12865i4073J02057k03847l07868J1734L45292K37471j08710k46530J71989J45150
12855E2665M9950m0585j68028O7616L43834j43064k13750k34887j73760J54987
12845c05022j51787Q9906J14033K49956J0377K23146o6468J89659j3953J59063
12835D98910j49167l65182K82837k82267l00566K9187Q6598K02452L11962l3376
12825B81388n8477m88465j84401j8500K25655M24519K73759j40356k06529k51613
$$ plain form
12815 -143020 -449973 -498588 -201052 -91123 -178688 -287973 -236958 -298752 172772 155474
12805 155474 112937 384657 309772 127107 -70124 141739 348506 263643 315805 400255
12795 400255 295399 46364 21580 277921 57158 35110 220962 395426 158840 -152000
12785 -152000 -86583 15214 -153624 -16924 226845 309175 95309 -154407 56057 47571
12775 47571 119145 314345 389355 332627 -108278 -227700 -247024 -369898 -569022 -297644
12765 -297644 -250535 -619863 -757722 -735670 -432473 -168822 41582 71345 -152572 -183820
12755 -183820 -61547 -452859 -5952 356497 365170 534556 514832 366728 -64560 -376674
12745 -376674 -636185 -562360 -560700 -721448 -672485 -536150 -493506 -703489 -631707 -338952 -64679
$$ packed form
12815a43020l06953m8615K97536J09929q7565j09285N1015o1794M71524j7298
12805A55474m2537K71720p4885j82665j97231K11863K06767q4863N2162Q4450
12795D00255j04856k49035k4784K56341k20763k2048J85852J74464k36586l10840
12785a52000O5417J01797j68838J36700K43769Q2330k13866k49716K10464q486
12775D7571P1574J95200P5010n6728m40905j19422j9324j22874j99124K71378
12765b97644M7109l69328j37859K2052L03197K63651K10404K9763k23917l1248
12755a83820J22273l91312M46907L62449Q673J69386j9724j48104m31288l12114
12745c76674k59511P3825J660j60748M8963J36335M2644k09983P1782K92755K74273
$$ plain form
12734 -64679 305357 232656 -235959 -444638 -366562 9490 -149559 -313894 -196909 -294912
12724 -294912 30049 -27017 -341992 -378077 -198352 -297695 -102169 188172 232704 39283
12714 39283 184969 182063 147930 196428 566257 581040 -45795 211941 270164 -3507 144570
12703 144570 71970 -388931 -389537 -361912 -594443 -228775 25383 -119160 -251845 -222261 -115978
12692 -115978 -1488 -160071 -255181 -52197 189040 292445 59874 -2909 -95815 -192611
12682 -192611 209655 485679 270033 -59712 -159302 -84777 -89876 146784 61727 42009 79939
12671 79939 -306387 -390222 -249301 -569075 -395857 -123614 -107986 -74763 -229327 -371331
12661 -371331 -290400 -97297 -132294 -262900 -316037 40461 123678 21820 65427 154145 183491
$$ packed form
12734f4679L70036p2701m68615k08679P8076L76052j59049j64335J16985r8003
12724b94912L24961n7066l14975l6085J79725r9343J95526K90341M4532j93421
12714C9283J45686k906l4133M8498L69829J4783o26835K57736N8223k73671J48077
12703A44570p2600m60901o06K7625k32531L65668K54158j44543j32685K9584J06283
12692a15978J14490j58583r5110K02984K41237J03405k32571o2783r2906r6796
12682a92611M02266K76024k15646l29745r9590P4525n099K36660q5057j9718L7930
12671G9939l86326q3835J40921l19774J73218K72243J5628L3223j54564j42004
12661c71331Q0931J93103l4997j30606n3137L56498Q3217j01858M3607Q8718K9346
$$ plain form
12650 183491 183613 162224 114190 126085 -40353 -302475 -335745 -207571 -271191 36241 144946
12639 144946 -186896 -413296 -315993 -242293 -430873 134992 322806 499546 670047 115925
12629 115925 15133 192253 19861 -208324 -315788 -551158 -415796 -179356 -199421 241621
12619 241621 353240 388943 428455 505209 329121 108364 199599 -58807 143529 245136
12609 245136 288942 482264 223013 -85525 -149770 104237 97024 -385823 -655777 -389526
12599 -389526 -566837 -868424 -603818 -501783 -213398 -270781 -931546 -952322 -782819 -479448
12589 -479448 -882 277266 164872 -24503 225782 113075 -40907 -65257 210906 183649
12579 183649 197687 238329 26160 503346 541947 317420 506934 438091 409014 295559
$$ packed form
12650A83491J22k1389m8034J1895j66438k62122l3270J28174o3620L07432J08705
12639A44946l31842k26400R7303P3700j88580N65865J87814J76740J70501n54122
12629A15925j00792J77120j72392k28185j07464k35370J35362K36440k0065M41042
12619B41621J11619L5703L9512P6754j76088k20757R1235k58406K02336J01607
12609B45136M3806J93322k59251l08538o4245K54007p213m82847k69954K66251
12599c89526j77311l01587K64606J02035K88385n7383o60765k0776J69503L03371
12589d79448M78566K78148j12394j89375K50285j12707j53982k4350K76163k7257
12579A83649J4038M0642k12169M77186L8601k24527J89514o8843k9077j13455
$$ plain form
12569 295559 52369 25295 60236 -237822 -459994 -696668 -768405 -648493 -387061 47828
12559 47828 -266107 -218797 131977 80208 -369335 -420570 112671 119303 -89801 20859 152909
12548 152909 45220 39930 67950 41744 -205561 -276301 -212215 -14901 44084 2603 -176723
12537 -176723 116302 247343 25648 197806 326829 509561 741791 476293 299371 366433
12527 366433 11254 -247287 -39799 -452910 -281110 -148588 -170639 -19889 9041 -298366
12517 -298366 81298 390127 577695 -14049 -180915 -75746 -114048 327707 396623 252241
12507 252241 132744 -171003 -226128 89734 351698 2075 -261609 226647 549463 365260
12497 365260 190510 -67841 -374093 -212044 226225 575244 626060 654768 536660 14057
$$ packed form
12569B95559k43190k7074L4941k98058k22172k36674p1737J19912K61432M34889
12559D7828l13935M7310L50774n1769m49543n1235N33241O632k09104J10660J32050
12548A52909j07689n290K8020k6206k47305p0740O4086J97314N8985m1481j79326
12537a76723K93025J31041k21695J72158J29023J82732K32230k65498j76922O7062
12527C66433l55179k58541K07488m13111J71800J32522k2051J50750K8930l07407
12517b98366L79664L08829J87568n91744j66866J05169l8302M41755O8916j44382
12507B52241j19497l03747n5125L15862K61964l49623k63684M88256L22816j84203
12497C65260j74750k58351l06252J62049M38269L49019N0816K8708j18108n22603
$$ plain form
12487 14057 352713 421664 255932 182111 -167791 -148775 28901 -254304 -251596 -275775 -99117
12476 -99117 -275802 -316007 -174204 60887 126256 464588 712196 625694 518395 272353
12466 272353 73543 14472 -207937 -282313 -306178 -191505 2926 239808 171006 -23387
12456 -23387 28672 -255400 -113954 261001 206100 -246515 -550528 -523097 -404083 -509990
12446 -509990 -337130 -377740 -202239 409492 677368 296854 66147 6599 -32670 -21093
12436 -21093 -144474 117750 89206 -246920 -358376 -32483 29619 -139758 -60907 364278
12426 364278 543250 442978 357027 229598 79706 146969 115984 178643 351172 123857
12416 123857 -268995 -343380 -370720 -284412 -508710 -505295 -143071 159856 264621 149649
$$ packed form
12487A4057L38656O8951j65732p3821l49902J9016J77676k83205K708k4179J76658
12476i9117j76685m0205J41803K35091O5369L38332K47608q6502j07299k46042
12466B72353j98810n9071k22409p4376k3865J14673J94431K36882o8802j94393
12456b3387N2059k84072J41446L74955n4901m52615l04013K7431J19014j05907
12446e09990J72860m0610J75501O11731K67876l80514k30707n9548l9269J1577
12436b1093j23381K62224k8544l36126j11456L25893O2102j69377P8851M25185
12426C64278J78972j00272q5951j27429j49892O7263l0985O2659J72529k27315
12416A23857l92852p4385k7340Q6308k24298L415L62224L02927J04765j14972
$$ plain form
12406 149649 -139256 -67537 145451 61654 -129117 162644 -301310 -277199 -172905 -45092
12396 -45092 -62066 -157275 -347063 -84253 -97214 -362014 -599742 -554472 -202507 -134881 -85273
12385 -85273 -85591 -112030 -294275 -153931 224589 409559 446935 539695 451434 336148 17214
12374 17214 13007 123438 183029 135578 29760 99831 228120 485518 715969 425691 177590
12363 177590 -100857 -123362 15045 59890 289414 227823 4791 91668 -68920 -124881
12353 -124881 -154783 -221057 -14367 235272 461377 552711 363572 197744 111612 -28178
12343 -28178 42894 202448 114840 -592661 -419890 -328639 -272305 -96807 -81964 -252028 -247990
12332 -247990 -285085 -365878 -409352 -220707 -31818 -214617 948 -236620 -332294 -215891
$$ packed form
12406A49649k88905P1719K12988q3797j90771K91761m63954K4111J04294J27813
12396d5092j6974r5209j89788K62810j2961k64800k37728M5270L51965O7626M9608
12385h5273l18k6439j82245J40344L78520J84970L7376R2760q8261j15286l18934
12374A7214m207J10431N9591m7451j05818P0071J28289K57398K30451k90278k48101
12363A77590k78447k2505J38407M4845K29524o1591k23032Q6877j60588n5961
12353a24881k9902o6274K06690K49639K26105R1334j89139j65828q6132j39790
12343b8178P1072J59554q7608p07501J72771R1251N6334J75498J4843j70064M038
12332b47990l7095q0793m3474J88645J88889j82799K15565k37568r5674J16403
$$ plain form
12322 -215891 -147922 -48805 107571 -58839 -215317 -190736 46168 -138875 -56709 -138073
12312 -138073 -154945 -176625 -151147 -98786 -31405 143224 423143 389661 345585 -1536 -298139
12301 -298139 -414892 -123607 130198 -170601 -375401 -185424 -450209 -626658 -271148 -306049
12291 -306049 -474158 -418226 -410186 -422780 -461807 -657424 -466269 -143159 -101897 -56878 -85411
12280 -85411 146881 -149642 -21285 166971 -182815 -359975 -283808 -69333 114119 250316
12270 250316 154131 2040 -328657 78675 183635 98414 193646 317956 240639 192558
12260 192558 200752 293951 264311 375380 103148 -365125 -172996 78116 339242 465792
12250 465792 122183 322610 464177 184822 -151947 -4767 -124476 127697 118131 172035
$$ packed form
12322b15891O7969R9117J56376j66410j56478K4581K36904j85043Q2166q1364
12312a38073j6872k1680K5478N2361O7381J74629K79919l3482m4076l47121k96603
12301b98139j16753K91285K53805l00799k04800J89977k64785j76449L55510l4901
12291c06049j68109N5932Q040j2594l9027j95617J91155L23110M1262M5019k8533
12280h5411K32292k96523J28357J88256l49786j77160P6167K14475J83452J36197
12270B50316r6185j52091l30697M07332J04960q5221R5232J24310p7317m8081
12260A92558Q194R3199k9640J11069k72232m68273J92129K51112K61126J26550
12250D65792l43609K00427J41567k79355l36769J47180j19709K52173r566N3904
$$ plain form
12240 172035 214118 362456 88421 -129122 -119607 86048 68131 -243453 -140607 160043
12230 160043 338921 349233 197640 -84357 -32430 40423 -99035 -116498 122115 -321832
12220 -321832 -217593 363361 759388 229651 -75307 -108113 -253017 -282018 -77489 161465
12210 161465 249056 303903 162827 103971 2931 -324528 -349901 -353192 -370467 -127999 158506
12199 158506 280431 201793 248110 314202 425705 106172 -13112 -36187 -350489 -283636
12189 -283636 -118296 115350 470008 391224 58494 -34167 206196 247051 119363 -64843
12179 -64843 -445592 -162782 -130914 -219449 -419025 -393683 -176160 28123 -84937 -25199
12169 -25199 305022 522992 314808 194061 29036 -81285 -241046 -272725 -271060 -431079
$$ packed form
12240A72035M2083J48338k74035k17543R515K05655j7917l11584J02846L00650
12230A60043J78878J0312j51593k81997N1927P2853j39458j7463K38613m43947
12220c21832J04239N80954L96027n29737l04958l2806j44904k9001K04529K38954
12210A61465Q7591N4847j41076n8856j01040l27459k5373l291j7275K42468K86505
12199A58506J21925p8638M6317O6092J11503l19533j19284k3075l14302O6853
12189b83636J65340K33646L54658p8784l32730r2661K40363M0855j27688j84206
12179f4843l80749K82810L1868q8535j99576K5342K17523K04283j13060N9738
12169b5199L30221K17970k08184j20747j65025j10321j59761l1679J665j60019
$$ plain form
12159 -431079 -673168 -770573 -575066 -166952 94051 -476029 -636626 -282969 -47044 14147
12149 14147 194426 127419 335094 402845 497983 640019 168255 59135 66442 72196 428673
12138 428673 700620 641688 537207 219647 -186831 -564484 -808018 -704497 -545275 -478698
12128 -478698 -830461 -797189 -766590 -341317 -96246 -118431 -105797 -30580 -69333 -556475 -834692
12117 -834692 -399427 -38741 186401 180954 -37315 -399345 -308862 -724997 -500008 -196755
12107 -196755 -161967 -69550 -65354 93977 66032 61416 108583 -32121 -185903 -442201 -268275
12096 -268275 -257789 -56419 45706 -42591 138264 75994 185944 217712 -272185 -451021
12086 -451021 -432581 -203410 111194 -107459 -201275 -94965 75692 -70997 -152496 34707
$$ packed form
12159d31079k42089r7405J95507M08114K61003n70080j60597L53657K35925O1191
12149A4147J80279o7007K07675O7751R5138J42036m71764j09120P307N754L56477
12138D28673K71947n8932j04481l17560m06478l77653k43534J03521J59222O6577
12128d78698l51763L3272L0599M25273K45071k2185J2634P5217l8753m87142k78217
12117h34692M35265L60686K25142n447k18269l62030R0483m16135K24989L03253
12107a96755L4788R2417M196J59331k7945m616M7167j40704j53782k56298J73926
12096b68275J0486K01370J02125q8297J80855o2270J09950L1768m89897j78836
12086d51021J8440K29171L14604k18653r3816J06310J70657j46689q1499J87203
$$ plain form
12076 34707 138750 -162607 -268430 24796 254379 39810 -269363 -547425 -322296 -212663
12066 -212663 -275771 -336098 -238143 -73552 -200359 -84318 57830 45159 -89856 -346118
12056 -346118 -306830 -136231 175148 29213 -238362 -534070 -334765 -226106 113430 156386
12046 156386 46262 54847 163480 227790 4408 -101794 -14659 -86331 -278008 -644717
12036 -644717 -950687 -941246 -689134 -143205 287890 122734 4907 -288576 -230511 -185033
12026 -185033 -204609 -414667 -684415 -808900 -787747 -681874 -325748 88620 239499 172078
12016 172078 -293692 -635760 -423162 -124719 -151823 -257302 19986 75891 76729 -415013
12006 -415013 -629334 -350138 105184 235266 564953 375546 1741 -211292 -121363 200272
$$ packed form
12076C4707J04043l01357j05823K93226K29583k14569l09173k78062K25129J09633
12066b12663o3108o0327R7955J64591j26807J16041J42148j2671j35015k56262
12056c46118L9288J70599L11379j45935k67575k95708J99305J08659L39536M2956
12046A56386j10124Q585J08633O4310k23382j06202Q7135p1672j91677l66709
12036f44717l05970R441K52112N45929M31095j65156j17827k93483N8065M5478
12026a85033j9576k10058k69748j24485K1153J05873L56126M14368J50879o7421
12016A72078m65770l42068K12598K98443k7104j05479K77288N5905Q38m91742
12006d15013k14321K79196M55322J30082L29687j89407l73805k13033Q9929L21635
$$ plain form
11996 200272 75617 -33837 -53179 67682 -164696 -340654 -370359 -474492 -147648 96827
11986 96827 10722 -62129 -293599 -379162 -587683 -510153 -129632 145071 31336 345998
11976 345998 499964 320169 -202720 -196238 -117789 25463 -408287 -233467 47389 -176586
11966 -176586 -597842 -801102 -434589 17372 402038 526027 636481 305685 193187 251869
11956 251869 138802 558169 506234 516902 759132 598703 14617 -406639 -453033 -798313
11946 -798313 -728879 -557265 -778238 -856655 -907362 -335862 -167921 -209155 -133721 -54189 116346
11935 116346 -147568 -457645 -590917 -573026 -205602 123528 145388 514025 500408 240287
11925 240287 284151 218282 253841 478367 464212 288330 110278 -76301 46234 80129
$$ packed form
11996B00272j24655j09454j9342J20861k32378j75958k9705j04133L26844K44475
11986I6827q6105p2851k31470q5563k08521P7530L80521K74703j13735L14662
11976C45998J53966j79795n22889O482P8449J43252m33750J74820K80856k23975
11966a76586m21256k03260L66513M51961L84666J23989J10454l30796j12498N8682
11956B51869j13067M19367n1935J0668K42230j60429n84086m21256m6394l45280
11946g98313O9434J71614k20973p8417n0707N71500J67941m1234P5434P9532J70535
11935A16346k63914l10077j33272J7891L67424L29130K1860L68637j3617k60121
11925B40287M3864o5869L5559K24526j4155j75882j78052j86579J22535L3895
$$ plain form
11915 80129 144601 25629 52750 225873 280290 -183740 -118748 -109842 -183634 -289380 -540112
11904 -540112 -498112 -121925 80739 240815 2439 261113 411405 153928 294618 136370
11894 136370 359961 409920 375093 103117 -180432 -307628 -252768 133364 326850 257994
11884 257994 546736 784889 530149 18204 -608645 -772324 -683741 -429192 -349068 -185013
11874 -185013 -466009 -513210 -443649 -452940 -651652 -371799 -47938 273149 255580 274043 123170
11863 123170 237747 366340 72726 11597 231233 21890 -266184 -678064 -648707 -762472
11853 -762472 -758588 -843393 -690706 -687682 -700331 -785046 -604215 -368858 -270364 -150802 250851
11842 250851 101015 -224719 -157017 24330 149912 -140196 -428830 -125924 40362 -272262
$$ packed form
11915H0129O4472j18972K7121J73123N4417m64030O4992Q906p3792j05746k50732
11904e40112M2000L76187K02664J60076k38376K58674J50292k57477J40690j58248
11894A36370K23591M9959l4827k71976k83549j27196N4860L86132J93486o8856
11884B57994K88742K38153k54740n11945o26849j63679Q8583K54549Q0124J64055
11874a85013k80996m7201O9561r291j98712K79853L23861L21087j7569J8463j50873
11863A23170J14577J28593k93614o1129K19636k09343k88074m11880K9357j13765
11853g62472L884q4805J52687L024j2649q4715J80831K35357R8494J19562M01653
11842B50851j49836l25734O7702J81347J25582k90108k88634L02906J66286l12624
$$ plain form
11832 -272262 -488492 -459923 -205409 37703 284794 508800 290037 219587 232057 127034
11822 127034 -66833 -306072 -96137 -441 -344796 -95246 -17392 -247814 -369699 -226475
11812 -226475 -126304 113165 333385 202412 29944 24664 56517 -125946 16800 -250190
11802 -250190 -644713 -937444 -400642 22725 -131032 29159 279037 170043 178039 3169
11792 3169 -144748 -44875 -23000 -177358 -332244 -161156 1752 -69089 -396948 -200419
11782 -200419 -104793 -252911 -244565 -404665 -790090 -370020 -88528 -155781 -213369 -618987
11772 -618987 -547343 -235281 34846 2711 80042 -43752 -180759 -200686 -640431 -261679
11762 -261679 -333403 -101697 169714 66501 214641 67220 -203121 -420714 -929777 -905894
$$ packed form
11832b72262k16230K8569K54514K43112K47091K24006k18763p0450J2470j05023
11822A27034j93867k39239K09935R5696l44355K49550P7854k30422j21885J43224
11812b26475J00171K39469K20220j30973j72468n280L1853j82463J42746k66990
11802b50190l94523k92731N36802M23367j53757J60191K49878j08994P996j74870
11792C169j47917R9873K1875j54358j54886J71088J62908p0841l27859J96529
11782b00419R5626j48118Q346j60100l85425M20070K81492o7253n7588m05618
11772f18987P1644L12062K70127l2135P7331j23794j37007j9927m39745L78752
11762b61679p1724K31706K71411j03213J48140j47421k70341k17593n09063K3883
$$ plain form
11752 -905894 -684501 -581116 -390550 -321276 -136558 -66928 36037 140978 -181599 -249682
11742 -249682 55559 207602 203247 121161 -97434 -20045 201130 402830 404838 7092 263479
11731 263479 603231 799504 739000 303287 108226 -33005 -315993 -143772 -195306 -346020
11721 -346020 -322397 -329483 -517796 -568444 -626402 -236829 -18370 -9782 -466578 -582145 -621247
11710 -621247 -607268 -345907 -351161 -540482 -483628 -791822 -791984 -557721 -420078 -58663 325732
11699 325732 482500 213963 77947 -6421 238966 41895 -190607 -458729 -417184 -231546
11689 -231546 52409 160509 255868 391270 159221 413477 457270 188231 35836 2376
11679 2376 -50100 -283662 -584054 -469734 8940 36702 -144468 -218447 -470814 -249308
$$ packed form
11752i05894K21393J03385J90566O9274J84718O9630J02965J04941l22577o8083
11742b49682L05241J52043m355q2086k18595P7389K21175K01700K008l97746K56387
11731B63479L39752J96273o0504m35713j95061j41231k82988J72221n1534j50714
11721c46020K3623p086j88313n0648n7958L89573K18459Q588m56796j15567l9102
11710f21247J3979K61361n254j89321N6854l08194j62K34263J37643L61415L84395
11699C25732J56768k68537j36016q4368K45387j97071k32502k68122M1545J85638
11689b31546K83955J08100R5359J35402k32049K54256M3793k69039j52395l3460
11679B376n2476k33562l00392J14320M78674K7762j81170p3979k52367K21506
$$ plain form
11669 -249308 -39624 -114493 -45129 248581 217702 -169356 -59556 -115301 124674 162590
11659 162590 562372 391954 -117804 -537031 -631019 -129958 -51982 -402520 -420824 9439
11649 9439 -17883 -72811 -158833 -137337 -154774 -199779 -217649 -412914 -500946 -463453 4526
11638 4526 206190 132988 154773 306157 356721 585533 278431 -24742 202542 589044
11628 589044 412002 194454 236414 525152 604707 335293 -106982 84442 5187 349536
11618 349536 667786 404050 37390 43137 -232968 -242927 -139081 7307 -157087 -324232
11608 -324232 -360746 -76243 173052 469342 355147 116119 -67084 -8244 71084 3053
11598 3053 80451 17415 -580832 -656704 -399932 -297575 -448236 -319532 -169035 -251000 -108537
$$ packed form
11669b49308K09684p4869O9364K93710l0879l87058J09800n5745K39975L7916
11659A62590L99782j70418n09758m19227r3988N01061P7976l50538j8304M30263
11649I439k7322n4928q6022K1496j7437m5005j7870j95265q8032L7493M67979
11638D526K01664p3202K1785J51384N0564K28812l07102l03173K27284L86502
11628E89044j77042k17548M1960K88738P9555k69414m42275J91424p9255L44349
11618C49536L18250k63736l66660N747k76105r959J03846J46388j64394j67145
11608c24232l6514K84503K49295K96290j14195k39028j83203N8840P9328o8031
11598C053P7398o3036n98247p5872K56772J02357j50661J28704J50497q1965J42463
$$ plain form
11587 -108537 179199 200447 227553 -58606 -215372 -53930 231698 78302 -346611 -331507
11577 -331507 -68804 449816 587173 60235 -97947 144337 -9756 -245607 -208298 -116277
11567 -116277 -338834 -530361 -363257 -512774 -313443 144838 214289 354662 98290 -126445
11557 -126445 -231469 -317984 -175799 -108486 -583329 -662057 -692144 -410189 106530 264157
11547 264157 -90287 -6707 345505 40063 -313937 -367058 -158063 46979 -164426 -217513
11537 -217513 -268750 -313875 -347327 -609450 -498942 -66106 90814 284678 184732 155050
11527 155050 365135 443944 329879 -38630 -36948 6453 -126433 381622 525009 380040
11517 380040 175937 -90531 -160612 53041 254217 360106 171777 -168798 -248056 9890
$$ packed form
11587a08537K87736K1248K7106k86159j56766J61442K85628j53396m24913J5104
11577c31507K62703N18620J37357n26938j58182K42284j54093k35851L7309R2021
11567a16277k22557j91527J67104j49517J99331M58281O9451J40373k56372k24735
11557a26445j05024q6515J42185O7313m74843p8728l0087K81955N16719J57627
11547B64157l54444Q3580L52212l05442l54000n3121K08995K05042k11405n3087
11537b17513n1237m5125l3452k62123J10508M32836J56920J93864r9946k9682
11527A55050K10085P8809j14065l68509J682M3401j32886N08055J43387j44969
11517C80040k04103k66468p0081K13653K01176J05889j88329l40575p9258K57946
$$ plain form
11507 9890 307871 285389 49037 -455038 -451976 -9673 150968 84583 -49813 -201977 -233613
11496 -233613 -597441 -743033 -505957 -379813 -231887 87207 330242 534627 207435 381158
11486 381158 562058 84176 -232272 112425 141577 122029 -157381 -192131 110640 170596
11476 170596 -8129 -59580 53415 -113085 -484613 -412029 -162712 -12089 154597 -94345
11466 -94345 -139088 -27711 -220663 -214502 -234296 -128830 220945 123739 -242270 -412271 -298122
11455 -298122 -81370 -322304 -311412 -166184 -130918 -72566 277409 364801 521358 332159
11445 332159 -247109 -679889 -664661 -421282 -318226 -224696 -337995 -25920 34832 -203663
11435 -203663 -253196 -464258 -494247 -385287 -332070 -355661 -238448 -150129 188493 290615
$$ packed form
11507I890K97981k2482k36352n04075L062M42303J60641o6385j34396j52164l1636
11496b33613l63828j45592K37076J26144J47926L19094K43035K04385l27192J73723
11486C81158J80900m77882l16448L44697K9152j9548k79410l4750L02771N9956
11476A70596j78725n1451J12995j66500l71528P2584K49317J50623J66686k48942
11466i4345m4743J11377j92952O161j9794J05466L49775r7206l66009j70001J14149
11455b98122K16752k40934J0892J45228L5266N8352L49975Q7392J56557j89199
11445C32159n79268m32780J5228K43379J03056R3530j13299L12075O0752k38495
11435b03663m9533k11062k9989J08960N3217k3591J17213Q8319L38622J02122
$$ plain form
11425 290615 337315 189411 -117765 -189332 -70196 -72096 -166476 623 208955 193779 194677
11414 194677 11459 -331176 -290599 -192624 -91958 77652 315979 -78739 -517914 -445204
11404 -445204 -239960 -316379 -313323 -233377 -294883 -434223 -439604 -477010 -469891 -443641 -228369
11393 -228369 53278 78284 -173199 -427837 -569404 -690235 -547544 -325966 -347985 121098
11383 121098 327149 588764 187533 -236051 -478674 -111542 -160821 -242034 -42625 198635
11373 198635 301231 301372 215833 389263 579610 276506 285495 475672 536873 484156 256242
11362 256242 27547 257852 336230 111801 73612 372421 911795 1031761 717513 366329
11352 366329 284200 501283 782668 987025 743162 678594 536645 281077 -42378 -451205
$$ packed form
11425B90615M6700j47904l07176p1567J19136j900r4380J67099K08332j5176Q98
11414A94677j83218l42635M0577R7975J00666J69610K38327l94718m39175P2710
11404d45204K05244p6419L056P9946o1506j39340n381l7406P119K6250K15272
11393b28369K81647K5006k51483k54638j41567j20831J42691K21578k2019M69083
11383A21098K06051K61615m01231m23584k42623L67132m9279q1213J99409K41260
11373A98635J02596J41q5539J73430J90347l03104Q989J90177O1201n2717k27914
11362B56242k28695K30305P8378k24429l8189K98809N39374J19966l14248l51184
11352C66329q2129K17083K81385K04357k43863o4568j41949k55568l23455m08827
$$ plain form
11342 -451205 -718630 -535653 -430551 -448311 -528779 -487208 -455214 -109338 -36639 20324 198751
11331 198751 366246 278075 157066 -133211 -196337 -195589 80298 189287 112204 -179995 -2976
11320 -2976 -65045 -239822 -759827 -949153 -287755 85951 353352 155841 125470 118040 -52854
11309 -52854 -7247 120049 324187 276853 -60038 -216757 -254170 -37552 -58741 15247 84778
11298 84778 55585 84243 160970 79572 -264855 -377615 -201694 133824 144904 203193 277298
11287 277298 150796 -276523 -97943 380421 584619 534256 396947 541605 370012 -63743
11277 -63743 109447 250706 557489 651205 455108 179141 121881 -162911 183344 564816
11267 564816 788151 785567 466514 444360 452520 332856 469239 374322 301940 319918 272685
$$ packed form
11342d51205k67425J82977J05102j7760q0468M1571L1994L45876P2699N6963J78427
11331A98751J67495q8171j21009k90277o3126P48K75887J08989p7083k92199J77019
11320b976o2069j74777n20005j89326O61398L73706K67401j97511l0371p430j70894
11309e2854M5607J27296K04138m7334l36891j56719l7413K16618k1189P3988O9531
11298H4778k9193K8658P6727q1398l44427j12760J75921L35518J1080N8289P4105
11287B77298j26502m27319J78580M78364K04198n0363j37309J44658j71593m33755
11277f3743J73190J41259L06783R3716j96097k75967n7260k84792L46255L81472
11267E64816K23335k584l19053k2154Q160j19664J36383r4917p2382J7978m7233
$$ plain form
11256 272685 -36604 5410 99390 70759 114468 270289 261766 250664 183062 256223 416286
11245 416286 360514 103010 83670 -178 33723 99093 -21211 -34232 -50426 209512 128246
11234 128246 -187332 -206873 -361800 -298157 -277646 165602 270300 202105 58254 123505
11224 123505 135678 570170 884688 669788 211838 -51747 -263294 -245444 -361140 -260170
11214 -260170 -304350 -533947 -342832 212779 313059 260288 326761 521019 474725 105067
11204 105067 100695 290298 114965 385941 498969 366552 -212060 -32091 -52114 -98034
11194 -98034 -242247 -310693 -194028 -356877 -237131 12505 -84398 53055 220742 -9895
11184 -9895 126762 172905 179221 71093 57401 96231 323165 321226 160070 -169421 -268363
$$ packed form
11256B72685l09289M2014R3980k8631M3709J55821q523j1102o7602P3161J60063
11245D16286n5772k57504j9340q3848L3901O5370j20304j3021j6194K59938q1266
11234A28246l15578j9541j54927O3643K0511M43248J04698o8195j43851O5251
11224A23505J2173M34492L14518k14900m57950k63585k11547J7850j15696J00970
11214b60170m4180k29597J91115N55611J00280n2771O6473J94258m6294l69658
11204A05067m372J89603j75333K70976J13028j32417n78612J79969k0023m5920
11194i8034j44213o8446J16665j62849J19746K49636r6903J37453J67687k30637
11184i895J36657M6143O316j08128j3692L8830K26934j939j61156l29491r8942
$$ plain form
11173 -268363 -412472 -495533 -275187 21078 36540 -163040 -155991 -201881 -76537 170186
11163 170186 -61706 -370384 -169660 177640 165532 -116944 -259065 -295888 -194721 -592598
11153 -592598 -505159 -481558 -657199 -413051 -17835 -58136 -54991 20667 -373307 -857505 -519870
11142 -519870 178517 419551 191123 2100 -12149 290692 373415 309955 216708 78069
11132 78069 -8618 -118025 -453818 -865562 -812028 -518126 -10149 -268239 -243238 -142470
11122 -142470 -245962 -176660 -98140 -189242 -160302 -92620 -177845 -207937 -358860 -854844 -668938
11111 -668938 -411820 -302079 -314948 -409635 -499802 -213537 149614 131532 -50894 -352682
11101 -352682 -561699 -302327 -71149 81440 -63117 -359607 26827 73881 -86391 -186081
$$ packed form
11173b68363j44109q3061K20346K96265J5462j99580P049m5890J25344K46723
11163A70186k31892l08678K00724L47300j2108k82476j42121l6823J01167l97877
11153e92598Q7439K3601j75641K44148L95216m0301L145P5658l93974m84198L37635
11142e19870O98387K41034k28428j89023j4249L02841Q2723o3460r3247j38639
11132G8069q6687j09407l35793m11744N3534K93902N07977k58090K5001J00768
11122a42470j03492O9302P8520r1102K8940O7682q5225l0092j50923m95984J85906
11111f68938K57118J09741j2869r4687r0167K86265L63151j8082j82426l01788
11101c52682k09017K59372K31178J52589j44557k96490L86434M7054j60272r9690
$$ plain form
11091 -186081 -215556 -217210 -177898 -87037 -92675 33901 509479 886202 887941 297896 -37873
11080 -37873 -242492 -89882 371397 649120 632386 343547 -41081 -62560 552326 462678
11070 462678 370537 127686 159432 -9958 176140 264139 -4871 7113 -56525 -166550
11060 -166550 -392265 -422926 -653797 -629947 -767115 -937197 -468851 -167267 -195971 -126987
11050 -126987 -68863 84328 -10371 -247019 -198302 49445 118202 55953 -153392 -77855 256237
11039 256237 314055 357935 88567 61788 164212 -220760 -180960 -545121 -506568 -501307 -413813
11028 -413813 316132 782598 725500 514272 1763 -269652 -50119 161815 470532 746637
11018 746637 830570 376801 396826 449451 263470 221890 347882 310609 416081 533290
$$ packed form
11091a86081k9475j654L9312R0861n638J26576M75578L76723J739n90045l35769
11080c7873k04619J52610M61279K77723j6734k88839l84628k1479O14886q9648
11070D62678r2141k42851L1746j69390J86098Q7999k69010J1984o3638j10025
11060a66550k25715l0661k30871K3850j37168j70082M68346L01584k8704O8984
11050a26987N8124J53191r4699k36648M8717K47747O8757o2249k09345P5537L34092
11039B56237N7818M3880k69368k6779J02424l84972L9800l64161L8553N261Q7494
11028d13813P29945M66466n7098k11228n12509k71415K19533K11934L08717K76105
11018G46637Q3933m53769K0025N2625j85981m1580J25992l7273J05472J17209
$$ plain form
11008 533290 443937 265227 34959 -5249 -92675 -213591 -551233 -361104 97067 -66412
10998 -66412 241130 360592 327813 -2981 183287 593425 1015955 1557141 2643184 4784551
10988 4784551 8438880 14126069 16625554 12826546 8049903 5071336 2951140 2094348
10980 2094348 1805755 1668890 1376059 1124359 1222806 1195964 1415373 1646531 2124149 2738595
10970 2738595 3339279 4329104 6271182 8286578 9252562 8420296 6838097 5199838 3733362
10961 3733362 2668657 1951858 1430460 885962 961763 808233 742795 835287 635783 611397
10951 611397 613917 446876 348290 547597 739031 385947 251887 729070 692010 294193
10941 294193 49300 84304 333371 359343 122875 -165220 -479656 -658374 -699603 -676436
$$ packed form
11008E33290q9353j78710k30268m0208q7426j20916l37642J90129M58171j63479
10998f6412L07542J19462l2779l30794J86268M10138M22530N41186J086043K141367
10988D784551L654329N687189K499485l799008m776643k978567k120196q56792
10980B094348k88593j36865k92831k51700R8447k6842K19409K31158M77618O14446
10970B738595O00684R89825J942078K015396R65984q32266j582199j638259j466476
10961C733362j064705p16799n21398n44498P5801j53530o5438R2492j99504k4386
10951F11397K520j67041r8586J99307J91434l53084j34060M77183l7060l97817
10941B94193k44893L5004K49067K5972k36468k88095l14436j78718m1229K3167
$$ plain form
10931 -676436 -544219 -574622 -318175 -13110 -77310 129573 413252 475673 392382 485286
10921 485286 413792 327842 438280 116365 6832 -35146 -93886 -139324 3351 222945
10911 222945 46625 16252 119260 62014 -79423 117039 356017 458211 583972 369052
10901 369052 60567 -348006 -262789 162015 416149 29420 92269 -22425 52095 421285
10891 421285 380374 116772 -163417 -128398 -126267 -57533 -53871 -222472 136868 377605 105860
10880 105860 -273093 -456064 -658491 -547971 -61357 104950 323159 455859 604261 653356
10870 653356 249407 -208957 -148467 240924 299428 146884 29468 -291804 -317239 -244968
10860 -244968 -90313 -251184 -579710 -525691 25252 186624 488518 156771 -62202 -172836
$$ packed form
10931f76436J32217l0403K56447L05065o4200K06883K83679O2421q3291R2904
10921D85286p1494q5950J10438l21915j09533m1978n8740m5438J42675K19594
10911B22945j76320l0373J03008n7246j41437J96462K38978J02194J25761k14920
10901C69052l08485m08573Q5217M24804K54134l86729O2849j14694P4520L69190
10891D21285m0911k63602k80189L5019K131O8734L662j68601L59340K40737k71745
10880A05860l78953j82971k02427J10520M86614J66307K18209J32700J48402M9095
10870F53356m03949m58364O0490L89391N8504j52544j17416l21272k5435P2271
10860b44968J54655j60871l28526N4019N50943J61372L01894l31747k18973j10634
$$ plain form
10850 -172836 -221808 -34035 377720 643547 456701 320692 -203773 -152681 30188 -48585
10840 -48585 15963 -199945 -199200 168597 -12449 -278754 -159031 -424025 -331759 -289848 -54228
10829 -54228 -220303 -143763 -324625 -426548 -423872 -543187 -742543 -889276 -809193 -415637
10819 -415637 -159295 -98119 -135965 41583 354016 323078 -119671 -362082 -543784 -663173
10809 -663173 -441357 -209688 553916 666188 153021 4244 165446 66534 -413748 -756412
10799 -756412 -189484 212484 -106327 -495509 -155132 203307 166570 -285462 -507093 -498693
10789 -498693 -450222 -337280 -585017 -764675 -714813 -633708 -646970 -634938 -405176 70643
10779 70643 565644 637758 591765 605896 590931 472492 144399 276824 456368 329269
$$ packed form
10850a72836m8972J87773M11755K65827j86846j36009n24465N1092J82869p8773
10840d8585O4548k15908P45L67797j81046k66305J19723k64994R2266M1911K35620
10829e4228j66075P6540j80862j01923K676j19315j99356j46733Q0083L93556
10819d15637K56342O1176l7846J77548L12433l0938m42749k42411j81702j19389
10809f63173K21816K31669P63604J12272n13167j48777J61202r8912m80282l42664
10799g56412N66928M01968l18811l89182L40377L58439l6737m52032k21631Q400
10789d98693M8471J12942k47737j79658M9862Q1105j3262J2032K29762M75819
10779G0643M95001P2114m5993J4131j4965j18439l28093J32425J79544j27099
$$ plain form
10769 329269 95855 37469 -45085 53632 88096 174456 22561 80645 341286 102441 -150830
10758 -150830 -468169 -491593 -309224 -198756 -274015 -329113 -306138 -319586 -393058 -501834 -300959
10747 -300959 63004 87473 81528 47779 -247531 -459189 -296784 -178092 97654 338778
10737 338778 310569 306283 203878 108720 122460 609336 363101 -21432 -65978 -42939 -249674
10726 -249674 -187819 -123339 143692 470586 629252 677350 375722 133283 -9738 87017
10716 87017 320149 732223 1230613 1397038 1071286 1046907 863149 475705 304734 217542
10706 217542 60081 165453 393632 232253 58828 -12796 88672 24616 -12058 179164
10696 179164 14265 -160521 -113170 -40874 177939 177072 309456 42835 -34693 -198634 -169269
$$ packed form
10769C29269k33414n8386q2554R8717L4464Q6360j51895N8084K60641k38845k53271
10758a50830l17339k3424J82369J10468p5259n5098K2975j3448p3472j08776K00875
10747c00959L63963K4469n945l3749k95310k11658J62405J18692K75746K41124
10737C38778k8209m286j02405r5158J3740M86876k46235l84533m4546K3039k06735
10726b49674O1855O4480K67031L26894J58666M8098l01628k42439j43021R6755
10716H7017K33132M12074M98390J66425l25752k4379j83758l87444j70971q7192
10706B17542j57461J05372K28179j61379j73425p1624J01468o4056l6674J91222
10696A79164j64899j74786M7351P2296K18813q67J32384k66621p7528j63941K9365
$$ plain form
10685 -169269 191851 -104079 -284089 -184392 -324966 -340842 -467429 -613238 -566140 -223347
10675 -223347 103802 374423 26619 -46462 510199 757980 633372 167675 -494 -25280
10665 -25280 -128551 -433891 -453109 -213750 -227539 -5568 -64576 77424 61308 210200
10655 210200 62556 -13395 439861 327312 13200 -151690 -178103 -265624 -506267 -662263
10645 -662263 -502933 -464994 -282658 -43833 345014 492953 219312 -63496 58316 -147413
10635 -147413 -237776 136825 105189 -178658 -291505 -111418 265852 526266 55115 -99178
10625 -99178 119222 -122529 -50719 -81426 -360593 -686686 -724374 -1044769 -887646 -565996
10615 -565996 -497325 -45836 45455 -55993 -187364 -286949 -454064 -316566 -217830 -74692
$$ packed form
10685a69269L61120k95930j80010R9697j40574j5876j26587j45809M7098L42793
10675b23347L27149K70621l47804p3081N56661K47781j24608m65697j68169k4786
10665b5280j03271l05340j9218K39359j3789K21971n9008J42000j6116J48892
10655B10200j47644p5951M53256j12549l14112j64890k6413q7521k40643j55996
10645f62263J59330L7939J82336K38825L88847J47939k73641k82808J21812k05729
10635a47413r0363L74601l1636k83847j12847J80087L77270K60414m71151j54293
10625i9178K18400k41751P1810l0707k79167l26093l7688l20395J57123L21650
10615e65996O8671M51489R1291j01448j31371r9585j67115J37498R8736J43138
$$ plain form
10605 -74692 -41140 -308438 -60949 47927 -110285 -339990 12534 514979 653286 897606
10595 897606 594219 180128 -69621 -78784 -251493 -269429 -38792 87855 -131817 139732
10585 139732 439474 627243 797987 912629 793665 476206 334903 240387 239455 67085
10575 67085 -442241 -630249 -503135 -467531 -211947 -6457 92322 18839 147942 278007
10565 278007 100885 -21178 -46382 384525 529728 256705 -66734 -246415 -391977 -484627
10555 -484627 -420160 -164355 -199418 -209491 184933 387813 371572 161878 275987 144988
10545 144988 152976 -53048 -203717 -339689 -383092 -510727 -98476 33889 -298684 -391108
10535 -391108 -448181 -799321 -714312 -411887 -119709 -147981 -237920 -181749 -392997 -539537
$$ packed form
10605g4692L3552k67298K47489J08876j58212k29705L52524N02445J38307K44320
10595H97606l03387m14091k49749r163j72709j7936K30637J26647k19672K71549
10585A39732K99742J87769J70744J14642j18964l17459j41303r4516r32j72370
10575F7085n09326j88008J27114L5604K55584K05490R8779p3483J29103J30065
10565B78007j77122j22063k5204M30907J45203k73023l23439j79681j45562r2650
10555d84627O4467K55805l5063j0073L94424K02880j6241k09694J14109j30999
10545A44988P988k06024j50669j35972m3403j27635M12251J32365l32573r2424
10535c91108n7073l51140Q5009L02425K92178k8272q9939N6171k11248j46540
$$ plain form
10525 -539537 -333673 -416331 -383222 -156311 3651 -45720 -150502 -275947 206408 615181
10515 615181 619087 373754 -216459 -414208 -147813 227482 165357 25789 -133024 177443
10505 177443 374530 643985 670163 365935 168011 -82871 -31485 -22089 -109943 213566
10495 213566 469098 355198 -82539 -119670 73555 201786 41602 14666 52219 37968
10485 37968 261616 327503 29791 -105633 73851 28581 -278737 -389074 -104278 152816
10475 152816 58917 400206 769815 551045 360680 436406 281490 243808 77124 -50741
10465 -50741 -125363 -194299 -279328 -96497 109845 101902 9779 -774 -59472 65975 256981
10454 256981 259359 407837 417267 -82981 -145560 -335086 -491934 -607117 -552962 -243594 -158779
$$ packed form
10525e39537K05864q2658L3109K26911J59962m9371j04782j25445M82355M08773
10515F15181L906k45333n90213j97749K66395L75295o2125j39568j58813L10467
10505A77443J97087K69455K6178l04228j97924k50882N1386R396q7854L23509
10495B13566K55532j13900m37737l7131J93225J28231j60184k6936L7553j4251
10485C7968K23648O5887k97712j35424J79484m5270l07318j10337K84796K57094
10475A52816r3899L41289L69609k18770j90365P5726j54916l7682j66684j27865
10465e0741p4622o8936q5029J82831K06342p943r2123j0553n8698J25447J91006
10454B56981K378J48478R430n00248o2579j89526j56848j15183N4155L09368Q4815
$$ plain form
10443 -158779 204412 353465 24556 -105273 -241219 -297659 -73092 -246731 -331009 -375826
10433 -375826 -62758 341304 466355 563310 670860 615671 481529 277268 84130 -135142
10423 -135142 -291384 -142438 184440 -147204 -225717 -254765 -257481 -379632 -371608 -186893 115482
10412 115482 43625 -32490 -231471 -510440 -477875 -257178 -335234 -420288 -102396 251792
10402 251792 189239 152785 155824 -9229 3149 17127 339962 615395 845463 1443230 1666070
10391 1666070 1608424 1634739 1372014 1244567 739108 520256 829787 954021 1008178 845192
10381 845192 427971 239503 331967 -27353 -114139 -185228 -454796 -727155 -614534 -189483
10371 -189483 -228280 -126884 178682 405456 341825 134183 136954 303589 140899 -157697
$$ packed form
10443a58779L63191J49053l28909j29829j35946n6440K24567j73639q4278m4817
10433c75826L13068M04062J25051R6955J07550n5189j34142k04261j93138k19272
10423a35142j56242J48946L26878l31644p8513k9048k716j22151Q024J84715L02375
10412A15482p1857p6115j98981k78969L2565K20697p8056q5054L17892L54188
10402B51792o2553l6454L039j65053J2378J3978L22835K75433K30068N97767K22840
10391A666070n7646K6315k62725j27447n05459k18852L09531J24234N4157j62986
10381H45192m17221j88468R2464l59320q6786p1089k69568k72359J12621M25051
10371a89483l8797J01396L05566K26774o3631k07642K771J66635j62690k98596
$$ plain form
10361 -157697 -455784 -545774 -469144 -233385 -550375 -643658 -480304 -244556 10431 178451
10351 178451 37756 -156203 -56014 140061 -42628 -119253 -93839 6759 49225 178238
10341 178238 96331 -52475 -33814 -212004 -149993 -24229 182469 410318 294843 447769
10331 447769 779813 683998 530701 464928 446741 211776 63416 -6650 351377 440522
10321 440522 115419 -128082 -91607 33128 289275 642142 318559 232792 290638 31038
10311 31038 -272090 -149692 -92323 -143565 132005 -129641 -394355 -141243 -262911 -377665
10301 -377665 -259899 -243918 -451655 -283677 -253542 -196858 -340760 -175757 -260614 -415011
10291 -415011 -602486 -611187 -454777 -505118 -361722 -78230 -100560 -147211 33666 370643
$$ packed form
10361a57697k98087q9990P6630K35759l16990r3283J63354K35748K54987J68020
10351A78451j40695j93959J00189J96075j82689p6625K5414J00598M2466J29013
10341A78238q1907j48806J8661j78190O2011J25764K06698K27849j15475J52926
10331D47769L32044r5815j53297o5773j8187k34965j48360p0066L58027Q9145
10321D40522l25103k43501L6475J24735K56147L52867l23583q5767N7846k59600
10311C1038l03128J22398N7369n1242K75570k61646k64714K53112j21668j14754
10301c77665J17766J5981k07737J67978L0135N6684j43902J65003q4857j54397
10291d15011j87475q701J56410n0341J43396K83492k2330m6651J80877L36977
$$ plain form
10281 370643 366937 253873 68025 350764 363548 274795 270721 39342 113048 256368 245683
10270 245683 195830 201673 22820 -452761 -339969 -255873 -196547 67298 95511 -33223 17105
10259 17105 305841 -9771 -319116 -172644 -10202 53820 94668 24288 -235155 -441220
10249 -441220 -205720 -13390 50120 -224061 -303785 -285632 -229889 -76241 -51409 -30475 248215
10238 248215 243009 22714 19158 65869 31099 -103671 -124915 9505 -275501 -586729 -464184
10227 -464184 -244927 76462 36309 31353 364539 502518 706120 595792 267689 324813
10217 324813 316037 262142 226293 8144 -14388 208892 150426 148058 -141364 -214116 77079
10206 77079 209094 80584 128726 -142956 -492269 -117105 405010 589840 369160 297056
$$ packed form
10281C70643l706j13064j85848K82739J2784q8753m074k31379P3706J43320j0685
10270B45683m9853N843j78853m75581J12792Q4096N9326K63845K8213j28734N0328
10259A7105K88736l15612l09345J46472J62442O4022M0848p0380k59443k06065
10249d41220K35500J92330O3510k74181p9724J8153N5743J53648K4832K0934K78690
10238B48215n206k20295l556M6711l4770j34770k1244J34420k85006l11228J22545
10227d64184K19257L21389m0153m956L33186J37979K03602j10328l28103N7124
10217C24813q776n3895l5849k18149k2532K23280n8466k368k89422p2752K91195
10206G7079J32015j28510M8142k71682l49313L75164N22115J84830k20680p2104
$$ plain form
10196 297056 8965 -388345 -985018 -902003 -712284 -313914 -17887 -82324 -239848 -313198
10186 -313198 -144704 -119656 -158620 -183362 -119344 -238261 -303691 -450074 -225144 -49890
10176 -49890 -369412 -350334 -34360 96028 138954 -109651 -280609 -101865 370842 283032
10166 283032 155347 -8756 -157004 -138904 94655 -113281 -271912 -255734 -494055 -774150
10156 -774150 -863916 -827177 -520936 -261584 -268156 -278429 -426604 -313578 -395473 -479938 -398302
10145 -398302 -372819 -321769 -376352 -420283 -416229 -515490 -468153 -89137 -394081 -518008 -68952
10134 -68952 314535 550337 703723 95632 -516617 -411331 -35416 -10308 -4286 -93560
10124 -93560 -487113 -606023 -471764 -227114 -389603 -387486 -327685 -119741 -92509 128415
$$ packed form
10196B97056k88091l97310n96673Q3015J89719L98370K96027o4437j57524p3350
10186c13198J68494K5048l8964k4742O4018j18917o5430j46383K24930J75254
10176d9890l19522J9078L15974J30388M2926k48605j70958J78744M72707q7810
10166B83032j27685j64103j48248J8100K33559k07936j58631J6178k38321k80095
10156g74150q9766L6739L06241K59352o572j0273j48175J13026q1895q4465Q1636
10145c98302K5483N1050n4583m3931M054r9261M7337L79016l04944j23927M49056
10134f8952L83487K35802J53386o08091o12249J05286L75915K5108O022q9274
10124i3560l93553j18910J34259K44650j62489K117N9801K07944K7232K20924
$$ [...]
##END NTUPLES=NMR SPECTRUM
##END=
