##TITLE=Analysis number 320607
Compound Code cc 45804
Book Reference 468/95
Project Code adrs
Chemist Name colinb
##JCAMPDX= 6.0         $$ Bruker NMR JCAMP-DX V2.0
##DATA TYPE= NMR SPECTRUM
##DATA CLASS= NTUPLES
##ORIGIN= Bruker BioSpin GmbH
##OWNER= nmr
$$ XWIN-NMR		Version 3.5
$$ Mon Jul  3 08:27:42 2006 GMT Daylight Time (UT+1h)  MAYBRIDGE\nmr@NMR_250MHZ
##.OBSERVE FREQUENCY= 250.131544655141
##.OBSERVE NUCLEUS= ^1H
##.ACQUISITION MODE= SIMULTANEOUS (DQD)
##.ACQUISITION SCHEME= undefined
##.AVERAGES= 16
##.DIGITISER RES= 18
##SPECTROMETER/DATA SYSTEM= dpx250
##.PULSE SEQUENCE= zg30
##.SOLVENT NAME= CDCl3
##.SHIFT REFERENCE= (INTERNAL, CDCl3, 0, 16.522)
##AUDIT TRAIL= $$ (NUMBER, WHEN, WHO, WHERE, WHAT)
$$ ##TITLE= Audit trail, XWIN-NMR		Version 3.5
$$ ##JCAMPDX= 5.01
$$ ##ORIGIN= Bruker BioSpin GmbH
$$ ##OWNER= nmr
$$ C:\u/data/dgb/nmr/ADRS/2010/pdata/1/auditp.txt
$$ ##AUDIT TRAIL=  $$ (NUMBER, WHEN, WHO, WHERE, WHAT)
(   1,<2006-07-03 08:27:12.27 +100>,<MAYBRIDGE\nmr>,<NMR_250MHZ>,
      <created by zg, POWCHK disabled, PULCHK disabled
       configuration hash MD5:
       E2 DF 36 D8 04 B2 41 60 5A D7 A3 38 5A 4B D0 FE
       data hash MD5: 64K
       09 85 AC 13 5A 75 EC 04 EE 7D 0C 15 63 22 E8 4B>)
(   2,<2006-07-03 08:27:30.90 +100>,<MAYBRIDGE\nmr>,<NMR_250MHZ>,
      <Start of raw data processing
       ef LB = 0.3 FT_mod = 6 PKNL = 1 SI = 32K 
       data hash MD5: 32K
       90 4F 6D 4A D6 C5 02 A9 14 69 D0 95 26 6D E9 DB>)
(   3,<2006-07-03 08:27:32.77 +100>,<MAYBRIDGE\nmr>,<NMR_250MHZ>,
      <apk 
       data hash MD5: 32K
       54 CA C1 6B 7D E2 4B 32 E2 71 23 E0 3D 43 26 22>)
(   4,<2006-07-03 08:27:33.51 +100>,<MAYBRIDGE\nmr>,<NMR_250MHZ>,
      <abs ABSG = 5 
       data hash MD5: 32K
       F5 0B 3D 4C 7C 73 E9 01 BB 44 AD 59 A8 FF 38 7D>)
$$ ##END=
$$ 
$$ hash MD5
$$ E3 2A DD 8D 07 41 32 FE 8E 50 39 D2 D5 B1 B0 C4
##$RELAX= 
##$RELAX= 
##$RELAX= 
##$RELAX= 
##$RELAX= 
##$RELAX= 
##$RELAX= 
$$ Bruker specific parameters
$$ --------------------------
##$DU= <C:\u>
##$EXPNO= 2010
##$NAME= <ADRS>
##$PROCNO= 1
##$TYPE= <nmr>
##$USER= <dgb>
##$AMP= (0..31)
100 100 100 100 100 100 100 100 100 100 100 100 100 100 100 100 100 100 
100 100 100 100 100 100 100 100 100 100 100 100 100 100 
##$AQSEQ= 0
##$AQ_mod= 3
##$AUNM= <au_zg>
##$AUTOPOS= <2 >
##$BF1= 250.13
##$BF2= 250.13
##$BF3= 250.13
##$BF4= 250.13
##$BF5= 500.13
##$BF6= 500.13
##$BF7= 500.13
##$BF8= 500.13
##$BYTORDA= 1
##$CFDGTYP= 0
##$CFRGTYP= 5
##$CHEMSTR= <none>
##$CNST= (0..31)
1 1 145 1 1 1 1 1 1 1 1 1 1 1 1 1 1 1 1 1 1 1 1 1 1 1 1 1 1 1 1 1 
##$CPDPRG= <>
##$CPDPRG1= <>
##$CPDPRG2= <>
##$CPDPRG3= <>
##$CPDPRG4= <mlev>
##$CPDPRG5= <mlev>
##$CPDPRG6= <mlev>
##$CPDPRG7= <mlev>
##$CPDPRG8= <mlev>
##$CPDPRGB= <>
##$CPDPRGT= <>
##$D= (0..31)
0 1 0 0 0 0 0 0 0 0.06 0 0 0 0 0 0 0.0002 0 0 0 0 0 0 0 0 0 0 0 0 0 0 
0 
##$DATE= 1151911631
##$DBL= (0..7)
120 120 120 120 120 120 120 120 
##$DBP= (0..7)
150 150 150 150 150 150 150 150 
##$DBP07= 0
##$DBPNAM0= <>
##$DBPNAM1= <>
$$ [...]
##$SUBNAM7= <"">
##$SUBNAM8= <"">
##$SUBNAM9= <"">
##$SW= 20.6930455092707
##$SWIBOX= (0..15)
0 0 3 0 0 0 0 0 0 0 0 0 0 0 0 0 
##$SW_h= 5175.983436853
##$TD= 65536
##$TD0= 1
##$TE= 298.16
##$TE2= 300
##$TE3= 300
##$TEG= 300
##$TL= (0..7)
0 120 120 120 120 120 120 120 
##$TP= (0..7)
150 150 150 150 150 150 150 150 
##$TP07= 0
##$TPNAME0= <>
##$TPNAME1= <>
##$TPNAME2= <>
##$TPNAME3= <>
##$TPNAME4= <>
##$TPNAME5= <>
##$TPNAME6= <>
##$TPNAME7= <>
##$TPOAL= (0..7)
0.5 0.5 0.5 0.5 0.5 0.5 0.5 0.5 
##$TPOFFS= (0..7)
0 0 0 0 0 0 0 0 
##$TUNHIN= 0
##$TUNHOUT= 0
##$TUNXOUT= 0
##$USERA1= <user>
##$USERA2= <user>
##$USERA3= <user>
##$USERA4= <user>
##$USERA5= <user>
##$V9= 5
##$VALIST= <valist>
##$VCLIST= <CCCCCCCCCCCCCCC>
##$VD= 0
##$VDLIST= <DDDDDDDDDDDDDDD>
##$VPLIST= <PPPPPPPPPPPPPPP>
##$VTLIST= <TTTTTTTTTTTTTTT>
##$WBST= 1024
##$WBSW= 4
##$XGAIN= (0..3)
0 0 0 0 
##$XL= 0
##$YL= 0
##$YMAX_a= 372063
##$YMIN_a= -521701
##$ZGOPTNS= <>
##$ZL1= 120
##$ZL2= 120
##$ZL3= 120
##$ZL4= 120
##$ABSF1= 16.522
##$ABSF2= -4.171173
##$ABSG= 5
##$ABSL= 3
##$ALPHA= 0
##$AQORDER= 0
##$ASSFAC= 0
##$ASSFACI= 0
##$ASSFACX= 0
##$ASSWID= 0
##$AUNMP= <proc_1d>
##$AZFE= 0.1
##$AZFW= 0.1
##$BCFW= 0
##$BC_mod= 0
##$BYTORDP= 0
##$COROFFS= 0
##$CY= 12.5
##$DATMOD= 1
##$DC= 0
##$DFILT= <>
##$DTYPP= 0
##$F1P= 14.0000005364418
##$F2P= -0.99999901652339
##$FCOR= 0.5
##$FTSIZE= 32768
##$FT_mod= 6
##$GAMMA= 0
##$GB= 0
##$INTBC= 1
##$INTSCL= 1
##$ISEN= 128
##$LB= 0.3
##$LEV0= 0
##$LPBIN= 0
##$MAXI= 10000
##$MC2= 0
##$MEAN= 0
##$ME_mod= 0
##$MI= 0
##$NCOEF= 0
##$NC_proc= -3
##$NLEV= 6
##$NOISF1= 0
##$NOISF2= 0
##$NSP= 0
##$NTH_PI= 0
##$NZP= 0
##$OFFSET= 16.522
##$PC= 1
##$PHC0= 159.3642
##$PHC1= 6.951904
##$PH_mod= 1
##$PKNL= yes
##$PPARMOD= 0
##$PSCAL= 4
##$PSIGN= 0
##$REVERSE= no
##$SF= 250.13
##$SI= 32768
##$SIGF1= 0
##$SIGF2= 0
##$SINO= 400
##$SIOLD= 32768
##$SREGLST= <1H.CDCl3>
##$SSB= 0
##$STSI= 32768
##$STSR= 0
##$SW_p= 5175.98343685301
##$SYMM= 0
##$S_DEV= 0
##$TDeff= 65536
##$TDoff= 0
##$TI= <Analysis number 999999
Compound Code 99
Book Reference 9
Project Code 9>
##$TILT= no
##$TM1= 0
##$TM2= 0
##$TOPLEV= 0
##$USERP1= <user>
##$USERP2= <user>
##$USERP3= <user>
##$USERP4= <user>
##$USERP5= <user>
##$WDW= 1
##$XDIM= 32768
##$YMAX_p= 420658059
##$YMIN_p= -1235463
$$ End of Bruker specific parameters
$$ ---------------------------------
##NTUPLES= NMR SPECTRUM
##VAR_NAME=  FREQUENCY,     SPECTRUM/REAL,   SPECTRUM/IMAG
##SYMBOL=    X,             R,               I
##VAR_TYPE=  INDEPENDENT,   DEPENDENT,       DEPENDENT
##VAR_FORM=  AFFN,          ASDF,            ASDF
##VAR_DIM=   32768,         32768,           32768
##UNITS=     HZ,            ARBITRARY UNITS, ARBITRARY UNITS
##FACTOR=    0.157963299565203, 1,           1
##FIRST=     4132.6476996994, 0,             0
##LAST=      -1043.33573715361, 0,           0
##MIN=       -1043.33573715361, -1235463,    0
##MAX=       4132.6476996994, 420658059,     0
$$ Real data points
##PAGE= N=1
##DATA TABLE= (X++(R..R)), XYDATA
$$ [...]
18681D5598561R888443P048889O722095Q965767J0039000P105966J931669j620578
$$ 45598561 55487004 62535893 69257988 78223755 88262755 95368721 97300390 95679812
18673I5679812j880750r05842l439075j0184249j4639584j2724905q240231n343673
$$ 95679812 93799062 92893220 89454145 79269896 64630312 51905407 43665176 38321503
18665C8321503m761640n198853m736776l473410k379667j656937j173777q62590
$$ 38321503 33559863 28361010 23624234 20150824 17771157 16114220 14940443 14077853
18657A4077853o13345m94148m36009m12245l86439l44144l29838l47010l59013
$$ 14077853 13464508 12970360 12534351 12122106 11735667 11391523 11061685 10714675 10355662
18648A0355662l52809l46408k86510k21981j93404j63122j46282r6197m8726m479
$$ 10355662 10002853 9656445 9369935 9147954 8954550 8791428 8645146 8548949 8500223 8495744
18638H495744R8281J84702L10241N51564R01930J434083K378352L848150N286672
$$ 8495744 8594025 8778727 9088968 9640532 10542462 11976545 14354897 18203047 23489719
18629B3489719N471179M405844M056964N361935O437175M784969J256638p27111
$$ 23489719 28960898 33366742 37423706 42785641 49222816 54007785 55264423 54537312
18621E4537312n06196O7852j149663m019465o205083n924012m173299l020891
$$ 54537312 54031116 54098968 52949305 48929840 42724757 36800745 32627446 29606555
18613B9606555l493597m574004m335718l041941j907401j244679q92521o83460
$$ 29606555 26112958 21538954 17203236 14161295 12253894 11009215 10116694 9433234
18605I433234n50546m71346m28107l63505l07993k80510k86274k70989k38019
$$ 9433234 8882688 8411342 7983235 7619730 7311737 7031227 6744953 6473964 6235945
18596F235945k37994k26137k57689k27227k08682j88909j82468j86592j95117
$$ 6235945 5997951 5771814 5514125 5286898 5078216 4889307 4706839 4520247 4325130
18587D325130j77993j56096j49497j37595j23224j29845q8453q7456j07484j15173
$$ 4325130 4147137 3991041 3841544 3703949 3580725 3450880 3362427 3274971 3167487 3052314
18577C052314j08364p0403p6991j02133r2958o3495q1828o0191m7655n3513n7370
$$ 3052314 2943950 2873547 2796556 2694423 2601465 2537970 2456142 2395951 2348296 2294783 2237413
18566B237413r1043q1007o3415n7238m5627o6411n0150l0926l7710J425j3167
$$ 2237413 2146370 2065363 2001948 1944710 1899083 1832672 1782522 1751596 1713886 1715311 1702144
18555A702144j7817j2327K6314N1335O2985L7115J9126j0473p848Q618l1343n0895
$$ 1702144 1684327 1672000 1698314 1749649 1812634 1849749 1868875 1858402 1850554 1859172 1827829 1776934
18543A776934n5334p2212o7185m9099l7872p8334j17160j00697o3700k4676j7202
$$ 1776934 1721600 1649388 1582203 1533104 1495232 1416898 1299738 1199041 1135341 1110665 1093463
18532A093463k4222j9503J1383n573j1276j9000j2162m0459m5656m5403k1887
$$ 1093463 1069241 1049738 1061121 1055548 1044272 1025272 1013110 972651 926995 881592 859705
18521H59705k0194j9836n429j0763k8581m4978k0597l5716l6816k6747j5553k4588
$$ 859705 839511 819675 814246 803483 774902 729924 709327 673611 636795 610048 594495 569907
18509E69907k9695m3473l0608J471K262L0465L8283K1234N7548Q8885J00286O5834
$$ 569907 540212 496739 466131 467602 469864 500329 538612 559846 617394 706279 806565 872399
18497H72399L9010M4548N5415M4752K6020J6881J726P084m69n994m4026j01249
$$ 872399 911409 955957 1011372 1056124 1082144 1099025 1100751 1107835 1107366 1101372 1057346 956097
18485I56097j05507o7382k1354k395k08l0979m9513m4568m3423j9555j8828j1539
$$ 956097 850590 783208 761854 759459 759251 728272 678759 634191 590768 571213 552385 540846
18473E40846j8658k0636j4838j9941k7281l3640j8189j0874j4838j7797j4133
$$ 540846 522188 501552 486714 466773 439492 405852 387663 376789 361951 344154 330021
18462C30021j5039j6635o720j3682J384K167q382j6401j4142j0045J0496K815
$$ 330021 314982 298347 291627 277945 279329 281496 273114 256713 242571 232526 243022 245837
18450B45837j4490q459J5762L0607K7499M0J3377L3264O6512N9100Q3362J22693
$$ 245837 231347 222888 238650 269257 296756 296796 310173 343437 409949 469049 552411 675104
18438F75104J75875K18309K42463K25826J57427Q5368K2442p9762j38676k05866
$$ 675104 850979 1069288 1311751 1537577 1695004 1780372 1802814 1723052 1584376 1378510
18428A378510k32591j91503j31609o4206j8070j7083j7616o992J2364K0318O1807
$$ 1378510 1145919 954416 822807 758601 740531 723448 705832 698840 711204 731522 793329
18417G93329J18400K09219K44993K28149J85803J02629J8416q1580j67292k18230
$$ 793329 911729 1120948 1365941 1594090 1779893 1882522 1900938 1819358 1652066 1433836
18407A433836k69810k26062j30331j11931p7801q2001l9044k716k596j0000Q107
$$ 1433836 1164026 937964 807633 695702 617901 535900 496856 494140 491544 481544 489651
18396D89651L8000K9103K6721J5039n114j2232k6661j9379r886O849m453l0972
$$ 489651 527651 556754 583475 598514 593400 581168 554507 535128 525242 532091 527638 496666
18384D96666K553k3865j5588R759p679J1389p339K210Q748N924j9099J1250J2916
$$ 496666 499219 475354 459766 469525 461846 473235 465896 468106 476854 482778 463679 474929 487845
18371D87845k5919j9357J3089K4102J0242J3623J4684K0517J2587J2557M3017
$$ 487845 461926 442569 455658 479760 490002 503625 518309 538826 551413 563970 606987
18360F06987N2538Q6966J19320J33083J21685J08254O4750J0668k2158j00116
$$ 606987 659525 746491 865811 998894 1120579 1228833 1293583 1304251 1282093 1181977
18350A181977j02589j21581j06986p3804m2980o111k524M690n551J8482L4884
$$ 1181977 1079388 957807 850821 777017 734037 727926 725402 730092 724541 743023 777907
18339G77907N7479L7566M1141L7401K0394M8490L2698L9675M2973L9938M4253
$$ 777907 835386 872952 914093 951494 971888 1020378 1053076 1092751 1135724 1175662 1219915
18328A219915M6094M7358N2142N3351P0312J12613J53874J80981K30149K98780
$$ 1219915 1266009 1313367 1365509 1418860 1489172 1601785 1755659 1936640 2166789 2465569
18318B465569L76108N02364P02922J011900J510011K360159L826774N997593P839544
$$ 2465569 2841677 3344041 4046963 5058863 6568874 8929033 12755807 18753400 26592944
18309B6592944P640315N951685L484673J143240j038976m484769o746070q313007
$$ 26592944 34233259 40184944 43669617 44812857 43773881 39289112 32543042 24230035
18301B4230035p148939m419218k648779j694982j158017p93396n61842l91694
$$ 24230035 17081096 12661878 10013099 8318117 7160100 6366704 5804862 5413168
18293E413168k58053k01687j58565r4812n7072l1995J5964K724m95R818L677j8144
$$ 5413168 5155115 4953428 4794863 4700051 4642979 4610984 4626948 4629672 4629177 4638995 4642672 4624528
18281D624528n7694n1307n4812n2476J8353Q5439J16783J59798K00679K99379
$$ 4624528 4566834 4515527 4460715 4408239 4426592 4512031 4628814 4788612 4989291 5288670
18271E288670M54673O91956J038131J522281K342335L811796N798154O904497
$$ 5288670 5743343 6435299 7473430 8995711 11338046 15149842 20947996 27852493
18263B7852493O394154N167563L695087L128068K620877J463577k17428k365654
$$ 27852493 34246647 39414210 43109297 46237365 48858242 50321819 50104391 47738737
18255D7738737k547430k180530k602097m686798o180866p041544n704872l490581
$$ 47738737 45191307 43010777 40408680 35721882 29541016 22499472 16794600 13304019
18247A3304019k106498j369478r72900p02069n29323l92250k91289k10783j68835
$$ 13304019 11197521 9828043 8855143 8153074 7623751 7231501 6940212 6729429 6560594
18238F560594j56025j43570j15888j18948j29785j35853j20511j30526j29510
$$ 6560594 6404569 6260999 6145111 6026163 5896378 5760525 5640014 5509488 5379978
18229E379978j17096j47466j59691r1109m9351j6079P574N6132Q3109J59487L10669
$$ 5379978 5262882 5115416 4955725 4864616 4815265 4799186 4806760 4862892 4946001 5105488 5416157
18218E416157N17774P75837J147219J777032K862115M291966N005924M331265
$$ 5416157 5933931 6709768 7856987 9634019 12496134 16788100 21794024 26125289
18210B6125289K902910J194941K1057j638789l680197m923116n323999l765004
$$ 26125289 29028199 30223140 30244197 28605408 24925211 20002095 14678096 10913092
18202A0913092k179990j305355q94877o87985n41730m10772l25558k63558k22811
$$ 10913092 8733102 7427747 6532870 5844885 5303155 4892383 4566825 4303267 4080456
18193D080456j71287j14666q0672o8377l6768j7826l4200m1959l2817n3732n7597
$$ 4080456 3909169 3794503 3713831 3645454 3608686 3590860 3556660 3514701 3481884 3428152 3370555
18182C370555p4705q4663p8102q0093p6090o6882o6643n2787m0934j4729k128
$$ 3370555 3295850 3211187 3133085 3052992 2976902 2910020 2843377 2790590 2749656 2734927 2732799
18171B732799L0223P9808R6339J27828J60199J48885J59054J70689J79872J21031
$$ 2732799 2763022 2842830 2939169 3066997 3227196 3376081 3535135 3705824 3885696 4006727
18161D006727Q6368Q6145O2490K752m947N090R198P3000J46026K24007L32276
$$ 4006727 4093095 4179240 4241730 4244482 4239535 4244625 4253823 4326823 4472849 4696856 5029132
18150E029132N22899P90103J220095J974567L072000L832672L425208K348051
$$ 5029132 5552031 6342134 7562229 9536796 12608796 16441468 19866676 22214727
18142B2214727K141079K677180K292079q9624k158262k021773j017349r60709
$$ 22214727 24355806 27032986 29325065 29235441 27077179 25055406 24038057 23077348
18134B3077348j893592k194622j165123J94923J440124K873096N023331Q219860
$$ 23077348 21183756 18989134 17824011 18018934 19459058 22332154 27355485 35575345
18126C5575345J1503978J1878782R059394P463737R250402J0221767M597415m339765
$$ 35575345 47079323 58958105 68017499 75481236 84731638 94953405 99550820 95211055
18118I5211055p299186m676589l251104o048397q317286m266606L980459J1878802
$$ 95211055 87911869 83235280 79984176 73935779 65618493 61351887 65332346 77211148
18110G7211148J5616024J4222952J1689944Q594530L604119n112709j3285221
$$ 77211148 92827172 107050124 118740068 127334598 130938717 125826008 112540787
18103A12540787j6218681j7150782j6014664j3093625r438138o263894m011982
$$ 112540787 96322106 79171324 63156660 50063035 40624897 34361003 30349021
18096C0349021k590890j574790o55993L96358J612374K734313L378252L374534
$$ 30349021 27758131 26183341 25527348 25923706 27536080 30270393 33648645 37023179
18088C7023179K656946J454442p44j622356l169064m336512m684144m306518l425509
$$ 37023179 39680125 41134567 41133823 39511467 36342403 32005891 27321747 23015229 19589720
18079A9589720k488186j809094j334460j037439q35903o52561n53962m69778l93849
$$ 19589720 17101534 15292440 13957980 12920541 12084638 11432077 10878115 10408337 10014488
18070A0014488l34108k92538k54968k26472k12182k18285k53976k59356k81603
$$ 10014488 9680380 9387842 9132874 8906402 8694220 8475935 8221959 7962603 7681000
18061G681000k84709k84731l00560k85927k60802k56840k30385j93991k05555
$$ 7681000 7396291 7111560 6811000 6525073 6264271 6007431 5777046 5583055 5377500
18052E377500j95844j82586j70568j48533j35381j33083j34555j30099j15387
$$ 5377500 5181656 4999070 4828502 4679969 4544588 4411505 4276950 4146851 4031464
18043D031464r3510j06697j23857r7424j05480r4824p8906r7563j05222p1764
$$ 4031464 3937954 3831257 3707400 3609976 3504496 3409672 3330766 3233203 3127981 3056217
18033C056217p9237q3429p4195o9603q2223q0273p9651o2784n9738o0649p4124
$$ 3056217 2976980 2893551 2819356 2749753 2667530 2587257 2507606 2444822 2385084 2324435 2250311
18022B250311n2686l5034l1896m0389l8843m3810m8754o6232n6055n0391n6982
$$ 2250311 2197625 2162591 2130695 2090306 2051463 2007653 1958899 1892667 1836612 1786221 1729239
18011A729239n5013l3514n4800m4799n5793n7380n5106m8927l6998k2554j661
$$ 1729239 1674226 1640712 1585912 1541113 1485320 1427940 1372834 1323907 1286909 1264355 1262694
18000A262694k3472m3167k6542j2806o961k6242l7146n4994l8748k3236l1910
$$ 1262694 1239222 1196055 1169513 1156707 1149746 1123504 1086358 1031364 992616 969380 937470
17989I37470j6589q453o754k4925r628j3483j1m338k6812l4245l9708l8783l4421
$$ 937470 920881 912428 905674 880749 871121 857638 857627 853289 826477 792232 752524 713741 679320
17976F79320m9111j9964j5336k126j4760j5421j0723o330l827K2416N5696Q3106
$$ 679320 630209 610245 594909 592783 578023 562602 551879 545549 541722 564138 619834 702940
17964G02940J02705J32021J19241Q4190Q0329R1475P0397J110p8720q3119n6476
$$ 702940 805645 937666 1056907 1141097 1221426 1312901 1383298 1384408 1305688 1222569 1166093
17953A166093k9536q2363j38049j54326j30730p4836m0707j8470p588J7686O5147
$$ 1166093 1136557 1054194 916145 761819 631089 556253 515546 497076 489488 507174 572321
17942E72321R9762J10864Q9547N9203P0599J14172Q0658J8473m1049m8039j7716
$$ 572321 672083 782947 872494 931697 1002296 1116468 1197126 1215599 1174550 1126511 1108795
17931A108795k2756q5084j39590j33344r3824p8635n4112m9214l8858k1075O416
$$ 1108795 1086039 1000955 861365 728021 634197 555562 501450 452236 413378 392303 398719
17920C98719L5013M3110P7107P6260M8412O535k0388n3982l7374k6609n9696m7845
$$ 398719 433732 476842 553949 630209 678621 685156 664768 610786 573412 546803 487107 439262
17908D39262l5208l1867j7827k5326j4672L113q472k3623r275J3221M1516N0271
$$ 439262 404054 372187 354360 329034 314362 317475 309003 285380 276105 289326 330842 381113
17896C81113m272l2226j6163r984k6245k3964m316M544k609j131k8364k3316k76
$$ 381113 376841 344615 328452 318468 292223 268259 263943 268487 265878 264747 236383 213067 212791
17883B12791O278o213r818j8437O630o178J7513K863m267q566J0912M632n012
$$ 212791 219069 212856 203038 184601 191231 185053 202566 205429 201162 192596 203508 208140 203128
17870B03128j8222j2423j8602K2070Q17j4963j0584j1195j4220l0481K4117K0169
$$ 203128 184906 172483 153881 175951 176768 161805 151221 140026 125806 95325 119442 139611
17858A39611l933N02j1713j6217J915L219p617Q384O909J947j4838j935J341M925
$$ 139611 135678 136180 124467 108250 110165 113384 105767 114151 121060 123007 108169 106234 107575 112500
17844A12500k0288l879R398K100J0980q810J3495M351N087L459j5665j3074r104
$$ 112500 92212 88333 97731 99831 110811 102001 115496 119847 124934 128393 112728 99654 90550
17831I0550k1351p200J2645j64j2892l910o803K191j1215l72J1932m839M251J047
$$ 90550 69199 61999 74644 74480 61588 57678 50875 53066 41851 41479 53411 48572 52823 53870
17817E3870J0969L368P894J436P130J583j6659p029M120o887j6395k0592j5702
$$ 53870 64839 68207 76101 77537 84667 86250 69591 62562 66682 59795 43400 22808 7106
17804G106K1669Q950l849r657J406L2469K6941K4008L4284L0313K8072K0948m751
$$ 7106 28775 37725 33876 24219 25625 58094 85035 109043 143327 173640 201712 222660 217909
17791B17909j1445k2202l4400m1005k2719j9324N709R853J2239j0830m963k045
$$ 217909 206464 184262 149862 108857 86138 66814 72523 82376 94615 83785 78822 76777
17779G6777o478j4914K0756L764j2686q784k437P915j6748k9812Q259J0865K111
$$ 76777 70299 55385 76141 79905 67219 58435 55998 63913 47165 17353 25612 36477 38588
17766C8588j607N357M232o329j5240j9121J9942J0703P311M722N856J5498L4672
$$ 38588 36981 42338 46570 40241 25001 5880 25822 36525 43836 48558 54414 69912 104584
17753A04584K5895m537J3942N4898M6833K9820L3898J2538K3729R179j1949j3905
$$ 104584 130479 125942 139884 194782 241615 271435 305333 317871 341600 350779 338830 324925
17741C24925j7988r167J924l6920l9768k4717k1204j3324J0497j401j3j7230j1910
$$ 324925 306937 297770 299694 262774 223006 198289 177085 163761 174258 172857 172844 155614 143704
17728A43704j6847O668L837l057n927O15l276m550k387R54J6201K4412M8472M4726
$$ 143704 126857 133525 137362 134305 128378 128993 125717 121167 118780 119734 135935 160347 208819 253545
17714B53545K3451L8687M8368O6781R2163R5190Q2581O6001Q0457P4972N9638
$$ 253545 276996 315683 364051 430832 522995 618185 700766 766767 847224 922196 981834
17703I81834P4043M5010J4084K0117N651l058p576l4648q0737j03589j11915j22351
$$ 981834 1055877 1100887 1114971 1135088 1140739 1137681 1130105 1095457 1014720 911131 799216 676865
17691F76865q0359n8380o7549p2580l5678l9079j0496k0406j9148n158r623O93
$$ 676865 596506 538126 470577 397997 362319 323240 312744 292338 273190 268032 258409 259102
17679B59102J9556J776l683j8554j3787p435k6884l5785l047j8696k1703k1274
$$ 259102 278658 280434 276751 258197 244410 236975 210091 174306 171259 152563 130860 109586
17667A09586j7491J0729N373p382j5611j4311J3244J3178J7136J897j2681M077
$$ 109586 92095 102824 108197 100815 85204 70893 84137 97315 114451 116348 103667 107744
17655A07744J2598p209k866o731j7026m231j4056j1417J0149j517k0911j7298
$$ 107744 120342 113133 110267 103536 86510 82279 68223 56806 66955 65438 44527 27229
17643B7229J8007O067j4920O343j0198M922M208J943k2365m225N019J0569L05
$$ 27229 45236 51303 36383 42726 32528 37450 41658 43601 21236 17011 22030 32599 32904
17630C2904O467p467J355L177r556O234j3733j1516q829q185n813P448j8787K805
$$ 32904 39371 31904 33259 36436 26880 33114 19381 7865 -964 -9149 -14962 -7514 -26301 -23496
17616b3496Q649Q789O433M34q065L145R767L472k0372k3710L04J5205J7337J5106
$$ -23496 -14847 -6058 375 809 -7256 -4111 5656 9128 -11244 -34954 -34650 -19445 -2108 12998
17602A2998J0712j4986j725j1525j2962R524J0033Q921q741n760o383j04L400
$$ 12998 23710 8724 6999 -4526 -17488 -7964 2069 10990 2249 -3511 -9894 -9998 -6598
17589f598J6071J6955N68M009O891j3441j4640J4687R61l174r368K217L8365L0376
$$ -6598 9473 26428 26996 31005 37896 24455 9815 24502 25463 22289 12921 15138 53503 83879
17575H3879O781L0795M7346J9253J7919K4923N6557K8994j1471l8290m3307q622
$$ 83879 90660 121455 168801 188054 205973 230896 287453 316447 304976 266686 223379 214757
17563B14757j7004k4860j4157l0463k6934j2487j304J1401L0373M5064L3382K6296
$$ 214757 197753 172893 158736 128273 101339 88852 87548 98949 129322 174386 207768 234064
17551B34064L8560K2794K8890o596j6300j9553J413l4498m1184m1210k5071j1887
$$ 234064 272624 295418 324308 317712 301412 281859 283272 248774 207590 166380 141309 129422
17539A29422p709j6736j157l45J1359M8134M4263K3655L2355M0186L9225K1150
$$ 129422 121713 104977 103820 103475 114834 162968 207231 230886 263241 303427 342652 363802
17527C63802j5398l7825m2537m1650n8420m8633k8723p454P905J5942Q524m58
$$ 363802 348404 310579 268042 226392 167972 119339 90616 83162 91067 107009 115533 115075
17515A15075J183M4734P4905L9030L5814K3151J5612k3427k9791m3897m7631n4642
$$ 115075 116258 160992 235897 274927 310741 333892 349504 326077 296286 252389 204758 150116
17503A50116k8413p271r452j5969q515j4918j4414l125p148p063o627Q020L38
$$ 150116 121703 114432 104980 89011 80496 65578 51164 48039 40891 33828 27201 35221 35559
17490C5559j49J6169J84r587K773k5816m347L701P399q351J418j004n275L0815
$$ 35559 35410 51579 51763 42176 44949 19133 14786 18487 25886 17535 18953 17949 12674 43489
17476D3489j7613j9879n147j3012L774J7614l803J1033l944Q73j0872j1438J9577
$$ 43489 25876 5997 850 -12162 -8388 9226 5423 16456 12512 13385 2513 -8925 10652
17463A0652R274l836j0599O0M627m807l927j1802j2891j3728p440J3795R198K0085
$$ 10652 19926 16090 5491 5551 10178 5371 1444 -10358 -23249 -36977 -44417 -30622 -21424 -1339
17449a339J8101J8837M824L476J1365L104j531M156J0229K7027o427k9605l0343
$$ -1339 16762 35599 40423 43899 55264 58368 56837 60993 71222 98249 91822 62217 31874
17436C1874j2591k447k5084M66J8188m876m909R753P569j96Q51r738r987k1462
$$ 31874 19283 16836 -8248 -7782 10406 5530 621 10374 17943 17747 18598 8860 -1127 -22589
17422b2589Q808O847L293j949j6887K836J693n009l28m731m117P739j825J4624
$$ -22589 -13781 -6934 -3641 -5590 -22477 -19641 -17948 -22957 -23285 -28016 -32133 -24394 -26219 -11595
17408a1595K3618j535p439j1639N059O581j1619j3261q30r584J095J0821J6215
$$ -11595 12023 10488 3049 -8590 -3531 3050 -8569 -21830 -22660 -32244 -31149 -20328 -4113
17395d113N259O523j5359J671p223j8263o389K2198J5124K672j4935P855o410
$$ -4113 1146 7669 -7690 -6019 -13242 -31505 -37894 -15696 -572 2100 -12835 -4980 -11390
17382a1390n475K350R552K162q046j5255k2820j0021J5405J5787L709r044R859
$$ -11390 -16865 -14515 -4963 -2801 -10847 -26102 -48922 -58943 -43538 -27751 -24042 -33086 -23227
17369b3227k718O664M57O726n62O718r760Q071J1302k2845j3795J2452R577r60
$$ -23227 -25945 -19281 -18824 -12098 -12660 -5942 -15702 -7631 3671 -19174 -32969 -20517 -10940 -11900
17355a1900N778k433J116J9771j6849L773M709r700j2435k476k26Q926J6567N183
$$ -11900 -6122 -8555 -7439 12332 -4517 -744 3965 -5735 -18170 -20646 -20872 -11946 4621 9804
17341I804J5609o094l1708j5476N300m145j066J0717j7396l788J8424l770L842
$$ 9804 25413 19319 -12389 -27865 -22565 -26710 -27776 -17059 -34455 -38243 -19819 -23589 -19747
17328a9747n738j0622O002J5481Q390j4808p711Q306k0393q886J1730J6028k442
$$ -19747 -25485 -36107 -30105 -14624 -6234 -21042 -28753 -20447 -40840 -49726 -37996 -21968 -24410
17315b4410m42K4046R546n435k776j453j694n801j134p97M839R280P03l486j771
$$ -24410 -24852 -806 8740 3305 529 -924 -2618 -8419 -9553 -10350 -5511 3769 4472 986 -785
17300g85M360o034p708o831q484k4773M387n970K5488J638k1370J1387J6752N066
$$ -785 3575 -2459 -10167 -16998 -25482 -50255 -45868 -51838 -26350 -24712 -46082 -34695 -17943 -12877
17286a2877O398N018j9419j4649J6929J3644J2983o30L952k3533k0653O395J6945
$$ -12877 -6479 -1461 -20880 -35529 -18600 -4956 8027 7397 11349 -12184 -32837 -26442 -9497
17273i497M310j7291j3653Q629J3129j4302Q08k500k1L00O159J2284R263r440
$$ -9497 -5187 -22478 -36131 -27502 -14373 -28675 -27867 -30367 -30388 -30088 -23929 -11645 -2382 -11822
17259a1822Q38J3551j1352j5617J1660N881J009J9416L93j1246r944j328j685
$$ -11822 -10984 2567 -8785 -24402 -12742 -6861 -5852 13564 13957 2711 -7233 -8561 -10246
17246a0246k763j4R187j4222q034N203K284j513l927K3569K1008k4135p976j1988
$$ -10246 -13009 -13023 -3836 -18058 -26092 -20889 -18605 -20118 -24045 -476 20532 -3603 -11579 -23567
17232b3567j5005P073L007L976j3168j1355o45l044L5212L4754L374r903j2066
$$ -23567 -38572 -31499 -28492 -24516 -37684 -49039 -49684 -52728 -17516 17238 20612 10709 -1357
17219a357p315J5225N864l566k880m540q590K39J57J4546L051j2502R161N609
$$ -1357 -8672 6553 12417 8851 5971 1431 -7159 -6920 -6763 7783 10834 -1668 7493 13102
17205A3102J561R332J3250r44o751N675K4751j0802q200r170j8352M881J1405
$$ 13102 14663 23995 37245 36301 29550 35225 59976 49174 40974 31804 13452 18333 29738
17192B9738o685j0375j5563o085Q076J1837K775J3894p551J3212R891m866j5826
$$ 29738 23053 12678 -2885 -8970 -894 10943 13718 27612 20061 33273 43164 38298 22472
17179B2472K895J6768K3827P823j262r903l444j3457k7631j7027J9150k2406j4910
$$ 22472 25367 42135 65962 73785 72523 62620 59176 45719 18088 1061 20211 -2195 -17105
17166a7105J2510M104m179q700q804J3040j1382J2921K425k0390n817K0373K426
$$ -17105 -4595 -491 -4670 -13370 -22174 -9134 -20516 -7595 -5170 -25560 -31377 -11004 -8578
17153h578J1942q387j0802j7292Q320N913j4183J138Q001K5818J3129Q651l356
$$ -8578 3364 -5023 -15825 -33117 -24797 -18884 -33067 -31929 -23928 1890 15019 23670 20314
17140B0314k169J7525Q885J2377K5111l438k9473j4534O343k885o946m793j4175
$$ 20314 18145 35670 44555 56932 82043 78605 49132 34598 40941 38056 31110 26317 12142
17127A2142K617m104p874J0194M850K157j7728J039j0408r809k56nj0433j1692
$$ 12142 14759 10655 2781 12975 17825 19982 2254 3293 -7115 -16924 -17180 -17185 -27618 -39310
17113c9310o852J758j522J9376r2k201J7709J82l495l345m70J572K309M022r547
$$ -39310 -46162 -44404 -45926 -26550 -26642 -28843 -11134 -10952 -14447 -17792 -18262 -16690 -14381 -10359 -19906
17098a9906l187l37l277j9475j1659L970K8658J7075J0650J3138O653n953m878
$$ -19906 -23093 -23430 -26707 -46182 -57841 -53871 -25213 -8138 2512 15650 22303 16350 11472
17085A1472m019J223j5899p914J0630K2323M552Q572j1353l8919k5706L4320K1844
$$ 11472 7453 8676 -7223 -15137 -4507 17816 22368 30940 19587 -19332 -45038 -10718 11126
17072A1126J747J1765J0303J4097l56k4433l2119N79K3066K1540J008n283j2940
$$ 11126 12873 24638 34941 49038 48682 24249 -7870 -7291 15775 37315 38323 33040 20100
17059B0100j5317j2795j260m547k0802K7390O266q085J3945J7295j521P475K420
$$ 20100 4783 -8012 -9272 -13819 -34621 -7231 -965 -9050 4895 22190 20669 28144 30564
17046C0564j7539k628Q697k308m431j7707j6963j1509K370J4548K2443L2042J6875
$$ 30564 13025 10397 19094 16786 12355 -5352 -22315 -33824 -31454 -16906 5537 37579 54454
17033E4454K0765J5139N074j4725M419O73K766K140k4085j0063J9476Q178m780
$$ 54454 75219 90358 95432 80707 85126 85799 88565 90705 66620 56557 76033 84211 79431
17020G9431q317j2270q666j1279R121j4469j4925k1439R105K982J1105m754q188
$$ 79431 71114 58844 50178 38899 48020 33551 18626 -2813 6292 9274 20379 15625 7437
17007G437n083q663J2056J3310K241l643N107p032k155J1263P067j058j556M628
$$ 7437 2354 -6309 5747 19057 21298 17655 22762 15730 13575 24838 31905 30847 29291 33919
16993C3919j4939M636J3201O640j0171j8815o250J1341R801N264P392J7444J1100
$$ 33919 18980 23616 36817 43457 33286 14471 8221 19562 29363 34627 42019 59463 70563
16980G0563J374k968q648J3689J7953K7860J6097Q750m920J2130K0712O636K262
$$ 70563 71937 68969 60321 74010 91963 119823 135920 144670 139750 151880 172592 179228 181490
16967A81490q5o558j2522j3658m508N971p387k1086j4526j6812J93J508j8132
$$ 181490 181405 174847 162325 148667 144159 150130 142743 121657 107131 90319 90512 92020 73888
16954G3888l0117Q346Q646Ol337j9063p662N003J8933J3559J3214p083J952M850
$$ 73888 43771 52117 60763 60769 57432 38369 30707 35710 54643 68202 81416 74333 76285 81135
16940H1135J4209P52j1451R275K6113Q821N44K3477J9140J3729K5283L1317M1058
$$ 81135 95344 96096 84645 93920 120033 128854 129398 152875 172015 185744 211027 242344 283402
16927B83402N0306Q2619J52499K59190M65268N56191L79449Q5566L2614M4045
$$ 283402 333708 416327 568826 828016 1293284 1849475 2228924 2314490 2347104 2391149
16917B391149j05729m95690n84725l74082k04626j18718q9176n1988k4673m8054
$$ 2391149 2285420 1789730 1205005 830923 626297 507579 418403 366415 341742 293688
16907B93688n8922k9465m021j1888k3611k0613q597K562Q51q349J0427K741k2060
$$ 293688 234766 205301 201280 189392 165781 145168 136571 139133 139984 131635 142062 144803 122743
16894A22743j0249J6938P102P561J0115o229l2397j1090n607l516q673k3748k931
$$ 122743 112494 129432 136534 144095 154210 147981 115584 104494 98887 95371 86698 62950 60019
16881F0019M385p162j7675n501q665l491J4372J7305K714k5285p380m178M751
$$ 60019 64404 57242 39567 34066 25401 21910 36282 53587 56301 31016 23636 19458 24209
16868B4209j5836p692K980L2410J759j8335L610n34p487j3239J706Q179K848n352
$$ 24209 8373 681 3661 36071 37830 19495 23105 22571 15084 1845 3551 11730 14578 9226
16854I226Q345P102J1791n624j1297P055j6725m616Q224J6947P805O685p855k76
$$ 9226 17571 24673 36464 30840 19543 26598 9873 5257 13481 30428 38233 44918 37063 36787
16840C6787r89j0075J0215J1695J6581l885n740N19o141J5751J6998K0063Q882
$$ 36787 35798 25723 35938 47633 64214 60329 54589 55108 48967 64718 81716 101779 110661
16827A10661j781j8289k6472M833L204r744J431k0399j0492Q378l934P17m398
$$ 110661 108880 90591 64119 68952 72156 62412 63843 43444 32952 41330 37396 38113 33715
16814C3715l064K4653K9979L161M105R553J612r754k5733j5584k742J836o297
$$ 33715 30651 55304 85283 88444 92549 102102 103714 93960 68227 52643 49901 51737 45440
16801D5440j2957j6700l536j0457J4622N126n397j3718r423k2269m428L0690J2328
$$ 45440 32483 15783 12247 1790 16412 21538 16141 2423 -7000 -29269 -33697 -3007 9321
16788I321j5986j8779R056n32K0753O959m872r922j0828J6179J1893O456j8304
$$ 9321 -6665 -25444 -16388 -16920 3833 10792 5920 -4002 -14830 1349 13242 19698 1394
16775A394N53P863M562M508o749n250j4547j7619k041L774j5574K318J6784k041
$$ 1394 1947 9810 14372 18880 12131 6881 -7666 -25285 -27326 -23552 -39126 -36808 -20024 -22065
16761b2065k474Q441P243r12j5380m120p233k213J1669Q639K344J8322R926n187
$$ -22065 -24539 -16098 -8855 -9767 -25147 -29267 -36500 -38713 -27044 -18405 -16061 2261 12187 7000
16747G000K698j5967j457O979l871p731j3834q438J5821j844k369p018n823O848
$$ 7000 9698 -6269 -7726 -747 -4618 -12349 -26183 -34621 -18800 -20644 -23013 -30031 -35854 -29006
16733b9006K747j4873J0608J5706j2820J259M245J7848q57M928l350K817L760
$$ -29006 -26259 -41132 -30524 -14818 -27638 -26379 -22134 -4286 -5143 -215 -3565 -748 3012
16720C012J0745k3358J2742k916m729L16o436j243L0297k634j5087q813N786N050
$$ 3012 13757 -9601 3141 225 -4504 -4188 -10624 -11867 18430 15796 709 -8104 -2318 2732
16706B732M59q379k625L760R536r640o010n66L793o042o719j6435r760N082Q256
$$ 2732 3191 -5188 -7813 -4053 5483 -4157 -10167 -10733 -6940 -12982 -19701 -36136 -45896 -40814 -32558
16691c2558j1159p883J3075J0466J8950p669j3299R070K6365J275j5703o437N261
$$ -32558 -43717 -51600 -38525 -28059 -9109 -16778 -30077 -21007 5358 6633 -9070 -15507 -10246
16678a0246J0520r656p434r90K0347J6741n52j1256K277k3249k3056N93P166r494
$$ -10246 274 -9382 -16816 -17806 2541 19282 18730 7474 9751 -13498 -36554 -35961 -28795 -38289
16664c8289N127J4125J9805q205p43O030J919k437Q267N765Q600n335j0951j6671
$$ -38289 -33162 -19037 768 -7437 -8180 -2150 -231 -2668 5599 11364 19964 14629 3678 -12993
16650a2993K050j1860P114Q577J1067p05J4066K1114L934q990j1488j663j1765
$$ -12993 -10943 -22803 -15689 -7112 3955 3250 17316 38430 42364 33374 21886 20223 8458
16637H458l139k628k937J364j2716K931O385N772j0699O903J0453J4428n925k4709
$$ 8458 5319 2691 -246 1118 -11598 -8667 -2282 3490 -7209 -306 10147 24575 18650 -6059
16623f059p203j0651n64J0491j491Q885J0463m147o99N790j2323J584k71p035
$$ -6059 -13262 -23913 -24477 -13986 -15477 -6592 3871 -276 -975 4815 -7508 -5924 -6195 -13230
16609a3230j1296K395J6990M244j718j2597j5533J9459J3245J928P711K5350j6775
$$ -13230 -24526 -22131 -5141 -897 -2615 -15212 -30745 -11286 1959 3887 11598 36948 20173
16596B0173j4702M617j8557p47q405j873j958O334r94J0601P947q024L757K3640
$$ 20173 5471 10088 -8469 -9216 -17621 -19494 -21452 -15118 -16112 -5511 2436 -5588 -1831 21809
16582B1809k424j9459l943N245J4508L329l790j5025K295P152k766l4N898j4171
$$ 21809 19385 -74 -4017 1228 15736 19065 15275 250 2545 9697 6931 6897 12795 -1376
16568a376j0010L695K4729K3984J3109j4029j1438j7393j0015p943k271L256O485
$$ -1376 -11386 -7691 17038 41022 54131 40102 28664 11271 1256 -6687 -8958 -5702 783
16555G83P666j3340j8000j978q122n66J7297R17o319n850P557P304m643J683K663
$$ 783 8449 -4891 -22891 -24869 -32991 -33557 -16260 -15343 -21662 -27512 -19955 -12651 -17294 -15611 -12948
16540a2948j5132k496n36K0602J0906n445j267N974K504J5970Q250k3162j9861
$$ -12948 -28080 -30576 -31112 -10510 396 -5049 -6316 -342 2162 18132 26382 3220 -16641
16527a6641J2621n318J447J8207k1259j6427j95j4328R414K6678n677o726q502
$$ -16641 -4020 -9338 -7891 10316 -10943 -27370 -27565 -41893 -32479 -5801 -11478 -18204 -26706
16514b6706P567l238r653P511K0721q286o770L718K2322j2058p648k4609P02J4281
$$ -26706 -19139 -22377 -32030 -24519 -3798 -12084 -18854 -15136 7186 -4872 -12520 -37129 -36427 -22146
16500b2146P294J2817P830Q979q864q251j0123K885J0628M063M744k1910q558
$$ -22146 -14852 -2035 5795 14774 5910 -2341 -12464 -9579 1049 5112 9856 -12054 -20612
16487b0612K497J1512l849O011j0442k1739j4057L166J2302J0086o506j0098J4219
$$ -20612 -18115 -6603 -10452 -4441 -14883 -36622 -50679 -47513 -35211 -25125 -31631 -41729 -27510
16474b7510J800K0356Q907k436K572J046M220R276m588J2894O418j7289Q457J6589
$$ -27510 -25710 -5354 3553 1117 3689 4735 8955 18231 13643 26537 32955 15666 24123 40712
16460D0712k1577j3158o745K695j7297k3256m042Q02J5891R316o776p647K2943
$$ 40712 19135 5977 -768 1927 -15370 -38626 -42668 -41866 -25975 -16659 -23435 -31082 -8139
16447h139P389N909j5001j6755M864J7751R418q781Q317j0671j0886R256J5141
$$ -8139 -750 5159 -9842 -26597 -21733 -3982 5436 -3345 4972 -5699 -16585 -7329 7812
16434G812p058j0365p766K9648N165k5859P569o544m001L499k2720j8637m928
$$ 7812 754 -9611 -17377 12271 17436 -8423 -854 -7398 -11399 -7900 -30620 -49257 -54185
16421e4185O116J9584K2410J1340M553N237j0071m312j1614j3329j9779k0463
$$ -54185 -48069 -28485 -6075 5265 9818 15055 4984 672 -10942 -24271 -44050 -64513
16409f4513J1242J3090Q844m481R378J4866J1152Q294n264L506m675n758p74m617
$$ -64513 -53271 -40181 -31337 -35818 -26440 -11574 -422 7872 2608 6114 1439 -4319 -5093 -9710
16395i710L23j2517l765Q640J1756R757k581r42k747j141J5394j414r180r578
$$ -9710 -9387 -21904 -25669 -17029 -5273 4484 1903 961 -1786 -2927 12467 11053 1873 -7705
16381g705j6578l0494J5704L0818R071j6030j2619J745J3077L725j1591J2261
$$ -7705 -24283 -54777 -39073 -8255 816 -15214 -27833 -26088 -13011 -9286 -20877 -8616
16369h616R316R221o620J864j4075j6297J4453J2922r60J5145N252r775k610p564
$$ -8616 700 9921 3301 5165 -8910 -25207 -10754 2168 1208 16353 21605 11830 9220 1656
16355A656j2562N051K243K067j0613l894k864n212J3610K490J0909j8734j172
$$ 1656 -10906 -5855 -3612 -1545 -12158 -16052 -18916 -24128 -10518 -8028 2881 -15853 -17025
16342a7025j0357M497L54Q178J1732m553j0559J1178J2997M697j8439j7278Q887
$$ -17025 -27382 -22885 -22531 -14353 -2621 -7174 -17733 -6555 6442 11139 -7300 -24578 -15691
16329a5691j0531j3240J0581O39j2601J0892j9884j5071J5438M0435K8163J863
$$ -15691 -26222 -39462 -28881 -28242 -40843 -29951 -49835 -64906 -49468 -9033 19130 20993
16317B0993j0780j2183J9859k76j8682p308m819N598L614j1809r218j6839k5689
$$ 20993 10213 -1970 17889 17613 -1069 -8377 -13196 -7598 -3984 -15793 -25011 -41850 -67539
16304f7539P207K4514J2114K1435l809j7859J1211K491K043m254J1355O627R655
$$ -67539 -60332 -35818 -23704 -2269 -6078 -23937 -12726 -10235 -8192 -12446 -1091 5536 15191
16291A5191k381R318O06k5650j4514r285L1J0008n973k4379J7343J6382p776j1600
$$ 15191 12810 22128 22734 -2916 -17430 -26715 -26684 -16676 -22649 -47028 -29685 -13303 -21079 -32679
16277c2679J5068M948j5605q631J2998P776M915l357M571K820r366N857N444j006
$$ -32679 -17611 -12663 -28268 -36899 -23901 -16125 -11210 -14567 -9996 -7176 -16542 -10685 -5241 -6247
16263f247O171n526o942l036P781l936P744l878M022j1768k1383m74j4710k1146
$$ -6247 -76 -5602 -12544 -15580 -7799 -11735 -3991 -7869 -3847 -15615 -36998 -37472 -52182 -73328
16249g3328k697J5130J2914J5943l148j0845j008J0645J833l448L2490K8123j2988
$$ -73328 -76025 -60895 -47981 -32038 -35186 -46031 -47039 -36394 -34561 -38009 -5519 22604 9616
16236I616j0281l241o283j5133q581J4414J1687k024M298K396r650k7809m260
$$ 9616 -665 -3906 -10189 -25322 -33903 -19489 -7802 -9826 -5528 -3132 -12782 -40591 -44851
16223d4851K2340M506o930m261J7152o316Q759j5390m540m668K6162L1182o668
$$ -44851 -22511 -18005 -24935 -29196 -12044 -18360 -9601 -24991 -29531 -34199 -8037 23145 16477
16210A6477k6671j454Q032m490k360N344P96m287R054J139k0462k075M580K0518
$$ 16477 -10194 -11648 -3616 -8106 -10466 -5122 -4326 -8613 441 1580 -18882 -20957 -16377 4141
16196D141R803p230O403p109j1474r388j1764O535J5301l324Q86j0486q276J2047
$$ 4141 13944 6714 13117 6008 -5466 -14854 -26618 -20083 -4782 -8106 -7220 -17706 -25982 -13935
16182a3935J8605q260j2004L370j0085o132J01r618k132M532J0736L177J7306
$$ -13935 4670 -3590 -15594 -12224 -22309 -28441 -28340 -37958 -40090 -35558 -24822 -21645 -4339
16169d339R939k5253j8476K988J7045j904m7l738j4526J9359L4195J8960k1440
$$ -4339 5600 -19653 -38129 -35141 -18096 -20000 -20047 -23785 -38311 -18952 15243 34203 12763
16156A2763j0187M881J3177Q493k9959j2107O877O116N176k937j408j8211p866
$$ 12763 2576 7457 20634 29127 -832 -12939 -6062 54 5230 2293 885 -17326 -25192
16143b5192o647R593J0456J1378R848l470l13r245n881J7315j5516L327P388j4361
$$ -25192 -31839 -22246 -11790 -412 9436 5966 5653 -3592 -9473 7842 -7674 -4347 3041 -11320
16129a1320o016K690l84p561o067L050N648O116J305J0318J5694J901k6635k2490
$$ -11320 -17336 -14646 -15030 -22591 -28658 -25608 -19960 -13844 -12539 -2221 13473 15374 -11261 -33751
16115c3751J4690K9447P202K486P336L04l6007j2187K328K621K2518J3479k198
$$ -33751 -19061 10386 17588 20074 27410 27714 -8293 -20480 -18152 -15531 6987 20466 18268
16102A8268m657m987m681j109j1680Q82J0039N541m631k3685P842R233Q983l663
$$ 18268 13611 8624 3943 2834 -8846 -7964 2075 7616 2985 -20700 -12858 -3625 5358 1695
16088A695k4014J87K416k218m753J3436m601n941q186k535n539P194J9034J4306
$$ 1695 -22319 -22132 -19716 -21934 -26687 -13251 -17852 -23793 -31979 -34514 -40053 -32859 -13825 481
16074D81j9050o278J5353J2930O92k044J6570J323j3430J0552J0127j5664k1498
$$ 481 -18569 -24847 -9494 3436 4128 2084 18654 19977 6547 17099 27226 11562 -9936
16061i936k132M962m651p8J5869J3317m779j5769j6579L434R110O846p402r320
$$ -9936 -12068 -7106 -11757 -11835 4034 17351 12572 -3197 -19776 -16342 -7232 -386 -7788 -17108
16047a7108K4709M412j8364j0744k0112J8156N110J3256O727j2066K40J119J0760
$$ -17108 7601 12013 -6351 -17095 -37207 -19051 -13941 -685 6042 -6024 -5784 -4665 6095
16034F095N816k263M444k0642J717m90J5022N987O530R88p13j1857o355J02J1882
$$ 6095 11911 9648 14092 -6550 -4833 -5323 9699 15686 22216 23204 22491 10634 4279 4381 16263
16019A6263l092m774j4461j8507j2923j1764J0754K3783q16q395P865l428K821
$$ 16263 13171 8397 -6064 -24571 -37494 -49258 -38504 -14721 -15537 -23932 -16067 -19495 -16674
16006a6674M852j4202J0781J0339J1518k411J2702N562j8906j1107j6361j1728
$$ -16674 -11822 -26024 -15243 -4904 6614 4203 16905 22467 3561 -7546 -23907 -35635
15994c5635r710J2689J0553j0977L183J8717p70J6767J739j586P751q44j3213
$$ -35635 -45345 -32656 -22103 -33080 -29897 -11180 -11950 4817 6556 4970 12721 11877 -1336
15981a336O389p826l299N185l188N117L579k5591m940J1982J3479J1318j2718
$$ -1336 5053 -2773 -6072 -887 -4075 1042 4621 -20970 -25910 -13928 -449 10869 -1849
15968a849k8791j1313K9734J6763k003j4479N993K931n468q038j4717q360r333
$$ -1849 -30640 -41953 -12219 4544 2541 -11938 -5945 -3014 -8482 -16520 -31237 -39597 -48930
15955d8930J4749J4786K4764J759O833J6831k2726k587K319j8458j7763N758J5693
$$ -48930 -34181 -19395 5369 7128 13961 30792 8066 5479 7798 -10660 -28423 -22665 -6972
15942f972N73M461Q402J1692j6344j4337L30K2558N695j7507o939J6449K2653
$$ -6972 -6399 -1938 6464 18156 1812 -12525 -12195 10363 16058 -1449 -8388 8061 30714
15929C0714j0006J606N315k47N481l515j0225K4709K5066j3301r685j808j9144
$$ 30714 20708 22314 27629 27382 32863 29348 19123 43832 68898 55597 45912 44104 24960
15916B4960k2879J173K2440K8237M2051K7643K3863K4758J5735k043K329k707
$$ 24960 2081 3254 25694 53931 95982 123625 147488 172246 187981 185938 188267 185560
15904A85560k3817k5044k5718l7274j2167k606j6864n558r931l752k393o219J0203
$$ 185560 161743 136699 110981 73707 61540 58934 42070 36512 26581 22829 20436 14217 24420
15891B4420j5522J1481N519q502k3867k5935Q511J258Q592l641K0633M808M445
$$ 24420 8898 20379 25898 17396 -6471 -32406 -23895 -22637 -14045 -17686 2947 7755 12200
15878A2200J3389p029o15L277J204j2600p699o114k441j0008L045j4596m567K3919
$$ 12200 25589 18560 17945 21222 22426 9826 2127 -3987 -6428 -16436 -13391 -27987 -32554 -8635
15864h635P042j3987k2239P071K0008J8822P021P54k1522k0734N282M351l409
$$ -8635 -1593 -15580 -37819 -30748 -10740 8082 15103 15857 -5665 -26399 -21117 -16766 -20175
15851b0175K270J5122J5451p205j4567Q532K0555j0678p242N629J0196J3016r195
$$ -20175 -17905 -2783 12668 5463 -9104 -572 19983 9305 2063 7692 17888 30904 21709
15838B1709j0172k058M635o710Q60l326l560m665j7401Q907j2406J383K6956L275
$$ 21709 11537 9479 14114 7404 8264 4938 1378 -3287 -20688 -11781 -24187 -22804 4152 7427
15824G427r407K78N633J0679O302q974k0958n904J4295p74L258k7264q652Q040
$$ 7427 -1980 -1702 3931 14610 20912 11938 -9020 -14924 -629 -1403 1855 -25409 -34061 -26021
15810b6021R534J6549l735j1529J2437m980j0727Q147R970q346k918l424P731
$$ -26021 -16487 62 -3673 -15202 -2765 -7745 -18472 -10325 -355 -8701 -11619 -15043 -7312
15797g312r110m579J5653N122j133l526l20N140Q65m359q000J6373J2166M471
$$ -7312 -16422 -21001 -5348 -226 -1359 -4885 -5205 -65 800 -3559 -11559 4814 16980 21451
15783B1451j5201k5680P929o36l504L896J1147N84J52p303j0716O587O947p698
$$ 21451 6250 -19430 -11501 -12137 -15641 -11745 -598 -14 138 -7165 -17881 -11294 -4347 -12045
15769a2045j9993N150J8008p600j6454j4507K7681j05R806J0835m45j1418L710
$$ -12045 -32038 -26888 -8880 -16480 -32934 -47441 -19760 -19865 -10059 776 331 -11087 -7377
15756g377r948J4778P601J0110n390J1j7844K487N172l549p857L386J134O494
$$ -7377 -17325 -2547 5054 15164 9774 9785 -8059 -5572 -400 -3949 -11806 -8420 -7286 -792
15742g92j5645j2076p215K0427P306J1491P542o296m780n177P290Q761j5269l412
$$ -792 -16437 -28513 -35728 -15301 -7995 3496 11038 4742 -38 -5215 2075 10836 -4433 -7845
15728g845j6407j5061L4391K3581j3343m184p258J5077K531j7851j2403K220R844
$$ -7845 -24252 -39313 -4922 18659 5316 1132 -6126 8951 11482 -6369 -18772 -16552 -6708
15715f708j2858j06L039O468P803m109j2260L521N126j4424p415J494K332l022
$$ -6708 -19566 -19672 -16633 -10165 -2362 -6471 -18731 -15210 -10084 -24508 -31923 -30429 -28097 -31119
15701c1119J4361N681M695k066n753j002j2317K846J2350J2066K2208J9410r42
$$ -31119 -16758 -11077 -6382 -8448 -14201 -15203 -27520 -24674 -12324 -258 21950 41360 40418
15688D0418j7525k1103j0480k172m180j6347K713N161K6828L684j6729k8511O558
$$ 40418 22893 1790 -8690 -10862 -15042 -31389 -28676 -23515 3313 6997 -9732 -38243 -31685
15675c1685K06J128R155q848Q111K5638J5889m395l865K979m466K831p057l079
$$ -31685 -31479 -30351 -21196 -30044 -21933 3705 19594 15199 11334 14313 9847 12678 5621 2542
15661B542q33O741j132r511L80N990p85J1953J6256J030q259j5050j2454k65q535
$$ 2542 1709 8450 7318 -2193 -1813 4177 3392 15345 31601 32631 24372 9322 -3132 -3397 -11932
15646a1932l846J7655J1284k0909n822M41o742k0131P663P696M407K865j109p234
$$ -11932 -15778 1877 13161 -7748 -13570 -13129 -19871 -40002 -32339 -24643 -20236 -17371 -18480 -25714
15632b5714j62K699M987L198l575p041L217P791j246j1544r426o060J244J6645
$$ -25714 -25876 -23177 -18190 -14992 -18567 -25608 -22391 -14600 -15846 -27390 -36816 -42876 -41632 -24987
15618b4987L3854n704j3260J2714j751k1252P14j904j8331J2524K201l640N004
$$ -24987 8867 3163 -10097 2617 866 -20386 -19672 -21576 -39907 -27383 -25182 -28822 -23818
15605b3818O156n206m91L081n604L885L610J036m471q878R001k825K4768P312
$$ -23818 -17662 -22868 -23359 -20278 -25882 -21997 -18387 -17351 -21822 -30700 -21699 -24524 244 7556
15591G556r553J807J4867Q769M354j9999l3685J76J0378J9604j26o215P87m426
$$ 7556 -1997 -190 14677 23446 27800 7801 -25884 -25708 -15330 4274 4148 -2067 -1280 -5706
15577e706r837R437q647k4150N703J9317K8898p923J873L156j5633j6395J846
$$ -5706 -15543 -6106 -14753 -38903 -33200 -13883 15015 7092 8965 12121 -3512 -19907 -18061
15564a8061K0346P255q509j355q087k733l40k575k3311j0363K609J8005P308n00
$$ -18061 2285 9540 1031 -324 -8411 -11144 -11484 -14059 -37370 -47733 -45124 -27119 -19811 -20311
15550b0311J5955J1345L089j5906j5203M714r377j5226J8198J1374M489l311j2096
$$ -20311 -4356 6989 10078 -5828 -21031 -16317 -25694 -40920 -22722 -11348 -6859 -10170 -22266
15537b2266L205O388J4656K1702m247j8225j2430n076p925L548K3562J5606P529
$$ -22266 -19061 -12673 1983 23685 19438 1213 -11217 -16293 -24218 -20670 2892 18498 26027
15524B6027q328j1708j2543p610j0058N127J2801P04j795K261J2895K513p35j985
$$ 26027 17699 5991 -6552 -14162 -24220 -19093 -6292 -5588 -7383 -5122 7773 10286 9551 7566
15510G566J74p293J33k829p024J5532j1743P90K37J3765J2222j3893j7182p431
$$ 7566 7740 447 580 -2249 -9273 6259 -5484 -4694 -4457 9308 21530 7637 -9545 -16976
15496a6976m625j0349J1677J3795j650j5924o827L69J4038Q538L541m147K830
$$ -16976 -21601 -31950 -20273 -6478 -8128 -24052 -30879 -30510 -16472 -7934 -4393 -8540 -5710
15483e710Q290n018j4128J1033P31k4r484k4779q241K9816J2028m704O936K6696
$$ -5710 2580 -2438 -16566 -5533 -4802 -4826 -14310 -39089 -47330 -17514 -5486 -10190 -3254 23442
15469B3442p080j7944J765R570Q607r92p5O792r378p457k686j6190j6558Q368
$$ 23442 16362 -1582 183 9753 18360 17368 17293 24085 14707 7250 4564 -11626 -28184 -19816
15455a9816O857j4546q149J1625J7806M683N462k3303n66n614n558j061K541Q411
$$ -19816 -12959 -27505 -35654 -24029 -6223 -1540 3922 -19381 -19947 -25561 -31119 -32180 -29639 -21228
15441b1228k220l346J4169n709j2709R396k804r83p926n949J0743N003J9705M660
$$ -21228 -23448 -26794 -12625 -18334 -31043 -21647 -24451 -25434 -33360 -39309 -28566 -23563 -3858 802
15427H02p220K627J8030j0120k1730n523o829l22j00J0902Q936K043M591k7969
$$ 802 -6418 -3791 14239 4119 -17611 -23134 -29963 -30285 -30385 -19483 -10547 -8504 -3913 -31882
15413c1882j2972K5163J7633j2236j671q104n704O242J0942l926Q805j1661J910
$$ -31882 -44854 -19691 -2058 -14294 -15965 -24069 -29773 -23531 -12589 -16515 -7710 -19371 -17461
15400a7461J901J0915J0809q476p35j622j0190k1384P72J5458K4563Q313n497
$$ -17461 -15560 -4645 6164 -2312 -3047 -4669 -14859 -36243 -35471 -20013 4550 12863 7366
15387G366J864r720k1386j5507J0824K1802j696Q310o102L48j32j4254J4891J4473
$$ 7366 9230 -490 -21876 -37383 -26559 -4757 -6453 1857 -4245 -3897 -4029 -18283 -3392 11081
15373A1081j0150k0881J0446R372P941q613k1046j3411J5648Q662R54P770Q610
$$ 11081 931 -19950 -9504 -132 7809 -804 -21850 -35261 -19613 -10951 -9997 -2227 6383
15360F383J462j3565l312m85q96J4504M19o181j4050k3061J326J1806j198Q653
$$ 6383 7845 -5720 -9032 -9517 -10413 4091 4510 -1671 -15721 -38782 -37456 -25650 -26848 -18195
15346a8195K0634J137l472l463l025j0584o12k961o170M919K3066r21m624R7M729
$$ -18195 2439 3576 104 -3359 -6384 -16968 -17580 -20541 -26711 -21792 1274 353 -4271 -4174 555
15331E55p249j2972J8502J5757j336q613k433K671j1689m190l693M859Q089J26
$$ 555 -6694 -19666 -1164 14593 13257 4644 2211 4882 -6807 -10997 -14690 -9831 -1742 -1616
15317a616O37K5398O282j4765j3722j476j4677P433R294M08R952O252m63p820
$$ -1616 -979 24419 30701 15936 2214 738 -13939 -6506 2788 3196 13148 19400 18937 11117
15303A1117j5642K388M247q38P863j641j1754n94o970j3903j3467J1474N501p97
$$ 11117 -4525 -2137 2110 1272 9135 7494 -4260 -4854 -11824 -25727 -39194 -27720 -22219 -23016
15289b3016J111J2581K0189J906j6979n760J8218k910p436q374J1236q820j9056
$$ -23016 -21905 -9324 10865 12771 -4208 -9968 8250 5340 -2096 -10470 766 -8054 -27110
15276b7110k769L319M152q515j929J9649R086J0092j3351l842j9149J046P592
$$ -27110 -29879 -26560 -22408 -30923 -32852 -13203 -4117 5975 -7376 -11218 -30367 -29321 -21729
15263b1729L0324O512r599K0544R271j0439j0749l1757p801J1034J1801j2480
$$ -21729 8595 15107 5508 26052 35323 24884 14135 -17622 -25423 -14389 -2588 -15068
15251a5068j3106J8307J2083J048k2478n959O672K0476o430n333J1511L316j8717
$$ -15068 -28174 -9867 2216 3264 -19214 -25173 -18501 1975 -4455 -9788 1723 5039 -13678
15238a3678j0620P433J9611q026p734P291N502J228q772j228J4662J7615l668
$$ -13678 -24298 -16865 2746 -5280 -13014 -5723 -221 1007 -7765 -8993 5669 23284 19616
15225A9616j1727q678Q32q158j1922J1698K5764p537j4000O501n808M027M530
$$ 19616 7889 -789 43 -8115 -20037 -8339 17425 9888 -4112 2389 -3419 608 5138
15212E138L345n788n438l16j532k778j1971q265j4804J593K1487O286O198J477
$$ 5138 8483 2695 -2743 -3059 -4591 -7369 -19340 -27605 -42409 -40816 -19329 -13043 -6845 -5368
15198e368J0279n947o160Q260j1736p242J3215K3739Q60j1773r358J8916p685
$$ -5368 4911 -1036 -7196 1064 -10672 -17914 -4699 19040 19900 8127 -1231 17685 10000
15185A0000j8086J577O27k396r164m033L949L170m17j3853j0356M34Q065K0232
$$ 10000 -8086 -6509 -5882 -8278 -17442 -21475 -17526 -14356 -14773 -28626 -38982 -38548 -30483 -10251
15171a0251J6183n172k6072r119K4715K4906K960J375p774k6049M780J1715q704
$$ -10251 5932 760 -25312 -34431 -9716 15190 18150 19525 11751 -14298 -9518 2197 -6507
15158f507L048R728p730j2098l1117n791K0807K9087J2274o777j9169l9112n274
$$ -6507 -3459 6269 -1461 -13559 -44676 -50467 -29660 -573 11701 4924 -14245 -53357 -58631
15145e8631K3108J7857N751m823p585K1371R425J096k1517k0030j947K7824L876
$$ -58631 -35523 -17666 -11915 -16738 -24323 -2952 6473 7569 -13948 -33978 -35925 -8101 -4225
15132d225r657L654J0810N486R07j5038l645Q228k641n57p2j240L566J556J3726
$$ -4225 -13882 -10228 582 6068 6975 -8063 -11708 -3480 -6121 -6678 -6750 -7990 -4424 -2868 10858
15117A0858K4187n235j15p650k8431j3288K3363j7336L576Q172K0572K7012Q492
$$ 10858 35045 29810 29695 22045 -6386 -19674 3689 -13647 -10071 -1899 18673 45685 54177
15104E4177n925k2223r510r057o869J2716K223n917j2958l231k314M025O075O509
$$ 54177 48252 26029 16519 7462 593 13309 15532 9615 -3343 -6574 -8888 -4863 1212 7721
15090G721o728j1028p558J932K5766K4296k2599k1610q266r315m059K332P188
$$ 7721 993 -10035 -17593 -15661 10105 34401 11802 -9808 -18074 -27389 -31448 -29116 -21928
15077b1928J6901Q678J405J4890Q643l4454j6040J030P130K882K291m455o948
$$ -21928 -5027 3651 5056 19946 28589 -5865 -21905 -20875 -13745 -10863 -8572 -13027 -19975
15064a9975J2798J9017J8380l178k3080K445l327l744j1239Q187J1143j23P686
$$ -19975 -7177 11840 30220 27042 3962 6407 3080 -664 -11903 -3716 7427 7304 14990
15051A4990r341l649N353k53o981K905k207j7383k397J0048P642m191l886P622
$$ 14990 5649 2000 7353 7100 119 3024 817 -16566 -18963 -8915 -1273 -5464 -9350 -1728
15037a728n487j3683n51Q217J4546k3726j2625J7009J2835m212Q384J0566P948
$$ -1728 -7215 -20898 -21449 -13232 1314 -22412 -35037 -18028 -5193 -9405 -1021 9545 17493
15024A7493P337L145O607j4883P528r314j1488j2429J2615K3940j0112k6821j5189
$$ 17493 24830 27975 34582 19699 27227 17913 6425 -6004 6611 30551 20439 -6382 -21571
15011b1571k210K805M441Q598J1068j940j1960o183J6523J2116M159j1993j6084
$$ -21571 -23781 -20976 -16535 -7937 3131 1191 -10769 -16952 -429 11687 15846 3853 -12231
14998a2231k173m011o764L1999Q063p834n942k068J7712K169j4444J5543Q926
$$ -12231 -14404 -18415 -25179 6820 14883 7049 1107 -961 16751 18920 4476 20019 28945
14985B8945o032l297l238m816k160k3905K987Q734n801o633j7092K7676K7847
$$ 28945 22913 19616 16378 11562 9402 -14503 -11516 -2782 -8583 -15216 -32308 -4632 23215
14972B3215n502M775j3138j5432p974J8481J7703n572m684q286M823n147n874
$$ 23215 17713 22488 9350 -6082 -14056 4425 22128 16556 11872 3586 8409 3262 -2612
14959b612m808m927O409R870J0675j6174k627K0637R567K960q931r468n779m308
$$ -2612 -7420 -12347 -5938 3932 14607 -1567 -4194 16443 26010 28970 20039 10571 4792 484
14945D84n343K409j61N75k439O054O59n399j5939p602m231J2249J945J1558N598
$$ 484 -4859 -2450 -2611 -2036 -4475 1579 2238 -3161 -19100 -26702 -30933 -18684 -16739 -5181 417
14930D17m325N589j3156p996J9601J4223k879n286j1248k2585r770N134J8836
$$ 417 -3908 1681 -11475 -19471 130 14353 11474 6188 -5060 -27645 -37415 -32281 -13445
14917a3445L289K283l975o05N17r142P786J3739J993k720r48J4916L057J0754
$$ -13445 -10156 -7873 -11848 -12453 -11936 -21078 -13292 447 2440 -280 -1228 13688 16745 27499
14903B7499Q886p427j1964J682K528J741J3943l5531j5601J3913K0623N031j445
$$ 27499 36385 28958 16994 18676 21204 22945 36888 1357 -14244 -331 20292 25323 23878
14890B3878r478l771l0726l640P929J339R892M181J7528l313O706P740j4366k4649
$$ 23878 14400 10629 -20097 -23737 -15808 -14469 -4577 -396 17132 13819 20525 28265 13899 -10750
14876a0750j6503J6540j279j1207K816M098M285R021J3669j8952J484P238j0882
$$ -10750 -27253 -10713 -11992 -23199 -20383 -16285 -12000 -2979 10690 -8262 -6778 460 -10422
14863a0422K174K2211m258p289J351J1413j2147M976J4630n798l8J810j181M822
$$ -10422 -8248 13963 9705 2416 3767 15180 3033 8009 22639 16841 16803 18613 17432 22254
14849B2254o374O293R413K643r084m588L528M793j8072k1718P571J7748J9209
$$ 22254 15880 22173 31586 34229 25145 20557 24085 28878 10806 -10912 -3341 14407 33616
14836C3616J0603M477j20J6985K5599K1891K4530J1610J6050K1988J6408k520
$$ 33616 44219 48696 48576 65561 91160 113051 137581 149191 165241 187229 203637 201117
14824B01117p348J4763J8357R493p699k6964m9765j2832k3783l0517l125j0440
$$ 201117 193769 208532 226889 236382 228683 201719 151954 139122 115339 84822 81697 71257
14812G1257J053J138j6249k2175J5479J692N451q010k3348k2728k295k298M635
$$ 71257 72310 73448 57199 35024 50503 52195 57646 49636 26288 3560 1265 -1033 3602
14799C602L609J7317j4719j3344Q704K7701K0071q805j8415j3324n747L065j1218
$$ 3602 7211 24528 9809 -3535 5169 32870 52941 44136 25721 12397 6650 9715 -1503
14786a503J05J448J1269j8875m5N16P99p424n223N395K4573J0015q942m519J127
$$ -1503 -1398 50 11319 -7556 -7601 -7085 -6286 -13710 -18933 -13538 11035 21050 12108 7589 8716
14771H716P84o969L687m381l27K115J3465q472o521l860k541O467P776J2240L848
$$ 8716 9500 2531 6218 1837 1510 3625 17090 8618 2097 -1763 -4304 2163 9939 22179 26027
14756B6027k820R438p715j0148p751L755l349K348J0592L464M344j0291j5832
$$ 26027 23207 32645 24930 14782 7031 10786 7437 9785 20377 23841 28185 17894 2062
14743B062o726P309l649J5860l109nk684o383r511J9903K3305l564j9010k1931
$$ 2062 -4664 2645 -1004 14856 11747 11742 9058 2675 -6836 13067 36372 32808 13798 -8133
14729h133K1205K0384l612l244j5614q262q056P859O773j3084r488J9051n945
$$ -8133 13072 33456 29844 26600 10986 2724 -5332 2527 9300 -3784 -13272 5779 -166
14716a66j818J10N492J4540q299Q015j3261J2243J7462k5201p600K84J884J5757
$$ -166 -1984 -1874 3618 18158 9859 17874 4613 16856 34318 9117 1517 1801 3685 19442
14702A9442K379p593j5750o643K0537K46j0109l452j162P229J5269j2453n62j3908
$$ 19442 21821 14228 -1522 -8165 12372 12618 2509 -943 -2105 5124 20393 7940 7378 -6530
14688f530j1117p86J5986J0932N751k217J6742j513k5116J868Q565O64M111j0310
$$ -6530 -17647 -18433 -2447 8485 14236 12019 28761 27248 2132 4000 12565 13229 17340 7030
14674G030j0754j3204q872L963j1133J4953O342p543P897O314j2202q854j332
$$ 7030 -3724 -16928 -25800 -21837 -32970 -18017 -11675 -19218 -11321 -5007 -17209 -26063 -27395
14661b7395k0490J3603l305j557J95K0670P684l874O54O981m387n453k220J5518
$$ -27395 -47885 -34282 -37587 -39144 -38949 -18279 -10595 -14469 -13815 -6834 -11221 -16674 -18894 -3376
14647c376L0056l437j6818j1535j0515j0830j180j0546M1J5770k143J3777J0463
$$ -3376 26680 23243 6425 -5110 -15625 -26455 -27635 -38181 -38140 -22370 -24513 -10736 -273
14634b73O278K4377j454n48K992j519j0776q632j3055j558J590Q377J214n674
$$ -273 6005 30382 28928 28380 31372 29853 19077 10445 -2610 -4168 -2578 5799 7013 1339
14620A339r261K900q425q083J1812p458O397o933m287K409n44P05k389J0153k91
$$ 1339 -7922 -5022 -13447 -21530 -9718 -17176 -10779 -17712 -21999 -19590 -20134 -19429 -21818 -11665 -11956
14605a1956Q497j677j1962m286J2823K7470J7772K407o185r348j3103J4700p286
$$ -11956 -3459 -5136 -17098 -21384 -8561 18909 36681 39088 32903 23555 10452 25152 17866
14592A7866p283L861L658P640k331j6732k944O220J7108L113k4207Q744j5647
$$ 17866 10583 14444 18102 25742 23411 6679 3735 9955 27063 30176 5969 14713 -934
14579i34l166J906r310O840J1399P307R201J7356J6142J4579j2852m312m006r240
$$ -934 -4100 -2194 -11504 -4664 6735 14042 23243 40599 56741 71320 58468 54156 50150 40910
14565D0910r982j2034j9293K862J0818J3975r706j4772K2844J2664p718n575K04
$$ 40910 30928 18894 -399 2463 13281 27256 17550 2778 25622 38286 30568 24993 25197
14552B5197J454k42k293j0138p213J910k7715k1105J3798M4535K7587j1588j5754
$$ 25197 26651 26409 24116 13978 6765 8675 -19040 -40145 -26347 18188 45775 34187 18433
14539A8433J2589J1378m078k3240O401j1212j2117L44m992j4238N920q714J783
$$ 18433 31022 42400 38322 15082 21483 10271 -1846 -1502 -6494 -20732 -14812 -23526 -21743
14526b1743Q167J6917J1690j756j0593q673K747k264n506P981Q490N507K212k1090
$$ -21743 -13576 3341 15031 13275 2682 -5991 -3244 -5508 -11014 -3033 5457 10964 13176 -7914
14512g914n576R177L246l242j197O960J1282R512p393k3285M867K0432J3785N566
$$ -7914 -13490 -4313 -1067 -4309 -5506 1454 12736 22248 14855 -8430 -3563 16869 30654 36220
14498C6220j1869l2712k4328M393K4218q76j1897o233P131M420J0249p365J010
$$ 36220 24351 -8361 -32689 -28296 -4078 -4954 -16851 -23084 -15953 -11533 -1284 -8649 -7639
14485g639J1472Q044p585o921Q300R662j065q037J7868P534j4206n663J9367j7795
$$ -7639 3833 11877 4292 -2629 5671 15333 14268 6231 24099 31633 17427 11764 31131 13336
14471A3336j5535P470M659N764J672j619J050Q236L733k0827j9834l224J544k902
$$ 13336 -2199 5271 9930 15694 17366 15747 16797 25033 28766 7939 -11895 -15119 -13575 -16477
14457a6477j99N560q275J0942M61K0139K4625j435P559M724j4245j8288k1999
$$ -16477 -16676 -11116 -19391 -8449 -7988 12151 36776 35341 42900 47624 33379 15091 -6908
14444f908q53M164J7587p871j6334k573O300j8303m931J0556J7046J6160j643
$$ -6908 -7761 -3597 13990 6119 -10215 -12788 -6488 -24791 -29722 -19166 -2120 14040 12397
14431A2397j8672P243J8802j2066k1506M517P130J2125j7326m70K1797J1410l971
$$ 12397 -6275 968 19770 7704 -13802 -9285 -2155 9970 -7356 -7826 13971 25381 21410
14418B1410j3670j1308j329N715N200O399o37r618r237J0729j1475k412j2337
$$ 21410 7740 -3568 -4897 818 6018 12417 11780 2162 -7075 3654 -7821 -10233 -22570
14405b2570j2237J3047J2716j1825J1657J0756J0712M828k617Q500j2066k4470
$$ -22570 -34807 -21760 -9044 -20869 -9212 1544 12256 17084 14467 22967 10901 -13569
14393a3569j1608J1238k120J6145P425n538k592J1342k144P506N33j4401m799
$$ -13569 -25177 -13939 -16059 86 7511 1973 -619 10723 8579 16085 16618 2217 -2582
14380b582l48R287J5815o714j391J0352j586j0292j1616j695j0944O045R28M360
$$ -2582 -2930 6357 22172 15458 14067 24419 22833 12541 925 -770 -11714 -5669 -4741 -381
14366c81J5362j302j5537K281J808J2624M022j7192j1622Q732M111n600J2889
$$ -381 14981 13679 -1858 423 2231 14855 18877 1685 -9937 -1205 2906 -2694 10195
14353A0195j2956j2J1191j7526r092J4918J7457j7240j2130l221J4769J4938j5363
$$ 10195 -2761 -2773 8418 -9108 -18200 -3282 14175 -3065 -15195 -18416 -3647 11291 -4072
14340d072j1483J6006J2050J3715O221q41j0921j9313L556J0204q532l410J5477
$$ -4072 -15555 451 12501 26216 32437 31596 20675 1362 4918 15122 6590 3180 18657
14327A8657K462j1360m864L156J1790j264m962l918j7493o144l454J5106J3399
$$ 18657 21119 9759 4895 8051 19841 18577 13615 9697 -7796 -13940 -17394 -2288 11111
14314A1111J934j799J2950j880j0218j971J2088L910n812R383j1230k5055j121
$$ 11111 13045 11246 24196 22316 12098 10127 22215 26125 20313 29696 18466 -6589 -7710
14301g710J4775J5391N184k1383l109j4957n729P697J9050M372O649l564q961
$$ -7710 7065 22456 27640 6257 3148 -11809 -17538 -9841 9209 13581 20230 16666 7705
14288G705r31J6712p803j5882l036j5249m122K734n923k274j0798j234J9098J6538
$$ 7705 6774 23486 15683 -199 -3235 -18484 -22606 -19872 -25795 -28069 -38867 -40101 -21003 -4465
14274d465Q443J5924R36k3859M623J0879Q428N401N401L322n616j0372J764j0773
$$ -4465 3978 19902 20838 -3021 1602 12481 20909 26310 31711 35033 29417 19045 20809 10036
14260A0036k212j1499j2152J0526j0241o512M148Q601O699M645K489o40K035J831
$$ 10036 7824 -3675 -15827 -5301 -15542 -22054 -17906 -9305 -2606 2039 4528 3888 5923 7754
14246G754J676j0502m963j5355o585J9944O731K053J694J7203j1431j8917j3366
$$ 7754 9430 -1072 -6035 -21390 -27975 -8031 -1300 753 2447 19650 8219 -10698 -24064
14233b4064L687J1856j2039M408J4941Q693Q762l191M793k0366k5736o287R272
$$ -24064 -20377 -8521 -20560 -16152 -1211 7482 16244 13053 17846 -2520 -28256 -34543 -25271
14220b5271J5578J4192L088M219j0855J441k887M26L221p303K105L586O290m771
$$ -25271 -9693 4499 7587 11806 951 2392 -495 -69 3152 -4151 -2046 1540 7830 3059
14206C059O13p47j0818m253N950p094n503N856k327J960N883J7252m045j5187
$$ 3059 3672 2925 -7893 -12146 -6196 -13290 -18793 -12937 -15264 -13304 -7421 9831 5786 -9401
14192i401J0990R472J7919j0932j2974N742J0839Q97P412K773m149n299j3442
$$ -9401 1589 11061 28980 18048 5074 10816 21655 22552 29964 32737 28588 23289 9847
14179I847j1847O795O130k752K576n648j5093L94J3828K299j1817J010l255k8518
$$ 9847 -2000 4795 10925 8173 10749 5101 -9992 -9598 4230 6529 -5288 -4278 -7533 -36051
14165c6051J4080J058K227N860J151J0797j4230r600m61J6578O977l118Q577o158
$$ -36051 -21971 -20913 -18686 -12826 -11675 -878 -15108 -24708 -25169 -8591 -1614 -4732 3845 -2313
14151b313r379M184J1914N619k3782q223J0693J5086j4320J123O213j2236L074
$$ -2313 -11692 -7508 4406 10025 -13757 -21980 -11287 3799 -10521 -9398 -3185 -15421 -12347
14138a2347L468M601j2071Q538j2492o661K0260J946q259j3672Q955R554J2422
$$ -12347 -8879 -4278 -16349 -7811 -20303 -26964 -6704 -4758 -13017 -26689 -17734 -8180 4242
14125D242P185O719R126j7150k5954L005Q078j5457n377K0795K6049Q461j4439
$$ 4242 11427 18146 27272 10122 -15832 -12827 -4749 -20206 -25583 -4788 21261 29722 15283
14112A5283k0800l238J3386Q864J0865K4567J3558k1492r702j5511O5m385j25
$$ 15283 -5517 -8755 4631 13495 24360 48927 62485 40993 31291 15780 15845 11460 11335
14099A1335q182J1290J1561J200o07P81k3093j0214k6642J6752K128m099j766
$$ 11335 3153 14443 26004 27204 26597 27378 4285 -5929 -32571 -15819 -13691 -17790 -19556
14086a9556K151K20K809J736L838Q960p144r52O969K6919j3678k2305j0951J2605
$$ -19556 -17405 -17185 -14376 -12640 -8802 158 -6986 -7938 -969 25950 12272 -10033 -20984 -8379
14072h379J5774J9651j3391j9942R626M722R900J3761j2987k335R974j1741j0504
$$ -8379 7395 27046 13655 -6287 3339 8061 17961 31722 18735 16400 26374 14633 4129
14059D129j4787J2876J4346O696R830M611p962m255N887J1226J0258j8815k2108
$$ 4129 -10658 2218 16564 23260 33090 37701 29739 25484 31371 42597 52855 34040 11932
14046A1932L767j241j7471p292m524J8822J2468k373K232j0696L015n151l2077
$$ 11932 15699 14458 -3013 -10305 -14829 3993 16461 14088 16320 5624 8639 3488 -28589
14033b8589J3977J9269J232O127O40j4811r189L276j2706m447Q444R527L276J1106
$$ -28589 -14612 4657 5889 12016 12656 -2155 -11344 -8068 -20774 -25221 -16777 -7250 -3974 7132
14019G132j6091j1534j9896Q871L4456J6551K867j1453k6887j7304J9888K6561
$$ 7132 -8959 -20493 -40389 -31518 2938 19489 22356 10903 -15984 -33288 -13400 13161
14007A3161J041J615j4120k317k88q613j0619k531j968p96J3844J8979j594q420
$$ 13161 14202 15817 1697 -620 -908 -9521 -20140 -22671 -24639 -25435 -11591 7388 5794 -2626
13993b626P284J6050P013k3491k64j2247N9R047K111j4198K6615J5665O202j7904
$$ -2626 4658 20708 27721 4230 3966 -8281 -8222 825 2936 -11262 15353 31018 37220 19316
13979A9316j8940q571J0001K9031J5094q695j1242j9884n292o437j682k171J0790
$$ 19316 376 -8195 1806 30837 45931 37236 25994 6110 818 -5619 -7301 -9472 1318
13966A318m88k0911j4756n233P84N124L877J2874R19K1577J5028Q959M502o158
$$ 1318 830 -20081 -34837 -40070 -39286 -34162 -30285 -17411 -16492 5085 20113 29072 33574 27416
13952B7416j414O365k0568k231L422J3167p021n818p04j0428j4029j10J0580L642
$$ 27416 26002 32367 11799 9568 12990 26157 19136 13318 12614 2186 -11843 -11953 -1373 2269
13938B269l545j0407j0228R38R104j378P093J8019J259M577J1861k814k713Q651
$$ 2269 -1276 -11683 -21911 -20973 -11869 -13247 -6154 11865 13124 17701 29562 26748 24035 32686
13924C2686j7734j5427j358N198j293J2379J0766J5622j7934k4556R418m923j4793
$$ 32686 14952 -475 -1833 3365 2072 14451 25217 40839 22905 -1651 7767 2844 -11949
13911a1949r718J0208q52Q55J3543J446o093Q206q116M651J1350M245J1337o334
$$ -11949 -21667 -11459 -12311 -11456 2087 3533 -2560 5646 -2470 2181 13531 17776 29113 22779
13897B2779J0876Q908j5684l820n784M587k577k0274p264K3168J8974n751k3882
$$ 22779 33655 42563 26879 23059 17275 21862 19285 -989 -8253 14915 33889 28138 4256
13884D256j6418j078J4880K2145J7109p230k1348k1057j5125M550K3539J010j6702
$$ 4256 -12162 -13240 1640 23785 40894 33664 12316 -8741 -23866 -19316 4223 5233 -11469
13871a1469j528J3058P343J2526k261l1372j0980O96J9023K0732M24j3431j288
$$ -11469 -12997 61 7404 19930 17669 -13703 -24683 -23987 -4964 15768 16192 2761 1473
13858A473n71K877J453J12O057n00l645l371J2961J6977j392o935N27n39J304
$$ 1473 902 3779 5232 5344 11401 10901 7256 3885 16846 33823 32431 25496 26023 25484 26788
13843B6788j021j4779m732J1592j9391j0482K819j3390L002M315J1801R056n16
$$ 26788 25767 10988 6256 17848 -1543 -12025 -9206 -22596 -19594 -15279 -3478 5578 5062
13830E062j1822P406P892l4219k168J9739r94k4981k9309J1907L9407K1220J366
$$ 5062 -6760 646 8538 -25681 -27849 -8110 -9104 -34085 -63394 -51487 -12080 9140 10506
13817A0506j7612n8p869P436J1741l349K1503R396n868j1758o354j2582K0677
$$ 10506 -7106 -7164 -15033 -7597 4144 795 22298 31694 25826 14068 7714 -4868 15809
13804A5809J7176K41n948l117J738Q503j692j0545j8747l172J127K3643J1048
$$ 15809 32985 33226 27278 24161 25899 34402 32710 22165 3418 246 1373 25016 36064
13791C6064l657j2033k3007n405p528N900K033J0348m403L015K0980q214j7664
$$ 36064 32407 20374 -2633 -8038 -15566 -9666 -7633 2715 -1688 1327 22307 14093 -3571
13778c571M369N170N2j090K340p347K0418J1557J014j6649r398J3624J3120r947
$$ -3571 798 5968 6020 4930 7270 -77 20341 31898 32912 16263 6865 20489 33609 23662
13764B3662j6385j2310j1964j769O292P511n148K83K0776J5852J3229j804j6628
$$ 23662 7277 -5033 -16997 -18766 -12474 -4963 -10111 -9828 10948 26800 40029 38225 21597
13751B1597m1576q856K1425L174O186J2187k075N814q77j6514L96J4212n467q437
$$ 21597 -19979 -28835 -7410 -4236 1950 14137 12062 17876 16999 485 881 15093 9626 1189
13737A189Q135J0758J381r918j650n701k92O170j0192n889K265O160J271R846
$$ 1189 9324 20082 21463 11545 9895 4194 3902 10072 -120 -6009 -3744 2416 3687 13533
13723A3533Q233o822p102O767n771j1651j3133q927P623J1319p01q621j3362k202
$$ 13533 21766 14944 7842 14609 8838 -2813 -15946 -24873 -17250 -5931 -6632 -15253 -28615 -30817
13709c0817K2747K1950O622k2554m878m215j1754J618K019J468J1885o33j1113
$$ -30817 -8070 13880 20502 -2052 -6930 -11145 -22899 -21281 -19262 -17794 -5909 -6542 -17655
13696a7655j1663R525K0782Q996J4108o583r137M424k425p032j1514J6544l836
$$ -17655 -29318 -19793 989 9985 24093 17510 8373 12797 10372 3340 -8174 8370 4534
13683D534j4197k1385p070K325J2305l38k0838J131K3502K190j821J6267N264
$$ 4534 -9663 -31048 -38118 -35793 -23488 -23826 -44664 -43533 -20031 -17841 -19662 -3395 1869
13670A869O55J9244J3450J1663j0663R57q025j285O707j1768p184m267j869R135
$$ 1869 2524 21768 35218 46881 36218 37175 29150 27865 34572 22804 15620 11353 9484 18619
13656A8619n012r277j1612o935j5611K7030l409j7503L889L999J048j667P025
$$ 18619 13607 4330 -7282 -14217 -29828 -2798 -6207 -23710 -19821 -15822 -14774 -16441 -9416
13643i416L914J6985j730m38n424j4781j8621o346J7667J3696p056O889p552M074
$$ -9416 -5502 11483 9753 9315 3891 -10890 -29511 -35857 -18190 -4494 -11550 -4661 -12213 -8139
13629h139K590K0381O374m713K1022J2602j8902o927P156m394j3161Q65P325m529
$$ -8139 -5549 14832 21206 16493 37515 50117 31215 24288 31444 27050 13889 14754 22079 17550
13615A7550q347J9711k42k5278j1643M46L253J709n512J515J0357q467r673J6155
$$ 17550 9203 28914 28672 3394 -8249 -7803 -4550 -2841 -8353 -6838 3519 -4948 -14621 1534
13601A534l952j5397L4424L1515K6080m76j206k062n66j5279k0311j8355J7398
$$ 1534 -2418 -17815 16609 48124 74204 73728 72522 70460 69894 54615 34304 15949 33347
13588C3347J482k0000Q16O982j1631k1995J1450J454j8143p194n80J7360J6904
$$ 33347 34829 14829 15645 22627 10996 -10999 451 1905 -16238 -23432 -24012 -6652 10252
13575A0252K5379l018n581J902R646J255j036j4085N263o816q847j5368j0030
$$ 10252 35631 32613 27032 28934 38580 39835 38799 24714 29977 23161 14314 -1054 -11084
13562a1084L214n621m80M478o441k002J2543L9563L736j8993M718N078k9958k3470
$$ -11084 -7870 -13491 -13971 -9493 -15934 -17936 -5393 34170 37906 18913 23631 28709 -1249 -24719
13548b4719K1228O981J9181M4318R703k6473k5828l886O350o27J5799J2897L087
$$ -24719 -3491 3490 22671 66989 76692 50219 24391 20505 26855 26228 42027 54924 58011
13535E8011l0415r13P583q767j331L942J0722q937P249K650r302l7137n785M331
$$ 58011 27596 26683 34266 25499 24168 28110 38832 29895 37144 39794 30492 -6645 -12430 -8099
13521h099J196k443J5086K0907K530p838o915J9127j627j2920P90l663j5210j883
$$ -8099 -6903 -9346 5740 26647 29177 21339 14424 33551 31924 19004 19794 16131 921 -962
13507i62J5860K458p987J7461J5019q085R571M999O793l829r990m627J8850J3256
$$ -962 14898 17356 9369 26830 41849 33764 43335 48334 55127 51298 41308 36681 55531 68787
13493F8787r527p926l576p652J9342Q00q166q586R600J3918j2181j3403j2838
$$ 68787 59260 51334 47758 40106 59448 60248 52082 43496 53096 67014 54833 41430 28592
13480B8592l695K0347p214j3930J4170m07R022J95l057j4887j0194J6113J6632
$$ 28592 24897 45244 38030 24100 38270 37863 46885 47080 44023 29136 18942 35055 51687
13467E1687k959l0965K343K2673J7821n050M306k0535l6615m457P248J0397J6797
$$ 51687 48728 17763 20106 42779 60600 55550 59856 39321 2706 -1751 5497 15894 32691
13454C2691L4172M910l0365l692Q206k323j0889j8825n777j3771k213K4236Q675
$$ 32691 66863 71773 41408 37716 45922 43599 32710 13885 8108 -5663 -7876 16360 25035
13441B5035J1617J2638o033j590O667K1249p153j1455p492m365r146P408Q836
$$ 25035 36652 49290 43257 41667 48334 69583 62430 50975 43483 39118 29972 37380 46216
13428D6216j111j2245j0039j801K7519N476k718Q6P204k276j4874K922r066j0659
$$ 46216 45105 32860 22821 21020 48539 54015 51297 51383 58587 56311 41437 44359 35293 24634
13414B4634Q341L113K7202M439k8771k6691L246K5697j1646r13J2471J274m298
$$ 24634 32975 36088 63290 67729 38958 12267 15513 41210 29564 28651 41122 42396 38098
13401C8098j4446J6504p543l710m680O089K870M88o518L039J2242q56J3591N675
$$ 38098 23652 40156 32613 28903 24223 30312 33182 33670 27152 30191 42433 41577 55168 60843
13387F0843l837j6185K458K970R521J963j3593j1299J2727R184j1770Q131j2011
$$ 60843 57006 40821 43279 46249 55770 57733 44140 32841 45568 54752 42982 51113 39102
13374C9102j1804L618n545Q378K0575Q446k6445k069R531m1374j0190J5100J364
$$ 39102 27298 30916 25371 33749 54324 62770 36325 34256 43787 2413 -7777 7323 8687
13361H687J8904K3282M067l2004n656J2462L0568J7500j1259j1352o621K7521
$$ 8687 27591 50873 54940 22936 17280 29742 60310 77810 66551 55199 48578 76099
13349G6099o026L141j5572j8049k220k153j3853o606K2069R961j6484k1305L167
$$ 76099 70073 73214 57642 39593 37373 35220 21367 14761 36830 46791 30307 9002 12169
13336A2169R58k521L277J6999N822j9072j4814J3800R667o518P321j356Q45Q896
$$ 12169 13127 10606 13883 30882 36704 17632 2818 16618 26285 19767 27088 25732 26577 35473
13322C5473J5443J293l961J6818l076k9909q564q427m160J9570J2088J4236J3491
$$ 35473 50916 52209 48248 65066 61990 32081 23517 15090 10930 30500 42588 56824 70315
13309G0315J5904r942l1223J2022R278j0685k8742N594K0845K1534l604p893J0314
$$ 70315 86219 76277 45054 57076 66354 55669 26927 32521 53366 74900 71296 63403 73717
13296G3717q785j0156O74J16p222K5851K4785m294l986j2169P55j2388j4980K886
$$ 73717 64932 54776 55450 55566 48344 74195 98980 94686 90700 78531 79286 66898 51918 54804
13282E4804j1320M850N473O834R798J0864j7630k166n341N98j420j2277j8253
$$ 54804 43484 48334 53807 60641 70439 81303 63673 61507 56166 56764 55344 43067 24814
13269B4814r971m684J8038J4588J2928K5104m0j5918k3101l668Q928J1643r946
$$ 24814 14843 10159 28197 42785 55713 80817 80777 64859 41758 38090 47018 58661 48715
13256D8715k640O985m709Q323J7634k857j5312l716J136j2079J781J333n868Q485
$$ 48715 46075 53060 48351 56674 74308 71451 56139 52423 53559 41480 43261 44594 38726 47211
13242D7211O803K45k522J2411Q383L105L31k4367N489J3758j910j42K0132p614
$$ 47211 54014 54259 51737 64148 72531 75636 75967 51600 57089 70847 68937 68795 88927 81313
13228H1313j5517K7010Q43j7333j5524k878R989K816j2140j6703j953K3818K9317
$$ 81313 65796 92806 93649 76316 60792 57914 67903 70719 58579 41876 39923 63741 93058
13215I3058N574k072j4108q827j5988m752L570L026P807O962J0790o914j062j6195
$$ 93058 98632 96560 82452 73625 57637 52885 56455 59481 67288 74250 85040 78126 77064 60869
13201F0869O722j0960j9280m678J1622m772N182Q566R686l67k064j175Q708P803
$$ 60869 67591 56631 37351 32673 44295 39523 44705 53271 62957 62590 60526 59351 68059 75862
13187G5862N440P124k6680j6431R932K9287L0811J5400P490R916R129l063j4964
$$ 75862 81302 88426 61746 45315 55247 84534 115345 130745 138235 148151 157280 154217 139253
13174A39253l717j0069K3081Q876L025K7051J9658K70K4556K9093L0950K3643
$$ 139253 135536 125467 148548 157424 160449 187500 207158 207428 231984 261077 292027 315670
13162C15670K7875L8800P2132J07510J68400K65742L95245M35711L76300K56023
$$ 315670 343545 382345 454477 561987 730387 996129 1391374 1827085 2203385 2459408
13152B459408J18365M4213p3715k39424l67627k82297q3978J06083K92814N88611
$$ 2459408 2577773 2621986 2548271 2308847 1941220 1658923 1574945 1681028 1973842 2562453
13142B562453J087999J778060K042201J156848K28397J47876J58110o39500k152325
$$ 2562453 3650452 5428512 7470713 8627561 8855958 9003834 9161944 8522444 6370119
13133F370119k125604j237983o83446l99600k86909k12724j42524j11378j02418
$$ 6370119 4244515 3006532 2323086 1923486 1636577 1423853 1281329 1169951 1067533
13124A067533q2572o2781m3017l1826l6382l8575l5794k0197k3179k0122l4191
$$ 1067533 984961 922180 879163 847337 810955 772380 736586 716389 693210 673088 638897
13113F38897l4286l1936k2431j9147k8575p255k1006k7756k4217o327Q13k1005
$$ 638897 604611 572675 550244 531097 502522 495267 474261 446505 422288 415961 416774 395769
13101C95769j1732j4259Q42k4375p204j0966j6938N661k511j5567j6109O126L2990
$$ 395769 384037 369778 370620 346245 339041 328075 311137 316798 314287 298720 282611 288737 321727
13088C21727r324m2566m0849q158j6159J3967p324j0458o52p110p661q522o703
$$ 321727 312403 269837 228988 220830 204671 218638 211314 200856 200204 193094 185433 176911 170208
13075A70208n807l4639r287J0545K5476m272L396J5050Q303k447q662n945j1571
$$ 170208 164401 129762 120475 131020 156496 152224 155620 170670 178973 176526 167864 161919 150348
13062A50348P611L80J444l111j1302q579J0063q091P443j004O821l64J9732J5440
$$ 150348 157959 158339 159783 156672 145370 136791 146854 138763 146206 145202 152023 151659 171391 186831
13048A86831k7171j3858k0991j676j2060j1289R428j5460p138M44J5821p10k427
$$ 186831 159660 145802 124811 123135 111075 99786 109214 93754 86616 87060 102881 102171 99744
13035I9744k688P967Q038M948l532j4701m616J5121J4573J5365K4411k674J72
$$ 99744 97056 105023 113061 118009 114477 99776 95160 110281 124854 140219 164630 161956 162128
13022A62128l758o861j2499n122k740J7212o45K411j719q716k2761k7416j6032
$$ 162128 158370 151509 139010 133888 131148 148360 147715 150126 148407 139691 116930 89514 73482
13009G3482o945R908j687L129l280J8342j8061k1345P153J1701J257P264J3419
$$ 73482 66537 76445 74758 77887 74607 92949 74888 53543 60696 72397 73654 80918 94337
12996I4337L853L268R05p010j7709r783p00j7468J1028L934l953J9833Q68N770
$$ 94337 98190 101458 102363 95353 77644 67861 67161 49693 60721 64655 60702 80535 81403 87173
12982H7173J5753J4162R194K4224J2043N6K6096L7693L3598K6645L42k2659k3252
$$ 87173 102926 117088 126282 150506 162549 162605 188701 226394 259992 286637 286979 264320 241068
12969B41068j0336J5225Q308l4684n4718j0696m425j5876P445K1322L625r730
$$ 241068 230732 245957 254265 219581 164863 154167 149742 133866 141311 162633 166258 156528
12957A56528j8301Q935j4731k3620Q005J7467J5107j1894l0520j790l368j1998
$$ 156528 138227 147162 132431 108811 116816 134283 149390 137496 106976 105186 101818 89820
12945H9820k9199m0968k0630P20K7399M801k9156j3385O667J0487j6553n625k155
$$ 89820 60621 19653 -977 -257 27142 31943 2787 -10598 -3931 6556 -9997 -15622 -17777
12932a7777K5669J5604j6920k5975p580j8389J0102p488l8916l8003k8011m0554
$$ -17777 7892 23496 6576 -19399 -26979 -45368 -35266 -42754 -81670 -119673 -147684 -188238
12920a88238m336k6864m5222m6836m1939l5705o4079j01757j37376j61860j95798
$$ -188238 -192574 -219438 -264660 -311496 -353435 -389140 -453219 -554976 -692352 -854212 -1050010
12909a050010j57612k7841J19551J89812K09667K59266L48721L36335K03858O1179
$$ -1050010 -1207622 -1235463 -1115912 -926100 -716433 -457167 -108446 227889 431747 492926
12899D92926j3178j4357j6781j8949j73j1191p432N339J246n374j8328j3914p688
$$ 492926 479748 465391 448610 429661 429488 418297 410865 416204 417450 412076 393748 379834 372146
12886C72146p749q709k3025K289J761j2361p588P778Q838K1027Q957j2382N015
$$ 372146 364397 355688 332663 334952 336713 324352 316764 324542 333380 354407 363364 350982 355997
12873C55997j4491q86K421J4756j781j4124n951p595O153J1133K8071J4713P919
$$ 355997 341506 340620 343041 357797 356016 341892 335941 328346 334499 345632 373703 388416 396335
12860C96335m752J2763K4952K6159K6233R418K679J9086L1488M2671L8559M7649
$$ 396335 391583 404346 429298 455457 481690 491108 493787 512873 544361 587032 625591 673240
12848F73240J4829n993m2662o4092o5972k3548K4386R933j2639l2545j2057J7248
$$ 673240 688069 682076 639414 575322 509350 485802 510188 520121 507482 474937 462880 480128
12836D80128M2294L1484M1602L5754L563J6075Q6k9218q630L882O481J2393K4306
$$ 480128 522422 553906 595508 631262 634825 650900 650986 621768 613138 617020 623501 635894 660200
12823F60200P456J4638m609o361k1268R52k1798k7481l274Q9M33m332j7516r884
$$ 660200 667656 682294 677685 671324 650056 651008 629210 601729 598455 598544 598977 594645 577129 567245
12809E67245r439q833j6582K690J5493K7832K3814J5570K7002K3059L0918L8583
$$ 567245 557806 548973 532391 535081 550574 578406 602220 617790 644792 667851 698769 737352
12797G37352K0933N765j6065j108k5361k8969o987l691J0453j1000p263r079M2422
$$ 737352 758285 764050 747985 746877 721516 692547 685560 681869 692322 681322 674059 664980 707402
12784G07402N3341N6741L8290L4327N3267N2729O6178L4252L4559K6801K0810
$$ 707402 760743 817484 855774 890101 943368 996097 1062275 1096527 1131086 1157887 1178697
12773A178697J3380P723Q0Q267O131l063O879N9966Q4958R9041J08447J29728
$$ 1178697 1192077 1199800 1199880 1208147 1214278 1211215 1218094 1278060 1363018 1462059 1570506 1700234
12761A700234J62291J82433J33240R6148J03953O6369O9237M0251L3009O0183
$$ 1700234 1862525 2044958 2178198 2274346 2378299 2444668 2513905 2554156 2587165 2647348
12751B647348R3692J22827J34355J49003J90545K36012K98915L15879L49936L86455
$$ 2647348 2741040 2863867 2998222 3147225 3337770 3573782 3872697 4188576 4538512 4924967
12741D924967M57763N13930N76905O73213P93766R18677J060009J229098J446491
$$ 4924967 5382730 5896660 6473565 7146778 7940544 8859221 9919230 11148328 12594819
12732A2594819J847135K393425L007642L616287M284975N223853O693845R122281
$$ 12594819 14441954 16835379 19843021 23459308 27744283 32968136 39661981 48784262
12724D8784262J3307221K0873568L4956741N7731596P9554088P9217448N3769692
$$ 48784262 62091483 82965051 117921792 175653388 255207476 334424924 388194616
12717C88194616K4018803Q444640n274958l9628401p5673097q6447644o5078179
$$ 388194616 412213419 420658059 415383101 375754700 300081603 213633959 148555780
12710A48555780l7699146k1551656j3649545r669673p387680n998575n159901
$$ 148555780 110856634 89304978 75655433 65985760 58598080 52599505 47439604
12703D7439604m532285l762933k985938k361131j848651j411313j058965q61426
$$ 47439604 42907319 39144386 36158448 33797317 31948666 30537353 29478388 28616962
12695B8616962q09920r17263j059882j159530j245886j226451j111147r67642
$$ 28616962 27807042 26889779 25829897 24670367 23424481 22198030 21086883 20119241
12687B0119241q53322p69810p29173p06731o84957o61781o17855n74727n50806
$$ 20119241 19265919 18496109 17766936 17060205 16375248 15713467 15095612 14520885 13970079
12678A3970079n41664m99093m80108m67028m54948m02665l17523k88197k74096
$$ 13970079 13428415 12929322 12449214 11982186 11527238 11124573 10807050 10518853 10244757
12669A0244757k90530k73292k57469k85493l14687l36793l22481k78702k74131
$$ 10244757 9954227 9680935 9423466 9137973 8823286 8486493 8164012 7885310 7611179
12660G611179k61486k19348k02632k09679j82619j82361j66616j50168j45845
$$ 7611179 7349693 7130345 6927713 6718034 6535415 6353054 6186438 6036270 5890425
12651E890425j65946j49152j13113j02041j33219j46950j54020j12925j18075
$$ 5890425 5724479 5575327 5462214 5360173 5226954 5080004 4925984 4813059 4694984
12642D694984j18540j24374j24138j52584j63010j26921j00137j14042j20255
$$ 4694984 4576444 4452070 4327932 4175348 4012338 3885417 3785280 3671238 3550983
12633C550983q4267o6822n6012o4099n3341o6728p6227o9587q0791r5659p0888
$$ 3550983 3466716 3399894 3343882 3279783 3226442 3159714 3083487 3013900 2933109 2837450 2766562
12622B766562p2317p6192p0070o6631p7277o7903q3645p6269p2664n3407n8967
$$ 2766562 2694245 2618053 2547983 2481352 2404075 2336172 2252527 2176258 2103594 2050187 1991220
12611A991220o7158o0897m1587n2577l3922k4238k6541l7966j9480j7328l3602
$$ 1991220 1924062 1863165 1821578 1769001 1735079 1710841 1684300 1646334 1626854 1609526 1575924
12600A575924K7324M6157O8906J13600J22759J23232J28739O7559R108m4160o9863
$$ 1575924 1603248 1649405 1718311 1831911 1954670 2077902 2206641 2274200 2283308 2239148 2169285
12589B169285l5565O3480J83375L95936O83575R50773J039821Q35254M78265J71936
$$ 2169285 2133720 2197200 2380575 2776511 3460086 4410859 5450680 6285934 6764199 6936135
12579F936135j20784n19547r79404j190033j025060p10792m11130k37347j72003
$$ 6936135 6815351 6295804 5316400 4126367 3101307 2390515 1979385 1742038 1570035
12570A570035j35445j35732j10673p8378n2015m8912n5720n7496n2157n6563m7427
$$ 1570035 1434590 1298858 1188185 1109807 1057792 1008880 953160 895664 843507 786944 739517
12559G39517o3527n4197l5633k6533m5841l3950l3140j9538j7655k8286l4720
$$ 739517 675990 621793 586160 559627 513786 479836 446696 427158 409503 381217 346497
12548C46497j7948K33k6124l8542j7206k0561j5961K817l0278m2797p924K756
$$ 346497 328549 328782 302658 264116 246910 226349 210388 213205 182927 140130 132206 134962
12536A34962N336j6567m4382l9896L1049J40735K61692K81280K77406K42298K23710
$$ 134962 140298 123731 79349 39453 70502 211237 472929 754209 1031615 1273913 1497623
12525A497623J65015J1363j46681k19611j93790j29245n9652m9912m0632m1119
$$ 1497623 1662638 1674001 1527320 1307709 1113919 984674 925022 875110 834478 793359
12515G93359n6018m1634m1386k7399k7031j4571j4897l9679l3821k3376k5732
$$ 793359 737341 695707 654321 626922 599891 585320 570423 530744 496923 473547 447815
12504D47815j7418L825P576J3685j5273m937n700k55l709q053j1960k4436j5728
$$ 447815 430397 434222 441798 455483 440210 435273 429573 429318 425609 417556 405596 381160 365432
12491C65432J5200J7039j9359q297j1040k5580k8463k1240N222k852k3779k5201
$$ 365432 380632 397671 378312 370015 358975 333395 304932 283692 288914 286062 262283 237082
12479B37082L767O443j035o553k063o381k615n178N612R580J7647N372J8162j766
$$ 237082 240849 247292 246257 239704 237641 231260 228645 223467 229079 238659 256306 261678 279840 278074
12465B78074k8962j0365j7814j1821p676r654k5276Q259O321R392Q780q850K431
$$ 278074 249112 238747 220933 209112 201436 191782 166506 174765 181086 190478 199258 190408 192839
12452A92839r4k419O1L307J5299k1123k3885o656J1223j1399j2398j4799P556
$$ 192839 192745 190326 190387 193694 208993 187870 163985 157329 168552 157153 144755 129956 137512
12439A37512O866o717R787j4588j3583J316L109K0414P565J4097j3799M982j2045
$$ 137512 144378 137661 147448 132860 119277 120593 123702 144116 151681 165778 151979 156961 144916
12426A44916n429Q422j4887k4802j1744l075p605M075k8688k3509l368R583J515
$$ 144916 139487 147909 133022 108220 96476 93401 85796 89871 61183 37674 34306 43889 45404
12413D5404M813j125m115m352J8948K4443J9400K6956L2918L5236N7408R2850
$$ 45404 50217 49092 44977 40625 59573 84016 103416 130372 163290 198526 255934 348784
12401C48784R7250J15547J03366P1485J5150l4173n8865p2741r5679q9451o2561
$$ 348784 446034 561581 664947 736432 751582 717409 658544 585803 490124 400673 338112
12390C38112m0225l6020m8029l5403j8854K097q229l0098L18R043r698r128p482
$$ 338112 297887 261867 213838 178435 159581 161678 153449 123351 123669 132712 123014 113886 106404
12377A06404j1359j1540k209P48j844j3188j9032J3872N464J127k054J4134L613
$$ 106404 95045 83505 81296 82044 80200 67012 47980 61852 67316 68443 66389 80523 84136
12364H4136m244j4763q152j815j8269m066K2626J0139J252k465j7290k1633o048
$$ 84136 79892 65129 56977 55162 36893 32827 55453 65592 66844 64379 47089 25456 19408
12351A9408O179J616j500J0081p74K527K1255j5663Q791J8453j654n519l942r444
$$ 19408 25587 27203 25703 35784 35010 37537 58792 43129 51920 70373 68719 63200 59258 49814
12337D9814r108j856K1450J7696p086j4291n856o614j6473M69o087Q878J4480
$$ 49814 40706 38850 60300 77996 70910 56619 50763 44149 27676 28145 22058 30936 45416
12324D5416M350L391j3651N0r243p694J1743J3272P106n402N324J411l618j8353
$$ 45416 49766 53157 39506 39556 30313 22619 34362 47634 54740 49338 54662 56073 52455 34102
12310C4102j2137j7267r82J0125M06r08P543N629n919k4486Q915J0142l390N640
$$ 34102 21965 4698 3716 13841 14247 13339 20882 26511 20592 -3894 5021 15163 11773 17413
12296A7413q539p237K8538J9448j319K4463M447J8324J9232K7391J9120J7384
$$ 17413 8874 1637 30175 49623 48304 72767 77214 95538 114770 142161 161281 178665
12284A78665K3691J4264M1187J11633J68468K55951L76013M39184L36437J86997
$$ 178665 202356 216620 257807 369440 537908 793859 1169872 1609056 1945493 2132490
12274B132490Q2817p435j88410l63132m31583l52775k05495j30167r4758o4550
$$ 2132490 2215307 2207872 2019462 1656330 1224747 871972 666477 536310 441552 377002
12264C77002m8692m2153j2051l3340l3777j4768n028m852k1164k3271j889M299
$$ 377002 328310 286157 274106 240766 206989 192221 187193 182341 161177 137906 136017 140316
12252A40316k467k5529m871m492K1599P663L792M509k2058l5400j580O257R884
$$ 140316 137849 112320 107449 102957 124556 132219 136011 140520 118462 83062 81482 87739 97623
12239I7623R181j189j1304j6344j8941Q717q707J2381J9797M421n670j5010j277
$$ 97623 106804 105615 94311 77967 59026 67743 59036 71417 91214 95635 89965 74955 73678
12226G3678J2888m562K677k711k7183j0594J3090M341j5657J35N061J5231r508
$$ 73678 86566 82004 84681 81970 54787 44193 57283 61624 45967 46102 51163 66394 56886
12213E6886j7966j2488p824n211n191J6511L443j3443j2567K103J2490o907l781
$$ 56886 38920 26432 18608 13397 8206 24717 28160 14717 2150 4253 16743 9836 6055
12200F055n707N101O093J9189N876p950j2339k702j3550l703M064Q071N10R813
$$ 6055 348 5449 11542 30731 36607 28657 16318 13616 66 -3637 427 8498 9008 18821
12186A8821N864k1916j2153P915K0802l007n953J318M948j0012j0393K6944J9004
$$ 18821 24685 2769 -9384 -1469 19333 16326 10373 11691 16639 6627 -3766 23178 42182
12173D2182l77j3078r237k2854j1948k534K0859O639p089k265R59n687J7994J528
$$ 42182 41805 28727 19490 -3364 -15312 -17846 3013 9652 2563 298 1257 -4430 13564 15092
12159A5092j8117J1587j448k6766m71k168J3169J8130J5446N269M764j3632N687
$$ 15092 -3025 8562 7114 -19652 -20123 -22291 -9122 9008 24454 29723 34487 20855 26542
12146B6542J219J2653k678p671Q659N408j6863L441M33j3798r579m497L047n942
$$ 26542 27761 40414 37736 30065 38724 44132 27269 30710 31143 17345 7766 3269 6316 374
12132C74J0771M009p630J4269l214q316j0234O831M367j3557j3952K009j789j194
$$ 374 11145 15154 7524 21793 18579 10263 29 6860 11227 -2330 -16282 -14273 -16062 -17256
12118a7256O953L331R200r83m900J411O658j7695N521L611K0050j2243k3252q657
$$ -17256 -10303 -6972 2228 1245 -3655 -2244 4414 -13281 -7760 -4149 15901 3658 -19594 -28251
12104b8251R846L248J4352J698o649J1305j224j7423n31J6758k733q907L574O701
$$ -28251 -18405 -15157 -805 893 -5756 5549 4325 -13098 -13629 3129 396 -8511 -4937 1764
12090A764p947O728n622L366M669k580j7941l493r442j0515O918R82N940J7450
$$ 1764 -6183 545 -5077 -1711 2958 378 -17563 -21056 -30498 -41013 -34095 -33113 -27173 -9723
12076i723K1418J0713m731j5080J984K0139K4409P095j3150j3693j5973j5547
$$ -9723 11695 22408 17677 2597 4581 24720 49129 56224 43074 29381 13408 -2139
12064b139P749j080l369O26N834j2388j578j103p02p197J9014J4399j728o316
$$ -2139 5610 4530 1161 1787 7621 -4767 -6345 -7448 -8150 -15347 3667 18066 16338 10022
12050A0022n150N68m422j0992j3598l372j761j589m370M29R828L210R674j1025
$$ 10022 4872 5440 1018 -9974 -23572 -26944 -28705 -30294 -34664 -34235 -24407 -21197 -11523 -22548
12036b2548J0267K4375n407o799k2055r079K185J7693J4230j1639O759J3602L822
$$ -22548 -12281 12094 6687 -112 -22167 -31246 -29061 -11368 2862 -8777 -2018 11584 15406
12023A5406j5507k25K330j1626r087J2328J3904N014Q170l413L614p823k0353
$$ 15406 -101 -326 2004 -9622 -18709 -6381 7523 12537 20707 17294 20908 13085 -7268
12010g268o004K1228J1939j0833p269k394K823J4386q61K76o571j6684j5359Q80
$$ -7268 -13272 7956 19895 9062 1793 -601 2222 16608 15747 16023 9452 -7232 -22591 -21711
11996b1711J2033J2300O583N334J2136J839m235n200l142q50M611M080j0902k3457
$$ -21711 -9678 2622 9205 14539 26675 28514 24279 19079 15937 15087 19698 23778 12876 -10581
11982a0581r222M707J8722l346j0974M949N69l87j4675j5325Q444J2209J1651
$$ -10581 -19803 -15096 3626 280 -10694 -5745 -5176 -5563 -20238 -35563 -27119 -14910 -3259
11969c259M261Q554j7960o669J947J3158N045P224J3833l884j2312q602R544j2824
$$ -3259 1002 9556 -8404 -15073 -13126 32 5077 12301 26134 22250 9938 1336 10880 -1944
11955a944j2500O701l724l916Q259O065j261p247m15J3147j4942o589R240J6821
$$ -1944 -14444 -7743 -11467 -15383 -7124 -1059 -2320 -9567 -9982 3165 -11777 -18366 -9126 7695
11941G695j146j8756R208J1316j4731P811j1210m891J6187M906j668j3891K487
$$ 7695 6549 -12207 -2999 8317 -6414 1397 -9813 -14704 1483 6389 4721 -9170 -6683
11928f683J775Q963j1739l290R394K3908R133k3418O20L305M654k2730q216J0102
$$ -6683 -4908 4055 -7684 -10974 -1580 22328 31461 8043 8663 11968 16622 -6108 -14324 -4222
11914d222O227M373Q396k310l069q30K419p002N542R678j9122j6885r397M701
$$ -4222 2005 6378 14774 12464 9395 8565 10984 3982 9524 19202 80 -16805 -26202 -21501
11900b1501P184J813m764J6098j549j692p801K427J2964j3737j6842n364K667
$$ -21501 -14317 -12504 -17268 -1170 -2719 -4411 -12212 -9785 3179 -10558 -27400 -32764 -30097
11887c0097O430R432P624J1025J4204J5556j1652j6745k739P242O348l990L609
$$ -30097 -23667 -14235 -6611 4414 18618 34174 22522 5777 3038 10280 16628 12638 16247
11874A6247N442J446J359j3826k1309j7004m361Q923J7886j258r362P200P503
$$ 16247 21689 23135 24494 10668 -10641 -27645 -32006 -23083 -5197 -6455 -15817 -8617 -1114
11861a114j6608j050l404K674r711K0064J1518J244j2892k842J3116J569K426
$$ -1114 -17722 -18772 -22176 -19502 -29213 -9149 2369 3613 -9279 -12121 995 2564 4990
11848D990l000L57j1302j3798j259j3854q384K4202k868j5473R055R684P382J469
$$ 4990 1990 2347 -8955 -22753 -24012 -37866 -46250 -22048 -24916 -40389 -31334 -21650 -14268 -12799
11834a2799n462Q312p202j1312O388J1208R179j4882J1975J0605k219k036O89
$$ -12799 -18261 -9949 -17151 -28463 -22075 -10867 -1688 -16570 -4595 6010 3791 1755 2444
11821B444j7518j3187N814r133N411J2352J178O26J2332j080J0609k480n246q957
$$ 2444 -15074 -28261 -22447 -31580 -26169 -13817 -12639 -12013 319 -761 9848 7368 2122 -6835
11807f835K6243j310L573O882Q92j5561M550k242k0097j4894J9214J1775j263
$$ -6835 19408 18098 21671 28553 29445 13884 18434 16192 -3905 -18799 415 12190 10927
11794A0927l179j2336l716M095p214r899O771J7129J4502n485j3735q391J12j0154
$$ 10927 7748 -4588 -8304 -4209 -11423 -21322 -14551 2578 17080 11595 -2140 -10531 -10419 -20573
11780b0573J3131L2575q140k2191j760J9546R991j1851j4351o803K8942J7667
$$ -20573 -7442 25133 16993 -5198 -6958 12588 22579 10728 -3623 -10426 18516 36183
11768C6183j4366j0666l614k345N415K0027J431r807j2186L174L025J6274K9861
$$ 36183 21817 11151 7537 5192 10607 30634 32065 22258 10072 13246 16271 32545 62406
11755F2406J9347J2076J9635j1081J700j5615m5258l7315j7012j549K4419J9364
$$ 62406 81753 93829 113464 102383 104083 88468 43210 5895 -11117 -12666 11753 31117
11743C1117r503p864L14m624j53l357K748O051l032j2971N079K320p356j1219
$$ 31117 21614 13750 14064 9440 9287 5930 8678 14729 11697 -1274 3805 6125 -1231 -12450
11729a2450k643j3200j990O903n708K9954m438k1841Q546K2374k490j5877l161
$$ -12450 -15093 -28293 -30283 -23380 -29088 866 -3572 -25413 -16867 5507 3017 -12860 -16021
11716a6021P94j6156J370J4463Q561P75j020L286p12j6224o524J3538M610m880
$$ -16021 -15227 -31383 -30013 -15550 -6989 -6214 -7234 -3948 -4660 -20884 -27408 -13870 -9260 -14140
11702a4140O208q821P370R630k127j2931J7805J4821k1946M828M807n972J7470
$$ -14140 -7932 -16753 -9383 247 -1880 -14811 2994 17815 -4131 697 5504 -468 17002
11689A7002K3789k5415r373j4165j2163p200o148J1175K0847q23o99M422L239
$$ 17002 40791 15376 6003 -8162 -20325 -27525 -33673 -22498 -1651 -2474 -3173 1249 4488
11676D488j2774j710J1340j0217j1109k6187N716J4297J4774J0185M586r823k9031
$$ 4488 -8286 -9996 1344 -8873 -19982 -46169 -40453 -26156 -11382 -1197 3389 -6434 -35465
11663c5465J1783J6666N140R569j0741j1291m461R983L0686K571m712J5165O684
$$ -35465 -23682 -7016 -1876 7693 -3048 -14339 -18800 -8817 21869 24440 19728 34893 41577
11650D1577k2921k0625m244L575o852n35l473J470J0228o588N586L178M835l060
$$ 41577 18656 -1969 -6213 -2638 -9490 -10025 -13498 -12028 -1800 -8388 -2802 376 5211 2151
11636B151j4320l975J713Q368K2964R545j6016j0296Q236m447j2437Q990q72m033
$$ 2151 -12169 -16144 -14431 -6063 16901 26446 10430 134 8370 3923 -8514 476 -396 -4429
11622d429j3583q203o466N655P110j1075O546Q650O524M037L455j5371M148L627
$$ -4429 -18012 -26215 -32681 -27026 -19916 -30991 -24445 -15795 -9271 -5234 -1779 -17150 -13002 -9375
11608i375J2097o631j3907Q69j6915p713J681J179m645J5956R971o530J2282L888
$$ -9375 2722 -3909 -17816 -16947 -33862 -41575 -39894 -38715 -43360 -27404 -17433 -23963 -11681 -7793
11594g793P5j286n031J0925Q38k8537r853J4830L4639M740j2769j3096K2485J2090
$$ -7793 -7718 -9004 -14035 -3110 -2272 -30809 -40662 -25832 8807 13547 778 -12318 10167 22257
11580B2257j4643j2644j1865p548P975P163j7093L023k2376K44K324N276O288
$$ 22257 7614 -5030 -16895 -24443 -16468 -9305 -26398 -23375 -45751 -45507 -43183 -37907 -31619
11567c1619O244l057m111J2520J5518j0338o560K858J9302J0154l129L691j2205
$$ -31619 -25375 -28432 -32543 -20023 -4505 -14843 -21403 -18545 757 10911 7782 11473 -732
11554g32N40j1397q462J1289l73J1508n4p839R900K375j427j5799K478j467m834
$$ -732 -192 -11589 -20051 -8762 -9135 2373 2319 -5520 4380 6755 5328 -10471 -7993 -9460 -14294
11539a4294L688J4645J5992P121j4825k0724p465J2560J003J990j3811M37l978
$$ -14294 -10606 4039 20031 27152 12327 -8397 -15862 -3302 -2299 -309 -14120 -13683 -17661
11526a7661M687P680l154J1258k117K367K35J0815J0714o233K731j5565J439O026
$$ -17661 -12974 -5294 -8448 2810 693 3060 3295 14110 24824 18591 21322 5757 7196 13222
11512A3222k6190n435N190L58L440K1797j5573J2102P605j5138j1434k778K559
$$ 13222 -12968 -18403 -13213 -12855 -9415 12382 -3191 8911 16516 1378 -10056 -12834 -10275
11499a0275m015o540j509K290j1933j374r228L903J501M783j253l361P059K3746
$$ -10275 -14290 -20830 -22339 -20049 -31982 -33356 -42584 -38681 -37180 -32397 -33650 -37011 -29952 -6206
11485f206J0227j0904q09J1226J1923Jk145l810k680q524k1549j2310l233O857
$$ -6206 4021 -6883 -7692 3534 15457 15458 13313 9503 6823 -1701 -23250 -35560 -38793 -31936
11471c1936P245o576Q632J778Q969J3637N591O564O660k3439j0662J3295Q875
$$ -31936 -24691 -31267 -22635 -20857 -11888 1749 7340 13904 20564 -2875 -13537 -242 8633
11458H633O103J1731L358Q803M992r245k0783k0350q520J0271o484N790M901K3290
$$ 8633 14736 26467 29825 38628 43620 34375 13592 -6758 -15278 -5007 -11491 -5701 -800 22490
11444B2490L696k4018K937O640P247j7713j3934Q843o474r553P782K203M089K0611
$$ 22490 26186 2168 5105 11745 18992 1279 -12655 -3812 -10286 -19839 -12057 -9854 -5765 14846
11430A4846K5744M272k642k4013j0345q490j4814j2957K6417J8948o492q201J087
$$ 14846 40590 44862 42220 18207 7862 -628 -15442 -28399 -1982 16966 10474 2273 3360
11417C360J675o926j3425p489J0858K2171j676j988j2352K841J9119m193k0794
$$ 3360 5035 -1891 -15316 -22805 -11947 10224 8548 6560 -5792 -2951 16168 11975 -8819
11404h819r306o582o285J1707Q002j0535k1944L096J9958J3361r17o850J3938
$$ -8819 -18125 -24707 -30992 -19285 -11283 -21818 -43762 -40666 -20708 -7347 -8264 -15114 -1176
11391a176R002m725k6479q948M999K1687J5425p821j0850k96J7006M891j5232
$$ -1176 7826 3101 -23378 -32326 -27327 -5640 9785 1964 -8886 -9182 7824 12715 -2517
11378b517q241o691K0592o141j9188K782n09m608r192K1326J9564k590l5718n409
$$ -2517 -10758 -17449 3143 -2998 -22186 -19404 -19913 -24521 -33713 -12387 7177 4587 -31131 -36540
11364c6540J7392J4733j4590o242P236l043j0643L361N47m449P455O466r218Q202
$$ -36540 -19148 -4415 -19005 -25247 -18011 -21054 -31697 -28336 -27789 -32238 -24783 -18317 -27535 -19333
11350a9333J5214J605k540j3966J386N439L1853l437j9026L800R836j0483r629
$$ -19333 -4119 -2514 -5054 -19020 -17634 -12195 19658 16221 -2805 995 10831 348 -9281
11337i281l043m398L638J3745L102M353J7645M504k241k6922m972P659J0064m422
$$ -9281 -12324 -16722 -13084 661 3763 8116 25761 30265 28024 1102 -3870 3789 13853 9431
11323I431m844p35r404j1873J9164R469m363n334O292J1105l338j0332j0123n173
$$ 9431 4587 3852 -5552 -17425 1739 11208 6845 1511 7803 18908 15570 5238 -4885 -10058
11309a0058o97P35M270K67J6034k97m346K776p09K908j4361J5044M481o661P925
$$ -10058 -10755 -10020 -5750 -5483 10551 10254 5908 8684 7975 10883 -3478 11566 16047 9386 17311
11294A7311j0560j180L0779r272j821J558j8389j0627J094K2215P825j7544R09
$$ 17311 6751 5571 36350 27078 25257 26815 8426 -2201 -1107 21108 28933 11389 12298
11281A2298L3994M5378J4055K5174L3202K0810L2484K1723j6977o724k0718m6996
$$ 12298 46292 91670 105725 130899 164101 184911 217395 239118 222141 215417 194699 147703
11269A47703m9686l7488q586k3907l629N075n610o690l426r507n401r65r017J0412
$$ 147703 98017 60529 51943 28036 24407 29482 23872 17182 13756 4249 -1152 -2117 -11134 -722
11255g22R509k223M855j920M611K8327K6789j556K964K1811L9241L4304M8499
$$ -722 8787 6564 11419 9499 14110 42437 69226 67670 70634 92445 131686 165990 214489
11242B14489N3605J2150M894n377n4889m6051m1450m7738k9378j4890k605Q770
$$ 214489 268094 280244 285138 279761 224872 178821 137371 89633 60255 45365 42760 51530
11230E1530q936k185j483J0021m43p517j2124j5197P658l405j6218m036J2634
$$ 51530 42594 40409 38926 48947 48504 40987 28863 13666 21324 17919 1701 -2335 10299
11217A0299Q802J3344O312n177j7800j8553j7943r516J5392L598l974Q304P441
$$ 10299 19101 32445 38757 33580 15780 -2773 -20716 -30232 -14840 -11242 -15216 -6912 529
11204E29J06j973J406k482J311o807J043K237j2417J652K1254P022N151N204j7438
$$ 529 635 -1338 68 -2414 -1103 -7910 -6867 -4630 -17047 -15395 5859 12881 18032 23236 5798
11189E798j4057m685Q321N237J042j3475j7468j971K4069K322J141o204q739j070
$$ 5798 -8259 -12944 -4623 614 1656 -11819 -29287 -31258 -7189 -4867 -3726 -9930 -18669 -19739
11175a9739q997K490J9618L942j918m57j3701J1786J5804k44k263M875j4271L293
$$ -19739 -28736 -26246 -6628 -2686 -4604 -5061 -18762 -6976 8828 8584 6321 11196 -3075 218
11161B18J2449k2996j7736L688K9381k375o076R00P69o028M340j9624p794Q980
$$ 218 12667 -10329 -28065 -24377 5004 2629 -3447 -2547 -1778 -7806 -3466 -23090 -30884 -21904
11147b1904K2404J0533l87J326k276K073j4632j6612k098P448Q097j0156J659
$$ -21904 500 11033 10646 11972 9696 11769 -2863 -19475 -21573 -14125 -6028 -16184 -14525
11134a4525m085j3021l828J439O95J1635O020p823J1203J0032j600J534J219n263
$$ -14525 -18610 -31631 -35459 -34020 -33325 -21690 -15670 -23493 -12290 -2258 -3858 -2324 -1105 -6368
11120f368J2173m856q718k2420j1898j217R581J0136l398K2288j5090j8458L175
$$ -6368 5805 949 -7769 -30189 -42087 -43304 -33723 -23587 -26985 -4697 -19787 -38245 -35070
11107c5070p426Q740J6116J9539m018R555J3062j5239O710J7755r774k1033k6765
$$ -35070 -42496 -33756 -17640 1899 -2119 7436 20498 5259 11969 29724 19950 -1083 -27848
11094b7848j1681L113m178J0679K1411J9174j1420j7352P63J0966L133m315n065
$$ -27848 -39529 -36416 -40594 -29915 -8504 10670 -750 -18102 -17339 -6373 -3240 -7555 -12620
11081a2620k841J9404q924N484J0943N780k1562L249J2101m88J3868j4232j141
$$ -12620 -15461 3943 -4981 503 11446 17226 -4336 -1087 11014 10526 24394 10162 9021
11068I021P813K0930O191J2933n459r970J0544j0588j1299N237j4376J064O070
$$ 9021 16834 37764 43955 56888 51429 41459 52003 41415 30116 35353 20977 22041 28111
11055B8111j3627k3846N042k3133j708M186M536J4911R378j1020P897J8354L420
$$ 28111 14484 -9362 -4320 -27453 -29161 -24975 -20439 -5528 3850 -7170 727 19081 22501
11042B2501j1206L97J2242N520r536k3172k257L1760K5628j5880j5400p853k837
$$ 22501 11295 11692 23934 29454 19918 -3254 -5511 26249 51877 35997 20597 12744 9907
11029I907n573k303J2173M867J985J0051j7449j846o493j5327L077k340k012J3026
$$ 9907 4334 2031 14204 19071 21056 31107 13658 11812 5319 -10008 -6931 -9271 -11283 1743
11015A743N992N089J0385r213p107k2995p739R398L652N875j4777k0096R519K3123
$$ 1743 7735 12824 23209 13996 6889 -16106 -23845 -14447 -10795 -4920 -19697 -39793 -30274 -7151
11001g151J9229J024j549l962k0062k2420q783P262K979J1585m599M786J5266
$$ -7151 12078 13102 11553 7591 -12471 -34891 -43674 -36412 -33433 -21848 -26447 -21661 -6395
10988f395q164k0539m860K4335J5213o087J6201l750j6867j4206N914p264p294
$$ -6395 -14559 -35098 -39958 -15623 -410 -6497 9704 5954 -10913 -25119 -19205 -26469 -33763
10975c3763R304k029R681Q537j109o785m093J280J1323l66r199p468j5596o404
$$ -33763 -24459 -26488 -16807 -8270 -9379 -16164 -20257 -18977 -7654 -8020 -17219 -24687 -40283 -46687
10961d6687n344K4942J5233j3790R282L2253k043j8643r60K8941o642j6633j098
$$ -46687 -52031 -27089 -11856 -25646 -16364 15889 13846 -4797 -5757 23184 16542 -91 -1189
10948a189q350j8192N677O665j1009N967P21m516K4302L0526Q32l0710j538M686
$$ -1189 -9539 -27731 -22054 -15389 -26398 -20431 -19710 -24226 76 30602 31434 724 -814 3872
10934C872N827p91R434J8002J1194L322j0045j2668k7222j1358q386J3242J4454
$$ 3872 9699 8908 18342 36344 47538 50860 40815 28147 925 -10433 -18819 -5577 8877
10921H877r033j4359N468Q914J383O925J6277j430Q037k892j7621j4319K487Q01
$$ 8877 -156 -14515 -9047 -133 1250 8175 24452 23022 31059 28167 10546 -3773 -1286 -485
10907d85J622J2683j2144p419K0408K4582O95j7881r792j2121J7950N919m481
$$ -485 1137 13820 1676 -5743 14665 39247 39942 22061 12269 148 18098 24017 19536
10894A9536k4553J769K5151J3962O38m088k4045p498j4829j2531K655P432P300
$$ 19536 -5017 -3248 21903 35865 36503 32415 8370 872 -13957 -26488 -23833 -16401 -9101
10881i101P048J5655L663q622r390j1581J3785O159j1716n327J7805n759k5121
$$ -9101 -2053 13602 17265 8643 -747 -12328 1457 7616 -4100 -9427 8378 2619 -22502
10868b2502O941J5235n730J041J0882K519O281J6057J12j0087k001j3202m613
$$ -22502 -15561 -326 -6056 -5015 5867 8386 14667 30724 30836 20749 18748 5546 933
10855I33r687J020l40k0257J8611K0422J0460n444l430j6902O155L168j776l133
$$ 933 -8754 -7734 -8074 -28331 -9720 10702 21162 15718 12288 -4614 1541 4709 2933 -200
10841b00n118j742J1750J923k543k615J4729n329k7371k460J4660K0809J0768
$$ -200 -5318 -7060 4690 6613 4070 1455 16184 10855 -16516 -18976 -4316 16493 27261
10828B7261J939P19j8248l1749n593J9664J4193j4711k208J3035L943j1352K683
$$ 27261 29200 29919 11671 -20078 -25671 -6007 8186 -6525 -8733 4302 8245 -3107 -424
10815d24r664O563J2819p066q85J786J891K259O550j4185k2147l741K3060K692
$$ -424 -10088 -3525 9294 2228 1343 3129 5020 7279 13829 -356 -22503 -26244 -3184 -492
10801d92j5854L217k526j992O227O667n603k545R299R707J1736n504k3850k3927
$$ -492 -16346 -13129 -15655 -17647 -11420 -4753 -10356 -12901 -3602 6105 17841 12337 -11513 -35440
10787c5440Q038q41N3J313J1262J5056k132J3978L028j2765j4496m143K0669J3585
$$ -35440 -27402 -28243 -28190 -26877 -15615 -559 -2691 11287 14315 1550 -12946 -17089 3580 17165
10773A7165j4606k121O951J5496k6084r331p76K0201J887p425j7528K674J3701
$$ 17165 2559 438 7389 22885 -3199 -12530 -13306 6895 8782 1357 -16171 -13497 204
10760B04L2270J7607j3883n278m555l905j2620J711N959r765M278O56Pj0015O157
$$ 204 32474 50081 36198 30920 26365 22460 9840 11551 17510 7745 12023 12679 12686 2671 8828
10745H828J0043l696j0830m780Q996Q620J0158j1313o078o968k2936J1979K0125
$$ 8828 18871 15175 4345 -435 8561 17181 27339 16026 9948 2980 -19956 -7977 12148
10732A2148Q171J4164r917J077p291j0675j7643J852K376N313M566q378m335J3595
$$ 12148 20319 34483 24566 25643 18352 7677 -9966 -8114 -5738 -425 4141 -4237 -8572 5023
10718E023j6185O866K3405O273J5849O618q133j953J1491n469j7050N377J4155
$$ 5023 -11162 -4296 19109 25382 41231 47849 39716 37763 49254 43785 26735 32112 46267
10705D6267P316J4855J0371j5869K438n985O588K1143J1348m855L896K5990K6846
$$ 46267 53583 68438 78809 62940 65378 59393 65981 87124 98472 93617 97513 123503 150349
10692A50349J6022n517N10J6955J3677J1350K1788M9940L7428N2526O5604P4353
$$ 150349 166371 160854 161364 178319 191996 203346 225134 275074 312502 365028 430632 504985
10680E04985J29220K42357L60282M85074N94776N41845M06946L05176K92537K73548
$$ 504985 634205 876562 1236844 1721918 2316694 2858539 3265485 3570661 3863198 4136746
10670D136746J49203l3340j45524k10869k10095k39641l96139n67875n78312m71314
$$ 4136746 4285949 4252609 4107085 3896216 3686121 3446480 3050341 2482466 1904154 1432840
10660A432840l13553j73598j07809q9813m8070m9833n9516k6775k0699j6035l0122
$$ 1432840 1119287 945689 837880 748067 699997 650164 590648 563873 543174 527139 497017
10649D97017k9827l5678k3729l129k5516q608j9126j9897k1561j1722k6101l9679
$$ 497017 467190 431512 407783 404654 379138 370530 351404 331507 309946 298224 272123 232444
10637B32444q482J1014o833j3126q468m804O188p063j2050q290j5604o802j162
$$ 232444 223962 234976 228143 215017 206549 201745 207933 200870 188820 180530 164926 158124 156962
10624A56962l868n237M563J433L576j9439k6416p213j525J0425L656j2877L475
$$ 156962 153094 147857 152420 153853 157429 137990 111574 104361 102836 113261 116917 104040 107515
10611A07515m584R631J0801k9464j4164r275J9886K1806j2389j353j1522N443
$$ 107515 102931 112562 123363 93899 79735 70460 90346 112152 99763 98410 86888 92331
10599I2331j1069k1592j4301j3516K3719J2501o63O544m67k2491j8638J169J1489
$$ 92331 81262 59670 45369 31853 55572 68073 67410 73954 73487 50996 32358 33527 45016
10586D5016P713m355K533q38P53M411K921k1770m545P496M665k559J145Q992j5441
$$ 45016 52729 48374 50907 50069 50822 55233 58154 36384 31839 39335 44000 41441 42586 51578 36137
10571C6137r294J0565p77k0452r551l768M579N991J4720Q20O39r661m221p025
$$ 36137 26843 37408 36631 16179 6628 2860 7439 13430 28150 28970 29609 19948 15727 8702
10557H702J7771J4559J0049j4969k776J7124r810o843n857J0059J6375j1481k5155
$$ 8702 26473 41032 51081 36112 33336 50460 40650 33807 27950 38009 54384 42903 17748
10544A7748o290j4600k1230J350K4615J7307p545p145J5236k5061j6147p150j8886
$$ 17748 11458 -3142 -24372 -23022 1593 18900 11355 4210 19446 -5615 -21762 -28912 -47798
10531d7798O398M700J0163J4387K429J3514J1400k079j6228j0907n832J5368J1978
$$ -47798 -41400 -36700 -26537 -12150 -9721 3793 15193 13114 -3114 -14021 -19853 -4485 7493
10518G493k707o209J7605K3636m005l7849j1961o53J8173J8412P339j2761p197
$$ 7493 4786 -1423 16182 39818 35813 -2036 -13997 -14650 3523 21935 29274 16513 9316
10505I316K7528k723N927L252k0195J150k2728j1682J1544j1924J429r848j3947
$$ 9316 36844 34121 40048 43300 23105 24255 1527 -10155 1389 -10535 -9106 -18954 -32901
10492c2901j5145m911N573J6720J9723L666j4693R79l401L0731J6286m463Q698
$$ -32901 -48046 -52957 -47384 -30664 -10941 -7275 -21968 -20989 -24390 6341 22627 18164 26862
10479B6862k18k3898r11m576l107Q826j8628r457J572Q156J6957J0035p73n837
$$ 26862 26644 2746 1835 -2741 -5848 2978 -15650 -25107 -23535 -15379 1578 11613 10840 5003
10465E003j3783j0991O720q549N660N452q698m274J8544L4910r000r514R876j300
$$ 5003 -8780 -19771 -13051 -21600 -15940 -10488 -19186 -23460 -4916 29994 20994 11480 21356 20056
10451B0056j1781j5300m949k210J4044J9418m524j0931L150k338L609j677J487
$$ 20056 8275 -7025 -11974 -14184 -140 19278 14754 3823 6973 4635 8244 6567 8054
10438H054r084n503R050j6271m641K1571J6772K4k0927j0756r598k874J3318R273
$$ 8054 -1030 -6533 2517 -13754 -18395 3176 19948 19972 -955 -11711 -21309 -24183 -10865 -1592
10424a592q74J3469P224j0405j3911j1651J2233L965J5264M740q967J7746J395
$$ -1592 -2466 11003 18227 7822 -6089 -17740 -5507 -1542 13722 18462 9495 27241 28636
10411B8636j8489j7721r490L0186l48j3255L836J2069P532m241o525j0792j1200
$$ 28636 10147 -7574 -17064 13122 12774 -481 3355 15424 22956 18715 12190 1398 -9802
10398i802J547P034J7329p638j0123k6367K768P899J771J5896j0762m873J5545
$$ -9802 -8255 -1221 16108 8470 -1653 -28020 -25252 -17353 -15582 314 -10448 -15321 224
10385B24N622J426N646K245k2350j1441j5281K3315K2601k122n438L342J795J247
$$ 224 5846 7272 12918 15163 -7187 -18628 -33909 -10594 12007 9885 4447 7789 9584 10831
10371A0831J532J1743Q307O573j7259q317N17p060k1628j4017m831k4152P736
$$ 10831 12363 24106 32413 38986 21727 13410 13927 6867 -14761 -28778 -33609 -57761 -50025
10358e0025J3945J0102L957K230j381J3088J8470j5092k2863q676j3116R978J0018
$$ -50025 -36080 -25978 -22021 -19791 -21172 -8084 10386 -4706 -27569 -36245 -49361 -39383 -29365
10345b9365J220O689O737J4094j6787j043K9818J048J1291o199J555J2168O755
$$ -29365 -28145 -21456 -14719 -625 -17412 -18455 11363 12411 23702 17503 19058 31226 37981
10332C7981j4248k9136L493p69r766J1659o37k4645j6999L899J4409J2362m670
$$ 37981 23733 -5403 -1910 -2679 -12445 -786 -1423 -26068 -43067 -39168 -24759 -12397 -17067
10319a7067R693l229j5222P647K3744Q239j1316j4588k080n1J7967M546O162L0
$$ -17067 -7374 -10603 -25825 -18178 5566 13805 2489 -12099 -14179 -14230 3737 8283 14445 14475
10305A4475j4136p677j2768j8045R358j774P658J7226J1684R302o541J415k456
$$ 14475 339 -7338 -20106 -38151 -28793 -30567 -22909 -5683 6001 15303 8762 10177 7721
10292G721N583K027j1832l1763L961k455J1936K1117L2448o419N418o579J0384
$$ 7721 13304 15331 3499 -28264 -24303 -26758 -14822 6295 38743 32324 37742 31163 41547
10279D1547r034j7920r616k916J2695R698p046k2560j5675J7033K0098N812k68
$$ 41547 32513 14593 4977 2061 14756 24454 17408 -5152 -20827 -3794 16304 22116 21848
10266B1848m823j691R893J0141j364k5673o15M292o248p627K930j0311j807R01
$$ 21848 17025 15334 25227 35368 34004 8331 7716 12008 5760 -1867 1063 -9248 -11055 -10154
10252a0154m913Q233l575p490J5578R17R39R812p022P080J5826L781m526m005
$$ -10154 -15067 -6834 -10409 -17899 -2321 -1404 -465 9347 2325 9405 25231 29012 24486 20481
10238B0481O138J2184J9453O341k5922M84P709Q6P395Q667j172Q058J6405O272
$$ 20481 26619 38803 58256 64597 38675 39159 46868 46954 54349 63016 61844 69902 86307 92579
10224I2579P677R250n74K493j1598k5315j8827p990r64r991l063m274M729O882
$$ 92579 100256 109506 108932 111425 99827 74512 55685 47695 46731 36740 33677 29403 34132 41014
10210D1014R567j3103k2125l1941N113o911j2310J4895K244o990p651O615l098
$$ 41014 50581 37478 15353 -16588 -11475 -18386 -30696 -15801 -13557 -20547 -28198 -21583 -24681
10197b4681Q70p401n933K2368j4860J8614K5894j4703N763R597R49O823j4560
$$ -24681 -23811 -31212 -37145 -14777 -29637 -11023 14871 168 5931 15528 16477 23300 8740
10184H740n308J450q478N744J2448j2554n916L683N640j303K5055J7712j3870
$$ 8740 3432 4882 -3596 2148 14596 2042 -3874 -191 5449 4146 29201 46913 33043
10171C3043k0598Q181K011k901r789k5841m090N028N536M250j2845Q4Q019J7125
$$ 33043 12445 20626 22637 19736 9947 -15894 -19984 -14956 -9420 -5170 -18015 -17931 -9912 7213
10157G213n146P928j4583j8198J2262l424p807N14O324J692k612j507R58M514
$$ 7213 2067 9995 -4588 -22786 -10524 -13948 -21755 -21241 -14917 -13225 -15837 -17344 -16386 -11872
10143a1872J5638O351j1526R893r007j1834M342J6275P781l428j5352k5225K135
$$ -11872 3766 10117 -1409 8484 -523 -12357 -8015 8260 16041 12613 -2739 -27964 -25829
10130b5829Q443Q435L566J0319K2813k000j4243l0374j0453K755K192J9152J7773
$$ -25829 -17386 -8951 -5385 4934 27747 25747 11504 -18870 -29323 -26568 -24376 -5224 12549
10117A2549K637P213J3114j7498o142j807N955L222j012m123K870n498k3149j6749
$$ 12549 15186 22399 35513 18015 11873 10066 16021 19243 18231 14108 16978 11480 -11669 -28418
10103b8418m220J5480M914L23n88J669J9054j3215N405n604k2166P414L6693M751
$$ -28418 -32638 -17158 -12244 -11921 -12509 -10840 8214 -5001 404 -5200 -27366 -19952 16741 21492
10089B1492k5964k0861l20j0222K6248L605j2529k403o97k513K175l937J0997
$$ 21492 -4472 -25333 -25653 -35875 -9627 -6022 -18551 -20954 -21651 -24164 -21989 -25926 -14929
10076a4929p482M720J0591N291p172n871L715k765K1619J0698j7008l4440j6741
$$ -14929 -22411 -17691 -7100 -1809 -8981 -14852 -11137 -13902 7717 18415 1407 -33033 -49774
10063d9774L653Q918J3105J198J982J7864k046m711k32N776L093J3246Q699p304
$$ -49774 -46121 -37203 -24098 -22900 -20918 -3054 -5100 -9811 -10043 -4267 -1174 12072 20771 13467
10049A3467O233n690q925r271O823N354j3520j4147L298J1259J0112P697J4348
$$ 13467 19700 14010 5085 -4186 2637 7991 -5529 -19676 -16378 -5119 4993 12690 27038
10036B7038J530j7116r641L787k0855j8847K556J0138J4096l752l440O950J8149
$$ 27038 28568 11452 1811 5598 -15257 -34104 -31548 -21410 -7314 -11066 -14506 -7556 10593
10023A0593K574j6441j3058j029N253J2379M767j1632q60O253Q32j1659J2529
$$ 10593 13167 -3274 -16332 -17361 -12108 271 5038 -6594 -7454 -1201 -369 -12028 501
10010E01P12J756J1366l428j6819p67O591O832K8568M169k6789M50J2030j3265
$$ 501 1213 2969 14335 10907 -5912 -6679 -88 6744 35312 39481 12692 13142 25172 11907
9996A1907k0904n807O570J169j2992J4208P594K0833J8784j5581k7492M516J8079
$$ 11907 -8997 -14804 -8234 -7065 -20057 -5849 1745 22578 41362 25781 -1711 2805 20884
9983B0884O818k2565j1951M08K562k267j0356n961J3661K589r902o277J7635l409
$$ 20884 27702 5137 -6814 -6406 -3844 -6111 -16467 -22428 -8767 -6178 -16080 -22357 -4722 -8131
9969h131M2Q258j2651j3238O717J4888n130K840R122J4423P396m309k5100q606
$$ -8131 -8089 169 -12482 -25720 -19003 -4115 -9245 -6405 2717 17140 24536 20227 -4873 -13479
9955a3479j063R058J7123Q626l0488j6240P942N225M527L62r362P761J9082r480
$$ -13479 -14542 -5484 11639 20265 -10223 -26463 -18521 -13296 -8769 -8407 -17769 -10008 9074 -406
9941d06n014o532J298Q241J8426N172l312j0816j3660J0612m64j1784R301O674
$$ -406 -5420 -11952 -10654 -2413 16013 21185 17873 7057 -6603 4009 3545 -8239 1062 7736
9927G736q600L192k919M864L943r206K503L322Q709O309o162N58j5805J4456l476
$$ 7736 -864 2328 -591 4273 8216 -990 1513 4835 13544 19853 13691 14249 -1556 12900 9424
9912I424N700M014k0686k585o419p157Q60o949j675N844K0534k32j4762J809J1699
$$ 9424 15124 19138 -1548 -4133 -10552 -17709 -16849 -23798 -25473 -19629 905 673 -14089 -12280 -581
9897e81m544N40J9303J9367j8814J751J1943O806N612r916j0361j7353m342Q255
$$ -581 -5125 -4585 14718 34085 15271 17022 28965 35771 41383 31467 21106 3753 -589 7666
9883G666R276N600l418k2307o850r279M461L506q377K1999K3562Q186N627n37
$$ 7666 16942 22542 19124 -3183 -10033 -19312 -14851 -11345 -19722 2277 25839 34025 39652 39115
9869C9115j4235j3249J1051p318j673m988q556l038l795r491L479L3324K2244
$$ 39115 24880 11631 22682 15364 13691 8703 147 -2891 -6686 -16177 -12698 20626 42870
9856D2870j8847Q399K0653L990K0j0497j9682o456J0817k315q952N463n818j1782
$$ 42870 24023 32422 53075 57065 57085 46588 26906 20450 31267 28952 20000 25463 19645 7863
9842G863p216l320m524p226J135l81K2109J1032M306j7772J7303J0137m245r019
$$ 7863 647 -2673 -7197 -14423 -13288 -13669 8440 19472 23778 6006 23309 33446 29201 20182
9828B0182m876o445j6714J125p087J0621P587K319o523J22J7702o420l232N455
$$ 20182 15306 8861 -7853 -6728 -13815 -3194 4393 6712 189 311 18013 11593 8361 13816
9814A3816j5797k0675j8406L33N98K6545P830K5648J6008j3766n595k0466k6240
$$ 13816 -1981 -22656 -41062 -40729 -40131 -13586 -5756 19892 35900 22134 16539 -3927 -30167
9801c0167J0810K0214l30k0443p87j324q274n363J1718K1831N566j624j8382k900
$$ -30167 -19357 857 527 -19916 -20703 -22027 -30301 -35664 -23946 -2115 3451 1827 -16555 -19455
9787a9455N536O195J0389p152P95P522N067r758m356J2701J2879O90k0696k6989
$$ -19455 -13919 -7724 2665 -4487 -3692 3830 8897 -861 -5217 7484 20363 21053 357 -26632
9773b6632N57J2098O075O398m875M101J1027J5270k025j0027r544m047k174L073
$$ -26632 -26075 -13977 -7902 -1504 -6379 -2278 8749 24019 21994 11967 2423 -1624 -3798 -725
9759g25J6397Q003j3756j0050O90J445j1997r574j08M312j7834O235J7980J480
$$ -725 15672 23675 9919 -131 559 2004 -9993 -19567 -19675 -15363 -33197 -26962 -8982 -7502
9745g502j4075p314N415k288J208P277n002j4543j4262J7571L0223M494o031j2729
$$ -7502 -21577 -28891 -23476 -25764 -24556 -17279 -22281 -36824 -51086 -33515 -3292 1202 -4829 -17558
9731a7558P401K8833M245j6468K1034J0265k0973L063l55l453l496k3060o967
$$ -17558 -10157 18676 22921 6453 27487 37752 16779 19842 19487 16034 12538 -10522 -17489
9718a7489O286J1799k453j8994j1723l189J6309J1708J454j3755r813j015O784
$$ -17489 -11203 596 -1857 -20851 -32574 -35763 -19454 -7746 -6292 -20047 -29860 -30875 -24091
9705b4091k637j105p832r642J1928N070J5994J8513K443k0332j3661N848J2161
$$ -24091 -26728 -27833 -35665 -45307 -33379 -28309 -12315 6198 8641 -11691 -25352 -19504 -7343
9692g343J4436k30O761J7197J236J1389K8665p620j5327j2381K130j6792j0467
$$ -7343 7093 6863 13624 30821 32057 43446 72111 64491 49164 36783 38913 22121 11654
9679A1654k422m715L494J1872J6087M539n041K867J5381r707j5452j6Q400r600
$$ 11654 9232 4517 8011 19883 35970 40509 35468 38335 53716 44009 28557 28541 36941 27341
9665B7341m234O451J4977n082p494j5242j6587m486M209Q818j5022J786J2251
$$ 27341 23107 29558 44535 39453 31959 16717 130 -4356 -147 8671 -6351 -4565 7686
9652G686o870j848N371m503m879m874j3307J5501J6473p352j76j1893L997J7625
$$ 7686 816 -1032 4339 -164 -5043 -9917 -23224 -7723 8750 1398 1222 -10671 -6674 10951
9638A0951M384p508q995Q74J680n443J0279P266j3013Q687P88K891k011m760P161
$$ 10951 15335 7827 -1168 -294 1386 -4057 6222 13488 475 9162 9950 12841 10830 6070 13231
9623A3231l466J889J9024k829p772l678j125q201k6871r561O412l539L668J5013
$$ 13231 9765 11654 30678 27849 20077 16399 15274 7073 -19798 -29359 -22947 -26486 -22818 -7805
9609g805l534J2931l82J7641j3560j4911o707o920L3129L0987o743k3243L697
$$ -7805 -11339 1592 1210 18851 5291 -9620 -16327 -23247 9882 40869 34126 10883 14580
9596A4580n359p667j1508k974J2921p390K015n120j1736p488J5809J0136J1714
$$ 14580 9221 1554 -9954 -12928 -7 -7397 -5382 -10502 -22238 -29726 -13917 -3781 7933
9583G933L946J6930J9025Q016j6897P858q864o974N745m037j1041K24M172J663
$$ 7933 11879 28809 47834 55850 38953 46811 37947 30973 36718 32681 21640 21864 26036 27699
9569B7699J22n445j8652r889K965J4656J256J743J1285o505p192l164l843N02
$$ 27699 27821 22376 3724 -6165 -3200 11456 12712 14455 25740 19235 12043 8879 5036 5538
9555E538j2177n753R271Q695q185N610m155K1225O671M27j3190k9845k534j149
$$ 5538 -6639 -12392 -3121 5574 -2611 2999 -1156 20069 26740 27167 13977 -15868 -18402 -19551
9541a9551N543j2158J169k82o907J7218J9439j4567j185O91O071J0990N440qK935
$$ -19551 -14008 -26166 -24997 -25279 -32186 -14968 4471 -10096 -11281 -10590 -4519 6471 11911 11903 14838
9526A4838q278J0547J0859j255J5645n845N566M949j0821l840j3812O943r874
$$ 14838 6560 17107 27966 26711 42356 36511 42077 47026 36205 32365 18553 25496 15622
9513A5622m149j2109j0193J2843n246M086N661k1944q670O477J3203J191m32j6813
$$ 15622 11473 -636 -10829 2014 -3232 854 6515 -15429 -24099 -17622 -4419 -3228 -3660 -20473
9499b0473J1450K991J3177J9091j465q271P645J488M22j5712l394L906M466k0213
$$ -20473 -9023 -6032 7145 26236 24771 16500 24145 25633 26055 10343 6949 10855 15321 -4892
9485d892R09J1557K1203k945j0858R354k817Q153j9088j5706j205K38j815r709
$$ -4892 -3983 7574 28777 25832 14974 24328 21511 29664 10576 -5130 -6335 -6097 -7912 -17621
9471a7621r692L491n396J000j0299P633L603j1960O242J9572O319K1628j58j9245
$$ -17621 -27313 -23822 -29218 -28218 -38517 -30884 -27281 -39241 -32999 -13427 -7108 14520 14362 -4883
9457d883k9098m558J7936R187j0531k2514J256L202q560K9380L3035J2248J1139
$$ -4883 -33981 -38539 -20603 -11416 -21947 -44461 -43205 -40003 -48563 -19183 13852 26100 37239
9444C7239j0214p321J4250j2247j4467j0583j084J046l114r014k244J0696K0041
$$ 37239 27025 19704 33954 21707 7240 -3343 -4427 -3381 -6495 -15509 -17753 -7057 12984
9431A2984M369m279j1235q422j349Q656L2303N318l871K501m523l706o576k118
$$ 12984 17353 13074 1839 -6583 -7932 724 33027 38345 34474 36975 32452 28746 22170 20052
9417B0052r48K213j197j2362N985j622n72J2623j661j0853l256j0097R491j348
$$ 20052 19104 21317 20120 7758 13743 12121 11549 24172 22511 11658 8402 -1695 7796 6448
9403F448Q223K6156q214r229o044J3990J0598p721j3216j7720L4669L6784j8499
$$ 6448 14671 40827 32613 23384 17340 31330 41928 34207 20991 3271 37940 74724 56225
9390E6225j4112r833l53r053K0909N387j5305O89j748r063p220k1369q976J6830
$$ 56225 42113 32280 31927 22874 43783 49170 33865 34554 32806 23743 16523 -4846 -13822 3008
9376C008K0911J2928j1645k0663j4893m215J8355K450j1118M102M679K0725K8484
$$ 3008 23919 36847 25202 4539 -10354 -14569 3786 6236 -4882 -780 3899 24624 53108
9363E3108o664m406O483K4108r934j2356J9048Q749j7064M44j2083o794P15K3832
$$ 53108 46444 42038 48521 72629 62695 50339 69387 78136 61072 61516 49433 42639 43354 67186
9349F7186j8569J356L494l1337k4227J3615J2364j1514m955J3550Q065J844K7400
$$ 67186 48617 49973 53467 22130 -2097 11518 23882 12368 7413 20963 29028 30872 58272
9336E8272K380m77J383m990q965M356j3670r150o254k983J2457r408J2546K1259
$$ 58272 60652 60175 61558 56568 47603 51959 38289 29139 22885 19902 32359 22951 35497 56756
9322E6756k200J789N214O118l203k9154j4741K038r597N566K143J512K2050J6767
$$ 56756 54556 56345 61559 67677 64474 35320 20579 22617 13020 18586 20729 22241 44291 61058
9308F1058P469j2414o922J5995J8899j2155j0131K968P196J2378J2810j2446N150
$$ 61058 68527 56113 49191 65186 84085 71930 61799 64767 71963 84341 97151 84705 89855
9295H9855J6256P455J7248R881J1986j3735m849J8283K6756K1146k982R776n78
$$ 89855 106111 113566 130814 140695 152681 138946 134097 152380 179136 200282 197300 207076 206498
9282B06498M037j2529J3024M1228L3722L7076M0785M9371N9462P0714P3977J06349
$$ 206498 210535 198006 211030 252258 285980 323056 363841 413212 472674 543388 617365 723714
9270G23714J71430K15343K77283L97926N82244R36074J543397K131037K057849
$$ 723714 895144 1110487 1387770 1785696 2367940 3304014 4847411 6978448 9036297
9261I036297J113043L36061J57924j07726j198719k348225k073404j311434q07286
$$ 9036297 10149340 10485401 10643325 10535599 9336880 6988655 4915251 3603817 2796531
9252B796531n01745l38393k41665j90177j56148j10230j01724r6382p0172l9456
$$ 2796531 2294786 1956393 1714728 1524551 1368403 1258173 1156449 1060067 989895 950439
9242I50439l4671l7448n0295n0603j3805o948m6084l4093l4638l1551l6858k8117
$$ 950439 915768 878320 828025 777422 763617 756669 710585 676492 641854 610303 573445 545328
9230E45328j5863j2191l277k5661l6585k0381r036q956o378j8866k1632k3940
$$ 545328 529465 517274 513997 488336 451751 431370 422334 413378 407000 388134 366502 342562
9218C42562j6853q954K919J5379j9662k1970J910K005j8821o066l751j7237l4686
$$ 342562 325709 316755 319674 335053 315391 293421 295331 297336 278515 272449 268698 251461 216775
9205B16775j6648J9976l286r893o445l813j460l50J5824j0694p647N364k2373
$$ 216775 200127 220103 216817 206924 200479 196666 195206 194856 210680 199986 192339 197703 175330
9192A75330l600P905j1182J177L944m962J0508k1485q638N052n038j7979n7j2964
$$ 175330 171730 179635 168453 169630 173574 168612 179120 157635 148997 154049 149011 131032 130975 118011
9178A18011J1807R881j3878n570L334j9230K174N804m021R575k403r227l4031
$$ 118011 129818 139699 125821 120251 123585 104355 106529 112333 108312 117887 115484 106257 72226
9165G2226q456J4569J7033m60o68L924j5980k2150R441J3732p683J96p48p955
$$ 72226 63770 78339 95372 94912 94244 98168 82188 60038 69479 83211 75528 75724 74976 67021
9151F7021O655o251m83k797J3728Q957l911l519j2237j3678M371L199J3031L035
$$ 67021 73676 67425 66942 64145 77873 86830 82919 79400 67163 53485 57856 61055 74086 77121
9137G7121j4791J022j207p175L463K327n008Q647J0921k4477Q811J0952l034l4428
$$ 77121 62330 63352 62145 54970 58433 60760 55752 64399 75320 50843 59654 70606 67572 33144
9123C3144j3904o909P651N346O622K0801R780j7144k1096L028K7282O478j0574
$$ 33144 19240 12331 19982 25328 31950 52751 62531 45387 24291 27319 54601 61079 50505
9110E0505k5079j3050J2429J9766m522j4388Q124J1650J1559J4882O081j5223
$$ 50505 25426 12376 24805 44571 40049 25661 33785 45435 56994 71876 77957 62734
9098F2734j5718k2611k6970M544J2921Q291J2433k367p970K630k916j9922J0503
$$ 62734 47016 24405 -2565 1979 14900 23191 35624 33257 25287 27917 25001 5079 15582
9085A5582J575j6248m164P612J9593K0976p994j0815O450p297n212J2306J6643
$$ 15582 17157 909 -3255 4357 23950 44926 36932 26117 32567 25270 20058 32364 49007
9072D9007K5151k21j3586J552j3942P962K5716l578l644j1010j6176m943J4903
$$ 49007 74158 73937 60351 61903 47961 55923 81639 78061 74417 63407 47231 42288 57191
9059E7191K7255K923j9743n950J5312L937K163K957L042n266J8831J9273l79K168
$$ 57191 84446 87369 67626 61676 76988 80925 83088 86045 89087 83821 102652 121925 121546 123714
9045A23714k584m104j4922m013p640l365M339j105j8322j938J3160j4348p720
$$ 123714 121130 117026 102104 98091 90451 87086 91425 90320 71998 70060 83220 68872 61152
9032F1152r100J83P511j177K1461l223m567p114n011j5119j3944J3054L617J0068
$$ 61152 52052 52235 59746 58569 80030 76807 72240 65126 60115 44996 31052 44106 47723 57791
9018E7791n482j9933r354O467j521R646O052j1282p591R703Q964P998O929Q907
$$ 57791 52309 32376 23022 29489 27968 37614 43666 32384 24793 34496 43460 51458 58387 67294
9004F7294j4702j7585J3834J0842j2125q501l606J2646J776J985M489l685n90
$$ 67294 52592 35007 48841 59683 47558 39057 35451 48097 49873 51858 56347 52662 52072
8991E2072q219m944P505R645r996r063K1071L6868K6357L883r03M616K737M030
$$ 52072 43853 38909 46414 56059 46063 37000 58071 94939 121296 125179 124276 128892 131629 135659
8977A35659L566K4607J2960J9597M1889N6407N7605M3220L8306N2028N7967P4473
$$ 135659 139225 163832 176792 196389 238278 294685 352290 395510 433816 485844 543811 618284
8965F18284J44211K41456L68557N84891P93027P12916L91599J45662M8854j09307
$$ 618284 762495 1003951 1372508 1957399 2750426 3463342 3854941 4000603 4049457 3940150
8955C940150m98479q30890p38463m73055k81905j87323j23743q9707o8595o0862
$$ 3940150 3441671 2610781 1872318 1399263 1117358 930035 806292 716585 647990 587128
8945E87128m3650l4428j9438l0397m5577j2086l6235m0788O058p872j1169j2215
$$ 587128 543478 509050 489612 459215 413638 401552 365317 324529 330587 322715 311546 299331
8933B99331j9973J093j3724j2583Q512P908k1339k8925r079k0315R889K275k6357
$$ 299331 279358 280451 266727 254144 262656 270564 249225 220300 211221 190906 200795 203070 176713
8920A76713k0174P430K4070J3976r797l560j962j979J295M367R598L268o891R882
$$ 176713 156539 163969 188039 202015 192218 188658 186696 184717 186012 190379 199977 203245 196354 206236
8906B06236o216q928p579j2403M162K9792K6146K2844J2522N3110J23104J67310
$$ 206236 200020 191092 183513 171110 175272 205064 231210 254054 266576 319686 442790 610100
8894F10100J89792J32126M9473L6513J1031o9963j74591j70818j17655p6885l7851
$$ 610100 799892 932018 981491 1018004 1029035 959072 784481 613663 496008 419123 381272
8883C81272l2920l5101k8086N25N642l2821n1184l1198k4294O167J2847L425l751
$$ 381272 348352 313251 285165 285690 291332 258511 207327 176129 151835 158002 170849 174274 170523
8870A70523j0418m903J295j1977j0301j4162L44N401J3946N791p336j0813M694
$$ 170523 160105 155202 156497 144520 134219 120057 120401 125802 139748 145539 138203 127390 132084
8857A32084r819j0257l1839l2959Q542M4658Q899q227r699k6219j7821K329m892
$$ 132084 122265 112008 80169 47210 55752 100410 109309 101082 91383 65164 47343 49672 44780
8844D4780m136J09o57j0170l724N656n151j1769l874j1872O386L1803L2454J0469
$$ 44780 40644 40753 40096 29926 26202 31858 26707 14938 11064 -808 5578 37381 69835 80304
8830H0304j2208m900M22n006j1167j29L95o656o094L655J6239P561j9259M125
$$ 80304 68096 63196 63618 58612 47445 47316 47711 41055 34961 38616 54855 62416 43157 47282
8816D7282O346l639j7321n430P715K6802J1522l69J2071k2232j2351n338J176
$$ 47282 53628 49989 32668 27238 34953 61755 73277 72908 84979 62747 50396 45058 46234
8803D6234M360j2235l585J166P954j997k3853L269J0772J4718o288L133M971o677
$$ 46234 50594 38359 34774 35940 43894 41897 18044 21313 32085 46803 40515 43648 48619 41942
8789D1942j4383O404J5392l701O073L577j7511J0882K4615K6967N020j0480j1710
$$ 41942 27559 33963 49355 45654 51727 55304 37793 48675 73290 100257 105277 94797 83087
8776H3087k890M360m046J683o902M690k2242k1155n603j042J1107J5768M619j1282
$$ 83087 80197 84557 80511 82194 75292 79982 57740 36585 30982 29940 41047 56815 61434 50152
8762E0152j2723J537R043L287o88M747O99J40P975P454J2336l287j824M469J1809
$$ 50152 37429 38966 48009 51296 50608 55355 56054 56194 64169 71623 83959 80672 78848 83317 95126
8747I5126k127o967p09R024Q69l50q714j2616j6964J2906J2511r18j4418p550
$$ 95126 92999 86032 85323 94347 95216 94866 86152 73536 56572 69478 81989 81071 66653 59103
8733E9103J4542J1749Q506J5679J2789j8417j4553k225q375J7013Q307q466M112
$$ 59103 73645 85394 93900 109579 122368 103951 89398 87173 78798 95811 104118 95652 99764
8720I9764j8314n474O976J746n243j5541Q302K54j2893j4484J9409K6107K1879
$$ 99764 81450 75976 82952 84698 79455 63914 72216 72470 59577 45093 64502 90609 112488
8707A12488k034k724N749Q378m810j6648M98L1706J0221r818j9399J5419J5365
$$ 112488 110454 107730 113479 121857 117047 100399 100897 132603 142824 133006 113607 129026 144391
8694A44391J0603R302o02P39J2577o497J2432J4560J3894J581J8597K7083O377
$$ 144391 154994 164296 163694 164433 177010 170513 182945 197505 211399 212980 231577 258660 265037
8681B65037l836J3942J2591J2470j3169n431K1203K0502L2301L5227J8014L1986
$$ 265037 261201 275143 287734 300204 287035 281604 302807 323309 355610 390837 408851 440837
8669D40837M6833O1851N7282P6120J03192J04636J15870J32633J54011J65418
$$ 440837 487670 549521 606803 682923 786115 890751 1006621 1139254 1293265 1458683
8659A458683J53881K06120K48073K83653M22300O38550R80438J589907K587299
$$ 1458683 1612564 1818684 2066757 2350410 2772710 3411260 4391698 5981605 8568904
8650H568904L731066L964987K457918Q41058L73196m6344j706882l984921m070927
$$ 8568904 12299970 16264957 18722875 19563933 19937129 19890785 18183903 14198982 10128055
8641A0128055k723040j652385j013795o41635m54553l34944k44426k05831j82158
$$ 10128055 7405015 5752630 4738835 4097200 3642647 3307703 3063277 2857446 2675288
8632B675288j46281j20936j38160j28853r8318p5791n8486o1638n1852l7549l1509
$$ 2675288 2529007 2408071 2269911 2141058 2042740 1966949 1908463 1846825 1794973 1757424 1725915
8621A725915k5434l7446l0940m612O775k2559l4417l3361k5152n7615p5674p2136
$$ 1725915 1700481 1663035 1632095 1627483 1634258 1611699 1577282 1543921 1518769 1461154 1385480 1313344
8609A313344p9738o2050n4381o2645p1786n3464l9500l6376l5292m0648j1359
$$ 1313344 1233606 1171556 1117175 1054530 982744 929280 889780 853404 818112 777464 766105
8598G66105M832j3992k8560l0736m870j3454k5030j3970k5903k3187j8080p474
$$ 766105 770937 756945 728385 697649 692779 679325 654295 640325 614422 591235 573155 565681
8586E65681l1130k8220j4447q787o630o957J319k3660k3917j3229j4163O808K1465
$$ 565681 534551 506331 491884 483097 476467 469510 470829 447169 423252 410023 395860 402668 424133
8573D24133J7147r108l6500j6366p398J181J8404J1185J3057L9156N0673Q2738
$$ 424133 441280 432172 395672 379306 371908 373089 391493 402678 415735 454891 505564 588302
8561E88302Q6639P2598J9766M92k696l6759r9316j10275o7989m2494n1375l6699
$$ 588302 674941 747539 767305 767797 765101 728342 629026 518751 450762 408268 356893 320194
8549C20194j3970j7070r344j4456j9196j3305K710J0797J9431k6306m1563k1516
$$ 320194 306224 289154 279810 265354 246158 232853 235563 246360 265791 239485 197922 176406
8537A76406J686M484J1020k276j4774p340o788Q984N028j6141J5436Q137j0811
$$ 176406 178092 182576 193596 191320 176546 169206 162418 171402 176430 160289 175725 183862 173051
8524A73051j3683n39L373K614M56P05j4185j8063n074j3628j5408k1542o928K648
$$ 173051 159368 158829 162202 164816 165272 165977 151792 133729 128655 115027 99619 78077 71149 73797
8510G3797j893N519k272J1607P382J0230J7100p814j8836J383j5429k0155K773
$$ 73797 71904 77423 75151 86758 94140 104370 121470 113656 94820 96203 80774 60619 63392
8497F3392J2309J2878l966j0952k780Q175l72J392m600j4928j2163j6761k33J1950
$$ 63392 75701 88579 84613 73661 70881 79056 78684 80076 75476 60548 48385 31624 31391 43341
8483D3341O839M875K364J3025j887j7182Q07J5012O46j7723o5j5007p348M985
$$ 43341 50180 55055 57419 70444 68557 51375 52182 67194 67840 50117 50052 35045 27697 32682
8469C2682K6663J2701j0629k833K1987n222l3741o642J9451L0006R912Q181K2301
$$ 32682 59345 72046 61417 58584 80571 75349 41608 34966 54417 84423 94335 102516 124817
8456A24817J1129L133j9470j0803j1460j1978r785R249J3716o079r016r724J8528
$$ 124817 135946 139079 119609 108806 97346 85368 75583 84832 98548 92469 83453 73729 92257
8443I2257M012j3212k0019j8928J9701M598j9035k995J5343N945P332j1148J518
$$ 92257 96269 83057 63038 44110 63811 68409 49374 46379 61722 67667 74999 63851 65369
8430F5369J8268k770j5873j2660n683J5036J6281n374q927j3233j6059R586p82
$$ 65369 83637 80867 64994 52334 46651 61687 77968 72594 63667 50434 34375 43961 43179
8417D3179j8461o896L235O458J0848J1478Q166L525m399l4j2443j4486p149J427
$$ 43179 24718 17822 21057 27515 38363 49841 58007 61532 57133 57099 44656 30170 23021 24448
8403B4448J7886J7582J322k4922l750O400Q327J4515l042J454J2853n517j1843
$$ 24448 42334 59916 61238 36316 32566 38966 47293 61808 58766 60220 73073 67556 55713
8390E5713J6970J5226j8696k0856q229J2375r451j2034k962N486R373k191j436
$$ 55713 72683 87909 69213 48357 40128 52503 43052 31018 28056 33542 42915 40724 39288
8377C9288q301K197N422J7270J0106l0545j0810Q178M937N106j804J3877j0705
$$ 39288 30987 33184 38606 55876 65982 35437 24627 32805 37742 42848 41044 54921 44216
8364D4216k046Q68o73Q006N617p787j3001k2622r113O758J1124J0768K924J254
$$ 44216 42170 43038 42365 50371 55988 48201 35200 12578 3465 10223 21347 32115 35039 36293
8350C6293R450m227k608l2177n665J1973J4691P195M772q121l897K553k429J0944
$$ 36293 45743 41516 38908 6731 1066 13039 27730 34925 39697 31576 27679 30232 27803 38747
8336C8747K416O81j5736m782J1671P566n396r624O808M656J0636k4570j5803J8526
$$ 38747 41163 41844 26108 21326 32997 40563 35167 25543 32351 37007 47643 23073 7270 25796
8322B5796L988J593K495j2815j7347J3928o487q104P817J0349M90m135j2693J434
$$ 25796 29784 31377 33872 21057 3710 17638 11151 3047 10864 21213 21703 17568 4875 6309
8308F309J7073J6580j142J3483l801k6452j2529p366J5161J68M982N023q496Q049
$$ 6309 23382 39962 38820 52303 48502 22050 9521 2155 17316 17484 22466 27489 18993 27042
8294B7042k478l6843j70K2251J4196j0779p540p837L975J9104p803L406K844q499
$$ 27042 24564 -12279 -12449 9802 23998 13219 5679 -2158 1817 20921 13118 16524 19368 10869
8280A0869O100J3923L1667L084j6151o645J238q304N728M272J1329j548m088n108
$$ 10869 16969 30892 62559 65643 49492 42847 44085 35781 41509 45781 57110 55562 51474 46366
8266D6366p564p702L67p645P299j3747n296L068J4107Q041j5237m71l383j7178
$$ 46366 38802 31100 31467 23822 31121 17374 12078 15146 29253 37294 22057 21586 18203 1025
8252A025o258K135J7480J8752L0221K5597J2760J7709J745m134j0173o659j6094
$$ 1025 -5233 -3098 14382 33134 63355 88952 101712 119421 121166 117032 106859 100200 84106
8239H4106q840r434J1325j1343q328k3505j378o064r402j6296K7459L1568l399
$$ 84106 75266 65832 77157 65814 57486 33981 32603 26539 17137 841 28300 59868 56469
8226E6469j6466o214p51J7367o61j6882m091J0975J2665j1539l355k159j236O930
$$ 56469 40003 33789 33038 50405 49744 32862 28771 39746 52411 40872 37517 35358 34122 41052
8212D1052j2300L871P221q389j9188J492J695J2942K235k6224j8577L659K1786
$$ 41052 28752 32623 39844 31455 12267 13759 15454 28396 30631 4407 -14170 -10511 11275
8199A1275J0720K462M210Q056M017j7340O24L312J8245j2737p480r407j5878k2826
$$ 11275 21995 24457 28667 36723 40740 23400 24024 27336 45581 32844 25364 15957 79 -22747
8185b2747o338P165J8357J6843J350l703K3482K1611K885k4815j1602J354O158
$$ -22747 -29085 -21920 -3563 13280 14630 10927 34409 56020 58905 34090 22488 23842 30000
8172C0000O223j2834p786K7353M423q653r397q638L818L907J783j3130k462k3888
$$ 30000 36223 23389 15603 42956 47379 38726 29329 20691 24509 28416 30199 17069 14607 -9281
8158i281j0546P918J5197Q146J4266j0829q811O201O629J0153m573P556L960r771
$$ -9281 -19827 -11909 3288 11434 25700 14871 6060 12261 18890 29043 24470 32026 35986 26215
8144B6215m304P850J7434P494m389j0882q26k0729j2616J9590N859J950j551Q665
$$ 26215 21911 29761 47195 54689 50300 39418 38592 17863 5247 24837 30696 32646 31095 39760
8130C9760N834O782j0856p343P8j6705j1627P841p753K0412L623n556J3853j7488
$$ 39760 45594 52376 41520 34177 34255 17550 5923 13764 6011 26423 30046 24490 38343 20855
8116B0855q269J0580j5204q699K1216J2296o527%k723M231n355J0563j431M077
$$ 20855 12586 23166 7962 -737 20479 32775 26248 26248 23525 27756 22401 32964 31533 35610
8102C5610m692Q377O188m560j5801q968J0467P119j533r586J5339r359L594M310
$$ 35610 30918 39295 45483 40923 25122 16154 26621 33740 32207 22621 37960 28601 32195 36505
8088C6505M839l541j4999R690K6456K9287o424M688j833m484j8527k5491m057
$$ 36505 41344 37803 22804 32494 58950 88237 81813 86501 84668 80184 61657 36166 32109
8075C2109J0435K2817P721l3255k523J9200l995j47J4201k782J1378r632j4205
$$ 32109 42544 65361 73082 39827 37304 56504 52509 52362 66563 63781 75159 65527 51322
8062E1322J8177Q663j93j7216P840k1j8523O647j207L85L10j945J3028J062r989
$$ 51322 69499 78162 77969 60753 68593 68572 50049 56696 55489 55874 56184 54239 67267 68329 58340
8047E8340j2311K519n818J5743r908j6523J465L1272L0456o789k762j4593j8843
$$ 58340 46029 48548 42730 58473 48565 32042 33507 64779 95235 88446 85684 71091 52248
8034E2248K1840J948j04J4678K2700k502m112q678J330Q547P35L225J1976O753
$$ 52248 74088 76036 75932 90610 113310 110808 106696 98018 99348 107895 108630 111855 123831 130584
8020A30584j4768j03O428J563j2673P376J3111K353j1189L496k71j0108k0549
$$ 130584 115816 115713 122141 123704 111031 118407 131518 133871 122682 126178 125907 115799 95250
8007I5250J879J7186j8665j4533L735N103p099j619J868p010p32k088M013M209
$$ 95250 97129 114315 95650 81117 84852 89955 82856 81237 83105 76095 75363 73275 77288 81497
7993H1497J2686O400P320L257n85j471K3174J0963j876J0195j3904n353K7542
$$ 81497 94183 100583 107903 111160 110575 109104 132278 143241 141365 151560 137656 132303 159845
7980A59845P096r593L638K195k1767k5769k320P028M711J0183k8669k359J3849
$$ 159845 166941 157348 160986 163181 141414 115645 113325 120353 125064 135247 106578 104219 118068
7967A18068j236k3653j3162o160n448p93J1297J2544j827j8261j2878M261K0322
$$ 118068 116832 93179 80017 73857 68409 67616 78913 91457 89630 71369 58491 62752 83074
7954H3074M084j0113O826Q383J4464n748M11m043l11Q874N39j3541j7657n807
$$ 83074 87158 77045 83871 92254 106718 100970 101381 97338 97027 105901 106440 92899 75242 69435
7940F9435j2856l032P047K625J0773O103n637j5121P176N496J2796j1691k7577
$$ 69435 56579 53547 60594 63219 73992 80095 74458 59337 66513 72009 84805 73114 45537
7927D5537j1140j7979J9609K8017o669J6173m948J1595P867j1457k4756l1635
$$ 45537 34397 16418 36027 64044 57375 73548 68600 80195 88062 76605 51849 20214
7915B0214j4299L064J2933o700Q681J049m199m223K325J2515R350N634n165j618
$$ 20214 5915 8979 21912 15212 23893 24942 20743 16520 18845 31360 40710 46344 41179 39561
7901C9561j5453O424Q33M572Q170J807O899j0764n559p890n133M398N514J3234
$$ 39561 24108 30532 31365 35937 44107 45914 52813 42049 36490 28600 23467 27865 33379 46613
7887D6613R184k392j9011J0313J6474q87j1911j3391k159J1028j0962M053L1506
$$ 46613 55797 53405 34394 44707 61181 60294 48383 34992 32833 43861 32899 36952 68458
7874F8458q690j4049o831j5916N306j1691p333j320J533l196j3523p277j2593
$$ 68458 59768 45719 38888 22972 28278 16587 9254 7934 9467 6271 -7252 -14529 -27122
7861b7122J1055P694J0313K4473K1053j3061K327j2927j5955k189j695n933M67
$$ -27122 -16067 -8373 1940 26413 47466 34405 36732 23805 7850 5661 3966 -1967 -1500
7848a500Q462r771O691J922n475J6685N726j6578j4580J2616O33j9598J858J6762
$$ -1500 6962 -2809 3882 5804 329 17014 22740 6162 -8418 4198 4831 -14767 -12909 3853
7834C853N560J5442k326q401J1559P472r073k8514q34p079j5711p773L495J7413
$$ 3853 9413 24855 22529 14128 25687 33159 24086 -4428 -5262 -12341 -28052 -35825 -32330 -14917
7820a4917n320L093J4649N349j0k820P59O172j7848j755J2266R817J354L247p057
$$ -14917 -20237 -17144 -2495 2854 2844 24 783 6955 -10893 -12648 -382 9435 10789 14036 6979
7805F979q805J2593N795j3293k984N18m203K2547P356k807j4280j7080n803L484
$$ 6979 -1826 10767 16562 3269 285 803 -3400 19147 26503 23696 9416 -7664 -13467 -9983
7791i983L572K418J6828p416j7464k910J9982O333k907j9575O592q071k6835o875
$$ -9983 -6411 -3993 12835 5419 -12045 -14955 5027 11360 8453 -11122 -4530 -12601 -39436 -46311
7777d6311O264L3264J7577p119j5866j1943J2000J1952K6912o92n967N68J981
$$ -46311 -40047 -6783 10794 3675 -12191 -24134 -12134 -182 26730 26038 20071 20639 22620
7764B2620L51N046J3381K390j5891n145j0268k9955k092J6474P380j2761m671
$$ 22620 22971 28017 41398 43788 27897 22752 12484 -17471 -19563 -3089 4291 -8470 -13141
7751a3141J7158m071L767L969O337m576q598R777J9237Q152n104j5686j9016L516
$$ -13141 4017 -54 3713 7682 14019 9443 845 10622 29859 38011 32907 17221 -1795 1721
7737A721P301L175k192j2796j252J7229N179Q561m765j5740Q089M863j4551j0954
$$ 1721 9022 12197 10005 -2791 -4043 13186 18365 26926 22161 6421 14510 19373 4822 -6132
7723f132K017P823k036Q029L049n579j7397J9003K2382j1464j2019p459m408P58
$$ -6132 -4115 3708 1672 9701 12750 7171 -10226 8777 31159 19695 7676 217 -4191 -3433
7709c433r71J237K3293L26k0356k281O639Q391j0839p045j8045o233l28p881K54
$$ -3433 -4404 -3167 20126 20452 96 -2185 4454 12845 2006 -5039 -23084 -29317 -29645 -37526 -37272
7694c7272K179J8666J6046R104J0389N626J918N764j1165j447r374r712P221N23
$$ -37272 -35093 -16427 -381 8723 19112 24738 26656 32420 21255 19808 10434 722 7943 8466
7680H466K11j2088k0972j062J552o315o238R229J4192j861J042p212K430J7075
$$ 8466 8677 -3411 -24383 -25445 -23893 -30208 -36446 -27217 -13025 -14886 -13844 -21056 -18626 -1551
7666a551M512q947r292O804m116r249L122J6868N01j9908j5487K338L328O600
$$ -1551 2961 -5986 -15278 -8474 -12590 -21839 -18717 -1849 -1348 -21256 -36743 -34405 -31077 -24477
7652b4477l453Q465K5275j1605j4376r8K2371J4739M370j655L924N592m212n887
$$ -24477 -27930 -19465 5810 -5795 -20171 -20269 2102 16841 21211 19556 23480 29072 24860 18973
7638A8973k925j5637J4004L968O203j314m861q749k992Q723j5685j5452j1680
$$ 18973 16048 411 14415 18383 24586 23272 18411 9662 6670 15393 -292 -15744 -27424
7625b7424J7602L371J2733K4397J4984k610k4470j2870q755j1186p629J9318J4628
$$ -27424 -9822 -6451 6282 30679 45663 43053 18583 5713 -3042 -14228 -21857 -2539 12089
7612A2089J5367q374o853n7Q775j7224L793J4902j7k865k6333j6025Q488Q998
$$ 12089 27456 19082 12229 12172 20947 3723 7516 22418 22401 19536 -6797 -22822 -14334 -5336
7598e336k854N028J0570j19J2958q237j4930j2214n508J2887M508M440Q846J5321
$$ -5336 -8190 -3162 7408 7289 20247 12010 -2920 -15134 -20642 -7755 -3247 1193 10039 25360
7584B5360j7874j2209P630J1349J1788j6348k5068K0268K461M391J0044j185k1036
$$ 25360 7486 -4723 2907 14256 26044 9696 -15372 4896 7357 11748 21792 20607 -429
7571d29k1143R250O626N629N32k5874n275K1046N413j0180l729k393j516j980
$$ -429 -21572 -12322 -5696 -67 465 -25409 -30684 -9638 -4225 -14405 -18134 -20527 -22043 -24023
7557b4023J6110K7383j5899l2491L376p770J7657J1723L58J242j027R64Q217j2676
$$ -24023 -7913 19470 3571 -28920 -25544 -33314 -15657 -3934 -3576 -2334 -3361 -2397 5820 -6856
7543f856k1739J4345J0382M0j2180L516l377j0775n815J346k713m789J3466j4412
$$ -6856 -28595 -14250 -3868 -3828 -16008 -12492 -15869 -26644 -32459 -31113 -33826 -38615 -25149 -39561
7529c9561p816J3776K2088J6957K475p972j9484m777N091j253O31l631l017J360
$$ -39561 -47377 -33601 -11513 5444 7919 -53 -19537 -24314 -19223 -20476 -19845 -23476 -26493 -25133
7515b5133J192J1940L952o479J729J5052P088m629K0470m678j4087J0018k7228
$$ -25133 -23941 -12001 -8049 -14528 -12799 2253 9341 4712 25182 20504 6417 16435 -10793
7502a0793j7266J2869J4236j986N056L4805l082p82n495j8625m669r648j8553
$$ -10793 -28059 -15190 -954 -2940 2116 36921 33839 33057 27562 8937 4268 -5380 -23933
7489b3933q731j687J5715J293J3700j6425J460J1481N877n401Q086L096r699Q849
$$ -23933 -32664 -34351 -18636 -17343 -3643 -20068 -18608 -7127 -1250 -6651 1435 4531 -5168 3681
7475C681n716q144K594O099j3303K598O528J2567N885j641l878p767N264R935
$$ 3681 -2035 -10179 -7585 -1486 -14789 -12191 -5663 6904 12789 11148 7270 -497 4767 14702
7461A4702j3759r259r07l799k470K841P923m690r382J1865J4597k226R97l886
$$ 14702 943 -8316 -9223 -13022 -15492 -12651 -4728 -9418 -18800 -6935 7662 5436 6433 2547
7447B547j2252k174K0041j69Q584J1995r94n296l464k025k900q768J798O274r486
$$ 2547 -9705 -11879 8162 7993 16577 28572 27578 22282 18818 16793 13893 5125 6923 13197 3711
7432C711P831j0230j6676Q759j433Q427M652R411J3038j516l239o039r622L084
$$ 3711 11542 1312 -15364 -6605 -8038 389 5041 14452 27490 25974 22735 16696 7074 10158
7418A0158j5155r727j3020q139O835N462P800j7823j4877R303L689J9274J0442
$$ 10158 -4997 -14724 -27744 -35883 -29048 -23586 -15786 -33609 -48486 -39183 -35494 -16220 -5778
7405e778k076l196j87J5744j0999k528j1436j2735R606J8552J2996J4309L363
$$ -5778 -7854 -11050 -11237 4507 -6492 -9020 -20456 -33191 -23585 -5033 7963 22272 25635
7392B5635l596j2645o612q741L436J8613m585j922k6611q830J5247K1229J918
$$ 25635 22039 9394 2782 -5959 -2523 16090 11505 9583 -17028 -25858 -10611 10618 12536
7379A2536n282k2711p050J1585J188n034j3606m117K837J9644M681J821J4502
$$ 12536 7254 -15457 -22507 -10922 -9734 -14768 -28374 -32491 -29654 -10010 -5329 -3508 10994
7366A0994k1040j9785J3431L255m235L182l105r580l276K2312Q627r173k426K609
$$ 10994 -10046 -29831 -16400 -13145 -17380 -14198 -17303 -26883 -30159 -7847 780 -8393 -10819 -8210
7352h210P113k952o056m481J3844p007k4657m838J4244J7470r58l516k274J0144
$$ -8210 -1097 -4049 -10105 -14586 -742 -7749 -32406 -37244 -23000 -5530 -6488 -10004 -12278 -2134
7338b134K186j871J1086K966j5026K106J3098J1589m175J1271J4637K4226o36
$$ -2134 52 -1819 9267 12233 -2793 -687 12411 24000 19825 31096 45733 69959 69323
7325F9323j0574j4376r541j9634k0888j5048P704J3253N054N939K0499J7566j3457
$$ 69323 58749 44373 34832 15198 -5690 -20738 -13034 219 5273 11212 31711 49277 35820
7312C5820j2543p795K048j6269m294K2740J3546q376j7686J114J523J5619r4j1728
$$ 35820 23277 15482 17530 1261 -3033 19707 33253 24877 7191 8305 9828 25447 25353 13625
7298A3625J2718j3038j3188J6821k22j1574N188N520j4505r881J4446O809J519
$$ 13625 26343 13305 117 16938 16716 5142 10330 15850 1345 -8536 5910 12719 14238
7285A4238J95l984K341Q611j0686n984k319j3384L998k6255L568j251p691O822
$$ 14238 14433 10449 12790 21401 10715 4731 2412 -10972 -6974 -33229 -29661 -30912 -38603 -31781
7271c1781M812K800m340O863j613K1939J4814j4769l243j4401r04J402L598n97
$$ -31781 -26969 -24169 -28509 -21646 -23259 -1320 13494 -1275 -4518 -18919 -19823 -18421 -14823 -15420
7257a5420j209J2197K522j23k728k7317n422K2451O752j1324Q625m71k0259m623
$$ -15420 -16629 -4432 -1910 -2033 -4761 -32078 -37500 -15049 -8297 -19621 -10996 -11467 -31726 -36349
7243c6349J8066q794j1986m730o26l699J2051J4551L206M096J9404l929r98J2635
$$ -36349 -18283 -27077 -39063 -43793 -44419 -48118 -36067 -21516 -18310 -14214 5190 1261 263 12898
7229A2898j361j5589Q337P498J079r598j9521l999J2469Q223p629j4686Q252k521
$$ 12898 11537 -4052 4285 11783 12862 3264 -16257 -20256 -7787 436 -7193 -21879 -13627 -16148
7215a6148L423n879n220K4Q296J007j87J3093k226j5238o487J7331Q579p628j9010
$$ -16148 -12725 -18604 -23824 -23800 -15504 -14497 -14684 -1591 -3817 -19055 -25542 -8211 368 -7260 -26270
7200b6270j5081m150l758K8413J6450q312q650P734K0917m399j2357M274p180
$$ -26270 -41351 -45501 -49259 -20846 -4396 -12708 -21358 -13624 7293 2894 -9463 -5189 -12369
7187a2369k160M562p28j7862N301J036p579K698M51Q93M554k112J1289J9475j861
$$ -12369 -14529 -9967 -10695 -28557 -23256 -22220 -29799 -27101 -26650 -25757 -21203 -23315 -12026 7449 5588
7172E588j7738K194p695J3346o008k726P717J3216k548k0486j7598O77k570M305
$$ 5588 -12150 -9956 -17651 -4305 -10313 -13039 -5322 7894 5346 -15140 -32738 -32061 -34631 -30326
7158c0326p660K203J1011L536l972J165m973L354J3033J1973j5571j9054L3149
$$ -30326 -37986 -35783 -24772 -21236 -25208 -24043 -29016 -25662 -12629 -656 -16227 -35281 -2132
7145b132J6352j4814j07k0127O145J4809P909j4408l784J1837l931R785o4L357
$$ -2132 14220 -594 -701 -20828 -14683 126 8035 -6373 -10157 1680 -2251 7534 7470 10827
7131A0827n172n489M993L309J062j381J5844j0942p449P686k493q308K191m733
$$ 10827 5655 166 5159 8468 9530 8149 23993 13051 5602 13288 10795 2487 4678 -55
7117e5O270P688p278R8Q710p851O028K6874j950j3125Q65m167p651j4969m244
$$ -55 6215 13903 6625 6723 15433 7582 13610 40484 38534 25409 26274 22107 14456 -513 -4757
7102d757J5528L705j1557q265O77n981J7770J9504j2708j6109j0372J0617k119
$$ -4757 10771 14476 2919 -5346 -4669 -10650 7120 26624 13916 -2193 -12565 -1948 -4067
7089d067J1571O326n474n606j731j0929k0008l937Q772J4034q125l0197M40j2325
$$ -4067 7504 13830 8356 2750 1019 -9910 -29918 -33855 -25083 -11049 -19174 -49371 -48931 -61256
7075f1256K7934K0631J5071J9018J5903k1757o055j1498j0281p61J632L114q647
$$ -61256 -33322 -12691 2380 21398 37301 15544 9489 -2009 -12290 -13051 -11419 -8305 -16952
7062a6952J2680O726K3068O929r954j2338O455O419N453j3147j67o690q590k389
$$ -16952 -4272 2454 25522 32451 22497 10159 16614 23033 28486 15339 15172 8482 -108 -2497
7048b497r232R755J9242N237r212n978O98j7108P523n428p578j803K43o563k210
$$ -2497 -11729 -1974 17268 22505 13293 7315 8013 -9095 -1572 -7000 -14578 -16381 -16138 -22701 -24911
7033b4911O44R629k35L983R149o814j5471L563M092j1985Q859N909J783J3147
$$ -24911 -24267 -14638 -14873 -10890 -1741 -8555 -24026 -20463 -16371 -28356 -19497 -13588 -11805 1342
7019A342J2637PJ6670j0850k3537O715J7678r811j1635q050O591J042j2074m701
$$ 1342 13979 13986 30656 19806 -3731 2984 20662 10851 -784 -8834 -2243 -1201 -13275 -17976
7005a7976J3219N774J1343K4731k268j0226r480K62O89l358k6308j0075R903k077
$$ -17976 -4757 1017 12360 37091 34823 24597 15117 15379 16068 12710 -13598 -23673 -13770 -15847
6991a5847K0692J2555p185k0612j4683k610M740J0582q490j730O238J4722o54
$$ -15847 4845 17400 10215 -10397 -25080 -27690 -22950 -12368 -20858 -22588 -16350 -1628 -2282
6978b282M501N25j8495M988K4246j1522j6442J0206Q024r904j0962j1902J6316
$$ -2282 2219 2744 -15751 -10763 13483 1961 -14481 -4275 3749 -6155 -17117 -29019 -12703
6965a2703O889q308K482k1674j2599R410l471o988J0725r7Q836J7656K8596j4320
$$ -12703 -5814 -14122 -11640 -33314 -45913 -36503 -39974 -46962 -36237 -36334 -27498 -9842 18754 4434
6951D434k0313L290j1949K0828K666j546o540M753L347J0J8428j6549j7689L739
$$ 4434 -15879 -12589 -24538 -3710 -1044 -2590 -9130 -4377 -1030 -1020 17408 859 -16830 -13091
6937a3091r99k353Q459J2763J6731j3385j9514J5033j0669M125L460j0945P67
$$ -13091 -14090 -16443 -7984 4779 21510 8125 -11389 3644 -7025 -2900 560 -10385 -9618
6924i618Q736N176P357O789J689R415j1147n555j2388J7671J4952N583j5930k0068
$$ -9618 -882 4294 11651 18440 20129 29544 18397 12842 454 18125 33077 38660 22730 2662
6910B662j6012J3572J4186n372r993J328N388j0415J771o999R371P206N28j5236
$$ 2662 -13350 222 14408 9036 -957 371 5759 -4656 -2885 -9884 -513 6693 7221 -8015
6896h015k755j4289r707K575k793K0816J1461o314K824P625J0476o351r65O26
$$ -8015 -10770 -25059 -34766 -32191 -34984 -14168 -2707 -9021 -6197 1428 11904 5553 4588 5214
6882E214J809Q936Q943q331l712j2101M453n062j1264O374J8987j8702j5857N590
$$ 5214 7023 15959 24902 16571 12859 758 5211 149 -11115 -4741 14246 -4456 -20313 -14723
6868a4723K631j5211n598K27O665K0082k136l867Q097K6478K4766q459k1182j2341
$$ -14723 -12092 -27303 -32901 -32674 -26009 -5927 -8063 -11930 -3833 22645 47411 38952 17770 5429
6854E429o15M956k0809N663L014q41q085J4273L594n321p866j2406L876J9511
$$ 5429 4814 9770 -11039 -5376 -2362 -3203 -11288 2985 6579 1258 -6608 -19014 -15138 4373
6840D373Q781Q96j4936j4042J1905J8430J4503R818k924n477j1462r257l816j5551
$$ 4373 13154 14050 -886 -14928 -3023 15407 29910 39728 36804 31327 19865 10608 6792 -8759
6826h759n285P478J8548K0194j1498l9668k4755J889O438K496j5657O748L1368
$$ -8759 -14044 -6566 11982 32176 20678 -18990 -43745 -41856 -35418 -32922 -48579 -41831 -10463
6813a0463J7157J1818j8897Q347L1199k6J0639j6869j4840o170k4932j905m045
$$ -10463 6694 18512 -385 7962 39161 39135 49774 32905 18065 11895 -13037 -14942 -18987
6800a8987l542l116J3396J8821N635Q013j5728N350Q341O209k4100J8763J9800
$$ -18987 -22529 -25645 -12249 6572 12207 20220 4492 9842 18183 24392 292 19055 38855
6787C8855p900o134n049o386j6989L810J511j2753j3348J4071N375L441J2926
$$ 38855 30955 24821 19772 13386 -3603 207 1718 -11035 -24383 -10312 -4937 -1496 11430
6774A1430j9712J339N386j1449m512N366M295O4j3198J4061J2505J2108J1963
$$ 11430 -8282 -6943 -1557 -13006 -17518 -12152 -7857 -7793 -20991 -6930 5575 17683 29646
6761B9646J6916K702j1191j2138j1263J5067J2283j5626n472j657l974R059j1318
$$ 29646 46562 49264 38073 25935 14672 29739 42022 26396 20924 19267 15293 24352 13034
6748A3034m307l456k1649n670L166K0877K8602J4135j6887k3970m88P429j146
$$ 13034 8727 5271 -16378 -22048 -18882 1995 30597 44732 27845 3875 3387 10816 9670
6735I670j771m903k5101j1761P344R196r19m543K500Q17J1302o853M834l731J094
$$ 9670 7899 2996 -22105 -33866 -26522 -17326 -18245 -22788 -20288 -19471 -8169 -15022 -10188 -13919 -12825
6720a2825r144J5278J3975q613j933l004J7828L5023j2208j8969l454L686K225
$$ -12825 -21969 -6691 7284 -1329 -3262 -6266 11562 46585 34377 15408 11954 15640 17865
6707A7865j1775K458l031j4328N586L664o769M300J1185J0034j3531j0293J6255
$$ 17865 6090 8548 5517 -8811 -3225 439 -6330 -2030 9155 19189 5658 -4635 11620
6694A1620J4769p800N85J2896O86l612O29Q035N903l4100l1508j48l575j0213
$$ 11620 26389 18589 19174 32070 32756 29144 29773 37808 43711 9611 -21897 -22045 -25620 -35833
6680c5833J12N644J2802J211l527Q408J2183j2864q952o973J7401J281q721n445
$$ -35833 -35721 -30077 -17275 -16064 -19591 -11183 1000 -11864 -20816 -27789 -10388 -9107 -17828 -23273
6666b3273M917n70p573J0474p605j7956L514n136K0173J859N625m295J0971J9855
$$ -23273 -18356 -18926 -26499 -16025 -23630 -41586 -38072 -43208 -23035 -21176 -15551 -19846 -8875 10980
6652A0980J0140r032j0725O663j6334q940O65J7429N893P434m448J1285J1119
$$ 10980 21120 12088 1363 8026 -8308 -17248 -16583 846 6739 14173 9725 21010 32129
6639C2129J358O176j9528k3588j641j044J5664L860J827j0137j0392l503J2023
$$ 32129 33487 39663 20135 -3453 -5094 -6138 9526 13386 15213 5076 -5316 -8819 3204
6626C204L995L579J439j5182q685J0240M288M097q58Q413j759P43j1455m839j2295
$$ 3204 7199 10778 12217 -2965 -11650 -1410 2878 6975 6117 14530 12771 13514 2059 -2780 -15075
6611a5075M171J9236m831j9581N602l49j3603p572o005K1357o240J2745Q905k290
$$ -15075 -10904 8332 3501 -16080 -10478 -10827 -24430 -32002 -38007 -16650 -22890 -10145 -1240 -3530
6597c530j0741j145Q51J4751J4381N261R030r764m387k190P981J777q942k924
$$ -3530 -14271 -15416 -14565 186 14567 19828 28858 19094 14707 12517 20498 22275 13333 10409
6583A0409J8552j6880k5579j515o989P705j42o408j7032q15j3172J2786J3695
$$ 10409 28961 12081 -13498 -15013 -22002 -14297 -14439 -20847 -37879 -38694 -51866 -39080 -25385
6570b5385r035J4564K0377K9369m737m891j8871j739J7764R094k0790J585n592
$$ -25385 -34420 -19856 521 29890 25153 20262 1391 -348 17416 26510 5720 7305 1713
6557A713j1122L985M025K438l455j527J2309O329j448Q872R985r111k6091o737
$$ 1713 -9409 -5424 -1399 1039 -2416 -3943 8366 14695 13247 22119 32104 22993 -3098 -9835
6543i835p425j4704J6260J2924J527J179Q54R230k2620m910R506j375o108K321
$$ -9835 -17260 -31964 -15704 -2780 -1253 -74 780 10010 -12610 -17520 -8014 -9389 -15497 -13176
6529a3176l293n91k930r680o048J3580J7644j0055j2932J808N803j4028P767P548
$$ -13176 -16469 -17060 -19990 -29670 -35718 -22138 -4494 -14549 -27481 -25673 -19870 -33898 -26131 -18583
6515a8583J6247L081j441J2649L428m310Q247P119j5486r096k0161r434K3110
$$ -18583 -2336 745 -696 11953 15381 11071 19318 26437 10951 1855 -18306 -27740 -4630
6502d630N265q480j6361N105j9461K5962J0606m622p36L546k55l205j4556J5784
$$ -4630 635 -7845 -24206 -19101 -38562 -12600 -1994 -6616 -7352 -3806 -4061 -7266 -21822 -6038
$$ [...]
##END NTUPLES=NMR SPECTRUM
##END=
