##TITLE=Analysis number 321753
Compound Code cc 45904
Book Reference 438/166
Project Code adrs
Chemist Name antons
##JCAMPDX= 6.0         $$ Bruker NMR JCAMP-DX V2.0
##DATA TYPE= NMR SPECTRUM
##DATA CLASS= NTUPLES
##ORIGIN= Bruker BioSpin GmbH
##OWNER= nmr
$$ XWIN-NMR		Version 3.5
$$ Thu Aug 24 12:49:54 2006 GMT Daylight Time (UT+1h)  MAYBRIDGE\nmr@NMR_250MHZ
##.OBSERVE FREQUENCY= 250.131544655141
##.OBSERVE NUCLEUS= ^1H
##.ACQUISITION MODE= SIMULTANEOUS (DQD)
##.ACQUISITION SCHEME= undefined
##.AVERAGES= 16
##.DIGITISER RES= 18
##SPECTROMETER/DATA SYSTEM= dpx250
##.PULSE SEQUENCE= zg30
##.SOLVENT NAME= DMSO
##.SHIFT REFERENCE= (INTERNAL, DMSO, 0, 16.522)
##AUDIT TRAIL= $$ (NUMBER, WHEN, WHO, WHERE, WHAT)
$$ ##TITLE= Audit trail, XWIN-NMR		Version 3.5
$$ ##JCAMPDX= 5.01
$$ ##ORIGIN= Bruker BioSpin GmbH
$$ ##OWNER= nmr
$$ C:\u/data/dgb/nmr/ADRS/1630/pdata/1/auditp.txt
$$ ##AUDIT TRAIL=  $$ (NUMBER, WHEN, WHO, WHERE, WHAT)
(   1,<2006-08-24 12:49:26.81 +100>,<MAYBRIDGE\nmr>,<NMR_250MHZ>,
      <created by zg, POWCHK disabled, PULCHK disabled
       configuration hash MD5:
       E2 DF 36 D8 04 B2 41 60 5A D7 A3 38 5A 4B D0 FE
       data hash MD5: 64K
       E3 F3 EC D2 D7 AF F1 F8 7A C3 B4 F1 46 3E B0 B2>)
(   2,<2006-08-24 12:49:43.11 +100>,<MAYBRIDGE\nmr>,<NMR_250MHZ>,
      <Start of raw data processing
       ef LB = 0.3 FT_mod = 6 PKNL = 1 SI = 32K 
       data hash MD5: 32K
       A9 5B 3D BE 71 0C 8B B4 7C 5C D0 22 8A 72 90 59>)
(   3,<2006-08-24 12:49:44.89 +100>,<MAYBRIDGE\nmr>,<NMR_250MHZ>,
      <apk 
       data hash MD5: 32K
       72 60 89 E0 FF 89 25 57 78 2E 66 5B 41 C5 A7 C2>)
(   4,<2006-08-24 12:49:45.62 +100>,<MAYBRIDGE\nmr>,<NMR_250MHZ>,
      <abs ABSG = 5 
       data hash MD5: 32K
       82 A4 55 C8 77 BA 77 C9 14 11 E5 AB 6F F7 21 DE>)
$$ ##END=
$$ 
$$ hash MD5
$$ DB 32 43 7F 6B B2 F3 61 95 19 6D 2A C4 ED 9C 2C
##$RELAX= 
##$RELAX= 
##$RELAX= 
##$RELAX= 
##$RELAX= 
##$RELAX= 
##$RELAX= 
$$ Bruker specific parameters
$$ --------------------------
##$DU= <C:\u>
##$EXPNO= 1630
##$NAME= <ADRS>
##$PROCNO= 1
##$TYPE= <nmr>
##$USER= <dgb>
##$AMP= (0..31)
100 100 100 100 100 100 100 100 100 100 100 100 100 100 100 100 100 100 
100 100 100 100 100 100 100 100 100 100 100 100 100 100 
##$AQSEQ= 0
##$AQ_mod= 3
##$AUNM= <au_zg>
##$AUTOPOS= <19 >
##$BF1= 250.13
##$BF2= 250.13
##$BF3= 250.13
##$BF4= 250.13
##$BF5= 500.13
##$BF6= 500.13
##$BF7= 500.13
##$BF8= 500.13
##$BYTORDA= 1
##$CFDGTYP= 0
##$CFRGTYP= 5
##$CHEMSTR= <none>
##$CNST= (0..31)
1 1 145 1 1 1 1 1 1 1 1 1 1 1 1 1 1 1 1 1 1 1 1 1 1 1 1 1 1 1 1 1 
##$CPDPRG= <>
##$CPDPRG1= <>
##$CPDPRG2= <>
##$CPDPRG3= <>
##$CPDPRG4= <mlev>
##$CPDPRG5= <mlev>
##$CPDPRG6= <mlev>
##$CPDPRG7= <mlev>
##$CPDPRG8= <mlev>
##$CPDPRGB= <>
##$CPDPRGT= <>
##$D= (0..31)
0 1 0 0 0 0 0 0 0 0.06 0 0 0 0 0 0 0.0002 0 0 0 0 0 0 0 0 0 0 0 0 0 0 
0 
##$DATE= 1156420164
##$DBL= (0..7)
120 120 120 120 120 120 120 120 
##$DBP= (0..7)
150 150 150 150 150 150 150 150 
##$DBP07= 0
##$DBPNAM0= <>
##$DBPNAM1= <>
$$ [...]
##$SUBNAM6= <"">
##$SUBNAM7= <"">
##$SUBNAM8= <"">
##$SUBNAM9= <"">
##$SW= 20.6930455092707
##$SWIBOX= (0..15)
0 0 3 0 0 0 0 0 0 0 0 0 0 0 0 0 
##$SW_h= 5175.983436853
##$TD= 65536
##$TD0= 1
##$TE= 296.16
##$TE2= 300
##$TE3= 300
##$TEG= 300
##$TL= (0..7)
0 120 120 120 120 120 120 120 
##$TP= (0..7)
150 150 150 150 150 150 150 150 
##$TP07= 0
##$TPNAME0= <>
##$TPNAME1= <>
##$TPNAME2= <>
##$TPNAME3= <>
##$TPNAME4= <>
##$TPNAME5= <>
##$TPNAME6= <>
##$TPNAME7= <>
##$TPOAL= (0..7)
0.5 0.5 0.5 0.5 0.5 0.5 0.5 0.5 
##$TPOFFS= (0..7)
0 0 0 0 0 0 0 0 
##$TUNHIN= 0
##$TUNHOUT= 0
##$TUNXOUT= 0
##$USERA1= <user>
##$USERA2= <user>
##$USERA3= <user>
##$USERA4= <user>
##$USERA5= <user>
##$V9= 5
##$VALIST= <valist>
##$VCLIST= <CCCCCCCCCCCCCCC>
##$VD= 0
##$VDLIST= <DDDDDDDDDDDDDDD>
##$VPLIST= <PPPPPPPPPPPPPPP>
##$VTLIST= <TTTTTTTTTTTTTTT>
##$WBST= 1024
##$WBSW= 4
##$XGAIN= (0..3)
0 0 0 0 
##$XL= 0
##$YL= 0
##$YMAX_a= 238402
##$YMIN_a= -387852
##$ZGOPTNS= <>
##$ZL1= 120
##$ZL2= 120
##$ZL3= 120
##$ZL4= 120
##$ABSF1= 16.522
##$ABSF2= -4.171173
##$ABSG= 5
##$ABSL= 3
##$ALPHA= 0
##$AQORDER= 0
##$ASSFAC= 0
##$ASSFACI= 0
##$ASSFACX= 0
##$ASSWID= 0
##$AUNMP= <proc_1d>
##$AZFE= 0.1
##$AZFW= 0.1
##$BCFW= 0
##$BC_mod= 0
##$BYTORDP= 0
##$COROFFS= 0
##$CY= 12.5
##$DATMOD= 1
##$DC= 0
##$DFILT= <>
##$DTYPP= 0
##$F1P= 14.0000005364418
##$F2P= -0.99999901652339
##$FCOR= 0.5
##$FTSIZE= 32768
##$FT_mod= 6
##$GAMMA= 0
##$GB= 0
##$INTBC= 1
##$INTSCL= 1
##$ISEN= 128
##$LB= 0.3
##$LEV0= 0
##$LPBIN= 0
##$MAXI= 10000
##$MC2= 0
##$MEAN= 0
##$ME_mod= 0
##$MI= 0
##$NCOEF= 0
##$NC_proc= -5
##$NLEV= 6
##$NOISF1= 0
##$NOISF2= 0
##$NSP= 0
##$NTH_PI= 0
##$NZP= 0
##$OFFSET= 16.522
##$PC= 1
##$PHC0= 142.1619
##$PHC1= 8.54553
##$PH_mod= 1
##$PKNL= yes
##$PPARMOD= 0
##$PSCAL= 4
##$PSIGN= 0
##$REVERSE= no
##$SF= 250.13
##$SI= 32768
##$SIGF1= 0
##$SIGF2= 0
##$SINO= 400
##$SIOLD= 32768
##$SREGLST= <1H.DMSO>
##$SSB= 0
##$STSI= 32768
##$STSR= 0
##$SW_p= 5175.98343685301
##$SYMM= 0
##$S_DEV= 0
##$TDeff= 65536
##$TDoff= 0
##$TI= <Analysis number 999999
Compound Code 99
Book Reference 9
Project Code 9>
##$TILT= no
##$TM1= 0
##$TM2= 0
##$TOPLEV= 0
##$USERP1= <user>
##$USERP2= <user>
##$USERP3= <user>
##$USERP4= <user>
##$USERP5= <user>
##$WDW= 1
##$XDIM= 32768
##$YMAX_p= 448177819
##$YMIN_p= -750593
$$ End of Bruker specific parameters
$$ ---------------------------------
##NTUPLES= NMR SPECTRUM
##VAR_NAME=  FREQUENCY,     SPECTRUM/REAL,   SPECTRUM/IMAG
##SYMBOL=    X,             R,               I
##VAR_TYPE=  INDEPENDENT,   DEPENDENT,       DEPENDENT
##VAR_FORM=  AFFN,          ASDF,            ASDF
##VAR_DIM=   32768,         32768,           32768
##UNITS=     HZ,            ARBITRARY UNITS, ARBITRARY UNITS
##FACTOR=    0.157963299565203, 1,           1
##FIRST=     4132.6476996994, 0,             0
##LAST=      -1043.33573715361, 0,           0
##MIN=       -1043.33573715361, -750593,     0
##MAX=       4132.6476996994, 448177819,     0
$$ Real data points
##PAGE= N=1
##DATA TABLE= (X++(R..R)), XYDATA
$$ [...]
27800 569918 647688 637901 561768 336839 234543 235087 334143 486130 333678 223620 195276
27789 195276 265346 339849 266534 287063 284629 353791 130173 101647 208964 265418 393188
27778 393188 527643 409883 493494 650036 595187 539510 478001 419802 240709 126683
27768 126683 256259 375104 323189 269095 236983 313160 271770 71061 220086 220434 311783
27757 311783 318338 217593 73505 6239 175748 289419 381452 452154 686546 621843 587371
27746 587371 602170 805067 882761 910027 681411 595370 502776 553728 612579 827842 786021
27735 786021 555063 330083 344209 377162 479827 595414 496084 636722 651983 861555
27725 861555 844617 657969 544818 554833 819676 800789 600787 484649 484887 540140 556383
27714 556383 610054 755759 754524 696731 453241 384287 390332 295423 222846 314945 431162
27703 431162 374674 386129 342635 450373 573298 539331 465234 211842 178936 254171 360229
27692 360229 465219 396329 238274 227594 215561 401125 390848 474330 564389 585786 432914
27681 432914 468543 600468 592395 660474 750926 999916 973350 686508 735338 611289 360542
27670 360542 309872 499866 582815 710125 863391 917941 881629 795933 845366 568125 483097
27659 483097 393619 474710 529416 571809 504132 567397 828511 981274 1004098 789890 356275
27648 356275 305569 377131 611064 790692 800188 589329 471528 406996 329966 296196 368109
27637 368109 497069 726537 611967 466858 345118 497390 616794 805150 930985 958417
27627 958417 914641 818440 783342 700038 523054 726447 835923 909749 916997 879753 978182
27616 978182 1067673 915850 723088 743419 866777 722790 674491 771915 936120 974126
27606 974126 916169 977622 934095 649061 513579 644007 501260 606468 857005 975738
27596 975738 950043 855589 858227 738595 690778 689017 715691 840588 998107 793981 639260
27585 639260 674096 674911 540077 415052 598194 618022 430565 540013 717789 930174
27575 930174 925942 718712 869575 915577 792030 855247 990927 963399 849928 806470 818895
27564 818895 942921 977213 966687 910384 893450 1008825 887005 756252 719198 607217
27554 607217 780644 756244 615720 636020 807375 987230 1041956 1079423 1099863 915460
27544 915460 592888 591090 785150 1090179 959962 844084 905117 847221 879688 797273 1044625
27533 1044625 976913 945455 1011320 1115835 1091283 1034749 1022955 1005642 919529 948207 1078400
27522 1078400 1177665 1055467 1281228 1317838 1389594 1438303 1362797 1365457 1350031 1065355 1039074
27511 1039074 1035701 889928 863554 866897 701489 691554 888467 1119203 1251749 1141064 1194275
27500 1194275 1221988 1428898 1317730 1170212 1129081 1441967 1473704 1293768 1262829 1425175
27490 1425175 1546213 1476656 1506910 1611753 1468958 1425585 1399314 1348535 1316261 1294428 1348892
27479 1348892 1374752 1321966 1217658 1191506 1357653 1307913 1378918 1417655 1653370 1540187
27469 1540187 1492671 1427305 1509561 1690991 1563768 1462568 1446666 1507096 1301478 1434653
27459 1434653 1468627 1418284 1343617 1515091 1591024 1529853 1629721 1663510 1465973 1425572 1475278
27448 1475278 1488275 1564275 1568577 1551657 1577243 1596219 1654500 1491899 1467682 1495496 1595403
27437 1595403 1520017 1513633 1846020 2032839 2037628 1937273 1845613 1786020 1772460 1827268 1743886
27426 1743886 1718623 1753389 1647776 1726558 1946805 1997677 1925928 1940037 1870005 2005013 2158663
27415 2158663 2013342 1848327 1963010 2095561 2210268 2261520 2118776 2072003 2249590 2265621
27405 2265621 2136671 2092284 2087516 2047642 2134903 2264440 2213001 2193400 2218448 2291655 2325545
27394 2325545 2472041 2431736 2312780 2098283 2176416 2414657 2480606 2399985 2194201 2333559
27384 2333559 2571351 2505828 2504465 2634924 2672260 2769505 2648547 2502342 2412452 2442081 2416129
27373 2416129 2308154 2346425 2485597 2388741 2263981 2406798 2647898 2759661 2844235 3046207
27363 3046207 3107390 3088547 2972939 2714536 2691740 2842864 2673126 2586356 2715303 2821491
27353 2821491 2915942 2739845 2641984 2663023 2679811 2627925 2610874 2612860 2546109 2514582 2725831
27342 2725831 2741493 2896104 3028066 2932081 3013737 3097296 3113659 2843391 2888825 2772293
27332 2772293 2850305 2994502 3376537 3523006 3406176 3133218 3099978 3160160 3231703 3046534
27322 3046534 2930214 3196483 3281135 3373260 3461114 3377690 3566810 3692220 3678257 3661022
27312 3661022 3594253 3461195 3517694 3681447 3782890 3675291 3600939 3709423 3821222 3910505
27302 3910505 4066584 4118248 4105899 4145936 4232742 4126900 3930050 4078115 4236302 4356796
27292 4356796 4621566 4590171 4354290 4259470 4277491 4277166 4281676 4258575 4268316 4466598 4519695
27281 4519695 4368019 4409821 4424369 4527079 4581914 4589306 4884073 4950934 4793759 4794775 4825144
27270 4825144 4879996 4910891 5019642 5023972 5141690 4968766 5061962 5347305 5433847 5425266 5605836
27259 5605836 5598400 5701188 5781681 5688129 5730703 5709069 5714219 5724792 5653390 5481815 5507093
27248 5507093 5554085 5710901 5935501 5890585 5942448 5999804 6204624 6393311 6422437 6286903
27238 6286903 6259434 6346900 6420993 6470958 6524681 6548713 6611265 6744355 6752400 6875149 7019350
27227 7019350 7011696 7090790 7014331 7098467 7372394 7384447 7289634 7373448 7447933 7734910 8044610
27216 8044610 8115064 8235506 8338855 8316966 8190122 8175288 8221058 8314932 8275865 8296952 8566131
27205 8566131 8775744 8716812 8777679 8743969 8737699 8813778 8885596 9063833 9066864 9139690 9120678
27194 9120678 9033897 9199109 9320678 9422837 9688499 9797450 9917034 10037603 10183928 10131674
27184 10131674 10423783 10404020 10618530 10595411 10608320 10574640 10756706 10939728 11105970 11286054
27174 11286054 11445760 11297317 11166953 11144146 11307108 11583584 11731496 11782028 11654354 11745667
27164 11745667 11978656 12117317 12096958 12264004 12328983 12411467 12652078 12789879 12925199 13001642
27154 13001642 12977138 12964167 13085838 13298307 13373431 13417464 13438603 13786326 13983593 14068838
27144 14068838 14318657 14368402 14230724 14118459 14370434 14528790 14642514 14931075 15056031
27135 15056031 14990432 14764322 14957354 14980615 15151027 15385928 15284195 15333230 15591018 15799734
27125 15799734 15958920 16019200 16004480 16021501 16042874 15859312 15915932 15986714 16022374 16356144
27115 16356144 16539581 16465316 16429859 16455923 16586033 16809374 16884023 16832482 16907347 17009153
27105 17009153 17074323 16949233 17116163 17138609 17393683 17585187 17687280 17895348 18020496 18066643
27095 18066643 18066407 17901418 17878690 17752299 17881780 18157262 18298532 18067563 18016955 18222392
27085 18222392 18090352 17701175 17670018 17882976 17881448 17704293 17681344 17515489 17513030 17676579
27075 17676579 17860504 17915282 17704567 17470117 17593571 17853414 17895458 17927884 17605067 17401777
27065 17401777 17524107 17414028 17331002 17447947 17541199 17406601 17313254 17199432 17169391 17205095
27055 17205095 17075848 16695118 16646810 16805621 16731662 16577777 16514200 16333403 16382999 16464417
27045 16464417 16470539 16188605 16033674 15795759 15656049 15584063 15587940 15643381 15408320 15042022
27035 15042022 15042010 15295887 15352900 15185351 15084080 14934677 14700536 14629906 14696234 14739259 14633037
27024 14633037 14463398 14357644 14249876 14157975 14123777 13832155 13774943 13525512 13433679 13495681
27014 13495681 13439348 13453233 13501872 13353388 13104160 13007216 12917969 12775222 12706175 12447643
27004 12447643 12429382 12269886 12208518 12200483 12140862 12189284 12159601 11999247 11935527 11757869 11650574
26993 11650574 11617078 11687897 11497783 11091822 11045816 11026636 10842853 10721931 10768191 10701567
26983 10701567 10819253 10464439 10090339 9947576 10036115 10043666 9953252 9789552 9838094 9771313
26973 9771313 9669431 9493938 9302008 9243957 9351331 9437926 9500209 9310055 9167376 9148803
26963 9148803 9159876 9025663 8887729 8626137 8429834 8482624 8495635 8473779 8521878 8571049
26953 8571049 8618943 8444181 8332515 8235583 7966493 7817202 7961072 7759339 7654027 7603090
26943 7603090 7625584 7590083 7601270 7581996 7454766 7130503 7102818 7054729 7034463 7070551 6925593
26932 6925593 6886202 6797516 6729611 6814263 6879433 6894235 6776702 6730890 6736171 6625382 6512654
26921 6512654 6366445 6330458 6251855 6286028 6326814 6359254 6330638 6237694 6174834 6118339 5719785
26910 5719785 5497187 5511966 5681995 5704944 5617117 5476244 5513190 5571995 5743727 5859468
26900 5859468 5725950 5495253 5427430 5457539 5268468 5139057 5209215 5182049 5172576 4839347
26890 4839347 4596601 4564890 4698690 4744562 4725185 4510431 4442854 4666613 4804064 4841790
26880 4841790 4998727 5070107 4952471 4761264 4667334 4671947 4496003 4350683 4168146 4174495
26870 4174495 4327270 4533982 4417553 4227481 4179277 3954755 3681442 3810433 3903080 3780699
26860 3780699 3565234 3635948 3601966 3647405 3601085 3668124 3952804 4157029 4153584 3959077 3836278
26849 3836278 3898437 3781752 3893927 3940759 3827997 3697948 3586854 3737667 3591503 3450956
26839 3450956 3452309 3431650 3644137 3738283 3783219 3596047 3388622 3290990 3392745 3325515 3247290
26828 3247290 3051003 2883729 3009324 2964417 2946831 2870229 2794677 2925700 3018131 2984629
26818 2984629 2851597 2849161 2850899 2810033 2734920 2738119 2809088 2933944 2945084 2765182 2771011
26807 2771011 2801687 2683217 2518574 2357329 2279983 2299014 2470238 2355406 2227546 2329480
26797 2329480 2473562 2483076 2390142 2245062 2400123 2378571 2377570 2277297 2115518 2304351
26787 2304351 2076704 1981287 2194316 2432664 2507620 2536580 2434121 2385043 2323383 2203973
26777 2203973 2147067 2331303 2554627 2494450 2510098 2158225 1955384 2058833 2237852 2103563
26767 2103563 2055707 2112377 1951974 1909897 1956450 1959712 1912263 1897527 1934561 1995310 2018296
26756 2018296 2058171 1780690 1840032 1876526 1934927 1922825 2020255 2126884 2032593 2073529 1916938
26745 1916938 1710210 1595170 1819363 1922876 1753985 1673250 1636120 1745035 1829720 1824424
26735 1824424 1940737 1957686 1698692 1557083 1710382 1959662 2206499 2118457 2108597 2045589
26725 2045589 1967513 1749687 1713715 1788985 1799197 1745586 1810631 1730816 1547977 1522784 1448641
26714 1448641 1470258 1681371 1785146 1622960 1550453 1516552 1508072 1500347 1448930 1630897 1678111
26703 1678111 1637439 1668922 1660960 1550173 1502923 1534524 1652389 1619795 1511619 1361768 1235805
26692 1235805 1433048 1431192 1296765 1251559 1255813 1220118 1346383 1300105 1240537 1197893 1222555
26681 1222555 1365760 1471015 1472089 1502566 1376016 1447546 1571770 1456203 1448558 1468611 1331450
26670 1331450 1228823 1256835 1419361 1411013 1065533 911616 1162316 1357089 1178920 895643
26660 895643 824237 994917 1061597 1019523 1019221 1065295 1174826 1385843 1411338 1203033 1078666
26649 1078666 993335 990199 1027228 1026861 1140535 1099647 1036060 1132396 1277418 1174359 1061555
26638 1061555 1087532 1011533 1042947 1002271 909608 792298 658374 799975 999248 1203600
26628 1203600 1019370 978073 1018543 1012852 934494 932370 944708 956277 854897 543937 458888
26617 458888 458452 691882 746650 626655 719818 692643 700089 780976 844625 693550 656862
26606 656862 742587 876155 848854 820008 949948 1040752 1097786 936726 1013364 1101186 927990
26595 927990 878572 872459 876002 924233 911560 830609 744111 840234 785033 537688 583027 582928
26583 582928 589186 613227 666763 778912 855061 733997 660995 720205 767397 786803 662704
26572 662704 768294 836924 925437 745633 439069 746768 924948 859795 982676 1066142
26562 1066142 903706 695175 721277 931321 1136624 1064279 867135 811417 859258 778593
26552 778593 871088 1075918 1067738 942921 868612 1021841 1117975 1108803 963891 676259 628284
26541 628284 760308 637637 574578 591715 401385 273311 329265 418223 577592 848163
26531 848163 810498 697820 658463 770292 721263 866577 922883 853636 812933 631710 474853
26520 474853 465986 638312 764494 794931 882428 815481 698073 515888 569113 647275 811612
26509 811612 767226 641475 744759 724722 545018 451918 516993 690897 572115 608396
26499 608396 863671 907853 866603 798588 801483 798570 701853 854424 940163 776121 839704
26488 839704 773990 757010 549228 480995 690430 857282 868160 800754 595764 541983 668981
26477 668981 795291 1063954 1047434 992871 918515 849178 756544 717173 656634 682102 701898
26466 701898 738209 704484 771149 767866 773861 609314 599897 707108 744980 727300 639065 856519
26454 856519 645197 566559 565867 511396 436040 294044 258835 319060 439355 472698 589590
26443 589590 735656 945755 832531 755121 595349 386319 224391 268185 260547 330522
26433 330522 434665 411750 498458 502979 347410 286793 185103 186944 396221 514037 500566
26422 500566 442388 569336 556992 574873 571961 585942 764643 799424 712696 602812 513786
26411 513786 520441 457511 555303 411180 271425 327798 597190 699819 691331 718280 646689
26400 646689 458292 487956 412372 322550 149783 91320 243014 163102 243867 202060 117657
26389 117657 53257 130525 419215 651657 751727 863865 626542 313854 382939 662663
26379 662663 632962 459534 405245 464629 450917 436832 509525 483180 364917 301133 322369
26368 322369 370657 217415 115621 227098 306224 483745 500500 495442 642355 763394
26358 763394 568817 311483 306134 387855 619490 632384 528995 513408 570974 614584 655907
26347 655907 594942 580294 479716 420257 566098 419112 398492 265320 228528 299148 290441
26336 290441 128114 179472 362415 513132 527203 495200 448663 262501 70430 35525
26326 35525 315165 337537 270754 235431 210800 406161 466748 384935 160537 61610 168669
26315 168669 299417 335181 374244 323832 327124 413459 307748 367047 431310 575518 443456
26304 443456 330986 266433 178995 227096 440766 596936 508890 510672 412963 266118 292373
26293 292373 389677 356236 163033 112272 204507 342559 197677 66568 313726 481517
26283 481517 587830 684515 524880 323249 342046 332460 226141 76473 238431 151198
26273 151198 159194 281817 454607 326220 225281 194754 298469 297035 249850 202339 262077
26262 262077 312621 375877 355341 208515 288680 172481 263080 274261 55763 -19136 19386
26251 19386 83650 102120 222957 219441 256072 274856 153009 161410 34251 -128479 -168775
26240 -168775 -111911 9593 108181 25390 -88887 -375 183626 267290 154374 65239 143548
26229 143548 203191 132217 58664 101355 200073 531177 323467 340392 277819 388229 672643
26218 672643 777561 728572 563016 351874 290008 197362 70236 70140 248121 199495 203252
26207 203252 214643 329609 281314 209305 251673 284683 194535 63774 70661 194333 248873
26196 248873 202615 280603 325775 194973 166388 282458 455256 514904 776193 619180
26186 619180 222151 236489 146167 111090 253937 265267 162050 205677 138665 49591 197339
26175 197339 347768 402487 336116 168440 341394 467137 518868 402104 290480 255092
26165 255092 265811 376267 515033 540130 515825 487812 491411 316705 369741 584591 517869
26154 517869 381011 234589 300832 455217 424583 206221 158439 282320 282164 132682 230465
26143 230465 300864 406203 507652 494532 375420 311494 277621 289723 60642 4129 157139
26132 157139 315057 506080 499763 373272 526311 550243 618647 520645 493165 625801 615872
26121 615872 661298 519235 433558 420146 420893 353906 185497 238895 465413 515943 257617
26110 257617 208679 87395 70316 90216 -3774 151103 300118 454211 358707 315766 194936
26099 194936 231910 216125 192137 129791 216107 368347 331055 278318 402335 501195 481504
26088 481504 437957 350054 331143 437604 351214 85815 185702 255768 335166 361965 327494
26077 327494 338794 256700 188003 250216 372216 476316 249679 101254 165121 91800 162181
26066 162181 421006 377974 178612 135599 199772 274740 417292 229546 -64450 -46572
26056 -46572 -187298 -276975 -109798 6437 174327 67873 20306 -113235 -169926 -130072
26046 -130072 -63445 -101902 -76875 -47347 -55479 -111209 -34264 156831 330581 272243 257909
26035 257909 226233 101263 266409 479916 424809 158426 29385 64641 -100255 -195667
26025 -195667 -56080 -38859 7505 -85764 -27474 113986 186075 -43576 -96121 54552 200099
26014 200099 358252 368772 595506 643873 556254 538836 416775 212193 166009 230158 100679
26003 100679 64937 251548 259312 29290 -270655 -410437 -206320 -32310 146663 138809
25993 138809 64459 141601 118496 158468 129142 263686 63186 -19479 60816 -58717 -96291
25982 -96291 -109579 35867 140179 30891 -122107 -174410 117770 258527 77761 23182
25972 23182 190418 168416 137827 92356 172224 124256 35196 -22249 82538 -65112 -21133
25961 -21133 132329 186667 88089 35455 45154 -27265 30915 114009 142211 302704 423601
25950 423601 261111 80454 -40786 -29087 41527 71020 150167 187875 130645 31316 -138594
25939 -138594 25507 141158 363518 417428 125963 -124986 -177967 59023 352956 302175
25929 302175 175333 104106 116278 95838 42152 43785 61067 58194 102933 157509 135095 174844
25917 174844 303348 478855 359439 90580 -95747 -237432 -106949 50231 -35522 -165803
25907 -165803 -87091 92083 108443 23543 -86467 103682 76225 -111580 -103093 47414 24614
25896 24614 -60113 27400 11951 -28419 -200345 -175779 -17580 49691 -63094 -205138 -131924
25885 -131924 -84934 -13145 217929 271170 151279 42554 188057 182062 81734 67562 17522
25874 17522 71235 -98894 128883 300844 355284 337210 85878 -31128 314454 363041
25864 363041 417154 366922 173031 243213 332530 212468 -10544 -120568 -110666 -17208 16846
25853 16846 29067 164140 162319 83398 58495 122087 -5761 -236792 -174837 83326 133247
25842 133247 131454 136458 134016 89122 -31972 -321384 -206709 -13230 -87764 -130531 -78313
25831 -78313 30801 129523 315795 314844 313455 257403 202525 60253 49693 -50527 -98860
25820 -98860 35739 123077 134563 140269 202279 169532 214847 359486 418983 519470 374894
25809 374894 167974 111920 347189 356812 310392 298797 171825 13681 144248 293423
25799 293423 289957 92 115770 191837 135410 276998 144090 -31937 -179059 -104597
25789 -104597 -73632 -28781 148868 343309 274526 296850 324327 71627 -149934 -145799 -130192
25778 -130192 24027 82132 -12995 141667 225905 302712 297571 169618 159962 140566 102236
25767 102236 195137 361 -12956 75683 38358 38296 39781 69665 62425 160608 238554 322685
25755 322685 112042 120191 32667 14200 40749 24483 -36973 -3694 54380 108720 126517
25744 126517 32698 121424 64237 -253610 -365443 -235903 -94200 175120 171346 14412
25734 14412 -33851 15202 116213 384603 327984 128551 316685 291989 236261 228867 359599
25723 359599 515902 444697 262069 104323 54489 32368 47226 61304 -98747 -166557 -244635
25712 -244635 -381352 -107341 80552 117033 163585 8816 -118161 -253483 -413400 -404524
25702 -404524 -146536 -119658 -75731 -39549 -45835 44763 47997 -14564 -86266 91547 132058
25691 132058 345927 132606 -149318 -172305 -13626 -156468 -241410 -181068 -130016 62756
25681 62756 176507 204261 53485 -98186 -135301 302421 586394 381443 256086 206975
25671 206975 208852 129340 119882 170430 54385 -27234 -29264 146429 226243 128811 120533 151310
25659 151310 203021 58222 42180 67106 17613 136920 -9871 -101182 -148025 -194918 -239293
25648 -239293 -182591 -213571 -146194 -32383 -21220 5203 81355 -177645 -325488 -230557 25182
25637 25182 -19380 62587 39530 -190314 -155182 -128706 -69956 -104988 -28413 -137996 -218844
25626 -218844 -153302 9237 -89189 -324649 -196479 -206214 -337932 -187442 88101 66925
25616 66925 5221 28548 111490 138761 2640 -110092 -47874 -144677 -201351 -42719 44149
25605 44149 -89767 -96593 -31236 184770 208492 219081 285187 201386 74264 189413 94716
25594 94716 181714 282965 280173 98455 -125862 -165699 -72546 15096 2128 62040 235196
25583 235196 194879 22017 11437 -14061 -202517 -251204 17763 -127268 -108554 94878
25573 94878 123253 327772 297314 291754 61572 -80808 182430 153074 190775 17301 -25862
25562 -25862 125250 159757 139890 48177 -75285 -171436 -286373 -374538 -337194 -119020 -92362
25551 -92362 -47698 -47439 -156180 -251851 -240903 -102391 23067 -118 17260 -41992 -119593
25540 -119593 -268021 -341789 -274243 -226203 -196536 -91640 -137142 -205520 -207148 -1034 63778
25529 63778 1628 -270033 -244200 -161254 -82613 49827 69890 -34640 -132677 -113852 -170771
25518 -170771 -183296 -198536 -9292 127135 421224 442157 315385 84666 -118478 -75619
25508 -75619 7423 76901 -196962 -232995 -139648 -322152 -137910 -16291 -27875 -152652 -204179
25497 -204179 -278521 -366649 -104518 99298 44477 -60777 13919 -36456 -70979 -124186 -130045
25486 -130045 -80057 72603 347022 279562 150911 24324 -222619 -124307 -43907 20778
25476 20778 -47331 -13966 -162176 -67675 167860 20257 -84748 -110449 -59992 176052 36575
25465 36575 -128378 -198413 -186670 -292190 -91626 162149 161908 -70987 -94586 -14660 -125907
25454 -125907 -178419 -202517 -114381 63670 301443 288379 278143 368592 30499 -104483 -26747
25443 -26747 56472 82885 11915 -61354 -161402 -153047 42236 -88779 -195194 -215455 -107711
25432 -107711 -92857 -149131 -187102 -90118 -161696 -180177 72018 201740 73761 -131930 -151814
25421 -151814 9215 -12868 -47788 -21281 -75827 -36120 204439 190040 -47319 -193364 -162781
25410 -162781 127219 304603 414338 503165 357104 73288 -130714 -124399 -118387 -93160 -210427
25399 -210427 -170830 -310452 -341137 -243530 -141688 -209744 -169556 -39436 -73474 -78488 -88166
25388 -88166 41017 187794 62690 57989 271013 578617 529648 221514 40815 153949
25378 153949 86600 128855 60685 -40882 -117412 -256379 -214604 12032 188867 496578
25368 496578 426554 205181 168188 129216 53635 48896 20610 158910 194521 111281 -4205
25357 -4205 -208209 -217581 -258830 -190800 -175384 -115593 -40914 -42467 46974 84162 179824 106632
25345 106632 77685 187332 201647 112459 161748 286968 446634 378133 248703 222362 102181
25334 102181 138120 199335 -27227 -346467 -360466 -308012 -328112 -296190 -271058 -172008 -146457
25323 -146457 -52259 -108083 -141687 -152919 -108761 -35273 -12145 8759 -38402 63375 12867
25312 12867 127258 460932 540236 618236 434796 324916 360898 413498 342722 422823 330756
25301 330756 157740 -60420 -51182 118405 203250 98568 63421 42236 -71130 -206815
25291 -206815 -153070 -116801 -150578 -130347 -167406 -359959 -166857 180190 308288 180293
25281 180293 -30101 -13883 -59198 -189557 -217653 2075 194924 294404 146652 73201
25271 73201 117604 104318 -72720 -126878 33670 108361 230114 -50055 -67374 78815 31633
25260 31633 -96820 -106552 -237227 -213389 -103411 16403 158222 124276 -56974 4035 31211
25249 31211 -34532 -54732 -64099 -120409 -285173 -348330 -287994 -73140 120079 43033 -111286
25238 -111286 -48213 -106424 -11890 -166134 -76306 40744 -74967 -237464 -328741 -142596
25228 -142596 -192251 -228665 -123192 -15566 -66500 103487 -29149 -236523 -482979 -518683
25218 -518683 -403338 -215642 -80570 -75038 -111570 -237926 -307801 -286239 -297054 -265356 7303
25207 7303 78689 80301 37251 167873 326846 568244 356873 100177 50176 -170710 -270696
25196 -270696 -226444 -113611 88531 292117 33677 -96190 -383 63154 -29587 -177275
25186 -177275 -146503 221532 129902 119380 78970 -49913 -174321 -180470 -137075 51657 117697
25175 117697 -157259 -254682 -83397 -12372 89818 80718 246270 300786 215734 239950 266576
25164 266576 260253 343102 236263 76874 -221242 -397297 -277537 -133907 -48263 65608
25154 65608 164539 -115931 -159420 36739 -26558 -161093 -208260 -171813 -212658 -164878 -8688
25143 -8688 39395 171303 303173 246630 158133 -5948 42060 -20719 -227744 -339384 -203529
25132 -203529 -97772 -136695 -124502 -63657 87532 214014 97590 -103238 136142 268390
25122 268390 189180 18336 -17818 -16510 8351 -51028 -20307 23894 66487 3205 -206459
25111 -206459 -288982 -226091 66471 303138 247433 -20184 -313111 -253762 -211531 -61634
25101 -61634 -118436 -98 88250 25810 22723 186821 223906 96136 92149 196829 148923
25090 148923 -123218 -164922 -83028 -55978 4758 -10928 -203610 -429049 -284840 -134709
25080 -134709 -267264 -122080 -64220 180964 119593 25076 -108411 -129606 -172931 56868
25070 56868 194620 92252 6308 -259678 -39107 -15285 112450 46565 -144449 -263398
25060 -263398 -311790 -252193 -219084 -95500 -135621 -310096 -338717 -392454 -391271 -276689 -235903
25049 -235903 -249752 -5788 142660 164851 46918 47528 140604 30031 -275686 -273256 -305137
25038 -305137 -326468 -327518 7110 126947 80695 -11057 -248246 -188606 -22182 47368 72737
25027 72737 150670 8660 -63184 -28326 -63147 -186188 -116246 36298 13880 202927 195841
25016 195841 133562 74448 16135 -128386 -197659 -94973 29553 213788 195634 86328
25006 86328 -211773 -289208 -267192 -160163 -176850 -202769 -319191 -459276 -462059 -244905 -276117
24995 -276117 -339580 -235082 83143 205873 165094 -129580 -377690 -207482 -134256 -148086
24985 -148086 -59222 -81064 43650 -125318 -337805 -286596 -160557 -157954 -278479 -182989 -302882
24974 -302882 -423531 -369656 -307032 -157453 -183978 -152540 -123102 -27321 70721 -120388 -221047
24963 -221047 60068 69780 3742 71499 161748 135144 91786 -76910 -276399 -351896 -293320
24952 -293320 -143718 -106384 -123159 25563 167162 326117 244507 62342 -36599 130854
24942 130854 -66421 -136456 -174948 -205402 -145497 -91952 -236564 -234224 -222437 -123616 -31884
24931 -31884 -46149 111728 149391 -13475 -310111 -273919 -69124 105371 48319 30328 135963
24920 135963 81014 -240567 -436034 -421194 -270759 -153418 -272046 -189656 -64186 -194288
24910 -194288 -169444 39554 112787 73931 -23778 140196 253438 179688 32332 -166726
24900 -166726 -103093 -6011 -110427 -79606 -168255 -237057 10009 59621 145061 295791 304039
24889 304039 381855 450932 431442 183772 47117 29330 -52603 -51017 -153567 -121001 -70676
24878 -70676 -210591 -289830 -125857 -86204 -38853 72366 -72071 -149753 -116178 -67938 -57320
24867 -57320 93831 115939 184236 76891 -197743 -171206 -259499 -192712 115921 158927 29784
24856 29784 -10679 -181665 -84765 -89136 -169288 -335189 -354559 -217941 -60112 -69617 -256562
24845 -256562 -331511 -310206 -162740 34442 267755 77119 -8453 -663 -10816 -204102 -304375
24834 -304375 -341188 -274206 -101619 -129636 -95911 -224282 -31660 103907 193427 249741 231040
24823 231040 283975 276230 149244 158803 -71259 -274572 -102051 -4272 -89579 -163834 -62625
24812 -62625 -157557 -120870 -62973 -12805 -47495 -169204 -263152 -10558 183977 162781 -47693
24801 -47693 -69142 -62996 86055 -14090 -77210 -196848 -109682 35042 205285 165814 -6679
24790 -6679 -52587 -44438 -49946 -131238 -49599 -114666 -229432 -296538 -159773 -13415 39252 79929
24778 79929 135835 100769 9984 -43419 -27379 136844 292991 258807 318563 198219 114286
24767 114286 81921 5849 -177508 -322948 -110850 -29933 -55965 148429 126161 250830
24757 250830 282158 209686 156972 34335 -143112 -57166 -84861 -9721 187221 -771 -188885
24746 -188885 -171118 -96805 45613 157521 162033 230983 293671 198256 235646 313936 361174
24735 361174 232308 65551 -68251 -68712 -12018 -58008 -166997 -293996 -251378 -45343 8813
24724 8813 -244343 -228365 -169452 -204875 -349402 -197800 -97981 51055 -94673 -317481 -360133
24713 -360133 -417798 -297363 -127378 88963 94466 64566 14033 -212286 -388828 -355354 -204488
24702 -204488 -24365 -79929 -85466 -88704 -47395 100675 113491 -37172 -262184 -249991 -99194
24691 -99194 -121617 -272313 -134110 -48452 -127068 -286287 -262300 -262795 -287433 -386952 -378125 -291772
24679 -291772 -197310 -46296 -119016 -130732 -213004 -332759 -311890 -129734 140293 208985 236264
24668 236264 277472 298436 298159 235307 353369 488241 426556 395895 385760 199736 100080
24657 100080 -41418 -107780 -114351 -8252 58807 -58899 -147547 -124495 -187052 -195381 -247120
24646 -247120 -253059 -181448 -182288 -64059 68711 219339 222758 215501 245591 60246 32066 -157645
24634 -157645 -337671 -315592 -335707 -230878 -192906 -392455 -529822 -563771 -290589 -12022
24624 -12022 -97641 -199817 -216933 -335034 -271759 -45789 -35895 -108147 -310429 -164465 -241763
24613 -241763 -197864 -161768 2070 183762 61915 132686 165996 -87132 -37030 -56293 -70566
24602 -70566 -27807 -76354 -100859 7778 77976 115278 69893 -208626 -411551 -321606 -199218
24591 -199218 -3686 -217132 -328877 -396488 -361180 -381153 -225294 -116355 -145565 36713
24581 36713 160606 3771 -104162 -8180 -13696 -160563 -47288 167602 252440 138810
24571 138810 181183 9140 -9736 130140 97156 132061 223648 199767 192194 2380 -139557
24560 -139557 -91912 113140 195886 142569 244100 342220 87744 -86658 -62978 -128464 -16998
24549 -16998 28373 95447 31672 156463 -25094 -202596 -190082 -335899 -296825 -358112 -372990
24538 -372990 -176891 -136058 -128755 -137479 -190052 -272745 -149707 26854 98098 15970 -24980
24527 -24980 -121352 -122783 -35030 -13722 -207793 -180050 -56252 25808 17582 -129694 -198610
24516 -198610 -303666 -365672 -90645 86260 105293 54857 89267 -88471 -73359 -108457 -281618
24505 -281618 -344312 -236404 -203849 4512 -5178 34984 909 96208 127659 112110 36044
24494 36044 143748 103535 -276685 -475495 -293540 -118455 98325 293891 328692 322784
24484 322784 222145 198948 215407 -888 115533 132741 -44606 -70957 86054 181837
24474 181837 312369 331648 194736 -2929 -101281 -43975 211658 276234 236338 57168
24464 57168 -30567 -91420 -213060 -156062 -33092 -6863 -85753 -59153 60577 87003 189170
24453 189170 45642 89832 105951 143437 93670 74415 -11956 -156846 -333840 -408528 -600403
24442 -600403 -413062 -111877 148844 153658 -175079 -189785 -16706 -72492 -162364 -375400
24432 -375400 -314312 -196551 -131456 -112297 -103406 34253 -136458 -151250 -7412 -102076 -257268
24421 -257268 -3080 -54697 -172150 -198465 -44357 46364 81163 -1933 41406 -73913 -26328
24410 -26328 -101135 -81488 -246584 -278951 -186263 -35919 -68648 -197827 -177162 -231772 -288516
24399 -288516 -443817 -290511 -275238 -406009 -303539 -257694 -3082 79329 -16385 -183338
24389 -183338 -336914 -247756 -368381 -532316 -435283 -368856 -187510 29935 76395 -32090
24379 -32090 4312 109794 -81491 -198171 -102076 55345 200107 275818 225403 290909 311301
24368 311301 202219 18675 -146324 -168855 28167 94649 42172 86123 194548 -50482
24358 -50482 -296810 -355087 -157362 -153259 -254976 -353499 -431204 -394785 -384365 -366099 -358732
24347 -358732 -188406 -157537 -138526 -224062 -375854 -207638 -58224 -204597 -242573 -419369
24337 -419369 -333704 -46602 136825 231386 -2145 -82984 142479 228981 47627 30256
24327 30256 -158210 -175378 -165411 30816 -93973 -55851 -23080 -300954 -330341 -421000 -336515
24316 -336515 -332014 -205994 -192573 80847 63879 -352613 -445317 -417640 -336507 -254913 -177688
24305 -177688 -15058 -116679 -108117 141164 210343 -86677 -213148 -232014 118185 331857
24295 331857 144719 -37693 -244506 -373257 -420491 -296376 -191043 -159132 -260004 -158818
24285 -158818 -118342 -154671 -119817 12038 139060 75243 126757 -4873 634 -2282 182349
24274 182349 -1077 -140836 -140456 -210858 -222915 -109729 19971 71345 -172648 -201410 -170472
24263 -170472 -104349 167714 120031 131396 -64172 -63897 13640 -26575 58609 183577 87802
24252 87802 14818 153059 173073 32823 -42423 52809 -65534 -59289 43407 221798 219908
24241 219908 172611 284446 241435 135115 312025 210942 31564 88359 116573 107200 184090
24230 184090 84562 -137636 -315313 -17765 326521 467649 332963 219525 193851 152945
24220 152945 -4267 86153 16120 -135682 -170817 -63329 -32216 -184376 -306743 -510120
24210 -510120 -337084 -99536 -110448 -165654 -30810 70804 118380 121140 92710 86411 -18855
24199 -18855 -123372 15180 47805 259769 357413 345905 263492 172310 -29015 -140424 -180095
24188 -180095 -169410 13312 -72606 -246951 -242293 -339793 -181687 -115400 2689 68740 101881
24177 101881 6368 57368 80781 -34003 -159650 -158793 -44471 -79647 -9932 -95025 -255790
24166 -255790 -265968 -161752 1907 -24132 -227468 -166858 -147541 88188 273198 228358
24156 228358 192448 117795 162293 69032 -30863 -91698 -57596 -71051 -234196 -132524 -208486
24145 -208486 -60334 100135 308976 104134 -38932 -138748 -137910 -207707 -252560 -128778 -27961
24134 -27961 41757 -131790 -219308 -256352 -291918 -242957 -199433 -277283 -377453 -375549 -166084
24123 -166084 -126603 50008 151202 -19422 42026 226546 82509 -169701 48307 72935
24113 72935 -60278 -200519 -52028 -72185 -160564 -274161 -136510 -1071 -9405 -36754 -186391
24102 -186391 -190662 -83312 -51430 -23854 -54635 -59734 -176760 -175182 -151517 -245977 -177854 -88351
24090 -88351 -202840 -263676 -63739 182419 142517 -47646 -157758 -208430 -151803 -149111 -67156
24079 -67156 45558 -72 -76055 19740 -129734 -207150 -243512 -101055 -201458 -173536 -109671
24068 -109671 43392 104112 1476 -43591 119157 156321 -1220 -23285 35450 109689 42681
24057 42681 -222106 -191426 -219805 -489527 -455011 -319560 -273179 -259684 -179395 -70504 -75584
24046 -75584 -68685 -82393 -139959 -35993 -5038 -184799 -307317 -245158 -47929 -7078 28412
24035 28412 -96795 -240631 -220107 -235320 -206767 -254855 -215562 -57062 30529 56280 1070
24024 1070 143340 205551 212282 236182 66014 28882 193620 294749 227245 116742 51948
24013 51948 99754 -110239 -182438 109997 104792 84443 18186 -183234 -308154 -246000 -401342
24002 -401342 -197713 86686 126094 -54881 5975 -125297 -319572 -489145 -347917 -188952
23992 -188952 -11584 99219 -25689 -4036 -123716 -58460 44509 -103514 -109606 118427
23982 118427 185148 209598 41528 -33349 105007 28421 -123376 -314225 -228003 9353
23972 9353 121946 317543 333239 435467 218185 131717 7907 44884 209583 224131 53150
23961 53150 50699 282921 448234 351995 26377 13079 70893 54029 48458 180684 99498
23950 99498 91995 155170 157791 51715 50841 257303 108880 -99657 -19142 -30141 -231964
23939 -231964 -210765 -96293 32180 70221 123383 109692 47688 107499 139123 163537 107110
23928 107110 126205 121278 93528 148645 189449 94952 -51801 -145654 -58069 55736 121454
23917 121454 138019 6646 152587 275866 146849 40846 -38927 46058 187577 234663
23907 234663 77579 142148 119687 22266 -36006 113629 335167 255112 -52746 -207421
23897 -207421 -207030 -245329 -198277 11745 71755 165346 -91223 -48124 1608 76479 155987
23886 155987 82251 -84554 -377894 -248633 -125157 -482096 -457570 -370792 -330321 -370547
23876 -370547 -438164 -400517 -453804 -352244 -123908 29840 -120282 -400890 -410812 -329870 -74093
23865 -74093 193532 157393 71451 82549 322036 280766 248237 191871 293506 159531 19056
23854 19056 -59312 -221605 -225882 -285903 -251014 -183721 -25908 118143 98410 45886 -214108
23843 -214108 -324868 -268750 -214519 -268533 -250689 -256039 -193310 34279 30299 -224318 -398101
23832 -398101 -310575 -294074 -453563 -362260 -344127 -361742 -314123 -130793 -13010 52511 -123752
23821 -123752 -194137 -174575 -206717 -134154 -189712 -227563 -166651 -149833 -151313 -121921 -34942 99224
23809 99224 346282 330870 351360 312494 307554 282106 325520 205739 176843 99134 90663 78740
23797 78740 33460 -129034 -143973 6231 -143313 -192942 17310 42102 241908 247614 47552
23786 47552 47515 189339 116210 8826 -86478 -203710 -277344 -76583 -229461 -303540 30894
23775 30894 32765 142351 270092 439241 413843 297552 211351 187362 17324 183785 161519
23764 161519 -3867 -75717 -33148 153108 -85445 -82306 10215 -70011 -224103 -141389 -146284
23753 -146284 -284094 -280294 -259448 -368285 -339300 -322486 -305092 -326314 -172195 -255973 -192246
23742 -192246 -124883 2884 174682 39284 -113029 -171334 -121567 -32767 -255930 -402821
23732 -402821 -348567 -138790 -5152 -20057 33145 6009 -14794 40776 -70321 -74063 -93276
23721 -93276 -56997 12004 13871 -39582 118211 97985 -81774 -253800 -266446 -62263 42228
23710 42228 152560 142630 81234 -1057 117334 328434 310113 -40853 -218669 -171010 -13756
23699 -13756 36283 81080 93865 221455 346863 364720 306084 26797 -62469 16044 -10194
23688 -10194 5184 10117 51058 143808 240200 141049 21489 -24264 17711 87357 136244 -101460
23676 -101460 -231081 -272729 -328076 -210680 -119578 18840 35526 44210 217274 234763 163634
23665 163634 111207 132404 161360 171778 113470 68706 -122521 -132812 -270687 -336268 -275215
23654 -275215 -166311 -4670 -85190 -23021 -108278 -269102 -198317 15153 175316 10039
23644 10039 -198087 -122620 -17912 26089 -12847 -199105 -135099 44606 215941 178914 80956
23633 80956 -13210 -166735 77725 234029 85165 121912 364212 187263 83047 3605
23623 3605 546 156017 76591 -3469 62159 107595 80124 -155266 -210232 -118928 -11868
23612 -11868 -83788 -61901 -186477 -182702 45250 123234 -38283 -359906 -175964 129831 86777
23601 86777 -165048 -28287 -42562 -100492 -117692 20306 75200 -168325 -251904 -222010 -115110
23590 -115110 -230090 -244957 -164128 -108549 -135149 -211681 -193716 -134721 -44722 -154246 -103070
23579 -103070 -64425 -219913 -89054 5864 -37960 -86348 -78627 918 81064 73236 149790
23568 149790 -3723 -115260 28356 96168 212332 345059 134857 -129113 -242333 -114013
23558 -114013 -159951 -204503 -224011 -188880 -38251 156045 72987 120388 38484 43141 2963
23547 2963 79276 194555 -16463 -233093 -67051 -68902 -194488 -195203 -400859 -506353 -521111
23536 -521111 -420967 -256998 -178575 -176460 -194821 -134874 -64295 1442 -129660 -87932 -30313
23525 -30313 51163 -45719 3686 158448 179653 381491 456557 317701 36873 -196180 -122290
23514 -122290 -214999 -15257 198429 191657 121434 94311 -13762 -41344 -133177 -398936 -553414
23503 -553414 -420613 -351016 -181855 -29527 -32057 -42407 -260979 -363674 -190958 53035
23493 53035 2786 -136245 -266626 -322909 -200905 -50940 -32238 7531 80458 236492 100742
23482 100742 -133457 -135129 -308874 -291479 -78764 -93836 -35962 40499 -68040 -82610 -123940
23471 -123940 -312911 -439651 -270450 -186638 -27517 84372 -82810 -2829 43962 19356
23461 19356 -64225 -78922 81798 124600 214963 116616 59014 -16063 -217067 -266128 -120119
23450 -120119 -64236 -270431 -295883 -309657 -109996 -84031 -65716 -111906 -382919 -305466 -79455
23439 -79455 -67533 -82683 -389882 -496516 -491548 -547692 -476886 -406708 -174181 -296684 -281741
23428 -281741 -123417 -195212 -208303 -457432 -522706 -539051 -638930 -523400 -330973 -134254
23418 -134254 16512 -65482 -116001 -100412 -155976 38099 -74919 -231424 -120360 -92430
23408 -92430 -48040 79497 25115 -169215 -369236 -391793 -289354 -160437 -36152 -9530
23398 -9530 -45559 9936 32077 94746 44719 -50329 -108552 -147108 -172121 -71688 66605
23387 66605 -17442 -45388 52212 -162771 -69255 -86667 12098 119664 134604 109078 40056
23376 40056 -135704 -142625 -269305 -324360 -369586 -406134 -284224 -246089 -141736 -12879 -29476
23365 -29476 -129303 -146407 -121629 -146932 -183830 -162415 -283216 -571726 -587902 -508814 -479995
23354 -479995 -478108 -265115 18319 181975 415155 354856 159759 28067 34944 30536 111491
23343 111491 -4054 139840 69531 -30658 -179097 -150911 -200999 -178797 118504 183388
23333 183388 164138 196150 348037 183324 71427 -52931 -49492 -52473 -24485 -37759 -19156
23322 -19156 -135369 -248821 -295973 -249723 -135610 -107060 -150521 -54529 12034 -134799 -72235
23311 -72235 40035 188893 368474 471353 199596 -142994 -261780 -179420 120527 145553
23301 145553 184158 155982 68247 89715 -18422 107182 273693 348676 260616 84381 -31911
23290 -31911 -123923 -132281 -278163 -320714 -125956 -207555 -144245 -208340 -32828 331901 459383
23279 459383 278582 -116896 -276385 -372198 -165960 60266 25774 1712 -103647 -218920
23269 -218920 -59380 15900 107563 241624 168818 239301 220018 143340 -138804 -308711 -247989
23258 -247989 -222045 -203890 -124401 -55242 -157620 -235711 -325455 -285564 -366573 -115220 77069
23247 77069 -70681 -155006 -33197 109905 -220603 -253674 -117800 -98313 -123929 -188276 -356221
23236 -356221 -363079 -255630 -162521 -95636 -5185 93267 65266 73090 156153 -36473 -247423
23225 -247423 -39780 -101662 -294241 -343021 -572356 -423458 -270810 -138202 -109379 -204161
23215 -204161 -194280 -262125 -342438 -214473 -74815 25434 18450 105101 239202 198274 31089
23204 31089 -168703 -233715 -119070 -30342 -188511 -321107 -560810 -391081 -75184 82834
23194 82834 105276 188035 136755 31149 247524 450893 349137 129654 -48325 119978
23184 119978 -57438 84603 254884 104693 86398 132492 343733 455984 367776 130521
23174 130521 -120277 113296 181829 63013 -80139 -40562 -37447 67867 112689 292760
23164 292760 199739 118530 -192765 -292437 -188460 -209101 -102366 126359 26184 169303
23154 169303 -21297 -152947 -37694 300162 326062 199223 45464 -3702 261672 505514
23144 505514 430957 218474 23227 123817 -84287 -295675 -461515 -246372 -130868 -217107
23134 -217107 -57780 -197956 -232807 122210 359143 529894 357812 77217 21793 95647
23124 95647 120840 127922 -59623 -60721 -294474 -345509 -158480 -304420 -368951 -233152 30954
23113 30954 44487 -10000 192103 13708 -154826 -97940 102590 81344 -80539 -37048 196374
23102 196374 308447 286237 225683 253969 302922 268409 192903 200806 321037 518959 832513
23091 832513 1158531 1276340 1379216 1482528 1665399 1808398 1863284 1588538 1340515 1198575
23081 1198575 891377 621170 513900 374654 323554 432524 610338 448912 337831 140123
23071 140123 139699 264826 251789 165487 51818 7877 189926 384574 336574 83522 -40091
23060 -40091 75945 410001 573242 258472 -78756 -128422 50019 134634 129808 -2929
23050 -2929 -163729 -219041 -221123 -57134 -219325 -62612 -48661 -221087 -223843 -145223 40253
23039 40253 124232 93226 -56566 -28162 68351 10779 -697 80882 38546 -85679 -161274
23028 -161274 -125872 -86496 -165261 -168232 44253 -9136 32591 117262 18698 96539 276870
23017 276870 212160 284451 375334 249661 191918 319141 65790 -140049 -179159 -35548
23007 -35548 -120985 -287559 -142876 22894 -61596 -33041 95198 79993 249281 281286 401805
22996 401805 306918 66409 -161043 29892 212835 317390 226374 166855 95055 337310
22986 337310 524452 478685 394208 236332 193272 193815 37632 91760 -87731 -82304 -44932
22975 -44932 119266 97183 35709 -93124 3518 38449 31681 153001 124581 112265 74922
22964 74922 -44927 -25231 31681 -158321 -311918 -102808 148495 215132 219271 170476 189309
22953 189309 49504 32642 14304 82329 82975 -120638 -34775 -3213 135075 263734 185346
22942 185346 139892 186210 188692 304106 360687 417130 431646 298695 96287 -26262 44529
22931 44529 -49517 -104634 -91129 -125837 20639 107852 213696 98368 -74596 -123123 -208209
22920 -208209 -96245 113305 21019 -56396 -93147 -61497 -120281 -3681 -69846 -104464 198620
22909 198620 252153 143801 18970 91451 92126 -105643 -198580 -28709 9227 -73701 22615
22898 22615 -27301 -108712 -101900 -26979 50417 -19710 -103735 75670 303541 373034 378741 20552
22886 20552 -112894 -291160 -200628 -52141 38359 95029 217742 281306 112717 -174112
22876 -174112 -125094 -312890 -364556 -227878 -80729 100557 156811 64044 -46760 -137923
22866 -137923 -45919 -24863 42437 -138351 -308760 -273560 -81886 96326 153028 110975 -23856
22855 -23856 7121 59087 -115639 -291332 -251709 -208740 -152932 -196247 -150649 8668 48161
22844 48161 -16196 129357 131036 64208 103143 55916 89746 214901 345554 211990 193605
22833 193605 101088 89435 175064 -49418 -262392 -195747 -370153 -253157 -197623 -49227
22823 -49227 -83443 -84750 55878 151709 311118 298122 179642 88298 172274 461505 319601
22812 319601 236597 195009 111362 69816 96380 20659 17474 14496 -132964 -60252 35976 -22462
22800 -22462 -60140 118357 184486 70198 -173714 -103580 115046 257138 155251 319640
22790 319640 353814 238854 34800 -181378 -172009 -140658 -48231 17280 183034 154412 73878
22779 73878 89030 -97073 -249905 55602 398679 477945 365652 358734 107084 12639 18931
22768 18931 137629 165302 128814 80931 -51899 -33022 33271 177648 255565 361412 475507
22757 475507 437980 126146 -18391 133262 155080 -16941 96509 125156 80782 71210 100874
22746 100874 225190 127914 37485 172458 385713 490135 578870 477835 326272 229631
22736 229631 314682 496885 520450 707468 965677 967405 869808 879919 929239 1004616 1111753
22725 1111753 982086 758400 639690 627002 592632 358826 114422 -13826 -71780 115058
22715 115058 101923 -46636 -53536 145848 179510 99368 62312 -80553 -173532 -131157 -213443
22704 -213443 -57340 -74629 -232467 -171616 -140941 57827 135480 73763 8207 9748 131637
22693 131637 82919 81358 315911 287478 74617 30029 -38343 139328 292149 133223 210239
22682 210239 91443 -85402 -122514 -65082 -8195 -30987 -206813 -365708 -427155 -425939 -294666
22671 -294666 -356834 -158758 65391 351010 578453 624465 702206 887475 1008220 812606
22661 812606 706033 931334 1050495 1005742 837375 639575 650279 787397 895976 957814
22651 957814 842477 906793 1162296 1095162 1181261 1275540 1160344 1079666 1088974 998361 1013540
22640 1013540 1132640 987846 795050 891524 897878 973034 941522 813264 836088 922883 801668
22629 801668 820434 983259 1068878 1203698 1113340 1140715 1248045 1365333 1626949 1714470
22619 1714470 1863814 2003793 2073548 2198985 2645503 2942907 3116552 3196891 3111437 3128207
22609 3128207 2749662 2245691 1984303 1831235 1826997 1852149 1743052 1894290 1940794 1805752
22599 1805752 1912198 1715062 1727438 1620361 1679905 1892620 1820289 2156990 2480165 2512638
22589 2512638 2560259 2480869 2403762 2413816 2275641 2228929 2331259 2394363 2429166 2379516 2365127
22578 2365127 2300641 2386821 2654030 2870554 2982188 3179879 3172054 3201583 3554785 3939082
22568 3939082 4082699 4387338 4782767 5069425 5532746 5953741 6199884 6696846 7585587
22559 7585587 8550706 9591569 10697884 12147146 13800193 15527216 17623820 20346778
22551 20346778 23984347 28458232 33938564 41615476 52476046 68479665 93196019 131685976
22543 131685976 186492659 249250138 302470656 336727098 355866738 371742158 384139924
22536 384139924 377203316 343760758 292278115 240718358 200111688 169165741 143675316
22529 143675316 121867800 103502803 88425167 76631507 67541422 60222189 54215395
22522 54215395 49187524 45013462 41295578 38046954 35365243 32956297 30567977 28682364
22514 28682364 27319973 25830332 23949695 22456514 21263488 20111565 19237445 18300668
22506 18300668 17503576 16772961 16124651 15329074 14716456 14098623 13793702 13613043 13434506
22497 13434506 13020749 12736529 12437671 11792363 11290147 10963039 10579526 10269772 10085106
22488 10085106 9915265 9621472 9397948 8935399 8417840 8382286 8256832 8028438 7816634
22479 7816634 7633874 7326676 7148318 6780431 6564806 6524435 6566045 6505033 6334428 6190101
22469 6190101 6240144 6335750 6361849 6404810 6399350 6488197 6504380 6405742 6287168 6293153 6180851
22458 6180851 5871600 5393895 5037916 4944759 4478359 4092072 4030101 3690241 3473320 3431432
22448 3431432 3428188 3259893 3093317 3016250 2946461 2741485 2711847 2664710 2574622 2434695 2440880
22437 2440880 2446366 2360078 2072992 2089568 2138000 1909283 1693350 1690069 1844540 1709713 1629884
22426 1629884 1663036 1590410 1528793 1552020 1423567 1312026 1255953 1347045 1377636 1111707 703757
22415 703757 903210 982930 1026468 1173926 1244951 1048018 917780 1169367 1469488 1729011
22405 1729011 1564898 1409334 1315690 1242116 1320295 1275630 1457223 1538302 1416210 1418747 1240947
22394 1240947 1064395 964936 1004822 1091705 1306067 1458721 1247666 933437 875144 768074
22384 768074 690845 459286 387107 446641 385639 584917 757511 799658 1043824 1179890
22374 1179890 1022567 762938 763460 703842 624340 698855 681261 593972 603616 714340 753913
22363 753913 618789 593307 393529 469524 590007 657974 497785 356234 350040 349948 85238
22352 85238 -346 -224739 -398732 -495462 -687533 -714041 -699248 -750593 -576649 -517788 -423733
22341 -423733 -271037 -385541 -407199 -289684 -369291 -317205 -80629 -45863 -216715 -405186
22331 -405186 -353576 -251898 -151164 -122202 -43687 262282 306317 44187 -86031 120994
22321 120994 110140 31974 -152417 -209812 -137543 -144326 -23842 218018 127265 156476 38443
22310 38443 25028 -39246 -170616 -331089 -202567 127234 195281 16531 -220164 -258571
22300 -258571 -313210 -463307 -230887 39870 32423 -21158 24388 118115 43592 -89817 -100776
22289 -100776 147138 14580 -29509 -35484 -201602 -63288 158977 263425 283154 158191
22279 158191 727 -4387 21840 -121257 -12398 -23466 -72489 58977 223945 280223 146213
22268 146213 6925 168054 -46134 -177336 -42342 -119213 -104678 -122152 -95868 -214225
22258 -214225 -114350 -1002 218322 176349 122524 173556 387133 266574 45689 -40986
22248 -40986 -183946 -189742 -185055 -248780 -116921 28024 -89600 -257137 -288980 -223717 -86936
22237 -86936 -135404 -268072 -302694 -148361 56201 137269 136317 179528 166751 112974 -47088
22226 -47088 -88821 -236522 -181035 -175922 -367742 -247801 -221640 -256742 -296612 -218866 12536
22215 12536 6215 -82935 -154651 -84614 -168998 -114140 -35350 -94968 -330384 -423956 -471165 -326622
22203 -326622 -180199 -171325 56499 29035 -59434 -69392 -214741 -293235 -267768 -140893 -203405
22192 -203405 -145097 -232658 -174445 -14482 112752 -67353 -10000 30517 119286 -67564 -231396
22181 -231396 -288342 -60792 78908 72136 -104990 -193480 -160519 -78344 -51300 119990 221921
22170 221921 296220 125370 -130431 -148962 -140465 -286430 -438384 -400255 -437407 -324187 -116789
22159 -116789 41954 129753 12604 -9920 -180268 -435707 -413065 -352044 -193207 -253863
22149 -253863 -231554 -135614 3628 47748 -97636 -278152 -242268 -251569 -287094 -227535 -39071
22138 -39071 -12344 -79138 -138606 -247232 -198666 -271552 -153592 21685 -37416 -212308 -264639
22127 -264639 -115448 87486 -22532 -122649 -79168 -138252 -154151 51046 133667 54269
22117 54269 -94067 -141693 -144039 -228804 -215720 -146988 -67630 -74061 -78689 -179754 -181540 -200202
22105 -200202 -163228 20408 112894 269660 249131 55048 68511 142843 153900 69045 37906
22094 37906 -184464 -362970 -226187 -195894 -148699 -272058 -394739 -291708 -278441 -278615 -319621
22083 -319621 -225897 -114932 -49348 -184269 -385332 -312907 -188744 -303346 -221965 -56057
22073 -56057 -193386 -106540 -84553 116893 -60301 -210587 -96784 -115358 52675 156878
22063 156878 58986 -245102 -207537 -94 51790 -80156 -164405 -109761 207239 296179 130565
22052 130565 -6328 61843 70879 131048 5391 -80809 -70259 -168484 -305260 -284986 -238616
22041 -238616 -18160 208687 252635 293632 104920 -15287 -35727 -24926 -6081 -23076 -215922
22030 -215922 -383330 -214483 11991 -304158 -306537 -199371 -103783 -14022 -142266 -289232
22020 -289232 -229031 -308884 -275234 35390 33547 -73860 -240073 -289546 -320307 -234163 -17270
22009 -17270 22923 -84312 -121935 184697 103224 -124379 -240218 -197841 -164449 -45400 -68409
21998 -68409 176328 197955 64777 284020 415184 137637 4173 110630 289866 267726
21988 267726 252312 344678 492141 690595 969324 1410417 1437165 1482429 1535314 1708398
21978 1708398 1764815 1687882 1489964 1031487 949862 760783 872626 728366 474238 478479
21968 478479 452875 325298 152667 89335 -106 23855 160266 51108 8135 -98018
21958 -98018 -93934 91677 144103 148009 -49816 -179821 -113544 -108980 -105288 -138509 -150244 -247833
21946 -247833 -221187 -261021 -363750 -296951 -70109 -25334 101720 -67472 -145615 -13075
21936 -13075 191384 189665 91195 80077 -7081 60469 51182 154995 261332 286067 240967
21925 240967 148751 143934 -58696 -256067 -128799 58518 39933 11722 -31086 38680 37799
21914 37799 16339 -23781 97568 233526 249009 187893 52186 66426 -37418 -360659 -586687
21903 -586687 -395075 -92095 -199218 -142147 18385 -39627 50415 126867 91712 38085 -118906
21892 -118906 50736 -25548 -168916 -275610 -295342 -272761 -178560 -145169 113389 176639 202190
21881 202190 102500 -43086 20520 -188511 -350230 -126730 134531 64515 -19292 111999
21871 111999 77491 -37127 -136850 -68444 239933 206197 57935 -52127 -347110 -391057
21861 -391057 -305179 -143800 -18687 -81936 -80631 10636 -75437 -32795 -250044 -296411 -367207
21850 -367207 -181449 -21759 -30521 88750 -76790 -130259 -67723 -15958 -87270 -32313 -100621
21839 -100621 -25345 17992 -47791 -90236 -106162 -294569 -157175 -70333 7387 103434 74164
21828 74164 181274 236883 290068 60292 -92255 -264660 -150499 79181 117373 -73671
21818 -73671 -246768 -274267 -369187 -316419 -155923 -159762 -513980 -690651 -456678 -45531 249642
21807 249642 298718 308012 69578 -27458 184245 168476 148502 -85680 -130496 -178791 -100264
21796 -100264 57020 101524 98124 45256 -69343 -102384 -216843 -150718 -200933 -98878 -134290
21785 -134290 -174809 -101062 -95295 -112026 -119954 -43237 15136 -89302 -129766 -116085 -22106 39044
21773 39044 26450 256816 172604 -110423 -69510 -109186 -71208 -141056 -216802 -317710 -380506
21762 -380506 -457945 -382490 -309979 -197673 6780 23313 -215847 -355968 -450024 -351510 -385218
21751 -385218 -143487 -54060 -144516 42731 -48590 -15429 -90073 23834 54396 23376 72893
21740 72893 16786 -62322 -143033 -285111 -502998 -365290 -299878 -183607 -87152 -218726 -427153
21729 -427153 -429635 -178236 27837 72162 37296 117505 121520 -44785 -71499 459 -110894
21718 -110894 -35599 9675 -11231 -121862 -222856 -467365 -447002 -279369 -79473 -45890
21708 -45890 -39869 -53970 -201349 -354788 -429381 -78159 204649 285548 185287 -80852 -159066
21697 -159066 -195747 -215282 -282421 -146642 -200610 -101661 61218 307073 190870 -21183
21687 -21183 -194669 -335994 -332659 -158719 18282 -70621 -182533 -186483 -207479 -190693 -287500
21676 -287500 -412513 -264273 -202927 -333409 -462951 -325321 -203900 -34071 133582 170688
21666 170688 171035 97504 80475 -101357 -351512 -411951 -274633 19670 36256 38353 -196245
21655 -196245 -478919 -525858 -296667 -79910 -346622 -195065 -18650 119628 131962 103497
21645 103497 165196 135355 97352 -43475 -78316 -41558 -17994 1883 -216766 -414539 -256339
21634 -256339 -328292 -231898 -131580 -211741 -315485 -296510 -298257 -320777 -93926 -134813 -104548
21623 -104548 -111815 -123113 -201275 -119915 -42847 -162290 -163677 -9869 30196 66267 183006
21612 183006 300530 285499 267013 182867 -73089 -168053 -163590 -48117 4493 -180689 -181886
21601 -181886 -157866 -187566 -222103 -294122 -168145 -98563 -88808 -66956 -222491 -222813 -217742 -49510
21589 -49510 73988 87125 83171 71129 -287456 -372530 -154740 44241 140735 12807 -57793
21578 -57793 -115419 -227384 -165905 -166519 -118656 -52169 -40352 -93305 -32471 -155542 -149922 -121331
21566 -121331 -318176 -267004 -30327 46133 -130584 -104627 -84563 -97846 23031 127936
21556 127936 44644 111827 -100838 1127 110644 -74307 -72349 -88853 -13725 130217 306117
21545 306117 148599 -65018 -113069 -87198 -149548 -146710 -182493 -69009 152951 438553 285664
21534 285664 -8364 -146853 58416 42012 -123891 -206285 -186771 -115228 -249399 -357926
21524 -357926 -292473 -201268 -140122 -105195 90721 37495 -60452 -210314 -201037 -163035 -56801
21513 -56801 -188356 -174226 -196075 -160704 -109869 -197112 -239070 -87398 -57 -29108 141298
21502 141298 259424 192108 19746 -230040 -189009 -83088 -89588 8958 42751 -88191 19117
21491 19117 81099 78565 122166 266583 215070 55032 -62604 -20587 -113015 -238858 -213632
21480 -213632 -145654 -129359 -225129 -188159 -190705 -396554 -384025 -190639 -238059 -80924 31386
21469 31386 15774 -12630 159714 195877 217185 196045 152822 96061 19554 -104870 -108881
21458 -108881 5758 -18036 -72394 -91877 -207693 -285670 -195737 -106915 -163237 -89181 -151868
21447 -151868 -133162 -339353 -294161 -227592 -149959 -47469 50528 -139534 -97683 -102713 -189997
21436 -189997 -234307 -61889 -7995 109008 97144 222440 41264 -178038 -294042 -320164
21426 -320164 -249726 -223990 -257318 -100541 -239397 -346135 -193914 39075 1879 -213165
21416 -213165 -324478 -167136 7296 106178 198235 -35867 -129395 -235749 -342096 -130811
21406 -130811 -12921 -132014 -135423 -283156 -142186 -61796 -194473 -165354 -197032 -297406
21396 -297406 -224069 1172 210955 317511 9471 -295497 -412837 -281836 5662 86052
21386 86052 -168644 -73796 145694 65243 41916 -124291 -145962 -62948 24663 112939 63983
21375 63983 -63649 -157430 -101007 -217175 -277226 -251933 -430780 -330681 -92823 -61183 -103949
21364 -103949 72103 48118 -144198 -206625 99801 150038 -30209 -147710 -190020 -130316
21354 -130316 -216119 -282862 -353255 -386783 -229911 -213116 -197097 -407388 -475150 -411328 -404223
21343 -404223 -475173 -510817 -482781 -397017 -295208 -287885 -216040 -139722 -45436 -219567 -334222
21332 -334222 -167488 -76660 -31678 4151 -56704 -26023 -28762 -79109 50860 11568 -100076
21321 -100076 -358632 -461454 -303371 -256622 -269242 -249938 -209133 -95231 -265497 -372537
21311 -372537 -133656 -50275 -147147 -361869 -437368 -163028 -180625 -385312 -537708 -404506
21301 -404506 -346250 -200141 -26506 -62502 -166367 44292 64371 -114843 -52178 84559
21291 84559 9692 -85030 -217796 -239825 -72591 -80445 -11440 176468 74363 27492 88176
21280 88176 164372 -39811 -187478 -166973 -105721 -110030 -127897 -305270 -151794 -18445 -318430
21269 -318430 -283003 -63036 -149557 -109617 -69231 -46641 -172965 -356054 -199145 -198234 -261315
21258 -261315 -376613 -257151 1161 -14641 -196233 -36546 -103712 -134199 -28112 96014
21248 96014 49646 110247 99988 83973 120876 71169 -13426 -163068 -96738 -117989 -191621
21237 -191621 -211277 -137635 -52857 -29341 100933 66129 69454 -224854 -331102 -284428 -100807
21226 -100807 -153432 -94991 -111365 82246 -30147 42168 31320 -113538 -114265 -307940 -305760
21215 -305760 -230566 -149579 -175368 -120484 -226578 -188337 -214261 -270776 -190243 -217377 -150251
21204 -150251 -259165 -316463 -354536 -206627 -238642 -134495 -101999 -89124 -116579 -40163 -132303
21193 -132303 -286574 -283350 -202038 -360067 -287432 -156102 -108622 -132089 51291 90424 89101
21182 89101 -118455 -74755 -30488 -132069 -113970 -115736 -236056 -190332 -289055 -318822 -148286
21171 -148286 -99270 29641 51432 -87262 -83334 -166660 -285287 -322775 -300560 -239097 13280
21160 13280 -35671 -141580 -190715 -74515 -122475 -173149 -192932 -347701 -407234 -391147 -238051
21149 -238051 -117423 -31334 -42870 -101354 -48570 -88527 -56808 -93159 -95076 -46460 117509
21138 117509 190971 84223 -82285 -191615 -310242 -212555 -133766 -175948 -132677 -148840 -214258
21127 -214258 -179140 -287297 -285671 -156721 9385 47249 9842 95584 125436 282578 415729
21116 415729 248597 -70111 -259456 -139616 -214630 -187149 -139500 41432 -34651 -71067
21106 -71067 -237015 -291484 -364940 -148883 112097 90891 30398 -90465 -155817 -302864 -479425
21095 -479425 -475283 -299908 -123544 102074 -64303 -803 -84442 -102103 -87484 70860 134540
21084 134540 30344 -15129 -107453 -40595 -93081 -275358 -138641 161428 276199 327926
21074 327926 208987 300311 270607 105271 -25402 78049 189701 121834 56964 55768 -72118
21063 -72118 -104232 -90681 -79331 -59500 -137475 -169758 -176718 -100342 114556 202902 153433 17928
21051 17928 -48189 -68450 40155 33323 -15816 -164869 -197555 -366306 -381619 -297023 -233603
21040 -233603 -14703 37796 -16593 128011 112251 20866 6892 31792 188827 -129093 -297870
21029 -297870 -160639 -298831 -94532 144730 64062 -67313 61224 -50334 -401092 -593139
21019 -593139 -523865 -464903 -341952 -262144 -259776 -83599 10932 61294 110414 180914 141672
21008 141672 347418 439004 303160 285970 274206 200894 95147 174260 246012 -29525 -63095
20997 -63095 -136392 -80163 -69607 -142278 -62699 -76026 -214514 -166979 -50165 -115289 -303246
20986 -303246 -312119 -372380 -376800 -329444 -360576 -353159 -239515 -124321 -48639 -143363 -496543
20975 -496543 -499123 -399084 -255500 -214061 -123004 -72380 -77324 -93093 -73603 -36058 151332
20964 151332 98260 -82479 -157405 -181964 4923 -176068 -252628 61536 133727 163022 310522
20953 310522 503173 234723 -33345 -77052 -64856 94706 263925 346647 372988 176208
20943 176208 -48203 -744 -60893 -50660 -114549 -121788 -101792 -267887 -75564 179601 324711
20932 324711 262528 121000 16263 -156091 -360935 -294340 -206222 -60965 -60286 -69878 37713
20921 37713 142901 189988 411212 477201 256468 -33653 -195947 -181903 -247926 -154450 -164811
20910 -164811 -104740 -77715 -125805 -452958 -544915 -548677 -451942 -278896 -104274 9141 121634
20899 121634 110031 168976 162164 211677 41297 -250417 -241121 -264954 -175669 1587 122255
20888 122255 99968 148603 177163 111272 158281 143620 252160 63340 -205548 -284123 -440554
20877 -440554 -400817 -192016 50552 109382 90363 26749 -29393 -23147 -84605 -126241 -55776
20866 -55776 -113961 -103456 -74235 -95171 -38439 -280739 -292034 -318676 -474474 -437304 -212420
20855 -212420 72086 -79815 -34005 15524 -33321 -243754 -204693 -209936 -175199 -325596 -277285
20844 -277285 -257949 -85638 -209432 -281193 -23914 61669 -117572 -405885 -357281 -93317
20834 -93317 36658 215808 98246 9519 -57131 120463 173643 -13944 -177965 -250914
20824 -250914 -297934 -251525 -274535 -313669 -379604 -402085 -326338 -249459 -312246 -352675 -145299
20813 -145299 -82105 -198198 -183597 -205690 -138871 -57797 -10336 214971 233845 144126 -31455
20802 -31455 -194906 -249235 -203145 -93995 33404 -14887 -30982 45216 124900 23510 117897
20791 117897 647 43253 84826 18522 70025 228284 24100 -159634 -135917 6610
20781 6610 138235 305295 251204 146506 100412 103825 195221 113255 242214 233348 189068
20770 189068 34524 55527 30130 19953 41896 149940 297888 250919 -23992 2499 46760
20759 46760 3229 -91466 -161548 -139685 -46966 -71583 -77163 -113647 47892 221826 227495 89227
20747 89227 85566 79604 100567 256475 176783 221400 151859 64005 -141227 -107037 38398
20736 38398 -26856 -382758 -470738 -347830 -226660 -348411 -385712 -185606 -93587 -124865 -107963
20725 -107963 -189906 -398559 -334194 -217748 -52730 64905 74089 135727 147042 112311 -36121
20714 -36121 -48904 13514 33123 -10093 -79275 192559 156511 -159067 -224631 -174718 41360
20703 41360 82664 100430 335066 226407 58382 40422 15046 13768 20105 102008 250143
20692 250143 253775 221776 6357 -180666 9749 253266 196644 -57592 -129489 107423
20682 107423 295755 236384 271349 251983 170581 311890 502312 451757 373891 484609 546580
20671 546580 648151 979473 1049851 1279829 1437797 1498813 1467242 1532202 1558758 1428516
20661 1428516 1308861 1366586 1103944 866977 775381 826136 921716 918659 828727 428757 210993
20650 210993 346227 468669 289129 47812 31965 -50885 -51328 -228560 -224120 -210837 -106906
20639 -106906 -38585 66228 96824 57059 113878 236301 279441 73290 60920 190933 335174
20628 335174 211101 92495 106956 218709 60775 -222210 -91722 129496 204910 30840
20618 30840 -40514 -108328 -22492 -112192 -348719 -290504 53081 140825 147727 108010 64409
20607 64409 1962 71275 105392 194440 230128 349046 129175 -52850 -5268 59685 212208
20596 212208 177221 72770 -62336 -169886 -237390 23659 59590 147153 361881 323788
20586 323788 268194 146047 11760 -39620 -88367 -17802 235 -31213 -40102 -41989 -66642
20575 -66642 57862 -48974 -97192 -195503 -136855 -40157 114402 179947 151258 -117089 -235793
20564 -235793 -256335 -290709 -346801 -221506 -103118 -262511 -232255 -335938 -235853 19290
20554 19290 195819 163182 71967 36732 42957 11069 -25513 92514 37138 -138986 -8666
20543 -8666 2765 27584 303047 251606 -35510 -91363 -129977 83374 114824 31782 122086
20532 122086 -79990 -50885 232565 410193 277909 31791 -97495 -134860 -173495 -226346
20522 -226346 -233804 -259734 -226887 -154120 -399785 -126163 73163 5472 -128613 -11472 123812
20511 123812 191971 199040 81158 33285 -95330 -141428 -67965 -36809 -143225 -12846 -80040
20500 -80040 -210235 -236705 -126878 -93559 -133434 -273350 -53131 70579 169352 233136 297658
20489 297658 283422 260197 248742 176653 4300 78182 5703 -155143 -125955 -62212 -91215
20478 -91215 -24794 21801 100367 43781 -34729 8047 97342 51302 -10638 134816 186094
20467 186094 84726 119807 147091 237041 72930 17918 120842 109412 -68730 -100643 41981
20456 41981 23090 -27327 17075 148440 290606 449362 419874 371857 211849 184752 131891
20445 131891 86938 52795 7324 58594 133382 185149 -44683 -325302 -297331 -71590 87981
20434 87981 121927 74612 96403 203191 337165 299601 193231 229460 482623 567093 322160
20423 322160 254677 393283 158336 -32612 -79853 19670 102667 150572 159257 -81338 -136067
20412 -136067 15983 218468 178483 257002 282146 171762 -141567 -286245 -252293 -264717
20402 -264717 -121239 -32733 14988 -15102 111985 288955 217983 213124 259285 320244 375835
20391 375835 362962 327547 336738 725109 866540 797110 561210 424999 321431 199768
20381 199768 587 -189733 -252367 -61432 161309 228334 60014 32404 75775 138763
20371 138763 369312 581251 583534 297852 181147 11292 -6163 23073 151309 113108
20361 113108 61669 238030 286430 224583 291689 129309 190478 233692 258872 165063 -105466
20350 -105466 -159870 19496 72829 29175 -76236 28426 173829 233994 92392 -133719
20340 -133719 -279379 -31902 184097 162072 -137206 -349631 -222133 -267815 -336425 -114954
20330 -114954 124989 61547 68377 116135 196748 46352 -129922 -146194 -141044 121066 206195
20319 206195 77749 25021 44240 -50411 -126534 -161302 -371778 -249746 34600 -57366 -213162
20308 -213162 -237219 -228925 -214654 -176525 34465 19014 -284787 -240770 87648 101045 -83029
20297 -83029 -126701 -120853 -127087 -33777 -25828 158768 200980 333768 508898 562713 673988
20286 673988 432418 201838 148928 249159 259873 154032 157888 202514 358870 356804 105588
20275 105588 27675 234997 366061 391772 376970 432432 530354 432675 240702 142547 197938
20264 197938 59160 98521 172939 204432 348587 235697 351427 364645 177691 229277
20254 229277 348683 272407 179639 259643 348677 597506 463595 331985 427104 217594
20244 217594 64825 -6389 133474 299446 557531 594954 356633 181764 271969 232767
20234 232767 234079 251978 231650 -101399 -65681 105722 197385 186858 160714 -22521 -83580
20223 -83580 -125634 39058 156400 -77737 -32193 291237 290021 246533 473012 515212 420266
20212 420266 351301 429843 643460 939002 1010433 1044313 1147090 1320918 1329379 1277145 1198792
20201 1198792 1100809 1101599 870139 794027 691827 484547 249851 159060 137875 160531 154856
20190 154856 -68953 -101172 -43350 -71759 -30011 125091 197206 242386 83484 -136046 -214704
20179 -214704 -164916 -35268 -82596 -112852 5663 62620 -44661 -122855 -137095 -141666 67481
20168 67481 163517 113051 -99933 -116591 -23801 192605 318958 302058 503718 487750 503879
20157 503879 332099 -78321 -243890 -244997 -119714 -6212 168584 160956 49162 162506
20147 162506 238488 251507 75069 83946 59427 279617 563375 743167 859447 1146409
20137 1146409 1152875 1198394 1355106 1400060 1227382 1392337 1400862 1371938 1222033 1202900 1325839
20126 1325839 1336073 1577296 1832700 2011172 2113283 2317411 2381019 2218976 2237450 2178536
20116 2178536 2252366 2183552 2197274 2173011 2022515 1857776 1759715 1831963 1737037 1486460 1471521
20105 1471521 1521750 1496060 1412117 1158064 1327185 1472962 1466381 1522184 1464878 1371657 1430785
20094 1430785 1570036 1376578 1335045 1394472 1451597 1507318 1663399 1717856 1719475 1665096 1570623
20083 1570623 1561527 1449062 1505122 1533472 1606922 1571575 1750307 1891106 1919080 1968239 2067209
20072 2067209 2134470 1948516 1823348 1647782 1746543 2009331 2025837 1954192 2019733 2117416
20062 2117416 2122254 2138976 2291833 2594206 2923151 2929080 2745632 2878227 3018834 3326885
20052 3326885 3689751 3973943 4296065 4675781 4991616 5552728 6288042 6888171 7445667
20043 7445667 8102260 8603352 9140460 9724686 10190869 10731623 11086699 11488984 11932476
20034 11932476 12440702 13081656 13899705 14729778 15911091 17246845 18753378 20838883 23478467
20025 23478467 26565879 30433503 35828396 42776356 52154498 65120074 83509456 109502084
20017 109502084 144272788 186709689 231118366 269140366 295590480 312839414 324148516
20010 324148516 327344486 316390783 289602010 253927962 217919822 186348638 160136862
20003 160136862 137903700 119054327 103274115 90050254 79097885 70315490 63194237
19996 63194237 57473847 52641277 48392406 44936992 41998083 39430429 37108586 35127369
19988 35127369 33411044 31961873 30656360 29525009 28235760 26859138 25536267 24276861
19980 24276861 22897637 21562593 20512683 19782869 19103000 18262387 17364641 16713396 16138050
19971 16138050 15485924 14871509 14440766 13759907 13137736 12790199 12357618 11984684 11525677
19962 11525677 11004901 10457990 10274654 10200756 10041879 9856015 9434601 9044536 8949771 8832860
19952 8832860 8724518 8340166 7997713 7909046 7705716 7386085 7049489 6848566 6698881 6253131
19942 6253131 5993180 6054866 6006784 5974336 5797405 5697957 5617298 5458875 5286774 5171606
19932 5171606 5196462 5134706 5073474 4899094 4726511 4513572 4308115 4394080 4634942 4791196
19922 4791196 4596574 4301327 4388467 4502258 4529205 4676841 4649923 4671218 4728028 4260868
19912 4260868 3978526 4036369 4011713 3776634 3553677 3436622 3249666 3206809 2979527 2427386
19902 2427386 2127432 2235378 2354195 2459524 2432625 2230530 2141220 2154049 2060043 2038994
19892 2038994 1845212 1689351 1342259 1169807 1238217 1252657 1566673 1627183 1358111 1312416
19882 1312416 1531227 1550430 1782053 2109832 2092441 1876009 1816019 1746203 1722513 1780112
19872 1780112 1905407 1718040 1595519 1485707 1463743 1402115 1586511 1682823 1863791 1873116
19862 1873116 1887531 1898501 1557576 1413212 1631838 1866636 1833494 1793564 1759418 1581227
19852 1581227 1492507 1403965 1529317 1654943 1550097 1362938 1290995 1177586 944085 1019947
19842 1019947 1274447 1316007 1241801 1041098 934323 1029390 910049 1014671 1102900 1174462
19832 1174462 1050065 1007855 998890 760302 680374 433036 285953 314664 137549 26793
19822 26793 -103453 -157711 -104077 107448 170745 61595 200327 347229 407949 407597 438123
19811 438123 349386 310584 500136 624428 828786 931709 1071789 1026859 880973 1050387
19801 1050387 1285611 1189882 1130124 1083237 1253310 1275788 1369119 1485796 1132832 805880
19791 805880 661805 575730 805284 852225 696008 735670 943220 720643 440386 358811
19781 358811 630603 988456 913728 800217 737828 768726 839911 1000902 1341631 1608224
19771 1608224 1658520 1576060 1601080 1576915 1684443 1519739 1354779 1098556 1006372 931052
19761 931052 840697 936854 863676 931796 861312 661457 375586 293257 357093 232529 335779
19750 335779 414247 367493 402345 276177 177423 155775 149945 293618 602785 648933 699151
19739 699151 677122 672749 680654 615065 722806 801919 893664 985921 1133941 1063243 977421
19728 977421 1043735 1375675 1405127 1346078 1421460 1453903 1550526 1553987 1581522 1645006 1421878
19717 1421878 1259387 1256562 1304921 1305450 1496265 1676683 1861634 1724430 1679944 1763583 1924589
19706 1924589 1966881 1741085 1737527 1778007 1877459 1912284 1947012 2013074 2017834 1959402 1998574
19695 1998574 2140222 2216049 2400995 2442291 2467389 2357561 2424971 2533533 2713975 2670393
19685 2670393 2446711 2358380 2278056 2178757 2144909 2018867 2036165 2085368 2144100 2060998 2010783
19674 2010783 2068981 2072601 2158171 2147641 2072171 1983970 1980474 1947220 2022068 2268372 2488991
19663 2488991 2462842 2578930 2706445 2871400 3058667 3032466 3045023 3275558 3295624 3203909
19653 3203909 3179362 3327012 3517859 3528298 3513668 3638132 4075209 4425652 4632480 4980929
19643 4980929 5330602 5687627 6136606 6461232 7022221 7673735 8445101 9126545 9925579
19634 9925579 10709344 11562794 12732575 14075580 15371766 16702139 18241660 19947432
19626 19947432 22144946 24845313 27972700 31953659 37022321 43028788 50872095 60801234
19618 60801234 73006688 86576932 100599518 114204216 128289534 143562137 159749929
19611 159749929 175181529 188514484 199484684 207997662 214346668 218895125 221668423
19604 221668423 221763948 218088666 210307770 199434401 187530223 175694880 163813264 150929780
19596 150929780 136606083 121956670 108403103 96597401 86225581 77146736 69424045
19589 69424045 62878183 57240970 52559809 48602990 45069243 41621842 38670108 36272059
19581 36272059 34027385 31991660 29951410 27907122 26332614 24925220 23699278 22568559
19573 22568559 21348238 20512734 19918977 19289907 18670611 18244067 17781383 17168232 16648062
19564 16648062 16155671 15710546 15168360 14557103 14034018 13458499 12874689 12436571 11968076
19555 11968076 11543631 10971075 10541466 10120921 9792994 9619985 9552770 9640856 9357145 8812010
19545 8812010 8476460 8294800 8011612 7759693 7714846 7411506 7212753 7106699 6869103 6592283
19535 6592283 6298977 6079800 5788131 5665212 5667357 5555370 5318620 5158747 4959177 4779718
19525 4779718 4604107 4408068 4293262 4398369 4482094 4300223 4151942 4080289 3957963 3992904
19515 3992904 3924586 3846062 3474297 3189999 2865168 2731581 2960886 3011393 2907154 2838502
19505 2838502 2770400 2648945 2326745 2267103 2265646 2079100 2117598 2305060 2318808 2165906
19495 2165906 2217511 2225934 2051644 1946059 1919066 1864894 1826590 1739540 1607778 1667217 1784497
19484 1784497 1733118 1515694 1448719 1518466 1524291 1634163 1717877 1800749 1582976 1568266 1784955
19473 1784955 1818824 1694459 1604223 1771808 1651301 1609806 1864313 1845326 1776536 1981238
19463 1981238 1966274 1977114 1858014 1751819 1720563 1779053 1785519 1987184 1864384 1699075
19453 1699075 1868492 1980377 1788703 1748062 1677486 1856655 1614459 1351851 1444823 1585739
19443 1585739 1399350 1327566 1365751 1437119 1417984 1351648 1289126 1506382 1594449 1617072 1687821
19432 1687821 1624444 1602117 1514294 1496975 1411223 1146127 1004531 699448 476761 416963
19422 416963 411533 393238 390205 190931 258029 227507 164468 148058 342880 484152 544384
19411 544384 534944 617451 735462 793304 881030 1100687 1028649 873274 893095 868629 1069955
19400 1069955 1260899 1167132 979211 754571 776734 916603 890810 870885 737384 762679
19390 762679 814296 879026 916172 950829 1180670 1245168 1190049 1376558 1545272 1698956 1664475
19379 1664475 1258252 977611 855188 862635 786725 720458 741647 968491 955374 904932 859344
19368 859344 688703 640573 586634 623213 856110 828780 848078 980811 1004231 764761 690971
19357 690971 841580 1202379 1215477 1258470 1400115 1493862 1694801 1668784 1691294 1789484 1783463
19346 1783463 1728578 1728535 1565732 1387886 1304766 1215172 1130996 1029890 882976 865947 888182
19335 888182 815315 783801 754451 746796 690238 632640 552710 580965 621265 525085 404766
19324 404766 471641 372157 316521 328525 382112 674305 562803 468818 556811 514767 386157
19313 386157 493209 550317 599785 474356 453341 518350 548493 367310 247110 222779 253862
19302 253862 335481 109717 250265 369760 486980 754421 610440 486443 376877 453936
19292 453936 466845 371918 415823 287887 247614 166737 172219 194390 185898 193576 165521 86391
19280 86391 51106 321280 216678 105890 257634 281527 257598 403992 458101 415829 383761
19269 383761 339052 126442 100579 123668 12527 -95926 108148 259584 306350 303496 190056
19258 190056 1802 120089 268157 468718 617160 540116 307356 221535 217055 298871
19248 298871 366299 238280 90872 105556 153313 57605 -91079 -264502 -143505 136189
19238 136189 295104 349102 320707 303179 625668 478972 321577 380225 453007 527139 455206
19227 455206 379071 477399 449241 383077 466808 414280 297291 375265 324681 379441 591713
19216 591713 729417 671812 871354 740031 548594 601283 801481 1102498 1260243 1100286
19206 1100286 965660 1048268 1012107 887064 734327 732631 1071951 1331377 1148706 1033756
19196 1033756 708510 509293 550849 550841 558449 659833 556676 482697 483036 408939 347387 204095
19184 204095 180519 274444 536609 533395 461717 515122 503789 202926 22361 246538 532845
19173 532845 538555 605742 580891 293064 313000 497553 390043 396485 564267 671666 788835
19162 788835 950568 857876 828511 774648 693548 691571 775498 794139 870589 902912 735486
19151 735486 539184 544611 675125 809738 771445 649982 728153 699908 775074 695954 326877
19140 326877 310017 361987 502276 702148 552384 560230 516704 488114 660774 676064 661367
19129 661367 514861 515970 475480 572521 755748 553921 425064 367297 355684 506534 520364
19118 520364 665731 789569 960946 973011 958864 948265 825638 830049 860694 960553 1158641
19107 1158641 1392587 1484546 1334667 1325354 1473195 1571634 1924069 2111952 2260204 2264286
19097 2264286 2137482 2209251 2428022 2575432 2733490 2787854 2695571 2648335 2608335 2502199
19087 2502199 2357110 2407434 2468465 2362554 2186600 1984910 1925717 1717322 1478858 1306894
19077 1306894 1014086 839784 778369 748493 587005 679753 741750 869765 619839 721855
19067 721855 671649 659735 579104 460483 536723 697975 888005 989420 1064550 909400
19057 909400 803285 773866 907256 882990 874789 901723 839987 690371 480125 372624 223495
19046 223495 117141 281728 570061 512033 763781 1114996 1102964 1171713 1356770 1450393
19036 1450393 1420092 1365881 1474488 1562788 1726503 1905202 2186170 2320847 2299879 2314739
19026 2314739 2549010 2520999 2459372 2432612 2504688 2677321 2611306 2537386 2745411 2913781
19016 2913781 2781864 2668801 2709365 2841402 2549205 2391592 2529501 2618305 2603329 2482460
19006 2482460 2614469 2643098 2523980 2623778 2724099 2952997 3021868 2809539 2769229 2799730
18996 2799730 2820176 2960838 3090982 3102950 3084818 3237885 3342225 3390948 3506063 3785290
18986 3785290 4007718 4259812 4341446 4362176 4479902 4547409 4548841 4663406 5115799 5413916
18976 5413916 5568095 6062504 6976841 7980816 9544611 11843451 14260499 16259831 17514002
18967 17514002 18370776 19569999 20694840 21286855 21343482 21137688 20835267 20621241 20344875
18958 20344875 20120993 19863667 19016335 17740361 16402369 15209181 14241058 13476860 12832913
18949 12832913 12094446 11739473 11374283 11441393 11561369 11639921 11738192 12093770 12446224 12874564
18939 12874564 13485012 13996266 14578859 15055979 15643045 16281593 17255618 18542213 19901270
18930 19901270 21523163 23278049 25388255 27856372 30906634 34612462 39144769 45301301
18922 45301301 53542334 64860383 80676274 102738797 131017969 161238484 186571021
18915 186571021 205591756 223347217 244802892 268519742 290228486 311362496 336135943
18908 336135943 362225162 384141611 402714073 421165983 438608135 448177819 442831381
18901 442831381 424665341 400410775 374549477 348907855 322813786 294937237 265056049
18894 265056049 234566860 205976544 181063785 160152968 142560972 127694582 114890654
18887 114890654 103909034 94842281 87171805 80343811 74299727 68914329 64111595 59951515
18879 59951515 56223523 53062166 50218784 47381322 44623482 42366187 40363154 38509493
18871 38509493 36744907 35217008 34032841 32945460 31904635 30875238 30071715 29393656
18863 29393656 28874796 28397821 27969431 27551838 27380074 27652781 28110597 28873660 30005341
18854 30005341 31355413 32344644 33326704 34345093 35135287 35551570 35641764 35035320 33875017
18845 33875017 32718198 31537278 29830015 27867103 25739808 23776263 22149507 20666030
18837 20666030 19297169 18098025 17317811 16750344 16001578 15397420 14698326 14161510 13616451
18828 13616451 13017251 12358373 11842668 11291034 10901593 10591947 10301372 10075908 9924036
18819 9924036 9560267 9368269 8919850 8745461 8583568 8282854 7884522 7608187 7278251
18810 7278251 7269395 7336379 7046672 6914956 6884178 6453976 6294198 6271338 6190326 5916668
18800 5916668 5634565 5461426 5284778 5094085 5002460 4986912 4758627 4380517 4281981 4276823
18790 4276823 4153221 4212591 4226938 4022253 4063717 4080601 3865825 3721916 3730439 3674933 3405924
18779 3405924 3347208 3270701 3142837 3316320 3399351 3536937 3515875 3245466 3350758 3393405
18769 3393405 3420179 3489755 3440393 3371835 3428630 3442751 3387235 3368682 3239170 3056674 2874995
18758 2874995 2926311 2930147 3118518 3192365 3055324 2980649 2996912 2730371 2576162 2437841
18748 2437841 2293855 2188226 2038680 2106060 2237056 2249315 2163572 2109867 2019204 1901568
18738 1901568 1874850 1749867 1691445 1895096 1832134 1653135 1517331 1442429 1494519 1566530
18728 1566530 1531817 1324055 1358254 1513821 1395015 1096163 780139 493222 539807 475006
18718 475006 485068 273858 75931 -23184 -114071 21963 27982 100239 177262 -17925 -69663
18707 -69663 -139996 -180400 3678 178412 394602 568221 499004 462463 537068 534905 406115
18696 406115 248824 236568 195918 250565 444621 605028 800352 777234 792464 742776 661287
18685 661287 630707 857590 1095605 1388887 1225087 1036514 911356 1004925 1106266 1338622
18675 1338622 1552417 1495212 1647516 1981051 2194897 2187414 2172823 2319274 2150087 1852617
18665 1852617 1551261 1507471 1627949 1750737 1664714 1566680 1577084 1443432 1419857 1297913
18655 1297913 1214412 1202204 1176328 993711 1018057 1082544 941200 823370 779266 658034
18645 658034 669657 753178 626810 537919 679818 704630 599971 654220 555589 503105 560062
18634 560062 625376 655786 554185 463734 577232 489029 638599 698687 599546 362790 352384
18623 352384 564979 611376 495883 526283 654614 793479 761495 660126 534895 452922
18613 452922 490667 625766 545506 499495 543894 563284 431858 535005 642920 494211
18603 494211 416642 632877 777769 736364 696716 665785 557372 438161 438859 454459 336400
18592 336400 136490 138222 262683 279370 272881 303693 233734 317905 557636 705951 768989
18581 768989 725724 628307 573509 577042 649367 536630 253633 237347 125599 124112 335567
18570 335567 403315 415637 559245 774421 954312 964085 989555 1053458 922199 784621 735676
18559 735676 918906 892609 810825 723306 731244 738789 754696 895669 941235 853308 847223 948206
18547 948206 877614 600079 219116 189933 315156 218380 156608 179422 416327 480235 561390
18536 561390 607366 633226 624242 536016 488077 310865 397637 669275 799000 685396 719850
18525 719850 766967 716774 479428 198929 287001 236283 47108 269725 433871 322466
18515 322466 356852 532528 738779 889605 914404 662172 327202 289648 385066 303719
18505 303719 342715 302483 257470 435545 693863 739468 775421 568653 424076 356477 667871
18494 667871 764666 628005 315553 202354 160754 -27017 -120420 -168411 -107663 7395
18484 7395 15927 107503 59284 161514 341412 337715 331017 294591 141194 48971 -195879 -147047
18472 -147047 51466 303233 402993 439806 356275 193859 14976 -58152 52422 -76941
18462 -76941 -50131 205834 144323 150593 346576 415988 130054 160479 308324 239828 101982
18451 101982 -1887 -55098 -14903 -71296 -156793 -121915 138059 312602 504266 530595 656965
18440 656965 603276 507531 622969 753558 653478 549590 673006 792599 842386 691430
18430 691430 614415 539469 690332 703304 674941 758659 857373 847135 809110 624607 500712
18419 500712 490286 477652 364464 322416 414091 354936 312023 167092 206188 355871 540251
18408 540251 529914 423325 483483 509094 274848 171985 192643 218777 333269 624180
18398 624180 680006 696283 671048 805614 1147826 1295357 1143968 988068 1010590 900275
18388 900275 1017477 1209251 1268956 1070883 970043 1126605 1021438 894046 757442 582238
18378 582238 682423 916129 1034273 805287 610372 589290 499637 346180 338946 325484
18368 325484 240786 309721 440819 368683 312501 320291 279456 330125 293390 431838 242796
18357 242796 146444 183057 44434 -24558 215379 291335 351190 334155 262655 332738 274092
18346 274092 211805 216847 384224 631165 672489 747236 680228 546513 590056 667469 576232
18335 576232 644799 745040 645738 527345 464951 307724 199841 155026 182156 37619
18325 37619 -54057 91472 223621 68327 94396 77846 48796 150249 161881 85184 174971
18314 174971 174091 67810 266445 462632 238376 149962 163538 194791 84081 -114998 -94847
18303 -94847 17030 89269 44042 30178 160728 309442 303731 122706 185220 297465 265905
18292 265905 220573 197829 -78031 -164238 -172665 -79997 -117707 -52829 137430 172354 126314
18281 126314 54100 166414 313810 445522 592092 602838 561410 263846 149758 224160
18271 224160 217566 230186 66629 -158372 -208514 -81334 -12577 145410 202322 197700 -51356
18260 -51356 -328360 -203016 51506 223030 220058 -5297 24307 91355 190714 128753 99402
18249 99402 152750 167803 129075 140525 196608 169929 4494 -115697 -1618 97584 88859
18238 88859 32715 -10680 4822 -61179 -207360 -108775 82748 214091 210511 195822 219501
18227 219501 107316 87628 4868 -5264 4711 127891 115609 236006 368215 342470 255967
18216 255967 143397 -53778 -219032 -182235 74036 201082 251260 139880 -61844 -32566
18206 -32566 163200 330413 273826 234635 249644 230648 258440 262003 255835 309443 459292
18195 459292 434728 261501 166048 186682 249757 196052 61777 -144853 -253066 -190280 136042
18184 136042 148011 47658 44688 69401 -47618 -118841 -129015 -91473 -69958 -8027 57810
18173 57810 100817 133676 97266 39133 -17166 42304 136047 221994 311572 254731 10111
18162 10111 -173894 -130511 -145796 -42649 168893 191171 9467 40382 10665 -17128 30853
18151 30853 -152856 -70348 -46892 -153524 -288771 -94838 135851 225031 196126 166795 198406
18140 198406 236650 250242 246484 183544 -106227 -210604 -101223 -140790 28542 157050 74033
18129 74033 49778 62024 41384 105148 126530 26280 -155412 -124377 16328 69203 76418
18118 76418 -111651 -315140 -407244 -283299 -69588 -48149 -89246 -81471 -149972 -80610 68598
18107 68598 237142 162914 -189207 -178402 -189686 -342852 -378219 -163932 -169347 -154605 -43558
18096 -43558 -20460 -34074 -25445 99249 240762 415738 449968 353869 87313 42047 280528
18085 280528 309380 254164 261731 61523 -5400 -113829 -222432 -112305 -93122 109840 262384
18074 262384 125056 122816 119996 158758 137402 151733 172698 250377 162553 187648 290874
18063 290874 177361 226210 132940 16862 148650 161680 214305 178038 -15019 -128140
18053 -128140 -64910 -67701 -42469 -44465 -18769 233855 248337 106065 124678 27218 -4158
18042 -4158 64569 -106829 -113595 89326 140638 116868 79763 24642 136329 297057 459903
18031 459903 605104 425035 281196 199444 205596 324156 408000 371328 386105 320643 240836
18020 240836 243720 179022 52419 146942 77809 -294680 -144490 -6816 95366 12432 -47442
18009 -47442 152942 208978 294962 347044 393291 331022 223161 130739 64330 194199 153015
17998 153015 87929 39286 -18949 28695 207537 179224 46753 57931 -70976 -50513 70627
17987 70627 320972 319403 103317 123636 240534 416891 482348 601162 693113 754236 678931
17976 678931 362687 145488 13582 9866 173850 136124 71729 224462 419769 271032
17966 271032 199754 259956 333560 511552 328417 76760 69609 -26895 -102295 -76734 171908
17955 171908 147341 -7623 -192947 -201041 -98066 184643 257778 275495 421544 441658 270061
17944 270061 151268 216056 236247 283253 230095 378387 155353 -193867 -249994 -173257 317360
17933 317360 517805 459199 324000 57062 -224690 -306921 -97211 -95793 -215297 -223460 -148508
17922 -148508 -136015 -42968 35709 108583 87370 1356 -21994 -86196 -227040 -302594 -111298
17911 -111298 137975 224270 85908 5456 -25508 11533 55826 152789 79685 -52149 49068
17900 49068 342965 400839 160035 197573 289239 319986 366178 235248 -65607 -215312 -148544
17889 -148544 -236219 -212256 100803 140777 -38800 -36574 23857 117697 223202 236952 107513
17878 107513 52890 141443 69770 34040 59177 -105687 -129790 -35054 -107403 -156960 -103680
17867 -103680 -27715 -159911 -326641 -317939 -245036 -365598 -282977 -163806 -105343 -253410 -255227
17856 -255227 -80512 -80550 -3917 -186880 -185318 -215944 -279931 -283718 -236196 -425188 -108171 43704
17844 43704 -202663 -424110 -36677 96318 88250 -31790 176343 450118 356055 85334
17834 85334 -291337 -422833 -349288 -339274 -226239 -170499 -212583 -336070 -313286 -280983 -282030
17823 -282030 -115563 85904 126289 70856 142272 207937 324040 294504 146949 142646 23814
17812 23814 32637 181908 138538 95326 63748 -27490 -281051 -566538 -727523 -509523 -202865
17801 -202865 -95719 -140791 -153716 -69222 -170955 -193016 -231534 -28676 303997 326922 136862
17790 136862 102843 187499 -147792 -439843 -499046 -356388 -271284 -83019 -202060 -194413 -79151
17779 -79151 47306 45224 37223 -177182 -257728 -151504 -51117 -131150 -295014 -400728 -344762
17768 -344762 -318951 -355147 -381671 -426071 -327302 -317947 -364299 -184307 101002 127890 6393
17757 6393 17868 -27018 -205002 -288210 -252713 -298472 -308644 -334661 -166609 -85675 -113154
17746 -113154 -179341 -87884 -95488 -187299 36341 -91613 -125452 -212127 -223414 -279393 -245578
17735 -245578 -376818 -424341 -238526 -39059 -18714 -212260 -291550 13319 83620 260564
17725 260564 109219 102278 136630 -66364 -106428 -195208 -300071 -316675 -257838 -126866 13068
17714 13068 115151 181454 106851 -132564 -232552 -421584 -391724 -224257 -73929 -35570 148616
17703 148616 143667 66585 10656 -26074 -16032 -103506 -53555 -204867 -430436 -427335 -315873
17692 -315873 -126864 -140759 -62869 1034 62269 11446 -22020 36907 78377 63832 16773
17681 16773 -122338 -171319 -77036 -29142 -15887 21441 49544 40433 -82218 -131356 -57905
17670 -57905 -134172 -187939 -212358 -227193 -27533 46805 -86305 -151164 -51589 -16069 -166007
17659 -166007 -143627 -264174 -323918 -163010 -4514 169568 7993 -37055 -27193 -128263
17649 -128263 53238 90995 80677 110225 168753 268983 262365 304197 275740 334860 242472
17638 242472 178488 77244 45676 61325 -129037 -285114 -222382 -169403 -278446 -105793
17628 -105793 69611 139653 179914 108514 52278 57831 -57019 -178112 -97637 93251 90303
17617 90303 61472 -60939 -102371 -20268 28750 20742 -31625 -44336 15809 149221 90347
17606 90347 -61591 59355 104191 163703 -73097 -64723 -12525 -183657 -160788 -199446 -288879
17595 -288879 -206931 -112987 -62491 -115031 -123197 -145472 -326492 -291083 -175025 -99657 117883
17584 117883 5260 -464103 -559505 -526084 -324749 -171776 -24807 -178184 -295146 -279332
17574 -279332 -295577 -208134 -139954 -159938 -168631 -290370 -287981 -203101 -188640 -184225 -190703 -87075
17562 -87075 -91439 -223774 -253742 -228915 -3318 117281 43981 -172706 -309857 -244992 -238457
17551 -238457 -71922 102529 109027 155860 104281 -72996 -163451 -171176 -210813 -90775 -130855
17540 -130855 6520 118782 35945 -65732 -99380 -275423 -256533 -77541 17983 -200640
17530 -200640 -220520 -32271 145810 68520 -72023 -265779 -183246 56080 174671 -77914
17520 -77914 -112573 -64113 -11156 -199111 -109471 10094 243603 316662 285685 262866 166743
17509 166743 -26530 -234404 -248882 -78399 -229779 -279721 -190991 -170938 -268535 -253835 -126959
17498 -126959 -246868 -202505 -267366 -214423 -15981 72236 73943 136663 201300 156541 19369
17487 19369 170723 194291 102099 135407 255060 187253 175146 98880 5388 78666 -814
17476 -814 2659 124252 124212 128045 69278 -24082 -134908 -176424 -127884 170742 306724 351949
17464 351949 345278 289860 236896 271859 143340 -8913 -169727 -195324 -135609 -110849 -69754
17453 -69754 107610 96784 306412 522196 616292 515861 622669 501985 365053 535168
17443 535168 634042 619610 498368 323526 272230 227995 75172 -248072 -388424 -181037
17433 -181037 -20596 86317 260136 175751 121009 36234 48249 121006 16766 -139234
17423 -139234 -176512 -233637 -165444 -243693 -131289 -181323 -229328 -164496 -5585 130252 -178454
17412 -178454 -16905 46825 -9024 -123273 -231082 -189134 -87691 32883 -19105 -160590
17402 -160590 -173903 43567 -198112 -288353 -245249 -216000 -105404 95841 168126 122769 421700
17391 421700 461119 153527 -30113 107136 154256 76223 164113 225298 157023 93692 -40872
17380 -40872 -54574 -70227 -214647 -249963 28660 121986 -182352 -383660 -159846 -63827 -189227
17369 -189227 -145618 -43961 -118503 -168567 -126351 -144986 34063 198856 36649 183464
17359 183464 134458 86448 14827 90668 135445 196538 153537 161405 231903 626262 788995
17348 788995 685659 562087 476263 359038 258135 266905 384878 409356 330754 371926 274834
17337 274834 318525 408574 97328 215153 242229 237686 276562 54280 -206789 -262570 -415572
17326 -415572 -233912 -334911 -307471 -61876 -61714 -151743 -204682 -48541 97066 108425 255396
17315 255396 253035 22885 -30371 -169067 -285577 -350562 -357831 -382221 -434316 -289129 -95247
17304 -95247 44416 64806 -202155 -272789 -112522 -146226 -256762 -328131 -364540 -358402 -151738
17293 -151738 -70742 -132844 -48576 -90707 -324757 -235533 -28611 159113 95697 -122401 -141601
17282 -141601 -172208 -495380 -643372 -448830 -197062 -23428 89817 34192 -94826 -239658
17272 -239658 -198976 -80169 -28395 16679 -185200 -290032 -457789 -393639 -202687 88798
17262 88798 133823 -32536 -270977 -300214 -300062 -264391 -192288 -279285 -270044 9320 127458
17251 127458 128911 -47046 -57914 -275066 -299400 -286387 -213470 -219446 -328985 -321327 -180109
17240 -180109 79803 78452 9888 30699 76419 50933 80383 74610 221839 204390 176460
17229 176460 -83451 -214781 -118014 -203119 -250764 -103710 -95514 -315984 -331082 -449884 -529878
17218 -529878 -472022 -366203 -148405 -183472 -28081 167364 249214 169787 -25963 562
17208 562 -99979 -268915 -414588 -278624 -122454 -1848 115713 145522 4550 -81393
17198 -81393 -252018 -211043 -256497 -295637 -172289 -214913 -317317 -319127 -236158 -286322 -384206
17187 -384206 -565433 -479310 -447556 -385877 -277997 -368060 -329536 -360560 -393371 -452322 -491083
17176 -491083 -323375 -75534 -47062 -90831 -26762 63521 -124441 -221054 -247465 -134493 41565
17165 41565 181734 205041 142184 156060 86895 141616 28692 -48484 77451 119047 48901
17154 48901 -85951 44262 95791 82752 6526 -126695 -146234 -104855 49749 -33172 140471
17143 140471 293097 418568 512035 553465 520453 461514 467857 813948 915279 757426 518535
17132 518535 412966 358610 352157 209693 140252 190937 293547 363434 245550 113994 -39375
17121 -39375 -53446 -107764 -22529 -31745 -114359 -99247 -181384 -63153 -81607 -194146 -101161
17110 -101161 -107476 -231924 -182266 -78320 -116734 -240340 -52354 54320 45059 130640 266453
17099 266453 195315 189432 100412 246590 453951 568326 385467 119954 41544 182264
17089 182264 183068 41228 -104255 -23777 -64566 -31020 156978 130505 -20236 1991 -61485
17078 -61485 -123131 -86538 -194825 -286591 -348041 -480463 -512858 -340223 -238485 -184491 -216343
17067 -216343 -248072 -220067 -203197 -140259 -96095 -143576 -287912 -243369 -102122 -3346 79726
17056 79726 -121783 -110329 176970 204668 32543 -38514 -16468 19153 206909 271031 159246
17045 159246 -190617 -347405 -228879 26614 -69513 -56184 -82471 -274061 -238148 -202924
17035 -202924 -330797 -301493 -70309 -36507 48489 -29481 -275178 -401834 -245313 -117107
17025 -117107 -62593 -225849 -340141 -398566 -356825 -204034 -277388 -232313 -113512 8818
17015 8818 122709 75672 100096 52930 142496 173074 79342 70688 217310 269321 70506
17004 70506 -129356 -111976 -111082 234890 327321 37887 -154197 -247320 -409171 -499079 -351740
16993 -351740 -296368 -403396 -328202 -94139 -7632 -187652 -241299 -230108 -256354 -305380 -132648
16982 -132648 102013 179047 71466 -4415 115872 146158 60577 -99515 -70536 78487
16972 78487 -189492 -585849 -548171 -653555 -619103 -248686 -204326 141453 169536 -151828
16962 -151828 -76291 -42044 -139564 -369782 -465505 -306175 -135369 -19878 161229 -94153
16952 -94153 -173436 -154889 -162664 -26077 -32240 -177311 -95493 103878 114181 22689 -125932
16941 -125932 -193555 -175161 -210306 -187054 -85078 16290 65553 -88464 62255 -88702
16931 -88702 -101927 -65903 -137799 121595 272140 125797 18295 26203 50600 46481 -29196
16920 -29196 2820 128719 230304 -52521 -351226 -354020 -297464 -421132 -503819 -539460 -410207
16909 -410207 -447839 -336577 -266075 -46151 -83177 -206827 -50015 102059 55745 -7967
16899 -7967 -55536 -267473 -402449 -351287 -182829 32594 101834 -2213 -149770 -284643
16889 -284643 -177299 70541 181071 -31669 39606 33879 55271 110877 -14700 -221870
16879 -221870 -290167 37362 177959 17243 124801 7276 -115872 -114617 -64892 -197403
16869 -197403 -208432 -144831 -173881 -149290 -78137 -40544 -160789 -196261 -76053 -191506 -276049
16858 -276049 5670 67335 -59531 -98654 55350 17920 -148668 -260896 -268800 -207114 -139703
16847 -139703 -109780 -192357 -182746 -209120 -144577 -163708 -291435 -192797 -94172 -28219 57022
16836 57022 -26685 -222029 -120353 -107114 -185000 -283539 -452960 -268888 -88282 -88830 -200107
16825 -200107 -207760 -91710 -185609 -448264 -540268 -392482 -252667 -296040 -281889 -264558 -302903
16814 -302903 -334803 -241461 -96682 -103639 39174 52622 104494 -140434 -305721 -397567 -329947
16803 -329947 -275372 -245100 -132035 -95062 26541 -19034 -108575 -209434 -165932 -146170 -198763
16792 -198763 -198533 -323886 -417513 -290954 -306865 -177608 -81374 21768 112495 67635 -95377
16781 -95377 -129949 -27394 19998 173198 46609 -16612 -37524 -183266 -107157 -55536 -214315
16770 -214315 -82691 11139 -7114 33271 86438 -103105 8352 121372 -88991 -71676
16760 -71676 -133838 -159102 -110818 -49919 -166065 -410631 -402644 -352113 -329286 -203421 42580
16749 42580 167875 121757 -171494 -312821 -248663 -240798 -199091 -326207 -328691 -115160 19655
16738 19655 26629 -83840 -170813 -274590 -398545 -442391 -454551 -359408 -200116 -20041 -83807
16727 -83807 -15252 81657 61741 62189 -47163 -113747 -119712 -70284 -52123 -7590 -96294 -81739
16715 -81739 23411 -4248 -136240 -20004 96556 189673 116517 61870 -111631 -222197
16705 -222197 -95919 48742 -100258 -314972 -289079 -353080 -495440 -330552 -160284 -187247
16695 -187247 -17815 56430 119747 77505 -122552 -139677 -8425 -34849 -169520 -303134
16685 -303134 -329158 -82194 -46349 134786 222265 -6560 -47960 104116 229744 237626 184056
16674 184056 328757 335100 92503 16237 -80150 -68659 -5661 18153 -75854 -152415 49398
16663 49398 3138 -106620 9497 66149 31814 91445 285841 283644 -14543 -215084 -138024
16652 -138024 11101 198533 138381 144900 120614 -8103 -157266 -214868 -260054 -222482 -309030
16641 -309030 -369891 -395529 -230587 -239453 -372261 -277719 -340502 -366153 -316308 -280327 -410175
16630 -410175 -372676 -407884 -463410 -337630 -23068 87530 -23135 -18722 41089 -67086 -19150
16619 -19150 45785 -38305 -166995 -205590 -166983 -118061 -141859 -136496 -48055 -221169 -291296
16608 -291296 -274149 -354359 -327567 -412721 -478181 -252762 -132029 -166228 -153752 -89738 -158683
16597 -158683 -314996 -403733 -293228 -244297 -244749 -159656 -188938 -164583 -137956 -19826 -26256
16586 -26256 -150514 56682 -13459 -175912 -153936 -144410 -57566 -255281 -214891 -60456 47382
16575 47382 27953 32186 126345 71930 183793 330258 268582 38898 -99747 -121009 -62142
16564 -62142 -182375 -172648 -368290 26718 176808 -37903 -96669 -127149 -202051 -399392 -312996
16553 -312996 20866 -154929 -421402 -376130 -229713 -114780 -22668 -94796 21889 112121
16543 112121 -34993 -204147 -299295 -319898 -117983 107327 275236 267247 279095 56730
16533 56730 -111605 -24510 -86063 -303728 -138525 -33080 195829 189787 42407 -13923 -41392
16522 -41392 -227118 -170779 -233010 -356596 -475981 -442941 -317374 -247148 -187020 -276026 -209555
16511 -209555 -130014 -114390 -216354 -243409 -158875 -125015 -22128 -95685 -290098 -166908 -36034
16500 -36034 -270776 -445975 -306957 -27519 30386 41869 -15707 -84834 18526 -9350 -161377
16489 -161377 -411641 -341877 -12995 78194 9012 38866 2726 13666 -100150 87151 246263
16478 246263 25551 -321069 -376721 -250703 17142 111848 -13158 -272646 -281555 -305501
16468 -305501 -226758 -87614 -90015 -304479 -154132 137201 68913 -30763 -222909 -75103
16458 -75103 88843 84499 121494 58755 -16629 -107939 -86909 -42467 -55025 111065 235260
16447 235260 -108723 -290267 -296922 -304411 -205062 -191039 -208014 -274852 24797 167118 41760
16436 41760 50208 -65579 67652 106783 -12390 -183306 -128574 -124776 -54898 -87468 -81076
16425 -81076 -112018 -56627 -226800 -210163 -133989 -14813 -36824 -112880 -43352 -126026 -128176
16414 -128176 -174526 -189053 -173422 -249187 -282438 -311999 -287173 -165426 -102231 -164915 -311557
16403 -311557 -284679 -165582 -285734 -303246 -382443 -253295 -186234 -239200 -237983 -189417 -221371
16392 -221371 -92346 -59921 13306 149439 211582 221896 57374 -61024 -143210 -135127 -213257
16381 -213257 -40099 -114906 -338669 -188111 -221196 -305070 -316977 -347786 -230562 -172313 -284147
16370 -284147 -333135 -316494 -249943 -336633 -399918 -195463 -147718 -77657 -54344 -78316 52429
16359 52429 6768 -279844 -230306 -124646 -109686 -206895 -207320 -216908 -376677 -551598 -451987
16348 -451987 -476247 -302704 -54790 11976 30576 -114717 -176403 -146901 -259823 -361737
16338 -361737 -380541 -359523 -354772 -123510 97128 246118 197647 126198 17928 96708 277399
16327 277399 255405 79992 -106658 -83835 -65163 -357189 -183859 -150582 -232447 -12707
16317 -12707 -53204 -80062 12365 21236 -128311 -102539 -363092 -559279 -503335 -249237 -200466
16306 -200466 -153979 -520316 -589920 -468040 -168350 51615 93395 268273 345940 108917
16296 108917 181941 221785 173626 -6577 -53030 -111555 -169521 -198762 -188915 -125863 -128706 -291763
16284 -291763 -388697 -347648 -88870 43703 91787 166695 134725 47243 114197 -100668 -20737
16273 -20737 95340 -100443 -314183 -613227 -739299 -441452 -38571 150497 244670 139088
16263 139088 -133236 -102853 -229058 -293552 -231557 -241810 -46356 -9698 -31254 69371 258887
16252 258887 197475 22999 -192008 -132014 -139414 -52987 24580 -111295 -354130 -403739 -299192
16241 -299192 -292322 -174546 -11541 26783 -103201 -70102 -173089 -103568 98812 121094 136672
16230 136672 108012 128486 -58551 -211018 -161400 -226251 -388000 -330588 -32542 146256
16220 146256 117762 32029 -26228 6792 -76566 -311495 -495986 -489661 -413957 -31220 66582
16209 66582 -56727 -222334 -246639 -262952 -224695 -228491 -378126 -495859 -436707 -191801 8456
16198 8456 35504 -129204 -36255 268468 480353 586726 523549 437089 316252 183709 101519
16187 101519 55614 34208 -71114 -92767 16635 -140619 -211395 -233425 -175110 -23686 126949
16176 126949 94031 34022 -172881 -230970 -278402 -352400 -312786 -354341 -325744 -299403 -168740
16165 -168740 -82040 82021 155126 -85808 -218961 -367310 -345273 -215532 -343883 -279969
16155 -279969 -9100 15383 -87791 -238811 -182979 -47900 -38445 57399 -46365 1263 244456
16144 244456 410740 372978 155781 122876 -38515 -24781 196529 84191 -68413 -67949 25422
16133 25422 91227 -120255 -280064 -404075 -275249 -226012 -216993 -203384 -228581 -218328 -176661
16122 -176661 -178591 -117501 -36301 -321592 -458523 -362245 -247917 -273153 -384207 -579350 -570846
16111 -570846 -519302 -441970 -217485 -344381 -341293 -295787 -606019 -440592 -271583 -274990 -368134
16100 -368134 -216147 -114669 -46848 -168687 -134251 33231 14554 -98450 -226059 -213795
16090 -213795 -195595 -278566 -260190 -203785 -201633 -103035 -50295 -53701 17589 66980 111981 152212
16078 152212 141568 161008 302928 218174 -16755 -86709 -44927 5038 -206855 -275735 -388836
16067 -388836 -246752 -116298 117912 149722 54910 -140460 -457341 -387653 -226028 -164144
16057 -164144 -437395 -494209 -367369 -312710 -289261 -285034 -433467 -492041 -322995 -104269 -40338
16046 -40338 -154131 -216698 -140156 -117389 -149920 -241769 -355281 -436566 -220561 -103163 -149538
16035 -149538 -357901 -211441 -183263 -325772 -314072 -200789 -76315 246586 189950 55240
16025 55240 -150311 -106249 -120211 -257505 -316591 -389077 -267451 -169696 -260514 -274343 -196611
16014 -196611 -152537 -42850 -11756 -11839 -68149 -175651 -108024 -140422 -162398 -419701 -440765
16003 -440765 -383595 -470579 -551333 -402746 -102143 43847 55812 32584 -7574 -74826 -188791
15992 -188791 -258696 -276246 -189480 -172190 -291728 -251507 -21086 18845 -201874 -219287 -117322
15981 -117322 -177997 -195303 -146324 4687 -47960 -213480 -113612 10879 -61262 -165426 -279050
15970 -279050 -287358 -53782 158898 192181 122646 181332 57445 -70777 -125000 -218378 -208946
15959 -208946 -75125 -63711 -15538 53814 73370 -124634 -295761 -171882 -24498 57468
15949 57468 12716 -116698 -105112 -173736 -67670 -69786 -39719 -34263 -56748 -29058 -163338
15938 -163338 -260962 -209473 -99980 -363044 -509780 -435059 -341987 -344190 -271680 -199310 -107919
15927 -107919 -49725 -164685 -237320 -167581 -89765 -80272 -59355 -352649 -356417 -121943 -253776
15916 -253776 -178135 -24146 11768 48781 -227738 -409753 -443082 -443218 -462372 -211402 44724
15905 44724 -30866 -91302 -92438 -128093 -176058 -234561 -282893 -92842 -171145 -107768 -88548 -41688
15893 -41688 -48099 79690 198059 179699 167918 -8268 -188486 -235510 -234382 -67292 -191948
15882 -191948 -91463 -82354 -148086 -34358 92268 -8793 -54249 -133757 -302201 -65704
15872 -65704 30513 -181238 -298968 -223666 -151105 -265604 -400819 -266260 -176239 -327099
15862 -327099 -490917 -395086 -236489 -116670 -20633 -3657 87943 118765 292134 224794 -39955
15851 -39955 -69236 21453 -20670 -100740 -323574 -359990 -183649 -152499 -233985 -206132 -297607
15840 -297607 -226544 -98526 26842 29849 -34312 -128838 -184322 -69211 -136644 -178690 -73155
15829 -73155 6153 12354 161405 124206 6577 43904 -145433 -405575 -349082 -243066 -149653
15818 -149653 -24120 175043 365121 399207 236871 210430 199264 108788 155804 295625
15808 295625 231132 294305 218788 98312 -16482 -81589 -126352 20579 69828 -34531 76295
15797 76295 34283 -47764 -62653 -38390 87928 39080 110683 103541 93665 223049 119024
15786 119024 31300 48632 -59822 -180618 -47331 -138334 -196810 -93319 48718 -37274
15776 -37274 -78191 -128968 -252074 -380800 -594431 -363333 -207522 -242062 -324941 -331037 -149088
15765 -149088 -39046 -177580 -278115 -359219 -250276 -95232 -232621 -450619 -651438 -679001
15755 -679001 -579971 -486560 -451057 -313920 -303183 -317462 -154420 -33191 -58920 -48123 -93878
15744 -93878 -75672 -102843 -534 122607 189912 174861 122746 132671 179949 287081 364514
15733 364514 -7382 -424922 -521002 -330129 -113497 -15539 -140679 -217424 -236406 -489704
15723 -489704 -350377 -118559 -111545 -178524 94664 70941 71559 56112 189135 257005 61263
15712 61263 -87760 -59529 -41514 -74028 -242920 -198187 -67866 68437 -87536 -332263
15702 -332263 -202154 35659 61163 -50765 74297 -7553 -46293 -117449 104131 396478
15692 396478 272065 292868 280717 46455 16819 84575 -34821 -20886 -37459 -98126 -110350
15681 -110350 185019 242794 156628 275237 132316 -185719 -304332 -177816 -19593 204087
15671 204087 218549 31512 59385 117648 179714 -86905 -103940 47089 -99224 -321444
15661 -321444 -283385 -122578 -32986 75487 -5478 -155025 -233336 -57182 80787 115504
15651 115504 -26292 -187621 -259499 -105355 180049 -70320 -132881 -67893 -14464 -48786
15641 -48786 -196712 -344206 -364224 -365510 -288191 -243725 -257338 -346884 -386452 -235928 -301397
15630 -301397 -277872 -224310 -87498 -160430 -150607 -111199 65006 44687 72124 82328 116982
15619 116982 29706 -240623 -364712 -442616 -384598 -183997 -130990 -236053 -227640 -10116 64563
15608 64563 30876 186507 217357 75037 107296 357769 325010 253226 234008 136272 185241
15597 185241 103013 62765 202927 163922 104007 -41649 -144776 -111219 -123958 -74243 -55136
15586 -55136 -208447 -257917 -165331 -184666 -132846 -32705 -28828 -49190 35261 -10862 -71635
15575 -71635 -86954 -10854 -77005 -165155 40958 142589 344399 284554 28949 -244764 -252779
15564 -252779 -224941 -194194 -142352 41578 24304 -4672 230967 131744 17534 72753 131712
15553 131712 271068 343378 316968 348945 286674 197852 -28554 -284587 -452524 -513620 -401049
15542 -401049 -293569 -378323 -430478 -398929 -401650 -446342 -456373 -312951 -165597 -145270 -127374
15531 -127374 -57991 -2837 -194468 -132013 63947 30999 -214060 -87795 -46510 -48358 10639
15520 10639 -302433 -411911 -208451 33978 55593 -21877 4596 -122027 -87854 31479
15510 31479 -62592 -73177 -16093 -68307 -195928 -358859 -289987 -90283 -174216 -229411 -256048
15499 -256048 -305559 -159316 -72995 173465 269854 129114 -73588 -74245 76984 -259186 -307078
15488 -307078 -188402 -201809 -206432 -219397 -194957 -163454 -268364 -388166 -420093 -580181 -349983
15477 -349983 -96332 -50544 -270838 -63442 -16772 5514 -122257 -291758 -230239 -138089
15467 -138089 -176661 -142794 -253866 -194178 -93654 -189862 -413504 -311027 -169308 33853
15457 33853 59090 19633 -59794 -32017 78778 -12476 5270 120553 45655 -59204 -207138
15446 -207138 -345216 -204897 -187931 -253453 -193171 -264488 -298164 -157497 -10345 41396 52872
15435 52872 12945 222359 98551 -73378 -138795 -274562 -207922 14968 -43045 137368
15425 137368 114516 106904 128340 228924 171391 57643 -166327 -93227 -14282 -164284 -363442
15414 -363442 -367910 -191539 -152953 -219390 -420809 -355079 -310805 -223298 -313308 -368659 -507825
15403 -507825 -315271 -170918 -246746 -226695 -155503 -225790 -454822 -436176 -179365 63403
15393 63403 -54790 -255821 -238333 -89536 -99872 -224389 -139943 -103591 -137409 -189758 -210005
15382 -210005 -250005 -172905 -60802 -69203 23361 -48289 -271492 -378019 -463577 -302765 -62979
15371 -62979 85992 95554 111396 12927 106293 190706 119785 31616 -76723 47797 83457
15360 83457 126606 6143 -35383 -146488 4102 -61150 -162867 -74174 -12356 -134645 -45088
15349 -45088 -93379 -211933 -109604 -69514 -187034 -407965 -272100 -184086 -132396 -192986 -161385
15338 -161385 -159757 -170113 -105706 -85768 -57550 -63401 -132902 -200824 -228823 -220594 -157278 -53311
15326 -53311 -186533 -178914 -56123 -162665 -252534 -368085 -367810 -43895 137444 185354 246999
15315 246999 132999 107744 313935 212889 249145 136357 -47917 -1135 132353 145680
15305 145680 24093 124495 52174 -128569 -29098 57965 107243 273431 367350 501531
15295 501531 451285 165961 99934 102518 51369 -39232 -26821 -38833 -29006 -72410 -260245
15284 -260245 -237747 -163177 -199314 -314829 -476590 -376942 -68159 -21733 4268 -47091 -104268
15273 -104268 -96359 171902 305287 384094 422593 150580 -112233 -5677 48782 59269 -23363
15262 -23363 -78225 96311 35950 -99577 -69079 77436 -153576 -331319 -283170 -191854 -194367
15251 -194367 -159845 -81362 16403 -205294 -187184 -171302 -74387 -37026 156109 319180 294182
15240 294182 232142 117810 117972 129370 163003 -55708 -68591 -139909 -3784 150172 54537
15229 54537 -25174 -44077 -121819 22491 213774 83853 -102650 -90184 32592 100944 205532
15218 205532 62497 -76175 36981 12787 -190063 -68106 -148597 -413451 -192364 -31567
15208 -31567 -78362 -130685 -158800 -279826 -418909 -318272 -277265 -177071 -84681 -135967 -302221
15197 -302221 -164437 -116592 -181073 -261296 -180467 -174644 -17763 41396 117512 302129 123310
15186 123310 458 86096 175265 146334 59316 -167609 -238647 -113549 -84695 -174275 -144507
15175 -144507 -237399 -123276 -119905 -177842 -142003 -47453 -24771 -121052 -121781 -86870 -62692 -135916
15163 -135916 -177091 -325330 -243514 -336117 -271880 -136276 75846 107443 44915 286517 173548
15152 173548 101036 -5399 30397 176328 77249 98078 71528 82602 37280 49498 -117684
15141 -117684 -280729 -229753 -141840 -26113 75704 -12450 66295 264857 503810 431529
15131 431529 356051 306085 205170 71656 247427 247167 195584 236220 256674 127488 -188638
15120 -188638 -246574 -186925 -37609 -41996 -104119 -289329 -155952 181526 157497 -25384 -186745
15109 -186745 -75298 157189 105766 93716 -18454 7468 1156 631 140663 19702 -6809
15098 -6809 170550 249089 210720 22088 -83374 65103 160970 21823 -14495 102423 67060
15087 67060 55325 -152471 -182695 -228002 -305960 -77998 53080 31162 -113336 -116638 -213960
15076 -213960 -135867 -147934 -4302 105624 148885 141435 -76086 -36166 121715 180432 316266
15065 316266 264649 215533 177050 100249 39503 -83625 -131289 -37444 -228319 -80866 -12048
15054 -12048 -67837 11208 166791 189989 41521 -147873 -238501 -174723 119696 28186 12381
15043 12381 -91446 40262 62784 -208689 -190348 -53958 -114094 -88900 -76975 -92729 18792
15032 18792 53462 110282 105940 -3654 23737 19810 -2559 -19737 93 -108261 -63134 -189986
15020 -189986 -138591 -90338 -145015 -183643 -172655 -219852 -170889 19324 -206561 -413074 -302565
15009 -302565 -187378 49258 180858 159131 -6377 -162981 -158533 -60965 87548 89177 163478
14998 163478 198119 250425 291450 264829 187700 183607 77382 89687 295288 184340 69909
14987 69909 -249450 -458615 -565222 -554234 -311185 -81259 -276208 -452606 -206543 -155598
14977 -155598 -66159 84341 24052 60160 122790 103164 54595 -70794 16702 -41456 -31705
14966 -31705 -72093 -103413 -125347 -5226 -60019 -205299 -235915 -80714 -72792 -342835 -535487
14955 -535487 -319252 -142293 29243 87708 136996 109361 63327 -7579 10723 70971 116203
14944 116203 137982 91871 194531 27528 200858 422926 462711 270194 216435 31109
14934 31109 18893 -129600 -210539 -48078 -48989 -71922 -108071 97675 30039 43723 90137
14923 90137 27611 -21 -168714 -211335 -434793 -469848 -492080 -196767 176102 264930 37442
14912 37442 -149201 -95701 -127277 -75876 118598 143173 16023 -208611 -317766 -348324 -305328
14901 -305328 -125401 -258814 -373229 -232329 -319044 -211874 37248 -68848 -170393 -120363
14891 -120363 92993 113713 80179 98296 40929 -74433 -52223 -162857 -344366 -121266
14881 -121266 5306 -20321 -211809 -84547 -146152 -185830 -36247 -75097 -179504 -217296
14871 -217296 21019 24437 -37130 -278506 -302594 -268646 -53094 100480 151781 -87855 42958
14860 42958 132587 11002 17747 8819 69124 117514 209021 161349 -38309 -31088 248121 105292
14848 105292 31137 32951 28186 101743 116120 6357 -79480 -183676 -133808 -258934 -388333
14837 -388333 -221218 -131055 -222483 -217343 -199669 -209271 -328019 -300208 -218944 -434881 -524888
14826 -524888 -276127 -4681 -5811 -90116 -350387 -344702 -133114 83138 13024 15217 -124803
14815 -124803 -160353 -33645 -21394 -65944 -114276 -88381 173049 391947 334467 221341 142699
14804 142699 295733 103524 52151 79004 184730 222366 -37034 -242072 -98549 -54684
14794 -54684 -260045 -426596 -208883 -92425 -165904 -210029 -222676 -423285 -528661 -316874
14784 -316874 -315250 -425526 -353835 25611 152338 96950 51899 77606 -34105 -71616 -32237
14773 -32237 -71710 -160305 -132583 -13349 84392 85637 68617 -23608 -70403 -117974 -106438 285531
14761 285531 533041 405957 315457 298931 24454 -93703 -46936 -88304 -54921 -65631 58545
14750 58545 310398 369010 196402 -20920 -155934 29082 261162 249230 21442 -281854
14740 -281854 -166147 179652 237928 83247 36262 194678 135418 179050 263799 187676 179185
14729 179185 196902 449427 471360 309966 140090 283123 351243 484281 555120 461201
14719 461201 361605 313324 296301 284608 372051 491899 448621 528481 451792 307227 208363
14708 208363 344453 287293 369920 266312 185173 265484 250397 40070 -228318 -336110
14698 -336110 -116235 -110882 41162 270383 358549 348286 150218 -10804 -27147 40204 239076
14687 239076 309249 316476 216302 182947 270081 270942 199413 225649 223103 241402 404694 671681
14675 671681 736426 639500 507639 365219 243047 178885 213184 120272 25008 -72619 -10548
14664 -10548 -10021 -300298 -328891 -204275 -160218 -41903 58055 231296 250544 285244 252559
14653 252559 166159 -44061 -87831 -18550 -145513 -312514 -167906 -130241 164204 290828
14643 290828 286950 84284 76217 90999 49574 -91286 -108830 -184267 -129336 -275935 -170567
14632 -170567 -46324 260316 164819 242526 183994 262452 141695 138588 259597 275862 269434
14621 269434 295538 234016 104710 -125116 -118125 -102086 -56950 120988 119215 -260901 -139181
14610 -139181 -192034 -172595 -238120 -214032 -147191 10470 176898 129322 28414 133399 -14006
14599 -14006 -323382 -333398 -197724 -32590 5960 -79919 -143680 -61709 -12186 -16750 -34190
14588 -34190 -105970 -76498 -19578 39023 65218 72321 107975 27614 99791 -12872 -50732 -145931
14576 -145931 -207384 -157390 -71983 50022 202612 22220 -147854 -290406 -216947 -152054
14566 -152054 -89353 20576 63035 -71422 -277609 -281645 -364594 -471386 -574144 -352239
14556 -352239 -76070 -41289 -133137 -205301 -251265 -299450 -189874 -8611 46664 122069 242175
14545 242175 327098 213376 -61800 -122295 32181 89946 -40438 -134320 -252114 -238884
14535 -238884 -158166 -164033 -45262 45931 112364 136126 113775 77297 -48452 -7190 -109952
14524 -109952 -252319 -128063 4106 -4584 -50790 -337919 -483285 -499724 -651862 -547315
14514 -547315 -408451 -348393 -156762 -151339 -216238 -275185 -184053 -69406 220649 204874 249927
14503 249927 238147 139517 131871 152716 176054 166879 58357 -23035 173536 350611 224301
14492 224301 59821 106615 301336 384535 6575 -343611 -269246 67011 202940 116487
14482 116487 50407 42216 228784 164815 70375 7784 70851 119562 107079 115985 198782 294111
14470 294111 230027 104639 22263 -193400 -154361 -60232 9095 -61845 -109305 -209407 -159647
14459 -159647 -162172 40830 -79326 -159938 252345 279288 134511 99055 -54659 -142199 -166347
14448 -166347 -100581 -139993 -93529 -141685 -104039 -114371 40739 71675 -206297 -46346 70771
14437 70771 119686 -16611 -122214 -152787 -242416 -238889 -126454 -56742 -70826 48695 284782
14426 284782 283903 184177 300509 268773 330896 442675 454923 340142 571522 457338 431129
14415 431129 518264 330171 116410 -60429 -95371 -177789 -23930 101306 309217 410688
14405 410688 325038 156406 -1908 -21870 -163827 -263667 -268521 -221733 -191342 -97999 -100150
14394 -100150 -119385 -127216 -104261 -98934 -221705 -285059 -43903 102758 67821 -65857 -117188
14383 -117188 -20600 24487 -9169 -210684 -253193 -72370 -118888 -259977 -371459 -234757
14373 -234757 -268959 -308835 -305494 -232947 -123444 -27162 -17723 -90792 -171061 -167229 -59374 -106409
14361 -106409 -337413 -331937 -166174 -132586 -171523 -17935 -8191 -303468 -259106 -70376 24728
14350 24728 61147 15397 -38000 -122774 -242142 -182816 -154853 -183707 -190270 -148741 -194547 -187580
14338 -187580 -292481 -145541 -111346 -16651 214980 170049 101783 20145 -130974 84709
14328 84709 17640 -82910 -65045 -36221 190766 232052 50298 311686 266061 3183 11705
14317 11705 276874 211537 115374 243889 222887 112731 -129172 -317622 -250679 -294067 -259681
14306 -259681 -390085 -374429 -161163 -113682 -127887 -105355 -107145 -115869 -159920 -153321 -195469 -82802
14294 -82802 -100378 -131545 30693 86495 179422 246552 33477 -83876 25727 -93187 -241817
14283 -241817 -169620 -70745 59090 -9144 -240402 -317395 -143737 -84866 -40664 -18122 4527
14272 4527 136140 211660 249484 299344 137829 -82581 -310946 -395845 -369210 -287212 -240091
14261 -240091 22303 66314 -58252 -162978 1123 61523 41621 84964 70794 91282 83306
14250 83306 206128 220784 184588 81968 167276 74540 -17610 117179 5390 25290 67637
14239 67637 47838 10795 215926 107277 -68842 -110838 -57315 -118783 -24938 -306367 -261866
14228 -261866 -138541 -167105 14106 147944 152102 95702 -80944 -225577 -297457 -290406 -342407
14217 -342407 -358959 -82766 171298 64052 -166024 -306780 -335198 -311793 -21880 72590
14207 72590 -299 137679 173509 139145 -35157 -111559 -110699 -207751 -275035 -394305 -350350
14196 -350350 -286164 -50966 102205 -69239 -266040 -370199 -340939 -142529 -215198 -373401
14186 -373401 -183189 -122098 -150036 -98329 39289 -88095 -191334 -274254 -293472 -84635
14176 -84635 77706 248225 269898 184781 2282 158339 288634 112546 -24574 -142692
14166 -142692 -79276 123020 145774 167571 90529 130171 128906 -35917 -332926 -127218 -102967
14155 -102967 -173298 -2695 -51223 -111573 -187875 -127672 -36206 -186680 -247368 -127509 -262416
14144 -262416 -186672 -17554 -6708 -87570 -247659 -318083 -76039 -166204 -229353 -71025 78468
14133 78468 -82647 -238452 -118551 -128870 -257734 -254758 -152237 -228215 -199852 -130660 -62388
14122 -62388 37339 124335 201434 132970 225240 190403 119828 -34678 -186853 -200790 -253779
14111 -253779 -142766 -51262 -78368 -26215 -57841 -308211 -338667 -121321 3219 83081 193107
14100 193107 223514 37711 -203675 -233492 -75835 -14853 -216639 -431702 -419209 -471745
14090 -471745 -479640 -328005 -187527 -252367 -146514 -147808 -151036 -356290 -309491 -137894 -160267
14079 -160267 -229023 -178213 -82642 115650 163068 192296 -37726 -22566 -95815 -331534 -113188
14068 -113188 -42582 24665 -172362 -143942 -105562 -20856 15880 223477 29019 -236883 -293978
14057 -293978 -189428 -156581 -29498 104032 -41265 -134838 -156691 -347404 -442264 -380543
14047 -380543 -428147 -246760 -92243 58034 25517 -88319 -35348 97859 40144 -867
14037 -867 -50499 -340919 -403783 -365197 -231691 -317478 -160001 -158921 -148693 41503 214357
14026 214357 -1343 -41403 -148624 -190854 3079 10285 -58821 -197679 -314283 -173947
14016 -173947 -250490 -192221 -199062 -108937 -129416 -222998 -243990 -328499 -384540 -251399 -334330
14005 -334330 -256278 -72148 -167074 -328971 -253120 -159504 -181271 -155966 -124138 -121096 58849
13994 58849 127695 46994 38488 180481 183919 112354 -195648 -259122 -173284 -156634 -174835 -244323
13982 -244323 -53444 23173 119486 240946 -30041 -125033 -113813 -146694 -303828 -332116 -315774
13971 -315774 -92108 -34975 -98959 -197453 -145844 -104448 -49210 173 -20009 -153880 -159628
13960 -159628 -151217 -107420 -76242 49907 120977 -146353 -315901 -140844 -38483 -23359 -1839
13949 -1839 -185836 -158798 44302 28838 -82600 -187267 -202434 -120090 162333 318691 92207
13938 92207 -66216 108282 212435 134639 62989 165788 228292 223198 326034 189928 251635
13927 251635 186586 11959 -164948 -193866 -90558 -145194 -62803 72862 -67143 -263998
13917 -263998 -371003 -389282 -353201 -303565 -199730 -155259 -110719 45554 -12278 -71833 -68739
13906 -68739 -166038 -115502 -35285 -59640 -143799 -247562 -35294 23503 11520 -48583 -120788
13895 -120788 -128354 -323974 -435330 -250220 -55562 5883 155691 47322 609 111965
13885 111965 853 -22137 -50290 -20323 63968 -156008 -161330 -80106 12314 -171019 -221136
13874 -221136 -19208 330118 264912 135486 -21822 -198937 -227215 -102105 -71454 30174
13864 30174 -65847 -72717 -99724 198383 345899 364484 365674 387149 416859 292839 484503
13853 484503 371417 210517 111928 154376 128016 -55034 -176738 -140431 -106413 71851
13843 71851 93811 -6656 68128 18812 141951 214388 310046 422614 422650 415278 365206 342227
13831 342227 555540 459579 315816 -63255 -58120 149897 109004 6600 -6013 -21266 -145144
13820 -145144 -143007 54938 165954 144762 122901 32186 -196168 -245965 -188129 -145933 -55450
13809 -55450 23368 112417 54556 -19304 -69436 6964 -161802 -122431 82669 80010 93768
13798 93768 288100 404156 211081 146194 40887 -42494 122226 262957 323072 222513
13788 222513 143054 140572 142139 -69578 -221648 -58871 56726 -38063 -154096 -226624 -17185
13777 -17185 35211 133610 30679 -82612 -115038 6860 11518 14867 147972 158165 3539
13766 3539 57688 191990 252148 149840 15604 -12287 39855 -129435 -31538 70146 113232
13755 113232 157203 13802 -58553 50919 151474 213029 89763 -120849 -133610 25232
13745 25232 144668 7039 26478 116316 51976 -152411 -124218 -1059 27198 57291 -82840
13734 -82840 -69548 -136871 -309348 -252674 62960 22513 -255008 -103051 -167502 -272104 -240410
13723 -240410 -174714 -27624 -110285 -21443 34535 39709 -6249 -8498 81017 81664 181570 155421
13711 155421 321821 347624 227015 130762 104699 123137 14589 -245056 -299953 -340106 -302410
13700 -302410 -63668 57133 53837 39922 -81052 -199596 -302383 -406464 -333499 -232728
13690 -232728 -326377 -249247 59208 -77786 -308383 -476348 -464490 -525757 -392292 -146965
13680 -146965 -70509 -14753 -110453 2877 51596 -25207 -57253 -242138 -305373 -242854 -165811
13669 -165811 -46605 -78133 -134821 -167348 -245064 -501367 -530433 -186383 -30280 -63410 70865
13658 70865 169032 267243 316196 334268 443684 396664 431649 273431 154864 46354 39842
13647 39842 80282 -184728 -263718 -90974 -218059 -133583 -162524 98129 83123 60084 -15510
13636 -15510 -58764 53535 138526 175147 129702 123765 -41278 -197525 -72816 87720 88843
13625 88843 105068 160820 291397 415839 173325 -159338 -108909 67901 96626 25651 -66887
13614 -66887 -45517 -187236 -294797 -329814 -162004 37105 65063 -105161 -37801 -53310 -72275
13603 -72275 -49013 -147069 -291977 -221398 -136626 -93788 -97483 -67942 -155422 -426364 -328039
13592 -328039 -260564 -221332 -164802 -165230 -216789 -12527 123215 218502 305984 436629 453030
13581 453030 269492 280 -86142 -122860 3375 -72044 -69341 -113575 12982 166921 121959
13570 121959 68405 -181185 -304789 -320424 -320135 -294021 -72941 82892 108224 168190 61222
13559 61222 45691 -85740 -128748 46681 153831 225109 182758 99778 -13071 -9304 -144548
13548 -144548 -115961 -34166 236047 360462 144327 13395 154928 157312 71234 -108710
13538 -108710 -100593 82362 172899 241844 261515 129721 44099 -159776 -173674 1299 38278
13527 38278 30545 -77103 -76107 11705 64675 -65741 -38915 8440 66133 255558 231786 190847
13515 190847 119849 1882 21101 -53134 -267795 -363617 -200302 -252454 -308826 -192290 -111925
13504 -111925 -103848 -193460 27722 312993 460298 294685 101221 -4405 50484 227480
13494 227480 291670 604993 544103 367053 474699 382472 411682 458495 596379 608068 627413
13483 627413 480443 354501 499595 530382 308753 131396 103922 75796 79805 62295 -39082
13472 -39082 -23808 162799 120530 128317 76117 89069 145966 92260 39145 68060 272460
13461 272460 205114 -178402 -271898 -110706 -15301 44115 -23225 -54641 -1488 77687 142510
13450 142510 174705 261291 53906 -116326 -185416 -216555 -279940 -224107 -321771 -411558 -361600
13439 -361600 -318739 -255215 -219757 -77340 7458 53706 121827 -21911 -106787 -287262 -251542
13428 -251542 -207649 -204635 -194949 -263199 -42991 19168 -278481 -234654 -282552 -311259 -221419
13417 -221419 -191114 -129807 -148954 -114502 -143264 -69693 -179242 -118415 9425 -148152 -161140
13406 -161140 -200690 -216634 -231375 -252766 -344005 -292346 -93598 10781 -22247 -84039 -45352
13395 -45352 -3580 89759 -8476 173376 258458 6472 -75447 119947 62335 -1045 -81205
13384 -81205 -156976 -278920 -73219 -65588 -249383 -207202 -115535 -53970 -104223 -166036 -159728
13373 -159728 -132740 -161595 -256295 -303910 -424047 -394429 -295947 -128314 -253769 -302173 -96620
13362 -96620 47999 179998 314688 183565 -18349 -92983 -267444 -31672 47878 -71534
13352 -71534 34061 157646 273818 116294 101625 42717 -102844 -113852 5388 127726
13342 127726 -18469 -256176 -372383 -94617 101662 65813 136022 107673 32786 8563
13332 8563 -142746 -223403 -154457 99762 -11067 -208670 -256425 -393081 -498447 -435559 -361244
13321 -361244 -33082 236869 294046 89198 136283 76047 -49969 -275637 -515281 -421000
13311 -421000 -224310 -165912 43844 364940 545985 393122 267597 29402 -23725 -169396
13301 -169396 -223466 -142583 188 199350 289146 547184 583480 401375 258434 157793
13291 157793 1908 -5527 38415 -22241 87098 232701 210498 138930 8701 -40019 -2951
13280 -2951 -19449 -107259 12761 -56553 -300093 -261965 -26023 -39017 -111243 -124362 -365826
13269 -365826 -354144 -339869 -327728 -391147 -333078 -40589 7821 -217698 -50919 3550 88182
13258 88182 150989 34157 45831 4283 -35349 -14621 80424 195310 96734 -120749 -176333
13247 -176333 -85402 -71601 95694 175940 101176 283425 502864 627928 431471 147541
13237 147541 -167305 -184830 -70971 -59927 -192647 -307519 77662 108532 -41868 -122560
13227 -122560 -115670 -60600 -191275 -222644 -65927 146347 193138 65838 -246826 -250758 33120
13216 33120 10024 -183030 -271820 -187030 -245354 -161714 -75377 -202237 -78597 107063 178808
13205 178808 317854 130280 90601 17507 152927 185440 126094 64627 -181269 -153190 -45238
13194 -45238 -7892 183483 358033 68768 -79953 -9040 -135368 -7049 285513 464378
13184 464378 289693 253519 94686 -108355 -224534 -125365 -98018 -4343 67855 -97461
13174 -97461 -121238 -191449 -246478 -176010 -68586 81073 234968 320323 309635 280063 187918
13163 187918 139517 -39553 25933 208601 223550 282664 359366 351171 243072 288818 264476
13152 264476 107576 382304 463952 418208 349065 188550 190638 279203 168597 31053 -129429
13141 -129429 -6769 68171 15892 -115317 75629 37270 -12695 114260 112152 106426 75878
13130 75878 198320 268405 168606 94916 80271 59080 112956 -162100 -95612 -51549 -62351
13119 -62351 -70488 -108381 -115264 200961 165875 90368 101993 123415 210098 168483 -3147 -120561
13107 -120561 -2332 -33257 141481 252108 287588 235918 -108709 -312208 -349182 -345855 -283551
13096 -283551 -224040 75087 198523 120272 147100 396554 227503 46687 -70525 37721
13086 37721 66055 116295 -44863 -227835 -258475 -1884 122608 363246 249116 29106
13076 29106 39373 47831 116664 22767 -34419 -117575 -185489 -135104 102626 60102 163569
13065 163569 332462 416742 354547 223553 275366 349880 139942 119312 -100765 -939 223813
13054 223813 179651 148977 285650 359463 472459 514176 185723 -47480 -95445 -258053
13044 -258053 -18576 111652 119048 -35740 -335403 -292964 -287338 -182191 -83821 65447 65662
13033 65662 -12536 -73212 113306 229058 131855 49330 -11155 -162971 -164401 10422 173470
13022 173470 130190 135925 83067 113417 -8141 34252 132135 98689 191635 -17801 41389
13011 41389 203588 214692 186933 157987 241357 254621 152619 160750 283834 154001 78749
13000 78749 138948 148724 157179 184128 201140 172402 271779 424455 490585 468755 318243 328373
12988 328373 227820 135475 320971 223251 196405 323017 214645 134734 86616 2947 28879
12977 28879 154737 211553 178438 -111904 -167684 -122522 -63427 -142227 -171845 -210705 3941
12966 3941 73280 133819 46216 48396 -44518 70135 87811 324778 289278 109837 19064
12955 19064 -35676 -27994 199777 217948 -77363 -67854 128449 312389 406535 188793 235485
12944 235485 211082 256948 336684 176994 54324 -308632 -164269 135971 167888 251183
12934 251183 264674 235187 269698 187228 42383 38146 114516 115937 169293 322993 539505
12923 539505 642752 501872 468998 479461 502638 455136 408706 333134 345015 135495 66546
12912 66546 244294 409626 489759 425622 230061 117630 107805 114701 170517 108613 108084 54050
12900 54050 -76790 -60598 -59465 -85686 -13015 53749 253508 407825 424937 324071 250544
12889 250544 320272 267735 305873 233096 57578 126553 241811 294194 115783 127480 151004
12878 151004 93283 53177 62989 128435 284171 309181 183366 241208 137590 349865 336072
12867 336072 356099 388674 245569 577988 1292398 1768447 2121690 2331139 2553972 2655507
12857 2655507 2535836 2417215 2210018 2165097 1854843 1375491 1233740 1144711 882191 696190
12847 696190 636122 594495 544925 673650 507806 485127 524702 677170 378754 162953
12837 162953 154932 352324 385325 332765 426448 166573 124087 241258 168626 123666 144229
12826 144229 239986 403998 434462 413053 471501 346346 153126 153591 52456 -82262 -73366
12815 -73366 224760 373083 286369 328580 249684 236416 319787 367468 392730 470902 324195
12804 324195 230717 156786 235896 486120 807949 1107788 1412724 1612689 1580775 1609200
12794 1609200 1631148 1551235 1533713 1333582 1065847 852948 776927 744512 759876 759044 667164
12783 667164 620983 405364 415904 594718 613524 525755 564639 606784 686088 644880 758725
12772 758725 668727 465178 586798 489101 336474 308720 387094 418702 428498 405127 382376
12761 382376 381908 363676 404590 333137 397888 325307 162817 194423 168937 228874 164121 204088
12749 204088 452004 597669 710752 951185 971945 831050 629931 524152 540711 658945
12739 658945 740327 559584 521620 550081 636181 681023 641895 571418 494448 525425 543481
12728 543481 589400 412029 133964 -43767 -111840 -77777 -34258 172892 244793 374702
12718 374702 475067 462258 408297 379593 457597 465470 424327 350245 361731 441729 237535
12707 237535 16055 -41538 147259 219428 222751 247093 149826 47024 177346 161398 186575
12696 186575 133398 55234 44165 124076 273286 184955 217746 239232 234235 211538 51469
12685 51469 -29798 130652 290546 360924 413384 554596 451664 348294 558211 615147
12675 615147 429097 397389 392638 565507 610895 505040 490608 352353 216238 257825 289209
12664 289209 271994 232736 332583 357915 184027 38913 183053 383493 607081 639142
12654 639142 564013 352100 320237 452914 604577 440789 334584 318372 326421 431181
12644 431181 545386 717842 664962 622369 704941 694658 795060 896248 1021628 1036933
12634 1036933 910063 705785 621183 535288 523422 444955 495129 668016 836628 820090
12624 820090 781179 853412 561458 436456 574379 609531 632310 662298 584420 289438 403949
12613 403949 499279 522486 535404 449706 414040 328999 419658 463685 432683 480139 543864
12602 543864 578211 612490 464536 326774 216793 412048 364951 546208 440579 126334
12592 126334 15785 98677 85707 114543 7796 32555 28223 4175 245888 426689 538206
12581 538206 572699 413009 353145 302064 92987 130565 251360 493057 483162 338753 309185
12570 309185 116562 38594 -31117 75607 202399 292617 274332 300727 272728 232358 253216
12559 253216 210002 232405 279636 453652 327339 179438 60608 137204 219296 337682
12549 337682 534257 583136 496689 502533 341997 311009 288479 308536 376410 460937 473685
12538 473685 449634 380454 167189 30899 215388 350133 386077 504578 579256 627515
12528 627515 478334 525643 609591 313640 113924 339345 474788 566627 678894 477550
12518 477550 426869 553271 552812 585158 441643 332445 307324 501023 707292 692308 523826
12507 523826 404545 360353 398464 313115 356199 382994 362198 444491 451314 381244 514016
12496 514016 568695 602958 647791 783259 797751 874050 822946 556747 481365 411616 355340
12485 355340 348611 323410 368053 417203 520394 444500 384690 405209 444626 493217 523407
12474 523407 635204 763641 881665 788554 619708 582572 551728 633969 550242 459981 436501
12463 436501 568660 453972 397255 374985 427448 419098 437171 567501 578440 609876 645186
12452 645186 533433 462075 370944 436198 591624 641711 455225 401432 165249 432795
12442 432795 512033 432895 432005 375982 504847 609986 683392 681191 872207 892687 832970
12431 832970 834045 926445 1023818 1052624 922946 844159 645219 513507 523327 629106 782026
12420 782026 631253 433874 324916 388932 600202 546419 467741 482618 551246 961732
12410 961732 964982 657189 581194 654393 849838 768191 850797 893751 885950 848437 763337
12399 763337 755495 772340 857492 806299 855956 727896 653754 843196 889564 1035785 1054552
12388 1054552 1113629 1026310 797588 704750 651378 910163 829358 745649 751295 898199 751193
12377 751193 542325 536557 676453 750898 933478 1033179 951288 894657 931305 949331 878746
12366 878746 851268 902521 886778 1019751 802060 649962 760393 657257 702040 722347
12356 722347 528693 339932 351001 691641 1023701 1074944 1077753 980565 857515 952880 1065300
12345 1065300 1065387 831616 845789 811625 672827 797209 900293 1118757 1221224 1141271 1147078
12334 1147078 977931 842638 875085 1060594 972866 825008 791877 913075 1022103 1057340
12324 1057340 1048143 1120103 1182741 1056437 959282 996818 888724 883961 1023517 1161143 1359734
12313 1359734 1440287 1233892 1132612 1258679 1350045 1419264 1317789 1067222 1272057 1574638
12303 1574638 1560474 1632895 1614136 1538385 1404796 1369709 1303676 1345755 1203171 1126221 1142082
12292 1142082 1310682 1302284 1306183 1278677 1239915 1248881 1288955 1331707 1276286 1417867 1495706
12281 1495706 1566602 1512707 1426792 1414007 1426409 1401633 1473869 1545231 1488655 1334983 1319474
12270 1319474 1296054 1297524 1382982 1506752 1578814 1738581 1719669 1583192 1367876 1378005 1589951
12259 1589951 1673049 1464575 1465196 1464554 1356018 1427527 1579115 1749465 1713364 1635248 1786199
12248 1786199 1829754 1855801 1877917 1809746 1899812 1918197 1653443 1508184 1709008 2039156
12238 2039156 1962123 1879143 1819471 1901293 1832700 1741860 1902990 1939114 1875239 1776827 1872150
12227 1872150 2010666 1954077 2044389 2111905 2168118 2209437 2250301 2568854 2655589 2323595 2082141
12216 2082141 1799082 1838374 2093612 2480755 2445349 2442903 2523391 2663812 2485050 2313069
12206 2313069 2511272 2674271 2592530 2390989 2406859 2457368 2527834 2697349 2666960 2606629
12196 2606629 2574842 2406539 2366728 2345224 2235273 2248610 2294628 2568559 2727741 2788100
12186 2788100 2981189 3067059 2874489 2755016 2746890 2696116 2639848 2673579 2685008 2886037 2909198
12175 2909198 2978857 2940873 3064032 2929758 2743114 2856219 2929125 2890727 2890579 3144703 2847075
12164 2847075 2719435 2984312 3202732 3126457 3062918 3272083 3365145 3470964 3536808 3452613
12154 3452613 3313799 3338023 3410176 3476644 3408802 3424303 3583272 3725700 3681441 3574787
12144 3574787 3792333 3841929 3778545 3745573 3773994 3824565 3757415 3690077 3744779 3844010 3851898
12133 3851898 3757330 3782734 3951483 3983348 3980013 4082106 4129527 4125774 4190470 4176102 4296994
12122 4296994 4224593 4378198 4366192 4347140 4385874 4413685 4798634 5083120 5119371 4862320
12112 4862320 4816358 4852210 5073220 5151353 5057865 5311857 5312585 5379505 5563552 5391985 5425448
12101 5425448 5497511 5404327 5517649 5648997 5728046 5808666 5746940 5738688 5825621 6042564 6021181
12090 6021181 6128878 6272330 6220436 6186376 6138629 6261047 6286859 6335962 6454640 6533940
12080 6533940 6724016 6767189 6973782 7077159 6992699 7027607 7065501 6956311 7068729 7299624
12070 7299624 7319288 7376795 7441863 7448654 7528843 7507247 7440044 7511387 7736513 8078848 8320933
12059 8320933 8525815 8618300 8704093 8581894 8662841 8808466 8817030 8841684 9076949 9348742
12049 9348742 9399186 9494529 9531318 9719853 9919428 10142728 10356842 10352531 10403862 10518047
12039 10518047 10717599 10943183 10778541 10736946 11007343 11276525 11321682 11373393 11577814 11761058
12029 11761058 12108208 12383110 12689502 12877234 12882608 13029362 13219832 13552805 13853888 14001841
12019 14001841 14252141 14433432 14505955 14633318 14885945 15177347 15297665 15474686 15801378
12010 15801378 16021675 16213296 16363245 16540489 16950494 17234595 17387302 17559663 17999254
12001 17999254 18247916 18482066 18920078 19489884 19548443 19764964 20037091 20207723 20358869
11992 20358869 20708756 21036747 21344930 21626024 21959531 22275461 22788284 23139806 23387255
11983 23387255 23803484 24236772 24327489 24678088 25224836 25684193 26126766 26391492 26805752
11974 26805752 27230433 27561195 27929028 28428186 29088826 29536027 29926059 30303176 30831123
11965 30831123 31442894 31795454 32222634 32641259 33130497 33610443 34224452 34632722 35101163
11956 35101163 35447819 35770522 36288904 36597559 37115974 37665024 38187272 38641113 39204965
11947 39204965 39414382 39818819 40356530 40857179 41328206 41722404 41997793 42354878 42693673
11938 42693673 43079017 43578664 43980093 44253753 44284823 44378247 44601964 45015095 45379138 45803873
11928 45803873 46312856 46444749 46581455 46731139 46625419 46641030 46888881 46778876 46668380
11919 46668380 46798220 46836178 46771184 46744796 46629383 46756963 46737549 46621091 46381953 46129427
11909 46129427 46049584 45943642 45643203 45260485 44916131 44881947 44814966 44588454 44355184 43975848
11899 43975848 43584352 43272362 42646438 42232156 41944321 41655595 41370588 41130265 40760253
11890 40760253 40322585 39805926 39471474 39137449 38673692 38216944 37733709 37309954 36877780
11881 36877780 36441387 35903667 35481890 35105754 34566590 33994599 33466330 32877115 32604453
11872 32604453 32486770 32170142 31652532 31137842 30684752 30299348 30126788 29751049 29155280
11863 29155280 28618532 28103299 27830683 27595221 27520432 27117581 26442267 25754182 25258454
11854 25258454 24945893 24761033 24432128 24144852 23856674 23651812 23284155 22926753 22722942
11845 22722942 22463573 22297587 21998190 21699736 21293960 20789171 20521551 20320145 19970133
11836 19970133 19700751 19469760 19115626 18635604 18257978 18091568 17993538 17901080 17604994 17376717
11826 17376717 17092990 16762293 16739974 16580627 16480675 16225597 15868103 15559110 15378556 15038142
11816 15038142 14701880 14441846 14279677 14271467 14135163 14030311 13811095 13472996 13367114 13323439
11806 13323439 12992695 12782597 12640421 12413609 12220410 12072843 12036330 12059175 11796564 11634315
11796 11634315 11385735 11251575 11101454 10946752 10926401 11024336 10650425 10426588 10302811 10227482
11786 10227482 10021387 9874872 9817309 9615640 9440605 9310385 9032676 8770445 8714152 8948095
11776 8948095 8833224 8540294 8450636 8300013 8205038 8243207 8372547 8394701 8268290 8087146
11766 8087146 7849026 7697203 7816509 7709188 7475737 7512505 7469355 7289807 7096114 6955182
11756 6955182 6920610 6796994 6866884 6811858 6744362 6753515 6670137 6705389 6666855 6576672 6650851
11745 6650851 6637046 6648366 6466063 6081449 5969265 6004260 5852881 5860867 5787012 5757069 5830169
11734 5830169 5800417 5674022 5507607 5499851 5386937 5103466 5058939 4917267 4907175 4911524 4768718
11723 4768718 4873429 5037046 5210592 5164947 4889416 4626887 4664542 4730802 4694735 4636846
11713 4636846 4497529 4408874 4379808 4486770 4523683 4536179 4393479 4122195 4063578 4038182
11703 4038182 4084393 3995337 3973385 3922995 3766707 3768025 3631244 3703050 3882828 3976962 4026460
11692 4026460 4052126 4205211 4096101 3799807 3650254 3446381 3613662 3568895 3340830 3419094
11682 3419094 3671940 3710407 3753928 3751766 3674979 3503476 3403553 3457114 3361297 3221905 3115596
11671 3115596 3067479 2947165 2888158 3139251 3058036 2908410 2728439 2840382 2943918 2888182
11661 2888182 2885876 2831478 2863435 2754108 2697416 2733213 2756180 2889081 3027645 3069055 2867340
11650 2867340 2744675 2514699 2372499 2439815 2653773 2523384 2232596 2283241 2502974 2639917
11640 2639917 2518992 2320153 2351908 2417911 2414970 2426748 2506614 2432768 2327898 2284699 2296824
11629 2296824 2004137 1873856 2073480 2237132 2409249 2360584 2480694 2308613 1992160 2012567
11619 2012567 2251345 2257448 2373423 2531051 2447143 2233629 2310297 2409323 2119568 1929738
11609 1929738 2017695 1900985 1772206 1746703 1962997 2001335 2088974 2095493 2104658 2163970 2135381
11598 2135381 1936932 1940788 1924248 1789186 1689115 1628773 1753209 1766028 1730366 1636228 1748350
11587 1748350 1799097 1720418 1596034 1824833 1777578 1742914 1735131 1584993 1338838 1188261
11577 1188261 1253212 1443261 1476923 1515263 1724408 1747699 1721001 1689117 1682959 1607255 1466983
11566 1466983 1604051 1406688 1374821 1438976 1417494 1361900 1598382 1696059 1513316 1368581
11556 1368581 1435343 1473032 1451661 1446402 1353344 1392094 1400370 1245266 1217795 1160888 1209235
11545 1209235 1144967 1264829 1314297 1188606 1117023 922359 1047227 1136806 1095823 1241645
11535 1241645 1390417 1280694 1203454 1155088 830916 890297 1088722 1044573 918073 813385
11525 813385 630442 797457 1055961 1086731 1144690 1222594 1008836 1043022 1120182 987720
11515 987720 1106541 1018380 1160121 1329349 1260809 1120351 1182137 1185014 1187673 1128716 1039696
11504 1039696 1082596 1164590 1146567 1160708 1045880 996491 914768 769434 826994 862674 802949
11493 802949 698807 947516 1147832 1024602 884761 922517 858456 742989 599335 897796
11483 897796 988034 829265 767753 811636 873860 775200 710864 634123 592940 555930 569894
11472 569894 634107 798887 877780 916266 801759 777088 863953 1031768 1136266 992773
11462 992773 1103789 1197770 1005550 998870 926175 824421 822181 719097 538574 746967 902921
11451 902921 972269 964648 827280 987237 1269018 1125109 721403 498537 533301 778652
11441 778652 961445 789015 600608 585486 771928 701016 636514 881102 1107479 1040450
11431 1040450 1016428 1073305 1042987 775299 622079 762576 912653 847033 770066 913402
11421 913402 1056123 1118406 931208 824925 894633 991576 895798 833672 786914 768138 753129
11410 753129 559476 460655 532473 552575 645900 768479 749267 787571 809427 727795 659462
11399 659462 725671 601450 387417 353618 220333 180135 412030 434136 496217 453112 485421
11388 485421 541626 500192 435483 390195 487175 563750 572050 691764 639227 523989 622109
11377 622109 606676 574735 547494 750954 806710 739454 812979 710287 666137 673049 710999
11366 710999 804662 685755 685384 480947 416457 477296 631085 653732 471284 228367 232115
11355 232115 233096 280538 219321 201853 226744 398246 488973 607046 666287 528926 561773
11344 561773 449357 77688 119814 368188 497136 461797 519132 462307 585361 748173
11334 748173 615804 401074 357241 310161 270047 272780 489264 616741 585269 545619 400325
11323 400325 436930 569773 645638 676146 700701 690283 689958 574985 674478 661167 514695
11312 514695 310698 210014 201743 371147 337195 217092 325367 422060 538823 486062
11302 486062 318064 351931 279923 244806 383441 514753 440792 339198 209721 -75716
11292 -75716 -45127 48248 161254 188211 301072 294671 257027 311870 317421 190751 90107
11281 90107 120004 241072 302391 97339 54057 228520 426135 661727 602536 202580
11271 202580 124619 371073 352258 353906 405733 187384 2309 -98175 -45343 -45440 102439
11260 102439 330694 529385 688088 601990 334411 223432 214867 121379 138772 254699
11250 254699 295893 191075 204753 342293 307085 189780 -117890 -41126 244598 279248
11240 279248 372729 401905 316244 336487 365468 447125 372143 228560 286116 389008 348898
11229 348898 253263 375610 484950 570356 627999 477680 438417 461690 370509 315787 365276
11218 365276 196283 -73826 -20330 255723 221689 209514 295569 303736 327957 16611 44402
11207 44402 195878 372491 567964 575695 308530 190616 361093 419495 330786 188500
11197 188500 132924 335382 398085 291038 574066 583456 610644 548911 330545 317630 471629
11186 471629 477772 296018 376144 355132 260269 151353 291753 416392 540446 403383
11176 403383 370730 545873 630319 558815 661549 601794 768941 636873 562236 615531 392345
11165 392345 182174 114519 115182 87426 -12900 14171 200732 416259 462869 417005 304003
11154 304003 208931 219612 249899 229070 51340 184898 312902 158437 62469 -146719
11144 -146719 -209379 -24741 69545 16929 76076 75268 83407 182393 97476 141476 86092 182701
11132 182701 190112 113222 73695 27377 157063 22224 270535 470113 320389 223529 87123
11121 87123 98603 200655 271426 309214 174536 28701 -208931 -175278 -13022 251969
11111 251969 369883 471758 407595 399716 341452 414797 458401 357449 95957 25922 309389
11100 309389 339572 207963 40167 -36713 -244 117702 235169 276912 332384 355663 413295
11089 413295 387873 198939 88520 166296 166409 325794 304647 391701 303852 209411 156533
11078 156533 7569 -61284 118547 100840 58638 -1684 -85936 147009 271226 282230 316064
11067 316064 322460 197691 150554 16358 83947 291856 566716 454363 379128 471575 512035
11056 512035 464546 257764 344815 362741 550940 656487 558312 619374 567184 226708 60768
11045 60768 71669 41321 -49111 138602 307729 348394 334067 278271 265708 341727 389066
11034 389066 508193 676721 658203 687026 676744 548124 601907 559763 761970 1201900
11024 1201900 1357159 1254607 1423647 1518036 1548102 1603454 1675603 1685654 1960866 1968500 1898117
11013 1898117 1884150 2065076 1979305 1636556 1692186 1644819 1683301 1538078 1424940 1322776
11003 1322776 1559791 1715299 1407134 1090684 1076612 1003362 938729 970359 1075019 1171802
10993 1171802 1129912 1168151 1101437 949691 894215 973803 777736 565470 664770 644085 472134
10982 472134 560395 864489 774511 590265 348634 223764 203053 150033 117134 95011 263080
10971 263080 345185 404541 536089 592089 631099 529717 545679 611202 701349 561463 471980
10960 471980 475337 484613 512196 563051 526188 408205 128729 130020 87957 220395 258918
10949 258918 266865 345729 564111 805876 990667 1048727 845681 762644 732404 825296 783019
10938 783019 685230 609226 602102 609791 535799 511583 520849 468501 299659 385224 147961 218039
10926 218039 564289 469274 214881 -81070 112675 -85913 9679 286994 474487 670065
10916 670065 645095 685056 595468 557990 634040 753029 559846 607706 658667 454328 197588
10905 197588 73990 257329 387365 437140 496277 434056 272385 147017 47763 -131971
10895 -131971 -438195 -461109 -218700 31375 79797 -143906 -30111 4159 16746 -10165
10885 -10165 -48395 -85232 -70071 -48052 23603 153458 153294 263828 207878 91163 -32567
10874 -32567 -34527 -99136 -114382 -223194 -103095 -65369 -39857 -38131 -190982 -153927 97930
10863 97930 148292 135772 134832 150363 8328 75431 202460 312894 270046 57321 242106
10852 242106 396189 144466 -8904 -59954 165442 374919 595473 721648 697882 658802
10842 658802 596104 275692 28455 -11811 154135 321421 362540 533503 401521 286497
10832 286497 268557 238946 272063 309538 446548 513541 454314 313492 189019 82598 75440
10821 75440 121104 66108 135385 187980 100584 39993 -3368 -37044 -94295 26569 99321
10810 99321 -30776 99243 220010 579 57623 214863 127864 195942 377786 456438
10800 456438 649774 572567 509211 522671 496325 569660 675183 693099 761452 968567 806430
10789 806430 738313 603381 755505 739803 629980 615538 752137 760768 704963 720781 606381
10778 606381 660667 902757 957695 874008 704303 729900 654239 543190 611456 541831 517797
10767 517797 534719 598998 529294 540638 602150 456211 369294 270962 255846 213119 253836
10756 253836 285553 256057 196704 3649 -45252 -106877 -33897 43657 -36995 195276 35225
10745 35225 -141814 -181739 -135631 -27145 -131968 -208875 -260302 -327590 -214351 -219250 -398115
10734 -398115 -397942 -426103 -257165 -270160 -404155 -281595 -84482 -159140 -196586 -99959 70018
10723 70018 60330 74776 132508 160726 178073 39822 54061 155898 362211 472826 324112
10712 324112 189121 75077 161891 317349 515160 666605 600570 757445 693145 645650
10702 645650 512780 650792 658446 594610 785598 884623 891034 740682 764543 978154 1089744
10691 1089744 1143649 819394 602986 554042 731027 944021 975124 931854 780833 873289
10681 873289 1001642 931759 1019248 1226658 1048415 930083 979447 944727 814426 730575
10671 730575 918730 834050 786387 767804 833447 1113277 1217210 1212504 1390509 1227517 1130189
10660 1130189 1145987 1186105 1099089 1039770 933178 937926 997089 1066035 1169113 1217804 1370059
10649 1370059 1463362 1251577 1171710 1269299 1572908 1696400 1737097 1697394 1621646 1705252 1812270
10638 1812270 1941771 2121069 2206811 2332816 2528898 2688376 3107095 3439480 3572480 4004270
10628 4004270 4561355 4987884 5415978 5815420 6395581 7096320 7812347 8654375 9689094
10619 9689094 10962246 12504013 14769419 17988741 22203130 27538093 34245499 42254146
10611 42254146 51021043 59351125 66769425 73362897 79571802 85014025 89405790 93113760
10603 93113760 97572731 104306489 113980729 127069188 141529581 154496243 164947831
10596 164947831 173707021 181334540 187028197 189617580 189228319 189307970 193331823 202881140
10588 202881140 216657639 231313714 243115945 250974201 256274497 259675729 259660861 253763302
10580 253763302 242817438 231236334 223022623 219519428 219439591 220715846 220811782 218693797
10572 218693797 215215160 210939049 204556125 194263688 181304130 168614641 158073293
10565 158073293 150331525 144602864 139631457 134537998 129211890 123691299 117742930 111023482
10557 111023482 103007958 93816135 84631917 76304936 68955774 62682105 57315190 52606688
10549 52606688 48721291 45294576 42519181 39946552 37577204 35409378 33392039 31646002
10541 31646002 30095576 28601311 27320475 26110507 24858295 23768974 22832325 22187012
10533 22187012 21465138 20442910 19502021 18492450 17656398 17141727 16617359 16268912 15857251
10524 15857251 15179849 14572817 14311484 13893134 13552982 13448371 13019614 12475974 12183095
10515 12183095 11897894 11700336 11305077 10968728 10798001 10515459 10138239 9878874 9478487
10506 9478487 9227862 9034825 8964967 8630487 8237494 7914531 7644535 7444573 7419635 7380536
10496 7380536 7167607 7062649 6886321 6622362 6475959 6184505 5971580 5966404 6008420 5741961
10486 5741961 5572555 5401673 5271066 5203917 5164499 4966614 4882587 4828623 4631583 4484381
10476 4484381 4392523 4326575 4103703 3926405 3860431 3719868 3685532 3632619 3586880 3558684 3341092
10465 3341092 3063614 2916595 2898438 3131208 3141818 2987247 2992488 2914596 2927905 2945818 3019296
10454 3019296 2975474 3044279 3113849 2992636 2908970 2901391 2828432 2831136 2661183 2666105 2800010
10443 2800010 2832828 2469024 2445088 2502495 2459826 2422048 2599581 2606191 2744290 2893288 2720416
10432 2720416 2324449 2294304 2212491 2042970 2164472 2367817 2333646 2081300 1814522 1692105
10422 1692105 1836002 1932805 1919529 1788043 1596698 1623051 1567281 1604405 1530304 1382944
10412 1382944 1122258 967793 727322 599430 678036 646356 461029 524052 520448 445698
10402 445698 521352 691187 745759 701630 581950 422884 300012 380634 357933 222423
10392 222423 180133 141162 177960 206724 150558 68261 35915 134490 330733 432318 618879
10381 618879 587164 450554 398526 583857 639962 451254 467035 364636 303847 229706 270087
10370 270087 388959 483598 449040 272808 326107 498280 465854 481292 494493 576591 647473
10359 647473 556562 443985 487817 384620 643074 815015 845195 720219 530459 538252
10349 538252 541943 559953 421855 439183 479739 565149 535509 565427 666214 913509 927654
10338 927654 954647 1039578 1219324 1502604 1945526 2528595 3106257 3648958 3944806 4128685
10328 4128685 4527906 4601553 4423799 4074642 3589141 3108566 2734177 2356986 2069434 2049176
10318 2049176 1923778 1664369 1277479 1220113 1269132 1198765 1072527 907547 1020633 1011926
10308 1011926 907636 642189 569566 558853 729106 838269 836278 749929 705191 615112 598559
10297 598559 584432 688693 795699 734248 727466 618210 668530 760881 831340 686851 681814
10286 681814 611826 419081 605948 537004 438648 446239 486266 622323 795577 869775 891676
10275 891676 699534 486251 340392 303127 201072 323264 543317 507761 411532 424705
10265 424705 401222 392023 302689 247260 175965 157833 371541 520783 775804 686334 512960
10254 512960 271772 -18138 38006 -14830 18842 219261 143535 29405 82354 94515 75861
10243 75861 9561 -71452 -42159 32828 -60336 -25315 -29065 -3692 -54558 -43814 97358 52534
10231 52534 257935 471109 401286 290379 213705 267551 515921 651287 453968 415282
10221 415282 448681 475042 408148 167265 223307 246737 210926 208922 147205 183758 217121
10210 217121 370533 340024 94781 -46885 -132817 -291964 -158879 147760 282834 164771
10200 164771 288268 388250 160210 65711 202783 185740 255083 334075 369381 259124 46657
10189 46657 50566 79428 58655 151028 110389 271069 243378 297705 74971 -66368 7426
10178 7426 329628 382418 596208 776191 1109021 1161626 1331480 1449147 1266698 1431633
10168 1431633 1737261 1680033 1453653 1489453 1415671 1428635 1327639 1303332 1482216 1516807
10158 1516807 1251314 1126837 1108138 1168198 1295247 1416490 1377176 1479307 1475335 1437197
10148 1437197 1630560 1770846 1854278 1708734 1535878 1289252 1438594 1617354 1719281 1818549
10138 1818549 1703164 1594336 1542050 1463663 1513836 1416386 1418096 1393284 1151323 857618 563451
10127 563451 610068 691016 541223 611963 807361 805766 734140 687465 738314 799338 717725
10116 717725 686862 580725 243145 57307 -80047 -158582 52274 418240 407751 249310
10106 249310 174314 103549 171057 221877 204758 215887 361962 454371 527444 528245 471770 387851
10094 387851 399299 434262 457986 649981 682659 672498 666282 780895 745955 881308 925851
10083 925851 941495 1230722 1694925 2218398 2753904 3035651 3217265 3162689 3289169 3275707
10073 3275707 3005568 2649292 2286883 1940970 1762499 1744942 1790501 1787540 1478783 1166101
10063 1166101 956667 945743 899674 928926 905407 550876 508541 632942 555074 514255 532748
10052 532748 549790 438437 495364 553246 507084 411498 312290 243851 384617 617334 783750
10041 783750 878194 747858 544888 167188 211004 299362 497996 552608 615883 590255 432537
10030 432537 347312 252268 345730 458892 518537 349460 259214 384403 505487 480927 464376
10019 464376 290532 400578 518161 702523 635357 651268 716368 628640 663831 912481
10009 912481 884729 636348 347224 222298 338158 242005 237504 260051 238848 439497 537376
9998 537376 614830 782177 789400 830414 831022 675356 504989 414896 516558 670595 767803
9987 767803 792065 1100671 1143570 1443590 2101759 2780643 3753444 4611254 5344968 6174569
9977 6174569 6836771 7263220 7604462 7410355 7037699 6592428 6298291 5844600 5304488 4627041
9967 4627041 4044551 3612557 2946004 2350708 2103960 1880564 1590033 1479724 1325730 1270807
9957 1270807 1269579 1338018 1329069 1132517 1024609 916082 737198 798232 911035 853779 804279
9946 804279 790196 799231 669751 774811 917485 816509 701163 729009 770824 851684 726032
$$ [...]
##END NTUPLES=NMR SPECTRUM
##END=
