##TITLE=Analysis number 320783
Compound Code cc 45910
Book Reference 438/168
Project Code adrs
Chemist Name antons
##JCAMPDX= 6.0         $$ Bruker NMR JCAMP-DX V2.0
##DATA TYPE= NMR SPECTRUM
##DATA CLASS= NTUPLES
##ORIGIN= Bruker BioSpin GmbH
##OWNER= nmr
$$ XWIN-NMR		Version 3.5
$$ Mon Jul 10 15:56:44 2006 GMT Daylight Time (UT+1h)  MAYBRIDGE\nmr@NMR_250MHZ
##.OBSERVE FREQUENCY= 250.131544655141
##.OBSERVE NUCLEUS= ^1H
##.ACQUISITION MODE= SIMULTANEOUS (DQD)
##.ACQUISITION SCHEME= undefined
##.AVERAGES= 16
##.DIGITISER RES= 18
##SPECTROMETER/DATA SYSTEM= dpx250
##.PULSE SEQUENCE= zg30
##.SOLVENT NAME= DMSO
##.SHIFT REFERENCE= (INTERNAL, DMSO, 0, 16.522)
##AUDIT TRAIL= $$ (NUMBER, WHEN, WHO, WHERE, WHAT)
$$ ##TITLE= Audit trail, XWIN-NMR		Version 3.5
$$ ##JCAMPDX= 5.01
$$ ##ORIGIN= Bruker BioSpin GmbH
$$ ##OWNER= nmr
$$ C:\u/data/dgb/nmr/ADRS/2580/pdata/1/auditp.txt
$$ ##AUDIT TRAIL=  $$ (NUMBER, WHEN, WHO, WHERE, WHAT)
(   1,<2006-07-10 15:56:23.89 +100>,<MAYBRIDGE\nmr>,<NMR_250MHZ>,
      <created by zg, POWCHK disabled, PULCHK disabled
       configuration hash MD5:
       E2 DF 36 D8 04 B2 41 60 5A D7 A3 38 5A 4B D0 FE
       data hash MD5: 64K
       51 C0 FB C8 F2 54 A4 4D 7D 5D 84 25 FF FC A4 3A>)
(   2,<2006-07-10 15:56:35.15 +100>,<MAYBRIDGE\nmr>,<NMR_250MHZ>,
      <Start of raw data processing
       ef LB = 0.3 FT_mod = 6 PKNL = 1 SI = 32K 
       data hash MD5: 32K
       C8 F9 EF 94 C9 88 EA 75 31 A3 95 9C B8 CD CF 1F>)
(   3,<2006-07-10 15:56:36.82 +100>,<MAYBRIDGE\nmr>,<NMR_250MHZ>,
      <apk 
       data hash MD5: 32K
       09 80 11 DE 46 9A 09 D7 34 32 87 68 CD F5 56 FA>)
(   4,<2006-07-10 15:56:37.64 +100>,<MAYBRIDGE\nmr>,<NMR_250MHZ>,
      <abs ABSG = 5 
       data hash MD5: 32K
       91 09 69 80 46 22 D7 B2 18 99 27 B0 48 74 A5 78>)
$$ ##END=
$$ 
$$ hash MD5
$$ 30 FC 18 8A 26 AC B1 53 63 0A F7 42 9B D8 AA 1E
##$RELAX= 
##$RELAX= 
##$RELAX= 
##$RELAX= 
##$RELAX= 
##$RELAX= 
##$RELAX= 
$$ Bruker specific parameters
$$ --------------------------
##$DU= <C:\u>
##$EXPNO= 2580
##$NAME= <ADRS>
##$PROCNO= 1
##$TYPE= <nmr>
##$USER= <dgb>
##$AMP= (0..31)
100 100 100 100 100 100 100 100 100 100 100 100 100 100 100 100 100 100 
100 100 100 100 100 100 100 100 100 100 100 100 100 100 
##$AQSEQ= 0
##$AQ_mod= 3
##$AUNM= <au_zg>
##$AUTOPOS= <39 >
##$BF1= 250.13
##$BF2= 250.13
##$BF3= 250.13
##$BF4= 250.13
##$BF5= 500.13
##$BF6= 500.13
##$BF7= 500.13
##$BF8= 500.13
##$BYTORDA= 1
##$CFDGTYP= 0
##$CFRGTYP= 5
##$CHEMSTR= <none>
##$CNST= (0..31)
1 1 145 1 1 1 1 1 1 1 1 1 1 1 1 1 1 1 1 1 1 1 1 1 1 1 1 1 1 1 1 1 
##$CPDPRG= <>
##$CPDPRG1= <>
##$CPDPRG2= <>
##$CPDPRG3= <>
##$CPDPRG4= <mlev>
##$CPDPRG5= <mlev>
##$CPDPRG6= <mlev>
##$CPDPRG7= <mlev>
##$CPDPRG8= <mlev>
##$CPDPRGB= <>
##$CPDPRGT= <>
##$D= (0..31)
0 1 0 0 0 0 0 0 0 0.06 0 0 0 0 0 0 0.0002 0 0 0 0 0 0 0 0 0 0 0 0 0 0 
0 
##$DATE= 1152543383
##$DBL= (0..7)
120 120 120 120 120 120 120 120 
##$DBP= (0..7)
150 150 150 150 150 150 150 150 
##$DBP07= 0
##$DBPNAM0= <>
##$DBPNAM1= <>
$$ [...]
##$SUBNAM7= <"">
##$SUBNAM8= <"">
##$SUBNAM9= <"">
##$SW= 20.6930455092707
##$SWIBOX= (0..15)
0 0 3 0 0 0 0 0 0 0 0 0 0 0 0 0 
##$SW_h= 5175.983436853
##$TD= 65536
##$TD0= 1
##$TE= 296.16
##$TE2= 300
##$TE3= 300
##$TEG= 300
##$TL= (0..7)
0 120 120 120 120 120 120 120 
##$TP= (0..7)
150 150 150 150 150 150 150 150 
##$TP07= 0
##$TPNAME0= <>
##$TPNAME1= <>
##$TPNAME2= <>
##$TPNAME3= <>
##$TPNAME4= <>
##$TPNAME5= <>
##$TPNAME6= <>
##$TPNAME7= <>
##$TPOAL= (0..7)
0.5 0.5 0.5 0.5 0.5 0.5 0.5 0.5 
##$TPOFFS= (0..7)
0 0 0 0 0 0 0 0 
##$TUNHIN= 0
##$TUNHOUT= 0
##$TUNXOUT= 0
##$USERA1= <user>
##$USERA2= <user>
##$USERA3= <user>
##$USERA4= <user>
##$USERA5= <user>
##$V9= 5
##$VALIST= <valist>
##$VCLIST= <CCCCCCCCCCCCCCC>
##$VD= 0
##$VDLIST= <DDDDDDDDDDDDDDD>
##$VPLIST= <PPPPPPPPPPPPPPP>
##$VTLIST= <TTTTTTTTTTTTTTT>
##$WBST= 1024
##$WBSW= 4
##$XGAIN= (0..3)
0 0 0 0 
##$XL= 0
##$YL= 0
##$YMAX_a= 311990
##$YMIN_a= -465504
##$ZGOPTNS= <>
##$ZL1= 120
##$ZL2= 120
##$ZL3= 120
##$ZL4= 120
##$ABSF1= 16.522
##$ABSF2= -4.171173
##$ABSG= 5
##$ABSL= 3
##$ALPHA= 0
##$AQORDER= 0
##$ASSFAC= 0
##$ASSFACI= 0
##$ASSFACX= 0
##$ASSWID= 0
##$AUNMP= <proc_1d>
##$AZFE= 0.1
##$AZFW= 0.1
##$BCFW= 0
##$BC_mod= 0
##$BYTORDP= 0
##$COROFFS= 0
##$CY= 12.5
##$DATMOD= 1
##$DC= 0
##$DFILT= <>
##$DTYPP= 0
##$F1P= 14.0000005364418
##$F2P= -0.99999901652339
##$FCOR= 0.5
##$FTSIZE= 32768
##$FT_mod= 6
##$GAMMA= 0
##$GB= 0
##$INTBC= 1
##$INTSCL= 1
##$ISEN= 128
##$LB= 0.3
##$LEV0= 0
##$LPBIN= 0
##$MAXI= 10000
##$MC2= 0
##$MEAN= 0
##$ME_mod= 0
##$MI= 0
##$NCOEF= 0
##$NC_proc= -5
##$NLEV= 6
##$NOISF1= 0
##$NOISF2= 0
##$NSP= 0
##$NTH_PI= 0
##$NZP= 0
##$OFFSET= 16.522
##$PC= 1
##$PHC0= 156.3817
##$PHC1= 10.14766
##$PH_mod= 1
##$PKNL= yes
##$PPARMOD= 0
##$PSCAL= 4
##$PSIGN= 0
##$REVERSE= no
##$SF= 250.13
##$SI= 32768
##$SIGF1= 0
##$SIGF2= 0
##$SINO= 400
##$SIOLD= 32768
##$SREGLST= <1H.DMSO>
##$SSB= 0
##$STSI= 32768
##$STSR= 0
##$SW_p= 5175.98343685301
##$SYMM= 0
##$S_DEV= 0
##$TDeff= 65536
##$TDoff= 0
##$TI= <Analysis number 999999
Compound Code 99
Book Reference 9
Project Code 9>
##$TILT= no
##$TM1= 0
##$TM2= 0
##$TOPLEV= 0
##$USERP1= <user>
##$USERP2= <user>
##$USERP3= <user>
##$USERP4= <user>
##$USERP5= <user>
##$WDW= 1
##$XDIM= 32768
##$YMAX_p= 500468811
##$YMIN_p= -865543
$$ End of Bruker specific parameters
$$ ---------------------------------
##NTUPLES= NMR SPECTRUM
##VAR_NAME=  FREQUENCY,     SPECTRUM/REAL,   SPECTRUM/IMAG
##SYMBOL=    X,             R,               I
##VAR_TYPE=  INDEPENDENT,   DEPENDENT,       DEPENDENT
##VAR_FORM=  AFFN,          ASDF,            ASDF
##VAR_DIM=   32768,         32768,           32768
##UNITS=     HZ,            ARBITRARY UNITS, ARBITRARY UNITS
##FACTOR=    0.157963299565203, 1,           1
##FIRST=     4132.6476996994, 0,             0
##LAST=      -1043.33573715361, 0,           0
##MIN=       -1043.33573715361, -865543,     0
##MAX=       4132.6476996994, 500468811,     0
$$ Real data points
##PAGE= N=1
##DATA TABLE= (X++(R..R)), XYDATA
$$ [...]
$$ plain form
24799 164163 225053 -30822 111591 299618 239510 84802 -285451 -441132 -351069 -123382
24789 -123382 115391 19368 -182926 -222849 -203340 -229621 -207767 -149491 -270205 -182368 -339707
24778 -339707 -208813 -206598 -332176 -58864 135806 225844 107487 48512 79371 207606
24768 207606 68535 -63413 -83300 43905 89963 -150815 -279298 -357375 -456019 -34872
24758 -34872 219778 225249 92530 -154172 -221012 -93081 180832 165626 34852 282659
24748 282659 52780 -179377 124636 29012 -211970 -103226 -142355 -5380 90282 63231
24738 63231 -71245 -239942 -147488 -141608 -30036 -44339 -322877 -528721 -512532 -510536 -163911
24727 -163911 38598 9301 -148820 -40459 -4735 -166566 -240874 -313772 -352474 -259429 -234831
$$ packed form
24799A64163O0890k55875J42413J88027o0108j54708l70253j55681R0063K27687
24789a23382K38773r6023k02294l9923J9509k6281K1854N8276j20714Q7837j57339
24778c39707J30894K215j25578K73312J94670R0038j18357n8975L0859J28235
24768B07606j39071j31948j9887J27205M6058k40778j28483p8077r8644M21147
24758c4872K54650N471j32719k46702o6840J27931K73913j5206j30774K47807
24748B82659k29879k32157L04013r5624k40982J08744l9129J36975R5662k7051
24738F3231j34476j68697R2454N880J11572j4303k78538k05844J6189J996L46625
24727a63911K02509k9297j58121J08361L5724j61831p4308p2898l8702R3045K4598
$$ plain form
24716 -234831 -242116 -248295 -153348 -265253 -272096 -253295 -211857 -123135 -49612 67238 7128 -61524
24704 -61524 209717 235994 276429 277570 415622 550853 402436 247661 20180 -181657
24694 -181657 7903 -118438 -267483 -359410 -344210 -176844 -273379 -525617 -269783 -75992
24684 -75992 -138531 -241958 -347815 -422380 -283325 -370815 -456034 -427850 -253576 -58147 132531
24673 132531 157558 95613 -62071 -23064 102346 -153991 -9973 156305 111183 -33870
24663 -33870 -125016 -121665 -50284 145963 188822 134896 47703 -83189 -141806 -338096 -212641
24652 -212641 -127448 18982 -143 -31390 -29466 8524 142831 341492 340658 234978 164059
24641 164059 1843 16052 5465 -72000 52801 135576 -38887 -138098 -417946 -531719
$$ packed form
24716b34831p285o179R4947j11905o843J8801M1438Q8722P3523J16850o0110o8652
24704f1524K71241K6277M0435J141J38052J35231j48417j54775k27481k01837
24694a81657J89560j26341j49045r1927J5200J67366r6535k52238K55834J93791
24684g5992o2539j03427j05857p4565J39055q7490q5219K8184J74274J95429J90678
24673A32531K5027o1945j57684L9007J25410k56337J44018J66278m5122j45053
24663c3870r1146L351P1381J96247M2859n3926q7193j30892n8617j96290J25455
24652b12641Q5193J46430j9125l1247J924L7990J34307J98661q34j05680p0919
24641A64059j62216J4209j0587p7465J24801Q2775j74463r9211k79848j13773
$$ plain form
24631 -531719 -426082 -331371 -237459 -126567 -260050 -150031 646 154300 -13636 -215635
24621 -215635 -399252 -424137 -294660 -135808 20141 79162 81353 -48693 -47811 64072 283970
24610 283970 170967 37054 144159 235108 199179 205221 27194 -81177 -93013 -179013 -50876
24599 -50876 89205 268210 370042 444183 170133 15136 145499 185283 266209 380121
24589 380121 489388 354446 -7345 -381346 -187720 47511 82588 172702 274856 139424
24579 139424 17295 -83141 -154728 -304584 -138502 141770 271267 13799 66280 -9853
24569 -9853 -145593 -239479 -227150 -50284 35388 201583 31432 -254127 -285831 -237665 -305465
24558 -305465 40895 61907 -67254 59914 340949 354482 234160 27859 -29577 64811
$$ packed form
24631e31719J05637R4711R3912J10892j33483J10019J50677J53654j67936k01999
24621b15635j83617k4885J29477J58852J55949N9021K191j30046Q82J11883K19898
24610B83970j13003j33913J07105R0949l5929O042j78027j08371j1836q6000J28137
24599e0876J40081J79005J01832P4141k74050j54997J30363L9784Q0926J13912
24589C80121J09267j34942l61791l74001J93626K35231L5077R0114J02154j35432
24579A39424j22129j00436p1587j49856J66082K80272J29497k57468N2481p6133
24569i853j35740r3886J2329J76866Q5672J66195j70151k85559l1704M8166o7800
24558c05465L46360K1012j29161J27168K81035J3533j20322k06301n7436R4388
$$ plain form
24548 64811 -108878 -142587 -267498 -314075 -206415 127407 99976 -226102 -409152 -380832
24538 -380832 -454741 -118555 118555 311255 283468 392999 427919 171154 -22852 50884
24528 50884 65631 155410 215550 -50153 68060 114153 -26030 67832 315791 235502 8833
24517 8833 95113 201870 156426 33244 -130210 -161749 -320686 -373405 23245 86525 -17873
24506 -17873 -246183 -214245 -202396 -231934 -414335 -335262 -224383 -51305 73582 274136
24496 274136 137069 -202944 -24702 56680 -8141 -207908 -75476 10074 -6252 41236
24486 41236 74182 120658 298424 204810 -149895 -265803 -27954 20912 -146254 -545629
24476 -545629 -663964 -552495 -468315 -251918 -199252 -465078 -297357 33715 156467 137775
$$ packed form
24548F4811j73689l3709j24911m6577J07660L33822k7431l26078j83050K8320
24538c80832p3909L36186K37110J92700k7787J09531L4920k56765j94006P3736
24528E0884J4747Q9779O0140k65703J18213M6093j40183R3862K47959q0289k26669
24517H833Q6280J06757m5444j23182j63454l1539j58937n2719L96650O3280j04398
24506a7873k28310L1938J1849k9538j82401P9073J10879J73078J24887K00554
24496B74136j37067l40013J78242Q1382o4821j99767J32432Q5550j6326M7488
24486D1236L2946M6476J77766r3614l54705j15908K37849M8866j67166l99375
24476e45629j18335J11469Q4180K16397N2666k65826J67721L31072J22752j8692
$$ plain form
24466 137775 168683 214235 69484 75471 -36556 -99681 -126708 -201609 -46079 40604 -63161
24455 -63161 -16931 -181890 -260228 -66055 90052 118932 42043 -115630 44414 -137648
24445 -137648 -374596 -86481 -86680 -262543 -160944 -69398 -29750 -68450 1574 146160 100110
24434 100110 -89210 56728 65466 179852 145960 110319 -148781 -177965 -354976 -222817
24424 -222817 -3708 144430 155620 147915 54323 76074 24799 -42059 -7873 -167798 -120880
24413 -120880 -70531 -111124 -221536 -140131 -121722 -56307 -36763 -21271 -56970 -217283 -89661
24402 -89661 -72908 -224020 -305696 -256497 -168269 -42962 -26484 -50015 238621 136962 -19743
24391 -19743 -200674 -166747 -57782 49176 99022 78224 233024 299377 -52052 -204567
$$ packed form
24466A37775L0908M5552j44751N987j12027o3125k7027p4901J55530Q6683j03765
24455f3161M6230j64959p8338J94173J56107K8880p6889j57673J60044j82062
24445a37648k36948K88115j99j75863J01599R1546L9648l8700P0024J44586m6050
24434A00110j89320J45938Q738J14386l3892l5641k59100k9184j77011J32159
24424b22817K19109J48138J1190p705r3592K1751n1275o6858L4186j59925M6918
24413a20880N0349m0593j10412Q1405J8409O5415J9544J5492l5699j60313J27622
24402h9661J6753j51112q1676M9199Q8228J25307J6478k3531K88636j01659j56705
24391a9743j80931L3927J08965J06958M9846k0798J54800O6353l51429j52515
$$ plain form
24381 -204567 -223988 -187278 -105815 -52383 -79344 3943 -128337 -365391 -324788 -429490 -192601
24370 -192601 53572 244094 180571 185791 44191 -23754 -17118 -16830 162758 295924 184640
24359 184640 218448 -112446 -254203 -196387 -44239 28891 -47178 46794 76691 -3109 27207
24348 27207 126207 368118 360023 321092 239052 11447 70605 101377 238763 133206 -40654
24337 -40654 -235672 -202442 -131059 -46380 -134865 5160 -13389 22610 33916 229723 257009
24326 257009 262163 342777 -13721 -88002 -81752 -31300 99579 191445 34019 -165225 -25126
24315 -25126 100516 -142911 -224521 -145252 160309 394277 527972 405420 381957 20175
24305 20175 -250872 -234506 30198 16175 -175428 -60877 225030 577354 422165 102047
$$ packed form
24381b04567j9421L6710Q1463N3432k6961Q3287j32280k37054M0603j04702K36889
24370a92601K46173J90522o3523N220j41600o7945O636K88J79588J33166j11284
24359A84640L3808l30894j41757N7816J52148P3130p6069R3972K9897p9800L0316
24348B7207R9000K41911q095l8931q2040k27605N9158L0772J37386j05557j73860
24337d0654j95018L3230P1383Q4679q8485J40025j8549L5999J1306J95807K7286
24326B57009N154Q0614l56498p4281O250N0452J30879R1866j57426j99244J40099
24315b5126J25642k43427q1610P9269L05561K33968J33695j22552k3463l61782
24305B0175k71047J6366K64704j4023j91603J14551K85907L52324j55189l20118
$$ plain form
24295 102047 7823 -14043 -253521 -411852 -273328 -41519 132817 -9849 -150279 -45461
24285 -45461 138078 250713 326027 429959 366598 163200 103169 -127512 35 118485
24275 118485 -116816 -388620 -496135 -387055 -328959 -447867 -437999 -293163 -56749 -150054
24265 -150054 118596 145360 68074 11561 -97652 51662 -10004 -156522 -160602 -193435 -227403
24254 -227403 -296222 -50225 208698 325356 315939 -10508 -143538 -345271 -396671 -416374
24244 -416374 -220488 -179000 -36046 129357 19674 229679 320836 82122 -160549 -231595
24234 -231595 -169669 217984 175587 -44350 171627 114104 121357 133589 9424 -6216 -44415
24223 -44415 35453 227145 332871 410616 158901 131698 203351 -100898 -354705 -250651
$$ packed form
24295A02047r4224k1866k39478j58331J38524K31809J74336j42666j40430J04818
24285d5461J83539J12635P5314J03932o3361k03398o0031k30681J27547J18450
24275A18485k35301k71804j07515J09080N8096j18908R868J44836K36414r3305
24265a50054K68650K6764p7286n6513j09213J49314o1666j46518m080l2833l3968
24254b27403o8819K45997K58923J16658r417l26447j33030k01733n1400j9703
24244d16374J95886M1488J42954J65403j09683K10005R1157k38714k42671p1046
24234b31595O1926L87653m2397k19937K15977n7523P253J2232j24165j5640l8199
24223d4415P9868J91692J05726P7745k51715k7203P1653l04249k53807J04054
$$ plain form
24213 -250651 -173585 -338997 -192064 -75901 -231853 -44609 31979 -43583 -57135 -104307
24203 -104307 -85475 -234461 -252279 -238645 -124744 -90522 -298110 -472970 -513834 -286962
24193 -286962 -31883 -70156 79260 65094 -125410 -145672 -16092 29855 33223 -34716 -149967
24182 -149967 -2975 32092 -35515 -86619 -42100 81908 247112 180257 198719 150910 139605
24171 139605 144152 143994 166704 144576 217688 232642 114088 103875 5981 240059 224581 -73743
24159 -73743 -270046 -290001 25198 159503 201890 132651 -15308 65209 145737 -12222 -268615
24148 -268615 -443955 -375803 -371274 -411829 -254626 -103346 -139505 -103520 18322 -94521 -1868
24137 -1868 95060 227788 223770 127441 16861 -140776 -199237 -225822 -206479 -333389 -222293
$$ packed form
24213b50651P7066j65412J46933J16163j55952J87244P6588p5562j3552m7172
24203a04307J8832j48986j7818J3634J13901L4222k07588j74860m0864K26872
24193b86962K55079l8273J49416j4166j90504k0262J29580M5947L368o7939j15251
24182a49967J46992L5067o7607n1104M4519J24008J65204o6855J8462m7809j1305
24171A39605M547j58K2710k2128P3112J4954j18554j0213r7894K34078j5478k98324
24159g3743j96303j9955L15199J34305M2387o9239j47959Q0517Q0528j57959k56393
24148b68615j75340O8152M529m0555J57203J51280l6159L5985J21842j12843R2653
24137a868R6928J32728m018r6329j10580j57637n8461k6585J9343j26910J11096
$$ plain form
24126 -222293 -90673 -190853 -346836 -53050 -77768 -140960 -105167 -134314 -116228 -104137 -108999
24115 -108999 -138121 106578 240745 3076 -13322 -56194 -200732 -240637 -364255 -354389 -187135
24104 -187135 -117065 -285374 -316893 -188217 -59479 194638 306885 164796 -108992 -222719
24094 -222719 -38338 -57202 -29786 171240 -147976 -258009 -30651 -112649 -117859 -266328
24084 -266328 -204374 67796 70401 167775 116957 135397 322987 296849 165733 267132 254932
24073 254932 -77151 -212266 -139263 -149227 -217675 -144468 -165096 -79117 -100417 -285908 -328291
24062 -328291 -285975 -238017 -49426 37268 29937 343946 337610 152949 -48070 -242178 25577
24051 25577 -58152 -272687 -370549 -447605 -369271 -253947 -135873 -426157 -465604 -55188 -38671
$$ packed form
24126b22293J31620j00180j55983K93786k4718o3192L5793k9147J8086J2091m862
24115a08999k9122K44699J34167k37669j6398m2872j44538l9905j23618R866J67254
24104a87135P0070j68309l1519J28676J28738K54117J12247j42089k73788j13727
24094b22719J84381j8864K7416K01026l19216j10033K27358q1998n210j48469
24084b66328O1954K72170K605R7374n0818J8440J87590k6138j31116J01399j2200
24073B54932l32083j35115P3003r964o8448P3207k0628Q5979k1300j85491m2383
24062c28291M2316M7958J88591Q6694p331L14009o336j84661k01019j94108K67755
24051B5577q3729k14535r7862p7056P8334J15324J18074k90284l9447M10416J6517
$$ plain form
24040 -38671 -344044 -435524 -206570 -127682 -93342 -113503 -322385 -389725 -386419 -418971 -565074
24029 -565074 -493166 -426287 -332478 -87219 -73221 -117219 71860 63090 -19726 48206 155655
24018 155655 168334 293079 301794 58636 -103641 -18558 145171 41759 32865 140587 146865
24007 146865 128812 -174379 -359553 -461679 -260810 -275185 -277488 -388388 -360076 -279277 -353344
23996 -353344 -261530 -155899 50400 44940 99633 -90276 -113370 210920 182720 55559 29559
23985 29559 48621 171874 508902 792209 734137 674542 402401 223694 155284 300756
23975 300756 403515 74214 87798 133012 -79359 -254395 -443168 -122761 27502 -84717
23965 -84717 -56731 127222 17278 112851 373828 448234 198807 -54842 -131575 -65925 -88673
$$ packed form
24040c8671l05373r1480K28954P8888L4340k0161k08882o7340L306l2552j46103
24029e65074P1908O6879R3809K45259J3998m3998J89079q770q2816O7932J07449
24018A55655J2679J24745Q715k43158j62277Q5083J63729j03412q894J07722O278
24007A46865j8053l03191j85174j02126K00869j4375k303j10900K8312Q0799p4067
23996c53344R1814J05631K06299n460N4693j89909k3094L24290k8200j27161k6000
23985B9559J9062J23253L37028K83307n8072n9595k72141j78707o8410J45472
23975C00756J02759l29301J3584M5214k12371j75036j88773L20407J50263j12219
23965h4717K7986J83953j09944R5573K60977P4406k49427k53649p6733O5650k2748
$$ plain form
23954 -88673 -275019 -133919 172836 272951 273924 358981 395867 108719 -97470 -4602 146689
23943 146689 -45450 -288693 -376176 -401177 -374572 -249989 -219997 -29368 202496 137134
23933 137134 84794 164956 -120930 -163219 -205984 -357211 -449233 -360000 -272901 -104201 -34730
23922 -34730 1129 -166740 -143959 -69798 -24875 -43715 -313725 -364919 -131481 20870 -14746
23911 -14746 37145 92317 95984 70499 308744 476672 265779 6146 -135461 -1577 -128528
23900 -128528 -204037 -137730 -200271 -207451 282684 540766 238019 114518 73769 198439 212290
23889 212290 312985 191442 35456 -43008 -110436 -5628 113751 16885 -123239 16660
23879 16660 157646 284072 266417 66379 -233556 -168422 -204411 -227698 -401134 -403188 -486800
$$ packed form
23954h8673j86346J41100L06755J00115R73Q5057L6886k87148k06189R2868J51291
23943A46689j92139k43243q7483k5001K6605J24583K9992J90629K31864o5362
23933A37134n2340Q0162k85886m2289m2765j51227r2022Q9233Q7099J68700O9471
23922c4730L5859j67869K2781P4161M4923j8840k70010n1194K33438J52351l5616
23911a4746N1891N5172L667k5485K38245J67928k10893k59633j41607J33884j26951
23900a28528p5509O6307o2541p180M90135K58082l02747j23501m0749J24670J3851
23889B12290J00695j21543j55986p8464o7428J04808J19379r6866j40124J39899
23879A6660J40986J26426j7655k00038k99935O5134l5989k3287j73436k054q3612
$$ plain form
23868 -486800 -458165 -366293 -229675 -194317 -88742 -176998 -178325 -340592 -241247 45686 58786
23857 58786 149708 466596 306866 -28638 -146585 -196105 -260011 -235768 19466 91275 -47992
23846 -47992 -224335 -272464 -41194 48523 28437 25244 -214360 -224184 -16040 -11932 11284
23835 11284 -349381 -354541 -192106 -55852 121021 201776 291067 321113 35912 -175618 -195431
23824 -195431 -173156 -219117 -296762 -229498 -193627 -119406 -96684 -38598 88141 199188 -7614
23813 -7614 42837 117774 227504 114479 163687 152201 -39100 -359661 -513800 -552639 -471439
23802 -471439 -335050 -253318 -179042 -48429 -34563 -58055 -162346 -169843 91736 451364 257924
23791 257924 163024 314316 189595 203048 170936 -45860 -322240 -490844 -477333 -383641
$$ packed form
23868d86800K8635R1872J36618L5358J05575q8256j327j62267R9345K86933J3100
23857E8786R0922L16888j59730l35504j17947m9520o3906K4243K55234P1809j39267
23846d7992j76343m8129K31270Q9717k0086l193k39604r824K08144M108K3216
23835A1284l60665n160J62435J36254J76873Q0755Q9291L0046k85201k11530j9813
23824a95431K2275m5961p7645O7264L5871P4221K2722N8086J26739J11047k06802
23813g614N0451P4937J09730j13025M9208j1486j91301l20561j54139l8839Q1200
23802d71439J36389Q1732P4276J30613J3866k3492j04291p497K61579L59628j93440
23791B57924r4900J51292j24721J3453l2112k16796k76380j68604J3511R3692
$$ plain form
23781 -383641 -142249 -45665 -122119 -76579 72768 119971 100084 54005 162210 106262 264185
23770 264185 173317 24222 58344 238211 373137 247678 261390 66670 -12661 59035
23760 59035 984 -52899 -57845 -96572 81886 75729 190267 222543 16841 -43107 22642
23749 22642 -143276 -265652 -99628 6248 -46156 -155514 -90084 -56903 -73486 -136283 -201347
23738 -201347 -124585 -6735 124976 -730 -119887 -265976 -334147 -103580 -174033 -127508
23728 -127508 -76729 -116486 -245971 -72717 -66494 -9017 -164181 -185410 6937 224246 95424
23717 95424 -37208 -156196 -300381 18294 73171 -83329 -98442 -31483 -166502 -140965
23707 -140965 -283520 -449932 -329407 -25574 -149705 -248780 -260332 -225215 -113203 -250533
$$ packed form
23781c83641K41392R6584p6454M5540J49347M7203j9887m6079J08205n5948J57923
23770B64185r0868j49095L4122J79867J34926j25459J3712j94720p9331P1696
23760E9035n8051n3883m946l8727J78458o157J14538L2276k05702n9948O5749
23749B2642j65918j22376J66024J05876n2404j09358O5430L3181j6583o2797o5064
23738b01347P6762J17850J31711j25706j19157j46089o8171K30567p0453M6525
23728a27508N0779l9757j29485J73254O223N7477j55164k1229J92347K17309j28822
23717I5424j32632j18988j44185L18675N4877j56500j5113O6959j35019K5537
23707a40965j42555j66412J20525L03833j24131r9075j1552L5117J12012j37330
$$ plain form
23697 -250533 -332785 -331462 -262657 -456174 -350924 -219818 -310500 -458631 -258109 -255452 -516942
23686 -516942 -614293 -358730 -129626 -9699 -7174 -51143 -2066 -58603 -249259 -145549 -7503
23675 -7503 -295820 -447178 -205691 -292283 -176977 -87748 -42272 -101049 -243924 -292646 -180462
23664 -180462 -274140 -175736 33110 259520 283669 230818 213547 124631 -1263 -93828 33571
23653 33571 -28739 -129936 -142191 -280173 -121017 -134041 -112377 -239750 -353673 -251788
23643 -251788 -314117 -122828 -30505 -179033 -161707 -87406 -19646 -230161 -201554 -181189 -363504
23632 -363504 -219676 -188986 -354950 -405447 -343601 -39790 90400 -20450 -78442 -54746
23622 -54746 182089 303144 5341 -76041 -162717 -60288 93212 167421 50223 -85318
$$ packed form
23697b50533q2252J323O8805j93517J05250J31106r0682j48131K00522K657k61490
23686e16942r7351K55563K29104J19927K525m3969M9077n6537j90656J03710J38046
23675g503k88317j51358K41487q6592J15306Q9229M5476n8777j42875m8722J12184
23664a80462r3678R8404K08846K26410K4149n2851j7271q8916j25894r2565J27399
23653C3571o2310j01197j2255j37982J59156j3024K1664j27373j13923J01885
23643b51788o2329J91289R2323j48528J7326P4301O7760k10515K8607K0365j82315
23632c63504J43828L0690j65964n0497O1846L03811J30190j10850n7992K3696
23622e4746K36835J21055k97803q1382q6676J02429J53500P4209j17198j35541
$$ plain form
23612 -85318 -13482 -169979 -515773 -535657 -326433 -141231 -103707 33435 191808 79534
23602 79534 30334 68733 -6614 -121406 -247610 -390400 -342123 -275632 -303255 -301664 -326065
23591 -326065 -227084 -98584 -84912 -60847 41791 -150276 -420563 -352826 -159361 36072
23581 36072 237273 150526 -63008 15862 328352 426393 416966 260599 4441 81672 159133
23570 159133 241679 345229 278797 52999 42514 32843 -4591 -12224 -163076 -184426 -43678
23559 -43678 8198 -114555 -181323 -279803 -230475 -77370 -68008 -315785 -438825 -233934 182524
23548 182524 200671 169827 116562 -15260 -208986 -290876 93913 213658 373550 483119
23538 483119 413030 437306 190197 -221521 -450380 -465011 -471870 -390254 -196954 -91370 -124625
$$ packed form
23612h5318P1836j56497l45794j9884K09224J85202L7524J37142J58373j12274
23602G9534m9200L8399p5347j14792j26204j42790M8277O6491k7623J591k4401
23591c26065R8981J28500J3672K4065J02638j92067k70287O7737J93465J95433
23581C6072K01201q6747k13534P8870L12490R8041r427j56367k56158P7231P7461
23570A59133Q2546J03550o6432k25798j0485r671l7434p633j50852k1350J40748
23559d3678N1876j22753o6768r8480M9328J53105R362k47777j23040K04891M16458
23548A82524J8147l0844n3265j31822j93726q1890L84789J19745J59892J09569
23538D83119p0089K4276k47109m11718k28859j4631o859Q1616J93300J05584l3255
$$ plain form
23527 -124625 -147430 -165024 -223913 -113047 -174333 -185641 -243996 -191321 49900 -27165 36245
23516 36245 -7471 -225821 -212927 -22006 174840 214212 66682 -143577 -429393 -700303
23506 -700303 -708758 -568959 -260162 -203038 -288810 -70682 47262 228742 87810 -204192
23496 -204192 -279381 -291290 -42011 85887 132756 38446 -41388 -305512 -391950 -219872 -122269
23485 -122269 -54239 -43194 78994 202043 266477 417934 356826 -138748 -317621 -307941 -298115
23474 -298115 -259599 -171825 -181389 -312238 -177329 -106060 -59759 65828 198614 115400 215423
23463 215423 88171 -251541 -404830 -35189 117341 71956 8629 -119099 -284340 -144336
23453 -144336 4754 95732 -34329 -196706 -265473 -335838 -235475 35144 -25161 -218313
$$ packed form
23527a24625k2805j7594n8889J10866o1286j1308n8355N2675K41221p7065O3410
23516C6245m3716k18350J2894J90921J96846L9372j47530k10259k85816k70910
23506g00303q455J39799L08797N7124q5772K18128J17944J81480j40932k92002
23496b04192p5189j1909K49279J27898M6869r4310p9834k64124q6438J72078R7603
23485a22269O8030J1045J22188J23049O4434J51457o1108m95574j78873R680R826
23474b98115L8516Q7774r564j30849J34909P1269M6301J25587J32786q3214J00023
23463B15423j27252l39712j53289L69641J52530m5385o3327j27728j65241J40004
23453a44336J49090R0978j30061j62377o8767p0365J00363K70619o0305j93152
$$ plain form
23443 -218313 -9676 157911 60737 -199738 -352176 -257032 -298418 -415984 -112012 -34954
23433 -34954 -162012 -183575 -374214 -380618 -298988 -254594 -371881 -621307 -489230 -165255 -82832
23422 -82832 -16629 85018 -79007 28611 108730 -12076 -225092 -251538 11360 320079
23412 320079 411336 180592 -98391 -44914 -138928 -76199 -95554 -106630 -107756 -57310 -75702
23401 -75702 139955 401023 88507 -208751 -182433 -90702 32542 4629 -174577 167603
23391 167603 183749 94155 -76301 -181020 -51794 -265635 -540686 -669869 -358540 -251213
23381 -251213 -404211 -507142 -168315 -106985 -180708 -216591 -312463 -165770 -19953 -284
23371 -284 19904 -21629 -237152 -85650 -190120 -223504 2595 196483 195656 202094 168172 63831
$$ packed form
23443b18313K08637J67587r7174k60475j52438R5144m1386j17566L03972P7058
23433c4954j27058k1563j90639o404Q1630M4394j17287k49426J32077L23975Q2423
23422h2832O6203J01647j64025J07618Q0119j20806k13016k6446K62898L08719
23412C20079R1257k30744k78983N3477r4014O2729j9355j1076j126N0446j8392
23401g5702K15657K61068l12516k97258K6318R1731J23244k7913j79206L42180
23391A67603J6146q9594j70456j04719J29226k13841k75051j29183L11329J07327
23381b51213j52998j02931L38827O1330p3723l5883r5872J46693J45817J9669
23371b84K0188m1533k15523J51502j04470l3384K26099J93888q27O438l3922j04341
$$ plain form
23359 63831 7299 50965 -16820 -47964 -102748 -59869 2983 181421 267965 226873 356337
23348 356337 367692 181039 58998 219250 251511 107087 172680 9847 10377 -25301 105907
23337 105907 15025 116673 110882 -231051 -275704 24651 272531 517343 481500 245096
23327 245096 149254 92146 256677 406068 233934 -364 48083 12291 -67478 -171544
23317 -171544 -275695 -56812 30828 105965 -31983 -5279 20152 6481 -4973 4500 18820
23306 18820 48123 -6580 -99231 -300990 -387463 -147485 -77156 -234899 -218841 -150145 -176192
23295 -176192 -111558 21017 182474 376182 299503 264266 160057 -85273 -206302 -130769
23285 -130769 -113966 -36027 166757 91854 -287657 -274392 -38563 133766 312389 269142
$$ packed form
23359F3831n6532M3666o7785l1144n4784M2879O2852J78438Q6544m1092J29464
23348C56337J1355j86653j22041J60252L2261j44424O5593j62833N30l5678J31208
23337A05907r0882J01648n791l41933m4653L00355K47880K44812l5843k36404
23327B45096r5842n7108J64531J49391j72134k34298M8447l5792p9769j04066
23317a71544j04151K18883Q7640P5137j37948K6704K5431j3671j1454R473J4320
23306A8820K9303n4703r2651k01759q6473K39978P0329j57743J6058O8696k6047
23295a76192O4634J32575J61457J93708p6679l5237j04209k45330j21029P5533
23285a30769J6803P7939K02784p4903l79511J3265K35829J72329J78623m3247
$$ plain form
23275 269142 214471 -84979 -129181 -168429 -181834 -322584 -416240 -361567 -297080 -114371 -50030
23264 -50030 26562 -6420 15768 -220865 -309924 -406261 -486936 -444196 -117396 -93883 -158228
23253 -158228 58338 244577 123870 -147068 -425721 -423732 -90512 -83606 137248 271036
23243 271036 469076 501042 156017 79200 -44061 -144723 -208986 147842 202543 211301 -22669
23232 -22669 -50852 -209467 -317062 -215682 22520 245837 231905 184613 185945 -49193 19898
23221 19898 235622 405819 217008 522 118870 313391 153286 102695 -65673 -187643
23211 -187643 -170475 -351843 -301537 -171748 104890 214247 170189 -121169 -195528 -171949
23201 -171949 -242923 -489657 -452761 -528473 -311634 100653 286273 397500 516046 319311
$$ packed form
23275B69142n4671k99450m4202l9248j3405j40750r3656N4673O4487J82709O4341
23264e0030P6592l2982K2188k36633q9059r6337q0675M2740L26800K3513o4345
23253a58228K16566J86239j20707k70938k78653J989L33220O906K20854J33788
23243B71036J98040L1966l45025p6817j23261j00662o4263L56828N4701Q758k33970
23232b2669k8183j58615j07595J01380K38202K23317j3932m7292J332k35138O9091
23221A9898K15724J70197j88811k16486J18348J94521j60105n0591j68368j21970
23211a87643J7168j81368N0306J29789K76638J09357m4058k91358p4359K3579
23201a71949p0974k46734L6896p5712K16839M12287J85620J11227J18546j96735
$$ plain form
23191 319311 177543 85235 67017 -44434 -4165 197638 244708 181213 255220 418330 185978
23180 185978 -88567 -145872 -370544 -591336 -424474 -94663 141777 223044 114417 176822
23170 176822 -13484 -142314 -174923 -198224 -287229 -493343 -585129 -475825 -189588 154252
23160 154252 188810 4144 -102967 -239674 -70417 -58738 -235982 -315675 -338189 -42371
23150 -42371 -233968 -310589 -135547 10129 -48144 -8262 -34549 -200094 -406429 -623561
23140 -623561 -484174 -191704 47519 -58112 -120011 105893 128761 94654 -20627 -135661
23130 -135661 -281528 -239629 -198361 -110614 19310 -130375 -140373 -1289 66756 174409 98723
23119 98723 68250 -125643 -141848 -109170 -113641 -239074 -333641 -424837 -431965 -344086 -199644
$$ packed form
23191C19311j41768r2308j8218j11451M0269K01803M7070o3495P4007J63110k32352
23180A85978k74545n7305k24672k20792J66862L29811K36440Q1267j08627O2405
23170A76822j90306j28830l2609k3301q9005k06114r1786J09304K86237L43840
23160A54252L4558j84666j07111j36707J69257J1679j77244p9693k2514K95818
23150d2371j91597p6621J75042J45676n8273L9882k6287j65545k06335k17132
23140f23561J39387K92470K39223j05631o1899K25904K2868l4107j15281j15034
23130a35661j45867M1899M1268Q7747J29924j49685r998J39084O8045J07653p5686
23119I8723l0473j93893j6205L2678m471j25433r4567r1196p128Q7879J44442
$$ plain form
23108 -199644 -57839 95911 -41429 -86556 -362237 -554649 -652636 -620977 -559388 -773606
23098 -773606 -797606 -497711 -56833 -87817 -397421 -308626 -117693 -220879 -322653 -281450
23088 -281450 -339755 -332376 -202408 -74707 92412 -37107 -50114 57885 48838 -22630 -28523
23077 -28523 186089 246906 390139 413988 230922 46067 -1207 160673 192740 6652
23067 6652 -193848 -172793 -3798 215341 164292 -90497 -197745 -252518 -310147 -235216 -48449
23056 -48449 -131530 -245345 -505471 -574765 -311508 -39419 279982 285104 -26955 61405 125772
23045 125772 122557 -16326 -125156 14132 68719 161280 339889 134854 -260234 -247568
23035 -247568 -251299 -165174 -181965 -197837 -214596 -51996 -266550 -346754 -164396 -170975 -21805
$$ packed form
23108a99644J41805J53750j37340m5127k75681j92412r7987L1659O1589k14218
23098g73606k4000K99895M40878l0984l09604Q8795J90933j03186j01774M1203
23088b81450n8305P379J29968J27701J67119j29519j3007J07999r047p1468n893
23077b8523K14612O0817J43233K3849j83066j84855m7274J61880L2067j86088
23067F652k00500K1055J68995K19139n1049k54789j07248n4773n7629P4931J86767
23056d8449q3081j13815k60126o9294K63257K72089L19401N122l12059Q8360O4367
23045A25772l215j38883j08830J39288N4587R2561J78609k05035l95088J2666
23035b47568l731Q6125j6791j5872j6759J62600k14554q0204J82358o579J49170
$$ plain form
23024 -21805 68068 125564 -40054 -46749 -88876 -151642 -316387 -427774 -307446 -380127 -356387
23013 -356387 -338661 -365275 -392901 -427229 -462338 -415691 -214266 20864 38187 79210 265680
23002 265680 88973 -45129 46754 -156690 -118609 250317 371687 316055 43485 253561
22992 253561 253460 178355 278750 193050 187656 132119 33455 -121418 -80833 -131904 -111587 -32996
22980 -32996 121494 20024 70658 132664 -18648 -19800 -41509 -61465 -168706 -110642 -320743
22969 -320743 -473795 -524098 -402637 -193418 -197219 -245023 -120161 -185654 -278084 -282631 -407517
22958 -407517 -254433 -229629 -29229 3382 -20502 -139438 -222364 -249641 -211702 -144821 36454
22947 36454 -97527 -61737 -46106 -127311 -62544 -40883 37449 -147323 -56121 410757 263524
$$ packed form
23024b1805Q9873N7496j65618o695m2127o2766j64745j11387J20328p2681K3740
23013c56387J7726k6614k7626l4328l5109M6647K01425K35130J7323M1023J86470
23002B65680j76707j34102R1883k03444L8081L68926J21370n5632k72570K10076
22992B53561j01p5105J00395q5700n394n5537r8664j54873M0585n1071K0317P8591
22980c2996J54490j01470N0634O2006j51312j152k1709j9956j07241N8064k10101
22969c20743j53052n0303J21461K09219l801m7804J24862o5493r2430m547j24886
22958d07517J53084K4804K00400L2611k3884j18936q2926k7277L7939O6881J81275
22947C6454j33981L5790J5631q1205O4767K1661P8332j84772R1202M66878j47233
$$ plain form
22936 263524 117928 123856 216322 66786 -140340 34371 134773 -1231 -178795 -226808
22926 -226808 -211158 -124845 -69592 29551 -122301 -296048 -216396 -135032 -3493 72180 177843
22915 177843 70871 -117345 116155 82733 -55527 85489 -46638 -99460 -131884 -318357
22905 -318357 -469585 -342014 -136779 -32399 9792 2859 -45882 -317086 -399541 -398462 -141332
22894 -141332 15644 118520 15525 30524 11248 129739 239842 159929 -27411 -164265
22884 -164265 -252534 -163158 -94323 -213139 -300296 -191203 -198528 9630 215146 359162 247998
22873 247998 -85537 -246047 -96141 56743 -86608 -478233 -485070 -506134 -309772 -135134
22863 -135134 114076 342657 455543 121619 -97435 -103837 -17012 -39704 14568 -210868
$$ packed form
22936B63524j45596N928R2466j49536k07126J74711J00402j36004j77564m8013
22926b26808J5650Q6313N5253R9143j51852j73747P9652Q1364J31539P5673J05663
22915A77843j06972j88216K33500l3422j38260J41016j32127n2822l2424j86473
22905c18357j51228J27571K05235J04380M2191o933m8741k71204q2455J079K57130
22894a41332J56976J02876j02995J4999j9276J18491J10103p9913j87340j36854
22884a64265q8269Q9376O8835j18816q7157J09093p325K08158K05516J44016j11164
22873B47998l33535j60510J49906J52884j43351l91625o837k1064J96362J74638
22863a35134K49210K28581J12886l33924k19054o402Q6825k2692N4272k25436
$$ plain form
22853 -210868 -73620 38935 7012 -224251 -529062 -415086 -271646 -63501 19277 123721
22843 123721 305201 245530 92611 -191228 -98678 -155435 -141615 -77512 8580 129124 400857
22832 400857 411347 156883 157 -46063 196779 246298 176994 132770 253849 205319 -69926
22821 -69926 -121270 -163935 -250311 -234490 -125544 80165 199593 37643 -272570 -273121 -350143
22810 -350143 -547750 -655332 -380022 -124258 -382738 -410277 -335956 -292885 -297754 -194821
22800 -194821 -373938 -710916 -564058 -314024 -183397 -26898 -212689 -291707 35807 181564
22790 181564 122059 277131 364395 252795 118878 199504 104819 -86672 -138781 -46501 -179009
22779 -179009 -301955 -238214 -108230 42526 -14737 138889 133089 197063 263762 196285 7084
$$ packed form
22853b10868J37248J12555l1923k31263l04811J13976J43440K08145Q2778J04444
22843A23721J81480n9671j52919k83839R2550n6757J3820O4103Q6092J20544K71733
22832D00857J0490k54464j56726m6220K42842M9519o9304m4224J21079m8530k75245
22821f9926n1344m2665q6376J5821J08946K05709J19428j61950l10213n51p7022
22810c50143j97607j07582K75310K55764k58480k7539P4321M3071m869J02933
22800a94821j79117l36978J46858K50034J30627J56499j85791p9018L27514J45757
22790A81564n9505J55072Q7264j11600j33917Q0626r4685j91491n2109R2280j32508
22779a79009j22946O3741J29984J50756n7263J53626n800O3974O6699o7477j89201
$$ plain form
22768 7084 -237425 -340928 -403157 -305534 -189890 -408446 -788807 -794566 -353318 -231356 -138468
22757 -138468 14396 42121 126296 26547 -135116 -216962 62389 134400 -156620 -178140 46144
22746 46144 77312 29758 -160621 -183751 -291079 -115460 83978 408551 196802 98898
22736 98898 -71462 55528 101185 -103738 -294275 -313043 -354686 -229838 -378314 -503861
22726 -503861 -601891 -438866 -177169 -54883 129573 -65160 -161495 -120039 -196021 -340949
22716 -340949 -299068 85204 73952 -85605 195999 279187 215299 14616 119527 241509
22706 241509 192795 45495 109134 49235 -224777 -300571 -357057 -332238 -104579 19278 -82364
22695 -82364 -407536 -375373 -4721 243229 45318 -110130 74461 109566 250287 383101
$$ packed form
22768G084k44509j03503o2229R7623J15644k18556l80361n759M41248J21962R2888
22757a38468J52864K7725Q4175r9749j61663q1846K79351P2011k91020k1520K24284
22746D6144L1168m7554j90379k3130j07328J75619J99438L24573k11749r7904
22736I8898j70360J26990M5657k04923j90537j8768m1643J24848j48476j25547
22726e03861r8030J63025K61697J22286J84456j94733r6335M1456p5982j44928
22716c40949M1881L84272j1252j59557K81604Q3188o3888k00683J04911J21982
22706B41509m8714j47300O3639n9899k74012p5794n6486K4819K27659J23857j01642
22695h2364l25172L2163L70652K47950j97911j55448J84591L5105J40721J32814
$$ plain form
22685 383101 360893 127484 -72241 112711 269681 570417 521392 651647 508535 279485
22675 279485 252703 13600 -329549 -200898 -197762 -121195 24927 59352 91278 97111 80871
22664 80871 -158305 -51920 -47795 -97687 -86775 -171188 -68088 -98155 -164862 -238228 -487199
22653 -487199 -182301 93981 265922 89475 120314 27695 -102679 -336155 -457299 -251831
22643 -251831 -96106 74684 141527 208898 132582 -102444 -315465 -374678 -526703 -571192
22633 -571192 -452275 -323844 -312219 -496360 -433176 -409160 -374739 -441912 -207983 97228
22623 97228 107868 204947 154939 -61880 -211940 -14735 -105372 -284215 -195437 -99425 -53774
22612 -53774 -10083 58347 -6005 125729 -88255 -309301 -563825 -583409 -397576 -221251
$$ packed form
22685C83101k2208k33409j99725J84952J56970L00736m9025J30255j43112k29050
22675B79485k6782k39103l43149J28651L136P6567J46122L4425L1926N833j6240
22664H0871k39176J06385M125m9892J0912q4413J03100l0067o6707p3366k48971
22653d87199L04898K76282J71941j76447L0839r2619j30374k33476j21144K05468
22643b51831J55725J70790O6843O7371p6316k35026k13021n9213j52025m4489
22633e71192J18917J28431J1625j84141O3184K4016L4421o7173K33929L05211
22623I7228J0640R7079n0008k16819j50060J97205r0637j78843Q8778R6012M5651
22612e3774M3691O8430o4352J31734k13984k21046k54524j9584J85833J76325
$$ plain form
22602 -221251 -160925 -72293 -200636 -248826 -144396 -111257 -124219 -15284 -78823 -156002 -222218
22591 -222218 -284401 -397215 -424546 -232940 24819 171865 271930 179582 276058 234521
22581 234521 225253 117857 -82393 -198321 -236003 -21230 -23841 -178685 -158197 50903 303523
22570 303523 399231 69777 -32099 -6219 -71075 -159599 -101524 -103487 -18847 -63041 -167683
22559 -167683 -439840 -439439 -158800 -169434 -345372 -190578 -239963 -361740 -518211 -395937
22549 -395937 -231853 -194699 -36003 90351 120952 60013 -42566 -63073 -53233 204384 197031
22538 197031 129799 169055 155290 114251 47902 9268 -72977 170300 99770 -79766 879
22527 879 167107 74496 -44229 174984 312142 124672 181552 251153 253848 164642 211305
$$ packed form
22602b21251O0326Q8632j28343m8190J04430L3139j2962J08935o3539p7179o6216
22591b22218o2183j12814k7331J91606K57759J47046J00065r2348R6476m1537
22581B34521r268j07396k00250j15928l7682K14773k611j54844K0488K09100K52620
22570C03523R5708l29454j01876K5880o4856q8524N8075j963Q4640m4194j04642
22559a67683k72157M01K80639j0634j75938J54794m9385j21777j56471J22274
22549c95937J64084L7154J58696J26354L0601o0939j02579k0507R840K57617p353
22538A97031o7232L9256j3765m1039o6349l8634q2245K43277p0530j79536Q0645
22527H79J66228r2611j18725K19213J37158j87470N6880O9601K695q9206M6663
$$ plain form
22516 211305 47348 -94203 48675 53873 140065 61176 -95205 -25313 27639 46560 -272151
22505 -272151 -322885 -207265 23208 -140836 -295509 -432698 -395797 -370322 -251595 -92282
22495 -92282 -179877 -103694 160544 417643 592239 444488 220678 -269 43177 229592
22485 229592 132262 146385 -20966 -21086 35511 -75519 -210319 -331850 -253647 -39431 -39198
22474 -39198 -227770 -72098 -160709 -284478 -339937 -192505 -135873 -201053 -75229 -17592 32299
22463 32299 2578 48290 71497 -20556 -28290 9191 52591 -15824 20530 -222306 -115209
22452 -115209 34375 -34579 -40077 40894 -233566 -401608 -101008 179092 108267 -27710
22442 -27710 -31523 -17774 -44435 -430168 -477940 -220749 24741 99905 48596 101713 264863
$$ packed form
22516B11305j63957j41551J42878N198Q6192p8889j56381O9892N2952J8921l18711
22505b72151n0734J15620K30473j64044j54673j37189L6901K5475J18727J59313
22495i2282q7595P6183K64238K57099J74596j47751k23810k20947M3446J86415
22485B29592r7330J4123j67351j20N6597j11030j34800j21531P8203K14216K33
22474c9198j88572J55672q8611j23769n5459J47432N6632o5180J25824N7637M9891
22463C2299k9721M5712K3207r2053p734L7481M3400o8415L6354k42836J07097
22452a15209J49584o8954n498Q0971k74460j68042L00600K80100p0825j35977
22442b7710l813J3749k6661l85733m7772K57191K45490P5164n1309N3117J63150
$$ plain form
22431 264863 298119 110190 85688 302222 354608 235874 46208 -12818 -112897 -217046
22421 -217046 12735 153321 292703 119200 -23691 -123154 -174892 -189071 80912 258392
22411 258392 242835 161545 -24816 -80751 29126 196004 152436 215615 175900 1101 -120134
22400 -120134 -17146 102462 -7421 -122187 -113781 -107915 -257139 -103205 -209883 -282678
22390 -282678 -230339 -134421 -130330 -254057 -170200 -92548 -171319 -326869 -164651 -229611 -222120
22379 -222120 -83286 45717 30464 93162 140924 220320 133751 31165 -63639 -387280 -605920
22368 -605920 -593526 -484050 -315212 -278509 -314876 -224221 -81834 -98061 -285894 -336340 -411831
22357 -411831 -242209 -58998 -283744 -344708 -449629 -152916 205668 324037 174746 7397
$$ packed form
22431B64863L3256j87929k4502K16534N2386j18734j89666n9026j00079j04149
22421b17046K29781J40586J39382j73503j42891r9463n1738j4179K69983J77480
22411B58392j5557q1290j86361n5935J09877J66878m3568O3179l9715j74799j21235
22400a20134J02988J19608j09883j14766Q406N866j49224J53934j06678p2795
22390b82678N2339R5918M091j23727Q3857P7652p8771j55550J62218o4960P491
22379b22120J38834J29003j5253O2698M7762P9396q6569j02586r4804l23641k18640
22368f05920J2394J09476J68838L6703l6367R0655J42387j6227j87833n0446p5491
22357d11831J69622J83211k24746o0964j04921K96713L58584J18369j49291j67349
$$ plain form
22347 7397 -100954 13845 -697 -167186 -155067 -84703 110577 288646 472740 49907
22337 49907 5636 175118 185124 -63222 68415 86250 -112647 -221307 -130535 -41409 -143855
22326 -143855 -58382 177120 171581 143601 74524 -38265 -117520 -309583 -421658 -388108 -483709
22315 -483709 -364638 -286398 -208407 -194122 -215609 -140551 -54302 -324164 -533267 -160391 74898
22304 74898 37973 -73636 49249 232926 347251 197016 52374 79050 -157757 -48313
22294 -48313 -52140 41735 26432 -222248 -196597 -379904 -504439 -324055 -216920 -249598 -154142
22283 -154142 -193612 -46921 240234 243683 172722 38835 -70340 -130726 32962 19252 -101603
22272 -101603 51642 232258 183979 -30027 -251855 -197754 -49867 -69321 93257 429082
$$ packed form
22347G397j08351J14799j4542j66489J2119P0364J95280J78069J84094m22833
22337D9907m4271J69482J0006k48346J31637J7835j98897j08660R0772Q9126j02446
22326a43855Q5473K35502n539k7980o9077j12789p9255j92063j12075L3550r5601
22315d83709J19071P8240P7991J4285k1487P5058Q6249k69862k09103L72876K35289
22304G4898l6925j11609J22885J83677J14325j50235j44642K6676k36807J09444
22294d8313l827R3875j5303k48680K5651j83307j24535J80384J07135l2678R5456
22283a54142l9470J46691K87155L449p0961j33887j09175o0386J63688j3710j20855
22272a01603J53245J80616m8279k14006k21828N4101J47887j9454J62578L35825
$$ plain form
22262 429082 201257 213021 4025 -55208 65524 -38084 -422533 -745843 -594589 -373442
22252 -373442 -165747 -331977 -466777 -351374 -226394 31394 11197 -216375 -160107 -88616
22242 -88616 -29731 -205922 -413256 -375285 -584808 -444917 -352261 -499116 -403403 -56551
22232 -56551 55278 -25615 -298364 -456200 -409830 -256413 -198971 50285 -11386 118 87946
22221 87946 217464 43518 -158884 -133311 171416 265715 376086 401401 243632 -298
22211 -298 115219 148416 111600 199670 112725 214645 130328 90651 234157 304819 35535
22200 35535 -268458 -38450 -120110 -355895 -144217 -261217 -438458 -333627 21391 80050
22190 80050 335726 357752 466098 134869 -72320 -72753 -305916 -480972 -445179 -283191 -186673
$$ packed form
22262D29082k27825J1764k08996n9233J20732j03608l84449l23310J51254K21147
22252c73442K07695j66230j34800J15403J24980K57788k0197k27572N6268P1491
22242h8616N8885j76191k07334L7971k09523J39891R2656j46855R5713L46852
22232e6551J11829q0893k72749j57836M6370J53417N7442K49256o1671J1504Q7828
22221H7946J29518j73946k02402K5573L04727R4299J10371K5315j57769k43930
22211b98J15517L3197l6816Q8070q6945J01920q4317l9677J43506P0662k69284
22200C5535l03993K30008q1660k35785K11678j17000j77241J04831L55018N8659
22190H0050K55676K2026J08346l31229k07189m33k33163j75056L5793J61988R6518
$$ plain form
22179 -186673 -94372 -74987 -36645 192394 259418 210464 52125 -155872 -263669 -455678
22169 -455678 -283031 -124989 -110612 -189112 -262019 -317402 -306290 -200817 114327 236089
22159 236089 388834 417194 194870 96536 171765 174922 -146660 -43403 157370 210966 101258
22148 101258 -22770 -80354 -16872 -233484 -360509 -507334 -281228 -155062 147162 240925
22138 240925 125842 -19365 29546 37637 -21680 5861 -120048 -223753 -255171 -320220 -178378
22127 -178378 -353131 -389848 -352094 -148527 -218930 -524596 -784525 -453206 -120179 -165881
22117 -165881 -72829 38654 -22283 49157 113126 -77006 230865 287017 258908 -186629 -193894
22106 -193894 67201 297142 101912 -143099 -261413 -105648 176663 296372 362854 389457
$$ packed form
22179a86673R2301J9385L8342K29039O7024m8954j58339k07997j07797j92009
22169d55678J72647J58042J4377p8500p2907n5383J1112J05473L15144J21762
22159B36089J52745K8360k22324r8334P5229L157l21582J03257K00773N3596j09708
22148A01258j24028n7584O3482k16612j27025j46825K26106J26166L02224R3763
22138B40925j15083j45207M8911Q091n9317K7541j25909j03705l1418o5049J41842
22127a78378j74753l6717L7754K03567p0403l05666k59929L31319L33027m5702
22117a65881R3052J11483o0937P1440O3969j90132L07871N6152k8109m45537p265
22106a93894K61095K29941j95230k45011j18314J55765K82311J19709O6482K6603
$$ plain form
22096 389457 155286 43494 -54678 -48311 -19535 -76249 -9052 -31834 -48985 -85021 -110358
22085 -110358 -167883 29305 -83142 -253871 -338272 -249999 -263946 -286196 -192982 32775 -20562
22074 -20562 -266231 -449976 -73824 -38187 39432 73971 99513 -59391 195444 479765
22064 479765 221281 -1686 -39412 39171 -233993 -297177 -313455 -58892 -59829 -295288 -506974
22053 -506974 -710290 -609872 -225036 88127 153373 250538 330607 329837 252716 -107142 -334048
22042 -334048 -360602 -267408 -179857 -251704 -122809 416 92183 -4794 -62068 -61769 -172580
22031 -172580 -167109 -378803 -460871 -407224 -416184 -448888 -344096 -333843 -175876 62513 75749
22020 75749 -16958 -54418 -340014 -551070 -410621 -105215 96822 166813 -16891 -173546
$$ packed form
22096C89457k34171j11792r8172O367K8776n6714O7197k2782j7151l6036k5337
22085a10358n7525J97188j12447j70729q4401Q8273j3947k2250R3214K25757n3337
22074b0562k45669j83745L76152L5637P7619L4539K5542j58904K54835K84321
22064D79765k58484k22967l7726P8583k73164o3184j6278K54563r37k35459k11686
22053e06974k03316J00418L84836L13163O5246R7165Q0069p70p7121l59858k26906
22042c34048k6554R3194Q7551p1847J28895J23225R1767r6977n7274K99j10811
22031a72580N471k11694q2068N3647q960l2704J04792J0253J57967K38389J3236
22020G5749r2707l7460k85596k11056J40449L05406K02037O9991j83704j56655
$$ plain form
22010 -173546 -104992 -303575 -245897 -61783 -39013 -220348 -179390 -290023 -26609 150713
22000 150713 172370 -16713 -223807 -206013 39148 283697 171508 -88069 -290856 -247398
21990 -247398 -204060 -258093 -167624 -71340 -82760 67953 391664 423290 452372 226233 46501
21979 46501 195174 321306 264067 217514 214977 116767 108966 168731 180463 193646 180703 30174
21967 30174 -3359 -67345 -247675 -122393 32858 85315 -62300 28739 171955 60259
21957 60259 92520 235210 66298 -79145 -259558 -328574 -462082 -232549 -24230 39591
21947 39591 -50245 -357889 -465908 -451281 -561400 -643203 -541270 -256025 -67163 -103121
21937 -103121 -239016 -270859 -271310 -98748 -23961 5814 79717 126195 122398 21002 -9784
$$ packed form
22010a73546O8554j98583N7678J84114K2770j81335M0958j10633K63414J77322
22000A50713K1657j89083k07094J7794K45161K44549j12189k59577k02787M3458
21990b47398M3338n4033R0469R6284j1420J50713L23711L1626K9082k26139j79732
21979D6501J48673J26132n7239m6553k537r8210p801N9765J1732J3183j2943j50529
21967C0174l3533o3986j80330J25282J55251N2457j47615R1039J43216j11696
21957F0259L2261J42690j68912j45443j80413o9016j33508K29533K08319O3821
21947C9591q9836l07644j08019J4627j10119q1803J01933K85245J88862l5958
21937a03121j35895l1843m51J72562P4787K9775P3903M6478l797j01396l0786
$$ plain form
21926 -9784 219582 355577 223349 40989 -93908 131416 142950 48653 -53635 -56891 -110961
21915 -110961 -76059 63617 73362 -99248 -49370 -97414 -116538 -153601 -141384 -325390 -318071
21904 -318071 -100521 -96080 9966 183660 234558 -129121 -363256 -319332 -77099 -106108
21894 -106108 -321601 -250090 -447591 -445935 -532859 -516777 -291484 -198847 -175539 -157743 -231260
21883 -231260 -234667 -123711 140425 22137 -155557 -128872 -322735 -415066 -208471 3285
21873 3285 82115 87789 204270 107922 122141 222066 298309 370261 382096 195769 -43500
21862 -43500 -115033 -111719 -78386 -30162 -241263 -259124 -195255 -140913 -126814 -116700 -314561
21851 -314561 -362032 -204033 -148192 -271886 -686247 -611128 -224369 200341 152081 14656
$$ packed form
21926i784K29366J35995j32228j82360j34897K25324J1534r4297j02288l256n4070
21915a10961L4902J39676R745j72610M9878m8044j9124l7063J2217j84006P319
21904c18071K17550M441J06046J73694N0898l63679k34135M3924K42233k9009
21894a06108k15493P1511j97501J656q6924J6082K25293R2637K3308J7796p3517
21883b31260l407J10956K64136j18288j77694K6685j93863r2331K06595K11756
21873C285P8830N674J16481r6348J4219R9925P6243P1952J1835j86327k39269
21862d3500p1533L314L3333M8224k11101j7861O3869N4342J4099J0114j97861
21851c14561m7471J57999N5841j23694m14361P5119L86759M24710m8260j37425
$$ plain form
21841 14656 -147576 -122039 -343299 -392197 -278222 -80916 322870 281648 45835 116452
21831 116452 127470 92172 219391 193280 202804 252283 150568 158832 267060 143714 -76355
21820 -76355 43239 65690 114738 300037 367518 132202 87776 255409 227369 254547 457095
21809 457095 442005 255734 -50100 -327614 -348792 -231488 81434 48315 -27944 -194856
21799 -194856 -74116 15134 18453 -60566 -188931 -33801 4927 37535 -271646 -278225 -454562
21788 -454562 -540647 -241801 -36448 59493 -28848 -75960 -239034 -333600 -358607 -460956 -356280
21777 -356280 -74956 97956 -39581 -169276 -245786 -243675 -196100 -327180 -453677 -380884
21767 -380884 -77548 54670 45250 -153054 -51258 83369 78332 57751 397105 242068
$$ packed form
21841A4656j62232K5537k21260m8898J13975J97306M03786m1222k35813P0617
21831A16452J1018l5298J27219k6111R524M9479j01715Q264J08228j23346k20069
21820g6355J19594K2451M9048J85299O7481k35316m4426J67633k8040K7178K02548
21809D57095j5090j86271l05834k77514k1178J17304L12922l3119p6259j66912
21799a94856J20740Q9250L319p9019j28365J55130L8728L2608l09181o579j76337
21788d54562q6085K98846K05353R5941q8341m7112j63074r4566k5007j02349J04676
21777c56280K81324J72912j37537j29695p6510K111M7575j31080j26497P2793
21767c80884L03336J32218r420j98304J01796J34627n037k0581L39354j55037
$$ plain form
21757 242068 -196229 -259041 -417433 -564968 -516466 -331969 -327596 -168811 -46790 -57360
21747 -57360 -111896 -102716 -336877 -205245 -40461 -103384 -168167 449 33749 93066 -201581
21736 -201581 -349751 -174675 195007 134941 -76687 -75252 -65941 -93796 -82957 -421107 -385385
21725 -385385 -144801 -85102 47649 17402 75628 101751 -78860 -101126 -242007 -218655 217459
21714 217459 321466 5020 -249536 -175476 -192655 -349512 -384294 -4605 290142 113973
21704 113973 -118918 147111 -32700 -281880 -357666 -350217 -375246 -442488 -388278 -209040 57300
21693 57300 319506 177686 -58234 -134936 -212654 -181949 -102198 -132343 -336284 -334246 -401853
21682 -401853 -297777 -163498 -39836 52486 -25043 61553 115173 -152562 -119120 -279963
$$ packed form
21757B42068m38297o2812j58392j47535M8502J84497M373J58785J22021j0570
21747e7360n4536R180k34161J31632J64784o2923o4783J68616L3300N9317k94647
21736b01581j48170J75076L69682o0066k11628J435R311k7855J0839l38150L5722
21725c85385K40584N9699J32751l0247N8226K6123j80611k2266j40881K3352M36114
21714B17459J04007l16446k54556P4060j7179j56857l4782L79689K94747j76169
21704A13973k32891K66029j79811k49180p5786P449k5029o7242N4210J79238K66340
21693E7300K62206j41820k35920p6702p7718L0705P9751l0145k03941K038o7607
21682d01853J04076J34279J23662R2322p7529Q6596N3620k67735L3442j60843
$$ plain form
21672 -279963 -547495 -503970 -559077 -319610 31265 -43890 -139293 -378471 -444735 -354380 -127792
21661 -127792 -96172 61462 87517 -359574 -587879 -532227 -383760 -432027 -668335 -644972
21651 -644972 -575288 -242359 74216 365266 313362 60956 -39526 -221309 -239275 -303988
21641 -303988 -356885 -341840 -344090 -278467 -138965 156042 429588 386708 149907 44902 -53194
21630 -53194 -275427 -380559 -218754 43052 295575 419984 483728 418783 255350 114867
21620 114867 45501 208757 162237 248559 228692 72124 -21288 124462 177393 -83529 -178687
21609 -178687 -204231 105473 335158 225170 398284 371273 350016 214532 160593 208804
21599 208804 222490 137312 27188 -240087 -600283 -615370 -349859 106319 280749 200064
$$ packed form
21672b79963k67532M3525n5107K39467L50875p5155r5403k39178o6264R0355K26588
21661a27792L1620J57634K6055m47091k28305N5652J48467m8267k36308K3363
21651f44972O9684L32929L16575K91050n1904k52406j00482j81783j7966o4713
21641c03988n2897J5045k250O5623J39502K95007K73546m2880k36801j05005r8096
21630e3194k22233j05132J61805K61806K52523J24409O3744o4945j63433j40483
21620A14867o9366J63256m6520Q6322j9867j56568r3412J45750N2931k60922r5158
21609a78687k5544L09704K29685j09988J73114k7011k1257j35484n3939M8211
21599B08804J3686q5178j10124k67275l60196j5087K65511M56178J74430q0685
$$ plain form
21589 200064 176531 200269 219682 220005 288787 53442 -16580 288288 511626 469537 218728
21578 218728 173514 67420 79106 184325 154223 6947 -276772 -479272 -493799 -356125
21568 -356125 -317167 -111418 49776 167205 41021 -135369 -43972 90508 294903 284960
21558 284960 53010 -114137 -139839 -152264 -1715 -92401 -390326 -296115 -360207 -348126 -323598
21547 -323598 -251983 -17078 52393 -200060 -544565 -454344 -94262 280286 251015 62946
21537 62946 -6320 -40633 -36164 -197001 -111915 -10744 -92882 -260782 -295253 -425086 -295626
21526 -295626 -245794 -116820 -71942 -351482 -339024 -171283 -12605 2182 -129367 -233887
21516 -233887 -342626 -185144 106077 293379 87925 -96863 -94401 -129070 -319313 -416318
$$ packed form
21589B00064k3533K3738J9413L23O8782k35345p0022L04868K23338m2089k50809
21578B18728m5214j06094J1686J05219l0102j47276k83719k02500j4527J37674
21568c56125L8958K05749J61194J17429j26184j76390R1397J34480K04395r943
21558B84960k31950j67147k5702j2425J50549r0686k97925R4211o4092J2081K4528
21547c23598P1615K34905O9471k52453l44505R0221L60082L74548k9271j88069
21537F2946o9266l4313M469j60837Q5086J01171q2138j67900l4471j29833J29460
21526b95626M9832J28974M4878k79540J2458J67741J58678J4787j31549j04520
21516b33887j08739J57482K91221J87302k05454j84788K462l4669j90243r7005
$$ plain form
21506 -416318 -298641 -142182 -20477 -54867 -95081 -188862 -212458 -280284 -165504 29605
21496 29605 236765 378573 459736 54092 -205917 -178764 -274272 -52195 91377 185373
21486 185373 128878 114806 137171 245660 -34882 -216344 -292863 -449639 -482821 -293568
21476 -293568 -239335 -432055 -701379 -455278 -63084 99077 -9941 -261203 -201553 -121460
21466 -121460 -252305 -198348 -156446 -235997 -267121 -166526 -137842 -340110 -325785 -141627 -235837
21455 -235837 -379160 -423790 -343490 -164598 -24796 -155250 -20593 83440 -108673 -378763
21445 -378763 -388383 -148244 -294011 -332271 -298252 -165546 -185487 -81869 64550 -26160 -44236
21434 -44236 19529 73042 -72286 -142416 -147309 -201404 -164257 -75330 -57696 30502 251274
$$ packed form
21506d16318J17677J56459J21705l4390m0214r3781k3596o7826J14780J95109
21496B9605K07160J41808Q1163m05644k60009K7153r5508K22077J43572R3996
21486A85373n6495j4072K2365J08489k80542j81462p6519j56776l3182J89253
21476b93568N4233j92720k69324K46101L92194J62161j09018k51262N9650Q0093
21466a21460j30845N3957M1902p9551l1124J00595K8684k02268J4325J84158r4210
21455b35837j43323m4630Q0300J78892J39802j30454J34657J04033j92113k70090
21445c78763r620K40139j45767l8260L4019J32706j9941J03618J46419r0710j8076
21434d4236O3765N3513j45328p0130m893n4095L7147Q8927J7634Q8198K20772
$$ plain form
21423 251274 355754 529465 528539 421535 217066 53020 -164477 -110416 -215997 -293633
21413 -293633 -342300 -280298 -133145 -23207 174006 12079 -83222 26922 7974 -15163
21403 -15163 -91883 -172431 -232874 -506492 -508356 -303523 -195948 -465362 -516793 -264781 -113662
21392 -113662 -156380 -332680 -309439 -368001 -234754 -165186 -176995 -436497 -497839 -481814 -402212
21381 -402212 -425812 -401294 -34750 258799 293115 219407 216376 106773 -144785 -177262 -46261
21370 -46261 -10797 46600 38930 305478 358831 363304 166396 234856 541172 726590 663810
21359 663810 597752 597454 289192 271875 270153 123477 -29410 322026 313392 -45872 -172005
21348 -172005 -140236 -36121 -34406 -10845 -54536 -182200 -223597 -93819 468 123166 351983
$$ packed form
21423B51274J04480J73711r26j07004k04469j64046k17497N4061j05581p7636
21413b93633m8667O2002J47153J09938J97213j61927r5301J10144j8948k3137
21403a5163p6720q0548o0443k73618j864K04833J07575k69414n1431K52012J51119
21392a13662m2718j76300K3241n8562J33247O9568j1809k59502o1342J6025P9602
21381d02212k3600K4518L66544K93549L4316p3708l031j09603k51558l2477J31001
21370d6261L5464N7397p670K66548N3353M473j96908O8460L06316J85418o2780
21359F63810o6058k98l08262j7317j722j46676j52887L51436q634l59264j26133
21348a72005L1769J04115J715K3561m3691j27664m1397J29778R4287J22698K28817
$$ plain form
21337 351983 355844 108704 -62031 -140480 -171209 -194613 27297 140384 -59802 -54253 49798
21326 49798 4115 -114467 -109040 -180406 -115680 11856 -208698 -316677 -467854 -341561 -160993
21315 -160993 -126441 14797 -62447 -242168 -327554 -340771 -485862 -350642 -238478 -441622
21305 -441622 -437186 -338486 -152298 -84335 -129269 -205085 -113666 301089 386833 256050 73939
21294 73939 -188048 -231816 -202845 -158388 -132081 22847 70380 45657 147477 238691 239397
21283 239397 312952 382710 224510 15099 -109733 -90814 -6532 73764 -46331 149177
21273 149177 240620 -44041 -255564 -246034 -113115 -109582 -228009 -165350 81019 56144 -32838
21262 -32838 67476 129868 303201 178008 77609 52841 13231 -73889 138969 -153589
$$ packed form
21337C51983L861k47140j70735p8449l0729k3404K21910J13087k00186N549J04051
21326D9798m5683j18582N427p1366O4726J27536k20554j07979j51177J26293J80568
21315a60993L4552J41238p7244j79721q5386j3217j45091J35220J12164k03144
21305d41622M436R8700J86188O7963m4934p5816R1419M14755Q5744j30783j82111
21294G3939k61987m3768K8971M4457K6307J54928M7533k4723J01820R1214P06
21283B39397P3555O9758j58200k09411j24832J8919Q4282Q0296j20095J95508
21273A49177R1443k84661k11523R530J32919L533j18427O2659K46369k4875q8982
21262c2838J00314O2392J73333j25193j00399k4768l9610q7120K12858k92558
$$ plain form
21252 -153589 -450035 -529362 -504252 -225288 -244312 -348395 -128392 7072 71154 61705 165585
21241 165585 158332 54913 -71210 106634 308137 235959 72451 118951 -22573 -53295
21231 -53295 -72348 -134543 -169668 -322405 -330680 -393204 -427399 -94133 -47556 -160423 -82989
21220 -82989 95692 171995 151978 -116689 -398519 -352741 -324428 -356616 -325834 -369863 -566216
21209 -566216 -387925 -465163 -316068 -67147 -130417 -16475 124276 203322 140494 315203
21199 315203 202865 -43589 -89675 6317 -37869 -106766 -305135 -294305 -416275 -229855
21189 -229855 -224713 -344378 -363694 -347892 -456279 -324524 -325177 -364254 -362636 -346919 -358250 -455924
21177 -455924 -405257 -353158 -69454 -150676 -354059 -371655 -225220 7771 34191 -231559
$$ packed form
21252a53589k96446p9327K5110K78964j9024j04083K20003J35464O4082r449J03880
21241A65585p253j03419j26123J77844K01503p2178j63508M6500j41524l0722
21231e3295j9053o2195l5125j52737q275o2524l4195L33266M6577j12867P7434
21220h2989J78681P6303k0017k68667k81830M5778K8313l2188L0782m4029j96353
21209e66216J78291p7238J49095K48921o3270J13942J40751P9046o2828J74709
21199C15203j12338k46454m6086R5992m4186o8897j98369J0830j21970J86420
21189b29855N142j19665j9316J5802j08387J31755o53l9077J618J5717j1331r7674
21177d55924N0667N2099K83704q1222k03383j7596J46435K32991K6420k65750
$$ plain form
21167 -231559 -328391 -363240 -311578 42036 90147 -337413 -455835 -420705 -159921 -224533 -226963
21156 -226963 -534187 -406891 -347924 10256 231922 174923 -60089 -482505 -439653 -307215
21146 -307215 -449034 -657007 -332203 -4858 -147641 -409318 -196625 118934 203026 313426
21136 313426 51176 -18156 199887 -5807 -233894 -371223 -82327 119786 -109432 -156237
21126 -156237 -176847 -88982 157517 58577 74146 163585 58995 -301101 -179816 -32281
21116 -32281 -51679 -104597 -88331 -33711 88123 91076 -264907 -361597 -260901 -353793 -448596
21105 -448596 -312849 -333802 -369675 -177353 -83810 -129384 -269667 -89956 33393 152399
21095 152399 161012 87611 -174535 -214988 -79591 -54611 206889 361726 188054 100984 -261139
$$ packed form
21167b31559r6832l4849N1662L53614M8111m27560j18422L5130K60784o4612k430
21156b26963l07224J27296N8967L58180K21666n6999k35012m22416M2852J32438
21146c07215j41819k07973L24804L27345j42783k61677K12693L15559Q4092J10400
21136C13426k62250o9332K18043k05694k28087j37329K88896K02113k29218m6805
21126a56237k0610Q7865K46499r8940J5569Q9439j04590l60096J21285J47535
21116c2281j9398n2918J6266N4620J21834K953l55983r6690J00696r2892r4803
21105d48596J35747k0953l5873J92322R3543m5574j40283J79711J23349J19006
21095A52399Q613p3401k62146m0453J35397K4980K61500J54837j73672q7070l62123
$$ plain form
21084 -261139 -369915 -254332 -226423 -303084 -130959 -143481 -153236 -37595 -42540 134401 -25470
21073 -25470 -42454 134156 298069 67104 9481 131596 226800 6417 -74686 115519
21063 115519 258708 108444 -76699 110900 92818 -137386 -133736 117705 397469 277852
21053 277852 14898 -189712 -482772 -435233 -155961 200917 224721 236796 264678 254322
21043 254322 -40943 -259458 -229536 93235 352595 294204 299550 274163 89970 -227877
21033 -227877 -196541 36076 13424 107427 15554 -87733 -73632 -253197 -260745 -43060 -195491
21022 -195491 -378462 -407116 -218175 68752 91354 -51238 -91708 -246818 -122409 -36936
21012 -36936 46411 -135173 -383330 -280885 -164461 -301859 -496416 -502539 -129846 160474
$$ packed form
21084b61139j08776J15583K7909p6661J72125j2522r755J15641m945J76941j59871
21073b5470j6984J76610J63913k30965n7623J22115R5204k20383q1103J90205
21063A15519J43189j50264j85143J87599j8082k30204L650K51441K79764j19617
21053B77852k62954k04610k93060M7539K79272L56878K3804J2075K7882j0356
21043B54322k95265k18515K9922L22771K59360n8391N346k5387j84193l17847
21033b27877L1336K32617k2652R4003r1873j03287J4101j79565p548K17685j52431
21022a95491j82971k8654J88941K86927K2602j42592m0470j55110J24409Q5473
21012c6936Q3347j81584k48157J02445J16424j37398j94557o123L72693K90320
$$ plain form
21002 160474 68671 -21577 -303750 -337301 -455471 -554061 -475018 -195382 -170246 -239328 -78897
20991 -78897 -23171 -128602 -121446 -136980 -157147 56589 161590 -737 51176 93563 24541
20980 24541 -85790 -180041 -213099 -146302 -21470 142611 218561 -7088 -353215 -479385
20970 -479385 -321144 -296450 -447115 -268557 49485 -1937 -47969 -263094 -136437 153301
20960 153301 8469 -106921 -445782 -528441 -593276 -384766 -56810 84638 111759 65059
20950 65059 -118211 -90060 2430 9410 123842 21544 -167864 -200817 -102029 184715 234891
20939 234891 182568 50875 97003 343717 380427 347257 327837 278938 293063 121493 244571
20928 244571 288945 80240 -24315 34223 -54100 -15547 -58866 384 283630 339824 276856
$$ packed form
21002A60474r1803r0248k82173l3551j18170r8590P9043K79636K5136o9082J60431
20991g8897N5726j05431P156j5534k0167K13736J05001j62327N1913M2387o9022
20980B4541j10331r4251l3058O6797J24832J64081P5950k25649l46127j26170
20970d79385J58241K4694j50665J78558L18042n1422m6032k15125J26657K89738
20960A53301j44832j15390l38861q2659o4835K08510L27956J41448K7121m6700
20950F5059j83270K8151R2490O980J14432j02298j89408l2953R8788K86744N0176
20939B34891n2323j31693M6128K46714L6710l3170j9420m8899J4125j71570J23078
20928B44571M4374k08705j04555N8538q8323L8553m3319N9250K83246N6194o2968
$$ plain form
20917 276856 266702 280913 -9350 -206344 -296678 -185238 59492 -43902 -263627 -215489
20907 -215489 81794 26919 -61738 -189403 -324473 -382176 -376509 -98539 -43060 -211478 -304220
20896 -304220 -378796 -165710 27564 -27394 88703 -21728 -37483 34271 -60842 -281321
20886 -281321 -124746 -42329 211998 242174 211841 142507 325924 201320 260552 301687 24473
20875 24473 19749 -12535 -228418 -117007 90366 63194 103738 -68998 -88232 -210111 -305537
20864 -305537 -472189 -613710 -614624 -780911 -550233 -388630 -261825 10163 -74857 -212702
20854 -212702 -233183 14657 137362 263116 371523 222750 180991 169661 245714 67725
20844 67725 -208594 -249236 -139558 -236252 -293549 -392302 -232230 2048 -102928 19389
$$ packed form
20917B76856j0154J4211k90263j96994r0334J11440K44730j03394k19725M8138
20907b15489K97283n4875q8657j27665j35070n7703N667K77970N5479j68418r2742
20896c04220p4576K13086J93274n4958J16097j10431j5755P1754r5113k20479
20886b81321J56575Q2417K54327L0176l0333o9334J83417j24604N9232M1135k77214
20875B4473m724l2284k15883J11411K07373k7172M0544j72736j9234j21879r5426
20864c05537j66652j41521r14j66287K30678J61603J26805K71988q5020j37845
20854b12702k0481K47840J22705J25754J08407j48773m1759j1330P6053j77989
20844F7725k76319m0642J09678r6694n7297r8753J60072K34278j04976J22317
$$ plain form
20834 19389 281537 259932 29916 -25270 104803 205251 123526 -120535 68951 100718
20824 100718 44005 -212883 -379018 -236671 8300 -268039 -436203 -360651 -123846 -119388
20814 -119388 -476516 -365241 -58479 5763 -81542 -132455 -69429 -29313 -8433 -256045 -396021
20803 -396021 -438855 -339528 -318156 -120723 -235117 -612963 -522911 -277398 -225035 -243114 -187030
20792 -187030 -288148 -370562 -607167 -723212 -815994 -547530 -164127 -32504 -137211 -313465
20782 -313465 -347793 -450348 -577868 -370284 -168125 48919 -22427 -335218 -399795 -121031
20772 -121031 134643 75889 -163467 -131482 -4328 119369 -45505 -143549 -169129 -45328
20762 -45328 162649 -60305 -215127 -156619 -123107 -315000 -404531 -411120 -207636 -61614 -24025
$$ packed form
20834A9389K62148k1605k30016n5186J30073J00448q1725k44061J89486L1767
20824A00718n6713k56888j66135J42347K44971k76339j68164P5552K36805M458
20814a19388l57128J11275L06762O4242q7305n0913O3026M0116K0880k47612j39976
20803c96021m2834R9327K1372J97433j14394l77846R0052K45513N2363j8079N6084
20792a87030j01118q2414k36605j16045r2782K68464L83403J31623j04707j76254
20782c13465l4328j02555j27520K07584K02159K17044p1346l12791o4577K78764
20772a21031K55674n8754k39356L1985J27154J23697j64874r8044k5580J23801
20762d5328K07977k22954j54822N8508L3512j91893q9531o589K03484J46022L7589
$$ plain form
20751 -24025 36962 -15427 -74081 -133013 -181263 -99103 178045 211007 129583 165782 -7649
20740 -7649 87593 157935 119870 95708 -19442 29521 6801 -169969 -203022 -77052 170927
20729 170927 162490 44377 -79009 -120481 21786 -104674 -482245 -496070 -125505 74037
20719 74037 -69452 -220639 -264259 -190350 -226646 -116719 -25524 -224462 -464325 -292312
20709 -292312 -26102 69097 -18871 -137584 -192718 -57830 197749 22042 -300055 -117331
20699 -117331 -82468 -47527 -234099 -382130 -332155 -333269 -343969 -398528 -200980 -276047 -275766
20688 -275766 -117141 -59562 53266 42101 63286 679 51751 418081 434058 25093 -137097
20677 -137097 -158601 155435 449263 246924 307632 160510 22893 17460 -60304 83056
$$ packed form
20751b4025O0987n2389n8654n8932m8250Q2160K77148L2962q1424L6199j73431
20740g649R5242P0342l8065k4162j15150M8963k2720j76770l3053J25970K47979
20729A70927q437j18113j23386m1472J42267j26460l77571j3825L70565J99542
20719G4037j43489j51187m3620P3909l6296J09927R1195j98938k39863J72013
20709b92312K66210R5199q7968j18713n5134J34888K55579j75707l22097J82724
20699a17331L4863L4941j86572j48031M9975j114j0700n4559J97548p5067K81
20688b75766J58625N7579J12828j1165K1185o2607N1072L66330J5977m08965j62190
20677a37097k1504L14036K93828k02339O0708j47122j37617n433p7764J43360
$$ plain form
20667 83056 190563 300009 106678 190430 320279 305557 118084 117013 -174348 -419524
20657 -419524 -241313 -221739 -196441 -94756 -91897 4299 192368 216665 273956 58632 -101114
20646 -101114 -324342 -92969 54511 -107815 -292908 -236191 -94 80995 67744 -211786
20636 -211786 -189886 -261756 -254062 -265140 -160106 -256810 -361488 -174227 -165448 -444739 -474097
20625 -474097 -184764 49326 194674 -12234 -144303 -244822 -455803 -350460 -104319 28265
20615 28265 120524 76405 -18940 -12068 -16051 25659 106264 62360 -49160 -132443 -390318 -627839
20603 -627839 -507744 -399704 -390195 -215147 64131 223275 408292 241116 54085 107237
20593 107237 17924 -180644 -329941 -472763 -620969 -417424 -586237 -444065 96230 318139
$$ packed form
20667H3056J07507J09446j93331Q3752J29849j4722j87473j071k91361k45176
20657d19524J78211J9574K5298J01685K859R6196J88069K4297N7291k15324j59746
20646a01114k23228K31373J47480j62326j85093N6717K36097Q1089j3251k79530
20636b11786K1900p1870P694j1078J05034r6704j04678J87261Q779k79291k9358
20625d74097K89333K34090J45348k06908j32069j00519k10981J05343K46141J32584
20615B8265R2259m4119r5345O872l983M1710Q0605m3904j11520q3283k57875k37521
20603f27839J20095J08040R509J75048K79278J59144J85017j67176j87031N3152
20593A07237q9313j98568j49297j42822j48206K03545j68813J42172N40295K21909
$$ plain form
20583 318139 268843 212039 88864 -122147 89324 -156366 -207705 -199078 -245027 -241490 -162907
20572 -162907 -39942 25185 -32830 -140449 -457943 -560575 -496937 -264777 -217772 -332810
20562 -332810 -157129 60353 285943 439396 286022 70929 16301 -55151 -64554 -112627
20552 -112627 -150534 -133145 -178958 -321212 -338184 -493416 -225743 -181251 -287515 -310169 -451466
20541 -451466 -264622 -134331 -94664 -42919 -172550 -238223 -488620 -624027 -400361 -176976
20531 -176976 -284229 -302127 -280929 -60091 -84734 -302464 -349726 -294908 -149390 -316754
20521 -316754 -298501 -187080 -183962 -105065 -1215 -40624 296938 683724 525779 109660
20511 109660 253222 345838 58475 182739 80369 -59229 -32045 20364 19984 -54144 192998
$$ packed form
20583C18139m9296n6804j23175k11011K11471k45690n1339Q627m5949L537P8583
20572a62907J22965O5127n8015j07619l17494j02632O3638K32160M7005j15038
20562c32810J75681K17482K25590J53453j53374k15093n4628p1452r403m8073
20552a12627l7907J7389m5813j42254j6972j55232K67673M4492j06264k2654j41297
20541d51466J86844J30291L9667N1745j29631o5673k50397j35407K23666K23385
20531a76976j07253j7898K1198K20838k4643k17730m7262N4818J45518j67364
20521c16754J8253J11421L118P8897J03850l9409L37562L86786j57945m16119
20511A09660J43562R2616k87363J24264j02370j39598K7184N2409l80p4128K47142
$$ plain form
20500 192998 181954 244561 -25582 -168087 -487441 -677796 -415948 -208589 -17146 -12353
20490 -12353 -126207 -158534 -20627 137758 81954 -71221 217557 362414 209099 -84721
20480 -84721 -116483 19678 117143 -117834 -432290 -303301 -189242 -118311 -67102 -58413 -268537
20469 -268537 -232221 -48765 105950 230279 180066 264752 408369 411969 294872 221880 178415
20458 178415 46366 74574 365759 312403 499966 496122 243618 90482 197842 -18314
20448 -18314 -83232 -30838 152832 198659 44244 105060 37939 121044 363169 143295 -154491
20437 -154491 -161433 -307756 -256873 -133360 -70642 -42542 -195153 -93542 -105066 -182905 -82809
20426 -82809 -11052 -68411 20610 252587 -87973 -267808 24714 -59660 -34470 111861 111948
$$ packed form
20500A92998j1044O2607k70143j42505l19354j90355K61848K07359J91443M793
20490a2353j13854l2327J37907J58385n5804j53175K88778J44857j53315k93820
20480h4721l1762J36161R7465k34977l14456J28989J14059P0931N1209Q689k10124
20469b68537L6316J83456J54715J24329n0213Q4686J43617L600j17097p2992m3465
20458A78415j32049K8208K91185n3356J87563l844k52504j53136J07360k16156
20448a8314o4918N2394J83670M5827j54415O0816o7121Q3105K42125k19874k97786
20437a54491o942j46323N0883J23513O2718K8100j52611J01611j1524p7839J00096
20426h2809P1757n7359Q9021K31977l40560j79835K92522q4374K5190J46331Q7
$$ plain form
20415 111948 42929 -156904 -229686 -216889 -115631 -136362 -43961 99860 164421 4906 -42450
20404 -42450 84604 156846 98928 -102890 -232102 -90683 203498 246207 149581 123707 -86965
20393 -86965 -114579 -57938 172879 318350 256000 -35346 -279325 -89358 68281 233666
20383 233666 128910 59536 32051 43394 124177 253312 284181 191877 -30997 -27706 156603
20372 156603 377008 360013 362624 488590 948807 1078130 1059824 1159068 1548469 1876785
20362 1876785 1716006 1518080 1901580 2230128 2098271 1893674 1748504 1395917 1081863
20353 1081863 1063733 1067139 570110 396276 305748 237058 272399 323151 346340 458234 436161
20342 436161 350633 39758 -193505 58060 168621 114064 356519 345019 -51342 -240893
$$ packed form
20415A11948o9019j99833p2782J2797J01258k0731R2401J43821O4561j59515m7356
20404d2450J27054P2242n7918k01818j29212J41419K94181M2709r6626k5874k10672
20393h6965k7614N6641K30817J45471o2350k91346k43979J89967J57639J65385
20383B33666j04756o9374k7485J1343Q0783J29135L0869r2304k22874L291J84309
20372A56603K20405j6995K611J25966M60217J29323j8306R9244L89401L28316
20362A876785j60779j97926L83500L28548j31857k04597j45170l52587l14054
20353A081863j8130L406m97029j73834r0528o8690L5341N0752K3189J11894k2073
20342D36161q5528l10875k33263K51565J10561n4557K42455j1500l96361j89551
$$ plain form
20332 -240893 -249715 -240287 -252172 70364 -27741 143695 -42474 -237274 -260694 -398669 -394322
20321 -394322 -368889 -481276 -367092 -206303 -133511 -180265 -126532 -59243 -59677 -20708 191513
20310 191513 362889 290191 78141 -22212 125132 103064 45518 -156764 -178263 -77807
20300 -77807 23056 31323 -160775 -237522 -80308 113971 70916 -224207 -257908 -120247 -154092
20289 -154092 -168957 -238695 -80513 -53947 107019 12274 4024 19126 -257695 -576562 -623623
20278 -623623 -266303 -79264 -201469 -328974 -389028 -392376 -58058 227289 195498 -164897
20268 -164897 -259778 -85653 277907 188912 -61340 -128938 -101121 -70214 4773 64582 71537
20257 71537 -70955 3641 183262 49777 60318 25435 67387 -142500 -31725 -125865 -172621
$$ packed form
20332b40893q822R428j1885L22536r8105J71436j86169j94800k3420j37975M347
20321c94322K5433j12387J14184J60789P2792m6754N3733O7289m34L8969K12221
20310A91513J71376p2698k12050j00353J47344k2068n7546k02282k1499J00456
20300g7807J00863Q267j92098p6747J57214J94279m3055k95123l3701J37661l3845
20289a54092j4865o9738J58182K6566J60966r4745q250J5102k76821l18867m7061
20278f23623L57320J87039j22205j27505o0054l348L34318K85347l1791l60395
20268a64897r4881J74125L63560q8995k50252o7598K7817L0907P4987N9809O955
20257G1537j42492P4596J79621j33485J0541l4883M1952k09887J10775r4140m6756
$$ plain form
20246 -172621 -14734 -231414 -143764 -62299 -295338 -355247 -301278 -58019 45128 24961
20236 24961 23134 150927 81285 -189 32762 -171459 -331800 -185296 -28484 -96950 -139332
20225 -139332 -3656 -64473 -301338 -325354 -428960 -392221 -70330 -18729 -10910 45152 -18850
20214 -18850 -128066 66838 45298 -105375 33666 455845 634288 527210 352818 195525
20204 195525 193910 448006 804448 620440 374152 442920 528905 811016 746223 703049 567418
20193 567418 479917 519939 424013 608875 769011 751041 589294 353461 47253 -24262
20183 -24262 207734 37520 196751 285961 279885 220954 152336 228102 180009 -11056 134494
20172 134494 291839 329746 463808 568943 671950 423288 -25223 -10291 164998 556308
$$ packed form
20246a72621J57887k16680Q7650Q1465k33039n9909N3969K43259J03147k0167
20236B4961j827J27793o9642q1474L2951k04221j60341J46504J56812o8466m2382
20225a39332J35676o0817k36865k4016j03606L6739L21891N1601P819N6062o4002
20214a8850j09216J94904k1540j50673J39041M22179J78443j07078j74392j57293
20204A95525j615K54096L56442j84008k46288O8768Q5985K82111o4793m3174j35631
20193E67418q7501M0022r5926J84862J60136j7970j61747k35833l06208p1515
20183b4262K31996j70214J59231Q9210o076n8931o8618P5766m8093j91065J45550
20172A34494J57345L7907J34062J05135J03007k48662m48511J4932J75289L91310
$$ plain form
20162 556308 540225 285438 391016 346860 261549 172842 62754 -56827 -259662 6112
20152 6112 -22573 -48063 -123670 -80634 -34997 -47011 116875 165477 100723 245413 303645
20141 303645 342118 286210 149920 -89340 -241205 -89096 -10179 -9319 232251 414970 349745
20130 349745 307830 -28439 -267435 -202836 62015 505759 522583 250537 171707 389231
20120 389231 380926 -30170 -205344 -51973 263444 223694 79583 -105592 -153390 -29935
20110 -29935 68663 -154896 18507 126544 330136 207916 -39013 78010 190259 44890
20100 44890 117976 37291 -74482 -255305 -250016 -252866 -265295 25731 46266 -118546 -186338
20089 -186338 -247931 -505620 -551309 -434907 -128070 -62449 -27245 68350 451499 480616 459255
$$ packed form
20162E56308j6083k54787J05578m4156q5311q8707j10088j19581k02835K65774
20152F112k8685k5490p5607M3036M5637j2014J63886M8602o4754J44690N8232
20141C03645L8473n5908j36290k39260j51865J52109P8917Q60K41570J82719o5225
20130C49745m1915l36269k38996O4599K64851M43744J6824k72046p8830K17524
20120C89231q305m11096j75174J53371L15417l9750j44111j85175m7798J23455
20110b9935R8598k23559J73403J08037K03592j22220k46929J17023J12249j45369
20100D4890P3086q0685j11773j80823N289k850j2429K91026K0535j64812o7792
20089a86338o1593k57689m5689J16402L06837O5621L5204R5595L83149K9117k1361
$$ plain form
20078 459255 554320 539006 248462 -62363 -9072 -46529 -152849 -171994 -153186 4538 10275
20067 10275 127130 376241 404382 450536 215380 79172 -106139 -165194 -21187 140596
20057 140596 91704 252459 172001 -84504 -237977 -139446 162845 436481 377330 196927
20047 196927 236491 135350 -40337 -89807 -87550 -209909 -333139 -442022 -542810 -378559
20037 -378559 -143788 -240679 -193045 -124241 -210289 -236761 -297675 -58904 99050 275387 254541
20026 254541 10244 -293733 -286846 -142724 -31769 -71020 8922 146819 254203 417551
20016 417551 398190 138631 142491 -27012 -140834 -92912 -90722 130746 -30389 -194840 -135195
20005 -135195 -77859 -326308 -286951 341 269675 247074 180908 16566 2957 -64966 -49114
$$ packed form
20078D59255R5065j5314k90544l10825N3291l7457j06320j9145J8808J57724N737
20067A0275J16855K49111K8141M6154k35156j36208j85311n9055J44007J61783
20057A40596m8892J60755q0458k56505j53473R8531L02291K73636n9151j80403
20047A96927L9564j01141j75687m9470K257j22359j23230j08883j00788J64251
20037c78559K34771r6891M7634O8804q6048k6472o0914K38771J57954J76337k0846
20026B54541k44297l03977O887J44122J10955l9251P9942J37897J07384J63348
20016D17551j9361k59559L860j69503j13822M7922K190K21468j61135j64451N9645
20005a35195N7336k48449L9357K87292K69334k2601o6166j64342j3609o7923J5852
$$ plain form
19994 -49114 -41396 68186 56069 245298 494822 327981 269222 392547 437023 132581 -175037
19983 -175037 21635 267720 391729 291852 380861 492521 282915 62691 85527 134011
19973 134011 134195 107597 -47235 -270281 -337904 -122159 176262 313068 419054 280950
19963 280950 209290 202498 285192 389739 361851 517295 566243 404915 366377 392427 240643
19952 240643 176702 290928 273153 159789 193285 46183 -86687 49064 167775 157324
19942 157324 66313 -57976 164527 361562 290973 264110 220514 87478 160689 216475 254747
19931 254747 135931 -82869 -345777 -343655 -243625 -70915 183146 89003 176280 186319
19921 186319 101327 -193589 -359020 -277353 90334 466270 627519 559221 429028 440791
$$ packed form
19994d9114P718J09582j2117J89229K49524j66841n8759J23325M4476l04442l07618
19983a75037J96672K46085J24009r9877Q9009J11660k09606k20224K2836M8484
19973A34011J84k6598j54832k23046o7623K15745K98421J36806J05986j38104
19963B80950p1660o792Q2694J04547k7888J55444M8948j61328l8538K6050j51784
19952B40643o3941J14226j7775j13364L3496j47102j32870J35751J18711j0451
19942A57324r1011j24289K22503J97035p0589k6863m3596j33036P3211N5786L8272
19931B54747j18816k18800k62908K122J00030J72710K54061r4143Q7277J0039
19921A86319q4992k94916j65431Q1667L67687L75936J61249o8298j30193J1763
$$ plain form
19911 440791 295806 148257 -40570 16174 88425 46854 170301 107564 -108240 -95689
19901 -95689 -69137 -111324 -74025 18492 120822 78171 14642 12379 51477 233141 431161
19890 431161 190293 30995 12961 -152544 -294617 -396065 -388853 -354397 -212081 168544
19880 168544 304034 235194 202090 33458 -41617 148769 171222 123616 -51279 -152543
19870 -152543 -241414 -271813 -83184 -137017 -243190 46660 324747 476955 511910 222823
19860 222823 -156932 -175921 157972 182973 95690 245468 357636 276766 367191 507153
19850 507153 559138 412733 252573 270098 105291 65228 -60469 259225 291047 327751
19840 327751 322512 305131 390769 299235 558276 824671 718196 975209 1018123 782481 596155
$$ packed form
19911D40791j44985j47549j88827N6744P2251m1571J23447o2737k15804J2551
19901i5689K6552m2187L7299R2517J02330m2651o3529k263L9098J81664J98020
19890D31161k40868j59298j8034j65505j42073j01448P212L4456J42316L80625
19880A68544J35490o8840l3104j68632p5075J90386K2453m7606j74895j01264
19870a52543q8871l0399J88629n3833j06173K89850K78087J52208L4955k89087
19860B22823l79755j8989L33893K5001q7283J49778J12168q0870R0425J39962
19850E07153N1985j46405j60160J7525j64807m0063j25697L19694L1822L6704
19840C27751n239j7381Q5638r1534K59041K66395j06475K57013M2914k35642j86326
$$ plain form
19829 596155 526463 628061 814615 1118497 1232999 918075 798200 712563 847786 927461
19819 927461 739432 603342 826263 1086159 1103477 821004 802256 890883 916597 745395
19809 745395 732231 599169 561460 570036 624751 858336 1300951 1411052 1305130 949186
19799 949186 646387 526884 630973 975920 1162537 1091217 1295152 1445002 1455670 1409209
19789 1409209 1171158 1254708 1313816 1373621 1498355 1729820 1631531 1475964 1451754 1217074
19779 1217074 1071917 947397 1118059 1382013 1144623 1157714 1088380 1228580 1492024 1550186
19769 1550186 1475826 1603014 1818539 1822910 1712127 1818257 2173262 2454231 2583686 2731067
19759 2731067 2706786 2679648 2862487 2854673 3057205 3150472 3065712 3056836 3243576 3652264 3818864
$$ packed form
19829E96155o9692J01598J86554L03882J14502l14924j19875q5637J35223P9675
19819I27461j88029j36090K22921K59896J7318k82473j8748Q8627K5714j71202
19809G45395j3164j33062l7709Q576N4715K33585M42615J10101j05922l55944
19799I49186l02799j19503J04089L44947J86617p1320K03935J49850J0668m6461
19789A409209k38051Q3550N9108N9805J24734K31465r8289j55567k4210k34680
19779A217074j45157j24520J70662K63954k37390J3091o9334J40200K63444N8162
19769A550186p4360J27188K15525M371j10783J06130L55005K80969J29455J47381
19759B731067k4281k7138J82839p814K02532R3267q4760q876J86740M08688J66600
$$ plain form
19748 3818864 4252358 4572521 5262192 6050847 6602631 7117157 8178864 9277200 10423861
19739 10423861 11439718 12349337 12917458 13621421 14387395 14892948 15225844 15336686 15470251
19730 15470251 16024881 16907191 18041681 19581817 21285251 23482987 26590209 30310245
19722 30310245 34905612 40829955 48725171 59718860 75248337 97598141 129711491
19715 129711491 174453599 232128132 298163198 362819319 416862364 457347815 485890268
19708 485890268 500468811 492156826 453412509 387425925 310778547 241118287 187493136
19701 187493136 149801906 123668059 105187304 91847701 81615877 73755733 67629667
19694 67629667 62609781 58475208 55102516 52704222 50792640 48993285 47429992 46053894
$$ packed form
19748C818864M33494L20163O89671P88655N51784N14526J061707J098336J146661
19739A0423861J015857R09619N68121P03963P65974N05553L32896J10842J33565
19730A5470251N54630Q82310J134490J540136J703434K197736L107222L720036
19722C0310245M595367N924343P895216J0993689J5529477K2349804L2113350
19715A29711491M4742108N7674533O6035066O4656121N4043045M0485451K8542453
19708D85890268J4578543q311985l8744317o5986584p6647378o9660260n3625151
19701A87493136l7691230k6133847j8480755j3339603j0231824p860144o126066
19694F7629667n019886m134573l372692k398294j911582j799355j563293j376098
$$ plain form
19686 46053894 44721197 43384716 42050635 40479605 39079142 37611481 36296738 34576039
19678 34576039 32871843 31209686 29665677 28357613 26951660 25641296 24571964 23662520
19670 23662520 22599086 21448922 20399509 19157580 18276928 17634284 17024146 16449259 15941230
19661 15941230 15400835 15119225 14772224 14487634 14058723 13457350 12950016 12412684 12053658
19652 12053658 11883880 11276766 10750385 10469161 10438077 10272231 10015368 9785674 9402397
19643 9402397 9343622 9159297 8476413 7975208 7712338 7546587 7213510 7070193 7049352 6964210
19633 6964210 6654905 6402926 6058836 5789076 5571364 5469630 5200886 4989745 4944466 5122500
19623 5122500 5199250 4923826 4750211 4750037 4536388 4461706 4643218 4396945 4374199 4234582
$$ packed form
19686D6053894j332697j336481j334081j571030j400463j467661j314743j720699
19678C4576039j704196j662157j544009j308064j405953j310364j069332r09444
19670B3662520j063434j150164j049413j241929q80652o42644o10138n74887n08029
19661A5941230n40395k81610l47001k84590m28911o01373n07334n37332l59026
19652A2053658j69778o07114n26381k81224l1084j65846k56863k29694l83277
19643I402397n8775j84325o82884n01205k62870j65751l33077j43317k0841q5142
19633F964210l09305k51979l44090k69760k17712j01734k68744k11141m5279J78034
19623E122500P6750k75424j73615j74k13649p4682J81512k46273k2746j39617
$$ plain form
19613 4234582 4036503 3647811 3443244 3396794 3459934 3374261 3271043 3257560 3106640 3006027
19603 3006027 3055228 3016071 2847116 2603772 2367472 1931985 1834746 2036403 2208412 2360010
19593 2360010 2385146 2425773 2324724 2082255 1888153 2040069 1859012 1660016 1717892 1630532
19583 1630532 1261827 1301419 1375123 1302752 1291840 1508429 1636068 1699428 1897507 1913508
19573 1913508 1702806 1496499 1661364 1538991 1667123 1656011 1491374 1501163 1509666 1216491
19563 1216491 1153580 1157647 1451950 1403102 1198975 1062754 1012943 984307 932033 922097 783721
19552 783721 615153 621074 542901 649036 683105 686518 405940 382881 380022 685276 725664
19541 725664 354784 321165 423363 651146 785937 702801 653748 658542 570807 311458 204136
$$ packed form
19613D234582j98079l88692k04567m6450O3140q5673j03218j3483j50920j00613
19603C006027M9201l9157j68955k43344k36300m35487r7239K01657J72009J51598
19593B360010K5136M0627j01049k42469j94102J51916j81057j98996N7876q7360
19583A630532l68705L9592P3704p2371j0912K16589J27639O3360J98079J6001
19573A913508k10702k06307J64865j22373J28132j1112j64637R789Q503k93175
19563A216491o2911M067K94303m8848k04127j36221m9811k8636n2274r936j38376
19552G83721j68568N921p8173J06135L4069L413k80578k3059k859L05254M0388
19541G25664l70880l3619J02198K27783J34791q3136m9053M794q7735k59349j07322
$$ plain form
19530 204136 273334 441870 666406 506624 438273 286907 311081 638719 581701 422763
19520 422763 325006 313775 539034 450261 551004 790399 766731 769290 985329 1200012 1000277
19509 1000277 958993 919486 1062854 1230167 1288639 1253393 1491362 2074207 2172340 2153270
19499 2153270 2182675 2080022 1843425 1839794 1686988 1383904 1468645 1534738 1571012 1556068 1635995
19488 1635995 1509712 1515421 1593029 1188434 909072 936470 885691 941557 1071211 1182575
19478 1182575 1304345 1144791 984670 809060 688809 495476 218879 295312 474011 605945
19468 605945 659646 625007 691185 758249 587013 688898 586381 419927 454760 513765 670869
19457 670869 521522 504954 570209 768840 677325 500347 207483 53695 70683 -201505
$$ packed form
19530B04136O9198J68536K24536j59782o8351j51366K4174L27638n7018j58938
19520D22763r7757j1231K25259q8773J00743K39395k3668K559K16039K14683j99735
19509A000277m1284l9507J43368J67313N8472l5246K37969N82845R8133j9070
19499B153270K9405j02653k36597l631j52806l03084Q4741O6093L6274j4944P9927
19488A635995j26283N709P7608m04595k79362K7398n0779N5866J29654J11364
19478A182575J21770j59554j60121j75610j20251j93333k76597P6433J78699J31934
19468F05945N3701l4639O6178O7064j71236J01885j02517j66454L4833N9005J57104
19457F70869j49347j6568O5255J98631r1515j76978k92864j53788J6988k72188
$$ plain form
19447 -201505 -379436 -134480 48245 43155 162224 297032 303833 245057 294565 326989 278756
19436 278756 304175 452792 426166 561903 484866 429161 403753 343569 276826 313710 398021
19425 398021 361925 140626 53391 -142411 2508 324840 367424 361278 477918 506636 219515
19414 219515 -50329 86433 191746 158821 241394 120195 -55382 -206152 -142094 -245071
19404 -245071 -352707 -368355 -199217 101233 40452 93706 226457 258087 127126 -53444
19394 -53444 -30792 36827 14665 -60583 -117186 -261154 -246804 -114799 45604 43735 14557
19383 14557 -182088 -34571 107786 175311 83334 -16985 -173608 -317454 -416029 -430093
19373 -430093 -572353 -481462 -501679 -345273 -141242 -63301 -34228 2496 -43302 19652 231546
$$ packed form
19447b01505j77931K44956J82725n090J19069J34808O801n8776M9508L2424m8233
19436B78756K5419J48617k6626J35737p7037n5705k5408o0184o6743L6884Q4311
19425C98021l6096k21299q7235j95802J44919L22332M2584o146J16640K8718k87121
19414B19515k69844J36762J05313l2925Q2573j21199j75577j50770O4058j02977
19404b45071j07636j5648J69138L00450o0781N3254J32751L1630j30961j80570
19394e3444K2652O7619k2162p5248n6603j43968J4350J32005J60403j869k9178
19383A4557j96645J47517J42357O7525r1977j00319j56623j43846r8575j4064
19373d30093j42260R0891k0217J56406K04031P7941K9073L6724m5798O2954K11894
$$ plain form
19362 231546 196280 118935 127068 62709 -62662 -766 243517 554027 573629 470377 458219
19351 458219 362242 336621 366938 326531 354693 272051 271701 318497 317537 -49278 -206632 -42704
19339 -42704 57352 247365 138661 -143599 -218090 131228 195868 338563 363557 223654
19329 223654 92334 118409 61727 204164 292204 262814 239161 376778 440725 401544 414065
19318 414065 540719 1021713 844064 629141 598217 284269 455162 601984 478340 295145
19308 295145 330044 223436 176337 221397 307036 156079 -24990 46627 306200 408179
19298 408179 172931 5269 208149 459281 436255 408187 281131 306117 261361 284236
19288 284236 251869 194502 -54534 -12979 -1607 -141502 -141192 211142 261184 403668 553778
$$ packed form
19362B31546l5266p7345Q133o4359j25371O1896K44283L10510J9602j03252j2158
19351D58219r5977k5621L0317m0407K8162q2642l50M6796r60l66815j57354J63928
19339d2704J00056J90013j08704k82260p4491L49318O4640J42695K4994j39903
19329B23654j31320K6075n6682J42437Q8040k9390k3653J37617O3947l9181J2521
19318D14065J26654M80994j77649k14923l0924l13948J70893J46822j23644j83195
19308B95145L4899j06608m7099M5060Q5639j50957j81069P1617K59573J01979
19298D08179k35248j67662K02880K51132k3026k8068j27056K4986m4756K2875
19288B84236l2367n7367k49036M1555J1372j39895L10L52334N0042J42484J50110
$$ plain form
19277 553778 352039 205608 350325 83117 -72748 -100096 -104895 -92613 135727 274305
19267 274305 367495 179741 275913 409950 241147 166036 345731 238884 52469 170240
19257 170240 209203 267737 339221 429239 348570 145377 10290 -52230 -13310 -117735 -244027
19246 -244027 -113158 69674 -28634 -82518 74569 156272 207967 301868 225292 345226 355021
19235 355021 363334 343381 335993 307873 183603 364935 355313 286760 464344 108155 115224
19224 115224 234523 306979 290656 190104 232945 246942 263968 138438 382281 510891
19214 510891 564586 607567 557203 337461 500712 524592 450464 219343 120866 212954 107574
19203 107574 67816 180061 173676 208916 261946 253720 423682 459850 417810 457722 308878
$$ packed form
19277E53778k01739j46431J44717k67208j55865k7348m799J2282K28340J38578
19267B74305R3190j87754R6172J34037j68803p5111J79695j06847j86415J17771
19257A70240L8963N8534P1484R0018q0669k03193j35087o2520L8920j04425j26292
19246b44027J30869J82832r8308n3884J57087Q1703N1695R3901p6576J19934R795
19235C55021Q313j9953p388k8120j24270J81332r622o8553J77584l56189P069
19224A15224J19299P2456j6323j00552M2841J3997J7026j25530K43843J28610
19214E10891N3695M2981n0364k19742J63251K3880p4128k31121r8477R2088j05380
19203A07574l9758J12245o385L5240N3030q226J69962L6168m2040L9912j48844
$$ plain form
19192 308878 331471 333836 165841 106158 262175 364689 413584 670539 918214 784816
19182 784816 558029 410136 94004 440 260919 433598 395634 450530 353896 386354
19172 386354 315615 -77425 -288379 -139782 -69709 -18586 160927 134136 28877 -59383
19162 -59383 53195 272098 418779 547122 628815 381429 206729 122959 209707 167008
19152 167008 213205 385444 496142 348751 500583 615164 482572 639431 763523 757094
19142 757094 781303 957756 1071019 1275694 1491368 1525806 1546887 1554304 1472301 1492170 1282382
19131 1282382 1008172 781322 806185 561669 209793 266304 351236 331780 352067 559267
19121 559267 405327 351777 334569 462662 526640 489820 680047 699663 596398 587395 370985
$$ packed form
19192C08878K2593K365j67995n9683J56017J02514M8895K56955K47675j33398
19182G84816k26787j47893l16132r3564K60479J72679l7964N4896r6634L2458
19172C86354p0739l93040k10954J48597P0073N1123J79513k6791j05259q8260
19162e9383J12578K18903J46681J28343Q1693k47386j74700q3770Q6748m2699
19152A67008M6197J72239J10698j47391J51832J14581j32592J56859J24092o429
19142G57094K4209J76453J13263K04675K15674L4438K1081P417q2003J9869k09788
19131A282382k74210k26850K4863k44516l51876N6511Q4932j9456K0287K07200
19121E59267j53940n3550j7208J28093O3978l6820J90227J9616j03265r003k16410
$$ plain form
19110 370985 341744 408637 436365 474025 434145 349621 339297 599227 922523 964931 895580
19099 895580 906729 1005415 1032908 1216791 1111013 1069178 934819 850521 961178 1025544 1404172
19088 1404172 1600450 1741220 1853428 2070282 2311933 2371908 2066322 2170626 2535145 2515241
19078 2515241 2354092 2243922 2212755 2130899 2006193 1933303 1709438 1824812 1873445 1636949
19068 1636949 1362931 1445189 1694760 1706666 1575839 1606825 1729320 1851074 1955449 1814879
19058 1814879 1726498 1717272 1833811 2107943 2368105 2607310 2928132 3083035 3302791 3470196
19048 3470196 3536305 3444561 3309941 2993736 2603801 2512301 2348099 2278495 2058015 2139395
19038 2139395 2232732 2272329 2204543 2310302 2278007 2243980 2553515 2533160 2454388 2348989 2306172
$$ packed form
19110C70985k9241O6893K7728L7660l9880q4524j0324K59930L23296M2408o9351
19099H95580J1149R8686K7493J83883j05778m1835j34359q4298J10657O4366L78628
19088A404172J96278J40770J12208K16854K41651N9975l05586J04304L64519j9904
19078B515241j61149j10170l1167q1856j24706p2890k23865J15374M8633k36496
19068A636949k74018Q2258K49571J1906j30827L0986J22495J21754J04375j40570
19058A814879q8381r226J16539K74132K60162K39205L20822J54903K19756J67405
19048C470196O6109r1744j34620l16205l89935r1500j64202o9604k20480Q1380
19038B139395R3337L9597o7786J05759l2295l4027L09535k0355p8772j05399m2817
$$ plain form
19027 2306172 2388337 2303459 2476692 2867671 2975826 3012369 3073962 3143882 3193353 3328287
19017 3328287 3410360 3312995 3312705 3562608 3766549 4000393 4102858 4295956 4612056 4816775
19007 4816775 5214630 5665847 6302880 6754977 7003286 7406386 7851675 8544727 9196217
18998 9196217 9912627 10779926 11911894 12948493 14169517 15762342 17231635 18884567
18990 18884567 20815484 22933524 25261220 28166607 31656069 36085539 41881453 49400362
18982 49400362 58401062 70226379 85068563 102736883 122783507 144017163 165444385
18975 165444385 185769483 204175988 218335176 226738846 229633827 228576101 225335566
18968 225335566 221444031 218406535 218155258 221100487 226459147 233573384 240803284 244906952
$$ packed form
19027B306172Q2165q4878J73233L90979J08155L6543O1593O9920M9471J34934
19017C328287Q2073r7365k90K49903K03941K33844J02465J93098L16100K04719
19007D816775L97855M51217O37033M52097K48309M03100M45289O93052O51490
18998I196217P16410Q67299J131968J036599J221024J592825J469293J652932
18990A8884567J930917K118040K327696K905387L489462M429470N795914P518909
18982D9400362R000700J1825317J4842184J7668320K0046624K1233656K1427222
18975A65444385K0325098J8406505J4159188Q403670K894981j057726l240535
18968B25335566l891535l037496k51277K945229N358660P114237P229900M103668
$$ plain form
18960 244906952 243320151 235336147 222121221 204686172 184054254 161826717 140320812
18953 140320812 121028378 105186404 92564562 82450363 74640989 68405246 63105904
18946 63105904 58593400 54974191 51673114 48969604 46506492 44134734 41861415 39791029
18938 39791029 37859910 36054006 34030188 32247962 30624996 29312927 27803873 26344946
18930 26344946 25267295 24344944 23672147 22794735 21837555 21212757 20554050 19700818 18761217
18921 18761217 18014043 17641392 17176170 16394090 15561230 14998223 14824051 14500130 14181049
18912 14181049 13976766 13593718 13189234 12711186 12503713 11937965 11650441 11482124 11021033
18903 11021033 10310724 10004794 9884348 9617148 9272938 8889055 8621632 8462299 8227137
$$ packed form
18960B44906952j586801p984004j3214926j7435049k0631918k2227537k1505905
18953A40320812j9292434j5841974j2621842j0114199p809374o235743n299342
18946F3105904m512504l619209l301077k703510k463112k371758k273319k070386
18938C9791029j931119j805904k023818j782226j622966j312069j509054j458927
18930B6344946j077651r22351o72797q77412r57180o24798o58707q53232r39601
18921A8761217p47174l72651m65222p82080q32860n63007j74172l23921l19081
18912A4181049k04283l83048m04484m78048k07473n65748k87524j68317m61091
18903A1021033p10309l05930j20446k67200l44210l83883k67423j59333k35162
$$ plain form
18894 8227137 8067093 7706698 7390331 7237886 7145672 7131975 7252272 7057933 6951526 6628963
18884 6628963 6380044 6144600 6008182 5717959 5518782 5257117 5215318 5193582 5134556 4944614
18874 4944614 4769994 4412967 4166958 3872644 3808498 4122417 4277089 4012518 3892281 4006399
18864 4006399 4020591 3910984 4083170 3617228 3088745 2979405 3011258 2970768 2844195 2860373
18854 2860373 2675065 2589970 2536473 2485289 2644656 2321617 2161816 2169874 2205716 2169011 2135024
18843 2135024 2160740 2140307 2106282 2203411 2329564 2344589 2094564 2046172 2138285 2222307 2002089
18832 2002089 2116552 2170948 2229733 2211166 2231925 1949927 1893771 2188610 2291409 2061002
18822 2061002 1754160 1625233 1776430 1721534 1774877 1740311 1786471 1724244 1551171 1471141
$$ packed form
18894H227137j60044l60395l16367j52445r2214j3697J20297j94339j06407l22563
18884F628963k48919k35444j36418k90223j99177k61665m1799k1736n9026j89942
18874D944614j74620l57027k46009k94314o4146L13919J54672k64571j20237J14118
18864D006399J4192j09607J72186m65942n28483j09340L1853m0490j26573J6178
18854B860373j85308q5095n3497n1184J59367l23039j59801Q058L5842l6705l3987
18843B135024K5716k0433l4025R7129J26153J5025k50025m8392R2113Q4022k20218
18832B002089J14463N4396N8785j8567K0759k81998n6156K94839J02799k30407
18822B061002l06842j28927J51197n4896N3343l4566M6160o2227j73073q0030
$$ plain form
18812 1471141 1340900 1126088 1197688 1205095 1075004 1083138 1053595 1113585 1354794 1354931 1253082
18801 1253082 1261301 1248093 1323248 1205944 1062192 1112073 1501010 1528102 1619054 1632492 1682339
18790 1682339 1585324 1653662 1604827 1588151 1726991 1666861 1561962 1618157 1477757 1624087
18780 1624087 1658987 1539497 1637851 1621085 1282890 941953 833757 759127 954698 1014504
18770 1014504 916307 1001484 1122584 1200807 1313519 1671052 1655106 1366611 1202415 1086889
18760 1086889 759411 767395 808231 676329 693474 1045083 1385688 1299532 1153409 1194629
18750 1194629 1147385 1372593 1345006 1641071 1736590 1727679 1978945 2207894 2387438 2517528
18740 2517528 2391545 2063151 2163842 2402604 2470438 2510530 2574980 2617829 2727254 2849036
$$ packed form
18812A471141j30241k14812P1600P407j30091Q134k9543N9990K41209J37j01849
18801A253082Q219j3208P5155j17304j43752M9881L88937K7092R0952J3438M9847
18790A682339r7015O8338m8835j6676J38840o0130j04899N6195j40400J46330
18780A624087L4900j19490R8354j6766l38195l40937j08196p4630J95571N9806
18770A014504r8197Q5177J21100P8223J12712L57533j5946k88495j64196j15526
18760A086889l27478P984M0836j31902J7145L51609L40605q6156j46123M1220
18750A194629m7244K25208k7587K96065R5519q911K51266K28949J79544J30090
18740B517528j25983l28394J00691K38762O7834M0092O4450M2849J09425J21782
$$ plain form
18730 2849036 3299620 3566985 3704316 3856894 3779180 3710456 3836594 3811663 3585385 3481097
18720 3481097 3367788 3267325 3165132 2970257 3167523 3163024 3162140 3157966 2758903 2461507 2507619
18709 2507619 2204700 2050865 1944547 1810034 1504857 1301772 1519340 1821225 1985248
18700 1985248 2140531 2242299 2264130 2160365 2060647 2064383 1841301 1968591 1983063 1682073
18690 1682073 1509962 1583335 1895632 2075005 2126934 1941745 1614939 1509109 1604684 1695555
18680 1695555 1736680 1913250 1872310 1816969 2107314 2272774 2037607 2142696 1985605 1979207
18670 1979207 2259083 2441823 2589106 2708252 2719624 2740328 2715905 2916883 2942249 2962336
18660 2962336 3343329 3783645 3963404 4040154 4171015 4353610 4389542 4430319 4626971 4789913
$$ packed form
18730B849036M50584K67365J37331J52578p7714o8724J26138k4931k26278j04288
18720C481097j13309j00463j02193j94875J97266m499q84m174l99063k97396M6112
18709B507619l02919j53835j06318j34513l05177k03085K17568L01885J64023
18700A985248J55283J01768K1831j03765r9718L736k23082J27290J4472l00990
18690A682073j72111P3373L12297J79373N1929j85189l26806j05830R5575R0871
18680A695555M1125J76570m0940n5341K90345J65460k35167J05089j57091o398
18670A979207K79876J82740J47283J19146J1372K0704k4423K00978K5366K0087
18660B962336L80993M40316J79759P6750J30861J82595L5932M0777J96652J62942
$$ plain form
18650 4789913 4937210 5044897 5243407 5531744 5990451 6331948 6948365 7514925 8208345
18641 8208345 8815305 9624116 10233515 10851355 11861685 13102843 14461792 16454473 18992223
18632 18992223 22112451 26159934 31532261 38519741 47984882 60751186 76986077 95743033
18624 95743033 115398172 134832382 153533536 169959426 181653467 186226806 182779173
18617 182779173 172856743 158565006 141068894 120841909 100676803 83383907 69830273
18610 69830273 59848356 52384483 46397348 41742678 38182193 35497831 33424860 31839154
18602 31839154 30479607 29393038 28295540 27510570 26859327 26093521 25381885 24463523 23850073
18593 23850073 23272613 22949010 22897827 22729289 22933141 23061744 23418609 24023840 24678541
$$ packed form
18650D789913J47297J07687J98510K88337M58707L41497O16417N66560O93420
18641H208345O06960Q08811O09399O17840J010330J241158J358949J992681K537750
18632A8992223L120228M047483N372327O987480R465141J2766304J6234891J8756956
18624I5743033J9655139J9434210J8701154J6425890J1694041M573339l447633
18617A82779173r922430j4291737j7496112k0226985k0165106j7292896j3553634
18610F9830273r981917p463873n987135m654670l560485k684362k072971j585706
18602C1839154j359547j086569j097498p84970o51243p65806p11636r18362o13450
18593B3850073n77460l23603n1183j68538K03852J28603L56865O05231O54701
$$ plain form
18584 24678541 25314428 26231719 27441574 29065634 31313373 33946098 37211453 41983702
18576 41983702 48805552 58012184 70368890 86724175 107683500 132040174 158161296
18569 158161296 184129064 208863687 230954403 247115117 253748982 249389133 236513678
18562 236513678 217275396 193253852 165929464 138489625 114434996 95381735 80927122
18555 80927122 70211180 62128802 55685645 50391325 46355857 43001243 40433471 38496225
18547 38496225 36689428 35025107 33604766 31905516 30320842 28852490 27566084 26143821
18539 26143821 25086807 23945083 22791010 21744262 20974842 20368632 19504489 18820177 18323779
18530 18323779 17614549 16883098 16203219 15688439 15197536 14529685 14061426 13441270 12813605
$$ packed form
18584B4678541O35887R17291J209855J624060K247739K632725L265355M772249
18576D1983702O821850R206632J2356706J6355285K0959325K4356674K6121122
18569A58161296K5967768K4734623K2090716J6160714O633865m359849j2875455
18562B36513678j9238282k4021544k7324388k7439839k4054629j9053261j4454613
18555H0927122j0715942q082378o443157n294320m035468l354614k567772j937246
18547C8496225j806797j664321j420341j699250j584674j468352j286406j422263
18539B6143821j057014j141724j154073j046748p69420o06210q64143o84312m96398
18530A8323779p09230p31451o79879n14780m90903o67851m68259o20156o27665
$$ plain form
18521 12813605 12273219 12045979 11651358 11033640 10564332 10119157 9897683 9658358 9538893
18512 9538893 9314335 9011017 8805610 8637400 8327347 7885725 7660211 7585695 7423598 7085837
18502 7085837 6865050 6815386 6764294 6460485 6209852 6163977 5905799 5863022 5739846 5640606
18492 5640606 5559197 5460215 5140117 4723700 4555242 4423241 4137924 4141059 4436851 4606523
18482 4606523 4485859 4271377 4013617 3931246 3684190 3424524 3424218 3252711 3266944 3441183
18472 3441183 3356971 3404462 3213997 3032291 2910195 2807202 2798641 2856783 2856630 2643235 2644688
18461 2644688 2461430 2366039 2453686 2651548 2673982 2317460 2190542 2329569 2300280 2198394
18451 2198394 2206330 2320401 2517836 2573336 2628321 2764986 2765813 2889356 3065845 3067784 2955869
$$ packed form
18521A2813605n40386k27240l94621o17718m69308m45175k21474k39325j19465
18512I538893k24558l03318k05407j68210l10053m41622k25514p4516j62097l37761
18502G085837k20787m9664n1092l03809k50633m5875k58178m2777j23176r9240
18492E640606q1409r8982l20098m16417j68458j32001k85317L135K95792J69672
18482D606523j20664k14482k57760q2371k47056k59666l06j71507J4233J74239
18472C441183q4212M7491j90465j81706j22096j02993q561N8142j53k13395J453
18461B644688j83258r5391Q7647J97862K2434l56522j26918J39027k9289j01886
18451B198394P936J14071J97435N5500N4985J36665Q27J23543J76489J939j11915
$$ plain form
18440 2955869 3034457 2801736 2902051 3119667 3332311 3343403 2822405 2494170 2392640 2539001
18430 2539001 2905735 3272141 3145514 2720767 2659258 2599491 2297180 2313921 2255419 2236584
18420 2236584 2148915 2038205 1866703 1638502 1358615 1148041 1141851 1474833 1679059 1330787
18410 1330787 913988 1034638 944673 901130 993913 1244598 1380964 1414379 1351319 1354749 1356131
18399 1356131 1286666 1207619 1157745 1078686 1096931 1069828 1028974 1317446 1519785 1729970 1832030
18388 1832030 1901571 2060012 2164444 2278530 2294889 2186082 1960108 1926284 2281686 2374342
18378 2374342 2007401 1619069 1513474 1406914 1227106 1285673 1058689 960776 874216 817251
18368 817251 983555 1059887 1145504 1143054 986750 930769 1087121 1043267 1048640 876661 955847
$$ packed form
18440B955869P8588k32721J00315K17616K12644J1092n20998l28235j01530J46361
18430B539001L66734L66406j26627m24747o1509n9767l02311J6741n8502j8835
18420B236584q7669j10710j71502k28201k79887k10574o190L32982K04226l48272
18410A330787m16799J20650q9965m3543R2783K50685J36366L3415o3060L430J382
18399A356131o9465p9047m9874p9059J8245k7103m0854K88472K02339K10185J02060
18388A832030O9541J58441J04432J14086J6359j08807k25974l3824L55402R2656
18378B374342l66941l88332j05595j06560j79808N8567k26984r7913q6560n6965
18368H17251J66304P6332Q5617k450j56304n5981J56352m3854N373j71979P9186
$$ plain form
18357 955847 871884 687297 786257 792803 797881 993733 1050033 892518 1140697 1210651 1191654
18346 1191654 1173924 1183409 1506682 1663828 1631509 1492792 1417493 1543327 1897278 2141049
18336 2141049 2573456 2951808 3101777 3144657 3078294 3150112 3316409 3182103 2780988 2371773
18326 2371773 2224083 2203174 2088434 1807190 1501482 1558251 1728455 1878618 1884637 1934388
18316 1934388 1883166 1807481 1870496 1905753 1840176 1742545 1743900 1737240 1769661 1936911 1963230
18305 1963230 1897240 1826172 1672953 1614016 1987876 2363266 2545659 2731305 2759962 2951846
18295 2951846 3412930 3619383 3808385 3878333 3843025 3949582 4181945 4228129 4410922 4823981
18285 4823981 4974828 5573191 6539321 7244193 7920586 8569909 9380346 10091932 11171149
$$ packed form
18357I55847q3963j84587R8960O546N078J95852N6300j57515K48179O9954j8997
18346A191654j7730R485L23273J57146l2319j38717p5299J25834L53951K43771
18336B141049M32407L78352J49969M2880o6363P1818J66297j34306m01115m09215
18326B371773j47690k0909j14740k81244l05708N6769J70204J50163O019M9751
18316A934388n1222p5685O3015L5257o5577r7631J355o660L2421J67250K6319
18305A963230o5990p1068j53219n8937L73860L75390J82393J85646K8657J91884
18295B951846M61084K06453J89002O9948l5308J06557K32363M6184J82793M13059
18285D823981J50847N98363R66130P04872O76393O49323Q10437P11586J079217
$$ plain form
18276 11171149 12605449 14487771 17061251 20745050 25708293 32940902 44031522 60239535
18268 60239535 82383102 107117512 129229652 146140864 158679677 169617064 177168991
18261 177168991 175014616 160562676 138717406 120397461 114162542 120710147 135100462
18254 135100462 149962168 161411665 168752569 174408742 178003409 172416707 154034426
18247 154034426 126362885 97965466 76150561 61977757 53234955 47303423 42639977
18240 42639977 38703030 35767872 33266589 31518818 30029482 28558904 27605446 27057523
18232 27057523 26514114 26012134 25572003 24946821 24165972 23837296 23628637 23510906 23567826
18223 23567826 23610317 23841395 24722559 26032117 27954745 31162644 36146590 43416413 54654543
$$ packed form
18276A1171149J434300J882322K573480L683799M963243P232609J1090620J6208013
18268F0239535K2143567K4734410K2112140J6911212J2538813J0937387P551927
18261A77168991k154375j4451940k1845270j8319945o234919O547605J4390315
18254A35100462J4861706J1449497P340904N656173L594667n586702j8382281
18247A54034426k7671541k8397419k1814905j4172804q742802n931532m663446
18240D2639977l936947k935158k501283j747771j489336j470578r53458n47923
18232B7057523n43409n01980m40131o25182p80849l28676k08659j17731N6920
18223B3567826M2491K31078Q81164J309558J922628L207899M983946P269823J1238130
$$ plain form
18214 54654543 70377139 88442738 104672043 116895403 125563778 132935356 138980578
18207 138980578 137791757 127418411 111110579 96614150 91048613 95522033 106042732
18200 106042732 117001866 125389752 131057249 135397247 138142569 134552505 121063825 100028021
18192 100028021 77926168 60872754 49690216 42728898 37924760 34178705 31297723
18185 31297723 28862382 27140272 25529493 24330142 23102400 21879203 20939321 20425452
18177 20425452 19606487 18765215 18104878 17437657 16574724 15681624 14845385 14275766 13682986
18168 13682986 12963157 12499768 12050640 12003651 11657638 11291407 10988580 10636576 10079125
18159 10079125 9523660 9290550 9065996 8387829 8048673 8020568 7911425 7720578 7569448
$$ packed form
18214E4654543J5722596J8065599J6229305J2223360Q668375P371578O045222
18207A38980578j188821j0373346j6307832j4496429n565537M473420J0520699
18200A06042732J0959134Q387886N667497M339998K745322l590064j3488680k1035804
18192A00028021k2101853j7053414j1182538o961318m804138l746055k880982
18185C1297723k435341j722110j610779j199351j227742j223197r39882n13869
18177B0425452q18965q41272o60337o67221q62933q93100q36239n69619n92780
18168A3682986p19829m63389m49128m6989l46013l66231l02827l52004n57451
18159A0079125n55465k33110k24554o78167l39156k8105j09143j90847j51130
$$ plain form
18150 7569448 7394334 7005094 6601290 6577308 6358945 6258129 6114287 5965968 5929919 5673163
18140 5673163 5642653 5373948 5089372 4850129 4715003 4734380 5021367 4951681 4688163 4753517
18130 4753517 5038781 5121080 4994015 4771036 4740573 4357776 4376246 4742559 5071061 5206248
18120 5206248 5066549 5175339 5056811 4859612 4472039 4236266 4043987 3981550 3861050 3758782
18110 3758782 3949808 3696741 3583170 3748846 4092872 3904166 3741678 3609582 3209059
18101 3209059 3091837 2944729 2667698 2360797 2595016 2796800 2765330 2660090 2830622 3004946
18091 3004946 3031915 2991230 3091448 3312509 3134733 2862167 2536633 2381370 2277383 2228649
18081 2228649 2255985 2060309 1716082 1595018 1496329 1428887 1500176 1425893 1862780 2053878
$$ packed form
18150G569448j75114l89240m03804k3982k18363j00816j43842j48319l6049k56756
18140E673163l0510k68705k84576k39243j35126J9377K86987o9686k63518O5354
18130D753517K85264Q2299j27065k22979l0463l82797J8470L66313L28502J35187
18120E206248j39699J08790j18528j97199l87573k35773j92279o2437j20500j02268
18110C758782J91026k53067j13571J65676L44026j88706j62488j32096m00523
18101C209059j17222j47108k77031l06901K34219K01784l1470j05240J70532J74324
18091C004946K6969m0685J00218K21061j77776k72566l25534j55263j03987m8734
18081B228649K7336j95676l44227j21064r8689o7442P1289p4283M36887J91098
$$ plain form
18071 2053878 2113965 2129906 2195902 2331027 2336540 2326994 2306625 2240538 2156812 2139563 1990613
18060 1990613 1686662 1640835 1636741 1800098 1931508 1857151 1760944 1758001 1892054 1898181 1628466
18049 1628466 1365267 1239909 1065513 1028954 1107958 842305 981550 1171608 1124738 1060820
18039 1060820 1143819 1124095 1175568 1362918 1469425 1536315 1847198 2173371 1871868 1321352
18029 1321352 1092859 1120148 1225029 1051844 995134 934407 1182832 1240407 1324636 1281769
18019 1281769 1070425 887875 700467 800688 797224 876579 909993 1076612 1190116 894309
18009 894309 579070 638949 652535 384900 426357 409289 696302 728673 533233 530967 417932
17998 417932 333538 364226 299350 382838 406408 161322 11373 94059 81140 100605 95647
$$ packed form
18071B053878O0087J5941O5996J35125N513r546k0369o6087q3726j7249j48950
18060A990613l03951m5827m094J63357J31410p4357r6207k943J34053O127k69715
18049A628466k63199j25358j74396l6559P9004k65653J39245J90058m6870o3918
18039A060820Q2999j9724N1473J87350J06507O6890L10883L26173l01503n50516
18029A321352k28493K7289J04881j73185n6710o0727K48425N7575Q4229m2867
18019A281769k11344j82550j87408J00221l464P9355L3414J66619J13504k95807
18009H94309l15239N9879J3586k67635M1457j7068K87013L2371j95440k266j13035
17998D17932q4394L0688o4876Q3488K3570k45086j49949Q2686j2919J9465m958
$$ plain form
17987 95647 58016 260132 229370 42613 54217 237199 41691 -133997 -169655 -94964 50327
17976 50327 382520 638689 563916 322062 219334 -110490 -19718 120287 77104 107928
17966 107928 337804 375608 173644 115741 318575 310908 187432 25349 29911 236101 419605
17955 419605 592035 694149 556755 119466 46740 -59857 13571 158262 304176 475019
17945 475019 399500 270417 72925 -19828 30517 220341 381471 417298 368254 335506 332265
17934 332265 494827 676840 716578 742606 532648 429021 563496 240469 72547 149698
17924 149698 81077 233433 256720 11369 -120240 7507 80837 243198 250547 235315 242752
17913 242752 61730 -42331 53908 244074 194815 350521 559439 596922 489432 455392
$$ packed form
17987I5647l7631K02116l0762j86757J1604J82982j95508j75688l5658P4691J45291
17976E0327L32193K56169p4773k41854j02728l29824R0772J40005m3183L0824
17966A07928K29876L7804k01964n7903K02834p667j23476j62083M562K06190J83504
17955D19605J72430J02114j37394m37289p2726j06597P3428J44691J45914J70843
17945D75019p5519j29083j97492r2753N0345J89824J61130L5827m9044l2748l241
17934C32265J62562J82013L9738K6028k09958j03627J34475l23027j67922P7151
17924A49698o8621J52356K3287k45351j31609J27747P3330J62361P349j5232P437
17913B42752j81022j04061R6239J90166m9259J55706K08918L7483j07490l4040
$$ plain form
17903 455392 600785 353827 523940 583063 591855 444343 419502 354492 332757 357196 241406
17892 241406 172284 28654 328108 335827 82512 -111767 28919 199297 234258 209802
17882 209802 159959 203729 58834 -141863 -124602 112143 29002 -104947 -18609 -122106
17872 -122106 -281305 -263864 -345446 -386945 -120815 1489 -70825 47885 296100 458657
17862 458657 330041 94682 -134238 -212673 42232 90900 92579 243176 251126 161947 143120
17851 143120 117617 -51805 57402 285275 122151 71806 312039 250170 -29285 -123777
17841 -123777 -93080 90939 69480 -82469 51387 23666 13990 61550 243264 45365 -78358
17830 -78358 -340572 -147108 63469 -21685 -172169 -334463 -395359 -442825 -627622 -530483
$$ packed form
17903D55392J45393k46958J70113N9123Q792j47512k4841o5010k1735K4439j15790
17892B41406o9122j43630K99454P719k53315j94279J40686J70378L4961k4456
17882B09802m9843M3770j44895k00697J7261K36745q3141j33949Q6338j03497
17872a22106j59199J7441q1582m1499K66130J22304p2314J18710K48215J62557
17862D58657j28616k35359k28920p8435K54905M8668J679J50597P950q9179j8827
17851A43120k5503j69422J09207K27873j63124n0345K40233o1869k79455r4492
17841a23777L0697J84019k1459j51949J33856k7721r676M7560J81714j97899j23723
17830g8358k62214J93464K10577q5154j50484j62294o0896m7466j84797R7139
$$ plain form
17820 -530483 -270776 -173811 -262486 -161741 -145349 -268376 -205866 -231577 -187694 -219251 -226623
17809 -226623 -312149 -56810 73030 -45239 -236882 -264970 -151481 -24931 -36247 -184869
17799 -184869 -272076 -194461 205513 230604 352329 260896 114025 421266 488050 397412 155312
17788 155312 -11952 359099 296541 87738 131129 179950 419105 360899 -159873 -129507
17778 -129507 -26636 131134 -17832 211584 554726 426633 247786 201401 259274 125629
17768 125629 -58039 20771 46679 73413 33483 -24455 -55042 226462 290301 54872 -33423
17757 -33423 -4581 -117080 -322001 -355547 -159503 -170014 -119398 2376 149142 176294 513590
17746 513590 546587 331510 381483 235517 59845 231734 430898 525574 672088 665381
$$ packed form
17820e30483K59707R6965q8675J00745J6392j23027O2510k5711M3883l1557p372
17809b26623q5526K55339J29840j18269j91643k8088J13489J26550j1316j48622
17799a84869q7207P7615L99974K5091J21725r1433j46871L07241O6784r0638k42100
17788A55312j67264L71051o2558k08803M3391M8821K39155n8206n20772L0366
17778a29507J02871J57770j48966K29416L43142j28093j78847m6385N7873j33645
17768A25629j83668P8810K5908K6734l9930n7938l0587K81504O3839k35429q8295
17757c3423K8842j12499k04921l3546J96044j0511N0616J21774J46766K7152L37296
17746E13590L2997k15077M9973j45966j75672J71889J99164R4676J46514o707
$$ plain form
17736 665381 616954 724225 858655 962390 1158718 1224039 773956 526149 376082 445355
17726 445355 707234 862136 896381 913533 929354 1101917 831614 517449 210842 -55460
17716 -55460 -29 12605 54934 261321 154699 130346 137071 163094 115332 54807 36577
17705 36577 139528 389896 765583 708198 359113 416717 541166 426514 348860 202227
17695 202227 114516 70970 -68540 23797 150211 90538 -67310 74292 371614 337052
17685 337052 412559 762922 852603 641180 625341 720670 677327 495602 488387 714738 768949
17674 768949 900789 880532 606912 639343 842620 822328 1021026 1092664 979698 745746
17664 745746 558539 289984 88503 130715 223703 164068 204207 559813 609533 587275 403523
$$ packed form
17736F65381m8427J07271J34430J03735J96328O5321m50083k47807j50067O9273
17726D45355K61879J54902L4245J7152J5821J72563k70303l14165l06607k66302
17716e5460N5431J2634M2329K06387j06622k4353O725K6023m7762o0525j8230
17705C6577J02951K50368L75687n7385l49085N7604J24449j14652p7654j46633
17695B02227q7711m3546j39510R2337J26414n9673j57848J41602K97322l4562
17685C37052P5507L50363Q9681k11423j5839R5329m3343j81725p215K26351N4211
17674G68949J31840k0257k73620L2431K03277k0292J98698P1638j12966k33952
17664G45746j87207k68555k01481M2212R2988n9635M0139L55606M9720k2258j83752
$$ plain form
17653 403523 174492 185217 518096 424889 -6740 -57249 27636 94834 151150 235934 336721
17642 336721 244872 126571 148742 121912 22734 103356 548493 295163 -63903 -208098
17632 -208098 261752 449609 328299 150970 132886 333297 276309 -32778 -217322 24233
17622 24233 262315 266650 120452 -22405 -156972 -198910 -49657 4060 -230422 -398778
17612 -398778 -92083 49489 230998 134645 -34390 -298939 -232369 -127046 -5269 150278
17602 150278 -23382 -247747 -325877 -354057 -280412 -29077 27388 140204 88465 172585 133767
17591 133767 239956 34302 -83060 73479 217194 173859 132910 -22835 -16810 84644
17581 84644 42768 -66191 -87282 -190658 -162395 6447 62930 33320 2090 -197365 -247476
$$ packed form
17653D03523k29031J0725L32879r3207m31629n0509Q4885O7198N6316Q4784J00787
17642C36721r1849j18301K2171k6830r9178Q0622M45137k53330l59066j44195
17632b08098M69850J87857j21310j77329j8084K00411n6988l09087j84544K41555
17622B4233K38082M335j46198j42857j34567m1938J49253N3717k34482j68356
17612c98778L06695J41572J81509r6353j69035k64549O6570J05323J21777J55547
17602A50278j73660k24365p8130k8180P3645K51335N6465J12816n1739Q4120l8818
17591A33767J06189k05654j17362J56539J43715m3335m0949j55745O025J01454
17581H4644m1876j08959k1091j03376K8263J68842N6483k9610l1230j99455n0111
$$ plain form
17570 -247476 -254094 -116464 -97114 16395 105909 52973 121692 159116 50995 -237625 28304
17559 28304 194728 212642 186135 -53329 -304282 -262408 -12386 134700 -44378 -29573
17549 -29573 -187863 -302998 -298995 -203662 -119852 43966 188245 199375 -34446 -141995 -205466
17538 -205466 -150066 37568 10908 -160997 -20818 185037 27751 22890 32715 962 218419
17527 218419 -28078 -90468 -124439 -55216 75624 79905 -173952 -191986 6116 101734 77335
17516 77335 -37565 115857 237158 233298 35945 -167418 -92889 141223 334475 275600
17506 275600 -14740 -245792 -339343 -314189 -330395 -445478 -296656 -223258 -183358 -30731
17496 -30731 -103667 -297152 -354935 -315973 -334075 -405222 -167948 168461 256400 105480 -14370
$$ packed form
17570b47476o618J37630J9350J13509Q9514n2936O8719L7424j08121k88620K65929
17559B8304J66424J7914k6507k39464k50953M1874K50022J47086j79078J4805
17549b9573j58290j15135M003R5333Q3810J63818J44279J1130k33821j07549o3471
17538b05466N5400J87634k6660j71905J40179K05855j57286m861R825l1753K17457
17527B18419k46497o2390l3971O9223J30840M281k53857j8034J98102R5618k4399
17516G7335j14900J53422J21301l860j97353k03363P4529K34112J93252n8875
17506B75600k90340k31052r3551K5154j6206j15083J48822P3398L9900J52627
17496c0731p2936j93485n7783L8962j8102p1147K37274L36409Q7939j50920j19850
$$ plain form
17485 -14370 203716 8375 -184569 -161521 -373917 -395786 -312202 -243832 -107017 19173
17475 19173 -9049 -46964 -51281 34752 41470 134800 182733 -81218 -218739 -136159 -170781 -389484
17463 -389484 -407020 -296293 -411207 -364616 -380766 -225556 12821 166678 -32050 -301395
17453 -301395 -353885 -445953 -406721 -217325 109662 137455 26856 -76728 -226668 -171233
17443 -171233 -149065 -127747 -183170 -145570 -425117 -479320 -434668 -486083 -243153 -188946 11375
17432 11375 -27494 -130738 -144735 -169594 34725 135646 -33651 -244770 -136648 93650
17422 93650 240521 294748 305339 316332 276580 354624 179232 219273 196422 -115466 -144298
17411 -144298 -207856 -155502 106286 214703 44859 -146129 -260986 80654 327318 147125
$$ packed form
17485a4370K18086j95341j92944K3048k12396k1869Q3584O8370J36815J26190
17475A9173k8222l7915m317Q6033O718R3330M7933k63951j37521Q2580l4622k18703
17463c89484j7536J10727j14914M6591j6150J55210K38377J53857j98728k69345
17453c01395n2490r2068L9232J89396L26987K7793j10599j03584j49940N5435
17443a71233K2168K1318n5423L7600k79547n4203M4652n1415K42930N4207K00321
17432A1375l8869j03244j3997k4859K04319J00921j69297k11119J08122K30298
17422I3650J46871N4227J0591J0993l9752P8044j75392M0041k2851l11888k8832
17411a44298o3558N2354K61788J08417j69844j90988j14857L41640K46664j80193
$$ plain form
17401 147125 41298 251659 202300 -26825 1873 -101741 -110645 65071 -38017 -80033
17391 -80033 -11737 -35614 -88990 -130112 13509 -28704 -213517 -392107 -440237 -519755 -519003
17380 -519003 -356020 -100262 -101864 -97993 67710 175679 306057 248186 70787 103 -79650
17369 -79650 83515 112156 83339 -224185 -210876 -238274 -221624 -264776 -294921 -145566 -16808
17358 -16808 -43544 -50371 110290 107917 312142 372138 346681 36708 25992 -96458 -182870
17347 -182870 127440 207158 220235 155445 107907 108108 82102 -115033 -205760 -298303 -203479
17336 -203479 -56094 157125 86117 -88363 -318093 -441794 -452657 -302190 -150662 -245894
17326 -245894 -185023 -368753 -297911 -119127 20343 30120 129338 193729 397937 442804 363137
$$ packed form
17401A47125j05827K10361m9359k29125K8698j03614q904J75716j03088m2016
17391h0033O8296k3877n3376m1122J43621m2213j84813j78590m8130p9518P52
17380e19003J62983K55758j602L871J65703J07969J30378n7871j77399p0684p9753
17369g9650J63165K8641k8817l07524J3309k7398J6650m3152l0145J49355J28758
17358a6808k6736o827J60661k373K04225N9996k5457l09973j0716j22450q6412
17347a82870L10310P9718J3077o4790m7538K01k6006j97135r0727r2543R4824
17336b03479J47385K13219p1008j74480k29730j23701j0863J50467J51528r5232
17326b45894O0871j83730P0842J78784J39470R777R9218O4391K04208M4867p9667
$$ plain form
17315 363137 458814 234058 115000 402018 413761 445723 244120 50585 192703 151475
17305 151475 99049 136870 995 30058 323859 403574 128124 142021 53857 -65566 -105614
17294 -105614 -205510 -197021 101569 70315 3801 -35787 -330666 -381070 -275386 -155475 -235840
17283 -235840 -79020 201543 227725 157148 -288 -50074 132549 142373 21362 289051
17273 289051 277687 69330 -7435 -98496 41253 -17065 -70408 -36168 220664 353113 313529
17262 313529 204142 223877 49115 55983 167144 282478 244671 28380 -72061 -25954
17252 -25954 -65622 33706 -171031 -119213 -125428 -21216 -32398 -261680 -132716 -129288 -84882
17241 -84882 215966 463842 579863 270170 19094 100398 125425 247317 215429 100976
$$ packed form
17315C63137R5677k24756j19058K87018J1743L1962k01603j93535J42118m1228
17305A51475n2426L7821j35875K9063K93801P9715k75450J3897q8164j19423m0048
17294a05614r9896Q489K98590l1254o6514l9588k94879n0404J05684J19911q0365
17283b35840J56820K80563K6182p0577j57436m9786J82623R824j21011K67689
17273B89051j1364k08357p6765r1061J39749n8318n3343L4240K56832J32449l9584
17262C13529j09387J9735j74762O868J11161J15334l7807k16291j00441M6107
17252b5954l9668R9328k04737N1818o215J04212j1182k29282J28964L428M4406
17241h4882L00848K47876J16021l09693k51076Q1304K5027J21892l1888j14453
$$ plain form
17231 100976 -45884 -102489 -144344 -223660 -16354 107279 19133 74259 111982 123775 55627
17220 55627 5311 113284 223323 215397 67685 -81887 -217991 -101531 63600 -82795
17210 -82795 -206713 -123004 -179674 -9531 147745 99274 63647 -71829 -133508 -47633 -102161
17199 -102161 -109826 -17270 269473 343672 300616 -35315 -123615 144112 232927 225781 266447
17188 266447 197683 140851 -2546 -159007 12843 180367 -119804 -83737 -109087 21682
17178 21682 83307 184507 167218 73055 16266 128718 145698 214852 26113 -214905 -289149
17167 -289149 -170033 -222646 -394336 -527533 -363767 -304549 -241686 -224771 -233015 -214456 -75501
17156 -75501 218 -49891 -48333 30931 -4728 -34803 -163958 -319134 -433699 -414936 -296750
$$ packed form
17231A00976j46860n6605m1855p9316K07306J23633q8146N5126L7723J1793o8148
17220E5627n0316J07973J10039p926j47712j49572j36104J16460J65131j46395
17210h2795j23918Q3709n6670J70143J57276m8471l5627j35476o1679Q5875n4528
17199a02161p665R2556K86743P4199m3056l35931q8300K67727Q8815p146M0666
17188B66447o8764n6832j43397j56461J71850J67524l00171L6067k5350J30769
17178B1682O1625J01200j7289r4163n6789J12452J6980O9154j88739k41018p4244
17167b89149J19116n2613j71690j33197J63766N9218O2863J6915q244J8559J38955
17156g5501P5719n0109J558P9264l5659l0075j29155j55176j14565J8763J18186
$$ plain form
17145 -296750 -75473 -56115 114922 262851 111763 -10675 -304647 -281020 -290741 -29579
17135 -29579 130840 272070 486778 291753 363299 406526 312896 269320 109256 61358 -75539
17124 -75539 88229 408064 341423 41436 -20392 15902 181358 194822 -33251 99961
17114 99961 273432 170465 383871 389159 366400 452653 203696 -36051 -126251 -167489 -64710
17103 -64710 70713 197260 271031 144915 18889 -206741 -249998 -308248 -424719 -480427
17093 -480427 -273996 -264124 -97610 57493 263266 180565 211254 324142 223327 297684
17083 297684 313796 144938 3539 -171137 -299389 -207372 -240469 -134738 75031 -46898
17073 -46898 -21964 293797 250889 -34700 -67137 -151821 -90221 -230568 -233795 -255622 -418689
$$ packed form
17145b96750K21277J9358J71037J47929j51088j22438k93972K3627r721K61162
17135b9579J60419J41230K14708j95025P1546M3227r3630m3576j60064m7898j36897
17124g5539J63768L19835o6641k99987o1828L6294J65456J3464k28073J33212
17114I9961J73471j02967K13406N288k2759Q6253k48957k39747r0200m1238J02779
17103f4710J35423J26547P3771j26116j26026k25630m3257n8250j16471n5708
17093d80427K06431R872J66514J55103K05773q2701L0689J12888j00815P4357
17083B97684J6112j68858j41399j74676j28252R2017l3097J05731K09769j21929
17073d6898K4934L15761m2908k85589l2437q4684O1600j40347l227k1827j63067
$$ plain form
17062 -418689 -497565 -578596 -787037 -683951 -336258 -42460 -74207 -289996 -372713 -182263
17052 -182263 -253548 -355563 36232 -103446 -345481 -381174 -224877 -100254 33935 35706
17042 35706 -57188 -190528 -159490 -100161 -181103 -134041 -101969 -207938 -109565 -44322 127519
17031 127519 14375 -96238 -13512 -33557 -149682 -151216 -32943 -58162 -116114 65458 42475
17020 42475 -110446 -109512 -136521 -83605 -44643 -197671 -353327 -307195 -16921 167500 145889
17009 145889 79507 136981 212870 59114 -8863 89735 180783 243565 366803 298191 251526
16998 251526 293386 53001 -124443 -6519 206826 50582 -192830 -166692 -233435 -220850
16988 -220850 -51411 15756 43303 9676 -196116 -89787 123990 135831 76829 -46186
$$ packed form
17062d18689p8876q1031k08441J03086L47693K93798l1747k15789q2717J90450
17052a82263p1285j02015L91795j39678k42035l5693J56297J24623J34189J771
17042C5706r2894j33340L1038N9329q0942M7062L2072j05969R8373O5243J71841
17031A27519j13144j10613Q2726k0045j16125j534J18273k5219n7952J81572k2983
17020D2475j52921R34k7009N2916L8962j53028j55656M6132K90274J84421k1611
17009A45889o6382N7474P5889j53756o7977R8598R1048O2782J23238o8612m6665
16998B51526M1860k40385j77444J17924K13345j56244k43412K6138o6743J2585
16988b20850J69439O7167K7547l3627k05792J06329K13777J1841n9002j23015
$$ plain form
16978 -46186 -1204 -15880 -321876 -469496 -205800 -201260 -341922 -84440 -110140 193158 343503
16967 343503 130936 -145784 -132516 2918 -23150 -274066 -367896 -338655 -430197 -363617 -81929
16956 -81929 95732 32325 22142 145066 45486 -200112 -204194 -17872 -82810 -222211 13326
16945 13326 240011 254584 93987 98622 57493 54202 33376 -88143 -81194 -47644 50132 45959
16933 45959 -171264 -373148 -439430 -173168 -127221 -33311 189119 340914 96376 -69177
16923 -69177 -31786 207736 207726 185706 154459 140726 150945 -138817 -235292 -110747 -274484
16912 -274484 -250045 -98440 67911 407447 242411 259427 175665 27661 -89092 41909
16902 41909 276611 331107 241149 165583 -34884 -251994 -47911 -160841 -274960 -165579
$$ packed form
16978d6186M4982j4676l05996j47620K63696M540j40662K57482k5700L03298J50345
16967C43503k12567k76720J3268J35434k6068k50916r3830K9241r1542O6580K81688
16956h1929J77661o3407j0183J22924r9580k45598m082J86322o4938j39401K35537
16945A3326K26685J4573j60597M635m1129l291k0826j21519O949L3550R7776m173
16933D5959k17223k01884o6282K66262M5947R3910K22430J51795k44538j65553
16923f9177L7391K39522j0k2020l1247j3733J0219k89762r6475J24545j63737
16912b74484K4439J51605J66351L39536j65036J7016q3762j48004j16753J31001
16902D1909K34702N4496q9958p5566k00467k17110K04083j12930j14119J09381
$$ plain form
16892 -165579 64404 -6538 -56364 -67217 -152988 -207508 -165531 -162430 -263625 -87011 85134
16881 85134 181570 103468 -80759 -6102 -49166 59774 -54810 -125384 -205319 -257681 -216302
16870 -216302 -90695 23304 112706 59765 -951 36314 -164998 -247656 -154758 -131719 -252258
16859 -252258 -79075 75296 -36693 -104786 -21941 44559 258102 429829 283160 134718
16849 134718 -235442 -337055 -304016 -467062 -415977 -166738 -82849 -224811 -16909 129064
16839 129064 247106 313801 44058 -102426 -118191 -106507 -218521 -147872 1906 53114
16829 53114 385639 478034 351106 382579 297987 334950 104907 60257 -136168 -259656 -197763
16818 -197763 -173879 -413663 -351600 -279069 -251615 -89805 -7144 64853 54323 -212685 -356314
$$ packed form
16892a65579K29983p0942m9826j0853q5771n4520M1977L101j01195J76614J72145
16881H5134R6436p8102j84227P4657m3064J08940j14584p0574p9935n2362M1379
16870b16302J25607J13999Q9402n2941o0716L7265k01312q2658R2898K3039j20539
16859b52258J73183J54371j11989o8093Q2845O6500K13543J71727j46669j48442
16849A34718l70160j01613L3039j63046N1085K49239Q3889j41962K07902J45973
16839A29064J18042O6695k69743j46484j5765J1684j12014P0649J49778N1208
16829E3114L32525R2395j26928L1473q4592L6963k30043m4650j96425j23488O1893
16818a97763K3884k39784O2063P2531K7454J61810Q2661P1997j0530k67008j43629
$$ plain form
16807 -356314 -361273 -332716 -361471 -455928 -466106 -163453 -276581 -394627 -36687 366427 294927
16796 294927 49680 -54038 24638 1711 -90843 207982 326382 -183062 -240660 -240223 -297560
16785 -297560 -446671 -276725 -318895 -329698 -370792 -491294 -210092 -91639 -40847 -130864
16775 -130864 -284254 -202404 -185766 -226351 -114776 -194521 -301674 -126568 -63233 -10819 47556
16764 47556 -190635 -453650 -465838 -297248 -295859 -202659 -55073 36603 279105 387710 206664
16753 206664 312537 139563 165813 188777 -11799 -152770 741 52554 331784 318538
16743 318538 176640 27813 -208298 -222242 -198456 -330677 -299730 -347154 -333673 -453007
16733 -453007 -274053 -305283 -336439 -25685 94495 65191 136529 -35237 -254677 -378709
$$ packed form
16807c56314m959K8557k8755r4457j0178L02653j13128j18046L57940M03114p1500
16796B94927k45247j03718P8676k2927r2554K98825J18400n09444n7598M37n7337
16785b97560j49111J69946m2170j0803m1094j20502K81202J18453N0792r0017
16775a30864j53390Q1850J6638m0585J11575p9745j07153J75106O3335N2414N8375
16764D7556k38191k63015j2188J68590J389R3200J47586R1676K42502J08605j81046
16753B06664J05873j72974K6250K2964k00576j40971J53511N1813K79230j3246
16743C18538j41898j48827k36111j3944K3786j32221L0947m7424J3481j19334
16733d53007J78954l1230l1156L10754J20180k9304P1338j71766k19440j24032
$$ plain form
16723 -378709 -305819 -32844 100872 10518 179525 9144 32092 218867 34440 -145306
16713 -145306 -342796 -130950 -93814 -169685 -433793 -279076 -141940 25913 389609 333013
16703 333013 141601 56186 -21 -205539 -109567 -108900 -254525 -338645 -345760 -305183 -518031
16692 -518031 -261150 -952 102058 78557 20494 12010 -81035 -90387 35954 -119036 -218546
16681 -218546 -169574 23451 146732 -114627 -77161 201845 340179 350264 -4859 -185657
16671 -185657 -377880 -348086 -306327 -278647 -377616 -332902 -281161 -285012 -327416 -193215 1408
16660 1408 66084 -159569 -273038 -353663 -365577 -267836 -297 6952 -212613 -307380 -284998
16649 -284998 -167524 -62473 -124600 16390 110621 -13691 -191246 -71333 147847 92778
$$ packed form
16723c78709P2890K72975J33716r0354J69007j70381K2948J86775j84427j79746
16713a45306j97490K11846L7136p5871k64108J54717J37136J67853L63696n6596
16703C33013j91412q5415n6207k05518R5972O67j45625q4120p115M0577k12848
16692e18031K56881K60198J03010k3501n8063q484r3045r352J26341j54990r9510
16681b18546M8972J93025J23281k61359L7466K79006J38334J0085l55123j80798
16671a85657j92223K9794M1759K7680r8969M4714N1741l851m2404J34201J94623
16660A408O4676k25653j13469q0625j1914R7741K67539P249k19565r4767K2382
16649b84998J17474J05051o2127J40990R4231j24312j77555J19913K19180n5069
$$ plain form
16639 92778 198879 353423 385869 349212 258432 -25096 -206376 -129247 -174439 -263256 -207328
16628 -207328 -69487 113085 202789 271733 234854 428379 389662 219429 106018 -9944
16618 -9944 141083 57706 -5044 -72448 46132 -71105 -454879 -514009 -339028 -494529 -612234
16607 -612234 -452899 -160128 5878 65752 241197 225712 87392 66042 100292 100280 -50362
16596 -50362 96791 91879 189498 16681 76602 246806 163528 -57114 -213560 -319756 -188258
16585 -188258 -82434 -315267 -341577 -188304 -47310 -143055 -243902 -294299 -198040 84370
16575 84370 242880 571309 391965 170051 229231 183448 127676 201294 35929 -268435
16565 -268435 -302462 -369848 -151775 65414 99446 521874 533089 588898 484534 412821 253003
$$ packed form
16639I2778J06101J54544L2446l6657r0780k83528j81280P7129m5192q8817N5928
16628b07328J37841J82572Q9704O8944l6879J93525l8717j70233j13411j15962
16618i944J51027q3377o2750o7404J18580j17237l83774n9130J74981j55501j17705
16607f12234J59335K92771J66006N9874J75445j5485j38320k1350L4250j2j50642
16596e0362J47153m912R7619j72817N9921J70204q3278k20642j56446j06196J31498
16585a88258J05824k32833k6310J53273J40994r5745j00847n0397R6259K82410
16575H4370J58510L28429j79344k21914N9180m5783n5772P3618j65365l04364
16565b68435l4027o7386K18073K17189L4032M22428J1215N5809j04364p1713j59818
$$ plain form
16554 253003 183671 104600 17362 -353990 -404637 -563138 -559871 -578104 -282617 -242005 -212480
16543 -212480 -154330 -238841 -339849 -191881 240261 130287 -60533 -141624 -116434 -123189 -72764
16532 -72764 164116 230593 180539 116552 110738 99740 111594 236977 72890 -69790 56271
16521 56271 189493 112751 -25693 17902 36674 5613 125494 312484 140118 -109545
16511 -109545 -77771 -5722 2985 30705 48594 -4129 -78832 -333028 -608321 -642584 -334944
16500 -334944 -273288 -210851 -125262 -98610 113189 67387 -116764 -69766 35431 47564 -59932
16489 -59932 115279 149003 209180 302600 433701 239953 -120518 -335996 -370142 -252507
16479 -252507 15917 193462 105608 -139910 -197177 -482436 -508344 -403990 -360724 -265456
$$ packed form
16554B53003o9332p9071q7238l71352n0647j58501L267j8233K95487M0612K9525
16543b12480N8150q4511j01008J47968M32142j09974j90820q1091K5190o755N0425
16532g2764K36880O6477n0054o3987n814j0998J1854J25383j64087j42680J26061
16521E6271J33222p6742j38444M3595J8772l1061J19881J86990j72366k49663
16511a09545L1774P2049Q707K7720J7889n2723p4703k54196k75293l4263L07640
16500c34944O1656O2437Q5589K6652K11799m5802j84151M6998J05197J2133j07496
16489e9932J75211L3724O0177R3420J31101j93748l60471k15478l4146J17635
16479b52507K68424J77545q7854k45518n7267k85259k5908J04354M3266R5268
$$ plain form
16469 -265456 -179822 -123492 -44049 19844 193656 153695 -29165 43358 -180418 -186964 -354266
16458 -354266 -270347 51839 25281 134852 45494 -15107 133070 168630 -99520 -275486
16448 -275486 -370119 -264629 -258020 -127935 -48272 -88668 -266038 -71737 4538 139246 64966
16437 64966 76351 -54679 -59430 -10768 30369 -43551 -111818 -154045 -138875 -73715 -146649 -293562
16425 -293562 -136706 10787 6891 -67588 8480 313759 536629 515517 172202 10207
16415 10207 1204 60494 306368 287234 178690 84026 73125 312115 233790 112475 370880
16404 370880 291846 19180 62915 53792 -47546 42095 143104 160061 -17436 8353 -28577
16393 -28577 -185299 -117314 -166376 -308224 -450855 -468841 -252915 -256027 -85374 -48049 92
$$ packed form
16469b65456Q5634N6330P9443O3893J73812l9961j82860P2523k23776o546j67302
16458c54266Q3919L22186k6558J09571q9358o0601J48177L5560k68150j75966
16448b75486r4633J05490O609J30085P9663m0396j77370J94301P6275J34708p4280
16437F4966J1385j31030m751M8662M1137p3920o8267m2227J5170O5160p2934j46913
16425b93562J56856J47493l896p4479P6068L05279K22870k1112l43315j61995
16415A0207r003N9290K45874j9134j08544r4664j0901K38990p8325j21315K58405
16404C70880p9034k72666M3735r123j01338Q9641J01009J6957j77497K5789l6930
16393b8577j56722O7985m9062j41848j42631j7986K15926l112J70653L7325M8141
$$ plain form
16382 92 28477 67563 193350 246628 -57001 -81376 -45340 -273865 -266427 -249065 56863 174221
16370 174221 23248 -201427 -156855 -62601 -16769 73794 45895 -78519 -290039 -187145
16360 -187145 -206799 -109405 145696 310011 34043 -74785 -129847 107500 80102 -16319
16350 -16319 -29836 -100856 -68646 -57952 -168650 48650 -21898 89749 83747 -164981 -190070
16339 -190070 -46582 -5977 -26715 -4531 -110360 21890 -169789 -277243 -179489 -29512
16329 -29512 201190 262558 69825 -227091 -116402 -85880 -213534 -142460 -233895 -213199 -281560
16318 -281560 -576883 -229532 -115096 -128053 77861 210778 50870 -239002 -388085 -274351
16308 -274351 -441985 -471953 -171742 -119880 -147710 -210986 -101720 -54652 -15612 -192263 -57357
$$ packed form
16382I2K8385L9086J25787N3278l03629k4375L6036k28525P438J7362L05928J17358
16370A74221j50973k24675M4572R4254M5832R0563k7899j24414k11520J02894
16360a87145j9654R7394K55101J64315k75968j08828n5062K37347k7398r6421
16350a6319j3517p1020L2210J0694j10698K17300p0548J11647o002k48728k5089
16339a90070J43488M0605k0738K2184j05829J32250j91679j07454R7754J49977
16329b9512K30702O1368j92733k96916J10689L0522j27654P1074r1435K0696o8361
16318b81560k95323L47351J14436j2957K05914J32917j59908k89872j49083J13734
16308b74351j67634k9968L00211N1862k7830o3276J09266M7068L9040j76651J34906
$$ plain form
16297 -57357 -46803 -308873 -266410 -216331 -85748 -129406 -126431 -27173 163373 176654 279311
16286 279311 363759 432869 110124 -68639 44629 77481 171868 -55446 -521692 -605761
16276 -605761 -399087 -176142 -186515 -94251 -103562 -283801 -249088 -52922 41041 81666 161210
16265 161210 189839 -4031 -198242 -193431 36317 101223 132160 240222 98837 256755
16255 256755 305512 176802 99248 219563 44720 -57567 152578 -1843 142917 349899
16245 349899 340947 106549 15028 -21184 -74036 -78222 -191389 -192727 -65026 -86775 -139272
16234 -139272 -133744 130646 -114334 -540964 -619037 -403953 -147726 185442 260721 45585
16224 45585 19879 -69409 -105352 -237866 -464585 -474045 -171108 -71737 88203 -24072 -166607
$$ packed form
16297e7357J0554k62070M2463N0079J30583m3658K975R9258J90546J3281J02657
16286B79311Q4448O9110l22745j78763J13268L2852R4387k27314m66246q4069
16276f05761K06674K22945j0373R2264r311j80239L4713J96166R3963M0625P9544
16265A61210K8629j93870j94211M811K29748O4906L0937J08062j41385J57918
16255B56755M8757j28710p7554J20315j74843j02287K10145j54421J44760K06982
16245C49899q952k34398r1521l6212n2852m186j13167j338J27701k1749n2497
16234a39272N528K64390k44980m26630p8073K15084K56227L33168P5279k15136
16224D5585k5706q9288l5943j32514k26719r460L02937R9371J59940j12275j42535
$$ plain form
16213 -166607 -78917 35471 66621 17798 -24391 -156232 -258752 -537604 -464263 -344343
16203 -344343 -242578 -123932 -35515 5457 137536 -91391 -176532 -191465 -235591 -431887
16193 -431887 -414704 -424765 -573100 -505256 -431035 -206124 -93084 195603 134109 -116442
16183 -116442 -295017 -296464 -405456 -290405 -331819 -332774 -256588 -18107 -184108 -144476 -210170
16172 -210170 -285205 -64919 136656 85931 50021 -96332 -184767 -191868 -260913 -193247 22346
16161 22346 -115899 -93998 -48569 -126312 46164 122747 -13429 -205666 29987 205046
16151 205046 43147 -4581 241586 461210 358463 194390 -180710 -437294 -648147 -302829
16141 -302829 -115470 -80311 -14112 -114702 -49263 77567 -15795 17118 51630 -215406 -436839
$$ packed form
16213a66607Q7690J14388L1150m8823m2189j31841j02520k78852P3341J19920
16203c44343J01765J18646Q8417M0972J32079k28927q5141j4933m4126j96296
16193d31887J7183j0061j48335O7844P4221K24911J13040K88687o1494k50551
16183a16442j78575j447j08992J15051m1414r55P6186K38481j66001L9632o5694
16172b10170p5035K20286K01575n0725l5910j46353q8435p101o9045O7666K15593
16161B2346j38245K1901M5429p7743J72476P6583j36176j92237K35653J75059
16151B05046j61899m7728K46167K19624j02747j64073l75100k56584k10853L45318
16141c02829J87359L5159O6199j00590O5439J26830r3362L2913L4512k67036k21433
$$ plain form
16130 -436839 -308872 -189996 84022 313156 210863 174503 36254 121780 188780 57131
16120 57131 -71886 -46416 263359 30452 -97343 -74272 91050 168834 275470 246497
16110 246497 7516 -187254 -340743 -231872 -294745 -291576 -211054 40984 82614 -38166
16100 -38166 -8409 -123674 113258 229628 97204 -62802 -76981 -76607 220017 351172 103530
16089 103530 -230802 -200487 -166454 -184354 -259678 -211268 -153763 -2233 108798 157464 176776
16078 176776 39841 -4551 89816 -7940 -159455 -345801 10367 203378 31851 13839
16068 13839 81561 -39510 -229395 -323028 73140 355585 183735 -61684 -130463 -96238
16058 -96238 -145475 -179956 42607 161591 118444 81584 252723 143629 -43845 -149864
$$ packed form
16130d36839J27967J18876K74018K29134j02293l6360j38249Q5526O7000j31649
16120E7131j29017K5470L09775k32907j27795K3071J65322P7784J06636k8973
16110B46497k38981j94770j53489J08871o2873L169Q0522K52038M1630j20780
16100c8166K9757j15265K36932J16370j32424j60006j4179L74K96624J31155k47642
16089A03530l34332L0315L4033j7900p5324M8410N7505J51530J11031M8666J9312
16078A76776j36935m4392R4367r7756j51515j86346L56168J93011j71527j8012
16068A3839O7722j21071j89885r3633L96168K82445j71850k45419o8779L4225
16058i6238m9237l4481K22563J18984m3147l6860J71139j09094j87474j06019
$$ plain form
16048 -149864 -187627 -185522 -223914 805 108975 79147 -133172 10056 177415 179227 -41698
16037 -41698 -256516 82224 182961 262352 95241 -255520 -256120 -213092 -315588 -253250 -113187
16026 -113187 -103010 -183418 -162696 -227790 -291912 -215950 58362 107581 -34203 -168967 -182117
16015 -182117 -62224 156284 397266 202736 11177 -4729 123852 162076 108611 -128500
16005 -128500 74473 108914 217503 140842 -64130 229101 183394 99359 -77281 -166613
15995 -166613 -308630 -310290 -338286 -151138 30422 -239060 -296484 -219120 -186149 -390827 -562762
15984 -562762 -355056 -198053 -31875 -107772 -180966 -118321 -84079 -12808 -50831 -243858 -54341
15973 -54341 117152 193700 104038 -166899 -296338 -213278 -228707 -235248 -217497 -66006 -111219
$$ packed form
16048a49864l7763K105l8392K24719J08170k9828k12319J43228J67359J812k20925
16037d1698k14818L38740J00737P9391j67111l50761o00M3028j02496O2338J40063
16026a13187J0177q0408K0722o5094o4122P5962K74312M9219j41784j34764j3150
16015a82117J19893K18508K40982j94530j91559j5906J28581L8224n3465k37111
16005a28500K02973L4441J08589p6661k04972K93231m5707q4035j76640q9332
15995a66613j42017j660k7996J87148J81560k69482n7424P7364L2971k04678j71935
15984e62762K07706J57003J66178p5897p3194O2645L4242P1271l8023j93027J89517
15973e4341J71493P6548q9662k70937j29439Q3060j5429o541J7751J51491m5213
$$ plain form
15962 -111219 -223164 -414538 -287858 -211701 -99018 -13228 144943 81283 2883 -41188
15952 -41188 22148 -189080 -299774 -258653 -177833 52143 242813 237052 -63899 -96029 124505
15941 124505 -76175 -170954 -200947 -22560 59745 -102506 86168 145122 213525 170451 -67396
15930 -67396 -96835 63330 -38017 -398184 -260932 -211487 9894 -17205 -74670 -11389 -199879
15919 -199879 -45059 29021 -124632 -164809 -266488 -564360 -591979 -157921 77439 135785
15909 135785 20383 24146 31901 -213938 -395016 -241182 -348228 -267521 -174488 24305 126486
15898 126486 -293458 -302412 -104962 17319 -1944 -92272 -132683 -215989 -333741 -512552 -402387
15887 -402387 -320706 -248130 -363880 -339944 -82713 -87876 -296372 -326063 -82160 270918 141203
$$ packed form
15962a11219j11945j91374J26680P6157J12683Q5790J58171o3660p8400m4071
15952d1188O3336k11228j10694M1121Q0820K29976J90670n761l00951l2130K20534
15941A24505k00680r4779k9993J78387Q2305j62251J88674N8954O8403m3074k37847
15930f7396k9439J60165j01347l60167J37252M9445K21381k7099n7465O3281j88490
15919a99879J54820P4080j53653m0177j01679k97872k7619M34058K35360N8346
15909A35785j15402L763P755k45839j81078J53834j07046Q0707R3033J98793J02181
15898A26486m19944q954J97450J22281j9263r0328m0411q3306j17752j78811J10165
15887d02387Q1681P2576j15750K3936K57231n163k08496k9691K43903L53078j29715
$$ plain form
15876 141203 96567 129919 134148 186285 90837 51528 -154617 -90162 -107534 -115386 27704
15865 27704 300323 334189 28065 -63869 -55681 -46978 60770 102878 87569 65215 159960
15854 159960 293565 287735 86494 158498 217472 132056 47244 141956 303051 546083 628222
15843 628222 334173 158801 -35561 -37815 69219 98083 -56463 78552 245193 73853
15833 73853 -164829 -470604 -390573 16090 451019 423760 255412 188293 37272 -24082
15823 -24082 -223959 -397130 -295080 16987 50990 37503 73582 150554 164579 236499 95938
15812 95938 -308552 -263677 -39420 87715 175928 66444 -89434 -173271 -165513 -61484 -229856
15801 -229856 -406093 -231877 142671 244022 1723 -105431 -13200 198766 415813 145770
$$ packed form
15876A41203m4636L3352M229N2137r5448l9309k06145O4455j7372p852J43090
15865B7704K72619L3866l06124r1934Q188Q703J07748M2108j5309k2354R4745
15854A59960J33605n830k01241P2004N8974q5416q4812R4712J61095K43032Q2139
15843F28222k94049j75372j94362k254J07034K8864j54546J35015J66641j71340
15833G3853k38682l05775Q0031M06663M34929k7259j68348o7119j51021o1354
15823b4082j99877j73171J02050L12067L4003j3487L6079P6972J4025P1920j40561
15812I5938m04490M4875K24257J27135Q8213j09484j55878q3837P758J04029j68372
15801b29856j76237J74216L74548J01351k42299j07154R2231K11966K17047k70043
$$ plain form
15791 145770 -385589 -381056 9518 123774 54633 -132452 -311216 -409290 -213153 -69481
15781 -69481 5706 -203855 -411458 -360975 -287968 -345966 -374394 -428265 -237753 -140877 -230130
15770 -230130 -107076 -39916 124747 241380 158476 93328 249613 240257 275815 198972 -37495
15759 -37495 -336032 -366027 -279854 -163198 29982 -60689 56892 213702 199522 161529 82851
15748 82851 74057 190056 117331 -97880 -139737 70019 181074 407491 286849 220449 189014
15737 189014 16231 -128483 -212046 -12360 348806 425183 100719 -119698 21219 153012
15727 153012 250941 211697 161525 -61111 -98240 -257890 -265690 -19041 120640 97568 14222
15716 14222 74425 58383 59798 66275 47414 78331 -28386 -227167 -179734 203716 426180
$$ packed form
15791A45770n31359M533L90574J14256o9141j87085j78764r8074J96137J43672
15781f9481P5187k09561k07603N0483P3007n7998k8428n3871J90512R6876q9253
15770b30130J23054O7160J64663J16633q2904o5148J56285r356L5558p6843k36467
15759c7495k98537k9995Q6173J16656J93180r0671J17581J56810j4180l7993p8678
15748H2851q794J15999p2725k15211m1857K09756J11055K26417j20642o6400l1435
15737A89014j72783j44714q3563J99686L61166P6377l24464k20417J40917J31793
15727A53012R7929l9244n0172k22636l7129j59650p800K46649J39681k3072q3346
15716A4222O0203j6042J415O477j8861L0917j06717j98781M7433L83450K22464
$$ plain form
15705 426180 165501 -153599 -109464 68874 76495 -159549 -100652 100121 361949 239036
15695 239036 -163203 -10220 14209 45462 166599 274198 109166 120944 54436 -192686
15685 -192686 -214924 -169112 -13368 -164274 -243899 -382916 -513980 -536147 -491742 -536222 -418806
15674 -418806 -502438 -332736 -277916 -260432 -416450 -220623 12546 -3430 -93812 -233098
15664 -233098 -198651 -274255 -96634 213862 329861 236272 73026 8096 -36082 19706 193473
15653 193473 248007 112700 155491 56512 -45499 -163978 -29286 171700 43223 -147261
15643 -147261 -263118 -122731 245236 86995 -93238 -52112 113846 297431 283811 54358
15633 54358 -104122 -249674 -255076 -128009 -156723 -309676 -228444 -29840 140468 363103
$$ packed form
15705D26180k60679l19100M4135J78338P621k36044N8897K00773K61828j22913
15695B39036m02239J52983K4429L1253J21137J07599j65032J1778o6508k47122
15685a92686k2238M5812J55744j50906p9625j39017j31064k2167M4405m4480J17416
15674d18806q3632J69702N4820J7484j56018J95827K33169j5976r0382j39286
15664b33098L4447p5604J77621L10496J15999r3589j63246o4930m4178N5788J73767
15653A93473N4534j35307M2791r8979j02011j18479J34692K00986j28477j90484
15643a47261j15857J40387L67967j58241j80233M1126J65958J83585j3620k29453
15633E4358j58480j45552n402J27067k8714j52953Q1232J98604J70308K22635
$$ plain form
15623 363103 121116 -18751 -144410 2860 -93049 -285610 -139974 -30558 -42104 173122
15613 173122 197753 317903 243794 47252 21597 47442 -97571 -278783 -241005 -354391
15603 -354391 -456936 -466970 -329916 -277522 -259008 -167620 75360 283176 254936 57897
15593 57897 79863 103588 29400 -19270 -68862 -170865 -151363 -203304 -145191 2194 -767
15582 -767 10315 -38400 -187710 -201217 32871 153104 -208855 -276744 -218212 -226653 -34983
15571 -34983 314372 301105 329787 194863 -313578 -286406 -153222 -234885 -103639 211608
15561 211608 564239 428209 306910 400679 380948 263252 273305 195230 127040 -66349
15551 -66349 -295412 -256515 -71297 97327 124693 50597 -165257 -381459 -347715 -310933 -70646
$$ packed form
15623C63103k41987j39867j25659J47270r5909j92561J45636J09416j1546K15226
15613A73122K4631J20150p4109j96542k5655K5845j45013j81212L7778j13386
15603c54391j02545j0034J37054N2394J8514R1388K42980K07816k8240j97039
15593E7897K1966K3725p4188m8670m9592j02003J9502n1941N8113J47385k961
15582g67J1082m8715j49310j3507K34088J20233l61959o7889N8532q441J91670
15571c4983L49355j3267K8682j34924n08441K7172J33184q1663J31246L15247
15561B11608L52631j36030j21299R3769j9731j17696J0053p8075o8190j93389
15551f6349k29063L8897J85218J68624K7366p4096k15854k16202L3744L6782K40287
$$ plain form
15540 -70646 52493 123446 109776 -6618 -116100 -172087 -325758 -34975 228299 515107
15530 515107 426710 193637 -40837 -93017 -318548 -456657 -411755 -482275 -370700 -184534
15520 -184534 250164 331810 225726 258313 140581 127836 301480 349919 169233 96342
15510 96342 109584 40713 -46416 -29039 -161921 -190798 -318484 -167741 -202001 -54248 -74888
15499 -74888 -551438 -733284 -730316 -635921 -438799 -255314 -74757 36768 90930 97085 61667
15488 61667 144057 205158 170342 202245 110539 140802 318870 498753 42468 -9596 132840
15477 132840 8376 -309617 -460309 -491785 -440450 -222552 -9119 115134 246802 232441
15467 232441 64543 132119 360514 427645 280933 -26907 -181131 -4722 116680 278508
$$ packed form
15540g0646J23139P0953j3670j16394j09482n5987j53671K90783K63274K86808
15530E15107q8397k33073k34474n2180k25531j38109M4902p0520J11575J86166
15520a84534M34698Q1646j06084L2587j17732j2745J73644M8439j80686p2891
15510I6342J3242o8871q7129J7377j32882k8877j27686J50743l4260J47753k0640
15499g4888m76550j81846K968R4395J97122J83485J80557J11525N4162O155l5418
15488F1667Q2390O1101l4816L1903r1706L0263J78068J79883m56285n2064J42436
15477A32840j24464l17993j50692l1476N1335K17898K13433J24253J31668j4361
15467B32441j67898O7576K28395O7131j46712l07840j54224J76409J21402J61828
$$ plain form
15457 278508 253879 385754 242195 121702 125432 85166 -117135 -199314 -80631 -81765 -299700
15446 -299700 -468109 -521700 -556637 -463395 -318303 -203436 125962 -9042 43130 292301
15436 292301 274094 27092 -122937 -169405 -262034 -198100 -148978 -52664 -63649 -176229 -218512
15425 -218512 -332585 -283167 -280937 -255642 -84590 -54251 -248614 -370835 -182419 -30889
15415 -30889 159265 138789 19417 2971 -59911 -191044 -74379 -232192 -211635 -120258 -296942
15404 -296942 -532467 -475776 -486914 -222739 24689 76157 -105087 -281004 -92958 66222
15394 66222 -222327 -438508 -361284 -355459 -409417 -203101 -140109 203656 289514 232084 33015
15383 33015 -73198 -55563 98179 213146 47635 71955 235732 23737 198275 369766
$$ packed form
15457B78508k4629J31875j43559j20493L730m0266k02301q2179J18683j134k17935
15446b99700j68409n3591l4937R3242J45092J14867L29398j35004N2172K49171
15436B92301j8207k47002j50029m6468r2629O3934M9122R6314j0985j12580m2283
15425b18512j14073M9418K230K5295J71052L0339j94363j22221J88416J51530
15415c0889J90154k0476j19372j6446o2882j31133J16665j57813K0557R1377j76684
15404b96942k35525N6691j1138K64175K47428N1468j81244j75917J88046J59180
15394F6222k88549k16181P7224N825n3958K06316O2992L43765Q5858n7430j99069
15383C3015j06213J7635J53742J14967j65511K4320J63777k11995J74538J71491
$$ plain form
15373 369766 233205 252766 246229 264650 314117 177438 95221 -81483 -165051 -6587 -152795
15362 -152795 -176751 -27574 -88106 147631 374948 228721 -37160 -89841 -120664 197
15352 197 -5273 -65865 -300611 -310297 -166118 -144392 1398 61991 122606 331871 267040 122806
15340 122806 -12353 -263493 -347068 -191161 -70823 29224 -70386 -293438 -444472 -448191
15330 -448191 -256426 -123160 -155306 -184856 -92261 -41175 -28630 107400 128176 -11219 -282988
15319 -282988 -365311 -205860 9247 -97124 114738 67553 -74309 -121580 -326376 -455679
15309 -455679 -546504 -727505 -434151 -117721 -99668 -71560 -285437 -314068 -108877 -73927
15299 -73927 -58443 -59016 4753 -170472 -436943 -388789 -326573 -321901 -246302 -87006 -299196
$$ packed form
15373C69766j36561J9561o537J8421M9467j36679q2217j76704q3568J58464j46208
15362a52795k3956J49177o0532K35737K27317j46227k65881n2681l0823J20861
15352A97n470o0592k34746r686J44179K1726J45790O0593O0615K09265o4831j44234
15340A22806j35159k51140q3575J55907J20338J00047r9610k23052j51034l719
15330d48191J91765J33266l2146k9550R2595N1086J2545J36030K0776j39395k71769
15319b82988q2323J59451K15107j06371K11862m7185j41862m7271k04796j29303
15309d55679r0825j81001K93354L16430J8053K8108k13877k8631K05191L4950
15299g3927J5484n73O3769j75225k66471M8154O2216M672P5599J59296k12190
$$ plain form
15288 -299196 -406733 -389674 -284066 -141819 -57606 -184630 -106793 -91137 -56227 -185169
15278 -185169 -237796 -14491 3768 -45042 -100628 -92147 -119041 -292628 -208111 -31244 51646
15267 51646 662 209552 125562 150409 277877 204234 241608 263721 65098 -8568 14730
15256 14730 4830 83996 -14810 -76443 -111531 -456225 -446765 -189501 -25567 79896 -54031
15245 -54031 -213780 -113481 -1018 207899 253180 -90258 -242035 -175481 -169215 -306771
15235 -306771 -29095 202921 51061 -33249 -242464 -291172 -377 133041 118977 114301
15225 114301 76638 -21084 -242785 -296335 -305246 -191741 -182748 -184769 -116164 -143059 -92248 -99620
15213 -99620 -300991 -299065 -134632 -48846 -79475 54914 127746 49697 41089 43290 -67761
$$ packed form
15288b99196j07537J7059J05608J42247Q4213j27024P7837J5656L4910j28942
15278a85169n2627K23305J8259m8810n5586Q481k6894j73587Q4517J76867Q2890
15267E1646n0984K08890q3990K4847J27468p3643L7374K2113j98623p3666K3298
15256A4730r900P9166r8806o1633l5088l44694R460K57264J63934J05463j33927
15245e4031j59749J00299J12463K08917M5281l43438j51777O6554O266j37556
15235c06771K77676K32016j51860q4310k09215m8708K90795J33418j4064m676
15225A14301l7663r7722k21701n3550q911J13505Q993k021O8605k6895N0811p372
15213i9620k01371J926J64433Q5786l0629J34389P2832p8049q608K201j11051
$$ plain form
15202 -67761 41914 61246 -180442 -32644 267140 424562 485185 178166 -72573 11834
15192 11834 250082 130553 -89672 -209854 -254543 -500104 -528747 -495120 -552599 -327587
15182 -327587 -208042 -300754 -207619 -105552 -89228 -19483 153242 238346 -29667 -235753
15172 -235753 -398592 -252705 -139699 -201811 -93826 3262 132619 236807 17817 -35828
15162 -35828 -12038 -71523 153937 339042 318961 155908 -23192 77684 61213 -78340
15152 -78340 119812 304501 187856 -65490 -286464 -337792 -303360 -363927 -382720 -358482 -257419
15141 -257419 -279201 -183567 -74622 -174088 -61260 11748 96800 -5070 -309231 -295755 -250694
15130 -250694 -216441 -334647 -300943 -91845 95167 13646 191981 201554 106172 190416 -109043
$$ packed form
15202f7761J09675J9332k41688J47798K99784J57422O0623l07019k50739Q4407
15192A1834K38248j19529k20225j20182m4689k45561k8643L3627n7479K25012
15182c27587J19545r2712R3135J02067J6324O9745J72725Q5104k68013k06086
15172b35753j62839J45887J13006o2112J07985R7088J29357J04188k18990n3645
15162c5828K3790n9485K25460J85105k0081j63053j79100J00876j6471j39553
15152g8340J98152J84689j16645k53346k20974n1328L4432o0567j8793K4238J01063
15141b57419k1782R5634J08945r9466J12828P3008Q5052j01870l04161J3476M5061
15130b50694L4253j18206L3704K09098J87012q1521J78335R573r5382Q4244k99459
$$ plain form
15119 -109043 -156564 -46221 149447 -13064 -6578 139386 3277 -173516 70054 49844
15109 49844 162285 82625 175943 168386 240101 242571 -267301 -390132 -518604 -318546 -42515
15098 -42515 129840 -125581 -400945 -392005 -113349 23443 103993 52163 113152 190831 146537
15087 146537 -169213 -368229 -239879 -166975 -224811 -295657 -526547 -558450 -339019 -280882
15077 -280882 -413905 -262585 -345200 -543716 -482416 -475674 -553880 -362261 -167617 110982
15067 110982 145174 200606 97787 -278730 -334325 -250532 -217493 -52735 206471 170829 195465
15056 195465 19731 46385 114719 118557 276994 -18673 -197395 -353244 -501715 -341091
15046 -341091 -225229 -195757 -140558 -405119 -491744 -543615 -578859 -427735 -62431 101312
$$ packed form
15119a09043m7521J10343J95668j62511O486J45964j36109j76793K43570k0210
15109D9844J12441p9660R3318p557P1715K470n09872j22831j28472K00058K76031
15098d2515J72355k55421k75364Q940K78656J36792Q0550n1830O0989P7679m4294
15087A46537l15750j99016J28350P2904n7836p0846k30890l1903K19431N8137
15077b80882j33023J51320q2615j98516O1300O742p8206J91619J94644K78599
15067A10982L4192N5432j02819l76517n5595Q3793L3039J64758K59206l5642K4636
15056A95465j75734K6654O8334L838J58437k95667j78722j55849j48471J60624
15046c41091J15862K9472N5199k64561q6625n1871l5244J51124L65304J63743
$$ plain form
15036 101312 -15372 -205511 -330950 -307286 -67255 37143 21147 -190388 -247406 -247765 -406875
15025 -406875 -263249 87684 44504 -27741 -91643 -170424 -317359 -375181 -258895 -37937
15015 -37937 -22726 -76399 -402652 -583919 -464981 -232299 -133115 -303338 -258481 -150732
15005 -150732 -132777 -54083 58001 361813 224342 142626 223391 35773 135032 33913
14995 33913 -6359 154355 -106171 7455 249251 -16789 40929 103008 -71966 -322676
14985 -322676 -45585 49235 87855 -15974 4722 -172331 -306508 -275611 -162440 -244757
14975 -244757 -295318 -257371 -164693 -175605 21461 248077 368780 234304 138921 266183
14965 266183 201274 87653 -8330 79034 338404 224538 84946 -45229 -193238 -76679
$$ packed form
15036A01312j16684j90139j25439K3664K40031J04398j5996k11535n7018l59j59110
15025d06875J43626L50933m3180p2245o3902p8781j46935n7822J16286K20958
15015c7937J5211n3673l26253j81267J18938K32682R9184j70223M4857J07749
15005a50732J7955P8694J12084L03812j37471q1716Q0765j87618R9259j01119
14995C3913m0272J60714k60526J13626K41796k66040N7718O2079j74974k50710
14985c22676K77091R4820L8620j03829K0696j77053j34177L0897J13171q2317
14975b44757n0561L7947R2678j0912J97066K26616J20703j34476r5383J27262
14965B66183o4909j13621r5983Q7364K59370j13866j39592j30175j48009J16559
$$ plain form
14955 -76679 -77278 -49065 -47909 2139 208397 292436 69236 150717 112299 127056 -31895 -204803
14943 -204803 -228440 -118787 181480 174700 283576 326902 305062 146523 214534 247714 53492
14932 53492 -198313 -354156 -268415 -248050 -33836 196511 284431 296617 386113 432045 388528
14921 388528 364353 303393 125046 -146113 -525555 -551190 -510425 -426844 -660639 -523567
14911 -523567 -282027 -316491 -445496 -422359 -180055 -406484 -477652 -366968 -98045 -62887
14901 -62887 -126184 -246563 -245771 -158764 -167411 -254318 -192238 -96717 31362 78343 -94005 34227
14889 34227 64831 -66513 -128778 -131308 -13024 301973 150837 -70036 -39636 31361 137000
14878 137000 358785 420201 302920 276835 119971 171081 34141 -101151 -120787 -77330
$$ packed form
14955g6679n99K8213J156N0048K06258Q4039k23200Q1481l8418J4757j58951j72908
14943b04803k3637J09653L00267o780J08876M3326k1840j58539O8011L3180j94222
14932E3492k51805j55843Q5741K0365K14214K30347Q7920J2186Q9496M5932m3517
14921C88528k4175o0960j78347k71159l79442k5635M0765Q3581k33795J37072
14911e23567K41540l4464j29005K3137K42304k26429p1168J10684K68923L5158
14901f2887o3297j20379P92Q7007q647q6907O2080R5521J28079M6981j72348J28232
14889C4227L0604j31344o2265k530J18284L14997j51136k20873L0400P0997J05639
14878A37000K21785O1416j17281k6085j56864N1110j36940j35292j9636M3457
$$ plain form
14868 -77330 74421 171179 304450 248359 173790 61979 335335 595653 336972 139245
14858 139245 -52762 -196557 -62592 38712 74687 -57912 -23266 180785 204328 193086
14848 193086 20073 104779 184191 386804 309370 -50522 -227445 -422548 -535101 -287243
14838 -287243 -208246 -169342 -140039 -210972 -62308 -12342 -163434 -249657 -241832 6642 72983
14827 72983 130914 -13781 -216963 -396058 -246711 -244538 -157071 -140873 -338171 -508779 -286677
14816 -286677 -187472 -249446 -342581 -250637 -163135 -132507 -83658 -82506 33223 -186608 -215335
14805 -215335 51856 124411 62798 -143472 -218556 -5124 -46016 -34914 138429 141941 245885
14794 245885 311783 144394 -49973 102663 67513 -126930 -107862 6372 -335367 -446948
$$ packed form
14868g7330J51751R6758J33271n6091p4569j11811K73356K60318k58681j97727
14858A39245j92007j43795J33965J01304L5975j32599L4646K04051K3543j1242
14848A93086j73013Q4706P9412K02613p7434l59892j76923j95103j12553K47858
14838b87243P8997L8904K9303p0933J48664M9966j51092q6223P825K48474O6341
14827G2983N7931j44695k03182j79095J49347K173Q7467J6198j97298j70608K22102
14816b86677R9205o1974r3135R1944Q7502L0628M8849J152J15729k19831k8727
14805b15335K67191P2555o1613k06270p5084K13432m0892J1102J73343L512J03944
14794B45885O5898j67389j94367J52636l5150j94443J9068J14234l41739j11581
$$ plain form
14784 -446948 -527274 -339335 -103189 -167139 -217867 -255318 -228357 -50181 70595 -59442
14774 -59442 25583 289684 234137 65782 -83380 97620 -3184 -34999 -17390 -122463
14764 -122463 -153315 -94681 -127148 -98706 -167344 -111624 24434 21975 39008 173471 277347
$$ packed form
14784d46948q0326J87939K36146o3950n0728l7451K6961J78176J20776j30037
14774e9442Q5025K64101n5547j68355j49162J81000j00804l1815J7609j05073
14764a22463l0852N8634l2467K8442o8638N5720J36058k459J7033J34463J03876
$$ [...]
##END NTUPLES=NMR SPECTRUM
##END=
