##TITLE=Analysis number 322353
Compound Code cc 45996
Book Reference 438/178
Project Code adrs
Chemist Name antons
##JCAMPDX= 6.0         $$ Bruker NMR JCAMP-DX V2.0
##DATA TYPE= NMR SPECTRUM
##DATA CLASS= NTUPLES
##ORIGIN= Bruker BioSpin GmbH
##OWNER= nmr
$$ XWIN-NMR		Version 3.5
$$ Wed Sep 27 10:47:30 2006 GMT Daylight Time (UT+1h)  MAYBRIDGE\nmr@NMR_250MHZ
##.OBSERVE FREQUENCY= 250.131544655141
##.OBSERVE NUCLEUS= ^1H
##.ACQUISITION MODE= SIMULTANEOUS (DQD)
##.ACQUISITION SCHEME= undefined
##.AVERAGES= 16
##.DIGITISER RES= 18
##SPECTROMETER/DATA SYSTEM= dpx250
##.PULSE SEQUENCE= zg30
##.SOLVENT NAME= DMSO
##.SHIFT REFERENCE= (INTERNAL, DMSO, 0, 16.522)
##AUDIT TRAIL= $$ (NUMBER, WHEN, WHO, WHERE, WHAT)
$$ ##TITLE= Audit trail, XWIN-NMR		Version 3.5
$$ ##JCAMPDX= 5.01
$$ ##ORIGIN= Bruker BioSpin GmbH
$$ ##OWNER= nmr
$$ C:\u/data/dgb/nmr/ADRS/1440/pdata/1/auditp.txt
$$ ##AUDIT TRAIL=  $$ (NUMBER, WHEN, WHO, WHERE, WHAT)
(   1,<2006-09-27 10:46:58.45 +100>,<MAYBRIDGE\nmr>,<NMR_250MHZ>,
      <created by zg, POWCHK disabled, PULCHK disabled
       configuration hash MD5:
       E2 DF 36 D8 04 B2 41 60 5A D7 A3 38 5A 4B D0 FE
       data hash MD5: 64K
       34 27 14 05 72 B8 28 9B 2B 84 99 77 11 8A AB B9>)
(   2,<2006-09-27 10:47:16.07 +100>,<MAYBRIDGE\nmr>,<NMR_250MHZ>,
      <Start of raw data processing
       ef LB = 0.3 FT_mod = 6 PKNL = 1 SI = 32K 
       data hash MD5: 32K
       74 BD 49 22 19 63 EE 33 FB E9 43 F3 36 99 40 05>)
(   3,<2006-09-27 10:47:18.20 +100>,<MAYBRIDGE\nmr>,<NMR_250MHZ>,
      <apk 
       data hash MD5: 32K
       85 00 1A 03 FE E7 B8 4C AB C7 1F 51 0F 14 D3 CC>)
(   4,<2006-09-27 10:47:18.98 +100>,<MAYBRIDGE\nmr>,<NMR_250MHZ>,
      <abs ABSG = 5 
       data hash MD5: 32K
       84 57 9F A6 AE 69 31 65 BF 05 3D A3 9A AE 10 0A>)
$$ ##END=
$$ 
$$ hash MD5
$$ 5A 88 CF AD 1A 68 0A 90 7B 40 BD A1 78 AC 58 5D
##$RELAX= 
##$RELAX= 
##$RELAX= 
##$RELAX= 
##$RELAX= 
##$RELAX= 
##$RELAX= 
$$ Bruker specific parameters
$$ --------------------------
##$DU= <C:\u>
##$EXPNO= 1440
##$NAME= <ADRS>
##$PROCNO= 1
##$TYPE= <nmr>
##$USER= <dgb>
##$AMP= (0..31)
100 100 100 100 100 100 100 100 100 100 100 100 100 100 100 100 100 100 
100 100 100 100 100 100 100 100 100 100 100 100 100 100 
##$AQSEQ= 0
##$AQ_mod= 3
##$AUNM= <au_zg>
##$AUTOPOS= <9 >
##$BF1= 250.13
##$BF2= 250.13
##$BF3= 250.13
##$BF4= 250.13
##$BF5= 500.13
##$BF6= 500.13
##$BF7= 500.13
##$BF8= 500.13
##$BYTORDA= 1
##$CFDGTYP= 0
##$CFRGTYP= 5
##$CHEMSTR= <none>
##$CNST= (0..31)
1 1 145 1 1 1 1 1 1 1 1 1 1 1 1 1 1 1 1 1 1 1 1 1 1 1 1 1 1 1 1 1 
##$CPDPRG= <>
##$CPDPRG1= <>
##$CPDPRG2= <>
##$CPDPRG3= <>
##$CPDPRG4= <mlev>
##$CPDPRG5= <mlev>
##$CPDPRG6= <mlev>
##$CPDPRG7= <mlev>
##$CPDPRG8= <mlev>
##$CPDPRGB= <>
##$CPDPRGT= <>
##$D= (0..31)
0 1 0 0 0 0 0 0 0 0.06 0 0 0 0 0 0 0.0002 0 0 0 0 0 0 0 0 0 0 0 0 0 0 
0 
##$DATE= 1159350417
##$DBL= (0..7)
120 120 120 120 120 120 120 120 
##$DBP= (0..7)
150 150 150 150 150 150 150 150 
##$DBP07= 0
##$DBPNAM0= <>
##$DBPNAM1= <>
$$ [...]
##$SUBNAM7= <"">
##$SUBNAM8= <"">
##$SUBNAM9= <"">
##$SW= 20.6930455092707
##$SWIBOX= (0..15)
0 0 3 0 0 0 0 0 0 0 0 0 0 0 0 0 
##$SW_h= 5175.983436853
##$TD= 65536
##$TD0= 1
##$TE= 295.16
##$TE2= 300
##$TE3= 300
##$TEG= 300
##$TL= (0..7)
0 120 120 120 120 120 120 120 
##$TP= (0..7)
150 150 150 150 150 150 150 150 
##$TP07= 0
##$TPNAME0= <>
##$TPNAME1= <>
##$TPNAME2= <>
##$TPNAME3= <>
##$TPNAME4= <>
##$TPNAME5= <>
##$TPNAME6= <>
##$TPNAME7= <>
##$TPOAL= (0..7)
0.5 0.5 0.5 0.5 0.5 0.5 0.5 0.5 
##$TPOFFS= (0..7)
0 0 0 0 0 0 0 0 
##$TUNHIN= 0
##$TUNHOUT= 0
##$TUNXOUT= 0
##$USERA1= <user>
##$USERA2= <user>
##$USERA3= <user>
##$USERA4= <user>
##$USERA5= <user>
##$V9= 5
##$VALIST= <valist>
##$VCLIST= <CCCCCCCCCCCCCCC>
##$VD= 0
##$VDLIST= <DDDDDDDDDDDDDDD>
##$VPLIST= <PPPPPPPPPPPPPPP>
##$VTLIST= <TTTTTTTTTTTTTTT>
##$WBST= 1024
##$WBSW= 4
##$XGAIN= (0..3)
0 0 0 0 
##$XL= 0
##$YL= 0
##$YMAX_a= 247128
##$YMIN_a= -410433
##$ZGOPTNS= <>
##$ZL1= 120
##$ZL2= 120
##$ZL3= 120
##$ZL4= 120
##$ABSF1= 16.522
##$ABSF2= -4.171173
##$ABSG= 5
##$ABSL= 3
##$ALPHA= 0
##$AQORDER= 0
##$ASSFAC= 0
##$ASSFACI= 0
##$ASSFACX= 0
##$ASSWID= 0
##$AUNMP= <proc_1d>
##$AZFE= 0.1
##$AZFW= 0.1
##$BCFW= 0
##$BC_mod= 0
##$BYTORDP= 0
##$COROFFS= 0
##$CY= 12.5
##$DATMOD= 1
##$DC= 0
##$DFILT= <>
##$DTYPP= 0
##$F1P= 14.0000005364418
##$F2P= -0.99999901652339
##$FCOR= 0.5
##$FTSIZE= 32768
##$FT_mod= 6
##$GAMMA= 0
##$GB= 0
##$INTBC= 1
##$INTSCL= 1
##$ISEN= 128
##$LB= 0.3
##$LEV0= 0
##$LPBIN= 0
##$MAXI= 10000
##$MC2= 0
##$MEAN= 0
##$ME_mod= 0
##$MI= 0
##$NCOEF= 0
##$NC_proc= -5
##$NLEV= 6
##$NOISF1= 0
##$NOISF2= 0
##$NSP= 0
##$NTH_PI= 0
##$NZP= 0
##$OFFSET= 16.522
##$PC= 1
##$PHC0= 140.3812
##$PHC1= 0.8760344
##$PH_mod= 1
##$PKNL= yes
##$PPARMOD= 0
##$PSCAL= 4
##$PSIGN= 0
##$REVERSE= no
##$SF= 250.13
##$SI= 32768
##$SIGF1= 0
##$SIGF2= 0
##$SINO= 400
##$SIOLD= 32768
##$SREGLST= <1H.DMSO>
##$SSB= 0
##$STSI= 32768
##$STSR= 0
##$SW_p= 5175.98343685301
##$SYMM= 0
##$S_DEV= 0
##$TDeff= 65536
##$TDoff= 0
##$TI= <Analysis number 999999
Compound Code 99
Book Reference 9
Project Code 9>
##$TILT= no
##$TM1= 0
##$TM2= 0
##$TOPLEV= 0
##$USERP1= <user>
##$USERP2= <user>
##$USERP3= <user>
##$USERP4= <user>
##$USERP5= <user>
##$WDW= 1
##$XDIM= 32768
##$YMAX_p= 406231817
##$YMIN_p= -519288
$$ End of Bruker specific parameters
$$ ---------------------------------
##NTUPLES= NMR SPECTRUM
##VAR_NAME=  FREQUENCY,     SPECTRUM/REAL,   SPECTRUM/IMAG
##SYMBOL=    X,             R,               I
##VAR_TYPE=  INDEPENDENT,   DEPENDENT,       DEPENDENT
##VAR_FORM=  AFFN,          ASDF,            ASDF
##VAR_DIM=   32768,         32768,           32768
##UNITS=     HZ,            ARBITRARY UNITS, ARBITRARY UNITS
##FACTOR=    0.157963299565203, 1,           1
##FIRST=     4132.6476996994, 0,             0
##LAST=      -1043.33573715361, 0,           0
##MIN=       -1043.33573715361, -519288,     0
##MAX=       4132.6476996994, 406231817,     0
$$ Real data points
##PAGE= N=1
##DATA TABLE= (X++(R..R)), XYDATA
$$ [...]
$$ plain form
15933 -86104 -95293 -46015 -49264 -93934 -82120 14402 15401 -24772 78758 96342 40174 21684
15921 21684 143986 151565 -33057 -1265 18746 -115494 -238848 -188312 -213103 -350994 -343863
15910 -343863 -225155 -10985 43800 752 -77377 -198386 -238360 -231358 -278537 -125915 -32052
15899 -32052 -65377 -21144 131749 187739 49145 -8898 -31675 -107476 -58299 93584 190186
15888 190186 93357 -113185 -233161 -191517 -182970 -356117 -327483 -149607 -71599 -98606 -136185
15877 -136185 -92867 -78028 147538 206681 136193 92035 151292 136922 -53689 -133089 33859
15866 33859 14730 -92184 -52240 134553 103857 -32113 -114457 -130639 -212665 -205260 -141213
15855 -141213 -87584 -169806 -189629 -190309 -326983 -280733 -227378 -120416 19066 32979 -45507
$$ packed form
15933h6104r189M9278l249m4670J1814R6522R99m0173J03530J7584n6168j8490
15921B1684J22302P579j84622L1792K0011j34240j23354N0536k4791j37891P131
15910c43863J18708K14170N4785m3048p8129j21009l9974P002m7179J52622R3863
15899c2052l3325M4233J52893N5990j38594n8043k2777p5801M9177J51883R6602
15888A90186r6829k06542j19976M1644Q547j73147K8634J77876P8008k7007l7579
15877a36185M3318J4839K25566N9143p0488m4158N9257j4370j90611p9400J66948
15866C3859j9129j06914L9944J86793l0696j35970q2344j6182q2026P405O4047
15855a41213N3629q2222j9823o80j36674M6250N3355J06962J39482J3913p8486
$$ plain form
15844 -45507 -152964 -226158 -218846 -16062 45740 53221 -41222 -84655 -258 111279 148891
15833 148891 -42631 -134103 -200911 -172206 -99774 -86491 -36094 -8166 -163430 -334980 -290702
15822 -290702 -69950 -71233 -39301 106533 -25178 -167618 -275100 -256996 -39744 -56613
15812 -56613 49001 119904 26399 -77165 -35 -46309 -160102 -126021 -123359 -98741 -101214
15801 -101214 -127428 -143298 -84203 33535 49739 -14437 -124038 -175108 -114728 -134028 -55917
15790 -55917 -37753 -30419 -65598 27292 237701 83022 -130407 -150849 -48850 -62862 -112020
15779 -112020 -148378 -173231 -111890 -32966 10573 45587 -6898 9041 -25743 -59958 -102820
15768 -102820 -231019 -177007 13471 126577 214509 206714 105485 27202 23039 65325 -119886
$$ packed form
15844d5507j07457p3194P312K02784O1802P481r4443m3433Q4397J11537L7612
15833A48891j91522r1472o6808K8705P2432J3283N0397K7928j55264j71550M4278
15822b90702K20752j283L1932J45834j31711j42440j07482J8104K17252j6869
15812e6613J05614P0903r3505j03564P7130m6274j13793L4081K662K4618k473
15801a01214k6214j5870N9095J17738J6204o4176j09601n1070O0380j9300P8111
15790e5917J8164P334l5179R2890K10409j54679k13429k0442J01999j4012m9158
15779a12020l6358k4853O1341P8924M3539L5014n2485J5939l4784l4215m2862
15768a02820j28199N4012J90478J13106Q7932p795j01229p8283m163M2286j85211
$$ plain form
15757 -119886 -181002 -257807 -235266 -162075 -93222 -62613 -64057 -108681 -35808 -105932 -90928 -29166
15745 -29166 -91974 -180648 -184571 -84033 31876 -47689 -36401 83408 140247 113378 14322
15734 14322 -79502 -58546 -37993 -40962 58169 110067 -19472 -67365 -92422 -86255 -32763 -86492
15722 -86492 -214850 -98094 -43219 60821 196308 221422 271933 197330 91562 -1049 8639
15711 8639 126006 8294 -43587 -6099 63011 120007 205052 55579 -60469 -24483 -23993
15700 -23993 -83067 -111969 38728 122180 85848 47328 40027 -26052 96840 44131 -6652
15689 -6652 -19427 -31847 -18782 49371 45013 49502 32963 -138641 -282702 -222434 -173473 -159064
15677 -159064 -143246 -95742 25875 82146 -25075 -103397 -64475 -125255 -268827 -378449 -454537
$$ packed form
15757a19886o1116p6805K2541P3191O8853L0609j444m4624P2873p0124J5004O1762
15745b9166o2808q8674l923J00538J15909p9565J1288J19809N6839k6869r9056
15734A4322r3824K0956K0553k969R9131N1898j29539m7893k5057O167N3492n3729
15722h6492j28358J16756N4875J04040J35487K5114N0511p4603j05768r2611R688
15711H639J17367j17712n1881L7488O9110N6996Q5045j49473j16048L5986M90
15700b3993n9074k8902J50697Q3452l6332l8520p301o6079J22892n2709n0783
15689f652j2775j2420J3065O8153m358M489j6539j71604j44061O0268M8961J4409
15677a59064J5818M7504J21617N6271j07221p8322L8922o0780j43572j09622p6088
$$ plain form
15666 -454537 -313469 -138066 -135039 -178772 -172605 -228074 -185741 -121928 -137067 -124584 -63931
15655 -63931 50988 79250 39571 12678 7048 18555 -19510 -28571 -87379 -97377 15054 143334
15643 143334 51186 51466 44955 -22418 -89757 -201347 -105664 98386 169983 64933 28297
15632 28297 -69395 -179600 -184905 -204377 -132975 -169547 -206443 -279209 -280082 -23628 84831 64769
15620 64769 137153 149039 101108 31607 5808 -53256 -100686 -12039 9790 -24021 -4824 -72852
15608 -72852 -197038 -214358 -202971 -173724 -198393 -109005 -163063 -143126 -61422 -152955 -187563
15597 -187563 -254159 -277863 -295013 -293418 -370116 -265002 -178112 -103154 -178487 -187760 -79463
15586 -79463 -87018 21094 60336 31096 -84907 -14212 25252 79082 83485 175350 244632 190705
$$ packed form
15666d54537J41068J75403L027m3733O167n5469M2333O3813j5139J2483O0653
15655f3931J14919K8262l9679k6893n630J1507l8065r061n8808r998J12431J28280
15643A43334r2148K80o511o7373o7339j11590R5683K04050P1597j05050l6636
15632B8297r7692j10205n305j9472P1402l6572l6896p2766q73K56454J08459k0062
15620F4769P2384J1886m7931o9501k5799n9064m7430Q8647K1829l3811J9197o8028
15608g2852j24186j7320J1387K9247k4669Q9388n4058J9937Q1704r1533l4608
15597a87563o6596k3704j7150J595p6698J05114Q6890P4958p5333r273J08297
15586g9463p555J08112L9242k9240j16003P0695L9464N3830M403R1865O9282n3927
$$ plain form
15574 190705 207541 183312 147139 190631 121049 130087 152822 66797 31907 23831 94158 236516
15562 236516 253922 238521 112843 -41069 -92075 -42000 -119982 -119198 -158363 -313636 -273300
15551 -273300 -74991 58991 45230 -106488 -203095 -126951 -79855 -117811 -92263 -167057 -212401
15540 -212401 -160196 -127095 -191643 -172728 -184153 -117125 -45157 -83518 -182555 -244419 -189794
15529 -189794 -137899 -22282 -24957 6010 16934 -149113 -255627 -200236 -198299 -174158 -122779
15518 -122779 -75094 -33820 -20930 141980 76400 12938 -215362 -193484 -53152 -9183 21424
15507 21424 60558 80182 -13132 -142957 -143600 -47415 -28193 -99249 -166107 -231489 -298470 -241589
15495 -241589 -119902 60451 165514 58775 -6115 16835 -12324 49612 84543 -7068 -221293
$$ packed form
15574A90705J6836k4229l6173M3492o9582R038K2735q6025l4890q076P0327J42358
15562B36516J7406j5401j25678j53912n1006N0075p7982P84l9165j55273M0336
15551b73300J98309J33982j3761j51718r6607P6144M7096l7956K5548p4794m5344
15540b12401N2205L3101o4548J8915j1425O7028P1968l8361r9037o1864N4625
15529a89794N1895J15617k675L0967J0924j66047j06514N5391J937K4141N1379
15518a22779M7685M1274J2890J62910o5580o3462k28300K1878J40332M3969L0607
15507B1424L9134J9624r3314j29825o43R6185J9222p1056o6858o5382o6981N6881
15495b41589J21687J80353J05063j06739o4890K2950k9159O1936L4931r1611k14225
$$ plain form
15484 -221293 -234251 -138829 -23809 50725 155648 183786 199119 225090 121192 207943 75368
15473 75368 104699 125790 29668 -173431 -45305 -78108 -97901 -70509 13461 16932 -83123
15462 -83123 -118788 -171071 -123326 -202930 -265704 -361054 -239952 -270482 -136971 -57617 -186774
15451 -186774 -228370 -144375 -82701 -47305 -54764 -10162 12508 -3092 -42800 18412 88506 88780
15439 88780 119414 40534 -15753 -12556 3526 -41861 36870 131600 114359 9714 -4609 -111588
15427 -111588 -176004 -229217 -146324 -150806 -72157 -20974 66815 152986 119177 -35245 -120491
15416 -120491 -181822 -175606 -138953 -206317 -176654 -121026 -53451 -83856 -128137 -1478 -2008 -20464
15404 -20464 13039 62673 82574 101553 -7265 121302 11429 -37408 -4910 5232 -7794
$$ packed form
15484b21293j2958R5422J15020P4534J04923K8138J5333K5971j03898Q6751j32575
15473G5368K9331K1091r6122k03099J28126l2803j9793K7392Q3970L471j00055
15462h3123l5665n2283M7745p9604o2774r5350J21102l0530J33511P9354j29157
15451a86774m1596Q3995O1674L5396p459M4602K2670j5600l9708O1212P0094K74
15439H8780L0634p8880n6287L197J6082m5387P8731R4730j7241j04645j4323j06979
15427a11588o4416n3213Q2893m482P8649N1183Q7789Q6171l3809j54422q5246
15416a20491o1331O216L6653o7364K9663N5628O7575l0405m4281J26659n30j8456
15404b0464L3503M9634J9901J8979j08818J28567j09873m8837L2498J0142j3026
$$ plain form
15393 -7794 -15045 -106447 -35585 -46477 -54591 -36683 -33809 -203212 -282138 -362749 -314499 -280852
15381 -280852 -188803 -125804 16988 48848 60475 3767 -29072 -69119 -87195 25724 64631
15370 64631 -44032 -47601 -93702 -64944 140122 231816 228385 52418 41513 37838 44585 213115
15358 213115 276048 188695 198290 131786 -1791 -107781 -91257 -116448 -197376 -156229 -160975
15347 -160975 -201203 -236495 -169890 -159315 -132340 -102032 -261798 -305349 -226378 -16052 65678
15336 65678 119470 -76477 -198845 -87750 -925 149822 45851 -33350 -14029 -112473 -22176
15325 -22176 56883 113898 52386 -120150 -143506 -37867 -63229 -21158 29224 -1191 23623
15314 23623 41925 102053 148809 164500 190236 166790 189971 216524 237317 230638 221275 87078
$$ packed form
15393g794p251r1402P0862j0892q114J7908K874j69403p8926q0611M8250L3647
15381b80852R2049O2999J42792L1860J1627n6708l2839m0047j8076J12919L8907
15370F4631j08663l569m6101K8758K05066R1694l431j75967j0905l675O747J68530
15358B13115O2933q7353R595o6504j33577j05990J6524k5191q0928M1147m746
15347a60975m0228l5292O6605J0575K6975L0308j59766m3551P8971K10326Q1730
15336F5678N3792j95947j22368J11095Q6825J50747j03971p9201J9321r8444R0297
15325b2176P9059N7015o1512j72536k3356J05639k5362M2071N0382l0415K4814
15314B3623J8302O0128M6756J5691K5736k3446K3181K6553K0793o679r363j34197
$$ plain form
15302 87078 -88486 -170729 -131812 -107487 -258408 -304798 -182405 -85228 10745 -46724 -101128
15291 -101128 -109762 -161955 -186154 -170839 -57397 -65254 -36868 -67130 -120764 -101913 -191343 -286071
15279 -286071 -221149 10116 52768 -8162 133353 202106 56812 66014 100419 179499 176883
15268 176883 71577 -135189 -167361 -864 78515 83074 35521 -67440 -138528 -40435 11130
15257 11130 -81131 -189462 -217836 -119048 21918 172232 164050 95342 144842 69195 -63758
15246 -63758 -171354 -238918 -185755 -35690 5055 -8496 23373 27842 -150848 -233627 -79552
15235 -79552 -87081 -258370 -154710 45677 88275 36671 -43876 88604 162488 17627 48886
15224 48886 23997 -158774 -327207 -287702 -254265 -123178 30572 103028 8871 -50306 -173131
$$ packed form
15302H7078j75564q2243L8917K4325j50921m6390J22393R7177R5973n7469n4404
15291a01128q634n2193k4199J5315J13442p857K8386l0262n3634J8851q9430r4728
15279b86071O4922K31265M2652o0930J41515O8753j45294R202L4405P9080k616
15268A76883j05306k06766l2172J66497P9379M559m7553j02961p1088R8093N1565
15257A1130r2261j08331k8374R8788J40966J50314q182o8708M9500p5647j32953
15246f3758j07596o7564N3163J50065M0745j3551L1869M469j78690q2779J54075
15235g9552p529j71289J03660K00387M2598n1604q0547J32480P3884j44861L1259
15224D8886k4889j82771j68433L9505L3437J31087J53750P2456r4157n9177j22825
$$ plain form
15213 -173131 -186839 -35520 -16697 -70565 -38101 -76693 -38254 -13981 104488 158638 127657
15202 127657 -60168 -103432 -106773 30309 131534 153601 51895 30127 -32909 -75018 -84041
15191 -84041 -123774 -124558 -69263 -98510 -29648 29525 1094 -160725 -229869 -216287 -229047 -169428
15179 -169428 -175226 -97718 -71867 -18552 -74740 -136024 -85312 7727 -101775 -171744 -114986
15168 -114986 78733 60858 46571 39959 132275 59451 -111448 -159279 -110955 -59485 -38740
15157 -38740 31386 89863 22217 62688 96797 72672 -31172 -77139 -114080 28300 176462
15146 176462 158517 49857 19530 -31118 -134077 -169929 20989 100022 -67623 -301344
15136 -301344 -327070 -177189 -69272 -77733 -118677 -133590 -95691 -163606 -105197 -93384 -99249
$$ packed form
15213a73131j3708J51319J8823n3868L2464l8592L8439K4273J18469N4150l0981
15202A27657j87825m3264l341J37082J01225K2067j01706k1768o3036m2109r023
15191h4041l9733p84N5295k9247O8862N9173k8431j61819o9144J3582j2760N9619
15179a69428n798P7508K5851N3315n6188o1284N0712R3039j09502o9969N6758
15168a14986J93719j7875j4287o612R2316p2824j70899m7831M8324N1470K0745
15157c8740P0126N8477o7646M0471L4109k4125j03844m5967l6941J42380J48162
15146A76462j7945j08660l0327n0648j02959l5852J90918P9033j67645k33721
15136c01344k5726J49881J07917q461m0944j4913L7899o7915N8409J1813n865
$$ plain form
15125 -99249 -87128 -105572 -207860 -304253 -228289 -54021 -43470 -9751 77555 -3197 -110833
15114 -110833 -37097 4554 -91679 -45236 87987 -56113 -104267 -125416 -100971 16334 80632
15103 80632 -3326 -101199 -123367 3226 99091 85327 -43599 -125103 -262728 -166404 -83546
15092 -83546 -158813 -134519 -202764 -144992 -145826 -136302 -53940 12073 -19878 -109967 -51044 60992
15080 60992 20961 -14479 147 -71744 -58820 -191325 -308849 -440033 -301061 -185778 -70022
15069 -70022 40606 -61694 -165579 -297998 -322900 -369528 -415606 -287266 -73206 -97656
15059 -97656 -90005 -99777 -74525 -44751 -91791 -59768 -154204 -251965 -181133 -211290 -282953 -237934
15047 -237934 -237412 -145418 -53457 14304 96048 181049 -9872 -162554 -220909 -4629 169062
$$ packed form
15125i9249J2121j8444j02288r6393P5964J74268J0551L3719Q7306q0752j07636
15114a10833P3736M1651r6233M6443J33223j44100m8154k1149K4445J17305O4298
15103H0632q3958r7873k2168J26593R5865j3764j28926q1504j37625R6324Q2858
15092h3546p5267K4294o8245N7772q34R524Q2362O6013l1951r0089N8923J12036
15080F0992m0031l5440J4626p1891J2924j32505j17524j31184J38972J15283J15756
15069g0022J10628j02300j03885j32419k4902m6628m6078J28340K14060k4450
15059i7656P651r772K5252K9774m7040L2023r4436r7761P0832l0157p1663M5019
15047b37934N22R1994R1961O7761Q1744Q5001j90921j52682n8355K16280J73691
$$ plain form
15036 169062 58530 -92466 -119427 49697 105499 -11835 15853 33504 -50942 -104057 -3169
15025 -3169 42849 -18901 23321 54541 27232 -115394 -122344 -195552 -211684 -194048 -73300 7326
15013 7326 -40732 -224291 -302340 -220484 -211733 -136696 -143058 -195592 -211232 -133326 -36309 8999
15001 8999 -36736 -160107 -132956 -73627 -158564 -183286 -264791 -364990 -345688 -311350 -294929
14990 -294929 -376826 -393533 -300847 -236751 -145793 -82463 16365 -44780 -217368 -174232 -110880
14979 -110880 -60608 -171545 -176696 -189459 -205348 -139906 -53797 -116801 -168187 -248757 -257933 -278658
14967 -278658 -393262 -221695 -115494 -70616 -89777 -166263 -212546 -48630 84894 29932
14957 29932 -34163 -163895 -194064 -129128 -50704 -3119 -13024 -68440 -56178 -21802 -60248 -90027
$$ packed form
15036A69062j10532j50996k6961J69124N5802j17334K7688J7651q4446n3115J00888
15025c169M6018o1750M2222L1220k7309j42626o950p3208j6132J7636J20748Q0626
15013G326m8058j83559p8049Q1856Q751P5037o362n2534j5640P7906R7017M5308
15001H999m5735j23371K7151N9329q4937k4722q1505j00199J9302L4338J6421
14990b94929q1897j6707R2686O4096R0958O3330R8828o1145j72588M3136O3352
14979a10880N0272j10937n151j2763j5889O5442Q6109o3004n1386q0570r176k0725
14967b78658j14604J71567J06201M4878j9161p6486m6283J63916J33524n4962
14957B9932o4095j29732l0169O4936P8424M7585r905n5416J2262L4376l8446k9779
$$ plain form
14945 -90027 -23425 75262 25950 119434 87920 -58282 -94423 -30304 -105221 -93927 -11745
14934 -11745 97026 95359 26456 32068 19310 -39164 -36301 -148980 -93839 -19574 -32670 -78607
14922 -78607 -100941 -68261 -58061 -62861 -172368 -332003 -352188 -218891 -145720 -68633 -40045
14911 -40045 -92888 -44625 90981 81850 12511 -95405 -138970 -166935 -201528 -209361 -267132 -154330
14899 -154330 -12210 -9297 -129776 -143708 -140007 -140592 -113382 -139155 -261795 -289060 -284555 -184406
14887 -184406 -107551 -100782 -125801 -171563 -114448 -45648 117588 156348 154621 209862 118185 118691
14875 118691 -7411 -39209 -33727 -165026 -225862 -191111 -94003 -147857 -209741 -278556 -352880
14864 -352880 -81397 -72481 -157702 -215387 -336770 -328584 -395029 -328142 -170060 -178392 -112181
$$ packed form
14945i0027O6602R8687m9312R3484l1514j46202l6141O4119p4917J1294Q2182
14934a1745J08771j667o8903N612j2758n8474K863j12679N5141P4265j3096m5937
14922g8607k2334L2680J0200m800j09507j59635k0185J33297P3171P7087K8588
14911d0045n2843M8263J35606r131o9339j07916m3565k7965l4593p833n7771J12802
14899a54330J42120K913j20479j3932L701n85K7210k5773j22640k7265M505J00149
14887a84406P6855O769k5019m5762N7115O8800J63236L8760j727N5241r1677N06
14875A18691j26102l1798N482j31299o0836L4751R7108n3854o1884o8815p4324
14864c52880K71483Q916q5221n7685j21383Q186o6445O6887J58082q332O6211
$$ plain form
14853 -112181 -86879 -115645 -82178 -26627 52654 -56109 -120451 -12762 109473 79289 76458
14842 76458 125478 59131 -57618 -16132 -90966 -62377 52987 88393 111768 136015 171472
14831 171472 120539 -38318 -30281 -78890 -79286 -26588 124625 259893 258035 61972 -2802
14820 -2802 5873 -53643 -47465 -87633 -36957 23237 4726 -61431 18326 73100 40616 -71267
14808 -71267 -150537 -193809 -45720 54482 -56726 -290396 -253878 -221898 -265703 -153610 -140871
14797 -140871 -178552 -173506 -114929 -29650 -46092 -105843 -158982 -198322 -194872 -61628 16698 49554
14785 49554 55863 58903 -16737 -99122 -216029 -115063 -174470 -246941 -175707 -55471 -48914 -124201
14773 -124201 -184211 -146010 -75010 -71865 -54192 104844 107028 63614 -11322 -52457 76646
$$ packed form
14853a12181K5302k8766L3467N5551P9281j08763o4342J07689J22235l0184k831
14842G6458M9020o6347j16749M1486p4834K8589J15364L5406K3375K4247L5457
14831A71472n0933j58857Q037m8609l96N2698J51213J35268j858j96063o4774
14820b802Q675n9516O178m0168N0676O0194j8511o6157P9757N4774l2484j11883
14808g1267p9270m3272J48089J00202j11208k33670L6518L1980m3805J12093J2739
14797a40871l7681N046N8577Q5279j6442n9751n3139l9340L450J33244P8326L2856
14785D9554O309L040p5640q2385j16907J00966n9407p2471P1234J20236O557p5287
14773a24201o0010L8201P1000L145J7673J59036K184m3414p4936m1135J29103
$$ plain form
14762 76646 -42066 -270809 -344225 -231997 -34242 -20873 27083 4751 -70629 -179633 -214557
14751 -214557 -62387 -57171 -147314 -45953 -55543 -148002 -285556 -334288 -217496 -136244 -2425
14740 -2425 -13636 -82665 -179823 -277153 -198557 -123319 -81661 71483 151367 106859 -10271
14729 -10271 -52537 -202263 -309712 -141906 -54055 -146245 -53148 -39870 -150475 -145532 -46244
14718 -46244 -51434 -91010 -115017 -33264 51890 -92223 -189995 -194006 -259693 -188459 -204573 -183425
14706 -183425 -186136 -211602 -106813 -73211 -181962 -108538 30485 -91178 -205578 -246075 -11840
14695 -11840 19108 -121090 -175930 -99771 55073 91665 12138 -42985 -37425 -6677 54176
14684 54176 -58581 -126827 58453 53955 -72248 -114286 -82079 -176172 -140335 -61293 28640
$$ packed form
14762G6646j18712k28743p3416J12228J97755J3369M7956k2332p5380j09004l4924
14751b14557J52170N216r0143J01361r590r2459j37554m8732J16792Q1252J33819
14740b425j1211o9029r7158r7330P8596P5238M1658J53144P9884m4508j17130
14729a0271m2266j49726j07449J67806Q7851r2190R3097J3278j10605M943R9288
14718d6244n190l9576k4007Q1753Q5154j44113r7772m011o5687P1234j6114K1148
14706a83425k711k5466J04789L3602j08751P3424J39023j21663j14400m0497K34235
14695a1840L0948j40198n4840P6159J54844L6592p9527n5123N560L0748O0853
14684E4176j12757o8246J85280m498j26203m2038L2207r4093L5837P9042Q9933
$$ plain form
14673 28640 145225 171450 -25348 -165025 -181658 -133788 -163432 -86225 -8212 59559 32852
14662 32852 -24770 -84432 -214746 -150209 -111303 -164541 -325396 -323492 -263266 -208137 -210000 -67457
14650 -67457 861 -14466 43284 -27507 3285 -106693 -160697 -287037 -181777 -64991 -30705
14639 -30705 -9199 -67326 -81062 67421 60516 88169 85170 17523 103394 48655 -19618 -179736
14627 -179736 22188 202826 57188 31341 189719 289952 265083 168775 6035 -105719
14617 -105719 -166717 -191554 -180630 -16563 67567 -44557 -8472 91368 122764 12577 -1032
14606 -1032 4796 -6215 -64744 -63739 -9328 14053 -61131 -40581 3623 -71240 -93424 -133648
14594 -133648 -75143 -16018 153343 129581 72185 9387 -48547 -18933 -55313 -206027 -266181
$$ packed form
14673B8640J16585K6225j96798j39677j6633M7870k9644P7207P8013O7771k6707
14662C2852n7622n9662j30314O4537L8906n3238j60855J904O0226N5129j863J42543
14650f7457O8318j5327N7750p0791L0792j09978n4004j26340J05260J16786L4286
14639c0705K1506n8127j3736J48483o905K7653k999o7647Q5871n4739o8273j60118
14627a79736K01924J80638j45638k5847J58378J00233k4869r6308j62740j11754
14617a05719o0998k4837J0924J64067Q4130j12124L6085R9840L1396j10187j3609
14606a032N828j1011n8529J005N4411K3381p5184K0550M4204p4863k2184m0224
14594a33648N8505N9125J69361k3762n7396o2798n7934K9614l6380j50714o0154
$$ plain form
14583 -266181 -280759 -221320 -199680 -266457 -307775 -243643 -169839 -201778 -239566 -178590 -77173
14572 -77173 -145096 -124152 -23851 16914 -97748 -120199 -35229 -106616 -215938 -164540 -44185
14561 -44185 -46395 -280362 -377237 -308653 -244356 -284987 -228440 -187345 -105072 -7642 -23255 21815
14549 21815 13912 28167 -144780 -164118 -130055 -100367 -157603 -279472 -299348 -233597 -109002
14538 -109002 -158140 -60179 -46103 46875 10722 -161029 -184142 -147532 -101972 -153841 -269453
14527 -269453 -169378 -80372 -7122 93389 49441 -40199 -188016 -121973 -69606 -69150 -52539
14516 -52539 -91891 -91302 -123898 -137288 -92388 -18860 26991 53277 -49114 -98394 -126190 -94912
14504 -94912 -109226 -123511 -18001 -22741 -17330 -123479 -245978 -156842 18836 150632 105029
$$ packed form
14583b66181j4578N9439K1640o6777m1318O4132P3804l1939l7788O0976J01417
14572g7173o7923K0944J00301M0765j14662k2451Q4970p1387j09322N1398J20355
14561d4185k210k33967r6875O8584O4297m0631N6547M1095Q2273R7430j5613M5070
14549B1815p903J4255j72947j9338L4063K9688n7236j21869j9876O5751J24595
14538a09002m9138R7961J4076R2978l6153j71751k3113L6610M5560n1869j15612
14527b69453J00075Q9006P3250J00511m3948q9640j47817O6043N2367M56J6611
14516e2539l9352N89l2596j3390M4900P3528M5851K6286j02391m9280k7796L1278
14504i4912j4314j4285J05510m740N411j06149j22499Q9136J75678J31796m5603
$$ plain form
14493 105029 -29988 -118368 -100418 -66554 -2352 -36858 -98235 -72969 -128079 -65600 -38676
14482 -38676 -123161 -210345 -177197 -28707 87889 42849 96566 102194 36618 79963 91032
14471 91032 53301 112116 135455 81420 93624 44381 33881 -91178 -60239 -35824 -97271
14460 -97271 -142751 -237013 -355539 -109463 -13103 -122622 -174723 -44950 -100702 -102228 -190079
14449 -190079 -284634 -187658 -34996 35902 40183 -11559 -12920 -13551 -11355 30432 -36178 -70440
14437 -70440 -72338 -115474 -112018 -33857 -22422 -118265 -170203 -231598 -314856 -229969 -195318 -243244
14425 -243244 -168032 -151708 -84510 -9459 -50381 -94314 94785 133785 129441 79715 112505
14414 112505 97440 6378 -55173 -54480 32671 63871 138164 42136 -13217 -126740 -116710 13105
$$ packed form
14493A05029j35017q8380J7950L3864O4202l4506o1377K5266n5110O2479K6924
14482c8676q4485q7184L3148J48490J16596m5040N3717N628o5576M3345J1069
14471I1032l7731N8815K3339n4035J2204m9243j0500j25059L0939K4415o1447
14460i7271m5480r4262j18526K46076R6360j09519n2101J29773n5752j526q7851
14449a90079r4555R6976J52662P0898M281n1742j361o31K196M1787o6610l4262
14437g0440j898m3136L456P8161J1435r5843n1938o1395q3258Q4887L4651m7926
14425b43244P5212J6324O7198P5051m0922m3933J89099L9000m344m9726L2790
14414A12505j5065r1062o1551O93Q7151L1200P4293r6028n5353j13523J0030J29815
$$ plain form
14402 13105 146690 76626 -105814 -19703 106439 -26171 -207859 -285044 -234781 -113505
14392 -113505 7148 -86848 -118035 -58218 -63691 -105231 -211955 -262223 -180309 -196778 -251735
14381 -251735 -211865 -166229 -95047 -70800 -46868 -157706 -179216 -182749 -169268 -154077 -141426
14370 -141426 -44790 -95624 -28709 -68225 -88272 8750 -9400 23681 181221 199871 176766
14359 176766 90211 35629 -67328 -132757 -117772 -107813 -191553 -177229 -122794 -75763 -51589
14348 -51589 -104425 -218630 -218672 -121103 -4089 39492 6932 -76238 -39422 98606 -2948
14337 -2948 -190501 -239673 -248884 -275754 -296291 -309825 -212194 -112456 -32660 17034 2243 54910
14325 54910 121307 251290 186424 146317 159060 224422 248601 67414 -57172 -221961 -230852
$$ packed form
14402A3105J33585p0064j82440Q6111J26142j32610j81688p7185N0263J21276
14392a13505J20653r3996l1187N9817n473m1540j06724n0268Q1914j6469n4957
14381b51735L9870M5636P1182K4247K3932j10838k1510l533J3481J5191J2651
14370a41426R6636n0834O6915l9516k0047R7022j8150L3081J57540J8650k3105
14359A76766q6555n4582j02957o5429J4985R959q3740J4324N4435M7031K4174
14348e1589n2836j14205m2R7569J17014M3581l2560q3170L6816J38028j01554
14337b948j87553m9172r211k6870k0537j3534R7631R9738P9796M9694j4791N2667
14325E4910O6397J29983o4866m0107J2743O5362K4179j81187j24586j64789q891
$$ plain form
14314 -230852 -148879 -111356 -145253 -227399 -76327 -30481 -113399 -79950 -50639 -38615 5743
14303 5743 22195 70668 89995 35724 1037 -16544 -60877 -145223 -272629 -242405 -130448
14292 -130448 -91051 -175768 -241931 -132247 -76877 -50351 93529 31248 -126009 -83712 -186931
14281 -186931 -264278 -273809 -112627 110610 113854 1127 -114803 -68813 -144159 -256676 -285825
14270 -285825 -314162 -217838 -44792 -140570 -257407 -298156 -183974 -183682 -127825 -111786 -120933
14259 -120933 -58268 -1039 -19760 -44782 -15205 -63475 -96266 -42720 12475 34585 167358
14248 167358 28833 -81641 -111400 -77179 -154428 -48641 -9875 -56965 -114259 -101374 -54376
14237 -54376 -149765 -168029 -141548 -199005 -259696 -215909 -188184 -146242 -134835 -189463 -122541 -54360
$$ packed form
14314b30852Q1973L7523l3897q2146J51072M5846q2918L3449K9311J2024M4358
14303E743J6452M8473J9327n4271l4687j7581m4333q4346j27406L0224J11957
14292a30448L9397q4717o6163J09684N5370K6526J43880o2281j57257M2297j03219
14281a86931p7347r531J61182K23237L244j12727j15930M5990p5346j12517k9149
14270b85825k8337R6324J73046r5778j16837m0749J14182K92N5857J6039r147
14259a20933O2665N7229j8721k5022K9577m8270l2791N3546N5195K2110J32773
14248A67358j38525j10474k9759L4221p7249J05787L8766m7090n7294J2885M6998
14237e4376r5389j8264K6481n7457o0691M3787K7725M1942J1407n4628O6922O8181
$$ plain form
14225 -54360 35895 63568 29642 93113 130567 36370 -70180 -136205 -221799 -221954 -145131 51177
14213 51177 62112 -52402 -123012 -83082 51684 85920 117603 77728 -64179 -195576 -127596
14202 -127596 -134684 -91010 -97813 -133607 -99183 -115569 -101298 -134689 -119487 -109264 -179975 -199840
14190 -199840 -193142 -47402 -79722 -97690 -90549 -147665 -36568 -180055 -265983 -258117 -276335
14179 -276335 -147388 -62346 -80129 -4929 -18598 -99581 -25471 -699 -42562 -59673 -99438
14168 -99438 -55716 -9527 -163797 -329014 -371692 -287894 -141660 -149957 -88744 26964 -37841
14157 -37841 -11304 68564 -17962 63401 80388 37124 121567 108018 78923 -54894 88055
14146 88055 18771 -263850 -423394 -338053 -236182 -107056 78638 126944 145673 174227 -13680
$$ packed form
14225e4360R0255K7673l3926O3471L7454r4197j06550o6025q5594j55P6823J96308
14213E1177J0935j14514p0610L9930J34766L4236L1683l9875j41907j31397O7980
14202a27596p088M3674o803l5794L4424j6386J4271l3391J5202J0223p0711j9865
14190a99840O698J45740l2320j7968P141n7116J11097j43487q5928P866j8218
14179b76335J28947Q5042j7783P5200j3669q0983P4110K4772m1863j7111l9765
14168i9438M3722M6189j54270j65217m2678Q3798J46234q297O1213J15708o4805
14157c7841K6537P9868q6526Q1363J6987m3264Q4443j3549k9095j33817J42949
14146H8055o9284k82621j59544Q5341J01871J29126J85694M8306J8729K8554j87907
$$ plain form
14135 -13680 -101085 -139192 -44525 21540 10486 57482 -2742 -42414 -38237 -60847 -62233 -21340
14123 -21340 -51901 -192445 -245903 -129215 -106344 -166344 -131345 -114714 -112898 -2242 71809
14112 71809 -164343 -275334 -329460 -281065 -171516 -124286 -97404 -163376 -111495 -111673 -108514 -53835
14100 -53835 -119592 -175001 -323695 -222411 -67718 -167123 -161884 -17184 -21185 -21202 -124468 -42514
14088 -42514 66724 -31110 -119143 -93755 -13143 55300 204590 140009 -14399 -117389 -167021
14077 -167021 -136226 -65214 331 25527 25718 6850 67244 11507 -181795 -306019 -190178
14066 -190178 -146600 -93399 -66900 -133433 -259824 -307083 -287790 -305592 -222747 -140973 -128399
14055 -128399 -146450 -223779 -182359 47549 259177 398379 331050 154658 143120 133439 107514
$$ packed form
14135a3680q7405l8107R4667O6065j1054M6996o0224l9672M177k2610j386M0893
14123b1340l0561j40544n3458J16688K2871o0000L4999J6631J816J10656P4051
14112G1809k36152j10991n4126M8395J09549M7230K6882o5972N1881j78L159N4679
14100e3835o5757n5409j48694J01284J54693r9405N239J44700m001j7j03266Q1954
14088d2514J09238r7834q8033K5388Q0612O8443J49290o4581j54408j02990m9632
14077a67021L0795P1012O5545K5196J91j8868O0394n5737j93302j24224J15841
14066a90178M3578N3201K6499o6533j26391m7259J9293j7802Q2845Q1774J2574
14055a28399j8051p7329M1420K29908K11628J39202o7329j76392j1538r681k5925
$$ plain form
14044 107514 189946 219882 159078 -22843 -142993 -149821 -146140 -20911 117261 120488 54956
14033 54956 -11261 -45954 -71656 -199052 -152626 -44021 53368 -1364 77316 145115 103780
14022 103780 196248 265460 186054 69660 29510 12949 18314 51773 31177 -30546 39228
14011 39228 38329 94788 120160 50114 28927 -20909 -75827 -88632 65988 117688 -43826 -150627
13999 -150627 -182313 -267663 -289551 -291382 -246525 -62797 -39586 -103674 -98647 -133457 -124396 31255
13987 31255 159667 205402 135886 82556 120923 20185 -164831 -252007 -148384 -189975 -99482
13976 -99482 137381 184063 167682 91005 15003 -44910 40921 -5456 -44501 -22519 -95949
13965 -95949 -115455 -201547 -171383 -68395 33662 -628 -60122 -65008 -189593 -131744 55929
$$ packed form
14044A07514Q2432K9936o0804j81921j20150o828L681J25229J38172L227o5532
14033E4956o6217l4693k5702j27396M6426J08605R7389n4732P8680O7799m1335
14022A03780R2468O9212p9406j16394m0150j6561N365L3459k0596o1723O9774
14011C9228q99N6459K5372p0046k1187m9836n4918j2805J54620N1700j61514j06801
13999a50627l1686q5350k1888j831M4857J83728K3211o4088N027l4810R061J55651
13987C1255J28412M5735o9516n3330L8367j00738j85016q7176J03623m1591R0493
13976i9482K36863M6682j6381p6677p6002n9913Q5831m6377l9045K1982p3430
13965i5949j9506q6092L0164J02988J02057l4290n9494m886j24585N7849J87673
$$ plain form
13954 55929 68090 14686 58798 72333 3774 -10390 43350 -51627 -2040 53592 -88066
13943 -88066 -128230 -98503 -110988 -188314 13649 79348 37653 -8672 -38419 -97792 -94312 -89497
13931 -89497 -117039 -110695 -42939 -161079 -138002 -25049 -65766 15831 -16987 -94199 -20811
13920 -20811 212797 221098 140469 22284 4836 63543 19138 7676 63599 34551 -91148
13909 -91148 -224530 -114242 76552 70348 44097 67660 -35747 -35463 37578 52185 -11131
13898 -11131 -134874 -154997 -22052 118918 44421 -72105 -77566 -90075 -80550 7798 -64085
13887 -64085 -256708 -327845 -312330 -281364 -205258 -150926 -125501 -16701 -59533 -124674 -94098
13876 -94098 21607 -3652 -65862 -52143 -138536 -231106 -279118 -240190 -161061 -183168 -240365
$$ packed form
13954E5929J2161n3404M4112J3535o8559j4164N3740r4977M9587N5632j41658
13943h8066m0164K9727j2485p7326K01963O5699m1695m6325k9747n9373L480M815
13931h9497k7542O344O7756j18140K3077J12953m0717Q1597l2818p7212P3388
13920b0811K33608Q301q0629j18185j7448N8707m4405j1462N5923k9048j25699
13909i1148j33382J10288J90794o204k6251K3563j03407K84P3041J4607o3316
13898a1131j23743k0123J32945J40970p4497j16526n461j2509R525Q8348p1883
13887f4085j92623p1137J5515L0966P6106N4332K5425J08800m2832o5141L0576
13876i4098J15705k5259o2210J3719q6393r2570m8012L8928P9129k2107n7197
$$ plain form
13865 -240365 -135617 -161553 -212811 -201588 -152418 -210143 -149532 3624 -39896 -176274 -128911
13854 -128911 -112398 42540 102364 29457 139165 173003 139869 163709 63922 -107176 -65144
13843 -65144 -48703 -61778 72259 153583 67436 32686 -20878 -53584 24289 175717 175937 101237
13831 101237 151756 109703 -3485 6573 -86296 -86627 -83623 -103307 -205514 -202098 -152695 -122852
13819 -122852 -137831 -95129 -75776 -126059 -174303 -189879 -353352 -327845 -320899 -280991 -212642
13808 -212642 -162201 -127531 68593 202441 271303 216740 72254 -11966 41495 41248 -78325
13797 -78325 -179012 -244527 -263952 -253314 -278714 -70501 16201 66879 87207 -16449 96693
13786 96693 206797 200218 190087 91424 14887 31838 40112 32324 43534 11438 979 55195
$$ packed form
13865b40365J04748k5936n1258J1223M9170n7725O0611J53156m3520j36378M7363
13854a28911J6513J54938N9824p2907J09708L3838l3134K3840r9787j71098M2032
13843f5144J6441j3075J34037Q1324q6147l4750n3564l2706P7873J51428K20p4700
13831A01237N0519m2053j13188J0058r2869l31L004j9684j02207L416M9403K9843
13819a22852j4979M2702J9353n0283m8244j5576j63473K5507O946L9908O8349
13808b12642N0441L4670J96124J33848O8862n4563j44486q4220N3461k47j19573
13797g8325j00687o5515j9425J0638k5400K08213Q6702N0678K0328j03656J13142
13786I6693J10104o579j0131r8663p6537J6951Q274p788J1210l2096j0459N4216
$$ plain form
13774 55195 136441 256811 323488 212957 255012 351750 354830 411188 184114 162283 244170
13763 244170 367146 373954 396146 554377 586031 616974 475679 504509 546786 714975 802828
13752 802828 737175 597592 716570 826811 1006146 975757 958089 866574 760452 705230
13742 705230 714116 714740 629650 567482 517933 449888 438011 370017 341443 384489 329015 159530
13730 159530 128806 222477 89194 53250 101164 157181 102006 109628 196479 251574 311714
13719 311714 390117 356599 236946 135166 145276 164049 -27904 -39599 91265 63531 21286
13708 21286 16472 27414 58090 89797 130451 217744 136269 191637 148337 130268 35115 -24032
13696 -24032 -31700 60858 -31112 -112339 -23281 46744 144808 207282 163162 142110 77022 -31030
$$ packed form
13774E5195Q1246J20370O6677j10531M2055R6738L080N6358k27074k1831Q1887
13763B44170J22976O808K2192J58231L1654L0943j41295K8830M2277J68189Q7853
13752H02828o5653j39583J18978J10241J79335l0389j7668r1515j06122n5222
13742G05230Q886O24q5090o2168m9549o8045j1877o7994k8574M3046n5474j69485
13730A59530l0724R3671j33283l5944M7914N6017n5175P622Q6851N5095O0140
13719C11714P8403l3518j19653j01780J0110J8773j91953j1695J30864k7734m2245
13708B1286m814J0942L0676L1707M0654Q7293q1475N5368m3300j8069r5153n9147
13696b4032p668R2558r1970q1227Q9058P0025R8064O2474m4120k1052o5088j08052
$$ plain form
13684 -31030 -23215 58700 168948 176475 167992 126028 34162 45506 161377 135543 112615 273055
13672 273055 259351 131590 247430 221224 265901 351137 237936 91591 172909 168795 235962
13661 235962 220478 124209 133889 61831 132884 253221 214977 114192 107402 25543 -80399
13650 -80399 -220322 -200772 -126607 -63416 -45759 -17736 89242 120372 172257 92859 -18808
13639 -18808 -126 38290 103555 98239 83052 45371 60005 131402 142242 159080 269097 274946
13627 274946 149804 64034 173448 102770 20983 -77732 -69083 32216 74901 50271 -21633
13616 -21633 -26714 14 31989 109566 12095 -61013 -92373 67259 120794 132174 194503 143857
13604 143857 260298 269924 160564 43992 32982 113732 -25572 -57948 96405 260073
$$ packed form
13684c1030P815Q1915J10248P527q483m1964r1866J1344J15871k5834k2928J60440
13672B73055j3704j27761J15840k6206M4677Q5236j13201j46345Q1318m114O7167
13661B35962j5484r6269R680p2058P1053J20337l8244j00785o790q1859j05942
13650h0399j39923J9550P4165O3191J7657K8023J06978L1130N1885p9398j11667
13639a8808J8682L8416O5265n316j5187l7681J4634P1397J0840J6838J10017N849
13627B74946j25142q5770J09414p0678q1787r8715Q649J01299M2685k4630p1904
13616b1633n081K6728L1975P7577r7471p3108l1360J59632N3535J1380O2329n0646
13604A43857J16441R626j09360j16572j1010Q0750j39304l2376J54353J63668
$$ plain form
13594 260073 188537 107460 68365 55409 253752 330314 369851 448963 467087 396390 282659
13583 282659 306926 501250 392906 307019 269116 338630 375537 388432 410172 351997 314648
13572 314648 310415 300268 244198 167881 193282 204079 288153 470416 371643 320506 268004
13561 268004 273115 240794 255599 190335 200821 245164 292633 191361 115187 50058 81654
13550 81654 -35189 -40413 69240 188520 297886 358857 502437 573142 431842 191579
13540 191579 109441 113264 239993 319459 163973 86727 187953 252982 216819 244827 257122
13529 257122 108315 19883 34680 8047 84602 156214 164231 248541 356625 451503 545312
13518 545312 469603 499208 475604 305993 115049 154696 180348 113929 230110 192272 167380
$$ packed form
13594B60073p1536q1077l9095j2956J98343P6562L9537P9112J8124p0697j13731
13583B82659K4267J94324j08344q5887l7903O9514L6907J2895K1740n8175l7349
13572C14648m233j0147n6070p6317K5401J0797Q4074J82263r8773n1137n2502
13561B68004N111l2321J4805o5264J0486M4343M7469j01272p6174o5129L1596
13550H1654j16843n224J09653J19280J09366O0971J43580P0705j41300k40263
13540A91579q2138L823J26729P9466j55486p7246J01226O5029l6163K8008J2295
13529B57122j48807q8432J4797k6633P6555P1612Q017Q4310J08084R4878R3809
13518E45312p5709K9605k3604j69611j90944L9647K5652o6419J16181l7838k4892
$$ plain form
13507 167380 158625 50774 91404 172031 153723 75914 106010 237269 314915 325477 416679
13496 416679 589720 565948 410674 273926 350216 451050 578117 602634 658709 590124
13486 590124 555076 618274 619359 534579 434730 469612 515671 596251 457532 352391 326797
13475 326797 294496 486021 656517 682395 663864 851855 800519 555256 504387 540907 461699
13464 461699 431931 368984 306488 352971 430742 476902 404796 298100 242731 225994 384683
13453 384683 387422 357309 404007 425447 552085 701676 618132 510848 580586 585750 666698
13442 666698 604749 627364 681949 576104 567558 642033 791589 824302 831264 736740 833213
13431 833213 1005085 977570 930266 808336 868119 1029311 1137707 1106964 1031997 1102423 1267844
$$ packed form
13507A67380q755j07851M0630Q0627j8308p7809L0096J31259P7646J0562R1202
13496D16679J73041k3772j55274j36748P6290J00834J27067K4517N6075o8585
13486E90124l5048O3198J085q4780r9849L4882M6059Q0580j38719j05141k5594
13475C26797l2301J91525J70496K5878j8531J87991n1336k45263n0869L6520p9208
13464D61699k9768o2947o2496M6483P7771M6160p2106j06696n5369j6737J58689
13453C84683K739l0113M6698K1440J26638J49591q3544j07284O9738N164Q0948
13442F66698o1949K2615N4585j05845q546P4475J49556L2713O962r4524R6473
13431H33213J71872k7515m7304j21930N9783J61192J08396l0743p4967P0426J65421
$$ plain form
13420 1267844 1309971 1323546 1366833 1425358 1483942 1427795 1462572 1522488 1479584 1478208 1532305
13409 1532305 1539065 1569850 1509958 1413778 1433635 1445969 1564030 1705190 1565109 1553861 1517101
13398 1517101 1481074 1428126 1532159 1537138 1570376 1644425 1781370 1866844 1877880 1979477 1938656
13387 1938656 1934528 1970526 2053046 2230720 2325429 2397770 2400461 2417992 2449347 2479512 2528716
13376 2528716 2720360 2739078 2874659 3097251 3224947 3300440 3379346 3502298 3531299 3514557
13366 3514557 3499023 3567043 3801175 4009517 4121766 4242510 4274202 4410076 4514514 4562437
13356 4562437 4651771 4829225 5051781 5188410 5339398 5455977 5579929 5681625 5872068 6072302
13346 6072302 6224333 6445621 6800058 7110797 7393144 7808063 8338405 8767727 9053996
$$ packed form
13420A267844M2127J3575M3287N8525N8584n6147L4777N9916m2904j376N4097
13409A532305O760L0785n9892r6180J9857J2334J18061J41160j40081j1248l6760
13398A517101l6027n2948J04033M979L3238P4049J36945Q5474J1036J01597m0821
13387A938656m128L5998Q2520J77674R4709P2341K691J7531L1355L0165M9204
13376B528716J91644J8718J35581K22592J27696P5493P8906J22952K9001j6742
13366C514557j5534O8020K34132K08342J12249J20744L1692J35874J04438M7923
13356D562437Q9334J77454K22556J36629J50988J16579J23952J01696J90443K00234
13346F072302J52031K21288L54437L10739K82347M14919N30342M29322K86269
$$ plain form
13337 9053996 9569844 10133855 10578154 11276318 11938241 12568749 13276848 14193235 15263015
13328 15263015 16307877 17468820 18736263 20017757 21645578 23454715 25409408 27582260
13320 27582260 30071580 32914937 36046164 39512561 43536113 48066455 53268234 59305365
13312 59305365 66153427 74045216 83089961 93388167 104990938 117896955 131735708
13305 131735708 145936167 159988644 173007075 183846166 191311962 194950681 194577723
13298 194577723 190188771 182323182 171870789 159647870 146739375 133806083 121578531
13291 121578531 110410973 100035383 90806707 82819512 75937311 69867863 64378215 59697605
13283 59697605 55499412 51773110 48455326 45330411 42537827 40160776 37954156 36025061
$$ packed form
13337I053996N15848N64011M44299O98164O61923O30508P08099R16387J069780
13328A5263015J044862J160943J267443J281494J627821J809137J954693K172852
13320B7582260K489320K843357L131227L466397M023552M530342N201779O037131
13312E9305365O848062P891789R044745J0298206J1602771J2906017J3838753
13305A31735708J4200459J4052477J3018431J0839091P465796L638719l72958
13298A94577723m388952p865589j0452393j2222919j2908495j2933292j2227552
13291A21578531j1167558j0375590r228676p987195o882201o069448n489648m680610
13283E9697605m198193l726302l317784l124915k792584k377051k206620j929095
$$ plain form
13275 36025061 34343576 32835268 31421543 30241432 29272266 28228877 27261670 26540423
13267 26540423 25987610 25567908 25300031 25123675 24919555 24712923 24591385 24695087 24807673
13258 24807673 24860527 25032202 25402961 25834315 26378889 26966254 27397757 27767919 28133545
13249 28133545 28552759 28789157 28939295 28845605 28587490 28314761 27706449 26955691 26238049
13240 26238049 25500529 24536510 23612309 22733287 21781417 20906106 20010039 19216421 18553690
13231 18553690 17795876 16922078 16181895 15594083 14942439 14357731 13791253 13245874 12852411
13222 12852411 12525971 12228258 11919876 11606107 11106643 10636098 10373365 10078803 9920728
13213 9920728 9719482 9431428 9031227 8647479 8510813 8464696 8325056 7968342 7661204 7577441
$$ packed form
13275C6025061j681485j508308j413725j180111r69166j043389r67207p21247
13267B6540423n52813m19702k67877j76356k04120k06632j21538J03702J12586
13258B4807673N2854J71675L70759M31354N44574N87365M31503L70162L65626
13249B8133545M19214K36398J50138r3690k58115k72729o08312p50758p17642
13240B6238049p37520r64019r24201q79022r51870q75311q96067p93618o62731
13231A8553690p57814q73798p40183n87812o51644n84708n66478n45379l93463
13222A2852411l26440k97713l08382l13769m99464m70545k62733k94562j58075
13213I920728k01246k88054m00201l83748j36666m6117j39640l56714l07138q3763
$$ plain form
13203 7577441 7434790 7129518 6873593 6716046 6683492 6672849 6476847 6212020 5999657 5821811
13193 5821811 5788351 5716383 5604857 5488673 5264036 5128070 5049566 4741107 4635857 4562687
13183 4562687 4439023 4321708 4254822 4177206 4144212 4005503 3860462 3872948 3864430 3803821 3769429
13172 3769429 3694216 3626633 3565150 3522723 3467257 3415577 3461779 3382108 3195560 3153158 3188521
13161 3188521 3155781 3054396 2886547 2645182 2653271 2601209 2568455 2512286 2455127 2444234 2434130
13150 2434130 2450720 2476773 2376823 2350611 2174818 2034247 2106686 2194841 2146403 2055069 2021772
13139 2021772 2058101 2113074 2091839 2069605 1927573 1779846 1805827 1830897 1803487 1750839 1823445
13128 1823445 1833561 1811804 1767404 1643816 1718696 1849178 1830745 1921164 1987014 2041833 2036919
$$ packed form
13203G577441j42651l05272k55925j57547l2554j0643j96002k64827k12363j77846
13193E821811l3460p1968j11526j16184k24637j35966p8504l08459j05250p3170
13183D562687j23664j17315o6886p7616l2994j38709j45041J2486q518o0609l4392
13172C769429p5213o7583o1483m2427n5466n1680M6202p9671j86548m2402L5363
13161C188521l2740j01385j67849k41365Q089n2062l2754n6169n7159j0893j0104
13150B434130J6590K6053r9950k6212j75793j40571P2439Q8155m8438r1334l3297
13139B021772L6329N4973k1235k2234j42032j47727K5981K5070k7410n2648P2606
13128A823445J0116k1757m4400j23588P4880J30482j8433R0419O5850N4819m914
$$ plain form
13117 2036919 1907973 1632749 1493673 1381316 1372697 1491617 1349051 1305881 1271914 1208601
13107 1208601 1211489 1177689 1054198 1066403 1012042 1003812 1054891 1084072 987923 1001728 1117694
13096 1117694 1091073 1086683 900847 932755 908702 899652 901445 800614 726361 686054 770830
13085 770830 756957 797109 872461 810761 669794 660694 875973 989537 1041374 1244350 1216654
13074 1216654 1192153 1032675 959120 869160 805318 732249 796158 710640 711276 696390 711373
13063 711373 751455 582803 535306 472191 542306 708593 785835 709578 579135 583308 642325
13052 642325 661511 535351 495673 480530 490118 426266 300601 247615 246962 122531 131802 246439
13040 246439 217257 261039 229344 284738 437338 453121 502446 599920 584407 605480 590502
$$ packed form
13117B036919j28946k75224j39076j12357q619J18920j42566m3170l3967o3313
13107A208601K888l3800j23491J2205n4361q230N1079K9181r6149J3805J15966
13096A117694k6621m390j85836L1908k4053r050J793j00831p4253m0307Q4776
13085G70830j3873M0152P5352o1700j40967r100K15279J13564N1837K02976k7696
13074A216654k4501j59478p3555q9960o3842p3069O3909q5518O36j4886J4983
13063G11373M0082j68652m7497o3115P0115J66287P7242p6257j30443M173N9017
13052F42325J9186j26160l9678j5143R588o3852j25665n2986o53j24431R271J14637
13040B46439k9182M3782l1695N5394J52600J5783M9325R7474j5513K1073j4978
$$ plain form
13029 590502 493144 359513 291490 359214 324229 386229 452522 330957 285970 322963 328880
13018 328880 382633 250132 66963 8603 23512 170318 281638 294282 314777 281395 357830
13007 357830 440849 461319 384736 310976 427593 629821 771307 731690 706720 683183 623801
12996 623801 596444 639773 714484 705987 552268 535794 572958 557542 501508 416930 418456 483527
12984 483527 415893 358862 359667 399644 490201 475373 385548 335685 230442 71348 92129
12973 92129 306718 447604 354360 347640 383679 394345 370998 379543 363269 304188 169277
12962 169277 244396 321920 275999 194405 227057 208169 304142 479901 487024 191117 149740
12951 149740 239324 307374 298798 273550 268986 240986 323593 371830 271859 239149 177698 135665
$$ packed form
13029E90502r7358j33631o8023O7724l4985O2000O6293j21565m4987L6993N917
13018C28880N3753j32501j83169n8360J4909J46806J11320J2644K0495l3382P6435
13007C57830Q3019K0470p6583p3760J16617K02228J41486l9617k4970k3537n9382
12996F23801k7357M3329P4711q497j53719j6474L7164j5416n6034q4578J526O5071
12984D83527o7634n7031Q05L9977R0557j4828q9825m9863j05243j59094K0781
12973I2129K14589J40886r3244o720L6039J0666k3347Q545j6274n9081j34911
12962A69277P5119P7524m5921q1594L2652j8888R5973J75759P123k95907m1377
12951A49740Q9584O8050q576k5248m564k8000Q2607M8237r9971l2710o1451m2033
$$ plain form
12939 135665 13215 17440 123269 75392 93469 148294 67550 137987 225871 240271 57165
12928 57165 61274 256032 377876 442661 357600 229572 132415 118693 244348 368241 370354
12917 370354 282030 196811 167968 98688 50664 53052 81893 211347 200182 184333 164528
12906 164528 194901 178214 240508 344274 359599 190813 216747 159412 7681 -124715 -209482
12895 -209482 -139543 29478 167827 156780 65475 170972 218354 222279 190177 239129 137293
12884 137293 -26467 64665 132074 39581 81006 18065 33396 187985 194375 68164 253513
12873 253513 326928 404341 404724 277842 217190 183197 92186 130908 13183 9113 204486
12862 204486 280005 229307 230209 361387 403304 325255 380254 471222 618481 591060 534196
$$ packed form
12939A35665j22450M225J05829m7877J8077N4825q0744P0437Q7884J4400j83106
12928E7165M109J94758J21844O4785q5061j28028r7157j3722J25655J23893K113
12917C70354q8324q5219k8843o9280m8024K388K8841J29454j1165j5849j9805
12906A64528L0373j6687O2294J03766J5325j68786K5934n7335j51731j32396q4767
12895b09482O9939J69021J38349j1047r1305J05497M7382L925l2102M8952j01836
12884A37293j63760R1132O7409r2493M1425o2941J5331J54589O390j26211J85349
12873B53513P3415P7413L83j26882o0652l3993r1011L8722j17725m070J95373
12862B04486P5519n0698R02J31178M1917p8049N4999R0968J47259k7421n6864
$$ plain form
12851 534196 551539 560151 560772 573571 726281 821934 790760 778642 854601 884841 825269 821066
12839 821066 783851 793346 693950 594906 562577 546750 592995 585733 565860 534294 554328 490746
12827 490746 399762 336648 259109 159015 87593 134514 157350 247469 189523 113349 218962
12816 218962 308560 438167 452624 374497 313094 211724 188154 301241 249983 233476 179000
12805 179000 22516 16615 218837 278336 207205 182185 391786 414168 390802 387444 337269
12794 337269 317411 264129 206871 237001 254123 147732 232686 311412 305449 302828 281089 187262
12782 187262 115434 191306 67670 -46656 -51473 -80676 -13245 36520 98826 140312 213781
12771 213781 232615 301344 340548 380490 308854 250900 202528 128868 168858 190787 203938
$$ packed form
12851E34196J7343Q612O21J2799J52710R5653l1174j2118P5959L0240n9572m203
12839H21066l7215R495r9396r9044l2329j5827M6245p262j9873l1566K0034o3582
12827D90746r0984o3114p7539j00094p1422M6921K2836R0119n7946p6174J05613
12816B18962Q9598J29607J4457p8127o1403j01370k3570J13087n1258j6507n4476
12805A79000j56484n901K02222N9499p1131k5020K09601K2382k3366l358n0175
12794C37269j9858n3282n7258L0130J7122j06391Q4954P8726n963k621k1739r3827
12782A87262p1828P5872j23636j14326m817k9203O7431M9765O2306M1486P3469
12771B13781J8834O8729L9204L9942p1636n7954m8372p3660L9990K1929J3151
$$ plain form
12760 203938 175126 166685 113778 168371 139715 147302 97535 93344 138146 104528 116069 104976
12748 104976 122109 140350 188829 -2142 -27925 70847 134715 148315 234028 123230 21006
12737 21006 18705 74830 -14253 47916 191863 165647 152217 156963 112357 149835 339316 469329
12725 469329 477504 338074 278777 262355 174478 115590 73163 51020 25773 8196 -65531
12714 -65531 20359 116779 149894 140374 -69589 -332867 -324475 -312036 -257189 -115054 -53785
12703 -53785 -67139 25821 98021 33842 -70072 -71584 26146 142849 51606 -21303 -6274
12692 -6274 79708 136821 175265 143695 -13016 -75047 -99589 -104858 -128896 -113969 -188333 -207872
12680 -207872 -108682 -84018 -158362 -324179 -239428 -186767 -72031 -74614 -132017 -74155 496
$$ packed form
12760B03938k8812q441n2907N4593k8656P587m9767m191M4802l3618J1541j1093
12748A04976J7133J8241M8479j90971k5783R8772O3868J3600Q5713j10798j02224
12737B1006k301N6125q9083O2169J43947k6216j3430M746m4606L7478J89481J30013
12725D69329Q175j39430n9297j6422q7877n8888m2427k2143k5247j7577p3727
12714f5531Q5890R6420L3115r520k09963k63278Q392J2439N4847J42135O1269
12703e3785j3354R2960P2200o4179j03914j512R7730J16703r1243p2909J5029
12692f274Q5982N7113L8444l1570j56711o2031k4542n269k4038J4927p4364j9539
12680b07872R9190K4664p4344j65817Q4751N2661J14736k583n7403N7862P4651
$$ plain form
12669 496 -29447 61838 207335 95073 21264 127981 242850 184670 115284 73224 72520 -17846
12657 -17846 -124318 -128034 2103 5545 -18210 34298 33400 126262 211675 77361 49973 13594
12645 13594 -1972 -48589 -119675 -70639 -45588 -185969 -137964 -99345 -113730 -123983 -27786
12634 -27786 71722 -11575 63337 116317 140800 66035 29471 108004 249702 207520 125262
12623 125262 103416 46518 22956 -67647 -29147 76295 116810 80536 -18800 -156543 -138707
12612 -138707 -48306 -101827 -136828 -76019 -111487 -122525 -107120 -81864 24332 -21622 -36216
12601 -36216 -31987 -7182 -68992 -127883 -55263 14557 -85612 -152919 -96771 1490 -670 23528
12589 23528 61442 46244 -34110 -131496 -97776 8086 5282 50924 -16814 14240 59997 -43924
$$ packed form
12669D96k9943R1285J45497j12262p3809J06717J14869n8180o9386m2060p04r0366
12657a7846j06472l716J30137L442k3755N2508q98R2862Q5413j34314k7388l6379
12645A3594j5566m6617p1086M9036K5051j40381M8005L8619j4385j0253R6197
12634b7786R9508q3297P4912N2980K4483p4765l6564P8533J41698m2182q2258
12623A25262k1846n6898k3562r0603L8500J05442M0515l6274r9336j37743J7836
12612a38707R0401n3521l5001O0809l5468j1038J5405K5256J06196m5954j4594
12601c6216M229K4805o1810n8891P2620O9820j00169o7307N6148R8261k160K4198
12589B3528L7914j5198q0354r7386L3720J05862k804M5642o7738L1054M5757j03921
$$ plain form
12577 -43924 2423 32034 20451 81386 40392 -50314 93192 275252 290057 220447 139339
12566 139339 64823 3140 -63888 -144084 -135702 -119858 -143697 -66812 24403 111844 83742 103721
12554 103721 120173 -12878 80576 111302 12680 -176213 -166837 -195936 -226861 -165693 -138217
12543 -138217 -158050 -99373 -34756 -29431 44666 22823 10080 24663 59777 -156291 -189495
12532 -189495 13918 116071 90928 111595 161865 175628 115266 181923 267036 203491 142374
12521 142374 157057 133205 87422 100522 43052 41453 -63673 -135034 -187527 -287630 -301188
12510 -301188 -309805 -372086 -247236 -125759 -139829 -76793 2921 26700 -230 35974 -50387
12499 -50387 -165726 -180846 -63529 129676 330717 278732 199567 85095 106367 164448 3474
$$ packed form
12577d3924M6347K9611j1583O0935m0994r0706J43506J82060J4805o9610q1108
12566A39339p4516o1683o7028q0196Q382J5844k3839P6885R1215Q7441k8102J9979
12554A03721J6452j33051R3454L0726r8622j88893R376k9099l0925O1168K7476
12543a38217j9833N8677O4617N325P4097k1843j2743J4583L5114k16068l3204
12532a89495K03413J02153k5143K0667N0270J3763o0362O6657Q5113o3545o1117
12521A42374J4683k3852m5783J3100n7470j599j05126p1361n2493j00103j3558
12510c01188q617o2281J24850J21477j4070O3036P9714K3779k6930L6204q6361
12499e0387j15339j5120J17317J93205K01041n1985p9165j14472K1272N8081j60974
$$ plain form
12488 3474 -155924 -199667 -103160 -168006 -239479 -229075 -259458 -59828 23703 133028 142457
12477 142457 94669 97098 66254 182254 204547 174802 213374 191957 129185 -7567 -122552
12466 -122552 5976 175340 19957 -73760 -31679 83687 207955 76825 64980 14897
12456 14897 -2 -70476 -77077 103223 24132 9798 68096 247253 267702 190198 84186
12445 84186 31440 148370 139153 136523 187305 177464 217011 113111 140060 167443 142571 35079
12433 35079 -16169 -111843 -137677 -242533 -162734 -106990 -133034 -15595 -53768 -105317 -138786
12422 -138786 -68430 -69525 -137632 -40595 -52233 -94056 -27206 35581 63759 93309 209463
12411 209463 159094 58134 -39613 -105516 -144580 -82928 -70086 -145814 -143244 -128367 -250618
$$ packed form
12488C474j59398m3743R6507o4846p1473J0404l0383J99630Q3531J09325R429
12477A42457m7788K429l0844J16000K2293k9745L8572k1417o2772j36752j14985
12466a22552J28528J69364j55383r3717M2081J15366J24268j31130j1845n0083
12456A4897j4899p0474o601J80300p9091j4334N8298J79157K0449p7504j06012
12445H4186n2746J16930r217k630N0782r841L9547j03900K6949K7383k4872j07492
12433C5079n1248r5674k5834j04856P9799N5744k6044J17439l8173n1549l3469
12422a38786P0356j095o8107R7037j1638m1823O6850O2787K8178K9550J16154
12411B09463n0369j00960r7747o5903l9064O1652J2842p5728K570J4877j22251
$$ plain form
12400 -250618 -166972 -160452 -329152 -174265 -23449 -56523 -39515 -21103 -7565 -156551 -171524
12389 -171524 -81795 -104528 -93612 -56028 -4883 -48286 -141358 42864 108427 175681 153465
12378 153465 116820 233030 102437 54539 103164 111210 148965 175895 113869 106651 66823
12367 66823 54217 42671 87615 11174 -113581 -100455 -99120 -131625 -39980 36012 60772 94093
12355 94093 180522 203295 165232 148759 205558 184080 113525 48619 99910 22385 -28557 -14581
12343 -14581 -40586 -32624 63251 -9381 -86671 -54524 20501 -2320 -42752 84335 34981 -62178
12331 -62178 -160017 -174071 -92052 61863 145165 124890 55884 37249 59209 13442 -124919
12320 -124919 -154834 -130266 -106377 -36839 -17613 65174 177987 132074 76906 -112084 -181359
$$ packed form
12400b50618Q3646O520j68700J54887J50816l3074J7008J8412J3538j48986j4973
12389a71524Q9729k2733J0916L7584N1145m3403r3072J84222O5563O7254k2216
12378A53465l6645J16210j30593m7898M8625Q046L7755K6930o2026p218l9828
12367F6823j2606j1546M4944p6441j24755J3126J335l2505R1645P5992K4760L3321
12355I4093Q6429K2773l8063j6473N6799k1478p0555o4906N1291p7525n0942J3976
12343a4581k6005P962R5875p2632p7290L2147P5025k2821m0432J27087m9354r7159
12331f2178r7839j4054Q2019J53915Q3302k0275o9006j8635K1960m5767j38361
12320a24919k9915K4568K3889O9538J9226Q2787J12813m5913n5168j88990o9275
$$ plain form
12309 -181359 -154087 -104144 12003 -4268 -91332 -109390 -156917 -182274 -129946 35429 94641
12298 94641 15318 -7182 -95319 -26341 49324 159642 122224 64410 11498 20973 75511 144122
12286 144122 182908 21912 -110421 -137628 -152893 -217906 -295113 -204556 -20533 -73431 -103730
12275 -103730 -140280 -66134 -146664 -168350 -61583 -17822 -13390 -18911 44434 33440 21605 65202
12263 65202 219368 118356 32800 18451 17044 76080 112342 55102 75295 85691 -20809
12252 -20809 -5289 -59561 -148718 -71016 -61524 22424 -51536 -134694 -197560 15219 87368 -24351
12240 -24351 55120 151466 269552 99933 -5803 -27126 -110300 -59199 -62298 -36593 -25499
12229 -25499 48897 204254 139999 8013 -49150 -122955 -204667 -153372 -168296 -151413 -170888
$$ packed form
12309a81359K7272M9943J16147j6271q7064j8058m7527k5357N2328J65375N9212
12298I4641p9323k2500q8137O8978P5665J10318l7418n7814n2912R475N4538O8611
12286A44122L8786j60996j32333k7207j5265o5013p7207R0557J84023n2898l0299
12275a03730l6550P4146q0530k1686J06767M3761M432n521O3345j0994j1835M3597
12263F5202J54166j01012q5556j4349j407N9036L6262n7240K0193J0396j06500
12252b0809J5520n4272q9157P7702R492Q3948p3960q3158o2866K12779P2149j11719
12240b4351P9471R6346J18086j69619j05736k1323q3174N1101l099K5705J1094
12229b5499P4396J55357o4255j31986n7163p3805q1712N1295j4924J6883j9475
$$ plain form
12218 -170888 -110981 -60434 -10362 68791 4645 -127578 -66080 64372 95866 16263 39194
12207 39194 54109 2017 -81026 -104316 -116894 -161378 -164056 -4566 154753 75393 -3867
12196 -3867 23779 39306 -56624 -119964 -146451 -103538 -96562 -203901 -176048 38054 165091
12185 165091 129823 30205 -38132 -115860 -74264 -2418 113094 107746 -25760 -77949 -178286
12174 -178286 -202053 -15281 -30082 -86791 -168439 -195059 -84067 44175 -45847 -201055 -286444
12163 -286444 -212246 -187185 -103631 -92373 -218381 -184713 -118273 -167205 -57489 54768 39369
12152 39369 19744 -148556 -70209 -111798 -214310 -144396 -132304 -115473 28679 168686 107900
12141 107900 70930 -17582 -96038 -113443 -59569 -146345 -84317 91582 141359 6026 24627
$$ packed form
12218a70888N9907N0547N0072P9153o4146j32223O1498J30452L1494p9603K2931
12207C9194J4915n2092q3043k3290j2578m4484k678J59490J59319p9360p9260
12196c867K7646J5527r5930o3340k6487M2913O976j07339K7853K14102J27037
12185A65091l5268r9618o8337p7728M1596P1846J15512n348j33506n2189j00337
12174a78286k3767J86772j4801n6709q1648k6620J10992J28242r0022j55208q5389
12163b86444P4198K5061Q3554J1258j26008L3668O6440m8932J09716J12257j5399
12152C9369j9625j68300P8347m1589j02512O9914J2092J6831J44152J40007o0786
12141A07900l6970q8512p8456j7405N3874q6776O2028J75899M9777j35333J8601
$$ plain form
12130 24627 100524 53498 29939 -24871 -169591 -255864 -295094 -338035 -234526 697 50040
12119 50040 14265 -29453 -98527 -117782 -136539 -231156 -164403 -117002 -31429 8265 106411 -39097
12107 -39097 -125170 -15923 96354 137790 171448 95481 4786 -31989 -22694 101203 174260
12096 174260 70607 31561 -30856 62299 176209 142714 117979 224417 334614 238880 101445
12085 101445 24168 81927 187924 241024 269176 277635 271196 117169 90023 81642 -27321
12074 -27321 6985 153142 159788 194620 151288 35566 -29384 -14747 81386 20731 9509
12063 9509 48924 -109861 -162917 -111514 -129171 -178020 -78322 -35672 -22901 -759 11338 91362
12051 91362 100019 75288 84575 77519 156084 119295 161624 275972 320568 291473 234909 236192
$$ packed form
12130B4627P5897m7026k3559n4810j44720q6273l9230m2941J03509K35223M9343
12119E0040l5775m3718o9074j9255j8757r4617O6753M7401Q5573L9694R8146j45508
12107c9097q6073J09247J12277M1436L3658p5967r0695l6775R295J23897P3057
12096A74260j03653l9046o2417R3155J13910l3495k4735J06438J10197r5734j37435
12085A01445p7277N7759J05997N3100K8152Q459o439j54027k7146q381j08963
12074b7321L4306J46157O646L4832m3332j15722o4950J4637R6133o0655j1222
12063I509L9415j58785n3056N1403j7657m8849R9698M2650J2771K2142J2097Q0024
12051I1362Q657k4731R287p056P8565l6789M2329J14348M4596k9095n6564J283
$$ plain form
12039 236192 228252 237329 297239 211955 139232 261930 224663 -3963 -122761 -159522 -64223
12028 -64223 11464 -39223 -115698 -129053 -183569 -140647 39530 135288 27277 -71485 -81042
12017 -81042 31254 35509 -24815 49595 43011 103902 136270 190926 182665 115874 -16441 -46231
12005 -46231 -62325 44605 127372 174495 125588 97315 67953 57435 -2976 43132 61084
11994 61084 44534 -40674 -31698 13574 17684 -34563 135440 49235 -34587 -3912 -54828 -55397
11982 -55397 1026 -82327 -132419 -196547 -154395 -47346 78343 19637 55755 99193 94936
11971 94936 167893 105507 13521 -93872 -131792 -220239 -194068 -129669 -60369 -61831 101021
11960 101021 61260 34565 147256 200179 166142 252810 90976 -24974 -28952 -111409 -149084
$$ packed form
12039B36192p940R077N9910q5284p2723J22698l7267k28626j18798l6761R5299
12028f4223P5687n0687p6475j3355n4516M2922J80177R5758j08011r8762r557
12017h1042J12296M255o0324P4410o584O0891L2368N4656q261o6791j32315k9790
12005d6231j6094J06930Q2767M7123m8907k8273k9362j0518o0411M6108J7952
11994F1084j6550q5208Q976M5272M110n2247J70003q6205q3822L0675n0916n69
11982e5397N6423q3353n0092o4128M2152J07049J25689n8706L6118M3438m257
11971I4936P2957o2386r1986j07393l7920q8447K6171O4399O9300j462J62852
11960A01021l9761k6695J12691N2923l4037Q6668j61834j15950l978q2457l7675
$$ plain form
11949 -149084 -78347 10445 114548 37202 3904 33394 51599 169887 155419 3433 -150476
11938 -150476 -140835 -152954 -180044 -117884 -133673 -232672 -281534 -242916 -284885 -246252 -70842
11927 -70842 9171 77594 77583 -26129 -160452 -116074 -144245 -175035 -43342 59980 113098
11916 113098 75684 58128 69820 40184 -42934 8456 12543 -81078 74420 113858 96767
11905 96767 -80319 -181366 -194616 -155818 -152864 -65442 11474 -8577 -187208 -183278 -28249
11894 -28249 3635 -168952 -118227 -27041 -12167 15072 -79143 -101003 -31024 -181179 -58294
11883 -58294 -95451 -145471 -135338 -58839 26168 -61125 -220192 -188315 -165148 -179967 -123453
11872 -123453 -130795 -60441 -1910 22180 -25811 -134557 -173600 -177689 -288635 -269205 -163778
$$ packed form
11949a49084P0737Q8792J04103p7346l3298K9490J8205J18288j4468j51986j53909
11938a50476R641j2119k7090O2160j5789r8999m8862L8618m1969L8633J75410
11927g0842Q0013O8423j1j03712j34323M4378k8171l0790J31693J03322N3118
11916A13098l7414j7556J1692k9636q3118N1390M087r3621J55498L9438j7091
11905I6767j77086j01047j3250L8798K954Q7422P6916k0051j78631L930J55029
11894b8249L1884j72587N0725R1186J4874K7239r4215k1860O9979j50155J22885
11883e8294l7157n0020J0133P6499Q5007q7293j59067L1877K3167j4819N6514
11872a23453p342P0354N8531K4090m7991j08746l9043m089j10946J9430J05427
$$ plain form
11861 -163778 5166 -21330 -69245 -153264 -171187 -79123 72288 190738 70564 -80901
11851 -80901 -18344 132173 103003 131941 134986 166631 125999 -87685 -231918 -104436 53775
11840 53775 83866 93393 30921 -24540 -40379 -30017 -30850 -130230 -146718 -27651 -72346 6718
11828 6718 129651 84915 98182 23996 -99730 -169762 -273842 -172612 -43940 599 33932
11817 33932 -124316 -48354 4279 6809 -15475 -82092 -70823 -132465 -177795 -201082 -264773 -258149
11805 -258149 -147693 -144479 -98664 -8532 66196 15233 101334 62928 -69021 -189317 -171749
11794 -171749 3415 122606 180283 151993 84307 103814 113490 58342 -83229 -72625 83822
11783 83822 246231 205501 120137 22720 -128712 -143837 -128944 -102300 -4238 104666 143818
$$ packed form
11861a63778J68944k6496m7915q4019j7923R2064J51411J18450j20174j51465
11851h0901O2557J50517k9170K8938L045L1645m0632k13684j44233J27482J58211
11840E3775L0091R527o2472n5461j5839J0362q33r9380j6488J19067m4695P9064
11828F718J22933m4736J3267p4186j23726p0032j04080J01230J28672M4539L3333
11817C3932j58248P5962N2633K530k2284o6617J1269o1642m5330k3287o3691O624
11805b58149J10456L214M5815R0132P4728n0963Q6101l8406j31949j20296J7568
11794a71749J75164J19191N7677k8290o7686J9507R676n5148j41571J0604J56447
11783H3822J62409m0730q5364r7417j51432j5125J4893K6644R8062J08904L9152
$$ plain form
11772 143818 164347 127774 -5976 72864 155482 139727 -22851 -73429 -7333 -51227 -31759
11761 -31759 -36963 -124375 -242624 -369636 -303380 -186712 -71739 -54854 -10114 18877 -34185
11750 -34185 -103748 -139441 -68053 14408 82778 -44598 -133417 -147138 -161468 -304082 -332753
11739 -332753 -329363 -250075 -291848 -221711 -206818 -208031 -243599 -273243 -189657 -47222 -37191 -78330
11727 -78330 -177993 -160537 -185180 -194226 -111812 -128666 -88615 -174116 -156054 -28979 5377 24075
11715 24075 -103872 -225116 -243982 -292627 -250371 -188679 -225055 -191053 -124709 -65704 -98543
11704 -98543 -146217 -9609 130331 -1196 -84495 -8149 -52369 -32747 -54905 -131685 -120561
11693 -120561 -17563 120361 66201 -4145 844 -12576 -70552 -108594 -107751 -133999 -34062 -45150
$$ packed form
11772A43818K0529l6573j33750P8840Q2618j5755j62578n0578O6096m3894J9468
11761c1759n204q7412j18249j27012O6256J16668J14973J6885M4740K8991n3062
11750c4185o9563l5693P1388Q2461O8370j27376q8819j3721j4330j42614k8671
11739c32753L390P9288m1773P0137J4893j213l5568k9644Q3586J42435J0031m1139
11727g8330r9663J7456k4643r046Q2414j6854M0051q5501J8062J27075L4356J8698
11715B4075j27947j21244j8866m8645M2256O1692l6376L4002O6344N9005l2839
11704i8543m7674J36608J39940j31527q3299P6346m4220J9622k2158p6780J1124
11693a20561J02998J37924n4160p0346M989j3420n7976l8042Q43k6248R9937j1088
$$ plain form
11681 -45150 22613 38333 -62963 -104519 -127282 -259955 -308050 -333156 -334635 -271110 -105780
11670 -105780 -40286 -134580 -185544 -132345 98961 182202 40368 -98789 -187893 -223272 -250826
11659 -250826 -54345 52631 -6984 -33793 -19959 -78230 -95723 -66557 72274 42225 -4130
11648 -4130 -55923 -108875 -24634 36980 -64243 -56435 -100236 -107253 -7595 83824 111259 178879
11636 178879 172021 110545 81716 154192 177740 59607 -68128 57767 256428 246292 205409
11625 205409 80241 -61496 62090 46628 -142088 -296864 -367192 -235989 -107262 28216
11615 28216 155208 152242 -204 -14922 -79676 -181364 -251481 -143453 48839 49577 1828
11604 1828 71368 -70254 -82375 1857 -89179 -62097 41666 115983 108821 -20730 -49368
$$ packed form
11681d5150O7763J5720j01296m1556k2763j32673m8095k5106j479O3525J65330
11670a05780O5494r4294n0964N3199K31306Q3241j41834j39157q9104l5379k7554
11659b50826J96481J06976n9615k6809J3834n8271j7493K9166J38831l0049m6355
11648d130n1793n2952Q4241O1614j01223P808m3801p017R9658R1419K7435O7620
11636A78879o858o1476k8829P2476K3548j18133j27735J25895J98661j0136m0883
11625B05409j25168j41737J23586j5462j88716j54776p0328J31203J28727J35478
11615B8216J26992k966j52446j4718o4754j01688p0117J08028J92292P38m7749
11604A828O9540j41622j2121Q4232r1036K7082J03763P4317p162j29551k8638
$$ plain form
11593 -49368 -42095 10374 -3058 -7938 30820 -24793 -83060 -67702 56172 40341 -4486 -75620
11581 -75620 -19700 -7306 -99996 -52575 -25233 2991 -123202 -199782 -215918 -226966 -250156
11570 -250156 -329710 -306941 -219346 -199197 -201568 -156289 -41230 -25628 -67808 -77929 -79236 -70787
11558 -70787 30905 -17044 30681 52928 110997 216966 221100 24721 -149661 -240334 -216094
11547 -216094 -46578 -45312 -46817 -73690 -137217 -78471 -13553 -141406 -129723 -127637 -118551 -270844
11535 -270844 -242424 -63295 -125807 -61882 15531 -86926 -168840 -219917 -178913 -61177 -9842
11524 -9842 -15102 41624 124904 174815 151426 190097 278818 248391 315478 366512 337641 268154
11512 268154 118184 25062 -92621 -46237 54297 -19704 -127770 -78533 296 -105778
$$ packed form
11593d9368P273N2469j3432m880L8758n5613n8267J5358J23874j5831m4827p1134
11581g5620N5920J2394r2690M7421K7342K8224j26193p6580j6136j1048k3190
11570b50156p9554K2769Q7595K0149k371M5279J15059J5602m2180j0121j307Q449
11558g0787J01692m7949M7725K2247N8069J05969M134j96379j74382r0673K4240
11547b16094J69516J266j505k6873o3527N8746O4918j27853J1683K086R086j52293
11535b70844K8420J79129o2512O3925P7413j02457q1914n1077M1004J17736N1335
11524i842n260N6726Q3280M9911k3389L8671Q8721l0427O7087N1034k8871o9487
11512B68154j49970r3122j17683M6384J00534p4001j08066M9237P8829j06074
$$ plain form
11502 -105778 -65086 47486 113349 115797 92968 191458 136209 114810 96803 -51597 -296769
11491 -296769 -352807 -252464 -175102 -59178 -171191 -125379 -61470 74497 96258 -36181
11481 -36181 -104738 -88883 59340 91930 42619 -16137 25316 -60538 -63974 -39746 123383
11470 123383 109118 30881 159142 181725 105969 149818 132659 34065 39825 29791 74987
11459 74987 46696 -9769 59564 204078 47022 -82495 -32643 -34460 -63216 59794 102996
11448 102996 96499 200835 227593 280208 181930 -31031 -45231 -30305 121243 191986 171231
11437 171231 171745 152039 138406 198136 180414 91686 -77677 -87816 4977 -96927 -75615
11426 -75615 -95966 -83444 -131977 -196351 -220784 -160039 -52730 -17381 -48614 -109248 -186855
$$ packed form
11502a05778M0692J12572O5863K448k2829R8490n5249k1399j8007j48400k45172
11491b96769n6038J00343P7362J15924j12013M5812O3909J35967K1761j32439
11481c6181o8557J5855J48223L2590m9311n8756M1453q5854l436K4228J63129
11470A23383j4265p8237J28261K2583p5756M3849j7159r8594N760j0034M5196
11459G4987k8291n6465O9333J44514j57056j29517M9852j817k8756J23010M3202
11448A02996o497J04336K6758N2615r8278k12961j4200J4926J51548P0743k0755
11437A71231N14j9706j3633N9730j7722q8728j69363j0139R2793j01904K1312
11426g5615k0351J2522m8533o4374k4433O0745J07309L5349l1233o0634p7607
$$ plain form
11415 -186855 -150454 -84314 -42887 -32921 5042 -106301 -15816 27378 30765 -48589 -135167 -184660
11403 -184660 -150392 -65691 166 62672 118374 11674 -136182 -193760 -152478 -8751 62320
11392 62320 -27276 -49287 -16116 58002 110063 138285 117742 51376 -63161 -77214 -117807
11381 -117807 -82536 -43174 -46945 -65214 -94572 -222584 -202462 -168969 -135253 -94976 22399
11370 22399 -61197 -157322 -114716 -47723 92921 68783 32912 137502 199818 146364 101222
11359 101222 178530 188454 178901 146804 45893 -76358 19709 112946 102406 50639 88190
11348 88190 42495 14682 55214 -3176 -52114 2285 141508 81096 65856 40259 65384
11337 65384 254011 167353 -23959 -17920 51012 137378 202223 211633 119822 -79691 -19537
$$ packed form
11415a86855L6401O6140M1427R966L7963j11343R0485M3194L387p9354q6578m9493
11403a84660L4268Q4701O5857O2506N5702j06700j47856n7578M1282J43727P1071
11392F2320q9596k2011L3171P4118N2061K8222k0543o6366j14537j4053m0593
11381a17807L5271L9362l771j8269k9358j28012K0122L3493L3716M0277J17375
11370B2399q3596r6125M2606O6993J40644k4138l5871J04590O2316n3454m5142
11359A01222P7308R924r553l2097j00911j22251R6067R3237j0540n1767L7551
11348H8190m5695k7813M0532n8390m8938N4399J39223o0412j5240k5597K5125
11337F5384J88627q6658j91312O039O8932Q6366O4845R410r1811j99513O0154
$$ plain form
11326 -19537 39481 148278 46702 -20767 -101497 -143304 -144468 -150886 -158277 -64181 67036 126945
11314 126945 78431 87524 91218 139123 170080 252583 218121 158797 123928 196030 282850 251212
11302 251212 158744 26138 -9379 120811 94014 18445 40015 128026 149068 4962 79605
11291 79605 168978 123305 174840 182953 -22680 34119 172281 152055 153803 178842 167131 141408
11279 141408 126796 82227 74393 49528 145095 258937 146185 77216 92227 1220 28084
11268 28084 63473 129222 126061 61817 107905 29495 -23790 -55319 -51632 14162 -147099 -86976
11256 -86976 12096 13279 -10444 -19866 163829 204569 132240 119375 19064 -23503 -21594 -70687
11244 -70687 -178837 -174250 -91330 60308 53294 -3372 -31342 -5614 22248 87071 55963 190163
$$ packed form
11326a9537N9018J08797j01576o7469q0730m1807j164o418p391R4096J31217N9909
11314A26945m8514R093L694M7905L0957Q2503l4462n9324l4869P2102Q6820l1638
11302B51212r2468j32606l5517J30190k6797p5569K1570Q8011K1042j44106P4643
11291G9605Q9373m5673N1535Q113k05633N6799J38162k0226J748K5039j1711k5723
11279A41408j4612m4569p834k4865R5567J13842j12752o8969J5011r1007K6864
11268B8084L5389O5749l161o4244M6088p8410n3285l1529L687O5794j61261O0123
11256h6976R9072J183k3723r422J83695M0740p2329j2865j00311m2567J909m9093
11244g0687j08150M587Q2920J51638p014n6666k7970K5728K7862O4823l1108J34200
$$ plain form
11232 190163 36184 60599 131320 46930 -99638 -87082 -27539 83803 205982 289768 254403
11221 254403 126230 94495 50154 -148676 -195094 -60594 119466 7528 72403 -21345
11211 -21345 -99474 -96816 -123260 -151720 -184289 -169492 -11964 46373 15829 150385 115025
11200 115025 38375 -11112 -74494 -26159 122345 -18857 -113413 -155096 -43986 101917 113326
11189 113326 113546 124606 48538 62628 167096 169443 57839 95763 137465 201175 335277
11178 335277 336363 391057 311912 144777 79545 198659 239791 229869 185505 186240 152677 94346
11166 94346 108349 279023 162522 179263 158667 163781 200582 189481 121786 204113 243911
11155 243911 305044 304796 382388 297419 314808 412483 459350 473541 336019 244653 203276 121245
$$ packed form
11232A90163j53979K4415P0721q4390j46568J2556N9543J11342J22179Q3786l5365
11221B54403j28173l1735m4341j98830m6418J34500J80060j11938O4875r3748
11211b1345p8129K658k6444k8460l2569J4797J57528N8337l0544J34556l5360
11200A15025p6650m9487o3382M8335J48504j41202r4556m1683J11110J45903J1409
11189A13326K20J1060p6068J4090J04468K347j11604L7924M1702O3710J34102
11178C35277J086N4694p9145j67135o5232J19114M1132r922m4364P35l3563n8331
11166I4346J4003J70674j16501J6741k0596N114L6801j1101o7695Q2327L9798
11155B43911O1133k48P7592q4969J7389R7675M6867J4191j37522r1366m1377q2031
$$ plain form
11143 121245 171784 191364 226618 312220 189399 143825 70434 15365 100356 105197 34732
11132 34732 97509 177017 175903 169573 115265 25838 -2756 109170 208136 203898 235195 338202
11120 338202 332183 368617 386148 541531 483375 452300 397251 363735 338950 340557 451466
11109 451466 577889 726228 822529 856551 971657 1200642 1328207 1351771 1366107 1518957
11099 1518957 1638704 1800322 1969457 2102140 2076481 1827783 1773800 1525473 1285774 1208536
11089 1208536 1051531 820632 808787 947799 954095 812224 641111 515064 441123 463865
11079 463865 470224 518022 600212 562538 508267 465578 414182 396798 366217 414163 453915 433276
11067 433276 414196 388191 177332 170598 236328 240027 195336 175597 334971 495269 595475
$$ packed form
11143A21245N0539J9580L5254Q5602j22821m5574p3391n5069Q4991M841p0465
11132C4732O2777P9508j114o330n4308q9427k8594J11926R8966m238L1297J03007
11120C38202o019L6434J7531J55383n8156l1075n5049l3516k4785J607J10909
11109D51466J26423J48339R6301L4022J15106K28985J27565K3564J4336J52850
11099A518957J19747J61618J69135J32683k5659k48698n3983k48327k39699p7238
11089A208536j57005k30899j1845J39012O296j41871j71113j26047p3941K2742
11079D63865O359M7798Q2190l7674n4271m2689n1396j7384l0581M7946L9752k0639
11067D33276j9080k6005k10859o734O5730L699m4691j9739J59374J60298J00206
$$ plain form
11056 595475 523840 557423 480996 252057 323211 385577 436512 423224 381918 405853 536831
11045 536831 463282 526764 460585 318830 327293 358174 338764 326487 394354 555489 567220
11034 567220 470222 448497 313304 400950 438143 570709 749109 786487 780478 667012 684693
11023 684693 682168 655667 647875 664628 644681 736654 817466 842739 926304 1094824 1182228 1243668
11011 1243668 1048822 1025358 933170 777443 836109 846680 846047 735718 543511 724629 852442
11000 852442 875215 807123 740003 743133 633091 401227 381008 405584 466229 388320 381097
10989 381097 408114 377891 251040 157644 254641 367889 333094 255518 343783 451681 469942
10978 469942 396771 304835 177105 253958 385209 378000 267917 218084 180936 155984 202615
$$ packed form
11056E95475p1635L3583p6427k28939P1154O2366N0935j3288m1306K3935J30978
11045E36831p3549O3482o6179j41755Q463L0881j9410j2277O7867J61135J1731
11034E67220r6998k1725j35193Q7646L7193J32566J78400L7378o009j13466J7681
11023F84693k525k6501p792J6753j9947R1973Q0812K5273Q3565J68520Q7404O1440
11011A243668j94846k3464r2188j55727N8666J0571o33j10329j92207J81118J27813
11000H52442K2773o8092o7120L130j10042k31864k0219K4576O0645p7909p223
10989C81097K7017l0223j26851r3396R6997J13248l4795p7576Q8265J07898J8261
10978D69942p3171r1936j27730P6853J31251p209j10083m9833l7148k4952M6631
$$ plain form
10967 202615 289952 315786 274041 261982 208249 124401 9478 33954 -88473 -76955 23507
10956 23507 174890 126960 92960 159835 287677 372433 409213 462558 375367 388772 463053
10945 463053 600536 502792 486920 547000 651685 603828 421579 257336 257798 167637 106123
10934 106123 202379 325885 420422 405438 204139 194697 230868 126704 95462 121403 300600
10923 300600 286192 292199 414530 423489 355885 233398 345149 356723 210532 172384 249359
10912 249359 306539 337351 265618 264906 257605 279909 345977 490297 556030 589709 564959 428773
10900 428773 443407 376336 214377 196458 186497 129561 285450 350734 157081 161006 271503
10889 271503 355147 241437 239590 331517 403480 362352 388087 364416 322774 328261 276631 340958
$$ packed form
10967B02615Q7337K5834m1745j2059n3733q3848j14923K4476j22427J1518J00462
10956B3507J51383m7930l4000O6875J27842Q4756L6780N3345q7191J3405P4281
10945D63053J37483r7744j5872O0080J04685m7857j82249j64243M62r0161o1514
10934A06123R6256J23506R4537j4984k01299r442L6171j04164l1242K5941J79197
10923C00600j4408O007J22331Q959o7604j22487J11751J1574j46191l8148P6975
10912B49359N7180L0812p1733p12p301K2304O6068J44320O5733L3679k4750j36186
10900D28773J4634o7071j61959j7919r961n6936J55889O5284j93653L925J10497
10889B71503Q3644j13710j847R1927P1963m1128K5735k3671m1642N487n1630O4327
$$ plain form
10877 340958 481469 571557 614541 541683 392077 285163 341176 396684 398496 324416 233294
10866 233294 340664 429457 358706 265711 30753 -66909 20187 109060 370122 524125 438976
10855 438976 386995 422913 429629 461863 421263 332160 302602 433186 631589 804181 835014
10844 835014 797138 786764 765210 754205 848004 964291 972567 1010120 1108014 1081393 1042290
10833 1042290 1117096 1218931 1206435 1169051 1066054 1001112 922993 899303 887810 790975 770312
10822 770312 759374 779391 675983 573401 608943 660158 630360 593229 632889 679375 825018
10811 825018 832100 898175 928732 877531 760058 738640 832162 707973 531184 605478 709055
10800 709055 714201 811489 856137 868506 956252 1086050 1120777 1170759 1075218 998442 1031433
$$ packed form
10877C40958J40511R0088M2984p2858j49606j06914N6013N5508J812p4080r1122
10866B33294J07370Q8793p0751r2995k34958r7662Q7096Q8873K61062J54003q5149
10855D38976n1981L5918O716L2234m0600q9103k9558J30584J98403J72592L0833
10844H35014l7876j0374k1554j1005R3799J16287Q276L7553R7894k6621l9103
10833A042290P4806J01835j2496l7384j02997o4942p8119k3690j1493r6835k0663
10822G70312j0938K0017j03408j02582L5542N1215k9798l7131L9660M6486J45643
10811H25018P082O6075L0557n1201j17473k1418R3522j24189j76789P4294J03577
10800G09055N146R7288M4648J2369Q7746J29798L4727M9982r5541p6776L2991
$$ plain form
10789 1031433 1061460 1078695 1167866 1214886 1256600 1421886 1547923 1460605 1415965 1454806 1565197
10778 1565197 1621582 1773601 1906258 1939116 1962598 1972642 1978380 2064768 2217702 2191090 2136662
10767 2136662 2130053 2105108 2047956 2098643 2262465 2297709 2162381 2046192 1994321 1975594 2044750
10756 2044750 2047915 1912888 1835370 1829337 1949686 1987140 1964951 1936685 1900111 1914005 1951390
10745 1951390 2016045 2148566 2231172 2332770 2363620 2470030 2486738 2691262 2793068 2952852
10735 2952852 2954666 2998513 3049085 3240885 3429061 3612631 3705547 3703556 3732896 3867271 4029164
10724 4029164 4167287 4228550 4314915 4495515 4642086 4978656 5163483 5146447 5194030 5226229
10714 5226229 5382064 5395200 5400661 5475618 5541930 5741182 5953328 6070761 6214007 6332419
$$ packed form
10789A031433L0027J7235Q9171M7020M1714J65286J26037q7318m4640L8841J10391
10778A565197N6385J52019J32657L2858K3482J0044N738Q6388J52934k6612n4428
10767B136662o609k4945n7152N0687J63822L5244j35328j16189n1871j8727O9156
10756B044750L165j35027p7518o033J20349L7454k2189k8266l6574J3894L7385
10745A951390O4655J32521Q2606J01598L0850J06410J6708K04524J01806J59784
10735B952852J814M3847N0572J91800J88176J83570R2916j991K9340J34375J61893
10724D029164J38123O1263Q6365J80600J46571L36570J84827j7036M7583L2199
10714E226229J55835J3136N461P4957O6312J99252K12146J17433J43246J18412
$$ plain form
10704 6332419 6443823 6648229 6848801 7061597 7321550 7479988 7720957 7947337 8289812
10695 8289812 8600949 8834098 9303847 9750307 10149627 10410519 10793207 11238230 11735239
10686 11735239 12415203 13099262 13797483 14525715 15386752 16207154 17188034 18399069 19676038
10677 19676038 21022421 22434619 24109060 26112402 28298673 30715929 33495729 36605467
10669 36605467 40030245 44040959 48844009 54454902 60724941 68315128 77334668 87951207
10661 87951207 100593587 115992572 134946536 158033286 186016042 219364649 257725638
10654 257725638 299339906 340631337 376034047 399353482 406231817 394850623 367983150
10647 367983150 331663399 292293698 254531225 220819426 192031201 168215966 148396649
$$ packed form
10704F332419J11404K04406K00572K12796K59953J58438K40969K26380L42475
10695H289812L11137K33149M69749M46460L99320K60892L82688M45023M97009
10686A1735239O79964O84059O98221P28232Q61037Q20402R80880J211035J276969
10677A9676038J346383J412198J674441K003342K186271K417256K779800L109738
10669C6605467L424778M010714M803050N610893O270039P590187R019540J0616539
10661H7951207J2642380J5398985J8953964K3086750K7982756L3348607L8360989
10654B57725638M1614268M1291431L5402710K3319435O878335j1381194k6867473
10647C67983150l6319751l9369701l7762473l3711799k8788225k3815235j9819317
$$ plain form
10640 148396649 132011219 118294874 106726403 96973480 88761759 81696427 75368935
10633 75368935 69852252 65089149 61037211 57579517 54453477 51675886 49211291 47289547
10625 47289547 45539350 44064895 42767684 41738696 40923517 40357447 40045988 40123362 40515903
10616 40515903 41396234 42646986 44780156 47868489 52228005 57914709 64432688 71131563
10608 71131563 76922555 80820881 82488576 82369183 82052235 82842674 85705684 91039814
10600 91039814 99257710 110665917 123938480 136417161 145377488 148644760 145144997 136859113
10592 136859113 127690864 121039187 118256106 119842415 126360704 137369787 150968044 163347567
10584 163347567 170586287 169745521 159883623 144078816 128078608 115806707 108339070 105595931
$$ packed form
10640A48396649j6385430j3716345j1568471r752923q211721p065332o327492
10633G5368935n516683m763103m051938l457694l126040k777591k464595j921744
10625D7289547j750197j474455j297211j028988q15179n66070l11459P7374L92541
10616D0515903Q80331J250752K133170L088333M359516N686704O517979O698875
10608G1131563N790992L898326J667695j19393l16948P90439K863010N334130
10600I1039814Q217896J1408207J3272563J2478681Q960327L267272l499763q285884
10592A36859113r168249o651677k783081J586309O518289J1009083J3598257J2379523
10584A63347567P238720q40766r861898j5804807j6000208j2271901p467637k743139
$$ plain form
10576 105595931 107208294 112229544 118930196 124371191 126190672 122342955 112488803 99524784
10568 99524784 87198456 77952941 71732176 68373325 67419960 68250015 69535226 70147745
10560 70147745 69213304 65923362 60505639 54027194 47903347 42839094 38962195 36047780
10552 36047780 33810149 32122177 30803544 29839201 29010434 28495982 28056941 27713534 27596419
10543 27596419 27496957 27339406 27049131 26781291 26469031 26092206 25623959 25274314 25226434 25257859
10533 25257859 25361010 25378983 25395723 25256140 25142620 24704689 24076151 23379292 23039892 22540844
10523 22540844 22230465 22025899 21889848 21573743 21262999 20912688 20428108 19761358 19217197
10514 19217197 18538969 17872451 17335659 16806168 16245827 15885641 15426675 14939007 14591099
$$ packed form
10576A05595931J612363N021250O700652N440995J819481l847717r854152j2964019
10568I9524784j2326328r245515o220765l358851r53365Q30055J285211O12519
10560G0147745r34441l289942n417723o478445o123847n064253l876899k914415
10552C6047780k237631j687972j318633r64343q28767n14452m39041l43407j17115
10543B7596419r9462j57551k90275k67840l12260l76825m68247l49645m7880L1425
10533B5257859J03151J7973J6740j39583j13520m37931o28538o96859l39400m99048
10523B2540844l10379k04566j36051l16105l10744l50311m84580o66750n44161
10514A9217197o78228o66518n36792n29491n60341l60186m58966m87668l47908
$$ plain form
10505 14591099 14165619 13662290 13177698 12606921 11999869 11491123 11119095 10807829 10461382
10496 10461382 10059904 9756019 9372315 9058822 8756991 8654177 8493858 8177124 7987410
10487 7987410 7865221 7598841 7357489 7201257 7208125 7038556 6869679 6759150 6677858 6401577
10477 6401577 6255350 6055430 5929874 5714554 5617698 5521753 5517275 5510288 5296234 4982710
10467 4982710 4834262 4660511 4554804 4436802 4166212 4044182 4062745 4160520 4194561 4128927
10457 4128927 4121990 3992878 3908613 3858972 3808767 3676342 3520744 3506280 3458980 3372150 3407933
10446 3407933 3354403 3223963 3104631 2952056 2829676 2718600 2665410 2622211 2625095 2649005
10436 2649005 2665680 2616073 2569699 2651189 2742781 2652253 2552960 2365883 2187023 2165566 2165586
$$ packed form
10505A4591099m25480n03329m84592n70777o07052n08746l72028l11266l46447
10496A0461382m01478l03885l83704l13493l01831j02814j60319l16734j89714
10487G987410j22189k66380k41352j56232O868j69569j68877j10529q1292k76281
10477F401577j46227j99920j25556k15320r6856r5945m478o987k14054l13524
10467D982710j48448j73751j05707j18002k70590j22030J8563R7775L4041o5634
10457D128927o937j29112q4265m9641n0205j32425j55598j4464m7300q6830L5783
10446C407933n3530j30440j19332j52575j22380j11076n3190m3199K884K3910
10436B649005J6675m9607m6374Q1490R1592r0528r9293j87077j78860k1457K0
$$ plain form
10425 2165586 2113949 2154493 2171730 2177050 2150888 1994934 1838948 1721490 1738663 1856185 1868544
10414 1868544 1824094 1777859 1686195 1684127 1559373 1543664 1697007 1792366 1681891 1591254 1581575
10403 1581575 1526279 1480711 1366740 1544027 1575052 1468785 1306169 1242327 1340612 1396790
10393 1396790 1274147 1202652 1271172 1194511 1089050 1095868 1136852 1193897 1056741 979402 1017403
10382 1017403 1177792 1158206 1155269 1040844 891911 902335 838086 877506 903406 861196 881107
10371 881107 965745 979092 902332 743232 665364 815049 891134 825730 741522 793697 866913
10360 866913 793765 778414 740408 775751 775754 762751 805020 667990 584945 503589 631612 796111
10348 796111 879680 989425 1077646 1060234 847981 698200 803911 864324 808174 827988 650991
$$ packed form
10425B165586n1637M0544J7237N320k6162j55954j55986j17458J7173J17522J2359
10414A868544m4450m6235r1664k068j24754j5709J53343R5359j10475r0637r679
10403A581575n5296m5568j13971J77287L1025j06267j62616o3842R8285N6178
10393A396790j22643p1495O8520p6661j05461O818M0984N7045j37156p7339L8001
10382A017403J60389j9586k937j14425j48933J0424o4249L9420K5900m2210J9911
10371H81107Q4638J3347p6760j59100p7868J49685P6085o5404q4208N2175P3216
10360H66913p3148j5351l8006L5343Lj3003M2269j37030q3045q1356J28023J64499
10348G96111Q3569J09745Q8221j7412k12253j49781J05711O0413n6150J9814j76997
$$ plain form
10337 650991 455168 485226 674577 681814 614849 712963 696622 572168 641722 724396 703918
10326 703918 726806 712079 629892 596566 594696 615032 686388 691775 678162 577105 692101
10315 692101 801366 678189 599306 523656 491644 467679 458330 510504 632360 727148 646192
10304 646192 589797 572498 623729 637748 524116 472604 351437 349201 412981 505338 555643
10293 555643 494857 513443 375283 260416 240541 278512 297700 404399 573669 656399 574599
10282 574599 404350 142274 152734 338086 533842 670858 569131 438651 300935 282190
10272 282190 303269 240056 266018 205376 98061 166788 407311 569858 463048 303796
10262 303796 315616 423862 365615 211537 109978 180419 258126 222807 214609 399115 464185
$$ packed form
10337F50991j95823L0058J89351P237o6965R8114j6341j24454O9554Q2674k0478
10326G03918K2888j4727q2187l3326j870K0336P1356N387j3613j01057J14996
10315F92101J09265j23177p8883p5650l2012k3965r349N2174J21856R4788q0956
10304F46192n6395j7299N1231J4019j13632n1512j21167k236O3780R2357N0305
10293E55643o0786J8586j38160j14867j9875L7971J9188J06699J69270Q2730q1800
10282E74599j70249k62076J0460J85352J95756J37016j01727j30480j37716j8745
10272B82190K1079o3213K5962o0642j07315O8727K40523J62547j06810j59252
10262C03796J1820J08246n8247j54078j01559P0441P7707l5319q198J84506O5070
$$ plain form
10251 464185 326744 286810 293411 291971 260303 290392 343350 213693 148637 251071 296634
10240 296634 337732 284677 223903 254529 385969 344193 205231 205135 345398 374005 335272
10229 335272 342498 310155 293362 255558 172897 135537 192653 296154 333049 328726 258633 203167
10217 203167 177688 309243 419426 483516 368088 380677 536201 713234 712975 636541 669415
10206 669415 752649 920005 1199838 1204963 1350037 1651221 1833623 2013472 2173633 2206463
10196 2206463 2024158 1879504 1778538 1714777 1657574 1383966 1027707 975807 946368 760508
10186 760508 642335 643225 647918 654606 735932 634484 501787 462684 498789 494283 545496 549345
10174 549345 465939 429385 526686 624187 551974 538041 576651 634010 629338 670512 719829 682171
$$ packed form
10251D64185j37441l9934O601j440l1668L0089N2958j29657o5056J02434M5563
10240B96634M1098n3055o0774L0626J31440m1776j38962r6J40263K8607l8733
10229C35272P226l2343j6793l7804q2661l7360N7116J03501L6895m323p0093n5466
10217B03167k5479J31555J10183O4090j15428J2589J55524J77033k59p6434L2874
10206F69415Q3234J67356K79833N125J45074L01184J82402J79849J60161L2830
10196B206463j82305j44654j00966o3761n7203k73608l56259n1900k9439j85860
10186G60508j18173Q90M693O688Q1326j01448j32697l9103L6105m506N1213L849
10174E49345q3406l6554R7301R7501p2213j3933L8610N7359m672M1174M9317l7658
$$ plain form
10162 682171 706846 730201 826933 930852 987538 816565 708521 681151 666490 613851 731060
10151 731060 898584 1005271 1068258 1078151 1074259 1202409 1219429 1129654 1009733 836785 788253
10140 788253 767733 820416 759181 733115 796655 966719 970779 781273 704942 595059 450803
10129 450803 461862 587292 559190 550664 718400 699602 596887 554370 480954 368616 249064
10118 249064 121970 78614 138182 281084 241812 232701 173690 233248 364885 270658 224749
10107 224749 395196 426653 255960 251568 319444 391726 377558 215559 176988 167153 22648
10096 22648 42401 245958 409265 336722 262699 315808 240298 84624 48529 104096 131996
10085 131996 53670 7324 80316 235874 206025 120933 119121 7604 -35340 -2533 81447
$$ packed form
10162F82171K4675K3355R6732J03919N6686j70973j08044k7370j4661n2639J17209
10151G31060J67524J06687O2987R893l892J28150J7020q9775j19921j72948m8532
10140G88253k0520N2683o1235k6066O3540J70064M060j89506p6331j09883j44256
10129D50803J1059J25430k8102q526J67736j8798j02715m2517p3416j12338j19552
10118B49064j27094m3356N9568J42902l9272r111n9011N9558J31637r4227m5909
10107B24749J70447L1457j70693m392O7876P2282j4168j61999l8571r835j44505
10096B2648J9753K03557J63307p2543p4023N3109p5510j55674l6095N5567K7900
10085A31996p8326m6346P2992J55558k9849q5092j812j11517m2944L2807Q3980
$$ plain form
10074 81447 106173 -17237 -40977 -29822 15293 -67126 45296 63706 -6889 16612 145649
10063 145649 222276 218292 53981 -10058 11263 -34536 -34234 25494 25945 1499 -80215 -176084
10051 -176084 -162577 -17260 16295 31659 -74473 -196580 -202345 -46201 106052 173675 151415
10040 151415 -8758 -41551 90081 95227 11221 -37564 82742 128598 55076 -27613 58879
10029 58879 173733 135961 35822 162692 225460 191036 96761 122001 177151 205386 227205
10018 227205 165781 81854 112435 106963 113806 124674 -41620 -153584 -269501 -127440 13901
10007 13901 9234 -21084 -123364 -168841 -35043 -48566 -8233 107129 -6391 30385 211273
9996 211273 242984 249839 165755 75591 -45543 -133234 -153538 -142356 -34056 -21104 -92261
$$ packed form
10074H1447K4726j23410k3740J1155M5115q2419J12422J8410p0595K3501J29037
10063A45649P6627l984j64311o4039K1321m5799L02N9728M51k4446q1714r5869
10051a76084J3507J45317L3555J5364j06132j22107n765J56144J52253O7623k2260
10040A51415j60173l2793J31632N146q4006m8785J20306M5856p3522q2689Q6492
10029E8879J14854l7772j00139J26870O2768l4424r4275K5240N5150K8235K1819
10018B27205o1424q3927L0581n472O843J0868j66294j11964j15917J42061J41341
10007A3901m667l0318j02280m5477J33798j3523M0333J15362j13520L6776J80888
9996B11273L1711O855q4084r0164j21134q7691k0304J1182J08300J2952p1157
$$ plain form
9985 -92261 -98811 73562 176454 178171 -21273 -24896 30968 174980 254199 116912 42463
9974 42463 -8366 31365 74410 185390 85649 -8684 60841 188634 220000 233823 347082
9963 347082 312209 171639 255167 250991 179870 166007 227678 269808 277836 197417 67856 64619
9951 64619 33661 -20762 2522 -37350 -44191 -53841 -64289 -99123 -150984 -140799 -147582 -79384
9939 -79384 -98202 -76836 -29740 -3482 32822 173896 122945 128510 34782 -19012 -33529 -157659
9927 -157659 -159478 -114465 -207193 -197447 -243695 -259371 -48745 43436 94225 46797 139413 138289
9915 138289 19119 480 -74229 -26305 -53781 -166299 -293796 -279916 -135708 -68146 -82376
9904 -82376 -82142 82844 34499 14953 -104295 -87735 101499 113823 -4839 -141245 -211554
$$ packed form
9985i2261o550J72373J02892J717j99444l623N5864J44012P9219j37287p4449
9974D2463n0829L9731M3045J10980r9741r4333O9525J27793L1366J3823J13259
9963C47082l4873j40570Q3528m176p1121j3863O1671M2130Q028q0419j29561l237
9951F4619l0958n4423K3284l9872o841r650j0448l4834n1861J0185o783O8198
9939g9384j8818K1366M7096K6258L6304J41074n0951N565r3728n3794j4517j24130
9927a57659j819M5013r2728R746m6248j5676K10626R2181N0789m7428R2616j124
9915A38289j19170j8639p4709M7924k7476j12518j27497J3880J44208O7562j4230
9904h2376K34J64986m8345j9546j19248J6560J89234J2324j18662j36406p0309
$$ plain form
9893 -211554 -240552 -163562 -33176 -20621 -118846 -225804 -241099 -171743 -204227 -91252 97529
9882 97529 197416 31995 -127053 -226063 -45338 -21232 -48573 -49190 -83488 -72457 -69238 20089
9870 20089 89104 196072 251977 220572 202209 163178 55503 54809 150060 272553 188982 167236
9858 167236 64622 27898 -137790 -164130 -74052 -145463 -163726 -184160 -170489 -144277 -117052
9847 -117052 -32360 -52442 -37406 4794 94801 89418 -1105 65545 261858 221879 -6946
9836 -6946 -115593 36846 113727 -14007 -86224 -50159 -93328 -159311 -115532 -34337 87880
9825 87880 134864 213074 233418 140524 60258 39623 92492 114891 126044 135200 113396 133887
9813 133887 24995 -40327 -16939 10426 43487 116755 162775 1048 1908 188516 116367
$$ packed form
9893b11554k8998P6990J30386J2555r8225j06958j5295O9356l2484J12975J88781
9882I7529R9887j65421j59048r9010J80725K4106k7341o17l4298J1031L219Q9327
9870B0089O9015J06968N5905l1405j8363l9031j07675o94R5251J22493q3571k1746
9858A67236j02614l6724j65688k6340R0078p1411j8263k0434J3671K6212K7225
9847a17052Q4692k0082J5036M2200R0007n383r0523O6650J96313l9979k28825
9836f946j08647J52439P6881j27734p2217L6065m3169o5983M3779Q1195J22217
9825H7880M6984P8210K0344r2894q0266k0635N2869K2399J1153R156k1804K0491
9813A33887j08892o5322K3388K7365L3061P3268M6020j61727Q60J86608p2149
$$ plain form
9802 116367 46354 17778 -20307 43630 19753 34967 57347 32631 -60611 -97544 -53433 -78209
9790 -78209 30707 39363 -44112 -113518 -44015 45435 93091 107787 34486 -64931 12234 -19652
9778 -19652 -139554 -306825 -424835 -404879 -214381 -103915 -176573 -46636 18254 -51744 -173046
9767 -173046 -130451 65090 57789 46192 235218 327811 252356 261884 176767 143450 274575
9756 274575 149496 -14169 -51923 12333 -51187 32819 33635 -109782 -140073 -8051 159603
9745 159603 235620 114802 -7576 -76261 -61314 -28231 -27413 -27556 -22183 35717 3247 -142243
9733 -142243 -97073 -45037 11520 37022 36835 -50402 -57967 -133523 -150494 -100379 -109167 -49786
9721 -49786 -4209 50528 -3849 14244 -106834 -126959 -274550 -172989 -130248 -152952 -170819
$$ packed form
9802A16367p0013k8576l8085O3937k3877J5214K2380k4716r3242l6933M4111k4776
9790g8209J08916Q656q3475o9406O9503Q9450M7656J4696p3301r9417P7165l1886
9778a9652j19902j67271j18010J9956J90498J10466p2658J29937O4890o9998j21302
9767a73046M2595J95541p301j1597J89026R2593p5455R528q5117l3317J31125
9756B74575j25079j63665l7754O4256o3520Q4006Q16j43417l0291J32022J67654
9745A59603P6017j20818j22378o8685J4947L3083Q18j43N373N7900l2470j45490
9733a42243M5170N2036N6557K5502j87q7237p565p5556j6971N0115q788N9381
9721d9786M5577N4737n4377J8093j21078k0125j47591J01561M2741k2704j7867
$$ plain form
9710 -170819 -171172 -57306 -68858 -68527 -110803 -74601 -149892 -313201 -241279 -98205 -24538 -65707
9698 -65707 -23495 37884 124178 -24966 7370 111700 32075 17098 -44004 -132507 -111449
9687 -111449 -155521 -256679 -352676 -407271 -374492 -137086 -18730 49752 -3863 1259 -126756
9676 -126756 -107274 -123460 -109831 -124901 -30519 -59635 -89971 -46226 -93668 -117284 -174278 -164883
9664 -164883 -161140 -59052 -22808 -271839 -456088 -403684 -246623 -145077 -161963 -243168 -119852
9653 -119852 -84505 -83441 4379 54098 87430 130650 150060 247730 346284 291035 303078 322662
9641 322662 140360 27409 -57442 -56502 -78892 8994 143655 132417 99201 33293 -24112
9630 -24112 80691 276874 199381 82875 -22222 -93378 -4523 84345 130113 157166 166704
$$ packed form
9710a70819l53J13866j1552L31m2276L6202p5291j63309P1922J43074P3667m1169
9698f5707M2212O1379Q6294j49144L2336J04330p9625j4977o1102q8503K1058
9687a11449m4072j01158r5997n4595L2779K37406J18356O8482n3615N122j28015
9676a26756J9482j6186J3629j5070R4382k9116l0336M3745m7442k3616n6994R395
9664a64883L743J02088L6244k49031j84249N2404J57061J01546j6886q1205J23316
9653a19852L5347J064Q7820M9719L3332M3220J9410R7670R8554n5249J2043J9584
9641C22662j82302j12951q4851R40k2390Q7886J34661j1238l3216o5908n7405
9630b4112J04803J96183p7493j16506j05097p1156Q8855Q8868M5768K7053R538
$$ plain form
9619 166704 242759 145605 156806 121006 104979 146131 56872 49615 80845 93360 4906 -107855
9607 -107855 -102654 -129040 -21041 -33554 -63633 -141152 -224085 -202719 -137723 -25594 -56918
9596 -56918 -51480 92536 143290 174844 161254 65476 -47599 -54206 18482 32637 60265 135638
9584 135638 30212 -34406 -122320 -210773 -42 102292 61978 -21925 17147 -76630 -53580
9573 -53580 11740 -38401 -47776 -88639 -183627 -138189 -74272 -106256 66837 14092 -68417 -33256
9561 -33256 -135611 -174306 -181598 -336722 -236074 -69785 -85674 -60824 -76572 -65455 -76149
9550 -76149 -21604 16781 -19260 -29582 -186306 -125251 -28278 -65559 -17498 -20979 -14907 -60302
9538 -60302 -96602 -123304 -214741 -363711 -302613 -189186 -140146 -212855 -165460 -21276 -30227
$$ packed form
9619A66704P6055r7154J1201l5800j6027M1152q9259p257L1230J2515q8454j12761
9607a07855N201k6386J07999j2513l0079p7519q2933K1366O4996J12129l1324
9596e6918N438J44016N0754L1554j3590r5778j13075o607P2688J4155K7628P5373
9584A35638j05426o4618q7914q8453K10731J02334m0314q3903L9072r3777K3050
9573e3580O5320n0141r375m0863r4988M5438O3917l1984J73093n2745q2509L5161
9561c3256j02355l8695p292j55124J00648J66289j5889K4850j5748J1117j0694
9550g6149N4545L8385l6041j0322j56724O1055R6973l7281M8061l481O072m5395
9538f0302l6300k6702r1437j48970O1098J13427M9040p2709M7395J44184q951
$$ plain form
9527 -30227 15057 88520 71304 178553 181155 65920 -46346 -216801 -173638 -77328 3867
9516 3867 126070 152820 5657 -149899 -131663 70800 127805 96670 3653 -176680 -133141
9505 -133141 -120745 -125023 -230516 -249455 -142352 -70784 4556 32358 -53866 -16392 -34719
9494 -34719 -109893 -41313 16027 36172 74761 68197 36750 11138 33600 197138 102941 -52621
9482 -52621 -42788 3798 -109794 -93680 -21010 -52275 -71031 -220341 -240977 -266627 -212356 -247659
9470 -247659 -120478 -104244 -151627 -117872 -137570 -103301 -156374 9889 105394 -51764 -181545
9459 -181545 -172665 -195812 -174276 -103746 -132323 -133400 -152413 -248630 -236044 -329841 -326717 -315037
9447 -315037 -183973 -72141 -13181 47620 16090 64126 179938 189354 117914 144506 250042
$$ packed form
9527c0227M5284P3463j7216J07249K602j15235j12266j70455M3163R6310Q1195
9516C867J22203K6750j47163j55556J8236K02463N7005l1135r3017j80333M3539
9505a33141J2396m278j05493j8939J07103P1568P5340K7802q6224L7474j8327
9494c4719p5174O8580N7340K0145L8589o564l1447k5612K2462J63538r4197j55562
9482e2621R833M6586j13592J6114P2670l1265j8756j49310k0636k5650N4271l5303
9470b47659J27181J6234m7383L3755j9698L4269n3073J66263R5505j57158j29781
9459a81545Q880k3147K1536P0530k8577j077j9013r6217J2586r3797L124J1680
9447c15037J31064J11832N8960O0801l1530M8036J15812R416p1440K6592J05536
$$ plain form
9436 250042 131494 -12904 -55349 -23720 -81368 -75686 -27877 38043 30190 -10874 56730 104643
9424 104643 42325 164629 103703 -11516 -13232 -48948 -49789 99485 179872 83465 -32629
9413 -32629 44519 22993 -34112 -180033 -276460 -171091 36316 115088 1982 -76823 -8036
9402 -8036 -44192 -64371 -99517 -125696 -119289 -149657 -115288 -96431 -97579 -36904 -36928 -105127 -177413
9389 -177413 -175212 -72071 -12094 -76116 -95295 2796 -125834 -163041 -210765 -204356 -255828 -386855
9377 -386855 -277095 -79758 -5361 -91682 -76468 -222770 -126292 -1882 -37205 -129094 -132038
9366 -132038 66864 128964 171105 124117 30498 -79870 -229195 -179703 -127762 -207970 -243906
9355 -243906 -210276 -132201 -88819 -68581 -97780 -86504 47174 99680 8088 -125616 -99985
$$ packed form
9436B50042j18548j44398m2445L1629n7648N682M7809O5920p853m1064O7604M7913
9424A04643o2318J22304o0926j15219j716l5716q41J49274Q0387r6407j16094
9413c2629P7148k1526n7105j45921r6427J05369K07407P8772j13106p8805O8787
9402h036l6156k0179l5146k6179O407l0368L4369J8857j148O0675k4o8199p2286
9389a77413K201J03141N9977o4022j9179R8091j28630l7207m7724O409n1472j31027
9377c86855J09760J97337P4397q6321J5214j46302R6478J24410l5323r1889k944
9366a32038J98902O2100M2141m6988r3619j10368j49325M9492N1941q0208l5936
9355b43906L3630P8075M3382K0238k9199J1276J33678N2506r1592j33704K5631
$$ plain form
9344 -99985 -43806 -83625 779 174794 217704 177786 60771 -17838 -14066 -58043 -27700 -64645
9332 -64645 -165334 -92928 68825 84748 132968 143076 225236 276423 240355 268996 382064
9321 382064 392523 371491 211870 -11535 -65062 -148637 -197842 -225584 -181510 -154594 -71537
9310 -71537 57849 158319 44541 -61859 -74149 -53298 -14649 34517 104553 97910 17519
9299 17519 109869 14736 -3312 63321 68045 52108 70153 162297 91804 93361 117122 118424
9287 118424 112776 109501 88962 46099 -115740 -60550 69073 218533 239334 126209 -5784
9276 -5784 -11861 102887 119875 46154 18401 -9208 56537 111002 40980 -3150 -100740 -3607
9264 -3607 -64913 -90321 46217 98042 47925 1987 109935 176908 211852 102953 80217
$$ packed form
9344i9985N6179l9819Q4404J74015M2910l9918j17015p8609L772m3977L0343l6945
9332f4645j00689P2406J61753J5923M8220J0108Q2160N1187l6068K8641J13068
9321C82064J0459k1032j59621k23405n3527q3575m9205k7742M4074K6916Q3057
9310g1537J29386J00470j13778j06400j2290K0851L8649M9166P0036o643q0391
9299A7519R2350r5133j8048O6633M724j5937J8045R2144p0493J557K3761J302
9287A18424n648l275k0539m2863j61839N5190J29623J49460K0801j13125j31993
9276e784o077J14748J6988p3721k7753k7609O5745N4465p0022m4130r7590R7133
9264c607o1306k5408J36538N1825n0117m5938J07948O6973L4944j08899k2736
$$ plain form
9253 80217 88210 50824 142737 138514 201602 134638 124755 119047 -53310 -234126 -166233 -11112
9241 -11112 18514 -20590 33302 130398 100803 46269 -28151 -128526 -168892 7811 -97011
9230 -97011 -195194 -109989 -124112 -98416 -41453 -88195 -171528 -143380 -134508 -57201 -6728 42862
9218 42862 36361 18172 105466 152605 169838 163192 144937 81565 27780 28991 64494 120610
9206 120610 10526 -109191 -15341 92456 -25723 -97836 -103588 -105716 12811 99157 213207
9195 213207 122644 -201244 -221519 -38676 -100581 -77226 -16379 112150 118236 113757 52106
9184 52106 61704 219941 416833 489492 385541 263701 -29876 -30469 96693 49775 -19185
9173 -19185 -22837 34416 163576 88182 27823 -83107 -112246 -114736 20266 199268 211483
$$ packed form
9253H0217P993l7386R1913m223O3088o6964r883n708j72357j80816O7893J55121
9241a1112K9626l9104N3892R7096k9595n4534p4420j00375m0366J76703j04822
9230i7011r8183Q5205j4123K5696N6963m6742q3333K8148Q872P7307N0473M9590
9218D2862o501j8189Q7294M7139J7233o646j8255o3372n3785J211L5503N6116
9206A20610j10084j19717R3850J07797j18179p2113n752k128J18527Q6346J14050
9195B13207r0563l23888k0275J82843o1905K3355O0847J28529O086m479o1651
9184E2106R598J58237J96892P2659j03951j21840k93577n93J27162m6918o8960
9173a9185l652N7253J29160p5394o0359j10930k9139k490J35002J79002J2215
$$ plain form
9162 211483 169911 132482 73854 -121896 -226839 -112386 -56607 -79242 99898 183464 177239
9151 177239 143428 59334 -18753 32718 30616 -65901 -87729 50563 129555 199223 244491 271426
9139 271426 170902 152900 147830 83038 -29625 37216 137459 149580 35165 -10279 20155
9128 20155 105856 235762 248411 182210 121168 134978 75469 -17866 86033 47558 18738
9117 18738 43692 101269 95413 -29826 -72849 79466 74384 -35790 -135933 -160308 -119217
9106 -119217 -22151 85055 55257 76128 3140 73897 52665 -14639 -44095 26706 20765 53186
9094 53186 64009 7670 30327 102951 6920 70086 -98186 -153410 -154848 -88151 66166 173822
9082 173822 111543 145362 215751 117507 -61743 -16589 48931 -61622 14703 47718 -65900
$$ packed form
9162B11483m1572l7429n8628j95750j04943J14453N5779k2635J79140Q3566o225
9151A77239l3811q4094p8087N1471k102r6517k1828J38292P8992O9668M5268K6935
9139B71426j00524j8002n070o4792j12663O6841J00243J2121j14415m5444L0434
9128B0155Q5701J29906J2649o6201o1042J3810n9509r3335J03899l8475k8820
9117A8738K4954N7577n856j25239m3023J52315n082j10174j00143k4375M1091
9106a19217R7066J07206k9798K0871p2988P0757k1232o7304k9456P0801n941L2421
9094E3186J0823n6339K2657P2624r6031O3166j68272n5224j438O6697J54317J07656
9082A73822o2279L3819P0389r8244j79250M5154O5520j10553P6325L3015j13618
$$ plain form
9071 -65900 -195959 -211963 -188036 -24713 24646 2000 -147161 -239588 -146718 -80441 -72610
9060 -72610 5653 51029 83564 40090 33050 24657 -41804 -87671 -148159 -190192 -183810 -293168
9048 -293168 -303361 -188975 -123256 -122892 -157577 -200993 -125966 -179122 -184104 -97980 -147903 51244
9036 51244 12779 -91470 -156891 -115814 -144154 -170497 -40381 -60325 -80416 -119666 -266242
9025 -266242 -326356 -174335 -89236 -38106 77906 93126 50192 -64711 47387 111372 -8883
9014 -8883 -133497 -114034 -40108 4322 -9840 -54250 -94622 -113878 -235038 -368227 -302927
9003 -302927 -209549 -165550 -220654 -283562 -421608 -308577 -46100 58843 95550 82200 -21118
8992 -21118 105662 213679 133671 62399 27637 17938 92428 81597 132622 51725 -83678
$$ packed form
9071f5900j30059j6004K3927J63323M9359k2646j49161r2427R2870O6277P831
9060g2610P8263M5376L2535m3474p040q393o6461m5867o0488m2033O382j09358
9048b93168j0193J14386O5719L64l4685m3416P5027n3156m982Q6124m9923J99147
9036E1244l8465j04249o5421M1077k8340k6343J30116j9944k0091l9250j46576
9025b66242o0114J52021Q5099N1130J16012J5220m2934j14903J12098O3985j20255
9014h883j24614J9463P3926M4430j4162m4410m0372j9256j21160j33189O5300
9003c02927R3378M3999n5104o2908j38046J13031K62477J04943L6707j3350j03318
8992b1118J26780J08017q0008p1272l4762r699P4490j0831N1025q0897j35403
$$ plain form
8981 -83678 -25612 -11256 -86477 -28756 101940 53699 -75613 18176 -13503 -39421 -133095
8970 -133095 -151621 -218687 -80400 6688 -26163 38071 46770 -40204 -106811 -74667 -115020 -4023
8958 -4023 143604 176175 195215 193289 114764 192254 257879 142503 180170 23908 -116104
8947 -116104 -247205 -170167 -115464 -58189 -53847 -175131 -161652 -105533 -16227 -26858 86047
8936 86047 67220 157825 115316 81218 93519 74210 55810 -37958 -71033 28103 115375 17080
8924 17080 51613 136344 76320 88472 170084 96918 82721 91196 91939 8563 -163505 -276208
8912 -276208 -299175 -253315 -156232 -154291 -43208 -11227 -68894 -140682 -151052 -94176 14474
8901 14474 36138 -45311 -141546 -217696 -107518 -66994 -20428 -28746 -83691 -100654 -150130 -197527
$$ packed form
8981h3678N8066J4356p5221N7721J30696m8241j29312R3789l1679k5918r3674
8970a33095j8526o7066J38287Q7088l2851O4234Q699q6974o6607L2144m0353J10997
8958d023J47627L2571J9040j926p8525P7490O5625j15376L7667j56262j40012
8947a16104j31101P7038N4703N7275M342j21284J3479N6119Q9306j0631J12905
8936H6047j8827R0605m2509l4098J2301j9309j8400r3768l3075R9136Q7272r8295
8924A7080L4533Q4731o0024J2152Q1612p3166j4197Q475P43q3376j72068j12703
8912b76208k2967M5860R7083J941J11083L1981n7667p1788j0370N6876J08650
8901A4474K1664q1449r6235p6150J10178M0524M6566q318n4945j6963m9476m7397
$$ plain form
8889 -197527 -149213 -87790 -23290 -24852 29848 -11927 -45353 42551 27242 -53148 -56949 3662
8877 3662 -61530 -56866 -61813 -170091 -136786 -149964 -51796 -100999 -81176 -115722 -213774 -185814
8865 -185814 -149379 -182780 -153081 -142331 -45346 2124 -4215 107182 210324 238192 189378
8854 189378 104355 75821 7828 -6264 -36771 118696 152931 157583 132035 94116 70856 -67146
8842 -67146 -88512 -24184 -31733 -102536 -16724 182309 185803 134006 116041 70020 47530 108147
8830 108147 120747 124824 83181 -142793 -299008 -191713 10978 37514 -23903 19816 -26364
8819 -26364 -179790 -207950 -204577 -302235 -243491 -213503 -202679 -139790 -214337 -76602 -7626 -1631
8807 -1631 -28064 -111462 -188124 -124718 -80741 -110926 -116870 -25055 -94432 3839 45420 37587
$$ packed form
8889a97527M8314O1423O4500j562N4700m1775l3426Q7904j5309q0390l801O0611
8877C662o5192M664m947j08278L3305j3178R8168m9203J9823l4546r8052K7960
8865a85814L6435l3401K9699J0750R6985M7470o339J11397J03142K7868m8814
8854A89378q5023k8534o7993j4092l0507J55467L4235M652k5548l7919k3260j38002
8842f7146k1366O4328p549p0803Q5812J99033L494n1797j7965m6021k2490O0617
8830A08147J2600M077m1643k25974j56215J07295K02691K6536o1417M3719m6180
8819b6364j53426k8160L373r7658N8744K9988J0824O2889p4547J37735O8976N995
8807a631k6433q3398p6662O3406M3977l0185n944R1815o9377R8271M1581p833
$$ plain form
8795 37587 20777 -64798 34138 63040 42025 81546 5711 -86304 -164603 -131973 -3308 60970
8783 60970 85583 93427 14663 72406 178207 298614 234008 175799 251692 228484 181585 144137
8771 144137 74978 2451 -27778 -35774 -47241 -58502 45253 13281 -239454 -278699 -337382
8760 -337382 -348423 -308902 -212207 -192679 33249 -20369 -159739 -159792 -177718 -28702 129872
8749 129872 94257 -80581 -48803 65908 145915 80925 -13161 -19127 40776 89577 87832 -53494
8737 -53494 -147936 -91429 37786 33501 88106 158610 -36006 -98203 11260 11551 -67826 -47829
8725 -47829 -69240 -92268 63792 101601 -141519 -189522 -114548 25336 -36483 -169126 -268546
8714 -268546 -209496 -145785 11671 -21818 16478 88298 -66779 -135065 -50036 -18108 -40647
$$ packed form
8795C7587j6810q5575R8936K8902k1015L9521p5835r2015p8299L2630J28665O4278
8783F0970K4613P844p8764N7743J05801J20407o4606n8209P5893k3208m6899l7448
8771A44137o9159p2527l0229p996j1467j1261J03755l1972k52735l9245n8683
8760c37382j1041L9521R6695J9528K25928n3618j39370n3j7926J49016J58574
8749A29872l5615j74838L1778J14711Q0007o4990r4086n966N9903M8801j745j41326
8737e3494r4442N6507J29215m285N4605P0504j94616o2197J09463K91p9377J9997
8725d7829k1411k3028J56060L7809k43120m8003P4974J39884o1819j32643r9420
8714b68546N9050O3711J57456l3489L8296P1820j55077o8286Q5029L1928k2539
$$ plain form
8703 -40647 -56450 -123584 -175414 -73323 11323 -122961 -22808 -50840 -155557 -94885 -14048
8692 -14048 -185612 -333695 -290914 -99364 -44711 -100288 -54719 50935 -5016 -64436 -91471
8681 -91471 -20612 -7533 -97237 11221 -48249 -75124 -12987 -53667 -61636 -53729 -78673 -153180
8669 -153180 -183474 -212020 -276951 -142290 -35453 -7105 -109703 -123816 -115707 -4653 -912
8658 -912 -83043 -129130 25552 23153 94918 106207 186430 93343 -24890 -94312 -115264 -170348
8646 -170348 -129449 -94647 -119236 -15582 -17203 -111887 -74497 -86454 -66969 -82515 -52907 63986
8634 63986 71613 -3716 22530 87587 50676 3089 61381 31590 -74612 -39392 -21686 -18089
8622 -18089 -42992 -42358 -40054 -27268 59131 269727 190222 63630 248051 250692 208074 94214
$$ packed form
8703d0647j5803o7134n1830J02091Q4646j34284J00153k8032j04717O0672Q0837
8692a4048j71564j48083M2781J91550N4653n5577M5569J05654n5951n9420k7035
8681i1471P0859J3079q9704J08458n9470k6875O2137m0680p969P907k4944p4507
8669a53180l0294k8546o4931J34661J06837K8348j02598j4113Q109J11054L741
8658i12q2131m6087J54682k399P1765J1289Q0223r3087j18233o9422k0952n5084
8646a70348M0899L4802k4589J03654j621r4684L7390j1957J9485j5546K9608J16893
8634F3986P627p5329K6246O5057l6911m7587N8292k9791j06202L5220J7706L597
8622a8089k4903O34K304J2786Q6399K10596p9505j26592J84421K641m2618j13860
$$ plain form
8610 94214 34721 -325 -5467 -29709 -92233 -148489 14063 130659 203889 279135 209644 167512
8598 167512 108164 79853 28864 -97453 -70714 7457 48177 77604 -35866 -15303 45450
8587 45450 117958 146973 36161 -24059 -3879 50341 64720 177951 65763 248 96913
8576 96913 147557 119599 161433 224714 333915 356863 306472 370830 344552 308509 341285 322513
8564 322513 209847 92659 43272 51196 -89408 -208209 -229727 -107269 -56373 -89257 1671
8553 1671 49915 139189 79980 24740 73675 84752 75136 65435 -38373 -140734 -183165 -41382
8541 -41382 13009 -68149 -128326 -148067 -85641 53474 125403 127083 47244 67694 132774 155299
8529 155299 148749 214386 362911 434174 361407 362566 285440 373581 456473 313934 278200 381385
$$ packed form
8610I4214n9493l5046n142k4242o2524n6256J62552J16596P3230P5246o9491m2132
8598A67512n9348k8311n0989j26317K6739P8171M0720K9427j13470K0563O0753
8587D5450P2508K9015j10812o0220K0180N4220J4379J13231j12188o5515R6665
8576I6913N0644k7958M1834O3281J09201K2948n0391O4358k6278l6043L2776j8772
8564C22513j12666j17188m9387P924j40604j18801k1518J22458N0896l2884R0928
8553A671M8244Q9274n9209n5240M8935J1077r616r701j03808j02361m2431J41783
8541d1382N4391q1158o0177j9741O2426J39115P1929J680p9839K0450O5080K2525
8529A55299o550O5637J48525P1263p2767J159p7126Q8141Q2892j42539l5734J03185
$$ plain form
8517 381385 401747 484301 481104 414699 381691 284313 270338 344262 165918 176351 160418 11918
8505 11918 93594 128558 154225 200956 104326 -34610 54636 186393 241853 275507 194545
8494 194545 149676 216112 74351 15275 41018 -103756 -159886 -27920 -65015 -4656 27664
8483 27664 -46007 -73808 16963 213436 311115 439311 459671 452454 344333 178487 39420
8472 39420 42300 -33522 -65532 -103246 -62320 -63885 129784 115580 4686 -76838 -220370 -225693
8460 -225693 -79502 96220 106820 112147 10818 -133957 -207859 -73443 151295 274363
8450 274363 158843 -68183 -148207 12868 -19692 -21845 -73442 -56113 -3463 -50137 -199550
8439 -199550 -196547 -79884 -101758 -55726 -97575 -168877 -209817 -159764 -60931 105774 145664
$$ packed form
8517C81385K0362Q2554l197o6405l3008r7378j3975P3924j78344J0433j5933j48500
8505A1918Q1676L4964K5667M6731r6630j38936Q9246J31757N5460L3654q0962
8494A94545m4869O6436j41761n9076K5743j44774n6130J31966l7095O0359L2320
8483B7664p3671k7801R0771J96473R7679J28196K0360p217j08121j65846j39067
8472C9420K880p5822l2010l7714M0926j565J93669j4204j10894q1524j43532n323
8460b25693J46191J75722J0600N327j01329j44775p3902J34416K24738J23068
8450B74363j15520k27026q0024J61075l2560k153n1597J7329N2650m6674j49413
8439a99550L003J16663k1874M6032m1849p1302m0940N0053R8833J66705L9890
$$ plain form
8428 145664 197703 308892 177393 179409 201108 205548 164865 158675 147835 142609 89983 -65519
8416 -65519 -99143 -12780 32482 117258 249689 158579 82725 -113117 -93303 123669 107070
8405 107070 41665 121183 114448 132954 323973 331938 66376 -117597 -123891 -101796 -23697 59726
8393 59726 148059 130541 209629 99454 72911 137026 129715 42644 35663 -67381 -205204 -217366
8381 -217366 -63221 64235 102342 40396 -36889 -161728 -90734 -61255 26544 53599 171587
8370 171587 180429 195670 176817 281554 209693 102406 137204 123684 72080 66346 153657 202161
8358 202161 83713 26234 28900 -14565 -107439 -19187 -7332 40095 -4557 -11998 18075 -33518
8346 -33518 -34351 -5522 76714 96964 19556 134504 98466 67398 27699 -43838 116851 260141
$$ packed form
8428A45664N2039J11189j31499K016K1699M440m0683o190j0840n226n2626j55502
8416f5519l3624Q6363M5262Q4776J32431r1110p5854j95842J9814K16972j6599
8405A07070o5405P9518o735J8506J91019P965k65562j83973o294K2095P8099Q3423
8393E9726Q8333j7518P9088j10175k6543O4115p311q7071o981j03044j37823j2162
8381b17366J54145J27456L8107o1946p7285j24839P0994K9479Q7799K7055J17988
8370A71587Q842J5241j8853J04737p1861j07287L4798j3520n1604n734Q7311M8504
8358B02161j18448n7479K666m3465r2874Q8252J1855M7427m4652p441L0073n1593
8346c3518q33K8829Q2236K0250p7408J14948l6038l1068l9699p1537J60689J43290
$$ plain form
8334 260141 433492 513418 396368 257390 94659 124928 94271 101672 108405 119429 137490
8323 137490 -8294 63236 122238 141263 10033 -49380 -28274 -49330 -28832 -77835 -144022
8312 -144022 -140478 -149775 5653 155725 207358 241184 205893 120282 11485 -21254 -11549 23621
8300 23621 71913 137374 124460 68139 102085 -83938 -232133 -208115 45678 396988 597854
8289 597854 635409 827930 790288 604815 441236 302918 176681 169782 116820 136075 154417
8278 154417 146243 120799 72462 5149 -16059 -43142 63571 51028 51214 -31674 -97223 -54584
8266 -54584 96098 194234 68684 95710 140750 108008 3578 -134968 -80939 780 56179
8255 56179 39540 38082 45395 -57954 -68754 -15761 91340 206150 235407 207719 227654 249995
$$ packed form
8334B60141J73351P9926j17050j38978j62731L0269l0657P401O733J1024J8061
8323A37490j45784P1530N9002J9025j31230n9413K1106k1056K0498m9003o6187
8312a44022L544r297J55428J50072N1633L3826l5291q5611j08797l2739R705L5170
8300B3621M8292O5461j2914n6321L3946j86023j48195K4018K53793L51310K00866
8289E97854L7555J92521l7642j85473j63579j38318j26237o899n2962J9255J8342
8278A54417q174k5444m8337o7313k1208k7083J06713j2543J86q2888o5549M2639
8266e4584J50682R8136j25550K7026M5040l2742j04430j38546N4029Q1719N5399
8255E6179j6639j458P313j03349j0800N2993J07101J14810K9257k7688J9935K2341
$$ plain form
8243 249995 245793 235740 130596 -33889 -168431 -245763 -164384 -106192 82432 311552 207975
8232 207975 101882 198326 277926 188246 127519 164471 174064 69168 50245 -47347 -171217
8221 -171217 -218219 -191997 -124944 -107690 -121969 -34374 -4538 54244 27498 46151 28245 53349
8209 53349 -38267 -203948 -144587 -116822 -37563 -36166 26518 -12620 -111669 -46500 15773 -86591
8197 -86591 -82610 15367 119917 184714 129750 12633 34275 92491 -62417 -13288 82204
8186 82204 40096 -79368 23076 -48793 35224 140207 112859 26132 77218 83979 44887
8175 44887 -42770 -122022 -131930 -42638 -118634 -50243 -30737 118316 107639 15984 -83473 -7253
8163 -7253 12866 94677 84374 64850 55606 68858 102994 156814 166187 -41953 -82040 -122006
$$ packed form
8243B49995m202j0053j05144j64485j34542p7332Q1379N8192J88624K29120j03577
8232B07975j06093R6444P9600q9680o0727L6952R593j04896j8923r7592j23870
8221a71217m7002K6222O7053J7254j4279Q7595K9836N8782k6746J8653j7906K5104
8209E3349r1616j65681N9361K7765P9259J397O2684l9138r9049O5169O2273j02364
8197h6591L981R7977J04550O4797n4964j17117K1642N8216j54908M9129R5492
8186H2204m2108j19464J02444p1869Q4017J04983k7348q6727N1086O761l9092
8175D4887q7657p9252r908Q9292p5996O8391J9506J49053j0677r1655r9457P6220
8163g253K0119Q1811j0303j9524r244J3252L4136N3820R373k08140m0087l9966
$$ plain form
8151 -122006 -87710 -29970 -50769 -35837 80964 114190 237195 292773 232511 90059 -103839
8140 -103839 -83996 -61237 -103761 -147672 -171714 -144788 -34138 -59527 -84275 -148286 30726
8129 30726 93521 -8796 89061 116701 150254 103211 113990 255640 378382 271773 163646
8118 163646 128930 111634 89860 69800 -115772 -232963 -232113 -158937 -158743 -137132 -95084 -271745
8106 -271745 -282419 -129694 -60147 70098 57116 -39586 -156505 -203162 -148401 -126131 -173043
8095 -173043 -199274 -191779 -123332 -180313 -168424 40577 -18390 -45086 -64550 -124650 -239416
8084 -239416 -359965 -365076 -234338 -54104 67920 90161 8601 -82175 -151257 -232204 -257206
8073 -257206 -184142 -120919 -124283 -86293 -47853 -124948 -194791 -180416 27634 183799 51392
$$ packed form
8151a22006L4296N7740k0799J4932J16801L3226J23005N5578o0262j42452j93898
8140a03839J9843K2759m2524m3911k4042K6926J10650k5389k4748o4011J79012
8129C0726O2795j02317R7857K7640L3553m7043J0779J41650J22742j06609j08127
8118A63646l4716j7296k1774k0060j85572j17191Q50P3176J94K1611M2048j76661
8106b71745j0674J52725O9547J30245j2982r6702j16919m6657N4761K2270m6912
8095a73043k6231P495O8447n6981J1889K09001n8967k6696j9464o0100j14766
8084b39416j20549n111J30738J80234J22024K2241q1560r0776o9082q0947k5002
8073b57206P3064O3223l364L7990L8440p7095o9843J4375K08050J56165j32407
$$ plain form
8062 51392 11971 30849 -17490 -10861 -101354 -79978 52851 -8675 -18949 63428 82387 146265
8050 146265 197349 167962 24127 -119482 -125816 -204900 -230382 -68006 -47610 -190271 -170723
8039 -170723 -142802 -78975 -125201 -124470 -115842 -77166 -180558 -319726 -121293 -98133 -152474 -171346
8027 -171346 -61509 -41726 1097 96405 86284 55602 110445 244033 246270 147828 -9570
8016 -9570 6838 39435 11726 60447 112148 55514 113126 59240 -129486 -171938 -85106 -70437
8004 -70437 -19883 10621 50400 -30593 -59045 -33738 30016 64771 79328 101473 203057 222884
7992 222884 304522 489955 283014 104061 40575 121724 -88859 -280519 -264123 -69568
7982 -69568 49219 -12735 -58349 72858 165358 86936 96820 1572 -27852 -94946 -135783 -127801
$$ packed form
8062E1392l9421J8878m8339O629r0493K1376J32829o1526j0274Q2377J8959O3878
8050A46265N1084k9387j43835j43609o334p9084k5482J62376K0396j42661J9548
8039a70723K7921O3827m6226P31Q628L8676j03392j39168J98433K3160n4341j8872
8027a71346J09837J9783M2823R5308j0121l0682N4843J33588K237r8442j57398
8016i570J6408L2597k7709M8721N1701n6634N7612n3886j88726m2452Q6832J4669
8004g0437N0554L0504L9779q0993k8452K5307O3754L4755J4557K2145J01584J9827
7992B22884Q1638J85433k06941j78953o3486Q1149k10583j91660J6396J94555
7982f9568J18787o1954m5614J31207R2500p8422R884r5248k9424o7094m0837P982
$$ plain form
7970 -127801 -119670 -145856 -73940 -87406 -47092 -4401 1045 -136586 -130458 -20207 154919 188012
7958 188012 16901 -84206 -23548 32823 -59180 -28636 19497 47429 69006 62601 20916
7947 20916 -19898 98686 51344 -71820 -30063 40060 115379 143889 104698 128973 243020
7936 243020 269819 178662 188449 257434 119411 153279 153454 96974 68074 20835 130997 76859
7924 76859 -54154 -33020 165929 133057 -49727 -111270 -121751 -169834 -149763 -59753 378
7913 378 4050 -52782 -76535 34140 157179 28058 -82413 -45731 15785 -40522 -139020 -174226
7901 -174226 -74257 -167075 -55623 135171 128887 95812 56894 -38182 -91824 -37628 -61214
7890 -61214 -55936 -41834 95637 87389 -29740 19564 11661 -21276 -73685 15487 130179 187146
$$ packed form
7970a27801Q131k6186P1916j3466M0314M2691N446j37631O128J10251J75126L3093
7958A88012j71111j01107O0658N6371r2003L0544M8133K7932K1577o405m1685
7947B0916m0814J18584m7342j23164M1757P0123P5319K8510l9191K4275J14047
7936B43020K6799r1157R787O8985j38023L3868J75n6480k8900m7239J10162n4138
7924G6859j31013K1134J98949l2872j82784o1543j0481m8083K0071R0010O0131
7913C78L672n6832k3753J10675J23039j29121j10471L6682O1516n6307r8498l5206
7901a74226R9969r2818J11452J90794o284l3075l8918r5076n3642N4196k3586
7890f1214N278J4102J37471q248j17129M9304p903l2937n2409Q9172J14692N6967
$$ plain form
7878 187146 232310 70465 29994 -19393 -65643 -154532 -110050 -76378 -95338 -90262 -48494 -1958
7866 -1958 -28138 65668 160693 182809 76667 99025 8041 -20926 -15630 52365 55248 17630
7854 17630 -9726 119400 164120 107759 -4379 92782 73916 37907 141343 294525 275661
7843 275661 196136 143003 154729 166823 87243 -28125 -64804 45847 -100849 -121088 100511
7832 100511 95970 -88487 -75765 -165805 -123365 -31708 -72624 -67174 -70007 -88620 87145 166046
7820 166046 78942 -80592 -129957 -268937 -367279 -272878 -155545 3443 72813 125486 98955
7809 98955 15684 72683 177662 126338 98825 -51053 -233022 -132410 -126594 -71877 34422
7798 34422 9528 -119599 -84014 -78067 16815 73232 -11129 -35725 -1134 19794 119206 92518
$$ packed form
7878A87146M5164j61845m0471m9387m6250q8889M4482L3672j8960N076M1768M6536
7866a958k6180R3806R5025K2116j06142K2358r0984k8967N296O7995K883l7618
7854A7630k7356J29126M4720n6361j12138R7161j8866l6009J03436J53182j8864
7843B75661p9525n3133J1726J2094p9580j15368l6679J10651j46696k0239K21599
7832A00511m541j84457J2722r0040M2440R1657m0916N450k833j8613J75765P8901
7820A66046q7104j59534m9365j38980r8342R4401J17333J58988O9370N2673k6531
7809I8955q3271N6999J04979n1324k7513j49878j81969J00612N816N4717J06299
7798C4422k4894j29127L5585N947R4882N6417q4361k4596L4591K0928R9412k6688
$$ plain form
7786 92518 -92464 -204141 -142422 -30365 2628 -14522 5568 99775 106128 87926 27494
7775 27494 118191 121520 -29124 -108951 -225548 -226881 -148669 -54 81439 114812 60667 4539
7763 4539 -50658 15148 -128393 -310959 -376642 -286910 -231618 -49428 -3406 -8516 -31709 -36775
7751 -36775 -95126 -120638 -10523 97849 267671 269438 96027 63708 113274 -23770 -4527
7740 -4527 -18384 -87111 -138422 -161925 -169330 -179596 -200863 -146320 -120787 -218953 -169895 -22613
7728 -22613 -130257 -214228 -204784 -97170 40895 42537 13725 -43158 -182334 -171340 -95951
7717 -95951 107331 165873 -5701 -128849 -118591 -80543 -43792 91275 110886 166859 36949
7706 36949 13960 82565 9597 -51023 -59478 -94736 -126207 -142851 -93727 -84239 -77801 -8584
$$ packed form
7786I2518j84982j11677O1719J12057L2993j7150K0090R4207O353j8202o0432
7775B7494R0697L329j50644p9827j16597j333P8212J48615Q1493L3373n4145n6128
7763D539n5197O5806j43541j82566o5683Q9732N5292J82190M6022n110k3193n066
7751c6775n8351k5512J10115J08372J69822J767j73411l2319M9566j37044J9243
7740d527j3857o8727n1311k3503p405j0266k1267N4543K5533r8166M9058J47282
7728b2613j07644q3971R444J07614J38065J642k8812n6883j39176J0994P5389
7717i5951K03282N8542j71574j23148J0258L8048L6751J35067J9611N5973j29910
7706C6949k2989O8605p2968o0620q455l5258l1471j6644M9124R488O438O9217
$$ plain form
7694 -8584 -4730 -7762 -111638 -190363 -229647 -279755 -218298 -189341 -171476 -110274 90582 95911
7682 95911 -20522 13423 97302 198644 129786 -9655 -46636 8428 -73506 -235025 -118059
7671 -118059 -34958 36911 18736 -7130 4302 -5108 23996 -49512 -40352 13157 35292 -29059
7659 -29059 92636 109410 66799 15808 -83550 -121828 -112618 -55410 -94710 -189433 -86163 -8339
7647 -8339 -63184 -119206 -39854 -60881 -165928 -152324 -92616 -27848 9596 5623 -26109 -122461
7635 -122461 -86707 545 16879 -5664 -124893 -109560 -750 -27200 80097 24200 -78401
7624 -78401 -1680 37052 -55578 -116678 -61248 -55282 -48016 -18707 -1638 -107245 -98576 -155651
7612 -155651 -112534 -87415 -137375 -10643 124043 16613 -91993 -72272 -51566 -79028 -112408
$$ packed form
7694h584L854l032j03876p8725l9284n0108O1457K8957J7865O1202K00856N329
7682I5911j16433L3945Q3879J01342o8858j39441l6981N5064q1934j61519J16966
7671a18059Q3101P1869j8175k5866J1432r410K9104p3508R160N3509K2135o4351
7659b9059J21695J6774m2611n0991r9358l8278R210N7208l9300r4723J03270P7824
7647h339n4845n6022P9352k1027j05047J3604N9708O4768L7444l973l1732r6352
7635a22461L5754Q7252J6334k2543j19229J5333J08810k6450J07297n5897j02601
7624g8401P6721L8732r2630o1100N5430N966P266K9309J7069j05607Q669n7075
7612a55651M3117K5119m9960J26732J34686j07430j08606J9721K0706k7462l3380
$$ plain form
7601 -112408 -113039 -163072 -122286 -146342 -80826 47805 -35767 -9473 -5640 -39036 68386 222633
7589 222633 226691 108218 181053 50290 -17805 67548 -21522 -68494 -53073 -5356 16669
7578 16669 -26429 49203 65520 116150 135376 32768 1458 -42105 27064 -70278 -145630 -118515
7566 -118515 -289023 -335820 -176039 32 -52720 -202604 -222687 -133965 -82964 -111891 46360
7555 46360 58565 -106095 -107170 -40937 -27141 -20206 -20683 110965 229677 131544 170046 132282
7543 132282 74167 74986 182846 273210 203197 104971 82276 1202 -18239 84442 53275 30443
7531 30443 -220658 -216824 -192279 -168678 -12902 -22815 -117536 -138018 -142127 -83062 -36751 8357
7519 8357 -17350 -41800 -81370 -130179 -106104 -59989 -84313 -103273 40194 163639 104189 99616
$$ packed form
7601a12408o31n0033M0786k4056O5516J28631q3572K6294L833l3396J07422J54247
7589B22633M058j18473P2835j30763o8095Q5353q9070m6972J5421M7717K2025
7578A6669m3098P5632J6317N0630J9226j02608l1310m3563O9169r7342p5352K7115
7566a18515j70508m6797J59781J76071n2752j49884k0083Q8722N1001k8927J58251
7555D6360J2205j64660j075O6233J3796O935m77J31648J18712r8133L8502l7764
7543A32282n8115Q19J07860R0364p0013r8226k2695q1074j9441J02681l1167k2832
7531C0443k51101L834K4545K3601J55776r913r4721k0482m109N9065M6311M5108
7519H357k5707k4450l9570m8809K4075M6115k4324j8960J43467J23445n9450m573
$$ plain form
7507 99616 133282 133296 162065 83037 97355 175098 210066 231557 231648 111592 96776 139105 54677
7494 54677 50200 531 -5574 53272 12186 -122765 -40695 75914 152133 148960 192490 212575
7482 212575 176534 132956 99559 111843 82673 44383 35111 19680 69910 43695 101703 91474
7470 91474 28993 15109 -7652 -33203 -25489 37315 -107497 -112923 -200467 -187326 -102159 -179131
7458 -179131 -214812 -220356 -159259 -89196 -125264 341 -27915 -96085 -99590 -122649 -98290 -81503
7446 -81503 17975 -9457 -98735 13055 164242 46518 59326 90092 -638 -100759 45915
7435 45915 115926 99340 66099 77561 203037 236685 190020 135377 67894 42099 -21345 41510
7423 41510 170869 74024 76025 143092 77853 33719 60571 -2939 -51711 -83577 -104505 -12335
$$ packed form
7507I9616L3666J4K8769p9028J4318P7743L4968K1491R1j20056j4816M2329q4428
7494E4677m477m9669o105N8846m1086j34951Q2070J16609P6219l173M3530K0085
7482B12575l6041m3578l3397J2284k9170l8290r272j5431N0230k6215N8008j0229
7470I1474o2481j3884k2761k5551P714O2804j44812n426q7544J3141Q5167p6972
7458a79131l5681n544O1097P0063l6068J25605k8256o8170l505k3059K4359J6787
7446h1503R9478k7432q9278J11790J51187j17724J2808L0766r0730j00121J46674
7435D5915P0011j6586l3241J1462J25476L3648m6665n4643o7483k5795o3444O2855
7423D1510J29359r6845K001O7067o5239m4134K6852o3510m8772l1866k0928R2170
$$ plain form
7411 -12335 58243 68162 -6329 -1311 51429 94786 129982 171615 65699 -40402 -93847 -174594
7399 -174594 -312572 -339658 -135257 -4759 -131561 -39371 28365 -73594 -201654 -162657
7389 -162657 -10750 -7498 -39049 -143041 -156790 -50047 160811 165268 18166 -22398 -91555
7378 -91555 -137317 -176531 -193572 -70179 41007 100817 121500 25344 -68918 -33171 -103690
7367 -103690 -123290 -59391 -88719 -43478 1609 -51422 -34455 -162421 -214995 -191862 -182809 -2784
7355 -2784 80378 106267 -3336 -9222 5860 -21600 3398 42314 -43135 -17137 -34284 -174071
7343 -174071 -121794 34541 57196 -20231 6142 90456 227748 165720 164547 50142 -182528
7332 -182528 -248111 -209290 -144609 -138739 -139055 -138047 66023 183801 235016 159785 51648 -4898
$$ packed form
7411a2335P0578R919p4491N018N2740M3357L5196M1633j05916j06101n3445q0747
7399a74594j37978k7086K04401J30498j26802R2190O7736j01959j28060L8997
7389a62657J51907L252l1551j03992j3749J06743K10858M457j47102m0564o9157
7378i1555m5762l9214j7041J23393J11186N9810K0683r6156r4262L5747p0519
7367a03690j9600O3899k9328M5241M5087n3031J6967j27966n2574K3133R053J80025
7355b784Q3162K5889j09603n886J5082k7460K4998L8916q5449K5998j7147j39787
7343a74071N2277J56335K2655p7427K6373Q4314J37292o2028j173j14405k32670
7332a82528o5583L8821O4681N870l16J008K04070J17778N1215p5231j08137n6546
$$ plain form
7320 -4898 180035 200694 197402 223043 153622 56554 92235 195394 291413 270397 259552 272067
7308 272067 177626 80274 22366 -56463 -8569 104944 115042 55052 -10097 31416 27938 21917
7296 21917 47155 -118236 -217031 -137943 -47450 -71309 -198163 -253598 -228005 -130058 -124120 -85551
7284 -85551 -73229 -54291 -10542 10340 -2175 -7954 -34347 -65488 -79632 -67973 -18343 -104273
7272 -104273 -49553 -29106 -73277 -136014 -35301 3263 -235747 -228689 -89475 -27207 -57917
7261 -57917 70779 102870 5450 -56730 -80745 -100522 -179421 -82711 -20305 -16665 -12071 7006
7249 7006 50316 26579 -53819 -182845 -170312 -55204 -111558 -69259 -26461 37531 106700 86355
7237 86355 -100126 -48074 7623 -98417 -189486 -180013 -130895 -13109 104918 155341 110403
$$ packed form
7320d898J84933K0659l292K5641o9421r7068L5681J03159R6019k1016j0845J2515
7308B72067r4441r7352n7908p8829M7894J13513J0098n9990o5149M1513l478o021
7296B1917K5238j65391r8795P9088R0493k3859j26854n5435K5593R7947N938L8569
7284h5551J2322J8938M3749K0882j2515n779k6393l1141j4144J1659M9630q5930
7272a04273N4720K0447m4171o2737J00713L8564k39010P058J39214O2268l0710
7261e7917J28696L2091r7420o2180k4015j9777p8899R6710O2406L640M594J9077
7249G006M3310k3737q0398j29026J2533J15108n6354M2299M2798O3992O9169k0345
7237H6355j86481N2052N5697j06040r1069R473M9118J17786J18027N0423m4938
$$ plain form
7226 110403 26600 -12149 10684 -90209 -80548 61105 142455 120391 66238 -36963 -128753
7215 -128753 -125536 -182649 -283773 -199167 -142741 -104090 -180216 -70348 33054 148021 179609
7204 179609 235334 305145 261514 67737 -80009 -11377 15984 -57915 -161479 -149163 -122521
7193 -122521 -54830 -112124 -138266 5734 40548 100987 169811 128651 205582 224034 134631
7182 134631 182134 221304 204877 150811 98362 9994 -59855 -2637 14535 -24416 9545 58172
7170 58172 92401 167776 78333 42563 49012 50759 -21475 -28752 2203 -40766 -54994 -39802
7158 -39802 148905 337517 276731 146927 -16895 -12424 162142 83399 -16894 -33205 2899
7147 2899 -21806 31921 38159 24170 31945 20217 -6593 65769 8121 -36137 -8842 -42180
$$ packed form
7226A10403q3803l8749K2833j00893R661J41653Q1350k2064n4153j03201r1790
7215a28753L217n7113j01124Q4606N6426L8651p6126J09868J03402J14967L1588
7204A79609N5725O9811m3631j93777j47746O8632K7361p3899j03564J2316K6642
7193a22521O7691n7294k6142J44000L4814O0439O8824m1160P6931J8452q9403
7182A34631M7503L9170j6427n4066n2449q8368o9849N7218J7172l8951L3961M8627
7170E8172L4229P5375q9443l5770O449J747p2234p277L0955m2969j4228J5192
7158c9802J88707J88612o0786j29804j63822M471J74566p8743j00293j6311L6104
7147B899k4705N3727O238j3989P775j1728k6810P2362n7648m4258K7295l3338
$$ plain form
7135 -42180 5515 -13488 -80034 25646 95197 218740 167345 145533 26199 -90000 -21874
7124 -21874 138372 25403 -125734 -44572 13252 67905 -56052 -82648 -131357 -249467 -273664
7113 -273664 -191298 -195539 -121857 -49340 1996 -18798 -34100 63654 78472 118800 119185 72048
7101 72048 14915 16089 41652 -8952 -10425 128791 270432 82988 31820 212198 162655
7090 162655 95170 188075 148295 166911 161442 121289 87507 118448 45813 25902 94441 56525
7078 56525 7583 -34380 45727 1776 -30170 -70346 64183 118619 234802 299695 164311
7067 164311 5835 -27417 42573 33310 -70271 -73741 -143401 -58740 16351 -8859 97768
7056 97768 81327 221573 339621 312540 238718 104702 138648 59260 -14380 -109750 -136710
$$ packed form
7135d2180M7695j9003o6546J05680O9551J23543n1395k1812j19334j16199O8126
7124b1874J60246j12969j51137Q1162N7824N4653j23957k6596m8709j18110k4197
7113b73664Q2366m241P3682P2517N1336k0794j5302R7754J4818M0328L85m7137
7101G2048n7133J174K5563n0604j473J39216J41641j87444n1168J80378m9543
7090A62655o7485R2905l9780J8616n469m0153l3782L0941p2635j9911O8539l7916
7078E6525m8942m1963Q0107m3951l1946m0176J34529N4436J16183O4893j35384
7067A64311j58476l3252O9990r263j03581l470o9660Q4661P5091k5210J06627
7056I7768j6441J40246J18048k7081p3822j34016L3946p9388p3640r5370k6960
$$ plain form
7045 -136710 -191750 -147291 -119262 52927 16032 -142474 -230282 -137091 -67531 -10513 -81698
7034 -81698 -24858 -164953 -30655 198110 241505 132600 189855 187258 84432 143255 200913
7023 200913 129017 -137941 -244472 -120047 52095 78810 -135041 -261407 -64537 -34151
7013 -34151 -70501 16742 1509 -47421 15179 -102951 -156491 -148787 -121230 -98745 -35692 26179
7001 26179 -129154 -146669 -25581 72954 54543 29313 -93146 -220996 -201665 -179972 -20691
6990 -20691 11918 75438 152007 140006 74418 35833 215809 295235 204499 42474 -972
6979 -972 -12401 740 111144 -68863 -204968 -156580 -14684 53785 130078 130646 150189 144158
6967 144158 86230 -655 22935 2446 -943 25652 -46299 -158990 -8234 31220 113582
$$ packed form
7045a36710n5040M4459K8029J72189l6895j58506q7808R3191O9560N7018p1185
7034h1698N6840j40095J34298K28765M3395j08905N7255k597j02826N8823N7658
7023B00913p1896k66958j06531J24425J72142K6715k13851j26366J96870L0386
7013c4151l6350Q7243j5233m8930O2600j18130n3540P704K7557K2485O3053O1871
7001B6179j55333j7515J21088R8535j8411k5230j22459j27850J9331K1693J59281
6990b0691L2609O3520P6569j2001o5588l8585J79976P9426r0736j62025m3446
6979i72j1429J3141J10404j80007j36105M8388J41896O8469P6293N68J9543o031
6967A44158n7928q6885K3590k0489l389K6595p1951j12691J50756L9454Q2362
$$ plain form
6956 113582 151282 13160 -105285 -84483 -65059 -20227 14503 36499 40915 34898 21283 -145402
6944 -145402 -311897 -333571 -179156 32196 129832 -518 -183655 -145976 39599 -60804
6934 -60804 -82122 -24884 86316 159428 354851 307764 127219 45178 18950 102099 23200
6923 23200 33776 44069 161446 76640 95038 115515 4705 -83064 -165998 -109354 -13774
6912 -13774 -123784 -239340 -111119 -33835 -98726 -75792 -65851 -115357 -7391 171937 232033
6901 232033 192565 252836 264404 282594 264329 170584 131146 120825 242847 350746 195673
6890 195673 18056 -45199 16629 118591 46117 -57939 -99712 -175127 -196802 -107831 -225706
6879 -225706 -307048 -194279 -150394 -146087 -135482 -144903 -107117 52918 25590 73489 76812 41082
$$ packed form
6956A13582L7700j38122j18445K0802J9424M4832L4730K1996M416o017j3615j66685
6944a45402j66495k1674J54415K11352R7636j30350j83137L7679J85575j00403
6934f0804k1318N7238J11200P3112J95423m7087j80545q2041k6228Q3149p8899
6923B3200J0576J0293J17377q4806J8398K0477j10810q7769q2934N6644R5580
6912a3774j10010j15556J28221P7284o4891K2934R941m9506J07966J79328O0096
6901B32033l9468O0271J1568J8190j8265r3745l9438j0321J22022J07899j55073
6890A95673j77617o3255O1828J01962p2474j04056m1773p5415k1675Q8971j17875
6879b25706q1342J12769M3885M307J0605r421L7786J60035k7328M7899L323l5730
$$ plain form
6867 41082 27163 126961 215419 126330 14155 -28062 58428 34830 -80194 -153849 -210976
6856 -210976 -262454 -254214 -105079 -71366 -79146 5365 -100172 -159155 -114047 -174862 -179945 -83830
6844 -83830 -20764 -95487 -34330 110362 96198 -53588 35332 157228 143543 142568 25953
6833 25953 -13453 37799 -65545 -70010 -15700 -77697 -152002 -212001 -292102 -397269 -376170 -420614
6821 -420614 -316437 -111190 -145036 -242825 -193037 -94753 -71948 -111514 -5400 25881 -171380
6810 -171380 -182443 -154337 -37980 96151 -15045 -234266 -398224 -460641 -414035 -261663
6800 -261663 -258436 -139825 -74660 -8021 -67648 -84826 -106240 -32032 145929 147228 100544 49921
6788 49921 34597 85136 138115 99021 50211 118668 78374 102812 20577 -117605 -136082 -42058
$$ packed form
6867D1082j3919R9798Q8458q9089j12175m2217Q6490k3598j15024p3655n7127
6856b10976n1478Q240J49135L3713p780Q4511j05537n8983M5108o0815n083R6115
6844h3830O3066p4723O1157J44692j4164j49786Q8920J21896j3685r75j16615
6833B5953l9406N1252j03344m465N4310o1997p4305n9999q0101j05167K1099m4444
6821d20614J04177K05247l3846r7789M9788R8284K2805l9566J06114L1281j97261
6810a71380j1063K8106J16357J34131j11196k19221j63958o2417M6606J52372
6800b61663L227J18611O5165O6639n9627j7178k1414P4208J77961J299m6684n0623
6788D9921j5324N0539N2979l9094m8810O8457m0294K4438q2235j38182j8477R4024
$$ plain form
6776 -42058 -44497 -48240 -44872 76861 133586 194501 219773 320464 386819 277749 227587 130456
6764 130456 9395 -70273 -67837 -69186 -81860 -18723 -38441 -131048 -240350 -177132 -99922 -131039
6752 -131039 -160646 -116789 -50079 88167 34140 -75568 -19481 127183 197804 262774 165259
6741 165259 67912 -1016 -62178 -46183 -108963 -292069 -201485 -51730 29857 -21694 -6404
6730 -6404 8281 -50991 -142374 -161141 -217534 -209960 -243282 -271318 -288807 -184808 -86883 27420
6718 27420 41770 -66235 -17774 114072 45421 -23269 -118289 -67559 -65896 -57938 -102006 -111319
6706 -111319 -245835 -294447 -315622 -199391 -64797 -45782 -126821 -271263 -335230 -326763 -280354
6695 -280354 -247726 -86459 37477 72955 -35292 -186128 -189084 -193714 -220830 -278812 -366122
$$ packed form
6776d2058k439l743L368J21733N6725O0915K5272J00691O6355j09070n0162r7131
6764A30456j21061p9668K436j349j2674O3137j9718r2607j09302O3218P7210l1117
6752a31039k9607M3857O6710J38246n4027j09708N6087J46664P0621O4970r7515
6741A65259r7347o8928o1162J5995o2780j83106R0584J49755Q1587n1551J5290
6730f404J4685n9272r1383j8767n6393P574l3322k8036j7489J03999R7925J14303
6718B7420J4350j08005M8461J31846o8651o8690r5020N0730J663P958m4068r313
6706a11319j34516m8612k1175J16231J34594J9015q1039j44442o3967Q467M6409
6695b80354L2628J61267J23936L5478j08247j50836k956m630k7116n7982q7310
$$ plain form
6684 -366122 -401247 -379872 -358083 -247646 -85215 -76818 -41686 -38016 17842 108445 -16156
6673 -16156 -116069 -139433 9659 -26373 -63547 -23292 -22357 45780 155302 198202 292501 228569
6661 228569 221159 248331 191679 203324 112297 32894 -128599 -105309 -69321 5338 -48976 -131943
6649 -131943 53600 132444 208032 243602 254340 139808 96965 7426 27936 103682 96618
6638 96618 101519 60243 -70414 -23452 89926 50961 1981 21476 92835 163797 123276 139120
6626 139120 93211 53594 25383 30567 118869 205790 247959 158761 41153 84614 70612 -89497
6614 -89497 -76468 -40958 -133762 -228958 -189658 -6438 98486 101879 33384 20722 13746 -92015
6602 -92015 -136969 -2900 -56285 -140931 -249793 -271302 -123356 19892 33509 -89415 -154122
$$ packed form
6684c66122l5125K1375K1789J10437J62431Q397L5132L670N5858R0603j24601
6673a6156r9913k3364J49092l6032l7174M0255R35O8137J09522M2900R4299o3932
6661B28569p410K7172n6652J1645r1027p9403j61493K3290L5988P4659n4314q2967
6649a31943J85543P8844P5588L5570J0738j14532m2843q9539K0510P5746p064
6638I6618M901m1276j30657M6962J13378l8965m8980J9495P1359P0962m0521J5844
6626A39120m5909l9617k8211N184Q8302Q6921M2169q9198j17608M3461j4002j60109
6614h9497J3029L5510r2804r5196L9300J83220J04924L393o8495j2662o976j05761
6602i2015m4954J34069n3385q4646j08862k1509J47946J43248J3617j22924o4707
$$ plain form
6591 -154122 -154641 -145641 -169787 -32729 -57974 -30576 -155792 -134103 -135175 -2247 74959 -36892
6579 -36892 -18216 -30129 -40277 60157 13708 -85128 -95725 -70332 -110279 -114258 -92551 126295
6567 126295 134750 115395 55653 -11397 9221 68500 35613 -99912 -119366 -16808 62518
6556 62518 180574 240252 197453 188906 214927 138652 52510 40144 21536 56765 67026 19295
6544 19295 58579 178438 200839 162960 168318 45707 111467 105859 29824 -8079 -47327 58042
6532 58042 88188 149766 188258 152980 39010 -15431 -130949 -34675 -50461 -9616 88600
6521 88600 250157 330955 158583 36790 -167025 -215502 -258104 -219371 -83536 65568 20309
6510 20309 -10949 -88794 -107798 -43163 -56839 -103199 -74854 -38221 -2423 58820 107339 181388
$$ packed form
6591a54122n19R000k4146J37058k5245K7398j25216K1689j072J32928P7206j11851
6579c6892J8676j1913j0148J00434m6449r8836j0597K5393l9947l979K1707K18846
6567A26295Q455j9355n9742o7050K0618N9279l2887j35525j9454J02558P9326
6556F2518J18056N9678m2799q547K6021p6275q6142j2366j8608L5229J0261m7731
6544A9295L9284J19859K2401l7879N358j22611O5760n608p6035l7903l9248J05369
6532E8042L0146O1578L8492l5278j13970n4441j15518R6274j5786M0845R8216
6521H8600J61557Q0798j72372j21793k03815m8477m2602L8733J35835J49104m5259
6510B0309l1258p7845j9004O4635j3676m6360K8345L6633L5798O1243M8519P4049
$$ plain form
6498 181388 173517 34436 -71765 -160010 -128765 -93246 -11251 -39863 -160249 -113520 -21930
6487 -21930 46238 12671 131533 252851 176457 93797 -57478 -157308 -45598 72957 -10481
6476 -10481 -155555 -137932 41196 260759 285576 178665 48391 -47492 -68250 71569 42059
6465 42059 -5051 -6401 30365 -164843 -160110 -68463 -92615 -207615 -194082 -211191 -277545 -146348
6453 -146348 -178173 -237298 -129738 31954 147247 189010 163390 85615 -4083 -80442 -108756
6442 -108756 -7361 72557 80052 -8524 -23088 -35365 152878 188607 91141 115782 19522
6431 19522 -29432 95931 88042 53898 -4198 -47136 33197 144769 123932 37965 22153 24279
6419 24279 -21634 -30043 1366 28102 4685 133693 88452 -55573 -111772 -98546 -58153 60137
$$ packed form
6498A81388p871j39081j06201q8245L1245L5519Q1995k8612j20386M6729R1590
6487b1930O8168l3567J18862J21318p6394q2660j51275r9830J11710J18555q3438
6476a0481j45074J7623J79128K19563K4817j06911j30274r5883k0758J39819k9510
6465D2059m7110j350L6766j95208M733R1647k4152j15000J3533j7109o6354J31197
6453a46348l1825n9125J07560J61692J15293M1763k5620p7775q9698p6359k8314
6442a08756J01395P9918P495q8576j4564j2277J88243L5729r7466K4641r6260
6431A9522m8954J25363p889l4144n8096m2938Q0333J11572k0837q5967j5812K126
6419B4279m5913q409L1409K6736k3417J29008m5241j44025n6199J3226M0393J18290
$$ plain form
6407 60137 119949 33111 -20512 -95711 -104311 -5993 170627 38162 44852 -3410 -45434 10703
6395 10703 124721 85034 43656 37742 51638 -75683 -24856 -121445 -153031 -109830 -58555 -125532
6383 -125532 -196567 -238632 -225018 -123353 34809 78013 -29084 -45574 -9124 -145945 -59256
6372 -59256 31322 121930 134819 112736 93971 19891 60392 149856 120278 37087 -102818 -128047
6360 -128047 -37506 5380 -71662 -41041 50330 234914 264386 134331 153200 152189 82539
6349 82539 74336 81888 87011 -27516 -156013 -137424 -116431 -67383 159219 140189 -788 -132573
6337 -132573 -183158 -90932 112215 184671 207918 196397 112456 66710 28513 37216 44106 75586
6325 75586 63377 101047 81395 -18550 -52922 23396 83375 26910 -21449 63240 100172 -45399
$$ packed form
6407F0137N9812q6838n3623p5199q600R8318J76620j32465O690m8262m2024N6137
6395A0703J14018l9687m1378n914J3896j27321N0827r6589l1586M3201N1275o6977
6383a25532p1035m2065J3614J01665J58162M3204j07097j6490L6450j36821Q6689
6372e9256R0578R0608J2889k2083j8765p4080M0501Q9464k9578q3191j39905k5229
6360a28047R0541M2886p7042L0621R1371J84584K9472j30055J8869j011o9650
6349H2539q203P552N123j14527j28497J8589K0993M9048K26602j9030j40977j31785
6337a32573n0585R2226K03147P2456K3247j1521q3941m5746l8197Q703O890L1480
6325G5586j2209L7670j9652r9945l4372P6318N9979n6465m8359Q4689L6932j45571
$$ plain form
6313 -45399 -207125 -274207 -306213 -237927 -305955 -292372 -318777 -300227 -219806 -51048 18296
6302 18296 3933 -53598 52968 115406 100367 62205 54130 75610 -13977 7535 -27437 -57609
6290 -57609 -47392 106840 153502 153075 106299 5147 207 23277 18881 -19086 -58097 -51957
6278 -51957 -219214 -245746 -103210 -15162 95848 52996 -156263 -49672 136916 181867 212266
6267 212266 54645 -53559 -142212 -119274 -196210 -160829 -85869 44532 46423 141148 47535
6256 47535 -22809 70645 78286 57757 83829 56203 -49750 -106459 -62119 2926 165291 189522
6244 189522 96476 97944 76598 50850 96651 39319 26430 75360 136256 100407 111852 196722
6232 196722 250417 168867 -7068 -189133 -171105 -203586 -183467 -181186 -192406 -167128 74538
$$ packed form
6313d5399j61726o7082l2006O8286o8028J3583k6405J8550Q0421J68758O9344
6302A8296j4363n7531J06566O2438j5039l8162q075K1480q9587K1512l4972l0172
6290e7609J0217J54232M6662m27m6776j01152m940K3070m396l7967l9011O140
6278e1957j67257k6532J42536Q8048J11010m2852k09259J06591J86588M4951L0399
6267B12266j57621j08204q8653K2938p6936L5381P4960J30401J891R4725r3613
6256D7535p0344R3454P641k0529K6072k7626j05953n6709M4340O5045J62365K4231
6244A89522r3046J468k1346k5748M5801n7332j2889M8930O0896l5849J1445Q4870
6232A96722N3695q1550j75935j82065J8028l2481K0119K281j1220K5278K41666
$$ plain form
6221 74538 170916 39135 -38180 21657 -185151 -158294 -102614 -159976 -204256 -126017 -156771
6210 -156771 -175229 -102816 -45211 18597 154246 187674 108215 124686 148774 46800 -49647
6199 -49647 12709 -2814 -5117 -154389 -192833 -246409 -301125 -211582 -177611 -195832 -188529 -121145
6187 -121145 -26573 -46798 -163934 -215451 -104957 -2582 -9393 -8671 -48453 -108508 30798
6176 30798 56410 -67876 -160829 -107354 -1977 26324 24886 26566 9200 -19887 109731 211988
6164 211988 100025 71197 41460 187371 305923 213655 173819 103084 53021 24418 151170
6153 151170 209233 48781 -69830 -160572 -273057 -244324 -152196 14211 152885 192974 125136
6142 125136 57903 -19489 -42993 -36033 19445 71816 106362 63183 45097 -11729 12486 5989
$$ packed form
6221G4538R6378j31781p7315N9837k06808K6857N5680n7362m4280P8239l0754
6210a56771j8458P2413N7605O3808J35649L3428p9459J6471K4088j01974r6447
6199d9647O2356j5523k303j49272l8444n3576n4716Q9543L3971j8221P303O7384
6187a21145R4572k0225j17136n1517J10494J02375o811P22l9782o0055J39306
6176C0798K5612j24286r2953N3475J05377K8301j438J680j7366k9087J29618J02257
6164B11988j11963k8828k9737J45911J18552r2268l9836p0735n0063k8603J26752
6153A51170N8063j60452j18611r0742j12485K8733R2128J66407J38674M0089o7838
6142A25136o7233p7392k3504O960N5478N2371L4546m3179j8086n6826K4215o497
$$ plain form
6130 5989 28810 42542 41377 148632 211461 166024 110878 103086 122846 56614 -4402 -130166
6118 -130166 -212242 -157152 -104806 -109428 -17803 -34705 -140187 -137158 18742 6337 -43724 69479
6106 69479 70215 -32655 28066 29610 -53121 -67491 31721 54087 -37326 36846 82508 229446
6094 229446 197857 108439 -51342 -242128 -245709 -296844 -317166 -229459 -242646 -225540 -262831
6083 -262831 -332594 -214198 19729 -128057 -176006 -133300 -148186 -166159 -64610 28484 164369
6072 164369 185222 156195 117030 94818 11153 -26172 18692 -31745 -120122 -188643 -89075 83512
6060 83512 252452 288500 274250 126853 5645 -3950 42876 153963 145150 92304 102346
6049 102346 52087 40501 -1066 25283 96562 150350 83712 54292 153199 3950 -49522
$$ packed form
6130E989K2821J3732j165J07255O2829m5437n5146p792J9760o6232o1016j25764
6118a30166q2076N5090N2346m622R1625j6902j05482L029J55900j2405n0061J13203
6106F9479P36j02870O0721J544q2731j4370R9212K2366r1413P4172M5662J46938
6094B29446l1589q9418j59781j90786l581n1135k0322Q7707j3187J7106l7291
6083b62831o9763J18396K33927j47786m7949M2706j4886j7973J01549R3094J35885
6072A64369K0853k9027l9165k2212q3665l7325M4864n0437q8377o8521R9568J72587
6060H3512J68940L6048j4250j47397j21208r595M6826J11087q813n2846J0042
6049A02346n0259j1586m1567K6349P1279N3788o6638k9420R8907j49249n3472
$$ plain form
6038 -49522 -99005 -9208 -27890 -149227 -31329 86998 107852 -7856 69056 121075 154472
6027 154472 107604 60238 35876 28920 6189 23207 6760 -70608 -92902 8047 15123 49099
6015 49099 99083 57227 -4124 -37214 -118617 -89316 -31673 -181963 -271176 -156441 -64554
6004 -64554 -76486 -141357 -14338 98933 38519 -49209 -219923 -204611 -103724 -28293 -8460
5993 -8460 23172 74337 148669 25495 -82363 -22037 13530 -70236 -146500 -246693 -155496
5982 -155496 -133382 -181203 -189607 -113472 -128265 -141857 -166310 -224280 -162362 -137236 -124811 -142179
5970 -142179 -134998 -171336 -197516 -245329 -249335 -179303 -180026 -22316 -71544 -41224 -67914 -141022
5958 -141022 -155158 -257261 -269588 -123954 -20910 -64771 -121598 -88340 -240084 -109620 -56758
$$ packed form
6038d9522m9483Q9797j8682j21337J17898J18327K0854j15708P6912N2019L3397
6027A54472m6868m7366k4362o956k2731J7018j6447p7368k2294J00949P076L3976
6015D9099M9984m1856o1351l3090q1403K9301N7643j50290q9213J14735R1887
6004f4554j1932o4871J27019J13271o0414q7728j70714J5312J00887P5431J9833
5993h460L1632N1165P4332j23174j07858O0326L5567q3766p6264j00193R1197
5982a55496K2114m7821q404P6135j4793j3592k4453n7970O1918K5126J2425j7368
5970a42179P181l6338k6180m7813m006P0032p23J57710m9228L0320k6690p3108
5958a41022j4136j02103j2327J45634J03044m3861n6827L3258j51744J30464N2862
$$ plain form
5947 -56758 -124817 -109245 -160758 -137711 -86398 -14308 60529 90171 61258 44819 108687 131349
5935 131349 9261 -92554 -119402 -77454 -128940 -113311 -11123 72468 8852 -38729 -134141
5924 -134141 -75331 -74888 -215786 -63718 -93181 -197166 -212195 -245097 -166838 -64059 -759
5913 -759 20906 204039 181852 143210 48949 25504 -23643 -82823 -21852 -89929 -65047 -15039
5901 -15039 29510 22375 -36698 -70946 -65369 -52783 -104776 -114933 -105897 -102434 5444 87216
5889 87216 74994 60127 -57756 -27080 64393 87941 81054 8103 100283 156901 53023 -15749
5877 -15749 58214 123956 126737 171742 109771 95683 99331 102024 94753 -82572 -93311 22011
5865 22011 28847 -128382 -91343 33822 87694 85437 44969 5314 51102 59874 -6014 -9806
$$ packed form
5947e6758o8059J5572n1513K3047N1313P2090P4837K9642k8913j6439O3868K2662
5935A31349j22088j01815k6848M1948n1486J5629J02188Q3591o3616m7581r5412
5924a34141N8810M43j40898J52068k9463j03985j5029l2902P8259J02779O3300
5913g59K1665J83133k2187l8642r4261k3445m9147n9180O0971o8077K4882N0008
5901a5039M4549p135n9073l4248N577J2586n1993j0157R036L463J07878Q1772
5889H7216j2222j4867j17883L0676R1473K3548o887p2951R2180N6618j03878o8772
5877a5749P3963O5742K781M5005o1971j4088L648K693p271j77325j0739J15322
5865B2011O836j57229L7039J25165N3872k257m0468l9655M5788Q772o5888l792
$$ plain form
5853 -9806 72974 64620 -58788 -121945 2699 -31171 12201 73095 -5387 1132 17470 -15694
5841 -15694 -132538 -32513 8530 9803 15585 -80732 -152793 -145078 -81595 -106426 -144800 -129853
5829 -129853 -155072 -47533 -114025 -204540 -43664 733 39657 35086 49990 14782 -29895
5818 -29895 -41533 25056 103009 156981 106567 17505 -113736 -261587 -273038 -44608 120801
5807 120801 68077 53986 51894 51461 42583 75513 -17430 -17338 -55492 58849 80193 108260 135778
5794 135778 187737 160352 152534 80657 49711 -78313 -146388 -126268 -89726 -33055 -9056 26930
5782 26930 -1507 -7369 -168294 -209783 -126077 -52996 -34938 -97847 -70021 -127190 -290125 -239172
5770 -239172 -136883 -108684 -27049 86492 107602 115768 135692 34455 -11246 -40924 -140979
$$ packed form
5853i806Q2780q354j23408o3157J24644l3870M3372O0894p8482O519J6338l3164
5841a5694j16844J00025M1043J273N782r6317p2061P715O3483k4831l8374J4947
5829a29853k5219J07539o6492r0515J60876M4397L8924m571J4904l5208m4677
5818b9895j1638O6589P7953N3972n0414q9062j31241j47851j1451K28430J65409
5807A20801n2724j4091k092m33q878L2930r2943R2l8154J14341K1344K8067K7518
5794A35778N1959k7385p818p1877l0946j28024o8075K0120L6542N6671K3999L5986
5782B6930k8437n862j60925m1489Q3706P3081J8058o2909K7826n7169j62935N0953
5770b39172J02289K8199Q1635J13541K1110Q166J9924j01237m5701k9678j00055
$$ plain form
5759 -140979 -166387 -206398 -57911 -28597 -127402 -55122 121761 73449 -103799 -205080 -213203
5748 -213203 -1938 48685 -1212 58777 78994 75384 68361 24592 -9806 -40341 -79401 -44510
5736 -44510 4282 153245 159023 152921 177612 195044 158607 102582 9059 -160925 -128311 54461
5724 54461 59988 76274 119590 44746 -99831 -208075 -102066 14980 2753 42999 -43683
5713 -43683 75098 117430 64090 84603 -23259 44706 178510 237302 116677 83934 57553
5702 57553 966 128722 246314 241585 152751 94612 51489 4377 59730 50421 63474 71209
5690 71209 24738 30319 62913 50526 52474 -9918 19760 161757 135474 -18449 14792 26118
5678 26118 -65569 -70137 -112607 -253425 -134983 -19247 4435 166037 133545 183084 174613
$$ packed form
5759a40979k5408m0011J48487K9314r8805P2280J76883m8312j77248j01281q123
5748b13203K11265N0623m9897N9989K0217l610p023m3769l4398l0535l9060L4891
5736d4510M8792J48963N778o102K4691J7432l6437n6025r3523j69984L2614J82772
5724E4461N527J6286M3316p4844j44577j08244J06009J17046j2227M0246q6682
5713d3683J18781M2332n3340K0513j07862O7965J33804N8792j20625l2743k6381
5702E7553n6587J27756J17592m729q8834n8139m3123m7112N5353r309J3053P735
5690G1209m6471N581L2594j2387J948o2392K9678J41997k6283j53923L3241J1326
5678B6118r1687m568m2470j40818J18442J15736K3682J61602l2492M9539q471
$$ plain form
5667 174613 128861 108261 89113 -580 110738 184195 72948 99452 93199 10678 -4174
5656 -4174 -116566 -175872 -236506 -192864 -65672 -40173 -43781 37721 107649 166515 162861 80738
5644 80738 -26083 -16713 24660 -34096 -40448 45694 41156 -85769 -132643 -89327 -120146 -116635
5632 -116635 69252 44907 61107 36782 47955 59943 42199 82048 64529 -16840 -4763
5621 -4763 -129897 -111195 -85720 -82454 -92214 63819 66857 11716 112957 232919 200261 97214
5609 97214 126498 72987 -42044 -23919 128377 185174 122692 40174 -17654 -44939 -17239
5598 -17239 -89612 -156121 -226162 -116933 -36176 -45130 -194879 -182584 12182 -106811 -70170
5587 -70170 42619 -29722 69057 102645 129536 52142 -39750 -157526 -101767 -93547 -24670 13400
$$ packed form
5667A74613m5752k0600j9148q9693J11318P3457j11247K6504o253q2521j4852
5656d174j12392n9306o0634M3642J27192K5499l608Q1502O9928N8866l654q2123
5644H0738j06821R370M1373n8756o352Q6142m538j26925m6874M3316l0819L511
5632a16635J85887k4345J6200k4325J1173J1988j7744L9849j7519q1369J2077
5621d763j25134J8702K5475L266r760J56033L038n5141J01241J19962l2658j03047
5609I7214K9284n3511j15031J8125J52296N6797o2482q2518n7828k7285K7700
5598a7239p2373o6509p0041J09229Q0757q954j49749J2295J94766j18993L6641
5587g0170J12789p2341R8779L3588K6891p7394r1892j17776N5759Q220O8877L8070
$$ plain form
5575 13400 59374 11548 38725 32247 26035 35111 -45200 77107 97222 104851 -49780 -113864
5563 -113864 -234253 -222069 -55292 89298 23425 -27714 -59075 -97489 -29658 -48252 -52205
5552 -52205 86551 202219 130617 88969 -9787 43942 191068 185032 87973 135242 211356
5541 211356 272387 220191 73155 -45538 -153601 -61742 83221 278904 296611 228643 107133
5530 107133 46660 40231 140310 35571 72726 126577 -40208 -122226 -81440 -47257 -106285
5519 -106285 -30835 33963 -444 25086 -807 -60299 -60578 -45528 -77304 27759 123862 -8251
5507 -8251 -75500 -77016 -75937 -173941 -141886 -107854 -23895 -121263 -97643 -114731 36872 66020
5495 66020 72403 133262 199123 118673 -4497 10664 5965 46353 97417 142498 155853 48014
$$ packed form
5575A3400M5974m7826K7177o478o212R076q0311J22307K0115P629j54631o4084
5563a13864j20389J2184J66777J44590o5873n1139l1361l8414O7831j8594l953
5552e2205J38756J15668p1602m1648r8756N3729J47126o036r7059M7269P6114
5541B11356O1031n2196j47036j18693j08063R1859J44963J95683J7707o7968j21510
5530A07133o0473o429J00079j04739L7155N3851j66785q2018M0786L4183n9028
5519a06285P5450O4798l4407K5530k5893n9492k79J5050l1776J05063R6103j32113
5507h251o7249j516J079r8004L2055L4032Q3959r7368K3620j7088J51603K9148
5495F6020O383O0859O5861q0450j23170J5161m699M0388N1064M5081J3355j07839
$$ plain form
5483 48014 24163 1893 -51191 -48883 -16642 83576 156152 110662 -55374 56048 24132
5472 24132 -18150 -32552 -28967 -17419 95382 143544 34935 -120821 -172770 -93333 -96181 -95860
5460 -95860 -142851 -232949 -302140 -219395 -151663 -197582 -165266 -124773 -155567 19396 64907 -58583
5448 -58583 -43081 -52338 -20628 128969 299725 340669 277780 80248 36694 245077 331368
5437 331368 282668 255140 236803 111562 -64284 -132425 -3876 106655 259648 261550 204117
5426 204117 241725 243855 237902 144389 157829 174223 246918 140003 27002 87622 216369
5415 216369 181032 155481 255067 147871 35295 56988 113064 120428 62546 -3045 75339
5404 75339 150700 145363 186962 97424 148277 276601 351126 394116 325839 250390 309902 87972
$$ packed form
5483D8014k3851k2270n3084K308L2241J00218P2576m5490j66036J11422l1916
5472B4132m2282j4402L585J1548J12801M8162j08609j55756n1949P9437k848L21
5460i5860m6991r0098o9191Q2745O7732m5919L2316M0493l0794J74963M5511j23490
5448e8583J5502r257L1710J49597J70756M0944o2889j97532m3554K08383Q6291
5437C31368m8700k7528j8337j25241j75846o8141J28549J10531J52993J902n7433
5426B04117L7608K130n953r3513J3440J6394P2695j06915j13001O0620J28747
5415B16369l5337k5551R9586j07196j12576K1693N6076P364n7882o5591P8384
5404G5339P5361n337M1599q9538N0853J28324P4525M2990o8277p5449N9512k21930
$$ plain form
5392 87972 17461 133001 137345 29451 -91472 -134412 -77615 -8569 -67340 -134513 -275664
5381 -275664 -289226 -173336 12452 124764 75347 -13537 65902 117509 233344 290480 90692
5370 90692 19574 -6922 -78865 -219844 -256687 -91015 8359 70069 21691 12013 75179 196610
5358 196610 86246 13739 67337 -11903 132450 289769 294683 174676 130257 111020 75215
5347 75215 99230 179243 185682 133303 170896 77170 80393 37194 -42227 -39866 101918 233434
5335 233434 188515 134523 37013 31024 122136 121799 131557 85841 22987 63044 94447 75460
5323 75460 47158 16161 -10897 -80495 -74677 25901 139622 67345 -28135 -110227 -78814 33287
5311 33287 146817 138125 60612 -63647 -20937 -74992 -9306 -84209 -87408 -65716 77118 123845
$$ packed form
5392H7972p0511J15540M344j07894j20923m2940N6797O9046n8771o7173j41151
5381b75664j3562J15890J85788J12312m9417q8884P9439N1607J15835N7136j99788
5370I0692p1118k6496p1943j40979l6843J65672R9374O1710m8378r678O3166J21431
5358A96610j10364p2507N3598p9240J44353J57319M914j20007m4419j9237l5805
5347G5215K4015Q0013O439n2379L7593r3726L223m3199p9421K361J41784J31516
5335B33434m4919n3992r7510n989R1112l37R758m5716o2854M0057L1403j8987
5323G5460k8302l0997k7058o9598N818J00578J13721p2277r5480q2092L1413J12101
5311C3287J13530q692p7513j24259M2710n4055O5686p4903l199K1692J42834M6727
$$ plain form
5299 123845 -78130 -192392 -189925 -230875 -65942 129540 184992 49322 -73816 -75044 -71003
5288 -71003 -26830 -59521 -195442 -84685 82705 260273 187251 47179 84027 13888 -129104
5277 -129104 -283707 -240636 -275666 -164549 -102739 -146769 -166147 -103153 -111391 -139812 -39049
5266 -39049 54708 171810 279739 230446 206946 159199 195624 193666 125723 -45523 -180189
5255 -180189 -195891 -87859 130316 163240 59898 -10384 -8115 -132547 -274713 -61810 178662
5244 178662 239437 139721 -78290 -218033 -237857 -168228 -190077 -109204 -16582 -36968 -99871
5233 -99871 -102575 -84151 27492 55753 -8366 110495 188025 120945 9411 -25826 67515
$$ packed form
5299A23845k01975j14262K467m0950J64933J95482N5452j35670j23138j228M041
5288g1003M4173l2691j35921J10757J67390J77568p3022j40072L6848p0139j42992
5277a29104j54603M3071l5030J11117O1810m4030j9378O2994q238k8421J00763
5266c9049R3757J17102J07929m9293k3500m7747L6425j958o7943j71246j34666
5255a80189j5702J08032K18175L2924j03342p0282K269j24432j42166K12903K40472
5244A78662O0775r9716k18011j39743j9824O9629k1849Q0873R2622k0386o2903
5233i9871k704J8424J11643K8261o4119J18861P7530o7080j11534l5237R3341
$$ [...]
##END NTUPLES=NMR SPECTRUM
##END=
