##TITLE=Analysis number 321618
Compound Code cc 46101
Book Reference 494/34
Project Code adrs
Chemist Name craigr
##JCAMPDX= 6.0         $$ Bruker NMR JCAMP-DX V2.0
##DATA TYPE= NMR SPECTRUM
##DATA CLASS= NTUPLES
##ORIGIN= Bruker BioSpin GmbH
##OWNER= nmr
$$ XWIN-NMR		Version 3.5
$$ Fri Aug 18 09:38:24 2006 GMT Daylight Time (UT+1h)  MAYBRIDGE\nmr@NMR_250MHZ
##.OBSERVE FREQUENCY= 250.131544655141
##.OBSERVE NUCLEUS= ^1H
##.ACQUISITION MODE= SIMULTANEOUS (DQD)
##.ACQUISITION SCHEME= undefined
##.AVERAGES= 16
##.DIGITISER RES= 18
##SPECTROMETER/DATA SYSTEM= dpx250
##.PULSE SEQUENCE= zg30
##.SOLVENT NAME= DMSO
##.SHIFT REFERENCE= (INTERNAL, DMSO, 0, 16.522)
##AUDIT TRAIL= $$ (NUMBER, WHEN, WHO, WHERE, WHAT)
$$ ##TITLE= Audit trail, XWIN-NMR		Version 3.5
$$ ##JCAMPDX= 5.01
$$ ##ORIGIN= Bruker BioSpin GmbH
$$ ##OWNER= nmr
$$ C:\u/data/dgb/nmr/ADRS/1180/pdata/1/auditp.txt
$$ ##AUDIT TRAIL=  $$ (NUMBER, WHEN, WHO, WHERE, WHAT)
(   1,<2006-08-18 09:38:02.33 +100>,<MAYBRIDGE\nmr>,<NMR_250MHZ>,
      <created by zg, POWCHK disabled, PULCHK disabled
       configuration hash MD5:
       E2 DF 36 D8 04 B2 41 60 5A D7 A3 38 5A 4B D0 FE
       data hash MD5: 64K
       6F A0 C7 69 27 84 82 5F 4F 40 53 4F D3 87 28 A3>)
(   2,<2006-08-18 09:38:15.40 +100>,<MAYBRIDGE\nmr>,<NMR_250MHZ>,
      <Start of raw data processing
       ef LB = 0.3 FT_mod = 6 PKNL = 1 SI = 32K 
       data hash MD5: 32K
       7B 29 6E 36 3D A8 95 A5 30 DB 98 7A FD 12 53 24>)
(   3,<2006-08-18 09:38:16.95 +100>,<MAYBRIDGE\nmr>,<NMR_250MHZ>,
      <apk 
       data hash MD5: 32K
       6C AA 18 CA 78 98 7D 52 97 15 9D 7A 35 6E 88 83>)
(   4,<2006-08-18 09:38:17.83 +100>,<MAYBRIDGE\nmr>,<NMR_250MHZ>,
      <abs ABSG = 5 
       data hash MD5: 32K
       78 6B 53 2C B5 13 69 B1 2E BA E2 9E 15 4A 83 EF>)
$$ ##END=
$$ 
$$ hash MD5
$$ 06 5D C5 A3 09 7B 38 83 82 1D 92 E3 6C FF 5E 97
##$RELAX= 
##$RELAX= 
##$RELAX= 
##$RELAX= 
##$RELAX= 
##$RELAX= 
##$RELAX= 
$$ Bruker specific parameters
$$ --------------------------
##$DU= <C:\u>
##$EXPNO= 1180
##$NAME= <ADRS>
##$PROCNO= 1
##$TYPE= <nmr>
##$USER= <dgb>
##$AMP= (0..31)
100 100 100 100 100 100 100 100 100 100 100 100 100 100 100 100 100 100 
100 100 100 100 100 100 100 100 100 100 100 100 100 100 
##$AQSEQ= 0
##$AQ_mod= 3
##$AUNM= <au_zg>
##$AUTOPOS= <7 >
##$BF1= 250.13
##$BF2= 250.13
##$BF3= 250.13
##$BF4= 250.13
##$BF5= 500.13
##$BF6= 500.13
##$BF7= 500.13
##$BF8= 500.13
##$BYTORDA= 1
##$CFDGTYP= 0
##$CFRGTYP= 5
##$CHEMSTR= <none>
##$CNST= (0..31)
1 1 145 1 1 1 1 1 1 1 1 1 1 1 1 1 1 1 1 1 1 1 1 1 1 1 1 1 1 1 1 1 
##$CPDPRG= <>
##$CPDPRG1= <>
##$CPDPRG2= <>
##$CPDPRG3= <>
##$CPDPRG4= <mlev>
##$CPDPRG5= <mlev>
##$CPDPRG6= <mlev>
##$CPDPRG7= <mlev>
##$CPDPRG8= <mlev>
##$CPDPRGB= <>
##$CPDPRGT= <>
##$D= (0..31)
0 1 0 0 0 0 0 0 0 0.06 0 0 0 0 0 0 0.0002 0 0 0 0 0 0 0 0 0 0 0 0 0 0 
0 
##$DATE= 1155890281
##$DBL= (0..7)
120 120 120 120 120 120 120 120 
##$DBP= (0..7)
150 150 150 150 150 150 150 150 
##$DBP07= 0
##$DBPNAM0= <>
##$DBPNAM1= <>
$$ [...]
##$SUBNAM7= <"">
##$SUBNAM8= <"">
##$SUBNAM9= <"">
##$SW= 20.6930455092707
##$SWIBOX= (0..15)
0 0 3 0 0 0 0 0 0 0 0 0 0 0 0 0 
##$SW_h= 5175.983436853
##$TD= 65536
##$TD0= 1
##$TE= 296.16
##$TE2= 300
##$TE3= 300
##$TEG= 300
##$TL= (0..7)
0 120 120 120 120 120 120 120 
##$TP= (0..7)
150 150 150 150 150 150 150 150 
##$TP07= 0
##$TPNAME0= <>
##$TPNAME1= <>
##$TPNAME2= <>
##$TPNAME3= <>
##$TPNAME4= <>
##$TPNAME5= <>
##$TPNAME6= <>
##$TPNAME7= <>
##$TPOAL= (0..7)
0.5 0.5 0.5 0.5 0.5 0.5 0.5 0.5 
##$TPOFFS= (0..7)
0 0 0 0 0 0 0 0 
##$TUNHIN= 0
##$TUNHOUT= 0
##$TUNXOUT= 0
##$USERA1= <user>
##$USERA2= <user>
##$USERA3= <user>
##$USERA4= <user>
##$USERA5= <user>
##$V9= 5
##$VALIST= <valist>
##$VCLIST= <CCCCCCCCCCCCCCC>
##$VD= 0
##$VDLIST= <DDDDDDDDDDDDDDD>
##$VPLIST= <PPPPPPPPPPPPPPP>
##$VTLIST= <TTTTTTTTTTTTTTT>
##$WBST= 1024
##$WBSW= 4
##$XGAIN= (0..3)
0 0 0 0 
##$XL= 0
##$YL= 0
##$YMAX_a= 211746
##$YMIN_a= -396050
##$ZGOPTNS= <>
##$ZL1= 120
##$ZL2= 120
##$ZL3= 120
##$ZL4= 120
##$ABSF1= 16.522
##$ABSF2= -4.171173
##$ABSG= 5
##$ABSL= 3
##$ALPHA= 0
##$AQORDER= 0
##$ASSFAC= 0
##$ASSFACI= 0
##$ASSFACX= 0
##$ASSWID= 0
##$AUNMP= <proc_1d>
##$AZFE= 0.1
##$AZFW= 0.1
##$BCFW= 0
##$BC_mod= 0
##$BYTORDP= 0
##$COROFFS= 0
##$CY= 12.5
##$DATMOD= 1
##$DC= 0
##$DFILT= <>
##$DTYPP= 0
##$F1P= 14.0000005364418
##$F2P= -0.99999901652339
##$FCOR= 0.5
##$FTSIZE= 32768
##$FT_mod= 6
##$GAMMA= 0
##$GB= 0
##$INTBC= 1
##$INTSCL= 1
##$ISEN= 128
##$LB= 0.3
##$LEV0= 0
##$LPBIN= 0
##$MAXI= 10000
##$MC2= 0
##$MEAN= 0
##$ME_mod= 0
##$MI= 0
##$NCOEF= 0
##$NC_proc= -5
##$NLEV= 6
##$NOISF1= 0
##$NOISF2= 0
##$NSP= 0
##$NTH_PI= 0
##$NZP= 0
##$OFFSET= 16.522
##$PC= 1
##$PHC0= 145.3658
##$PHC1= 3.256496
##$PH_mod= 1
##$PKNL= yes
##$PPARMOD= 0
##$PSCAL= 4
##$PSIGN= 0
##$REVERSE= no
##$SF= 250.13
##$SI= 32768
##$SIGF1= 0
##$SIGF2= 0
##$SINO= 400
##$SIOLD= 32768
##$SREGLST= <1H.DMSO>
##$SSB= 0
##$STSI= 32768
##$STSR= 0
##$SW_p= 5175.98343685301
##$SYMM= 0
##$S_DEV= 0
##$TDeff= 65536
##$TDoff= 0
##$TI= <Analysis number 999999
Compound Code 99
Book Reference 9
Project Code 9>
##$TILT= no
##$TM1= 0
##$TM2= 0
##$TOPLEV= 0
##$USERP1= <user>
##$USERP2= <user>
##$USERP3= <user>
##$USERP4= <user>
##$USERP5= <user>
##$WDW= 1
##$XDIM= 32768
##$YMAX_p= 304780412
##$YMIN_p= -894839
$$ End of Bruker specific parameters
$$ ---------------------------------
##NTUPLES= NMR SPECTRUM
##VAR_NAME=  FREQUENCY,     SPECTRUM/REAL,   SPECTRUM/IMAG
##SYMBOL=    X,             R,               I
##VAR_TYPE=  INDEPENDENT,   DEPENDENT,       DEPENDENT
##VAR_FORM=  AFFN,          ASDF,            ASDF
##VAR_DIM=   32768,         32768,           32768
##UNITS=     HZ,            ARBITRARY UNITS, ARBITRARY UNITS
##FACTOR=    0.157963299565203, 1,           1
##FIRST=     4132.6476996994, 0,             0
##LAST=      -1043.33573715361, 0,           0
##MIN=       -1043.33573715361, -894839,     0
##MAX=       4132.6476996994, 304780412,     0
$$ Real data points
##PAGE= N=1
##DATA TABLE= (X++(R..R)), XYDATA
$$ [...]
17021B293533N3407J648m1285j05170M2002l6252j17362l839j81004k82208j33857
17010A489613J11442m5416j09698n4815N4805M38389j08889k86878k30609o9218
17000A188726j43313L09402J75726K65144m128j15454j67218j53875k2142M132
16990A337000r9896k75136l814k2351N1928K16018j23185k8172K04933M8006o3879
16979A241452j53031j07760k31458R4666R5770l240j58025j53476J6405N3591
16969F94894M9746r8585P6224K5685j55701k5627j1571R4590m7299N8580p2875
16958E88061L0071j8619n2279K45729L9832o2924J01433J24629k05141k35332
16948E55460k13301k58244j52961J92168L34699M7282K041j49805k69602K8249
$$ plain form
17021 2293533 2346940 2348588 2307303 2202133 2244135 2207883 2090521 2086682 1905678 1623470 1489613
17010 1489613 1601055 1555639 1445941 1391126 1445931 1884320 1775431 1488553 1257944 1188726
17000 1188726 1045413 1354815 1530541 1795685 1791557 1676103 1508885 1355010 1332868 1337000
16990 1337000 1237104 961968 958154 935803 987731 1203749 1080564 1052392 1257325 1305331 1241452
16979 1241452 1088421 980661 749203 843869 939639 936399 778374 624898 641303 694894
16969 694894 744640 646055 722279 747964 592263 566636 555065 649655 602356 660936 588061
16958 588061 618132 599513 547234 792963 832795 769871 871304 995933 790792 555460
16948 555460 342159 83915 -69046 123122 457821 505103 507144 357339 87737 115986
16938A15986J39553J48280k0995K9645K5513k7970j8110J55347K34739k4505q8726
16927F68757j71529k27379q7411O9848j4302K3557o1266O2697J86949Q0308P610
16916E37839k14172J65662P3952k99600R8768J42735l00534N134j89048m4278
16906b3542j7083L62434J56604k72661k10645N4890K1420j18712j32320R4153
16896h5462r0477R4348L06430l4521j28163p1518j7718N9840m5110q0323J90471
16885I7797L9565j99414J46207j21221k5773K48731P0119j84009j16990O5251
16875B0263J09147L10498m9295l47912p569K20806J55313J35581j26902j94574
16865B25356j80897p9710J17879q5784m5842k9845m140O9589k32047o0706J28555
$$ plain form
16938 115986 255539 403819 382824 412469 437982 410012 391902 547249 781988 757483 668757
16927 668757 497228 269849 182438 252286 237984 261541 200275 262972 449921 530229 537839
16916 537839 323667 489329 563281 263681 362449 505184 204650 209784 20736 -23542
16906 -23542 -40625 321809 478413 205752 -4893 49997 71417 -47295 -179615 -85462
16896 -85462 -175939 -81591 224839 190318 62155 -9363 -27081 32759 -12351 -92674 97797
16885 97797 137362 -62052 84155 -37066 -62839 185892 256011 72002 -44988 20263
16875 20263 129410 439908 390613 42701 35132 255938 411251 546832 419930 225356
16865 225356 44459 -35251 82628 -3156 -48998 -78843 -82983 -13394 -245441 -306147 -177592
16854a77592J61679J28641J42409m6954j58997M9541j05598j76901J97374K22924
16844B36526J80303J15523J5313M7626K1986K8572k16075k87859n9274K94187
16834C76828J36491j99495j99136j37765J78533J4749j43375j55241k8872J08825
16824d8458p0874J74426R7221j42443n0169J16581K51948o931j29626j75837K84984
16813C00822M4244k16219q2394J7532k18599n3379J19890j0579j10395k08971
16803d18048K3340K67952J92095j12032k75531R711l353j10315J04850K81598
16793c9733l0657J45093l8919r0570q500K23381K13683l0397k35870k49342j30604
16782b72435R7800J06198O7348L45247J7527m04776k37125J59197k0734r7092
$$ plain form
16854 -177592 -15913 112728 255137 208183 49186 98727 -6871 -183772 13602 236526
16844 236526 416829 532352 547665 595291 617277 645849 429774 141915 82641 376828
16834 376828 513319 313824 114688 -23077 155456 170205 26830 -128411 -157283 -48458
16824 -48458 -119332 55094 152315 9872 -40297 76284 328232 321301 191675 15838 300822
16813 300822 345066 128847 46453 63985 -154614 -207993 -88103 -98682 -209077 -418048
16803 -418048 -394708 -126756 65339 -46693 -322224 -312513 -315866 -426181 -321331 -39733
16793 -39733 -70390 74703 35784 -54786 -63286 160095 373778 343381 107511 -141831 -272435
16782 -272435 -174635 -68437 -1089 344158 361685 -43091 -280216 -121019 -141753 -238845
16772b38845J33211J15616o5684J49119K13893m1446l78660j29548P5715K3686
16762a42943k01412m1061j37487M2139K71862K76046P3135p453J14763o1055p2056
16751A14478L0952p9766N8095J16305p5786n6440m2346m4962K73445J60540k05775
16740B48740o0822Q8709j22360j11496j109M9722J36879O2598j45721j74095j0928
16729c9883o9088o1162l382k6821P4321M6490K8363o3843k6510j35551J3701K39193
16717b4172L39838K8583k22030l2150J7343j05001l8067K3055j51841R689O9698
16706h5055J15003K2109m5923j45511P5795k31251j09716L32367K61045J58985
16696C47848K4319J69369j47568j16747n0381j57710j68618J07942J8791k41483
$$ plain form
16772 -238845 -105634 9982 -55702 93417 307310 265864 -112796 -242344 -166629 -142943
16762 -142943 -344355 -385416 -522903 -480764 -208902 67144 140279 132826 247589 186534 114478
16751 114478 145430 65664 123759 240064 164278 107838 65492 20530 293975 454515 248740
16740 248740 187918 276627 154267 42771 41662 91384 228263 290861 145140 -28955 -39883
16729 -39883 -108971 -170133 -173515 -200336 -126015 -79525 -51162 -115005 -141515 -277066 -263365 -24172
16717 -24172 315666 344249 122219 90069 107412 2411 -35656 -12601 -164442 -154753 -85055
16706 -85055 29948 52057 6134 -139377 -63582 -294833 -404549 -72182 188863 347848
16696 347848 372167 541536 393968 277221 226840 69130 -99488 8454 27245 -214238
16686b14238J51388K04163o2448j25301l3744j06038R481Q226r9806K0840K07797
16675c9680j09369k5015n046j5383J09314J1879m4000j24270J52810J21199L4501
16664F6940j50212N5178m1167J07485j15851j87467q7318j08366J12482J7875
16654c30421m4246J4441N4337K93403j78885j5418K07896K54202j13548n8403
16644H3358l3698j21157O7872m6454J09587j18089k0195R9494j60311L2597L12892
16633B05896K2013L2945J8494k15666k30641j01996M7067K2145R5582J78968L2211
16622A07018o4571k705k8651l7770k3617j93166j19962L7119R9821K97839J92076
16611B63431J60636K6960k90407k51715r431M07938J674k25486j72937M6191K2247
$$ plain form
16686 -214238 -62850 141313 78865 -46436 -80180 -186218 -176737 -168511 -268317 -247477 -39680
16675 -39680 -149049 -174064 -179110 -194493 -85179 -73300 -117300 -241570 -88760 32439 66940
16664 66940 -83272 -28094 -69261 38224 -77627 -265094 -352412 -460778 -348296 -330421
16654 -330421 -374667 -360226 -305889 -12486 -191371 -206789 1107 255309 141761 83358
16644 83358 49660 -71497 -3625 -50079 59508 -58581 -78776 20718 -139593 -106996 205896
16633 205896 227909 260854 279348 63682 -166959 -268955 -221888 -199743 -104161 74807 107018
16622 107018 42447 39742 11091 -26679 -50296 -243462 -363424 -326305 -226484 71355 263431
16611 263431 424067 451027 160620 -91095 -100526 307412 309086 83600 -89337 -43146 -20899
16600b0899o0241n7109J699L5374L68714p588K2716J26786j40107k12521l22383
16589b65559j86257J33013J78742K71739J83481n5718K63302J31184o1870M3607
16579F35664k0333j85251j75096O6598Q0275j75547j94752k53881K23217J5772
16569A6666k04338J0445J51913J35497K1240j64026N4001j6948J12841L37143
16559D54434M0724q3442J82785J39925L3387o1780j46707m1574j65416j2648n1958
16548B87730j24419k0765J41251q135j8955N9852o8254Q5598J7104K54517l5147
16537E70377L2007J32262j28449k82564k70096j70649J70114O3213P1158L25996
16527E13369J64711r9052l46187n0905J26947L8851j10562l6256q0030r1149j47543
$$ plain form
16600 -20899 -81140 -138249 -136550 -101176 267538 259950 282666 409452 269345 56824 -265559
16589 -265559 -451816 -318803 -140061 131678 315159 259441 522743 653927 592057 635664
16579 635664 615331 430080 254984 321582 401857 226310 31558 -222323 894 16666
16569 16666 -187672 -177227 -25314 110183 131423 -32603 21398 4450 117291 454434
16559 454434 495158 411716 594501 734426 767813 706033 559326 517752 352336 339688 287730
16548 287730 163311 142546 283797 275662 256707 316559 248305 333903 351007 605524 570377
16537 570377 602384 734646 606197 323633 53537 -117112 53002 116215 187373 513369
16527 513369 678080 579028 232841 181936 308883 347734 237172 200916 120886 29737 -117806
16516a17806n7609o2771L8256K20968R9164k9695k8130O954J00123j96048j68698
16505a95292K05099k45844k23631K48681L15658K14677J48612k39192l16452n1156
16495a38840J55944K15252P4341j04351k34032j89545m9060J90746j09733Q3516
16485a05762Q6972k05790J32172L26849k7614k76434M8032J36836M5574o3645
16475I7190p6211j52300j60895K4539K03208J61378m2880j76981L60013J53012
16465C90073L6591j70628j22298q0108J18358o0318k47266l46612J33674K20074
16455a28460l8421M7140N1782Q0335N8738j17335m910J16802q4282j52084J45417
16444b5278L18102r365j16259R6930p7859K3123k9867j48787J7166K19357M4103
$$ plain form
16516 -117806 -175415 -238186 -199930 21038 120202 90507 62377 69331 169454 -26594 -195292
16505 -195292 9807 -236037 -459668 -210987 104671 319348 467960 228768 -87684 -138840
16495 -138840 17104 232356 306697 202346 -31686 -221231 -270291 -79545 -189278 -105762
16485 -105762 -18790 -224580 -92408 234441 206827 -69607 -21575 115261 160835 97190
16475 97190 20979 -131321 -292216 -267677 -64469 96909 54029 -122952 237061 390073
16465 390073 426664 256036 133738 53630 171988 111670 -135596 -482208 -348534 -128460
16455 -128460 -166881 -119741 -67959 12376 71114 -46221 -51131 65671 -18611 -170695 -25278
16444 -25278 292824 283459 167200 264130 186271 209394 179527 30740 47906 267263 311366
16433C11366k85173M529p3132o7911j05818o7625n9053l8846Q6742n8614M7887
16422c05648J37128J17196k14754m3287l0351r7052j87974R0799J47168L4397
16412c52378K64414J96776j67242p6150l244p6348K735k154J96587j19362N3776
16401h2590J57830m0120j39430j42782j81950M5310J63393O0120J74064j26929
16391a13084l7645J77983J4990J04901j05286O9321L3455J34299K4751p5059j61094
16380F7532j1543J82238P3367j24452J66646N7244q5017j96836L1674m2529o1438
16369E6886n0299l63657j51634L41656J38890K1847J35827K938k3575j28912k7971
16358d8004K6780n5967M1458J43028M7132K9271l8830j05782q4914k3918m3282
$$ plain form
16433 311366 26193 30722 -42410 -110321 -216139 -283764 -342817 -381663 -294921 -353535 -305648
16422 -305648 -168520 -51324 -266078 -309365 -339716 -436768 -624742 -533943 -386775 -352378
16412 -352378 -87964 108812 -58430 -134580 -137824 -214172 -211437 -213591 -17004 -136366 -82590
16401 -82590 75240 35120 -104310 -247092 -429042 -383732 -220339 -160219 13845 -113084
16391 -113084 -150729 27254 42244 147145 41859 111180 144635 278934 303685 228626 67532
16380 67532 55989 238227 311594 187142 353788 411032 326015 129179 160853 118324 56886
16369 56886 6587 -357070 -508704 -167048 -28158 -6311 129516 132454 108879 -20033 -48004
16358 -48004 -21224 -77191 -35733 107295 154427 183698 144868 39086 -45828 -69746 -113028
16347a13028k91294k20777L7608K35295L90689j28886o1659L32761O9960j28199
16337A22470l71037J3983N8510J72715o8965o0214J93925M1255l58145j02479
16327c57982K7122P3927K47238k12781P939J27855k49235l57491M9850K10133
16317d33425K81651K13233o2605J87535R8977k332q5135j47517j19291J23855
16307E4946q9336l95513L7051J32720L9701L36727O1901l1115K33096m592j54466
16296B21120j75625J51157K35804Q1974k21877j32426n625k01944j13252K3194
16286a37500k8694m6573j69582L6168J59360K31191P0101k35228r6937l6837K04102
16275e0429J08047R0502j81665k20204k53564r3056l0350m5714o4839J52486L54021
$$ plain form
16347 -113028 -404322 -625099 -587491 -352196 38493 -90393 -152052 180709 250669 122470
16337 122470 -248567 -234584 -176074 -3359 -72324 -132538 61387 102642 -255503 -357982
16327 -357982 -330860 -256933 -9695 -222476 -214537 -86682 -335917 -693408 -643558 -433425
16317 -433425 -151774 61459 -1146 186389 285366 283034 197899 50382 -68909 54946
16307 54946 -34390 -429903 -392852 -260132 -220431 116296 178197 147082 380178 375586 221120
16296 221120 45495 196652 432456 514430 292553 160127 154502 -47442 -160694 -137500
16286 -137500 -166194 -212767 -382349 -346181 -186821 44370 114471 -120757 -217694 -254531 -50429
16275 -50429 57618 148120 -33545 -253749 -507313 -600369 -630719 -676433 -741272 -588786 -234765
16264b34765J91464J35401j26399r3298K62002r1262J9842Q2543j08492j20016
16254h2980j64962k04288J63947J66898j38598J11479L8003j41905j14696J04306
16244b62796L48615J52235l43832l29496J38251J95181P7028k87064J3549J11757
16234a86572J59611j79771j11769K29739M442L872Q5347r9411j03078p4026q0009
16223c51625k6035J65784n1247p3800J84334J08742L9931o9667J53794l8945j50190
16212a08924j12948j50663O4910J14161O5121J35449J62505o5387q1173K6651
16202D9702J14625J29603P1721J08161k09800j29486o2121n5720J63319p0459
16192A09545l3758J36723m1250j33791k9597o8829R2870k05616k97109m4298K8885
$$ plain form
16264 -234765 -43301 92100 -34299 -127597 134405 43143 62985 145528 37036 -82980
16254 -82980 -247942 -452230 -288283 -121385 -259983 -148504 -110501 -252406 -367102 -262796
16244 -262796 85819 238054 -105778 -435274 -297023 -101842 -24814 -311878 -298329 -186572
16234 -186572 -26961 -206732 -318501 -88762 -84320 -80448 4899 -94512 -197590 -271616 -351625
16223 -351625 -377660 -211876 -263123 -336923 -152589 -43847 -3916 -73583 80211 41266 -108924
16212 -108924 -221872 -372535 -307625 -193464 -128343 7106 169611 104224 23051 49702
16202 49702 164327 293930 365651 473812 264012 134526 72405 16685 180004 109545
16192 109545 75787 212510 171260 37469 7872 -60957 31913 -173703 -470812 -515110 -486225
16181d86225J58838K47056L19683J00167j54313r0052j64385l30265j95354J06104
16171d88746K0625j41655M5610J54094K82859K58728J68164r1870k93894j43700
16161b29785L9455O9659J5356J29385p6686K09574j77394j61833J82852R8216
16151I8799j25899k11515K9186M7423R9836j2161J740R9915p2621j47727Q2080
16140a10944J34214j14202j09734j2227P6474K9054q3840l814j47648l2999L5830
16129c39836o6174J02861K78275J04702j5439J10087j20480j34242M6285K50494
16119B16533m4548j34364L2478N1315j02803j79158m9872M3356K53917O9448R4882
16108B51184m3183o2528R7115p0765k47123j79897j50407R2686L24905R6403m3434
$$ plain form
16181 -486225 -327387 -80331 239352 339519 185206 95154 -69231 -399496 -594850 -488746
16171 -488746 -468121 -609776 -564166 -410072 -127213 131515 299679 207809 -86085 -229785
16161 -229785 -190330 -120671 -105315 24070 -52616 156958 -20436 -182269 583 98799
16151 98799 -27100 -238615 -209429 -162006 -62170 -74331 -72591 27324 -45297 -193024 -110944
16140 -110944 23270 -90932 -200666 -212893 -136419 -107365 -191205 -195019 -342667 -375666 -339836
16129 -339836 -406010 -303149 -24874 79828 64389 174476 53996 -80246 -33961 216533
16119 216533 171985 37621 70099 121414 18611 -160547 -210419 -167063 86854 156302 251184
16108 251184 208001 145473 242588 171823 -75300 -255197 -405604 -312918 11987 108390 64956
16097F4956k9055N1993m5510q0620M2241J33852J10437l6890j66132N9971j79211
16086g3968j56656M5141J40202J74093q0714K117o345N3417J90242P040j9980
16075B74589j20043L464k9933j94832j20077j06838Q104R0207J39023j01224L4035
16064a23525p675K3715p1607J81360J52076R6273j7988j01134J40920L12k76129
16053c402j49194o0173j15958l0410j7059J60553J80313j60888k1374J48343k62237
16042c31486K35817J11987O597J35877J37544j19450l38652l4472j13382R562
16032c00058J99168K24303O0921k38612j9793R0138k34234q0077M4558o4714L4495
16021b83905K25171K00203O2266O5030j06373j43304J45531O9753O1509k24230
$$ plain form
16097 64956 35901 87894 42384 -38236 4005 137857 248294 211404 45272 105243 -73968
16086 -73968 -230624 -185483 -45281 128812 48098 50215 43870 97287 287529 294569 274589
16075 274589 154546 158010 128077 -66755 -186832 -293670 -285566 -195359 -56336 -157560 -123525
16064 -123525 -131200 -107485 -179092 2268 154344 250617 232629 131495 272415 272727 -3402
16053 -3402 -152596 -212769 -328727 -359137 -376196 -215643 -35330 -196218 -217592 -69249 -331486
16042 -331486 -95669 16318 22915 158792 296336 176886 -161766 -196238 -309620 -300058
16032 -300058 -100890 123413 184334 -54278 -74071 16067 -218167 -298244 -253686 -318400 -283905
16021 -283905 -58734 141469 203735 268765 162392 19088 164619 234372 295881 71651
16011G1651O3348J70294j12514K521o5210j62867R0622L130l0751j06565Q5621
16000I280r1703r6885J49584L33297j98394j43040m0027N3131k8871J42218j1445
15989G7145j27312J019j55458j34713Q3539J79956L5409M1815m9751r7604j48877
15978b94832j09007q9466L64224J90324k67636l09418j97143J91524N7443J56091
15968c07896M8575O0000J35366l0866m3110o0757j94536J87825R4832J26511P6589
15957I2533j33554K7770K8867J37664l9059j08115j9917j27170N247L09561K15089
15946C88916k2521J10831j47045k37639l1552r9054j40715o898R1999l915J3008
15935h4585M7256J4325n9405j25438J79385L49587Q2230q6647N0082k57713j71854
$$ plain form
16011 71651 134999 305293 192779 195300 130090 -32777 57845 60975 30224 -76341 9280
16000 9280 -82423 -179308 -29724 303573 105179 -37861 -77888 -24757 -53628 88590 77145
15989 77145 -50167 -49148 -204606 -339319 -255780 -75824 -40415 1400 -48351 -145955 -294832
15978 -294832 -403839 -493305 -129081 61243 -206393 -515811 -712954 -521430 -463987 -307896
15968 -307896 -259321 -199321 -63955 -94821 -137931 -198688 -393224 -205399 -110567 15944 92533
15957 92533 -41021 -13251 15616 153280 114221 6106 -13811 -140981 -135734 173827 388916
15946 388916 366395 477226 330181 92542 60990 -38064 -178779 -185677 -93678 -97593 -84585
15935 -84585 -37329 -23004 -82409 -207847 -28462 321125 403355 316708 366790 109077 -62777
15924f2777J47773J63492J30867n73k75271k39741Q939o4796K5095K8207M7873
15913i0912M7388J02699J15206j41993j47002j37739j9212K68416K05613j03811
15903I8653m0302k69607M7266R142p1154k481J65891j8447R1565J46939N3399
15892B10864L2373P3458j0296j26597R5115o7273k14500j96636L8601m0646N0905
15881a54632k2667P1127J32436k164j4082j09198O813k05913Q0066L71475R3510
15870B46771m08l2193J78829j52151m09278k15040J0257n3443L66442J5204N7760
15859A2750R3601l34184q297K49180N3361j12464J2765J55402J29802J07997J11063
15848D70976k36927k8624L2136k3123j64791P3842k3329n2484j17526K32077l2835
$$ plain form
15924 -62777 84996 248488 379355 378782 103511 -136230 -127291 -192087 -166992 -138785 -90912
15913 -90912 -43524 59175 174381 32388 -114614 -252353 -271565 -3149 202464 98653
15903 98653 58351 -211256 -163990 -154848 -226002 -228483 -62592 -81039 10526 157465 210864
15892 210864 243237 316695 306399 179802 274917 207644 -6856 -203492 -164891 -205537 -154632
15881 -154632 -177299 -106172 26264 24100 10018 -99180 -92367 -298280 -218214 153261 246771
15870 246771 246363 214170 392999 240848 -168430 -383470 -373213 -426656 -60214 -45010 12750
15859 12750 106351 -227833 -236130 13050 66411 -46053 -33288 122114 251916 359913 470976
15848 470976 234049 205425 237561 214438 49647 123489 100160 47676 -69850 162227 129392
15837A29392m02730J95101J47914o218Q1781k5019l8405k3931l8631p4088q909
15826f3743J86352j35486k60588K2512J38180k41384R1152K63604J49969O656
15816A57224R462j06734j07247j56289K08993J62670J80091l6119j05705K5650
15806B31996l35903k66636o9155J55040r3526K08981J37389k0626j69331o1044
15796b82815j78363m7589L55593K69236K07065k376J08787j45463j72228m8806
15786F3041r0192M0399M9672q8740J27433M261O3397l8179k17258r9534k6604
15775b12304J23124j31061j67470P5227m0886P5824m6675j65589K03668K51527
15765c4615Q8755k42876O2713K03192j7878j30016q3105p1832J81008Q376k24026
$$ plain form
15837 129392 -273338 -78237 69677 63459 145240 120221 81816 57885 19254 -54834 -63743
15826 -63743 122609 -12877 -273465 -250953 -112773 -354157 -263005 599 150568 157224
15816 157224 166686 59952 -47295 -203584 5409 168079 348170 312051 206346 231996
15806 231996 -103907 -370543 -439698 -284658 -378184 -169203 -31814 -52440 -221771 -282815
15796 -282815 -461178 -508767 -153174 116062 323127 320751 429538 284075 111847 63041
15786 63041 -27151 13248 62920 -25820 101613 105874 169271 131092 -86166 -185700 -212304
15775 -212304 -89180 -220241 -387711 -312484 -353370 -277546 -324221 -489810 -286142 -34615
15765 -34615 54140 -188736 -126023 77169 59291 -70725 -153830 -225662 -44654 -36278 -260304
15754b60304j12485k3066J00619n0757j32069j81124J69564J93582L90320J59306
15744B53586k29600K1806j7242j08486n7072M8090j05527k77293j35613J88753
15734d18598K9537j42531k0723J38473m1531p890K98577J21596l28202J84916
15724a86376L58432r9335j67811K3395M246j6710n9813j25068N6508J46046K48748
15713A82262n6302j27650J01490l6074j31349r3805j01581k5421P2407p6252q2076
15702c74351J50074O2256O2452j13376M2889J63824L01418L5672r159R2742R071
15691D23512o4849q241k9360j06916j65297K11841j01122k47240l09788J0162
15681c87298L33318M2887k11666j74544j34479K487L73579M34200n3712k61055
$$ plain form
15754 -260304 -372789 -395855 -295236 -345993 -478062 -659186 -489622 -296040 94280 253586
15744 253586 23986 45792 28550 -79936 -137008 -88918 -194445 -471738 -607351 -418598
15734 -418598 -389061 -531592 -552315 -413842 -455373 -463263 -164686 -43090 -371292 -186376
15724 -186376 172056 72721 -95090 -71695 -67449 -84159 -143972 -269040 -212532 -66486 182262
15713 182262 125960 -1690 99800 63726 -67623 -161428 -263009 -288430 -216023 -292275 -374351
15702 -374351 -224277 -162021 -99569 -212945 -170056 -6232 295186 330858 321699 414441 423512
15691 423512 358663 350422 321062 214146 48849 260690 159568 -87672 -397460 -387298
15681 -387298 -53980 -11093 -222759 -397303 -531782 -529295 -155716 278484 224772 -36283
15671c6283p5027R0394K4285m0305k60644r5727J03194J39014J34833j777j55718
15660a73761J17517J09931M809j38410Q4581M9809j7773O8569j3324m4111M5105
15649I2942p2373j01873M0841J81942J12441o4642j82560j26604O0100Q4174O6172
15638I0560J7544l6919k31844l34421J4767p140m3537M3687J1929L36205L2348
15627a06821j29701j60437l7171L41181Q2331j70955k50558m4082L1448m13j22229
15616e67407K33145K710J5238J19482q7346n8610J85781o8577j89834R6990Q5523
15605b32905k17687j14536J74117L18341r4721N770j20891k6311M8177K6720r7510
15594c31436K48706o1414o7023J15311K89058N2754J07508J82286n1053j08434
$$ plain form
15671 -36283 -111310 -20916 3369 -36936 -297580 -393307 -290113 -151099 -16266 -18043 -173761
15660 -173761 -56244 53687 58496 -79914 4667 54476 36703 105272 91948 47837 92942
15649 92942 20569 -81304 -40463 141479 253920 189278 6718 -119886 -59786 24388 90560
15638 90560 108104 71185 -160659 -495080 -480313 -487453 -530990 -487303 -475374 -139169 -106821
15627 -106821 -236522 -396959 -434130 -92949 -10618 -181573 -432131 -476213 -444765 -445178 -567407
15616 -567407 -334262 -331552 -316314 -196832 -284178 -342788 -157007 -225584 -415418 -318428 -232905
15605 -232905 -450592 -565128 -391011 -72670 -167391 -161621 -282512 -308823 -260646 -233926 -331436
15594 -331436 -82730 -144144 -211167 -95856 193202 245956 353464 535750 484697 376263
15584C76263k01977r3420r5566j0676P8011J7238J8245J74511n3525J73873m7419
15573C35558k29109k5451j95314n0741J45599J50059j95803R6472J95107j50926
15563G5451q5074p5807j01145N5980J95387l2691j80242k33932J58178J69875
15553e4020J2870p9657K0026p3730J536j24793m2608L14383K86384j81629k36327
15542a57565k40063l8703J94573R2099j01671r455L01632Q3469P5211m7658l1668
15531A20201M3736M7926L6996J57329l01719k85504K33661M11116k46231j49920
15521F7591J45594K65847M9875j86389j56627J9385m384k81797J28838K3311q81
15510G0363m6188m2674j5295r5174m563N5847m300j10296L60906K25723j45605
$$ plain form
15584 376263 174286 80866 -14700 -25376 52635 69873 88118 262629 209104 382977 335558
15573 335558 106449 80998 -114316 -165057 -19458 130601 -65202 31270 226377 75451
15563 75451 -9623 -85430 -186575 -130595 64792 32101 -148141 -382073 -223895 -54020
15553 -54020 -41150 -120807 -100781 -174511 -172975 -297768 -340376 -25993 260391 78762 -157565
15542 -157565 -397628 -436331 -241758 -149659 -251330 -260785 40847 124316 199527 151869 120201
15531 120201 163937 211863 248859 406188 104469 -181035 52626 463742 217511 67591
15521 67591 213185 479032 528907 342518 185891 205276 200892 -80905 47933 71244 70363
15510 70363 24175 -18499 -33794 -128968 -133531 -77684 -81984 -192280 168626 394349 248744
15499B48744l31769j25565L0885R6453j260J02153J43926n8372j00221j46356
15489a41382q9273J32097K54926K52432O5130j72405k25841m13957J05478p5180
15479c07975j46822J32848J54213O2332j46294j068l8350n4613P7287Q8920j93802
15468c73324J23066L3142l2407M09335l7143k01693J4580M9121k278j43307O0731
15457a00177Q5738K52161j98185r122J09033Q1024o8575r5209K1914q524K61M4584
15445A14923K06512j3283j22058j23364k14739J3767j4018r3257j7017N4759J89457
15434a8318M697j97759N9462j30962J25599J34540O2362j64173j84987M6640R7030
15423a65869m6179J60459j25582L4067k5918J37056K44788N2831j26102j99972
$$ plain form
15499 248744 -83025 -208590 -177705 -81252 -82512 19641 163567 105195 4974 -141382
15489 -141382 -230655 -98558 156368 408800 473930 301525 75684 -338273 -232795 -307975
15479 -307975 -454797 -321949 -167736 -105404 -251698 -252766 -291116 -345729 -268442 -179522 -373324
15468 -373324 -250258 -217116 -249523 159812 122669 -79024 -64444 -15323 -17601 -160908 -100177
15457 -100177 -14439 237722 39537 30415 139448 220472 151897 56688 78602 70078 70339 114923
15445 114923 321435 308152 186094 62730 -152009 -138242 -152260 -245517 -262534 -207775 -18318
15434 -18318 -13621 -211380 -151918 -282880 -157281 -22741 39621 -124552 -309539 -262899 -165869
15423 -165869 -212048 -51589 -177171 -143104 -169022 -31966 212822 265653 139551 -60421
15413f0421J49890P9649N9632r3179l34478N8198q4501J36367L2054k35207o6824
15402c58820j89609P1281L89428R7380j46368o6033j82695m1443M02405O5481
15392D1007j00674J17907j88190j71666M0018j25019J8864J43030Q7596J59986
15382B2859j01532k0547J65480J73290K10767l9625k44205k34679J92945P9701
15372B04454N596K0464j12754j0272K5451k57447l68551K6935J78889P4480J54899
15361e7856n3011o5311o3246j1418O9723j4375J24451j67799k83231J89679K06892
15350a25502j04743J5089J59177M6017J15203m0630P167p0109j82999l9319l4513
15339b55162K89163K67651j90882k09863J8141j00917K825k22556K55814o6319
$$ plain form
15413 -60421 89469 169118 228750 135571 -198907 -140709 -225210 -88843 -56789 -291996 -358820
15402 -358820 -548429 -477148 -87720 9660 -136708 -202741 -385436 -426879 -24474 41007
15392 41007 -59667 58240 -129950 -301616 -261598 -386617 -367753 -224723 -137127 22859
15382 22859 -78673 -99220 66260 239550 450317 410692 166487 -68192 124753 204454
15372 204454 210050 230514 117760 107488 132939 -124508 -493059 -466124 -287235 -212755 -57856
15361 -57856 -110867 -176178 -239424 -250842 -181119 -195494 -71043 -238842 -522073 -332394 -125502
15350 -125502 -230245 -215156 -55979 -9962 105241 64611 71778 1669 -181330 -220649 -255162
15339 -255162 34001 301652 110770 -99093 -80952 -181869 -179044 -401600 -145786 -212105
15329b12105j15972L6134L39228K30420j66557j35864k3510k47430l6996R2841
15319b39811K45080L9954j2940q7740J0847R1824k1648j67736n9125m633K49779
15308D3851l8362p0632j5680j49231j91870J21463Q6243k7228J0309K75466K20598
15297B64927m3373J8607l34L92k0831j0343O2897p3570j33745O4863J5158j24406
15285B0242q9754r1401K7164j06473j06554P627K4485J23795J44354j15655k37863
15274d00033K28484L33003L30916o0913k65820q5435j32374m8483l20035q746
15264d29436L9833K17894J12422K11766j6874q8890j99467l0735L17933J77298
15254C11744k02707j74704j49827q4328K64862M1610j08746j20248R328K13968
$$ plain form
15329 -212105 -328077 -291943 47285 277705 111148 -24716 -48226 -295656 -332652 -239811
15319 -239811 5269 45223 32283 -55457 -44610 47214 25566 -142170 -201295 -205928 43851
15308 43851 5489 -65143 -80823 -230054 -421924 -300461 -214218 -241446 -231137 44329 264927
15297 264927 221554 240161 239827 240219 219388 209045 271942 198372 64627 129490 144648 20242
15285 20242 -69512 -160913 -133749 -240222 -346776 -339149 -314664 -190869 -46515 -162170 -400033
15274 -400033 -171549 161454 492370 431457 165637 80202 -52172 -100655 -420690 -429436
15264 -429436 -389603 -171709 -59287 152479 135605 46715 -152752 -183487 134446 311744
15254 311744 109037 -65667 -215494 -299822 -34960 6650 -102096 -222344 -213016 952
15244I52k0775k63340j23573k3423K15784K5352P0758O2384j2918j34770j06576
15233c10145m4712K265o3867J73690J57196P3308r6151J9591K23434n98j93398
15222e9387j09449N7605J62831q7936k8029P6598K5616p6159k12328j83836l8381
15211d72855N2286J13632j0621k6444Q7645J10226k81593J08537J58797J52137
15201h253J37321J45010r8571q2972J29727J21380J7790j23664p7784j40919O880
15190B5945R739p9182M194K05070K2479j57112q8243j18438K15436j40325j23523
15179b23960L3625K7373K8254J25125N8203P0544K6483J13332p3075p1375j51664
15168c7135J6270J83550K16256l72282j02794k40442j55663J33242N8210Q5951
$$ plain form
15244 952 -19823 -283163 -406736 -430159 -214375 -189023 -118265 -55881 -68799 -203569 -310145
15233 -310145 -354857 -352592 -416459 -242769 -85573 -12265 -108416 -88825 134609 134011 -59387
15222 -59387 -168836 -111231 51600 -36336 -64365 12233 37849 -38310 -250638 -434474 -472855
15211 -472855 -420569 -306937 -317558 -344002 -256357 -146131 -427724 -319187 -160390 -8253
15201 -8253 129068 274078 175507 92535 222262 343642 361432 237768 159984 19065 25945
15190 25945 35684 -43498 -39304 165766 188245 31133 -57110 -175548 39888 -100437 -223960
15179 -223960 -190335 -162962 -134708 -9583 48620 119164 145647 258979 185904 114529 -37135
15168 -37135 -20865 162685 378941 6659 -96135 -336577 -492240 -358998 -300788 -214837
15158b14837K04114n7948l4163Q7643J9659K086l2988j1505k5984Q4498n8368
15147c7793J87708m0516p6397j34693l02230N9927K91136j8592j49606k28267
15137d49323N9170J88627K1396R0456J20774j59182j65300P9801K31723j00930
15127h2788M7925L9417J01338k6970K0119P5819j94972k17718k8292O5147J57298
15116d3677k0787j19511K75041K55170o8372k90785n5126j8770j2321R7850M2892
15105D1604l2370Q6033l9761o2296k43555j1715K45749n383j57073r1144J84433
15094h5478K05241N2847P1388J31035k442k73405J07985J84171k7021j01898k57072
15083E351l40322Q0853R2923k90769J58820J45177L2736J61622J7574J6979K7182
$$ plain form
15158 -214837 -10723 -68671 -102834 -15191 4468 6554 -26434 -37939 -63923 20575 -37793
15147 -37793 149915 109399 33002 -101691 -403921 -343994 -52858 -71450 -221056 -449323
15137 -449323 -390153 -201526 -180130 -89674 31100 -128082 -293382 -213581 18142 -82788
15127 -82788 -34863 4554 105892 78922 99041 174860 -20112 -237830 -266122 -200975 -43677
15116 -43677 -64464 -183975 91066 346236 277864 -12921 -68047 -86817 -99138 -1288 41604
15105 41604 9234 95267 55506 -6790 -250345 -262060 -16311 -21694 -178767 -269911 -85478
15094 -85478 119763 172610 243998 375033 372591 99186 207171 391342 364321 262423 5351
15083 5351 -334971 -254118 -161195 -451964 -293144 -147967 -115231 46391 63965 80944 108126
15072A08126L46k60254k01592M3141J40118J77927J33995k67244m24695l8192
15062e88324K43996l033M3669J81620J14616J08803J2433j91861j6601M8913j54402
15051b00171j02690J93976M6591j6800k6118N7426n6057l05649J34961j1682k5014
15040c11227Q2759l3269J8531Q0352j77969J52011K17033o2256j58827M79O7932
15029a24451J11482K08373r0180m3764j34335L4592J14183M7119j00539J57599
15019A80079r890j26221o7818j58547N3636L22617Q1888r1935j09207j60520k8110
15008a14028L1408m1516p8452q8776J1938j33149J62231L29157O3386j04638k46516
14997b08955k3955J53294m9751K4675J07194j9720r4474r413j56879k06628R0088
$$ plain form
15072 108126 108472 -151782 -353374 -310233 -170115 7812 141807 -125437 -550132 -588324
15062 -588324 -344328 -347361 -303692 -122072 -7456 101347 113780 -78081 -94682 -45769 -200171
15051 -200171 -302861 -108885 -62294 -79094 -105212 -47786 -103843 -409492 -274531 -286213 -311227
15040 -311227 -228468 -261737 -243206 -162854 -340823 -188812 28221 -34035 -192862 -192383 -124451
15029 -124451 -12969 195404 105224 61460 -72875 -38283 75900 123019 22480 180079
15019 180079 170189 43968 -23850 -182397 -128761 193856 275744 183809 74602 -85918 -114028
15008 -114028 -82620 -124136 -202588 -291364 -279426 -412575 -250344 78813 142199 37561 -208955
14997 -208955 -232910 -79616 -129367 -104692 2502 -17218 -111692 -121105 -277984 -484612 -394524
14986c94524N2182J8567K9366L41979M7029j55216j58687p438J60498R2923J00
14975B6779M060Q5443K49575K17216j38577o5962j89941j06225J14627R6805M969
14964B98769J1871r1349r4551M9314l3832j83081j1077j90348J40770J70800Q507
14953G5793P2365p6480k7672n6126J5397j1119o9610p954J94960Q7251l223n0642
14941A42940q5583K6332R2348M4813j87036p2526J48352n5577p5434j24935P4129
14930g2177K47373k9280n4272j35910j65102J21092n2095K095P5334l2262o3008
14919a58212j8776J64984k3519N15Q9298Q7847p9j11674j42914k21338K795j30951
14907d62024J41774K48353J03066m1048K58765k74671j54429J10206K03307J58817
$$ plain form
14986 -394524 -342342 -323775 -294409 47570 94599 -60617 -219304 -226742 -66244 26679 26779
14975 26779 30839 116282 365857 583073 444496 378534 188593 82368 196995 293800 298769
14964 298769 310640 219291 124740 174054 140222 -42859 -53936 -244284 -103514 67286 75793
14953 75793 148158 71678 44006 -12120 3277 -7842 -77452 -85406 109554 196805 193582 142940
14941 142940 57357 83689 176037 220850 33814 -38712 109640 54063 -21371 -146306 -72177
14930 -72177 175196 145916 91644 -44266 -209368 -88276 -140371 -138276 -62942 -95204 -158212
14919 -158212 -176988 -12004 -35523 -35008 54290 142137 142058 30384 -112530 -333868 -331073 -462024
14907 -462024 -320250 -71897 31169 -9879 248886 -25785 -180214 -70008 133299 292116
14897B92116j80004j38642K10262J19690j00722k67648j63154j27638L5426K48682
14887g1632J38073n1111O4770L5847j32579o2766o0855m2608j7033O5639J47269
14876A3014J55993l5553j69710K12470J86378k79930L309J24416j31989l45825
14866b67427j35327L7705j99337K817r301K54280L94867M4344j9024o4320r0658
14855e1381n8749J00754m8992J7172J99315L5020J16847k7616P1013R860j99765
14844A63478k05117j44499j15816L5038j75067o6095Q2321L8080j05602m6557
14834e39836J40346J56817K18732J01010J48933o8226j04732l8781p4626j03241
14824a63604O5008K31909j20566n6283J01028m3839L5507Q7679j30082j10629
$$ plain form
14897 292116 112112 -26530 183732 303422 202700 -64948 -228102 -355740 -320314 -71632
14887 -71632 66441 15330 80100 115947 -16632 -79398 -140253 -182861 -199894 -134255 13014
14876 13014 169007 133454 -36256 176214 362592 82662 85971 210387 78398 -267427
14866 -267427 -402754 -365049 -564386 -561569 -570870 -316590 78277 122621 103597 39277 -51381
14855 -51381 -110130 -9376 -58368 -41196 158119 193139 309986 282370 353383 363243 163478
14844 163478 -41639 -186138 -301954 -266916 -441983 -508078 -425757 -387677 -493279 -539836
14834 -539836 -399490 -242673 -23941 77069 226002 157776 53044 14263 -60363 -163604
14824 -163604 -98596 133313 12747 -43536 57492 13653 49160 136839 6757 -103872
14814a03872l72653J60798J63357P0981k29381j51767q2870J61565J86474L2080
14804a65288j00296r6427J04463R9625J77806K1791L56399N7813k20236j00144
14794A35506k63452n3453M18260J68132q2244J42072K01121l96906j59170J0160
14784A20026J06833j9610m13006J63620l4280N9274j56466k08877k23590Q9617
14774e16459K79937K84231K14720j11043O1938N2570n1032q2474J1331J15654
14764B59373O5364M8818q5025j51305r3347k7542K1686L0747j53168l73003R9095
14753c58307L16152K9154j3258j02006m4433J69186l5907R5210J34007K28875
14743D18673j15544r9051k8205J34644j81365j96053J93489O4965j59464P4832
$$ plain form
14814 -103872 -476525 -315727 -152370 -81389 -310770 -462537 -545407 -383842 -197368 -165288
14804 -165288 -265584 -362011 -257548 -157923 19883 41674 398073 455886 235650 135506
14794 135506 -127946 -181399 236861 404993 322749 464821 665942 269036 109866 120026
14784 120026 226859 207249 -205757 -42137 -76417 -17143 -173609 -382486 -606076 -516459
14774 -516459 -236522 47709 262429 151386 213324 265894 214862 132388 143719 259373
14764 259373 324737 373555 288530 137225 43878 16336 38022 68769 -84399 -457402 -358307
14753 -358307 -42155 -13001 -26259 -128265 -172698 -3512 -39419 55791 189798 418673
14743 418673 303129 204078 175873 310517 129152 -66901 126588 191553 32089 106921
14733A06921r6569l3802J7212j29104r3980K43708J24897J22l30206j08837Q1992
14722b17646J33354j81516q4085J27568j35338p3560m9968P963J86393M8504m7027
14711b85358J8768J46984M8161J52413j89463l1634J47566K4141k6227l25516
14701c20165L2626K93477N1608Q9977O3986J3692J71163q7676m26064l5244K45885
14690I3265L03171k73319k0659n0261O2680L8084M1590q8542k72670Q4016P9352
14679c293J06260J68893P2193j08145j94542l7516o6352J06300j0929N7210k0828
14668F9251R6248J42593r4439j90022n3034J3507K65651J04138k03362l21560
14658a71029p7893k36543l9791J00142J21366K8489j35757J01032R4915J12437
$$ plain form
14733 106921 10352 -23450 -6238 -135342 -229322 14386 139283 139405 -190801 -299638 -217646
14722 -217646 -84292 -265808 -349893 -222325 -357663 -431223 -481191 -473228 -286835 -238331 -285358
14711 -285358 -266590 -119606 -71445 80968 -108495 -140129 7437 31578 5351 -320165
14701 -320165 -287539 5938 57546 147523 211509 225201 396364 308688 -117376 -152620 93265
14690 93265 396436 123117 102458 52197 114877 152961 194551 106009 -166661 -82645 -3293
14679 -3293 102967 271860 344053 235908 41366 3850 -62502 43798 32869 90079 69251
14668 69251 165499 308092 213653 23631 -29403 -15896 249755 353893 150531 -171029
14658 -171029 -248922 -485465 -525256 -425114 -303748 -275259 -411016 -309984 -215069 -102632
14648a02632L2565K07453L00498j80832l72269r8541M5420M872J13195k73641
14638c23912n2449J54157m8282n3452j29342j29502K68036J91690J82273j72882
14628a13665k12817J24322j9004j89043K45472L23729j41559k26261j21909L5731
14618b95004J0722K18984K21779M8412j22620j91555n4966j47887j36681L2489
14608d16327O9491K11615K05519Q8375n2615k69659j55128J97527L7529j62028
14598b45701P8463n5847k32060K84030L79797P3862l20258k77492m9878K21831
14588a43253P3317L9529j24093q726J30946Q9711J76216j6196j01145j45335l069
14577c2098l0687J57872r442R8287k03223k53343j75248J74167k2281j9649P0831
$$ plain form
14648 -102632 -70067 137386 437884 257052 -115217 -213758 -168338 -163466 -50271 -323912
14638 -323912 -376361 -222204 -270486 -323938 -453280 -582782 -314746 -123056 59217 -113665
14628 -113665 -326482 -202160 -221164 -410207 -164735 158994 17435 -208826 -330735 -295004
14618 -295004 -284282 -65298 156481 204893 82273 -109282 -164248 -312135 -448816 -416327
14608 -416327 -346836 -135221 70298 158673 106058 -163601 -318729 -121202 -83673 -245701
14598 -245701 -167238 -223085 -455145 -171115 208682 282544 -37714 -315206 -365084 -143253
14588 -143253 -69936 -30407 -154500 -163226 -32280 57431 233647 217451 116306 -29029 -32098
14577 -32098 -62785 95087 85645 183932 -19291 -272634 -447882 -273715 -295996 -315645 -244814
14566b44814o0591L61015L73448k18557l71753k54383M0051j8232j96286N2585
14556e37517K63531J69054J88005o4328j73170p204J43054j28328j74083J88901
14546a32085Q4078K15384K92636j1689R7064n2284m4695j23312k07155l16369
14536a98427j51702m4679J57307O1865J31129J03290j6984J9027J15873j79791
14526c092j42024m7372K5198Q1481J65731j21311J60170K22676J22155p5881M2358
14515D30089L1346j69796l0998k12227m8795r730k92783j05939J07008O2657j31813
14504c70981J96383M5848j11955Q0873J34452K049J23078j57435J22331o49L3311
14493I7305j44287L6251r4012N7859J8085j38918j16193J46280K66757j12632
$$ plain form
14566 -244814 -305405 55610 429058 210501 -161252 -415635 -375584 -393816 -590102 -537517
14556 -537517 -273986 -104932 83073 18745 -154425 -161629 -18575 -146903 -320986 -132085
14546 -132085 -48007 167377 460013 448324 545388 493104 448409 325097 117942 -198427
14536 -198427 -350129 -394808 -237501 -175636 -44507 58783 41799 60826 176699 -3092
14526 -3092 -145116 -192488 -167290 -85809 79922 -41389 118781 341457 463612 387731 430089
14515 430089 461435 291639 260641 48414 -381 -10111 -302894 -408833 -301825 -239168 -370981
14504 -370981 -174598 -128750 -240705 -159832 -25380 -23331 99747 -57688 64643 63994 97305
14493 97305 -46982 -10731 -104743 -46884 -28799 -167717 -283910 -137630 129127 16495
14483A6495N2424j1423k10701n9725K16900J00807p7184m7858j13587k07125J57328
14472a83649r2620n1881J06934J78793l1610m9036R4442k1856m29573j20236J96974
14461d03318o4264j57817J46123N9096P6045R4048o7424q2793J40434J73718m1342
14450a27494J7970M9706j63974L1455R1247j47231J55578J17193J5463r579o1887
14439c1553p310o8392O6567K1727K6583N8094P0943k05499n6266K16562L9216
14428A30672m6492k17243J02963K24902k09146j33328J23863j68998k54604j01085
14418e48496j26530J23588J07580J22972Q6694L08140L24981J25504k64186k19865
14408D0382j27140R1536M5503j34226k7052O1606o7858n6065N8304L0812J05325
$$ plain form
14483 16495 68919 57496 -153205 -212930 3970 104777 27593 -20265 -133852 -340977 -183649
14472 -183649 -276269 -328150 -221216 -42423 -74033 -123069 -28627 -50483 -480056 -600292 -403318
14461 -403318 -467582 -625399 -479276 -420180 -344135 -250087 -317511 -400304 -259870 -86152 -127494
14450 -127494 -109524 -59818 -223792 -192337 -101090 -248321 -92743 24450 39913 30334 -31553
14439 -31553 -38863 -107255 -40688 -18961 7622 65716 136659 -68840 -125106 91456 130672
14428 130672 84180 -133063 -30100 194802 -14344 -147672 -23809 -192807 -447411 -548496
14418 -548496 -675026 -551438 -443858 -320886 -234192 73948 398929 524433 260247 40382
14408 40382 -86758 4778 50281 -83945 -110997 -49391 -117249 -173314 -115010 -84198 21127
14397B1127k4608m2073j29349k19816j71978j8603K29950R630j9331m0678O9392
14386c36337K78965K68983l742l3574K11943j57106l06269j85319L4805J38800
14376h8851J0233L6705K7172m2964K75502J07508j67531j28884j76786J61984
14366A4088K18073k10823k87540j29330J79592l6346m7149p4256M0891J82373
14356a50427n9655j40207J36398J27550j47634M385J07631O2663J56042J70196
14346B66942k81017k13841o9293o462K9653J15827K66588J57028l31910j61098
14336b27583R6869K53927J73249Q1334j64141p98k22584j59463p9231p8943J29699
14325a97665R2255K38112K6730M11r6464j99251j14064J55498j1801o0951j99166
$$ plain form
14397 21127 -3481 -45554 -174903 -394719 -566697 -585300 -355350 -345720 -365051 -405729 -336337
14386 -336337 -57372 211611 207869 174295 386238 229132 -77137 -262456 -227651 -88851
14376 -88851 -78618 -41913 -14741 -57705 217797 325305 157774 28890 -147896 14088
14366 14088 232161 21338 -266202 -395532 -215940 -252286 -299435 -373691 -332800 -150427
14356 -150427 -210082 -350289 -213891 -86341 -233975 -229590 -121959 -59296 96746 266942
14346 266942 -14075 -227916 -297209 -303671 -274018 -158191 108397 265425 -66485 -227583
14336 -227583 -130714 123213 296462 377796 213655 212857 -9727 -169190 -248421 -327364 -197665
14325 -197665 -105410 132702 159432 159843 63379 -135872 -249936 -94438 -106239 -167190 -366356
14314c66356n6407J74497L64325m0699j58742j11655k36765j6998M7328J36801
14304b64671L51039j04833k42108J30828K89104n3041k80415n8911K7284m7222
14294b52946J43588Q5074K2955O5926l060P2962j8582L829Q023j24318j24002
14283a20551J32480K21572o0103J07458J36911j71578k17051j90120J48520j81234
14273a93696l488N5575k36882R0040J3292M2297K04099q7517J4219r7660j62346
14262c62067J39856J17472j1053j8708J67696l3744J64368L6054M8774k2765j35076
14251I0807m68681p1687M25834J62226k83194j00770l8427M3438N7078j50492
14241c33868m2121J97717J0797L6261M4780N2360q145k34317k13151J2637N2268
$$ plain form
14314 -366356 -422763 -248266 116059 75360 -83382 -195037 -431802 -448800 -401472 -264671
14304 -264671 86368 -18465 -260573 -129745 159359 106318 -174097 -233008 -205724 -252946
14294 -252946 -109358 -24284 -1329 64597 61537 134499 115917 119746 127769 3451 -120551
14283 -120551 11929 233501 173398 280856 417767 246189 29138 -160982 -12462 -193696
14273 -193696 -197184 -141609 -378491 -288451 -275159 -232862 -28763 -116280 -102061 -199721 -362067
14262 -362067 -222211 -104739 -115792 -134500 33196 -548 163820 199874 248648 225883 90807
14251 90807 -377874 -449561 -23727 138499 -144695 -245465 -283892 -240454 -183376 -333868
14241 -333868 -375989 -178272 -167475 -131214 -86434 -34074 -42219 -276536 -489687 -477050 -424782
14230d24782O8866J49123n8382q3095m2952n6864L4173J94377L09020P170j34044
14219c7390p8737L545j36395Q8339K68568j37876j90643p9499o367K44526K7791
14208c4138q0920l37952l9467J39938M71856K67280R6131k42993R3287J62133
14198D95155l68572m25725J49141R0820j44103r1603j35751o7131K37718L16647
14188E6596q7544j63897n4261J2976K77460J63647n0674k8614O4540k2900o5723
14177A01606j2992j77694j27058k20314j72632J12824j07774m3065L51251K34457
14167f1391J57578j75534O3805l5779R925j5483M530j6466p0171J09345N5231
14156B5590M3456o0296k30051j51347j40488j00089j3240J56691L30985K94676
$$ plain form
14230 -424782 -355916 -206793 -265175 -348270 -391222 -448086 -413913 -219536 89484 96654 -37390
14219 -37390 -116127 -112582 -248977 -160638 107930 -29946 -220589 -300088 -306455 -61929 -34138
14208 -34138 -115058 -453010 -492477 -352539 119317 386597 482728 239735 333022 495155
14198 495155 126583 -299142 -150001 -59181 -203284 -294887 -430638 -497769 -260051 56596
14188 56596 -30948 -194845 -249106 -236130 41330 204977 154303 125689 190229 167329 101606
14177 101606 88614 -89080 -216138 -436452 -609084 -496260 -604034 -647099 -295848 -61391
14167 -61391 96187 -79347 -15542 -51321 -41396 -56879 -52349 -68815 -138986 -29641 25590
14156 25590 69046 8750 -221301 -372648 -513136 -613225 -626465 -469774 -138789 155887
14146A55887K68798r7177j45878j91598Q4832P0374P0331m2497j07555j25999
14136f0482l388J56804k01456J32743p582j28825O320J0668j54745J4015L10733
14125G4805Q834j09720n3059r2142n8394P6205N6881k0469j87390K8117j09287
14114c85619R6079R4098j62734O9647J36234j9671k4690K03030j78912j23477
14104b96015r102m7176J41745l8565j7837m7537J18171o804j9440l1532j03661
14093c57753R6801J20979q3369J49420J68832r7950J45477P1646P3229o28j31689
14082A54995j30029K17349j80947l57812o4305K5327j0026Q4254N6739O6018q6781
14071b25218J82090p3235L4249k8448r4448J32903J4457p0694o6238m7665J22202
$$ plain form
14146 155887 424685 327508 181630 -9968 74864 145238 215569 173072 65517 -60482
14136 -60482 -63870 92934 -108522 24221 16639 -112186 -105866 -95198 -249943 -235928 74805
14125 74805 83639 -26081 -79140 -171282 -229676 -153471 -96590 -117059 -304449 -276332 -385619
14114 -385619 -289540 -195442 -358176 -288529 -152295 -171966 -196656 6374 -172538 -296015
14104 -296015 -305117 -352293 -210548 -249113 -266950 -314487 -196316 -203120 -222560 -254092 -357753
14093 -357753 -260952 -139973 -223342 -73922 94910 -3040 142437 214083 287312 286684 154995
14082 154995 24966 242315 61368 -296444 -360749 -335422 -345448 -261194 -204455 -138437 -225218
14071 -225218 -43128 -116363 -82114 -110562 -205010 -72107 -57650 -128344 -194582 -242247 -120045
14060a20045K6800j18422j8472j52922L1566K12334n845o1036J06299m4464J43710
14049d97n9569J3798R277N7127K68005J42935J6979K12052p5816j90523q7819
14038C05949J05370r9274k23683K9761K10518j71079k77945j71228Q5276O0395
14028a45940j27361J28006R0481J69326M6584j58671q6747P9180L0154M87m1494
14017a5995K2004j65602m4126L2236J118m90J89965L5037j26661j00437J63751
14006i200O8853J08664n5312j23230K17708J26389j57231j17931k16020j1143
13996a68453K89082n4934j92644j03276R4292m3482J15836J26483J8677K5304
13986A06885j06982j96592J2528J79497r6745l75901r5737K60877P1057p5052
$$ plain form
14060 -120045 -93245 -211667 -230139 -383061 -351495 -139161 -145006 -206042 -99743 -144207 -497
14049 -497 -60066 -46268 -36991 20136 288141 431076 448055 660107 584291 393768 305949
14038 305949 411319 312045 88362 118123 328641 157562 -120383 -291611 -206335 -145940
14028 -145940 -273301 -145295 -54814 114512 161096 2425 -84322 -5142 25012 25499 -15995
14017 -15995 6009 -159593 -203719 -171483 -170365 -170855 19110 54147 -72514 -172951 -9200
14006 -9200 59653 168317 113005 -10225 207483 333872 176641 58710 -157310 -168453
13996 -168453 120629 65695 -126949 -230225 -135933 -179415 -63579 62904 81581 106885
13986 106885 -97 -196689 -184161 -4664 -101409 -477310 -573047 -312170 -241113 -316165
13976c16165k3776K6264J25968L22933j05696j03073L844J15227k89373P9609
13966a64238J93683K16253m3810Q977k5538j43521j13485K8181N752j65161o7913
13955b70820J41771K47629K7055N3344q5473l86693r3948j5538j26395q6348K49578
13944c45838K07113r6537o6165K1845K71182n1496j00865J70653K29001J49701
13934C88594J81716o9362k01996j07724l0331j76342J04107M3207p5617j09905
13924e3653m8020J6230J19391J39699k02973k22412r2734r3177k56485J06620
13914e87514J61904K05788L33930m6631O2518O6350j7205N3180J23049J46495
13904E01864n110k06159j26236J44517L24563j05220j51635l55752l2577j4004
$$ plain form
13976 -316165 -339941 -313677 -187709 135224 29528 -73545 -69701 45526 -243847 -164238
13966 -164238 29445 245698 201888 210865 185327 41806 -71679 -43498 -37746 -202907 -270820
13955 -270820 -129049 118580 145635 198979 113506 -273187 -367135 -382673 -509068 -595416 -345838
13944 -345838 -138725 -235262 -301427 -279582 -8400 -59896 -160761 9892 238893 388594
13934 388594 570310 500948 298952 191228 160897 -15445 88662 131869 56252 -53653
13924 -53653 -101673 -85443 33948 173647 -29326 -251738 -344472 -437649 -694134 -587514
13914 -587514 -425610 -219822 114108 67477 129995 196345 179140 232320 355369 501864
13904 501864 496754 290595 164359 308876 633439 528219 376584 20832 -11745 -25749
13894b5749J11334K25513J26426j42266j87876k03160j02385o3702J80275J50671
13884F9081J44084J85472M2074j15697j9440l22005j43390N6506K56420P7897
13874B31002p6196j28759k80441k26808J13183J14478J96241r3201p7236j21492
13864c49229K05464N5849l3210j34934K85287P5628j23605j79451j49751L37854
13854a0098K67334j4513k28076k61906M5808J72683k04266J52513R2780r8535
13844h6276J06053R0355j4336K10602k3846m8632M0509l27646o9628o6129j11120
13833c00094N4385K01549J92330o8825j20791K27717r4551L9449N9549M6693j36995
13822A00416k9171O2224J25987j92287j39220J86092J65053j42032k51874J4235
$$ plain form
13894 -25749 85585 311098 437524 295258 107382 -95778 -198163 -261865 -81590 69081
13884 69081 213165 398637 440711 325014 305574 -16431 -159821 -103315 153105 231002
13874 231002 154806 26047 -254394 -481202 -368019 -253541 -57300 -150501 -227737 -349229
13864 -349229 -143765 -87916 -121126 -256060 29227 104855 -18750 -198201 -347952 -10098
13854 -10098 257236 242723 14647 -247259 -201451 -28768 -233034 -80521 12259 -86276
13844 -86276 19777 110132 95796 306398 282552 233920 274429 -53217 -122845 -188974 -300094
13833 -300094 -245709 -44160 148170 79345 -41446 186271 91720 131169 190718 237411 100416
13822 100416 71245 133469 259456 67169 -72051 114041 279094 137062 -114812 -100577
13812a00577n4743K09885p4941o8403L36737K25875k21222l76681K60361m3106
13802I3185N3836K19261m501k61526j67818m2109r8348L6630j07660J03301N0908
13791a24841J57261m6713J29145O5836k4873j16142k35022J2856L4974J06467
13781d1052P8292O2467J16684j73633J07289Q2010j49841q5370J05477m3492j02502
13770d3671J35337O7311o5772k5596m2835M9275N0982L3267L3606L3424k20334
13759D994j93488j5571L92244J85673j26346l11185O6638J6378j11086K3596M306
13748f3847n7126j88595P3285K51110M759j11114M2321o2562j73398r6500L1452
13737c50215p39j25639m6290k0731J35379r9927J28266M07728J20339J4463j0959
$$ plain form
13812 -100577 -155320 54565 -20376 -88779 247958 473833 252611 -124070 136291 93185
13802 93185 147021 366282 361781 100255 -67563 -109672 -208020 -171390 -279050 -175749 -124841
13791 -124841 32420 -14293 114852 180688 155815 39673 -195349 -182493 -147519 -41052
13781 -41052 37240 99707 216391 42758 150047 232057 82216 -3154 102323 58831 -43671
13770 -43671 91666 158977 93205 67609 24774 74049 125031 158298 191904 225328 4994
13759 4994 -188494 -204065 188179 373852 247506 -63679 2959 19337 -91749 -68153 -63847
13748 -63847 -120973 -309568 -236283 14827 19586 -91528 -49207 -111769 -285167 -381667 -350215
13737 -350215 -350954 -476593 -522883 -543614 -408235 -508162 -379896 27832 148171 162634 151675
13726A51675J5201k65758j40757K10700O2404P5667j16758k5327l7226Q2614J21150
13715A33585P1768j44855n3670m9680q2455l01p089J38317k370p8839Q206j26356
13703a93739R1773j63833J68436L8430o0168j68001J12546J47842Q9947N3418
13693A16651k67738p9905J91914j6705J66753r3663J34583j55267j77551O3574
13683a17354Q1619J27744J2495j8267K4058j13549j15491Q1085J20591J89660
13673B72591k1277Q497n9553K62857l1127J32239J17371j20722l02247l6817l06760
13662h4948j50012P6597j42066J18461k40884p674n1198J56924N6763K136K94301
13651B8400J22163N5615j8172k5519k01211n7264J42022K5355m9152j61871q2640
$$ plain form
13726 151675 166876 -98882 -239639 -28939 33465 109132 -7626 -32953 -70179 12435 133585
13715 133585 205353 60498 6828 -42852 -125307 -125608 -132697 5620 3250 -75589 -67383 -193739
13703 -193739 -101966 -265799 -97363 -58933 -119101 -287102 -174556 -26714 63233 116651
13693 116651 -151087 -230992 -39078 -55783 110970 17307 151890 -3377 -180928 -117354
13683 -117354 -35735 92009 104504 86237 110295 -3254 -118745 -37660 82931 272591
13673 272591 251314 259811 200258 463115 431988 564227 681598 560876 258629 221812 -84948
13662 -84948 -234960 -158363 -300429 -181968 -422852 -430526 -481724 -324800 -268037 -265901 28400
13651 28400 150563 206178 188006 162487 -38724 -95988 46034 71389 22237 -139634 -222274
13640b22274n6004l5928q042O0417R7162N4248J3569Q876j8481j14408K66922
13629D6057J05063n9464k36874o2155k6243K6394K6654J54562J16273j39241O3075
13618A4101J11265p740Q272n4400p0371j52173P978R5052K19968j79751j03837
13607a11636k4702p8110K59882J98625J85436l2930l64330o6566m5378J06536
13597B6827j875J20641m7240k37385K09960P0670K4768l05853j97088L1473J44236
13586a60866r5359k5944N9104O8912n4715K62836J0361k8315l9638j19850j66463
13575b89937J97331K64129j10252k43917n365J11991N1952M8406j05661J9244
13565f2079P6332O3964J44225j9534r0795J72510m3049m4370M4331J8311J72062
$$ plain form
13640 -222274 -278278 -314206 -322248 -261831 -164669 -110421 -96852 -87976 -106457 -220865 46057
13629 46057 151120 91656 -145218 -207373 -233616 -207222 -180568 -26006 90267 -48974 14101
13618 14101 125366 117626 125898 71498 1127 -151046 -143068 -48016 171952 -7799 -111636
13607 -111636 -136338 -214448 45434 244059 429495 396565 32235 -34331 -79709 26827
13597 26827 24952 145593 98353 -139032 70928 141598 166366 -139487 -336575 -305102 -160866
13586 -160866 -256225 -282169 -223065 -154153 -208868 53968 64329 36014 -3624 -123474 -289937
13575 -289937 -92606 171523 61271 -182646 -188011 -76020 -24068 24338 -81323 -62079
13565 -62079 14253 78217 222442 202908 112113 284623 241574 197204 241535 259846 431908
13554D31908M7022K1345k13636q5522K9704K1574n8480J6033k78326l12009l1146
13543d11533J71382K38460L54983j50720k44870J29958L55179L8931K1716l09118
13533A94368m22177J95319J84098m9597n2899m7554r1542L594K05326L4145k1627
13522A31454J33169L0269J38023J80796n1062l26210k89815l2475j05516P1115
13512a20252R3241m0326j6183J56852j59410j33320K26631J75729j74107j33497
13502a24642J99503K32366Q3911K8445j88145j10422J94535j07597Q371P2189
13492B88514J5096O883j06189j95067q4753n006n323j61689O8089M20501K50052
13481D91108k54010l43717p2968J48484J0536o7590L6905m3851Q1840l4630j90170
$$ plain form
13554 431908 478930 500275 286639 201117 230821 252395 193915 209948 -68378 -380387 -411533
13543 -411533 -240151 -1691 353292 202572 -42298 87660 442839 481770 503486 194368
13533 194368 -227809 -32490 151608 102011 49112 1558 -89984 -86390 118936 153081 131454
13522 131454 264623 294892 432915 613711 562649 236439 -53376 -85851 -191367 -120252
13512 -120252 -27011 -67337 -83520 73332 -86078 -219398 7233 182962 8855 -124642
13502 -124642 74861 307227 391138 419583 231438 121016 315551 207954 216325 288514
13492 288514 303610 310493 204304 9237 -75516 -80522 -85845 -247534 -179445 241056 491108
13481 491108 237098 -106619 -179587 -31103 -20567 -88157 -51252 -95103 -13263 -47893 -238063
13470b38063r3194P8671K76501R7322L4647M6580O1575o0938k9741J06537j02745
13459A77152j94827k39064Q8992P1511L8364k8384L1851K01337q1589r6366J5350
13448a5673P5345j59247j05101L02339R1323R2821j45672k0659J09776n0480j63517
13437A1255j962k79355N2259n211J07971K81288r6797q0688J12871J05173l286
13426B03518j47616O6936j3569Q8292R440k06673j9347J48241n1409M1708l4862
13415H4659k8501l0354j53722J75150M7946l9377P9054J04089j17310j10644k11097
13404b00107k36491l675J55154J64230K8306L7907J18991j21103o564J37315K70286
13393C44249p9569R9100m9834m3541j29032n0497j3899O2584J83483j91174k39061
$$ plain form
13470 -238063 -331257 -252586 23915 121237 155884 202464 264039 203101 173360 279897 177152
13459 177152 -17675 -256739 -167747 -96236 -57872 -86256 -54405 146932 65343 -31023 -15673
13448 -15673 59672 -99575 -204676 97663 188986 281807 136135 115476 225252 174772 11255
13437 11255 9293 -270062 -217803 -223014 -115043 166245 69448 -11240 101631 206804 203518
13426 203518 55902 122838 109269 197561 207001 328 -19019 129222 77813 119521 84659
13415 84659 56158 25804 -127918 47232 95178 55801 134855 238944 121634 10990 -200107
13404 -200107 -436598 -440273 -285119 -120889 -92583 -54676 64315 -56788 -63352 73963 344249
13393 344249 264680 363780 313946 270405 141373 90876 76977 139561 323044 131870 -107191
13382a07191j35526j11826M1646J8509l5605R1228K66343J35566k59769j03518
13372b00143o3321J20028J41869J24082n3664o558r4449k5116k6257j60103M9334
13361a94298J13605K23754O0193n0337K5651O3837k9029m5227k24693k58416J96561
13350a18399O5766Q6616K1590O9434n6906l04098m6131Q274q4343N0004k7766
13339c35959J54015j39697P6338K83947j94166O862K35782R1783k24210K5595
13329a9710r8103j12699o4429R7352J56311k3942k54878j3348J38096j5150k34581
13318d45081n3334J94231J00903j3841P3938J42419J40930O2124n0553r8309p5238
13307b1811j45543j37680K08573R2877k5691j33588K63293L49192K3413q9073
$$ plain form
13382 -107191 -242717 -354543 -312897 -294388 -329993 -238765 27578 163144 -96625 -200143
13372 -200143 -263464 -143436 -1567 122515 68851 62293 -32156 -57272 -83529 -243632 -194298
13361 -194298 -80693 143061 203254 152917 178568 242405 213376 168149 -56544 -314960 -118399
13350 -118399 -52633 33983 55573 125007 68101 -235997 -282128 -273854 -358197 -308193 -335959
13339 -335959 -181944 -321641 -245303 38644 -155522 -148660 87122 178905 -45305 -19710
13329 -19710 -117813 -230512 -294941 -197589 -41278 -65220 -320098 -333446 -195350 -210500 -445081
13318 -445081 -498415 -304184 -203281 -217122 -143184 -765 140165 202289 151736 53427 -21811
13307 -21811 -167354 -305034 -96461 -3584 -29275 -162863 100430 449622 473035 383962
13297C83962m7349k49336q6900k29449j84895O1742J90632o4280J20359J28224
13287B2710P9711j29329q0374j36791J58341L16462o0812p5231J6110k7289j7343
13276F6165j60754j09740k4778K82K48113R4681M9487Q2543l12288j40694j203
13265b08186J33723j954J11955J33836J2543j702J68351N5366J1658K118J2027
13254D29735o8006k18676j5774N8831J07021K2764l23834m41055p3306J70675
13244c51625O6670J20981J62684J90343J7536k32286l0619q7439q0098L9733K61369
13233G7249m8469k54519q5405j60908K00559k0054L0893P2407k6865r5497K19963
13222i0646N2923J6177K56791n9041k10494j14268J46960N0618o8721j88162j17403
$$ plain form
13297 383962 336613 87277 377 -229072 -413967 -352225 -161593 -225873 -105514 22710
13287 22710 102421 -26908 -107282 -244073 -85732 230730 169918 94687 110797 83508 66165
13276 66165 -94589 -204329 -229107 -228825 19288 113969 163456 245999 -66289 -206983 -208186
13265 -208186 -74463 -76417 35538 169374 181917 180215 348566 403932 415590 417708 429735
13254 429735 361729 143053 127279 186110 293131 315895 -7939 -448994 -522300 -351625
13244 -351625 -284955 -163974 -1290 189053 206589 -25697 -56316 -143755 -223853 -184120 77249
13233 77249 28780 -225739 -311144 -472052 -271493 -291547 -260654 -188247 -215112 -310609 -90646
13222 -90646 -37723 -21546 235245 176204 -34290 -148558 -1598 49020 -19701 -207863 -325266
13211c25266j30712K19912J59656J94990K25993n1917q5446M7640l0608j18474
13201A05768R3917m6870j87251k0083J25809M126j28109P3692L16045j17728p7240
13190A42076P8600k53724m8402O4662j76388j28693J34021R4112J2496O6669j37033
13179a51604o861K62823o0008o3306l0788O5862O1282Q7774k86785k06039J01847
13168b25803M01714J34824l0456j04524P3177J47050p2889p2915l68835l38496
13158d57153m7850J08431J1418J24238L13370K15719l06544l29597j73305K79637
13148b61636J16497j8314o2449K5980K17909p4783o7302J95949J72804k4561K4286
13137B44380L2569j63012M1593n4531j51567j0855P2501j0481k6375q169K6718
$$ plain form
13211 -325266 -455978 -236066 -76410 118580 344573 292656 207210 254850 224242 105768
13201 105768 199685 152815 -34436 -54519 71290 75416 -52693 20999 337044 219316 142076
13190 142076 220676 -33048 -81450 -16788 -193176 -321869 -187848 -93736 -81240 -14571 -151604
13179 -151604 -158465 104358 44350 -18956 -49744 16118 77400 165174 -121611 -327650 -225803
13168 -225803 175911 310735 280279 175755 248932 395982 323093 250178 -118657 -457153
13158 -457153 -505003 -396572 -385154 -260916 52454 268173 -38371 -367968 -541273 -261636
13148 -261636 -145139 -163453 -225902 -199922 17987 -56796 -124098 71851 244655 220094 244380
13137 244380 276949 113937 155530 100999 -50568 -61423 11078 597 -25778 -33947 -7229
13126g229n7563K3545j83047N7423K37532p2704j12780q0639J60847L9411j44975
13115a40179o3880K21842R4852k41702j03890q3686M8861j25947L59684q2895
13105a16940j61671J56906K42246K00877R8892p2278p3149N3267r4089j15035
13095A19026k7041q2328J28880P722l620j14013r5402r5658l5786K21212O6046
13084H9038l22734k12823L36827J6917J00493O0890j52375J30435J70113M2226
13074B59007l22605Q4764K09476j1991J32636j02312j88878O3393R396k01882
13064f8996j54919J23992r8861l0726o7684K3646j90580K9206L27807p3769r0882
13053b71766K41732M70529o6636j86732l47744k24244J01500M4241m0933J32646
$$ plain form
13126 -7229 -64792 -41247 -224294 -166871 70661 -2043 -114823 -195462 -34615 4796 -140179
13115 -140179 -204059 17783 112635 -129067 -232957 -316643 -267782 -393729 -34045 -116940
13105 -116940 -278611 -121705 120541 321418 420310 348032 274883 328150 234061 119026
13095 119026 91985 9657 138537 146259 142639 28626 -66776 -162434 -198220 22992 89038
13084 89038 -233696 -446519 -109692 -92775 7718 68608 -83767 46668 216781 259007
13074 259007 -63598 21166 230642 218651 351287 248975 60097 123490 132886 -68996
13064 -68996 -223915 -99923 -198784 -229510 -297194 -273548 -464128 -434922 -107115 -180884 -271766
13053 -271766 -30034 440495 373859 187127 -160617 -384861 -283361 -239120 -280053 -147407
13043a47407J94456J5529k37455j49148J4031N9665N8847J85349l5118J63584
13033A22333k394k0183J02234n1347r4207p0125j7856P5625k4981n1469K6489
13022e881K63668M6654q0587Q4442O0718K0790K68703j67639m37566m22140Q5751
13011b83087K92699N9440j56069M3938P713Q6557K90155J17351J18998j2518r7894
13000D67283m22761l42453m2372K6891j19781J876K18679K89469J61166K28019
12990D66016o9078j70567l05366k36613o6282l4511L21256J13643j42563k84680
12980d08745J48897K22778L2813r6212j01238j1440k42097j887J34953L01539
12970b0639K30407K3608o9997O3435J35410j8539J00294L9150j88854j92488l24223
$$ plain form
13043 -147407 47049 62578 -174877 -324025 -309994 -250329 -191482 -6133 -41251 122333
13033 122333 119939 99756 201990 150643 56436 -13689 -31545 44080 19099 -32370 -5881
13022 -5881 257787 304441 223854 308296 369014 389804 658507 490868 53302 -368838 -283087
13011 -283087 9612 69052 -87017 -43079 -35366 51191 341346 458697 577695 565177 467283
13000 467283 44522 -297931 -340303 -313412 -433193 -431317 -212638 76831 237997 466016
12990 466016 396938 226371 -78995 -315608 -381890 -416401 -95145 18498 -124065 -408745
12980 -408745 -259848 -37070 -4257 -100469 -201707 -213147 -455244 -457131 -322178 -20639
12970 -20639 209768 233376 163379 226814 362224 343685 443979 483129 294275 101787 -222436
12959b22436o9083P8555J21183M5382k5868J33116k8679k04405k2507r9051O4336
12948b29457J96964L04235K42310l07538k28004k7244K5904J79826j23896j8436
12938A4664J20552j61782k02332m4539P4156P8423J30157o2269j55117J44979
12928f3108o1223j326m5509K18985O3241O3396J76640q9745j86487Q3554O6202
12917B24620j43027j27183L7899K74089L4482O5584k12815j26072P8190p3412
12907C2355j97622J6961M0119N7628J09826j1440j3677J80593K7683j57627l15358
12896b30559K62741J21641k68835j17403N8357J51833J03940r3328R1515J42417
12886B22319r0532m7657J90910k5791J19479Q6395j19299k59090L432K57398o0661
$$ plain form
12959 -222436 -291519 -212964 -91781 -46399 -72267 60849 32170 -172235 -194742 -293793 -229457
12948 -229457 -32493 271742 514052 206514 -21490 -48734 -22830 156996 33100 14664
12938 14664 135216 -26566 -228898 -273437 -199281 -120858 9299 -52970 -208087 -63108
12928 -63108 -124331 -125657 -171166 47819 111060 174456 351096 261351 74864 158418 224620
12917 224620 81593 -45590 -7691 266398 300880 366464 153649 27577 105767 32355
12907 32355 -165267 -148306 -108187 -50559 59267 47827 34150 214743 242426 84799 -230559
12896 -230559 32182 153823 -115012 -232415 -174058 -22225 81715 -11613 79902 222319
12886 222319 131787 84130 275040 249249 368728 455123 335824 76734 80166 337564 276903
12875B76903j10844P5657M4892K2916l4128J22517n3870q3396l5488j73798j4
12864E1347J68312r3226l2610n6656N6970m6012M2927j91847q0746J19878J47366
12853H5703k6768J48948P0124j30547J70988j40525p779j52947j00161P4048N0999
12842D2083K73647r2825k56233j95085J06759J34190j11169j34932J69J27312
12832a06084P5717K41282J20911j93076l3483J44538J53034k49812l38369J09286
12822g6056K26394J62301j51378j87191l14484k18428K37001K89313L25P5432
12812D3229M9827Q2814k5236J61279p8552k64007J69421O4974m5161J28152j98564
12801H8176l18039J2200J45333o9990n74j58265J21707J12976Q3348J3278l881
$$ plain form
12875 276903 166059 241716 286608 309524 275396 397913 344043 260647 225159 51361 51347
12864 51347 219659 126433 93823 37167 94137 48125 91052 -100795 -181541 -61663 85703
12853 85703 58935 207883 278007 147460 318448 177923 170144 17197 -82964 -8916 42083
12842 42083 315730 222905 -33328 -228413 -121654 12536 -98633 -233565 -233396 -106084
12832 -106084 -30367 210915 331826 138750 105267 249805 402839 153027 -185342 -76056
12822 -76056 150338 312639 161261 -25930 -340414 -558842 -321841 -32528 -32203 43229
12812 43229 93056 175870 150634 311913 233361 -30646 138775 203749 158588 286740 88176
12801 88176 -229863 -217663 -72330 -142320 -142894 -301159 -179452 -66476 16872 30150 26269
12790B6269J68519K18016j24479j23104j92863q5558J48110J33536k68561J9468
12780h0647Q9239j29089m1697J06713L66787o9442m95486k13115j8291K15595
12770b69433J55525J17456N0205Q8785l8271q8664J2780J85657O9986l46434J9235
12759d3173Q9443j37449J63191N2248j89424r0024p6244o9863L44499P8994J08953
12748B31151m618j02180P7217J36367n9573j54466o7956q9979k90785L7566J12512
12737a74744M1481j17574L8993K40329l2776r5794Q4580K21460K2602r2720Q0416
12726B16253j05024J9969k2031K9674q3429j4049L0491M996M930p1833j46764
12715a36817N2890N5804k2423k04551j27446L7661n5686k6404J04946K50151M62096
$$ plain form
12790 26269 194788 412804 288325 165221 -27642 -113200 34910 168446 -100115 -80647
12780 -80647 8592 -120497 -162194 -55481 311306 241864 -253622 -466737 -485028 -269433
12770 -269433 -113908 3548 53753 142538 104267 15603 28383 214040 284026 -62408 -43173
12759 -43173 46270 -91179 72012 124260 -65164 -155188 -231432 -301295 43204 122198 231151
12748 231151 226533 124353 201570 337937 278364 123898 55942 -34037 -324822 -287256 -174744
12737 -174744 -133263 -250837 -211844 28485 -4291 -100085 -15505 205955 228557 135837 216253
12726 216253 111229 131198 109167 138841 55412 41363 71854 76850 81780 9947 -136817
12715 -136817 -83927 -28123 -50546 -255097 -382543 -344882 -400568 -426972 -322026 -71875 390221
12704C90221R9713l3947J04812j0372K5374j19100j45662l55232r7871J24559
12694a7505M54097O2666j80721k36588J11016j70572l55201l1522K03161L6630
12684a24539j60568J4677K54625j09905P6413j44865J40507O8065p8765O2287
12674b068q267Q8773J11528K55382j19264l21120N6935K95144q7733k50518M4187
12663F2979J76281M288k6341j46156P0623K17637J11561k13443j80264K31924
12653C09089k1655J1929q4206o7772n8274J49629j2383k63709j45104R6438j99863
12642b85881n6333L10324K12327k802m6979k5508J65522j31373J1340K4782j09265
12631F6154p591M544m8431o8632j4554K00347M6422k1496k04979n157J6251K872
$$ plain form
12704 390221 489934 455987 560799 550427 575801 456701 311039 -44193 -142064 -17505
12694 -17505 436592 499258 318537 81949 192965 22393 -332808 -364330 -161169 -124539
12684 -124539 -285107 -270430 -15805 -125710 -49297 -194162 -53655 14410 -64355 -2068
12674 -2068 -10335 78438 189966 445348 326084 4964 61899 357043 269310 18792 62979
12663 62979 239260 243548 217207 71051 141674 359311 470872 257429 77165 309089
12653 309089 287434 299363 215157 147385 89111 238740 226357 -37352 -182456 -86018 -285881
12642 -285881 -342214 -31890 180437 177635 130656 105148 270670 139297 150637 175419 66154
12631 66154 58563 63107 14676 -53956 -68510 131837 178259 156763 -48216 -53373 -37122 -34250
12619c4250K03899K40641P8194j39909l89512p4334j21283j06766L00998K58403
12609B16081J76502k95605m9572j34191o492m7790j10497J7432O5445J72112K18800
12598B22225L4605K42422K3672q6298l80650K5423R2851q5066N492j19497k8980
12587e3801O3576n8292K13565J01964j05753J59453K01598J65593l7662n1353
12577E98888R2351k31502j67485J54308k21878l4268k1695J4349J34413J5644
12567C33125j66207l12922m5825q238K71312k3770q3831j8510P6476J15364K89106
12556D26080r768j8884R6489k50413K2957J11402P2374j78640k86088o7806J73417
12545I1120M02491j31936k0158n5952k97007k37921k72382K10813J00419J13579
$$ plain form
12619 -34250 169649 410290 488484 348575 -40937 -115271 -236554 -343320 -42322 216081
12609 216081 392583 96978 47406 -86785 -93277 -141067 -251564 -234132 -168687 3425 222225
12598 222225 256830 499252 522924 436626 55976 81399 174250 89184 94676 -24821 -53801
12587 -53801 9775 -48517 165048 267012 161259 320712 522310 687903 650241 598888
12577 598888 691239 459737 292252 446560 224682 190414 168719 183068 317481 333125
12567 333125 166918 -146004 -191829 -200067 71245 47475 -36356 -54866 21610 136974 426080
12556 426080 416312 397428 493917 243504 266461 377863 450237 271597 -14491 -82297 91120
12545 91120 493611 361675 341517 285565 -11442 -249363 -521745 -310932 -210513 -96934
12535i6934O0818k0973J3260j09032j56518K89006J33531N5739j03952k33127
12525a68182O8682L25786j6378l52207K5696K68730P8572k78119J73349J44753
12515B70682M1122R8966L8389j87569j10089K7733r5432R007Q9366q9396N2151
12504A44930Q0360K03351J13104N1629j63896J2173J23809j31570j88457j24880
12494A20553m0692K31102R7626j28128m9861M2591J1140O1067R0445J26961j12894
12483D49910j43029k46134k32889j45778K31694O5459j59633Q6858J34089j19607
12473g9060j15460P5113O81K47813Q5959r134r7875k55987O0438K8795k2821J99648
12461A18110Q6576O8874j00985j4831m1799r9802j65445Q0221k0457J57012K42233
$$ plain form
12535 -96934 -36116 -57089 -43829 -152861 -309379 -20373 113158 168897 64945 -168182
12525 -168182 -99500 226286 209908 -142299 -116603 152127 230699 -47420 125929 270682
12515 270682 311804 410770 449159 261590 151501 179234 83802 92809 182175 92779 144930
12504 144930 225290 428641 541745 593374 429478 441651 565460 433890 245433 120553
12494 120553 79861 310963 408589 280461 230600 273191 284331 345398 435843 562804 449910
12483 449910 306881 60747 -172142 -317920 -86226 -20767 -180400 -93542 40547 -79060
12473 -79060 -194520 -119407 -118726 129087 215046 205912 108037 -147950 -87512 -58717 -81538 118110
12461 118110 204686 273560 172575 157744 115945 16143 -149302 -69081 -89538 67474 309707
12450C09707r2115k44771J10794O0732M229l6920k10054J9464k0352j93717j84474
12439d77477l2678M4460J68046K8106J8414L1394J59817M26262L280k03295Q255
12428A74584p1499k03749o8499o5413O713J99047O4239j8545K29501j43337r8661
12417D381K7089j6155k27328n3228p507L5234Q3659j43002Q9887J39606j02817
12406a70181k00904J24426K70711J78968l0186j41807k5048J15772l6021j48072
12396f2342L2479J93965j10386j14339L4463O3812k22918m5516K38002p9683j00852
12385a73315L2328Q5227n5238q0685l117M7369P0777Q8009R8657o9806j78225
12374a38019j28471l4688K87053J67455j08768M4082O8242p0133n2697l5676J20025
$$ plain form
12450 309707 217592 -27179 83615 144347 148576 111656 -98398 -78934 -99286 -293003 -477477
12439 -477477 -510155 -465695 -297649 -269543 -251129 -219735 -59918 366344 369624 166329 174584
12428 174584 103085 -100664 -169163 -234576 -227863 -28816 35423 16878 246379 103042 4381
12417 4381 31470 15315 -212013 -265241 -272748 -237514 -153855 -296857 -206970 -67364 -170181
12406 -170181 -371085 -246659 24052 203020 172834 31027 5979 121751 85730 -62342
12396 -62342 -29863 164102 53716 -60623 -26160 37652 -185266 -230782 7220 -72463 -173315
12385 -173315 -140987 -55760 -110998 -191683 -194800 -147431 -76654 11355 110012 40206 -138019
12374 -138019 -266490 -301178 -14125 153330 44562 88644 156886 86753 34056 -1620 118405
12363A18405l9413k39382P3099J92262M7830n9136K05631J20702K4949K07872
12353F52819J0209j62298j65554q4635k6336j41643J1497L09358l7894k8244J86279
12342E23558l9139l52119R7404L30948N3553j04760j17046k25047O033K658J66718
12331C42761O0752j74106k12124J33323m3402K45116j18094k9786P5834p7682
12321B02592j31074O0915R8343l0422R6436J6076j48326J28411M9723j61367J42628
12310C23935K60438k7377r3829j6743P9499L0856j331J72335Q8509j01920l96107
12299C18265k90733r2557N664q5676l6119J52964n3402P0526M2784j35703j26269
12288b30256M3620J46754K76101J29537j60958j30960j3600p7773R2538o6460
$$ plain form
12363 118405 78992 -160390 -87291 104971 152801 93665 299296 419998 444947 652819
12353 652819 663028 500730 335176 250541 224205 82562 94059 403417 365523 337279 523558
12342 523558 484419 132300 229704 560652 614205 509445 392399 167352 173385 176043 342761
12331 342761 403513 229407 17283 150606 107204 352320 234226 204440 280274 202592
12321 202592 71518 132433 230776 200354 296790 312866 164540 292951 342674 181307 323935
12310 323935 584373 556996 463167 446424 525923 556779 555448 727783 816292 714372 318265
12299 318265 27532 -65025 -59361 -145037 -181156 -28192 -81594 -11068 31716 -103987 -230256
12288 -230256 -186636 -39882 236219 365756 204798 73838 60238 -17535 75003 8543
12278H543q9584K17314J77031K29722O2337l25586k52107l0262J02049Q7136p4176
12267A12417K2220J03052j56068J04108R4911J356k3695k19662j9718J03630j11410
12256A1141k6289L8506n4675O3011J39208M1473q082L8731J53530J45290l34596
12245B07248q3954p8523l3097R4885n8166P4358L18134K05604r0906m64235p2227
12234A9121j94593q3094J14979O21750J11865j96954j53138M3141J68813L8556
12224D90446Q6731J73845J8232n1j21455k10622p7267J68445p7492k0438P5632
12213E06006K30439K1476j48795L487o1690r9180j07309k59939J54544q3504N0700
12202B06235J79032m0935P8990J48734k3686j31340N6931K68212J20576r1550
$$ plain form
12278 8543 -81041 136273 313304 543026 605363 279777 27670 -2592 99457 186593 112417
12267 112417 134637 237689 81621 185729 280640 281996 258301 38639 18921 122551 11141
12256 11141 -15148 23358 -31317 31694 170902 212375 204293 243024 396554 541844 207248
12245 207248 123294 44771 11674 106559 48393 122751 440885 646489 555583 91348 19121
12234 19121 -175472 -258566 -143587 478163 590028 393074 239936 283077 451890 490446
12224 490446 577177 751022 769254 769203 647748 437126 359859 528304 450812 430374 506006
12213 506006 736445 757921 609126 612613 550923 451743 344434 84495 239039 155535 206235
12202 206235 385267 344332 423322 572056 548370 417030 473961 742173 862749 771199
12192G71199j08072k53123m4770J08444j96987j94426N9889J40144j07340j73532
12182A426N6121J97885L10197K2646o2633N690p5341Q8195K2473J24394J3411
12171G04464l31106n7176m5214K78158J35325k03978N3187J4136j0077R7485j23160
12160E12044J30559J15712k04307K5549J42998L9226j01293r7050N0484r4726
12150E19196O8949j43019J43103k9942j53669j39457r7728Q9505K14727p7512
12140C94153o8609J77935K12459q9371k81299j257L7368K56305J52643n2365j51679
12129E86283k80952N2348M9194j50849L0301J03908J87480J10520j39833P9157
12119F27557P281j21822j78498p393J32728L10922r1426o7882J49343J55777m1513
$$ plain form
12192 771199 663127 410004 365234 473678 276691 82265 142154 282298 174958 1426
12182 1426 57547 255432 565629 588275 525642 531332 455991 544186 566659 691053 704464
12171 704464 373358 316182 270968 549126 684451 480473 533660 547796 537719 635204 512044
12160 512044 642603 758315 554008 579557 722555 761781 660488 563438 613922 519196
12150 519196 588145 445126 588229 558287 404618 265161 167433 256938 471665 394153
12140 394153 325544 503479 715938 626567 345268 344011 381379 637684 790327 737962 586283
12129 586283 305331 357679 406873 256024 286325 390233 577713 688233 548400 627557
12119 627557 634838 513016 334518 327125 459853 770775 679349 611467 760810 916587 875074
12108H75074k02278j84054o4784J69210m5401j46367K73456L43847L0606k20328
12098H28981p2819j4713N0991j77909m1763K11481Q4149N6844L7549J06550N902
12087A075243k59474J29503k1659K11402Q3688p7151n3405O5434J28273L8723
12077A320577j40042J92664J50354L7434k71132j99691k47622j21922J48210j22664
12067G46166L9410j7054j66439N4242J67451J21191j51598j6268K02671K04835
12057A184607J84845j97207J8354O4447L24307K09397R1629j12176j48146K5614
12047A645671l4671P9318k27056j13457J68811J32985K97911Q727o8312q5037
12037A804890K2868m6328q2934k46435q9386L34260M47412r5394k75K8242K4843
$$ plain form
12108 875074 672796 488742 423958 593168 547767 401400 674856 1018703 1049309 828981
12098 828981 756162 741449 792440 614531 572768 784249 868398 925242 962791 1069341 1075243
12087 1075243 815769 945272 923613 1135015 1218703 1141552 1088147 1153581 1281854 1320577
12077 1320577 1180535 1373199 1523553 1560987 1289855 1090164 842542 720620 868830 746166
12067 746166 785576 768522 602083 656325 823776 944967 793369 777101 979772 1184607
12057 1184607 1369452 1172245 1190599 1255046 1579353 1788750 1880379 1768203 1620057 1645671
12047 1645671 1611000 1690318 1463262 1349805 1518616 1651601 1949512 1958239 1889927 1804890
12037 1804890 1827758 1781430 1698496 1452061 1362675 1696935 2144347 2048953 2048678 2076920 2101763
12026B101763k36455j50998Q8864k20845L43252K96476k34550L1531J79777N6483
12016B255298N3656k8133N7282j41017k22860J32226P0494N5242j62957J94515
12006B263746P0578O8224J70685K61356J34271l6236q5891r6932j58813r5768
11996B495220J85049J71248J73173L16822j18590q6635K03987N1304Q6002K22987
11986C700567J8984n6932M3858K03690Q8087m6669K213L38676M09384K13514p1310
11975D844062J7997m7172q944K36227J96207J60845K22146L00536L42419L18357
11965F582680J67987J57524J42501K31465L57418K56316K78423L01029L11673
11956H787016J6415L02729O70665L92347N12564L99194L79298O51231N21799O72794
$$ plain form
12026 2101763 1865308 1714310 1803174 1582329 1925581 2222057 1987507 2019038 2198815 2255298
12016 2255298 2308954 2280821 2338103 2197086 1974226 2106452 2176946 2232188 2069231 2263746
12006 2263746 2334324 2402548 2573233 2834589 2968860 2932624 2846733 2749801 2590988 2495220
11996 2495220 2680269 2851517 3024690 3341512 3222922 3136287 3340274 3391578 3477580 3700567
11986 3700567 3719551 3662619 3706477 3910167 3998254 3951585 3953798 4292474 4701858 4915372 4844062
11975 4844062 4862059 4814887 4805943 5042170 5238377 5399222 5621368 5921904 6264323 6582680
11965 6582680 6750667 6908191 7050692 7282157 7639575 7895891 8174314 8475343 8787016
11956 8787016 8803431 9106160 9776825 10169172 10681736 11080930 11460228 12111459 12633258 13306052
11946A3306052O40085O28544P31767P76183R79640P06869R94355J088308J188780
11937B1040583J408302J511746J559778J702414K049601K565754K835938K944894
11929C7619010L240855L589832M469901M791460N194011O102718P118021Q165177
11921H0290985R524755J0918522J2413799J3633498J5465441J6877704J8107558
11914A77232262J8466852J7813996J5946091J3218059R628026N540581L52463
11907B58198330n077357r843747j3956643j6308913j7008075j7146035j6716561
11900A62140999j5344672j3691679j2030930j0807224r518361q451928p164975
11893H5131230o263575n488277m981029m625378l787266l398661l273983l023368
$$ plain form
11946 13306052 13946137 14574681 15306448 16082631 17062271 17769140 18763495 19851803 21040583
11937 21040583 22448885 23960631 25520409 27222823 29272424 31838178 34674116 37619010
11929 37619010 40859865 44449697 48919598 53711058 58905069 65007787 72125808 80290985
11921 80290985 89815740 100734262 113148061 126781559 142247000 159124704 177232262
11914 177232262 195699114 213513110 229459201 242677260 252305286 257845867 258198330
11907 258198330 253120973 243277226 229320583 213011670 196003595 178857560 162140999
11900 162140999 146796327 133104648 121073718 110266494 100748133 92296205 85131230
11893 85131230 78867655 73379378 68398349 63772971 59985705 56587044 53313061 50289693
11885E0289693k288096k186067k147731k059310j456623j651965j518441j412436
11877C5569024j325506j501541j244143j005461j002169j167100j266733q70109
11869B6186262r08518r16572q42874p40205o71881n33134p80007r19665o64295
11860A9209111n49353n62555k57219o06478n75966m48845l94147n28858l97289
11851A4888401l59243l36693k91407j83190k36598l90789l35977n66657k62514
11842A1925333l24144m11382k87250k64449k83706K0156k65173k28355k69624
11833I611406j00867m90906l90659J03806j91527m11736k56549j26473J19373
11824G865868j56085l46110l0362j08310m92309k15581n1737j34694R2146j02324
$$ plain form
11885 50289693 48001597 45815530 43667799 41608489 40151866 38499901 36981460 35569024
11877 35569024 34243518 32741977 31497834 30492373 29490204 28323104 27056371 26186262
11869 26186262 25277744 24361172 23518298 22778093 22106212 21573078 20793071 19873406 19209111
11860 19209111 18659758 18097203 17839984 17233506 16657540 16208695 15814548 15285690 14888401
11851 14888401 14529158 14192465 13901058 13717868 13481270 13090481 12754504 12187847 11925333
11842 11925333 11601189 11189807 10902557 10638108 10354402 10374558 10109385 9881030 9611406
11833 9611406 9510539 9019633 8628974 8732780 8541253 8129517 7872968 7746495 7865868
11824 7865868 7709783 7363673 7333311 7225001 6732692 6517111 6465374 6330680 6422826 6320502
11814F320502J36898J04922j60740l7384j83010l46697j48107q3423l18198k2604
11804E262159j80799k54899j00454o3132p8898l07457m5009O6406k83216j66339
11794C848362J6056J29398K4293L7174K4525p6521k94924n9655j71799j83534
11784C293375O9833J20812o2064J64671r9495j25593j25462j43374j32797k34625
11774B725281L0774M2407k24596j70263P8893j54543J88304J25432K44983j17218
11764B769454m12901j12472r1206q3170R7020k9399k62028k61302R568J68882
11754A792446k2539j74657M5123l4252p660j3899J55234J69252n8708j99045J6545
11743A667840r8045O3088K87997q2683j42760j58217M7022J8220p5153m8066k62326
$$ plain form
11814 6320502 6457400 6562322 6401582 6364198 6181188 5834491 5686384 5602961 5284763 5262159
11804 5262159 5081360 4826461 4726007 4662875 4583977 4276520 4231511 4297917 4014701 3848362
11794 3848362 3864418 3993816 4018109 4055283 4079808 4003287 3708363 3648708 3476909 3293375
11784 3293375 3363208 3484020 3421956 3586627 3487132 3361539 3236077 3092703 2959906 2725281
11774 2725281 2756055 2798462 2573866 2403603 2482496 2327953 2516257 2641689 2886672 2769454
11764 2769454 2356553 2244081 2152875 2069705 2166725 2137326 1875298 1613996 1623564 1792446
11754 1792446 1769907 1595250 1640373 1606121 1598461 1584562 1739796 1909048 1850340 1651295 1667840
11743 1667840 1569795 1632883 1920880 1838197 1695437 1537220 1584242 1602462 1527309 1479243 1216917
11732A216917J11641J59022J6658k83526K127L1394j57629M756K5762O8271K05248
11721A400641R4557Q4871Q873r3366j56104j70044m9917O7358p2899k44232P649
11710H77387j6234q4867m5202J44064m2553r5491J86151K6039J9352N2302k37051
11699G83897j80766J06218j40630K14795m924l4412k8061k9689j8692O1030q9382
11688F39384j15990j4604J57878l4056Q2426N5887k09478o8957J57437K8663M742
11677F83332N5734R5155J0731p3234j05760J2254P091j55143J45897J74229P0993
11666I21279j49022K3109j74360j51717R2922j45399n879J93043Q4860j14025
11656E74811r396N8493j3428j68423n9759p9227q1440L5079L61595j5655K726
$$ plain form
11732 1216917 1328558 1487580 1504238 1220712 1222839 1254233 1096604 1101360 1127122 1195393 1400641
11721 1400641 1495198 1580069 1588942 1495576 1339472 1169428 1119511 1186869 1113970 869738 877387
11710 877387 861153 776286 731084 875148 832595 737104 923255 949294 968646 1020948 783897
11699 783897 603131 709349 568719 783514 778590 744178 716117 686428 667736 728766 639384
11688 639384 523394 508790 666668 632612 715038 770925 561447 492490 649927 678590 683332
11677 683332 739066 834221 844952 771718 665958 678212 685303 530160 676057 850286 921279
11666 921279 772257 795366 621006 469289 562211 416812 410933 603976 688836 574811
11656 574811 565415 623908 610480 442057 382298 303071 221631 256710 618305 602650 605376
11645F05376j55722k76274j71724R6710K48520J99665J0444k32480j02570M1161
11635B63106P6356J2818Q4657j29312p944K84381K15155n8338k4787j47759j14135
11624D54198J0202K7116k6417O946R5436P4786j21541k59924K5303N2313j73169
11613A65249j08770l2678n0327O6203J31802J36191K40353J00300q7039J357n7957
11602E04684J07861k2781l4335l9496q1588j2123j06348N0461j48533P0006j17753
11591A70055k73227R5485M25426q3294n9835l3338o6822J98150J69144l1876k10618
11580B99250j69953J20592J22038j74964K7798L5623k43661l5113Q9681K05703
11570B76994J99680J92240J08636l2644k86554j29284J72382L14217k22853k80708
$$ plain form
11645 605376 449654 173380 1656 98366 346886 546551 556995 324515 221945 263106
11635 263106 339462 352280 436937 307625 299681 584062 799217 740879 716092 568333 454198
11624 454198 464400 491516 465099 472045 567481 642267 520726 260802 286105 338418 165249
11613 165249 56479 23801 -26526 39677 171479 307670 548023 648323 561284 562641 504684
11602 504684 612545 589764 555429 515933 434345 422222 315874 366335 217802 287808 170055
11591 170055 -103172 -7687 417739 334445 274610 241272 174450 372600 541744 509868 299250
11580 299250 129297 249889 371927 196963 224761 260384 16723 -18390 71291 276994
11570 276994 476674 668914 777550 744906 458352 329068 501450 815667 592814 312106
11560C12106k23355L4732m2966J32637J58099r6109j53018m6043r493O5533J38527
11549B70650Q1483J25027p1298j54550q6815K6219k8913k70042j92072M3918P6045
11538a80348R6798J00540j13558o9995P1365J04380J65500M565J3331j82809J2650
11527B2419J42723O444J26307J51858j636l30281j72350J02890J40098L5149N6765
11516B80386k6981J35549J30864r1997k23949k27146P0210N2758J55447R1453
11506C46594K23219m1905j98777j40012j9134P5751M3200O9791j18623n0328k17202
11495b7426n9924K51252j1218l3732k4020J77414l5408m6447J07574r1831j24164
11484H2070P7171j43605q9138j63469L5459p4321K24108K02225n504N9886P1119
$$ plain form
11560 312106 88751 123483 80517 213154 371253 275144 122126 76083 66590 132123 270650
11549 270650 352133 477160 405862 251312 164497 190716 161803 -108239 -300311 -256393 -180348
11538 -180348 -83550 16990 -96568 -166563 -95198 9182 174682 179247 192578 9769 22419
11527 22419 165142 171586 297893 449751 448115 117834 -54516 48374 188472 223621 280386
11516 280386 253405 388954 519818 427821 203872 -23274 46936 99694 255141 346594
11506 346594 569813 527908 329131 189119 169985 245736 288936 358727 240104 189776 -27426
11495 -27426 -87350 163902 152684 118952 94932 272346 236938 190491 298065 206234 82070
11484 82070 159241 15636 -73502 -236971 -201512 -275833 -51725 150500 144996 204882 276001
11473B76001R9772l06550k18234J47041P9765J9270j0290N3934q4061r9176L8512
11462d016k4736p8245L15172J01355L9324Q7403k73780k10615j46961L3971K01735
11451D0607r7066N7777m9772j76950j64825K17407K56810J76829l632J31934k32424
11440A56695k75027J08246O976M8020M6776j49612K07040J8669n4831J73002K79032
11429E64986j49455k34743k64198j24283L49530J10676l8948l0188j03634K63641
11419C43384P0896r3491j89335N8967j08531j66555R3236Q0310K22211r7171q652
11408B05269R5103J86892o3233j36404j50762P225k10900R5661J72072k06896
11398e973Q6777r6059k3802m3082K654P3876l8532J2461M6219J09449o7086J46510
$$ plain form
11473 276001 375773 69223 -149011 -1970 77795 97065 86775 140709 56648 -42528 -4016
11462 -4016 -28752 -106997 208175 309530 348854 436257 162477 -48138 -195099 -161128 40607
11451 40607 -56459 1318 -48454 -225404 -390229 -172822 83988 260817 257185 389119 156695
11440 156695 -118332 -10086 -3110 44910 91686 -57926 149114 167783 112952 285954 564986
11429 564986 415531 180788 -83410 -207693 141837 252513 213565 183377 79743 343384
11419 343384 414280 320789 131454 190421 81890 -84665 8571 88881 311092 213921 205269
11408 205269 300372 487264 424031 287627 136865 144090 -66810 28851 200923 -5973
11398 -5973 80804 -15255 -39057 -82139 -79485 -5609 -44141 -31680 14539 123988 56902 203412
11386B03412N8267M209j13141k09044J22179j01307R500J77888K19602n5506k80298
11375C5761l5475J38348n9492J3869r1884J90891K91098M3159k13870j91888k59561
11364a39044j7786P7838p9267J86946j11319P9790Q7074p1861j09295k03182O407
11353b93699Q5327O5707N9596L13181O2251j72263p5393J11866J6667J4797p3492
11342A14545O9968q2718k41807j36484J16254O3867O1929K66211J77735K2163
11332D31663j97815Q4380J0533O4187j75593N30j7444l1858K60427j65070k19483
11321D4457m4618K0493j9967M7876k17458J80553J02034j07886J32263j4446k0689
11310A02612q3047j78552R9324K10905p9865P5886J00803J89525j67840j49356
$$ plain form
11386 203412 261679 265888 152747 -56297 65882 -35425 -25925 151963 371565 316059 35761
11375 35761 286 138634 79142 93011 1127 192018 483116 526275 312405 120517 -139044
11364 -139044 -156830 -78992 -158259 28687 -82632 -2842 84232 12371 -96924 -300106 -293699
11353 -293699 -208372 -142665 -83069 230112 292363 120100 44707 156573 173240 188037 114545
11342 114545 184513 101795 -140012 -276496 -160242 -96375 -34446 231765 409500 431663
11332 431663 233848 318228 328761 392948 217355 217885 200441 168583 429010 263940 44457
11321 44457 -161 20332 365 48241 -169217 11336 113370 5484 137747 123301 102612
11310 102612 19565 -158987 -59663 151242 71377 147263 248066 437591 269751 120395
11300A20395k34875m3888J14160J7385Q3846l214J34057J42976l355J02063p3719
11289C55831Q0426j72548k80264k7988Q3507J01257j3454J7389J31498N5074j16624
11278B14104Q9724R9354k06033J33347J75391j19900j92651k6360j27128n5920
11268a6072j56106n6008J18789K19222o1635m7106J40334l2556l7582L8959R896
11257A20135L2597j14748q7671p2794L6481m795j352J60183m5425M5147J41026
11246B08784k7041o9142J7910Q6104J732r4906o4049P7254n6778N6720q4166j09483
11234e7061J19061O0193j20003R1115K28194j80645r1229l4810P4952n02R7353
11223A86618J22242j98898j51138L9408r3134J42320J29864J74869K40847k3627
$$ plain form
11300 120395 -114480 -158368 -44208 -26823 57023 53809 187866 330842 327487 429550 355831
11289 355831 436257 263709 -16555 -44543 38964 140221 126767 144156 275654 330728 214104
11278 214104 303828 403182 197149 330496 505887 385987 193336 166976 39848 -16072
11268 -16072 -172178 -228186 -109397 109825 48190 1084 141418 108862 71280 110239 120135
11257 120135 152732 37984 -49687 -122481 -86000 -90795 -92147 68036 22611 67758 208784
11246 208784 181743 112601 130511 216615 218347 123441 59392 136646 79868 136588 52422 -57061
11234 -57061 62000 122193 2190 93305 321499 140854 49625 14815 89767 89265 186618
11223 186618 308860 109962 -41176 -1768 -94902 47418 177282 352151 592998 569371
11213E69371p2999j720j75138o7587r8007j65630J50925K37510J11701J35926
11203F24352k43211k10787j3481J1516Q7486J63338k62226j47436n6022J3792
11193c2679R6843j91543N4146J24366J13574L4530j68299l9143K81536M70857
11183G44188J06553l44629j64942k26001j14588l0320J12957P617k2808R7137
11173A65164r6046L4843J03523n1515L6819J0022j07402j24935K03919j02648
11163G1744J71752M5740m8832N1085k3956J18434L14205P5858j41449J27041j14160
11152F47462r9582o9657J364J43312q3516l6123J7663J17984j89949j50588O3457
11141C61827q6120l2628J11250j2912J15866k1918J05666k26206j57592J52993
$$ plain form
11213 569371 496372 494652 319514 251927 153920 -11710 139215 376725 488426 624352
11203 624352 381141 170354 156873 168389 255875 419213 156987 9551 -46471 -32679
11193 -32679 64164 -127379 -73233 51133 164707 199237 30938 -8205 273331 744188
11183 744188 850741 506112 341170 115169 581 -29739 83218 90835 68027 165164
11173 165164 69118 103961 207484 155969 192788 202810 95408 -29527 174392 71744
11163 71744 243496 289236 240404 291489 267533 385967 700172 776030 634581 761622 647462
11152 647462 547880 478223 479587 622899 539383 503260 520923 638907 448958 298370 361827
11141 361827 275707 243079 354329 341417 457283 435365 541031 314825 157233 310226
11131C10226j94401j34340J14882J29469N1998K660J17580k3527k47793J10273
11121B37027O5940l8885k49432o6299J37982j26420q9034J65986M9193k2620j67921
11110a04483j64861K19962L6731M4158Q7213J27975O1670P3043J50773m7275l25204
11099A59702l32877R127L5214J43900L73607L4147k53297j04193p1522K2607J15539
11088A31954Q6327R5315J61206J1549J09546k10723n9853l5294N6875j49725j54192
11077D2985k4445J97616Q0717j48912j63491o8520J09258Q8197k01372K26743
11067A38776M50719l10063k90283j93810m6150J95640m5449k0984J08401J29805
11057A16602L05120k39071J39196J53247j12597J00603J8865j86929j5059j8718
$$ plain form
11131 310226 115825 -18515 96367 225836 277834 280494 398074 374547 126754 237027
11121 237027 302967 264082 14650 -51649 86333 -40087 -129121 36865 86058 63438 -104483
11110 -104483 -269344 -49382 -12651 31507 118720 246695 308365 381408 532181 484906 159702
11099 159702 -173175 -164048 -128834 15066 388673 422820 169523 65330 -6192 16415 131954
11088 131954 218281 313596 474802 486351 595897 385174 325321 290027 346902 197177 42985
11077 42985 18540 216156 296873 147961 -15530 -84050 25208 113405 -87967 138776
11067 138776 589495 279432 -10851 -204661 -250811 -55171 -100620 -121604 -13203 116602
11057 116602 421722 182651 321847 475094 362497 463100 481965 295036 279977 261259
11047B61259J2468p5862n5589K33319K06269K39822j1447j63647j25943o2681
11037D57968J98368J19474J98015j10514l6305n1064m477K21397K9365o479K29506
11026A245254J10713N2631J94720R2580O5705k28943l49231j25968K62035J48708
11016A468204K35019J77808J89261p9131p8843k2597k28805l59745k21181j00749
11006I79241n431J39882J41084Q4518J20507j97922j28381J7157k0286m8830K9562
10995A111101k49671l0311N5186m4109j43772J02125J60586n6683j07603j2485
10985G84364j73744j01103k18643m8092k4061r1865Q3662J5857N0147R1375k5863
10974C42034k18337j49726m1717K49312K05349J19029o028r5333j1937J46133
$$ plain form
11047 261259 273727 197865 142276 375595 581864 821686 810239 646592 520649 457968
11037 457968 656336 775810 973825 863311 827006 775942 771465 992862 1022227 1015748 1245254
11026 1245254 1355967 1408598 1603318 1695898 1761603 1532660 1183429 1057461 1319496 1468204
11016 1468204 1703223 1881031 2070292 1991161 1912318 1889721 1660916 1301171 1079990 979241
11006 979241 973810 1113692 1254776 1339294 1459801 1261879 1133498 1150655 1130369 1081539 1111101
10995 1111101 861430 831119 886305 842196 698424 800549 961135 904452 796849 784364
10985 784364 610620 509517 290874 242782 218721 126856 210518 226375 276522 367897 342034
10974 342034 123697 -26029 -67746 181566 386915 505944 499916 404583 392646 538779
10964E38779k08413l359o5176J46762m2132k4775j74961l3595N3868J8819j0983
10953A94834L3594j33885J6534J35131N3459k44424o1991P7047P6862L27204N6578
10942E30943k75032J01434R1984m0216j38800j74808o7039J66386O461o4349L9339
10931A76303o8039m7726q8967j832J13105J61409K0910o1179j75422K3875n2344
10920I3p1904Q8502J79339L4130r8713k03126J69997K39594j52545k49113k36106
10909b99852J83121P6892R7895J08218J05141J9649O0747R3259l68257j46695
10899f9882J89942j6716J03231L2626j41146n2220Q0579q4993j68743K5698L72223
10888B70599J26619k49518k46970j44329M1877k09452J29345K04543J52561N4006
$$ plain form
10964 538779 330366 327007 261831 408593 366461 341686 166725 133130 186998 205817 194834
10953 194834 228428 94543 111077 246208 299667 55243 -6748 70299 147161 474365 530943
10942 530943 255911 357345 449329 409113 270313 95505 28466 194852 201313 136964 176303
10931 176303 108264 60538 -28429 -30261 82844 244253 265163 203984 28562 52437 93
10920 93 -71811 16691 196030 230160 131447 -71679 98318 337912 185367 -63746 -299852
10909 -299852 -116731 -39839 58056 166274 271415 291064 351811 445070 76813 -69882
10899 -69882 120060 103344 206575 239201 98055 45835 126414 41421 -127322 -101624 270599
10888 270599 397218 147700 -99270 -243599 -201722 -411174 -281829 -77286 75275 129281
10878A29281j09009J43208l9462k16369J2279L93629j11390K6033k1415j87115
10868A9670r5525j3603J03465J80261k57454Q9833L59698K0677k01996j21628
10858H3398J95219J32218J1309k16375J49349N1750J3110J65936K62994J89355
10848A038263K40100j41281l290n3250j1844j69124P7684J25784k63399j96767
10838F42876J20672R9575k06454P6490N0075j69159J9453J11416J3815l1806o3712
10827F63241K1128R2253j46143j07876q096j6220k4712n9787j57781m1646P3086
10816B87447P7364K1966L60404M08057J17525j00423r5563J51139q1299j65689
10806I80928j16641O1876L90551L81100j86327j13293j00766J9711P6499m3896
$$ plain form
10878 129281 20272 163480 124018 -92351 -80072 313557 202167 228200 206785 19670
10868 19670 -75855 -89458 14007 194268 -63186 26647 386345 407022 205026 83398
10858 83398 278617 410835 422144 205769 355118 406868 419978 585914 848908 1038263
10848 1038263 1278363 1137082 1133792 1080542 1068698 899574 977258 1103042 839643 642876
10838 642876 763548 863123 656669 733159 783234 614075 633528 744944 758759 726953 663241
10827 663241 684369 776622 630479 522603 514507 498287 473575 413788 256007 214361 287447
10816 287447 364811 386777 747181 1155238 1272763 1172340 1076777 1227916 1146617 980928
10806 980928 864287 926163 1316714 1697814 1511487 1398194 1297428 1317139 1393638 1349742
10796A349742K7909K14399j64606p2905J28923k67096N0419J19309j07394M3651
10786A322351L4063q1237j13963k29127p8663j5084R0933k5779J9846J1146j52571
10775G81915j89989k48990j57619J05648J29630o9287K27936K61227J01566q7422
10765H54615k04011l41930n1062K6243L39402m6530J13079K41461K0763j36071
10755H15959r0264M4023K07463J31458J33316J40585Q1867J71674K2782j16476
10745A542387L5691Q2222j90353J3977M6976m5980k88681K8938L6267M5793J8174
10734A325411k17842j28156j7019m9779K6023k26627J18655P0214q7953J21382
10724I34309j0163j88425J01080M4425l5130k521J92848m3942j7464m4501p0522
$$ plain form
10796 1349742 1377651 1592050 1427444 1354539 1483462 1216366 1266785 1386094 1278700 1322351
10786 1322351 1356414 1275177 1161214 932087 853424 838340 929273 903494 923340 934486 781915
10775 781915 591926 342936 185317 290965 420595 351308 579244 840471 942037 854615
10765 854615 650604 308674 257612 283855 623257 576727 689806 931267 952030 815959
10755 815959 725695 769718 977181 1108639 1241955 1382540 1464407 1636081 1658863 1542387
10745 1542387 1578078 1660300 1469947 1483924 1530900 1484920 1196239 1225177 1261444 1307237 1325411
10734 1325411 1107569 979413 962394 912615 938638 712011 830666 900880 812927 934309
10724 934309 924146 735721 836801 881226 846096 843575 1036423 992481 975017 930516 859994
10713H59994n4737Q2537K6369M20022l1168p8999J34481J36089K84713j57760
10703A621541k46667k54059l3210J38430j5227K23375K16355j81540P4715n9308
10693A484405k54983n9039n1602J38223K4223K5225K61863K36980k0233l69339
10683A415723j12611j85392K00155O6611j07994M5456L88736K43411j60305l22112
10673A471678m8054j08231l19564L4064L17696K82411J82469P0673o3049j84816
10663A635277J53102J68184k7376K2360J22269Q5875R9757J59809J64980j16796
10653B467441j22757J89055J98397K15362r3645J86099K82395J29634L5964J24180
10643C612125q0842k03544J02066L83288L64312J96009j0692R6008J44734K10916
$$ plain form
10713 859994 805257 887794 914163 1334185 1303017 1224018 1358499 1494588 1779301 1621541
10703 1621541 1374874 1120815 1087605 1226035 1210808 1434183 1650538 1468998 1543713 1484405
10693 1484405 1229422 1170383 1118781 1257004 1281227 1306452 1568315 1805295 1785062 1415723
10683 1415723 1303112 1117720 1317875 1384486 1276492 1321948 1710684 1954095 1793790 1471678
10673 1471678 1423624 1315393 995829 1029893 1347589 1630000 1812469 1883142 1820093 1635277
10663 1635277 1788379 1956563 1929187 1951547 2073816 2159691 2259448 2419257 2584237 2467441
10653 2467441 2344684 2533739 2732136 2947498 2853853 3039952 3322347 3451981 3487945 3612125
10643 3612125 3531283 3327739 3429805 3813093 4177405 4373414 4362722 4458730 4603464 4814380
10633D814380L38342R9759K3035O96588P83498M25041K06191L57067Q17780Q29872
10623I391553R60397R12191J033415J241219J461910J812626K345075L370328
10615B2528714M255708N649505P405452R018229R945095R629482Q986305Q821661
10607H6240151Q983274Q462259O237706K598114J157503L569350P931370J2767669
10599A37947396J5547846J4979406J3340313J3193563J4544024J2988375N519078
10592B28060001m632919q898842m656416L912344J2392804J6624317J5380157
10585B58181446J2452466J1986436J2963684R196380l641077j9641234k6063867
10578B55434234k1176644j1314694k645902J628191K036445J619021K348387K923923
$$ plain form
10633 4814380 5152722 5252481 5275516 5972104 6755602 7180643 7386834 7743901 8561681 9391553
10623 9391553 10351950 11264141 12297556 13538775 15000685 16813311 19158386 22528714
10615 22528714 26784422 32433927 39839379 48857608 58802703 68432185 77418490 86240151
10607 86240151 95223425 103685684 109923390 112521504 113679007 117248357 125179727 137947396
10599 137947396 153495242 168474648 181814961 195008524 209552548 222540923 228060001
10592 228060001 223427082 214528240 209871824 213784168 226176972 242801289 258181446
10585 258181446 270633912 282620348 295584032 304780412 301139335 281498101 255434234
10578 255434234 234257590 222942896 220296994 221925185 223961630 225580651 227929038 230852961
10570B30852961l75758r763525j9635375k3032411j8950831j2539265p449182
10563A39106614m075505k820859k769722k732338k929461m356490q193605j2076121
10555I9152513j3125515j1614882r186839p185928n590486m244435l349009k864702
10547D1990717k439931j866744j469706j616837j548402j427180j199594j169326
10539B9252997j081921j007811r53619j005008p18740o40480o51452p88656o71906
10530B1733404n62943o63239q10172k79977l66198q83561m64938m04994k71564
10521A7025818l50184n96652n57524n80344l90970m75371l76714k1178m25398
10512A3251483m91342l69048j13019l62088m51867l19334l15397j95290k43274
$$ plain form
10570 230852961 230477203 220713678 201078303 178045892 159095061 146555796 139106614
10563 139106614 135031109 132210250 129440528 126708190 123778729 119422239 111228634 99152513
10555 99152513 86026998 74412116 65225277 58039349 52448863 48204428 44855419 41990717
10547 41990717 39550786 37684042 36214336 34597499 33049097 31621917 30422323 29252997
10539 29252997 28171076 27163265 26209646 25204638 24485898 23845418 23193966 22405310 21733404
10530 21733404 21170461 20507222 19697050 19417073 19050875 18167314 17702376 17297382 17025818
10521 17025818 16675634 16078982 15521458 14941114 14550144 14074773 13698059 13676881 13251483
10512 13251483 12760141 12391093 12278074 11915986 11464119 11144785 10829388 10634098 10390824
10503A0390824m83778j55020K7128j41610l22174k14813l43450K180m0324j07156
10493H611807l43898k44731N463o0913l84379r0458o9967m07361j35145O5280
10483F945698J88378l02630n00589K1852P3420q6804l39200l65387k29366n3193
10473E352179K9993n120k84074j66651Q21m8445k35986J07315R4385k4020l10036
10462D510361q9233j93490j32836k20147j8457k07973j73166l16048o8213Q9076
10452C179874J38631o826L0760l4927k31300m9026M2347k78599j59280P233N7419
10441B696306o0282k68978q7458P4613k00956p7337K30952J6985L3642j57683
10431B199804j11729P3034N3117j02509N3369L8705m7156k31026J64854o2940
$$ plain form
10503 10390824 9907046 9752026 9779154 9637544 9315370 9100557 8757107 8759287 8718963 8611807
10493 8611807 8267909 8023178 8028641 7967728 7583349 7492891 7422924 7015563 6880418 6945698
10483 6945698 7134076 6831446 6330857 6352709 6426129 6339325 6000125 5634738 5405372 5352179
10473 5352179 5382172 5377052 5092978 4926327 4927148 4878703 4642717 4750032 4844417 4820397 4510361
10462 4510361 4421128 4227638 4094802 3874655 3856198 3648225 3475059 3159011 3090798 3179874
10452 3179874 3318505 3311679 3342439 3307512 3076212 3027186 3069533 2790934 2631654 2638887 2696306
10441 2696306 2636024 2367046 2279588 2354201 2153245 2075908 2306860 2323845 2357487 2199804
10431 2199804 2088075 2161109 2214226 2111717 2165086 2203791 2156635 1925609 2090463 2027523
10421B027523j73496j65480j4222q3094j81969k05833m6779Q8159L04103o1582
10411A487330o1291K77394L05284j60026k71256k21476K6646J37293L00274n9095
10401A761077k84631M2516K39604l9934K8445q379j0956j63891j00778n9441k0461
10390A383171j03795j7366n3334K3604K08081j2444Q3627N2170j69755k39020
10380A154939k07042J6308J14737j60p3191j39301j3113M7016P8710j12001k02655
10369F64247j60054L1110J15214J96067J0851k98078J02981K23723j32335j90733
10359E62993k3462J25845J30508L2716K1823Q0448L9009J931j25079k88738j12153
10348D45841M3190j64277o5139J23913j34915j17380R7361j19210n2729K58077
$$ plain form
10421 2027523 1854027 1688547 1674325 1591231 1409262 1203429 1156650 1244809 1548912 1487330
10411 1487330 1426039 1703433 2008717 1848691 1577435 1355959 1382605 1519898 1820172 1761077
10401 1761077 1476446 1518962 1758566 1718632 1747077 1738698 1727742 1563851 1463073 1403632 1383171
10390 1383171 1279376 1262010 1208676 1232280 1440361 1427917 1511544 1563714 1393959 1154939
10380 1154939 947897 964205 1078942 1078782 1005591 866290 853177 900193 978903 866902 664247
10369 664247 504193 535303 650517 846584 857435 559357 662338 886061 753726 562993
10359 562993 539531 665376 795884 828600 850423 930871 969880 971811 846732 557994 445841
10348 445841 489031 324754 259615 383528 248613 131233 228594 109384 56655 314732
10338C14732n96k6905N3298K42569K7483p2249r5381l0929J65973r7637k27952
10327B52406k17081j04437j25731j327Q0758J82019J17036N3626m8854J97265
10317C85680q9413m4590J8375Q0553o4979p450j53017j59224m0149Q9658K26066
10306B41510L3578o8640Q0753R3120r6007m8681J6240Q497j58240n371j42907
10295d6148k05219J36816M20303K27476k10213k36699J19420P872O3933R6311
10285C73852j31091n863L7462J73320M9771k59894J81579Q2650m4262J994k00222
10274B59296k90220K27443M28214J77936K41354M23956K09173O6448M94060R17540
10264C155200R68869N69909M51622O89310M45526J35086P1149m68301o39911o10718
$$ plain form
10338 314732 314136 287231 340529 583098 610581 538332 442951 412022 577995 480358 252406
10327 252406 35325 -69112 -194843 -196170 -115412 66607 183643 237269 188415 385680
10317 385680 296267 251677 270052 350605 285626 278176 125159 -34065 -74214 15444 241510
10306 241510 275088 206448 287201 380321 284314 235633 251873 260370 102130 96759 -46148
10295 -46148 -251367 -114551 305752 533228 323015 86316 205736 213608 277541 373852
10285 373852 242761 236898 274360 447680 497451 237557 419136 501786 457524 459518 259296
10274 259296 -30924 196519 624733 802669 1044023 1467979 1677152 1743600 2237660 3155200
10264 3155200 4124069 4693978 5145600 5834910 6280436 6415522 6486671 6018370 5378459 4767741
10254D767741p19814n86860n00818l12177m38099n19421j22652j94863j28332
10245A244705k51894j78631k34834o7244q4479M7267J45208k76849r62J27513
10235D69800R0044L2398j07352j28290r4609k42077J90044K10297o9325l3638
10225C17292Q2742J66599p6416j67728j43266J03902l6581l3170J78783P2452
10215D64609j76434k06643j02262k0748j31892p3432J52946L46656J11613p8182
10205B86231j34262m4885R7754m3576J64315M9016o8260L7133J31517O4086k42533
10194B96536q3418J78751R4669j42930r0768k1259k2584n9925M0944o985j90579
10183g548j8716J05970o5777j22747q1569J81711N91595J13171j27764j03832
$$ plain form
10254 4767741 4047927 3461067 2960249 2648072 2209973 1690552 1567900 1373037 1244705
10245 1244705 992811 814180 579346 512102 427623 474890 620098 343249 342287 469800
10235 469800 559844 592242 484890 356600 261991 19914 209958 420255 350930 317292
10225 317292 400034 566633 490217 322489 179223 283125 246544 213374 392157 464609
10215 464609 288175 81532 -20730 -41478 -173370 -246802 -93856 252800 364413 286231
10205 286231 151969 107084 204838 161262 325577 374593 306333 343466 474983 539069 296536
10194 296536 213118 391869 486538 343608 252840 231581 208997 149072 190016 183031 -7548
10183 -7548 -26264 79706 13929 -108818 -190387 -8676 582919 696090 568326 464494
10173D64494m2425m4840L7605J26030J66629q3828l7098k70R5364K30167j05766
10162H06062l30089p0780J77688L16529L50591q3783p5861J47359j42483N1738
10152A146971j97022k25089L26832L78559J81263p7381j85546J18535J38570P022
10142A612714k07990k25856n9822K437K06397K43394k2067q5402j31205Q6521
10132A419121k13693j13094J15103j64756k52517j54721q3746J9065j7901L3426
10122E86287K97646j84250j78653l6013R4280M9432J1953k46073k70709j57355
10112c3455p3129J13619M0702r2337j77717M1658M9830M3935j78558L04222K4688
10101F3458j10146N9308J12276j55104O7530O3660J94334J57888j31224j46108
$$ plain form
10173 464494 422069 377229 414834 540864 707493 623665 586567 586297 681661 911828 806062
10162 806062 475973 405193 582881 899410 1250001 1166218 1090357 1237716 1095233 1146971
10152 1146971 949949 724860 1051692 1430251 1611514 1534133 1348587 1467122 1605692 1612714
10142 1612714 1404724 1178868 1119046 1121483 1327880 1571274 1549207 1463805 1332600 1419121
10132 1419121 1205428 1092334 1207437 1042681 790164 635443 551697 570762 552861 586287
10122 586287 883933 699683 521030 485017 579297 628729 640682 394609 123900 -33455
10112 -33455 -106584 7035 47737 -44600 -222317 -180659 -130829 -86894 -265452 38770 63458
10101 63458 -46688 12620 124896 -30208 37322 100982 295316 453204 321980 175872
10091A75872q9383J69564P2217J26114P217j94990l054p8085m3907n9637j73284
10080i1356K86104l8843j34675j01880J76779M5587j51156k69815O2405P5103
10070a41747M755J4520P2223o0798O5047R7607J80811m8306l67499R4606J81890
10059I3109k5568r4417P2031m767j54085m1652J43527M8933j07856J16652N545
10048E1452j75922k29785K12450J59467n2064m5417K1394k38957P0917J76763
10038d9702K01238J68451j68989k93928R1492J03601p8312l01790M0860K02942
10028h4137J4684o3484o9202J66326J56764o6198K4755J83838K0303q8723J17056
10017C11982P899q6825L1327r9499K30733k8762l57039j77191K6573O7793p7357
$$ plain form
10091 175872 86489 256053 328270 454384 461601 266611 263557 185472 141565 81928 -91356
10080 -91356 194748 155905 21230 -80650 96129 141716 -9440 -279255 -216850 -141747
10070 -141747 -136992 -122472 -50249 -111047 -46000 51607 232418 184112 -183387 -88781 93109
10059 93109 67541 -26876 45155 40388 -113697 -155349 -11822 37111 -70745 45907 51452
10048 51452 -124470 -354255 -141805 17662 -34402 -79819 -58425 -297382 -226465 -49702
10038 -49702 151536 319987 150998 -142930 -51438 52163 -26149 -327939 -287079 -84137
10028 -84137 -69453 -132937 -202139 -35813 120951 54753 79508 263346 283649 194926 311982
10017 311982 319881 233056 264383 164884 395617 366855 9816 -167375 -140802 -73009 -150366
10006a50366k101J03239K10774j91344k04099o7438j12430r90K82566P8772J43853
9995I0436J02686n2642N4425O1892p0776j51806J22448p3570Q1867P8245o3643
9984A79562k49179j87538q7364L34016J21648l7484o7838k27445J12644l4542
9974a43520J0825o6893j6009P6892l0759j05274R0148J27727j27863J50334P6354
9963D1962j59791J01082J34622L09831n4327j78250j02594m0205j55812J71481
9953F7999K86176P9658m9670k458o7882r6586p6276l3738J30198P670q2873k56175
9941i3957j0790J51409J58284Q8788j52194Q2233J43175L1728M9832K2440k68228
9930B02720k79094O3613j54665j97644j16102r730L51134K57744R9164k13319
$$ plain form
10006 -150366 -152467 -49228 161546 -29798 -233897 -301335 -413765 -414755 -132189 -53417 90436
9995 90436 193122 140480 194905 256797 186021 34215 156663 83093 164960 243205 179562
9984 179562 -69617 -257155 -344519 -10503 111145 73661 5823 -221622 -108978 -143520
9974 -143520 -132695 -199588 -215597 -138705 -169464 -274738 -184590 -56863 -184726 -34392 41962
9963 41962 -117829 -16747 117875 427706 373379 195129 92535 52330 -103482 67999
9953 67999 354175 433833 384163 381705 313823 217237 140961 107223 237421 245091 162218 -93957
9941 -93957 -104747 46662 204946 293734 141540 223773 366948 398676 448508 470948 202720
9930 202720 -76374 -12761 -167426 -365070 -481172 -490902 -139768 117976 217140 3821
9920C821J31364q174o5551j28624n708J02322r4173O1890j05091L9620o2766J5713
9908a15357l7036j5923J17706P8153J67141P6784k96299l05023j42692J04612
9898c67934L1768Q4188J12911L7034k2675J29228J67857L1271k90428j4781j93071
9887b94632k42965m5355L13068K49156P5503l4108k76691J41433O3755P3957P6631
9876I9752j63669K4689o5357j15353Q7938n9068Q187J70286J85228J89212q4869
9865B76976j73910j32952J75026l5774J99856P4446j78413k20730j2952K7830
9855e97l5204k510Q225K07741k8287l65935j64019j96401K8564j5651Q8665M3042
9843d32367k44664J20741J50482j49258j25560J14493K62871P1043j67573k0170
$$ plain form
9920 3821 135185 127011 61460 -67164 -72872 29450 -64723 -2833 -107924 -68304 -131070 -115357
9908 -115357 -152393 -168316 -50610 27543 194684 271468 -24831 -329854 -472546 -367934
9898 -367934 -336166 -251978 -139067 -102033 -124708 4520 172377 203648 -86780 -101561 -294632
9887 -294632 -537597 -582952 -269884 -20728 54775 20667 -256024 -114591 -50836 23121 99752
9876 99752 -63917 -39228 -104585 -219938 -132000 -191068 -182881 -12595 172633 361845 276976
9865 276976 103066 -29886 145140 109366 309222 383668 205255 -15475 -28427 -597
9855 -597 -35801 -38311 -30086 177655 149368 -216567 -380586 -576987 -548423 -564074 -475409 -432367
9843 -432367 -677031 -556290 -405808 -555066 -680626 -566133 -303262 -232219 -399792 -419962
9833d19962J41911M3039R0480K81884j57470o0657J34561j89746k5852J75245
9823A3433J43347N4284j91932J41378l5477j75776O5501N9964J51376J3893k31417
9812H574k57842L1371J18909K02308J50543o7269o6669q5877j37881m6974J3971
9801a36836O7507J63815J31633O8429j81400l7339j58353J10602L33740J83377
9791E45175M0756J5265k69837j81483j83418l3765r7452J14260n9093K0061n3466
9780a42997j738k55r8196m3529K11156k7176j23061K19801n4372j43471Q8121
9769a15717J15261j4742K4334P181p8149J35505K4676n9127L1967P5383q4766
9758F1806k13713j23746Q8859m4057P9400J1064p4551J29789j3817j27308n4494
$$ plain form
9833 -419962 -278051 -235012 -144532 137352 -20118 -80775 53786 -135960 -161812 13433
9823 13433 156780 211064 19132 160510 125033 -50743 14758 74722 226098 239991 8574
9812 8574 -249268 -217897 -98988 103320 253863 186594 119925 34048 -103833 -150807 -136836
9801 -136836 -69329 94486 226119 294548 113148 75809 -82544 28058 361798 545175
9791 545175 585931 601196 331359 149876 -33542 -67307 -164759 -50499 -109592 -89531 -142997
9780 -142997 -144735 -144990 -243186 -286715 -75559 -102735 -225796 -5995 -60367 -203838 -115717
9769 -115717 -456 -15198 9136 16317 -61832 73673 98349 39222 71189 146572 61806
9758 61806 -151907 -275653 -186794 -230851 -151451 -140387 -214938 -85149 -98966 -226274 -280768
9747b80768k52788J62498J22678j04248k7804J05284q1623M5603N1929j41476
9737d00715L5989K40014K02219j90879j06637J01150R0886j25345q7430R3149
9727a47599K01929J28075q9033R0942j6213k36253q0505m5052L0809j31297q209
9716c02406J31986J63594K05624j12758j82413K6230N8320k70025m8441n2192
9706c82481K57479J11144j79535k59811J59587J91885m1855n637L2439q1149k35042
9695d32976J83005J27807l8129Q7182K1798Q0355j03428N7085l0779K52133J851
9684B05904k16939n8628J6572N083j65836j80408J47142J99943J4328k0781p5360
9673a28980q9291N091j81814P1652R5850O9551K1427R0943O2070J796o1765J87324
$$ plain form
9747 -280768 -533556 -371058 -248380 -352628 -380432 -275148 -356771 -311168 -259239 -400715
9737 -400715 -364726 -124712 77507 -113372 -220009 -118859 -27973 -153318 -240748 -147599
9727 -147599 54330 182405 93372 184314 168101 -68152 -148657 -193709 -162900 -294197 -302406
9716 -302406 -170420 -6826 198798 86040 -96373 -70143 -11823 -281848 -330289 -382481
9706 -382481 -125002 -13858 -193393 -453204 -293617 -101732 -143587 -149224 -116785 -197934 -432976
9695 -432976 -249971 -122164 -160293 -73111 -51313 29042 -74386 -17301 -48080 204053 205904
9684 205904 -11035 -69663 -53091 -48008 -213844 -394252 -247110 -47167 -32839 -53620 -128980
9673 -128980 -218271 -213180 -394994 -323342 -227492 -157941 -136514 -45571 16499 18295 -43470 143854
9661A43854L05194l1217k68836q5884j06322o0960J97933K19880J15370j5406
9651D13606N8272K51531L22354K94042k1723L4909K12325M67667M92843p5681
9641B450145p06175m95876l85550l66678j42753J36321M8573j68137j52683l42427
9631a25240k96689J730N60725M9349j50622l16576k02924J15881K24645p8805
9621b18526J67445J84985J6551j16616q6601m1067K03880K489O2795n4602n075
9610A15658O2040N7995k2612j84608n2070J53022N9988K2274j62284l5296j32806
9599a18699k34866K30317J06671m082r6086K02777L1033N5603k9098J12219J27104
9588C82893p2910m6506J1566p0994k39835l8912J52439j26670j51424L5642Q9707
$$ plain form
9661 143854 449048 417831 148995 63111 -43211 -104171 93762 313642 429012 413606
9651 413606 471878 723409 1045763 1339805 1318082 1352991 1565316 2032983 2525826 2450145
9641 2450145 1743970 1248094 862544 495866 353113 489434 538007 369870 217187 -125240
9631 -125240 -421929 -420199 140526 189875 39253 -277323 -480247 -364366 -139721 -218526
9621 -218526 -51081 133904 150455 33839 -52762 -93829 110051 112540 175335 120733 115658
9610 115658 177698 235693 213081 28473 -23597 129425 189413 211687 49403 14107 -118699
9599 -118699 -353565 -123248 -16577 -20659 -116745 86032 117065 172668 143570 255789 382893
9588 382893 309983 263477 275043 204049 -35786 -74698 77741 -48929 -200353 -164711 -75004
9577g5004l8819j16833j97845K186L09558O136J79756J50086l9920R0843K77592
9566E47736j20005m17292j70074J21296j1560J74823O8390o1641m9438j18808
9556c6573l0141j2066j86338m0882J32622J40992J56533o2195j969n01L6796N243
9544A01521M9350N8730N3598p4472n8447j67955l5417j56777j79286K36520o3429
9533b36064j57682j91827k0620L71776J41423l6128o7515j7460o448K41554k43114
9522b22105L23813J75055j31293j39655o2203J9902J13511l6318m9505k551J6561
9511E212O5081k63335j15591K74139J20021J96722j54400r8502j2405J86716P7236
9500B80894l38076j60635P277J80288J4330r0940J15418n784l22366k34219K52100
$$ plain form
9577 -75004 -113823 -230656 -428501 -426315 -116757 -110621 69135 219221 179301 270144 547736
9566 547736 427731 10439 -159635 -38339 -49899 124924 193314 131673 82235 -36573
9556 -36573 -66714 -78780 -265118 -306000 -173378 -32386 124147 61952 59983 59482 96278 101521
9544 101521 150871 209601 263199 188727 130280 -37675 -73092 -229869 -409155 -172635 -236064
9533 -236064 -393746 -585573 -606193 -234417 -92994 -129122 -196637 -214097 -220545 21009 -222105
9522 -222105 101708 276763 145470 5815 -56388 -36486 77025 40707 -8798 -11349 5212
9511 5212 70293 -193042 -308633 -34494 85527 282249 127849 29347 16942 203658 280894
9500 280894 -57182 -217817 -210540 -30252 -15922 -106862 8556 2772 -319594 -553813 -301713
9489c01713J37418J28494k6620J15624l14592p2644J17764n7059l285m042P672
9478b72983K9549O2138R1694O8810j32595q2478p2506P9143k26218N2356J23997
9467b79093K2431J35193R2348k8559r0291n006P7728q0509J23059n2693Q9719
9456D327j1858q5197n9744N0746j9167k39457J95132J13945J60537m4196L7090
9445A02158k5489j21286k31136M3287j08840J24367J93187n3998m0782O5333R5268
9434D2069k5293J7537K9083j20689j17522P4210K06431J07126P1677j62560k8986
9423I3083j76006N8604k10160m5002K14199J94127j83365j55086j52852n2272
9413d14730n9786q1368j16394R1610J96375L5446o3893J71124L2768k8946p3264
$$ plain form
9489 -301713 -164295 -35801 -62421 53203 -261389 -334033 -216269 -273328 -276613 -280655 -272983
9478 -272983 -243434 -181296 -89602 -20792 -153387 -235865 -308371 -229228 -455446 -403090 -279093
9467 -279093 -256662 -121469 -29121 -57680 -147971 -152977 -75249 -155758 -32699 -85392 4327
9456 4327 -7531 -92728 -152472 -101726 -120893 -360350 -165218 -51273 109264 65068 102158
9445 102158 76669 -44617 -275753 -232466 -341306 -216939 -23752 -77750 -118532 -53199 42069
9434 42069 16776 34313 63396 -57293 -174815 -100605 105826 212952 284629 122069 93083
9423 93083 -82923 -24319 -234479 -279481 -65282 128845 -54520 -209606 -362458 -414730
9413 -414730 -474516 -555884 -672278 -580668 -384293 -348847 -412740 -241616 -208848 -237794 -311058
9402c11058J57860M323j07707m6819k99538p8139N25655K85796p9983j036L8089
9391H7443k06461J32514M1380j03496K97296J89834j73650k47900q4462P608K50606
9380A90712J51965l08173Q513J26405J65965K3583r8979j49059O2910o5144q6442
9369B2256J13843J83874j50076m98017M8794Q7177P2484k4837j41513R2725O7713
9358a25577j52478K22610n5402k0729j36415m3640k08148P5067J79753N9455J02998
9347a02506K01251J60906L337j42507j8580l3203M3746n7922K01292l0962k87934
9336f3082k93145r7153k6606J35235K15733L65358K2255j26386j28005j08152
9326a03948k3505k27607p2974K04536O5571J85508j03164j39151Q3724M1584l30752
$$ plain form
9402 -311058 -153198 -148875 -256582 -303401 -602939 -681078 -155423 130373 50390 49354 87443
9391 87443 -119018 13496 54876 -48620 248676 438510 264860 16960 -67502 -59894 190712
9380 190712 342677 34504 43017 169422 335387 358970 259991 110932 173842 108698 22256
9369 22256 136099 319973 169897 -328120 -279326 -192149 -119665 -144502 -286015 -193290 -125577
9358 -125577 -278055 -55445 -110847 -131576 -267991 -311631 -519779 -444712 -264959 -205504 -102506
9347 -102506 98745 259651 262988 120481 101901 68698 112444 54522 255814 224852 -63082
9336 -63082 -356227 -453380 -479986 -344751 -129018 236340 258595 132209 4204 -103948
9326 -103948 -127453 -355060 -428034 -223498 -157927 27581 -75583 -214734 -131010 -89426 -420178
9315d20178l6405J00662k96489J37127K02885j18810O5905M8682K86003l2058
9305f2676R0681k1311k65375o8110M3441N4700J30148O200j86775O5733J10206
9294a03138j00371o845O240n1692K8715l7088R380J71705r5495q5294q7270K29145
9282a22008K25847P9042r7974k67k29237j12988L7773K65359L25122R1175j3144
9271D48700l36527j30582o220K7067n9964j78536j317J72068J71484K10061k3162
9260B93072P9221l6274j342j48036k37758r7971J25137K16484l58329j36182J74969
9249a27009R1419m7231l3368m9867k07997N9328K28312P8401Q6619Q3454l6360
9238A25701J24812k44419M9441n4814n9268o6424L5477J63584o199j36021r8889
$$ plain form
9315 -420178 -456583 -355921 -652410 -515283 -312398 -431208 -365303 -316621 -30618 -62676
9305 -62676 28005 6694 -258681 -326791 -283350 -228650 -98502 -92302 -279077 -213344 -103138
9294 -103138 -203509 -210354 -204114 -255806 -227091 -264179 -254799 -83094 -178589 -263883 -351153 -122008
9282 -122008 103839 182881 84907 84640 -144597 -257585 -219812 45547 370669 461844 448700
9271 448700 112173 -18409 -24629 2438 -57526 -236062 -237379 -65311 106173 316234 293072
9260 293072 372293 336019 334677 186641 -51117 -149088 -23951 192533 -165796 -301978 -127009
9249 -127009 -35590 -82821 -116189 -166056 -374053 -314725 -86413 -8012 78607 162061 125701
9238 125701 250513 6094 55535 721 -58547 -124971 -89494 74090 67891 -68130 -167019
9227a67019M7851K06497P5500k2716r3345L493k64177R9589K25990n1125p7438
9216a6900K80755J61345k25654k02915J55657Q8081j78499O2412k6652M4103R4854
9205B36587J2578k71879j96068L7866K28244p3207p5539J9169L6859J42439m1136
9194E5913J0275j69894n8228o6329q1563J7053j10848o7666O2588j49149J16705
9183d41143L93300J1062j50184r4554K64996j45958p3107p6569j7974L56976K29246
9172B56091j0347l13667k04508k3526R1467L9587O9364L4983J53656q2811j9923
9161i634L1078P8179r6444j28747J08246J51070j89478J77819J25638j46174j5557
9150H5996k26730O4939K46375o6337Q0705K16488q9548K083K93894K05071J29196
$$ plain form
9227 -167019 -119168 87329 162829 140113 46768 50261 -213916 -114327 111663 60538 -16900
9216 -16900 263855 425200 199546 -3369 152288 240369 61870 124282 97630 141733 236587
9205 236587 249165 -22714 -218782 -180916 47328 -25879 -101418 -82249 -45390 97049 55913
9194 55913 66188 -103706 -161934 -228263 -309826 -292773 -403621 -471287 -408699 -557848 -441143
9183 -441143 -47843 -36781 -186965 -281519 -16523 -162481 -235588 -312157 -330131 26845 256091
9172 256091 245744 -67923 -272431 -295957 -204490 -164903 -95539 -60556 93100 10289 -9634
9161 -9634 21444 99623 3179 -125568 -17322 133748 -55730 122089 247727 101553 85996
9150 85996 -140734 -75795 170580 104243 184948 401436 311888 313971 607865 812936 942132
9139I42132j2479J09512M2824j19175k48589l44621l9292L2289q0780k09842N8695
9128A30674L5249J20503L5198j14486J88574R1484L7166j44990j67295j91234
9118B0843P3256J86319P8848l5526j8967l43082j09058J26108L5330K00687J13777
9107C28535M8814m1573j5407l87378J46473J98946j61219K39310K53293P1085
9097F80879j18698J7400K7494j50664M812J17348J82528J18561J48584r1922k48023
9086F88299J12361J21677k25751L0923l7747o2516j07042R2387r2868j69640J05259
9075D55342J18028J45920L8280J54885j57025k86376j90741k3250R2134j91790
9065A55407N485J476L712J00898l0813N7249J87848j6265j23758J21044N7065
$$ plain form
9139 942132 929653 1039165 1081989 962814 714225 369604 330312 362601 281821 71979 130674
9128 130674 165923 286426 321624 207138 395712 487196 524362 379372 212077 20843
9118 20843 94099 280418 359266 323740 304773 -38309 -147367 -21259 14071 214758 328535
9107 328535 377349 335776 320369 -67009 79464 278410 117191 356501 609794 680879
9097 680879 562181 579581 607075 456411 461223 578571 761099 879660 1028244 936322 688299
9086 688299 800660 922337 696586 727509 689762 627246 520204 612591 519723 350083 455342
9075 455342 573370 719290 757570 912455 755430 469054 278313 255063 347197 155407
9065 155407 160892 162368 166080 266978 236165 293414 481262 464997 341239 462283 519348
9054E19348j03441Q2809J57114k13682J48544R96j90636K76191J12700k06722
9044E83221m2645J153O6374l7187J3073L0633M1403R9108P0378j89326k62936
9033C73249J323J63421R7534k06084j51261m798J08707j30314K3780j25755o963
9022A42839K3286J49212j17599k4621K44616n9024j82685j50824j10778J93458
9012A07880J76007J22952L904j19076J4164J37137k83056K8937K20865J67525
9002E77239j71136j97140j7161p3624k05670j92785J8158R3787J10043J44532
8992H6243J21402p2165m9541j35132N4831j09091N312K95826M6739k14204r4993
8981f4773q1903R7685o9231P7200N1588J649M1033J59931m4427j27066q2353j51112
$$ plain form
9054 519348 415907 498716 655830 442148 590692 591688 401052 677243 789943 583221
9044 583221 540576 541729 608103 570916 583989 614622 656025 755133 825511 636185 373249
9033 373249 374572 537993 635527 429443 278182 273384 382091 251777 275557 149802 142839
9022 142839 166125 315337 197738 173117 417733 358709 176024 25200 -85578 107880
9012 107880 283887 406839 410743 291667 305831 442968 159912 188849 409714 577239
9002 577239 406103 208963 191802 118178 -87492 -280277 -262119 -168332 -58289 86243
8992 86243 207645 135480 85939 -49193 5638 -103453 -98141 197685 244424 30220 -64773
8981 -64773 -146676 -48991 -118222 -41022 10566 12215 53248 213179 168752 41686 -40667 -191779
8969a91779q8907K1655q2725R2540J94756Q7632k1664k53423k4475j1943j70661
8958d48994Q3207o7648L4466K38438J00239O132K0220O06j88456o6816L27860
8947C9254L16361K30295q8193k45496l2722J5687J09809j73522j76579k67712
8937b72818j85866r3617o8065K52619J5761P9873K40482J59260q9605j59717p0157
8926a91850n0555P8321j46189L3601j56860J7413J17483R8056j3595P3337J26880
8915a3958Q8666N909J16308k01780k32096M7277O0472J93072o6948m9835K11341
8904A58428j76432m6108J3585P7605j25942j77137l769N53810J51128k80014J2739
8893A57893j67412j44544k7390j5173J29716P9239J93282L6912q9084m0888K2575
$$ plain form
8969 -191779 -280686 -259031 -341756 -249216 -54460 33172 11508 -241915 -266390 -278333 -448994
8958 -448994 -365787 -433435 -398969 -160531 -60292 -54160 -33940 -33334 -221790 -288606 39254
8947 39254 355615 585910 497717 252221 219499 235186 344995 171473 -5106 -272818
8937 -272818 -458684 -552301 -620366 -367747 -351986 -272113 -31631 127629 38024 -121693 -191850
8926 -191850 -242405 -164084 -310273 -276672 -433532 -416119 -298636 -200580 -214175 -140838 -13958
8915 -13958 74708 80617 196925 -4855 -236951 -189674 -129202 63870 -3078 -52913 158428
8904 158428 -18004 -64112 -50527 27078 -98864 -276001 -279770 274040 425168 145154 157893
8893 157893 -9519 -154063 -181453 -196626 -66910 12329 205611 242523 153439 112551 135126
8882A35126J83734l3479k21299p3599j634R8917K02818N7770j61463n6549n2160
8871G8182J46796J29038Q2162j58319j54172J16218L3364j02445j67957N3685
8861E6552j95339M3930q9360n7570j49411R721P8833J21321k6668O765J77760
8850b3466j31269J2786Q2991p8090J02521J45384M009r4247J62491R0259j89851
8839H3518j82122J0682J52554J21654N119j74452J35729p9599k385K7958r493
8828H9163k39782j11061q2781K52096M7763j06238O5262r8594j45632L579J24461
8817b01764J73395J33797j68202K24584O7842Q6302m0073k08840k50333m0371
8807b23663Q7896J35722J9419p4697N7340L1992j51498M655J11446J22744J16569
$$ plain form
8882 135126 318860 285381 64082 -9517 -11151 87766 290584 348354 186891 130342 78182
8871 78182 224978 354016 436178 277859 123687 239905 273269 170824 2867 56552
8861 56552 -138787 -94857 -184217 -241787 -391198 -381477 -302644 -181323 -207991 -201226 -23466
8850 -23466 -154735 -141949 -58958 -137048 -34527 110857 114866 20619 183110 273369 83518
8839 83518 -98604 -87922 64632 186286 191405 16953 152682 73083 70698 98656 89163
8828 89163 -150619 -261680 -344461 -92365 -44602 -150840 -85578 -184172 -329804 -326225 -201764
8817 -201764 -28369 105428 -62774 161810 229652 315954 275881 67041 -183292 -223663
8807 -223663 -135767 -45 19374 -55323 2017 34009 -117489 -112834 -1388 121356 237925
8796B37925k0155k22418R0030j10865k82794J11009K13231p151o6475J69708J59968
8785B72013j05319q748k13522j42159K77956J74717O924j70391p5863L2560J26400
8774A74568R7814j52683j64182j48883J621K05425O7853k17050j46745K69206
8764a3056K66464k04261k14301R6901N8504l32457L2417K09727J56289J00937
8754A57164J90499J10580j67272k41166J2685N1327j34495l393M06492J68648
8744E51069J33973j13999n9464p2663q3641k9084q6316k15939P5689J18079p9709
8733A37995j20918q4841j4144J13548R0494k02134p5196R3957J10242J29481j07009
8722G1475j71068L3163J79922j5101j9091j31653L48380L42247m066k59542k90399
$$ plain form
8796 237925 217770 -4648 85382 -25483 -308277 -197268 15963 8812 -57663 112045 272013
8785 272013 166694 157946 -55576 -197735 80221 254938 261862 91471 15608 48168 174568
8774 174568 272382 119699 -44483 -193366 -191745 13680 81533 -135517 -282262 -13056
8764 -13056 253408 49147 -165154 -68253 -9749 -342206 -309789 -100062 56227 157164
8754 157164 347663 458243 290971 49805 62490 113817 -20678 -24071 382421 551069
8744 551069 685042 571043 511579 438916 355275 326191 239875 23936 99625 217704 137995
8733 137995 17077 -67764 -81908 31640 122134 -80000 -155196 -61239 49003 178484 71475
8722 71475 -99593 -66430 113492 98391 79300 -52353 296027 638274 634208 374666 84267
8711H4267J52244n0036j21446m6697J48494J35634K30004j8979Q3542K8219J64828
8700G90074L57n1916l8238q8022M943n9837K66790Q3347k77045J2435j4496J03778
8688G32170n1638l80668L6118m3937q2763j5361O83J67899J1047j22397n4893
8677A96260k32482j40581J8180o1012J53787N8027N9115Q7668j82924M4957J80046
8666A81041K93904k15383k33838J43732Q8233J2133J63737K91201q197m1178K1523
8655F96908p078J41563J63113K58052r9167r7424j97407m1446K15818m8847j57836
8644H26249Q6382J67347j19910r2055j1907j8859k83454k84220k03485O1672P0327
8633A98087j82372j12087M3441J07404l3461j34231J28176J05406r9529l0740
$$ plain form
8711 84267 236511 186475 65029 18332 166826 302460 532464 513485 597027 625246 790074
8700 790074 790431 738515 700277 612255 617198 557361 824151 907498 630453 642888 628392 732170
8688 732170 680532 299864 335982 292045 209282 193921 194604 362503 373550 251153 196260
8677 196260 -36222 -176803 -158623 -219635 -65848 -7821 51294 138962 -43962 995 181041
8666 181041 474945 259562 25724 169456 257689 269822 433559 724760 716563 675385 696908
8655 696908 689830 831393 994506 1252558 1153391 1055967 858560 817114 1032932 984085 826249
8644 826249 912631 1079978 960068 868013 856106 837247 553793 269573 66088 127760 198087
8633 198087 15715 -96372 -52931 54473 21012 -113219 14957 120363 20834 -9906
8623i906J98149o2261j79446K63374j22114j03030K06111O3979k30341J23273
8613A47788J43922J87629J03023Q355l76508K2295J79267l6482J15019N4777j29022
8602D20063j02536q1892l16163P7687J04818L5995J94438m0683q2767p7521O1770
8591A93209j01954p7385M2306R4329k52002r2210J56530J3611p0736j2590m6758
8580a53650j22425j17335P4290J866p9415K023K25123R9453o5965j03173J6482
8569b22726K8412J4566K28449J63696k8054N6806K66299n3064n4755k25554j16457
8558E7618K5689j04278j87967k97881j09217K44738K92012j9836k7895j10778
8548b37795Q4057R8406J80439J02352l3767k27840q0081K18481j38910j35755
$$ plain form
8623 -9906 188243 125982 -53464 209910 87796 -15234 190877 254856 24515 147788
8613 147788 291710 479339 582362 590717 214209 236504 415771 379289 494308 549085 420063
8602 420063 317527 235635 -80528 -2841 101977 137972 332410 291727 208960 131439 193209
8591 193209 91255 13870 56176 150505 -101497 -193707 -37177 -23566 -94302 -106892 -153650
8580 -153650 -276075 -393410 -319120 -317254 -396669 -394646 -169523 -70070 -136035 -239208 -222726
8569 -222726 -194314 -179748 48701 212397 184343 241149 507448 454384 399629 174075 57618
8558 57618 83307 -20971 -208938 -506819 -616036 -371298 -79286 -99122 -127017 -237795
8548 -237795 -153738 -55332 125107 227459 193692 -34148 -114229 104252 -34658 -170413
8538a70413O4933Q5447l3764N2130j65182k01472J11196j03387L2044L09510K05980
8527A87022l3146r1965j42173J3487j21741j25646O7607K22370K79069k30993
8517B3891j86671L3359K02202k59501l7867J86527P6412J07007l288j23258L93115
8506D11928J21084q628r1725l90903N0749J34979n3485q9238k6927J47452J47536
8495C52822M9575l6784n9880k9238k17862o9802L7497j19794j98718O411K83641
8484b132J80963n555J89265J29249p2194k32198j32141J36624o0100L3568J47274
8473C12623j69896l01506N2371q1569P6594J61711j25454j66881K90642j6001
8463C2634P9510q3832q4332J66957k2978l12233o6992J46070J59939M0346Q8975
$$ plain form
8538 -170413 -105480 -20033 -53797 -1667 -166849 -368321 -257125 -360512 -328468 -18958 187022
8527 187022 153876 61911 -80262 -66775 -188516 -314162 -246555 -24185 254884 23891
8517 23891 -162780 -129421 72781 -186720 -224587 -38060 38352 145359 142071 18813 411928
8506 411928 533012 524384 432659 41756 92505 227484 173999 84761 57834 205286 352822
8495 352822 402397 365613 305733 276495 58633 -11169 26328 -93466 -292184 -285773 -2132
8484 -2132 178831 173276 362541 491790 419596 187398 55257 191881 131781 165349 312623
8473 312623 142727 -158779 -106408 -187977 -111383 50328 -75126 -242007 48635 32634
8463 32634 112144 28312 -56020 110937 87959 -224274 -291266 -145196 14743 55089 144064
8452A44064J74117j23391k78049o8066Q7326M1210M8852j35194l0372J1292J62079
8441C3868M45418J43858k72244j16483Q7889P141N5024k35290M0156K92813K91793
8430G73943m2858j21892J7581j81393l48294K34328P6076j87090o6856j02517
8420E1028M5079J53381J01758o6984Q879j62346k44050l0528R3891J45663Q0357
8409A76128p727P9264J7942J9031m8003k7786L3663r3034M3364P3444P2145j3036
8397C25395j99193n9958q8773L7863m9638l52640J22446J52021n2202r114K16497
8386D2704N6621R8407j45525j28967o9410P5310K41161K9195j04918m22269j54617
8375d82308K23858K05699J02570n4931K05742J04466j96164k33606j6444M2260
$$ plain form
8452 144064 318181 194790 -83259 -151325 -63999 -22789 26063 -109131 -139503 -128211 33868
8441 33868 479286 623144 350900 234417 322306 329447 384471 149181 189337 482150 773943
8430 773943 731085 609193 626774 445381 97087 331415 407491 220401 153545 51028
8420 51028 96107 249488 351246 284262 293141 130795 -113255 -143783 -49892 95771 176128
8409 176128 168401 247665 265607 284638 236635 208849 242512 149478 192842 266286 338431 325395
8397 325395 126202 66244 -22529 15334 -34304 -386944 -264498 -112477 -164679 -173793 42704
8386 42704 99325 197732 52207 -76760 -146170 -70860 170301 199496 94578 -327691 -482308
8375 -482308 -258450 -52751 49819 -5112 200630 305096 108932 -124674 -141118 -98858
8365i8858p9133r1735P1119k9396K11385J58950o6728L067J20714k29491j49495
8354a79601N1232P4024j77566Q304K17961K60395o6220q0239o0165P6841L33337
8343D58303l4697N4466J79003K2643l45043l41808j46344N5244K42688R3566k02124
8332C5897k08303j88656J53757J11803J8796R8744J16779J56166r2265j73131
8322B9587j58361J12982k141j81031k7502K42151J22781j35757k78988K83797
8312G518K35537l2252n3296k8743j88223K03766J94436p2634r5983R6817Q9568
8301C56511j04524j05634L6720J56144k3252J90464J19497k49725n5601J93j81132
8290A39661r1345k3399J58906K66825M2445j75967k06986j06473K42972K6314
$$ plain form
8365 -98858 -177991 -269726 -198607 -228003 -16618 142332 75604 78671 199385 -30106 -179601
8354 -179601 -128369 -54345 -231911 -223607 -5646 254749 188529 108290 48125 124966 458303
8343 458303 423606 478072 657075 679718 334675 -7133 -153477 -98233 144455 238021 35897
8332 35897 -172406 -361062 -207305 -95502 -76706 22038 138817 294983 202718 29587
8322 29587 -128774 -15792 -17933 -198964 -226466 15685 138466 2709 -276279 7518
8312 7518 243055 210803 157507 128764 -59459 144307 338743 266109 170126 266943 356511
8301 356511 251987 146353 183073 339217 315965 506429 625926 376201 320600 320793 139661
8290 139661 48316 24917 183823 450648 493093 317126 110140 3667 246639 272953
8280B72953l9710K55893J97290j90106k54899k8932j59980K68194J82853j20610
8270C82946j56580J13135K16069j65490l9706J6649r9639k93266j67870Q8075
8260a05677K54303q7306L313R7475O4286l8853P2211J43750m38j59003k38388
8249E673j81861K888K54478K68833q6608j125j68034j16479O0446J36225j7831
8238A56605n6823j41037K9241j0855J3554M03526K44467m2337j96909j47461P0272
8227C22243l6819m2753J04365R6327j51014k47478j91345O0897J34043j33763
8217h5297l376M5465r552J88310j29461m78993j92210J34432J25320Q9110J89169
8206a27083L0207q703r3515j6177j6732J3437J23589P3784L08653M6123l8283
$$ plain form
8280 272953 233243 489136 686426 496320 241421 212489 52509 320703 503556 382946
8270 382946 226366 339501 555570 390080 350374 367023 267384 -25882 -193752 -105677
8260 -105677 148626 61320 64633 162108 226394 187541 259752 403502 403064 244061 5673
8249 5673 -176188 -173300 81178 350011 263403 262278 94244 -22235 38211 174436 156605
8238 156605 99782 -41255 -12014 -22869 -9315 394211 638678 596341 399432 251971 322243
8227 322243 285424 242671 347036 443363 292349 44871 -146474 -85577 48466 -85297
8217 -85297 -88673 -43208 -52760 135550 6089 -472904 -665114 -530682 -405362 -316252 -127083
8206 -127083 -96876 -105579 -199094 -215271 -232003 -218566 -94977 -21193 287460 333583 295300
8195B95300J83360j92582j19229k1059n5749k59075J9447K10434O7065q7712J86612
8184B26812J0917k33265r5440k45217k96779R1503J03218R1723J10144R088j00263
8173c27559J77420J67201l807j75343o9238r5600J96726M84490k054l2637j95896
8162A23703r2154M0558N5654j45630k24975r611K13680p0352j03360J34056j3595
8151i2026Q160Q6289J39373k83000j91637p6055j28815k6757O3108n460J77223
8140c29597R5533J46088P6220n7265O982j3493k84481J24133o2888J9932L1260
8129b47576K2825j86998K35877J16968k5095r2099k3987K41824K45994k7717k8652
8118B31364L995K4571r2153J9860j22328j25755J03356J39216k8205n1863K1792
$$ plain form
8195 295300 478660 286078 166849 145790 90041 -169034 -149587 60847 127912 40200 226812
8184 226812 237729 4464 -90976 -336193 -632972 -541469 -438251 -346528 -236384 -227296 -327559
8173 -327559 -150139 17062 13255 -162088 -231326 -326926 -130200 354290 352236 319599 123703
8162 123703 31549 72107 127761 -17869 -242844 -252455 -38775 -109127 -212487 -78431 -92026
8151 -92026 -83866 2423 141796 -141204 -332841 -408896 -537711 -564468 -501360 -506820 -329597
8140 -329597 -234064 -87976 -11756 -69021 -62039 -75532 -360013 -235880 -298768 -278836 -247576
8129 -247576 -224751 -411749 -175872 -58904 -83999 -176098 -200085 41739 287733 260016 231364
8118 231364 235359 259930 167777 187637 65309 -60446 42910 182126 153921 102058 123850
8107A23850o574K9816q0361J27762J25161o5468j44003n9152L9977j98434l3671
8096a41097Q7854J93233k3384j1045Q5653j0172J10613Q9173K15409N6619j32691
8085E20165K93871M53588M63617j08093K4573J27861n6459k88019k54637j88477
8075I87990j38687j49869j25429j36254o6112P8024j79681j76450J5403j6429
8065I2506m6937j67921K17610L68340J73449k21222j69105Q8834j58937p4794
8055A01823Q4684p5410N5084k6150J31254K74162J24391k95266n5060n9205j8245
8044B42062J92125L85095L68868M99418M27041N37131L01646M90227J27360n9445
8034C511528J66000p9279m89599n24054m32635o49080k96455r7184k11763l9554
$$ plain form
8107 123850 117276 147092 66731 194493 319654 254186 110183 51031 91008 -107426 -141097
8096 -141097 -53243 139990 116606 105561 191214 181042 291655 380828 596237 652856 520165
8085 520165 814036 1267624 1731241 1623148 1647721 1775582 1719123 1431104 1176467 987990
8075 987990 849303 699434 574005 437751 371639 449663 269982 93532 108935 92506
8065 92506 45569 -122352 95258 463598 637047 415825 246720 335554 176617 101823
8055 101823 186507 111097 166181 140031 271285 545447 669838 374572 319512 260307 242062
8044 242062 434187 819282 1188150 1687568 2114609 2651740 2953386 3443613 3570973 3511528
8034 3511528 3677528 3598249 3108650 2584596 2151961 1502881 1206426 1109242 897479 857925
8024H57925j6591j90501j90462j46153R3979J25156j50617j79153L5157m3673
8014A95067K30935J25964J07830l8878j97898j28344q6170j00333l6690P6454
8004A47937J12143K49739j1559J89680k2155j62552L6411J159K71480L30494r4915
7993A047862Q740J07469O5171K97765K02905m7001o4500l14582k39020l3302Q8417
7982A119924k4491p5952j25789k01744k11436o9022J37465J18335r9692J2556
7972E80154K01008j72146j53586O7635R0599k99328k46376L1800l7943J39091
7962B00908j2391k13911p9938l346Q5569J89412j74951k48593K5495l3761O8050
7951a97457J79777J81582J01309j87896M8461p7451k32170J17460j09771l81351
$$ plain form
8024 857925 841334 650833 460371 314218 408197 533353 382736 203583 238740 195067
8014 195067 426002 551966 659796 620918 423020 294676 208506 108173 71483 147937
8004 147937 260080 509819 498260 687940 665785 503233 539644 540803 812283 1142777 1047862
7993 1047862 1056602 1164071 1229242 1527007 1729912 1682911 1618411 1303829 1064809 1031507 1119924
7982 1119924 1095433 1019481 893692 691948 480512 411490 548955 667290 567598 580154
7972 580154 781162 609016 455430 523065 613664 314336 67960 99760 61817 200908
7962 200908 188517 -25394 -105332 -108678 -23109 166303 -8648 -257241 -231746 -265507 -197457
7951 -197457 -17680 163902 265211 77315 125776 48325 -183845 -66385 -176156 -557507
7941e57507J09166L0203L2887N8447j8658K37548J88086K09741J62892j6848r5379
7930C40578k28180m1030p371K4477k29991k490O1097j56881J28252K11988j4212
7919H6237k30738K09685N0517j88779j47141l3099j54883J7017J64796o4658K63701
7908b7345J64623k42099O9537N7729k70428J01156L93607J04943o3247k63667
7898B4809R6283J98291j27766j83054j40813p7837l37778J06553K81395K2444
7888a37473q9296p7433P1262Q3392J18343j32770q7571K0805q6852L59731J95836
7877B37974r016j23200l0615R814Q3369j38845j16530r7968J52382J3108j21306
7866a40833P2305J7623N272j719k4358o9222r1560k0902p2653n3767r3612K46197
$$ plain form
7941 -557507 -448341 -418138 -385251 -326804 -345462 -107914 80172 289913 452805 435957 340578
7930 340578 112398 71368 63997 88474 -141517 -144007 -82910 -239791 -111539 100449 86237
7919 86237 -144501 65184 115701 -73078 -220219 -253318 -408201 -391184 -226388 -291046 -27345
7908 -27345 137278 -104821 -35284 22445 -247983 -146827 246780 351723 288476 24809
7898 24809 121092 319383 191617 8563 -132250 -210087 -547865 -441312 -159917 -137473
7888 -137473 -226769 -304202 -232940 -149548 -31205 -163975 -251546 -230741 -317593 42138 237974
7877 237974 228958 105758 75143 84957 168326 29481 -87049 -185017 -32635 -19527 -140833
7866 -140833 -68528 -50905 -45633 -47352 -71710 -140932 -232492 -253394 -326047 -379814 -473426 -227229
7854b27229K06943J02501q9381j24343L68944J06964j551m9687j97836L2023j21541
7843E807j12647J69417j4973J06538o5305K80872k21242q6644j1796o5517K35355
7832B19865J45064j25174j17297k2614j39539j0322J65005J21216J56882L3681
7822D26767m7500k8936N0497M6714k19485O1860k2153J15536J25415n8941j5820
7811D33954K7419p9724q3952K0559Q7595l2308r8788Q517k37505k04854j17310
7800b76397K6899J65458K50187j13539l8534J64966l6834j12145j78269N0813
7790i7395J54205n3673k70013O4544O3403j16025J00937Q2600N0124j22289L3720
7779a09862j00286j87019J82969J43624j61660o606m6080j10817K3923J02297
$$ plain form
7854 -227229 -20286 82215 -7166 -131509 237435 344399 342848 293161 95325 127348 5807
7843 5807 -106840 62577 47604 154142 88837 369709 148467 61823 50027 -15490 219865
7832 219865 364929 239755 122458 99844 -39695 -50017 114988 236204 393086 426767
7822 426767 379267 350331 400828 447542 228057 289917 267764 383300 508715 449774 433954
7811 433954 461373 381649 297697 318256 405851 373543 274755 283272 45767 -159087 -276397
7800 -276397 -249498 -84040 166147 52608 14074 179040 142206 30061 -148208 -97395
7790 -97395 56810 3137 -266876 -202332 -138929 -254954 -154017 -71417 -21293 -143582 -109862
7779 -109862 -210148 -397167 -214198 -70574 -232234 -238840 -284920 -395737 -371814 -269517
7769b69517r1774O5578O7974K92619q6723o70j56226l20996J83989J48640J29262
7758c7844j62671O134j15223j51994J2592K288K3867l3666l2640L7658o8674K22798
7746b97375M25205L45976j93632l66910l4595J94775K05893p7956j63406R0918
7736A28893J39568o5377k17632o439j48950k16723j7649J81778r8298q5705K11114
7725a95420J57740m1348k35087m2830L24753L9713Q0264J02107j09699k681j47338
7714f9826j09307J73218K22895n7481k26346P8063J79550k1117j47903j4746J04324
7703A11324m2807j01552k3499j37814p1192Q0556J94207K27529L41775l62626
7693B15901l04456Q267J01116K17945J9050j518p1211M963k3322P405N1701n4504
$$ plain form
7769 -269517 -361291 -295713 -227739 64880 -21843 -22513 -178739 -499735 -315746 -167106 -37844
7758 -37844 -200515 -194381 -309604 -461598 -449006 -446718 -422851 -456517 -489157 -451499 -520173 -297375
7746 -297375 127830 473806 280174 -86736 -121331 73444 279337 201381 37975 128893
7736 128893 268461 203084 -14548 -20987 -169937 -386660 -404309 -222531 -320829 -406534 -195420
7725 -195420 -37680 -79028 -314115 -356945 -32192 7521 87785 189892 80193 77512 -69826
7714 -69826 -179133 -5915 216980 159499 -66847 11216 190766 169649 21746 7000 111324
7703 111324 68517 -33035 -56534 -194348 -265540 -184984 9223 236752 578527 215901
7693 215901 -88555 -80288 20828 238773 257823 256305 185094 190057 166735 174140 225841 171337
7681A71337j10014j62812l8564R8839P1290K3038l6749M8378J51465J84327j43469
7670B57066k91874j55040o6006N2212P1078O6499r2558k9870L5368J58538J91893
7659A97306j3109j79087R6720K39283J96258j23430k23103j53960J23469K8048
7649A88395P558p3919N8719k6633j35200k68641K21377K41324k72785R5504J0369
7638D6068j10598o8008J83003Q7182k77207p4350K80865j60460j80033K0777K91736
7627C8975Q3247j43664K275J1871q6868k49760j43778K72859K7773K16896K21734
7616B51560r6004p7624j64938N8393K0077L5594j33478k24766P8027K36274J54557
7605A37672l29782j85998N3828K01397j00526j6058O0783L3099K13130J13782
$$ plain form
7681 171337 61323 -101489 -140053 -41214 30076 53114 16365 64743 216208 400535 257066
7670 257066 -34808 -189848 -255854 -203642 -132564 -66065 -158623 -188493 -153125 5413 197306
7659 197306 184197 5110 101830 341113 537371 413941 190838 36878 160347 188395
7649 188395 195953 122034 180753 154120 18920 -249721 -28344 212980 -59805 35699 46068
7638 46068 -64530 -132538 50465 137647 -139560 -213910 66955 -93505 -273538 -252761 38975
7627 38975 122222 -21442 -19167 -7296 -94164 -343924 -487702 -214843 -187070 29826 251560
7616 251560 155556 77932 -87006 -28613 -8536 27058 -106420 -331186 -253159 -16885 137672
7605 137672 -192110 -378108 -324280 -122883 -223409 -239467 -178684 -145585 67545 181327
7595A81327j2487j31641j77374k12113P9119k04239L6426o1918Q5191R4328O9291
7584b54090n5377j95857J36037K65884P6736J40289L4394q143K14700p1111l18326
7573c4864j9022J91674q767P870j64134l8918o148O6210n3048m4105R5831N2961
7561D5540r4772n3664o4856k18953o1168K14169J08506l6464J28940P0867j28759
7550i0614k31075L1535J34510k9871o6842K525k8910K76164K03893l0575k02443
7539c1703o1108j47076P1936K6379K58411R3004j74889j19448j01978O5635N8433
7528f2404J6423r3455j73326O698L22115J1930q2869J4061k53669j10532K4852
7517c80176K08978L8147N0162q1127J3988K85237J03354j75178L6211j61955k053
$$ plain form
7595 181327 168840 37199 -140175 -352288 -273169 -477408 -440982 -502900 -417709 -323381 -254090
7584 -254090 -309467 -505324 -369287 -103403 -26667 113622 148016 139873 354573 283462 -34864
7573 -34864 -53886 137788 129021 136891 -27243 -66161 -72309 -6099 -59147 -103252 -7421 45540
7561 45540 -49232 -102896 -167752 -386705 -447873 -233704 -125198 -161662 -32722 38145 -90614
7550 -90614 -321689 -290154 -155644 -185515 -252357 -249832 -278742 -2578 201315 170740 -31703
7539 -31703 -92811 -239887 -167951 -141572 116839 209843 34954 -84494 -186472 -120837 -62404
7528 -62404 -45981 -139436 -312762 -306064 16051 27981 -54888 -40827 -294496 -405028 -380176
7517 -380176 -171198 -133051 -82889 -164016 -150028 135209 238563 63385 99596 -62359 -64412
7506f4412j60998L8J14874q2277J01216J15218M0241p4583j3294k41686J68522
7495i7141K12196j05997o3854K86402J08859n1589j37041k86309k43740j55261
7485e33475Q2382J60386J93163K50264M5588j63924J42427N3791p7819m0116j83745
7474g1078l8012Q370K11324r8663r1761J20O5850k96968J98653J87939p3822n663
7462c711j01908l4567J09783j04562J09125J39897j47473N4611J1271k73487Q7365
7451a53656L7268j15235r4247Q5074K18617K3518j81262j54591p7713O2550K3765
7440c25912K34905K92478r8706J27113L6133k40868m2425j84002O3912J85981
7430D8609L4830m3164j42895O3286K15105k41741o740K03732O8101P8582J21273
$$ plain form
7506 -64412 -225410 -225372 -110498 -192775 -91559 23659 63900 -10683 -23977 -265663 -97141
7495 -97141 115055 9058 -54796 231606 340465 288876 151835 -134474 -378214 -533475
7485 -533475 -451093 -290707 -97544 152720 198308 34384 176811 230602 152783 112667 -71078
7474 -71078 -109090 -100720 110604 11941 -79820 -79700 -13850 -310818 -112165 75774 1952 -3711
7462 -3711 -105619 -140186 -30403 -134965 -25840 114057 -33416 21195 32466 -241021 -153656
7451 -153656 -116388 -231623 -325870 -240796 -22179 1339 -179923 -334514 -412227 -349677 -325912
7440 -325912 -91007 201471 102765 229878 266011 25143 -17282 -201284 -137372 48609
7430 48609 83439 40275 -102620 -39334 175771 -65970 -72710 131022 199123 277705 398978
7419C98978j24186k50834M1336m8776j22690J67286j44279k5669k5941P4965L41176
7408B81366l74771j95908j11253M9480J09897N5810K70669K26307m0797k25919
7398D4881j48974K82601l9333k4887j23118J38910R5969Q0975K0654k06282R3172
7387B14568k6034l91795l04053j67908J31626R9843J48014K3676P1106o2446L9688
7376b23715M9321J9683j3265j2922K478K8297R0618K7165j24895j09825k7707
7365b94767o7360Q3002N4829j85593j7175n3248J340K16542Q484J0601l3832N837
7353b71340J03079J35143p752j82392l11310K13018K64381J04568q2486l5185
7343g0276K06123J01264J58771j1369l0536j24227m6347n7788L2404q5879J6379
$$ plain form
7419 398978 274792 23958 65294 16518 -106172 61114 -83165 -108834 -134775 -59810 281366
7408 281366 -93405 -289313 -400566 -351086 -241189 -185379 85290 311597 270800 44881
7398 44881 -104093 178508 139175 114288 -8830 130080 226049 307024 327678 121396 214568
7387 214568 188534 -203261 -507314 -675222 -543596 -443753 -295739 -272063 -200957 -263403 -223715
7376 -223715 -174394 -154711 -167976 -180898 -178420 -150123 -59505 -32340 -157235 -267060 -294767
7365 -294767 -362127 -279125 -224296 -409889 -427064 -480312 -478972 -262430 -253946 -243345 -277177 -271340
7353 -271340 -168261 -33118 -40870 -223262 -534572 -321554 -57173 47395 -35091 -70276
7343 -70276 135847 237111 395882 384513 353977 229750 183403 125615 158019 72140 88519
7332H8519p0337k63409m2011J45598O6055J96050L81980j05710k21850k64211
7322h9326j59561L7810M14909j93011K4372r4366l31011Q1176J17513j7046r0096
7311b98637m089J73272j65018k2232K63640K1432l0923J06803j96666r8588J22929
7300a28077M0272Q6262m0165J02343P3219K0225j86253N1981J56623Q6013O459
7289B68902k04433j68574p2442j12820J75068J55468p5198J30498L9940k59022
7279a22613j05012Q1271K85427P974r7013R3182J59470r8663Q9983p8575k64012
7268d8581k48078K09535K27602q2220j08472K6115J74771j76420j90167N2405
7258a63510n475k5325J85K28960J3167j30761k04397L0416j47679K25205K39538
$$ plain form
7332 88519 18182 -245227 -287238 -141640 -75585 120465 502445 396735 174885 -89326
7322 -89326 -248887 -211077 203832 10821 35193 -59173 -390184 -309008 -191495 -208541 -298637
7311 -298637 -302726 -129454 -294472 -316704 -53064 -31632 -62555 44248 -152418 -251006 -128077
7300 -128077 -87805 -1543 -41708 60635 133854 154079 -32174 19807 176430 262443 268902
7289 268902 64469 -104105 -176547 -289367 -114299 41169 -34029 96469 136409 -122613
7279 -122613 -227625 -146354 139073 147047 50034 143216 302686 204023 294006 215431 -48581
7268 -48581 -296659 -87124 140478 58258 -50214 -24099 150672 -25748 -215915 -163510
7258 -163510 -168985 -194310 -194125 34835 48002 -82759 -287156 -256740 -404419 -179214 60324
7247F0324O2458k95714k11978k47623N9221J34883m1277M1679Q4359J2795j2892
7236c53765J71676P0689m0212k17846R5982l4921J52274J26989O8592l6413N0519
7225E3564K94123P81n2613k23927j31427k00314L4159Q8219m0351j262Q6793k1798
7213a14053k61063k09611J14079K48759j54286J15304J41605K47485J09402l45494
7203a07873k79303O1882J30746j15812M2527q5760q931K45841J35506k655j52891
7192a36723J05579P5962Q1074K1694O17j6247K2048l0399r2186k09352q2171L9356
7180b20748o9345J15657J16640k33515L4765K25826M3123k08437k09884j5924
7170d21842R7865k9228J64573K74446O8562O0294O7888R266l01332k32119n1179
$$ plain form
7247 60324 122782 -172932 -384910 -632533 -573312 -438429 -479706 -438027 -353668 -340873 -353765
7236 -353765 -182089 -111400 -151612 -369458 -273476 -308397 -156123 -29134 39458 3045 53564
7225 53564 347687 348468 295855 71928 -59499 -259813 -225654 -137435 -177786 -179048 -92255 -114053
7213 -114053 -375116 -584727 -470648 -221889 -376175 -260871 -119266 128219 237621 -107873
7203 -107873 -387176 -325294 -194548 -310360 -267833 -353593 -362524 -116683 18823 16168 -136723
7192 -136723 -31144 44818 125892 147586 148203 131956 154004 123605 31419 -177933 -260104 -220748
7180 -220748 -290093 -174436 -57796 -291311 -256546 -30720 12403 -196034 -405918 -421842
7170 -421842 -323977 -353205 -188632 85814 154376 214670 282558 291824 -9508 -241627 -292806
7159b92806M9942J49711J46243j49003m1599J60709J58604l0039r6016r6493K9756
7148a0991j7715J17269J34429l0441l20099j98714M265L9383Q4892Q3169J20378
7137E825j3613m90041k56859L87240J99625O0896R8333q0329M0536J62473K86273
7126D00359N1086J998Q067l43722k5924Q462j44434j93323j80196K1905L7135
7115c58587o2541J80871K9173J9398j15905p9296J70399P2419l2060j4515J85718
7104d926J64443o193k59954r8042J66803J04889j74280N3725j12220k1963k3629
7093b11347m2296k19300J98256J26803J9823O6059j48125j8462J26791K25792
7083A23994M38529l6816l98276j92528p9128K23965K7597k98900k2363K54134
$$ plain form
7159 -292806 -242864 -93153 53090 -95913 -137512 23197 181801 151762 55746 -40747 -10991
7148 -10991 -28706 88563 222992 192551 -127548 -326262 -321997 -282614 -197722 -114553 5825
7137 5825 -7788 -497829 -754688 -367448 -167823 -106927 -8594 -88923 -48387 114086 400359
7126 400359 451445 453443 461510 117788 91864 100326 -44108 -237431 -417627 -395722 -358587
7115 -358587 -421128 -240257 -211084 -191686 -307591 -386887 -216488 -144069 -176129 -190644 -4926
7104 -4926 159517 153324 -106630 -204672 -37869 67020 -107260 -53535 -165755 -187718 -211347
7093 -211347 -253643 -472943 -274687 -147884 -128061 -62002 -210127 -228589 -101798 123994
7083 123994 562523 525707 127431 -65097 -144225 79740 107337 -191563 -213926 40208
7073D0208J28863o9290j61738j72815l92236p0937N1316K29879N81004K8102j61938
7062C0418j23609j2653K97102J32719j78078L8057j78861m62204L4458P3819M9833
7051b98999J81302P395k251J1733k0188r120j00155M4270J76144K3149M9358J5283
7039G7921o1286j8278N9904P616k9438P5578k4436J4899N8563m5045l37410m1826
7027b63238j09416j05558j7014O6494m5375L49590K7419j507k40681j06433J53018
7016b92701R1203K4843M9171J41155L2305J01291j31473J4109K27042j6765j4641
7005B25539j43036k57553m6381N683O4488Q8916p6099J03641J9817k19744m7195
6994b81924O0746J82771k9837r2129Q8153o724j51615J73193J69391J026m41459
$$ plain form
7073 40208 169071 99781 -61957 -234772 -627008 -697945 -646629 -416750 164254 192356 30418
7062 30418 -93191 -105844 191258 323977 145899 183956 5095 -457109 -422651 -348832 -298999
7051 -298999 -117697 -110302 -112553 -100820 -121008 -130128 -230283 -186013 -9869 13280 62638 77921
7039 77921 16635 -1643 58261 65877 36439 112017 87581 102480 161043 115998 -221412 -263238
7027 -263238 -372654 -478212 -495226 -428732 -474107 -124517 -97098 -98605 -339286 -445719 -292701
7016 -292701 -201498 -176655 -127484 13671 45976 147267 15794 29903 256945 240180 225539
7005 225539 82503 -175050 -221431 -215748 -151260 -62344 -138443 -34802 -14985 -234729 -281924
6994 -281924 -221178 -38407 -68244 -160373 -72220 -78944 -230559 -57366 112025 113051 -328408
6983c28408r5757O7893K099O0483J7935O54K74190K6321r0414j0974j31994J56440
6971e1532K5269j15987q6956N7725N8050n6783J75463L8763j18638L0170J81197
6960A36741P7910j05536P0045j79135j97346J12917J81995k7399j30966k45385
6950c06159P8622R6294J58215r6588j26709J18897J46057J5274O4514o155p0547
6939G1715l7961j77717l28469J21947K42461l292Q1024R2357L2682j98506O9746
6928c4013K02952N6894m2206J36804N0292k01231l38632L7095M2941J28154m4481
6917e431Q748L3701k26678j1928M9364Q4788K08428J11356j03501j91350k21515
6906b64018Q8189J35897L12755k2124o8682k14378l2706j84125j76060J18312
$$ plain form
6983 -328408 -424165 -356272 -354173 -293690 -275755 -275101 -911 25410 -65004 -75978 -207972 -51532
6971 -51532 -26263 -142250 -229206 -171481 -113431 -170214 5249 44012 -74626 -44456 136741
6960 136741 214651 109115 179160 25 -197321 -84404 97591 70192 -60774 -306159
6950 -306159 -227537 -131243 26972 -69616 -196325 -77428 68629 83903 148417 142262 71715
6939 71715 33754 -143963 -472432 -350485 -108024 -111316 -30292 62065 94747 -103759 -34013
6928 -34013 168939 225833 183627 320431 370723 169492 -169140 -132045 -89104 39050 -5431
6917 -5431 3317 37018 -189660 -201588 -152224 -67436 140992 252348 148847 -42503 -264018
6906 -264018 -175829 -39932 272823 250699 182017 -32361 -65067 -249192 -425252 -306940
6896c06940K62361K56525N4514k38624q8914P1822P5453M4764Q1369m8054j71950
6885g674K32267K9357R8797Q47k69486R591L4738m9715p4071o1582K19513R7865
6873B60447k73408m1395l8470J16417M8153j80572N0310k637l3713K23280J41042
6862B69454M0485j31409k05792k11405J0512l6065k01565Q5999K26080N1097j33430
6851b36039O7981J826r3971P4291j21349L0254K28157L09142l6438j58987l04253
6840b39386k19073O1055j18616r833K30088p8801o9897K11690R1586O9740N6851
6829a4596j04317K25254P0791N6984J90651j00238j51173J87172l7812l86195
6819f3479k1513K42472K23453K77578l68523k97777k5229l1993J1388K00031o3987
$$ plain form
6896 -306940 -44579 211946 266460 27836 -61078 10744 86197 130961 212330 164276 -7674
6885 -7674 224593 253950 352747 353594 84108 93699 128437 78722 4651 -56931 162582 260447
6873 260447 -12961 -54356 -92826 23591 71744 -108828 -58518 -61155 -94868 128412 269454
6862 269454 309939 178530 -27262 -238667 -228155 -264220 -465785 -379786 -153706 -102609 -236039
6851 -236039 -168058 -166232 -260203 -185912 -307261 -277007 -48850 260292 223854 64867 -239386
6840 -239386 -458459 -397404 -516020 -525853 -295765 -374566 -444463 -232773 -141187 -71447 -14596
6829 -14596 -118913 106341 177132 234116 424767 324529 173356 360528 322716 -63479
6819 -63479 -84992 157480 380933 658511 289988 -7789 -33018 -65011 -53623 146408 82421
6808H2421R7403q5563n3372j81866P7827O9757M3794L1590J19646r921j79793
6797A1923q6176N8212r7112j56527L9590L0902M4002N1018P5321N961n9202l3882
6785a15970Q2450j0708q4057n9442p4421J8736N7518j13365J52111r7215j63115
6774d07478J66406K1616n2037J42500J75392q2523l6269j7853l0706J04274J8102
$$ plain form
6808 82421 179824 94261 40889 -140977 -63150 6607 50401 81991 201637 191716 11923
6797 11923 -74253 -16041 -113153 -269680 -230090 -199188 -155186 -104168 -28847 -22886 -82088 -115970
6785 -115970 -33520 -44228 -128285 -187727 -262148 -243412 -185894 -299259 -147148 -244363 -407478
6774 -407478 -241072 -219456 -271493 -128993 46399 -36124 -72393 -90246 -120952 -16678 1424
$$ [...]
##END NTUPLES=NMR SPECTRUM
##END=
