##TITLE=317084
cc 46513
468/31
adrs
colin
##JCAMPDX= 6.0         $$ Bruker NMR JCAMP-DX V2.0
##DATA TYPE= NMR SPECTRUM
##DATA CLASS= NTUPLES
##ORIGIN= Bruker BioSpin GmbH
##OWNER= nmr
$$ XWIN-NMR		Version 3.5
$$ Wed Jul 12 09:03:18 2006 GMT Daylight Time (UT+1h)  MAYBRIDGE\nmr@NMR_250MHZ
##.OBSERVE FREQUENCY= 250.131544655141
##.OBSERVE NUCLEUS= ^1H
##.ACQUISITION MODE= SIMULTANEOUS (DQD)
##.ACQUISITION SCHEME= undefined
##.AVERAGES= 2
##.DIGITISER RES= 18
##SPECTROMETER/DATA SYSTEM= dpx250
##.PULSE SEQUENCE= zg30
##.SOLVENT NAME= CDCl3
##.SHIFT REFERENCE= (INTERNAL, CDCl3, 0, 16.4627)
##AUDIT TRAIL= $$ (NUMBER, WHEN, WHO, WHERE, WHAT)
$$ ##TITLE= Audit trail, XWIN-NMR		Version 3.5
$$ ##JCAMPDX= 5.01
$$ ##ORIGIN= Bruker BioSpin GmbH
$$ ##OWNER= nmr
$$ C:/u/data/dgb/nmr/ADRS/15680/pdata/1/auditp.txt
$$ ##AUDIT TRAIL=  $$ (NUMBER, WHEN, WHO, WHERE, WHAT)
(   1,<2006-02-07 14:13:06.82 +000>,<MAYBRIDGE\nmr>,<NMR_250MHZ>,
      <created by zg, POWCHK disabled, PULCHK disabled
       terminated by command 'halt'
       configuration hash MD5:
       84 BC 41 DB A1 6E 1D 46 DA 25 12 A5 C1 ED C5 3A
       data hash MD5: 64K
       88 B0 6C 79 9C 58 06 4C 8D A0 02 92 A2 58 1F 81>)
(   2,<2006-02-07 14:13:12.29 +000>,<MAYBRIDGE\nmr>,<NMR_250MHZ>,
      <Start of raw data processing
       ef LB = 0.3 FT_mod = 6 PKNL = 1 SI = 32K 
       data hash MD5: 32K
       B2 7F 82 3D B3 B6 96 CE 56 88 E2 1E 92 D4 78 40>)
(   3,<2006-02-07 14:13:14.32 +000>,<MAYBRIDGE\nmr>,<NMR_250MHZ>,
      <apk 
       data hash MD5: 32K
       8F E1 0F 1C E3 0C 3C 4B BD 57 0B BD 96 2F 29 E5>)
(   4,<2006-02-07 14:13:15.29 +000>,<MAYBRIDGE\nmr>,<NMR_250MHZ>,
      <abs ABSG = 5 
       data hash MD5: 32K
       28 D1 27 3C 7C 68 00 DD A6 37 D5 65 7B 59 47 06>)
$$ ##END=
$$ 
$$ hash MD5
$$ CC 41 E5 BD C7 C1 01 2C DF 67 91 37 F2 DD A0 29
##$RELAX= 
##$RELAX= 
##$RELAX= 
##$RELAX= 
##$RELAX= 
##$RELAX= 
##$RELAX= 
$$ Bruker specific parameters
$$ --------------------------
##$DU= <C:\Restored>
##$EXPNO= 15680
##$NAME= <ADRS>
##$PROCNO= 1
##$TYPE= <nmr>
##$USER= <dgb>
##$AMP= (0..31)
100 100 100 100 100 100 100 100 100 100 100 100 100 100 100 100 100 100 
100 100 100 100 100 100 100 100 100 100 100 100 100 100 
##$AQSEQ= 0
##$AQ_mod= 3
##$AUNM= <au_zg>
##$AUTOPOS= <9 >
##$BF1= 250.13
##$BF2= 250.13
##$BF3= 250.13
##$BF4= 250.13
##$BF5= 500.13
##$BF6= 500.13
##$BF7= 500.13
##$BF8= 500.13
##$BYTORDA= 1
##$CFDGTYP= 0
##$CFRGTYP= 5
##$CHEMSTR= <none>
##$CNST= (0..31)
1 1 145 1 1 1 1 1 1 1 1 1 1 1 1 1 1 1 1 1 1 1 1 1 1 1 1 1 1 1 1 1 
##$CPDPRG= <>
##$CPDPRG1= <>
##$CPDPRG2= <>
##$CPDPRG3= <>
##$CPDPRG4= <mlev>
##$CPDPRG5= <mlev>
##$CPDPRG6= <mlev>
##$CPDPRG7= <mlev>
##$CPDPRG8= <mlev>
##$CPDPRGB= <>
##$CPDPRGT= <>
##$D= (0..31)
0 1 0 0 0 0 0 0 0 0.06 0 0 0 0 0 0 0.0002 0 0 0 0 0 0 0 0 0 0 0 0 0 0 
0 
##$DATE= 1139321585
##$DBL= (0..7)
120 120 120 120 120 120 120 120 
##$DBP= (0..7)
150 150 150 150 150 150 150 150 
##$DBP07= 0
##$DBPNAM0= <>
##$DBPNAM1= <>
##$DBPNAM2= <>
##$DBPNAM3= <>
$$ [...]
##$SUBNAM7= <"">
##$SUBNAM8= <"">
##$SUBNAM9= <"">
##$SW= 20.6930455092707
##$SWIBOX= (0..15)
0 0 3 0 0 0 0 0 0 0 0 0 0 0 0 0 
##$SW_h= 5175.983436853
##$TD= 65536
##$TD0= 1
##$TE= 293.16
##$TE2= 300
##$TE3= 300
##$TEG= 300
##$TL= (0..7)
0 120 120 120 120 120 120 120 
##$TP= (0..7)
150 150 150 150 150 150 150 150 
##$TP07= 0
##$TPNAME0= <>
##$TPNAME1= <>
##$TPNAME2= <>
##$TPNAME3= <>
##$TPNAME4= <>
##$TPNAME5= <>
##$TPNAME6= <>
##$TPNAME7= <>
##$TPOAL= (0..7)
0.5 0.5 0.5 0.5 0.5 0.5 0.5 0.5 
##$TPOFFS= (0..7)
0 0 0 0 0 0 0 0 
##$TUNHIN= 0
##$TUNHOUT= 0
##$TUNXOUT= 0
##$USERA1= <user>
##$USERA2= <user>
##$USERA3= <user>
##$USERA4= <user>
##$USERA5= <user>
##$V9= 5
##$VALIST= <valist>
##$VCLIST= <CCCCCCCCCCCCCCC>
##$VD= 0
##$VDLIST= <DDDDDDDDDDDDDDD>
##$VPLIST= <PPPPPPPPPPPPPPP>
##$VTLIST= <TTTTTTTTTTTTTTT>
##$WBST= 1024
##$WBSW= 4
##$XGAIN= (0..3)
0 0 0 0 
##$XL= 0
##$YL= 0
##$YMAX_a= 72295
##$YMIN_a= -66936
##$ZGOPTNS= <>
##$ZL1= 120
##$ZL2= 120
##$ZL3= 120
##$ZL4= 120
##$ABSF1= 16.46274
##$ABSF2= -4.230433
##$ABSG= 5
##$ABSL= 3
##$ALPHA= 0
##$AQORDER= 0
##$ASSFAC= 0
##$ASSFACI= 0
##$ASSFACX= 0
##$ASSWID= 0
##$AUNMP= <proc_1d>
##$AZFE= 0.1
##$AZFW= 0.1
##$BCFW= 0
##$BC_mod= 0
##$BYTORDP= 0
##$COROFFS= 0
##$CY= 12.5
##$DATMOD= 1
##$DC= 0
##$DFILT= <>
##$DTYPP= 0
##$F1P= 14.0000005364418
##$F2P= -0.99999901652339
##$FCOR= 0.5
##$FTSIZE= 32768
##$FT_mod= 6
##$GAMMA= 0
##$GB= 0
##$INTBC= 1
##$INTSCL= 1
##$ISEN= 128
##$LB= 0.3
##$LEV0= 0
##$LPBIN= 0
##$MAXI= 10000
##$MC2= 0
##$MEAN= 0
##$ME_mod= 0
##$MI= 0
##$NCOEF= 0
##$NC_proc= -6
##$NLEV= 6
##$NOISF1= 0
##$NOISF2= 0
##$NSP= 0
##$NTH_PI= 0
##$NZP= 0
##$OFFSET= 16.46274
##$PC= 1
##$PHC0= 97.78864
##$PHC1= 7.933648
##$PH_mod= 1
##$PKNL= yes
##$PPARMOD= 0
##$PSCAL= 4
##$PSIGN= 0
##$REVERSE= no
##$SF= 250.130014821606
##$SI= 32768
##$SIGF1= 0
##$SIGF2= 0
##$SINO= 400
##$SIOLD= 32768
##$SREGLST= <1H.CDCl3>
##$SSB= 0
##$STSI= 32768
##$STSR= 0
##$SW_p= 5175.98343685301
##$SYMM= 0
##$S_DEV= 0
##$TDeff= 65536
##$TDoff= 0
##$TI= <Analysis number 999999
Compound Code 99
Book Reference 9
Project Code 9>
##$TILT= no
##$TM1= 0
##$TM2= 0
##$TOPLEV= 0
##$USERP1= <user>
##$USERP2= <user>
##$USERP3= <user>
##$USERP4= <user>
##$USERP5= <user>
##$WDW= 1
##$XDIM= 32768
##$YMAX_p= 505131165
##$YMIN_p= -211309
$$ End of Bruker specific parameters
$$ ---------------------------------
##NTUPLES= NMR SPECTRUM
##VAR_NAME=  FREQUENCY,     SPECTRUM/REAL,   SPECTRUM/IMAG
##SYMBOL=    X,             R,               I
##VAR_TYPE=  INDEPENDENT,   DEPENDENT,       DEPENDENT
##VAR_FORM=  AFFN,          ASDF,            ASDF
##VAR_DIM=   32768,         32768,           32768
##UNITS=     HZ,            ARBITRARY UNITS, ARBITRARY UNITS
##FACTOR=    0.157963299565203, 1,           1
##FIRST=     4117.82538631153, 0,            0
##LAST=      -1058.15805054148, 0,           0
##MIN=       -1058.15805054148, -211309,     0
##MAX=       4117.82538631153, 505131165,    0
$$ Real data points
##PAGE= N=1
##DATA TABLE= (X++(R..R)), XYDATA
$$ [...]
$$ plain form
18347 57264239 75552637 100082613 126965348 149954428 163032454 163966559 155702060
18340 155702060 139920190 120438192 99830762 82112996 70237291 63975432 62571023
18333 62571023 65816152 74426731 89291640 110795533 136312696 160186807 176286673
18326 176286673 182188501 182964917 185700292 193750673 202133730 203620458 192662886 171100017
18318 171100017 144470760 120210088 102180859 87828301 74616252 61762238 51425238
18311 51425238 45080615 42125103 41840355 43480689 45390819 45002873 41637191 36166841
18303 36166841 31297062 28520858 27793793 29216075 32976577 38863737 45325742 49777814
18295 49777814 50880083 47971874 43008933 37446147 32367677 28384331 25459107 24103427
$$ packed form
18347E7264239J8288398K4529976K6882735K2989080J3078026R34105q264499
18340A55702060j5781870j9481998k0607430j7717766j1875705o261859j404409
18333F2571023L245129Q610579J4864909K1503893K5517163K3874111J6099866
18326A76286673N901828P76416K735375Q050381Q383057J486728j0957572k1562869
18318A71100017k6629257k4260672j8029229j4352558j3212049j2854014j0337000
18311E1425238o344623k955512k84748J640334J910130l87946l365682n470350
18303C6166841m869779k776204p27065J422282L760502N887160O462005M452072
18295D9777814J102269k908209m962941n562786n078470l983346k925224j355680
$$ plain form
18287 24103427 24289615 25418679 27076290 29009960 31635202 34819193 37149870 37588182
18279 37588182 36602324 35950268 36658313 37312785 35979388 32521514 27878034 24022029 21792791
18270 21792791 20638179 19563058 18402490 17568489 17502066 17583943 16742301 14862197 12393002
18261 12393002 10514605 9405049 8747663 8256624 7866550 7568342 7430479 7372380 7343432
18252 7343432 7291261 7327286 7535899 7917974 8671347 9806785 10955563 11545819 11390794
18243 11390794 10593547 9514721 8291474 7048529 6081171 5512451 5246232 5241706 5495795
18234 5495795 5995616 6668499 7232717 7338433 6876678 6002638 5191179 4523734 3954639
18225 3954639 3517487 3143119 2887822 2757215 2696234 2646406 2617250 2615632 2614221 2659082 2710721
$$ packed form
18287B4103427J86188J129064J657611J933670K625242L183991K330677M38312
18279C7588182r85858o52056P08045O54472j333397l457874m643480l856005k229238
18270B1792791j154612j075121j160568q34001o6423Q1877q41642j880104k469195
18261A2393002j878397j109556o57386m91039l90074k98208j37863n8099k8948
18252G343432n2171L6025K08613L82075P53373J135438J148778N90256j55025
18243A1390794p97247j078826j223247j242945r67358n68720k66219m526K54089
18234E495795M99821O72883N64218J05716m61755q74040q11459o67445n69095
18225C954639m37152l74368k55297j30607o0981m9828k9156j618j411M4861N1639
$$ plain form
18214 2710721 2740715 2701521 2643503 2540305 2428174 2337568 2339881 2305866 2333563 2458441 2544797
18203 2544797 2508666 2411638 2249335 2105978 1998819 1921530 1813824 1685217 1521500 1311012
18193 1311012 1159360 1128888 1169644 1187339 1146874 1102392 1073033 1074734 1095814 1150495 1254291
18182 1254291 1363039 1454270 1477987 1491905 1432968 1245094 1038683 872509 805758 785422
18172 785422 852667 966443 1077462 1163559 1246821 1239793 1181511 1074068 982178 954491 941913
18161 941913 888552 848366 797716 771613 793960 779929 772502 743174 732639 708429 666503 625263
18149 625263 595103 577213 592658 575092 594949 628214 676322 713445 765506 791690 754651
18138 754651 711705 706481 746498 789978 845823 871588 875778 825184 758227 686862 626971 595095
$$ packed form
18214B710721K9994l9194n8018j03198j12131r0606K313l4015K7697J24878Q6356
18203B544797l6131r7028j62303j43357j07159p7289j07706j28607j63717k10488
18193A311012j51652l0472M0756J7695m0465m4482k9359J701K1080N4681J03796
18182A254291J08748R1231K3717J3918n8937j87874k06411j66174o6751k0336
18172G85422O7245J13776J11019Q6097Q3262p028n8282j07443r1890k7687j2578
18161I41913n3361m0186n0650k6103K2347j4031p427k9328j0535k4210m1926m1240
18149F25263l0160j7890J5445j7566J9857L3265M8108L7123N2061K6184l7039
18138G54651m2946n224M0017M3480N5845K5765M190n0594o6957p1365n9891l1876
$$ plain form
18126 595095 587405 618813 628909 658778 721411 798363 800908 806014 838803 901086 963606 1080005
18114 1080005 1231005 1447378 1815423 2343559 3190381 4539286 6856733 10878718 16855675
18105 16855675 23285677 24895165 21944548 14739521 9027674 5858473 4065419 3029719
18097 3029719 2410357 1983249 1646088 1402640 1249479 1114162 972324 892541 853472 896023
18087 896023 891900 854826 855577 863957 816690 760839 664615 575644 525895 478814 475332 440884
18075 440884 378248 360219 393978 429314 479602 460939 412100 379552 360628 331403 279463
18064 279463 237936 237894 218633 195800 194125 191388 184359 131713 152084 143987 144174 121346 97373
18051 97373 112796 109895 154888 160165 147837 126529 129090 127258 112722 85188 92434 113338 141951
$$ packed form
18126E95095p690L1408J0096K9869O2633P6952K545N106L2789O2283O2520J16399
18114A080005J51000K16373L68045N28136Q46822J348905K317447M021985N976957
18105A6855675O430002J609488k950617p205027n711847l169201j793054j035700
18097C029719o19362m27108l37161k43448j53161j35317j41838p9783l9069M2551
18087H96023m123l7074P51Q380m7267n5851r6224q8971m9749m7081l482l4448
18075D40884o2636j8029L3759L5336N0288j8663m8839l2548j8924k9225n1940
18064B79463m1527m2j9261k2833j675k737p029n2646K0371q097J87k2828k3973
18051I7373J5423k901M4993N277j2328k1308K561j832j4536k7534P246K0904K8613
$$ plain form
18038 141951 113610 93587 65693 66356 99668 97823 131774 116686 120382 103473 93851 98872 112143
18025 112143 77003 101467 101802 107822 110819 112335 96035 84163 61673 96649 145173 144602 116387
18012 116387 101973 116158 112615 79300 97078 115884 120014 138504 100455 6931 -17703 7442
18000 7442 43327 53581 66284 69014 58319 8825 -8198 -53027 -34918 3538 9965 -2888
17988 -2888 24227 34518 59936 90584 65105 34375 43873 50987 53062 63766 62953 72727 74668
17975 74668 61530 33686 20431 63094 41892 32074 78387 61423 39839 19110 21081 62215
17963 62215 100977 133582 128637 99078 46081 25802 49549 66995 81445 64971 44173 53028
17951 53028 61828 56934 33169 7009 38707 6788 15674 75200 55715 61112 96734 75476
$$ packed form
18038A41951k8341k0023k7894O63L3312j845L3951j5088L696j6909r622N021J3271
18025A12143l5140K4464L35O020K997J516j6300j1872k2490L4976M8524n71k8215
18012A16387j4414J4185l543l3315J7778J8806M130J8490l8049r3524k4634K5145
18000G442L5885J0254J2703K730j0695m9494j7023m4829J8109L8456O427j2853
17988b888K7115J0291K5418L0648k5479l0730R498P114K075J0704q13R774J941
17975G4668j3138k7844j3255M2663k1202r818M6313j6964k1584k0729J971M1134
17963F2215L8762L2605m945k9559n2997k0279K3747J7446J4450j6474k0798Q855
17951E3028Q800m894k3765k6160L1698l1919Q886N9526j9485N397L5622k1258
$$ plain form
17939 75476 48858 75749 122649 117282 77549 96694 113020 100989 110075 106392 131117 149088
17927 149088 148351 104162 100704 75276 96332 115028 95169 72014 120347 166555 195628 186214
17915 186214 202056 217208 210443 189509 156829 148816 143775 160640 122962 83540 122307 165922
17903 165922 208604 203572 211248 216894 226158 221524 238985 242966 209196 170609 139547 90587 116550
17890 116550 129430 141458 178434 195555 191609 183103 155901 136204 177030 179120 168804 192108
17878 192108 224101 233642 269086 297471 357496 395382 368041 357066 296587 266376 327786 325742
17866 325742 300665 297178 330660 370463 372808 325482 273359 261279 254618 243173 226954 227926
17854 227926 221696 235433 272190 264876 247938 293961 299024 259745 263182 237561 245456 260906
$$ packed form
17939G5476k6618K6891M6900n367l9733J9145J6326j2031R086l683K4725J7971
17927A49088p37m4189l458k5428K1056J8696j9859k3155M8333M6208K9073r414
17915A86214J5842J5152o765k0934l2680q013n041J6865l7678l9422L8767M3615
17903A65922M2682n032P676N646R264m634J7461L981l3770l8587l1062m8960K5963
17890A16550J2880J2028L6976J7121l946q506k7202j9697M0826K090j0316K3304
17878A92108L1993R541L5444K8385O0025L7886k7341j0975o0479l0211O1410k044
17866C25742k5077l487L3482L9803K345m7326n2123j2080o661j1445j6219R72
17854B27926o230J3737L6757p314j6938M6023N063l9279L437k5621P895J5450
$$ plain form
17842 260906 234043 218782 234612 268250 281579 281983 268583 253137 274298 324970 380842 424441
17830 424441 385085 364726 386964 338171 318030 310512 310350 324350 367877 431734 472285 473163
17818 473163 483185 520789 500663 456689 399203 383013 367496 386611 352369 316228 307923 300317
17806 300317 299263 308536 271420 234242 213856 251197 231482 196198 157685 164968 184789 173721
17794 173721 192051 223750 253095 258261 279091 292736 331289 378240 439364 428147 358129 318460
17782 318460 330154 329591 342360 340358 341751 309772 266479 253117 240083 259659 321518 402074
17770 402074 410006 328919 290580 240078 179680 162906 163022 133289 88951 82753 139219 210555
17758 210555 215244 222986 190097 143277 132645 114411 120763 117463 85162 16864 2552 57701
$$ packed form
17842B60906k6863j5261J5830L3638J3329M04j3400j5446K1161N0672N5872M3599
17830D24441l9356k0359K2238m8793k0141p518j62J4000M3527O3857M0551Q78
17818D73163J0022L7604k0126m3974n7486j6190j5517J9115l4242l6141q305p606
17806C00317j054R273l7116l7178k0386L7341j9715l5284l8513P283J9821j1068
17794A73721J8330L1699K9345N166K0830J3645L8553M6951O1124j1217p0018l9669
17782C18460J1694n63J2769k002J393l1979m3293j3362j3034J9576O1859Q0556
17770D02074P932q1087l8339n0502o0398j6774J16k9733m4338o198N6466P1336
17758B10555M689P742l2889m6820j0632j8234O352l300l2301o8298j4312N5149
$$ plain form
17746 57701 105439 83088 70602 83145 104868 88801 53770 55330 25051 31095 16072 16650
17734 16650 1796 56389 57019 8422 35388 58568 38421 26351 33231 71266 45628 54551
17722 54551 90841 69204 51992 68016 56635 30307 27960 26174 43859 28586 43924 30947
17710 30947 12102 -11593 10399 35318 90931 60198 44760 62974 37144 23212 51503 63403
17698 63403 67491 86278 67791 87478 85752 48332 29253 56112 69556 57998 91133 76331
17686 76331 62257 87765 107521 70508 92797 81678 82839 125361 126735 105611 91568 56372
17674 56372 65424 64919 30876 38005 74565 89947 112435 154677 165051 154407 135683 110067
17662 110067 114308 97686 60513 33224 53014 120323 88304 49673 21124 7352 71924 97710
$$ packed form
17746E7701M7738k2351j2486J2543K1723j6067l5031J560l0279O044j5023N78
17734A6650j4854N4593O30m8597K6966K3180k0147j2070O880L8035k5638Q923
17722E4551L6290k1637j7212J6024j1381k6328k347j786J7685j5273J5338j2977
17710C0947j8845k3695K1992K4919N5613l0733j5438J8214k5830j3932K8291J1900
17698F3403M088J8787j8487J9687j726l7420j9079K6859J3444j1558L3135j4802
17686G6331j4074K5508J9756l7013K2289j1119J161M2522J374k1124j4043l5196
17674E6372R052n05l4043P129L6560J5382K2488M2242J0374j0644j8724k5616
17662A10067M241j6622l7173k7289J9790O7309l2019l8631k8549j3772O4572K5786
$$ plain form
17650 97710 92067 100509 108648 162341 187497 157937 112884 117022 135790 121369 80493 71754 52372
17637 52372 30746 51236 58265 -20463 -5793 25199 71075 110877 120795 94276 117337 138243
17625 138243 132272 114261 107666 104871 152588 185754 191598 173520 142139 111060 117239 84283
17613 84283 45120 37046 10464 -21594 -10130 11026 -6563 -39146 -44512 -35081 -56486 -76003
17601 -76003 -49167 -57660 -71172 -97382 -73858 -34806 -40352 -27025 -13821 7450 51969 40944
17589 40944 6435 -16989 -16070 -19532 -80451 -87188 -31175 -2975 -28154 20222 36597 -8357
17577 -8357 -48015 7174 21917 32906 56801 27433 29620 83856 48389 -6691 -10290 -36972
17565 -36972 -35075 -21348 -15376 -11614 9444 -36613 -75771 -87009 -68093 -40238 -46676 -35358
$$ packed form
17650I7710n643Q442Q139N3693K5156k9560m5053M138J8768j4421m0876q739j9382
17637E2372k1626K0490P029p8728J4670L0992M5876L9802R918k6519K3061K0906
17625A38243n971j8011o595k795M7717L3166N844j8078l1381l1079O179l2956
17613H4283l9163q074k6582l2058J1464K1156j7589l2583n366R431k1405j9517
17601g6003K6836q493j3512k6210K3524L9052n546J3327J3204K1271M4519j1025
17589D0944l4509k3424R19l462o0919o737N6013K8200k5179M8376J6375m4954
17577h357l9658N5189J4743J0989K3895k9368K187N4236l5467n5080l599k6682
17565c6972J897J3727N972L762K1058m6057l9158j1238J8916K7855o438J1318
$$ plain form
17553 -35358 -6399 23901 13513 10101 5691 -1113 -12034 -3997 4119 -28285 -50952 -47613 -41776
17540 -41776 -43194 -47940 -24415 -15975 -7342 -13384 -31470 -47000 -40763 412 25153 4056 -26387
17527 -26387 -30246 -50663 -45426 -49029 -59489 -77795 -58589 -18507 -9429 -20459 14750 5184 -70179
17514 -70179 -64174 -57200 -32783 -31304 5342 23892 5028 1921 13163 28072 10925 -6111
17502 -6111 -20746 -26358 -18297 -13514 -8806 -13667 29329 33975 21377 -19520 -47348 -94819 -123122
17489 -123122 -98012 -100616 -111849 -100769 -40976 -36873 -53788 -79137 -61616 4597 -10221 -45091
17477 -45091 -62524 -61088 -36482 -5164 -49005 -46354 -23545 -5909 -19468 -37191 -57840 -39944
17465 -39944 -28452 -26472 -43820 -19458 -39945 -49703 -16272 32423 54068 85619 69138 48843
$$ packed form
17553c5358K8959L0300j0388l412m410o804j0921Q037Q116l2404k2667L339N837
17540d1776j418m746K3525Q440Q633o042j8086j5530O237M1175K4741k1097l0443
17527b6387l859k0417N237l603j0460j8306J9206M0082R078j1030L5209r566p5363
17514g0179O005O974K4417J479L6646J8550j8864l107J1242J4909j7147j7036
17502f111j4635n612Q061M783M708m861M2996M646j2598m0897k7828m7471k8303
17489a23122K5110k604j1233J1080N9793M103j6915k5349J7521O6213j4818l4870
17477d5091j7433J436K4606L1318m3841K651K2809J7636j3559j7723k0649J7896
17465c9944J1492J980j7348K4362k0487r758L3431M8695K1645L1551j6481k0295
$$ plain form
17453 48843 65519 17633 -19951 -6879 1206 -18036 -14365 -24486 -49277 -37092 -40587 -44449
17441 -44449 -41267 -15082 47722 93211 91868 77056 34022 36372 18062 41680 21149 10389
17429 10389 -3760 -14930 -37102 -35232 -6128 -2248 10366 894 -24767 -65203 -24924 -724
17417 -724 -14071 -20913 -33838 -24852 39183 62153 49710 3901 -18153 -2820 15365 27453
17405 27453 6156 28955 76557 157701 190059 213268 183561 150429 123724 79243 35852 43814
17393 43814 67083 60967 24156 20016 26556 18148 -3616 8688 -9303 -41027 -62773 -5679
17381 -5679 37682 81475 76034 35038 -971 31904 90323 80936 39813 30790 -503 -14511
17369 -14511 34110 46957 22174 -28739 -20417 -5883 -22902 -27034 -12611 -11264 -19719 -12049 -7865
$$ packed form
17453D8843J6676m7886l7584J3072Q085j9242L671j0121k4791J2185l495l862
17441d4449L182K6185O2804M5489j343j4812m3034K350j8310K3618k0531j0760
17429A0389j4149j1170k2172J870K9104L880J2614r472k5661m0436M0279K4200
17417g24j3347o842j2925Q986O4035K2970j2443m5809k2054J5333J8185J2088
17405B7453k1297K2799M7602Q1144L2358K3209k9707l3132k6705m4481m3391P962
17393D3814K3269o116l6811m140O540q408k1764J2304j7991l1724k1746N7094
17381e679M3361M3793n441m0996l6009L2875N8419r387m1123r023l1293j4008
17369a4511M8621J2847k4783n0913Q322J4534j7019m132J4423J347q455P670M184
$$ plain form
17356 -7865 -53325 -62898 -34972 1797 30658 36138 14663 -26016 -53317 -25909 3468 47285
17344 47285 17303 -29962 -33326 -22710 722 4334 -37379 -11441 18204 30597 8608 627
17332 627 -3485 -22915 -35105 -5044 23310 24567 -50052 -72947 -72602 -53987 -43556 -22172 -19917
17319 -19917 -50745 -48556 -17053 23254 83039 50573 19367 32304 16513 -18799 -25310 -820
17307 -820 -6444 -44033 -67234 -72895 -84912 -98917 -79103 -61481 -61174 -23458 -18327 -36792 -75346
17294 -75346 -88055 -78184 -44292 -20346 -31051 -61902 -73924 -80325 -78396 -77289 -71270 -64213 -61808
17281 -61808 -85097 -82278 -83527 -67391 -25105 -4197 -17264 -16916 -3010 -27001 -53904 -80071
17269 -80071 -63199 -54779 -35229 -1780 7122 23857 45958 29041 -2778 -14123 -1235 -11946
$$ packed form
17356g865m5460r573K7926L6769K8861N480k1475m0679k7301K7408K9377M3817
17344D7285k9982m7265l364J0616K3432L612m1713K5938K9645J2393k1989p981
17332F27m112j9430j2190L0061K8354J257p4619k2895L45J8615J0431K1384K255
17319a9917l0828K189L1503M0307N9785l2466l1206J2937j5791l5312o511K4490
17307h20n624l7589k3201n661j2017j4005J9814J7622L07L7716N131j8465l8554
17294g5346j2709R871L3892K3946j0705l0851j2022o401J929J107O019P057K405
17281f1808k3289K819j249J6136M2286K0908j3067L48J3906k3991k6903k6167
17269h0071J6872Q420J9550L3449Q902J6735K2101j6917l1819j1345J2888j0711
$$ plain form
17257 -11946 8343 18483 -16187 -50656 -35484 -36192 4628 53028 42711 21796 8152 3044
17245 3044 -25682 -29030 5988 28789 38961 20289 6269 34718 -6633 -29827 -2723 35992
17233 35992 83558 74915 36178 26744 30659 23987 25856 30377 -9443 -35042 -41651 -83635 -85302
17220 -85302 -98619 -88569 -102406 -96533 -65549 -33822 42043 62749 21786 -22372 -48736 -74844
17208 -74844 -58089 -6297 10609 -201 -24728 -28910 -24062 -42595 -32260 -13710 10956 -2790
17196 -2790 -14332 -50201 -69602 -38276 -18701 -35674 -57872 -5744 38580 61080 40288 4233
17184 4233 -9239 -43289 -63251 -74923 -23051 -27110 -30248 -42724 -56955 -58677 -54663 -45622 -939
17171 -939 30059 19660 17376 57759 58113 11541 -8222 -28195 -49530 -84765 -83235 -74157 -33091
$$ packed form
17257a1946K0289J0140l4670l4469J5172p08M0820M8400j0317k0915j3644n108
17245C044k8726l348L5018K2801J0172j8672j4020K8449m1351k3194K7104L8715
17233C5992M7566q643l8737r434L915o672J869M521l9820k5599o609m1984j667
17220h5302j3317J0050j3837N873L0984L1727P5865K0706m0963m4158k6364k6108
17208g4844J6755N1792J6906j0810k4527m182M848j8533J0335J8550K4666j3746
17196b790j1542l5869j9401L1326J9575j6973k2198N2128M4324K2500k0792l6055
17184D233j3472l4050j9962j1672N1872m059l138j2476j4231j722M014R041M4683
17171i39L0998j0399k284M0383L54m6572j9763j9973k1335l5235J530R078M1066
$$ plain form
17158 -33091 9219 -3441 -24637 -36074 -50056 -72101 -57771 -22016 -5643 -24090 -75617 -70801
17146 -70801 -24403 -19590 -63121 -49277 -21630 -15038 -30627 -8933 9256 5129 -8643 -11973
17134 -11973 -34506 -36788 -23464 2491 -40445 -50078 -56061 -43406 -10314 59280 77647 47452
17122 47452 28851 19751 22846 -17977 -26583 -28590 8714 36012 61982 83933 85910 65901 47068
17109 47068 28158 3783 47465 63940 60877 35675 -36721 -16132 30713 27182 32573 16520
17097 16520 -28783 -36260 -36269 -8963 -7936 -5654 -12291 -17572 5363 49103 -9215 -47724 -78903
17084 -78903 -29004 -39428 -57559 -30904 -42941 -53229 -42626 -6298 -8413 -29503 -14271 -8423
17072 -8423 -29837 -23231 8505 17013 8001 -17143 -10962 25777 80874 76425 22905 -2739 -6568
$$ packed form
17158c3091M2310j2660k1196j1437j3982k2045J4330L5755J6373j8447n1527M816
17146g0801M6398M813m3531J3844K7647O592j5589K1694J8189m127j3772l330
17134a1973k2533k282J3324K5955m2936r633n983J2655L3092O9594J8367l0195
17122D7452j8601r100L095m0823q606k007L7304K7298K5970K1951J977k0009j8833
17109D7068j8910k4375M3682J6475l063k5202p2396K0589M6845l531N391j6053
17097A6520m5303p477rK7306J027K282o637n281K2935M3740n8318l8509l1179
17084g8903M9899j0424j8131K6655j2037j0288J0603L6328k115k1090J5232N848
17072h423k1414O606L1736Q508r012k5144O181L6739N5097m449n3520k5644l829
$$ plain form
17059 -6568 21470 10302 -10885 -1409 44371 62951 17569 24 -39464 -41022 -10460 8445
17047 8445 -26106 -37161 -54885 -36827 -9917 25061 52973 26304 -21857 -12470 -5093 -18306
17035 -18306 -27251 -69820 -47258 3992 48149 29985 7240 -8354 -5171 -13448 -38594 -22911
17023 -22911 -5231 7452 25083 62374 80657 88472 35908 52169 95786 94399 100276 117315
17011 117315 120013 120131 168452 201807 273328 343919 439052 541776 617679 621519 624645 591250
16999 591250 525446 437403 275403 196329 179422 161911 84247 49603 72135 93587 81972
16988 81972 66368 106744 138067 89390 41649 59447 63010 76789 52583 7243 10860 36979
16976 36979 35427 28546 30656 15764 15785 7299 12699 -10765 17001 60001 35617 35336 31114 37292
$$ packed form
17059f568K8038j1168k1187R476M5780J8580m5382j7545l9488j558L0562J8905
17047H445l4551j1055j7724J8058K6910L4978K7912k6669m8161R387P377j3213
17035a8306q945m2569K2562N1250M4157j8164k2745j5594L183q277k5146J5683
17023b2911J7680J2683J7631L7291J8283P815n2564J6261M3617j387N877J7039
17011A17315K698J18M8321L3355P1521P0591R5133J02724P5903L840L126l3395
16999E91250o5804q8043j62000p9074j6907j7511p7664l4644K2532K1452j1615
16988H1972j5604M0376L1323m8677m7741J7798L563J3779k4206m5340L617K6119
16976C6979j552o881K110j4892K1q486N400k3464K7766M3000k4384k81m222O178
$$ plain form
16962 37292 54344 94735 106396 74084 39054 10044 -12641 -13888 28499 35520 52477 58053
16950 58053 31420 -7593 23353 54799 45718 19982 13200 -13883 -47977 -90295 -84243 -68951
16938 -68951 -76312 -83887 -82173 -50532 -39389 -46013 -65245 -82869 -98421 -110304 -75502 -32140
16926 -32140 19192 32699 23885 45933 27391 -21320 -39634 -75456 -120699 -151727 -131430 -69174
16914 -69174 -63017 -85204 -65643 -43055 -16030 -11542 -23945 -25404 -39714 -34915 4732 19411
16902 19411 -4283 -8882 23951 29096 62524 91007 55137 6037 28684 13190 32110 87163
16890 87163 116132 118215 113600 109105 89068 85960 71776 98754 113263 106751 109249 111831 159594
16877 159594 274887 370583 474905 585403 670544 730607 808228 859770 809853 783838 697847
$$ packed form
16962C7292J7052M0391J1661l2312l5030k9010k2685j247M2387P021J6957N576
16950E8053k6633l9013L0946L1446r081k5736o782k7083l4094m2318O052J5292
16938f8951p361p575J714L1641J1143o624j9232j7624j5552j1883L4802M3362
16926c2140N1332J3507q814K2048j8542m8711j8314l5822m5243l1028K0297O2256
16914f9174O157k2187J9561K2588K7025M488j2403j459j4310M799L9647J4679
16902A9411k3694m599L2833N145L3428K8483l5870m9100K2647j5494J8920N5053
16890H7163K8969K083m615m495k0037l108j4184K6978J4509o512K498K582M7763
16877A59594J15293R5696J04322J10498Q5141O0063P7621N1542m9917k6015q5991
$$ plain form
16866 697847 556016 432170 345459 232311 145915 120857 130995 123111 103109 58394 35638
16855 35638 -5590 -32370 -11879 24811 5758 3042 8728 13044 20727 9333 -12867 31149
16843 31149 29406 31523 75998 104501 92012 63641 67856 61694 77730 76817 72553 56230 48006
16830 48006 44348 42408 60509 56657 34619 34517 65352 29676 -6800 -12266 -3187 15728 14740
16817 14740 44261 34116 34815 51556 36734 29557 46949 87840 66337 11195 -8994 -46134
16805 -46134 -31683 -7159 -17889 -14871 -43511 -75091 -77127 -50424 -21776 -10904 1380 -31004
16793 -31004 -31547 19564 55070 101042 101454 78996 43063 35955 69310 50869 15665 37357 89371
16780 89371 108143 122920 104469 50149 51026 85403 50353 41304 56397 62887 34128 59944
$$ packed form
16866F97847j41831j23846q6711j13148q6396k5058J0138p884k0002m4715k2756
16855C5638m1228k6780K0491L6690j9053k716N686M316P683j1394k2200M4016
16843C1149j743K117M4475K8503j2489k8371M215o162J6036r13m264j6323q224
16830D8006l658j940J8101l852k2038j02L0835l5676l6476n466R079J8915r88
16817A4740K9521j0145O99J6741j4822p177J7392M0891k1503n5142k0189l7140
16805d6134J4451K4524j0730L018k8640l1580k036K6703K8648J0872J2284l2384
16793c1004n43N1111L5506M5972M12k2458l5933p108L3355j8441l5204K1692N2014
16780H9371J8772J4777j8451n4320Q77L4377l5050r049J5093O490k8759K5816
$$ plain form
16768 59944 69886 73831 64891 58298 26867 -22870 -54150 -32251 -9169 17189 55149 14864
16756 14864 -36924 -40926 -28952 -53410 -25433 -23397 -25253 11106 15184 45282 37875 31350 55045
16743 55045 30509 -3399 -12424 -24916 2117 10370 9932 -9572 -624 29258 42564 54938 45539
16730 45539 12224 975 -963 -21508 -19382 -45068 -32909 -29816 -22174 17356 48676 60316
16718 60316 64960 52250 58188 82569 106677 157190 176481 119798 109605 102791 98369 108028 104841
16705 104841 127593 127593 75522 38542 47816 49564 42602 18426 -46674 -74877 -49450 -61269 -60938
16692 -60938 -27425 27257 25598 -9085 -14576 12271 26450 61650 94641 117378 107594 64588
16680 64588 57500 76852 82378 37977 40982 42538 60402 40990 43502 56132 29961 34518 63766
$$ packed form
16768E9944R942L945q940o593l1431m9737l1280K1899K3082K6358L7960m0285
16756A4864n1788m002J1974k4458K7977K036j856L6359M078L0098p407o525K3695
16743E5045k4536l3908r025j2492K7033Q253m38j9504Q948K9882J3306J2374r399
16730D5539l3315j1249j938k0545K126k5686J2159L093P642L9530L1320J1640
16718F0316M644j2710N938K4381K4108N0513J9291n6683j0193o814m422R659l187
16705A04841K2752%n2071l6980R274J748o962k4176o5100k8203K5427j1819L31
16692f0938L3513N4682j659l4683n491K6847J4179L5200L2991K2737r784m3006
16680F4588p088J9352N526m4401L005J556J7864j9412K512J2630k6171M557K9248
$$ plain form
16667 63766 42272 8904 3114 64055 104021 88234 51926 -3672 -27876 -26276 13535 29510
16655 29510 8648 4459 1702 4173 20835 26909 10655 11831 -19084 -47991 -75356 -96507 -120194
16642 -120194 -124345 -119784 -116470 -137522 -167856 -147636 -111060 -56277 -40823 -33026 -58696 -48834
16630 -48834 -82619 -96804 -49977 -10139 -19708 -23644 -15645 -4545 4678 14759 -29014 -30061 -8433
16617 -8433 -10091 -3183 -24041 -32696 -39734 -3929 -22957 -16058 40777 44141 88483 154150 144250
16604 144250 201339 216021 171389 138271 143146 182764 177544 131325 124177 132785 168769 239371
16592 239371 252884 258720 240986 249307 269511 323173 418597 522437 640971 756359 902589
16581 902589 1105613 1317173 1518711 1614996 1556635 1405675 1173105 934954 715979 530358
$$ packed form
16667F3766k1494l3368n790O0941L9966j5787l6308n5598k4204J600L9811J5975
16655B9510k0862m189k757K471J6662O074j6254J176l0915k8907k7365k1151k3687
16642a20194m151M561L314k1052l0334K0220L6576N4783J5454P797k5670R862
16630d8834l3785j4185M6827L9838r569l936P999J1100R223J0081m3773j047K1628
16617h433j658O908k0858q655p038L5805j9028O899N6835L364M4342O5667r900
16604A44250N7089J4682m4632l3118M875L9618n220m6219p148Q608L5984P0602
16592B39371J3513N836j7734Q321K0204N3662R5424J03840J18534J15388J46230
16581I02589K03024K11560K01538R6285n8361j50960k32570k38151k18975j85621
$$ plain form
16571 530358 429718 346882 322926 323473 343212 343610 338076 364666 408346 400425 393807 397204 418978
16558 418978 419751 417074 408660 413589 467712 533179 541938 554940 548649 551952 530805 460144 424785
16545 424785 434978 397064 357737 371773 344478 295142 286393 308911 304516 288272 236678 211312
16533 211312 202933 172813 122298 136613 149768 171112 204217 211705 240116 233244 232334 228942 294998
16520 294998 331956 310466 327647 373932 440776 496779 584072 652761 750222 825478 916763
16509 916763 996320 1086672 1134622 1122412 1082936 1009855 892297 811104 733532 650061 623076
16498 623076 671478 707010 735666 745139 757384 799369 821405 810952 790189 776534 810611 854401
16486 854401 932838 1043446 1190956 1350273 1617848 1931234 2242047 2509011 2754564 3023365
$$ packed form
16571E30358j00640q2836k3956N47J9739L98n534K6590M3680p921o618L397K1774
16558D18978P73k677q414M929N4123O5467Q759J3002o291L303k1147p0661l5359
16545D24785J0193l7914l9327J4036k7295m9336q749K2518m395j6244n1594k5366
16533B11312q379l0120n0515J4315J3155K1344L3105P488K8411o872r10l392O6056
16520B94998L6958k1490J7181M6285O6844N6003Q7293O8689R7461P5256R1285
16509I16763P9557R0352M7950j2210l9476p3081j17558q1193p7572q3471k6985
16498F23076M8402L5532K8656R473J2245M1985K2036j0453k0763j3655L4077M3790
16486H54401P8437J10608J47510J59317K67575L13386L10813K66964K45553K68801
$$ plain form
16476 3023365 3342816 3728769 4228873 4931496 5753910 6632647 7421578 7984030 8334317
16467 8334317 8665460 9222494 10215501 11804355 14229401 17920540 23489341 31882026 44165365
16458 44165365 60821245 80764636 101387308 119746248 131308897 132402688 122973305
16451 122973305 105281489 84783775 64893151 47541590 34605530 25815686 19934046
16444 19934046 15920282 13052683 10956825 9434311 8288580 7402331 6744012 6204367
16436 6204367 5719425 5233207 4784543 4397306 4027265 3758027 3530185 3336795 3147088
16427 3147088 3005706 2822945 2588534 2398319 2262221 2139231 1980926 1790134 1623521
16418 1623521 1500793 1383893 1245327 1100407 970750 886260 837332 762799 688523 644020
$$ packed form
16476C023365L19451L85953N00104P02623Q22414Q78737P88931N62452L50287
16467H334317L31143N57034R93007J588854K425046L691139N568801Q392685J2283339
16458D4165365J6655880J9943391K0622672J8358940J1562649J093791r429383
16451A22973305j7691816k0497714j9890624j7351561j2936060q789844n881640
16444A9934046m013764k867599k095858j522514j145731q86249o58319n39645
16436F204367m84942m86218m48664l87237l70041k69238k27842j93390j89707
16427C147088j41382j82761k34411j90215j36098j22990j58305j90792j66613
16418A623521j22728j16900j38566j44920j29657q4490m8928p4533p4276m4503
$$ plain form
16408 644020 601670 548609 468514 432183 409543 383472 352833 340411 266891 222829 232486 221990
16396 221990 215069 242287 245241 244997 265425 247722 251613 253783 265914 304880 307561 307772 340499
16383 340499 350473 371897 389670 378002 383745 365553 339060 352538 325610 225641 175572 195263
16371 195263 228724 181442 93096 87766 123030 113459 103195 99104 88872 108486 115154 110030
16359 110030 101226 53149 35298 63538 99386 52312 18473 30707 51226 62030 31666 39194
16347 39194 70076 85121 21290 8559 292 8819 80412 102520 83150 119013 160265 126738
16335 126738 133432 140962 124170 108401 138639 116884 29635 -1108 -50108 -53596 -61612 -79789
16323 -79789 -94839 -110412 -97557 -60415 -20799 -29204 -29714 -3849 -15104 -30369 -44861 -10108
$$ packed form
16408F44020m2350n3061q0095l6331k2640k6071l0639j2422p3520m4062R657j0496
16396B21990o921K7218K954k44K0428j7703L891K170J2131L8966K681K11L2727
16383C40499R974K1424J7773j1668N743j8192k6493J3478k6928r9969n0069J9691
16371A95263L3461m7282q8346n330L5264r571j0264m091j0232J9614O668n124
16359A10030q804m8077j7851K8240L5848m7074l3839J2234K0519J0804l0364P528
16347C9194L0882J5045o3831j2731q267Q527P1593K2108j9370L5863M1252l3527
16335A26738O694P530j6792j5769L0238k1755q7249l0743m9000l488q016j8177
16323g9789j5050j5573J2855L7142L9616q405n10K5865j1255j5265j4492L4753
$$ plain form
16311 -10108 6467 12123 29071 40534 18492 -9397 -15489 -28066 -66199 -85349 -61428 -2657
16299 -2657 7795 38646 37171 43359 98651 117036 136125 131692 101598 67727 54151 50679 49284
16286 49284 42430 46354 51657 78664 61139 48918 99785 110230 131822 161226 114641 72200
16274 72200 69668 95904 100360 113012 155336 250235 267232 266601 279926 247546 206950 168421
16262 168421 120088 110912 89220 60773 49604 40286 17738 -21043 -73653 -56843 -34730 -21780
16250 -21780 -16108 -4765 4856 -4513 21211 13452 7001 -16621 -43136 -46332 -54968 -42744 -63773
16237 -63773 -83581 -91725 -163683 -211309 -180649 -158964 -144459 -153715 -134565 -114193 -91787 -50532
16225 -50532 -46892 -66012 -37978 -19711 -32729 -50795 -29815 20987 14169 -14574 -57371 -50239
$$ packed form
16311a0108J6575N656J6948J1463k2042k7889o092j2577l8133j9150K3921N8771
16299b657J0452L0851j475O188N5292J8385J9089m433l0094l3871j3576l472j395
16286D9284o854L924N303K7007j7525j2221N0867J0445K1592K9404m6585m2441
16274G2200k532K6236M456J2652M2324R4899J6997o31J3325l2380m0596l8529
16262A68421m8333r176k1692k8447j1169r318k2548l8781n2610J6810K2113J2950
16250b1780N672J1343R621r369K5724p759o451k3622k6515l196q636J2224k1029
16237f3773j9808q144p1958m7626L0660K1685J4505r256J9150K0372K2406M1255
16225e0532L640j9120K8034J8267j3018j8066K0980N0802o818k8743m2797P132
$$ plain form
16213 -50239 -6009 -13639 -57209 -71598 -80111 -54164 -2118 32460 24110 25767 10584 -5561
16201 -5561 28978 42525 27307 -11316 -16247 -24314 -4800 -14126 -18591 -21143 -9758 -26295 -11510
16188 -11510 -23893 -41279 -11586 31554 17709 -43480 -52545 -10114 26524 38052 4244 -34068
16176 -34068 -35754 -48740 -50016 -53333 -30119 -23302 -58678 -32178 -17486 -18485 -23143 -827 -16457
16163 -16457 -94969 -113683 -63110 -12402 -36357 -50623 -61107 -31749 11549 8412 -11384 1921
16151 1921 14727 -22001 -33529 -20880 -5031 -20655 -59437 -56096 -34200 -40821 -60884 -12318
16139 -12318 57942 53479 90236 81480 25230 15594 -5202 -6145 -33412 -54456 -15336 6286 -8126
16126 -8126 -4087 -14346 -41652 -20155 1894 22590 10808 11909 27094 35909 50556 51338 60888
$$ packed form
16213e0239M4230p630m3570j4389q513K5947N2046L4578q350J657j5183j6145
16201e561L4539J3547j5218l8623m931q067J9514r326m465k552J1385j6537J4785
16188a1510j2383j7386K9693M3140j3845o1189r065M2431L6638J1528l3808l8312
16176c4068j686j2986j276l317K3214O817l5376K6500J4692r99m658K2316j5630
16163a6457p8512j8714N0573N0708k3955j4266j0484K9358M3298l137j9796J3305
16151A921J2806l6728j1528J2649J5849j5624l8782L341K1896o621k0063M8566
16139a2318P0260m463L6757q756n6250r636k0796r43k7267k1044L9120K1622j4412
16126h126M039j0259k7306K1497K2049K0696j1782J101J5185Q815J4647P82R550
$$ plain form
16113 60888 59352 49222 55774 10147 -27552 6263 12512 -31840 -28399 13968 49469 57116 73685
16100 73685 110425 100907 34126 948 6866 -10654 -25596 -26808 -25295 -63763 -36079 22325
16088 22325 46828 -5601 -72539 -73307 -47817 -87209 -89453 -69889 -65899 -99622 -94378 -56912 -23338
16075 -23338 -24911 -33729 -5141 33484 20349 34178 22342 38216 59846 46450 7255 -10981
16063 -10981 -8153 -22269 -67389 -68793 -49598 -12419 -15279 -37978 -36192 -35230 -36114 12959 16061
16050 16061 -37495 -49663 -67876 -40500 -29073 -93842 -105985 -102854 -45479 -407 243 14209
16038 14209 25125 3634 -41396 -24314 25399 6131 -50025 -77950 -59155 -33573 -32517 -17445
16026 -17445 -34886 -85309 -102933 -106462 -87399 -66592 -75920 -72504 -34866 -28185 -9122 9013
$$ packed form
16113F0888j536j0130O552m5627l7699L3815O249m4352L441M2367L5501P647J6569
16100G3685L6740r518o6781l3178N918j7520j4942j212J513l8468K7684N8404
16088B2325K4503n2429o6938p68K5490l9392k244J9564L990l3723N244L7466L3574
16075b3338j573q818K8588L8625j3135J3829j1836J5874K1630j3396l9195j8236
16063a0981K828j4116m5120j404J9195L7179k860k2699J786R62q84M9073L102
16050A6061n3556j2168j8213K7376J1427o4769j2143L131N7375M5072O50J3966
16038A4209J0916k1491m5030J7082M9713j9268n6156k7925J8795K5582J056J5072
16026a7445j7441n0423j7624l529J9063K0807r328L416L7638O681J9063J8135
$$ plain form
16014 9013 723 3668 28872 27827 37121 -1498 -45629 -31256 -55878 -98167 -71333 -19880 8109
16001 8109 -10916 17982 34338 -2191 -18552 -29792 7834 30600 26786 42528 40990 47552
15989 47552 16404 -48992 -33231 -12220 -32549 -41481 -54888 -59244 -54657 -66840 -35843 -47554
15977 -47554 -66615 -60879 -41723 -9072 15068 54080 -2169 -54239 -49472 -62560 -50701 -51317
15965 -51317 -65079 -73202 -76440 -85017 -39269 -22786 -5737 -19980 9491 30999 31882 18816 -19136
15952 -19136 -57717 -64638 -26230 -30040 -42988 -28631 -16918 -33489 -26217 -46665 -46008 -27794 12062
15939 12062 53811 47965 25733 -3638 11378 23011 38805 3942 -47643 -14077 34633 28917
15927 28917 65009 156262 174082 176602 227261 279236 308790 292269 251993 198445 200700 179603
$$ packed form
16014I013q290K945K5204j045R294l8619m4131J4373k4622m2289K6834N1453K7989
16001H109j9025K8898J6356l6529j6361j1240L7626K2766l814J5742j538O562
15989D7552l1148o5396J5761K1011k0329q932j3407m356M587j2183L0997j1711
15977d7554j9061N736J9156L2651K4140L9012n6249n2070M767j3088J1859o16
15965e1317j3762q123l238q577M5748J6483J7049j4243K9471K1508Q83j3066l7952
15952a9136l8581o921L8408l810j2948J4357J1713j6571P272k0448O57J8214L9856
15939A2062M1749n846k2232k9371J5016J1633J5794l4863n1585L3566M8710n716
15927B8917L6092R1253J7820K520N0659N1975K9554j6521m0276n3548K255k1097
$$ plain form
15915 179603 157713 147475 113679 105622 124075 134330 135591 115835 153577 191203 239529 306038
15903 306038 406780 499449 593247 642129 624495 578708 525066 468735 395292 310671 251384
15892 251384 175359 141246 131168 99349 74744 27550 19861 29644 53202 45453 19216 29219
15880 29219 23537 -9039 6435 720 -643 18236 22916 479 -7727 12136 -7765 -25872 -58992
15867 -58992 -91885 -69719 -62670 -66219 -71131 -59604 -52791 -59242 -11 9341 -28144 -40656 -44603
15854 -44603 -41350 -37929 -32995 3397 7660 -21757 -36626 -21332 -2397 32234 38585 60366 41498
15841 41498 -1721 -31971 -22781 -4155 -27983 -18566 -4515 -16442 -10713 -20140 15103 26094
15829 26094 4409 2712 -1791 -24030 -34953 -29758 -13439 -13957 -66607 -84290 -73089 -50672 -39623
$$ packed form
15915A79603k1890j0238l3796q057J8453J0255J261j9756L7742L7626M8326O6509
15903C06038J00742R2669R3798M8882j7634m5787n3642n6331p3443q4621n9287
15892B51384p6025l4113j0078l1819k4605m7194p689R783K3558p749k6237J0003
15880B9219n682l2576J5474n715j363J8879M680k2437q206J9863j9901j8107l3120
15867e8992l2893K2166P049l549m912J1527O813o451N9231R352l7485j2512l947
15854d4603L253L421M934L6392M263k9417j4869J5294J8935L4631O351K1781j8868
15841D1498m3219l0250R190J8626k3828R417J4051j1927N729r427L5243J0991
15829B6094k1685j697m503k2239j0923N195J6319n18n2650j7683J1201K2417J1049
$$ plain form
15816 -39623 -70400 -61568 -69025 -79531 -51841 -37082 -34691 -44729 -44172 -68614 -23613 -6101 -4639
15803 -4639 -2161 15931 6839 -27858 -11323 1017 18708 -6337 -34435 -40798 -7709 30483
15791 30483 79303 54362 13385 -44545 -50970 -14559 28146 41852 82568 64109 724 -1306
15779 -1306 -1617 -37679 -47733 -45441 -53945 -28472 -12855 -32264 -19414 -19661 -32809 -72894 -34514
15766 -34514 -19784 -12771 -691 15858 15710 8356 6535 65749 61129 22213 -7187 -42069 -26083
15753 -26083 -30506 -30664 -34514 -12270 -28242 -62153 -56088 -55113 -50226 -6233 22065 17044 17752 11468
15739 11468 7263 24729 -5297 -22615 -11186 4616 20579 -5440 10013 27472 18384 6488
15727 6488 5022 -7433 -15104 -21787 -57428 -62990 -56485 -88731 -69391 -40130 -25069 -48429 -48512
$$ packed form
15816c9623l0777Q832p457j0506K7690J4759K391j0038N57k4442M5001J7512J462
15803d639K478J8092r092l4697J6535J2340J7691k5045k8098o363L3089L8192
15791C0483M8820k4941m0977n7930o425L6411M2705J3706M0716j8459o3385k030
15779a306l11l6062j0054K292q504K5473J5617j9409J2850k47j3148m0085L8380
15766c4514J4730P013J2080J6549j48p354j821N9214m620l8916k9400l4882J5986
15753b6083m423j58l850K2244j5972l3911O065R75M887M3993K8298n021P08o284
15739A1468m205J7466l0026j7318J1429J5802J5963k6019J5453J7459r088j1896
15727F488j466j2455p671o683l5641n562O505l2246J9340K9261J5061k3360q3
$$ plain form
15714 -48512 -82576 -67671 -73939 -79670 -87630 -35544 -33555 -25231 -15804 -35358 -44536 -30871 -33955
15701 -33955 -42029 -22458 5544 26606 -25274 -54582 -60780 -33081 -42745 -65990 -40213 8581
15689 8581 29324 38767 -1576 -24185 -16424 -18175 -4654 -31864 -46990 -29841 -31332 -55091 -39774
15676 -39774 -20095 -55188 -51164 29605 23077 -13360 2361 43283 60905 36265 9054 11131
15664 11131 13441 6935 25308 22664 30083 11814 27634 41954 12631 -21187 -38641 -27767
15652 -27767 -12390 -12648 4815 -14994 -25292 -31901 -23413 10703 29584 33669 54890 24672 -2248
15639 -2248 -15241 -12638 -29743 -53333 -82219 -97423 -70589 -40772 -35883 7150 12835 13427 31557
15626 31557 30118 52225 34266 1609 17478 509 -40399 -86722 -120467 -93658 -71488 -74571
$$ packed form
15714d8512l4064J4905o268n731p960N2086J989Q324R427j9554r178J3665l084
15701c3955q074J9571K8002K1062n1880k9308o198K7699r664k3245K5777M8794
15689H581K0743R443m0343k2609P761j751J3521k7210j5126J7149j491k3759J5317
15676c9774J9679l5093M024Q0769o528l6437J5721M0922J7622k4640k7211K077
15664A1131K310o506J8373k644P419j8269J5820J4320k9323l3818j7454J0874
15652b7767J5377k58J7463j9809j0298o609Q488L4116J8881M085K1221l0218k6920
15639b248j2993K603j7105k3590k8886j5204K6834K9817M889M3033N685N92J8130
15626C1557j439K2107j7959l2657J5869j6969m0908m6323l3745K6809K2170l083
$$ plain form
15614 -74571 -55945 -60186 -56254 -61031 -42313 -43095 -81346 -68456 -88082 -76184 -32843 2620 -1209
15601 -1209 -48272 -89410 -82160 -82763 -86328 -30997 3237 -937 -34856 -33066 13098 20050 -8293
15588 -8293 -9560 -12673 -34652 -44154 29307 65866 80732 52238 -1222 -1330 13967 14219 3014
15575 3014 -15953 -27379 -53490 -64691 -52305 -32298 -23568 -9110 28563 -8864 -21369 -3693
15563 -3693 -19482 -1796 29631 -11970 -8462 -35530 -29169 -27416 -37820 -41896 -35043 -48511 -33570
15550 -33570 -56989 -32877 -14820 -31985 -38098 -10590 18095 18184 -12919 -53193 -83901 -49154
15538 -49154 -81779 -52815 -9972 7661 14766 17037 32852 5237 -36958 -32804 -32781 -63336 -55809
15525 -55809 -36318 2702 20582 25065 10553 1977 1081 -22217 -6246 -7412 16685 28791 -9251
$$ packed form
15614g4571J8626m241L932m777J8718p82l8251J2890j9626J1898M3341L5463l829
15601a209m7063m1138P250o03l565N5331L4234m174l3919J790M6164O952k8343
15588h293j267l113k1979r502P3461L6559J4866k8494n3460j08J5297K52j1205
15575C014j8967j1426k6111j1201J2386K0007Q730J4458L7673l7427j2505J7676
15563c693j5789J7686L1427m1601L508k7068O361J753j0404m076O853j3468J4941
15550c3570k3419K4112J8057j7165o113K7508K8685Q9l1103m0274l0708L4747
15538d9154l2625K8964M2843J7633P105K271J5815k7615m2195M154K3l0555P527
15525e5809J9491L9020J7880M483j4512q576q96k3298J5971j166K4097J2106l8042
$$ plain form
15512 -9251 -17531 -12398 1484 -8131 4092 -10980 -35345 -17006 -18747 -24836 -6941 9953 8096
15499 8096 15559 27914 -11620 -23748 -22169 -37352 -70568 -61026 -20975 -33632 -24131 -27170 -20757
15486 -20757 23613 13153 5846 -17459 -2015 7787 13910 -2630 -51570 -66786 -24992 14330
15474 14330 12498 -3585 7290 2094 2004 23584 2704 -11685 -21407 -26754 -42201 -52675 -46933
15461 -46933 -36029 -72324 -42048 -26743 6847 16686 -6547 -40260 -63847 -64726 -23057 -7538
15449 -7538 -16979 477 49108 24364 56030 72986 53142 43429 5182 -21956 -33687 -41871
15437 -41871 -2378 32108 29944 513 -9174 -602 12824 -12088 -53252 -98595 -107752 -93906
15425 -93906 -79693 -60153 -57019 -24152 -17269 -19334 -16472 733 -15105 -38092 -31205 -41827 -38284
$$ packed form
15512i251q280N133J3882r615J2223j5072k4365J8339j741o089J7895J6894j857
15499H096P463J2355l9534j2128J579j5183l3216R542M0051j2657R501l039O413
15486b0757M4370j0460p307k3305J5444R802O123j6540m8940j5216M1794L9322
15474A4330j832j6083J0875n196r0K1580k0880j4389r722n347j5447j0474N742
15461d6933J0904l6295L0276J5305L3590R839k3233l3713k3587q79M1669J5519
15449g538r441J7456M8631k4744L1666J6956j9844r713l8247k7138j1731q184
15437d1871L9493L4486k164k9431r687Q572J3426k4912m1164m5343r157J3846
15425i3906J4213J9540L134L2867O883k065K862J7205j5838k2987O887j0622L543
$$ plain form
15412 -38284 -15779 -28029 -34608 -2838 19066 31428 15193 -18626 -62843 -58324 -69745 -20760
15400 -20760 28137 63080 81188 65324 72040 81641 20086 -64067 -66600 -39168 -6 24999
15388 24999 28271 31917 29024 -4853 -88553 -57718 -33549 19516 17880 16773 12913 1369 -11657
15375 -11657 -35225 -44881 -29795 -41569 -69134 -90128 -76832 -38439 21581 1817 -31878 -8790
15363 -8790 15250 9048 -9036 -33986 -22051 -11137 -7249 -9726 15550 35844 21896 -7079
15351 -7079 20230 27030 25371 44446 32416 2449 -21238 -2523 -25917 -21868 22526 37844
15339 37844 6658 -10971 34105 -31146 -36619 8095 21877 -18772 -30776 -15034 22254 3125
15327 3125 19421 1667 -57680 -40094 12540 27110 45214 28760 -14789 -74222 -51203 -26547
$$ packed form
15412c8284K2505j2250o579L1770K1904J2362j6235l3819m4217M519j1421M8985
15400b0760M8897L4943J8108j5864O716R601o1555q4153k533K7432L9162K5005
15388B4999L272L646k893l3877q3700L0835K4169N3065j636j107l860j1544j3026
15375a1657k3568r656J5086j1774k7565k0994J3296L8393O0020j9764l3695K3088
15363h790K4040o202j8084k4950J1935J0914L888k477K5276K0294j3948k8975
15351g079K7309O800j659J9075j2030k9967k3687J8715k3394M049M4394J5318
15339C7844l1186j7629M5076o5251n473M4714J3782m0649j2004J5742L7288j9129
15327C125J6296j7754n9347J7586N2634J4570J8104j6454m3549n9433K3019K4656
$$ plain form
15315 -26547 446 -14155 -18772 -11251 -28241 -12775 34279 4779 -44971 -32555 -7832 -12779
15303 -12779 -19596 15472 43910 38084 19118 30966 57036 79587 52055 42558 39469 33689 -14540
15290 -14540 -37989 -52726 -685 24029 30580 30749 32650 11492 -7772 10903 15434 -19197 -39379
15277 -39379 -29694 -19370 -33306 -48069 -36715 -60620 -71063 -81569 -48342 -47978 -11239 -21316
15265 -21316 -41215 -14677 2330 -7332 -31332 -10204 -50715 -48818 -63031 -74051 -49998 -44172
15253 -44172 -62043 -43416 -46224 -41104 -27245 6461 6498 -1574 -17237 -51887 -39947 -18763 -17319
15240 -17319 -34020 5820 31392 8813 20939 15417 -14207 -20809 9582 12111 29221 14124
15228 14124 -25455 -2038 16935 3900 -19537 -51381 -53815 -60469 -57759 -69428 -61645 -60799 -70379
$$ packed form
15315b6547K6993j4601m617P521j6990J5466M7054k9500m9750J2416K4723m947
15303a2779o817L5068K8438n826j8966J1848K6070K2551k7532r497l089n780m8229
15290a4540k3449j4737N2041K4714O551J69J901k1158j9264J8675M531l4631k0182
15277c9379R685J0324j3936j4763J1354k3905j0443j0506L3227L64L6739j0077
15265b1316j9899K6538J7007r662k4000K1128m0511J897j4213j1020K4053N826
15253d4172j7871J8627k808N120J3859L3706L7q072j5663l4650J1940K1184J444
15240a7319j6701L9840K5572k2579J2126n522k9624o602L0391K529J7110j5097
15228A4124l9579K3417J8973j3035k3437l1844k434o654K710j1669P783Q46r580
$$ plain form
15215 -70379 -97817 -89986 -59006 -10047 -36349 -39791 -36093 -65733 -67016 -8504 10277 -724
15203 -724 -38954 -95945 -66942 -90681 -75865 -24410 -30751 -40377 -14008 -6994 -40766 -35735 -39741
15190 -39741 -47490 -25097 1882 3846 3461 7707 8858 13805 23306 22327 3696 -23924 -44569 -86828
15176 -86828 -92970 -46719 -18603 1593 9895 46628 72406 51206 36920 44342 22269 -30340
15164 -30340 -11071 -13188 -11810 -17826 -14301 -8185 -37934 -41347 -13467 19518 39272 42501 35270
15151 35270 19737 18917 6293 36505 24145 22836 61075 53601 65073 79632 129592 147469
15139 147469 121999 141409 143610 170878 236388 288389 356025 444807 588233 773990 973432
15128 973432 1200318 1433856 1582653 1670999 1616242 1464069 1219848 985797 778794 615998
$$ packed form
15215g0379k7438P831L0980M8959k6302l442L698k9640j283N8512J8781j1001
15203g24l8230n6991K9003k3739J4816N1455o341r626K6369P014l3772N031m006
15190c9741p749K2393K6979J964l85M246J151M947R501r79j8631k7620k0645m2259
15176h6828o142M6251K8116K0196Q302L6733K5778k1200j4286P422k2073n2609
15164c0340J9269k117J378o016L525O116k9749l413K7880L2985J9754L229p231
15151C5270j5533q20j2624L0212j2360j309L8239p474J1472J4559M9960J7877
15139A47469k5470J9410K201K7268O5510N2001O7636Q8782J43426J85757J99442
15128I73432K26886K33538J48797Q8346n4757j52173k44221k34051k07003j62796
$$ plain form
15118 615998 469475 395601 346913 310945 231302 188675 144779 97548 55242 56241 104700 107868
15106 107868 79484 32224 3708 35070 41388 61854 55253 17424 -7977 -36482 -10081 36828
15094 36828 79309 67794 10796 1160 12637 24867 -21637 -25395 -24016 -39416 -30820 13533
15082 13533 18555 33849 16200 -21966 -39725 -33122 -26786 -30684 -65564 -77335 -12931 -2011
15070 -2011 5635 -27236 -46695 -29526 -40304 -1873 29440 54951 80164 44049 1888 -11928
15058 -11928 13491 5654 -7273 -25529 -20386 -30457 8320 2029 22913 -10262 -31929 -1875
15046 -1875 11818 4894 -34880 -72549 -55597 -79562 -67409 -40433 -21337 -33841 -37224 -7848
15034 -7848 -15884 -50146 -66642 -59879 -3898 -14652 -14740 -8951 -24612 -15188 -34599 -33034 671
$$ packed form
15118F15998j46523p3874m8688l5968p9643m2627m3896m7231m2306R99M8459L168
15106A07868k8384m7260k8516L1362O318K0466o601l7829k5401k8505K6401M6909
15094C6828M2481j1515n6998r636J1477J2230m6504l758J379j5400Q596M4353
15082A3533N022J5294j7649l8166j7759O603O336l898l4880j1771O4404J0920
15070b011P646l2871j9459J7169j0778L8431L1313K5511K5213l6115m2161j3816
15058a1928K5419p837j2927j8256N143j0071L8777o291K0884l3175k1667L0054
15046a875J3693o924l9774l7669J6952k3965J2153K6976J9096j2504l383K9376
15034g848q036l4262j6496O763N5981j0754q8N789j5661R424j9411J565L3705
$$ plain form
15021 671 35711 98130 107016 53372 37072 10458 29154 46248 35458 11516 6460 18365
15009 18365 26061 46608 60974 94922 41278 -14224 14054 49296 32299 22208 27437 -25768
14997 -25768 -26554 -14504 -8905 -39047 -24394 -45356 -51403 -61770 -42290 796 6827 -13435 -39282
14984 -39282 -25710 -23572 -3418 21586 8703 -31101 -49606 -72928 -71315 -32590 7341 60954
14972 60954 73834 42436 36969 26059 48590 44865 -14068 -21248 -10692 -25943 -28806 -20874 -9389
14959 -9389 16362 35546 36450 17254 4576 10999 20236 -16191 -11971 -25069 -42701 -53270 -71698
14946 -71698 -99478 -70452 -5193 6617 33521 24856 25408 52961 81082 44609 -11134 -64393
14934 -64393 -101381 -121399 -75400 -42415 -7145 -2961 20591 74049 86353 38175 33743 60971
$$ packed form
15021F71L5040O2419Q886n3644j6300k6614J8696J7094j0790k3942n056J1905
15009A8365P696K0547J4366L3948n3644n5502K8278L5242j6997j0091N229n3205
14997b5768p86J2050N599l0142J4653k0962o047j0367J9480M3086O031k0262k5847
14984c9282J3572K138K0154K5004j2883l9804j8505k3322J613L8725L9931N3613
14972F0954J2880l1398n467j0910K2531l725n8933p180J0556j5251k863P932J1485
14959i389K5751J9184R04j9196j2678O423R237l6427M220j3098j7632j0569j8428
14946g1698k7780K9026O5259J1810K6904q665N52K7553K8121l6473n5743n3259
14934f4393l6988k0018M5999L2985L5270M184K3552N3458J2304m8178m432K7228
$$ plain form
14922 60971 41578 5068 -19537 -39025 -33546 -50961 -47207 -3774 -22278 -25344 -54488 -48085
14910 -48085 -39648 -57920 -60732 -73632 -59084 -21336 7043 -11269 -22243 -57076 -44471 -24941
14898 -24941 -10536 19579 16123 -6089 -24598 -34561 -33899 -26629 -10034 -14743 -4741 22373 41859
14885 41859 12011 -15381 -29037 -45073 -29423 -23206 -435 31622 46055 55539 33146 18984
14873 18984 15347 1924 -10750 -64044 -74300 -70917 -61548 -36192 -37470 -65790 150 36189
14861 36189 49079 -19150 -31646 56499 45394 -23704 -71784 -50803 -42982 -60307 -101370 -88876
14849 -88876 -63344 -53766 -54483 -16439 4396 -3641 12159 29165 42368 10565 -17633 2744
14837 2744 4890 12436 -33705 -33020 25842 40678 53829 44504 30545 23186 42392 18146 44636
$$ packed form
14922F0971j9393l6510k4605j9488N479j7415L754M3433j8504l066k9144O403
14910d8085Q437j8272k812j2900J4548L7748K8379j8312j0974l4833J2605J9530
14898b4941J4405L0115l456k2212j8509r963O62P270J6595m709J0002K7114J9486
14885D1859k9848k7392j3656j6036J5650O217K2771L2057J4433R484k2393j4162
14873A8984l637j3423j2674n3294j0256L383R369K5356j278k8320O5940L6039
14861C6189J2890o8229j2496Q8145j1105o9098m8080K0981P821j7325m1063J2494
14849h8876K5532R578p17L8044K0835q037J5800J7006J3203l1803k8198K0377
14837B744K146P546m6141O85N8862J4836J3151r325j3959p359J9206k4246K6490
$$ plain form
14824 44636 73449 42654 -12401 -54372 -7777 -3705 -11621 -17736 -40577 -46428 -24289 -24545 -61901
14811 -61901 -43549 4355 -29333 -36305 -12982 2119 -23184 -28343 377 24027 10520 -4303
14799 -4303 15859 42411 32792 47164 30749 21909 4122 -21506 -15224 -51089 -47499 -18336 -24371
14786 -24371 -2933 44571 52126 31210 5139 -26511 6986 3248 19785 36189 -17877 -28234
14774 -28234 -51864 -52820 -53060 -56200 -115056 -99131 -47013 -24725 15767 35226 61599 66074 55263
14761 55263 37952 48586 33164 -2042 -27866 1883 45252 62705 90278 82568 -12655 -26171
14749 -26171 12344 15181 23800 32077 48956 57605 40082 8348 -7845 -51225 -63699 -33468
14737 -33468 -4699 -4503 -36886 -52255 -35253 -470 18083 -2151 -12745 -25092 -41139 -46167
$$ packed form
14824D4636K8813l0795n5055m1971M6595M072p916o115k2841n851K2139k56l7356
14811f1901J8352M7904l3688o972K3323J5101k5303n159K8720K3650j3507j4823
14799d303K0162K6552r619J4372j6415q840j7787k5628O282l5865L590K9163o035
14786b4371K1438M7504P555k0916k6071l1650L3497l738J6537J6404n4066j0357
14774b8234k3630r56k40l140n8856J5925N2118K2288M0492J9459K6373M475j0811
14761E5263j7311J0634j5422l5206k5824K9749M3369J7453K7573p710r5223j3516
14749b6171L8515K837Q619Q277J6879Q649j7523l1734j6193m3380j2474L0231
14737c3468K8769J96l2383j5369J7002L4783J8553k0234j0594j2347j6047n028
$$ plain form
14725 -46167 -19296 -23876 -14077 -41309 -57258 -54699 -85467 -58075 -32032 -33103 -43026 -3655 -9243
14712 -9243 2847 42918 42688 15497 -20780 -30084 -21013 4637 12135 -2334 -4111 2851 -3103
14699 -3103 -15487 -9177 32310 70040 21772 -3105 -38014 -58886 -55185 -39060 9375 -7499
14687 -7499 -32362 -33910 -48264 -48233 -35840 -54508 -55269 -56944 -26997 18423 56182 42210 6938
14674 6938 -14134 -20734 -52601 -79055 -90038 -103964 -82167 -53525 -17975 -37321 -34671 -5719
14662 -5719 -17053 -40242 -2939 27171 9615 -4745 -9117 -18848 -32867 -30518 -49698 -32192
14650 -32192 -20137 -3994 -21248 -38044 -35844 -28597 -29552 -55460 -51921 -42931 -11010 12403 38553
14637 38553 41226 6888 -34558 -18626 37072 82708 43726 -24861 -34202 -22683 -31521 -41518
$$ packed form
14725d6167K6871m580R799k7232j5949K559l0768K7392K6043j071r923L9371n588
14712i243J2090M0071k30k7191l6277r304R071K5650P498j4469j777O962n954
14699c103j2384O310M1487L7730m8268k4877l4909k0872L701J6125M8435j6874
14687g499k4863j548j4354L1J2393j8668p61j675K9947M5420L7759j3972l5272
14674F938k1072o600l1867k6454j0983j3926K1797K8642L5550j9346K650K8952
14662e719j1334k3189L7303L0110j7556j4360m372r731j4019K349j9180J7506
14650c2192J2055J6143j7254j6796K200P247r55k5908L539Q990L1921K3413K6150
14637C8553K673l4338m1446J5932N5698M5636l8982o8587r341J1519q838r997
$$ plain form
14625 -41518 -40500 -58544 -49347 -26857 -19716 -51759 -51347 -55418 -30626 -23324 -25941 -31741 -2630
14612 -2630 36335 31296 1137 -11006 -13965 4299 20035 -31125 -82734 -65984 -30662 -34063
14600 -34063 4146 -7254 -11405 -10868 -25490 6749 -8049 -26515 -61410 -15651 16674 10521
14588 10521 6283 8530 -3604 -30122 -60161 -55018 -33831 -13811 -20996 -21327 32447 20810 5549
14575 5549 -1341 -6595 893 -12522 -10513 -3732 -2044 -6471 -6262 17902 3224 822 4713 21965
14561 21965 37120 50795 71824 19312 -10831 -8740 -13378 -33176 15683 36520 67664 79382
14549 79382 20117 -44874 -57658 -42261 -48912 -61656 -83123 -56953 -76355 -75433 -39470 -13790
14537 -13790 11288 35136 43666 63000 57169 30944 -24840 -54124 -65428 -96081 -12176 14525
$$ packed form
14625d1518J018j8044R197K2490P141l2043M12m071K4792P302k617n800K9111
14612b630L8965n039l0159j2143k959J8264J5736n1160n1609J6750L5322l401
14600c4063L8209j1400m151N37j4622L2239j4798j8466l4895M5759L2325o153
14588A0521m238K247j2134k6518l0039N143K1187K0020p185l31N3774j1637j5261
14575E549o890n254P488j3415K009O781J688m427K09K4164j4678k402L891J7252
14561B1965J5155J3675K1029n2512l0143K091m638j9798M8859K0837L1144J1718
14549G9382n9265o4991j2784J5397o651j2744k1467K6170j9402R22L5963K5680
14537a3790K5078K3848Q530J9334n831k6225n5784k9284j1304l0653Q3905K6701
$$ plain form
14525 14525 -10246 -6923 10492 19784 23703 52614 58479 59147 46037 29093 20842 21477 27135 6279
14511 6279 -18807 4819 33995 15555 -21981 -63623 -54489 -59182 -59674 -24898 -43815 -72637 -62367
14498 -62367 -24297 2564 19649 30671 26720 -11631 -61119 -63318 -52524 -43427 -17552 5433
14486 5433 13119 53784 41057 -16681 -28099 -13820 15458 28293 49301 71986 34508 4346
14474 4346 -10009 -17206 -12124 9657 -7885 -10436 32517 6071 -30509 -14184 20354 23943 27035
14461 27035 -254 -5644 1181 -14574 5724 13591 -31876 -39612 -66531 -78175 -71565 -31064 -9738
14448 -9738 -44469 -52617 -42244 -14633 30556 11658 -21009 -22907 -29869 -23092 -43845 -48727 -66658
14435 -66658 -29703 15839 20695 32493 17223 -7834 3795 15247 5083 -26864 -13777 4762
$$ packed form
14525A4525k4771L323J7415R292L919K8911N865O68j3110j6944q251O35N658k0856
14511F279k5086K3626K9176j8440l7536m1642R134m693m92L4776j8917k8822J0270
14498f2367L8070K6861J7085J1022l951l8351m9488k199J0794R097K5875K2985
14486E433P686M0665j2727n7738j1418J4279K9278J2835K1008K2685l7478l0162
14474D346j4355p197N082K1781j7542k551M2953k6446l6580J6325L4538L589L092
14461B7035k7289n390O825j5755K0298P867m5467p736k6919j1644O610M0501K1326
14448i738l4731q148J0373K7611M5189j8898l2667j898o962O777k0753m882j7931
14435f6658L6955M5542M856J1798j5270k5057J1629J1452j0164l1947J3087J8539
$$ plain form
14423 4762 -16536 -56091 -44138 -24662 -2222 1530 -48340 -64731 -53761 -62838 -62049 -33260 6271
14410 6271 40475 14216 4093 -5275 -3646 -10302 -8640 21647 -1000 -44017 -39435 -24475 -55695
14397 -55695 -82284 -87289 -116443 -122043 -75213 -47918 -48699 -63442 -46229 -4841 -9990 -36476 4280
14384 4280 5654 4750 -11642 -11606 -25793 -33434 -55449 -45422 -8683 17022 13186 -49918 -71858
14371 -71858 -72007 -77180 -42253 -9501 -9556 -14474 -41999 -42105 -15712 12445 9463 -18621 -38980 -49334
14357 -49334 -31939 -66680 -53847 -92984 -68950 -61828 -41513 -26168 -20968 -44533 -17494 21674
14345 21674 26539 -17456 -58895 -25429 -35967 -42898 -3334 5567 -21982 -26937 -21916 -30326 33817
14332 33817 55705 34626 7671 -34285 -16502 -2710 -14930 -2944 17141 9809 -19253 1740
$$ packed form
14423D762k1298l9555J1953J9476K2440L752m9870j6391J0970r077P89K8789L9531
14410F271L4204k6259j0123r368J629o656J662L0287k2647m3017M582J4960l1220
14397e5695k6589n005k9154n600M6830K7295p81j4743J7213M1388n149k6486M0756
14384D280J374r04j6392L6j4187p641k2015J0027L6739K5705l836o3104k1940
14371g1858j49n173L4927L2752n5m918k7525j06K6393K8157k982k8084k0359j0354
14357d9334J7395l4741J2833l9137K4034P122K0315J5345N200k3565K7039L9168
14345B1674M865m3995m1439L3466j0538o931L9564Q901k7549m955N021q410O4143
14332C3817K1888k1079k6955m1956J7783J3792j2220J1986K0085p332k9062K0993
$$ plain form
14320 1740 20473 32677 26413 47727 38019 15401 9242 5482 3469 13468 27960 -24174 -58746
14307 -58746 -70547 -58390 -12904 33493 15363 -10289 -6247 2287 -10385 -37635 -14179 1377
14295 1377 31405 48522 40442 26611 -342 -26525 -22854 -11352 -38228 -43717 -36457 -31911 -16756
14282 -16756 25442 67896 58447 77511 32089 -64503 -51167 -31578 -35364 -17384 -23382 -34597
14270 -34597 7540 48561 36495 -13807 9339 56402 89627 102012 85562 91145 111069 99525
14258 99525 124688 132760 105606 105400 94225 138060 145483 130880 147111 183719 208758 200565 157619
14245 157619 142430 142060 144726 119036 93435 127730 123580 91699 63276 16438 -53875 -66099
14233 -66099 -16241 -3494 -25754 -10735 10592 19489 30272 53521 47766 51467 58123 3519
$$ packed form
14320A740J8733J2204o264K1314r708k2618o159l760k013R999J4492n2134l4572
14307e8746j1801J2157M5486M6397j8130k5652M042Q534j2672k7250K3456J5556
14295A377L0028J7117q080j3831k6953k6183L671J1502k6876n489P260M546J5155
14282a6756M2198M2454r449J9064m5422r6592J3336J9589l786J7980n998j1215
14270c4597M2137M1021j2066n0302K3146M7063L3225J2385j6450N583J9924j1544
14258I9525K5163Q072k7154k06j1175M3835P423j4603J6231L6608K5039q193m2946
14245A57619j5189l70K666k5690k5601L4295m150l1881k8423m6838p0313j2224
14233f6099M9858J2747k2260J5019K1327Q897J0783K3249n755L701O656n4604
$$ plain form
14221 3519 -22192 1299 24903 36973 56046 44322 -857 -56551 -28260 -20269 -16215 -44623
14209 -44623 -18924 8920 33633 34489 -4289 -873 22278 2254 -8889 -28544 -30737 9516
14197 9516 21071 7350 -11479 -15068 -6544 -42981 -46388 -27651 -22719 -42807 -2576 4794 -23219
14184 -23219 -57510 -69258 -38401 3051 -2429 -30500 -14281 714 -14489 -21302 -19849 18255
14172 18255 14132 -3537 -22217 12390 34212 50704 28034 9032 21139 12874 6914 -7544
14160 -7544 5813 42209 49098 30628 25341 -25180 -47021 -19178 -14062 3641 8368 -1931 -14584
14147 -14584 -15999 -10903 -12133 27925 14172 12235 44040 29228 55976 50777 16802 -28228 -27393
14134 -27393 -33818 -46327 -15599 -14144 -22820 -10415 -11997 -26099 -21328 -12684 33235 10332 -32774
$$ packed form
14221C519k5711K3491K3604J2070J9073j1724m5179n5694K8291P991M054k8408
14209d4623K5699K7844K4713Q56l8778L416K3151k0024j1143j9655k193M0253
14197I516J1555j3721j8829l589Q524l6437l407J8737M932k0088M0231P370k8013
14184b3219l4291j1748L0857M1452n480k8071J6219J4995j5203o813J453L8104
14172A8255m123j7669j8680L4607K1822J6492k2670j9002J2107q265n960j4458
14160g544J3357L6396O889j8470n287n0521k1841K7843N116J7703M727j0299j2653
14147a4584j415N096j230M0058j3753j937L1805j4812K6748n199l3975m5030Q35
14134b7393o425j2509L0728J455q676J2405j582j4102M771Q644M5919k2903m3106
$$ plain form
14121 -32774 24339 45064 15451 14659 22299 16676 -5983 -539 5032 4922 46779 34851 8684
14108 8684 -24470 -66888 -70290 -45265 -41785 -32654 -31787 -46543 -45598 -17354 -55933 -74278 -55107
14095 -55107 -40934 -42682 -16219 24679 33524 49605 77302 63509 34927 43676 80425 90210
14083 90210 52329 44899 -8263 -30144 3680 -9595 -25033 4342 2561 -17696 -4886 28165
14071 28165 27944 -7438 13204 59557 66569 57454 23735 17172 27841 -9421 3946 21678 25782
14058 25782 37542 50411 65368 29712 42218 45328 7784 -6552 6682 16417 33715 40938
14046 40938 64394 88020 100509 79490 89618 138761 165968 163381 194657 241403 327305 438307
14034 438307 537616 680482 983083 1385730 1854437 2277393 2620793 2766521 2629234 2266538
$$ packed form
14121c2774N7113K0725k9613p92P640n623k2659N444N571j10M1857j1928k6167
14108H684l3154m2418l402K5025L480R131Q67j4756R45K8244l8579j8345J9171
14095e5107J4173j748K6463M0898Q845J6081K7697j3793k8582Q749L6749R785
14083I0210l7881p430n3162k1881L3824j3275j5438K9375j781k0257J2810L3051
14071B8165k21l5382K0642M6353P012r115l3719o563J0669l7262J3367J7732M104
14058B5782J1760J2869J4957l5656J2506L110l7544j4336J3234R735J7298P223
14046D0938K3456K3626J2489k1019J0128M9143K7207k587L1276M6746Q5902J11002
14034D38307R9309J42866L02601M02647M68707M22956L43400J45728j37287l62696
$$ plain form
14024 2266538 1775127 1290014 880157 654856 501135 404326 353814 285431 233993 186465
14014 186465 155084 133738 124727 122162 110261 76986 76493 87312 115632 99308 57807 74277
14002 74277 65837 41405 72141 101308 63554 62918 56770 35361 -2039 -24033 3599 20072
13990 20072 63221 50886 71867 72440 73825 48140 -11161 -29296 -9176 13073 4916 -18357
13978 -18357 34728 38687 25946 9177 14034 22268 -571 15361 41708 24192 15451 -9537
13966 -9537 -40333 -3746 10339 30191 27799 29618 57810 40216 69896 86774 97168 88370
13954 88370 74329 61177 50768 50287 17346 -21191 365 17055 9696 8670 -2484 19548
13942 19548 32387 37893 49798 85222 73737 34563 8139 29763 32555 26441 2149 -22088
$$ packed form
14024B266538m91411m85113m09857k25301j53721r6809n0512o8383n1438m7528
14014A86465l1381k1346r011k565j1901l3275m93J0819K8320j6324m1501J6470
14002G4277q440k4432L0736K9167l7754o36o148k1409l7400k1994K7632J6473
13990B0072M3149j2335K0981N73J385k5685n9301j8135K0120K2249q157k3273
13978a8357N3085L959j2741j6769M857Q234k2839J5932K6347j7516q741k4988
13966i537l0796L6587J4085J9852k392J819K8192j7594K9680J6878J0394q798
13954H8370j4041j3152j0409m81l2941l8537K1556J6690p359j026j1154K2032
13942A9548J2839N506J1905L5424j1485l9174k6424K1624K792o114k4292k4237
$$ plain form
13930 -22088 3372 2930 647 15210 -4171 20922 72912 91843 66797 41542 59420 78352
13918 78352 59912 39846 47882 23402 -19342 -21686 6484 -26769 -37658 -16514 -649 -4545
13906 -4545 -28068 -42413 -73627 -35542 -19762 -37561 -44694 -32411 16621 47578 34802 -3813
13894 -3813 -22000 22810 19533 42428 71001 50498 29577 32203 14977 43311 29274 6272
13882 6272 628 -38878 -53461 -5105 28414 28292 122 -48264 -72912 -56292 -30152 3258
13870 3258 -29663 -7977 9149 -13897 17968 5636 -844 19958 32315 51274 52476 66529
13858 66529 55200 28422 -5922 -20478 -17377 36045 65845 78158 119352 85435 25167 34474
13846 34474 44374 30003 3479 -17046 -10103 -17379 -34314 -33513 -37645 -26284 6746 67081 78099
$$ packed form
13930b2088K5460m42k283J4563j9381K5093N1990J8931k5046k5255J7878J8932
13918G8352j8440k0066Q036k4480m2744k344K8170l3253j0889K1144J5865l896
13906d545k3523j4345l1214L8085J5780j7799p133J2283M9032L0957j2776l8615
13894c813j8187M4810l277K2895K8573k0503k0921K626j7226K8334j4037k3002
13882F272n644l9506j4583M8356L3519j22k8170m8386k4648J6620K6140L3410
13870C258l2921K1686J7126k3046L1865j2332o480K0802J2357J8959J202J4053
13858F6529j1329k6778l4344j4556L101N3422K9800J2313M1194l3917o0268R307
13846C4474R900j4371k6524k0525O943p276j6935Q01m132J1361L3030O0335J1018
$$ plain form
13833 78099 70232 79615 63076 1019 12071 -8476 -19808 7949 12311 19392 -8650 4394
13821 4394 57123 100089 82490 38066 -1537 1055 -28789 -5341 29576 33890 17647 42693
13809 42693 43493 61384 25618 23399 37241 -13309 -38451 -41968 -23723 28521 46561 27782
13797 27782 44122 45417 28678 20035 -4567 9765 -1608 18865 4700 -21518 -3159 -6196
13785 -6196 -866 13038 14082 33980 69671 66765 49977 27050 1403 -200 28106 24052 126
13772 126 -10548 8519 28163 -43817 -72234 1870 32980 46352 47183 48003 38726 31294 11887
13759 11887 2100 -7560 -270 11643 41742 66987 74922 111568 137256 115962 148865 167944
13747 167944 176429 209201 200763 145383 108998 54904 29887 58533 65525 22257 -14327 41303
$$ packed form
13833G8099p867R383j6539o2057J1052k0547j1332K7757M362P081k8042J3044
13821D394N2729M2966j7599m4424l9603K592k9844K3448L4917M314j6243K5046
13809D2693Q00J7891l5766k219J3842n0550k5142l517J8245N2244J8040j8779
13797B7782J6340J295j6739q643k4602J4332j1373K0473j4165k6218J8359l037
13785f196N330J3904J044J9898L5691k906j6788k2927k5647j603K8306m054k3926
13772A26j0674J9067J9644p1980k8417P4104L1110J3372Q31Q20r277p432j9407
13759A1887r787r660P290J1913L0099K5245P935L6646K5688k1294L2903J9079
13747A67944Q485L2772q438n5380l6385n4094k5017K8646O992m3268l6584N5630
$$ plain form
13735 41303 96935 82136 42246 48395 57478 28407 21084 5966 -34287 -84574 -56848 -50174
13723 -50174 -12827 3529 -3442 25082 38635 7966 21329 98519 129759 149182 152257 137623
13711 137623 145669 153689 152349 151778 136404 106943 129070 104070 66989 54809 41066 47233 65932
13698 65932 40157 35045 35704 16340 -25449 -34372 -22357 -3080 -24499 -39651 -30521 10851 37272
13685 37272 63863 84143 84531 90649 112075 84819 30516 2566 67442 74613 42288 37182 35375
13672 35375 41941 34390 53332 61283 66465 66492 56097 54812 58713 50277 60311 39451 20620 58211
13658 58211 66152 58679 61941 63202 61610 55738 42589 77775 90535 105902 87965 101925 114068
13645 114068 111954 123448 145326 182877 199867 177391 150296 162942 176854 165667 144580 149735
$$ packed form
13735D1303N5632j4799l9890O149R083k9071p323j5118m0253n0287K7726O674
13723e0174L7347J6356o971K8524J3553l0669J3363P7190L1240J9423L075j4634
13711A37623Q046Q020j340n71j5374k9461K2127k5000l7081j2180j3743O167J8699
13698F5932k5775n112O59j9364m1789q923J2015J9277k1419j5152R130M1372K6421
13685C7272K6591K0280L88O118K1426k7256n4303k7950O4876P171l2325n106j807
13672C5375O566p551J8942P951N182K7j0395j285L901q436J0034k0860j8831L7591
13658E8211P941p473L262J261j592n872j3149L5186J2760J5367j7937J3960J2143
13645A14068k114J1494K1878L7551J6990k2476k7095J2646J3912j1187k1087N155
$$ plain form
13633 149735 148534 150683 175832 206472 254132 311157 337344 380150 379108 382799 364644 344078
13621 344078 333088 309261 315519 355748 376567 428447 448427 444228 447773 441151 486903 484538
13609 484538 476663 487475 499316 514489 531105 498994 465432 461677 429482 406844 402447 377617
13597 377617 376430 346621 316258 333218 326532 286176 315681 334504 303548 274290 278405 284570
13585 284570 327994 321925 279834 272377 268635 273706 234711 247275 219706 184332 151062 208242
13573 208242 239727 175788 134002 174237 184589 186565 172322 147597 157423 158626 153714 153598 137214
13560 137214 92200 33721 42208 65114 42328 18743 28913 29277 78437 38370 51758 84226
13548 84226 117211 137370 113477 85180 82877 86722 69290 24775 12554 7763 11169 31150
$$ packed form
13633A49735j201K149K5149L0640M7660N7025K6187M2806j042L691j8155k0566
13621C44078j0990k3827O258M0229K0819N1880J9980m199L545o622M5752k365
13609D84538p875J0812J1841J5173J6616l2111l3562l755l2195k2638m397k4830
13597C77617j187k9809l0363J6960o686m0356K9505J8823l0956k9258M115O165
13585B84570M3424o069m2091p457l742N071l8995J2564k7569l5374l3270N7180
13573B08242L1485o3939m1786M0235J0352J976j4243k4725R826J203m912j16j6384
13560A37214m5014n8479Q487K2906k2786k3585J0170L64M9160m0067J3388L2468
13548H4226L2985K0159k3893k8297k303L845j7432m4515j2221m791L406J9981
$$ plain form
13536 31150 -11265 -53633 -36913 -20049 -23114 -44074 216 48398 72824 56243 65563 58367
13524 58367 22776 12082 -8969 18139 39605 37992 53712 65876 35030 8992 36949 30028
13512 30028 44825 55967 82717 98330 90911 79514 51538 15778 24957 38580 27630 25371
13500 25371 -3626 -25301 -3671 26652 75689 108013 120318 94518 90503 97355 137638 117503
13488 117503 38089 -18197 -21259 -37427 -17315 30437 78214 104735 120807 148659 127295 105582
13476 105582 105177 100382 69766 97701 65102 64970 55544 77674 62650 38006 53767 29569 40025
13463 40025 57837 41396 51728 46968 46567 53445 76753 54831 39149 24241 53532 59961 39446
13450 39446 37551 -3623 -20422 3634 26543 61021 33838 53660 69674 65192 33354 -20028
$$ packed form
13536C1150m2415m2368J6720J6864l065k0960M4290M8182K4426j6581R320p196
13524E8367l5591j0694k1051K7108K1466j613J5720J2164l0846k6038K7957o921
13512C0028J4797J1142K6750J5613p419j1397k7976l5760R179J3623j0950k259
13500B5371k8997k1675K1630L0323M9037L2324J2305k5800m015O852M0283k0135
13488A17503p9414n6286l062j6168K0112M7752M7777K6521J6072K7852k1364k1713
13476A05582m05m795l0616K7935l2599j32r426K2130j5024k4644J5761k4198J0456
13463D0025J7812j6441J0332m760m01O878K3308k1922j5682j4908K9291O429k0515
13450C9446j895m1174j6799K4056K2909L4478k7183J9822J6014m482l1838n3382
$$ plain form
13438 -20028 12527 43691 55574 37245 12931 -450 19409 2836 5024 22523 33193 51581
13426 51581 55013 35468 -4314 -8084 28418 -8092 -42115 -1814 31130 28285 22007 62163
13414 62163 60444 38745 26714 12759 291 31636 71281 59874 21052 -15844 -3298 49140
13402 49140 78294 68705 38866 27865 47193 51900 33556 36143 38198 -12184 14931 40584
13390 40584 23216 -7210 -8918 -35378 -37991 -39950 -39018 -18968 11044 5754 20495 21160 23309
13377 23309 45740 29713 68411 91860 122874 123649 104567 101970 117800 111695 75860 46531
13365 46531 40192 51346 18462 -27012 -4139 19485 5368 -3361 26414 38199 44971 15448
13353 15448 -850 -2210 41058 42213 53425 44483 9262 26731 41890 26258 -15166 -13367
$$ packed form
13438b0028L2555L1164J1883j8329k4314j3381J9859j6573K188J7499J0670J8388
13426E1581L432j9545l9782l770L6502l6510l4023M0301L2944k845o278M0156
13414F2163j719k1699j2031j3955j2468L1345L9645j1407l8822l6896J2546N2438
13402D9140K9154r589k9839j1001J9328M707j8344K587K055n0382K7115K5653
13390D0584j7368l0426j708k6460k613j959R32K0050L0012n290J4741O65K149
13377B3309K2431j6027L8698K3449L1014P75j9082k597J5830o105l5835k9329
13365D6531o339J1154l2884m5474K2873K3624j4117q729K9775J1785O772k9523
13353A5448j6298j360M3268J155J1212q942l5221J7469J5159j5632m1424J799
$$ plain form
13341 -13367 -1419 9523 41501 25907 1395 11928 39953 73985 73352 68152 75603 54245
13329 54245 3772 45631 77410 45850 23282 22957 13454 19097 34522 38277 14421 47353 79446
13316 79446 48329 16231 36262 63977 106060 129022 90098 61088 76398 82209 32662 13286
13304 13286 26223 43605 56877 68951 72343 30229 1102 16094 34688 43412 48436 59096
13292 59096 57424 43534 92740 161670 145261 111015 59789 54305 42342 57247 76717 78822
13280 78822 96521 88432 43080 13604 34024 53847 68241 89794 121914 120265 104522 107166
13268 107166 100923 47210 49593 90268 129806 115310 68575 77920 105662 101681 105738 94592
13256 94592 103222 138787 177825 174154 190689 217868 248411 256861 229421 213688 211388 228440
$$ packed form
13341a3367J1948J0942L1978j5594k4512J0533K8025L4032o33n200P451k1358
13329E4245n0473M1859L1779l1560k2568l25r503N643J5425L755k3856L2932L2093
13316G9446l1117l2098K0031K7715M2083K2962l8924k9010J5310N811m9547j9376
13304A3286J2937J7382J3272J2074L392m2114k9127J4992J8594Q724N024J0660
13292E9096j672j3890M9206O8930j6409l4246n1226n484j1963J4905J9470K105
13280G8822J7699q089m5352k9476K0420J9823J4394K1553L2120j649j5743K644
13268A07166o243n3713K383M0675L9538j4496m6735R345K7742l981M057j1146
13256I4592Q630L5565L9038l671J6535K7179L0543Q450k7440j5733k300J7052
$$ plain form
13244 228440 299093 343500 399197 452286 524092 532402 576857 722253 937471 1232546 1528587
13233 1528587 1913019 2400957 2889582 3240555 3346822 3194654 2951570 2574633 2174814
13224 2174814 1705513 1344165 1067372 874042 761385 687261 622172 550065 471720 376592
13214 376592 347629 325290 286069 243248 237712 210378 158822 111216 124866 110482 64569 45474
13202 45474 50996 56601 66845 81616 104436 95153 100430 95868 110610 135629 139747 140386 125731
13189 125731 173358 231339 282627 321117 318421 314361 370447 401161 449307 504085 534704 630293
13177 630293 692054 766902 891582 950131 986484 996594 916732 870436 823956 744607 678674
13166 678674 625852 553238 475021 391722 350147 302898 296865 269217 264046 240498 169767 159683
$$ packed form
13244B28440P0653M4407N5697N3089P1806Q310M4455J45396K15218K95075K96041
13233A528587L84432M87938M88625L50973J06267j52168k43084l76937l99819
13224B174814m69301l61348k76793j93330j12657p4124o5089p2107p8345r5128
13214C76592k8963k2339l9221m2821n536k7334n1556m7606J3650j4384m5913j9095
13202D5474N522N605J0244J4771K2820r283N277m562J4742K5019M118O39j4655
13189A25731M7627N7981N1288L8490k696m060N6086L0714M8146N4778L0619R5589
13177F30293O1761P4848J24680N8549L6353J0110p9862m6296m6480p9349o5933
13166F78674n2822p2614p8217q3299m1575m7249o033k7648n171k3548p0731j0084
$$ plain form
13154 159683 169552 144318 145916 177808 185887 196605 158062 138141 140254 159350 136237 85085
13142 85085 74663 69465 52428 31018 2234 55281 120964 136932 152125 174812 220384 258830
13130 258830 287567 240511 188141 113516 -9322 -87325 -81371 -125918 -156972 -151481 -135011 -101639
13118 -101639 -54653 -9509 38228 85419 121944 115932 92050 109593 162017 208453 295931 400844
13106 400844 484300 623845 836423 1146145 1631081 2207419 2664164 2802052 2532962 1993776
13096 1993776 1473803 1055763 778590 594649 459804 343437 278073 229387 190829 242453
13086 242453 253304 235649 213260 176121 136809 117608 148396 181172 176977 189864 149896 95277
13074 95277 111234 113770 100506 98789 134676 138436 123962 106169 122106 162450 153656 163226 189072
$$ packed form
13154A59683R869k5234J598L1892Q079J0718l8543j9921K113J9096k3113n1152
13142H5085j0422n198j7037k1410k8784N3047O5683J5968J5193K2687M5572L8446
13130B58830K8737m7056n2370p4625j22838p8003N954m4547l1054N491J6470L3372
13118a01639M6986M5144M7737M7191L6525o012k3882J7543N2424M6436Q7478J04913
13106D00844Q3456J39545K12578L09722M84936N76338M56745J37888k69090n39186
13096A993776n19973m18040k77173j83941j34845j16367o5364m8686l8558N1624
13086B42453J0851j7655k2389l7139l9312j9201L0788L2776m195J2887l9968n4619
13074I5277J5957K536j3264j717L5887L760j4474j7793J5937M0344q794R570K5846
$$ plain form
13061 189072 194746 131569 77845 77794 101384 84923 81104 108085 109945 148296 140851 114117 100015
13048 100015 132201 139447 116128 131606 132264 141345 193471 179061 175146 185047 162447 168100 187838
13035 187838 195389 202422 203006 202223 216143 198994 148401 121602 159131 184487 147131 129856 137462
13022 137462 142750 145325 160110 165865 188529 179081 95878 44059 54907 97318 134665 104529
13010 104529 78793 112553 106918 152612 209190 238813 237923 230359 242179 273170 272430 267591 250148
12997 250148 192862 154267 121652 168566 150123 168020 209364 219749 221416 210785 234116 259336
12985 259336 206283 222167 265575 271376 242836 202654 173249 212676 225842 236390 244148 258610
12973 258610 299568 330607 396078 432184 400859 400518 361408 313421 307839 315160 326597 324715
$$ packed form
13061A89072N674o3177n3724n1K3590j6461l819K6981J860L8351p445k6734j4102
13048A00015L2186P246k3319J5478O58R081N2126j4410l915R901k2600N653J9738
13035A87838P551P033N84p83J3920j7149n0593k6799L7529K5356l7356j7275P606
13022A37462N288K575J4785N755K2664r448q3203n1819J0848M2411L7347l0136
13010A04529k5736L3760n635M5694N6578K9623q90p564J1820L0991p40m839j7443
12997B50148n7286l8595l2615M6914j8443J7897M1344J0385J667j0631K3331K5220
12985B59336n3053J5884M3408N801k8540m0182k9405L9427J3166J0548P758J4462
12973B58610M0958L1039O5471L6106l1325l41l9110m7987n582P321J1437j882
$$ plain form
12961 324715 274454 230695 226233 229854 268187 280375 227341 204633 225238 306356 317758 265996
12949 265996 234576 200875 194859 152302 139100 141034 110591 115976 130310 76844 33124 -12671
12937 -12671 -55896 -94913 -112638 -82669 -62283 -41707 1015 6958 -16603 18781 54829 89775
12925 89775 105443 149387 188818 221247 239486 282384 337700 382880 412246 442000 465519 444837
12913 444837 344784 292951 268189 173621 110997 145062 221938 255475 269799 293988 256804
12902 256804 238769 256425 278824 312878 397275 450194 449221 440534 456488 513260 504873 495239
12890 495239 537055 558802 588444 636721 625199 624234 702717 736235 781268 824851 879355 920934
12878 920934 937131 934047 908443 895877 847806 823964 883108 897291 902227 992722 1127638 1365322
$$ packed form
12961C24715n0261m3759m462L621L8333J2188n3034k2708K0605Q1118J1402n1762
12949B65996l1420l3701o016m2557j3202J934l0443N385J4334n3466m3720m5795
12937a2671m3225l9017j7725K9969K0386K0576M2722N943k3561L5384L6048L4946
12925H9775J5668M3944L9431L2429J8239M2898N5316M5180K9366K9754K3519k0682
12913D44837j00053n1833k4762r4568o2624L4065P6876L3537J4324K4189l7184
12902B56804j8035J7656K2399L4054Q4397N2919r73q687J5954N6772q387r634
12890D95239M1816K1747K9642M8277j1522r65P8483L3518M5033M3583N4504M1579
12878I20934J6197l084k5604j2566m8071k3842N9144J4183M936R0495J34916K37684
$$ plain form
12866 1365322 1641118 1889695 2062515 2162549 2143761 2065336 1869346 1573852 1293945 1100529
12856 1100529 991252 877852 770574 657040 535292 431181 212203 30249 -21134 13918
12846 13918 113197 241897 323873 385660 416017 433273 431850 414881 446016 488814 509493 530410
12834 530410 557202 623428 649440 623560 603841 650030 684560 671119 639575 588302 535376
12823 535376 463700 467030 474141 539026 633667 753233 849122 969495 1124225 1261275 1392893
12812 1392893 1525331 1546460 1544252 1523064 1552193 1623886 1711960 1816978 1903880 2037100 2145272
12801 2145272 2226466 2326579 2420291 2527883 2609657 2754943 2954387 3171474 3449054 3709751
12791 3709751 3913175 4001058 4040904 3994521 3906963 3830750 3826263 3896313 4078828 4247548 4401340
$$ packed form
12866A365322K75796K48577J72820J00034j8788p8425j95990k95494k79907j93416
12856A100529j09277j13400j07278j13534j21748j04111k18978j81954n1383L5052
12846A3918R9279J28700Q1976O1787L0357J7256j423j6969L1135M2798K0679K0917
12834E30410K6792O6226K6012k5880j9719M6189L4530j3441l1544n1273n2926
12823E35376p1676L330P111O4885R4641J19566R5889J20373J54730J37050J31618
12812A392893J32438K1129k208k1188K9129P1693Q8074J05018Q6902J33220J08172
12801B145272Q1194J00113R3712J07592Q1774J45286J99444K17087K77580K60697
12791C709751K03424Q7883L9846m6383q7558p6213m487P0050J82515J68720J53792
$$ plain form
12780 4401340 4590691 4797514 5079156 5407548 5783510 6313409 6867892 7533344 8247624
12771 8247624 9062687 9879922 10702984 11564301 12556607 13739974 15174377 16846229 18827034
12762 18827034 21143637 23882843 27093097 30866996 35540770 41319529 48452053 57285938
12754 57285938 68140165 81355536 96880233 114066138 131625230 147603011 159846830
12747 159846830 166380422 166081542 159082755 146567495 130442486 113040941 96280105
12740 96280105 81322087 68611012 58089565 49521328 42591391 36951794 32346561 28542247
12732 28542247 25346873 22706097 20513478 18632808 17021866 15651535 14408205 13328450
12724 13328450 12420385 11584771 10829704 10179636 9648438 9235163 8845650 8471181 8134975
$$ packed form
12780D401340J89351K06823K81642L28392L75962N29899N54483O65452P14280
12771H247624Q15063Q17235Q23062Q61317R92306J183367J434403J671852J980805
12762A8827034K316603K739206L210254L773899M673774N778759P132524Q833885
12754E7285938J0854227J3215371J5524697J7185905J7559092J5977781J2243819
12747A59846830O533592k98880o998787j2515260j6125009j7401545j6760836
12740I6280105j4958018j2711075j0521447q568237o929937n639597m605233l804314
12732B8542247l195374k640776k192619j880670j610942j370331j243330j079755
12724A3328450r08065q35614p55067o50068n31198m13275l89513l74469l36206
$$ plain form
12715 8134975 7772005 7369967 6995232 6634525 6267795 5922636 5591191 5297085 5018177
12706 5018177 4818352 4666396 4555077 4445600 4352265 4247166 4112109 4054191 4020611 3931117
12696 3931117 3797593 3681445 3637146 3629889 3824678 4226170 4730164 5216381 5670797 5994588
12686 5994588 6146235 6270616 6455216 6823854 7379304 8110330 9087108 10268630 11620103
12677 11620103 13197573 15010439 17113384 19604941 22710449 26769655 32297901 40028985
12669 40028985 50739116 65275534 84879139 112600500 154627348 219394162 310420025
12662 310420025 413291834 490983123 505131165 448951236 348420700 249131123 176225073
12655 176225073 129189481 99021352 78483072 63578100 52376579 43908447 37577832
$$ packed form
12715H134975l62970m02038l74735l60707l66730l45159l31445k94106k78908
12706E018177j99825j51956j11319j09477r3335j05099j35057n7918l3580q9494
12696C931117j33524j16148m4299p257J94789M01492N03994M86217M54416L23791
12686E994588J51647J24381J84600L68638N55450P31026R76778J181522J351473
12677A1620103J577470J812866K102945K491557L105508M059206N528246P731084
12669D0028985J0710131J4536418J9603605K7721361M2026848O4766814R1025863
12662C10420025J02871809P7691289J4148042n6179929j00530536r9289577p2906050
12655A76225073m7035592l0168129k0538280j4904972j1201521q468132o330615
$$ plain form
12648 37577832 32790038 29026884 25817906 22882186 20322595 18207708 16507866 15102537
12640 15102537 13922266 12992803 12172716 11379702 10683216 10087474 9603929 9242399 8959687
12631 8959687 8672605 8356869 8002019 7580560 7029181 6403068 5782646 5222211 4749897
12622 4749897 4336597 3998676 3723547 3453824 3172156 2975561 2899559 2819847 2705546 2584034
12612 2584034 2485524 2418565 2436209 2469421 2563594 2752544 3044469 3454191 4206332 5398866
12602 5398866 6882948 8149460 8629958 8057880 6658418 5200864 4157076 3489320 3048844
12593 3048844 2762257 2596256 2459210 2326941 2201208 2033163 1973935 1959163 1913213 1874290
12583 1874290 1811755 1714432 1623250 1598455 1532853 1464315 1383367 1327404 1355492 1374705 1315213
$$ packed form
12648C7577832m787794l763154l208978k935720k559591k114887j699842j405329
12640A5102537j180271r29463q20087p93014o96486n95742m83545l61530k82712
12631H959687k87082l15736l54850m21459n51379o26113o20422n60435m72314
12622D749897m13300l37921k75129k69723k81668j96595p6002p9712j14301j21512
12612B584034r8510o6959J7644L3212R4173J88950K91925M09722P52141J192534
12602E398866J484082J266512M80498n72078j399462j457554j043788o67756m40476
12593C048844k86587j66001j37046j32269j25733j68045n9228j4772m5950l8923
12583A874290o2535r7323r1182k4795o5602o8538q0948n5963K8088J9213n9492
$$ plain form
12572 1315213 1255514 1176428 1118651 1077768 1099818 1082590 1044704 1015505 1051371 1133697 1266024
12561 1266024 1498466 1819921 2141148 2352950 2350657 2109265 1736546 1412263 1183359 999692
12551 999692 869711 831513 862292 886868 925912 935150 968873 978161 939064 889161 848999 831383
12539 831383 849172 936785 1082060 1090343 935473 617739 321631 158759 110461 150360 182912
12528 182912 227350 264718 295237 273198 250405 249389 261031 229594 207185 194184 197658 176384
12516 176384 186334 247865 245044 206920 199652 158152 107915 73730 134009 261218 359760 468149
12504 468149 587817 664917 744761 822232 892486 943645 948216 919801 858614 798066 712298
12493 712298 672646 672836 777547 876492 983511 1096995 1213214 1305257 1291757 1211638 1123691
$$ packed form
12572A315213n9699p9086n7777m0883K2050j7228l7886k9199L5866Q2326J32327
12561A266024K32442L21455L21227K11802k293k41392l72719l24283k28904j83667
12551I99692j29981l8198L0779K4576L9044R238L3723R288l9097m9903m0162j7616
12539H31383J7789Q7613J45275Q283j54870l17734k96108j62872m8298L9899L2552
12528A82912M4438L7368L0519k2039k2793j016J1642l1437k2409j3001L474k1274
12516A76384R950O1531k821l8124p268m1500n0237l4185O0279J27209R8542J08389
12504D68149J19668P7100P9844P7471P0254N1159M571k8415o1187o0548q5768
12493G12298l9652J90J04711R8945J07019J13484J16219R2043j3500q0119q7947
$$ plain form
12482 1123691 1092551 1099240 1090516 1089200 1103456 1157842 1258051 1391481 1467660 1535300 1538434 1451879
12470 1451879 1302392 1145230 1008199 889342 777016 722109 739120 793140 813452 842744
12460 842744 911796 986934 1162734 1396373 1579976 1637393 1559276 1332850 1091228 836627
12450 836627 638047 546490 531168 513640 475036 419871 349215 250220 134668 117360 146079
12439 146079 173034 200385 206281 218411 207565 175519 128861 132821 202728 244346 262366 328521
12427 328521 352731 364916 407733 478842 513823 547610 610887 679105 741359 733654 702550 692002
12415 692002 642697 577963 532720 506738 498432 459033 385877 330546 310704 285478 261881 217547
12403 217547 182683 153487 144256 216044 218520 200540 238172 248141 224622 227570 234960 235418 216387
$$ packed form
12482A123691l1140O689q724j316J4256N4386J00209J33430P6179O7640L134q6555
12470A451879j49487j57162j37031j18857j12326n4907J7011N4020K0312K9292
12460H42744O9052P5138J75800K33639J83603N7417p8117k26426k41622k54601
12450H36627j98580r1557j5322j7528l8604n5165p0656r8995j15552j7308K8719
12439A46079K6955K7351N896J2130j0846l2046m6658L960O9907M1618J8020O6155
12427C28521K4210J2185M2817P1109L4981L3787O3277O8218O2254p705l1104j0548
12415F92002m9305o4734m5243k5982q306l9399p3156n5331j9842k5226k3597m4334
12403B17547l4864k9196r231P1788K476j7980L7632R969k3519K948P390M58j9031
$$ plain form
12390 216387 238053 260605 295298 312905 314312 285792 291108 277877 260057 221583 220990 340212
12378 340212 425274 524190 638962 787892 858650 830476 742929 609527 528663 474976 435978
12367 435978 371701 298588 293840 307048 278206 240652 223005 202798 165057 178603 175455 161847
12355 161847 191803 245151 272619 200806 178518 167519 132856 166663 230646 223843 195889 176471
12343 176471 265525 315903 312192 308057 378197 453187 481875 570400 584959 631500 737959 838793
12331 838793 907759 984803 1044001 1070128 1198569 1411323 1619357 1904296 2332098 3018357
12321 3018357 4035092 5407295 6835797 7660133 7510481 6533424 5190036 4004541 3171106
12312 3171106 2614933 2213223 1886036 1645978 1427214 1187700 1012296 881291 767932
$$ packed form
12390B16387K1666K2552L4693J7607J407k8520N316j3231j7820l8474n93J19222
12378C40212Q5062R8916J14772J48930P0758k8174q7547j33402q0864n3687l8998
12367D35978o4277p3113m748J3208k8842l7554j7647k0207l7741J3546l148j3608
12355A61847K9956N3348K7468p1813k2288j0999l4663L3807O3983o803k7954j9418
12343A76471Q9054N0378l711m135P0140P4990K8688Q8525J4559M6541J06459J00834
12331H38793O8966P7044N9198K6127J28441K12754K08034K84939M27802O86259
12321C018357J016735J372203J428502Q24336j49652r77057j343388j185495q33435
12312C171106n56173m01710l27187k40058k18764k39514j75404j31005j13359
$$ plain form
12303 767932 707672 674336 633363 566659 493722 412814 345289 340806 360992 416038 397421 388754
12291 388754 378053 368934 365387 346141 404282 406722 382348 405376 369609 276774 210651 190593
12279 190593 169701 166890 164922 144391 138131 132238 167750 166206 146895 179217 174595 127381 89132
12266 89132 91949 133522 144457 167677 177987 167750 141356 139625 153832 155107 140854 144118
12254 144118 127628 143829 169263 138870 149712 166541 165434 151814 128388 142651 178085 185198
12242 185198 212039 240855 223136 204690 220462 232481 201022 135746 124988 139454 198245
12231 198245 211156 219593 214354 225623 231613 234938 286333 331393 350316 477919 622110 803317
12219 803317 1046973 1393170 1927746 2473505 2790600 2751154 2353447 1789375 1318188 998007
$$ packed form
12303G67932o0260l3336m0973o6704p2937q0908o7525m483K0186N5046j8617q667
12291C88754j0701r119l547j9246N8141K440k4374K3028l5767r2835o6123k0058
12279A90593k0892k811j968k0531o260n893L5512j544j9311L2322m622m7214l8249
12266H9132K817M1573J0935K3220J0310j0237k6394j731J4207J275j4253L264
12254A44118j6490J6201K5434l0393J0842J6829j107j3620k3426J4263L5434P113
12242A85198K6841K8816j7719j8446J5772J2019l1459o5276j0758J4466N8791
12231A98245J2911Q437n239J1269N990L325N1395M5060J8923J27603J44191J81207
12219H03317K43656L46197N34576N45759L17095l9446l97707n64072m71187l20181
$$ plain form
12209 998007 780265 686682 628427 546066 511105 468524 420321 424454 472781 513736 541599
12198 541599 551240 509061 442277 368635 259472 174164 113396 5859 -28953 -8231 3544
12187 3544 11714 56648 78754 54631 53899 77472 57101 33438 41836 49008 55516 51156 95226
12174 95226 69528 33093 3770 58593 59887 30952 1832 -22788 -7259 50354 62798 63949
12162 63949 67430 39001 21274 2378 -22893 5352 4825 -8444 22910 67269 99499 70143
12150 70143 35819 35485 41714 34831 36895 30028 48528 60057 76322 84719 63636 47778 18053
12137 18053 -5136 20475 29461 -2420 18577 34680 50889 49046 63924 54746 39572 8051
12125 8051 -10129 52 18933 51013 78221 101545 53665 46322 78984 66670 8751 -7732
$$ packed form
12209I98007k17742r3583n8255q2361l4961m2581m8203M133M8327M0955K7863
12198E41599R641m2179o6784p3642j09163q5308o0768j07537l4812K0722J1775
12187C544Q170M4934K2106k4123p32K3573k0371k3663Q398P172O508m360M4070
12174I5226k5698l6435k9323N4823J294k8935k9120k4620J5529N7613J2444J151
12162F3949L481k8429j7727j8896k5271K8245n27j3269L1354M4359L2230k9356
12150G0143l4324l34O229o883K064o867J8500J1529J6265Q397k1083j5858k9725
12137A8053k3189K5611Q986l1881K0997J6103J6209j843J4878r178j5174l1521
12125H051j8180J0181J8881L2080K7208K3324m7880p343L2662j2314n7919j6483
$$ plain form
12113 -7732 10598 34628 8892 -18925 -266 -31224 -28177 -2884 16955 -27376 -36001 -19402
12101 -19402 -35473 -75102 -79259 -47613 -21428 12175 36980 50666 -4087 -64228 -1128 36001
12089 36001 47194 47732 -21607 -52595 -15805 75936 78229 63566 74486 89619 55910 29692
12077 29692 44129 53380 61915 40817 18977 -6161 9902 20100 35189 59847 68521 35311
12065 35311 -10606 27276 23113 23379 38514 15061 62250 80172 10406 5718 -11808 -35342
12053 -35342 -44493 -21578 -40755 -32819 -20282 5413 8209 52495 43000 39519 71468 54471 24457
12040 24457 7417 -15143 -34467 -34612 -48832 -10625 56187 97543 98239 78702 42977 14991
12028 14991 21074 34445 12571 -7052 11950 37004 23886 21849 -22946 -18156 28076 50611
$$ packed form
12113g732J8330K4030k5736k7817J8659l0958L047K5293J9839m4331q625J6599
12101a9402j6071l9629m157L1646K6185L3603K4805J3686n4753o0141O3100L7129
12089C6001J1193N38o9339l0988L6790R1741K293j4663J0920J5133l3709k6218
12077B9692J4437R251Q535k1098k1840k5138J6063J0198J5089K4658Q674l3210
12065C5311m5917L7882m163K66J5135k3453M7189J7922o9766m688j7526k3534
12053c5342r151K2915j9177P936J2537K5695K796M4286r495l481L1949j6997l0014
12040B4457j7040k2560j9324j45j4220L8207O6812M1356O96j9537l5725k7986
12028A4991O083J3371k1874j9623J9002K5054j3118k037m4795M790M6232K2535
$$ plain form
12016 50611 44902 20097 17662 31380 21035 -14046 -34970 -8833 14964 2741 -13916 -30154
12004 -30154 -50823 -3548 33939 45014 49630 61993 25592 1779 -19685 -21918 32510 31132
11992 31132 54909 48541 46758 44385 27607 18100 -1237 12444 20731 37431 24375 24458 10801
11979 10801 30035 24727 29840 35815 55554 28659 5312 -26710 -17907 18266 26626 -2603 14569
11966 14569 45580 32770 2644 30109 63891 49632 16733 -1077 12637 -14815 -16184 1363
11954 1363 15753 8045 3374 6201 11772 1594 4969 4580 -7265 -31058 -3296 7611 28684
11941 28684 11875 15780 -18706 -28132 -17847 15913 49928 70224 96124 43129 24891 40012
11929 40012 26213 31885 28653 54376 29763 1514 -25082 -17554 309 18804 10776 -6436
$$ packed form
12016E0611n709k4805k435J3718j0345l5081k0924K6137K3797j2223j6657j6238
12004c0154k0669M7275L7487J1075M616J2363l6401k3813k1464k233N4428j378
11992C1132K3777o368j783k373j6778r507j9337J3681Q287J6700j3056Q3j3657
11979A0801J9234n308N113N975J9739k6895k3347l2022Q803L6173Q360k9229J7172
11966A4569L1011j2810l0126K7465L3782j4259l2899j7810J3714k7452j369J7547
11954A363J4390p708m671K827N571j0178L375l89j1845k3793K7762J0907K1073
11941B8684j6809L905l4486r426J0285L3760L4015K0296K5900n2995j8238J5121
11929D0012j3799N672l232K5723k4613k8249k6596P528J7863J8495q028j7212
$$ plain form
11917 -6436 10777 17744 13513 16045 29082 60040 57662 60940 59190 48660 59535 90140 85890
11904 85890 49302 13140 -22360 -5878 58416 39400 -12925 -4279 20806 35034 -4564 -46393
11892 -46393 -25701 27771 23665 -7377 -1596 -15069 -32433 -40324 -541 43795 58894 55497
11880 55497 35416 -12845 -14572 -20221 -27357 -9377 -21014 -31609 -10921 30130 60717 38375
11868 38375 24642 36646 41446 49477 48356 78258 91593 92506 73384 32048 7189 48621 58686
11855 58686 35087 17338 7340 -47161 -88481 -58388 -24968 -2866 -65095 -68577 -50993 -5273
11843 -5273 28724 51406 10297 -980 23453 19417 13765 55467 69539 53989 63418 85136
11831 85136 54107 -23580 -21666 23971 41649 36394 23760 11060 -8862 -10761 -7533 -39252
$$ packed form
11917f436J7213O967m231K532J3037L0958k378L278j750j0530J0875L0605m250
11904H5890l6588l6162l5500J6482O4294j9016n2325Q646K5085J4228l9598m1829
11892d6393K0692N3472m106l1042N781j3473j7364p891L9783M4336J5099l397
11880E5497k0081m8261j727n649p136J7980j1637j0595K0688M1051L0587k2342
11868C8375j3733J2004M800Q031j121K9902J3335R13j9122m1336k4859M1432J0065
11855E8686k3599j7749r998n4501m1320L0093L3420K2102o2229l482J7584M5720
11843e273L3997K2682m1109j1277K4433m036n652M1702J4072j5550R429K1718
11831H5136l1029p7687J914M5637J7678n255j2634j2700j9922j899L228l1719
$$ plain form
11819 -39252 -6854 68824 87988 87389 90663 75674 58462 56871 34501 4538 25917 5216
11807 5216 6369 34406 48257 58964 74038 95646 83809 80393 97561 106776 109496 103952 96472
11794 96472 113598 134947 121113 104028 131769 234307 306657 314826 337060 336111 323965 289624
11782 289624 211853 171425 138322 101094 80965 74636 66459 82048 70699 61838 19347 -3345
11770 -3345 30752 44350 72192 59805 55388 25379 17920 19174 22637 -11186 -27738 3230 29530
11757 29530 30280 68626 55631 -14178 -36650 -25078 -29090 -69292 -62220 -27608 -13823 -40386
11745 -40386 -8905 -677 12563 22938 52237 70868 32681 -3010 -1179 17453 46207 51559
11733 51559 30997 36744 60590 -10222 -38986 -48935 -7412 16329 31598 37118 58872 62623
$$ packed form
11819c9252L2398P5678J9164n99L274j4989j7212j591k2370k9963K1379k0701
11807E216J153K8037J3851J0707J5074K1608j1837l416J7168R215K720n544p480
11794I6472J7126K1349j3834j7085K7741J02538P2350Q169K2234r49j2146l4341
11782B89624p7771m0428l3103l7228k0129o329q177J5589j1349q861m2491k2692
11770c345L4097J3598K7842j2387m417l0009p459J254L463l3823j6552L0968K6300
11757B9530P50L8346j2995o9809k2472J1572m012m0202P072L4612J3785k6563
11745d0386L1481Q228J3240J0375K9299J8631l8187l5691J831J8632K8754N352
11733E1559k0562N747K3846p0812k8764r949M1523K3741J5269N520K1754L751
$$ plain form
11721 62623 34338 36012 36014 11104 -640 -13417 -22810 -46108 -65958 -52064 -63035 -48253 3110
11708 3110 14970 -2644 -53090 -72950 -63094 -29849 -21901 23477 24548 4266 16140 21171 18915
11695 18915 9230 -12729 -52229 -8278 -19840 -38163 -16269 10659 -5448 -45842 -27584 -25439
11683 -25439 -80293 -88167 -51990 -26654 -24589 -35910 -50193 -27556 -803 -29068 -11143 20688
11671 20688 -5810 18302 9505 -15647 -10250 -17734 -27439 -31657 -11123 2552 18616 1186 -30237
11658 -30237 -40358 -73303 -88537 -50361 -64493 -83970 -41023 -33284 -39311 -41249 -31082 -51995
11646 -51995 -59662 -84280 -94078 -64767 -46762 -66069 -31568 37020 44322 18835 6340 23694
11634 23694 58101 41913 51094 66851 67801 46592 31089 42673 46702 51536 7767 -15144 8312
$$ packed form
11721F2623k8285J674Kk4910j1744j2777r393k3298j9850J3894j0971J4782N1363
11708C110J1860j7614n0446j9860R856L3245P948M5378J071k0282J1874N031k256
11695A8915r685k1959l9500M3951j1562j8323K1894K6928j6107m0394J8258K145
11683b5439n4854p874L6177K5336K065j1321j4283K2637K6753k8265J7925L1831
11671B0688k6498K4112q797k5152N397p484r705m218K0534J3675J6064j7430l1423
11658c0237j0121l2945j5234L8176j4132j9477M2947P739o027j938J0167k0913
11646e1995p667k4618r798K9311J8005j9307L4501O8588P302k5487j2495J7354
11634B3694L4407j6188R181J5757R50k1209j5503J1584M029M834m3769k2911K3456
$$ plain form
11621 8312 -20561 -18864 -24330 21384 54305 36616 -5591 -27292 -3881 -12217 -33439 -22206
11609 -22206 -25879 3143 39585 50751 8831 -8148 -9044 6930 12033 -15828 -25723 -30711 -21297
11596 -21297 -24987 4417 35244 43317 51152 41204 2678 12667 15918 -9504 -14237 27708 3105
11583 3105 10140 41818 6503 -17020 -12207 2105 6745 19364 -1979 -25619 -51273 -51516 -65090
11570 -65090 -31760 13751 -1748 -18019 -59835 -45701 -20023 20585 9481 -15716 -12784 -2080
11558 -2080 -35647 -24649 -47372 -51966 -45410 -21375 -11652 10234 7503 -1320 11112 -27152 -9525
11545 -9525 42293 46657 21874 11087 -7316 -35454 -39521 -27759 -12640 -26296 -6218 59262
11533 59262 66297 35542 -6504 -2437 -18568 -36867 -24358 -5946 -8294 2155 18684 3236
$$ packed form
11621H312k8873J697n466M5714L2921j7689m2207k1701K3411q336k1222J1233
11609b2206l673K9022L6442J1166m1920j6979q96J5974N103k7861r895m988R414
11596b1297l690K9404L0827Q073P835r948l8526R989L251k5422m733M1945k4603
11583C105P035L1678l5315k3523M813J4312M640J2619k1343k3640k5654k43j3574
11570f5090L3330M5511j5499j6271m1816J4134K5678M0608j1104k5197K932J0704
11558b080l3567J0998k2723m594O556K4035R723K1886k731q823J2432l8264J7627
11545i525N1818M364k4783j0787j8403k8138m067J1762J5119j3656K0078O5480
11533E9262P035l0755m2046M067j6131j8299J2509J8412k348J0449J6529j5448
$$ plain form
11521 3236 -16707 -16728 9112 19923 16868 -10047 -11467 -6241 -13628 -3437 -15094 -46810 -36485
11508 -36485 -17873 1643 16500 11345 23395 21297 42275 40838 19255 8949 -3147 -28946
11496 -28946 25007 45755 85852 70437 35447 12535 3757 3120 -25505 15500 1846 -53689
11484 -53689 -20848 17226 2718 -8291 -12689 -17466 -56291 -38561 -809 4886 15036 48009
11472 48009 56502 47819 65285 67881 64263 46581 34905 59127 73542 39787 1884 -20872
11460 -20872 -12922 -9461 4329 -16311 -52740 -32164 -32555 -18487 -789 -12673 -45205 -44911 -16340
11447 -16340 -33477 -20663 22931 22071 24667 60632 5865 -36751 -28679 -15611 -12254 2790 -2329
11434 -2329 -18272 -32682 -61702 -33902 -21588 -40106 -58142 -86906 -95801 -87154 -69750 -71832
$$ packed form
11521C236j9943k1K5840J0811l055k6915j420N226p387J0191j1657l1716J0325
11508c6485J8612J9516J4857n155J2050k098K0978j437k1583j0306j2096k5799
11496b8946N3953K0748M0097j5415l4990k2912q778o37k8625M1005j3654n5535
11484e3689L2841L8074j4508j1009m398m777l8825J7730L7752N695J0150L2973
11472D8009Q493q683J7466K596l618j7682j1676K4222J4415l3755l7903k2756
11460b0872P950L461J3790k0640l6429K0576l91J4068J7698j1884l2532K94K8571
11447a6340j7137J2814M3594q60K596L5965n4767m2616Q072J3068L357J5044n119
11434b329j5943j4410k9020K7800J2314j8518j8036k8764q895Q647J7404k082
$$ plain form
11422 -71832 -24163 -28986 -12358 -20666 4228 23230 -11114 -46044 -56368 -72653 -38370 -34191
11410 -34191 15657 20682 55180 48612 39195 45666 44810 60502 61368 17889 12084 -2243 23844
11397 23844 10019 -8878 -25140 -2920 36943 51552 39384 47426 16841 -10361 -16718 2148
11385 2148 34157 43813 11120 -5378 -20001 -47516 22234 37586 7619 2889 -24097 -39063
11373 -39063 4039 57590 72249 56513 48464 47220 4604 -41435 -68904 -46006 6661 34838
11361 34838 54207 54106 14752 7046 14035 12951 -42438 -57662 -57404 -53241 -60396 -14490 -24813
11348 -24813 -71473 -100573 -84947 -28571 19928 397 -16007 -15517 -53962 -66358 -46547 -63351
11336 -63351 -87412 -49158 -28765 -45732 -69959 -68186 -26007 -23397 -32764 -3822 37190 71080
$$ packed form
11422g1832M7669m823J6628q308K4894J9002l4344l4930j0324j6285L4283M179
11410c4191M9848N025L4498o568r417O471q56J5692Q66m3479n805j4327K6087
11397B3844j3825j8897j6262K2220L9863J4609j2168Q042l0585k7202o357J8866
11385B148L2009R656l2693j6498j4623k7515O9750J5352k9967m730k6986j4966
11373c9063M3102N3551J4659j5736q049j244m2616m6039k7469K2898N2667K8177
11361C4838J9369j01l9354p706O989j084n5389j5224K58M163p155M5906j0323
11348b4813m6660k9100J5626N6376M8499j9531j6404M90l8445j2396J9811j6804
11336f3351k4061L8254K0393j6967k4227J773M2179K610r367K8942M1012L3890
$$ plain form
11324 71080 73323 45880 22118 -3225 -6514 -7005 16796 14540 -23836 -31999 -12442 -24761 -35379
11311 -35379 -12673 3233 4025 19240 42094 -16019 -50543 -10100 16936 9880 -16033 -14068
11299 -14068 14320 -9334 -26576 -54836 -35046 -14535 -25017 -11698 6109 33447 43700 61545
11287 61545 47852 7954 -35784 -34153 -20802 13435 10333 2757 13826 9602 3736 31415 26099
11274 26099 32686 3110 -21336 -7823 17586 -3498 -11305 36686 63864 54473 24801 19423
11262 19423 42800 54017 96069 161365 160461 134136 130229 106788 143666 254178 334568 390174
11250 390174 469949 471338 422308 337604 242637 151474 81701 41544 26161 48447 71838 87782
11238 87782 49090 26666 7859 -37735 -30023 -10444 -4925 -15140 21364 60440 40647 -1103
$$ packed form
11324G1080K243k7443k3762k5343l289m91K3801k256l8376q163J9557j2319j0618
11311c5379K2706J5906P92J5215K2854n8113l4524M0443K7036p056k5913J965
11299a4068K8388k3654j7242k8260J9790K0511j0482J3319J7807K7338J0253J7845
11287F1545j3693l9898m3738J631J3351L4237l102p576J1069m224n866K7679n316
11274B6099O587k9576k4446J3513K5409k1084p807M7991K7178r391k9672n378
11262A9423K3377J1217M2052O5296r04k6325l907k3441L6878J10512Q0390N5606
11250C90174P9775J389m9030q4704r4967r1163o9773m0157j5383K2286K3391J5944
11238H7782l8692k2424j8807m5594P712J9579N519j0215L6504L9076j9793m1750
$$ plain form
11226 -1103 13046 37660 44753 20406 12792 16152 -18373 -33553 -42566 -10908 6010 -15418 -28589
11213 -28589 -22309 16136 22693 17654 3863 -14552 -36832 -12117 25591 18749 19670 43268 15634
11200 15634 9229 -1598 25586 28507 25202 27526 5466 129 16851 28890 27927 32633 30969
11187 30969 1686 -51499 -46161 -47216 -54836 -26871 333 23745 -17764 -41056 -31000 -32940
11175 -32940 -38016 7332 25321 -23781 -43720 -52566 -32602 -24770 -52305 -66141 -28939 -764
11163 -764 -16456 11872 39697 65003 55190 36907 33209 12226 17983 -13070 -62518 -80451 -22520
11150 -22520 50423 64448 74302 78708 67645 83947 150504 185804 229183 269317 351811 393762
11138 393762 383116 327841 295557 282826 214447 132605 77695 41944 49233 33198 24107 -3048
$$ packed form
11226a103J4149K4614P093k4347p614L360l4525j5180r013L1658J6918k1428j3171
11213b8589O280L8445O557n039j3791j8415k2280K4715L7708o842R21K3598k7634
11200A5634o405j0827K7184K921l305K324k2060n337J6722J2039r63M706j664
11187C0969k9283n3185N338j055p620K7965K7204K3412m1509k3292J0056j940
11175c2940n076M5348J7989m9102j9939q846J9964P832k7535j3836L7202K8175
11163g64j5692K8328K7825K5306r813j8283l698k0983N757l1053m9448j7933N7931
11150b2520P2943J4025R854M406j1063J6302O6557L5300M3379M0134Q2494M1951
11138C93762j0646n5275l2284j2731o8379q1842n4910l5751P289j6035r091k7155
$$ plain form
11126 -3048 -67461 -44040 15812 47576 18897 -14778 -8638 -11549 -1267 12719 9300 -10002
11114 -10002 22567 68332 41594 27148 20864 3560 -2145 36296 54678 35153 13998 7391
11102 7391 -6251 -19293 11157 -10314 -58337 -31503 -47736 -69669 -61874 -43261 -22092 -53219
11090 -53219 -43541 -39658 -53643 -50545 -20474 -20397 -19050 -20272 -5636 6021 4109 2651 -120 -27802
11076 -27802 -86812 -71381 -13493 1428 14597 -5742 -45528 -45404 -17690 -7166 7274 -18068
11064 -18068 -17071 936 1999 11506 9208 -15894 -27643 11640 30417 33544 -3667 -24793 -58293
11051 -58293 -76362 -28388 -1458 -15662 -4936 18011 14585 -30437 -46035 -11119 -1292 -2654
11039 -2654 17731 22590 -7350 -19193 -4384 -7652 -35071 -69647 -54803 4402 6019 -26002
$$ packed form
11126c048o4413K3421N9852L1764k8679l3675O140k911J0282J3986l419j9302
11114a0002L2569M5765k6738j4446o284j7304n705L8441J8382j9525k1155o607
11102G391j3642j3042L0450k1471m8023K6834j6233k1933P795J8613K1169l1127
11090e3219R678L883j3985L098L0071P7J347j222J4636J1657j912j458k771k7682
11076b7802n9010J5431N7888J4921J3169k0339l9786J24K7714J0524J4440k5342
11064a8068R97J8007J063R507k298k5102j1749L9283J8777L127l7211k1126l3500
11051e8293j8069M7974K6930j4204J0726K2947l426m5022j5598L4916R827j362
11039b654K0385M859k9940j1843J4809l268k7419l4576J4844N9205J617l2021
$$ plain form
11027 -26002 -22455 43846 67066 15106 -24105 -47678 -28088 -10607 -13808 17603 15729 -54120
11015 -54120 -74326 -55145 -64912 -37493 11121 716 -29856 -35892 -31725 9088 8969 -30793 -74418
11002 -74418 -72392 -36222 12544 28318 43710 39683 4379 11196 20025 -10120 -29202 -75520
10990 -75520 -32613 -2237 10298 4706 19537 46992 34307 24058 36573 54921 23861 -1014
10978 -1014 -10871 -17660 -46804 -19323 26316 74993 76056 24524 -27912 -37468 -53259 -67444 -89061
10965 -89061 -89393 -69093 -9627 -12570 -10595 576 13825 22667 933 -41434 -16436 1053 1384
10952 1384 -7988 -39215 -56210 -38163 -38530 -67428 -33861 -19413 -896 30640 29626 26490 29985
10939 29985 41667 23499 28811 26938 29185 3821 -29366 -76024 -75449 -50468 -42882 -32109 -12768
$$ packed form
11027b6002L547O6301K3220n1960l9211k3573J9590J7481l201L1411j874o9849
11015e4120k0206J9181r767K7419M8614j0405l0572o036M167M0813j19l9762m3625
11002g4418K026L6170M8766J5774J5392m027l5304O817Q829l0145j9082m6318
10990g5520M2907L0376J2535n592J4831K7455j2685j0249J2515J8348l1060k4875
10978a014r857o789k9144K7481M5639M8677J063n1532n2436r556j5791j4185k1617
10965h9061l32K0300N9466k943J975J1171J3249Q842k1734m2367K4998J7489L31
10952A384r372l1227j6995J8047l67k8898L3567J4448J8517L1536j014l136L495
10939B9985J1682j8168N312j873K247k5364l3187m6658N75K4981P586J0773J9341
$$ plain form
10926 -12768 3722 9668 23652 -18645 -66487 -69130 -48444 -53406 -57010 -54026 1137 40483 24021
10913 24021 12762 -15804 -33105 -41125 -44091 -26987 -4618 12380 -22531 -54098 -98587 -98980
10901 -98980 -77563 -25085 33830 66853 250 -52346 -50791 -71826 -52064 -37982 -45935 -47919
10889 -47919 -32231 -34256 -61607 -63109 -69922 -59347 -9312 11614 15347 25798 50100 57833 60593
10876 60593 25216 -50580 -39489 -32513 -15863 43993 32418 48580 25233 -18119 -12021 33788
10864 33788 34824 32171 31981 7441 -40968 -87227 -90253 -43455 -15125 -14742 -12619 12853 -14883
10851 -14883 -21899 -19119 81 3643 15710 9720 -5765 -14594 -56648 -86073 -80574 -16489 972
10838 972 7026 19004 -10461 -27045 -25057 -3140 7741 -14850 -16179 -13822 -23364 -3519 28408
$$ packed form
10926a2768J6490N946J3984m2297m7842k643K0686m962l604K984N5163L9346j6462
10913B4021j1259k8566j7301q020k966J7104K2369J6998l4911l1567m4489l93
10901i8980K1417N2478N8915L3023o6603n2596J555k1035J9762J4082p953j984
10889d7919J5688k025k7351j502o813J0575N0035K0926L733J0451K4302P733K760
10876F0593l5377p5796J1091O976J6650N9856j1575J6162k3347m3352O098M5809
10864C3788J036k653j90k4540m8409m6259l026M6798K8330L83K123K5472k7736
10851a4883p016K780J9200L562J2067n990j5485q829m2054k9425N499O4085J7461
10838I72O054J1978k9465j6584J988K1917J0881k2591j329K357r542J9845L1927
$$ plain form
10825 28408 63839 30950 -4615 -31099 -46660 -27684 -9580 -11410 25534 19960 -29751 -46201
10813 -46201 -12394 -4462 19047 23434 -10786 -22253 -19034 -11391 -3353 -1790 -16026 -13038 365
10800 365 1791 -19636 -18324 15868 52276 17084 -52587 -74615 -34246 1888 1500 5720 -25737
10787 -25737 -30161 -8420 -19041 -14284 -43977 -18935 7616 4791 -10626 -25515 -36923 -38301
10775 -38301 -9678 18944 15501 12115 37357 -11709 -55359 -27270 -16226 -20354 -48160 -44491
10763 -44491 -25985 -19742 -35287 -54299 -60577 -42236 -21560 -23518 -25285 -31618 -53281 -40318 -60410
10750 -60410 -53487 -8358 9759 869 14507 5048 -22092 -20270 -15802 -28014 1992 38660 51094
10737 51094 44393 23598 31970 54843 42807 34344 19855 -4877 -30011 -19996 -8508 -26646
$$ packed form
10825B8408L5431l2889l5565k6484j5561J8976J8104j830L6944n574m9711j6450
10813d6201L3807P932K3509M387l4220j1467L219P643Q038J563j4236K988J3403
10800C65J426k1427J312L4192L6408l5192o9671k2028M0369L6134l88M220l1457
10787b5737m424K1741j0621M757k9693K5042K6551k825j5417j4889j1408j378
10775c8301K8623K8622l443l386K5242m9066m3650K8089J1044m128k7806L669
10763d4491J8506O243j5545j9012o278J8341K0676j958j767o333k1663J2963k0092
10750f0410O923M5129J8117q890J3638r459k7140J822M468j2212L0006L6668J2434
10737E1094o701k0795Q372K2873j2036q463j4489k4732k5134J0015J1488j8138
$$ plain form
10725 -26646 -47484 -43318 -39277 4561 43054 33181 -12524 -50878 -55923 -58981 -42986 -78481 -72202
10712 -72202 -65141 -56847 -17259 -16652 -14713 -13852 -56812 -52236 -51315 6791 19249 15743 19761 32136
10698 32136 39395 137 -48010 -58665 -47803 -8059 -27064 -78200 -79481 -66941 -71237 -32152
10686 -32152 -11638 -15282 -16136 3856 27440 25134 15993 8376 27601 5254 4166 21967 29844
10673 29844 22369 -17187 -34228 -46726 -25264 9846 41806 44544 47566 56962 35123 50751
10661 50751 -2670 -33494 -3524 9678 -4271 -1796 -1254 -16937 -1621 15087 -22531 -31942
10649 -31942 -55030 -26494 18207 26954 4581 -4923 -26633 -39804 -40612 -43518 -36104 -23149 -10857
10636 -10857 -14799 8640 39134 16621 9636 17694 16245 11698 10036 -47157 -46820 18515 49187
$$ packed form
10725b6646k0838M166M041M3838L8493r873m5705l8354n045l058J5995l5495O279
10712g2202P061Q294L9588O07J939Q61m2960M576R21N8106J2458l506M018J2375
10698C2136P259l9258m8147j0655J0862L9744j9005n1136j281J2540m296L9085
10686c2152K0514l644q54J9992K3584k306r141p617J9225k2347j088J7801P877
10673B9844p475l9556j7041j2498K1462L5110L1960K738L022R396k1839J5628
10661E0751n3421l0824K9970J3202j3949K475N42j5683J5316J6708l7618r411
10649c1942k3088K8536M4701Q747k2373r504k1710j3171q08k906P414J2955J2292
10636a0857l942K3439L0494k2513o985Q058j449m547j662n7193L37O5335L0672
$$ plain form
10623 49187 38037 47051 9845 -1218 32072 22406 -28655 -13396 -8822 -27703 -51409 -21534
10611 -21534 -6545 -2793 -3427 -2421 -25671 -54750 -98300 -101918 -41820 -15109 -33595 -4130 35795
10598 35795 21977 25916 71698 53217 33336 22357 1084 -21601 4428 1210 -16340 -9457
10586 -9457 -63373 -48396 -44789 -63040 -75032 -25426 -21822 -17986 12617 15228 1081 -3013 12724
10573 12724 35037 20340 -2685 -34028 -18686 -12962 -2147 -5269 12360 -582 -12911 -669
10561 -669 -32 -21061 -10322 2020 11776 35978 58488 42418 25702 -1214 -31708 2265 -4108
10548 -4108 4241 5561 -9624 -28926 -49451 -82182 -62365 -31713 -34023 -23876 -43881 -27560
10536 -27560 -26523 -92 6946 31052 47496 52232 21303 -5540 -14930 -20451 -2771 34797 9425
$$ packed form
10623D9187j1150R014l7206j1063L3290r666n1061J5259M574j8881k3706K9875
10611b1534J4989L752o34J006k3250k9079m3550l618O0098K6711j8486K9465L9925
10598C5795j3818L939M5782j8481j9881j0979k1273k2685K6029l218j7550O883
10586i457n3916J4977L607j8251j1992M9606L604L836L0603K611j4147m094J5737
10573A2724K2313j4697k3025l1343J5342N724J0815l122J7629j2942j2329J2242
10561f69O37k1029J0739J2342R756K4202K2510j6070j6716k6916l0494L3973o373
10548d108Q349J320j5185j9302k0525l2731J9817L0652k310J0147k0005J6321
10536b7560J037K6431P038K4106J6444M736l0929k6843r390n521J7680L7568k5372
$$ plain form
10523 9425 -13268 3534 5819 5809 -10676 2962 18955 21663 80372 111557 40313 7738 -20712
10510 -20712 -11612 22864 34270 50447 76660 51286 2390 7918 13652 14220 -6244 -23721 -22336
10497 -22336 2778 -16708 -36725 2004 -26795 -33189 -55746 -15557 -20741 -40154 -13991 19115
10485 19115 -23685 -52275 21366 56340 41433 29467 38645 40406 -9889 -48535 -24567 -26127
10473 -26127 -47983 -26932 47 10433 -5049 -28776 -39722 -10181 -14785 -35538 -36035 -40487
10461 -40487 -54987 -59698 -60240 -53520 -37251 -18104 11707 28970 54431 19657 -40463 -59910
10449 -59910 -69352 -70861 -64418 -60406 -48741 -48189 -73107 -68420 -54666 -19358 -7174 5648 34366
10436 34366 50755 22839 12591 19717 7385 12816 -5925 -34931 -49243 -24659 -28953 -6847
$$ packed form
10523I425k2693J6802K285j0j6485J3638J5993K708N8709L1185p1244l2575k8450
10510b0712R100L4476J1406J6177K6213k5374m8896N528N734N68k0464j7477J385
10497b2336K5114j9486k0017L8729k8799o394k2557M0189n184j9413K6163L3106
10485A9115m2800k8590P3641L4974j4907j1966R178J761n0295l8646K3968j560
10473b6127k1856K1051K6979J0386j5482k3727j0946K9541m604k0753m97m452
10461d0487j4500m711n42O720J6269J9147K9811J7263K5461l4774o0120j9447
10449e9910r442j509O443M012J1665N52k4918M687J3754L5308J2184J2822K8718
10436C4366J6389k7916j0248P126j2332N431j8741k9006j4312K4584m294K2106
$$ plain form
10424 -6847 -20580 -49665 -32378 7562 24256 30586 -7376 -38270 -36582 -53465 -50642 -45979 -31963
10411 -31963 -38527 -55962 -38306 -23548 -20933 25579 50936 54464 46079 -10579 -26004 10675
10399 10675 19408 -6583 582 7232 -6060 -20312 -32597 16517 11990 -45196 -35422 -22482 4573
10386 4573 10101 25561 30429 62746 61493 22804 33347 75058 43874 -5180 -8170 -19107 -43927
10373 -43927 606 42108 56812 17296 -3817 -27866 -35609 -15748 9637 20513 34434 1063
10361 1063 -6757 23415 44204 32167 -14292 -34683 -58839 -44110 -15557 -5419 -26330 2734
10349 2734 13588 24240 29459 29523 8486 8937 9786 5681 29649 63759 75370 63715 85907 96422
10335 96422 56974 -3106 540 10137 -16336 -17523 19693 28549 12670 3605 12879 30429 79405
$$ packed form
10424f847j3733k9085J7287L9940J6694O330l7962l0894J688j6883K823M663J4016
10411c1963o564j7435J7656J4758K615M6512K5357L528q385n6658j5425L6679
10399A0675Q733k5991P165O650j3292j4252j2285M9114m527n7186R774J2940K7055
10386D573N528J5460M868L2317j253l8689J0543M1711l1184m9054k990j0937k4820
10373d3927M4533M1502J4704l9516k1113k4049p743J9861K5385J0876J3921l3371
10361A063p820L0172K0789j2037m6459k0391k4156J4729K8553J0138k0911K9064
10349B734J0854J0652N219O4k1037M51Q49m105K3968L4110J1611j1655K2192J0515
10335I6422l9448o0080L646R597k6473j187L7216Q856j5879r065R274J7550M8976
$$ plain form
10322 79405 69254 24670 -41347 -77366 -21187 -8570 -22028 -6414 16570 18717 39762 20661
10310 20661 13090 11616 39678 5827 1001 51106 59972 44358 4722 -17741 -29411 -28198 -8556
10297 -8556 -11481 -27017 577 31229 52064 19529 11510 14233 13854 -2114 -9084 16497 47902
10284 47902 37759 7943 -33166 -44344 -35053 -13904 -123 18316 22836 -2233 -43605 -58770
10272 -58770 -4151 16552 38664 47046 47356 56442 69545 85187 81466 64638 47661 23100 26726
10259 26726 50559 48050 13987 -4546 5028 -3085 -21435 -16529 4936 -1638 -26703 -23029 41809
10246 41809 72390 78522 45020 28691 32596 34081 33485 24620 30080 55614 62146 52676 54519 32818
10232 32818 22649 11851 17792 25967 46388 41809 27355 -14332 -31587 21802 82795 42755
$$ packed form
10322G9405j0151m4584o6017l6019N6179J2617j3458J5614K2984K147K1045j9101
10310B0661p571j474K8062l3851m826N0105Q866j5614l9636k2463j1670J213J9642
10297h556k925j5536K7594L0652K0835l2535q019K723l79j5968o970K5581L1405
10284D7902j0143k9816m1109j1178R291K1149J3781J8439M520k5069m1372j5165
10272e8770N4619K0703K2112Q382L10R086J3103J5642l721j6828j6977k4561L626
10259B6726K3833k509l4063j8533R574q113j8350M906K1465o574k5065L674O4838
10246D1809L0581O132l3502j6329L905J485n96q865N460K5534O532r470J843k1701
10232C2818j0169j0798N941Q175K0421m579j4454m1687j7255N3389O0993m0040
$$ plain form
10220 42755 13950 36089 50956 30144 43743 37460 17059 26585 49700 26806 14360 17372
10208 17372 -2349 -36399 -12150 -31686 -40306 -32141 -30788 15393 53967 72507 64784 71655 50557
10195 50557 20277 32044 40592 42907 60359 40509 25704 28080 6639 -30513 -29900 1040 26503
10182 26503 28376 16083 -7714 33740 64843 14923 -25657 -14701 -30619 -39369 -9515 -9383
10170 -9383 -30928 -46939 -19474 10056 49369 55939 79906 72728 61423 80717 91271 56768
10158 56768 15173 24083 60602 56844 70588 102491 96959 100975 95240 64653 48565 55963 59207
10145 59207 67543 95399 103336 74838 74030 67485 56039 46004 32051 18238 33143 27087 7790
10132 7790 -2672 39257 74096 105880 112055 84733 39648 27973 27685 297 41479 40244 42129
$$ packed form
10220D2755k8805K2139J4867k0812J3599o283k0401R526K3115k2894j2446L012
10208A7372j9721l4050K4249j9536q620Q165J353M6181L8574J8540p723O871k1098
10195E0557l0280J1767Q548K315J7452j9850j4805K376k1441l7152O13L0940K5463
10182B6503J873j2293k3797M1454L1103m9920m0580J0956j5918q750K9854J32
10170i383k1545j6011K7465K9530L9313O570K3967p178j1305J9294J0554l4503
10158E6768m1595Q910L6519l758J3744L1903n532M016n735l0587j6088P398L244
10145E9207Q336K7856P937k8498q08o545j1446j0035j3953j3813J4905o056j9297
10132G790j0462M1929L4839L1784O175k7322m5085j1675k88k7388M1182j235J885
$$ plain form
10119 42129 72787 78507 25070 59603 89764 112853 80542 33762 32898 39399 71205 61051
10107 61051 56713 53234 51515 66085 27401 34334 26255 44190 42551 23607 29528 42625 1663
10094 1663 -12927 -26655 -8941 9002 24514 46124 47914 67606 60844 67121 27959 -8995
10082 -8995 6433 2169 -20822 -16722 -5116 3230 -23470 -29948 -4049 -11191 -3137 11759 42188
10069 42188 47873 28167 10052 18084 43076 64228 71773 64564 38844 6999 -17243 16507
10057 16507 29781 20632 70618 125388 91384 49670 72614 80107 22463 15181 16357 7505 17280
10044 17280 11181 11195 -9678 -18496 -30020 -9787 13964 53002 73580 83877 108754 92068 91757
10031 91757 94662 99622 84544 111203 102481 97988 110990 154748 206230 173920 160295 215106
$$ packed form
10119D2129L0658N720n3437L4533L0161K3089l2311m6780q64O501L1806j0154
10107F1051m338l479j719J4570l8684O933q079J7935j639j8944N921J3097m0962
10094A663j4590j3728J7714J7943J5512K1610J790J9692o762O277l9162l6954
10082h995J5428m264k2991M100J1606Q346k6700o478K5899p142Q054J4896L0429
10069D2188N685j9706j8115Q032K4992K1152P545p209k5720l1845k4242L3750
10057A6507J3274r149M9986N4770l4004m1714K2944P493n7644p282J176q852R775
10044A7280o099J4k0873q818j1524K0233K3751L9038K0578J0297K4877j6686l11
10031I1757K905M960j5078K6659q722m493J3002M3758N1482l2310j3625N4811
$$ plain form
10019 215106 338411 450247 581480 813712 1247967 2052346 3268171 4616185 4985021
10010 4985021 4451673 3022220 1828852 1197161 829722 609083 520117 472361 357336
10001 357336 280526 215640 131465 105199 158597 204618 199218 167757 194634 187295 163670 138245
9989 138245 100029 76735 84374 76285 59228 79199 58963 48148 107323 126323 117868 98583
9977 98583 74589 48391 45059 46438 49882 49383 27561 19161 41163 56178 56480 66830 75551 110814
9963 110814 116191 101021 123233 52372 -20807 -30429 -23074 -10506 2273 11137 48938 72107
9951 72107 70707 65544 94997 119056 131392 120931 115077 100218 92689 82237 58676 128714 118318
9938 118318 62804 59970 80673 121944 153844 184641 181692 161423 138762 109877 137803 154057
$$ packed form
10019B15106J23305J11836J31233K32232M34255Q04379J215825J348014L68836
10010D985021n33348j429453j193368o31691l67439k20639q8966m7756j15025
10001C57336p6810o4886q4175k6266N3398M6021n400l1461K6877p339k3625k5425
9989A38245l8216k3294P639q089j7057J9971k0236j0815N9175J9000q455j9285
9977I8583k3994k6198l332J379L444m99k1822q400K2002J5015L02J0350Q721L5263
9963A10814N377j5170K2212p0861p3179r622P355J2568J2779Q864L7801K3169
9951G2107j400n163K9453K4059J2336j0461n854j4859p529j0452k3561P0038j0396
9938A18318n5514k834K0703M1271L1900L0797k949k0269k2661k8885K7926J6254
$$ plain form
9926 154057 151525 142978 174673 224750 243191 225096 212372 220477 196850 190045 196645 267140 316462
9913 316462 306602 259419 303849 331198 292158 265678 273547 300422 341537 379835 407047 438378
9901 438378 471297 481694 486382 484580 509048 522829 491628 483068 502038 518576 553626 579495
9889 579495 634825 655098 658645 660121 677866 692563 714723 716373 710627 685342 713095 732147
9877 732147 730248 721853 736656 757498 731916 696689 685555 665393 592802 549445 532717 529611
9865 529611 541592 501603 518823 511538 476467 458942 428843 411340 406387 425872 459219 464320
9853 464320 476859 467719 437710 429873 456369 449940 423263 382830 372421 342292 310792 277255
9841 277255 260755 276508 295868 305233 280230 285657 324581 316097 299916 281286 293246 326671
$$ packed form
9926A54057k532q547L1695N0077J8441j8095j2724Q105k3627o805O600P0495M9322
9913C16462r860m7183M4430K7349l9040k6480P869K6875M1115L8298K7212L1331
9901D38378L2919J0397M688j802K4468J3781l1201q560J8970J6538L5050K5869
9889E79495N5330K0273L547J476J7745J4697K2160J650n746k5285K7753J9052
9877G32147j899q395J4803K0842k5582l5227j1134k0162p2591m3357j6728l106
9865E29611J1981l9989J7220p285l5071j7525l0099j7503m953J9485L3347N101
9853D64320J2539r140l0009p837K6496o429k6677m0433j0409l0129l1500l3537
9841B77255j6500J5753J9360R365k5003N427L8924q484j6181j8630J1960L3425
$$ plain form
9829 326671 324782 288034 271804 264162 224706 212447 203299 148242 162142 180968 181146 157020 136088
9816 136088 189443 205840 205871 217536 177823 145515 100712 86612 90744 144179 136749 150628 129913
9803 129913 118235 132401 192584 229305 221095 213940 166740 135213 151710 178895 210323 198239
9791 198239 196399 216433 195960 179135 186012 225339 249293 213027 173699 201153 228553 242150
9779 242150 230832 210586 230664 221253 231318 237579 208610 257030 282279 237979 214502 276155
9767 276155 268059 252728 258497 248475 235906 276551 275669 222864 213364 244155 260354 280358 258711
9754 258711 218922 197270 184615 217711 235250 261747 267868 274187 265617 248660 234636 203299
9742 203299 196571 200779 220407 223115 256499 304882 333798 365349 360266 312460 334685 395279
$$ packed form
9829C26671j889l6748j6230p642l9456j2259r148n5057J3900J8826J78k4126k0932
9816A36088N3355J6397L1J1665l9713l2308m4803j4100M132N3435p430J3879k0715
9803A29913j1678J4166O0183L6721q210p155m7200l1527J6497K7185L1428j2084
9791A98239j840K0034k0473j6825O877L9327K3954l6266l9328K7454K7400J3597
9779B42150j1318k0246K0078r411J0065O261k8969M8420K5249m4300k3477O1653
9767B76155q096j5331N769j0022j2569M0645q82n2805r500L0791J6199K0004k1647
9754B58711l9789k1652j2655L3096J7539K6497O121O319q570j6957j4024l1337
9742B03299o728M208J9628K708L3384M8383K8916L1551n083m7806K2225O0594
$$ plain form
9730 395279 413138 423516 436980 427224 448145 464022 518327 514906 517939 513877 523497 553066 593593
9717 593593 596247 603935 640516 666920 677468 706537 763286 760920 740447 713056 738202 730561
9705 730561 711990 697200 746811 703267 700828 701094 698663 742341 742828 693077 663761 663748 660797 602254
9691 602254 591910 644841 618159 565483 553421 552072 515067 501161 468652 450327 411145 410627
9679 410627 375855 367844 369583 367612 368786 346005 358376 360652 342961 358000 330289 307615 282705
9666 282705 252840 246450 247631 201344 208690 224515 224657 192315 219450 230522 225841 271165 303637
9653 303637 258423 222794 188783 202208 220993 246834 223241 200193 234815 269968 249364 238859
9641 238859 245803 236477 211401 202555 195579 185467 222045 258539 217199 210423 214301 175048 142380
$$ packed form
9730C95279J7859J0378J3464r756K0921J5877N4305l421L033m062R620K9569M0527
9717E93593K654P688L6581K6404J0548K9069N6749k366k0473k7391K5146p641
9705G30561j8571j4790M9611m3544k439K66k431M3678M87m9751k9316j3k951n8543
9691F02254j0344N2931k6682n2676j2062j349l7005j3906l2509j8325l9182n18
9679D10627l4772q011J739j971J174k2781J2371K276j7691J5039k7711k2674k4910
9666B82705k9865o390J181m6287P346J5825J42l2342K7135J1072m681M5324L2472
9653C03637m5214l5629l4011J3425J8785K5841k3593k3048L4622L5153k0604j0505
9641B38859O944r326k5076q846o976j0112L6578L6494m1340o776L878l9253l2668
$$ plain form
9628 142380 195735 276290 297681 315650 306525 261256 250877 249354 211513 169810 193041 249049
9616 249049 256893 270132 272675 255625 238894 257412 226314 279878 314293 284651 297150 298946
9604 298946 268478 263698 232339 255701 281934 300991 289539 250619 229320 248019 215104 177855
9592 177855 207451 202398 169049 179338 208006 253853 278795 293774 295278 296315 290545 264525
9580 264525 235958 222892 254714 273645 280927 287039 336597 360540 330862 322314 334618 341263
9568 341263 323863 333288 314556 310099 288755 249808 297228 346026 306182 305356 294492 292189 279159
9555 279159 275451 253509 242407 231105 238259 250844 221045 202541 222150 217592 242788 197635
9543 197635 140488 138695 188494 199310 205764 191405 170034 181258 170832 200596 167245 180871
$$ packed form
9628A42380N3355Q0555K1391J7969r125m5269j0379j523l7841m1703K3231N6008
9616B49049P844J3239K543j7050j6731J8518l1098N3564L4415k9642J2499J796
9604B98946l0468m780l1359K3362K6233J9057j1452l8920k1299J8699l2915l7249
9592A77855K9596n053l3349J0289K8668M5847K4942J4979J504J037n770k6020
9580B64525k8567j3066L1822J8931P282O112M9558K3943k9678q548J2304O645
9568C41263j7400R425j8732m457k1344l8947M7420M8798l9844q26j0864k303j3030
9555B79159l708k1942j1102j1302P154J2585k9799j8504J9609m558K5196m5153
9543A97635n7147j793M9799J0816O454j4359k1371J1224j0426K9764l3351J3626
$$ plain form
9531 180871 238415 225060 181435 179599 181666 223672 257544 285196 283146 241480 242148 268859 252368
9518 252368 287815 289342 259969 214168 250234 288597 322827 352636 353546 353366 400711 441069 438830
9505 438830 460487 529214 534340 525384 551152 545123 539810 555516 604964 629563 639228 647673 689592
9492 689592 705389 708106 688745 719025 734801 729557 700147 720481 729736 745295 752942 739286
9480 739286 732143 753933 799117 827476 835112 813457 787945 774173 750910 755564 759801 780173
9468 780173 801656 784109 777799 830493 865328 905992 907345 901379 941271 962880 968396 969039 970717
9455 970717 979440 996343 1006254 1017294 1054459 1065955 1082746 1093257 1083233 1135165 1165981 1204201
9443 1204201 1240277 1261670 1214895 1200718 1244724 1314996 1402845 1393509 1460955 1516727 1560585 1554193
$$ packed form
9531A80871N7544j3355m3625j836K067M2006L3872K7652k050m1666O68K6711j6491
9518B52368L5447J527k9373m5801L6066L8363L4230K9809R10j80M7345M0358k239
9505D38830K1657O8727N126q956K5768o029n313J5706M9448K4599R665Q445M1919
9492F89592J5797K717j9361L0280J5776n244k9410K0334R255J5559P647j3656
9480G39286p143K1790M5184K8359P636k1655k5512j3772k3263M654M237K0372
9468G80173K1483j7547o310N2694L4835M0664J353n966L9892K1609N516O43J678
9455I70717Q723J6903R911J1040L7165J1496J6791J0511j0024N1932L0816L8220
9443A204201L6076K1393m6775j4177M4006P0272Q7849r336O7446N5772M3858o392
$$ plain form
9431 1554193 1552085 1564954 1572095 1620510 1661479 1685841 1731858 1763692 1812642 1869905 1924365 1986182
9419 1986182 2076695 2147465 2224215 2307517 2361583 2404123 2530034 2681690 2808548 2905413 2978722
9408 2978722 3052300 3137936 3237724 3363737 3467629 3573190 3733070 3916614 4059088 4204986
9398 4204986 4416051 4606881 4739695 4892004 5077988 5283273 5498116 5743055 6030457 6282373
9388 6282373 6525221 6841415 7220303 7573755 7965261 8411890 8916733 9394553 9933511 10563766
9378 10563766 11231661 11938221 12693788 13573919 14508845 15514613 16646111 17893907 19286330
9369 19286330 20807504 22489262 24320025 26391857 28654873 31179750 33975956 37111090
9361 37111090 40614324 44410509 48604954 53159830 58019809 63249656 68709431 74213619
$$ packed form
9431A554193k108J2869P141M8415M0969K4362M6017L1834M8950N7263N4460O1817
9419A986182R0513P0770P6750Q3302N4066M2540J25911J51656J26858R6865P3309
9408B978722P3578Q5636R9788J26013J03892J05561J59880J83544J42474J45898
9398D204986K11065J90830J32814J52309J85984K05285K14843K44939K87402K51916
9388F282373K42848L16194L78888L53452L91506M46629N04843M77820N38958O30255
9378A0563766O67895P06560P55567Q80131R34926J005768J131498J247796J392423
9369A9286330J521174J681758J830763K071832K263016K524877K796206L135134
9361C7111090L503234L796185M194445M554876M859979N229847N459775N504188
$$ plain form
9353 74213619 79605590 84627646 89083311 92672366 95046620 96067858 95663943 93884632
9345 93884632 90853855 86827023 82114366 76960966 71667828 66415976 61318331 56441846
9337 56441846 51901729 47742246 43858646 40310326 37109757 34218822 31616886 29284197
9329 29284197 27136411 25202973 23468893 21901543 20432312 19140398 17949306 16859077
9321 16859077 15858067 14983163 14153809 13348934 12650078 11978480 11357469 10743988 10187040
9312 10187040 9707290 9197657 8728051 8322866 7913054 7597033 7252622 6915855 6578551
9303 6578551 6254871 5995442 5791903 5541814 5302843 5084385 4898727 4693106 4493412 4322053
9293 4322053 4194002 4045625 3921949 3789842 3700411 3598305 3461839 3343463 3233399 3137609
$$ packed form
9353G4213619N391971N022056M455665L589055K374254J021238m03915j779311
9345I3884632l030777m026832m712657n153400n293138n251852n097645m876485
9337E6441846m540117m159483l883600l548320l200569k890935k601936k332689
9329B9284197k147786j933438j734080j567350j469231j291914j191092j090229
9321A6859077j001010q74904q29354q04875o98856o71598o21011o13481n56948
9312A0187040m79750n09633m69606m05185m09812l16021l44411l36767l37304
9303F578551l23680k59429k03539k50089k38971k18458j85658k05621j99694j71359
9293D322053j28051j48377j23676j32107q9431j02106j36466j18376j10064r5790
$$ plain form
9283 3137609 3048899 2962991 2900858 2839717 2754742 2706374 2621715 2570433 2506191 2389286 2316070
9272 2316070 2274370 2233548 2163942 2091167 2042411 2038524 2004356 1948141 1904167 1828253 1778133 1701673
9260 1701673 1692410 1673153 1643122 1623661 1582151 1533831 1541517 1524849 1486502 1438452 1381389 1309627
9248 1309627 1318157 1294274 1260185 1203153 1183246 1185452 1176728 1160691 1174019 1148609 1120260 1122188
9236 1122188 1098871 1049015 1050244 1037787 986592 959121 939329 917053 913591 891729 839268 803324
9224 803324 779961 771191 778036 774124 742723 707111 734904 712189 676049 635280 626857 679738
9212 679738 710920 654424 644883 645164 639530 632121 600719 565694 571954 553922 529301 534093 589853
9199 589853 582156 563659 565112 527362 509648 522285 546215 543945 552103 601558 627089 623644 644671
$$ packed form
9283C137609q8710q5908o2133o1141q4975m8368q4659n1282o4242j16905p3216
9272B316070m1700m0822o9606p2775m8756l887l4168n6215m3974p5914n0120p6460
9260A701673r263j9257l0031j9461m1510m8320P686j6668l8347m8050n7063p1762
9248A309627Q530k3883l4089n7032j9907K206q724j6037J3328k5410k8349J928
9236A122188k3317m9856J229j2457n1195k7471j9792k2276l462k1862n2461l5944
9224H03324k3363q770O845l912l1401l5612K7793k2715l6140m0769q423N2881
9212F79738L1182n6496r541K81n634p409l1402l5025O260j8032k4621M792N5760
9199E89853p697j8497J453l7750j7714J2637K3930k270Q158M9455K5531l445K1027
$$ plain form
9186 644671 640520 631142 624276 594289 585796 586889 574414 603649 613561 581871 550941 589888 574655
9173 574655 571524 555610 561058 549314 516621 536104 557211 531063 532864 561024 568139 579614
9161 579614 589029 614369 621578 605380 566705 567383 543521 506933 480806 431453 445125 448208 425662
9148 425662 418453 399118 400904 396442 393069 378100 365850 326672 300378 224121 188731 159636
9136 159636 189444 230850 260673 253680 248262 244312 233780 263942 259948 253758 284284 261339 219251
9123 219251 214294 236419 239938 216882 233372 242533 229379 185636 182269 229598 218553 203544
9111 203544 212584 230830 243287 260873 262842 251960 221291 213900 208966 191157 175393 167008 160002
9098 160002 164869 193746 210575 230483 269418 275762 247699 224290 220819 228763 224360 167859 153084
$$ packed form
9186F44671m151r378o866k9987q493J093j2475K9235R912l1690l0930L8947j5233
9173E74655l131j5914N448j1744l2693J9483K1107k6148J801K8160P115J1475
9161E79614R415K5340P209j6198l8675O78k3862l6588k6127m9353J3672L083k2546
9148D25662p209j9335J786m462l373j4969j2250l9178k6294p6257l5390k9095
9136A59636K9808M1406K9823o993n418l950j0532L0162l994o190L0526k2945m2088
9123B19251m957K2125L519k3056J6490R161j3154m3743l367M7329j1045j5009
9111B03544R040J8246J2457J7586J969j0882l0669p391m934j7809j5764q385p006
9098A60002M867K8877J6829J9908L8935O344k8063k3409l471P944m403n6501j4775
$$ plain form
9085 153084 190760 205781 187117 159415 157142 198555 169776 116013 112627 157489 188020 167381
9073 167381 190674 207642 173633 177834 191455 196734 183081 163670 106883 108680 134836 161573
9061 161573 187336 231716 238371 203817 179917 163635 155371 132816 154134 154195 107557 83040 92667
9048 92667 134279 131350 152918 123482 117430 136234 129148 132426 119552 132325 115171 108714 129044
9035 129044 141564 135056 149921 131953 131192 123367 151917 127599 116669 130229 123861 127764 114597
9022 114597 79243 92111 120799 131652 127536 163287 150675 103274 82834 102986 123798 156552
9010 156552 156823 135922 70247 60319 90793 96490 92197 76261 56452 38155 39668 69230 60816
8997 60816 73053 123565 141521 128090 90871 107272 121751 138586 146443 134281 124118 115548
$$ packed form
9085A53084L7676J5021j8664k7702k273M1413k8779n3763l386M4862L0531k0639
9073A67381K3293J6968l4009M201J3621N279j3653j9411n6787J797K6156K6737
9061A61573K5763M4380O655l4554k3900j6282q264k2555K1318O1m6638k4517R627
9048I2667M1612k929K1568k9436o052J8804p086L278j2874J2773j7154o457K0330
9035A29044J2520o508J4865j7968p61p825K8550k4318j0930J3560o368L903j3167
9022A14597l5354J2868K8688J0853m116L5751j2612m7401k0440K0152K0812L2754
9010A56552K71k0901o5675r928L0474N697m293j5936j9809j8297J513K9562q414
8997F0816J2237N0512J7956j3431l7219J6401J4479J6835P857j2162j0163q570
$$ plain form
8985 115548 100349 84217 108274 92473 28206 10747 67193 68933 73298 121513 134385 143383
8973 143383 125871 90268 80199 101252 134288 141139 111459 103834 124821 143445 129748 100594
8961 100594 132920 134578 141708 139555 109383 77250 35696 58546 69218 74880 110056 153130
8949 153130 202269 230912 197294 143203 114346 114634 108467 83820 71729 80314 89635 105847 95281
8936 95281 45217 54136 79069 94539 123651 168510 149548 143599 126122 138609 107016 98290
8924 98290 45772 19844 29473 -7874 29560 74499 101091 97679 92848 70862 78662 80386 46955
8911 46955 15180 46414 43087 35906 36599 51007 75401 67464 74042 95346 84788 49763 28449
8898 28449 45173 58924 82718 56863 65314 82503 108021 129230 134564 136097 142356 106701 95848
$$ packed form
8985A15548j5199j6132K4057j5801o4267j7459N6446J740M365M8215J2872Q998
8973A43383j7512l5603j0069K1053L3036O851k9680p625K0987J8624j3697k9154
8961A00594L2326J658P130k153l0172l2133m1554K2850J0672N662L5176M3074
8949A53130M9139K8643l3618n4091k8857K88o167k4647j2091Q585R321J6212j0566
8936I5281n0064Q919K4933J5470K9112M4859j8962n949j7477J2487l1593q726
8924I8290n2518k5928R629l7347L7434M4939K6592l412m831k1986P800J724l3431
8911D6955l1775L1234l327p181O93J4408K4394p937O578K1304j0558l5025k1314
8898B8449J6724J3751K3794k5855Q451J7189K5518K1209N334J533O259l5655j0853
$$ plain form
8885 95848 97705 108149 74261 62483 50607 67783 76291 86136 96462 97636 102030 76568 16065
8872 16065 37038 75862 112826 110253 116508 111458 88184 35432 45400 62966 109033 118354 82219
8859 82219 42808 11599 -12476 10546 -33674 -22261 6538 -1602 -2344 6495 35903 49073 59803
8846 59803 41490 5980 37445 53488 86191 113697 102370 89945 101603 73382 30462 18466
8834 18466 53496 43322 77778 105596 57676 38610 74883 48325 48939 46796 38771 22568 -257
8821 -257 21367 47471 91740 92069 29598 37093 48848 49261 8890 -20635 -1927 38229 33999
8808 33999 45364 65950 49547 46581 16844 -1839 5456 18310 35303 45437 50810 79596
8796 79596 39798 -13208 -41147 -49326 -43069 -23542 -3616 30851 18415 1856 43394 34210
$$ packed form
8885I5848J857J0444l3888j1778j1876J7176Q508R845J0326J174M394k5462o0503
8872A6065K0973L8824L6964k573O255n050k3274n2752R968J7566M6067R321l6135
8859H2219l9411l1209k4075K3022m4220J1413K8799q140p42Q839K9408J3170J0730
8846E9803j8313l5510L1465J6043L2703K7506j1327j2425J1658k8221m2920j1996
8834A8466L5030j0174L4456K7818m7920j9066L6273k6558O14k143q025j6203k2825
8821b57K1624K6104M4269L29o2471P495J1755M13m0371k9525J8708M0156m230
8808C3999J1365K0586j6403k966k9737j8683P295J2854J6993J0134N373K8786
8796G9596l9798n3006k7939q179O257J9527J9926L4467j2436j6559M1538r184
$$ plain form
8784 34210 59082 63203 29570 1431 13840 36607 49634 70346 68960 14838 25214 47493
8772 47493 69835 70958 59366 37117 8258 -23913 -31127 -8517 14446 39562 42184 59300
8760 59300 58448 78735 77765 50960 15964 32217 54867 43845 15371 45882 68529 59930 99410
8747 99410 95724 72345 30391 -6186 9819 36720 40983 49182 61814 59795 44450 39277 27648
8734 27648 15010 31197 71828 75164 92558 82006 12889 -42834 -29604 24786 3603 31310
8722 31310 38596 43639 66295 83697 83341 59003 43674 55044 92532 73198 56699 42153 54760
8709 54760 56846 57777 89576 113162 122625 70899 4622 50062 78439 94261 92214 88122 85208
8696 85208 73469 56192 35219 59828 77419 59276 61318 70952 68199 62773 81929 90534 71264
$$ packed form
8784C4210K4872M121l3633k8139J2409K2767J3027K0712j386n4122J0376K2279
8772D7493K2342J123j1592k2249k8859l2171p214K2610K2963K5116K622J7116
8760E9300q52K0287r70k6805l4996J6253K2650j1022k8474L0511K2647q599L9480
8747I9410l686k3379m1954l6577J6005K6901M263Q199J2632k019j5345n173j1629
8734B7648j2638J6187M0631L336J7394j0552o9117n5723J3230N4390k1183K7707
8722C1310P286N043K2656J7402l56k4338j5329J1370L7488j9334j6499j4546J2607
8709E4760K086R31L1799K3586R463n1726o6277M5440K8377J5822k047m092k914
8696H5208j1739j7277k0973K4609J7591j8143K042R634k753n426J9156Q605j9270
$$ plain form
8683 71264 56065 7198 -2762 -14068 -12377 2557 8364 -11181 -22968 -5601 374 -2178 -12729
8670 -12729 14167 30469 18062 21447 -19338 -13281 -16248 15548 1681 9920 -1587 -35008 -25882
8657 -25882 10959 28234 2513 -22841 -2093 -13695 -10520 -17972 -31523 -14125 -13655 -38463 20347
8644 20347 68132 35303 75778 38859 19502 24626 9505 -59373 -101377 -63764 5897 49044
8632 49044 45393 42673 39570 40759 16385 31122 47565 42917 38845 34094 29273 27945 13361 3930
8618 3930 -12979 4228 34193 50863 68649 39577 15329 29761 51601 35773 39184 83504
8606 83504 83339 54134 30605 4474 -10722 65208 80734 69627 94875 81653 37348 64840
8594 64840 89180 86298 54569 60883 75448 62548 51863 81876 37189 -3726 7950 15256
$$ packed form
8683G1264j5199m8867r960j1306J691J4934N807j9545j1787J7367N975k552j0551
8670a2729K6896J6302j2407L385m0785O057k967L1796j3867Q239j1507l3421R126
8657b5882L6841J7275k5721k5354K0748j1602L175p452j3551J7398M70k4808N8810
8644B0347M7785l2829M0475l6919j9357N124j5121o8878m2004L7613O9661M3147
8632D9044l651k720l103J189k4374J4737J6443m648m072m751m821j328j4584r431
8618C930j6909J7207K9965J6670J7786k9072k4248J4432K1840j5828L411M4320
8606H3504j65k9205k3529k6131j5196P5930J5526j1107K5248j3222m4305K7492
8594F4840K4340k882l1729O314J4565j2900j0685L0013m4687m0915J1676P306
$$ plain form
8582 15256 11857 34897 26439 30118 39168 56938 83900 24389 -17667 5485 24215 34856 43269
8569 43269 35197 26282 48517 46856 83529 122147 112965 94357 76651 81217 83711 85900 95752
8556 95752 91028 37063 18580 12917 -4770 29846 59158 37312 -11618 3901 43046 68804
8544 68804 59886 61528 54718 56276 21672 -12034 -20175 -52382 -53895 -22360 6711 41452 65504
8531 65504 50833 11395 -4002 -11301 22174 35822 10396 24757 79678 92355 124621 113243
8519 113243 82734 52790 38070 21690 -18436 23072 39402 31899 -3091 -14324 2127 40643
8507 40643 24159 -12413 -937 -1937 8333 6922 -7268 44248 42618 39809 10412 10832 10095
8494 10095 31014 51226 23892 -18026 -33660 -34213 -35160 -25230 31714 59367 30885 -4049 -51054
$$ packed form
8582A5256l399K3040q458L679R050J7770K6962n9511m2056K3152J8730J0641Q413
8569D3269q072q915K2235j661L6673L8618r182j8608j7706M566K494K189R852
8556I5752m724n3965j8483n663j7687L4616K9312k1846m8930J5519L9145K5758
8544F8804q918J642o810J558l4604l3706q141l2207j513L1535K9071L4741K4052
8531F5504j4671l9438j5397p299L3475J3648k5426J4361N4921J2677L2266j1378
8519A13243l0509k9944j4720j6380m0126M1508J6330p503l4990j1233J6451L8516
8507D0643j6484l6572J1476j000J0270j411j4190N1516j630k809k9397M20p37
8494A0095K0919K0212k7334m1918j5634n53r47R930N6944K7653k8482l4934m7005
$$ plain form
8481 -51054 -47240 -34771 -30189 -13235 -29263 -60486 -62887 -27474 -26182 -28780 -8703 40033 58262
8468 58262 78882 75451 62492 15174 -21317 -38524 -3746 -9721 -8264 -9396 7639 -3170 -6425
8455 -6425 29643 -25191 -59464 -62859 -58579 21400 52435 24750 2696 -7439 -3332 17717 7840
8442 7840 -21032 -27592 -28936 -10578 -2020 1703 24574 16772 25707 64263 86213 59935 74592
8429 74592 72737 46955 39713 63856 61596 63987 66995 29949 28918 57050 54120 12837 9753
8416 9753 2974 -17828 -61358 -47429 -23421 21150 88221 76072 25131 11603 -2155 3541
8404 3541 31071 10794 25428 41796 41647 46499 17073 15691 26892 31286 34965 -12898 -41920
8391 -41920 -21969 49786 38718 -3567 5061 -2910 -29565 -39977 -37214 -26215 -55340 -51055 -55114
$$ packed form
8481e1054L814J2469M582J6954j6028l1223k401L5413J292k598K0077M8736J8229
8468E8262K0620l431j2959m7318l6491j7207L4778n975J457j132J7035j0809l255
8455f425L6068n4834l4273l395M280P9979L1035k7685k2054j0135M107K1049r877
8442G840k8872o560j344J8358Q558L723K2871p802Q935L8556K1950k6278J4657
8429G4592j855k5782p242K4143k260K391L008l7046j031K8132k930m1283l084
8416I753o779k0802m3530J3929K4008M4571O7071j2149n0941j3528j3758N696
8404C541K7530k0277J4634J6368j49M852k9426j382J1201M394L679m7863k9022
8391d1920J9951P1755j1068m2285Q628p971k6655j0412K763J0999k9125M285m059
$$ plain form
8378 -55114 -47466 -15552 7743 24532 41041 52218 24265 7280 10672 29645 15757 -13013
8366 -13013 -35192 -7155 8002 49479 47816 19245 51893 65036 27438 33897 36027 35917 38386
8353 38386 4108 -16025 -53963 -74975 -37903 -32600 -39283 -6242 -17964 -17 6763 -8257
8341 -8257 -17470 18984 44202 16581 -36806 -38067 -8506 -3532 32079 46845 11418 26398 63384
8328 63384 24941 -42745 -54153 -11262 3027 -7761 64635 59069 3216 5043 15404 63608
8316 63608 61569 42592 14790 17920 56074 80086 70563 6293 -3681 -7700 -5608 42222 46942
8303 46942 39736 25231 34687 31126 39758 41203 6513 -48502 -80021 -30271 17144 -14918 -18463
8290 -18463 14457 13453 -6048 41592 73316 57959 26229 6762 -1308 -29791 -60503 -43306
$$ packed form
8378e5114P648L1914K3295J6789J6509J1177k7953j6985L392J8973j3888k8770
8366a3013k2179K8037J5157M1477j663k8571L2648J3143l7598O459K130j10K469
8353C8386l4278k0133l7938k1012L7072N303o683L3041j1722J7947O780j5020
8341h257r213L6454K5218k7621n3387j261K9561M974L5611J4766l5427J4980L6986
8328F3384l8443o7686j1408M2891J4289j0788P2396n566n5853J827J0361M8204
8316F3608k039j8977k7802L130L8154K4012r523o4270r974m019K092M7830M720
8303D6942p206j4505R456l561Q632J445l4690n5015l1519M9750M7415l2062l545
8290a8463L2920j004j9501M7640L1724j5357l1730j9467q070k8483l0712J7197
$$ plain form
8278 -43306 3652 30133 36013 46589 36966 -45942 -82817 -49434 -25460 -7489 19105 29007
8266 29007 58029 41300 2158 -2214 -44944 -61428 -59243 -28165 122 25595 -1121 -38640
8254 -38640 13516 38954 15696 3793 10330 10840 31975 34218 27002 12638 181 -25439 -33268
8241 -33268 -12901 1373 -14763 -678 45097 60339 -4338 120 40699 60886 9806 -44600
8229 -44600 -56583 -15006 -21163 -9234 8221 30094 36057 31353 79124 45768 -4390 -2278 11851
8216 11851 -9554 6345 13250 -442 -26276 -15597 8222 19160 6090 6610 31112 50537
8204 50537 52335 26656 29951 50809 39617 48192 63085 73013 30669 25357 27416 5062 8672
8191 8672 18846 32970 35732 17836 -13437 -18913 -3743 -32249 -51338 18857 66591 66763 46162
$$ packed form
8278d3306M6958K6481N880J0576r623q2908l6875L3383K3974J7971K6594R902
8266B9007K9022j6729l9142m372m2730j6484K185L1078K8287K5473k6716l7519
8254c8640N2156K5438k3258j1903O537N10K1135K243p216j4364j2457k5620p829
8241c3268K0367J4274j6136J4085M5775J5242o4677M458M0579K0187n1080n4406
8229d4600j1983M1577o157J1929J7455K1873N963m704M7771l3356n0158K112J4129
8216A1851k1405J5899O905j3692k5834J0679K3819J0938j3070N20K4502J9425
8204E0537J798k5679L295K0858j1192Q575J4893R928m2344n312K059k2354L610
8191H672J0174J4124K762j7896l1273n476J5170k8506j9089P0195M7734J72k0601
$$ plain form
8178 46162 53604 25803 28418 55708 61435 19852 -20702 -3367 6418 7264 -26919 -7795 26511
8165 26511 16260 29101 54383 42084 17965 -30413 -20241 -26270 -8235 6075 25854 42812
8153 42812 13620 15765 3140 -28997 -17340 22810 9260 -1198 -10795 -28417 -45390 -34265
8141 -34265 -31283 -12585 -2828 24271 40131 62811 32888 49017 70726 88825 91594 59431
8129 59431 56118 55794 825 -27109 -17971 -2188 -1502 -2096 5481 -25491 -61479 -48632 -21360 -15853
8115 -15853 4758 32976 26097 66116 57792 32361 51324 15836 -39526 -31016 7276 16961 -3592
8102 -3592 20440 38773 27504 -13585 -52017 -40224 -1458 2234 -7536 -19102 -44186 -79895
8090 -79895 -136279 -123990 -66953 -47009 -45027 -21077 9183 49105 11476 -76040 -80620 -58440
$$ packed form
8178D6162P442k7801K615K7290N727m1583m0554J7335R785Q46l4183J9124L4306
8165B6511j0251J2841K5282j2299k4119m8378J0172o029J8035J4310J9779J6958
8153D2812k9192K145j2625l2137J1657M0150j3550j0458r597j7622j6973J1125
8141c4265K982J8698R757K7099J5860K2680k9923J6129K1709J8099K769l2163
8129E9431l313l24n4969k7934R138J5783O86n94P577l0972l5988J2847K7272N507
8115a5853K0611K8218o879M0019q324k5431J8963l5488n5362Q510L8292R685k0553
8102c592K4032J8333j1269m1089l8432J1793L8766L692r770j1566k5084l5709
8090g9895n6384J2289N7037J9944J982K3950L0260L9922l7629q7516m580K2180
$$ plain form
8078 -58440 -38365 -3341 29367 32642 40603 1431 24036 40179 39239 25076 42956 24526 -26103
8065 -26103 -53276 -68536 -63014 -26147 -42552 -5930 55886 120622 94083 32141 6872 -12507
8053 -12507 -19301 -26075 -7133 17561 2994 26945 52737 -5620 -83313 -110903 -55903 -2547
8041 -2547 -2733 -8034 -19168 -24805 -64813 -30593 5363 32004 27661 1082 -48642 -38288 1809
8028 1809 19357 6029 23258 17415 23377 34915 31047 29187 28662 68573 105512 108381 91534
8015 91534 67373 -3285 -19494 14415 32445 -526 38367 60167 21339 23487 2752 -18997
8003 -18997 -20993 -7059 -26651 -23622 -11300 -3958 26198 29144 15745 25855 46299 58492 35700
7990 35700 5934 43289 58228 64776 52871 24882 -13694 -56578 -52830 -28675 -30520 -5716
$$ packed form
8078e8440K0075L5024L2708L275P961l9172K2605J6143r40j4163J7880j8430n0629
8065b6103k7173j5260N522L6867j6405L6622O1816O4736k6539o1942k5269j9379
8053a2507o794o774J8942K4694j4567K3951K5792n8357p7693k7590N5000N3356
8041b547j86n301j1134n637m0008L4220L5956K6641m343k6579m9724J0354M0097
8028A809J7548j3328J7229n843N962J1538l868j860n25L9911L6939K869j6847
8015I1534k4161p0658j6209L3909J8030l2971L8893K1800l8828K148k0735k1749
8003a8997j996J3934j9592L029J2322P342L0156K946j3399J0110K0444J2193k2792
7990C5700k9766L7355J4939O548j1905k7989l8576m2884L748K4155j845K4804
$$ plain form
7978 -5716 -21276 19836 24045 33978 36471 3463 -12367 7789 10056 4113 41521 74899 49267
7965 49267 18604 16392 42274 43214 41569 16444 -28420 -67294 -51497 -40258 -53685 -46425 -40289
7952 -40289 -34808 -36053 -46161 -57142 -4276 43211 66724 91626 32362 -30986 -44119 -32479
7940 -32479 -48431 -48243 -49404 -27132 -26604 -31621 -29744 -13135 14122 37223 78466 96866 103749
7927 103749 71575 33181 53842 64890 54789 59891 140339 121588 30003 23991 50474 35684
7915 35684 -10670 12124 30025 29971 13212 -10638 -38002 -2832 -1084 17123 59238 52573 38411
7902 38411 42516 66317 86555 73253 34667 1746 -58006 -49364 -4614 25330 17260 -9974
7890 -9974 -30469 -12248 26419 36677 27419 1957 5646 25374 58375 1327 -63390 -42030
$$ packed form
7978e716j5560M1112M209R933K493l3008j5830K0156K267n943L7408L3378k5632
7965D9267l0663k212K5882R40j645k5125m4864l8874J5797J1239j3427P260O136
7952d0289N481j245j0108j0981N2866M7487K3513K4902n9264o3348j3133J1640
7940c2479j5952J88j161K2272N28n017J877J6609K7257K3101M1243J8400O883
7927A03749l2174l8394K0661J1048j0101N102Q0448j8751r1585o012K6483j4790
7915C5684m6354K2794J7901n4j6759k3850k7364L5170J748J8207M2115o665j4162
7902C8411M105K3801K0238j3302l8586l2921n9752Q642M4750K9944q070k7234
7890i974k0495J8221L8667J0258r258k5462L689J9728L3001n7048o4717K1360
$$ plain form
7878 -42030 -16776 -2854 -7565 24539 2934 -18728 -40616 -41052 -50256 -41751 -95575 -78775 8198
7865 8198 47464 47843 39643 -15108 -52313 -23101 -3114 -12122 21715 2663 5658 -9396 -45219
7852 -45219 -39259 -11664 62497 64182 66657 75471 73796 33309 9067 23653 23137 55063 42554
7839 42554 -2933 -7792 10857 9457 -5735 25095 28851 -7595 -6368 -7846 -32023 -20597 17465
7826 17465 8113 -16922 -35760 -53373 -52325 -76823 -59052 -48663 -26421 7279 -28877 -42098
7814 -42098 -20227 7597 34919 47899 35608 26675 30151 29774 18732 3108 6583 -5901 12509
7801 12509 38188 53685 67057 22406 7644 50949 84541 65832 27603 29840 -8197 -25242
7789 -25242 -8949 7707 -15346 -2006 -18635 -68271 -67144 214 7555 -1239 -4567 -19098 -4602
$$ packed form
7878d2030K5254J3922m711L2104k1605k1662k1888m36r204Q505n3824J6800Q6973
7865H198L9266L79q200n4751l7205K9212J9987r008L3837j9052K995j5054l5823
7852d5219N960K7595P4161J685K475Q814j675m0487k4242J4586n16L1926j2509
7839D2554m5487m859J8649j400j5192L0830L756l6446J227j478k4177J1426L8062
7826A7465r352k5035j8838j7613J048k4498J7771J0389K2242L3700l6156j3221
7814d2098K1871K7824K7322J2980j2291q933L476l77j1042j5624L475j2484J8410
7801A2509K5679J5497J3372m4651j4762M3305L3592j8709l8229K237l8037j7045
7789b5242J6293J6656k3053J3340j6629m9636J127O7358P341q794l328j4531J4496
$$ plain form
7776 -4602 16608 22102 11646 1820 584 -38139 25783 45545 -13531 -19240 2077 32937 36254
7763 36254 26189 16796 -13018 -16444 15695 15073 47683 66101 37284 -4617 7509 32272 23217
7750 23217 39970 36346 17631 4019 3405 -8209 -11953 -3424 30704 62808 35307 12175 31
7737 31 -4738 21834 22316 21336 8691 8903 55549 63785 50682 61251 47931 39005 25895 12708
7723 12708 -25614 -47989 -58131 -33618 -13926 -14995 -54365 -87068 -78080 -63222 -56692 -62314 -35637
7710 -35637 10978 58213 25709 -16347 -12436 -8160 -895 -5770 -26077 -41549 -58408 -82885 -71318
7697 -71318 -32248 -34540 -26969 -13219 -19830 7930 5376 55 -161 -5537 -430 29749 40779 29215
7683 29215 -1430 -29075 -19486 -11590 22392 44807 16490 517 15351 25635 18484 -2535
$$ packed form
7776d602K1210N494j0456r826j236l8723O3922J9762n9076n709K1317L0860L317
7763C6254j0065r393k9814l426L2139o22L2610J8418k8817m1901J2126K4763r055
7750B3217J6753l624j8715j3612o14j1614l744Q529L4128L2104k7501k3132j2144
7737C1m769K6572M82r80j2645K12M6646Q236j3103J0569j3320q926j3110j3187
7723A2708l8322k2375j0142K4513J9692j069l9370l2703Q988J4858O530n622K6677
7710c5637M6615M7235l2504m2056L911M276P265m875k0307j5472j6859k4477J1567
7697g1318L9070k292P571J3750o611K7760k554n321k16n376N107L0179J1030j1564
7683B9215l0645k7645R589P896L3982K2415k8317j5973J4834J0284p151k1019
$$ plain form
7671 -2535 23002 23119 5494 -9442 -42901 -29978 -12137 3551 -3935 35991 29166 -7319 -59201
7658 -59201 -81149 -57208 -21568 318 19784 14957 2627 14214 11082 35858 3035 32945
7646 32945 31494 34614 42582 65069 68941 6633 17107 33210 25652 51083 22314 -16095 -12383
7633 -12383 -3440 -19265 -4636 -4104 -4288 -43102 -55080 -53902 -23815 4380 49568 50395 23593
7620 23593 14319 8438 2864 -9978 -2231 -11668 22044 40193 17081 -6954 -2930 15782 32063
7607 32063 21141 -4689 911 -20391 -45873 -35941 658 24044 26385 93 23805 34850
7595 34850 43629 16552 -15115 -24321 13491 21860 8606 26172 29651 936 -38009 -47526 -70045
7582 -70045 -50851 4867 -9371 -20534 -43648 -64788 -56205 -53496 -55691 -12179 -41705 -86019
$$ packed form
7671b535K5537J17j7625j4936l3459J2923J7841J5688p486L9926o825l6485n1882
7658e9201k1948K3941L5640K1886J9466m827j2330J1587l132K4776l2823K9910
7646C2945j451L120P968K2487L872o2308J0474J6103p558K5431k8769l8409L712
7633a2383Q943j5825J4629N32j84l8814j1978J178L0087K8195M5188Q27k6802
7620B3593r274n881n574j2842P747r437L3712J8149k3112k4035M024J8712J6281
7607C2063j0922k5830N600k1302k5482R932L6599K3386K341k6292K3712J1045
7595C4850Q779k7077l1667r206L7812Q369j3254J7566L479k8715l8945r517k2519
7582g0045J9194N5718j4238j1163k3114k1140Q583K709k195M3512k9526m4314
$$ plain form
7570 -86019 -84274 -58059 -18611 -4641 -63 2242 8295 22043 29029 18788 -16519 -30810 -43747
7557 -43747 -41885 -30537 -17591 13847 53779 29861 29478 44486 15441 -25323 -21406 31896 30912
7544 30912 12398 -5648 -29019 -24186 -39857 57 -59 -16086 -1548 -9502 -36915 -37606 -13564
7531 -13564 20400 29170 52475 75117 57407 57372 90985 105730 61138 -6828 -492 17122 32287
7518 32287 49040 24762 57889 89021 103835 117335 68774 77317 83802 33944 27728 5897
7506 5897 5077 11732 -1451 37407 374 -27549 15525 66667 33512 -12762 -23780 -5301 -27271
7493 -27271 -55852 -52364 -33317 -10251 7532 16590 13403 12987 21370 17766 506 -10852 7724
7480 7724 25644 113 -6942 -21860 354 18612 26397 25235 -1786 -2863 -26137 -20449 -44485
$$ packed form
7570h6019J745K6215L9448J3970M578K305O053J3748O986j0241l5307j4291j2937
7557d3747J862J1348J2946L1438L9932k3918l83J5008k9045m0764L917N3302r84
7544C0912j8514j8046k3371M833j5671L9914j16j6027J4538p954k7413o91K4042
7531a3564L3964Q770K3305K2642j7710l5L3613J4745m4592o7966O336J7614J5165
7518C2287J6753k4278L3127L1132J4814J3500m8561Q543O485m9858o216k1831
7506E897q20O655j3183L8858l7033k7923M3074N1142l3155m6274j1018J8479k1970
7493b7271k8581L488J9047K3066J7783R058l187m16Q383l604j7260j1358J8576
7480G724J7920k5531p055j4918K2214J8258P785j162k7021j077k3274N688k4036
$$ plain form
7467 -44485 -33871 -26798 -735 3084 27608 26478 14991 -33843 -83096 -66640 -15642 11326
7455 11326 817 18937 45326 67641 43594 10356 -6325 -35612 -45869 -48387 -23998 -773
7443 -773 16317 46822 95179 87185 61864 12376 -9918 294 -34496 -56110 -28189 14423
7431 14423 -1712 19266 20559 -19603 -49508 -38105 -23823 -39613 -51979 -32304 -44161 -79285
7419 -79285 -79741 -56866 -56938 -78325 -84385 -57410 -68867 -87540 -72719 -35109 -24690 -3973 24795
7406 24795 4817 13884 55399 51462 31380 41245 14131 -13273 -18063 -10020 1982 24439 -10866
7393 -10866 -5831 29777 29359 3455 -19897 -35267 -74315 -44218 14849 16162 -31081 -35854 -4442
7380 -4442 46315 42376 30157 56231 40088 59415 46640 57495 45058 12112 10932 24744
$$ packed form
7467d4485J0614P073K6063L819K4524j130j1487m8834m9253J6456N0998K6968
7455A1326j0509J8120K6389K2315k4047l3238j6681k9287j0257k518K4389K3225
7443g73J7090L0505M8357p994k5321m9488k2294J0212l4790k1614K7921M2612
7431A4423j6135K0978J293m0162k9905J1403J4282j5790j2366J9675j1857l5124
7419g9285m56K2875p2k1387o060K6975j1457j8673J4821L7610J0419K0717K8768
7406B4795j9978R067M1515l937k0082R865k7114k7404m790Q043J2002K2457l5305
7393a0866N035L5608m18k5904k3352j5370l9048L0097N9067J313m7243m773L1412
7380d442N0757l939j2219K6074j6143J9327j2775J0855j2437l2946j180J3812
$$ plain form
7368 24744 16864 11401 -10583 3899 33306 38947 14588 19159 28726 35498 45585 81496 71434
7355 71434 526 -33427 -39623 -34352 -26194 -33755 -15305 13067 1775 12228 33057 67716 67447
7342 67447 49447 -5084 -34076 -17271 -6378 -564 6008 -3812 -30401 -41509 -47499 -51949 -11129
7329 -11129 59097 46540 18238 -16195 -31447 -34505 -55102 -57198 -19844 -4862 5643 -33905
7317 -33905 -15027 39369 25983 34548 52454 42534 1639 2447 32121 5105 228 -22848 -47669
7304 -47669 -43428 -26575 -39673 -44551 -22825 -4504 19457 25632 23978 21741 21728 7579 -14662
7291 -14662 -16180 -21293 -41026 -23607 6077 10456 9466 -12144 -50244 -45889 -28505 -20215 -48087
7278 -48087 -27180 -21087 -9690 -46097 -57947 -41814 -56190 -88411 -99450 -74118 -48800 -13314
$$ packed form
7368B4744p880n463k1984J4482K9407N641k4359M571R567O772J0087L5911j0062
7355G1434p0908l3953o196N271Q158p561J8450K8372j1292J0453K0829L4659k69
7342F7447j8000n4531k8992J6805J0893N814O572r820k6589j1108n990m450M0820
7329a1129P0226j2557k8302l4433j5252l058k0597k096L7354J4982J0505l9548
7317c3905J8878N4396j3386Q565J7906r920m0895Q08K9674k7016m877k3076k4821
7304d7669M241J6853j3098m878K1726J8321K3961O175j654k237j3j4149k2241
7291a4662j518n113j9733J7419K9684M379r90k1610l8100M355J7384Q290k7872
7278d8087K0907O093J1397l6407j1850J6133j4376l2221j1039K5332K5318L5486
$$ plain form
7266 -13314 -23477 -4170 11114 9916 11239 -26032 -40899 -10719 8569 -119 -17952 -8577 -23346
7253 -23346 -26772 -43368 -55509 -49819 -44645 -25198 -36034 -31142 5364 11045 -18369 -34150 -48834
7240 -48834 -56095 -37458 -18381 12340 11486 -31334 -8293 46956 6828 -2193 6361 -9242 -59704
7227 -59704 -69268 -67523 -48670 -32719 -34885 -12278 -3657 12048 -8962 1449 31267 47808 30800
7214 30800 -3518 -30375 -34989 16587 76200 78409 73129 52919 29216 -22219 -10493 24833
7202 24833 27062 34659 21283 21943 53492 7728 -31414 -28967 15828 52639 42780 25062 -3566
7189 -3566 3161 6263 -7422 -12611 21316 38229 27781 19809 -8705 -3933 11485 -5829 -7816
7176 -7816 39266 17873 4584 -18320 17728 16734 -6588 12716 56697 20521 13671 22517 18263
$$ packed form
7266a3314j0163J9307J5284j198J323l7271j4867L0180J9288q688j7833R375j4769
7253b3346l426j6596j2141N690N174J9447j0836M892L6506N681k9414j5781j4684
7240d8834p261J8637J9077L0721q54m2820K3041N5249m0128r021Q554j5603n0462
7227e9704r564J745J8853J5951k166K2607Q621J5705k1010J0411K9818J6541j7008
7214C0800l4318k6857m614N1576N9613K209n280k0210k3703n1435J1726L5326
7202B4833K229P597j3376O60L1549m5764l9142K447M4795L6811r859j7718k8628
7189c566O727L102j3685n189L3927J6913j0448p972k8514M772J5418j7314j987
7176g816M7082k1393j3289k2904L6048r94k3322J9304M3981l6176o850Q846m254
$$ plain form
7163 18263 11360 -10932 -10729 -3643 35777 41003 27359 -8575 27027 20589 32620 47118 8161
7150 8161 20839 -9916 -56808 -61383 -60873 -48992 -48106 -2053 50253 28478 14264 9204 20166
7137 20166 -8881 -36269 -35580 -22691 -18730 -21694 5142 20474 60044 34078 46244 44695 52236
7124 52236 29484 -7546 -12676 -30619 -28778 6129 7237 24903 54352 47403 43424 14738 49961
7111 49961 35436 19706 -3466 17154 20051 7478 15044 28042 47950 -13687 -16641 8154
7099 8154 17365 957 -23877 -21241 8665 18542 19940 12233 -8481 -6750 -20862 -29627 -19909 -41896
7085 -41896 -68153 -55560 -18849 5428 -28118 -46397 -23334 -18665 -1675 23002 42460 25253
7073 25253 5275 -13534 -36072 -38871 -61941 -95547 -44268 -41603 -56733 -90529 -65097 -8749
$$ packed form
7163A8263o903k2292K03P086L9420N226j3644l5934L5602o438J2031J4498l8957
7150H161J2678l0755m6892m575N10J1881Q86M6053N2306k1775j4214n060J0962
7137B0166k9047k7388O89J2889L961k964K6836J5332L9570k5966J2166j549P541
7124E2236k2752l7030n130j7943J841L4907J108J7666K9449o949l979k8686L5223
7111D9961j4525j5730k3172K0620K897j2573P566J2998J9908o1637k954K4795
7099H154R211j6408k4834K636K9906R877J398p707k0714J731j4112q765R718k1987
7085d1896k6257J2593L6711K4277l3546j8279K3063M669J6990K4677J9458j7207
7073B5253j9978j8809k2538k799k3070l3606N1279K665j5130l3796K5432N6348
$$ plain form
7061 -8749 18359 28731 4368 46360 56364 37485 -2499 -61888 -129358 -126278 -70731 -5434
7049 -5434 68185 94191 109692 58984 31370 26167 17705 12334 9024 4092 14916 33453 12305
7036 12305 -10755 10206 -16818 -60177 -38813 -42285 -57638 -42101 -28404 -13152 -6611 -9704
7024 -9704 -6982 6931 17767 16970 26990 -7225 -22628 15977 36745 22308 4222 -13536 -5387
7011 -5387 5714 14959 39472 36993 63580 56944 4045 -45444 -27212 -24979 -19037 -1418 14082
6998 14082 -6585 9606 12455 17038 25410 37591 52128 33798 32502 26740 13021 19883 27787
6985 27787 729 -71023 -50011 -23385 -4116 21884 25323 23753 28752 38621 40830 26916 14837
6972 14837 28450 25747 3397 -23875 -23675 -9163 36747 10010 -5698 -20959 -29549 -25761 -17454
$$ packed form
7061h749K7108J0372k4363M1992J0004j8879l9984n9389o7470L080N5547O5297
7049e434P3619K6006J5501n0708k7614n203q462n371l310m932J0824J8537k1148
7036A2305k3060K0961k7024m3359K1364l472j5353J5537J3697J5252O541l093
7024i704K722J3913J0836p97J0020l4215j5403L8605K0768j4437j8086j7758Q149
7011e387J1101R245K4513k479K6587o636n2899m9489J8232K233N942J7619J5500
6998A4082k0667J6191K849M583Q372J2181J4537j8330j296n762j3719O862P904
6985B7787k7058p1752K1012K6626J9269K6000L439j570M999R869K209j3914j2079
6972A4837J3613k703k2350k7272K00J4512M5910k6737j5708j5261q590L788Q307
$$ plain form
6959 -17454 414 3828 20891 32283 -7354 -18397 -38130 -17350 -16857 -15795 -8971 -5665 14970
6946 14970 55331 82518 35641 -17552 -45720 -41427 -3898 43176 40168 62205 53024 -23028
6934 -23028 -49466 -8265 4795 -11035 -20481 -51195 -49062 -28412 -22854 8018 25208 -14661
6922 -14661 -48438 -16742 5687 17360 11584 18154 -8151 -62398 -77151 -56179 -68285 -82228
6910 -82228 -101269 -97028 -65807 -54372 -80161 -84333 -81186 -35708 -695 -9282 -28866 -45266 2900
6897 2900 33604 8807 -12603 -22171 -20535 -3576 14995 -5394 2426 15999 9156 -25736 -37651
6884 -37651 -13999 -19412 -23961 -11903 27474 26138 17616 29886 53769 53278 70236 33330 -2458
6871 -2458 -13189 -19253 -1745 38431 23826 -1725 26406 3900 13275 7459 -28976 -64982 -82825
$$ packed form
6959a7454J7868L414J7063J1392l9637j1043j9733K0780M93J062O824L306K0635
6946A4970M0361K7187m6877n3193k8168M293L7529M7074l008K2037r181p6052
6934b3028k6438M1201J3060j5830r446l0714K133K0650N558L0872J7190l9869
6922a4661l3777L1696K2429J1673n776O570k6305n4247j4753K0972j2106j3943
6910h2228j9041M241L1221J1435k5789m172L147M5478L5013q587j9584j6400M8166
6897B900L0704k4797k1410r568J636J6959J8571k0389P820J3573o843l4892j1915
6884c7651K3652n413m549J2058L9377j336q522J2270K3883m91J6958l6906l5788
6871b458j0731o064J7508M0176j4605k5551K8131k2506R375n816l6435l6006j7843
$$ plain form
6858 -82825 -58017 -54658 -30417 -35118 -57658 -69339 -18690 10427 -46791 -73245 -79559 -40844
6846 -40844 -21259 -34176 -55742 -55545 -90712 -69288 -28155 -1463 -12052 -39028 -32521 -27147 -16994
6833 -16994 12469 11210 21374 17513 -30308 -65721 -46999 -13015 -18349 -14564 -44149 25333 51664
6820 51664 24950 -24181 -67894 -51864 -17668 467 9296 21395 27194 -3298 -7996 -10980 23403
6807 23403 8085 -7426 17572 27969 52472 36606 44438 46101 11297 8056 -16196 9421
6795 9421 54079 25631 -14705 -25685 -3003 37927 28779 45907 42658 31129 48579 41930 49264
$$ packed form
6858h2825K4808L359K4241m701k2540j1681N0649K9117n7218k6454o314L8715
6846d0844J9585j2917k1566J97l5167K1424M1133K6692j0589k6976O507N374J0153
6833a6994K9463j259J0164l861m7821l5413J8722L3984n334L785k9585O9482K6331
6820E1664k6714m9131m3713J6030L4196J8135Q829J2099N799l0492m698k984L4383
6807B3403j5318j5511K4998J0397K4503j5866P832J663l4804l241k4252K5617
6795I421M4658k8448m0336j0980K2682M0930r148J7128l249j1529J7450o649P334
$$ [...]
##END NTUPLES=NMR SPECTRUM
##END=
