##TITLE=Analysis number 321596
Compound Code cc 47701
Book Reference 494/42
Project Code adrs
Chemist Name craigr
##JCAMPDX= 6.0         $$ Bruker NMR JCAMP-DX V2.0
##DATA TYPE= NMR SPECTRUM
##DATA CLASS= NTUPLES
##ORIGIN= Bruker BioSpin GmbH
##OWNER= nmr
$$ XWIN-NMR		Version 3.5
$$ Thu Aug 17 12:32:38 2006 GMT Daylight Time (UT+1h)  MAYBRIDGE\nmr@NMR_250MHZ
##.OBSERVE FREQUENCY= 250.131544655141
##.OBSERVE NUCLEUS= ^1H
##.ACQUISITION MODE= SIMULTANEOUS (DQD)
##.ACQUISITION SCHEME= undefined
##.AVERAGES= 16
##.DIGITISER RES= 18
##SPECTROMETER/DATA SYSTEM= dpx250
##.PULSE SEQUENCE= zg30
##.SOLVENT NAME= DMSO
##.SHIFT REFERENCE= (INTERNAL, DMSO, 0, 16.522)
##AUDIT TRAIL= $$ (NUMBER, WHEN, WHO, WHERE, WHAT)
$$ ##TITLE= Audit trail, XWIN-NMR		Version 3.5
$$ ##JCAMPDX= 5.01
$$ ##ORIGIN= Bruker BioSpin GmbH
$$ ##OWNER= nmr
$$ C:\u/data/dgb/nmr/ADRS/1130/pdata/1/auditp.txt
$$ ##AUDIT TRAIL=  $$ (NUMBER, WHEN, WHO, WHERE, WHAT)
(   1,<2006-08-17 12:32:15.63 +100>,<MAYBRIDGE\nmr>,<NMR_250MHZ>,
      <created by zg, POWCHK disabled, PULCHK disabled
       configuration hash MD5:
       E2 DF 36 D8 04 B2 41 60 5A D7 A3 38 5A 4B D0 FE
       data hash MD5: 64K
       33 D2 79 57 73 E1 11 74 38 1A 3A 9D 9D 4A 33 59>)
(   2,<2006-08-17 12:32:28.66 +100>,<MAYBRIDGE\nmr>,<NMR_250MHZ>,
      <Start of raw data processing
       ef LB = 0.3 FT_mod = 6 PKNL = 1 SI = 32K 
       data hash MD5: 32K
       F2 32 6D 4F BB 4F F8 39 B9 F2 F1 54 82 0A 0F 9F>)
(   3,<2006-08-17 12:32:30.38 +100>,<MAYBRIDGE\nmr>,<NMR_250MHZ>,
      <apk 
       data hash MD5: 32K
       BD 6A 2A 4C A6 CC 53 0F DD E7 EE 37 32 1C 87 3A>)
(   4,<2006-08-17 12:32:31.13 +100>,<MAYBRIDGE\nmr>,<NMR_250MHZ>,
      <abs ABSG = 5 
       data hash MD5: 32K
       EB 97 27 00 54 10 C3 57 7A 18 FA 9B 2D 7E 86 EB>)
$$ ##END=
$$ 
$$ hash MD5
$$ 92 B5 51 F0 8B A3 85 24 DB F2 73 7B C1 2C 1B 80
##$RELAX= 
##$RELAX= 
##$RELAX= 
##$RELAX= 
##$RELAX= 
##$RELAX= 
##$RELAX= 
$$ Bruker specific parameters
$$ --------------------------
##$DU= <C:\u>
##$EXPNO= 1130
##$NAME= <ADRS>
##$PROCNO= 1
##$TYPE= <nmr>
##$USER= <dgb>
##$AMP= (0..31)
100 100 100 100 100 100 100 100 100 100 100 100 100 100 100 100 100 100 
100 100 100 100 100 100 100 100 100 100 100 100 100 100 
##$AQSEQ= 0
##$AQ_mod= 3
##$AUNM= <au_zg>
##$AUTOPOS= <29 >
##$BF1= 250.13
##$BF2= 250.13
##$BF3= 250.13
##$BF4= 250.13
##$BF5= 500.13
##$BF6= 500.13
##$BF7= 500.13
##$BF8= 500.13
##$BYTORDA= 1
##$CFDGTYP= 0
##$CFRGTYP= 5
##$CHEMSTR= <none>
##$CNST= (0..31)
1 1 145 1 1 1 1 1 1 1 1 1 1 1 1 1 1 1 1 1 1 1 1 1 1 1 1 1 1 1 1 1 
##$CPDPRG= <>
##$CPDPRG1= <>
##$CPDPRG2= <>
##$CPDPRG3= <>
##$CPDPRG4= <mlev>
##$CPDPRG5= <mlev>
##$CPDPRG6= <mlev>
##$CPDPRG7= <mlev>
##$CPDPRG8= <mlev>
##$CPDPRGB= <>
##$CPDPRGT= <>
##$D= (0..31)
0 1 0 0 0 0 0 0 0 0.06 0 0 0 0 0 0 0.0002 0 0 0 0 0 0 0 0 0 0 0 0 0 0 
0 
##$DATE= 1155814334
##$DBL= (0..7)
120 120 120 120 120 120 120 120 
##$DBP= (0..7)
150 150 150 150 150 150 150 150 
##$DBP07= 0
##$DBPNAM0= <>
##$DBPNAM1= <>
$$ [...]
##$SUBNAM7= <"">
##$SUBNAM8= <"">
##$SUBNAM9= <"">
##$SW= 20.6930455092707
##$SWIBOX= (0..15)
0 0 3 0 0 0 0 0 0 0 0 0 0 0 0 0 
##$SW_h= 5175.983436853
##$TD= 65536
##$TD0= 1
##$TE= 296.16
##$TE2= 300
##$TE3= 300
##$TEG= 300
##$TL= (0..7)
0 120 120 120 120 120 120 120 
##$TP= (0..7)
150 150 150 150 150 150 150 150 
##$TP07= 0
##$TPNAME0= <>
##$TPNAME1= <>
##$TPNAME2= <>
##$TPNAME3= <>
##$TPNAME4= <>
##$TPNAME5= <>
##$TPNAME6= <>
##$TPNAME7= <>
##$TPOAL= (0..7)
0.5 0.5 0.5 0.5 0.5 0.5 0.5 0.5 
##$TPOFFS= (0..7)
0 0 0 0 0 0 0 0 
##$TUNHIN= 0
##$TUNHOUT= 0
##$TUNXOUT= 0
##$USERA1= <user>
##$USERA2= <user>
##$USERA3= <user>
##$USERA4= <user>
##$USERA5= <user>
##$V9= 5
##$VALIST= <valist>
##$VCLIST= <CCCCCCCCCCCCCCC>
##$VD= 0
##$VDLIST= <DDDDDDDDDDDDDDD>
##$VPLIST= <PPPPPPPPPPPPPPP>
##$VTLIST= <TTTTTTTTTTTTTTT>
##$WBST= 1024
##$WBSW= 4
##$XGAIN= (0..3)
0 0 0 0 
##$XL= 0
##$YL= 0
##$YMAX_a= 227157
##$YMIN_a= -422159
##$ZGOPTNS= <>
##$ZL1= 120
##$ZL2= 120
##$ZL3= 120
##$ZL4= 120
##$ABSF1= 16.522
##$ABSF2= -4.171173
##$ABSG= 5
##$ABSL= 3
##$ALPHA= 0
##$AQORDER= 0
##$ASSFAC= 0
##$ASSFACI= 0
##$ASSFACX= 0
##$ASSWID= 0
##$AUNMP= <proc_1d>
##$AZFE= 0.1
##$AZFW= 0.1
##$BCFW= 0
##$BC_mod= 0
##$BYTORDP= 0
##$COROFFS= 0
##$CY= 12.5
##$DATMOD= 1
##$DC= 0
##$DFILT= <>
##$DTYPP= 0
##$F1P= 14.0000005364418
##$F2P= -0.99999901652339
##$FCOR= 0.5
##$FTSIZE= 32768
##$FT_mod= 6
##$GAMMA= 0
##$GB= 0
##$INTBC= 1
##$INTSCL= 1
##$ISEN= 128
##$LB= 0.3
##$LEV0= 0
##$LPBIN= 0
##$MAXI= 10000
##$MC2= 0
##$MEAN= 0
##$ME_mod= 0
##$MI= 0
##$NCOEF= 0
##$NC_proc= -5
##$NLEV= 6
##$NOISF1= 0
##$NOISF2= 0
##$NSP= 0
##$NTH_PI= 0
##$NZP= 0
##$OFFSET= 16.522
##$PC= 1
##$PHC0= 137.0537
##$PHC1= 10.09281
##$PH_mod= 1
##$PKNL= yes
##$PPARMOD= 0
##$PSCAL= 4
##$PSIGN= 0
##$REVERSE= no
##$SF= 250.13
##$SI= 32768
##$SIGF1= 0
##$SIGF2= 0
##$SINO= 400
##$SIOLD= 32768
##$SREGLST= <1H.DMSO>
##$SSB= 0
##$STSI= 32768
##$STSR= 0
##$SW_p= 5175.98343685301
##$SYMM= 0
##$S_DEV= 0
##$TDeff= 65536
##$TDoff= 0
##$TI= <Analysis number 999999
Compound Code 99
Book Reference 9
Project Code 9>
##$TILT= no
##$TM1= 0
##$TM2= 0
##$TOPLEV= 0
##$USERP1= <user>
##$USERP2= <user>
##$USERP3= <user>
##$USERP4= <user>
##$USERP5= <user>
##$WDW= 1
##$XDIM= 32768
##$YMAX_p= 395867128
##$YMIN_p= -520354
$$ End of Bruker specific parameters
$$ ---------------------------------
##NTUPLES= NMR SPECTRUM
##VAR_NAME=  FREQUENCY,     SPECTRUM/REAL,   SPECTRUM/IMAG
##SYMBOL=    X,             R,               I
##VAR_TYPE=  INDEPENDENT,   DEPENDENT,       DEPENDENT
##VAR_FORM=  AFFN,          ASDF,            ASDF
##VAR_DIM=   32768,         32768,           32768
##UNITS=     HZ,            ARBITRARY UNITS, ARBITRARY UNITS
##FACTOR=    0.157963299565203, 1,           1
##FIRST=     4132.6476996994, 0,             0
##LAST=      -1043.33573715361, 0,           0
##MIN=       -1043.33573715361, -520354,     0
##MAX=       4132.6476996994, 395867128,     0
$$ Real data points
##PAGE= N=1
##DATA TABLE= (X++(R..R)), XYDATA
$$ [...]
24136G4583M5274R7630m851j53943J6466l1685j44751K5469l7058J29841J31384
$$ 74583 119857 217487 212636 58693 75159 43474 -101277 -75808 -112866 16975 148359
24125A48359j40168o0133O4382J9633j25201p5067N2876R2372l2110m6250m550
$$ 148359 8191 -51942 12440 32073 -93128 -168195 -115319 -22947 -55057 -101307 -105857
24114a05857J10173Q0793j7212r6773l5431k8185p6073M1913p5280K0156Q8590
$$ -105857 4316 85109 67897 -28876 -64307 -92492 -168565 -126652 -201932 -181776 -93186
24103i3186R583j0908P0744r0192j41950J39354J85175P267n7260M3277m2343
$$ -93186 -83603 -94511 -23767 -113959 -255909 -116555 68620 75887 18627 61904 19561
24092A9561j13623p9046l8940O0078R6759R7592j41771K5404O9667L4582J01161
$$ 19561 -94062 -173108 -212048 -151970 -55211 42381 -99390 -73986 -4319 30263 131424
24081A31424l7148M9911N1898j4494r7180q8531n8437M8239j64872o8963J08183
$$ 131424 94276 144187 196085 181591 84411 -4120 -62557 -14318 -179190 -248153 -139970
24070a39970m6685l3170O0543J34157Q7743k6991J7090j390q3810o3037j131R2321
$$ -139970 -186655 -219825 -159282 -25125 62618 35627 52717 51327 -32483 -95520 -96651 -4330
24058d330n5009Q885r3981j1781O7992K2642J15880M1323k5979p7382j1649j37492
$$ -4330 -59339 -50454 -144435 -156216 -88224 -65582 50298 91621 65642 -11740 -23389 -160881
24046a60881n9714P1719q131o7444O309M0065P3421o7111m2723O9033P9091N6983
$$ -160881 -220595 -148876 -157007 -224451 -218142 -178077 -104656 -171767 -214490 -145457 -66366 -9383
24034i383k9773K1703L4578R9910m0575k3822j0625M7128l2885L2869r2118r6428
$$ -9383 -39156 -17453 17125 117035 76460 52638 42013 89141 56256 89125 -2993 -99421
24022i9421L613N7066R8421o6354q5012P955j1585k22749j1895R2868M8360J27923
$$ -99421 -95808 -38742 59679 -6675 -91687 -83732 -95317 -318066 -329961 -237093 -188733 -60810
24010f0810J94755R1616j8438l7538o9036L7460j4265J4922p7087j65317P3442
$$ -60810 133945 225561 207123 169585 100549 138009 123744 138666 61579 -103738 -30296
23999c0296k1762r33J15610l0579k922k1326j0679P3999m9542j46004l5146n9076
$$ -30296 -52058 -52991 62619 32040 29118 7792 -2887 71112 21570 -124434 -159580 -218656
23987b18656J14408J93165Q207l5907j73147P620J389p631k3019m6823R7693J25090
$$ -218656 -104248 88917 97124 61217 -111930 -104310 -102921 -110552 -133571 -180394 -82701 42389
23975D2389o8032l2204q8457l1671L7669q1303J96750J78337k498k75313o1506
$$ 42389 -25643 -57847 -146304 -177975 -140306 -221609 -24859 153478 150980 -124333 -185839
23964a85839K7314k7088K6473K16509J18061l4798j47330j07088M7428J49150
$$ -185839 -158525 -185613 -159140 57369 175430 140632 -6698 -113786 -66358 82792
23954H2792M9676J1762Q9674k460m3396k15064J3591M4063M0584j03274p2905
$$ 82792 132468 144230 233904 231444 188048 -27016 -13425 30638 71222 -32052 -104957
23943a04957M806R1103r2797J793J16338P2333r2364j52682r2436n78K49106J8263
$$ -104957 -100151 -9048 -101845 -100052 16286 88619 -3745 -156427 -248863 -249441 -335 17928
23931A7928m9401j59292j03674M9419J12994j7182J03653J82475O5203j07739
$$ 17928 -31473 -190765 -294439 -245020 -132026 -149208 -45555 136920 202123 94384
23921I4384j96052j27667k2100M0970J55413k6599j26704k4364J53784J02422
$$ 94384 -101668 -229335 -251435 -210465 -55052 -81651 -208355 -232719 -78935 23487
23911B3487l270k7020k8345K8738o6935j2121J42058k264j00640L696M851j2353
$$ 23487 20217 -6803 -35148 -6410 -73345 -85466 56592 54328 -46312 -42616 -37765 -50118
23899e0118r9736Q0043J41988n8012j17219K685K5709N1858j8777N1213n5323
$$ -50118 -149854 -69811 72177 14165 -103054 -100369 -74660 -22802 -41579 9634 -45689
23888d5689l4935M895j07665r6582J9303M2471O5495R6492N0818L7585K8492p7315
$$ -45689 -80624 -75729 -183394 -279976 -260673 -218202 -152707 -56215 -5397 32188 60680 -16635
23876a6635l9768n6597l3467m9477P0631o1284J6829R9147O6308m9023L8026q3461
$$ -16635 -56403 -113000 -146467 -195944 -125313 -186597 -169768 -70621 -4313 -53336 -15310 -98771
23864i8771K11J7826m8836J5015q6515k2131q1951O8653J56139M7570r9840j00317
$$ -98771 -98560 -80734 -129570 -114555 -201070 -223201 -305152 -236499 -80360 -32790 -132630 -232947
23852b32947M5508M0608L7448J9493O6463q4446o823L6058j12649K5339J74392
$$ -232947 -187439 -146831 -109383 -89890 -23427 -107873 -114696 -78638 -191287 -165948 8444
23841H444P7940K5179j71959K3042J23578P7656O8517Q870p8691j70571K7639
$$ 8444 86384 111563 -60396 -37354 86224 163880 232397 241267 162576 -7995 19644
23830A9644j02565j09662r6309J04545J62396j2168j74797O3628O1547J14278
$$ 19644 -82921 -192583 -288892 -184347 -21951 -34119 -208916 -145288 -83741 30537
23820C0537n3977r062Q2187k2918n1381j40659k8939J4728M6877R8557J1916r395
$$ 30537 -23440 -32502 49685 26767 -24614 -165273 -194212 -179484 -132607 -34050 -22134 -31529
23808c1529l514k03705M3304q14n483J43734J12479N4268n2794p8601K1227p9204
$$ -31529 -35043 -238748 -195444 -196258 -201741 -58007 54472 108740 55946 -22655 -1428 -80632
23796h0632q6458R8080q274J1700q2283l1027n9876r6142J1782j2450Q5051J00945
$$ -80632 -167090 -69010 -77284 -65584 -147867 -178894 -238770 -334912 -323130 -335580 -250529 -149584
23784a49584J55895J51014J3736k8223o3869O0255J9496j16681l4846j8201o1766
$$ -149584 6311 157325 171061 142838 78969 139224 158720 42039 7193 -11008 -72774
23773g2774M6017p4343M0335K9196j10122J01655J36566k11628k6117M7043L4993
$$ -72774 -26757 -101100 -60765 -31569 -141691 -40036 96530 -115098 -141215 -94172 -59179
23762e9179K3450q8804M0686j8649p9833J40554J29145O2401J5121j67082K3434
$$ -59179 -35729 -124533 -83847 -102496 -182329 -41775 87370 149771 164892 -2190 21244
23751B1244O5200r9941p8378m1643l0676K2810L1255o0384j10112l4246R6264
$$ 21244 86444 -13497 -91875 -133518 -164194 -141384 -110129 -170513 -280625 -314871 -218607
23740b18607J13059J66379N1849k9362r2019R1437K5844J4829m3759L6528m3883
$$ -218607 -105548 60831 112680 83318 -8701 82736 108580 123409 79650 116178 72295
23729G2295j63601l2869k4569n413J16600M6937O3811O7753O4931n3730j21313
$$ 72295 -91306 -124175 -148744 -154157 -37557 9380 73191 140944 205875 152145 30832
23718C0832O324L9148J2454m6566r0844j16949M1798J85459Q2768j35645p1385
$$ 30832 37156 76304 88758 42192 -48652 -165601 -123803 61656 144424 8779 -62606
23707f2606J61107M0863j2822J0519r1031k4767O1230P1447m7347R1347j1798
$$ -62606 98501 139364 126542 137061 46030 21263 82493 153940 106593 197940 186142
23696A86142j22365j80321l1445K23186O2732n346L5260o0003m1039j6760m9058
$$ 186142 63777 -116544 -147989 75197 137929 132583 167843 107840 66801 50041 983
23685I83R135P8814m2617j30339r2148l5940m9397P4531r0468R4506Q0885J01980
$$ 983 10118 88932 46315 -84024 -176172 -212112 -261509 -186978 -277446 -182940 -102055 -75
23673g5J90486m4092Q236J44065p2591j25147l8015O8336R1650j79098r9232R698
$$ -75 190411 146319 154555 298620 226029 100882 62867 131203 222853 43755 -55477 -45779
23661d5779k4335m737L4557J8314M0962q4431P3774O2065J20345m4457j09696
$$ -45779 -70114 -74851 -40294 -21980 18982 -65449 8325 70390 190735 146278 36582
23650C6582j41156j85449O7479J03222J00549L1102J1058l2845l4055K8690J10043
$$ 36582 -104574 -290023 -222544 -119322 -18773 12329 23387 -9458 -43513 -14823 95220
23639I5220Q3168K3523q5727j18836j05972o8232n4328N5324J09425R4015Q069
$$ 95220 178388 201911 116184 -2652 -108624 -176856 -231184 -175860 -66435 27580 35649
23628C5649j13757k0744L0800L2762N2835Q3476Q2871j79563q8659M8650N7957
$$ 35649 -78108 -98852 -68052 -35290 17545 101021 183892 4329 -84330 -35680 22277
23617B2277N6467L8621j38289j57317Q5677n6141J65921P6441r0250j66358L3569
$$ 22277 78744 117365 -20924 -178241 -92564 -148705 17216 93657 3407 -162951 -129382
23606a29382J11553k0598N3123M632o603L2251J1175N307M1901p77l5984j6398
$$ -129382 -17829 -38427 14696 19328 12725 44976 56151 61458 103359 102582 66598 50200
23594E0200n8346o1027p5548O3512J47008K1650m0784l204j1915j42726j13509
$$ 50200 -8146 -69173 -144721 -81209 65799 87449 46665 43461 31546 -111180 -224689
23583b24689l0442O2330J31286N0693P132J9933M8788p6420j75826j34185O6351
$$ -224689 -255131 -192801 -61515 -10822 -3690 16243 65031 -11389 -187215 -321400 -255049
23572b55049K2655J59964J12336p5198q698p3458L860L8276O8872J37006j79201
$$ -255049 -232394 -72430 39906 -35292 -43990 -117448 -113588 -75312 -6440 130566 -48635
23561d8635j76633k9961m7383K22101J13108p8763k6358O9257O6715Q9330m2870
$$ -48635 -225268 -255229 -302612 -80511 32597 -46166 -72524 -3267 63448 152778 109908
23550A09908j04787j2032j5568k0777j15103P8795L1034L6777L645j50q9764R171
$$ 109908 5121 -6911 -22479 -43256 -158359 -79564 -48530 -11753 -8108 -8258 -98022 -88851
23538h8851q2790j33029R7591P2527L9524J13664Q1234q8949r1391m6392J1478
$$ -88851 -171641 -304670 -207079 -134552 -95028 18636 99870 10921 -80470 -126862 -115384
23527a15384k4721Q8879m7531q7271Q673J43592L9595L7708P8669L3557l7903
$$ -115384 -140105 -51226 -98757 -186028 -177355 -33763 5832 43540 122209 155766 117863
23516A17863k06554K3089L5247L9090P6256J48373j8641j44740K441p1943J01891
$$ 117863 -88691 -65602 -30355 8735 84991 233364 214723 69983 72424 481 102372
23505A02372J6315m9741l1248l0844k31748q1572J02153L3958j00246n2741J24958
$$ 102372 118687 68946 37698 6854 -224894 -306466 -204313 -170355 -270601 -323342 -198384
23494a98384M131K6221P3806p8587L4040J06874Q1409M7031R6195l4254p6749
$$ -198384 -194253 -168032 -94226 -172813 -138773 -31899 49510 96541 192736 158482 81733
23483H1733o7464j2120p9632q8054R5373R6165R1124j44590N370M6400l5621k326
$$ 81733 14269 2149 -77483 -165537 -70164 26001 117125 -27465 -22095 24305 -11316 -13642
23471a3642l3086j00637m5584P7747P9708o23k8185M3231N0689l4747J3847K1774
$$ -13642 -46728 -147365 -192949 -115202 -35494 -36117 -64302 -21071 29618 -5129 8718 30492
23459C0492n0454L7040j33235K1034N0326p0029j6031J31758j7584K0751N1138
$$ 30492 -19962 17078 -116157 -95123 -44797 -114826 -130857 901 -16683 4068 55206
23448E5206Q0909L2881M560r0066o2587j6819j6322K8098j28423p1307J41981
$$ 55206 136115 168996 173556 83490 20903 4084 -12238 15860 -112563 -183870 -41889
23437d1889k8663N4689n4456L4808K8163k4041M5341j58793o5370L7184k5155
$$ -41889 -70552 -15863 -70319 -35511 -7348 -31389 13952 -144841 -210211 -173027 -198182
23426a98182R6648r453K8860J2741N0673J1223l9572M8239k7996l3056P239q9377
$$ -198182 -101534 -110987 -82127 -69386 -18713 -7490 -47062 1177 -26819 -59875 -52636 -142013
23414a42013n5675M3074N2069K44306O9476n9576r3104k3771J2263j31556N4042
$$ -142013 -197688 -154614 -102545 141761 211237 151661 58557 34786 47049 -84507 -30465
23403c0465J40285J3789Q1615l1460j74222j21691J363n0894j5549p3907j0087
$$ -30465 109820 123609 205224 173764 -458 -122149 -120786 -171680 -187229 -261136 -271223
23392b71223J72968k0414j02975R6551P1320l8267q219L5364l0018l6878j4531
$$ -271223 -98255 -118669 -221644 -125093 -53773 -92040 -100259 -64895 -94913 -131791 -146322
23381a46322K2172j50O7023J51092q4011j8002R0516K4685q8502j14294p6784
$$ -146322 -124150 -124300 -57277 93815 9804 -8198 82318 107003 18501 -95793 -172577
23370a72577o5660O8202N911Q414l2764K7189J12415J10298j27645K085R2248
$$ -172577 -238237 -170035 -164124 -155710 -188474 -161285 -48870 61428 -66217 -64132 28116
23359B8116k3611m4577j7904P726P5779j54412O8584P7061P152r6990j15023m7320
$$ 28116 4505 -40072 -57976 -50250 25529 -128883 -60299 16762 23914 -73076 -188099 -235419
23347b35419J21189K467o2063q2406P9833J78026K1506j7669K5096o834J13064
$$ -235419 -114230 -111763 -173826 -256232 -176399 1627 23133 5464 30560 23726 136790
23336A36790R91j58515l8341j67411k5612J5865K0074N4108J01052j123l9514
$$ 136790 137781 -20734 -59075 -226486 -252098 -236233 -216159 -162051 -60999 -62122 -101636
23325a01636P3710p115j31209m4731m1868M0286P4784L0826l5514m725J00827
$$ -101636 -27926 -35041 -166250 -210981 -252849 -212563 -137779 -106953 -142467 -147192 -46365
23314d6365J32300q1249k09238N737J76638K6962p0278j0467j0720P4247q2749
$$ -46365 85935 4686 -204552 -198815 -22177 4785 -65493 -75960 -86680 -12433 -95182
23303i5182O3290k6557M2293j7614j5582K9401R6148p1848o7124P4357n3517j14201
$$ -95182 -31892 -58449 -16156 -33770 -49352 -19951 76197 4349 -62775 11582 -41935 -156136
23291a56136j14345N9078J48434r0540R1668J08816j2490k8725K4511j48569p2144
$$ -156136 -270481 -211403 -62969 -153509 -61841 46975 34485 5760 30271 -118298 -190442
23280a90442M4688J20298N8813J31568Q4125j62886n0602p6214N5956o1835j136
$$ -190442 -145754 -25456 33357 164925 249050 86164 35562 -40652 15304 -46531 -47667
23269d7667J06727O6114j17576M2044n2809k6419k8135l759R9802J14167j45911
$$ -47667 59060 125174 7598 49642 -3167 -29586 -57721 -61480 38322 152489 6578
23258F578n188Q1159q8309n8217K7145K9060j0285p641m5900N256r695j0443m3531
$$ 6578 1390 82549 -5760 -63977 -36832 -7772 -18057 -25698 -71598 -66342 -76037 -86480 -130011
23245a30011o578M6530p3076K3157Q6264o713J7333N4560q0240q6809R8599N6023
$$ -130011 -136589 -90059 -163135 -139978 -53714 -60427 -43094 11466 -68774 -155583 -56984 -961
23233i61L6278k9510J1180p4087P2893J60779m459j6523o1375k02129j04354n6262
$$ -961 35317 5807 16987 -57100 15793 176572 172113 155590 94215 -107914 -212268 -268530
23221b68530M9857J00536J06543l530j9088K7135m8750J08749K6610l5693j11600
$$ -268530 -218673 -118137 -11594 -15124 -34212 -7077 -55827 52922 79532 43839 -67761
23210f7761j4088N8770J35189L2868o5533j95292o9372O1803J80614R3782k65
$$ -67761 -81849 -23079 112110 144978 79445 -115847 -185219 -123416 57198 150980 150715
23199A50715j29529o3029O3520m9294n5482l8890J4283Q0564J8131K1976l8649
$$ 150715 21186 -41843 21677 -27617 -83099 -121989 -107706 -27142 -9011 12965 -25684
23188b5684O6413L4471j12695p5617N7593J01339k0893K5277M3395l5773L4656
$$ -25684 40729 75200 -37495 -113112 -55519 45820 24927 50204 93599 57826 92482
23177I2482j9086K4175q79o9473p9895j15947o5959J08387L7017l1700o3095j21448
$$ 92482 73396 97571 96692 27219 -52676 -168623 -234582 -126195 -89178 -120878 -183973 -305421
23165c05421L9358P0614J27399J31734o595k01606j8177P0581J07281J08765q5132
$$ -305421 -266063 -195449 -68050 63684 57089 -144517 -162694 -92113 15168 123933 38801
23154C8801L2642j073J38912K2781j00425q7206l0220o1058r0947j06147M5516
$$ 38801 71443 70370 209282 232063 131638 44432 14212 -46846 -137793 -243940 -198424
23143a98424J8992Q4287J86614k2067j93543J1791J80948J5364m7160p2017K132
$$ -198424 -179432 -95145 91469 69402 -124141 -112350 68598 83962 36802 -35215 -33083
23132c3083n7840o6396J30019R8622j07008j70158J04760J39815r098q1467m6567
$$ -33083 -90923 -157319 -27300 71322 -35686 -205844 -101084 38731 29633 -51834 -98401
23121i8401n6963R878J3812p547n8041j695j0554L2493J22571L4103k4597m3741
$$ -98401 -155364 -145486 -131674 -139221 -197262 -198957 -209511 -177018 -54447 -20344 -44941 -88682
23109h8682j6887l062k12858M7713N316N2328J03614K3194p0193n5062N0579M7988
$$ -88682 -105569 -108631 -321489 -273776 -268460 -216132 -112518 -89324 -159517 -214579 -164000 -116012
23097a16012N4171R3961J2082j18579q7109J0668L8370N5148J54563J07276j47545
$$ -116012 -61841 32120 44202 -74377 -161486 -150818 -112448 -57300 97263 204539 56994
23086E6994n7429n4137j13242l5779j941J27128n186k5613N4250P4662R234m4785
$$ 56994 -435 -54572 -167814 -203593 -205534 -78406 -83592 -109205 -54955 19707 28941 -15844
23074a5844o0572P3184K9343O2436M8286r6456q7458O891k1404K9590n7777q8282
$$ -15844 -76416 -3232 26111 88547 136833 40377 -47081 -40190 -61594 -32004 -89781 -178063
23062a78063j00811o3485M1404L0036J96188p1910k19815J22808J71522R301j44185
$$ -178063 -278874 -342359 -300955 -270919 -74731 -146641 -366456 -243648 -72126 -62825 -207010
23051b07010O121O8314J1462R0697m7218q0835k777J84819K3571r7280m2553M0235
$$ -207010 -200889 -132575 -121113 -30416 -77634 -158469 -161246 23573 47144 -50136 -92689 -52454
23039e2454q4723N6571k6369q5472p0093L9713K52453M8140N8893r1813k411J65814
$$ -52454 -137177 -80606 -106975 -192447 -262540 -222827 29626 77766 136659 44846 42435 208249
23027B08249p887k05263l7750l9509J6042o3302j01559R115K3800m3484P2545
$$ 208249 200362 -4901 -42651 -82160 -66118 -129420 -230979 -221864 -198064 -241548 -169003
23016a69003N8990r748J3797J48242M882k2622o8756p9139n8044K4932J94330
$$ -169003 -110013 -119761 -105964 42278 47160 24538 -44218 -123357 -181401 -156469 37861
23005C7861N1841P7586o0125j60132R24K0412N4135o7071J9721P0444J6302r0290
$$ 37861 89702 167288 107163 -52969 -52045 -31633 22502 -44569 -24848 45596 61898 -28392
22993b8392Q863J44135K6093j9810k07001j53678O5195Q0318q4173P2313J2932
$$ -28392 -19529 124606 150699 130889 -76112 -229790 -164595 -84277 -168450 -96137 -83205
22982h3205p7926N7359J31884k3920K2727n5342O2657o1041Q209L3369M3935j03068
$$ -83205 -161131 -103772 28112 4192 26919 -28423 34234 -26807 -18598 14771 58706 -44362
22970d4362m2480O7143k6236J4916m6889j5947P9311L2322p6925j60182j3435
$$ -44362 -86842 -19699 -45935 -31019 -77908 -93855 -14544 17778 -59147 -219329 -232764
22959b32764N2622J55542J81829q1795j01280j45806M8034n240P3527L9018Q5573
$$ -232764 -180142 -24600 157229 75434 -25846 -171652 -123618 -128858 -55331 -16313 69260
22948F9260j24239r381K0678O3369M1912Q1135Q6315j44831o2933L381r7860j03637
$$ 69260 -54979 -64360 -43682 19687 61599 142734 229049 84218 21285 24666 -73194 -176831
22936a76831k1524J34832J41337P6026l5981k0687r6708j44653L4819j8101N0572
$$ -176831 -198355 -63523 77814 153840 117859 97172 464 -144189 -109370 -127471 -76899
22925g6899K4014J1054l5304o7910l262k5733J15817Q9235q9804k2693J48027
$$ -76899 -52885 -41831 -77135 -145045 -148307 -174040 -58223 31012 -58792 -81485 66542
22914F6542M5606K2589p4597q0709n2852P0920M8190k5881L9688Q1486o2195q8135
$$ 66542 112148 134737 60140 -20569 -73421 -2501 45689 19808 59496 140982 78787 -9348
22902i348p0332K1592J1686R6296K8827L3913P1653n1238j33055k9932l733N8575
$$ -9348 -79680 -58088 -46402 49894 78721 112634 184287 133049 -6 -29938 -33671 24904
22890B4904p8577Q1077p5746k9526R0778o0491J2025L9293l6776J0460m3480o2880
$$ 24904 -53673 27404 -48342 -77868 12910 -47581 -35556 3737 -33039 -22579 -66059 -128939
22878a28939L1859K6515j4394N5410N277j43514J14251J00311J07283o683j06639
$$ -128939 -97080 -70565 -84959 -29549 -24272 -167786 -53535 46776 154059 147376 40737
22867D0737p3590Q7331R658J0309k8182n3233k7531J16930j2899r9655q9111j3036
$$ 40737 -32853 54478 64136 74445 46263 -6970 -34501 82429 69530 -30125 -119236 -132272
22855a32272l1819q0163k4730J20737J54141J26557j7154J6994o8795j89385k5691
$$ -132272 -164091 -244254 -268984 -148247 5894 132451 115297 132291 63496 -125889 -151580
22844a51580Q1163Q348j88153Q8469J88531K0253p2926k9490O893J2315o188j10821
$$ -151580 -70417 -62069 -250222 -161753 26778 47031 -25895 -55385 -48492 -36177 -42365 -153186
22832a53186j02211M4264J4K6800Q5421R7686J36845J02845K0507p6229j81864
$$ -153186 -255397 -211133 -211119 -184319 -98898 -1212 135633 238478 258985 182756 892
22821H92J2804M6035r8928j37498K0786R3982Q1620Q2815P4595m1361j26860p4296
$$ 892 13696 59731 -39197 -176695 -155909 -61927 19693 102508 177103 135742 8882 -65414
22809f5414q946o4804j02536j5228J59654R4256j0692l433N3440R0564P0214r9515
$$ -65414 -74360 -139164 -241700 -256928 -97274 -3018 -13710 -17143 36297 126861 197075 97560
22797I7560j88528K4379J04662L6862M8540j7735O3536q9454O1466J05093j83953
$$ 97560 -90968 -66589 38073 74935 123475 105740 169276 79822 141288 246381 62428
22786F2428n2777n6552j08599j4181J57043N5941R3568o1890L248n8199k5858
$$ 62428 9651 -46901 -155500 -169681 -12638 43303 136871 74981 78229 20030 -5828
22775e828r2502r9417r1983m5157P9624K26846R6855J6603o8618J57001K1761
$$ -5828 -98330 -197747 -289730 -334887 -255263 -28417 68438 85041 16423 173424 195185
22764A95185p3392N6739k1834J8147l5263n5505o9578j1765m2343l4577L7121
$$ 195185 121793 178532 156698 174845 139582 84077 14499 2734 -39609 -74186 -37065
22753c7065O9038r7642M880j780j0668k443Q8145J7344k2880n9257K4808o9455
$$ -37065 31973 -65669 -60789 -62569 -73237 -75680 12465 29809 6929 -52328 -27520 -96975
22741i6975j10325q1446M5616M3256l780K4987N1164J84307R5925k6496K915k266
$$ -96975 -207300 -288746 -243130 -199874 -203654 -178667 -127503 56804 152729 126233 129148 126882
22729A26882l815L9114j00943p3525K5413J10446J7421j30435k8168l2922r1222
$$ 126882 123067 162181 61238 -12287 13126 123572 140993 10558 -17610 -50532 -141754
22718a41754J21698K5067j88276J69498R1933q3289q5418j30591J867N3065k9680
$$ -141754 -20056 5011 -183265 -13767 78166 -5123 -90541 -221132 -219265 -166200 -195880
22707a95880n1352N2924n595N4559J99001J03608j04790j49821p7451J54743k0534
$$ -195880 -247232 -194308 -199903 -145344 53657 157265 52475 -97346 -174797 -20054 -40588
22696d0588L8730M0351Q6210l8394P0949N089m8439j81996m1974J36937M7421
$$ -40588 -1858 38493 124703 86309 157258 162347 113908 -68088 -110062 26875 74296
22685G4296m0900k2122O0612P0780O916m2428k546n8914j40013J13366n9918n5241
$$ 74296 33396 11274 71886 142666 149582 107154 104608 45694 -94319 19047 -40871 -96112
22673i6112K1063J6858N9957L3404k927k8511j27806j9545J13495O0863K3360
$$ -96112 -75049 -58191 1766 35170 32243 3732 -124074 -143619 -30124 30739 54099
22662E4099P2945J4013j12489p2466k5063n8041Q0014L2683l0775o6772o646k0548
$$ 54099 127044 141057 28568 -43898 -68961 -127002 -46988 -14305 -45080 -111852 -118498 -139046
22650a39046l399P2854K00064j5162r3266J03366j8212K7345o2281k1352J10541
$$ -139046 -142445 -69591 130473 115311 22045 125411 107199 134544 72263 50911 161452
22639A61452K6304k23033J30278J35964k34145o2993q4330j36478N0378Q9543
$$ 161452 187756 -35277 95001 230965 -3180 -66173 -150503 -286981 -236603 -147060
22629a47060m626Q2526m9002r8460J12889J49875J66850n4779j35330q3847J3244
$$ -147060 -151686 -69160 -118162 -216622 -103733 46142 212992 158213 22883 -60964 -47720
22618d7720K0233j01939r456j9787N299J45930M9315N3426o6073r6886n7180o0128
$$ -47720 -27487 -129426 -138882 -158669 -153370 -7440 41875 95301 29228 -67658 -124838 -184966
22606a84966J31612Q5742n1413k4098L2861m2987j31327m0446L2001J67106J72039
$$ -184966 -53354 32388 -19025 -43123 -10262 -53249 -184576 -225022 -193021 -25915 146124
22595A46124K9694n6186j03084p1254n2129j18110P0966P4895R004L9327J1203
$$ 146124 175818 119632 16548 -54706 -106835 -224945 -153979 -79084 -70080 -30753 -19550
22584a9550l9604J7868K1350J01504Q0691J49867j1029j58414j47138r7191O6031
$$ -19550 -59154 -41286 -19936 81568 162259 312126 301097 142683 -4455 -101646 -35615
22573c5615r4577J22458O8053l7675R5421m18O9935j41790j07447j1812J07127
$$ -35615 -130192 -7734 60319 22644 118065 117647 187582 45792 -61655 -73467 33660
22562C3660J53131Q7830J01178j01420j48277j30659o0434m9980j12361r6044
$$ 33660 186791 274621 375799 274379 126102 -4557 -64991 -114971 -227332 -323376
22552c23376N1598L5801P7741J414L1528O4271J23732J46371k9601k05451r1010
$$ -323376 -271778 -235977 -158236 -156822 -125294 -61023 62709 209080 179479 -25972 -116982
22541a16982q1320K7853L2852J4532l3525J6717j9828q3417j4688O6864Q4984
$$ -116982 -198302 -170449 -137597 -123065 -156590 -139873 -159701 -243118 -257806 -190942 -105958
22530a05958J12109N7735l3632N3673j857L7360o669n768j13745p3865M6056J56505
$$ -105958 6151 63886 30254 83927 82070 119430 112761 106993 -6752 -80617 -34561 121944
22518A21944R5831m6586o6829q0724q3549p3709j07426j26434K0922R2024L9615
$$ 121944 217775 171189 104360 23636 -59913 -133622 -241048 -367482 -346560 -254536 -214921
22507b14921l1642L1250P9961P7426N6274M322p5375M2738P113m2175M6580P0300
$$ -214921 -246563 -215313 -135352 -57926 -1652 2670 -72705 -29967 -22854 -65029 -18449 51851
22495E1851m2944l9417L5386n8592n8005o45J15653o1128j17448P0620J04025
$$ 51851 8907 -30510 4876 -53716 -111721 -112366 3287 -57841 -175289 -104669 -644
22484f44l1496M1832j1028L6149n857k8164j90290L3971L9389M4883K7497r4256
$$ -644 -32140 9692 -1336 34813 28956 792 -189498 -155527 -116138 -71255 -43758 -138014
22472a38014q6038N2619J05682J23103l908p0075j82731j13884l4566M7861J27555
$$ -138014 -224052 -171433 -65751 57352 53444 -16631 -199362 -313246 -347812 -299951 -172396
22461a72396p1421o4179Q4202R6116J83091M8306j39772q6905q2624p2032J23336
$$ -172396 -243817 -307996 -223794 -127678 55413 103719 -36053 -122958 -205582 -277614 -154278
22450a54278J43428L3397o9765L5380P6864j6626j59106k34756Q2350M1980L2132
$$ -154278 -10850 22547 -47218 -11838 65026 48400 -110706 -345462 -263112 -221132 -189000
22439a89000O9515O4865K5010K222Q796l6701K4691J7449J0984n153n5967m9042
$$ -189000 -119485 -54620 -29610 -27388 -18592 -55293 -30602 -13153 -2169 -7322 -63289 -112331
22427a12331j20367N2073J49946p1558j00638J16566o2609N9469M3850J3367l4489
$$ -112331 -232698 -180625 -30679 -102237 -202875 -86309 -148918 -89449 -45599 -32232 -66721
22416f6721L7262j2728J10714N8956j04227j19802K6941n0815o3371K56994L7753
$$ -66721 -29459 -42187 68527 127483 23256 -96546 -69605 -120420 -183791 73203 110956
22405A10956j66085j21329O3828p62J6817R7431J3712k3620N2817P4750K4170
$$ 110956 -55129 -176458 -112630 -113392 -96575 856 14568 -9052 43765 118515 142685
22394A42685q6575n2789r5284j2588o8780N5551j23188l9356l0292L7725P3667
$$ 142685 56110 3321 -91963 -104551 -173331 -117780 -240968 -280324 -310616 -272891 -199224
22383a99224M0446J07204R5368o4011j2287m0573O9937K2728L4097n98q9391j09975
$$ -199224 -158778 -51574 43794 -20217 -32504 -73077 -3140 19588 53685 53087 -36304 -146279
22371a46279J5571J40798L0475l8303j0934q4171l6014K0781O8831M5209J88808
$$ -146279 -130708 10090 40565 2262 -8672 -92843 -128857 -108076 -39245 5964 194772
22360A94772N9426p9396j40727o1837M0063l1025l9038Q8673J8167r8561K3248
$$ 194772 254198 174802 34075 -27762 12301 -18724 -57762 30911 49078 -49483 -26235
22349b6235P4116l5904j8616Q1365L0805M4419K5780N154j18552o1035L838P4631
$$ -26235 47881 11977 -6639 74726 105531 149950 175730 180884 62332 1297 5135 79766
22337G9766j20298j17793j7095J09503J6043q0375O3685J00811o5371n6048K9162
$$ 79766 -40532 -158325 -175420 -65917 -49874 -130249 -66564 34247 -31124 -87172 -58010
22326e8010M6151K9347j416J05075L8185j93906r1320K01649K1195N6655p2681
$$ -58010 -11859 17488 16072 121147 159332 -34574 -125894 75755 96950 153605 80924
22315H0924o8062k4768k2370l0997K1216p1651l1476L3033M1241J47154J75552
$$ 80924 12862 -11906 -34276 -65273 -44057 -115708 -147184 -114151 -72910 74244 249796
22304B49796j22602j37389n0760l3560l7566l7513J51816L636r1847K2766m22
$$ 249796 127194 -10195 -60955 -94515 -132081 -169594 -17778 -14142 -105989 -83223 -83645
22293h3645r9140P1368l9622J15557q900L0157K0865j19930j36286R6616m133
$$ -83645 -182785 -111417 -151039 -35482 -44382 -14225 6640 -113290 -249576 -152960 -157093
22282a57093K2646L9069O7374P077K2579J1264J56516O0918l5788j24779n759
$$ -157093 -134447 -95378 -28004 -20927 1652 12916 169432 230350 194562 69783 64024
22271F4024J0990M3625j33317n8818R0628L1643l8515j8604M6236P7648M850l9684
$$ 64024 75014 118639 -14678 -73496 17132 48775 10260 -8344 37892 115540 120390 80706
22259H0706K195l3687O2786n5694j13991j55484n5850P3588Q4625K9848l9819
$$ 80706 82901 49214 112000 56306 -57685 -213169 -269019 -195431 -110806 -80958 -120777
22248a20777m2611k4681K3634j08732J41400J44694L0683k4458k2569M9232J2016
$$ -120777 -163388 -188069 -164435 -273167 -131767 12927 43610 19152 -3417 45815 57831
22237E7831Q998m2940O9122J7899K8992k7671k0893n9356j2365k1229l2390p7625
$$ 57831 66829 23889 93011 110910 139902 112231 91338 31982 19617 -1612 -34002 -111627
22225a11627R4342K5355M3999M0472l0344j03159m6642l6122J49898p449j974
$$ -111627 -17285 8070 52069 92541 62197 -40962 -87604 -123726 26172 18723 16749
22214A6749j2577j8753L9342q3931o4440K5316J6357R6277Q4975J24312j47015
$$ 16749 4172 -14581 24761 -59170 -123610 -98294 -81937 14340 99315 223627 76612
22203G6612n452J65110K861m5095j35958p8864m3317L1295R063M9826k6004O3980
$$ 76612 71160 236270 239131 194036 58078 -20786 -64103 -32808 -23745 26081 77 64057
22191F4057M0924L7121j8541m992p88M4316n2963J17782P769r6056j90015j03806
$$ 64057 104981 142102 123561 118569 117781 162097 109134 226916 234685 138629 -51386 -155192
22179a55192R1748J10813q286j05064M9080j02230R212J36339n2883o1646p3966
$$ -155192 -63444 47369 39083 -65981 -16901 -119131 -109919 26420 -26463 -88109 -162075
22168a62075J3950M8404j1910O8188Q5460M2520k0473j07229r367k3119j143k1023
$$ -162075 -148125 -99721 -111631 -43443 42017 84537 64064 -43165 -52532 -75651 -76794 -97817
22156i7817r2917O3209R366K17092M3059r4413j17972o270K5409J4891R524O7774
$$ -97817 -190734 -127525 -118159 98933 141992 47579 -70393 -76663 -51254 -36363 -26839 40935
22144D0935r3454k7794n006J82716l783n1540J4335j20188j08530k4681J7382
$$ 40935 -52519 -80313 -85319 97397 93614 42074 56409 -63779 -172309 -196990 -179608
22133a79608J59337K07772l7029p5329P1789j7804k15400j19248L4232M0959o0356
$$ -179608 -20271 187501 150472 75143 146932 129128 -86272 -205520 -171288 -130329 -190685
22122a90685m1074J5012L8034J33367K24377m8488k71345j44964J34588j5792
$$ -190685 -231759 -216747 -178713 -45346 179031 130543 -140802 -285766 -151178 -166970
22112a66970k9850M7827N3356P16J3015j00490j9934j12683n9233O2455P2391
$$ -166970 -196820 -148993 -95637 -94921 -81906 -182396 -202330 -315013 -374246 -311791 -239400
22101b39400J5486Q2644L5568K1863o8651R577R4475N527L9649n065P7105J3536
$$ -239400 -223914 -141270 -105702 -83839 -152490 -142913 -48438 -42911 -3262 -8327 68778 82314
22089H2314j11260q1223J53410K1582j42531k19727j24003M8059J31930Q7388
$$ 82314 -28946 -110169 43241 64823 -77708 -297435 -421438 -373379 -241449 -154061
22079a54061O6939k7885n9031J55288O5143k7733m2142o5781j5134M8725N8572
$$ -154061 -87122 -115007 -174038 -18750 46393 18660 -23482 -89263 -104397 -55672 2900
22068B900J00239j15947j90097m1153J42430J47541M2122q8897j70399O538O6998
$$ 2900 103139 -12808 -202905 -244058 -101628 45913 88035 -862 -171261 -164723 -97725
22057i7725L3106m962O9478l6629p0409J4400R3523j4147q8562P6359O0119Q950
$$ -97725 -64619 -69581 -103 -36732 -107141 -92741 782 -13365 -101927 -25568 34551 43501
22045D3501p8737j39103j09675K1721M5316N3794J69501K8662n6567j34492L8752
$$ 43501 -35236 -174339 -284014 -262293 -216977 -163183 6318 34980 -21587 -156079 -117327
22034a17327O472J99004n3880j7326m9718O866P4984J0910J0484m9935L9274R1518
$$ -117327 -110855 88149 34269 16943 -32775 -25909 49075 59985 70469 20534 59808 151326
22022A51326j05718l1045R8160N0773J494N9664N8066j86192j03479j5896j9689
$$ 151326 45608 14563 112723 163496 164990 224654 282720 96528 -6951 -22847 -42536
22011d2536l4238r606J4333R2001J05320J3812q9908L1011M3521M4596P9080j74195
$$ -42536 -76774 -86380 -72047 19954 125274 139086 49178 80189 123710 168306 247386 73191
21999G3191o8832j02593n5276J0015J85354K5758R2309N6890k01730j29754N1857
$$ 73191 4359 -98234 -153510 -143495 41859 67617 159926 216816 15086 -114668 -62811
21988f2811Q4562o041j6328K4124p2318R0485N5256k5300Q3451k8740r6430j0795
$$ -62811 21751 15710 -618 23506 -48812 41673 96929 71629 155080 126340 29910 19115
21976A9115L9549j9601l2992K4699m2022J02033J02679r8373m5205J006M8788
$$ 19115 58664 39063 6071 30770 -11252 90781 193460 95087 49882 50888 99676
21965I9676j17033l9856J3987k2572o177j18080Q9341n2986M2856j13584n7577
$$ 99676 -17357 -57213 -43226 -65798 -71975 -190055 -100714 -153700 -110844 -224428 -282005
21954b82005J95471K08935j1851j66118J28143N4046m4040j69765p8909J7143
$$ -282005 -86534 122401 110550 -55568 72575 126621 82581 -87184 -166093 -148950
21944a48950L3215L0651o4965Q2151L4166L0749j1223k4162Q0848q7841l9029
$$ -148950 -115735 -85084 -150049 -67898 -33732 -2983 -14206 -38368 42480 -45361 -84390
21933h4390l8583J8142K9000P6447n027L5185l7537j02131Q724J09782P0824O9338
$$ -84390 -122973 -104831 -75831 616 -4411 30774 -6763 -108894 -100170 9612 80436 149774
21921A49774m9192k23558k11122N8701O6585R2095l6198J2790O2581p125J30129
$$ 149774 100582 -122976 -334098 -275397 -208812 -116717 -152915 -140125 -77544 -84669 45460
21910D5460M0754J24873J27337j9803j77014q5805k04758k6875j323J10784m8086
$$ 45460 86214 211087 338424 318621 141607 55802 -148956 -175831 -177154 -66370 -114456
21899a14456l8541Q3746J7957j1783o8070q710M7292K46183k2852k9557N4148
$$ -114456 -152997 -69251 -51294 -63077 -131147 -139857 -92565 153618 130766 101209 155357
21888A55357J3640n10n165q8235r9792j3393J580j45111J754j16745k0985K8671
$$ 155357 168997 168487 163322 75087 -24705 -38098 -36518 -181629 -179875 -296620 -317605 -288934
21876b88934J55012J30078Q6500O1859L6101n0003l1723J13300m2041l32154j84166
$$ -288934 -133922 -3844 82656 144515 180616 130613 98890 212190 170149 -162005 -346171
21865c46171J4208J32683J07674R8468O3863P156k1262l6921O1771J26367J7260
$$ -346171 -331963 -199280 -91606 6862 70725 77881 56619 19698 81469 207836 225096
21854B25096j42597j29352O6376p0991p3816P4291j0742R8677N9314p3389m3131
$$ 225096 82499 -46853 19523 -51468 -125284 -50993 -61735 36942 96256 22867 -20264
21843b0264k1498j41729j9784J25533J00050P4778M7905J05672j48738o8917o3526
$$ -20264 -41762 -183491 -203275 -77742 22308 97086 144991 250663 101925 33008 -30518
21832c0518M0238K9726L7739M3922k4843o382m7540p8650M4133m5217O4049K8343
$$ -30518 9720 39446 77185 121107 96264 89882 42342 -36308 7825 -37392 26657 55000
21820E5000Q497N8172j59232n0184J0255P7960J43656j05661p1379J29731L1640
$$ 55000 63497 121669 -37563 -87747 -77492 468 144124 38463 -32916 96815 128455
21809A28455n8356o2127J04366J93567m4227j51843o1730m1917O7458j04804j12408
$$ 128455 70099 7972 112338 305905 261678 109835 48105 6188 73646 -31158 -143566
21798a43566L8777K020q0987j06051Q1626J74701Q9429J3849k1090k34573j27737
$$ -143566 -104789 -102769 -183756 -289807 -208181 -33480 55949 69798 48708 -185865 -313602
21787c13602p2004M9239P3019J04614M2596K6875r2113O7741M9195J36131l8720
$$ -313602 -385606 -336367 -263348 -158734 -116138 -89263 -181376 -113635 -64440 71691 32971
21776C2971j18180l0314K9389j778K1341j002n1090j12280j0843J08814J89909
$$ 32971 -85209 -115523 -86134 -87912 -66571 -67573 -118663 -230943 -241786 -132972 56937
21765E6937j7664j12930j03692J89067J07705N5994M6672j27596q6587R1694J0701
$$ 56937 39273 -73657 -177349 11718 119423 175417 222089 94493 7906 99600 110301
21754A10301K4134P0527j553j51024r7591m2286J7598M9715j8793o468J00677
$$ 110301 134435 204962 203409 52385 -45206 -87492 -69894 -20179 -38972 -45440 55237
21743E5237N8370k5662N4466k5907o5110l9642q406m2542k4573K2589J6268j08328
$$ 55237 113607 87945 142411 116504 51394 11752 3346 -39196 -63769 -41180 -24912 -133240
21731a33240P6777R206j5657O1388k1260k4467J7783R8696J4663K4107K7827k5351
$$ -133240 -56463 -47257 -62914 -1526 -22786 -47253 -29470 69226 83889 107996 135823 110472
21719A10472J6225K6514j39457j54142j3553j624Q9327J20412j631j65673n5306
$$ 110472 126697 153211 13754 -140388 -153941 -155565 -66238 54174 52543 -113130 -168436
21708a68436Q4905J53088O6844l4865O193J59351K9486j58682J615K2960N8728
$$ -168436 -83531 69557 136401 101536 107729 267080 296566 137884 139499 162459 221187
21697B21187p763l0527J900J1489j12723k8886o3192q0626n6409j7758n9814j7853
$$ 221187 213424 182897 184797 196286 83563 54677 -8515 -89141 -145550 -163308 -223122 -240975
21685b40975O1525J1708J00019O0170L5806J32209k0567j01906r8529k206N7536
$$ -240975 -179450 -167742 -67723 -7553 28253 160462 139895 37989 -60540 -62746 -5210
21674e210J60637O6068L7185o5966p9825j14824J7457l8695K0910k06312o4208
$$ -5210 155427 221495 258680 192714 112889 -1935 15522 -23173 -2263 -208575 -272783
21663b72783J73911J42810J60027J22806j22576l1438k6486k23464j60069R04
$$ -272783 -98872 43938 203965 326771 204195 172757 146271 -77193 -237262 -236358
21653b36358J13306K5614J9023L068r2673J1768J02467o3188L22J07918N3917
$$ -236358 -123052 -97438 -78415 -75347 -168020 -156252 -53785 -116973 -116651 -8733 45184
21642D5184r2085L1637K4853j17343j7087R135K7094Q576k700L1949j0729L9273
$$ 45184 -46901 -15264 9589 -107754 -124841 -115706 -88612 -80036 -82736 -50787 -61516 -22243
21630b2243k3590M1333K8175N5409m1657l6483o9199j8508M4772o4296Q4287J52353
$$ -22243 -45833 -4500 23675 79084 37427 944 -68255 -86763 -41991 -106287 -22000 130353
21618A30353q4672j67262O8757L5984M0481j4417p5561L4678N9359N7060r3215
$$ 130353 45681 -121581 -52824 -16840 23641 9224 -66337 -31659 27700 84760 -8455
21607h455j3782J82022j92841q5311l4953O9437Q1232N3098n0925q7236L8968
$$ -8455 -22237 159785 -33056 -118367 -153320 -83883 -2651 50447 -478 -87714 -48746
21596d8746n2638j2979K6093Q5790J48206J10806m5293M329l6064l6651K1436
$$ -48746 -101384 -114363 -88270 -2480 145726 256532 211239 215568 179504 142853 164289
21585A64289R57n3253L9214m1314k42232m3995K3079n0604R2928R0476k7647n6749
$$ 164289 165246 111993 151207 109893 -132339 -176334 -153255 -203859 -110931 -20455 -48102 -104851
21573a04851n3357l519K0168O1808k0726k3436M3994M006L5658m9018Q9938m2801
$$ -104851 -158208 -161727 -141559 -79751 -100477 -123913 -79919 -75913 -40255 -89273 665 -42136
21561d2136j35704j4959J47457K8781n1744l7177l1039O803n6894M6961J33648
$$ -42136 -177840 -192799 -45342 -16561 -68305 -105482 -136521 -129718 -186612 -139651 -6003
21550f003M9382R2295n5695r9286l5980K6865m8287j8617P7314N2048r7266J187
$$ -6003 43379 135674 79979 -19307 -55287 -28422 -76709 -95326 -18012 34036 -63230 -62043
21538f2043j03093k4461J33091M508J7115O7236K5527l4289O5492r236M5070j5188
$$ -62043 -165136 -189597 -56506 -51998 -34883 32353 57880 23591 89083 79847 124917 109729
21526A09729M6237J2858n3845j21895m162o0421k8158p0986J11567J97565J2078
$$ 109729 155966 168824 114979 -6916 -11078 -71499 -99657 -170643 -59076 138489 150567
21515A50567L5044o378J6270r4660R3239K5104o3344j49261R563l4040J1910j8817
$$ 150567 185611 179233 195503 100843 194082 219186 155842 6581 16144 -17896 -5986 -24803
21503b4803J7061n1330j5305J5991j00739J00815J7036q5318j3065M1126M9883
$$ -24803 -7742 -59072 -74377 -58386 -159125 -58310 -41274 -126592 -139657 -98531 -48648
21492d8648Q4621R783r1502R0832j73394j40585N3029K02213J20223O9733o5894
$$ -48648 35973 45756 -45746 45086 -128308 -268893 -215864 -13651 106572 176305 110411
21481A10411M7222p1015l7711R3898j02392K232R8683J38010p026q2217j53121
$$ 110411 157633 86618 48907 142805 40413 42645 141328 279338 272312 190095 36974
21470C6974j26492O1327J8748J5033m3380j22724K9574R1626J25761L9317j00565
$$ 36974 -89518 -28191 -9443 5590 -37790 -160514 -130940 -39314 86447 125764 25199
21459B5199j42531Q489J36039Q7731q5192r8315n0829k1527k0410J19631R5079
$$ 25199 -117332 -108843 27196 114927 29735 -68580 -119409 -140936 -161346 -41715 53364
21448E3364m6559n0512j0903L823L9634n8416j762O7754Q6439m446q4436j75924
$$ 53364 6805 -43707 -54610 -50787 -11153 -69569 -71331 -3577 82862 78416 -6020 -181944
21436a81944L595P3781J0879N3842K00874J84369n2934l34691j69043k840k5575
$$ -181944 -178349 -104568 -93689 -39847 161027 345396 292462 -42229 -211272 -214112 -239687
21425b39687Q0283M1972k8673R3264O0278N2903j03995m8733Q6083q9471K7919
$$ -239687 -159404 -117432 -146105 -52841 7437 60340 -43655 -92388 -6305 -95776 -67857
21414f7857l4423J15592J13462j373Q208j05819k06505j7171R5836O496O7525
$$ -67857 -102280 13312 126774 125401 133609 27790 -178715 -195886 -100050 -93554 -26029
21403b6029p7612k5944J0374k0160J55725K1872k0100J2415j3866J8221L4468
$$ -26029 -103641 -129585 -119211 -139371 16354 38226 18126 30541 16675 34896 69364
21392F9364l5232j29476j8927k9058p15L0272K7220R7715k0482j17556J15915
$$ 69364 34132 -95344 -114271 -143329 -144044 -113772 -86552 11163 -9319 -126875 -10960
21381a0960O4013J459l1774M3693k02873j26469R1322J16685K76733N4960j7710
$$ -10960 53053 54512 22738 66431 -136442 -262911 -171589 -54904 221829 276789 259079
21370B59079r6686r5760q6637k2250J0582J2065O3260J26624L7267J8943K5892
$$ 259079 162393 66633 -20004 -42254 -31672 -19607 43653 170277 207544 226487 252379
21359B52379j29936j84107n061J11139j01925N3148M177n8934l3503J18926n6211
$$ 252379 122443 -61664 -66725 44414 -57511 -4363 -186 -59120 -92623 26303 -29908
21348b9908p4215j7893J07335n9858j607m0341j98691n7127J01206J32225R5608
$$ -29908 -104123 -122016 -14681 -74539 -76146 -116487 -315178 -372305 -271099 -138874 -43266
21337d3266R0271o7343R6957n4015j12189l8800P3465j9950K4633N3546O7614
$$ -43266 47005 -20338 76619 22604 -89585 -128385 -54920 -74870 -50237 3309 70923
21326G0923J5449o7161j31388n4183R3133J33994l1812r5084R4513q615q7476
$$ 70923 86372 19211 -112177 -166360 -73227 60767 28955 -66129 28384 19769 -67707
21315f7707R620R3369R574p1391O150R6566j968P6788j37508j15965k8326N7808
$$ -67707 -58087 35282 44856 -26535 -20385 76181 74213 151001 13493 -102472 -130798 -72990
21303g2990M1533N810J67322M5279O019J8221m6890j05413K9656k3098o6851M2574
$$ -72990 -31457 -25647 141675 186954 192973 211194 164304 58891 88547 65449 -1402 41172
21291D1172o0280l4566q4119L788j6472m3959L8586j08425l1741K17786O4101
$$ 41172 -19108 -53674 -137793 -134005 -150477 -194436 -155850 -264275 -296016 -78230 -14129
21280a4129k2472j01299K6706R0341Q2091Q3644n0292O1540j28034p2737l3428
$$ -14129 -36601 -137900 -111194 -20853 61238 144882 94590 156130 28096 -44641 -78069
21269g8069O7889O3851Q0395L178J8656j03466r439k8472l5395K082M8155o0416
$$ -78069 -10180 53671 134066 137244 155900 52434 42995 14523 -20872 -18790 29365 -31051
21257c1051Q640M2936o9738J8243M117J4569l2018j122J06943q3411j04443J7883
$$ -31051 -22411 20525 -49213 -30970 -26853 -12284 -44302 -45424 61519 -21892 -126335 -108452
21245a08452J76656Q691j5135Q157M2523r7609p9823J12434P3147K4159j5126
$$ -108452 68204 76895 61760 69917 112440 14831 -64992 47442 120589 144748 129622
21234A29622j99376P099J20998r3274k4858J08927M4566o1047o2207l7913j01208
$$ 129622 -69754 -62655 58343 -34931 -59789 49138 93704 32657 -29550 -67463 -168671
21223a68671N8283k7083p8520K0270M0870K2736J39644o6827p3353j01431n0240
$$ -168671 -110388 -137471 -215991 -195721 -154851 -132115 7529 -59298 -132651 -234082 -284322
21212b84322J80639m26O9252k7267q8941Q3457L840O9667K0966P1180j6345n8335
$$ -284322 -103683 -104109 -34857 -62124 -151065 -67608 -63768 5899 26865 98045 81700 23365
21200B3365Q3217l5014m8342j7348p7479k5380k0662m5279m899N9004J31414N2838
$$ 23365 106582 71568 23226 5878 -71601 -96981 -117643 -162922 -167821 -108817 22597 75435
21188G5435P7111r851j2518J3545p4952r8770P5230R027L8864J59333l5270o0002
$$ 75435 152546 142695 130177 143722 68770 -30000 45230 54257 93121 252454 217184 157182
21176A57182o5005l4796l4068j33654P1459K21763P3737j97335L6479R2087O049
$$ 157182 92177 57381 23313 -110341 -38882 182881 256618 59283 95762 187849 193898
21165A93898k24982p0197M7424J9001l8577R5501o297J14986N0551M3222r7010
$$ 193898 -31084 -101281 -53857 -34856 -73433 22068 15771 130757 181308 224530 127520
21154A27520o5356m185J176J4852n3678P1652p3695j17198j027J12480Q0391J37805
$$ 127520 62164 57979 59155 74007 20329 91981 18286 -98912 -99939 12541 92932 230737
21142B30737n2715j66989j26773Q899q9188q8324m5028j1167Q9232J87240P028
$$ 230737 178022 11033 -115740 -106841 -196029 -284353 -329381 -340548 -251316 -64076 -57048
21131e7048n2913k5795J62120J77994L9164j52006r2323L4214L0413n2844j5942
$$ -57048 -109961 -135756 26364 204358 243522 91516 -807 33407 63820 10976 -4966
21120d966p8954q6871l034p433o036L6032o2949M7957J02074M8464j51334l9562
$$ -4966 -83920 -170791 -173825 -181258 -187294 -151262 -214211 -166254 -64180 -15716 -167050 -206612
21108b06612o0221L81J1658Q2403M7042N3912J00680Q3429J17518J2145m9284
$$ -206612 -266833 -266452 -254794 -172391 -125349 -71437 29243 112672 230190 242335 193051
21097A93051j45815j15062K8639J8795q2517n7847K4592o421K6699J10037N5526
$$ 193051 47236 -67826 -39187 -20392 -102909 -160756 -136164 -142585 -115886 -5849 49677
21086D9677K9300J07490R469j30589j24771r4954j14164Q4357J72032k1378n7131
$$ 49677 78977 186467 195936 65347 -59424 -154378 -268542 -184185 -12153 -33531 -90662
21075i0662P1075j59764M4408J14292J31525R2752n7667k37374j57938J24174
$$ -90662 -19587 -179351 -134943 -20651 110874 203626 145959 -91415 -249353 -125179
21065a25179R7538p2481j23243k7540J7462Q2243K7651j1442o9153M1748N7429
$$ -125179 -27641 -100122 -223365 -250905 -233443 -151200 -123549 -134991 -204144 -162396 -104967
21054a04967J0788Q176o7637R3295J14469j13181l2140R810o0912O4973P7993
$$ -104967 -94179 -86003 -153640 -60345 54124 -59057 -91197 -81387 -142299 -77326 667
21043F67m4366j3221J4769L4415m6043N7277L167m5289j7828p1304j10715J0568
$$ 667 -43699 -56920 -42151 -7736 -53779 3498 6665 -38624 -56452 -127756 -238471 -227903
21031b27903k6037m310R0910O3522k0519J09259J04173k6837m7743j2351j9817
$$ -227903 -253940 -258250 -167340 -103818 -124337 -15078 89095 62258 14515 2164 -17653
21020a7653m638j65489o053l7959L6335O9098l4421P7955K8197N3145j3549R072
$$ -17653 -22291 -187780 -193833 -231792 -195457 -126359 -160780 -82825 -54628 -1483 -15032 -5960
21008e960O0495j65457j06212l7191m3040P5945J45121Q7991l4640l3743N0081
$$ -5960 54535 -110922 -217134 -254325 -297365 -221420 -76299 11692 -22948 -56691 -6610
20997f610m2161l069K2880l9324L3582M2153k2757j1536P827o3759q6300k5463
$$ -6610 -48771 -51840 -28960 -68284 -34702 7451 -15306 -26842 -19015 -82774 -169074 -194537
20985a94537J2970P7458K3555j45019r7210j0993J41766J08645q9197j37673J07672
$$ -194537 -181567 -104109 -80554 -225573 -322783 -333776 -192010 -83365 -172562 -310235 -202563
20974b02563J40291p8795J4804L8346n2965L2564l3581Q1468J49377q5677j15623
$$ -202563 -62272 -141067 -126263 -87917 -140882 -108318 -141899 -60431 88946 3269 -112354
20963a12354o7220l0314j06364O4676J60886M94N120K3762L5166p2005j58613
$$ -112354 -179574 -209888 -316252 -251576 -90690 -90196 -85076 -61314 -26148 -98153 -256766
20952b56766M6804R4672L5224Q8925N3993r760L9887r0901n3985q2263J01749
$$ -256766 -209962 -115290 -80066 8859 62852 53092 92979 2078 -51907 -134170 -32421
20941c2421j0409p671M3391O349j33911k9158P1118J5092M5261n2275J7738O6313
$$ -32421 -42830 -50501 -7110 -761 -134672 -163830 -92712 -77620 -32359 -84634 -66896 -583
20929e83l4064o5321Q8194n2164J9740J8884j0241J41709R4051k3479j7714m1211
$$ -583 -34647 -99968 -11774 -63938 -44198 -25314 -35555 106154 200205 176726 159012 117801
20917A17801r2930n4155j61533K7040J13722P8121O0530l0608r6107J1227K6825
$$ 117801 24871 -29284 -190817 -163777 -50055 28066 88596 57988 -38119 -26892 -67
20906f7m0254M4510M8011K9632P8968Q0203j22092n9900j26109P237L8101J27368
$$ -67 -40321 4189 52200 81832 160800 241003 118911 59011 -67098 -59861 -21760 105608
20894A05608J11993n0985k0774N8077r9961M1369l8671o6216m1495q129l2384
$$ 105608 217601 166616 145842 203919 103958 145327 106656 40440 -1055 -9184 -41568
20883d1568M294L303n2391P95K2110l2948J4954p2004J3524M3113K4626k5627
$$ -41568 -37274 -33971 -86362 -85567 -63457 -96405 -81451 -153455 -139931 -96818 -72192 -97819
20871i7819J26713J77199k90205l4698J13507Q5332L0013P447m7382P7595k3273
$$ -97819 28894 206093 -84112 -118810 -5303 80029 110042 117489 70107 147702 124429
20860A24429k6340J3824o3723O9296J00673q0980r9287r5297r7832K0649o328
$$ 124429 98089 111913 48190 117486 218159 137179 37892 -57405 -155237 -134588 -140916
20849a40916N723J9775m9845j24179L0390J72113J1621j2286o6149n4977j34604
$$ -140916 -135193 -115418 -165263 -289442 -259052 -86939 -75318 -87604 -153753 -208730 -343334
20838c43334N0401J20079j17384j10185J12870j7339k5634K9252J44370J03177
$$ -343334 -292933 -172854 -290238 -400423 -287553 -304892 -330526 -301274 -156904 -53727
20828e3727n0955j06178P3303Q4679M1630l4407j5837n6482k4882O6719m1684
$$ -53727 -104682 -210860 -137557 -52878 -11248 -45655 -61492 -117974 -142856 -76137 -117821
20817a17821n3098Q592p762M639Q2386M4362j29074j7442J4391L6928J04027J05724
$$ -117821 -170919 -162327 -170089 -165450 -83064 -38702 -167776 -185218 -170827 -133899 -29872 75852
20805G5852P9651p0445j00669k4058n040J35545O118R0633J75262j16333j70830
$$ 75852 155503 85058 -15611 -39669 -44709 90836 96954 187587 362849 246516 75686
20794G5686q9386j30751q6450m7794K6797j2518O2473J36327J5776j0772Q0534
$$ 75686 -13700 -144451 -230901 -278695 -251898 -264416 -201943 -65616 -49840 -60612 19922
20783A9922J21367J9487q4970N009p4469j75831m4798n1629k7687J34470P0924
$$ 19922 141289 160776 75806 80815 6346 -169485 -214283 -265912 -293599 -159129 -88205
20772h8205M6376l6426J1005J6356m5001k0261p9122p470P2220K4582r8413N300
$$ -88205 -41829 -78255 -67250 -50894 -95895 -116156 -195278 -202748 -130528 -105946 -204359 -199059
20760a99059J24202L9117K3699K9294R1749J27805J3749n4475j04796r9321j3336
$$ -199059 -74857 -35740 -12041 17253 109002 236807 250556 196081 91285 -8036 -21372
20749b1372L7691L014k1773L8465Q4639j6066p3438j54769j69097J04062J47443
$$ -21372 16319 19333 -2440 36025 120664 104598 31160 -123609 -292706 -188644 -41201
20738d1201K7101P9438J17500R0118L8483j28542j07946l1768J9893l0018J6697
$$ -41201 -14100 65338 182838 272956 311439 182897 74951 43183 63076 33058 49755
20727D9755k5150j63034j21147J08351K6187P8236J02246N4882p6455o1288j06693
$$ 49755 24605 -138429 -259576 -151225 -125038 -46802 55444 110326 33871 -27417 -134110
20716a34110K5109J3422L4165l7566J816L3641Q6947P6354o3319j31154P304n683
$$ -134110 -109001 -95579 -61414 -98980 -97164 -63523 23424 99778 36459 -94695 -87391 -93074
20704i3074q0139L2933J16256M6952j10199N3618L7681q8838j28302O8957J16860
$$ -93074 -173213 -140280 -24024 22928 -87271 -33653 4028 -84810 -213112 -144155 -27295
20693b7295j24428N6397J03815R1371m8103o4554j15506k7484j9357J01913Q1038
$$ -27295 -151723 -95326 8489 99860 51757 -12797 -128303 -155787 -175144 -73231 7807
20682G807R1453q6725j20771p1159P4613Q0036p8723P5252o4631j22187l5530
$$ 7807 99260 12535 -108236 -179395 -104782 -24746 -103469 -28217 -92848 -215035 -250565
20671b50565J64065J4491J713O6954N840O7782r2818j18895l981k1180J0833m1705
$$ -250565 -86500 -72009 -70296 -3342 2498 70280 -22538 -141433 -145414 -166594 -155761 -197466
20659a97466M4281J5596M5688J25945j4929m8132l3015l5139o4852j4317L2517
$$ -197466 -153185 -137589 -91901 34044 19115 -29017 -62032 -97171 -162023 -176340 -143823
20648a43823q279j3970j8004O5201p993K5165q9127N5754J63301J44855p1889
$$ -143823 -152102 -166072 -184076 -118875 -126868 -101703 -190830 -135076 28225 173080 101191
20637A01191j48706j8069j56065k0364M7498L8092p810J42002K1938j40785n4881
$$ 101191 -47515 -65584 -221649 -242013 -194515 -156423 -164233 -22231 -293 -141078 -195959
20626a95959N3130J2899J31521J39741L5103J1698P3684O4121p2173q2128j01291
$$ -195959 -142829 -129930 1591 141332 176435 188133 261817 325938 253765 171637 70346
20615G0346j04015l8452m1543q8777R2353J15133J22888j02858r5511q7989J5986
$$ 70346 -33669 -72121 -113664 -202441 -110088 5045 127933 25075 -70436 -158425 -142439
20604a42439L6972j4848J3689J39741O2541O8266j8546j02925j2544L4619R205
$$ -142439 -105467 -120315 -106626 33115 95656 163922 145376 42451 29907 64526 73731
20593G3731r616m5448N7460K2378o3947o1886n354m9447K2026M8725m4508j0317
$$ 73731 64115 18667 76127 98505 34558 -27328 -32682 -82129 -60103 -11378 -55886 -66203
20581f6203k5587O0021J52707J8129m4772j12683k3665N5959J04507P1623n2227
$$ -66203 -91790 -31769 120938 139067 94295 -18388 -42053 13906 118413 190036 137809
20570A37809J339L2260l0296j09161p4938j03494l9299M5432N206R4337R7920
$$ 137809 139148 171408 141112 31951 -42987 -146481 -185780 -140348 -135142 -40805 57115
20559E7115j7098p1232j24039m6769j07593M642J24695J00907k133j2476q5527
$$ 57115 40017 -31215 -155254 -202023 -309616 -304974 -180279 -79372 -81505 -93981 -179508
20548a79508Q7148N3853l0679k7560P4219r8564l748O7465p5671J47587p6173
$$ -179508 -92360 -38507 -69186 -96746 -22527 -121091 -124839 -57374 -133045 14542 -61631
20537f1631j07613l0134J21372J06206j17974r2061j53113j85406L720J59228
$$ -61631 -169244 -199378 -78006 28200 -89774 -181835 -334948 -520354 -516634 -357406
20527c57406J03796K23420N2315K2646k7797j40433J6754M6680l4006J04343M1852
$$ -357406 -253610 -30190 22125 44771 16974 -123459 -106705 -60025 -94031 10312 52164
20516E2164o7828k3421j30077p559L1940J34194k6415j3675O3980l895J47428
$$ 52164 -15664 -39085 -169162 -176721 -144781 -10587 -37002 -50677 13303 9408 156836
20505A56836J59142j51623j64003j02846K3138l6720m7575L0954R1665R2982k2411
$$ 156836 315978 164355 352 -102494 -79356 -116076 -163651 -132697 -41032 51950 29539
20494B9539n3674L7540J12606K4364L949K0612o0085r961p2457K0835R155n207
$$ 29539 -24135 13405 126011 150375 154324 174936 114851 104890 32433 53268 62423 57216
20482E7216k0059m3602j28404M0680n9793K7532K1004j11571n0144N6264J78963
$$ 57216 37157 -6445 -134849 -94169 -153962 -126430 -105426 -216997 -267141 -210877 -31914
20471c1914J31120O366R4897J3518q7086k8889j7434n8068p5304K6927M2786n0953
$$ -31914 99206 105572 200469 213987 126901 98012 80578 22510 -52794 -25867 16919 -34034
20459c4034m1371q0854r0178M3674N8516Q6409J58835J85876p1431j01820N0515
$$ -34034 -75405 -156259 -246437 -202763 -144247 -57838 100997 286873 215442 113622 164137
20448A64137l5648k5765K1079q2531l2703j26301J18789J15478k1614K9438o2105
$$ 164137 128489 102724 123803 41272 8569 -117732 1057 116535 94921 124359 62254
20437F2254k46677o3215L3384J20807M7676n1653o989R3990q8107n6820J8974
$$ 62254 -184423 -247638 -214254 -93447 -45771 -97424 -104413 -10423 -98530 -155350 -136376
20426a36376K04710l9857j81303j16738N8086P8788Q3073M3650J4392L5478j1254
$$ -136376 68334 28477 -152826 -269564 -211478 -132690 -49617 -5967 8425 43903 32649
20415C2649o2403j65250Q5422J78534l0474J36830j9494o9870j01223k6054j4681
$$ 32649 -29754 -195004 -109582 68952 38478 175308 155814 85944 -15279 -41333 -56014
20404e6014P2448R7289k3392p2564M1563M1168l544K4833m9120j12472n8184M3256
$$ -56014 16434 113723 90331 17767 59330 100498 96954 121787 72667 -39805 -97989 -54733
20392e4733N8505q0136l808L9773P6265P6500L0265M5846j4670J7418N299j07409
$$ -54733 3772 -76364 -80172 -40399 35866 112366 142631 188477 173807 191225 196524 89115
20380H9115p6462j09160O4063j4754J58178l5105L803J56517p4300m6212M0439
$$ 89115 12653 -96507 -32444 -47198 110980 75875 79678 236195 161895 115683 156122
20369A56122l7300l8375j7462j37759j39474J11198J27084M6244l1966l7060r474
$$ 156122 118822 80447 62985 -74774 -214248 -103050 24034 70278 38312 1252 -8222
20358h222k3677J20161P6154j17608l7827L0476P0345J20366O1555n4412j51061
$$ -8222 -31899 88262 164416 46808 8981 39457 109802 230168 291723 237311 86250
20347H6250j00972j21443j4474J9972R8640J49089k4974k620M5497k9135j18609
$$ 86250 -14722 -136165 -150639 -130667 -32027 117062 92088 89468 134965 105830 -12779
20336a2779p2892p905N6766Q7535N4215m6114J0182Q7715l201j42921J31287k6511
$$ -12779 -85671 -93576 -36810 50725 104940 58826 69008 156723 153522 10601 141888 115377
20324A15377O381n7677M6375j12058j63429n7053O0450J24557p1856n969J06686
$$ 115377 121758 64081 110456 -1602 -165031 -222084 -161634 -37077 -108933 -114902 -8216
20313h216n5799j58091M2961R1347N5447O4616K8665N83q7455p8380J02892K1859
$$ -8216 -64015 -222106 -179145 -87798 -32351 32265 60930 61513 -25942 -104322 -1430 20429
20301B0429O0381J14243R8174L011n5640p1840J05440k6504j59185j70445k6478
$$ 20429 80810 195053 293227 296238 240598 168758 274198 247694 88509 -81936 -108414
20290a08414J09483J04267J26822k0683n9632j66797k7891L3444m2133N4348j09777
$$ -108414 1069 105336 232158 211475 151843 -14954 -42845 -9401 -51534 2814 -106963
20279a06963n9854L4814m5802j7079O5843J00222J7533O6234l347o0584m0024
$$ -106963 -166817 -132003 -177805 -194884 -129041 -28819 -11286 54948 51601 -8983 -49007
20268d9007o8373k6982o4173m4262K8913N5696J06042J31927M1197J25315p3610
$$ -49007 -117380 -144362 -208535 -252797 -223884 -168188 -62146 69781 110978 236293 162683
20257A62683o5065l0655n218j55797P5597R9456l8709n7684l8591k0019l9075
$$ 162683 97618 66963 61745 -94052 -18455 81001 42292 -15392 -53983 -74002 -113077
20246a13077J8825l9859j34634m3735l2612Q35N1361O7430J75175j7776M1701
$$ -113077 -94252 -134111 -268745 -312480 -345092 -344257 -292896 -225466 -50291 -68067 -26366
20235b6366q8431l8129P0621l9018j08816K7507J47119P1477M1591P916j29133
$$ -26366 -114797 -152926 -82305 -121323 -230139 -202632 -55513 15964 57555 65471 -63662
20224f3662n3177R9827P5468J7659R5137O2397N3980p1371k50798j0998J07678
$$ -63662 -116839 -17012 58456 76115 171252 233649 287629 216258 -34540 -45538 62140
20213F2140N9654k2226j4274j4711n8614K2347l7913o1630L1666l2357L9507l5157
$$ 62140 121794 99568 85294 70583 11969 34316 -3597 -65227 -33561 -65918 -26411 -61568
20201f1568j384L0546O3377P6053M8558M3379j28142k4228o8654l876M4549J4831
$$ -61568 -62952 -32406 30971 107024 155582 198961 70819 46591 -22063 -25939 18610 33441
20189C3441M2835r5444m988j42807j621K705R4100P5139O1461O6777j33212j3249
$$ 33441 76276 -19168 -24156 -166963 -168584 -165879 -71779 3360 64821 131598 -1614 -14863
20177a4863O8091M3002K2845j02117j4869q877m6750j30319j38147l2229J41220
$$ -14863 53228 96230 119075 16958 2089 -6788 -53538 -183857 -322004 -354233 -213013
20166b13013Q0991K0115K384L805R864r8244J2035J45089Q6273L1314r1267o1836
$$ -213013 -132022 -111907 -109523 -105718 -95854 -194098 -182063 -36974 49299 80613 -10654 -72490
20154g2490q9336N6124l6734r860M092m043j06087J082k9434M4119K76430O0688
$$ -72490 -161826 -105702 -142436 -152296 -148204 -152247 -258334 -257252 -286686 -242567 33863 94551
20142I4551j6465O4568J9165r2942j51141N2931J60172j15113j42954q565R4640
$$ 94551 78086 142654 161819 68877 -82264 -29333 130839 15726 -127228 -135793 -41153
20131d1153M5037L9213j70795k21988n5734M1974J67959K50277N1394k8249M6958
$$ -41153 3884 43097 -127698 -349686 -405420 -363446 -195487 54790 106184 77935 124893
20120A24893R8884j10971j03563N835M540N24P0124J5456j70172p1917r8570r6360
$$ 124893 223777 112806 9243 15078 19618 20142 90266 105722 -64450 -136367 -234937 -331297
20108c31297r3242Q6902J37123q167p1381N7122Q7762R6622L660o352q3581j23918
$$ -331297 -424539 -337637 -200514 -208681 -280062 -222940 -135178 -38556 -34896 -41248 -124829 -248747
20096b48747m2447K7093R2940J3594K8154J66605J8130o4882j93469j41604o7253
$$ -248747 -291194 -264101 -171161 -157567 -129413 37192 55322 -9560 -203029 -344633 -411886
20085d11886Q2285J92349K56026n6478j78986o89J04606J25370L9996L5875m8619
$$ -411886 -329601 -137252 118774 62296 -116690 -117379 -12773 112597 152593 188468 139849
20074A39849j38463P98J65568P0192J6079j09117j57408K4080M0655J01482O5837
$$ 139849 1386 2184 167752 237944 254023 144906 -12502 11578 52233 153715 219552
20063B19552j1652k21621j89887J21913P0540j59715N3921K39016n5010j75026
$$ 219552 207900 -13721 -203608 -81695 -11155 -170870 -116949 122067 67057 -107969
20053a07969j50255J07879O6396K5039O2534r522p2260j26321P8380J41242L0519
$$ -107969 -258224 -150345 -83949 -58910 3624 -5898 -78158 -204479 -126099 15143 45662
20042D5662J6394o7971n7037K9566O8905k5215P332r2425o7359K9482O4900m2053
$$ 45662 62056 -5915 -62952 -33386 35519 10304 17636 -74789 -142148 -112666 -47766 -89819
20030h9819p3620p830J11082Q2724M8645k09938L4559R3009m7861Q1597L4739
$$ -89819 -163439 -171269 -60187 22537 71182 -138756 -104197 -11188 -59049 22548 57287
20019E7287n6452l011l2308O267j85004N8485Q9180R598J9230k2095j70101J9991
$$ 57287 835 -2176 -34484 -28217 -213221 -154736 -65556 -55958 -36728 -58823 -228924 -208933
20007b08933J88968o3737r7655K9318m8276l774K662J44394M7215J5234p1975
$$ -208933 -19965 -83702 -181357 -152039 -200315 -204089 -201427 -57033 -9818 5416 -66559
19996f6559l7577L3673j5975j5987M488J3450j17030J32990J66615R5403l1769
$$ -66559 -104136 -70463 -86438 -102425 -97937 -84487 -201517 -68527 98088 193491 161722
19985A61722j43956m8492j6949N3108J8635p806m3336R0610J6568P596o0246J961
$$ 161722 17766 -30726 -47675 5433 24068 16262 -27074 63536 80104 87700 27454 29415
19973B9415l2189q5912J03429M628p7603k16574j7200J60167J62394q6035N2811
$$ 29415 -2774 -88686 14743 19371 -58232 -274806 -292006 -131839 30555 -55480 -2669
19962b669k5010o5215M522m6285m6311o1808O9920l7742N5420J04040Q7032O6197
$$ -2669 -27679 -92894 -88372 -134657 -180968 -242776 -172856 -210598 -155178 -51138 35894 102091
19950A02091q7511k39983r8930K6334J05173K4678k5693N092J7806k2158R787
$$ 102091 14580 -225403 -324333 -297999 -192826 -168148 -193841 -188749 -170943 -193101 -183314
19939a83314K2382P1905J23015L7439n6370N3885K629l6880n5343n8430M6637
$$ -183314 -160932 -89027 33988 71427 15057 68942 71571 34691 -20652 -79082 -32445
19928c2445O5362O5036j7521l0434n0761K1004O2140M6567p8519J77831L7966
$$ -32445 32917 97953 80432 49998 -763 20241 82381 128948 50429 228260 266226
19917B66226q5426p189J0016j52136m0157J7305q0509L2045j242j01708k2435
$$ 266226 180800 173611 183627 31491 -8666 8639 -71870 -39825 -41067 -142775 -165210
19906a65210r2594J6815o6277k3670J37573J8086R1367J01847M4181J3283q6434
$$ -165210 -257804 -240989 -307266 -330936 -193363 -175277 -83910 17937 62118 75401 -11033
19895a1033p3435L2244J9436J8199J03105j14042N923k7673P8130j18884m5387
$$ -11033 -84468 -52224 -32788 -14589 88516 -25526 -19603 -47276 30854 -88030 -133417
19884a33417O6957L3480q9251j1783J36668J30504l9737j95519J17538K9029j9773
$$ -133417 -66460 -32980 -122231 -134014 2654 133158 93421 -102098 15440 44469 24696
19873B4696k1166r5907j62376j15620R2470P2898R6091N8536l9084K6410R5531
$$ 24696 3530 -92377 -254753 -370373 -277903 -205005 -108914 -50378 -89462 -63052 32479
19862C2479l7155r6239p2023k754J8615O0070O3787j9705j3895N0008R5919p630
$$ 32479 -4676 -100915 -172938 -175692 -157077 -97007 -33220 -52925 -66820 -16812 79107 71477
19850G1477l5084l9587K6476j11970J44055K7573m1397J07343J0449l6406p2836
$$ 71477 36393 -3194 23282 -88688 55367 82940 41543 148886 159335 122929 50093
19839E0093m6681r4452N822K5067m930M1888J277L296m5412l6552p595R7988M020
$$ 50093 3412 -91040 -85218 -60151 -65081 -23193 -21916 -18620 -64032 -100584 -108179 -10191 -6171
19826f171L6219K3546l6856M5391j1358J7837M7677M0468J250k60667p3696P8551
$$ -6171 30048 53594 16738 62129 50771 68608 116285 156753 158003 -102664 -176360 -97809
19814i7809J38423j35992k8553K5388M7406L9900q5040R0083J32811Q2299j92855
$$ -97809 40614 -95378 -123931 -98543 -51137 -11237 -96277 -6194 126617 208916 16061
19803A6061j70623j16016k5759P0595M2656N201R0636N4343J03346n4270j71594
$$ 16061 -154562 -270578 -296337 -225742 -183086 -177885 -87249 -32906 70440 16170 -155424
19792a55424N6329J88515R444N4090l7425L5595r9976K6935k4612O3606j3556
$$ -155424 -99095 89420 98864 152954 115529 151124 51148 78083 53471 117077 103521
19781A03521m5872l4438r101l2893j2425J8629L6735J5439Q85l5809N8083J14097
$$ 103521 57649 23211 14110 -18783 -31208 -12579 24156 39595 40480 4671 62754 176851
19769A76851q861j7505n8782j03525j32190J05926R8452L641l4805P8055Q1332
$$ 176851 167990 150485 91703 -11822 -144012 -38086 60366 64007 29202 107257 188589
19758A88589o850p7263j28243R1027R5685J60174O0195j33093k58475j12899n1064
$$ 188589 181739 104476 -23767 67260 162945 323119 383314 250221 -8254 -121153 -172217
19747a72217P4156O2270M1588n8896n6705q236Q9698N0656M0935n6072j00141
$$ -172217 -98061 -35791 5797 -53099 -109804 -118040 -28342 22314 63249 7177 -92964
19736i2964l0090O179J5568P9155q6226J839L2143K3471l2264r178o6870n5190
$$ -92964 -123054 -116875 -101307 -22152 -108378 -106539 -74396 -50925 -83189 -92367 -159237 -214427
19724b14427J5033q0308P9873J42889N9547m3006r601R5915j11249p3333K2578
$$ -214427 -199394 -279702 -199829 -56940 2607 -40399 -50000 45915 -65334 -138667 -116089
19713a16089N3042p0482O3045Q1232N0701l432l3240j4299o740O1924r9323n9622
$$ -116089 -63047 -133529 -70484 10748 61449 58017 24777 10478 3738 65662 -33661 -93283
19701i3283L0837K469P8758N4199m3079q8557K1158J31317N3384K235j25303K8065
$$ -93283 -62446 -59977 18781 72980 29901 -58656 -37498 93819 147203 149438 24135 52200
19689E2200J4755L3621j8003M0238P3988J01479o1485k8867k2388J3463L4061
$$ 52200 66955 100576 82573 122811 196799 298278 236793 207926 185538 199001 233062
19678B33062r0747K7585M7150j49978p5285Q1265L0170M2934l5546m2261N3931
$$ 233062 142315 169900 217050 67072 -8213 73052 103222 146156 110610 68349 122280
19667A22280L435l9609L0858P4043P618j70984j64541J14516j0100N7369J631
$$ 122280 125715 86106 116964 191007 198625 27641 -136900 -22384 -32484 24885 26516
19656B6516M7023l498M4431o317J09644K2828k2454j7452n4690J1900j20669J09739
$$ 26516 73539 70041 114472 108155 217799 240627 218173 200721 146031 157931 37262 147001
19644A47001J14752k2589j63337j19840O0890J31896J38515J02146j07015j8248
$$ 147001 261753 239164 75827 -44013 16877 148773 287288 389434 282419 264171
19634B64171N2799J04437j51439j02535P3603l5788N6587R8809j9814N9012J75455
$$ 264171 316970 421407 269968 167433 241036 205248 261835 360644 340830 399842 575297
19623E75297K16943Q8603Q8357K05851r540J8097k5652L4333J62593N1759J06988
$$ 575297 792240 880843 969200 1175051 1165511 1183608 1157956 1192289 1354882 1406641 1513629
19612A513629N7171l6479j3588O6170M0326k34488j42972J2503L0615m5644r5157
$$ 1513629 1570800 1534321 1520733 1586903 1627229 1392741 1249769 1262272 1292887 1247243 1152086
19601A152086j24623n8783m6562j65546r4851n9173j38585O8464j25226j41608
$$ 1152086 1027463 968680 922118 756572 661721 602548 463963 532427 407201 265593
19591B65593M7234J44219m8206L2018m2033l4183R2664r3922k52234O087k4101
$$ 265593 312827 457046 408840 440858 398825 364642 457306 363384 111150 117237 93136
19580I3136j94977j68224j01752k9729J4119J51828O5838K36074N3687r195K392
$$ 93136 -101841 -270065 -371817 -401546 -387427 -235599 -169761 66313 120000 110805 113197
19569A13197O3780r7526l8966m2043k8971J24072M7442J47693m6551K2353O4265
$$ 113197 176977 79451 40485 -1558 -30529 93543 140985 288678 242127 264480 328745
19558C28745m0232p8573R008L2375M6454l7677o8490j7046l1482l7687q2333M0813
$$ 328745 288513 209940 218948 251323 297777 260100 191610 174564 143082 105395 23062 63875
19546F3875Q1887l452J3407N9087q0854o1874l4219J7300J54787o5845o361q6080
$$ 63875 145762 142310 155717 214804 133950 72076 37857 55157 209944 144099 137738 51658
19534E1658K3787M7335j00124j2265L6219m5612J5014Q9110J8567O1342q663m1264
$$ 51658 75445 122780 22656 10391 46610 998 16012 105122 123689 185031 176368 135104
19522A35104m15R3509K0727o9908n5810n1985J1578o1563J15004L1014j91504
$$ 135104 134689 228198 248925 179017 123207 71222 82800 21237 136241 167255 -24249
19511b4249K4807P4214J1201L826r993M3927Q6174J9995o0007m2858m3105r6360
$$ -24249 558 74772 85973 89799 79806 123733 209907 229902 169895 127037 83932 -12428
19499a2428L09M3607O018m0908J11100p4495o5529K3023K7539J05319P7393P8160
$$ -12428 -12119 31488 37506 -3402 107698 33203 -32326 -9303 18236 123555 200948 279108
19487B79108o7329j14798o2937K4708L8144J44977j13562j79343O8969O3320O5011
$$ 279108 211779 96981 34044 58752 96896 241873 128311 -51032 17937 81257 146268
19476A46268l8660J1893Q4431L9611j26119j06275Q6459J17755P9274q2823n2894
$$ 146268 107608 119501 203932 243543 117424 11149 97608 215363 294637 211814 158920
19465A58920o196J64139O4952J1221P6950m7001j0135r4337P8089p2731q6074
$$ 158920 152724 316863 381815 393036 469986 422985 412850 318513 396602 323871 237797
19454B37797n500j16765r5850O5005j3266j33489o960q3934m701J25490j5115
$$ 237797 232297 115532 19682 84687 71421 -62068 -69028 -152962 -157663 -32173 -47288
19443d7288N7352l1604N5330K2254R8763K0382O6617K7227j02862m0605q85p1675
$$ -47288 10064 -21540 33790 56044 154807 175189 241806 269033 166171 125566 124681 53006
19431E3006j2580J50975L3759j16114k5304J05961J13513j56651p3158J3767o1455
$$ 53006 40426 191401 225160 109046 83742 189703 303216 146565 73407 87174 25719
19420B5719n8825N6739l8047N3297N8355j9623n9081j5980J09220l5606j15491
$$ 25719 -33106 23633 -14414 38883 97238 77615 18534 2554 111774 76168 -39323
19409c9323P4095J21475J27265L9546j0684n1186j15522j17467j8404o0261K6405
$$ -39323 34772 156247 283512 323058 312374 261188 145666 28199 9795 -50466 -24061
19398b4061k8195j9718J08841m6295k9426N9878k9952L6488L6832J7656O8373
$$ -24061 -52256 -71974 36867 -9428 -38854 21024 -8928 27560 64392 82048 150421
19387A50421l1310k41268L7539j8620m6148m8007J04960J53993J20598N3175J03284
$$ 150421 119111 -122157 -84618 -103238 -149386 -197393 -92433 61560 182158 235333 338617
19376C38617r6795m9273p4154J0344P6914K9169j11029o0317O0800O4090m4922
$$ 338617 241822 192549 118395 128739 205653 234822 123793 63476 124276 188366 143444
19365A43444P0924J5700K1746K6408o9184j20536p2026O4870J59559J45836P5720
$$ 143444 214368 230068 251814 278222 209038 88502 16476 81346 240905 386741 462461
19354D62461M9572J59440L46811K03197J59244R4342j33618r2455j55923j88804
$$ 462461 512033 671473 1018284 1221481 1380725 1475067 1341449 1248994 1093071 904267
19344I04267j21851m4456k3423l6081j86572j50505L2470q7894N5849J02884n9357
$$ 904267 782416 737960 714537 678456 491884 341379 373849 285955 341804 444688 385331
19333C85331N9756J05977M4515J60054K10476J83467M9574J34186J10683J02232
$$ 385331 445087 551064 595579 755633 966109 1149576 1199150 1333336 1444019 1546251
19323A546251k5259j41151q5068k05288k19949j94834j40833j33984j22420m4768
$$ 1546251 1520992 1379841 1294773 1089485 869536 674702 533869 399885 277465 232697
19313B32697J30044m5606L979m1251n877j14380j0669O0634R8067Q5213K2930
$$ 232697 362741 317135 321114 279863 273986 159606 148937 209571 307638 392851 415781
19302D15781p3258m9684r9497J680Q5189N8550o5881L3426J01558q777J5354P2615
$$ 415781 342523 292839 193342 195022 280211 338761 272880 306306 407864 399087 414441 487056
19290D87056o0177j97241m1176k699n0947J09725j28423J5966O4335m2833J33578
$$ 487056 426879 229638 188462 185763 134816 244541 116118 132084 196419 153586 287164
19279B87164M5114l408j09154k00254k6589P2263q0657K3519N0796N6562J0569
$$ 287164 332278 328870 219716 19462 -7127 65136 -15521 7998 58794 115356 125925
19268A25925L7244m7806k0875Q8275J49187M1467q8383j22996j40761j7170J3029
$$ 125925 163169 115363 94488 182763 331950 373417 285034 162038 21277 4107 17136
19257A7136r5309J51583J17648j4538Q4429n6078o7328j15968J75548J72996j08774
$$ 17136 -78173 73410 191058 176520 260949 204871 137543 21575 197123 370119 261345
19246B61345j19082n6328Q0111P0522J04123m1948m3741O17L4194p1398l9905
$$ 261345 142263 85935 166046 236568 340691 298743 255002 255619 289813 218415 178510
19235A78510j1086Q5114L8292J5310N3583M7832K5544r0839j08761O422J21346
$$ 178510 167424 252538 290830 306140 359723 407555 433099 342260 233499 239921 361267
19224C61267p4413r8658n4278o4793J20115n8540q481J1697J0197m073N5819j359
$$ 361267 286854 188196 133918 69125 189240 130700 122219 133916 144113 140040 195859 194500
19212A94500q5705J37516J42699n8634k4028p5725K9491O6575k08L2883O8936
$$ 194500 108795 246311 389010 330376 306348 230623 260114 326689 326481 359364 428300
19201D28300M4130P8952o4670j27644p9648j4800R9203O0313K5267j2514j69680
$$ 428300 472430 551382 486712 359068 279420 264620 363823 424136 449403 436889 267209
19190B67209o5254N3217M6694j9926l038J22412R3015O8244L0071j09960k8121
$$ 267209 201955 255172 301866 281940 278902 401314 494329 562573 592644 482684 454563
19179D54563j30313j07506q8400Q2098Q6443J17768M9936o8627j15062j18485
$$ 454563 324250 216744 128344 210442 296885 414653 464589 395962 280900 162415
19169A62415l1360J15807M190P1379L5940j63706r1952O7178P8459J50410J21690
$$ 162415 131055 246862 251052 322431 358371 194665 102713 169891 248350 398760 520450
19158E20450m3669O1348O2427m3728k93511j24975Q5049J22907o2579M0457J44242
$$ 520450 476781 538129 600556 556828 263317 138342 223391 346298 283719 324176 468418
19147D68418n5608j56041l5588J50505J52754J53j39146O562K09289N4047j10499
$$ 468418 412810 256769 221181 371686 524440 524593 385447 392009 601298 655345 544846
19136E44846o1655j07282o116J5248m4064O574Q823J18894M4431j74462K2123
$$ 544846 483191 375909 369793 385041 340977 347551 356374 475268 519699 345237 367360
19125C67360R3368Q6593l8632L173p1274L4979L5796j18619o4313L5636n116R4680
$$ 367360 460728 547321 508689 511862 440588 475567 511363 392744 328431 364067 358951 453631
19113D53631L0411m1360j21705l3651N6467M9425l042k5131j37644j2908k2493
$$ 453631 484042 442682 320977 287326 343793 393218 390176 365045 227401 214493 192000
19102A92000K330J48806R7103J62766L6903l6155j06938r5598n4895P3966J02266
$$ 192000 194330 343136 440239 603005 639908 603753 496815 401217 346322 420288 522554
19091E22554Q5451O0256J23337K0974K6658K34269J32606J01889r0059n2144L7792
$$ 522554 608005 668261 791598 812572 839230 1073499 1206105 1307994 1217935 1165791 1203583
19080A203583k8887k1480l7431K663L9034n3750J96735K9865J04408L0317J27057
$$ 1203583 1174696 1153216 1115785 1118448 1157482 1103732 1300467 1330332 1434740 1465057 1592114
19069A592114k0500J1119p3002j72841r7365n2518p0378p0602Q2694J42995m5918
$$ 1592114 1571614 1582733 1509731 1336890 1239525 1187007 1116629 1046027 1128721 1271716 1225798
19058A225798r5454m180j8151P0894j9333k4413j49023p258M2143m5393M7242
$$ 1225798 1130344 1126164 1108013 1178907 1159574 1135161 986138 978880 1021023 975630 1022872
19047A022872J0301Q4056j7780j317O7742J07193r5465j21356p545J30921N0471
$$ 1022872 1033173 1117229 1099449 1098132 1165874 1273067 1177602 1056246 1048701 1179622 1230093
19036A230093n6434J33327J06675m2232p0344N7665J20962N0560K5281J36593
$$ 1230093 1173659 1306986 1413661 1371429 1301085 1358750 1479712 1530272 1555553 1692146
19026A692146O6696O4300L4984n0772N222M7759J59054J38797n2868J46351m5619
$$ 1692146 1758842 1823142 1858126 1807354 1812576 1860335 2019389 2158186 2105318 2251669 2206050
19015B206050M7081K1569J42252J46869J25525K50981L207J51815J95029J08818
$$ 2206050 2253131 2274700 2416952 2563821 2689346 2940327 2943534 3095349 3290378 3399196
19005C399196J31470J48942J30263J42740J36446K54334L52761L04532L25029
$$ 3399196 3530666 3679608 3809871 3952611 4089057 4343391 4696152 5000684 5325713
18996E325713N16597N01816L79261L60642L46672L08181L39618O27989N78592
$$ 5325713 5842310 6344126 6723387 7084029 7430701 7738882 8078500 8706489 9285081
18987I285081N20613O10610J015989J140684J324545J858612K514403L378980
$$ 9285081 9805694 10416304 11432293 12572977 13897522 15756134 18270537 21649517
18979B1649517M817013P493423J2265750K0001621K8375610L2165417L2088855
$$ 21649517 26466530 33959953 46225703 66227324 94602934 126768351 158857206
18972A58857206L7915248M3084543K4350301p095558j3201667M896794P885872
$$ 158857206 196772454 239856997 264207298 257111740 243910073 248806867 256692739
18965B56692739j4032313k5404588r604207P674598J8244958L1844830L0202856
$$ 256692739 242660426 217255838 207651631 215326229 233571187 265416017 295618873
18958B95618873J346177k3616944j5543931o87548j4060451m2217347m9655721
$$ 295618873 296965050 273348106 257804175 257116627 243056176 200838829 151183108
18951A51183108l4803729k1045959j3517453r036854o474475n143849m300045
$$ 151183108 116379379 95333420 81815967 72779113 66304638 61160789 56860744
18944E6860744l465876k936220k792771k570862k350346j891139j656643j662022
$$ 56860744 53394868 50458648 47665877 45095015 42744669 40853530 39196887 37534865
18936C7534865j463924j545276j488707j326182j147753j024217r79209j082222
$$ 37534865 36070941 34525665 33036958 31710776 30563023 29538806 28559597 27477375
18928B7477375r31632o58461p31863o84000n57236p03175p78499q43073p38404
$$ 27477375 26545743 25887282 25155419 24471419 23914183 23211008 22432509 21589436 20851032
18919B0851032n60198l85636l57524n42067m00295k23133l00218m41705l97368
$$ 20851032 20290834 19905198 19547674 19005607 18605312 18382179 18081961 17640256 17242888
18910A7242888n47211n95292m09946l76114k66966k51366l37622l68840k44852
$$ 17242888 16695677 16100385 15690439 15314325 15047359 14795993 14458371 14089531 13844679
18901A3844679k68304k01531k75381l11501m53768l49432m42440l09653l52035
$$ 13844679 13576375 13374844 13099463 12787962 12334194 11984762 11542322 11232669 10880634
18892A0880634l03426k94590j45676k37986j89769n3080j83304l06844j49046
$$ 10880634 10577208 10282618 10136942 9898956 9709187 9656107 9472803 9165959 9016913
18883I016913j75271J5118l9155j3235J2393J66390J60670O6961l4613l0050k02301
$$ 9016913 8841642 8856760 8817605 8804370 8816763 8983153 9143823 9210784 9176171 9146121 8943820
18872H943820k78840n21454l80719k76112q6718p4668k40033j19513r6732j14804
$$ 8943820 8664980 8143526 7762807 7486695 7399977 7325309 7085276 6965763 6869031 6754227
18862F754227j81432j52116j11611j14305m7860K2272j05239n2857l8576k1711
$$ 6754227 6572795 6420679 6309068 6194763 6146903 6169175 6063936 6011079 5972503 5950792
18852E950792l3867Q6427O6699J88333K88910K39930L51696L02193K0745m58486
$$ 5950792 5916925 6003352 6070051 6258384 6547294 6787224 7138920 7441113 7461858 7003372
18842G003372l56605q9440O4953k6969J41545L96403M73073K38457L76263L63530
$$ 7003372 6646767 6557327 6622280 6595311 6736856 7133259 7606332 7844789 8221052 8584582
18832H584582K72978M66225O63038P41197Q43962J025084J339504J511210J390128
$$ 8584582 8857560 9323785 9986823 10728020 11571982 12597066 13936570 15447780 16837908
18823A6837908J756695K068080K310231L460584M651675O499161J0376675J7851668
$$ 16837908 18594603 20662683 22972914 26433498 31085173 37584334 47961009 65812677
18815F5812677L2028442N0507951N7290745M3436762M1147020N4948377K750243
$$ 65812677 97841119 148349070 205639815 249076577 290223597 345171974 347922217
18808C47922217q7837995q3966655m8207550k7643683j6964220j0775932o931531
$$ 347922217 260084222 176117567 127910017 100266334 83302114 72526182 65594651
18801F5594651m866465l946905k693529j257185K871J250104K364721L983733
$$ 65594651 60728186 56781281 54087752 52830567 52833438 54083542 56448263 60431996
18793F0431996O638252J1082113J9113948L4030492N4151311O1430386M6521960
$$ 60431996 67070248 78152361 97266309 131296801 185448112 246878498 293400458
18786B93400458M4187311N7748452N30907r7886340r4635603n4785974l1723936
$$ 293400458 337587769 395336221 395867128 297980788 203345185 148559211 116835275
18779A16835275j9630669j2944532r058441p019383n623701m702580l970210l091940
$$ 116835275 97204606 84260074 75201633 68182250 62558549 57855969 53885759 50793819
18771E0793819k389429j930881j864557j929417j807881j767532k346651k372214
$$ 50793819 48404390 46473509 44608952 42679535 40871654 39104122 36757471 34385257
18763C4385257j946742j624660j301095j215538j169237j092315q86398r05000
$$ 34385257 32438515 30813855 29512760 28297222 27127985 26035670 25149272 24244272
18755B4244272o49896m20987k78097l30536l87385l20424m82095j079185j076094
$$ 24244272 23594376 23173389 22895292 22564756 22177371 21856947 21374852 20295667 19219573
18746A9219573q71067n90686m96841n47203l44951m67976n93855n08764l55206
$$ 19219573 18348506 17757820 17260979 16713776 16368825 15900849 15306994 14798230 14443024
18737A4443024l77787n17069l25384l43986l34760k97474l12360k85769l43279
$$ 14443024 14065237 13548168 13222784 12878798 12544038 12246564 11934204 11648435 11305156
18728A1305156k00997k61725l61988j57136j74149k53001k42829k82778k73852
$$ 11305156 11104159 10842434 10480446 10323310 10149161 9896160 9653331 9370553 9096701
18719I096701j77189j91832j53105k28509k62797j79394k08513j79759k73711
$$ 9096701 8919512 8727680 8574575 8346066 8083269 7903875 7695362 7515603 7241892
18710G241892k10911q9659l7749j62843j12224m8287j01512r2756j7543j06706
$$ 7241892 7030981 6941322 6903573 6740730 6628506 6580219 6478707 6385951 6368408 6261702
18700F261702k49446k96663j41462j45706j45061j14906j35097j49124J5700k3941
$$ 6261702 6012256 5715593 5574131 5428425 5283364 5168458 5033361 4884237 4899937 4875996
18690D875996k00124k45548j56531l3527L0302k5477n4124j10014k68887j04635
$$ 4875996 4675872 4430324 4273793 4240266 4270568 4245091 4190967 4080953 3812066 3707431
18680C707431O5179o657k59636j41170o8229M8334J63783m9144j61518j57977
$$ 3707431 3772610 3765953 3506317 3365147 3296918 3345252 3509035 3459891 3298373 3140396
18670C140396n2578k7000p5318l7566l3719j01689k05657O8483j80166j41373
$$ 3140396 3087818 3060818 2985500 2947934 2914215 2812526 2606869 2675352 2495186 2353813
18660B353813n0501j77063O4770P0021K3667r3164p914K6704K08697m5176j09127
$$ 2353813 2303312 2126249 2191019 2261040 2284707 2191543 2183629 2210333 2419030 2373854 2264727
18649B264727m7415M5605k5483j91375j20061K536k322K0925n3578L3874J03926
$$ 2264727 2217312 2262917 2237434 2046059 1925998 1928534 1926212 1947137 1893559 1927433 2031359
18638B031359j6647p4318J2205q8404m9491j00936M1256q792j34913L0135K5943
$$ 2031359 2014712 1940394 1952599 1864195 1814704 1713768 1755024 1746232 1611319 1641454 1667397
18627A667397k7896j03499r1064l0251q4090m6151J5185j66772p2254j43551R4378
$$ 1667397 1639501 1536002 1444938 1414687 1330597 1284446 1299631 1132859 1060605 917054 1011432
18616A011432N5797j8362J33971J77942Q5930q5605j77517J13720Q0143j27728
$$ 1011432 1067229 1048867 1182838 1360780 1446710 1361105 1183588 1297308 1377451 1249723
18606A249723j39935j29094J05432J57385o6193j19411J6430k6529M5899o4292
$$ 1249723 1109788 980694 1086126 1243511 1177318 1057907 1074337 1047808 1093707 1029415
18596A029415q8233K6733q800K0706M2966K9915j6473l0170P4427J5924J8221
$$ 1029415 941182 967915 959115 979821 1022787 1052702 1036229 1006059 1080486 1096410 1114631
18585A114631l9130o227k1889k5800k2600o2860p2484J1684K0027k2687J5957
$$ 1114631 1075501 1069274 1047385 1021585 998985 936125 863641 875325 895352 872665 888622
18574H88622J59355J80428O4566j94242j93871J41064P5637k17080r002N6350
$$ 888622 1047977 1228405 1292971 1098729 904858 1045922 1121559 904479 895477 951827
18564I51827n6260k19731J69781Q7767K4041p9227j20727n5743O4008J5177l3177
$$ 951827 895567 675836 845617 933384 957425 878198 757471 701728 765736 780913 747736
18553G47736J12348J66429K2964j03027j01032m8950l1029k0804n9664n9789J5202
$$ 747736 860084 1026513 1049477 946450 845418 796468 765439 744635 684971 625182 640384
18542F40384M0083J5432J22090O2867k7697j22534o1707l0464k2818K3713P8886
$$ 640384 680467 695899 817989 880856 853159 730625 668918 638454 615636 639349 718235
18531G18235j65321Q7134J31394o1130J03109P8775l2740j51931J7626j35110
$$ 718235 552914 640048 771442 710312 813421 892196 859456 707525 725151 590041
18521E90041j12272J5206Q0007l5242L666j17490M8699J9611q3733N4069m2136
$$ 590041 477769 492975 572982 537740 541406 423916 472615 492226 408493 462562 420426
18510D20426k2363n36K24n3173p9841P4564o8125j72495O5961K7755O7185N1223
$$ 420426 398063 397527 397751 344578 264737 339301 271176 98681 164642 192397 259582 310805
18498C10805K0889J6345j21105k3033K4248N5795K02258J8904o9847n1368J19286
$$ 310805 331694 348039 226934 203901 228149 283944 486202 505106 435259 383891 503177
18487E03177J85388K54879j8087l4711J7403l8363p2316j37646j39810j74002
$$ 503177 688565 943444 925357 890646 908049 869686 797370 659724 519914 345912
18477C45912L8122L5612o5068R2831j7337K6913M3664P5811L6533l8667J24359
$$ 345912 384034 419646 354578 447409 430072 456985 500649 576460 612993 574326 698685
18466F98685R8578j27614N503P7719J12402l1894M267M5292J88996K1861j3908
$$ 698685 797263 669649 675152 752871 865273 833379 837646 882938 1071934 1093795 1079887
18455A079887l4887r7308j2084O9755J7586K7767l0485l1276R399j6136j00612
$$ 1079887 1045000 947692 935608 1005363 1022949 1050716 1020231 988955 998354 982218 881606
18444H81606L5909R1139J03367j79757j4371J09082L259J08308p6301N587R7384
$$ 881606 917515 1008654 1112021 932264 917893 1026975 1030234 1138542 1062241 1067828 1165212
18433A165212k9128j59297o5089K4985N4149k6267J46185Q6283O4586M6589K2728
$$ 1165212 1136084 976787 911698 936683 990832 964565 1110750 1197033 1261619 1308208 1330936
18422A330936q7637n2935l8821l1493N3013M5286P9890J00066N6495O2725k6092
$$ 1330936 1243299 1190364 1151543 1120050 1173063 1218349 1298239 1398305 1454800 1517525 1491433
18411A491433j48083R4821J12105Q1768j24896k29912M0476P0600P1444R4898
$$ 1491433 1343350 1438171 1550276 1632044 1507148 1277236 1317712 1388312 1459756 1554654
18401A554654K26487L7035J60540K23200r566r2917K13139L94419L78661M71356
$$ 1554654 1781141 1818176 1978716 2201916 2192350 2099433 2312572 2706991 3085652 3557008
18391C557008M96958L76849L99669Q9798k41039j03262J39688J67863L06957L60357
$$ 3557008 4053966 4430815 4830484 4920282 4679243 4575981 4715669 4883532 5190489 5550846
18381E550846O00382P63801Q70499Q40161P50133R42262R17608R26703J067195
$$ 5550846 6151228 6915029 7785528 8625689 9375822 10318084 11235692 12162395 13229590
18372A3229590J561265K155844K680963L508124M727389O722619J0204503J6240573
$$ 13229590 14790855 16946699 19627662 23135786 27863175 34585794 44790297 61030870
18364F1030870K6161506L8603523M8580791N3241793N2415263M2785484J9668340
$$ 61030870 87192376 125795899 174376690 227618483 280033746 322819230 342487570
18357C42487570j5156039n1966677o7869265n7716437l5615469k1091545j3291066
$$ 342487570 327331531 275364854 207495589 149779152 114163683 93072138 79781072
18350G9781072q736204o012899m135497k944384j835950q61164L61666J656814
$$ 79781072 71044868 65031969 60896472 57952088 56116138 55254974 55616640 57273454
18342E7273454L425553O626208J2766088K2893194L4996130M3626565M6161030
$$ 57273454 60699007 67325215 80091303 102984497 137980627 181607192 227768222
18335B27768222M6283469L9799048J4458862k2257939n2680846n9683411m8867399
$$ 227768222 274051691 313850739 328309601 306051662 253370816 193687405 144820006
18328A44820006l1340210j9549416j2938723r124157o781492n450151m357305
$$ 144820006 113479796 93930380 80991657 71867500 65086008 59635857 55278552
18321E5278552l497293k936956k487011k180436k126112j930210j868180j683045
$$ 55278552 51781259 48844303 46357292 44176856 42050744 40120534 38252354 36569309
18313C6569309j527936j445167j507447j554904j347272j105571j063482q31212
$$ 36569309 35041373 33596206 32088759 30533855 29186583 28081012 27017530 26186318
18305B6186318o43026m27056l93628m78475o40885q61739r05355r25829q06930
$$ 26186318 25543292 25116236 24722608 24244133 23603248 22741509 21836154 20910325 20103395
18296B0103395p89504p94647q15132o87349l47445l25366m34120m46972n94337
$$ 20103395 19313891 18519244 17704112 17016763 16669318 16343952 15909832 15462860 14868523
18287A4868523m85674l50219l35166l31686m39472m43856k66596m36778k34452
$$ 14868523 14382849 14032630 13697464 13365778 12926306 12482450 12215854 11779076 11544624
18278A1544624n7183k65235k05335n3091j18514p6284L9310R0602n9308N5218
$$ 11544624 11487441 11222206 11016871 10963780 10845266 10768982 10808292 10898894 10839586 10894804
18268A0894804j7085r9127j0885j6713o0013k15273m00020m95530n63042n37218
$$ 10894804 10877719 10778592 10767707 10750994 10690981 10475708 10075688 9580158 9017116 8479898
18258H479898l21847k85309l02588j54651j18445K4121j5750J20434l7737n6714
$$ 8479898 8158051 7872742 7570154 7415503 7297058 7321179 7305429 7425863 7388126 7331412
18248G331412J5954j8466j23288n1867k44043j41086j63460l76352k13394Q4090
$$ 7331412 7347366 7328900 7205612 7153745 6909702 6768616 6605156 6228804 6015410 6099500
18238F099500k1912j72379k91255m21752l74048l66343j18127o3160j4641j01848
$$ 6099500 6077588 5905209 5613954 5192202 4818154 4451811 4333684 4270524 4255883 4154035
18228D154035j1390L5798K3787j93621r3897r9271n4534j7999p7461j9421l0696
$$ 4154035 4142645 4178443 4202230 4008609 3914712 3815441 3760907 3742908 3665447 3646026 3615330
18217C615330k77845k92986k20290j9073k2491J1079K9697N1060j81221j76774
$$ 3615330 3337485 3044499 2824209 2805136 2782645 2793724 2823421 2874481 2693260 2516486
18207B516486k12342n4883K8576J34134J23929p9022q7798p529j14603n3842q166
$$ 2516486 2304144 2249261 2277837 2411971 2535900 2456878 2369080 2361551 2246948 2193106 2184940
18196B184940R5300Q460j78433K1139j30404j04506N2567J95612m4191j13739
$$ 2184940 2280240 2288700 2110267 2131406 2001002 1896496 1949063 2144675 2100484 1986745
18186A986745j29539r6290k10806L643J18879K7293R9510j39309p6580J9710j09370
$$ 1986745 1857206 1760916 1550110 1553753 1672632 1699925 1799435 1660126 1583546 1603256 1493886
18175A493886K6608j38844j13772J4833m2369N795N1605L0865k4842k16343m8497
$$ 1493886 1520494 1381650 1267878 1282711 1240342 1246137 1297742 1328607 1303765 1087422 1038925
18164A038925J14954j7994P0932L2486k9787k3402j33978j4944l240p999K4111
$$ 1038925 1153879 1135885 1206817 1239303 1209516 1186114 1052136 1037192 1033952 1025953 1050064
18153A050064n9013j31589m6187K5572O3937K19001J9244r0734k4235R03N3498
$$ 1050064 991051 859462 813275 838847 902784 1121785 1141029 1050295 1026060 1026963 1080461
18142A080461P4049l1187j0625O756j23169k5738p0168Q1521k041j29393L3669
$$ 1080461 1154510 1123323 1112698 1119454 996285 970547 900379 981900 979859 850466 884135
18131H84135R3574n3816j13027Q916R0364j99463k11668M4038N989o8043J8455
$$ 884135 977709 923893 810866 819782 910146 710683 499015 543053 549042 480999 499454
18120D99454R2024L6311J5748J9239P126r9909L5954N4249l4211J41666J42533
$$ 499454 591478 627789 643537 662776 669902 569993 605947 660196 625985 767651 910184
18109I10184k9458l4839k2801j690J24416J8045j19609Q9451M0849K9785J23077
$$ 910184 880726 845887 823086 821396 945812 963857 844248 933699 974548 1004333 1127410
18098A127410n1906j8518j0888j0466j66326r3034Q1890P0435R7282M212K4263
$$ 1127410 1075504 1056986 1046098 1035632 869306 776272 858162 928597 1025879 1030091 1054354
18087A054354r0622j98829k41266J09195Q9836p2536j49300K7011Q974Q033j0204
$$ 1054354 963732 764903 523637 632832 722668 650132 500832 527843 536817 544850 534646
18076E34646M8159j03967R3299J9800p1147M795J32678K0291n1469r2216J0680
$$ 534646 582805 478838 572137 591937 520790 525585 658263 678554 627085 534869 545549
18065E45549L8686q6007j13334P7773Q0140q0338j1445J32679N6563L5684J42104
$$ 545549 584235 498228 384894 462667 542807 462469 451024 583703 640266 675950 818054
18054H18054J57967L019N750M8475m0547o5449Q8448j12171j11249n5386k3005
$$ 818054 976021 979040 984790 1033265 992718 927269 1015717 903546 792297 736911 713906
18043G13906O4227J02911K2682r7525k09181k15902N2402P7460M4933M6376m8587
$$ 713906 778133 881044 903726 806201 597020 381118 433520 510980 555913 602289 553702
18032E53702j47660M3348O7519K4844j29987k4440M8557J8772j36341o867O5298
$$ 553702 406042 449390 516909 541753 411766 387326 435883 454655 318314 311447 376745
18021C76745o0055K4412J13546j9320j2012K9065L7179p7681l1970r4846L6211
$$ 376745 316690 341102 454648 435328 423316 452381 489560 411879 379909 285063 321274
18010C21274J28199O6834j0713R9653m733r5586Q7750J81869n0955j72085J23612
$$ 321274 449473 516307 505594 605247 600514 504928 592678 774547 723592 551507 675119
17999F75119J70773J79800R6344J48046l2141l6875o8397q0288M8061Q9851J7342
$$ 675119 845892 1025692 1122036 1270082 1237941 1201066 1132669 1052381 1100442 1190293 1207635
17988A207635m6121p6933O4432Q5560o9713r0177j34865o9890q5617k15182r8648
$$ 1207635 1161514 1084581 1149013 1234573 1164860 1074683 939818 869928 784311 569129 470481
17977D70481M1158R7169Q1439K03089O3342r9032j4676q6906l3548R9896m1231
$$ 470481 511639 608808 690247 893336 956678 857646 842970 756064 722516 822412 781181
17966G81181O3608J14024N9775j9057j81667j47324j65423L1705J18007J7089
$$ 781181 844789 958813 1018588 999531 817864 670540 505117 536822 654829 671918
17956F71918o4856o0646J732N3887P4141J21044K8867P2727k7130j63147K7574
$$ 671918 607062 546416 548148 602035 676176 797220 826087 898814 871684 708537 736111
17945G36111j7194J11928J08183j0611q4246o3222L9702J19066O6015j57363k36538
$$ 736111 718917 830845 939028 928417 844171 780949 820651 939717 1005732 848369 611831
17934F11831j26541Q5402J7060K0846l3854M6482J43400o2737j0626p2744K6851
$$ 611831 485290 570692 587752 608598 574744 621226 764626 701889 691263 618519 645370
17923F45370M4704p527j57450j0006L3507O9709m4349o3322L592l5897j61299
$$ 645370 690074 682547 525097 515091 548598 618307 573958 510636 514228 478331 317032
17912C17032K2482K9117j10078L9055L8524K1857l1658j6214J21814K30680N7625
$$ 317032 339514 368631 258553 297608 336132 357989 326331 310117 431931 662611 720236
17901G20236o8429o4028q4527l0271J06091k6063j38116J19674q994j46708k6343
$$ 720236 651807 587779 503252 472981 579072 553009 414893 534567 525573 378865 352522
17890C52522j3775L3188J86140N3586k25157k04014l7300P7385K36329L8402p2876
$$ 352522 338747 371935 558075 611661 386504 182490 145190 222575 458904 497306 424430
17879D24430P0222j16969k8770J6355l2108j3757J25750m7368J03040r6051j43028
$$ 424430 494652 377683 348913 365268 333160 319403 445153 397785 500825 404774 261746
17868B61746r869Q9710m9308k8925j07871j6308R5535R9801N2081n4205k57719
$$ 261746 251877 341587 292279 263354 155483 139175 234710 334511 386592 332387 74668
17857G4668q6483R2942J81481O3495J6786n584m0101M1610J23444L0685l058r6564
$$ 74668 -11815 81127 262608 326103 342889 337305 297204 338814 462258 492943 489885 393321
17845C93321o8785L7461L2198Q7211M9572q2178o783J14611j02460O5142R7056
$$ 393321 324536 361997 394195 481406 530978 448800 442017 556628 454168 519310 616366
17834F16366J17613r217l1781K7941j1025r3061Q777M947j1892l6733J19487J82865
$$ 616366 733979 724762 692981 720922 709897 616836 625613 630560 618668 581935 701422 884287
17822H84287q8355j9965J96980K57267J74207J78715K29262J71887J88424J92558
$$ 884287 795932 775967 972947 1230214 1404421 1583136 1812398 1984285 2172709 2365267
17812B365267L288j75393j51117k12552j99499r8946j60248n2871l0531Q097k861
$$ 2365267 2368555 2193162 2042045 1829493 1629994 1531048 1370800 1317929 1287398 1295495 1292634
17801A292634j26727j29555L3158L4717p2822K36128K90894J29093J03484J38107
$$ 1292634 1165907 1036352 1069510 1104227 1031405 1267533 1558427 1687520 1791004 1929111
17791A929111K98815K13855M2148J32462q5493j47092k65999j79068k3782k99379
$$ 1929111 2227926 2441781 2483929 2616391 2530898 2383806 2117807 1938739 1914957 1615578
17781A615578j96757q6613J31449M2058j35543r0117o4370J27837j7490j23373
$$ 1615578 1418821 1332208 1463657 1505715 1370172 1280055 1215685 1343522 1326032 1202659
17771A202659Q6640Q5538N0571J6603L9999M0593k3376N8213R7242M1780o5496
$$ 1202659 1289299 1374837 1425408 1442011 1482010 1522603 1499227 1557440 1654682 1696462 1630966
17760A630966m1755O2059n9732m036p2996j10151o3585O2902P1749K10453K10770
$$ 1630966 1589211 1651270 1591538 1587502 1514506 1404355 1340770 1403672 1475421 1685874 1896644
17749A896644K02946P2876L85458M46094K96037L43853L73475K54654J88408K98886
$$ 1896644 2099590 2172466 2557924 3004018 3300055 3643908 4017383 4272037 4460445 4759331
17739D759331J20827K88793M70599K76724O8494J1094K88993L44836J70312J71244
$$ 4759331 4880158 5168951 5639550 5916274 5984768 5995862 6284855 6629691 6800003 6971247
17729F971247M08051O10713Q15973J084706J638333K056649K501463L746161N383438
$$ 6971247 7379298 7990011 8805984 9890690 11529023 13585672 16087135 19833296 25216734
17720B5216734P753942J2554782J9757690K6690551L0111192L2625045L6658004
$$ 25216734 32970676 45525458 65283148 91973699 122084891 154709936 191367940
17713A91367940L3737669J9247182J014709j1101157n216658p221487k0879922
$$ 191367940 225105609 244352791 245367500 234266343 229049685 221828198 200948276
17706B00948276l6643477m0896372k7084924j5264736q829685m717486j839744
$$ 200948276 164304799 123408427 96323503 81058767 72229082 67511596 65671852
17699F5671852J197367N321857J1554052K0196401K7541387L0364676L3481191
$$ 65671852 66869219 72191076 83745128 103941529 131482916 161847592 195328783
17692A95328783L9586174L4349593J3555983n793893j4250682n920713j1309476
$$ 195328783 234914957 269264550 282820533 277026640 262775958 256855245 245545769
17685B45545769k8117684m1520480m2363569k8740069j7697510j1493063q019840
$$ 245545769 217428085 175907605 133544036 104803967 87106457 75613394 67593554
17678F7593554o048374m761178l834554l107333k707058k547561k534153k213165
$$ 67593554 61545180 56784002 52949448 49842115 47135057 44587496 42053343 39840178
17670C9840178j869195j718801j632540j501040j339741j285891j290591j041406
$$ 39840178 37970983 36252182 34619642 33118602 31778861 30492970 29202379 28160973
17662B8160973r60358r96374q60487p36594n29958o46377q08015p29517o50462
$$ 28160973 27200615 26204241 25343754 24607160 24077202 23430825 22622810 21893293 21242831
17653B1242831o31125n90022o46951p46743o65056o50745o93621m46356l47092
$$ 21242831 20611706 20021684 19374733 18627990 17962934 17312189 16618568 16172212 15825120
17644A5825120m44947n77408m52066l34104m21849o37503l70171j77576l37748
$$ 15825120 15380173 14802765 14350699 14016595 13594746 12957243 12587072 12409496 12071748
17635A2071748k15361k17484k97535k16733l99273m12308j78182k11368k47178
$$ 12071748 11856387 11638903 11341368 11124635 10725362 10313054 10134872 9923504 9676326
17626I676326j75605j51643j94944k37142j39354j30883k89684l22350j71806
$$ 9676326 9500721 9349078 9154134 8916992 8777638 8646755 8357071 8034721 7862915
17617G862915k86084k17072k17697k94583m7710k1695q2969j52239k43483k06416
$$ 7862915 7576831 7359759 7142062 6847479 6799769 6778074 6695105 6542866 6299383 6092967
17607F092967o2084k009o6551N5077k28021k64687k48577k09283j01944o0091
$$ 6092967 6030883 6028874 5962323 6017400 5789379 5524692 5276115 5066832 4964888 4904797
17597D904797n4770m9168l3676j31602j08106j59831q6811j84173r3750m5850
$$ 4904797 4850027 4800859 4767183 4635581 4527475 4367644 4280833 4096660 4002910 3957060
17587C957060r6574q0419k8077p9580J7060J21134j0686j36582r5663j3121l8463
$$ 3957060 3860486 3780067 3751990 3672410 3689470 3810604 3799918 3663336 3567673 3554552 3516089
17576C516089L7855j6961j80080k953P9569l5733k76709k66452r3516r4393m9294
$$ 3516089 3553944 3536983 3356903 3353950 3433519 3397786 3121077 2854625 2761109 2666716 2617422
17565B617422j918o7471j54251k0567l1331k0118P8075k8220J5566L7211j0027
$$ 2617422 2615504 2548033 2393782 2373215 2341884 2321766 2399841 2371621 2387187 2424398 2414371
17554B414371l1968o8840l719J4042O8960k4924j57267n2727M0875m4425j77165
$$ 2414371 2382403 2313563 2309844 2323886 2392846 2367922 2210655 2157928 2198803 2154378 1977213
17543A977213j53674j75134j48899N1019Q6738q9105j17014r7751K5935J49805
$$ 1977213 1823539 1648405 1499506 1550525 1637263 1548158 1431144 1333393 1359328 1509133
17533A509133l579R3339P8516j29472l6794L009n3431j80192l34341m2109J06226
$$ 1509133 1505554 1598893 1677409 1547937 1511143 1514152 1460721 1280529 946188 904079 1010305
17522A010305R9556p0812M3680J61359q3512j8859n3570j7817Q9192q5957p7984
$$ 1010305 1109861 1039049 1082729 1244088 1160576 1141717 1088147 1070330 1159522 1073565 995581
17511I95581o1329Q4791J00411P1933J2204r4920j66000j8614P9013Q4498p388
$$ 995581 934252 1019043 1119454 1191387 1203591 1108671 942671 924057 1003070 1087568 1080180
17500A080180k27514l4042J06365J7q9853m3184R5230J16608L7258N9675J0185
$$ 1080180 852666 818624 924989 925006 835153 791969 887199 1003807 1041065 1100740 1110925
17489A110925j28152j72992j3170K44571q9502q0588p8107m5795j00749n2314
$$ 1110925 982773 809781 796611 1041182 951680 871092 792985 747190 646441 594127
17479E94127J08782J7634p8592M3055N5646o6440p6003M7330o8465l7232n0390
$$ 594127 702909 720543 641951 685006 740652 674212 598209 645539 577074 539842 489452
17468D89452P599K4019m1979o258J7435R4067k3928J75608L4137m0987l5683j24015
$$ 489452 497051 521070 479091 472833 490268 584335 560407 736015 770152 729165 693482 569467
17456E69467q7914N7600L862j24173J2594P8157k0133j3366p2831Q2340J51964
$$ 569467 481553 539153 543015 418842 431436 509593 489460 476094 403263 485603 637567
17445F37567O5130p7616r5143j54884l6911J20553q3731j08464j16723N183L3039
$$ 637567 702697 625081 529938 375054 338143 458696 374965 266501 149778 154961 188000
17434A88000Q1464P0345J63286J65222j79206k43653r4854K8898P1780P6889l3348
$$ 188000 269464 339809 503095 668317 489111 245458 150604 179502 251282 328171 294823
17423B94823m4217R7227J67291J09515j33103j64216k8922p422j44592K5148R8137
$$ 294823 250606 347833 515124 624639 491536 327320 298398 290976 146384 171532 269669
17412B69669K516p8984j53965o2071R8502J12346R117K8639J95925p686j22092
$$ 269669 272185 193201 39236 -22835 75667 188013 197130 225769 421694 414008 291916
17401B91916j03313k5830J3604j665K1946J35596n4396j124m5546l8845p81Q3771
$$ 291916 188603 162773 176377 174712 196658 332254 277858 276734 231188 192343 191562 275333
17389B75333J6527q0084J6564k2947N0802J39089J15632m7357j33006o3376m2114
$$ 275333 291860 211776 228340 205393 256195 395284 510916 463559 330553 267177 225063
17378B25063Q2188R4878J33977J2777J549j27147p4128K4902J24517J05328K0534
$$ 225063 307251 402129 536106 548883 550432 423285 349157 374059 498576 603904 624438
17367F24438j13831o2794p4037q8420o6048L9513l7135j06846p7160J3829J34539
$$ 624438 510607 447813 373776 285356 219308 258821 221686 114840 37680 51509 186048
17356A86048P9315Q5482K7n1066j6153Q5410p2559l8100J14063P0182q2426m3016
$$ 186048 265363 350845 350872 299806 283653 369063 296504 258404 372467 442649 360223 317207
17344C17207p880l3846n543M5705J5033n2545K6135R2415P4031J2893m7476q6707
$$ 317207 309327 275481 269938 315643 330676 278131 304266 396681 470712 483605 436129 349422
17332C49422l1465J7886L6967l5839M941l9076N5219k0047L7697J2839j8145O2379
$$ 349422 317957 335843 372810 336971 341912 302836 358055 338008 375705 388544 370399 432778
17320D32778L0690n2651j62688J3870n4471O3649n692q0491J2203J34793K4642
$$ 432778 463468 410817 248129 261999 207528 271177 265485 184994 197197 331990 356632
17309C56632j21413k9947m6236r04j0532p4799l4043l5742P1843J62617O0971
$$ 356632 235219 205272 159036 158132 147600 72801 38758 3016 74859 237476 298447
17298B98447Q8882n6492O5381O4606j63084j63231n2634j5998J24357J82528R7401
$$ 298447 387329 330837 396218 460824 297740 134509 81875 65877 190234 372762 470163
17287D70163j74006p4205j8684O1809J2284J53631n8427k23m1994j68433P3138
$$ 470163 296157 221952 203268 265077 277361 430992 372565 372342 330348 161915 235053
17276B35053O4326n5714l7647P9123J71551O2357o4065q005M4773j03665O0537
$$ 235053 299379 243665 206018 285141 456692 519049 454984 446979 491752 388087 448624
17265D48624J81892j4173l7002J37553Q2689k71115k6032Q4483K2841j12972J27509
$$ 448624 630516 616343 579341 716894 799583 528468 502436 586919 609760 496788 624297
17254F24297K17551O4286p8276J00444j12122j36567Q64j53304j01214k286J57084
$$ 624297 841848 906134 827858 928302 816180 679613 680477 527173 425959 423673 580757
17243E80757J35125J24577J15199P0199j06482p1226j8168P1841J26592q6953
$$ 580757 715882 840459 955658 1025857 919375 848149 829981 901822 1028414 941461
17233I41461j46641j68440m7934P6812L6807n971N9350m1818q330Q8558Q6648
$$ 941461 794820 626380 578446 655258 692065 686094 745444 703626 695296 783854 870502
17222H70502Q9663k8674m5439k5987q2433m4052M0428O2108O0199J04161Q7899
$$ 870502 960165 931491 886052 860065 777632 733580 774008 836116 896315 1000476 1088375
17211A088375L9427r933p1613M0698p1268J28204J68279J12667J09050j50999
$$ 1088375 1127802 1117869 1046256 1086954 1015686 1143890 1312169 1424836 1533886 1382887
17201A382887r4552O5092J6895R0110J67370J28019q2888N2383Q1377O0643M0419
$$ 1382887 1288335 1353427 1370322 1460432 1627802 1755821 1672933 1725316 1806693 1867336 1907755
17190A907755J65195L07010K35102K18738K5000Q6791K36193K90856L71564M13394
$$ 1907755 2072950 2379960 2615062 2833800 2858800 2945591 3181784 3472640 3844204 4257598
17180D257598M68362K33795M9481J17908J31360L12340N26546N47694P52057J040334
$$ 4257598 4725960 4959755 5009236 5127144 5258504 5570844 6097390 6645084 7397141 8437475
17170H437475R64879J192769J564112J696194J907640K831644M617392P798509
$$ 8437475 9402354 10595123 12159235 13855429 15763069 18594713 23212105 31010614
17162C1010614J3961647K4313119L4017112L1532977K2671482L1065709K9465547
$$ 31010614 44972261 69285380 103302492 134835469 157506951 188572660 218038207
17155B18038207k7587716n7329306l4051523j4866747k308067R680619K2520016
$$ 218038207 190450491 133121185 99069662 84202915 81894848 91575467 114095483
17148A14095483K9320029K3518492K1112644L0086267Q001011m4492115m5843181
$$ 114095483 143415512 166934004 188046648 218132915 226133926 181641811 135798630
17141A35798630k1977637l572290J2217050K3479757K2175455J7020584K5061941
$$ 135798630 113820993 110248703 122465753 145945510 168120965 185141549 210203490
17134B10203490J8256617l1408471n0916298l1229607j4713204l214204Q034840
$$ 210203490 228460107 197051636 146135338 114905731 100192527 96978323 105013163
17127A05013163K0508877K6401664J9062073J7955109K8867079K568830n2479423
$$ 105013163 125522040 151923704 170985777 188940886 217807965 220376795 167897372
17120A67897372m8970208k7510530j6187165j0490251p242147n174225l981994
$$ 167897372 118927164 91416634 75229469 64739218 57497071 52322846 48340852
17113D8340852l237944k480399k012965j877779j915554j716807j599027j575010
$$ 48340852 45102908 42622509 40609544 38731765 36816211 35099404 33500377 31925367
17105C1925367j401388j208398r58378j015428q91290o84648o23771p90817r14618
$$ 31925367 30523979 29315581 28357203 27341775 26450485 25765837 25142066 24351249 23436631
17096B3436631j032237r95314r19182o66725m47517m98810m36024l62768l52235
$$ 23436631 22404394 21409080 20489898 19823173 19375656 18876846 18440822 18078054 17725819
17087A7725819n00539m79272m70963o55235n34521l58341m10141n64463m20718
$$ 17725819 17225280 16746008 16275045 15619810 15085289 14726948 14316807 13752344 13331626
17078A3331626k88953m05572l35029l66872l10513l21997j68775k59831k57534
$$ 13331626 13042673 12637101 12302072 11935200 11624687 11302690 11133915 10874084 10616550
17069A0616550k42155k67986m19764j71325k03384k37083k51122j53378j77671
$$ 10616550 10374395 10106409 9686645 9515320 9311936 9074853 8823731 8670353 8492682
17060H492682k27588j42797j61141j17076k83203k56125j41964j85628k20368
$$ 8492682 8265094 8122297 7961156 7844080 7560877 7304752 7162788 6977160 6756792
17051F756792j86888j55425n3787j33399r6912j23414j04050p6641j75215j28167
$$ 6756792 6569904 6414479 6360692 6227293 6130381 6006967 5902917 5826276 5651061 5522894
17041E522894j28173j50997k06996j25135j62699j08179O652j7404j14008j81905
$$ 5522894 5394721 5243724 5036728 4911593 4748894 4640715 4647367 4629963 4515955 4334050
17031D334050j61225r3346k3033p3668n3166j09588m875q7966p9357M0125j71142
$$ 4334050 4172825 4079479 4056446 3982778 3929612 3820024 3815149 3727183 3647826 3687951 3516809
17020C516809j76954l4273p1413j50810m8198J30467m382j21582j42375j25547
$$ 3516809 3339855 3305582 3234169 3083359 3035161 3165628 3161246 3039664 2897289 2771742
17010B771742m1935m6808J2649m4624J4713l8913K5116p5464r5262M535j41630
$$ 2771742 2729807 2682999 2695648 2651024 2665737 2626824 2651940 2576476 2481214 2485749 2344119
16999B344119r9390m8144p3710n6947p650Q1748J3395m3838q1950Q7163q8290
$$ 2344119 2244729 2196585 2122875 2065928 2058278 2140026 2153421 2109583 2027633 2114796 2026506
16988B026506j32861m9593J13161R3721l9211r425q4598q5840j88969l3929R653
$$ 2026506 1893645 1844052 1957213 2050934 2011723 2002298 1917700 1831860 1642891 1608962 1618615
16977A618615n6021N0099L2706J03480K7089r5441k47309j9236J28451o9442l4589
$$ 1618615 1562594 1612693 1645399 1748879 1775968 1680527 1433218 1413982 1542433 1472991 1438402
16966A438402r3585O7922J6023p1162r6677p4717N3503k8230p8122l899O7488
$$ 1438402 1344817 1412739 1428762 1357600 1260923 1186206 1239709 1211479 1133357 1129458 1196946
16955A196946L8528J4052p0572j89355O521L0375K6079p3335m9104j0096l0479
$$ 1196946 1235474 1249526 1178954 989599 996120 1026495 1052574 979239 930135 920039 889560
16944H89560o8340M301M0422k3078K9801O8870J2026L8837l3907K5436J9459j7483
$$ 889560 821220 825521 865943 842865 872666 941536 953562 992399 958492 983928 1003387 985904
16932I85904j72812j02716j085p013m9311q5506j5640J13078J34873M9013m0193
$$ 985904 813092 710376 709291 702278 652967 567461 551821 664899 799772 848785 808592
16921H08592q3008J8949l2063l2242L102n9824o5593p6715J52785r3119L7231
$$ 808592 725584 744533 712470 680228 683330 623506 557913 481198 633983 540864 578095
16910E78095J01252J33009k1088j11626M2104p9046P3934J51627n5624j94846
$$ 578095 679347 812356 791268 679642 721746 642700 716634 868261 812637 617791
16900F17791L5155R7959l7020o89m0003j45859q1423n7375n9794K0676J7973j2832
$$ 617791 652946 750905 713885 713196 673193 527334 445911 388536 328742 349418 367391 354559
16888C54559j9403n8006l2340P8826P5228J03782O4808l6131q6319K9124n4604
$$ 354559 335156 277150 244810 323636 398864 502646 567454 531323 445004 474128 419524
16877D19524K2466j2122M9509N9344j33588q6880K126J53512Q2209R2727q3036
$$ 419524 441990 429868 479377 538721 405133 318253 320379 473891 556100 648827 565791
16866E65791j82359l1711K6968K6044J21139M784o6136l9378j80490n597o171
$$ 565791 383432 351721 378689 404733 525872 530656 464520 425142 244652 239055 232884
16855B32884O3311J54671P3738j58440J9618Q4264M5718L3486q1127j55377P6805
$$ 232884 296195 450866 524604 366164 385782 470046 515764 549250 468123 312746 389551
16844C89551L3605o2573p986p1630o5935j9086r9919j067J19704Q65R7414j0532
$$ 389551 423156 360583 352597 280967 215032 195946 96027 94960 214664 215529 312943 302411
16832C02411j48735L8158J0251j21368l4760l3586M3682J54208K4784J08039L1802
$$ 302411 153676 191834 202085 80717 45957 12371 56053 210261 235045 343084 374886
16821C74886o9372j17160J667O839m0408l6757M5536R7988N5610q8363j02221
$$ 374886 305514 188354 190021 196860 156452 119695 165231 263219 318829 230466 128245
16810A28245J5727M3385n065J2835R2947n7746n7199j9620N2584o8073q6398R0981
$$ 128245 143972 187357 182292 195127 288074 230328 173129 153509 206093 138020 51622 142603
16798A42603j1869K4190p3133O284M1938k533J5885O1117l3076P7179L8901J03836
$$ 142603 130734 154924 81791 88075 130013 127480 143365 204482 171406 248585 287486 391322
16786C91322P280j11120K9833J144r3948k8852J48006Q5592p8478p3002l953o7341
$$ 391322 398602 287482 317315 318459 224511 195659 343665 429257 350779 277777 273824 206483
16774B06483J7150r334J1392r458Q757r4911l214p1521q538K3137K6768J01263
$$ 206483 223633 214299 225691 216233 224990 130079 126865 55344 46806 69943 96711 197974
16762A97974K8252l5098M8978m0132j5009n9381J06726J33146j6642j67778l2328
$$ 197974 226226 191128 240106 199974 184965 125584 232310 365456 348814 181036 148708
16751A48708l6220r8234n5265k5215k5352J30812M8705n157l0541p1874k7121
$$ 148708 112488 14254 -41011 -66226 -91578 39234 87939 82782 52241 -19633 -46754
16740d6754N0890N3061K965m157J9909P8766r2256j65361j226J62437J56982j0572
$$ -46754 4136 57197 60162 56005 75914 154680 62424 -102937 -104163 58274 215256 204684
16728B04684N0745K0468j42792l0688J92414M5190m7703K5291o9757j5702n5287
$$ 204684 255429 275897 133105 102417 294831 340021 292318 317609 247852 232150 176863
16717A76863j13713P7341K31456M2420j3971q1940o7808k3969n3207O6989N601
$$ 176863 63150 140491 371947 414367 400396 318456 250648 226679 173472 240461 246062
16706B46062o6163j62550o5166N6070J31548Q0644j23827P5491J8855K9622N4796
$$ 246062 179899 17349 -47817 8253 139801 220445 96618 172109 190964 220586 275382
16695B75382p3714p5543j01882m0097J08867P367k2184L0703P0736l464J4194
$$ 275382 201668 126125 24243 -15854 93013 100380 78196 108899 179635 176171 190365
16684A90365p8659r6071K8435j0268o9744k6381K2910K7763j8883Q084P2025O9818
$$ 190365 111706 15635 44070 33802 -35942 -62323 -39413 -11650 -30533 -22449 49576 119394
16672A19394J05185j24248k0664p051n3144j40231j6120n0041k1881J1259J12139
$$ 119394 224579 100331 79667 72616 19472 -120759 -136879 -186920 -208801 -197542 -85403
16661h5403J10435l1256J4291K1435p3344N0712O854M7951O8863L6752J34356
$$ -85403 25032 -6224 8067 29502 -43842 6870 13724 61675 130538 167290 301646
16650C01646O1267L5535j49111k83634m8584j7961j24686J37950K10176J64136
$$ 301646 362913 398448 249337 -34297 -82881 -100842 -225528 -87578 122598 286734
16640B86734q3655r1137k4094j9226m709Q4137J1504L3541k2601p8125O7810N9520
$$ 286734 203079 111942 87848 68622 63913 148050 159554 193095 170494 92369 160179 219699
16628B19699K2977o1827q8702K7714K02350J05017j33083j52213k2537J8320O6338
$$ 219699 242676 180849 92147 119861 322211 427228 294145 141932 119395 137715 204053
16617B04053J17434q7861j73530Q1023p4120m1751j6154P6482L3987M9585p2993
$$ 204053 321487 233626 60096 141119 66999 25248 9094 85576 119563 169148 96155
16606I6155j28963N2684P2064l8172K2374O8558J25459J21156Q110P5008J2356
$$ 96155 -32808 19876 91940 53768 76142 144700 270159 391315 399425 474433 486789
16595D86789N2957J15160K44502Q9264j25641k16316p7252J0024R5309l7074N8202
$$ 486789 539746 654906 899408 988672 863031 646715 569463 579487 674796 637722 695924
16584F95924J22236M501k5213J10153J19933p1954j40521m8610j30725P1341R395
$$ 695924 818160 822661 797448 907601 1027534 955580 815059 766449 635724 707065 716460
16573G16460J4580O4451Q5823j9750J4163P2187j87562j32884p1324J88992L8686
$$ 716460 731040 795491 881314 861564 875727 947914 760352 627468 556144 745136 783822
16562G83822m4815r804K8326L8609p0249m9856j24166j11736j18545N3703K0565
$$ 783822 739007 729203 757529 796138 725889 676033 551867 440131 321586 375289 395854
16551C95854M1580o5651j35996q7319m3775k6893Q0214M6250m5054l5647l9054
$$ 395854 437434 371783 235787 148468 104693 77800 158014 204264 159210 123563 84509
16540H4509n702o1314J46339R0174P0514j9545P3748k29916l05772N3380J76946
$$ 84509 78807 17493 163832 254006 324520 304975 378723 148807 -156965 -103585 73361
16529G3361j18736p0314K7980O068o7659R8565J21796N4183O9157J4467l2782
$$ 73361 -45375 -115689 -87709 -81641 -149300 -50735 71061 125244 194401 208868 176086
16518A76086N4521J41004k9804j64947l9796k7395J4913L4704l0629j5735K5222
$$ 176086 230607 371611 341807 176860 137064 109669 124582 159286 128657 112922 138144
16507A38144L0482n3114P4739M5863J29201K5802j67444J9525O2393j5871l8540
$$ 138144 168626 115512 190251 236114 365315 391117 223673 243198 305591 289720 251180
16496B51180k8304q7540P5436J78894n088o4879p4891m4251j23887p2764O4747
$$ 251180 222876 135336 210772 389666 384578 319699 244808 200557 76670 3906 68653
16485F8653J49539P4582r6542o1489p3371j33275O1312Q078L6640M1506L0203
$$ 68653 218192 292774 196232 134743 61372 -71903 -10591 -2513 34127 75633 105836
16474A05836J2335R4173m7482j39889k4611k7001R7132m1254j16579J5629K6908
$$ 105836 118171 212344 164862 24973 362 -26639 70493 29239 -87340 -71711 -44803
16463d4803q186K8460l09j3037M6605P3538m6336l1889N5040J580R3247Q8972
$$ -44803 -52989 -24529 -24838 -37875 8730 82268 35932 4043 59083 60663 153910 242882
16451B42882j1523j12133j68509j65268l9848P8005m5233J29392J34758O9949
$$ 242882 231359 119226 -49283 -214551 -254399 -176394 -221627 -92235 42523 112472
16441A12472q588m7250N5887l3563j10378j5316J4652j08311j9557o4767j41420
$$ 112472 103884 56634 112521 78958 -31420 -46736 -32084 -140395 -159952 -224719 -366139
16430c66139Q0739P0838J63958J27587j1097j28772l965J07774n910J5982k4192
$$ -366139 -285400 -214562 -50604 76983 65886 -62886 -66851 40923 35013 50995 26803
16419B6803j76227R8026O2322M2006j43228o2567P5543K4478N2771M1348n8153
$$ 26803 -149424 -51398 10924 52930 -90298 -152865 -77322 -52844 -73 41275 -16878
16408a6878l8132K7190N9899m5531J27546K0326m5809l4841l7224k0839O9612
$$ -16878 -55010 -27820 32079 -13452 114094 134420 88611 53770 16546 -4293 65319
16397F5319M9039L6445M8092M060j05433n6475j15073j22474p2039K1229K44M4597
$$ 65319 114358 150803 198895 202955 97522 41047 -74026 -196500 -268539 -247310 -247066 -202469
16385b02469J12836J00034j30418j66499p6709Q6279N9961R5774R8690n2926K5785
$$ -202469 -89633 10401 -120017 -286516 -363225 -276946 -216985 -121211 -22521 -75447 -49662
16374d9662J77640j02061q1307R0106r816o2291j07264M7063P7644k367J955J152
$$ -49662 127978 25917 -55390 34716 24900 -37391 -144655 -97592 -19948 -22315 -20360 -19208
16362a9208o258Q5695o2412o6779m1716k0966J58299J51818L2624O797j20882
$$ -19208 -25466 60229 -2183 -68962 -110678 -131644 26655 178473 211097 217894 97012
16351I7012q2456q1415l9445O1460L9087o4400O4630R2205k1975K6391j17900
$$ 97012 14556 -66859 -106304 -44844 -5757 -70157 -5527 86678 64703 91094 -26806
16340b6806j4423J79284N2966O9955l1434k60790k4099l992q5089K8776J57484
$$ -26806 -41229 138055 191021 260976 229542 -31248 -55347 -59339 -144428 -115652 41832
16329D1832J04148j07928j15959j25261j06265j5102J51894P0437L1028l9803
$$ 41832 145980 38052 -77907 -203168 -309433 -324535 -172641 -102204 -71176 -110979
16319a10979k7999j3476J84365k6836q0151N1443L644J34014J6886p7751o5598
$$ -110979 -138978 -152454 31911 5075 -75076 -23633 -19989 114025 130911 53160 -12438
16308a2438N66Q2948M7788j05809j908L4840K9965K1225k719m6014r0603o2110
$$ -12438 -11872 71076 118864 13055 11147 45987 75952 97177 94458 48444 -42159 -104269
16296a04269p7337J03460J63631O4771m298M5883p0869q4286n0091M2549p5216
$$ -104269 -181606 -78146 85485 150256 145958 191841 120972 36686 -13405 29144 -46072
16285d6072j28710o0721M4947K35757K2207Q8660R0687o9668O176n0410j74658
$$ -46072 -174782 -235503 -190556 45201 67408 156068 246755 177087 183263 132853 -41805
16274d1805L7243J29476N2254q4430L1278O217k015k8914K1574O174j54420K2984
$$ -41805 -4562 124914 177168 92738 124016 130233 128218 99304 120878 127052 -27368 -4384
16262d384P2140R642o2625L4658N0528J9962m9080J1126q908M117m5303P2796
$$ -4384 67756 77398 14773 49431 99959 119921 70841 81967 73059 77176 31873 104669
16250A04669N8197L3719m956j01591j2971j35757q1278l3531J16533J40434p2961
$$ 104669 162866 196585 191629 90038 77067 -58690 -139968 -173499 -56966 83468 10507
16239A0507j04700L342J13467L3357k6846K0091J00335J9981j67035j36349J23998
$$ 10507 -94193 -90851 22616 55973 29127 49218 149553 169534 2499 -133850 -9852
16228i852R3291o3105M9863Q4509j13389j93517q7199N6425K10388R4016o0471
$$ -9852 83439 20334 70197 154706 41317 -152200 -239399 -182974 27414 121430 60959
16217F0959Q299J06571N6857j02156R484Q9757K8169j05629J1509R9278M036j09933
$$ 60959 69258 175829 232686 130530 140014 229771 257940 152311 163820 263098 267134 157201
16205A57201j63884j00435L3763l947r986j7110n8282q8682n9892N2250J6739
$$ 157201 -6683 -107118 -73355 -77302 -87288 -104398 -162680 -251362 -311254 -259004 -242265
16194b42265K2442R3197J12867L9943J01786K5204j58467o542J5283n3525r2311
$$ -242265 -219823 -126626 -13759 26184 127970 153174 -5293 -11835 3448 -50077 -142388
16183a42388j9556l684O6884P4059j14824j48330L8916P9382J01992k5291o826
$$ -142388 -161944 -165628 -98744 -24685 -139509 -287839 -248923 -169541 -67549 -92840 -99666
16172i9666j5650J41654m6724n3477J23348J24050J4624j86599o7006J08239K3250
$$ -99666 -115316 26338 -20386 -73863 49485 173535 188159 1560 -65446 42793 66043
16161F6043L7183q9613O8413l9640j02783n3011m6518M4856J46551K11960p478
$$ 66043 103226 13613 82026 42386 -60397 -113408 -159926 -115070 31481 243441 235963
16150B35963j55236j2132m3086L324k429j26312J18018J73440O2284q8103j08231
$$ 235963 80727 68595 25509 28833 26404 -99908 18110 191550 253834 165731 57500
16139E7500j4145o8577j0754Q4522J03515R151l9943j66036n257J11297J98214
$$ 57500 43355 -25222 -35976 48546 152061 161212 121269 -44767 -50024 61273 259487
16128B59487P24n3290n9575l5812j0884L3376n196k7034j07091r0468j02152Q775
$$ 259487 260211 206921 147346 111534 100650 134026 128830 101796 -5295 -95763 -197915 -189140
16116a89140L7554R8825n7837j2651J35664O9456k2813l6807Q6443O1659L6206
$$ -189140 -151586 -52761 -110598 -123249 12415 81871 59058 22251 108694 170353 206559
16105B06559j23721q0275n3765k5671n7328q1363n0465R4167M3925L5155r415
$$ 206559 82838 2563 -51202 -76873 -134201 -215564 -266029 -171862 -127937 -92782 -102197
16094a02197J1881K6542O8095R00r3242k6418q3970K5994R7253L7103N5026m6680
$$ -102197 -90316 -63774 4321 5221 -88021 -114439 -198409 -172415 -75162 -38059 16967 -29713
16082b9713m0662l6424q2068N2220J45843q467r6150p3024J11553l7880r9827
$$ -29713 -70375 -106799 -188867 -136647 9196 729 -95421 -168445 -56892 -94772 -194599
16071a94599j4584J01253o4855p184L0691m413l830l9261m9332N1114j6742J34509
$$ -194599 -209183 -107930 -172785 -179969 -149278 -153691 -157521 -196782 -246114 -195000 -211742 -77233
16059g7233M3324K0976L5123n2326O8295P924o3440L6261j05897j8780J71056
$$ -77233 -33909 -12933 22190 -30136 38159 46083 -17357 18904 -86993 -105773 65283
16048F5283k747j02483j04513M8416K0993J21362k6089k1106j20995j8699L7368
$$ 65283 62536 -39947 -144460 -96044 -75051 46311 20222 -884 -121879 -140578 -103210
16037a03210k3208R9320k68r5223l2929j19182M1927Q9797J8322K9641j05306
$$ -103210 -126418 -27098 -27366 -122589 -155518 -274700 -232773 -142976 -124654 -95013 -200319
16026b00319J61317P179N343J12605Q3664L2600r842n3780j18489M2211n0385
$$ -200319 -39002 -31823 -26480 86125 169789 202389 192547 138767 20278 62489 12104
16015A2104q8094o5506N6485m5214k5566L2873n3425O1088r884N2649L5446N6612
$$ 12104 -75990 -141496 -85011 -130225 -155791 -122918 -176343 -115255 -125139 -72490 -37044 19568
16003A9568L1074M4349M2936R2798j31671k6212J8652q1732m3710N2123P4099
$$ 19568 50642 94991 137927 230725 99054 72842 91494 9762 -33948 18175 92274
15992I2274K2797p7416N1569M5305r561m0225o2497O0439l1000q1169l1893L2807
$$ 92274 115071 37655 89224 134529 124968 84743 22246 82685 51685 -29484 -61377 -28570
15980b8570L511J55017r7787k1076R1587J02392L0881m5808q9184J148p4970j287
$$ -28570 -25059 129958 32171 11095 102682 205074 235955 190147 100963 102111 27141 25854
15968B5854R8453J3837j29100p3652P1393n4637K4849J07561L323k1815J543j3176
$$ 25854 124307 138144 9044 -64608 6785 -47852 -23003 84558 87881 66066 67609 54433
15956E4433j4474p6557J0341j01402Q623l8261l3778N2931J01509O9024J46173
$$ 54433 39959 -36598 -26257 -127659 -119036 -157297 -191075 -138144 -36635 32389 178562
15945A78562L2043j92462q407k62861j10713K08433J74721M906n4448K5244R8331
$$ 178562 210605 18143 9736 -253125 -363838 -155405 19316 24222 -30226 -4982 93349
15934I3349k7957j39183j20011K8079P5955m7580K105j3084M5584O3638k486j28009
$$ 93349 65392 -73791 -193802 -165723 -89768 -137348 -135243 -148327 -102743 -39105 -41591 -169600
15922a69600j424j54386J18578R7704O623K1667O0504j7622r0984J03992O7718
$$ -169600 -171024 -325410 -206832 -109128 -102505 -80838 -20334 -37956 -128940 -24948 42770
15911D2770n5908p3425j0415o0795K4294R7419O8218Q2560o2714o809j23685K1584
$$ 42770 -13138 -86563 -96978 -157773 -133479 -36060 32158 114718 52004 45195 -78490 -56906
15899e6906m49k1055O2131J6407L3520n2458n2099K3908O320j5193J132k5641
$$ -56906 -57355 -78410 -16279 128 33648 -18810 -70909 -47001 -40681 -55874 -54742 -80383
15887h0383L981o4417J27911R1659n6497n4032q3197P2791k6247r275N913N0683
$$ -80383 -76402 -140819 -12908 78751 22254 -31778 -114975 -42184 -68431 -77706 -71793 -21110
15875b1110q00n5513n5748K6132J25637j5611j23414q8603j13405j3037L2056
$$ -21110 -21910 -77423 -133171 -107039 18598 2987 -120427 -209030 -322435 -335472 -303416
15864c03416J37270O0765J3147J26797J3103l4745j54360m1178m1859J96510R7071
$$ -303416 -166146 -105381 -92234 34563 47666 12921 -141439 -182617 -224476 -27966 69105
15853F9105q806n4488k4016m0421n4190J28655p1395J2392K690M0732J22711N2164
$$ 69105 60299 5811 -18205 -58626 -112816 15839 -55556 -43164 -40474 258 122969 175133
15841A75133O5127o904j64687n1111q553N170o6182k4717K3927o3796J0094n5843
$$ 175133 240260 233356 68669 17558 9005 14175 -52007 -76724 -52797 -116593 -106499 -162342
15829a62342L3610L03624n025j56643j00074O2166L1068J24691M7049j10524j43283
$$ -162342 -128732 174892 169867 13224 -86850 -24684 6384 131075 178124 67600 -75683
15818g5683j05838K8230J21067N7719j66203O8347J53766m8867j66300j00796
$$ -75683 -181521 -153291 -32224 25495 -140708 -72361 81405 32538 -133762 -234558
15808b34558O226N9817J38754J8431m2963R0921N8842M3078k8049j5055p1960
$$ -234558 -228332 -168515 -29761 -11330 -54293 36628 95470 138548 110499 95444 23484
15797B3484m4375l669N427j00622j55465J09836J61521M4469M1077k50j15873
$$ 23484 -20891 -24560 -19133 -119755 -275220 -165384 -3863 40606 81683 81433 -34440
15786c4440m5510J1328M5603m6633j05544k4971Q7849J12538J01921M0312R9464
$$ -34440 -79950 -68622 -23019 -69652 -175196 -200167 -112318 220 102141 142453 241917
15775B41917q7320k45584n9212M4934J10480l4300N9283O2025p8748O4964J10939
$$ 241917 154597 -90987 -150199 -105265 5215 -29085 30198 92223 13475 78439 189378
15764A89378j01241j63359m1835M2395K0195O0601O3416N0348j10266L7387k4561
$$ 189378 88137 -75222 -117057 -74662 -54467 6134 69550 119898 9632 47019 22458
15753B2458o171M8759M7250n7406k4393O95o9809j7711L5680o8662M1341r4683
$$ 22458 16287 65046 112296 54890 30497 31192 -38617 -56328 -20648 -89310 -47969 -142652
15741a42652L9140J04856j24059j23116J2852J74641Q8820r5343l7070K8182k35
$$ -142652 -103512 1344 -122715 -245831 -232979 -58338 30482 -64861 -101931 -73749 -73984
15730g3984p7730j13731J04898P8204K3579M6083N1556J01016L3817j10514k149
$$ -73984 -151714 -265445 -160547 -82343 -58764 -12681 38875 139891 173708 63194 61045
15719F1045P122M927k794m7883O8161J4786P3395p4257o9479m723J60010n583
$$ 61045 68167 73094 70300 22417 90578 105364 178759 104502 35023 30300 190310 184727
15707A84727j0099L7354m727j5854p3453n7036p8190k1954K4754p0634O5363R8210
$$ 184727 174628 211982 207255 191401 117948 60912 -17278 -39232 -14478 -85112 -19749 78461
15695G8461J6611j20928r5897R6205J27413q2471j48647q4732r7543k1641Q2194
$$ 78461 95072 -25856 -121753 -25548 101865 19394 -129253 -213985 -311528 -333169 -250975
15684b50975K07672J21527r215Q4628N826r3214L6890J4019j26045j61488J14636
$$ -250975 -43303 78224 69009 153637 159463 66249 103139 117158 -8887 -170375 -55739
15673e5739Q5197R035P2644J824J41217j2188j24108k2138k209J5448o7173m1018
$$ -55739 29458 38493 111137 112961 254178 241990 117882 95744 93535 108983 41810 792
15661G92O5959L6075m2397j23361j64754k8042Q7308R4430k7095J50634J24693
$$ 792 66751 102826 60429 -62932 -227686 -255728 -168420 -73990 -101085 49549 174242
15650A74242j2083j2346j15955j36633j23330M2985M0558P2503O1737K0621j58443
$$ 174242 162159 149813 33858 -102775 -226105 -183120 -142562 -70059 -8322 12299 -146144
15639a46144k4993L5478O0682J16446m2373n1018J4040N3416M0907j0327J07740
$$ -146144 -171137 -135659 -74977 41469 -904 -51922 -37882 15534 56441 46114 153854
15628A53854K5745j550l1915p9547O4381J29591m0868q6351m6026k0668O3753
$$ 153854 179599 178049 146134 66587 130968 260559 219691 133340 87314 66646 130399
15617A30399k3021j5065J42848J3549o2603J3024o6785k0529k00821k1108L1608
$$ 130399 107378 92313 235161 248710 186107 199131 132346 111817 -89004 -110112 -78504
15606g8504k10277m5951j6295J43285J00213n9420N43n0950Q6070J35649k8113
$$ -78504 -288781 -334732 -351027 -207742 -107529 -166949 -166406 -217356 -131286 4363 -23750
15595b3750J30342L1385j42354n7787M0171l4884R49n9920J1152J28056R7093
$$ -23750 106592 137977 -4377 -62164 -21993 -56877 -55928 -115848 -104696 23360 120453
15584A20453N9852j03348q9872l279R1742j5799k32547k16881J70565O4442l639
$$ 120453 180305 76957 -12915 -16194 75548 59749 -172798 -389679 -219114 -154672 -158311
15573a58311j2806j44075N7446L0966n127J63586J48253p5501r0759J46324K04791
$$ -158311 -171117 -315192 -257746 -226780 -231907 -68321 79932 4431 -86328 59996 264787
15562B64787K8926j27568j07431n0235l9834O3383J4573q8323j1721P4441n2545
$$ 264787 293713 166145 58714 8479 -31355 32028 46601 -41722 -53443 20998 -31547
15551c1547o7967Q3249Q4684p2620L8711O0240K3674j2667m1508l6575j09949
$$ -31547 -99514 -16265 68419 -4201 34510 94750 118424 105757 64249 27674 -82275
15540h2275q0289j01041O4158j10908p8957O0607J94648j524m8825M8405J58946
$$ -82275 -162564 -263605 -199447 -310355 -389312 -328705 -134057 -135581 -184406 -136001 22945
15529B2945P1899r7945J1506j6090j02307j4608j3602L642L2251L0606k0481J03433
$$ 22945 94844 -3101 8405 -7685 -109992 -124600 -138202 -134560 -102309 -71703 -92184 11249
15517A1249J48198q0876O914M654j11239j52734K5619Q8017J01562R0318j6429
$$ 11249 159447 78571 85485 90139 -21100 -173834 -148215 -60198 41364 131682 115253
15506A15253r4491j49614L5651Q7485j9896M4124J22579j04628j07699k9706L6125
$$ 115253 20762 -128852 -93201 -5716 -25612 18512 141091 36463 -71236 -100942 -64817
15495f4817k857l589o3410P6946j7855j59377J3461J08952J27677J25313j3233
$$ -64817 -67674 -71263 -134673 -57727 -75582 -234959 -221498 -112546 15131 140444 127211
15484A27211l9324r4927q3465n993J36740R951k6935L9678m0349n4691K0116O3754
$$ 127211 87887 -7040 -90505 -96498 40242 50193 23258 62936 22587 -32104 -11988 51766
15472E1766J41816j2739o7007m7189r9831M7251j9729P6877M5483M683O380p483
$$ 51766 193582 180843 113836 66647 -33184 14067 -5662 71215 116698 121381 127761 120278
15460A20278k1755p0945j52685n7323N7809R4193k6649L6891j74448k6060J78747
$$ 120278 98523 27578 -125107 -182430 -124621 -30428 -57077 -20186 -194634 -220694 -41947
15449d1947Q9233j38210p7485R0004P1563J47750K3293r6612m5422m1418j65649
$$ -41947 47286 -90924 -168409 -78405 -6842 140908 164201 67589 22167 -19251 -184900
15438a84900r8730J31939K2388m5638J73450q2822L5034R3223N9002q8658M5068
$$ -184900 -283630 -151691 -129303 -174941 -1491 -84313 -49279 43944 102946 14288 59356
15427E9356j12959q9621J23688K19339j5224k34618k78008J63275P1885J12857
$$ 59356 -53603 -143224 -19536 199803 184579 -50039 -328047 -164772 -92887 19970
15417A9970P0391K9325l7676o8405K6061J44671j72200p0372r0199N7398J28575
$$ 19970 90361 119686 82010 13605 39666 184337 12137 -58235 -148434 -91036 37539
15406C7539j69950K6511L3482j4746r4589M2444J54516o1817p5666P4515J24095
$$ 37539 -132411 -105900 -72418 -87164 -181753 -139309 15207 -46610 -122276 -47761 76334
15395G6334j19988l5665J04154J103k9641q8149N7200O7323q9823j34536r6145
$$ 76334 -43654 -79319 24835 25938 -3703 -91852 -34652 32671 -57152 -191688 -287833
15384b87833R999M1168P5765J96147K5693o888J35583J1537l1957p062l4501j8821
$$ -287833 -277834 -236666 -160901 35246 60939 54051 189634 201171 169214 162152 127651 108830
15372A08830o2546l2013o2788R6259L3216j18782J7862J32637P5301O7473m1531
$$ 108830 46284 14271 -48517 47742 80958 -37824 -19962 112675 187976 255449 213918
15361B13918j07850j8298j93552j21082J42448J45293k8317Q2544J3134j958j05954
$$ 213918 106068 87770 -105782 -226864 -84416 60877 32560 115104 128238 126280 20326
15350B0326k5233j3923o6726q8085o0030J56234N5250O5849J7320J2255l1070
$$ 20326 -4907 -18830 -85556 -173641 -233671 -77437 -22187 43662 60982 73237 42167
15339D2167M570r999n8530l6060n4331J13859n2372o4803M1743L7064J46438L6432
$$ 42167 46737 36738 -21792 -57852 -112183 1676 -50696 -115499 -73756 -36692 109746 146178
15327A46178n1552J5117K4419K4577j304j30838o6334K70j15006O5346l3376M6121
$$ 146178 94626 109743 134162 158739 157435 26597 -39737 -39467 -154473 -89127 -122503 -76382
15315g6382M0187J19324n1362l7797N9004p7606j5559L7352n9159Q1795q2049
$$ -76382 -36195 83129 31767 -6030 52974 -24632 -40191 -2839 -61998 19797 -62252
15304f2252J0568L5739k0053k522k4803q2334k3558J01265l2040j32772K1891
$$ -62252 -51684 -15945 -35998 -38520 -63323 -145657 -169215 -67950 -99990 -232762 -210871
15293b10871N0604J72163j9368O9057K08356k0592j26199j62453K0043j17287
$$ -210871 -160267 11896 -7472 61585 269941 249349 123150 -39303 -19260 -136547
15283a36547o3027L5997l273K06558N502o0745l7608q0328O2442N3521m9646j3509
$$ -136547 -199574 -163577 -166850 39708 45210 -15535 -53143 -133471 -71029 -17508 -67154 -80663
15271h0663P0954k7762Q5373M2631Q2155m9568j65126n6857j5337j2589j287j06673
$$ -80663 -9709 -37471 47902 90533 172688 123120 -42006 -98863 -114200 -126789 -128076 -234749
15259b34749m2841k5149R9671J41115J36406l5718Q8575N955j27034N3335p064
$$ -234749 -277590 -302739 -203068 -61953 74453 38735 127310 133265 6231 59566 52502
15248E2502j17814j0942j7657O9097J11465n6724k09858L2349R9748p5098l8305
$$ 52502 -65312 -76254 -93911 -24814 86651 29927 -179931 -147582 -47834 -122932 -161237
15237a61237M8306J88022J94695k1215j2115j1160j23726q3536K5543O8387N1268
$$ -161237 -112931 75091 269786 248571 236456 225296 101570 18034 43577 111964 163232
15226A63232r7853k43691m1176O1056J68157m9982r5290P2149l2415n9726J41497
$$ 163232 65379 -178312 -219488 -158432 9725 -40257 -135547 -63398 -95813 -155539 -14042
15215a4042J61151N7002l9556j03960j02949q4006n0667J16288K3162J17647O4294
$$ -14042 147109 204111 164555 60595 -42354 -126360 -177027 -60739 -37577 80070 144364
15204A44364q9845k02220n2089L2692O6428P2424k8616j88169P5163K770j07761
$$ 144364 54519 -147701 -199790 -167098 -100670 -28246 -56862 -245031 -169868 -167098 -274859
15193b74859R0150J4937J00421P0619M1117Q6946J0428R506J81126k8125j71711
$$ -274859 -184709 -169772 -69351 1268 42385 129331 139759 149265 330391 302266 130555
15182A30555O9707R5002q2350k7434o1738o4974L0091o7010j37937p4983Q1125
$$ 130555 200262 295264 212914 185480 123742 58768 88859 21849 -116088 -191071 -109946
15171a09946J35382O5834k461L6838j27940N9513P2654k0507k8256Q4864p474
$$ -109946 25436 91270 88809 125647 -2293 57220 129874 109367 81111 165975 158501
15160A58501J8454l3707j18773l7099J91111J58828o1836j10791j5553o0085j08477
$$ 158501 176955 143248 24475 -12624 178487 337315 275479 164688 149135 89050 -19427
15149a9427o5053l8499k7170O6595K3382k1639K2804J5731l4236J4315m612O9315
$$ -19427 -84480 -122979 -150149 -83554 -60172 -81811 -59007 -43276 -77512 -63197 -67809 1506
15137A506N8694j39841q5808M991l1327K2059k6101K6986J03283J12691Q1587
$$ 1506 60200 -79641 -165449 -160458 -191785 -169726 -195827 -168841 -65558 47133 128720
15126A28720l8885k4121J00615J1325k00360P9250J25590n4342l7825O1255J08638
$$ 128720 89835 65714 166329 177654 -22706 56544 182134 127792 89967 151222 259860
15115B59860j27554j59298P9044L7028o5031j21510k8321N5185K2598K4827j1579
$$ 259860 132306 -26992 52052 89080 24049 -97461 -125782 -70597 -47999 -23172 -34751
15104c4751K6528Q1871q7101P4763K39096R2628j73472n0852L16n7896j56077
$$ -34751 -8223 73648 -13453 61310 300406 393034 219562 168710 169026 111130 -44947
15093d4947K4399m2617l8740J00805m5958J58128K8974m0643j06351k9890R5104
$$ -44947 -20548 -63165 -101905 -1100 -47058 111070 140044 99401 -6950 -36840 58264
15082E8264R0018P497l7420J173r1326k4658q100L4001k8057k2619n9273l2380
$$ 58264 148282 155779 118359 119532 28206 3548 -4552 29449 1392 -21227 -80500 -112880
15070a12880J545O0724p024o0464l4423J41785j8218J3560M2388l4056O140j2477
$$ -112880 -111335 -50611 -57635 -118099 -152522 -10737 -28955 -15395 26993 -7063 -923 -13400
15058a3400M2080K6220l258p3508o6266n792l9830j0008L962R5634R5945q5359
$$ -13400 28680 54900 51642 -21866 -88132 -93924 -133754 -143762 -139800 -44166 51779 -33580
15046c3580q7589j55037O2562Q1907L8512L6188P8111Q8981Q7947o1217j24932
$$ -33580 -121169 -276206 -213644 -131737 -93225 -57037 21074 110055 198002 136785 11853
15035A1853n153l2520m0305L7444O1860j27887j4225J62525M6063r9738L9894
$$ 11853 6700 -25820 -66125 -28681 33179 -94708 -108933 53592 99655 -83 39811
15024C9811K4677j0580M1008j01410j39394M0762J5982P1640J8966r2034n2191
$$ 39811 64488 53908 94916 -6494 -145888 -105126 -89144 -17504 1462 -90572 -142763
15013a42763J01250O4554J22374J07553L3899j19994j88481o2113J08290N3976
$$ -142763 -41513 23041 145415 252968 286867 166873 -21608 -83721 24569 78545
15003G8545J33576j45963j77006p8634J54782J96661r6690K0433L7756n0195m1603
$$ 78545 212121 66158 -110848 -189482 -34700 161961 65271 85704 123460 73265 31662
14992C1662M9510K9916q0807k772j19098q5899J56552q86n7937N6474O5580O5868
$$ 31662 81172 111088 30281 27509 -91589 -177488 -20936 -21822 -79759 -23285 42295 108163
14980A08163Q426j1903l185O67n607q3845r3084J44490J21328q8562j73629j05845
$$ 108163 116589 104686 101501 102168 96561 12716 -80368 64122 185450 96888 -76741 -182586
14968a82586j0524M9417J20694Q0315M595P732m3672q0882k4852M4619k314q7749
$$ -182586 -193110 -143693 -22999 57316 61911 69643 25971 -54911 -79763 -35144 -37458 -125207
14956a25207j6489J83678K8014j08713r8309K0964j6763O9859j4718L5091j2910
$$ -125207 -141696 41982 69996 -38717 -137026 -116062 -132825 -62966 -77684 -42593 -55503
14945e5503Q0034m3335j30516m7706j18243K4490J35172j5843j05920N0338P5545
$$ -55503 24531 -18804 -149320 -197026 -315269 -290779 -155607 -171450 -277370 -227032 -151487
14934a51487m9023o1580m4817L6799K096l9901l3341L8313k2125M3035J33115
$$ -151487 -200510 -262090 -306907 -270108 -268012 -307913 -341254 -302941 -325066 -282031 -148916
14923a48916J38098M8838O2957k7121o5872N3951j28674k39010j2562J79054L2516
$$ -148916 -10818 38020 100977 73856 7984 61935 -66739 -305749 -318311 -139257 -106741
14912a06741R4257J14563J5072k705L6307j5930q5946p725J1969K413N2499O8998
$$ -106741 -12484 102079 117151 114446 150753 134823 48877 41152 53121 55534 108033 177031
14900A77031j51343j15816M8743J2560R7775J32471J2908j55279O4798p68J3031
$$ 177031 25688 -90128 -41385 -28825 68950 201421 214329 59050 123848 123080 136111
14889A36111j71208p1554Q1372J60087o91r4655L7798K9101p9845j03902j10510
$$ 136111 -35097 -106651 -25279 134808 134117 39462 77260 106361 26516 -77386 -187896
14878a87896l4766J3334m2298M4052j5699K4812J03724J16210o869k0830n746
$$ -187896 -222662 -209328 -251626 -207574 -223273 -198461 -94737 21473 14604 -6226 -11972
14867a1972j22464q336j4245r9828k377J12048N2725M9809k8958p152J50552j38
$$ -11972 -134436 -142772 -157017 -256845 -259222 -147174 -94449 -44640 -73598 -80750 69802 69664
14855F9664p5118J10209j01968j68888l9695N7293R6185O0379k8132k1813J10422
$$ 69664 -5454 104755 2787 -166101 -205796 -148503 -52318 8061 -20071 -41884 68538
14844F8538M3781m8291q1407N4157m2722j53346m1367l5356L3484l709k8204J12013
$$ 68538 112319 64028 -17379 36778 -5944 -159290 -200657 -236013 -202529 -206238 -234442 -122429
14832a22429P8179L1606p9224n2344J13386J04013j5068r415l4414m9532J3983
$$ -122429 -44250 -12644 -91868 -144212 -30826 73187 58119 48704 14290 -35242 -21259
14821b1259j4004j8168M6685J8935J4454o349QM0028J628K3047n099j2310q0130
$$ -21259 -35263 -53431 -6746 12189 26643 20294 20302 60330 61958 85005 79906 67596 -12534
14808a2534k5010K5437O3521L8805j7185l1464J9915q7288j34979M7622K10951
$$ -12534 -37544 -12107 51414 90219 73034 41570 61485 -25803 -160782 -113160 97791
14797I7791J67852k4361l7616q7231o8429k2749j13263k5012J48648J19123J8096
$$ 97791 265643 241282 203666 116435 48006 25257 -88006 -113018 35630 154753 172849
14786A72849k00713j45831l5059o425q8170K3718R7277j4094j609R7682J37278
$$ 172849 -27864 -173695 -208754 -215179 -303349 -279631 -182354 -196448 -198057 -100375 36903
14775C6903J62058n6835j01007L7125R4202L9448Q929o8102n3256j62179J14156
$$ 36903 198961 142126 41119 78244 172446 211894 220823 152721 99465 -62714 51442
14764E1442J30033p1703j44031L1219M5722L5210M9587n8332j57524N4503N3764
$$ 51442 181475 109772 -34259 -3040 42682 77892 127479 69147 -88377 -33874 19890
14753A9890q9523k5274O9872J7639r1648j1928N4071Q5883P6199j09120j29252
$$ 19890 -69633 -94907 -25035 -7396 -99044 -110972 -56901 28982 105181 -3939 -133191
14742a33191P753J06600Q5756J4645P924J1994q0175l1821M2474p711j6399k3662
$$ -133191 -125438 -18838 66918 81563 89487 101481 21306 -10515 31959 24248 7849 -15813
14730a5813m0038J15418O2850K1537j07836j2316O1329K7525p9170J02956r6975
$$ -15813 -55851 59567 122417 143954 36118 23802 85131 112656 33486 136442 39467
14719C9467j21925P7583P8397R5282l7894J0942k9698p6716n5547N3560k2499
$$ 39467 -82458 -4875 73522 168804 130910 141852 112154 35438 -20109 33451 10952
14708A0952j2034Q6276p451J7773O7793K5495m8900m0857L1170m9745m0313l4031
$$ 10952 -1082 85194 77743 95516 163309 188804 139904 99047 130217 80472 40159 6128
14696F128N6529Q9583K7324l2815N6535r4905j5172j50241n3805L3201o5992L2797
$$ 6128 62657 152240 179564 146749 203284 108379 93207 -57034 -110839 -77638 -143630 -110833
14684a10833K2682O2529n4054P8821k3900j0538J2623K0385r8451n658J27321
$$ -110833 -88151 -25622 -79676 -855 -24755 -35293 -22670 -2285 -100736 -106394 20927
14673B0927J39642m8865n4143L991M3724j09565q1295j864J8615O1167o1621j23133
$$ 20927 160569 111704 57561 61552 105276 -4289 -85584 -87448 -68833 -7666 -69287 -192420
14661a92420r0905J6345J04645K5290M8036J16488K2160j20080o2424j8222n5580
$$ -192420 -283325 -266980 -162335 -137045 -89009 27479 49639 -70441 -132865 -151087 -206667
14650b06667Q3303K9657l2115N6139k503Q6478N35j29643n5954O0691O9974P5419
$$ -206667 -123364 -93707 -125822 -69683 -72186 14292 14827 -114816 -170770 -110079 -40105 35314
14638C5314Q1965M4161j12866j32099K7236O1579l6666k3036J05985k893j41579
$$ 35314 117279 161440 48574 -83525 -56289 5290 -31376 -54412 51573 48680 -92899
14627i2899j21101J3942P1897J31273Q4706o1291Q2409L9381K940J7838j7733
$$ -92899 -214000 -200058 -128161 3112 87818 26527 108936 148317 151257 169095 151362
14616A51362l2646N3901K2426j45679M0886J8839j26221j4431J00679O14r8329
$$ 151362 118716 172617 195043 49364 90250 109089 -17132 -31563 69116 69730 -28599
14605b8599L1519m3212M0636k2852q24j09003K4962R8409M2606p447o1492J46594
$$ -28599 2920 -40292 344 -22508 -23332 -132335 -107373 -8964 33642 26195 -35297 111297
14593A11297l664J0317q6112N4623K0978m3822n9370m8294L557J26011O5554o7934
$$ 111297 107633 117950 31838 86461 107439 63617 4247 -44047 -40490 85521 151075 83141
14581H3141j25452K1317j29247K3902J2881L8344m4596K7982J33161J5850J3218
$$ 83141 -42311 -20994 -150241 -126339 -113458 -75114 -119710 -91728 41433 57283 70501
14570G0501K5268j14031o877j43128p1368o26L2593J19313R5420L7080l2899o3047
$$ 70501 95769 -18262 -25139 -168267 -239635 -240261 -207668 -88355 7065 44145 11246 -51801
14558e1801m6588k3078j1541k118R2683k8361k8587J6320K48853J09505q6766
$$ -51801 -98389 -121467 -133008 -135126 -42443 -70804 -99391 -83071 165782 275287 188521
14547A88521m4395q0442r2360l1928M9684J09537j1653o0596J76487O62n3405
$$ 188521 144126 63684 -28676 -60604 -10920 98617 86964 26368 202855 203517 150112
14536A50112o040q0297K9496j23458j26387K2703M0825P5588Q6753J9598j132
$$ 150112 144072 63775 93271 -30187 -156574 -133871 -93046 -17458 69295 88893 87761
14525H7761q9770k1162N4180M2892r6664n6037J11931M6301m5110M0860O2512
$$ 87761 -2009 -23171 31009 73901 -22763 -78800 33131 79432 34322 75182 137694
14514A37694j76289n5312M391M9791R6029K2542K6776l7822n3313R178j13568
$$ 137694 -38595 -93907 -89516 -39725 56304 78846 105622 67800 14487 23665 -89903
14503h9903O1982J6043J20037L1457o0242m7478j9032j40033Q223J76675J13504
$$ -89903 -27921 -11878 108159 139616 79374 31896 12864 -127169 -118946 57729 171233
14492A71233l2990r236n887p5118L2184o5279j28549Q097K5107L0761j28133N6030
$$ 171233 138243 129007 123120 48002 80186 14907 -113642 -105545 -80438 -49677 -177810 -121780
14480a21780J6142n875L2643L2616J17114r893n3094J3115n0773M6785r0997j23351
$$ -121780 -105638 -111513 -78870 -46254 70860 60967 7873 20988 -29785 17000 -73997 -197348
14468a97348l9995M2538J75583M0263P647p7332j14321p8638k5054P2278L1517
$$ -197348 -237343 -194805 -19222 21041 28688 -48644 -162965 -241603 -266657 -194379 -162862
14457a62862M4743L4560n3588j52420q8460M1379O180o3375k4350J08497J60987
$$ -162862 -118119 -83559 -137147 -289567 -378027 -336648 -330468 -393843 -418193 -309696 -148709
14446a48709J61751o4316o4478n8939l7885k4707O8013M2789k8298O2631o3416
$$ -148709 13042 -51274 -115752 -174691 -212576 -237283 -169270 -126481 -154779 -92148 -155564
14435a55564j1084N1167l708k7598K8071q4102O1772K25187k50963j22382K0801
$$ -155564 -166648 -115481 -119189 -146787 -118716 -202818 -141046 84141 -166822 -289204 -268403
14424b68403J30502J20189j3853l8123R279r5387O2201R9107K5459J605L9665
$$ -268403 -137901 -17712 -31565 -69688 -60409 -155796 -93595 5512 30971 32576 72241
14413G2241M2803L73j9781j20994r7720J69581j65580n7009J33899q0723j2437
$$ 72241 115044 115417 95636 -25358 -123078 46503 -119077 -176086 -42187 -122910 -135347
14402a35347k703J29037J2400l351m4967m9803K5108O6242j4482j5987J8389r8817
$$ -135347 -138050 -9013 3387 36 -44931 -94734 -69626 -3384 -17866 -33853 -15464 -114281
14390a14281P8267J54717K7235n097r5267j7444p1105K0694l2615n1697n2985
$$ -114281 -36014 118703 145938 140841 45574 28130 -42975 -22281 -54896 -106593 -159578
14379a59578j0240R0676N210O5042N3022m0790n866j736k6658p6712r360P4514
$$ -159578 -169818 -79142 -73932 -8890 44132 3342 -2524 -4260 -30918 -107630 -116990 -42476
14367d2476n4981K0476Q5345L310L726O935k339N4251j20288P5852q4611n9164
$$ -42476 -97457 -76981 8364 11674 15400 22335 19996 74247 -46041 29811 -54800 -113964
14355a13964m4716j9289M8702P2348o9733p7880N499J58084n1228j17766j0875
$$ -113964 -158680 -177969 -129267 -56919 -126652 -204532 -199033 -40949 -92177 -209943 -220818
14344b20818N873R8822R9901Q0980L6198m4956L1377N8792L7672K0907o985j05514
$$ -220818 -214945 -116123 -16222 64758 100956 56000 87377 146169 183841 204748 197763 92249
14332I2249l5083N6455Q1436p8989j17932j36079m872j5080O8708j18286r5352
$$ 92249 57166 113621 195057 116068 -1864 -137943 -142815 -157895 -89187 -207473 -302825
14321c02825j3769J38260J70570J42084L1538O9344P8590j36131j62606q8082
$$ -302825 -316594 -178334 -7764 134320 165858 235202 313792 177661 15055 -73027
14311g3027p5486m0628l0660L6179J8355L0055j8718J2165J8287P2279R6299J45104
$$ -73027 -148513 -189141 -219801 -183622 -165267 -135212 -153930 -141765 -123478 -51199 45100 190204
14299A90204j71106l2931Q716N6734J27232p7909n9928q1037q43M6068q4695L1138
$$ 190204 19098 -13833 -5117 51617 178849 100940 41012 -40025 -40868 5200 -79495 -48357
14287d8357m6101l781O342j10805J02494M1780p0172m9228J20852Q5895n8503
$$ -48357 -94458 -98239 -91897 -202702 -100208 -58428 -128600 -177828 -56976 28919 -29584
14276b9584o8961L2195Q7674m433L5956L6124M8327k5627N613k660j31820o6498
$$ -29584 -98545 -66350 21324 16891 52847 88971 137298 111671 117284 114624 -17196 -83694
14264h3694j2154J72310K2870Q6525n3323q9472j04050m7390n9440p279O9466
$$ -83694 -95848 76462 99332 185857 132534 43062 -60988 -108378 -167818 -175097 -105631
14253a05631j32276L4016J02404n8090j19143m68o6005M3847J80284P3955l6090
$$ -105631 -237907 -203891 -101487 -159577 -278720 -279188 -345193 -301346 -121062 -47107 -83197
14242h3197o4683P9047M8526r9400q5393K8700M1995Q295J35180j02499j20449
$$ -83197 -147880 -68833 -20307 -119707 -205100 -176400 -134405 -126110 9070 -93429 -213878
14231b13878n8480j7197L03838J62765o4572k25996k15592R8013J2721J5306R2815
$$ -213878 -272358 -289555 14283 177048 112476 -113520 -329112 -231099 -218378 -203072 -110257
14220a10257N4086q304J7730M0200q8596j01546N6506j5281m415P5642N9093l2109
$$ -110257 -56171 -64475 -46745 -6545 -95141 -196687 -140181 -155462 -159877 -84235 -25142 -57251
14208e7251K6587j4468m8733l0555l7809J32312P8473j20842m1735O5098J64619
$$ -57251 -30664 -45132 -93865 -124420 -162229 -29917 48556 -72286 -114021 -48923 115696
14197A15696J4014j66733o3296K15521m1111k0238j8124o8301o0897J04345j7335
$$ 115696 129710 -37023 -100319 115202 74091 53853 35729 -32572 -93469 10876 -6459
14186f459n0306m3342K9449j8141j31088j2148K1833O1972J34862O4971J30930
$$ -6459 -56765 -100107 -70658 -88799 -219887 -232035 -210202 -148230 -13368 51603 182533
14175A82533K8878l0988k24014j08024O5603K9983j3813M4706P3334o8142j20640
$$ 182533 211411 180423 -43591 -151615 -86012 -56029 -69842 -25136 48198 -19944 -140584
14164a40584Q2588M693M858R1583m1885j41943M12j7670M7663k5421L1996p7205
$$ -140584 -57996 -53303 -48445 43138 1253 -140690 -140278 -157948 -110285 -135706 -103710 -180915
14152a80915P0426J33435M6298j9049q705m2112P737j0907r7643j57502J64631
$$ -180915 -110489 22946 69244 50195 41490 -622 7115 -3792 -101435 -258937 -94306
14141i4306Q5121K4425l7707K2983P6989l3327j5559n3278K1863Q998J7588j06058
$$ -94306 -9185 15240 -22467 516 77505 44178 28619 -24659 -2796 6202 23790 -82268
14129h2268j51549j8499R6306R533N9796q6143l9333N2142P9536N9176j14905
$$ -82268 -233817 -252316 -156010 -146477 -86681 -172824 -212157 -160015 -80479 -21303 -136208
14118a36208K3445j8688M2690J06003j22467m6029L7178R2480J23059j8221j5081
$$ -136208 -112763 -131451 -88761 17242 -105225 -151254 -114076 -21596 101463 83242 68161
14107F8161J15913j567p7697j02292j01351L4176J08803l8999n1649J40q266q0541
$$ 68161 184074 182507 104810 2518 -98833 -64657 44146 5147 -46502 -46362 -54628 -135169
14095a35169K4953K5955N9604o1399j41486P1286J18789p8980k1675Q4192K3441
$$ -135169 -110216 -84261 -24657 -86056 -227542 -156256 -37467 -116447 -138122 -53930 -30489
14084c0489k7409M113N1965J9373n7510p6775K3262p1153j6929P0888k3662K6801
$$ -30489 -57898 -53785 -1820 17553 -39957 -116732 -93470 -164623 -181552 -110664 -134326 -107525
14072a07525m3375m0477J4932P4377L7258p5291j8652N7193q8965J70595J43701
$$ -107525 -150900 -191377 -176445 -102068 -64810 -140101 -158753 -101560 -190525 -19930 123771
14061A23771M7338Q67m9146n803j37807j07867M5099Q457M907Q0478J23445o5572
$$ 123771 171109 171976 122830 117027 -20780 -128647 -83548 -75091 -70184 10294 133739 68167
14049F8167j0181L4569J159M6032L1433p4915q7467L0437L1216r451J2994O8005
$$ 68167 57986 92555 93714 139746 171179 96264 8797 39234 70450 60999 73993 141998
14037A41998p4149Q53P0867j28715J0581L4146L1038k7398j52533n0267P8179
$$ 141998 67849 68702 139569 10854 21435 55581 86619 59221 -93312 -143579 -65400
14026f5400p751n2676L3623J3737o8022J62422M7447M1988J01611J2007j2195
$$ -65400 -73151 -125827 -92204 -78467 -146489 15933 63380 105368 206979 218986 206791
14015B06791k1941r8174j10199j51867L3691K0343j5281J519O3262q5936o1330
$$ 206791 184850 86676 -23523 -175390 -141699 -121356 -136637 -135118 -71856 -157792 -219122
14004b19122N0008J28322L0267j66476k6866K2152k3851Q2989R1191k025j19692
$$ -219122 -169114 -40792 -10525 -177001 -203867 -181715 -205566 -122577 -31386 -33411 -153103
13993a53103k5770K7446P9875J36475o1642n2665p180r0595M104Q5130J53571
$$ -153103 -178873 -151427 -71552 64923 3281 -49384 -56564 -147159 -143055 -57925 95646
13982I5646m4428Q8652M469r8941L2031j1696j22005k0650J27002N0544m9728
$$ 95646 51218 139870 144339 45398 77429 65733 -56272 -76922 50080 100624 50896
13971E0896m898K1985M7342O2097L9440n6167l4924l6467j38482j2957P1478O9413
$$ 50896 45998 67983 115325 177422 216862 160695 125771 89304 -49178 -62135 9343 78756
13959G8756j17132l0689p9990k0034O0512M7619J28094Q2899K9209j66162o2523
$$ 78756 -38376 -69065 -149055 -169089 -108577 -60958 67136 150035 179244 13082 -49441
13948d9441j0436K3626m5395j5890R4060p9228p9656r7718J28519P0623O3964
$$ -49441 -59877 -36251 -81646 -97536 -3476 -82704 -162360 -260078 -131559 -60936 3028
13937C028L8478M682L5969N7611K9201j29335P3364J999j27076r6462k9919N4763
$$ 3028 41506 46188 82157 139768 168969 39634 112998 114997 -12079 -108541 -138460 -83697
13925h3697O9156J2110j67686L779M6337K11508Q3944P1821l6730o6678j26234
$$ -83697 -14541 -2431 -170117 -166338 -120001 91507 175451 247272 210542 143864 17630
13914A7630j88851p7651O1956J34302J28053k8396q657q9834n7815N3978N3294
$$ 17630 -171221 -248872 -186916 -52614 75439 47043 38386 -51448 -109263 -55285 -1991
13903a991J16527o3625j05934Q7433Q1510q2972o334L3572j13885o0896j9230
$$ -1991 114536 50911 -55023 32410 113920 30948 24614 58186 -55699 -116595 -135825
13892a35825Q9592J11481m173j09757J65111P1158j24985p321K9072l3252K7724
$$ -135825 -46233 65248 61075 -48682 116429 187587 62602 55281 84353 51101 78825
13881G8825m7139n1557p64j07020O8916r620J03331P8953J3264m0033o668m0306
$$ 78825 31686 -19871 -20635 -127655 -58739 -68359 34972 113925 127189 87156 80488 40182
13869D0182J1664o296n7178L1884M4746o624J22511j07496P482L2990N3708o1920
$$ 40182 51846 45550 -11628 20256 65002 58378 180889 73393 80875 113865 167573 105653
13857A05653q5840M2315j739j34783n8224J3246j48242N8794J38425N7145K0198
$$ 105653 19813 62128 60389 -74394 -132618 -119372 -267614 -208820 -70395 -13250 6948
13846F948K8409j13483j45566O5957N0205J06350K8369m0511j988p978j7223K523
$$ 6948 35357 -78126 -223692 -157735 -107530 -1180 27189 -13322 -15310 -23288 -40511 -37988
13834c7988j26945P6342J41280Q164j2539O8494n6404j21911n8766r3763k6384
$$ -37988 -164933 -88591 52689 60853 48314 116808 60404 -61507 -120273 -214036 -240420
13823b40420m5461M4458J34096P183J07657P2411p0223P0731J9368m0049j05448
$$ -240420 -285881 -241423 -107327 -100144 7513 79924 9701 80432 99800 59751 -45697
13812d5697k0696j13965L569N3047l46Q5837j1965l2992K6498J19332n677o7131
$$ -45697 -66393 -180358 -176789 -123742 -124088 -38251 -50216 -83208 -56710 62622 56945 -10186
13800a0186n4452k4273r5020k6751J23944Q1295J0850j3494p3747p2990O7530
$$ -10186 -64638 -88911 -183931 -210682 -86738 -5443 5407 -8087 -81834 -154824 -87294
13789h7294K6541P5403J26443J29374K6220j51699J3364L129j05383j61956o536
$$ -87294 -60753 14650 141093 270467 296687 144988 158352 161481 56098 -105858 -112394
13778a12394L0690O4637J03918j4844j25608j0975N6698o8997q0117J4151l6558
$$ -112394 -81704 -17067 86851 72007 -53601 -64576 -7878 -76875 -156992 -142841 -179399
13767a79399Q6352J05612r7958N5400J20530M0325k17398o4444J41524L4999K6410
$$ -179399 -93047 12565 -85393 -29993 90537 130862 -86536 -150980 -9456 25543 51953
13756E1953k3834M6539K523N3115j30610k2895k93j4099K0768l8682l6543n0959
$$ 51953 28119 74658 77181 130296 -314 -23209 -23502 -37601 -16833 -55515 -92058 -143017
13744a43017R2387j26R9036m6659l4743J1640K3000Q2440q752p9055O3395n8546
$$ -143017 -50630 -50756 48280 1621 -33122 -21482 1518 83958 75206 -3849 59546 1000
13732A000L0181j06540j48886R8040J53628M9062J8675Q994j09186l366j6470
$$ 1000 31181 -75359 -224245 -126205 27423 76485 95160 104154 -5032 -8398 -24868
13721b4868m5227K09632J14439j09766K0602j07250p3075l5315k3500J09983J2004
$$ -24868 -70095 139537 253976 144210 164812 57562 -15513 -50828 -74328 35655 47659
13710D7659q4471k6019O1513L8416J13404k7727j22509r8009J487k1946l0676
$$ 47659 -36812 -62831 -1318 37098 150502 122775 266 -97743 -96256 -118202 -148878
13699a48878M2531R0359J4495K4837r367J4659L7515O4360m3502q6328r7187K1331
$$ -148878 -106347 -15988 -1493 23344 13977 28636 66151 130511 87009 681 -96506 -75175
13687g5175J4800O9736j1639j3926j49358n1393J31296Q6532j6026R270L1156
$$ -75175 -60375 9361 -2278 -16204 -165562 -216955 -85659 873 -15153 -5883 25273
13676B5273K1292o2953j32385N9098O1316j05481M3728J8733l1387P2803J6560
$$ 25273 46565 -16388 -148773 -89675 -28359 -133840 -90112 -71379 -102766 -29963 -13403
13665a3403m7843j5866q9601L4796J14386q6385M787k3094K3921R8655m1714j0228
$$ -13403 -61246 -77112 -166713 -131917 -17531 -103916 -99129 -122223 -98302 353 -41361 -51589
13653e1589J80848j00482J2373L5184l8956J9564J07726j31903n9705L152o2138
$$ -51589 129259 28777 41150 76334 37378 56942 164668 32765 -26940 -23788 -85926
13642h5926p965J07043J28163r0684j1767O1885q9248m6136L0003n5581r6360
$$ -85926 -93891 13152 141315 50631 38864 100749 11501 -34635 -4632 -60213 -156573
$$ [...]
##END NTUPLES=NMR SPECTRUM
##END=
