##TITLE=Analysis number 321540
Compound Code cc 48309
Book Reference 496/26/2/2
Project Code adrs
Chemist Name anns
##JCAMPDX= 6.0         $$ Bruker NMR JCAMP-DX V2.0
##DATA TYPE= NMR SPECTRUM
##DATA CLASS= NTUPLES
##ORIGIN= Bruker BioSpin GmbH
##OWNER= nmr
$$ XWIN-NMR		Version 3.5
$$ Wed Aug 16 09:34:33 2006 GMT Daylight Time (UT+1h)  MAYBRIDGE\nmr@NMR_250MHZ
##.OBSERVE FREQUENCY= 250.131544655141
##.OBSERVE NUCLEUS= ^1H
##.ACQUISITION MODE= SIMULTANEOUS (DQD)
##.ACQUISITION SCHEME= undefined
##.AVERAGES= 16
##.DIGITISER RES= 18
##SPECTROMETER/DATA SYSTEM= dpx250
##.PULSE SEQUENCE= zg30
##.SOLVENT NAME= CDCl3
##.SHIFT REFERENCE= (INTERNAL, CDCl3, 0, 16.522)
##AUDIT TRAIL= $$ (NUMBER, WHEN, WHO, WHERE, WHAT)
$$ ##TITLE= Audit trail, XWIN-NMR		Version 3.5
$$ ##JCAMPDX= 5.01
$$ ##ORIGIN= Bruker BioSpin GmbH
$$ ##OWNER= nmr
$$ C:\u/data/dgb/nmr/ADRS/950/pdata/1/auditp.txt
$$ ##AUDIT TRAIL=  $$ (NUMBER, WHEN, WHO, WHERE, WHAT)
(   1,<2006-08-16 09:34:12.24 +100>,<MAYBRIDGE\nmr>,<NMR_250MHZ>,
      <created by zg, POWCHK disabled, PULCHK disabled
       configuration hash MD5:
       E2 DF 36 D8 04 B2 41 60 5A D7 A3 38 5A 4B D0 FE
       data hash MD5: 64K
       7D 6C E8 73 01 08 CB 04 F4 56 B5 1F 4E 25 9D 92>)
(   2,<2006-08-16 09:34:24.04 +100>,<MAYBRIDGE\nmr>,<NMR_250MHZ>,
      <Start of raw data processing
       ef LB = 0.3 FT_mod = 6 PKNL = 1 SI = 32K 
       data hash MD5: 32K
       33 9F 55 C6 82 E1 2B 51 B5 DA DA B6 FD 78 A4 9C>)
(   3,<2006-08-16 09:34:25.90 +100>,<MAYBRIDGE\nmr>,<NMR_250MHZ>,
      <apk 
       data hash MD5: 32K
       06 BA 49 88 E9 B6 EE 9E 21 8E 71 29 66 57 35 E0>)
(   4,<2006-08-16 09:34:26.72 +100>,<MAYBRIDGE\nmr>,<NMR_250MHZ>,
      <abs ABSG = 5 
       data hash MD5: 32K
       13 F2 E3 9E 83 2E 41 C0 74 10 77 E2 26 38 D8 DF>)
$$ ##END=
$$ 
$$ hash MD5
$$ F4 1A 34 0B 55 A1 57 33 77 4F F8 73 4E F0 E2 B0
##$RELAX= 
##$RELAX= 
##$RELAX= 
##$RELAX= 
##$RELAX= 
##$RELAX= 
##$RELAX= 
$$ Bruker specific parameters
$$ --------------------------
##$DU= <C:\u>
##$EXPNO= 950
##$NAME= <ADRS>
##$PROCNO= 1
##$TYPE= <nmr>
##$USER= <dgb>
##$AMP= (0..31)
100 100 100 100 100 100 100 100 100 100 100 100 100 100 100 100 100 100 
100 100 100 100 100 100 100 100 100 100 100 100 100 100 
##$AQSEQ= 0
##$AQ_mod= 3
##$AUNM= <au_zg>
##$AUTOPOS= <3 >
##$BF1= 250.13
##$BF2= 250.13
##$BF3= 250.13
##$BF4= 250.13
##$BF5= 500.13
##$BF6= 500.13
##$BF7= 500.13
##$BF8= 500.13
##$BYTORDA= 1
##$CFDGTYP= 0
##$CFRGTYP= 5
##$CHEMSTR= <none>
##$CNST= (0..31)
1 1 145 1 1 1 1 1 1 1 1 1 1 1 1 1 1 1 1 1 1 1 1 1 1 1 1 1 1 1 1 1 
##$CPDPRG= <>
##$CPDPRG1= <>
##$CPDPRG2= <>
##$CPDPRG3= <>
##$CPDPRG4= <mlev>
##$CPDPRG5= <mlev>
##$CPDPRG6= <mlev>
##$CPDPRG7= <mlev>
##$CPDPRG8= <mlev>
##$CPDPRGB= <>
##$CPDPRGT= <>
##$D= (0..31)
0 1 0 0 0 0 0 0 0 0.06 0 0 0 0 0 0 0.0002 0 0 0 0 0 0 0 0 0 0 0 0 0 0 
0 
##$DATE= 1155717251
##$DBL= (0..7)
120 120 120 120 120 120 120 120 
##$DBP= (0..7)
150 150 150 150 150 150 150 150 
##$DBP07= 0
##$DBPNAM0= <>
##$DBPNAM1= <>
$$ [...]
##$SUBNAM7= <"">
##$SUBNAM8= <"">
##$SUBNAM9= <"">
##$SW= 20.6930455092707
##$SWIBOX= (0..15)
0 0 3 0 0 0 0 0 0 0 0 0 0 0 0 0 
##$SW_h= 5175.983436853
##$TD= 65536
##$TD0= 1
##$TE= 295.16
##$TE2= 300
##$TE3= 300
##$TEG= 300
##$TL= (0..7)
0 120 120 120 120 120 120 120 
##$TP= (0..7)
150 150 150 150 150 150 150 150 
##$TP07= 0
##$TPNAME0= <>
##$TPNAME1= <>
##$TPNAME2= <>
##$TPNAME3= <>
##$TPNAME4= <>
##$TPNAME5= <>
##$TPNAME6= <>
##$TPNAME7= <>
##$TPOAL= (0..7)
0.5 0.5 0.5 0.5 0.5 0.5 0.5 0.5 
##$TPOFFS= (0..7)
0 0 0 0 0 0 0 0 
##$TUNHIN= 0
##$TUNHOUT= 0
##$TUNXOUT= 0
##$USERA1= <user>
##$USERA2= <user>
##$USERA3= <user>
##$USERA4= <user>
##$USERA5= <user>
##$V9= 5
##$VALIST= <valist>
##$VCLIST= <CCCCCCCCCCCCCCC>
##$VD= 0
##$VDLIST= <DDDDDDDDDDDDDDD>
##$VPLIST= <PPPPPPPPPPPPPPP>
##$VTLIST= <TTTTTTTTTTTTTTT>
##$WBST= 1024
##$WBSW= 4
##$XGAIN= (0..3)
0 0 0 0 
##$XL= 0
##$YL= 0
##$YMAX_a= 547971
##$YMIN_a= -868732
##$ZGOPTNS= <>
##$ZL1= 120
##$ZL2= 120
##$ZL3= 120
##$ZL4= 120
##$ABSF1= 16.522
##$ABSF2= -4.171173
##$ABSG= 5
##$ABSL= 3
##$ALPHA= 0
##$AQORDER= 0
##$ASSFAC= 0
##$ASSFACI= 0
##$ASSFACX= 0
##$ASSWID= 0
##$AUNMP= <proc_1d>
##$AZFE= 0.1
##$AZFW= 0.1
##$BCFW= 0
##$BC_mod= 0
##$BYTORDP= 0
##$COROFFS= 0
##$CY= 12.5
##$DATMOD= 1
##$DC= 0
##$DFILT= <>
##$DTYPP= 0
##$F1P= 14.0000005364418
##$F2P= -0.99999901652339
##$FCOR= 0.5
##$FTSIZE= 32768
##$FT_mod= 6
##$GAMMA= 0
##$GB= 0
##$INTBC= 1
##$INTSCL= 1
##$ISEN= 128
##$LB= 0.3
##$LEV0= 0
##$LPBIN= 0
##$MAXI= 10000
##$MC2= 0
##$MEAN= 0
##$ME_mod= 0
##$MI= 0
##$NCOEF= 0
##$NC_proc= -2
##$NLEV= 6
##$NOISF1= 0
##$NOISF2= 0
##$NSP= 0
##$NTH_PI= 0
##$NZP= 0
##$OFFSET= 16.522
##$PC= 1
##$PHC0= 146.9059
##$PHC1= 7.001959
##$PH_mod= 1
##$PKNL= yes
##$PPARMOD= 0
##$PSCAL= 4
##$PSIGN= 0
##$REVERSE= no
##$SF= 250.13
##$SI= 32768
##$SIGF1= 0
##$SIGF2= 0
##$SINO= 400
##$SIOLD= 32768
##$SREGLST= <1H.CDCl3>
##$SSB= 0
##$STSI= 32768
##$STSR= 0
##$SW_p= 5175.98343685301
##$SYMM= 0
##$S_DEV= 0
##$TDeff= 65536
##$TDoff= 0
##$TI= <Analysis number 999999
Compound Code 99
Book Reference 9
Project Code 9>
##$TILT= no
##$TM1= 0
##$TM2= 0
##$TOPLEV= 0
##$USERP1= <user>
##$USERP2= <user>
##$USERP3= <user>
##$USERP4= <user>
##$USERP5= <user>
##$WDW= 1
##$XDIM= 32768
##$YMAX_p= 381974254
##$YMIN_p= -43989
$$ End of Bruker specific parameters
$$ ---------------------------------
##NTUPLES= NMR SPECTRUM
##VAR_NAME=  FREQUENCY,     SPECTRUM/REAL,   SPECTRUM/IMAG
##SYMBOL=    X,             R,               I
##VAR_TYPE=  INDEPENDENT,   DEPENDENT,       DEPENDENT
##VAR_FORM=  AFFN,          ASDF,            ASDF
##VAR_DIM=   32768,         32768,           32768
##UNITS=     HZ,            ARBITRARY UNITS, ARBITRARY UNITS
##FACTOR=    0.157963299565203, 1,           1
##FIRST=     4132.6476996994, 0,             0
##LAST=      -1043.33573715361, 0,           0
##MIN=       -1043.33573715361, -43989,      0
##MAX=       4132.6476996994, 381974254,     0
$$ Real data points
##PAGE= N=1
##DATA TABLE= (X++(R..R)), XYDATA
$$ [...]
18952E929l650q345k295L136L484J479Q64j946O54N840O6K707n289K477M616r721
$$ 5929 2279 -6066 -8361 -5225 -1741 -262 602 -1344 -690 5150 5216 7923 2634 5111 9727 6
18936Fn293N914m311L07k919m47M740O471l504n366o31m679m74O962O151O480
$$ 6 -5287 627 -3684 -3377 -6296 -6743 -2003 4468 964 -4402 -5033 -9712 -10186 -3224 2927 9407
18920I407k007m091L765L253k669m764k59L360L922O893k316n244n328L109N134
$$ 9407 7400 3309 7074 10327 7658 2894 2635 5995 9917 16810 14494 9250 3922 7031 12165
18905A2165n035q667r945L113O741N571J326o991J3O054J696k620L226N16m324
$$ 12165 7130 -1537 -11482 -8369 -1628 3943 5269 -1722 -1709 4345 6041 3421 6647 7163 2839
18890B839K638l865L742j806j768J235K087n448o818q473N681Q409M457L643J331
$$ 2839 5477 1612 5354 3548 1780 3015 5102 -346 -7164 -15637 -9956 -1547 2910 6553 7884
18875G884n554O172M241j862L32J327k134l314k231J678m673J423J071o14J018
$$ 7884 2330 8502 12743 10881 11213 12540 10406 7092 4861 6539 1866 3289 4360 3746 4764
18860D764P756k505m745k819p055M020L788K709J0683j077q691l2O494m62k07
$$ 4764 12520 10015 5270 2451 -4604 -584 3204 5913 16596 15519 6828 6796 13290 12828 12621
18845A2621o303l472r44j103j410J870j923K657M804L477m914m805K930N62J704
$$ 12621 6318 2846 1902 799 -611 1259 -664 1993 6797 10274 5360 555 3485 4047 5751
18830E751k945K009j917N929O10j723m211K190L51K008l547N37p034K285k84L033
$$ 5751 2806 4815 2898 8827 9437 7714 3503 5693 6044 8052 4505 5042 -1992 293 9 3042
18814C042P912k820J65K216k29L395M01r25J837q221k94N507N397N65n856k793
$$ 3042 10954 8134 8299 10515 10286 13681 14082 13157 14994 6773 6479 11986 17383 17948 12092 9299
18798I299K913K462J381k872r023K828N274Q275O112p111p466K837l07K133l06
$$ 9299 12212 14674 16055 13183 4160 6988 12262 20537 26649 19538 12072 14909 14602 16735 16429
18783A6429l384k157M63m677l95K268j066k079k02M337M515K966J1k313M267L703
$$ 16429 13045 10888 11351 6674 6279 8547 7481 5402 5200 9537 14052 17018 17029 14716 18983 22686
18767B2686J69Q640J1862M685L527o857j2944r427r221k765m520j260J406L639
$$ 22686 22855 31495 43357 48042 51569 44712 31768 22341 13120 10355 5835 4575 5981 9620
18753I620N904O165K354o364o655L798L860l217K141J747N068j296K578K035k597
$$ 9620 15524 21689 24043 17679 11024 14822 18682 15465 17606 19353 24421 23125 25703 27738 25141
18738B5141m65j444P54N507m999k389j449O175k861J715P339m72l928K62J666
$$ 25141 24676 23232 23986 29493 24494 22105 20656 26831 23970 25685 33024 32552 28624 28886 30552
18723C0552k508J599O848L00j689k088r37k982o963m521O73N655l360k557k40
$$ 30552 28044 29643 36491 36791 35102 33014 32077 29095 22132 17611 18284 23939 20579 18022 17782
18708A7782O352l433m544K995M271k750p218j281Q132N765n75L904n185j628O037
$$ 17782 24134 20701 16157 19152 23423 20673 13455 12174 20306 26071 25496 29400 24215 22587 28624
18693B8624M679J940J57J307J375K418j766k13L768Q536R581J2897J4526K2929
$$ 28624 33303 35243 35400 36707 38082 40500 38734 38521 42289 50825 60406 73303 87829 110758
18679A10758K6813K5345K8201L7900L4324K2437M346k529j8267k6849k2317j8929
$$ 110758 137571 162916 191117 229017 263341 285778 290124 287595 269328 242479 220162 201233
18667B01233j2334l603R370K5337L3249K5484K0218J4475R619j1484k6244l5873
$$ 201233 188899 185296 194666 220003 253252 278736 298954 313429 323048 311564 285320 249447
18655B49447l7669l0841l1322k8486j8472r008j4258r148j0747m657j880J125
$$ 249447 211778 180937 149615 121129 102657 93649 79391 70243 59496 54839 52959 54084
18643E4084Q819M848l651p822J294j179o211k364o440l75l868l728o99L001m640
$$ 54084 62903 67751 64100 56278 57572 56393 50182 47818 41378 41003 37135 33407 32708 35709 31069
18628C1069j280J001q963M636K670k59L202m087o121K556K66J942k832j688M561
$$ 31069 29789 30790 21827 26463 29133 28874 32076 27989 21868 24424 24690 26632 23800 22112 26673
18613B6673M406l186l69j1492m766k502j027N19M778K732j665L412O839J475j646
$$ 26673 31079 27893 27524 16032 11266 8764 7737 8256 13034 15766 14101 17513 24352 25827 24181
18598B4181p40N52L458m768o460P207O460J155k031k87k073k563P666K181o696
$$ 24181 23441 23993 27451 22683 16223 23430 29890 31045 29014 28727 26654 24091 31757 33938 27242
18583B7242m955p804j255N838J529L526k031r54j388k382L599N705l216o148q12
$$ 27242 22287 14483 13228 19066 20595 24121 22090 21136 19748 17366 20965 26670 23454 17306 16494
18568A6494K528J695J278j596k765o029l032L411J873K795l666q57K623J488K945
$$ 16494 19022 20717 21995 20399 17634 11605 8573 11984 13857 16652 12986 12129 14752 16240 19185
18553A9185k485L344k569k81O434L80r962J833j95K6L223M773O71L201k774j0823
$$ 19185 16700 20044 17475 17194 23628 24008 14046 15879 15684 15710 18933 23706 24377 27578 24804 13981
18537A3981k359M116Q468O547K47r435J079K162l68p816K309k82r49K540k752
$$ 13981 11622 15738 24206 30753 31000 21565 22644 24806 24438 16622 18931 18649 17700 20240 17488
18522A7488J819P655j225q27j278k399P35L979k321J45j476k736j934K083O670
$$ 17488 19307 26962 25737 24910 23632 21233 21968 25947 23626 23771 22295 19559 17625 19708 26378
18507B6378J830q002n566j831M705J510N282m020K848K181k287R93J308l190k866
$$ 26378 28208 20206 14640 12809 17514 19024 24306 20286 23134 25315 23028 24021 25329 22139 19273
18492A9273j744j017K388Q339M354Q48l975l157L2q368J508O231M314m288j44
$$ 19273 17529 16512 18900 27239 31593 32441 28466 25309 25341 16973 18481 24712 29026 24738 24594
18477B4594L656N474M927q15j368m246m249L00J336j88n227k161M807L921J263
$$ 24594 28250 33724 38651 37836 36468 32222 27973 28273 29609 29421 24194 22033 26840 30761 32024
18462C2024j5o813k237M365L464m333q965j066J455J566N881R65l620M416o011
$$ 32024 32009 25196 22959 27324 30788 26455 17490 16424 17879 19445 25326 26291 22671 27087 21076
18447B1076l370Q844O129M409k754k466q05J613J378O229q82J377M913o411p185
$$ 21076 17706 26550 32679 37088 34334 31868 31063 32676 34054 40283 39401 40778 45691 39280 32095
18432C2095J642j625L949M38k452m35O384M382j0800r637K104R567M402k620k318
$$ 32095 33737 32112 36061 36499 34047 33612 39996 44378 33578 23941 26045 35612 40014 37394 35076
18417C5076o008o058N11L211r78L571J692J985O004L0K665L720N912k243P237
$$ 35076 29068 23010 23521 26732 25754 29325 31017 33002 39006 39036 41701 45421 51333 49090 56327
18402E6327k139k183k339p035q190M203j907K058L795l430m910O038Q149N114
$$ 56327 54188 52005 49666 42631 34441 38644 36737 38795 42590 39160 34250 40288 48437 53551
18388E3551l924J471K967m647k677m985p730l90q350k076J770O040j255p812m733
$$ 53551 49627 51098 54065 49418 46741 41756 34026 33636 25286 23210 24980 31020 29765 21953 17220
18373A7220q22J655l283M21P370O554l669p162O53j842j445N194L405L852M02
$$ 17220 16398 18053 14770 15191 22561 29115 25446 18284 18937 17095 15650 20844 24249 28101 28503
18358B8503o02J801J240p2K183M24r94K517J0324L567Q19j454J0168K332o694
$$ 28503 27901 29702 30942 30870 33053 33477 32483 35000 45324 48891 49710 48256 58424 60756 54062
18343E4062k062L895L05J197K957j164k320K956J868R77L642J0382J497M770M248
$$ 54062 52000 55895 56200 57397 60354 59190 56870 59826 61694 62671 66313 76695 78192 82962 87210
18328H7210j131l821o974n431j0082n36j43L897p246l278M961N311K48K017L599
$$ 87210 86079 82258 75284 69853 59771 59235 59092 62989 55743 52465 57426 62737 62985 65002 68601
18313F8601k224J081l784r001p34J798L478l559n260j121K260m100p63j52N483
$$ 68601 66377 67458 63674 54673 53939 55737 59215 55656 50396 49275 51535 47435 46672 46520 52003
18298E2003m07k533l44J404K734l214k324o180p215M689J0126K515q94l294j281
$$ 52003 51596 49063 48719 50123 52857 49643 47319 41139 33924 38613 48739 51254 50360 47066 45785
18283D5785n73O171N257l100o478j38j33l665N647N940k179p554m804K873N886
$$ 45785 45212 51383 56640 53540 47062 46924 46791 43126 48773 54713 52534 44980 40176 43049 48935
18268D8935l051n243O118J1259J031k623K181J335o276P03O061Q4n685l454l79
$$ 48935 45884 40641 46759 58018 59049 56426 58607 59942 53666 54369 60430 60514 54829 51375 50996
18253E0996K643M367M800R387P049l7l235P92j98r57k134k805J362N234J140R61
$$ 50996 53639 58006 62806 72193 79242 79205 75970 76762 76564 75607 73473 70668 72030 77264 78404 79365
18237G9365P862P276j141n609l800qK180N85M684J486P291M968p05N885P942J6580
$$ 79365 87227 94503 93362 87753 83953 83945 86125 86710 91394 92880 100171 105139 104434 110319 118261 134841
18221A34841J3000J1696J4086J4475J5011J2829J1705K8237L4843L7724L2427
$$ 134841 147841 159537 173623 188098 203109 215938 227643 255880 290723 328447 360874
18210C60874K7174K5324J0822o376j4044k0348j1628k100J2303K6500K7715K2396
$$ 360874 388048 413372 424194 417818 403774 383426 371798 369698 382001 408501 436216 458612
18198D58612J1535p085r182k0100k5587l2067l1061k3368j8471m968m581q281
$$ 458612 470147 463062 453880 433780 408193 376126 345065 321697 303226 298258 293677 285396
18186B85396O831J1954M960R46M659M197K987J910K864N459Q113P55J915L941
$$ 285396 292227 304181 309141 310087 314746 318943 321930 323840 326704 332163 340276 341031 342946 346887
18172C46887M355J3853J4667J2604J6474K6432L7780L2660L2105L2536N1445P3033
$$ 346887 351242 365095 379762 392366 408840 435272 473052 505712 537817 570353 621798 694831
18160F94831J13847J57362K23118K97272L80334M45623M61648M18073L11735J67503
$$ 694831 808678 966040 1189158 1486430 1866764 2312387 2774035 3192108 3503843 3671346
18150C671346l0613j63410k70250l48558k89238k03910o4102Q4264K17301L27162
$$ 3671346 3640733 3477323 3207073 2858515 2569277 2365367 2301265 2385529 2602830 2929992
18140B929992L84741L59725K72180J40343n2915k17755l32907m31777m08132l73576
$$ 2929992 3314733 3674458 3946638 4086981 4034066 3816311 3483404 3051627 2643495 2269919
18130B269919l00493k07077j47862q4464l9677j906K4145O2956Q2299J04179J19010
$$ 2269919 1969426 1762349 1614487 1530023 1490346 1488440 1512585 1575541 1657840 1762019 1881029
18119A881029J17894J18469J06583R1820Q6223J02079J25625J70847K57351M01811
$$ 1881029 1998923 2117392 2223975 2315795 2402018 2504097 2629722 2800569 3057920 3459731
18109C459731O48863J139736J847525J915740J357894J476094J549326M5265j430100
$$ 3459731 4108594 5248330 7095855 9011595 10369489 11845583 13394909 13440174 12010074
18100A2010074K42154J963625L451487M878346O180347P127526P159604O295966
$$ 12010074 12252228 14215853 17667340 22545686 28726033 35853559 43013163 49309129
18092D9309129M445067J965763j294075l332966n147492n703453m551711l043254
$$ 49309129 53754196 55719959 54425884 51092918 45945426 40241973 35690262 32647008
18084C2647008o08372J832833L946635N520651N950159N334731L597895J170286
$$ 32647008 32038636 33871469 37818104 43338755 49288914 54623645 58221540 59391826
18076E9391826k141447m351331o325894p370649o762189o061894m744052l487232
$$ 59391826 57250379 52899048 46573154 39202505 32440316 26378422 21634370 18147138
18068A8147138k524887j808855j341114j050123q62501p33784o38353n60862n08888
$$ 18147138 15622251 13813396 12472282 11422159 10559658 9825874 9187521 8626659 8117771
18059H117771m43721l73198l19266k67314k30040k09010j88767j79577j91598
$$ 8117771 7674050 7300852 6981586 6714272 6484232 6275222 6086455 5906878 5715280
18050E715280k05656k18461k22151k20717k18306k12710j92198j75438j67780
$$ 5715280 5509624 5291163 5069012 4848295 4629989 4417279 4225081 4049643 3881863
18041C881863j60740j46507j36170j26410j30600j13590j02884r8598r7425q5322
$$ 3881863 3721123 3574616 3438446 3312036 3181436 3067846 2964962 2866364 2768939 2683617
18031B683617p5151p5837p7393p1046o7281p2568p7634p2056o6042o3026n8688
$$ 2683617 2608466 2532629 2455236 2384190 2316909 2244341 2166707 2094651 2028609 1965583 1906895
18020A906895m9679m9439m5574m7354m5980m2371m5829m6669m6008l8131m1327
$$ 1906895 1857216 1807777 1762203 1714849 1668869 1626498 1580669 1534000 1487992 1449861 1408534
18009A408534l8217l9547m0269m5044l8467k9725k5493l3961l6326k3200k7348
$$ 1408534 1370317 1330770 1290501 1245457 1206990 1177265 1151772 1117811 1081485 1058285 1030937
17998A030937k5147j7583k4496k9290k3148j9737k5654k4753k8484k9009j5848
$$ 1030937 1005790 988207 963711 934421 911273 891536 865882 841129 812645 783636 767788
17987G67788j6999k8446k4426k0922j9271j5893j8383j5550j6456j7106j4410
$$ 767788 750789 722343 697917 676995 657724 641831 623448 607898 591442 574336 559926
17976E59926j0267j3989j4481p853o723j0225j8947j7448n371p185j2769j5748
$$ 559926 549659 535670 521189 513336 506613 496388 477441 459993 454622 447437 434668 418920
17964D18920r060n096j1431r129j2317j3074j0512r79o594q015j1552j1676j4082
$$ 418920 409860 404764 393333 384204 371887 358813 348301 347322 340728 332713 321161 309485 295403
17951B95403j4768j1486r835j3934l783k800o687r890j2240j0831q005q235j5354
$$ 295403 280635 269149 259314 245380 241597 238797 232110 222220 209980 199149 191144 182909 167555
17938A67555j4309j4904o995j907L4k344k673j775j084l625o655p297m597l242
$$ 167555 153246 138342 131347 129440 129474 127130 124457 122682 121598 117973 111318 104021 99424 96182
17924I6182l330j300m598k146L044n136o448K773K175O207J156j1186n336l890
$$ 96182 92852 91552 86954 84808 87852 82716 76268 79041 81216 87423 88579 77393 72057 68167
17910F8167n050N184N651l336M61l153p492l03R829Q315J73l063J309o908r61
$$ 68167 63117 68301 73952 70616 71077 67924 60432 60129 69958 78273 78446 75383 76692 69784 68823
17895F8823P344l95K722j900L252J07N430P696o292q798j1144l219j78k378k417
$$ 68823 76167 75772 78494 76594 79846 79953 85383 93079 86787 77989 66845 63626 63448 61070 58653
17880E8653q71M985N158J806j447l903k268n997p365m560j224K362K178j65K66
$$ 58653 57782 62767 67925 69731 68284 64381 62113 56116 48751 44191 42967 45329 47507 47342 47608
17865D7608o42K472N625K158J355q53j557p728r099k378L63K157L978Q531j011
$$ 47608 46966 49438 55063 57221 58576 57723 56166 48438 39339 36961 37324 39481 43459 51990 50979
17850E0979J119l55n651k021J510N478R707k729m970j009N697l289M60L487k985
$$ 50979 52098 51743 46092 44071 45581 51059 60766 58037 53067 52058 57755 54466 54926 58413 55428
17835E5428K09n941O05l223n671m761K035J408L498K903p44J304J149o894m606
$$ 55428 55637 49696 50301 47078 41407 36646 38681 40089 43587 46490 45746 47050 48199 41305 36699
17820C6699N698M626n337o478L995K466m595L129m606L099l595o613j839j026
$$ 36699 42397 47023 41686 35208 39203 41669 37074 40203 35597 38696 35101 28488 26649 25623
17806B5623l067j093K283P229L72n846n752m288j952N557j518O49o048p233p23
$$ 25623 22556 21463 23746 30975 31347 25501 19749 15461 13509 19066 17548 18197 12149 4916 4193
17791D193O923Q69o342j0926p586m726L801j629n238k730O209k160K269J666K793
$$ 4193 11116 11985 5643 -5283 -12869 -17595 -13794 -15423 -20661 -23391 -17182 -19342 -17073 -15407 -12614
17776a2614L808l75k402l263k819k547k997l640J193Q284Q659J679M591k041j799
$$ -12614 -8806 -9181 -11583 -14846 -17665 -20212 -23209 -26849 -25656 -17372 -8713 -7034 -2443 -4484 -6283
17761f283L984N315J14o63K681O511p993p609O37K573j086o001l84k1K408M998
$$ -6283 -2299 3016 3130 2467 5148 11659 3666 -3943 -3306 -733 -1819 -7820 -8204 -8225 -5817 -819
17745h19m898k845j9k882L431N478n507k241r96R410Q001k75n80l826r420k351
$$ -819 -5717 -8562 -8581 -11463 -8032 -2554 -8061 -10302 -11298 -1888 6113 5838 5258 1432 -7988 -10339
17729a0339L220M0K689J611j346p053R36L622Q74l851P51L998J210p671j455O291
$$ -10339 -7119 -7079 -4390 -2779 -4125 -11178 -10242 -6620 -5746 -9597 -8846 -4848 -3638 -11309 -12764 -6473
17713f473l330L227m455K329P599K012n788l303J634j976j212k477k39N993Q172
$$ -6473 -9803 -6576 -11031 -8702 -1103 909 -4879 -8182 -6548 -8524 -9736 -12213 -12452 -6459 1713
17698A713n808o743j638L618m711p44m45M197K808m901n910O362l079l811K436
$$ 1713 -4095 -10838 -12476 -8858 -13569 -14313 -14758 -10561 -7753 -12654 -18564 -12202 -15281 -19092 -16656
17683a6656J055r69J479L435M222j990q26N52o100l135k4R414J61j951o00k056
$$ -16656 -15601 -16570 -15091 -11656 -7434 -9424 -10250 -9698 -15798 -18933 -18957 -9543 -9382 -11333 -11933 -13989
17667a3989j310M872J844j052p367J40J050l975K128O340k178n047P374J1705
$$ -13989 -15299 -10427 -8583 -9635 -17002 -16862 -15812 -19787 -17659 -11319 -13497 -18544 -11170 535
17653E35m16l820j032J183k606n908n522M096M257M766K683j0335n229K275K660
$$ 535 119 -3701 -4733 -3550 -6156 -12064 -17586 -13490 -9233 -4467 -1784 -12119 -17348 -15073 -12413
17638a2413n53j215O39j580j103J813l711n864J692L858m95J862L229J116M958
$$ -12413 -12966 -14181 -13542 -15122 -16225 -14412 -18123 -23987 -22295 -18437 -18932 -17070 -13841 -12725 -7767
17623g767j867m988k12l83M174J719J0643p908m890J0545J2320m00p543m235m308
$$ -7767 -9634 -14622 -14834 -15217 -11043 -9324 1319 -6589 -11479 -934 11386 10986 3443 -792 -5100
17608e100k288j738K162M513j080m522j009P017L965L979j0246n004j0K28n074
$$ -5100 -7388 -9126 -6964 -2451 -3531 -8053 -9062 -2045 1920 5899 -4347 -9351 -9361 -9133 -14207
17593a4207q442J889M216J170L220p51m633l140n12N054o370L349N598j925K90
$$ -14207 -22649 -20760 -16544 -15374 -12154 -12905 -17538 -20678 -21190 -16136 -22506 -19157 -13559 -15484 -15194
17578a5194J884P292k682J828P976k420l51m109L819M459K636K489K23m393k951
$$ -15194 -13310 -6018 -8700 -6872 1104 -1316 -1667 -5776 -1957 2502 5138 7627 7850 3457 506
17563E06k756N7J409L346J2082k875J237M568k216l294j657O853l188l710R68
$$ 506 -2250 -2193 -784 2562 14644 11769 13006 17574 15358 12064 10407 17260 14072 10362 11330
17548A1330o963j647O412M320n22n230K822j773q896m733o0o658K831J0875J30
$$ 11330 4367 2720 9132 13452 12930 7700 10522 8749 -147 -4880 -4940 -11598 -8767 2108 2238
17533B238k291P210J987n133P72P72M281K270j106n375Q3P329n61l24J030N500
$$ 2238 -53 7157 9144 4011 4783 5555 9836 12106 11000 5625 5708 13037 12476 12152 13182 18682
17517A8682J106K089p09J518j482L44J0676J4857J1521J7310K4624L4993L5349
$$ 18682 19788 21877 21168 22686 21204 21548 32224 47081 58602 75912 100536 135529 170878
17504A70878L4819L1495K0766J1639j0471k0134j9136j7472k2183k0790q3J0676
$$ 170878 205697 237192 257958 269597 259126 238992 219856 202384 180201 159411 159328 170004
17492A70004K2454L0342K5214J7896K3627O195q727k3161l2393l0686k9364l3714
$$ 170004 192458 222800 248014 265910 289537 295732 287005 263844 231451 200765 171401 137687
17480A37687k1859j1381j4861r141p778m325n929l867q508o876j601l796j125
$$ 137687 115828 104447 89586 80445 72667 68342 62413 58546 50038 43162 41561 37765 36640
17467C6640J867l272n382O132L283n463m389j150K332p002l494K606M267l632
$$ 36640 38507 35235 29853 35985 39268 33805 29416 28266 30598 23596 20102 22708 26975 23343
17453B3343k212p722K332O676j850m667N372J15k288q738k771n54m312N550J1394
$$ 23343 21131 13409 15741 22417 20567 15900 21272 21387 19099 10361 7590 7036 2724 8274 19668
17438A9668N596N369J3952M095j3271j2065j0221o863k178M504O110O37j500l626
$$ 19668 25264 30633 44585 48680 35409 23344 13123 6260 4082 8586 14696 15333 13833 10207
17424A0207j983J528l552n684M858J649k270N4k421k38m589q571K25O484M326
$$ 10207 8224 9752 6200 516 5374 7023 4753 4807 2386 2148 -2441 -11012 -10787 -4303 23
17409B3Q037r12r731l523o22K865J0856m80r382j438j870O329J535o281Q265M551
$$ 23 8060 7148 -2583 -6106 -6728 -3863 6993 6513 -2869 -4307 -6177 152 1687 -4594 3671 8222
17393H222j858o243o700M148J175o493n61L389J360K720k43m559n834L340j854
$$ 8222 6364 121 -6579 -2431 -1256 -7749 -8310 -4921 -3561 -841 -1084 -5643 -11477 -8137 -9991
17378i991K980O6n201n05J770K336J117P37r88J1159L370m023p333J55L286J869
$$ -9991 -7011 -6945 -12146 -12651 -10881 -8545 -7428 -6691 -7679 3480 6850 2827 -4506 -4351 -1065 804
17362H04j946p39k256M267j890K591n899o120O87L874M646l121l498j850N475
$$ 804 -1142 -1881 -4137 130 -1760 831 -5068 -11188 -10501 -6627 -1981 -5102 -8600 -10450 -4975
17347d975K090K92j046n662p83Q40P05M287p3j971J053j171j636K846%P1O086
$$ -4975 -2885 -2593 -3639 -9301 -10084 -9244 -8539 -4252 -4325 -6296 -5243 -6414 -8050 -5204 -5204 -5133 953
17330I53J845l679L219J1131J0255l069j342m231l435j358k998n432K577R97J471
$$ 953 2798 -881 2338 13469 23724 20655 19313 15082 11647 10289 7291 1859 4436 5433 6904
17315F904J992K680k883j2704J121N429K152K968J639M718k476j451M075l678
$$ 6904 8896 11576 8693 -4011 -2890 2539 4691 7659 9298 14016 11540 10089 14164 10486
17301A0486r242m312K791K666K568m000J928k752N43J78K7m721l886m809N066
$$ 10486 1244 -3068 -277 2389 4957 957 2885 133 676 854 881 -3840 -7726 -12535 -7469
17286g469N079L020k480k351J995M038j243L771J137j232p0j0510K523O369J248
$$ -7469 -2390 630 -1850 -4201 -2206 1832 589 4360 5497 4265 4195 -6315 -3792 2577 3825
17271C825j005J143l163j273n725j201n471L61K834K249j226k628j814P083K403
$$ 3825 2820 3963 800 -473 -6198 -7399 -12870 -12509 -9675 -7426 -8652 -11280 -13094 -6011 -3608
17256c608J98M527o076L232J292J757P65j963O095o06n983r25n898N47j313J616
$$ -3608 -3410 1117 -4959 -1727 -435 1322 2087 124 6219 5613 -370 -1295 -7193 -6646 -7959 -6343
17240f343J265o976l217J0807J2038M660j511k646o803q478N10K741Q75q2k5O545
$$ -6343 -5078 -12054 -15271 -4464 7574 12234 10723 8077 1274 -7204 -6694 -3953 -3078 -3160 -3185 3360
17224C360J874l470P51K343j995o856R94m53L304M887K092k231p94J120L28K582
$$ 3360 5234 1764 2515 4858 2863 -3993 -2999 -3452 -148 4739 6831 4600 3806 4926 5254 7836
17208G836K54k000J107j104n528J801j54o804q108m529Q072L217M68j689k472
$$ 7836 8090 6090 7197 6093 565 2366 2212 -4592 -12700 -17229 -9157 -5940 -5472 -7161 -9633
17193i633M24K19J0617L425J409k04L836J357p929l344Q39o212l908L75K598L60
$$ -9633 -9209 -8990 1627 5052 6461 6257 10093 11450 3521 177 1016 -5196 -9104 -8729 -6131 -5771
17177e771j167N435J0391K20p300j591L925r99O802m672p870L542N819l029q467
$$ -5771 -6938 -1503 8888 9108 1808 217 4142 3143 9945 5273 -2597 945 6764 3735 -4732
17162d732L965n75j13j528N30m369P032P380m001J031N233p381k401q28q989n49
$$ -4732 -767 -1342 -1455 -2983 -2453 -6822 210 7590 3589 4620 9853 2472 71 -757 -9746 -10295
17146a0295N683P970k8J445M830o337p071k48K883l07M649r32M139N93n533L596
$$ -10295 -4612 3358 3330 4775 9605 3268 -3803 -4051 -1168 -1475 3174 2242 6381 6974 1441 5037
17130E037k081p107n81O258n884K227k40K529n7L266l022l486m07O378N855k265
$$ 5037 2956 -4151 -4732 1526 -4358 -2131 -2371 158 101 3367 345 -3141 -3548 2830 8685 6420
17114F420n358R54m430j053L616M188K653M67M155J948k14l639l08k396m457l950
$$ 6420 1062 2016 -2414 -3467 149 4337 6990 7457 11612 13560 13346 9707 9399 7003 2546 -1404
17098a404J469R90q88K254M115k253j474m140k41Q133N638o939p761l756L992
$$ -1404 65 1055 167 2421 6536 4283 2809 -1331 -1572 6561 12199 5260 -2501 -6257 -2265
17083b265R396L471m388p265J0084N089k6m973k651n34J491n715O919J1388L362
$$ -2265 7131 10602 6214 -1051 9033 14122 14096 9123 6472 5938 7429 1714 8633 20021 23383
17068B3383n376j142K182N414m758k091P418O82m134j944n622p332l157K316P29
$$ 23383 18007 16865 19047 24461 19703 17612 25030 25712 21578 19634 14012 6680 3523 5839 6568
17053F568j4597p833Q200Q973O760Q206N13K943R500l782j1117m773Q35K451o65
$$ 6568 -8029 -15862 -7662 1311 8071 16277 16790 19733 29233 25451 14334 9561 10396 12847 12182
17038A2182r00p79l707k419Q682M074k390L702p23P343O641n434q864k220j690
$$ 12182 11282 10503 6796 4377 13059 17133 14743 18445 17722 25065 31706 26272 17408 15188 13498
17023A3498P5k032J645j05l750P624N029j0370j235M950l637O41J098L327l277
$$ 13498 13573 11541 13186 13081 9331 16955 21984 11614 10379 15329 11692 12333 13431 16758 13481
17008A3481j095J861n456K447P67n669r617J405J2818M111j991j433p169O917
$$ 13481 12386 14247 8791 11238 12005 6336 -3281 -1876 10942 15053 13062 11629 4460 11377
16994A1377J0254o906n838K943P756N830j253l836J345L904K056K142O686J226
$$ 11377 21631 14725 8887 11830 19586 25416 24163 20327 21672 25576 27632 29774 36460 37686
16980C7686M364j223K643R130J0740J7550K6648K8426L2464N2121N6405M0313
$$ 37686 42050 40827 43470 52600 63340 80890 107538 135964 168428 220549 276954 317267
16968C17267K0600M645k4868m3224l9552l7734k8712j3420J2608K3469K8051M0393
$$ 317267 337867 342512 317644 274420 234868 197134 168422 155002 167610 191079 219130 259523
16956B59523L9303K5671J6623k601k2446m7239m7591m4136k9216j8977j9941j9015
$$ 259523 298826 324497 341120 338519 316073 268834 221243 177107 147891 128914 108973 89958
16944H9958q409m405j114r439o971l218N460l27J4o377K873L076j0021r829l00
$$ 89958 81549 77144 76030 66591 59620 56402 61862 61535 61549 55172 58045 61121 51100 41271 40971
16929D0971n6P38N183o516j5585r1j917L534J734M678l131n266l155J82N380K34
$$ 40971 40915 41653 46836 40320 24735 24644 22727 26261 27995 32673 29542 24276 21121 21303 26683 26917
16913B6917M097P857m83m107k736l467n846l384p89j539R73J1567k488K203M321
$$ 26917 31014 38871 38388 34281 31545 28078 22232 18848 18059 16520 17493 29060 26572 28775 33096
16898C3096j4l990j081q068j525M452P74q02M32R39k487m309J065l892k673Q3
$$ 33096 33082 29092 28011 19943 18418 22870 23644 22842 23274 24213 21726 17417 18482 14590 11917 12000
16882A2000l933J922j824N101M756l201n682M725O77q473j0495J606N409R292
$$ 12000 8067 9989 8165 13266 18022 14821 9139 13864 14541 6068 -4427 -2821 2588 11880
16868A1880P847J201k298l864J448P7m502J885O966q18K235j016m802l299J918
$$ 11880 19727 20928 18630 14766 16214 16291 11789 13674 20640 19822 22057 21041 16239 12940 14858
16853A4858J940j422l402p413j051R743L231J348j441j010Q617M283j286m883
$$ 14858 16798 15376 11974 4561 3510 13253 16484 17832 16391 15381 23998 28281 26995 22112
16839B2112m950l118J861J148m05M460k14m022M601j21O36j981n255M346N324
$$ 22112 17162 14044 15905 17053 16648 21108 20894 16872 21473 21352 21988 20007 14752 19098 24422
16824B4422J216l916O79q98p992m098O586N63J0949N43l622m293m568o276P199
$$ 24422 25638 21722 22401 21503 13511 9413 15999 16562 27511 28054 24432 20139 15571 9295 16494
16809A6494j86J000j213n58L14O929K371J75N231m85j0251K629J469k200k452
$$ 16494 16308 17308 16095 15537 15851 22780 25151 25326 30557 30072 19821 22450 23919 21719 19267
16794A9267M12K164q62k911M244m399l358N764m685m059P80r51M769J235o486
$$ 19267 19679 21843 20981 18070 22314 17915 14557 20321 15636 11577 12357 11406 16175 17410 10924
16779A0924m795K518P116o154q758j751Q735M200p269j098J19L545J655L373M23
$$ 10924 6129 8647 15763 9609 851 -900 7835 12035 4766 3668 3787 7332 8987 12360 12783
16764A2783L604m72L857J526M219j261K394l538l846J027M862J739J798j514m52
$$ 12783 16387 15915 19772 21298 25517 24256 26650 23112 19266 20293 25155 26894 28692 27178 26726
16749B6726k417J422N336O118j147j542j630n448q583k499R083M683m869J867
$$ 26726 24309 25731 31067 37185 36038 34496 32866 27418 18835 16336 25419 30102 25233 27100
16735B7100K767L214L303n511m028L976J0486K207N297M60n823K935r71O20k515
$$ 27100 29867 33081 36384 30873 26845 30821 41307 43514 48811 49271 43448 46383 45412 46032 43517
16720D3517L05m67p989p565J853M393q91L952J699P138m003o272j26J719n450
$$ 43517 43822 43355 35366 27801 29654 34047 33156 37108 38807 45945 41942 35670 35544 37263 31813
16705C1813l696n832l323M171K069l721p325o274J119O562Q31Q220J068j1602
$$ 31813 28117 22285 18962 23133 25202 21481 14156 7882 9001 15563 16394 24614 25682 14080
16691A4080r811k525P35J014Q23l643K897P217P598L26o90l567J714J329L396
$$ 14080 4269 1744 2479 3493 4316 673 3570 10787 18385 18711 18021 14454 16168 17497 20893
16676B0893N76m359J476J0969R429k47J2129J349L930L487r8l720j0007r766j384
$$ 20893 21469 17110 18586 29555 38984 38737 50866 52215 56145 59632 59534 55814 45807 36041 34657
16661C4657N3L430N342J3083M253L06N255m400r7l152j53J47M57r348r141n084
$$ 34657 34710 38140 43482 56565 60818 61124 66379 61979 61882 58730 58577 58724 59181 49833 40692 35608
16645C5608j221K667j840p266L645J845o22O631J389J415K976L170p351l470J967
$$ 35608 34387 37054 35214 27948 31593 33438 32816 39447 40836 42251 45227 48397 41046 37576 39543
16630C9543M342O53j0115J531N170J501L43k052K894n65m740n991p166J578Q273
$$ 39543 43885 44538 34423 35954 41124 42625 42968 40916 43810 43245 38505 32514 25348 26926 35199
16615C5199J0554j232J705R76q015n652l17J575k073l45j523j615k404O867K640
$$ 35199 45753 44521 46226 47202 39187 33535 33218 34793 32720 32375 30852 29237 26833 33700 36340
16600C6340k164K697J386j311k685J951J045L68k577n30L912J525P570J518p80
$$ 36340 34176 36873 38259 36948 34263 36214 37259 37627 35050 34520 38432 39957 47527 49045 48265
16585D8265L665N293k145n5o756p099k837j716N695M63R34J2217j48l208k151
$$ 48265 51930 57223 55078 55023 48267 41168 38331 36615 42310 42773 43707 55924 55776 52568 50417
16570E0417J862q74K752q62N73N545K474L654J443m338K830J019n90K470N110
$$ 50417 52279 51405 54157 53295 53868 59413 61887 65541 66984 62646 65476 66495 65905 68375 73485
16555G3485J674n25L436P541m144O9M475J1077R951O466P646Q468M892N532L272
$$ 73485 75159 74634 78070 85611 81467 81536 86011 97088 107039 113505 121151 129619 134511 140043 143315
16540A43315j013k711o158q706o94O725J5668J7662R590N440M75M678R549Q449
$$ 143315 142302 139591 133433 124727 124033 130758 146426 164088 173678 179118 179593 184271 193820 202269
16526B02269R514o61J095r206k803N937P180J1150K436L542P065P178L575L795
$$ 202269 211783 211122 212217 203011 200208 206145 213325 224475 226911 230453 237518 244696 248271 252066
16512B52066N716J1038N038J1207Q322R763J5438J7309K0745K1577J2978K4140
$$ 252066 257782 268820 273858 285065 293387 303150 318588 335897 356642 378219 391197 415337
16500D15337L5023M0347N0017O3096R5491J49604K47287L66006M66281N66161
$$ 415337 450360 490707 540724 603820 699311 848915 1096202 1462208 1928489 2494650
16490B494650O18098N13090L15400J03349j83605m95091n17231m69120l50384
$$ 2494650 3112748 3625838 3941238 4044587 3860982 3365891 2848660 2379540 2029156
16481B029156j56451K4861J93353L36332M55853N28306M61791K90388P1575k02483
$$ 2029156 1872705 1897566 2090919 2427251 2883104 3411410 3873201 4163589 4235164 4032681
16471D032681n16425n69768n32432m58686l09949k07080j43922r7682o5205m7140
$$ 4032681 3516256 2946488 2414056 1955370 1645421 1438341 1294419 1196737 1131532 1084392
16461A084392l5758k2564k0222j6340m212n461j2956j3807q081l865m996P806
$$ 1084392 1048634 1026070 1005848 989508 985296 979835 966879 953072 944991 941126 936130 943936
16449I43936K3472L5517M5954P2963Q8643R7912R4010Q3062P1033O8381O3343
$$ 943936 967408 1002925 1048879 1121842 1210485 1308397 1402407 1485469 1556502 1624883 1688226
16438A688226N8125P2567J04241J31441J63240K03498K51383K76065L15722L59957
$$ 1688226 1746351 1818918 1923159 2054600 2217840 2421338 2672721 2948786 3264508 3624465
16428C624465L97795M59704N57248P29594R86375J434684K214007L484764N169752
$$ 3624465 4022260 4481964 5039212 5768806 6755181 8189865 10403872 13888636 19058388
16419A9058388O720007Q243868R505498Q522984N602334K673614p02863o106373
$$ 19058388 25778395 34022263 43527761 52050745 57653079 60326693 59623830 53517457
16411E3517457p928217p009332o418610l939696o72566K237084M487947O405565
$$ 53517457 45589240 38579908 32161298 28221602 27549036 29786120 34274067 40679632
16403D0679632P988853P363260M666885J829561j316133o609526q842176q132239
$$ 40679632 48668485 56031745 60698630 62528191 61212058 54602532 45760356 37628117
16395C7628117p936810o257539m169110k841188k034762j520279j172290r24212
$$ 37628117 29691307 23433768 19264658 16423470 14388708 12868429 11696139 10771927
16387A0771927p24091n85389m93167m28082m02215m07498l97528l87563l63903
$$ 10771927 10047836 9462447 8969280 8541198 8138983 7731485 7333957 6946394 6582491
16378F582491l35873k90190k48423k21633j92235j72175j63585j54127j51717
$$ 6582491 6246618 5956428 5708005 5486372 5294137 5121962 4958377 4804250 4652533
16369D652533j65269j85820j72774j74824j71471j55312j42264j29434j30687
$$ 4652533 4487264 4301444 4128670 3953846 3782375 3627063 3484799 3355365 3224678
16360C224678j20940j12776j07586r1390q7953q4487p5756p1460p4755p5006p4441
$$ 3224678 3103738 2990962 2883376 2791986 2704033 2619546 2543790 2472330 2397575 2322569 2248128
16349B248128p2944o6182o4995n7774o1972o6204n6492n8370m9588l9631m3971
$$ 2248128 2175184 2109002 2044007 1986233 1924261 1858057 1801565 1743195 1693607 1653976 1610005
16338A610005m0379l8638l6571m3153l8522m1064m0827l7133l5671l5195k8206
$$ 1610005 1569626 1530988 1494417 1451264 1412742 1371678 1330851 1293718 1258047 1222852 1194646
16327A194646k6509l8297l7325k7368k5251k7215k3854l2324k8159k2465j4966
$$ 1194646 1168137 1129840 1092515 1065147 1039896 1012681 988827 956503 928344 905879 890913
16316H90913k2554k4313k2619k0435k4734k1588k3473k2327j4889j3808j2250
$$ 890913 868359 844046 821427 800992 776258 754670 731197 708870 693981 680173 667923
16305F67923j2649j5214j3373n944P303J3511J2346K9593K8480K0970J4720O824
$$ 667923 655274 640060 626687 620743 628046 641557 653903 683496 711976 732946 747666 754490
16293G54490q645l6476m0898l4619j6542q925j816Q754J6514J5076M622r447j3117
$$ 754490 745845 709369 668471 633852 617310 608385 606569 615323 631837 646913 651535 642088 628971
16280F28971m0831n1950m6771l9649l8112l4877k6484j8966j7549m921j3412j6511
$$ 628971 588140 536190 489419 449770 411658 376781 350297 331331 313782 308861 295449 278938
16268B78938q441r970j3609j3897j3235p266r143j3784j6091j1734k546l509l494
$$ 278938 270497 260527 246918 233021 219786 212520 203377 189593 173502 161768 159222 155713 152219
16255A52219l517J468j2785j826n819n350n935m803L468l21q722j1528j894j470
$$ 152219 148702 150170 137385 135559 129740 124390 118455 113652 117120 116799 108077 96549 94655 93185
16241I3185l523L977M257J188L848n216n858o498n708J018q257j654L073J284
$$ 93185 89662 93639 97896 99084 102932 97716 91858 85360 79652 80670 72413 70759 73832 75116
16227G5116J3184P525m878L23J414P01n034o106m025j032n0L844N8j675P61J952
$$ 75116 88300 95825 90947 91270 92684 93385 88351 82245 78220 77188 77138 80982 81040 79365 80126 82078
16211H2078L572N037j009k368p491m841p798L368m552j284N240o71l492M53K901
$$ 82078 85650 90687 89678 87310 79819 74978 67180 70548 65996 64712 69952 69281 65789 66242 69143
16196F9143P09j105j818j0169j076r60m862K908j511K095K195k743m038j41l4
$$ 69143 69852 68747 66929 56760 55684 54724 49862 52770 51259 53354 55549 52806 48768 48627 48593
16181D8593m556J121k533o95J483j421n188M705K423n716K31P080k135J067O349
$$ 48593 44037 45158 42625 41930 43413 41992 36804 41509 43932 38216 38447 45527 43392 44459 50808
16166E0808j595o726L78n06P535N830L194n563o19j383l950o527Q620J1010m371
$$ 50808 49213 42487 42865 42359 49894 55724 58918 53355 52736 51353 47403 40876 49496 60506 56135
16151E6135j228L423N14l263l084q602m898O120j89n667j342o30L896o120J827
$$ 56135 54907 58330 58844 55581 52497 43895 38997 45117 44928 39261 37919 37289 41185 35065 36892
16136C6892N099o187j1383m014R195Q402k384J091R4o248p770J970L576J324q544
$$ 36892 41991 35804 24421 20407 29602 38004 35620 36711 36805 30557 22787 24757 28333 29657 21113
16121B1113R29m38L645J87j329J302k171p337n123n547m687j928L260l53l573
$$ 21113 22042 21604 25249 25436 24107 25409 23238 15901 10778 5231 544 -1384 1876 1523 -2050
16106b050j143r567o001M12jJ803L590q94k74n85l267j193R52l090o220P64k485
$$ -2050 -3193 -12760 -18761 -18349 -18350 -16547 -12957 -13851 -14125 -14710 -17977 -19170 -18218 -21308 -27528 -26764 -29249
16089b9249n007r733O052Q498P967J555J370M346J23k401k759k331o743M626N011
$$ -29249 -34256 -43989 -37937 -29439 -21472 -19917 -18547 -14201 -14078 -16479 -19238 -21569 -28312 -23686 -18675
16074a8675j180n02j848k508R085P887J812q355l294K531K26n76O754n2m151R340
$$ -18675 -19855 -20357 -22205 -24713 -15628 -7741 -5929 -14284 -17578 -15047 -14821 -15397 -8643 -8695 -12846 -3506
16058c506L352k676P81n278n806l25O590o286J994R38O763J458K580j036l121
$$ -3506 -154 -2830 -2049 -7327 -13133 -13458 -6868 -13154 -11160 -10222 -3459 -2001 579 -457 -3578
16043c578K98n779j0349j611L627M370q070L937l02M773L285M022O932J84m082
$$ -3578 -3280 -9059 -19408 -21019 -17392 -13022 -21092 -17155 -17457 -12684 -9399 -5377 1555 1739 -2343
16028b343r61J703L667m522q746N030o03j0706K68R136O910N70o374J011j815
$$ -2343 -3304 -1601 2066 -2456 -11202 -6172 -6775 -17481 -17213 -8077 -1167 -597 -6971 -5960 -7775
16013g775J479j081L395J45j772M144K87o725N33N584L890n944R71L537k481M938
$$ -7775 -6296 -7377 -3982 -3837 -5609 -1465 -1178 -7903 -7370 -1786 2104 -3840 -2869 668 -1813 3125
15997C125K964m451m358j439q39R49N766l647n827n845p134L435M598L9M026N953
$$ 3125 6089 1638 -2720 -4159 -4998 -4049 1717 -1930 -7757 -13602 -20736 -17301 -12703 -12664 -8638 -2685
15981b685K274N10J70o101R55K061k74J246j175L152l174r89K255K222K03j31
$$ -2685 -411 99 269 -5832 -4877 -2816 -3090 -1844 -3019 133 -3041 -4030 -1775 447 650 519
15965E19p049k919k390M220L584L046k770n186l847n490j149K900n122N083Q979
$$ 519 -6530 -9449 -11839 -7619 -4035 -989 -3759 -8945 -12792 -18282 -19431 -16531 -21653 -16570 -7591
15950g591k643O202N340r049j0204J399L623K712k536K625N255J563l579L172
$$ -7591 -10234 -4032 1308 -7741 -17945 -16546 -12923 -10211 -12747 -10122 -4867 -3304 -6883 -3711
15936c711P39m765J684O041k146q697L54O463P011L375P93N587j989q709q702
$$ -3711 -2972 -7737 -6053 -12 -2158 -10855 -10501 -4038 2973 6348 7141 12728 10739 2030 -6672
15921f672R02J686p93N629M082P44J568l199m192K945O847R85j117J173n33o150
$$ -6672 -5770 -4084 -4877 752 4834 5578 7146 3947 -245 2700 9547 10532 9415 10588 10055 3905
15905C905r400n63L922M373r655j148N066j911J147l80N989M14m999N52K111P263
$$ 3905 -5495 -6058 -2136 2237 -7418 -8566 -3500 -5411 -4264 -4644 1345 1759 -3240 -2688 -577 6686
15889F686L172m871q922K817M37p11j058k465Q592L951k020j446L128n88O55L930
$$ 6686 9858 4987 -3935 -1118 -681 -1392 -2450 -4915 3677 7628 5608 4162 7290 6702 7357 11287
15873A1287R01m565j808j775L378N357p35M027M417j003Q263J4763J6716J9158
$$ 11287 12188 7623 5815 4040 7418 12775 12040 16067 20484 19481 27744 42507 59223 78381
15859G8381K7999M8163N0727M4810L7627K1442j752k0369l6699l4503l4042k5190
$$ 78381 106380 154543 205270 250080 287707 309149 307397 287028 250329 215826 181784 156594
15847A56594j3547L27K3645K2236M2001N1044M1604J4863m218k8642m9947m3872
$$ 156594 143047 143374 167019 189255 231256 282300 323904 338767 334549 305907 255960 212088
15835B12088l7379m1214k8722j5376j0155j5971j1372j1315p497J207k315P5M568
$$ 212088 174709 133495 104773 89397 79242 63271 51899 40584 33087 34294 31979 32054 36622
15822C6622K922j908o614K356J673n275J06k707j875k080n472k994M341K432o630
$$ 36622 39544 37636 31022 33378 35051 29776 29882 27175 25300 23220 17748 14754 19095 21527 14897
15807A4897L391L542o918o274j388J288Q33l58l917n390P54k94Q283P921n398
$$ 14897 18288 21830 14912 8638 7250 8538 9371 9013 5096 -294 460 166 8449 16370 10972
15792A0972p000r82L517P075M048j714j88K489j914m594l884j920m635m309K789
$$ 10972 3972 2990 6507 13582 17630 15916 15728 18217 16303 11709 7825 5905 1270 -3039 -250
15777b50P344m970n59j141j16L896n459M523l978j3905J38M145K867l380l54J7
$$ -250 7094 2124 1565 424 308 4204 -1255 3268 -710 -14615 -14477 -10332 -7465 -10845 -11199 -11182
15761a1182m297J217O902Q67L588k974n378j0953L823Q039N253m39l442k293J054
$$ -11182 -15479 -14262 -7360 -6493 -2905 -5879 -11257 -22210 -18387 -10348 -5095 -5534 -8976 -11269 -10215
15746a0215M903q12K29o22l756k94O969J213j268r792R60M443p67J263J723K597
$$ -10215 -5312 -6124 -5895 -6517 -10273 -10567 -3598 -2385 -3653 -13445 -12485 -8042 -8809 -7546 -5823 -3226
15730c226Q736J0205m9j0801r993j828P015m224n013r79n74L75J875l466K997
$$ -3226 5510 15715 15666 4865 -5128 -6956 59 -4165 -9178 -10157 -10731 -10356 -8481 -11947 -8950
15715h950q46Q00L155N321K406l031n642j0845J286P650M345N071m573j889p39
$$ -8950 -9796 -8996 -5841 -520 1886 -1145 -6787 -17632 -16346 -8696 -4351 720 -3853 -5742 -6481
15700f481N987K892K951J639m179n743j057k127o137l273R056J322k141q563k222
$$ -6481 -494 2398 5349 6988 2809 -2934 -3991 -6118 -12255 -15528 -6472 -5150 -7291 -15854 -18076
15685a8076L311O00L060J1714M295j0677q314j215K595L027o795L343P888L861
$$ -18076 -14765 -14165 -11105 609 4904 -5773 -14087 -15302 -12707 -9680 -16475 -13132 -5244 -1383
15671a383n18O71r11l963k181N99m296m880J853p19J690R10K063l527p283K814
$$ -1383 -1901 -1230 -2141 -6104 -8285 -7686 -11982 -16862 -15009 -15728 -14038 -13128 -11065 -14592 -21875 -19061
15655a9061l04O736K566p66M739K081k70n357M886K939r89o911l258l732Q50R17
$$ -19061 -19365 -12629 -10063 -10829 -6090 -4009 -4279 -9636 -4750 -1811 -2800 -9711 -12969 -16701 -15851 -14934
15639a4934J0741P91o564N12m945J918M814J839L650n782N28O109L342k125M495
$$ -14934 -4193 -3402 -9966 -9454 -14399 -12481 -7667 -5828 -2178 -7960 -7432 -1323 2019 -106 4389
15624D389N131j32l586j287j257p25K723q128m630L446J034n918m497K109j935
$$ 4389 9520 9388 5802 4515 3258 2533 5256 -2872 -7502 -4056 -3022 -8940 -13437 -11328 -13263
15609a3263J421N386K271n921J942L626m040p757N019N801r510L714M449M47k098
$$ -13263 -11842 -6456 -4185 -10106 -8164 -4538 -8578 -16335 -11316 -5515 -15025 -11311 -6862 -6415 -8513
15594h513K662j360n692J216N672j942j361k79K067L761o473l720L878K892L533
$$ -8513 -5851 -7211 -12903 -11687 -6015 -7957 -9318 -9597 -7530 -3769 -10242 -13962 -10084 -7192 -3659
15579c659q74m935j309k08j058M813O047M964m17M230l499l099K021m937l665
$$ -3659 -4533 -9468 -10777 -10985 -12043 -7230 -1183 3781 3364 7594 4095 996 3017 -1920 -5585
15564e585K889K349j488n2L891J026l054o876k020j478O11M444j595N400M01n783
$$ -5585 -2696 -347 -1835 -1887 2004 3030 -24 -6900 -8920 -10398 -9787 -5343 -6938 -1538 -1137 -6920
15548f920j418L615O372J773j311m549q551k884M672l87P550L645o061L870o30
$$ -6920 -8338 -4723 1649 3422 2111 -2438 -10989 -13873 -9201 -9588 -2038 1607 -4454 -584 -1214
15533a214J169R22K740l329m780m112l952L817O653K853M557J144K712o543p341
$$ -1214 -45 877 3617 288 -4492 -8604 -12556 -8739 -2086 767 5324 6468 9180 2637 -4704
15518d704j685k329J808n390l890Q729L695p29j0222j60K413k468M418J0406n563
$$ -4704 -6389 -8718 -6910 -12300 -16190 -7461 -3766 -4495 -14717 -14877 -12464 -14932 -10514 -108 -5671
15503e671j353J745j601L707L274M971o040m296l485M74J795n254K772M017l304
$$ -5671 -7024 -5279 -6880 -3173 101 5072 -968 -5264 -8749 -8275 -6480 -11734 -8962 -4945 -8249
15488h249J715Q306L164m190l00l206m644j978P061Q378k950l562m820l516K277
$$ -8249 -6534 1772 4936 746 446 -2760 -7404 -9382 -2321 6057 3107 -455 -5275 -8791 -6514
15473f514N599J228p84n027o718m217J4041Q429m399j728k957L46j962j019K486
$$ -6514 -915 313 -471 -5498 -12216 -16433 -2392 6037 1638 -90 -3047 -2701 -4663 -5682 -3196
15458c196L895j697j061M062K546j0594k14K509n51k285r489k29K814K896n41
$$ -3196 699 -998 -2059 2003 4549 -6045 -6259 -3750 -4301 -6586 -16075 -16304 -13490 -10594 -11135
15443a1135O104L499m476n724M745M711M09K563J008m304p127r232N357K431M380
$$ -11135 -5031 -1532 -6008 -11732 -6987 -2276 -1867 696 1704 -2600 -9727 -18959 -13602 -11171 -6791
15428f791O646l340n828m542J741N80L432L790p42n998p347J560Q54R62L450r73
$$ -6791 -145 -3485 -9313 -13855 -12114 -11534 -8102 -4312 -5054 -11052 -18399 -16839 -15985 -15023 -11573 -12546
15412a2546l543R363L951J117j012j273k206k131L352j432J914J549k054m57L78
$$ -12546 -16089 -6726 -2775 -1658 -2670 -3943 -6149 -8280 -4928 -6360 -4446 -2897 -4951 -5408 -5030
15397e030O530k573l025r18K750j213r701l111L786K005P568n56k18p309J354
$$ -5030 1500 -1073 -4098 -5016 -2266 -3479 -13180 -16291 -12505 -10500 -2932 -3488 -3706 -11015 -9661
15382i661K439j253j113m546M800K729R61l574l908J0946m34j900j365l649j311
$$ -9661 -7222 -8475 -9588 -14134 -9334 -6605 -5644 -9218 -13126 -2180 -2614 -4514 -5879 -9528 -10839
15367a0839R826N023j175n359p130M104L645j472p34J3915M655p738l220K981
$$ -10839 -1013 4010 2835 -2524 -9654 -5550 -1905 -3377 -4111 9804 14459 6721 3501 6482
15353F482P06k505J110l723k228k820o497J521K85o54L075o33K377l762q230J185
$$ 6482 7188 4683 5793 2070 -158 -2978 -9475 -7954 -7669 -8323 -5248 -5881 -3504 -7266 -15496 -14311
15337a4311M276N580O596k262j137j867j939L172J399m497j547k823O89R269j500
$$ -14311 -10035 -4455 2141 -121 -1258 -3125 -5064 -1892 -493 -4990 -6537 -9360 -8671 598 -902
15322i02p291j361Q02J427O522O171p322l859k449o775l478J505P012L228P19
$$ -902 -8193 -9554 -8752 -7325 -803 5368 -1954 -5813 -8262 -15037 -18515 -17010 -9998 -6770 -6051
15307f051Q36l83J252J339R716J634l829P77j784j14K748o049l119O684N544o174
$$ -6051 -5215 -5598 -4346 -3007 6709 8343 4514 5291 3507 3393 6141 92 -3027 3657 9201 3027
15291C027r27M12K94L20J165m758l914k554m075M49l591j963K589P987O484J31
$$ 3027 2100 2512 2806 3126 4291 -467 -4381 -6935 -11010 -10561 -14152 -16115 -13526 -5539 945 1076
15275A076p311L148R404J660o152m683n233o81J378M937n17j56l535k181l491
$$ 1076 -6235 -3087 6317 7977 1825 -2858 -8091 -8772 -7394 -2457 -2974 -3130 -6665 -8846 -12337
15260a2337R63L557Q778L176n306m173J315J111p337O317l474k256L961M565j149
$$ -12337 -11374 -7817 961 4137 -1169 -5342 -4027 -2916 -10253 -3936 -7410 -9666 -5705 -1140 -2289
15245b289k578l90K387L333k232m06K526l96n358k956K412m854J723P166M990
$$ -2289 -4867 -5257 -2870 463 -1769 -2175 351 -45 -5403 -8359 -5947 -10801 -9078 -1912 3078
15230C078r93L41J589r147k453n227P835O010K340K652M780J787m929m983L244
$$ 3078 2085 2426 4015 -5132 -7585 -12812 -4977 1033 3373 6025 10805 12592 7663 2680 5924
15215E924o32j0898m23N745M309P82l244m972p40K683L708Q31L344L317o85k967
$$ 5924 5292 -5606 -6029 -284 4025 4807 1563 -3409 -4149 -1466 2242 3073 6417 9734 9049 6082
15199F082j981k809R98n992j366l564K735J377k105M205M440L503P32J190k428
$$ 6082 4101 1292 2290 -3702 -5068 -8632 -5897 -4520 -6625 -2420 2020 5523 6255 7445 5017
15184E017k244q1J06o722j03K732k690o052j232O932K934N86N435j816M5r10k158
$$ 5017 2773 2692 2798 -3924 -4027 -1295 -3985 -10037 -11269 -4337 -1403 -817 4618 2802 2847 1937 -221
15167b21j436j365M778k182K378M967m682J057k886o8r54J326P576N113o089m163
$$ -221 -1657 -3022 1756 -426 1952 6919 2237 3294 408 340 -614 712 8288 13401 7312 3149
15151C149k355L343O287j963j1679N70N62P625K155k982m906k139N747K905k664
$$ 3149 794 4137 10424 8461 -3218 -2648 -2086 5539 7694 4712 -194 -2333 3414 6319 3655
15136C655J595n181P580J073j637K724o132n641k339j252k077N03j789M121M840
$$ 3655 5250 69 7649 8722 7085 9809 3677 -1964 -4303 -5555 -7632 -7129 -8918 -4797 43
15121D3R103k093p153l616M88K999L722L336M401M287m761q91K910k663k768n119
$$ 43 9146 7053 -100 -3716 -3228 -229 3493 6829 11230 15517 10756 9865 12775 10112 7344 2225
15105B225l25O177K357o078p584l942L161l03j675m575k637P233M591o954L978
$$ 2225 1900 8077 10434 4356 -3228 -7170 -4009 -4312 -5987 -10562 -13199 -5966 -1375 -8329 -4351
15090d351M21M470L720O129p154o088M796K670k663k050j281O70Q007P851j488
$$ -4351 -3930 540 4260 10389 3235 -2853 1943 4613 1950 -100 -1381 -711 7296 15147 13659
15075A3659k269N750R894K065O115J4213R959R953P368K967j1017p781j3020j1895
$$ 13659 11390 17140 27034 29099 35214 49427 59386 69339 76707 79674 68657 60876 47856 35961
15061C5961m642n888j3151k231N158o087k900m064k102l695J053N071M461N891
$$ 35961 31319 25431 12280 10049 15207 9120 6220 2156 54 -3641 -2588 2483 6944 12835
15047A2835j637m507k80J696k728l307k468L731L63l115M340M777m088j13P051
$$ 12835 11198 6691 6411 8107 5379 2072 -396 3335 3698 583 4923 9700 5612 5499 12550
15032A2550L853r214m492L109r25J157J535j338l647k134M211M105o390n02j113
$$ 12550 16403 7189 2697 5806 4881 6038 7573 6235 2588 454 4665 8770 2380 1878 765
15017G65M979N212k995j980K027n269o675J944N333Q101K298M065K073l097m466
$$ 765 5744 10956 7961 5981 8008 2739 -3936 -1992 3341 11442 13740 17805 19878 16781 12315
15002A2315k512K271q499M847n232p957N466O931J619M231Q14j6627l990M621
$$ 12315 9803 12074 3575 8422 3190 -4767 699 7630 9249 13480 14294 -2333 -6323 -1702
14988a702M57L932M634k5M011J006k228q21R55j019J484N663l652n464l034K197
$$ -1702 -1245 2687 7321 7296 11307 12313 10085 9264 10219 9200 10684 16347 12695 7231 4197 6394
14972F394O275m22m079l948j710l937Q162r02n701J878L251M639m194k016q49
$$ 6394 12669 12247 8168 4220 2510 -1427 6735 5833 132 2010 5261 9900 5706 3690 2841
14957B841n939o414j894N112M595M183m845o674j980M427P741j092Q330r92o193
$$ 2841 -3098 -9512 -11406 -6294 -1699 2484 -2361 -9035 -11015 -6588 1153 61 8391 7399 1206
14942A206N34j083J348r080o43j636N432P989L295J570J695l241m814r74M6R31
$$ 1206 1740 657 2005 -7075 -7718 -9354 -3922 4067 7362 8932 10627 7386 2572 1598 1644 2575
14926B575m990k509Q346K755m870l973r050j981J2763K315j53M959N510O599Q10
$$ 2575 -2415 -4924 3422 6177 1307 -2666 -11716 -13697 -934 1381 1228 6187 11697 18296 19106
14911A9106m720m263l483L454M182r95K528N816p636j0902M329O20L69K095K163
$$ 19106 14386 10123 6640 10094 14276 13281 15809 21625 13989 3087 7416 8036 8405 10500 12663
14896A2663o315n347m88K410k547n62L116j826n006k757N127N441L578Q55l608
$$ 12663 6348 1001 513 2923 376 -186 2930 1104 -3902 -6659 -1532 3909 7487 8342 4734
14881D734n213r85Q538L444k041j0517j442O333J127j461O533K467k3l740k440
$$ 4734 -479 -1464 7074 10518 8477 -2040 -3482 2851 3978 2517 9050 11517 11494 7754 5314
14866E314J627L858j744M310J2017K262j001j857j0620l981K658r62J125j307
$$ 5314 6941 10799 9055 13365 25382 27644 26643 24786 14166 10185 12843 11881 13006 11699
14852A1699M264j280l106k366M88q74P87J605L16m433k329M925L799J098J271
$$ 11699 15963 14683 11577 9211 9699 8825 9612 11217 11533 7100 4771 9696 13495 14593 15864
14837A5864m727m172l070j27P720l847m837O401O133l601l136N24L108J0824j015
$$ 15864 11137 6965 3895 3768 11488 7641 2804 9205 15338 11737 8601 9125 12233 23057 22042
14822B2042k151j19k458K928J472J44K395K150n304j169l395j0230j404k926l1
$$ 22042 19891 19772 17314 20242 21714 21858 24253 26403 21099 19930 16535 6305 4901 1975 1944
14807A944M421N283J288P77l666M246k09O42M047k188p954m632n47L429L71j876
$$ 1944 6365 11648 12936 13713 10047 14293 14084 14726 18773 16585 8631 3999 3452 6881 7252 5376
14791E376K369P510j857m993P00L204j376n956J072M068k709k717K290R00L354
$$ 5376 7745 15255 13398 8405 9105 12309 10933 4977 6049 10117 7408 4691 6981 7881 11235
14776A1235L9J314m240M46O303L763J279L336p588l290J242j026O459M630n55
$$ 11235 11274 12588 8348 8794 15097 18860 20139 23475 15887 12597 13839 12813 19272 23902 23347
14761B3347q156l932P4J26l600M698J098P026k099k618m643N940O444l665l261
$$ 23347 15191 11259 11333 11459 7859 12557 13655 20681 18582 15964 11321 17261 23705 20040 16779
14746A6779k671n485N035R66l273r22j500o388P60R017N3K919O920L448P390n69
$$ 16779 14108 8623 13658 14624 11351 10429 8929 2541 3301 12318 12371 15290 22210 25658 33048 32479
14730C2479j424n340o717K449Q04j1527M607M807j660M4J868N920J001N231J348
$$ 32479 31055 25715 18998 21447 22251 10724 15331 20138 18478 18522 20390 26310 27311 32542 33890
14715C3890q153p666J763M518R173M089J422j398o583j2283L358N451n724K857
$$ 33890 25737 18071 19834 24352 33525 37614 39036 37638 31055 18772 22130 27581 21857 24714
14701B4714P010L851j273o449j675k35j66L737K548k961K069m50J894J491k989
$$ 24714 31724 35575 34302 27853 26178 25943 25777 29514 32062 29101 31170 30720 32614 34105 31116
14686C1116l397P37M912M657O091m064o804l85k981m502L223O028N318J701K16
$$ 31116 27719 28456 33368 38025 44116 40052 33248 32863 29882 25380 28603 34631 39949 41650 41866
14671D1866k762p025J730O055J955N529J944j716N361j054M862J2496j238r551
$$ 41866 39104 32079 33809 39864 41819 47348 49292 47576 52937 51883 56745 69241 68003 58452
14657E8452j30k45M96M202L713K914j152N451N178K619M388L983R139K127N317
$$ 58452 58322 58077 58573 62775 66488 69402 68250 73701 78879 81498 85886 89869 99008 101135 106452
14642A06452J0904J802o51o80p740o813K631L200L608R942R024J5054J5060J1727
$$ 106452 117356 119158 118507 117827 110087 103274 105905 109105 112713 122655 131679 146733 161793 173520
14628A73520P471J6574K2138K3967K6968K2099L2697L7745M2352N0430O0677P4275
$$ 173520 180991 197565 219703 243670 270638 292737 325434 363179 405531 455961 516638 590913
14616E90913J01735J22764J42400J55575K00970K79595M21182O56614R64343J353942
$$ 590913 692648 815412 957812 1113387 1314357 1593952 2015134 2671748 3636091 4990033
14606D990033J756746K039473K085978J777004J133083K63768o70769j472980
$$ 4990033 6746779 8786252 10872230 12649234 13782317 14046085 13375316 11902336
14598A1902336j932744k002533j777620j390147r72505o45646m40356l25033k54644
$$ 11902336 9969592 7967059 6189439 4799292 3826787 3181141 2740785 2415752 2161108
14589B161108k04382j73320j50502j29212j09258r4208q3909q3105p2402n7146
$$ 2161108 1956726 1783406 1632904 1503692 1394434 1300226 1216317 1133212 1060810 1003664
14579A003664m7914l8626l4719l9782m1422l0489k6921k9520k6356k4964k3606
$$ 1003664 955750 917124 882405 842623 801201 770712 743791 714271 687915 662951 639345
14568F39345k1693k0172j4164j6034k0455k1207j8402j6591j9387k4724j0400
$$ 639345 617652 597480 583316 567282 546827 525620 507218 490627 471240 446516 436116
14557D36116j2171j5356j1819j7874j2634j0489j3960j8267p784j841n049q992
$$ 436116 423945 408589 396770 378896 366262 355773 341813 323546 315762 313921 308872 299880
14545B99880r300j0655q489o038k96m460j1499o478m425o490o92j939q170j5134
$$ 299880 290580 279925 271436 265398 265102 260642 249143 242665 238240 231750 231058 229119 220949 205815
14531B05815o884n927m868M491o159o922p762o15n612o057p280l149M835Q5l812
$$ 205815 198931 193004 188136 192627 186468 179546 171784 171169 165557 159500 152220 149071 153906 153991 150179
14516A50179k293J66k190q833m523j942j728m592j013n624r338K153M52o012p251
$$ 150179 147886 148052 145862 137029 132506 130564 128836 124244 123231 117607 108269 110422 110874 104862 97611
14501I7611N8o325k252L265M552m240l563P60j3530o263L929M435J579m764n617
$$ 97611 97669 91344 89092 92357 96909 92669 89106 89866 76336 70073 74002 78437 80016 75252 69635
14486F9635n646J0458R093P91o204m454l861N325j695J439J497k18J271l018q509
$$ 69635 63989 74447 83540 84331 78127 73673 69812 75137 73442 74881 76378 76160 77431 74413 65904
14471F5904n473N021M48l661L007j819l503n69l035o010n228M534J436L565j150
$$ 65904 60431 65452 65900 62239 65246 63427 59924 59355 56320 50310 45082 49616 51052 54617 53467
14456E3467j891M446n653k576J056o454o643k032o49n75M697M745J747o365L230
$$ 53467 51576 56022 50369 47793 48849 42395 35752 33720 33071 32496 37193 41938 43685 37320 40550
14441D0550N04l024r713j20J085l868L815R073l312r14O887r72L650J192l853
$$ 40550 41054 38030 28317 28197 29282 25414 29229 38302 34990 34076 40963 39991 43641 44833 40980
14426D0980L307O872j737n375k605j203n308O093J402k990L152k667L014M496
$$ 40980 44287 51159 49422 44047 41442 40239 34931 41024 42426 39436 42588 39921 42935 47431
14412D7431K730k457p750k14j468n90k073L765J452O422j352l056L552K238j489
$$ 47431 50161 47704 39954 39740 38272 37682 35609 39374 40826 47248 45896 42840 46392 48630 47141
14397D7141L630N658J108k324j760N430M792K269m895k08R149L064K01n763j28
$$ 47141 50771 56429 57537 55213 53453 58883 63675 65944 61049 60841 69990 73054 73255 67492 67364
14382F7364N701J1295L042P182M933J5424M720K006J0500J4002J9044J2452J1225
$$ 67364 73065 84360 87402 94584 99517 114941 119661 121667 132167 146169 165213 177665 188890
14369A88890K1466J6623J7239J9683J8182J4109O928J0493J470K81Q730M07L77
$$ 188890 210356 226979 244218 263901 282083 296192 303120 313613 315083 315364 324094 324501 324878
14356C24878q263p636m864o338l210k618n777m065O080L735k609n002n535k489
$$ 324878 316615 308979 304115 297777 294567 291949 286172 282107 288187 291922 289313 284311 278776 276287
14342B76287L943R964O158M086K178M429J2408J7297J4279M995L714K361j651
$$ 276287 280230 290194 296352 300438 302616 307045 319453 336750 351029 356024 359738 362099 360448
14329C60448p74j02m995j0091j8823j5925j2575j5124j6890k4223k1078j1708
$$ 360448 359674 359572 354577 344486 325663 309738 297163 282039 265149 240926 219848 208140
14317B08140o306m533j7733j8441p816p610j5604j1203J237j656M111J83n049
$$ 208140 201834 197301 179568 161127 153311 145701 130097 118894 120131 118475 122586 122769 117720
14304A17720k720l571j1215l830l078m793k826J587O913O676K737J344M466J0796
$$ 117720 115000 111429 100214 96384 93306 88513 85687 87274 94187 100863 103600 104944 109410 120206
14290A20206J3907K981j351j2771j1950j3993q546p999n445n655k728L878p77
$$ 120206 134113 137094 135743 122972 111022 97029 88483 80484 75039 69384 66656 70534 69757
14277F9757j587K45q326n058j672J19N432P493K144m910j127k384l569l711J943
$$ 69757 68170 68415 60089 55031 53359 53478 58910 66403 68547 63637 62510 60126 56557 52846 54789
14262E4789N841J263j60M596P14l430k104l538k69m878L931J1559n296p630M080
$$ 54789 60630 61893 61733 66329 67043 63613 61509 57971 57702 52824 56755 68314 63018 55388 59468
14247E9468R078o70m152j2290m084n76j99J205M216K33j117J2541J5320J324J408
$$ 59468 68546 67876 63724 51434 47350 46774 46575 47780 51996 52229 51112 63653 78973 80297 81705
14232H1705l582l681k704M30N307J179K79l096M346J149l447k122k457l639k806
$$ 81705 78123 74442 71738 72168 77475 78654 78933 75837 80183 81332 77885 75763 73306 69667 66861
14217F6861K218n915l911J1256Q028k628j458r66l449J626p946l336l180k875
$$ 66861 69079 63164 59253 70509 78537 75909 74451 73485 70036 71662 63716 60380 57200 54325
14203E4325J496R24L892J0225J2574N964m731m927o659j0558M149O543K925r19
$$ 54325 55821 56745 60637 70862 83436 89400 84669 79742 73083 62525 66674 73217 76142 75223
14189G5223Q52J669K536l710q375m530N642r53O59m556n535K875P572j533l273
$$ 75223 76075 77744 80280 76570 68195 63665 69307 68354 69013 64457 58922 61797 69369 67836 64563
14174F4563L233q765J348L515M586J2805K517j3720l362P212l203j0738j299Q693
$$ 64563 67796 59031 60379 63894 68480 81285 83802 70082 66720 73932 70729 59991 58692 67385
14160F7385O659O173k700k747p513P04N263J49N099k952M250N542J261O798l045
$$ 67385 74044 80217 77517 74770 67257 67961 73224 73373 78472 75520 79770 85312 86573 93371 90326
14145I0326K191P752M615j116m649p427Q256P955Q490K074J195P872O197J0674
$$ 90326 92517 100269 104884 103768 99119 91692 99948 107903 116393 118467 119662 127534 133731 144405
14131A44405J0116N882J0067K505j2804m900r828n129r420j4847j2687q15n749
$$ 144405 154521 160403 170470 172975 160171 155271 145443 140314 130894 116047 103360 102545 96796
14118I6796q335m322l538r80q01J631j98k570l363m626M324m105k116J1110P631
$$ 96796 88461 84139 80601 79621 78820 80451 80253 77683 74320 69694 74018 69913 67797 78907 86538
14103H6538j181o447j326O280j584j632L927N900o559k064o32O279j205J606q450
$$ 86538 85357 78910 77584 83864 82280 80648 84575 90475 83916 81852 81220 87499 86294 87900 79450
14088G9450n261J596K943o95L708K884o715J668Q102j496j698j030l988K903J0244
$$ 79450 74189 75785 78728 78033 81741 84625 77910 79578 87680 86184 84486 83456 79468 82371 92615
14073I2615M762q729j3970j166Q421L449P568P944o759j189L337O234K233R49
$$ 92615 97377 88648 74678 73512 81933 85382 92950 100894 94135 92946 96283 102517 104750 105699
14059A05699L597R82K45j683L319J3943Q543K212K750j159l592J1891J7977Q917
$$ 105699 109296 110278 110523 108840 112159 126102 134645 136857 139607 138448 134856 146747 164724 173641
14045A73641K521O955N342J4612L85l693K478K178Q001M305O447L659L368K988
$$ 173641 176162 183117 188459 203071 203456 199763 202241 204419 212420 216725 223172 226831 230199 233187
14031B33187N159K97j280K165J8604L049k01M678L010m053o57N830Q787J0047
$$ 233187 238346 238643 237363 239528 258132 261181 260980 265658 268668 264615 263958 269788 278575 288622
14017B88622L982N092N585P174J1880R247R098R285P536J0389J0193J2390l90
$$ 288622 292604 297696 303281 310455 322335 331582 340680 349965 357501 367890 378083 390473 390083
14004C90083k082Q871J3206j233O020P292O082J351J130M138L641R725J2501J1978
$$ 390083 388001 396872 410078 408845 414865 422157 428239 429590 430720 434858 438499 448224 460725 472703
13990D72703Q942M588N930J2788J2166N096J2845K1155J4244R691J4702J1877
$$ 472703 481645 486233 492163 504951 517117 522213 535058 556213 570457 580148 594850 606727
13978F06727J0976J7257K2220R185J9104J9858K1980J9192J7626K3800J7587K3859
$$ 606727 617703 634960 657180 666365 685469 705327 727307 746499 764125 787925 805512 829371
13966H29371L9446L6836L0011L1476L4939L9690M1759M6703M9713N2252N1425
$$ 829371 868817 905653 935664 967140 1002079 1041769 1083528 1130231 1179944 1232196 1283621
13955A283621N9648P3328P8915Q0176Q9908J00767J06574J24637J34296J45595
$$ 1283621 1343269 1416597 1495512 1575688 1665596 1766363 1872937 1997574 2131870 2277465
13945B277465J71422J94515K08597K24719K50981K87789L30987L71775M09460
$$ 2277465 2448887 2643402 2851999 3076718 3327699 3615488 3946475 4318250 4727710
13936D727710M65912N35915O00882O85995P91007R01192J036042J180788J343029
$$ 4727710 5193622 5729537 6330419 7016414 7807421 8708613 9744655 10925443 12268472
13927A2268472J549060J780803K027150K287965K561288K831343L080005L272642
$$ 12268472 13817532 15598335 17625485 19913450 22474738 25306081 28386086 31658728
13919C1658728L386482L401873L292669L055361K689573K209670J666583J082855
$$ 31658728 35045210 38447083 41739752 44795113 47484686 49694356 51360939 52443794
13911E2443794N19573K5252l88574p08030r17825j034151j071247j042916r64479
$$ 52443794 52963367 52988619 52600045 51892015 50974190 49940039 48868792 47825876 46861397
13902D6861397q50622p00595n51096l89543k13269k7900J65226L48534N38547
$$ 46861397 46010775 45310180 44759084 44369541 44156272 44128372 44293598 44642132 45180679
13893D5180679P20387R03129J092475J270813J419244J525495J595345J590291
$$ 45180679 45901066 46804195 47896670 49167483 50586727 52112222 53707567 55297858
13885E5297858J482042J277513R58669N26649J2319n72346j193986j792054k323031
$$ 55297858 56779900 58057413 59016082 59542731 59555050 58982704 57788718 55996664 53673633
13876E3673633k742291l044697l211462l259901l188750l048107k848798k615541
$$ 53673633 50931342 47886645 44675183 41415282 38226532 35178425 32329627 29714086
13868B9714086k381811k149831j923828j726729j548521j379353j229194j109554
$$ 29714086 27332275 25182444 23258616 21531887 19983366 18604013 17374819 16265265
13860A6265265r99343q99556q15407p45419o78628o10614n59043n19664m84272
$$ 16265265 15265922 14366366 13550959 12805540 12126912 11516298 10957255 10437591 9953319
13851I953319m50740m17949l79166l55081l34176l17894k97658k85088k71736
$$ 9953319 9502579 9084630 8705464 8350383 8016207 7698313 7400655 7115567 6843831
13842F843831k55951k40831k19483k12995k15785k05202j97926j85265j72093
$$ 6843831 6587880 6347049 6127566 5914571 5698786 5493584 5295658 5110393 4938300
13833D938300j60035j50273j49776j36909j40441j32347j31836j24240j19317
$$ 4938300 4778265 4627992 4478216 4341307 4200866 4068519 3936683 3812443 3693126
13824C693126j09728r5134j04801j06065r9091r3359q8764q3930q6967p6083p1428
$$ 3693126 3583398 3488264 3383463 3277398 3178307 3084948 2996184 2912254 2825287 2749204 2677776
13813B677776p5798p0830p2855p2755o9301o9312o6087o2234n1165n8627n6862
$$ 2677776 2601978 2531148 2458293 2385538 2316237 2246925 2180838 2118604 2067439 2008812 1951950
13802A951950m7544m1539n0231n0984l9187m5115n0123m6839m2894l8551l7315
$$ 1951950 1904406 1862867 1812636 1761652 1722465 1677350 1627227 1580388 1537494 1498943 1461628
13791A461628l7836l7689l8013l3632l1853k9751l2157l9048l2578m1252l1332
$$ 1461628 1423792 1386103 1348090 1314458 1282605 1252854 1220697 1181649 1149071 1107819 1076487
13780A076487k6382k9348k2355j9551k8091k9646k3846l0469k3011j8655k5667
$$ 1076487 1050105 1020757 998402 978851 950760 921114 897268 866799 843788 825133 799466
13769G99466k2260k6885j6182j5070j9105j9053j8212j8008j3297j8072j9003
$$ 799466 777206 750321 734139 719069 699964 680911 662699 644691 631394 613322 594319
13758E94319j3373j1625j7520j1694j6187j4814j5097j4828j6686j0427j5885
$$ 594319 580946 569321 551801 540107 523920 509106 494009 479181 462495 452068 436183
13747D36183k0944j8143j3057j2127j0290j0878j3240q113o372q133p592r621
$$ 436183 415239 397096 384039 371912 361622 350744 337504 329391 323019 314886 307294 297673
13735B97673n733j3099r826j2407j333L170n101j0305j0085l819l581j149o68
$$ 297673 291940 278841 269015 256608 255275 258445 253344 243039 232954 229135 225554 224405 223737
13722B23737l612n279L654k597o622o088K03k238k371L645m770q586r00J505Q488
$$ 223737 220125 214846 218500 215903 209281 203193 203396 201158 198787 202432 197662 189076 188176 189681 198169
13707A98169j737o160n631j67N40l512M24R90L25K757m466q050j0553k588M543
$$ 198169 196432 190272 184641 184474 185014 181502 181926 182916 183241 185998 181532 173482 162929 160341 164884
13692A64884M221M38L970j613o440p373l228K027K02J067N236J652n585m775J160
$$ 164884 169105 169543 173513 171900 165460 158087 154859 156886 157088 158155 163391 165043 159458 154683 155843
13677A55843J788m942j973k805n160O413L50p550l763m890k111N112J584J136
$$ 155843 157631 152689 150716 147911 142751 149164 149514 141964 138201 133311 131200 136312 137896 139032
13663A39032N526J253O018L030j169O712J416q958j0767j1816K011Jj3310p639
$$ 139032 144558 145811 151829 154859 153690 160402 161818 152860 142093 130277 132288 132289 118979 111340
13649A11340j876N463M11l355Q57L908k308m534O509j536l218l284k080K791j583
$$ 111340 109464 114927 115338 111983 112840 116748 114440 109906 116415 114879 111661 108377 106297 109088 107505
13634A07505l065j803l124Q54m366O523L693N474n175j1515o946K470M408K127
$$ 107505 104440 102637 99513 100367 96001 102524 106217 111691 106516 95001 88055 90525 94933 97060
13620I7060n472n490p633k347j777l605P67m890r030n120M724j663n00l054k814
$$ 97060 91588 86098 78465 76118 74341 70736 71503 66613 57583 52463 57187 55524 55024 51970 49156
13605D9156l008j09q22J15l032n00K353p757k750l700j128R380Q657M966J1351
$$ 49156 46148 46039 45217 45332 42300 41800 44153 36396 33646 29946 28818 38198 46855 51821 63172
13590F3172M158q306o741m11m700r623p623j770J248j738N270l928p330k704k257
$$ 63172 67330 59024 52283 51872 47172 37549 29926 28156 29404 27666 32936 29008 21678 18974 16717
13575A6717n794o65l359l658j658j66j123k266N837N275p352n158p51J297M041
$$ 16717 10923 10258 6899 3241 1583 1417 294 -1972 3865 9140 1788 -3370 -4121 -2824 1217
13560A217l243p224K409R919M839m347l625M084l235j356o1R281N065j370k023
$$ 1217 -2026 -9250 -6841 3078 7917 3570 -55 4029 794 -562 -623 8658 13723 12353 10330
13545A0330K188Q081K59j478k988M253p52K528O066p069j0893n174n215O943N772
$$ 10330 12518 20599 20858 19380 16392 20645 19893 22421 28487 21418 10525 5351 136 7079 12851
13530A2851N208j532p522L583L906J128l18k312k753k71o371l644j443m80N492
$$ 12851 18059 16527 9005 12588 16494 17622 17304 14992 12239 11968 5597 1953 510 30 5522
13515E522N409L322Q58j835K527l499j430L11j189N430j795l863M167j321J806
$$ 5522 10931 14253 15111 13276 15803 12304 10874 11185 9996 15426 13631 9768 13935 12614 14420
13500A4420K140L242p699l113K87O013N285k763p65J434R618K789N845o106q62
$$ 14420 16560 19802 12103 8990 9277 15290 20575 17812 17047 18481 28099 30888 36733 30627 29765
13485B9765J1176Q530n528j001R01Q995M455L919J977M096K493R022J0984P748
$$ 29765 40941 49471 43943 42942 43843 52838 57293 61212 63189 67285 69778 78800 89784 97532
13471I7532M094J2595J1167J7733J4048J5262J8712J2343J9374J8054P835J1742
$$ 97532 101626 114221 125388 143121 157169 172431 191143 203486 222860 240914 248749 260491
13459B60491J6117Q627N572k798J80j211q41K486j1243k367L077j918r238p723
$$ 260491 276608 285235 290807 288009 288189 286978 286137 288623 277380 275013 278090 276172 266934 259211
13445B59211j1684m119k052j006L607m67O590J1967P185j244R59J780K345R118
$$ 259211 247527 243408 241356 240350 243957 243490 250080 262047 269232 267988 268947 270727 273072 282190
13431B82190J0746P876R812J4428R399L492j522p470o955j3704j1290j6849j4145
$$ 282190 292936 300812 310624 325052 334451 337943 336421 328951 321996 308292 297002 280153 266008
13418B66008k0889j7199k1962j7758m718j3194j5074j4300o959k426n206p500
$$ 266008 245119 227920 205958 188200 183482 170288 155214 140914 133955 131529 126323 118823
13406A18823l291j1400p217m47j0787K15J0140J620l64j958j0331m946n091m087
$$ 118823 115532 104132 96915 96468 85681 85896 96036 97656 97292 95334 85003 80057 74966 70879
13392G0879l330N89P56k496K024l04P449l989n210j48J885m001j173l302r70n130
$$ 70879 67549 68138 68894 66398 68422 68118 75567 71578 66368 66220 68105 64104 62931 59629 58659 53529
13376E3529j547P696m25q122o762J228L878O535j301J279J197k688j13J531M0
$$ 53529 51982 59678 59253 51131 44369 45597 49475 56010 54709 55988 57185 54497 54384 55915 55955
13361E5955L37k628m306k089N226p227N448K915n094l536J18L030n698j740Q133
$$ 55955 56292 53664 49358 47269 52495 45268 50716 53631 48537 45001 45119 48149 42451 40711 48844
13346D8844l556k41O74J682q20N95n493R363J0668M219m336r609q508k756j906
$$ 48844 45288 45047 45721 47403 46583 47178 41685 51048 61716 65935 61599 51990 43482 40726 38820
13331C8820k928n84J2674J00n715n473j566L533K971k61N45m547j350K50L307
$$ 38820 35892 35308 47982 48082 42367 36894 35328 38861 41832 41571 42116 37569 36219 36469 39776
13316C9776m899J040l38K219N655k726k348n759q781l362K804L999Q399l00l32
$$ 39776 34877 35917 35579 37798 43453 40727 38379 32620 23839 20477 23281 27280 35679 35379 35047
13301C5047N878M814l269j054L630n728k788L590j300K200Q536K154n441m506
$$ 35047 40925 45739 42470 41416 45046 39318 36530 40120 38820 41020 49556 51710 46269 41763
13287D1763Q97j88K488P442l395q160m462o277N226Q455N474n678L552L877L708
$$ 41763 42660 42472 44960 52402 49007 40847 36385 30108 35334 43789 49263 43585 47137 51014 54722
13272E4722m305o7k168q460n818j116K966k661j521J548j856N052M152K230P79
$$ 54722 50417 50350 48182 39722 33904 32788 35754 33093 31572 33120 31264 36316 40468 42698 43477
13257D3477q182K432L953j294m065J45M33r130k20L520m745N874L988L856l39
$$ 43477 35295 37727 41680 40386 36321 36466 36899 27769 27549 31069 26324 32198 36186 40042 39703
13242C9703p80L651J774j620q242p188n543K565J741R053R607m79m600l184o087
$$ 39703 38923 42574 44348 42728 34486 27298 21755 24320 26061 35114 44721 44242 39642 36458 30371
13227C0371k924K897l44j678J52M812L564q61L702P26J878l886q005l857M230
$$ 30371 27447 30344 30000 28322 28474 33286 36850 35989 39691 40417 42295 38409 30404 26547 30777
13212C0777M276P504J130p850m163k471k829J6374O573O781k105o507K224O81
$$ 30777 35053 42557 43687 35837 31674 29203 26374 42748 49321 56102 53997 47490 49714 50395
13198E0395j765k83j0840p034K893R813M39K659J843j993p676k459Q465N362m692
$$ 50395 48630 48347 37507 30473 33366 43179 43618 46277 48120 46127 38451 35992 44457 49819 45127
13183D5127o259J036Q480O729Q961l707j3113J590J425k731m633J360N04m201
$$ 45127 38868 39904 48384 55113 64074 60367 47254 48844 50269 47538 42905 44265 44769 40568
13169D0568k032J0412Q496l178n268K822j932k610J3090O893j006n295k841k710
$$ 40568 38536 48948 57444 54266 48998 51820 49888 47278 60368 67261 66255 60960 58119 55409
13155E5409l816N058Q428Q618M040P577O952R435J6926J9249K1802K7169J8892
$$ 55409 51593 56651 65079 73697 77737 85314 92266 101701 118627 137876 159678 186847 205739
13142B05739l248j8404k1798k9573j6298j0686p459p686m014k840n252j493q31
$$ 205739 202491 184087 162289 132716 116418 105732 98273 90587 86573 83733 78481 76988 76157
13129G6157k03k308j928O075N804O475n62o152q18n551j91M54J54J466m023q830
$$ 76157 75954 73646 71718 77793 83597 90072 89510 83358 82540 76989 76798 77252 77406 78872 74849 66019
13113F6019o545l075m202J331J2145Q540R503M420M058j628L887P455O295M273
$$ 66019 59474 56399 52197 53528 65673 74213 83716 88136 92194 90566 94453 101908 108203 112476
13099A12476k951N87M223N452K290J847O248J1659K3395K4824L0395L2324L8745
$$ 112476 109525 110112 114335 119787 122077 123924 130172 141831 165226 190050 220445 252769 291514
13086B91514O6799J10144J84234K69451L24247L41462L15318K05992K4505j74861
$$ 291514 358313 468457 652691 922142 1246389 1587851 1903169 2109161 2133666 1958805
13076A958805l20073l83741l23215k15133j34659r9259o7149l9237l6367l0547
$$ 1958805 1638732 1254991 931776 716643 581984 482725 415576 376339 339972 309425
13066C09425k6070k7184j6991q246j6882j6389j0023l520K385j110L225Q367l786
$$ 309425 283355 256171 239180 230934 214052 197663 187640 184120 186505 185395 188620 196987 193201
13053A93201q254j3452j1896n812m133n463l403P91R827N546l993j752k744m678
$$ 193201 184947 171495 159599 153787 149654 144191 140788 141579 151406 156952 152959 151207 148463 143785
13039A43785j352m926k883l282m281K828j155r496K16m046J75N252m708J986N58
$$ 143785 142433 137507 134624 131342 127061 129889 128734 119238 119454 115408 115583 120835 116127 118113 118671
13024A18671r8o939p878l303l046J41N75m159q123P66R893N521o279k120M795
$$ 118671 118573 111634 103756 100453 97407 97548 98123 93964 85841 86607 96500 102021 95742 93622 98417
13009I8417j294k380J834p41J93k705R02Q059J34n675j177l100k401J551K596
$$ 98417 97123 94743 96577 95836 96029 93324 94226 102285 102419 96744 95567 92467 90066 91617 94213
12994I4213L563K766l833m280J864k507k651M483O920m718r723L960M735L12k768
$$ 94213 97776 100542 96709 92429 94293 91786 89135 93618 100538 95820 86097 90057 94792 95104 92336
12979I2336O141l275n061K651M10M168q36k876M33l724J757j309L449L336M996
$$ 92336 98477 95202 90141 92792 93202 97370 96534 93658 94091 90367 92124 90815 94264 97600 102596
12964A02596J1909M872P167Q736R076L543j516Q361J2876J1952J7056J5921J8622
$$ 102596 114505 119377 126544 135280 144356 147899 146383 154744 167620 179572 196628 212549 231171
12951B31171J6943Q925m39r031j9667l3470l3041k7792k2615j9345j0882K194
$$ 231171 248114 257039 256600 247569 227902 194432 161391 133599 110984 91639 80757 82951
12939H2951k714p867l814P96M896o704k413o228k647j078l399K395K776K797R7
$$ 82951 80237 72370 68556 69352 74248 67544 65131 58903 56256 55178 51779 54174 56950 59747 59844
12924E9844N647q44m640q275p66n602m715O304P249K225P834R496M713Q192j011
$$ 59844 65491 64647 60007 51732 50966 45364 40649 46953 54202 56427 64261 73757 78470 86662 85651
12909H5651K533O041j505k846k198o707Q960J7461K0094L3049M3481M1048M2483
$$ 85651 88184 94225 92720 89874 87676 80969 89929 107390 127484 160533 204014 245062 287545
12896B87545L5898J7184l38j1302k0021l0236k7339k1613j7558j9038k2882k0133
$$ 287545 323443 340627 340289 328987 308966 278730 251391 229778 212220 193182 170300 150167
12884A50167n069m092l284n390j872j41M846Q472Q885j434m355j893J545l734
$$ 150167 145098 141006 137722 132332 130460 130319 135165 143637 152522 151088 146733 144840 146385 142651
12870A42651j0134p155l7P326J0233J7693R775N194J0216L967l594j6361m748
$$ 142651 132517 125362 125325 132651 142884 160577 170352 175546 185762 189729 186135 169774 165026
12857A65026j0616j4008n752k551k798m687q778J688N683Q430l022r266j7323
$$ 165026 154410 140402 134650 132099 129301 124614 115836 117524 123207 131637 128615 119349 102026
12844A02026n001m228J500J084L006Q910P306J6735J2589R082J6667P557j6111
$$ 102026 97025 92797 94297 95381 98387 107297 114603 131338 143927 153009 169676 177233 161122
12831A61122k7334r337o602j460Q861L169J3083J0743R564n47j788j1199j4214
$$ 161122 133788 124451 117849 116389 125250 128419 141502 152245 161809 161262 159474 148275 134061
12818A34061j044R468J3878J4271J8601J0143N826J0447K06m13M85j3576j1037
$$ 134061 133017 142485 156363 170634 189235 199378 205204 215651 215857 215444 215929 202353 191316
12805A91316l523j33n324j659O557Q120R723P008R36P32N438R402L784o975o898
$$ 191316 187793 187660 182336 180677 187234 195354 205077 212085 213021 213753 219191 228593 232377 225402 218504
12790B18504K805k634P588J0029M695M285J5577J502o261O740Q966L58j985j59
$$ 218504 221309 218675 226263 236292 240987 245272 260849 262351 256090 262830 271796 272154 270169 270010
12776B70010K385K1239K7242L1035M5891N9616O1475N1127L8381K6218J1875P093
$$ 270010 272395 293634 320876 351911 397802 457418 518893 570020 608401 634619 646494 653587
12764F53587o948j2148j3369l550j131k949K818l330q545j1902q845Q237J6493
$$ 653587 646639 634491 621122 617572 616441 613492 616310 612980 604435 592533 583688 591925 608418
12751F08418J4704J4840J4755M339K907J0617P225O347J647J962O97J3777J3875
$$ 608418 623122 637962 652717 657056 659963 670580 677805 684152 685799 687761 688458 702235 716110
12738G16110K0101K8062K9797L4098L7178L6924K8244J8869K0961Q801J4827K0061
$$ 716110 736211 764273 794070 828168 865346 902270 930514 949383 970344 979145 993972 1014033
12726A014033K9513M1269M3369N3432N3563N9050P6625J01145J22473J53078J90565
$$ 1014033 1043546 1084815 1128184 1181616 1235179 1294229 1370854 1471999 1594472 1747550 1938115
12715A938115K36562L05913L92256N21955P53800J211906K025904L097443L878110
$$ 1938115 2174677 2480590 2872846 3394801 4148601 5360507 7386411 10483854 14361964
12706A4361964M136199L970191K866691N68500k005391l750870m734251m079417
$$ 14361964 18498163 22468354 25335045 25903545 23898154 20147284 15413033 11333616
12698A1333616k563917j488387r34573o21523m33229k90664j20812Q5295J71513
$$ 11333616 8769699 7281312 6346739 5725216 5291987 5001323 4880511 4965806 5137319
12689E137319J06619J15422J06379k10355n94346m48816k41308j64020j33178
$$ 5137319 5243938 5359360 5465739 5255384 4661038 4212222 3970914 3806894 3673716
12680C673716j31988j20513q9457n4141j6644L5745R0743J39189J78221K11533
$$ 3673716 3541728 3421215 3331758 3277617 3260973 3296718 3387461 3526650 3704871 3916404
12670C916404K35291K49127K57976K79862L06359L51385M02689M55523N41966
$$ 3916404 4151695 4400822 4658798 4938660 5245019 5596404 5999093 6454616 6996582
12661F996582O29024O92029P68308Q72899J008280J207463J488461J879050K407256
$$ 6996582 7625606 8317635 9085943 9958842 10967122 12174585 13663046 15542096 17949352
12652A7949352L095379L979939N189495O971853R783171J4803108K4130659L8517125
$$ 17949352 21044731 25024670 30214165 37186018 46969189 61772297 85902956 124420081
12644A24420081N3169905O0911215O0926148N2630456K9916449m052007l6007095
$$ 124420081 177589986 238501201 299427349 352057805 381974254 377922247 341915152
12637C41915152n8355061o8694435n7549141l7615031k3185607j5520626j1378617
$$ 341915152 283560091 214865656 157316515 119701484 96515877 80995251 69616634
12630F9616634q914491p203259n869433m772611l849148l117665k591638k200887
$$ 69616634 60702143 53498884 47629451 42856840 39007692 35890027 33298389 31097502
12622C1097502j894080j647931j439308j261366j103026r77872r06513q70140
$$ 31097502 29203422 27555491 26116183 24854817 23751791 22773919 21867406 20997266
12614B0997266q54042q21782p63785o95138o15145n59324n46796n50916n46093
$$ 20997266 20143224 19321442 18557657 17862519 17247374 16688050 16141254 15590338 15044245
12605A5044245n45473n40357n21841n12414n06202m90203m75180m41659l89582
$$ 15044245 14498772 13958415 13436574 12924160 12417958 11927755 11452575 11010916 10621334
12596A0621334l34186l00697k84686k83125k93933l08072l03646k84208k62656
$$ 10621334 10287148 9986451 9701765 9418640 9124707 8816635 8512989 8228781 7966125
12587G966125k44226k29131k12306k06955k02084j89935j90636j85560j60928
$$ 7966125 7721899 7492768 7280462 7073507 6871423 6681488 6490852 6305292 6144364
12578F144364j46788j45231j35983j52745j50595j54452j65128j54723j35771
$$ 6144364 5997576 5852345 5716362 5563617 5413022 5258570 5093442 4938719 4802948
12569D802948j26742j10633j01349j02445j04594r4666r0622r0079r7740r3080
$$ 4802948 4676206 4565573 4464224 4361779 4257185 4162519 4071897 3981818 3884078 3790998
12559C790998q9530r3437r4804q1928q0649q6263q2752q1047q3111q6717q5591
$$ 3790998 3701468 3608031 3513227 3431299 3350650 3264387 3181635 3100588 3017477 2930760 2845169
12548B845169p7901p0244o6280n6254m0800m5830m4897m2536m5085m2460l0416
$$ 2845169 2767268 2697024 2630744 2574490 2533690 2487860 2442963 2400427 2355342 2312882 2282466
12537B282466k5455j9849k0380k2376k9428m0634n2916o4922n5702m5870l4617
$$ 2282466 2257011 2237162 2216782 2194406 2164978 2124344 2071428 2006506 1950804 1904934 1870317
12526A870317k7769k4932k9762l2422j8184j6358r647J974P809N324k361j0108
$$ 1870317 1842548 1817616 1787854 1755432 1737248 1720890 1711243 1713217 1721026 1726350 1723989 1713881
12514A713881j2609k6227l1047l4562m1631k6631k2985k8547k1909j7315j7209
$$ 1713881 1701272 1675045 1643998 1609436 1567805 1541174 1518189 1489642 1467733 1450418 1433209
12503A433209k0747k2020l2317l0436k2063j1544l64J138R134P711O305J1176
$$ 1433209 1412462 1390442 1358125 1327689 1305626 1294082 1293718 1294856 1303990 1311701 1318006 1329182
12491A329182J2818J2351J5025P931J7930L1745L9848M1120M3477N0155N5362
$$ 1329182 1342000 1354351 1369376 1377307 1395237 1426982 1466830 1507950 1551427 1601582 1656944
12480A656944O1587O3267O8794P4819P7595Q9050R4584R6310J01961J15341J24522
$$ 1656944 1718531 1781798 1850592 1925411 2003006 2092056 2186640 2282950 2384911 2500252 2624774
12469B624774J38792J65588J86378K08327K26954K45411K65189K75781K87896
$$ 2624774 2763566 2929154 3115532 3323859 3550813 3796224 4061413 4337194 4625090
12460D625090L18746L45811L70508M09138M40189M60750M89900N05297N10239
$$ 4625090 4943836 5289647 5660155 6069293 6509482 6970232 7460132 7965429 8475668
12451H475668M97797M79248M53824M23817L77244L37153K89910K30679J73593
$$ 8475668 8973465 9452713 9906537 10330354 10707598 11044751 11334661 11565340 11738933
12442A1738933J27489Q2161M6181J6240K467m469j6801j8398n588J1428L4678
$$ 11738933 11866422 11948583 11994764 12011004 12013471 12009002 11992201 11973803 11968215 11979643 12014321
12431A2014321P1092J12681J65596K07996K40001K93171L44823M00172M58046
$$ 12014321 12085413 12198094 12363690 12571686 12811687 13104858 13449681 13849853 14307899
12422A4307899N30517N93934O58442P25828P98179Q48093Q83017Q97652Q74344
$$ 14307899 14838416 15432350 16090792 16816620 17614799 18462892 19345909 20243561 21117905
12413B1117905Q17695P29846N94196M26996K35729L4764j66586l46204n13126
$$ 21117905 21935600 22665446 23259642 23686638 23922367 23957131 23790545 23444341 22931215
12404B2931215o39532p34791q00559q24528q30071q06519p69540p37657o83069
$$ 22931215 22291683 21556892 20756333 19931805 19101734 18295215 17525675 16788018 16104949
12395A6104949o16843n56730n10003m57651m01380l56508l09688k66552k25021
$$ 16104949 15488106 14931376 14421373 13963722 13562342 13205834 12896146 12629594 12404573
12386A2404573j88209j58148j20323q5623o6832m3177k8094k2497j5583j9172
$$ 12404573 12216364 12058216 11937893 11852270 11785438 11742261 11714167 11691670 11676087 11656915
12376A1656915k6954m5761p0698j00055j22722j54867k02758k37937k60985l06093
$$ 11656915 11629961 11584200 11513502 11413447 11290725 11135858 10933100 10695163 10434178 10128085
12366A0128085l39731l55481l70494l75880l86845l82639l68042l57813l44892
$$ 10128085 9788354 9432873 9062379 8686499 8299654 7917015 7548973 7191160 6846268
12357F846268l26928l11971k98515k79248k61379k41489k30858k17987k05261
$$ 6846268 6519340 6207369 5908854 5629606 5368227 5126738 4895880 4677893 4472632
12348D472632j98051j79724j57613j48826j44623j42282j29637j12357j07545
$$ 4472632 4274581 4094857 3937244 3788418 3643795 3501513 3371876 3259519 3151974
12339C151974j09933j14449j12018j16468j20028j23903j14137j06496j06088
$$ 3151974 3042041 2927592 2815574 2699106 2579078 2455175 2341038 2234542 2128454
12330B128454q4319n9474m4133m2717m0235m3554m1526m6029n0475m0555m4083
$$ 2128454 2044135 1984661 1940528 1897811 1857576 1814022 1772496 1726467 1675992 1635437 1591354
12319A591354m0061l7211l6170l8514k7967j6930l0213k7672l7200m2015l8059
$$ 1591354 1551293 1514082 1477912 1439398 1411431 1394501 1364288 1336616 1299416 1257401 1219342
12308A219342l1572l3541l2703k9277k3995k3153k6578l2310k8975k3031k0918
$$ 1219342 1187770 1154229 1121526 1092249 1068254 1045101 1018523 986213 957238 934207 913289
12297I13289k5123k3155k2045k6844j9022j6803j8707j8264j5860n550j2529j3946
$$ 913289 888166 865011 842966 816122 797100 780297 761590 743326 727466 721916 709387 695441
12285F95441j1129j9581j6349j5856k1168j6750j8719r359j4952j2717q580j0049
$$ 695441 684312 664731 648382 632526 611358 594608 575889 566530 551578 538861 530281 520232
12273E20232r246p404q386j8616j19p307j8552j1116l801k089O302J2453J1717
$$ 520232 510986 503582 495196 476580 476461 469154 450602 439486 435685 433596 439898 452351 464068
12260D64068Q853J5700J1732m204k6733k4627l2607k8609j9356r521j4784j3570
$$ 464068 472921 488621 500353 496149 469416 444789 412182 383573 364217 354696 339912 326342
12248C26342n69l48p795q070r503r449j0233K044L230j2078j9129m566o017j547
$$ 326342 325773 325425 317630 309560 300057 290608 280375 282419 285649 273571 254442 249876 243859 242312
12234B42312J404N740J297O0j1609j1288n275q079j0257n374O352M122N360k551
$$ 242312 243716 249456 250753 250813 239204 227916 222641 214562 204305 198931 205283 209405 214765 212214
12220B12214j190L405Q772j10j2526p898m16R329P569j171O840J1232P469P423
$$ 212214 211024 214429 223201 223091 210565 202667 202251 211580 219149 217978 224818 236050 243519 250942
12206B50942K0605J5867K2419L6690N7489Q7394J42681K21045K93207L37208L37250
$$ 250942 271547 287414 309833 346523 404012 491406 634087 855132 1148339 1485547 1822797
12195A822797K77430J22559q9947k58302l63424l67449k69750j61239j06113p5724
$$ 1822797 2100227 2222786 2132839 1874537 1511113 1143664 873914 712675 606562 530838
12185E30838n5877m5227m0578l3070k6900k8531j9730j1022j0516q721k829k047
$$ 530838 474961 429734 389156 356086 329186 300655 280925 269903 259387 250666 247837 245790
12173B45790r303k321N645l493j654r637p871l169j0946j3068j0041j2413J395
$$ 245790 236487 234166 239811 236318 234664 225027 217156 213987 203041 189973 179932 167519 168914
12160A68914k650j1387j1687l234J434k575J564M167n596o630j21l546l61r204
$$ 168914 166264 154877 143190 139956 141390 138815 140379 144546 138950 132320 132199 128653 128292 119088
12146A19088n325K060k180k481j332N734j331p662n859q841n842j714n940J489
$$ 119088 113763 115823 113643 111162 109830 115564 114233 106571 100712 91871 86029 84315 78375 79864
12132G9864K326M416l738n197q754M487N892J673k164P49p523j555J0246j533
$$ 79864 82190 86606 82868 77671 68917 73404 79296 80969 78805 79554 72031 70476 80722 79189
12118G9189n776j033J013j290J986L985n294J06L511k340j519o253r104q898J989
$$ 79189 73413 72380 73393 72103 74089 78074 72780 72886 76397 74057 72538 66285 57181 48283 50272
12103E0272n512j27K970l467l452l318N934L49r737m468K403L30n162m00M063
$$ 50272 44760 44633 47603 44136 40684 37366 43300 43649 33912 29444 31847 32177 27015 26615 30678
12088C0678M360N038K81L64J049k794o413L319M175J332o406J768K898j007q40
$$ 30678 35038 40076 40357 40721 41770 38976 32563 35882 40057 41389 34983 36751 39649 38642 37802
12073C7802j412j205K90k32O391Q290n790j1473l233k390k250n890J99q1J403
$$ 37802 36390 35185 35475 35243 41634 49924 44134 32661 29428 27038 24788 18898 19097 19016 20419
12058B0419K745m093k482o083m290O015Q95L753M306N771K823O762J0729L810
$$ 20419 23164 19071 16589 10506 6216 12231 13126 16879 21185 26956 29779 36541 47270 51080
12044E1080m546L84j271q784k038P98K356L016o993q934o62M203M66l68o112j228
$$ 51080 46534 46918 45647 36863 34825 35623 37979 40995 34002 25068 24406 28609 29075 28707 22595 21367
12028B1367K41Q016P4j0709k752L935O9J431K838j128k861J838O451j555O7l307
$$ 21367 21608 29624 29698 18989 16237 20172 20241 21672 24510 23382 20521 22359 28810 27255 27322 24015
12012B4015q655n588K593l63J11j340j778J114k215J509j475o408n469M178K638
$$ 24015 15360 9772 12365 12002 12113 10773 8995 10109 7894 9403 7928 1520 -3949 229 2867
11997B867o772J859K708O866R605K228O04l553m415l379j2k082k882j78M562N445
$$ 2867 -3905 -2046 662 7528 17133 19361 19965 16412 11997 8618 8606 6524 3642 3464 8026 13471
11981A3471L493P841N411N859N830P726J7833L9501O9827Q8431O5832M4999N4684
$$ 13471 16964 24805 30216 36075 41905 49631 67464 106965 176792 265223 331055 376054 430738
11968D30738J3087j08797j25079o7594l1055j7082j2178j1732q469q453j1187
$$ 430738 443825 335028 209949 142355 111300 94218 82040 70308 61839 53386 42199
11957D2199L806o418n285L381l463r570J301k479j694K250o20r04l01K822n174
$$ 42199 46005 39587 34302 37683 34220 24650 25951 23472 21778 24028 23408 22504 22203 25025 19851
11942A9851q654k906R572M044J833j113j87l864l096J695K640q52n296k110O560
$$ 19851 11197 8291 17863 21907 23740 22627 22440 18576 15480 17175 19815 18963 13667 11557 18117
11927A8117L921J361K539M91R42R624N055N533J1376J7038J0500J0649J1602N117
$$ 18117 22038 23399 25938 26429 27371 36995 42050 47583 58959 75997 86497 97146 108748 113865
11913A13865m081m998l625Q29j9855k5885j6083n843k00m325j399k55K549q99
$$ 113865 109784 104786 101161 101990 82135 56250 40167 34324 34124 29799 28400 28145 30694 29795
11899B9795q546m758k321l543o41M079k75R244J716m340o441k107q59o787j04
$$ 29795 21249 16491 14170 10627 9986 14065 13790 23034 24750 20410 13969 11862 11003 4216 4112
11884D112K446m310K382N416N488P35K272J460m486m220m657r961k268P26J91
$$ 4112 6558 2248 4630 10046 15534 16269 18541 20001 15515 11295 6638 -3323 -5591 -4865 -4674
11869d674l758l09P554N545N550K269q578k595J78L001M352j480k392N24m096
$$ -4674 -8432 -8741 -1187 4358 9908 12177 3599 1004 1182 4183 8535 7055 4663 5187 1091
11854A091m739o415j311J0058L950n89K60o89j72K504K983k47j00K007L467N073
$$ 1091 -3648 -10063 -11374 -1316 2634 2045 2305 1616 1444 3948 6931 6684 6584 8591 12058 17131
11838A7131n005pl02J278N09m966o054k98L696r81k5k828P415K03j800o253j425
$$ 17131 12126 12119 11817 13095 13604 8638 2584 2286 5982 5001 4976 2148 9563 9766 7966 1713 288
11821B88O158N361m583o354m227L262j819J011O217o683m592O733n401o076M954
$$ 288 6446 11807 7224 870 -3357 -95 -1914 -903 5314 -1369 -5961 772 -4629 -10705 -5751
11806e751O325l120j786m087l726R93j185Q322L535Q585k84M925l195n153m889
$$ -5751 574 -2546 -4332 -8419 -12145 -11152 -12337 -4015 -480 8105 7821 12746 9551 4398 -491
11791d91m770K979O840M086m644j511q95J258m737J001Q865M375j651l698p902
$$ -491 -5261 -2282 4558 8644 4000 2489 1594 2852 -1885 -884 7981 12356 10705 7007 -895
11776h95j380N956j663K691K146j69n298n951L136k358m27L410N105l245M57L428
$$ -895 -2275 3681 2018 4709 6855 6686 1388 -4563 -1427 -3785 -4212 -802 4303 1058 1515 4943
11760D943m229m807K919K715l677O47l786k142m947r807r95L361J0198R83J924
$$ 4943 714 -4093 -1174 1541 -2136 -1489 -5275 -7417 -12364 -22171 -23166 -19805 -9607 -8624 -6700
11745f700K516l117q867l444l928O158M707l289M973L360l59L890m819J615j68
$$ -6700 -4184 -7301 -16168 -19612 -23540 -17382 -12675 -15964 -10991 -7631 -7990 -4100 -8919 -7304 -7472
11730g472J709K102J284p5P611j288N6O634k355q103n686L046J126L819m63L732
$$ -7472 -5763 -3661 -2377 -2452 5159 3871 3927 10561 8206 103 -5583 -2537 -1411 2408 1945 5677
11714E677J0246J1782L985K289O855j1617j2260l145j85j045j347o586l436K879
$$ 5677 15923 27705 31690 33979 40834 29217 16957 13812 13627 12582 11235 4649 1213 4092
11700D092J521j875M942j875j241n20m494l509m782l465m654N36N097O180K804
$$ 4092 5613 3738 8680 6805 5564 5044 550 -2959 -7741 -11206 -15860 -15324 -10227 -4047 -1243
11685a243M85l313k382n146K748Q672m475p210Q17m924k695P711l43r37M804Q240
$$ -1243 -758 -4071 -6453 -11599 -8851 -179 -4654 -11864 -11047 -15971 -18666 -10955 -11298 -12235 -7431 809
11669H09O071n305q58K41N427P0k019j686J117m253k238l171L677J1257o337o625
$$ 809 6880 1575 717 958 6385 6455 4436 2750 3867 -386 -2624 -5795 -2118 9139 2802 -3823
11653c823N890L205q27j0248j725J425P127k147m962p73K300M49K910K442K455
$$ -3823 2067 5272 4445 -5803 -7528 -6103 1024 -1123 -6085 -6858 -4558 -4109 -1199 1243 3698
11638C698q01L662k178j454p361j241k001N0J369n043n017n955N152Q454O513
$$ 3698 2897 6559 4381 2927 -4434 -5675 -7676 -7626 -6257 -11300 -16317 -22272 -17120 -8666 -2153
11623b153L649o441q754P497O714N176p947l076J830m659k221J967P577N17l248
$$ -2153 1496 -4945 -13699 -6202 512 5688 -2259 -5335 -3505 -8164 -10385 -8418 -841 -324 -3572
11608c572j54K078j733j454J128O03m687M37N578j827m666j175K254L789L14l202
$$ -3572 -3726 -1648 -3381 -4835 -3707 -3104 -7791 -7354 -1776 -3603 -8269 -9444 -7190 -3401 -3087 -6289
11592f289q53J319o712j958O472J579M847K649j343n928M87L450J939k893j796
$$ -6289 -7142 -5823 -12535 -14493 -8021 -6442 -1595 1054 -289 -6217 -5730 -2280 -341 -3234 -5030
11577e030O321N506l430n543p340o22n15k790m541j393M1L148J335J034l581j436
$$ -5030 1291 6797 3367 -2176 -9516 -10138 -10653 -13443 -17984 -19377 -19336 -16188 -14853 -13819 -17400 -18836
11561a8836J619N914L672M22m761l618K010P7N683j70K426O457K773n141m384
$$ -18836 -17217 -11303 -7631 -7209 -11970 -15588 -13578 -13501 -7818 -7988 -5562 895 3668 -1473 -5857
11546e857k042j901L177q77p252J191L061Q64r53m608Q679M062j748M134J126
$$ -5857 -7899 -9800 -6623 -7500 -14752 -13561 -10500 -9636 -10589 -15197 -6518 -2456 -4204 -70 1056
11531A056o961l428j334j614J868N764K840Q87K048N027j046n791n881K51J782
$$ 1056 -5905 -9333 -10667 -12281 -10413 -4649 -1809 -922 1126 6153 5107 -684 -6565 -6314 -4532
11516d532J238k570j521O002l429m365m141J157j973L869j164o564j503N485O836
$$ -4532 -3294 -5864 -7385 -1383 -4812 -9177 -13318 -12161 -14134 -10265 -11429 -17993 -19496 -14011 -7175
11501g175K844l954n241K199O17j648M884K537l545k19K201O887N290k853r530
$$ -7175 -4331 -8285 -13526 -11327 -10710 -12358 -7474 -4937 -8482 -8701 -6500 387 5677 2824 -6706
11486f706K460L590P903K566m070j990K218Q554O470M420N493J994l553k439k457
$$ -6706 -4246 -656 7247 9813 5743 3753 5971 14525 20995 25415 30908 32902 29349 26910 24453
11471B4453k185j558l367m185j518K337j482q07q004j300J120L278J217K85K863
$$ 24453 22268 20710 17343 13158 11640 13977 12495 11688 3684 2384 3504 6782 7999 8284 11147
11456A1147Q594O966J0520J1012J1497K9393M0886L4825K0751N812j1183m9903
$$ 11147 19741 26707 37227 48239 59736 89129 130015 164840 185591 191403 180220 130317
11444A30317m8404k2774j4823j1378r915L20n91k607M294p332k684k595p326K688
$$ 130317 81913 59139 44316 32938 23023 23343 22752 20145 24439 17107 14423 11828 4502 7190
11430G190l908j675j30K584m261m154j081j312L162L769J062j578J956L884J086
$$ 7190 3282 1607 1477 4061 -200 -4354 -5435 -6747 -3585 184 1246 -332 1624 5508 6594
11415F594l667N90L370K727M012k161m134m204O9P73k400n199m95n774j535Q08
$$ 6594 2927 3517 6887 9614 13626 11465 7331 3127 3196 3969 1569 -3630 -4125 -9899 -11434 -10626
11399a0626k498L652L517O023Q351O257J765o163q856l575k537j383o418n119
$$ -10626 -13124 -9472 -5955 68 8419 14676 16441 10278 1422 -2153 -4690 -6073 -12491 -17610
11385a7610M88O267N849N18k493j953j481j021N749j635O904j522j571O679m470
$$ -17610 -17122 -10855 -5006 -4488 -6981 -8934 -10415 -11436 -5687 -7322 -418 -1940 -3511 3168 -1302
11370a302l081M220J16q154l344L448N573m130J224Q467k74r107r345r95K031
$$ -1302 -4383 -163 -47 -8201 -11545 -8097 -2524 -6654 -5430 3037 2763 -6344 -15689 -16684 -14653
11355a4653l293K074J027L13L898K874j291K034l54J363m748L120M883l233m876
$$ -14653 -17946 -15872 -14845 -14532 -10634 -7760 -9051 -7017 -7371 -6008 -10756 -7636 -2753 -5986 -10862
11340a0862K496p52L40J802P462K761p12j87L369N332k957m188L10j1963o712
$$ -10862 -8366 -9118 -8778 -6976 486 3247 2535 2348 5717 11049 8092 3904 4214 -7749 -14461
11325a4461K843K192Q376N858k678j171N330J376L140K53p14j276j378p713p881
$$ -14461 -11618 -9426 -1050 4808 2130 959 6289 7665 10805 11058 10344 9068 7690 -23 -7904
11310g904M068m450M056l596J185k546M765K910m451j316L581k794m214N049P426
$$ -7904 -3836 -8286 -4230 -7826 -6641 -9187 -4422 -1512 -5963 -7279 -3698 -6492 -10706 -5657 1769
11295A769N827p53L807o523K99P33r155q5L127M747J3404M504L861k598n325o796
$$ 1769 7596 6843 10650 4127 4426 5159 -3996 -4081 -954 3793 17197 21701 25562 22964 17639 10843
11279A0843N91Q53m429p745o673k73l949j25O092O31L168K575n762K879j084K632
$$ 10843 11434 12287 7858 113 -6560 -6833 -10782 -10907 -4815 -4184 -1016 1559 -4203 -1324 -2408 224
11263B24O062M864o391q120m1Q164L270j574o844L90O963l04p983J476J901P550
$$ 224 6286 11150 4759 -3361 -3402 4762 8032 6458 -386 4 6967 6663 -1320 156 2057 9607
11247I607K128o250j505L96P951K308P52R855J0550P184K7969L5840L1729K4316
$$ 9607 11735 5485 3980 4376 12327 14635 15387 25242 35792 42976 70945 106785 138514 162830
11233A62830K2174K641k5384m7632l7787k3848m323m904l990p865j3388p669k685
$$ 162830 185004 187645 162261 114629 76842 52994 48671 43767 39777 31912 18524 10855 8170
11220H170k723K590R811M421l535j1469m690O77J548k502k273N589K52l895M584
$$ 8170 5447 8037 17848 22269 18734 7265 2575 3252 4800 2298 25 5614 5866 1971 6555
11205F555N614o337m992M849R898J213k052j745j2310l754L85K922Q77M390n945
$$ 6555 12169 5832 840 5689 15587 16800 14748 13003 693 -3061 -2676 246 1123 5513 -432
11190d32o136J259O065l331j194q12J836L374Q04j894k458m563O2R451m40l253
$$ -432 -6568 -5309 756 -2575 -3769 -4581 -2745 629 1433 -461 -2919 -7482 -7420 2031 1591 -1662
11174a662J362J06M670J38q07n471j476N0k588n086M860k900J479j987j942M897
$$ -1662 -300 -194 4476 4614 3807 -1664 -3140 -3090 -5678 -10764 -5904 -8804 -7325 -9312 -11254 -6357
11158f357j369P91J500N230K896o308j046N020K698K136m264K770N913m145l762
$$ -6357 -7726 -6935 -5435 -205 2691 -3617 -4663 357 3055 5191 927 3697 9610 5465 1703
11143A703K143n421n394L688P204M877M717m980m739n784k553n098K100J319o72
$$ 1703 3846 -1575 -6969 -3281 3923 8800 13517 8537 3798 -1986 -4539 -9637 -7537 -6218 -6890
11128f890O427M930k958l216j143m107K377j417m490j839o333O814J3648L543
$$ -6890 -463 4467 1509 -1707 -2850 -6957 -4580 -5997 -10487 -12326 -18659 -11845 1803 5346
11114E346k452p05l787o128K413K767L959K326K79l460k129J095l479m897r94
$$ 5346 2894 2189 -1598 -7726 -5313 -2546 1413 3739 4018 558 -1571 -476 -3955 -8852 -9846
11099i846k76m430J853N006R197N46j920L022k262j626l348k140Q260K886n694
$$ -9846 -10122 -14552 -12699 -7693 1504 2050 130 3152 890 -736 -4084 -6224 2036 4922 -772
11084g72L496N843r15q311k917j90m105j827l27J3579J2049K053j1489r675k94
$$ -772 2724 8567 7652 -659 -3576 -3766 -7871 -9698 -10025 3554 15603 17656 6167 -3508 -3802
11069c802Q506N312O95o609j571K830J086n480K965j429m236R63j41l557j325
$$ -3802 4704 10016 10711 4102 2531 5361 6447 967 3932 2503 -1733 -770 -911 -4468 -5793
11054e793N383M914K861J953L06l709l494r8j637OM085L468J199N02k757J994
$$ -5793 -410 4504 7365 9318 9624 5915 2421 2323 686 692 4777 8245 9444 9946 7189 9183
11038I183K574q521o009K770J552q1K463l038p473j930l42KL046K775N35R882
$$ 9183 11757 3236 -2773 -3 1549 1468 3931 893 -6580 -8510 -8852 -8850 -5804 -3029 -2494 7388
11022G388N11k460P34M899M247K882m543m640J496m951m722l438k501p79N75N94
$$ 7388 7899 5439 6173 11072 15319 18201 13658 9018 10514 5563 841 -2597 -5098 -5877 -5302 -4708
11006d708K816K645M722j253k330o054n883L390j09N156j99K104O261J1223M32
$$ -4708 -1892 753 5475 4222 1892 -4162 -10045 -6655 -6764 -1608 -1807 297 6558 17781 18213
10991A8213j0974r245l111j46Q323o77K50l768O080K345K199m63j613m774p059
$$ 18213 7239 -2006 -5117 -5263 3060 2383 2633 -1135 4945 7290 9489 9026 7413 2639 -4420
10976d420k494j96P872K854J890P389L313n476r218n756Q14M607Q520k747p584
$$ -4420 -6914 -7110 762 3616 5506 12895 16208 10732 1514 -4242 -3428 1179 9699 6952 -632
10961f32p54Q831o348m226k558M252r40k816l413J705P00n730j322P420P532O78
$$ -632 -1386 7445 1097 -3129 -5687 -1435 -2375 -5191 -8604 -6899 -6199 -11929 -13251 -5831 1701 2379
10945B379M593k466J483L069J771k213k189k848j371O34l210n76m188K699L61
$$ 2379 6972 4506 5989 9058 10829 8616 6427 3579 2208 2842 -368 -944 -5132 -2433 -2072
10930b072m560R24M723Q027k029l757j839O077p64o690M581k161k671O523j95
$$ -2072 -6632 -5708 -985 7042 5013 1256 -583 5494 4730 -1960 2621 460 -2211 4312 4117
10915D117l112O337n105j795J072k855O384K663m961j219O175K83l558n184K114
$$ 4117 1005 7342 2237 442 1514 -1341 5043 7706 2745 1526 7701 7984 4426 -758 1356
10900A356J402m19K205N877m615m352O76J258K386J680o707m194j873J377J954
$$ 1356 2758 2339 4544 10421 5806 1454 2130 3388 5774 7454 747 -3447 -5320 -3943 -1989
10885a989n202O92o48o20O837K816m092m028Q970R662j262j1129o254N54L91k56
$$ -1989 -7191 -6499 -7147 -7767 -930 1886 -2206 -6234 2736 12398 11136 7 -6247 -5693 -5302 -5558
10869e558j562L485p78J388N679K873o496k163N27J538J25n719R07M251N305Q84
$$ -5558 -7120 -3635 -4413 -3025 2654 5527 -969 -3132 -2605 -1067 -942 -6661 -5754 -1503 3802 4686
10853D686L643L20O773o03m013Q7p72M533o273m345q08J093O56N66j692M686l875
$$ 4686 8329 8649 15422 14819 10806 10893 10121 14654 8381 4036 3228 4321 4977 5543 3851 8537 4662
10836D662k160n908J690J843M509L474q90o677n150l926M186K891N627R28K61
$$ 4662 2502 -3406 -1716 127 4636 8110 7220 543 -4607 -8533 -4347 -1456 4171 5099 5360
10821E360k957O171K158o16J976K176J513o568k130K07n782j1541m145j173O187
$$ 5360 2403 8574 10732 10116 12092 14268 15781 9213 7083 7290 1508 -10033 -14178 -15351 -9164
10806i164N004P304N92K802N602J248K713K494p813n450k251L230J660N398O177
$$ -9164 -4160 3144 3736 6538 12140 13388 16101 18595 10782 5332 3081 6311 7971 13369 19546
10791A9546M927n182k718j738j499k26k008m230j138J768K347N450L549Q11P34
$$ 19546 24473 19291 16573 14835 13336 13110 11102 6872 5734 7502 9849 15299 18848 19659 20393
10776B0393R17k640k597p566p012O969R208K598P18k225K394p204m029J386m18
$$ 20393 21310 18670 16073 8507 1495 8464 17672 20270 20988 18763 21157 13953 9924 11310 10892
10761A0892L066L632k102M999K752o475l159N223L113n342m306J096K943k689
$$ 10892 13958 17590 15488 20487 23239 16764 13605 18828 21941 16599 12293 13389 16332 13643
10747A3643j594m022K156k861m55O735o69k665M823Q39R122P354l92r54K588k72
$$ 13643 12049 8027 10183 7322 6867 13602 12933 10268 15091 15930 25052 32406 32014 31060 33648 33376
10731C3376l781l817l652r175j644j01m95N572M259M597l273l654N4k503R364
$$ 33376 29595 25778 22126 12951 11307 11206 10711 16283 20542 25139 21866 18212 18266 15763 25127
10716B5127O945k15k259N012p94p720J585M48l127L371N776N772L96l709L420
$$ 25127 32072 31857 29598 34610 33816 26096 27681 28129 25002 28373 34149 39921 40317 36608 40028
10701D0028l051n119J176P636K442q79M581K141Q04n217q405j67J613K568O561
$$ 40028 36977 31858 33034 40670 43112 42233 46814 48955 49759 44542 36137 35970 37583 40151 46712
10686D6712m220l087J192N324J838r28j566n557J700K872J401M607k814J920M87
$$ 46712 42492 39405 40597 45921 47759 46831 45265 39708 41408 44280 45681 50288 47474 49394 49881
10671D9881J44J11q80l464k97j341Q944J557k455L185N580M552P977o53n113m227
$$ 49881 50025 50136 49256 45792 45495 44154 53098 54655 52200 55385 60965 65517 73494 72841 67728 63501
10655F3501k823N818O759J97k959p305K025O238L853L251q49K539M285R872K155
$$ 63501 60678 66496 73255 73452 70493 63188 65213 71451 75304 78555 77706 80245 84530 94402 96557
10640I6557m708n359l16j406m648O04M24O237o65j691Q907J2898M315L719J719
$$ 96557 91849 86490 86174 84768 80120 80724 81148 87385 86720 85029 93936 106834 111149 114868 116587
10625A16587n617j318K848O110L820O576J1863R653m203J499j48L059P12N087
$$ 116587 110970 109652 112500 118610 122430 129006 140869 150522 146319 147818 147670 150729 151441 156528
10611A56528l203M663R63K906Q389J2428R845M294l019J4514O554N133J6926L715
$$ 156528 153325 157988 158951 161857 170246 182674 192519 196813 193794 208308 214862 219995 236921 240636
10597B40636L733O865J0760J1025R428J2182P141O289J0416N093R931J6293J0929
$$ 240636 244369 251234 261994 273019 282447 294629 301770 308059 318475 323568 333499 349792 360721
10584C60721O346Q875J5344J0688P425J1029J4979K2623J3217J5263J1596J9176
$$ 360721 367067 375942 391286 401974 409399 420428 435407 458030 471247 486510 498106 517282
10572E17282K6850K2841J5243J2295J8108K0305J3128K0899J9832J9627J6161
$$ 517282 544132 566973 582216 594511 612619 632924 646052 666951 686783 706410 722571
10561G22571J8136J6360J8964K4888J8256J5127J8301J8383J2747J1588L831P070
$$ 722571 740707 757067 776031 800919 819175 834302 852603 870986 883733 895321 899152 906222
10549I06222N114m957m274k249k296n494r233j1857m061m226q277j3379j6263
$$ 906222 911336 906379 902105 899856 897560 892066 882833 870976 866915 862689 854412 841033 824770
10536H24770j9795j7553j5760k0044j8765r362j0996j3697j6453j2956j8963k1415
$$ 824770 804975 787422 771662 751618 732853 723491 712495 698798 682345 669389 650426 629011
10524F29011j6155k2195k2865k0367j3544j2701j7288j3386j2634j6238q197o014
$$ 629011 612856 590661 567796 547429 533885 521184 503896 490510 477876 461638 453441 447427
10512D47427j0585j6905j2065q080p312j4446r326j0741o192j0068j1481Q77m13
$$ 447427 436842 419937 407872 399792 392480 378034 368708 357967 351775 341707 330226 331103 330690
10499C30690j0619j9547r788L211o048j5563j2359r262l717n607j0842j0995M142
$$ 330690 320071 300524 290736 293947 287899 272336 259977 250715 246998 241391 230549 219554 223696
10486B23696l153o619o096r279J303j2472r292n8M684k350q158K175r68L757k281
$$ 223696 220543 213924 207828 198549 199852 187380 178088 178030 182714 180364 172206 174381 173413 177170 174889
10471A74889q25l119o161p227N00m60o874n110k103l592l306o282m799p119j44
$$ 174889 174064 170945 164784 157557 158057 157597 150723 145613 143510 139918 136612 130330 125531 118412 118268
10456A18268Q776k971p713q888J480o097j421l52L475k287m740m288j605m016
$$ 118268 127044 124073 116360 107472 108952 102855 101434 101082 104557 102270 97530 93242 91637 87621
10442H7621r671l451k047L839J2401M645j3002n509K026j504m654r920j2O51j392
$$ 87621 77950 74499 72452 76291 88692 93337 80335 74826 76852 75348 70694 60774 60762 61413 60021
10427F0021J372N095K937p563m334m902J036p478n635M812R671k35p98j067n317
$$ 60021 61393 66488 69425 61862 57528 52626 53662 46184 40549 45361 55032 54797 53999 52932 47615
10412D7615K150o527K496J170j615o228o705M455O587P693N21j3807O195N874
$$ 47615 49765 43238 45734 46904 45289 39061 32356 36811 43398 51091 51612 37805 44000 49874
10398D9874P29P208j0687j3424k445J370K192M010k39K143J775k25r12j147k106
$$ 49874 50603 57811 47124 33700 31255 32625 34817 38827 38588 40731 42506 42281 41369 40222 38116
10383C8116l218n147q155l022j016o035K844Q553P087M73q353r195l05M714L910
$$ 38116 34898 29751 21596 18574 17558 11523 14367 22920 30007 30480 22127 12932 12627 17341 21251
10368B1251N432o6n15O197M235l278n509q548j417J513K953m514N834J498o213
$$ 21251 26683 26617 26102 32299 36534 33256 27747 19199 17782 19295 22248 17734 23568 25066 18853
10353A8853L710M264j0084k77O987L419R91M392q037l10m142o896k460P492K320
$$ 18853 22563 26827 16743 16466 23453 26872 27863 32255 24218 23908 19766 12870 10410 17902 20222
10338B0222j576K772k014l125j708K328K599q115L167j560m033o030O707N746
$$ 20222 18646 21418 19404 16279 14571 16899 19498 11383 14550 12990 8957 2927 9634 15380
10324A5380m61k853j606k477j197o063k308K39M460j529K23J1665M54l794j435
$$ 15380 14919 12066 10460 7983 6786 723 -1585 -1346 3114 1585 1808 13473 13927 10133 8698
10309H698R812L86L804m95o051p61M050m776j539O017K961l670j2058n503O3O007
$$ 8698 18510 18896 22700 22205 16154 15393 19443 14667 13128 19145 22106 18436 6378 875 938 6945
10293F945O471r58O508P131k795q287o353L033O12j789k480K586P544L465Q18
$$ 6945 13416 12458 18966 26097 23302 15015 8662 11695 12307 10518 8038 10624 18168 21633 22451
10278B2451K112k715o158L651j631n988o359l514N2k314M843N899l651J945P462
$$ 22451 24563 21848 15690 19341 17710 11722 5363 1849 1901 -413 4430 10329 6678 8623 16085
10263A6085j136k052L288P191K7621K4176J9919K1366J6523K0422L547l1123l3822
$$ 16085 14949 12897 16185 23376 50997 75173 95092 116458 132981 153403 156950 125827 92005
10250I2005k8515k3181j2364L970K76o482k441k532l722L26K306K140j835M729
$$ 92005 63490 40309 27945 31915 32191 25709 23268 20736 17014 17340 19646 21786 19951 24680
10236B4680m947r746p117Q84R862j718q6k759r898J219M517j790j970K674j742
$$ 24680 19733 9987 2870 3754 13616 11898 11812 9053 -845 374 4891 3101 1131 3805 2063
10221B063L044M538J329l431n039J077R193j806p24L403l429p320J135k84l050
$$ 2063 5107 9645 10974 7543 2504 3581 12774 10968 10244 13647 10218 2898 4033 3749 699
10206F99K396j405l809k296L991M874Q978K202o393q397j091J1927J125j217n16
$$ 699 3095 1690 -2119 -4415 -424 4450 13428 15630 9237 840 -251 11676 12801 11584 11068
10191A1068k926p547p172R590P362j571j939j305l649l030k404j294k205k534
$$ 11068 8142 595 -6577 3013 10375 8804 6865 5560 1911 -1119 -3523 -4817 -7022 -9556
10177i556Q503j290j626Q337P179l009m610q8Q106m781p453j786M125n323O53
$$ -9556 -1053 -2343 -3969 4368 11547 8538 3928 3840 11946 7165 -288 -2074 2051 -3272 -2619
10162b619L071k783J61P861N790Q020O84o758m670j352p679M24l236J057J426
$$ -2619 452 -2331 -2170 5691 11481 19501 20185 13427 8757 7405 -274 150 -3086 -2029 -603
10147f03K548j520n322n771k746M000R770J1818M497j3092r150M264j065J010
$$ -603 1945 425 -4897 -10668 -13414 -9414 356 12174 16671 3579 -5571 -1307 -2372 -1362
10133a362q453Q60N903l1n195L369N585l777j12N083R00l77J808N735M655l245
$$ -1362 -9815 -8955 -3052 -3083 -8278 -4909 676 -3101 -3213 1870 2770 2393 4201 9936 14591 11346
10117A1346m548m478N065K371j427n735j976q289l456m195M231Q333N800R18k897
$$ 11346 6798 2320 7385 9756 8329 2594 618 -7671 -11127 -15322 -11091 -2758 3042 3960 1063
10102A063M916L490m233M688n231J228P061K956l069o584k343o884J797p44O960
$$ 1063 5979 9469 5236 9924 4693 5921 12982 15938 12869 6285 3942 -2942 -1145 -1889 5071
10087E071R271L068K18M520k530k110q35j0452j0762Q113P422l257J209q876m930
$$ 5071 14342 17410 17628 22148 19618 17508 16673 6221 -4541 3572 10994 7737 8946 70 -4860
10072d860l540O456J2920j813J528l676l258j055n128M61M299P620q00n425n519
$$ -4860 -8400 -1944 10976 9163 10691 7015 3757 2702 -2426 -1965 2334 9954 9154 3729 -1790
10057a790J71lj280l001K175j853M860N85L199j332M39P42K95M596p55J069k452
$$ -1790 -1619 -1622 -2902 -5903 -3728 -5581 -721 -136 3063 1731 2170 2912 3207 7803 7048 8117 5665
10040E665r881l922j851K887K584J306K518J811m64l699M584K264k960n751K776
$$ 5665 -4216 -8138 -9989 -7102 -4518 -3212 -694 1117 653 -3046 1538 3802 842 -4909 -2133
10025b133K550r41J073K686Q36L710O09K718K468L82n572J585j978L654j190l122
$$ -2133 417 -524 549 3235 4071 7781 8390 11108 13576 13958 8386 9971 7993 11647 10457 7335
10009G335q08p51P160R33M826Q364J037m713r893K447J534p73l230o26L052Q59
$$ 7335 6527 5776 12936 13869 18695 27059 28096 23383 13490 15937 17471 16698 13468 12842 15894 16753
9993A6753L686M311J0263R101J6573J7250M6065P9083P2931M1767M6279M1388
$$ 16753 20439 24750 35013 44114 60687 77937 124002 203085 276016 317783 364062 405450
9981D05450p3116j24771o1814l5472k2701n556n364m139M76L04q416r07l683q721
$$ 405450 332334 207563 145749 110277 87576 82020 76656 72517 72993 73297 64881 63974 60291 51570
9967E1570l931q882K74m517q175j305K146K712j371j142l660M466L550m388o145
$$ 51570 47639 38757 39031 34514 26339 25034 27180 29892 28521 27379 23719 28185 31735 27347 21202
9952B1202K366J0212M86l026n536k252R9K391n130J903N274L290R04J487l477
$$ 21202 23568 33780 34266 31240 25704 23452 23551 25942 20812 22715 27989 31279 32183 33670 30193
9937C0193l297M20k653k062K421R67Q068P557l819j4786l322P757M395K506j19
$$ 30193 26896 27316 24663 22601 25022 25989 34057 41614 37795 23009 19687 27444 31839 34345 34226
9922C4226K357j838j762j211J567n04J338J1363L883j017l387K300N049M563l631
$$ 34226 36583 34745 32983 31772 33339 32835 34173 45536 49419 48402 45015 47315 52364 56927 53296
9907E3296m089O086k426k542M45o73L97L129L3K299J442K92J225M559J836k084
$$ 53296 49207 55293 52867 50325 50770 50097 50494 53623 53656 55955 57397 57689 58914 63473 65309 63225
9891F3225P922J2714J0847K714m689o660l161q60k908J475N215J2060J9083J7523
$$ 63225 71147 83861 94708 97422 92733 86073 82912 82052 79144 80619 85834 97894 116977 134500
9877A34500J6294J6558J8512K3963J8765L9720M7280M7851N7886N0413M6916L5337
$$ 134500 150794 167352 185864 209827 228592 268312 315592 363443 421329 471742 518658 553995
9865E53995J8550K0571L5979N7153Q2355J06261J43656J90220K37314L14544M33175
$$ 553995 572545 593116 629095 686248 768603 874864 1018520 1208740 1446054 1760598 2193773
9854B193773O45566J046650J878092L290678M708979M901447L934475L172522
$$ 2193773 2839339 3885989 5764081 9054759 13763738 18665185 22599660 25772182
9846B5772182J502782k542733o345138n964738l672522k060117j279591q71552
$$ 25772182 27274964 24732231 18387093 12422355 8749833 6689716 5410125 4538573
9838D538573o32724m91536l91222l22190k47471j89153j56096j29942r7997p2865
$$ 4538573 3905849 3414313 3023091 2700901 2453430 2264277 2108181 1978239 1880242 1807377
9828A807377o2892m5515k4118k7846m3805n8087o9774q3782p8578p3015n9755
$$ 1807377 1744485 1698970 1674852 1647006 1603201 1545114 1475340 1391558 1312980 1239965 1180210
9817A180210k2364O760J7756o98o90l755l4646j08941j01514p0644n9564m5789
$$ 1180210 1157846 1164606 1182362 1181664 1180974 1177219 1142573 1033632 932118 861474 801910 756121
9805G56121l8670l0656k5792k6641j4607j4521k7331k4543k1188j8343j7953k0354
$$ 756121 717451 686795 661003 634362 619755 605234 577903 553360 532172 513829 495876 475522
9793D75522j5200j7077j4906q133j0171p799j0201j5681l803j2450j5196j4566
$$ 475522 460322 443245 428339 420206 410035 402236 392035 376354 372551 360101 344905 330339
9781C30339j3841m821j044j1275j8572j1676p847j369o299m807n750j0621q924
$$ 330339 316498 311677 310633 299358 280786 269110 261263 259894 253595 248788 243038 232417 223493
9768B23493Q87m402j1358q533m366o015j554m209j657k753j0773r616j837j334
$$ 223493 224380 219978 208620 200087 195721 189706 188152 183943 182286 179533 168760 159144 157307 155973
9754A55973q602m777j532n210p40k936o47r595j0257k791q094l836P016P946l685
$$ 155973 147371 142594 141062 135852 135112 132176 131529 121934 111677 108886 100792 96956 103972 111918 108233
9739A08233j1370m680P0q217K96J834l134l570J1975j818p279n498m216K690N70
$$ 108233 96863 92183 92253 84036 84332 86166 83032 79462 91437 89619 82340 76842 72626 75316 75886
9724G5886k697N45O97k988q538k866K932r4p491q502n74k770N786k219m968p67
$$ 75886 73189 73734 74431 71443 62905 60039 62971 62877 55386 46884 46310 43540 49326 47107 42139 41372
9708D1372r96n16l49o971n009m304M29P744k679m381L558O776j086r477n250J412
$$ 41372 40376 39860 39511 32540 27531 23227 23656 31400 28721 24340 27898 34674 33588 24111 18861 20273
9692B0273N811n281m420j823M503L75m653p282J133m76L030M033Q41k715m854
$$ 20273 26084 20803 16383 14560 19063 19438 14785 7503 8636 8160 11190 15223 16064 13349 8495
9677H495K116n571k162L282K778N84J020M086m38m2J081p30K511L168q727l703
$$ 8495 10611 5040 2878 6160 8938 9522 10542 14628 14190 14148 15229 14499 17010 20178 11451 7748
9661G748J55l075j967j156M739k377L003M132L033L845n1n658q635N23O189n586
$$ 7748 7903 4828 2861 1705 6444 4067 7070 11202 14235 18080 18029 12371 3736 4259 10448 4862
9645D862K468P07q00l407L020N438J653n286j119P32R71j605n234K050L283m945
$$ 4862 7330 8037 7237 3830 6850 12288 13941 8655 7536 8268 9239 7634 2400 4450 7733 2788
9629B788p667m78K631J710n13J552j707n35N687N443J910M43l064j642Q85P087
$$ 2788 -4879 -5357 -2726 -1016 -1529 23 -1684 -2219 3468 8911 10821 11264 8200 6558 7443 14530
9613A4530l011j481l315k896r19N156M090l222q280k072L246O143o53q97m080
$$ 14530 11519 10038 6723 3827 2908 8064 12154 8932 652 -1420 1826 7969 7316 6419 2339
9598B339J896L187K073n685o591l107M259M145l406K235L324j524N220R581m594
$$ 2339 4235 7422 9495 3810 -2781 -5888 -1629 2516 -890 1345 4669 3145 8365 17946 13352
9583A3352o631l201M607L09n91r010l041L009j31l579N296J436M076r49j3143
$$ 13352 6721 3520 8127 8436 7845 -1165 -4206 -1197 -1328 -4907 389 1825 5901 4952 -8191
9568h191K820L682O168P59o600l432l338r27O093l90k97M323M493j851q198l179
$$ -8191 -5371 -1689 4479 5238 -1362 -4794 -8132 -9059 -2966 -3356 -3653 670 5163 3312 -4886 -8065
9552h065n093O99J996L112n509N759P357N637k466l327j248m555m014p121l784
$$ -8065 -13158 -12459 -10463 -7351 -12860 -7101 256 5893 3427 100 -1148 -5703 -9717 -16838 -20622
9537b0622J590J197J121N487K557K182J510Q094j641k192J321K816m628n283Q581
$$ -20622 -19032 -17835 -16714 -11227 -8670 -6488 -4978 3116 1475 -717 604 3420 -1208 -6491 2090
9522B090j070q805J485j52m22j126O178K140n661m863l818L967O164J226j315
$$ 2090 1020 -7785 -6300 -6452 -6874 -8000 -1822 318 -5343 -10206 -14024 -10057 -3893 -2667 -3982
9507c982k508o820O9P04j610j930O88K053M953J0063m560j40l313R55J139M207
$$ -3982 -6490 -13310 -13241 -12537 -14147 -16077 -15389 -13336 -8383 1680 -2880 -3020 -6333 -5378 -4239 -32
9491c2n94n50J083L605n586j823j998K726k636J187O55m823j365Q124l5M829K823
$$ -32 -626 -1176 -93 3512 -2074 -3897 -5895 -3169 -5805 -4618 -3963 -8786 -10151 -2027 -2062 2767 5590
9474E590l264j546J835r056k600O372K64p55j549p60Q67K393p351n420o935P220
$$ 5590 2326 780 2615 -6441 -9041 -2669 -2405 -3160 -4709 -5469 -4602 -2209 -9560 -14980 -21915 -14695
9458a4695Q777O473L373m083p93M803N595p620j0868k62K448N07Q009N878l966
$$ -14695 -5918 555 3928 -155 -948 3855 9450 1830 -9038 -9300 -6852 -6345 1664 7542 3576
9443C576R14j409k121K186P738J6121K4647L1303K3284K3654J8782j2568l5296
$$ 3576 4490 3081 960 3146 10884 27005 51652 82955 106239 129893 148675 136107 100811
9430A00811l5043j7507j7517r385K583k63q41l938l143n693n238R52N573k424
$$ 100811 65768 48261 30744 21359 23942 23679 22838 18900 15757 10064 4826 5778 11351 8927
9416H927j021J356M469o452N088j22O08N400l249p682J259P012P29l739l106n236
$$ 8927 7906 9262 13731 7279 12367 12245 12853 18253 15004 7322 8581 15593 16322 12583 9477 4241
9400D241l570J88L991O97o597k377l343n020J576N309Q477k728p091r694M713
$$ 4241 671 859 4850 5547 -1050 -3427 -6770 -11790 -10214 -4905 3572 844 -6247 -15941 -11228
9385a1228L288k347k87O771k261m81P383K23l905K763J533m955n235m290o014
$$ -11228 -7940 -10287 -10574 -3803 -6064 -6545 838 1061 -2844 -81 1452 -3503 -8738 -13028 -19042
9370a9042L462L727M983K678N960m971K972K310k68p192k878k469L396M257j009
$$ -19042 -15580 -11853 -6870 -4192 1768 -3203 -231 2079 1811 -5381 -8259 -10728 -7332 -3075 -4084
9355d084P608L8K283q32k323q690k509J107L422N434j336n201l392L090o54K479
$$ -4084 3524 3562 5845 5013 2690 -6000 -8509 -7402 -3980 1454 118 -5083 -8475 -5385 -6039 -3560
9339c560j650Q8K278P403Q362j0506k423k143k285K42L806N66L440J361o28k92
$$ -3560 -5210 -5122 -2844 4559 12921 2415 -8 -2151 -4436 -4194 -388 178 3618 4979 4351 4059
9323D059J346k467o735K637q15l42N3Q72Q67r828m390L175n003M847p18k236P074
$$ 4059 5405 2938 -3797 -1160 -1975 -2317 -2264 -1392 -525 -10353 -14743 -11568 -16571 -11724 -12442 -14678 -7604
9306g604N744J717o060r80j718l840M97l052k762R753M324j0127J76N344O706
$$ -7604 -1860 -143 -6203 -7183 -8901 -12741 -12244 -15296 -18058 -8305 -3981 -14108 -13932 -8588 -1882
9291a882o84n724M169P632L392p824o265n42N566k054K444J791j088k645l080
$$ -1882 -2566 -8290 -4121 3511 6903 -921 -7186 -7728 -2162 -4216 -1772 19 -1069 -3714 -6794
9276f794o365L849N480k456r71j387j563L0k154k391P53K667J577K559j459L151
$$ -6794 -13159 -9310 -3830 -6286 -7257 -8644 -10207 -10177 -12331 -14722 -13969 -11302 -9725 -7166 -8625 -5474
9260e474N649n25J952k450p3o583P74N732L81N54k626q489M540K499j876p17P046
$$ -5474 175 -350 1602 -848 -921 -7504 -6730 -998 -617 -63 -2689 -11178 -6638 -4139 -6015 -6732 314
9243C14M613j019j525Mn299o907j050L649L778J250q232j472O157R206J756k421
$$ 314 4927 3908 2383 2387 -2912 -9819 -10869 -7220 -3442 -2192 -10424 -11896 -5739 3467 5223 2802
9227B802K092n712p520j64M893O470K276o82n637k869m523j538o060j475L895
$$ 2802 4894 -818 -8338 -8502 -3609 2861 5137 4455 -1182 -4051 -8574 -10112 -16172 -17647 -13752
9212a3752O025M683L379J734J150J671l593p307L405L83N790O440m319p090K841
$$ -13752 -7727 -3044 335 2069 3219 4890 1297 -6010 -2605 -2222 3568 10008 5689 -1401 1440
9197A440J944l761K15n079n044j204O762M021J728m03p653m041L101k061k185
$$ 1440 3384 -377 -162 -5241 -10285 -11489 -4727 -706 1022 619 -7034 -11075 -7974 -10035 -12220
9182a2220L532n183m491k31N974P468K144L439M942k428j523j542n025l159O82
$$ -12220 -8688 -13871 -18362 -18593 -12619 -5151 -3007 432 5374 2946 1423 -119 -5144 -8303 -7621
9167g621P416J938m367o879J286j306O588K73k975N064O703l482l744o575l178
$$ -7621 -205 1733 -2634 -9513 -8227 -9533 -2945 -2672 -5647 -583 6120 2638 -1106 -7681 -10859
9152a0859q13K692J114M246L857l937k294P251q97m709J524k39J81n033r27L620
$$ -10859 -11672 -8980 -7866 -3620 237 -3700 -5994 1257 360 -4349 -2825 -3064 -2883 -7916 -8843 -5223
9136e223J390L821J483L72P13N506p402n809k079L296k928n867Q96N116l079K976
$$ -5223 -3833 -12 1471 1843 2556 8062 660 -5149 -7228 -3932 -6860 -12727 -11831 -6715 -9794 -6818
9120f818p9M059N842L283j517l650R66J007p528m223l989k286N306k76j632r68
$$ -6818 -6897 -2838 3004 6287 4770 1120 2086 3093 -4435 -8658 -12647 -14933 -9627 -9903 -11535 -12503
9104a2503j392M2r32p674l807J3214R815O783k510J071m581m119M625L753K716
$$ -12503 -13895 -13853 -14785 -22459 -26266 -13052 -3237 3546 1036 2107 -2474 -6593 -1968 1785 4501
9089D501o192m34k720n689m81M746m730k352j602Q105m16k983L66k226K209N046
$$ 4501 -1691 -2125 -4845 -10534 -11015 -6269 -10999 -13351 -14953 -6848 -7264 -10247 -9881 -12107 -9898 -4852
9073d852K363L472M058n74n751k677P605J813p808n420Q969K46n23k568k047L318
$$ -4852 -2489 983 5041 4467 -1284 -3961 3644 5457 -2351 -7771 1198 1444 921 -1647 -3694 -376
9057c76J322p726R233J4314L671n743r492m423l020o511K1o74Q245R330k943k878
$$ -376 946 -6780 2453 16767 20438 14695 5203 780 -2240 -8751 -8730 -9404 -1159 8171 5228 2350
9041B350l827l234j082K144K688k994r249k539K785P677J084m73Q85L265N51l471
$$ 2350 -1477 -4711 -5793 -3649 -961 -3955 -13204 -15743 -12958 -5281 -4197 -4670 -3785 -520 31 -3440
9025c440M823n873o398L506R406J83l387n545l491j035L793L125N77k229n849
$$ -3440 1383 -4490 -10888 -7382 2024 2207 -1180 -6725 -10216 -11251 -7458 -4333 -3756 -5985 -11834
9010a1834L166L129L20p48p34l798J411O179o340l816K005J0037k979J531J880
$$ -11834 -8668 -5539 -5219 -5967 -6701 -10499 -9088 -2909 -9249 -13065 -11060 -1023 -4002 -2471 -591
8995e91L809j271o455L531J782p040m736O472L762N033K350q328k935N855P637
$$ -591 3218 1947 -4508 -977 805 -6235 -10971 -4499 -737 4296 6646 -1682 -4617 1238 8875
8980H875O351m662o740o383k547L900p23P37p97l474N403Q095K559j0480m530
$$ 8875 15226 10564 3824 -2559 -5106 -1206 -1929 -1192 -1989 -5463 -60 8035 10594 114 -4416
8965d416K397l457m14L247M515P498L172m623k072r46r75m963j812k193k376O206
$$ -4416 -2019 -5476 -5890 -2643 1872 9370 12542 7919 5847 4901 3926 -1037 -2849 -5042 -7418 -1212
8949a212n61m581P982K352k919k68j109n710k948m295L623L674R850N087k358
$$ -1212 -1773 -6354 1628 3980 1061 793 -316 -6026 -8974 -13269 -9646 -5972 3878 8965 6607
8934F607K824l243n514k364K452k275r083m942O887j600l344J767Q391n12r536
$$ 6607 9431 6188 674 -1690 762 -1513 -10596 -15538 -8651 -10251 -13595 -11828 -3437 -3949 -13485
8919a3485o634o48M174J1477M522J443l108M85k49o991o61K067L572K292N556
$$ -13485 -20119 -20767 -16593 -5116 -594 849 -2259 -1774 -2023 -9014 -9675 -7608 -4036 -1744 3812
8904C812q280j1970L493N60K009M426N721n016k107N05p90J770K798K594L026
$$ 3812 -4468 -16438 -12945 -12385 -10376 -5950 -229 -5245 -7352 -6847 -7637 -5867 -3069 -475 2551
8889B551k239j293m999l239L045O448K882O287N938j504p319m332r086K730L776
$$ 2551 312 -981 -5980 -9219 -6174 274 3156 9443 15381 13877 6558 2226 -6860 -4130 -354
8874c54j070o966j887j584J113J877N451M332l896j918j536m578j371M939j91
$$ -354 -1424 -8390 -10277 -11861 -10748 -8871 -3420 912 -2984 -4902 -6438 -11016 -12387 -7448 -7639
8859g639q20J498O061o54l49p53l563K507o259n534P892Q421k434o43o477q354
$$ -7639 -8459 -6961 -900 -1554 -1903 -2656 -6219 -3712 -9971 -15505 -7613 808 -1626 -2269 -8746 -17100
8843a7100l944m66r70K857K382o14k257P888Q986J12P56K393k346K155k701o130
$$ -17100 -21044 -21510 -22480 -19623 -17241 -17855 -20112 -12224 -3238 -3126 -2370 23 -2323 -168 -2869 -8999
8827h999J635j471j194J050R19L886m492o31j98J209L94J468l603m124M350N721
$$ -8999 -7364 -8835 -10029 -8979 -8060 -4174 -8666 -9297 -9495 -8286 -7892 -6424 -10027 -14151 -9801 -4080
8811d080Q98m442L279K842l746K045l134j222L029j899M526j274q662o395k559
$$ -4080 -3182 -7624 -4345 -1503 -5249 -3204 -6338 -7560 -4531 -6430 -1904 -3178 -11840 -18235 -20794
8796b0794P283K866N928J036J417j776n840p467Q014L636N972n27m109k067K012
$$ -20794 -13511 -10645 -4717 -3681 -2264 -4040 -9880 -17347 -9333 -5697 275 -252 -4361 -6428 -4416
8781d416j520LO641P338j92m832Q78l468r2%p311n42J979o048n392M977M914J198
$$ -4416 -5936 -5933 708 8046 7854 3022 3900 432 340 340 -6971 -7513 -5534 -11582 -16974 -11997 -7083 -5885
8763e885O72l963K745O998O097j764l12k63k661j195m685j510m741L551J0241
$$ -5885 -5213 -9176 -6431 567 6664 4900 4588 4325 1664 469 -4216 -5726 -10467 -6916 3325
8748C325Q47p207n090m24R800L697o00n134k711M279K313l824o308K053k076K043
$$ 3325 4172 -3035 -8125 -8549 1251 4948 4348 -786 -3497 782 3095 -729 -7037 -4984 -7060 -5017
8732e017l938n511r30m49J670J922J0010q33J82L114j58k700M61M705M926n544
$$ -5017 -8955 -14466 -15396 -15845 -14175 -12253 -2243 -3076 -2894 220 62 -2638 -2177 2528 7454 1910
8716A910K976J330j374L936l103o086j956K969k242O306K2J95j92L049K691K047
$$ 1910 4886 6216 4842 8778 5675 -411 -2367 602 -1640 4666 4688 4883 4691 7740 10431 12478
8700A2478p039o168Q549N000j280Q25n561K719N959J444n747q827m261m544J574
$$ 12478 5439 -729 7820 12820 11540 12365 6804 9523 15482 16926 11179 2352 -1909 -6453 -4879
8685d879k556N589Q561l267K211R57j666N30k277m334j963m92K874J1986k817
$$ -4879 -7435 -1846 6715 3448 5659 6616 4950 5480 3203 -1131 -3094 -3586 -712 11274 8457
8670H457l616k272j594r544J01R664o98O91L532J782K30J80n087p1L366L669K487
$$ 8457 4841 2569 975 -8569 -8468 1196 498 1189 4721 6503 6733 6913 1826 1755 5121 8790 11277
8653A1277o746j206Q518J062l496m575o167o171p65J838r4k985n695N427l75L554
$$ 11277 4531 3325 11843 12905 9409 4834 -1333 -7504 -8269 -6431 -6525 -9510 -15205 -9778 -10153 -6599
8637f599N335M647l336P209K314m113r88k649q53N9o42n268o710K618J760M50
$$ -6599 -1264 3383 47 7256 9570 5457 4469 1820 967 1026 384 -4884 -11594 -8976 -7216 -6766
8621f766L419q84J686L808M640Q979L830k841j854p73K844L245k401m447K034
$$ -6766 -3347 -4231 -2545 1263 5903 14882 18712 15871 14017 13244 16088 19333 16932 12485 14519
8606A4519j627k694K72j625k635j709j953k309L574n165j1308r36J0995L712l404
$$ 14519 12892 10198 10470 8845 6210 4501 2548 239 3813 -1352 -12660 -13596 -2601 1111 -2293
8591b293k143O453O385P675K173q322r432l762L601N073M890k364J831J924l308
$$ -2293 -4436 2017 8402 16077 18250 9928 496 -3266 335 5408 10298 7934 9765 11689 8381
8576H381k669j918M532m38K213R055k183j0489J33R12m411L397K745K948m328
$$ 8381 5712 3794 8326 7888 10101 19156 16973 6484 6617 7529 3118 6515 9260 12208 7880
8561G880j0164j618N037K759L072L219K365l461k474Q36M194O413O693k967k998
$$ 7880 -2284 -3902 1135 3894 6966 10185 12550 9089 6615 7451 11645 18058 24751 21784 18786
8546A8786k984L27l070L813M052R17L602q03n473l163K081o23j927n348j977K050
$$ 18786 15802 16129 13059 16872 20924 21841 25443 24640 19167 16004 18085 17462 15535 10187 8210 10260
8530A0260L840L192r021J317M271M414p26r935r963n497L360N906m059p281J828
$$ 10260 14100 17292 8271 9588 13859 18273 17547 7612 -2351 -7848 -4488 1418 -2641 -9922 -8094
8515h094M254J674J534M674J956M206m75n86K689K789m458l07k792J831L676m243
$$ -8094 -3840 -2166 -632 4042 5998 10204 9729 9143 11832 14621 10163 9856 7064 8895 12571 8328
8499H328n97N906R14n464j562M744q264j122J224k406M753m69o16k238J383m233
$$ 8328 7731 13637 14551 9087 7525 12269 4005 2883 4107 1701 6454 5985 5369 3131 4514 281
8483B81N533J898j585L939J409M078J661N674J826l798L038J1954J3078P392Q923
$$ 281 5814 7712 6127 10066 11475 15553 17214 22888 24714 20916 23954 35908 48986 56378 65301
8468F5301N585j0613j5887r778m671p259j875l580J849r688n977P71N864p29M8
$$ 65301 70886 60273 44386 34608 29937 22678 20803 17223 19072 9384 3407 4178 10042 9313 9361
8453I361k693R567Q268k769n221q43l138j993k257K532j428o066L900P346M106
$$ 9361 6668 16235 24503 21734 16513 15670 12532 10539 8282 10814 9386 3320 7220 14566 18672
8438A8672J896N78m881M297R822J3454J0560Q574Q777K761j7121j5923j3924m050
$$ 18672 20568 21146 16265 20562 30384 43838 54398 62972 71749 74510 57389 41466 27542 23492
8424B3492o700q404l798K751m901l532R98K143q665j577K989j24K048M778J224
$$ 23492 16792 8388 4590 7341 2440 -1092 -94 2049 -6616 -8193 -5204 -5328 -3280 1498 2722
8409B722l819l987K653K168j336O689J541O48r01J383k361K435l785l012M018
$$ 2722 -1097 -5084 -2431 -263 -1599 5090 6631 7279 6378 7761 5400 7835 4050 1038 5056
8394E056Q300K148m706J259K37Q173k709o074m140j713n467p696J362J1388J055
$$ 5056 13356 15504 10798 12057 12294 20467 17758 11684 7544 5831 364 -7332 -5970 5418 6473
8379F473n078N254M875l009J880J461l644N560m329n888k817j851P621K408n468
$$ 6473 1395 6649 11524 8515 10395 11856 8212 13772 9443 3555 738 -1113 6508 8916 3448
8364C448n370m302K609N571l193r684N762N951K880l153M406L74O409R290j592
$$ 3448 -1922 -6224 -3615 1956 -1237 -10921 -5159 792 3672 519 4925 5299 11708 20998 19406
8349A9406K677N592m553j0000J668j809j882l006L750K64m867L94q68m570K241
$$ 19406 22083 27675 23122 13122 14790 12981 11099 8093 11843 12107 7240 7634 6766 2196 4437
8334D437J77L942K231L699J211j219l598p084l503J268j660J0753L674k84o566
$$ 4437 4614 8556 10787 14486 15697 14478 10880 3796 293 1561 -99 10654 14328 14044 7478
8319G478J62N610J081r377m486j520o41M09K064q188j310J98r9k9L595O458L024
$$ 7478 7640 13250 14331 4954 468 -1052 -1693 -1284 780 -7408 -8718 -8520 -8619 -8648 -5053 1405 4429
8302D429o201n565K652n513k039j915L29q07p95N195P243Q766j699l115m227m995
$$ 4429 -1772 -7337 -4685 -10198 -12237 -14152 -13823 -14630 -15425 -10230 -2987 5779 4080 965 -3262 -8257
8286h257P25o53p13K914p33o673J0494P256l622j577j656K085l431M688l57k027
$$ -8257 -7532 -8185 -8898 -5984 -6717 -13390 -2896 4360 738 -839 -2495 -410 -3841 847 490 -1537
8270a537k81L770P96o385J295M516L677k038q126K684M715K939m043m23M303k815
$$ -1537 -1818 1952 2748 -3637 -2342 2174 5851 3813 -4313 -1629 3086 6025 1982 1559 5862 3047
8254C047p766n087J596L382N290K927m835k718L862M66l648l116K925J905j159
$$ 3047 -4719 -9806 -8210 -4828 462 3389 -1446 -4164 -302 164 -3484 -6600 -3675 -1770 -2929
8239b929n375M119K16k819n934j817K392p4j318K987J88M512l13J299jj035J879
$$ -2929 -8304 -4185 -3969 -6788 -12722 -14539 -12147 -12221 -13539 -10552 -10364 -5852 -6165 -4866 -4867 -5902 -4023
8222d023R125O697K692m312m768K521L408k020j996q729l377L46O168N59M511
$$ -4023 5102 11799 14491 10179 5411 7932 11340 9320 7324 -1405 -4782 -4436 1732 2291 6802
8207F802q959p085J329N321J831l460M827K731j812L044o864n689K86R30K148
$$ 6802 -2157 -9242 -7913 -2592 -761 -4221 606 3337 1525 4569 -2295 -7984 -7698 -6768 -4620
8192d620j625k385J853j656M068N070l690M35L437m48J96l848m080J056L496J478
$$ -4620 -6245 -8630 -6777 -8433 -4365 705 -2985 -2550 887 439 635 -3213 -7293 -6237 -2741 -1263
8176a263K119L221m113r637m360M064N377J172M892N53n517N482P062O20n485
$$ -1263 856 4077 -36 -9673 -14033 -9969 -4592 -3420 1472 2025 -3492 1990 9052 9672 4187
8161D187m577j825k5K764j352l09o104l176J11J074M097N49J328J337j2092l703
$$ 4187 -390 -2215 -2240 524 -828 -1137 -7241 -10417 -10306 -9232 -5135 -4586 -3258 -1921 -14013 -17716
8145a7716M719R176L587p013k505M291o77J840n496J088N728N280j755o190r050
$$ -17716 -12997 -3821 -234 -7247 -9752 -5461 -6138 -4298 -9794 -8706 -2978 2302 547 -5643 -14693
8130a4693n11O893L549K381j739J169j665L787o9N414j035R95k388J066N216q29
$$ -14693 -15204 -8311 -4762 -2381 -4120 -2951 -4616 -829 -898 4516 3481 4476 2088 3154 8370 7541
8114G541l673k834j394M457n831L349N346N415k969j847q73m853J95L842Q75J652
$$ 7541 3868 1034 -360 4097 -1734 1615 6961 12376 9407 7560 6687 1834 2029 5871 6746 8398
8098H398L76q51j250l616O47k29j155j66O844k311o090k083K73M219k833j630
$$ 8398 8774 7923 6673 3057 3704 3475 2320 2154 8998 6687 597 -1486 -1213 3006 173 -1457
8082a457k098j984j745K2n71J205R229j238l243k456j763N375K445L958m939j557
$$ -1457 -3555 -5539 -7284 -7262 -7833 -6628 2601 1363 -1880 -4336 -6099 -724 1721 5679 740 -817
8066h17n412K28R780J584p30j176M58K392P187j0010o148M119k042M034J528k897
$$ -817 -6229 -6001 3779 5363 4633 3457 3915 6307 13494 3484 -2664 1455 -587 3447 4975 2078
8050B078J853P273J5q979j996l077K096L358J658l320q644N90L659r48N281o291
$$ 2078 3931 11204 11219 2240 244 -2833 -737 2621 4279 959 -7685 -7095 -3436 -4384 897 -5394
8034e394J875K396J583M631O66o262q834K328N942L535j395N024j084RN547L219
$$ -5394 -3519 -1123 460 5091 5757 -505 -9339 -7011 -1069 2466 1071 6095 5011 5020 10567 13786
8018A3786J754Q460k863o872k20m808j662j884N86J296k587J762n814L955J17
$$ 13786 15540 24000 21137 14265 14045 9237 7575 5691 6277 7573 4986 6748 934 4889 5006
8003E006J049p55n037j591l578O999O394J33j766j3646n512N937O431P021j297
$$ 5006 6055 5300 263 -1328 -4906 2093 8487 8620 6854 -6792 -12304 -6367 64 7085 5788
7988E788q842L92N883j290L198o88k875M12J425j910k43J681L097k321l49q02
$$ 5788 -3054 -2662 3221 1931 5129 4441 1566 1978 3403 1493 1250 2931 6028 3707 3358 2556
7972B556o7m83O68l485k933l1O766L060m673K25l42Q54P308j042j959n123l405
$$ 2556 2489 2006 2674 -811 -3744 -3775 2991 6051 1378 1603 1261 2115 9423 8381 6422 1299 -2106
7955b106L346J994K552p460KL382N041P103M320n07K933o845m717k797p34N135
$$ -2106 1240 3234 5786 -1674 -1672 1710 6751 13854 18174 17667 20600 13755 9038 6241 5507 10642
7939A0642R89n116j1039o965L855L322N480O063L075m575q969j716J2129J55k434
$$ 10642 11631 6515 -4524 -11489 -7634 -4312 1168 7231 10306 5731 -3238 -4954 7175 7330 4896
7924D896j980M73J331L727l67k792K74L647J72m583p543K265J472N311L50l860
$$ 4896 2916 3389 4720 8447 8080 5288 5562 9209 9381 4798 -2745 -480 992 6303 6653 2793
7908B793J134M086K634K862L586o520k527m825nk593N495N238O168k01o220q945
$$ 2793 3927 8013 10647 13509 17095 10575 8048 3223 3218 625 6120 11358 17526 17325 11105 2160
7892B160j191O138L147p828l554l227M034Q84K910K179J611k864J037L319N042
$$ 2160 969 7107 10254 2426 -1128 -4355 -321 563 3473 5652 7263 4399 5436 8755 13797
7877A3797j50k836k604p22K65j276J658m464l512M514L599k740l973l722j206
$$ 13797 13647 10811 8207 7485 7750 6474 8132 3668 156 4670 8269 5529 1556 -2166 -3372
7862c372n2N658M623N530j915k645n91j150q696J250m671L360O958l421L67L824
$$ -3372 -3424 2234 6857 12387 10472 7827 7236 6086 -2610 -1360 -6031 -2671 4287 866 1233 5057
7846E057J762r26j987n547k294M763j152k605k624L337K76K12J023L890K863P469
$$ 5057 6819 5893 3906 -1641 -3935 828 -324 -2929 -5553 -2216 -1940 -1728 -705 3185 6048 13517
7830A3517k321m412j949m803Q08J96l646j818R347l524p095o626M066K019P215
$$ 13517 11196 6784 4835 32 840 1036 -2610 -4428 4919 1395 -5700 -12326 -8260 -6241 974
7815I74J444r317k381O539L892m55l223J070k103j07J188j792j3951k402Q901
$$ 974 2418 -6899 -9280 -2741 1151 696 -2527 -1457 -3560 -3667 -2479 -4271 -18222 -20624 -11723
7800a1723P124l255k051q53p73N178Q347L799k296r537J342M847R23j978K627
$$ -11723 -4599 -7854 -9905 -10758 -11531 -6353 1994 5793 3497 -6040 -4698 149 1072 -906 1721
7785A721j900m00L707n333j64k063n057O479O366L76n150m764p011k61L572N890
$$ 1721 -179 -579 3128 -2205 -2369 -4432 -9489 -3010 3356 3732 -1418 -6182 -13193 -13454 -9882 -3992
7769c992J795K239O285N53k803m286K475n839n863q600L286J1829K166n559j832
$$ -3992 -2197 42 6327 6880 4077 -209 2266 -3573 -9436 -18036 -14750 -2921 -755 -6314 -8146
7754h146R850L314p573k128k187M287K619m659M590K635l102n83J713j852p014
$$ -8146 1704 5018 -2555 -4683 -6870 -2583 36 -4623 -33 2602 -500 -1083 630 -1222 -8236
7739h236J986L577K092l428m82J679n44p804l265O533J503K534K285N7J340jR03
$$ -8236 -6250 -2673 -581 -4009 -4491 -2812 -3356 -11160 -14425 -7892 -6389 -3855 -1570 -1513 -173 -174 729
7722G29m974m506n64k792m055M777J768n503J495L603m554j71M970k040N21Q834
$$ 729 -4245 -8751 -9315 -12107 -16162 -11385 -9617 -15120 -13625 -10022 -14576 -14747 -9777 -11817 -11296 -2462
7706b462P4Q89k263j290j955K840m837r31L800j960q45j246j517l077k09P102
$$ -2462 -2388 -1499 -3762 -5052 -7007 -4167 -9004 -9935 -6135 -8095 -8940 -10186 -11703 -14780 -14989 -7887
7690g887j924j0909n301N600L409M43M839R385K21m272J785P657P69k490p755
$$ -7887 -9811 -20720 -26021 -20421 -17012 -16569 -11730 -2345 -2124 -6396 -4611 3046 3815 1325 -6430
7675f430J229K086j522j640M575J815K957L350R01P05q2l960j603n067J132L05
$$ -6430 -5201 -3115 -4637 -6277 -1702 113 3070 6420 7321 8026 7944 3984 2381 -2686 -1554 -1249
7659a249l390m845k197M986K746J482r65q47L583o691j1790P860J2168o1O62O356
$$ -1249 -4639 -9484 -11681 -6695 -3949 -2467 -3432 -4279 -696 -7387 -19177 -11317 851 790 1452 7808
7643G808j21o234j704N373l500K881P2q732m499L02O74k663l389K806K362P459
$$ 7808 7687 1453 -251 5122 1622 4503 4575 -4157 -8656 -8354 -7680 -10343 -13732 -10926 -8564 -1105
7627a105R424J826l406o292q22m989q495O03M30j815K902K591Q00O753N25o216
$$ -1105 8319 10145 6739 447 -375 -5364 -13859 -13256 -12826 -14641 -11739 -9148 -8348 -1595 -1070 -7286
7611g286O819M203k670J810J598n41J955J056o986l255R126j130K895m31o487
$$ -7286 -467 3736 1066 2876 4474 3933 5888 6944 -42 -3297 5829 4699 7594 7163 676
7596F76o432p71j821j488k656J51J272k731o99O291J455J901O829k95j564o8m021
$$ 676 -5756 -6527 -8348 -9836 -12492 -12341 -11069 -13800 -14499 -8208 -6753 -4852 1977 1682 118 50 -3971
7579c971K92R75m276j984j312J671Q179L858M119p207r679p279L700N943N567
$$ -3971 -3679 -2704 -6980 -8964 -10276 -8605 -426 3432 7551 344 -9335 -16614 -12914 -6971 -1404
7564a404J168m397k368J857k59K406o28O70M295n84p569Q93m176k068N075J404
$$ -1404 -236 -4633 -7001 -5144 -5403 -2997 -3625 -2955 1340 756 -6813 -5920 -10096 -12164 -7089 -5685
7548e685R383L981l590p515l652k906M421j348j003N727M274k108q741l590k75
$$ -5685 3698 7679 4089 -3426 -7078 -9984 -5563 -6911 -7914 -2187 2087 -21 -8762 -12352 -12627
7533a2627L679N943L717N561q85L144m35n307m934o484J179M494J830K083N969
$$ -12627 -8948 -3005 712 6273 5388 8532 8097 2790 -2144 -8628 -7449 -2955 -1125 958 6927
7518F927O14K869J740j364M84l651j419o936m888K004k52l950l83J145R94N567
$$ 6927 7541 10410 12150 10786 11270 7619 6200 -736 -5624 -3620 -3872 -7822 -8205 -7060 -6066 -499
7502d99k520n874r81n393n730M255Q849L215l979P026J1027P29n832o235o687
$$ -499 -3019 -8893 -9874 -15267 -20997 -16742 -7893 -4678 -8657 -1631 9396 10125 4293 -1942 -8629
7487h629n351q162O589K328K264O020l303n324P73P57l556j146P192l304q287
$$ -8629 -13980 -22142 -15553 -13225 -10961 -4941 -8244 -13568 -12795 -12038 -15594 -16740 -9548 -12852 -21139
7472b1139j838J0134M24j804l3j915K445J625j161N343K398k167K338K326p76
$$ -21139 -22977 -12843 -12419 -14223 -14256 -16171 -13726 -12101 -13262 -7919 -5521 -7688 -5350 -3024 -3800
7457c800n005m075Q19l89L687j481j0159K15Q195J4792L220j401m783m974j15
$$ -3800 -8805 -12880 -12061 -12450 -8763 -10244 -20403 -20188 -11993 2799 6019 4618 -165 -5139 -5254
7442e254J454M587m2k653l644J349J620N501L583m962m712n869k709l285N888
$$ -5254 -3800 787 745 -1908 -5552 -4203 -2583 2918 6501 1539 -3173 -9042 -11751 -15036 -9148
7427i148O301J887M087m348q630N151K724q88m520q5N362K623J837k45N487K151
$$ -9148 -2847 -960 3127 -1221 -9851 -4700 -1976 -2864 -7384 -7469 -2107 516 2353 2108 7595 9746
7411I746L119j3415j0911r7l55L503l331j580K945L663R97K996N406k001m241
$$ 9746 12865 -550 -11461 -11558 -11913 -8410 -11741 -13321 -10376 -6713 -5716 -2720 2686 685 -3556
7396c556p795j692M760K821k767N304L388m057j650j512r39o000n95J0047J133
$$ -3556 -11351 -13043 -8283 -5462 -8229 -2925 463 -3594 -5244 -6756 -7695 -13695 -14290 -4243 -3110
7381c110q879M203L326j597Q98J773j959K953l121m804j437J277k400l209m062
$$ -3110 -11989 -7786 -4460 -6057 -5159 -3386 -5345 -2392 -5513 -10317 -11754 -10477 -12877 -16086 -20148
7366b0148P632R946Q159l338m383n23M08o171m98l96j507R500L256m418n173j726
$$ -20148 -12516 -2570 5589 2251 -2132 -2655 -2247 -8418 -8916 -9312 -10819 -1319 1937 -2481 -7654 -9380
7350i380o273P47l316m54J031K888R673L234m093R1L502J726m831L648J956j957
$$ -9380 -15653 -14906 -18222 -18676 -17645 -14757 -5084 -1850 -5943 -5852 -2350 -624 -5455 -1807 149 -1808
7334a808j138k72p31m4Q85j361l579k368Q704q16o401l731O350l91r92k535l080
$$ -1808 -2946 -3218 -3949 -3993 -3108 -4469 -8048 -10416 -1712 -2528 -8929 -12660 -6310 -6701 -7693 -10228 -13308
7317a3308J997J659K028O18N520q2l025k709N571P802N39j910l500p83p246J920
$$ -13308 -11311 -9652 -7624 -7006 -1486 -1568 -4593 -7302 -1731 6071 6610 4700 1200 417 -6829 -4909
7301d909O298M207j23j312M243L216m026o291l259K019l8l10N638k513p509l506
$$ -4909 1389 5596 5473 4161 8404 11620 7594 1303 -1956 63 25 -285 5353 2840 -4669 -8175
7285h175M52k521O349P004R51l097K339N554N736K845M71r817j0199J411J819
$$ -8175 -7723 -10244 -3895 3109 4060 963 3302 8856 14592 17437 17908 8091 -2108 -697 1122
7270A122j647K589Q72j620m614o460M991N080J0K711j883r11n363p092L580J3415
$$ 1122 -525 2064 2936 1316 -3298 -9758 -4767 313 323 3034 1151 240 -5123 -12215 -8635 4780
7254D780N556p190j3021o79P814k589j884L532N214N025j876l74k187l235l676
$$ 4780 10336 3146 -9875 -10554 -2740 -5329 -7213 -3681 1533 6558 4682 4308 2121 -1114 -4790
7239d790J297k195N245o071r166l6J0275j371N140P275q659p180j788N898l701
$$ -4790 -3493 -5688 -443 -6514 -15680 -15716 -5441 -6812 -1672 5603 -3056 -10236 -12024 -6126 -9827
7224i827L748K429l405P51O956O922j2o056p091n88L935j402n829k248k411K318
$$ -9827 -6079 -3650 -7055 -6304 652 7574 7562 1506 -5585 -6173 -2238 -3640 -9469 -11717 -14128 -11810
7208a1810J1468L570J0109L535n681n108n412K542p002o964k689J852Q02K147
$$ -11810 -342 3228 13337 16872 11191 6083 671 3213 -3789 -10753 -13442 -11590 -10788 -8641
7194h641L67N886P778J248J973l980J553l572n72l832k975o296K653q10q45M403
$$ -8641 -8274 -2388 5390 6638 8611 4631 6184 2612 2040 -1792 -4767 -11063 -8410 -9220 -10065 -5662
7178e662M974k175M481J373M29k930p93L417J815j193n67L57N423P85j0316m1
$$ -5662 -688 -2863 1618 2991 3420 490 -303 3114 4929 3736 3169 3526 8949 9734 -582 -623
7162f23k536J828N368l033k441m583j448k732J214N307J1275k86J85l547m073
$$ -623 -3159 -1331 4037 1004 -1437 -6020 -7468 -10200 -8986 -3679 7596 7310 7495 3948 -125
7147a25J752n789j312J788k519K022N416L625J852l014N55O158n285r548N272
$$ -125 1627 -4162 -5474 -3686 -6205 -4183 1233 4858 6710 3696 4251 10409 5124 -4424 848
7132H48j616j163K934q278k622r50l203n18J968J4266K426m332J842l452l216
$$ 848 -768 -1931 1003 -7275 -9897 -10847 -14050 -14568 -12600 1666 4092 -240 1602 -1850 -5066
7117e066m31L256J216j699j2063p690K191O277N215M395K862j194m100n365J610
$$ -5066 -5497 -2241 -1025 -2724 -14787 -22477 -20286 -14009 -8794 -4399 -1537 -2731 -6831 -12196 -10586
7102a0586P013K131R945K065k782L007l402o923p698n571O79L990Q272m267M917
$$ -10586 -3573 -1442 8503 10568 7786 10793 7391 468 -7230 -12801 -12122 -8132 140 -4127 790
7087G90L764j191k437M430n342r927j471j814m59O097M218K447m725K776L906
$$ 790 4554 3363 926 5356 14 -9913 -11384 -13198 -13657 -7560 -3342 -895 -5620 -2844 1062
7072A062J986k529l774J369J456m431k401p13K202p59j48M427N912j873m916q201
$$ 1062 3048 519 -3255 -1886 -430 -4861 -7262 -7975 -5773 -6532 -6680 -2253 3659 1786 -3130 -11331
7056a1331N184l28j682l704n469K652L330M632k394J212K417k753l18N897m604
$$ -11331 -6147 -6475 -8157 -11861 -17330 -14678 -11348 -6716 -9110 -7898 -5481 -8234 -8552 -2655 -7259
7041g259n1L232O284m699p377M29R14K847P92J446M574k574o92L790j677k858
$$ -7259 -7310 -4078 2206 -2493 -9870 -9441 -8527 -5680 -4888 -3442 1132 -1442 -2134 1656 -21 -2879
7025b879k931k549L349N181m92l687m851J509M749j578K651R742o217N72j244
$$ -2879 -5810 -8359 -5010 171 -321 -4008 -8859 -7350 -2601 -4179 -1528 8214 1997 2569 1325
7010A325j51O909o283l187J0451j445o679M952p65k228o349K759M935j224m975
$$ 1325 1174 8083 1800 -1387 9064 7619 940 5892 5127 2899 -3450 -691 4244 3020 -1955
6995a955n166J446O220O965K800r025m328l088P749r34k682k205J837j038k497
$$ -1955 -7121 -5675 545 7510 10310 1285 -3043 -6131 1618 684 -1998 -4203 -2366 -3404 -5901
6980e901p234L098K122l597L932J087j791n05J948j780k311Q934R107M552k132
$$ -5901 -13135 -10037 -7915 -11512 -7580 -6493 -8284 -8789 -6841 -8621 -10932 -1998 7109 11661 9529
6965I529j1143l592j056n78k80M281N105K955m008q980l803J321Q635P2N0j788
$$ 9529 -1614 -5206 -6262 -6840 -7120 -2839 2266 5221 1213 -7767 -11570 -10249 -1614 -1542 -1492 -3280
6949c280n213n418L29Q248L147k596O59n047K32M600Q05n53L039j99j1257%L650
$$ -3280 -8493 -13911 -13582 -5334 -2187 -4783 -4124 -9171 -8939 -4339 -3534 -4087 -1048 -1247 -12504 -12504 -8854
6932h854n24M300N665k069q42L063J694n085l296N488J560M160j582k542m077
$$ -8854 -9378 -5078 587 -1482 -2324 739 2433 -2652 -5948 -460 1100 5260 3678 1136 -2941
6917b941l015M149k069j137L086K555P133N427m559n711j78j936Q90m561l518
$$ -2941 -5956 -1807 -3876 -5013 -1927 628 7761 13188 8629 2918 2740 804 1694 -2867 -6385
6902f385K475M50m542M641O295P66p18p1r10m301j941q640O45r04J681L129j671
$$ -6385 -3910 -3460 -8002 -3361 2934 3700 2982 2911 2001 -2300 -4241 -12881 -12236 -13140 -11459 -8330 -10001
6885a0001M905k849N113q07m252L99j377M038M130m063p28O044n436o050M214
$$ -10001 -5096 -7945 -2832 -3639 -7891 -7492 -8869 -4831 -701 -4764 -5492 552 -4884 -10934 -6720
6870f720M906m328k854N620P790K356m405N96p87m628K209M833J108m732K194
$$ -6720 -1814 -6142 -8996 -3376 4414 6770 2365 2961 2174 -2454 -245 4588 5696 964 3158
6855C158j972m95L01K522j619l391N473p013l161j47J103J602P0J617O9l591l156
$$ 3158 1186 691 992 3514 1895 -1496 3977 -3036 -6197 -6344 -5241 -3639 -3569 -1952 -1883 -5474 -8630
6838h630m189K968P604L70j265k818l945l676o360P787P401j283K093M059k108
$$ -8630 -12819 -9851 -2247 -1877 -3142 -5960 -9905 -13581 -19941 -12154 -4753 -6036 -3943 116 -1992
6823a992m484k335j281L225l809L554M821l489o963l948Q988l861R87N063J279
$$ -1992 -6476 -8811 -10092 -6867 -10676 -7122 -2301 -5790 -12753 -16701 -7713 -11574 -10587 -5524 -4245
6808d245k686M874q779k571k180j353K57Q056M633j297l954m146N347P401J582
$$ -4245 -6931 -2057 -10836 -13407 -15587 -16940 -16683 -8627 -3994 -5291 -9245 -13391 -8044 -643 939
6793I39M5j508L211m168n674L500J477k069o532N679J570m09j881k637kL391L252
$$ 939 984 -524 2687 -1481 -7155 -3655 -2178 -4247 -10779 -5100 -3530 -3939 -5820 -8457 -8459 -5068 -1816
6776a816J82j182O394M39L175J551p684m999N826n085N273J829m38j833k763P453
$$ -1816 -1634 -2816 3578 4017 7192 8743 1059 -3940 1886 -3199 2074 3903 3465 1632 -1131 6322
6760F322j321o956j942K997J692P366l70l507k557l242l523j123n29M048O627
$$ 6322 5001 -1955 -3897 -900 792 8158 7788 4281 1724 -1518 -5041 -6164 -6693 -2645 3982
6745C982J430o763j2021p702L441O307P572K383M775M588q800j016o081q57K616
$$ 3982 5412 -1351 -13372 -21074 -17633 -11326 -3754 -1371 3404 7992 -808 -1824 -7905 -8762 -6146
6730f146Q519N991o129o259R93j371J002M603J07l747p886n115Q737K233l313
$$ -6146 2373 8364 2235 -4024 -3031 -4402 -3400 1203 1310 -2437 -10323 -15438 -6701 -4468 -7781
6715g781j542m101J068J653M135J063k13m656N071N841J936K507L145o338j841
$$ -7781 -9323 -13424 -12356 -10703 -6568 -5505 -5718 -10374 -5303 538 2474 4981 8126 1788 -53
6700e3k564j571j965J545K63N8J369R891k936j875k620j265r13j616M764J253
$$ -53 -2617 -4188 -6153 -4608 -4345 -4287 -2918 6973 4037 2162 -458 -1723 -2636 -4252 512 1765
6684A765p61j357P657P399K034J631p597j2880m922k706k996J491O17K936l65
$$ 1765 1004 -353 7304 14703 16737 18368 10771 -2109 -7031 -9737 -12733 -11242 -10625 -7689 -8054
6669h054m174Q01K225K315M644O34j616j609J485J087l298p658k419O102Q253
$$ -8054 -12228 -11427 -9202 -6887 -2243 -1609 -3225 -4834 -3349 -2262 -5560 -13218 -15637 -9535 -1282
6654a282J232j612R85K538J124L16k209o305k200k77K063p2k646j445L219J310
$$ -1282 -50 -1662 -677 1861 2985 3301 1092 -5213 -7413 -7690 -5627 -5699 -8345 -9790 -6571 -5261
6638e261o25k616O00J163J865k157K187M738K162J59l9o643o94J357J426J248
$$ -5261 -5886 -8502 -7902 -6739 -4874 -7031 -4844 -106 2056 2215 2176 -4467 -5161 -3804 -2378 -1130
6622a130K095J982J193l298j018o449j730L000P606m765o758O517N869J0780o608
$$ -1130 965 2947 4140 842 -176 -6625 -8355 -5355 2251 -2514 -9272 -2755 3114 13894 7286
6607G286K09J955o72n005m224n818J477J840l893M923J2154l298m129J451j560
$$ 7286 7495 9450 8778 3773 -451 -6269 -4792 -2952 -6845 -1922 10232 6934 2805 4256 2696
6592B696J630J0617m595q483l100l250m439L466l055L537N301N483j479k321n40
$$ 2696 4326 14943 10348 1865 -1235 -4485 -8924 -5458 -8513 -4976 325 5808 4329 2008 1468
6577A468m449K580K14n2k409k578o58Q379N349l114m61k75l442k789L78j685Q73
$$ 1468 -2981 -401 -187 -239 -2648 -5226 -5884 2495 7844 4730 4269 3994 552 -2237 -1859 -3544 -2671
6560b671M71K664K480n293k094M896J459K574M50n780k628M602j800o745K296
$$ -2671 -2200 464 2944 -2349 -4443 453 1912 4486 4936 -844 -3472 1130 -670 -7415 -5119
6545e119J479K743N093j45r995k696K306j84k22O0J080O567K049j672m1L176p93
$$ -5119 -3640 -897 4196 4051 -5944 -8640 -6334 -6518 -6740 -6680 -5600 967 3016 1344 1303 4479 3686
6528C686n721j833O167J591K86l208k233q90K985L966j660r587j632N008L656
$$ 3686 -2035 -3868 2299 3890 4176 968 -1265 -2155 830 4796 3136 -6451 -8083 -3075 581
6513E81n627p787k00O897Q558k277m734r757L132O381M816P78P39J409J684j735
$$ 581 -5046 -12833 -13033 -6136 2422 145 -4589 -14346 -11214 -4833 -17 761 1500 2909 4593 2858
6497B858N82J343j494o951m771L701l87j754M106l176k207M323K750J839r438
$$ 2858 3440 4783 3289 -3662 -8433 -4732 -5119 -6873 -2767 -5943 -8150 -3827 -1077 762 -8676
6482h676Q32K449L80N480q54N38L358n178k053N08R097L587j421l628n022n116
$$ -8676 -7844 -5395 -5015 465 -389 149 3507 -1671 -3724 -3216 5881 9468 8047 4419 -603 -5719
6466e719l536j305j311O690M755J916m211M465j207O5m08J913j18j745K167R57
$$ -5719 -9255 -10560 -11871 -5181 -426 1490 -2721 1744 537 602 194 2107 1989 244 2411 3368
6450C368l712J315k306m640j286l77N205O718l973l474J031J243l804K053L497
$$ 3368 -344 971 -1335 -5975 -7261 -7638 -2433 4285 312 -3162 -2131 -888 -4692 -2639 858
6435H58L930N065k220p819j396q39r70q20L839L296r05k711O72m338P21M65m932
$$ 858 4788 9853 7633 -186 -1582 -2421 -3391 -4211 -372 2924 2019 -692 -20 -4358 -3637 -3172 -8104
6418h104n125m609J102P419K557k427n344K282L923Q362p7n704K666J007K613
$$ -8104 -13229 -17838 -16736 -9317 -6760 -9187 -14531 -12249 -8326 36 -41 -5745 -3079 -2072 541
6403E41N346j32n701l937n535M184M707o664k851j359j519j562R329N235K743
$$ 541 5887 5755 54 -3883 -9418 -5234 -527 -7191 -10042 -11401 -12920 -14482 -5153 82 2825
6388B825J24L882j938n352k273K277K575L108n912q53L920P617K616p797n301
$$ 2825 2949 6831 4893 -459 -2732 -455 2120 5228 -684 -1537 2383 10000 12616 4819 -482
6373d82k357M665J1986M15m413m866m170m406J528K717l46L800p129j154M079
$$ -482 -2839 1826 13812 14227 9814 4948 778 -3628 -2100 617 271 4071 -3058 -4212 -133
6358a33m964L810k173n767j638l187l367Q552M191O42m56k515J0902J768n991
$$ -133 -5097 -1287 -3460 -9227 -10865 -14052 -17419 -8867 -4676 -4034 -4490 -7005 3897 5665 -326
6343c26l844k545k455M203J767j534j327K947J061J703M57q52K891J138J617o77
$$ -326 -4170 -6715 -9170 -4967 -3200 -4734 -6061 -3114 -2053 -350 107 -745 2146 3284 4901 4224
6327D224n313q98Q13J249r048l741o064q94J4165M504mN146k42m278L700l608
$$ 4224 -1089 -1987 -1174 75 -8973 -12714 -18778 -19672 -5507 -1003 -1007 4139 3897 -381 3319 -289
6311b89n779k461M902P098J971o806p709k746L205M394k56K504J09N86M497j627
$$ -289 -6068 -8529 -3627 3471 5442 -1364 -9073 -11819 -8614 -4220 -4476 -1972 -1863 -1277 3220 1593
6295A593l481l197o49K815k124q66P79q12o77N250r59n445j606o129J54Q63M062
$$ 1593 -1888 -5085 -5734 -2919 -5043 -5909 -5130 -5942 -6619 -1369 -2328 -7773 -9379 -15508 -15354 -14491 -10429
6278a0429N507k792m013Q358L293l857N026O441L696m551l389k986p669L870p80
$$ -10429 -4922 -7714 -11727 -3369 -76 -3933 1093 7534 11230 6679 3290 304 -7365 -3495 -4275
6263d275l460K774P364j150L209l444m282J519K027M990J551n796p263o542k843
$$ -4275 -7735 -4961 2403 1253 4462 1018 -3264 -1745 282 5272 6823 1027 -6236 -12778 -15621
6248a5621N476Q210L23M460j170K738j73k095J096K251R02J219p538l076J98Q300
$$ -15621 -10145 -1935 -1612 2848 1678 4416 4243 2148 3244 5495 6397 7616 78 -2998 -2800 5500
6232E500N615J470l668j485k371L678j426l601m343k479M490m332L937j599P798
$$ 5500 11115 12585 8917 7432 5061 8739 7313 3712 -631 -3110 1380 -2952 985 -614 7184
6217G184M495n567l341l297n070n478k573M849n41N926J5266q57l945j662K781
$$ 7184 11679 6112 2771 -526 -5596 -11074 -13647 -8798 -9339 -3413 11853 10996 7051 5389 8170
6202H170L152J854m973L044l458r995m654k572J948P485J878k515k36O308j351
$$ 8170 11322 13176 8203 11247 7789 -2206 -6860 -9432 -7484 1 1879 -636 -872 5436 4085
6187D085q57J615m251K31k972o891k579m399P867j954J222o47k041J262J758J465
$$ 4085 3228 4843 592 823 -2149 -9040 -11619 -16018 -8151 -10105 -8883 -9530 -11571 -10309 -8551 -7086
6171g086L585l657O701L574k468l634n912r95k382L022P27L544R125j700m237
$$ -7086 -3501 -7158 -457 3117 649 -2985 -8897 -9892 -12274 -9252 -8525 -4981 4144 2444 -1793
6156a793m555L0J428O07P669K41N19j746O40l074k210M435L422o521l898K345
$$ -1793 -6348 -6318 -4890 -4283 3386 3627 4146 2400 3040 -34 -2244 2191 5613 -908 -4806 -2461
6140b461P247m923p949n497Q174M838m055k17J383J568L431K898l5J319J51j881
$$ -2461 4786 -137 -8086 -13583 -5409 -571 -4626 -4843 -3460 -1892 1539 4437 4402 5721 5872 3991
6124C991K322N527o683j1912K74L99J86J999o057n81J681J593p764M938P027l3
$$ 3991 6313 11840 5157 -6755 -6481 -6082 -5896 -3897 -9954 -10535 -8854 -7261 -15025 -10087 -3060 -3093
6108c093N447N123j110p721o61M45j218k131N263R75k275L692K057j6p846K240
$$ -3093 2354 7477 6367 -1354 -2015 -1570 -2788 -4919 344 1319 -956 2736 4793 4777 -3069 -829
6092h29K833k475j156N709k484l05O224j593J56M856j0706o051k812l413O937
$$ -829 2004 -471 -1627 4082 1598 1293 7517 5924 6080 10936 230 -5821 -8633 -12046 -5109
6077e109R49K056O87l42p152m188P007K086P7l480r13L626M946q373K684Q318
$$ -5109 -4160 -2104 -1417 -1759 -8911 -13099 -6092 -4006 -3929 -7409 -8322 -4696 250 -8123 -5439 2879
6061B879J636k852p090j862r57k620o68Q516R960K190Q82J844l876m276J719J501
$$ 2879 4515 1663 -5427 -7289 -8246 -10866 -11534 -3018 6942 9132 10014 11858 7982 3706 5425 6926
6045F926n355m651p9k382M209L785M431M91l677l826J1645N35n352K052j853l138
$$ 6926 1571 -3080 -3159 -5541 -1332 2453 6884 7375 3698 -128 11517 12052 6700 8752 6899 3761
6029C761o287n527K724j454J946o72R70O085k885L22m170R11k561m489L777O377
$$ 3761 -2526 -8053 -5329 -6783 -4837 -5509 -4539 1546 -1339 -1017 -5187 -4276 -6837 -11326 -7549 -1172
6013a172n682m17l72k94r06J133M445K694o174Q34O626M242q52M297m228k818
$$ -1172 -6854 -7271 -7643 -7937 -8843 -7710 -3265 -571 -6745 -5911 715 4957 4105 8402 4174 1356
5997A356j571K497M789J476N95p58l856n02m270j0889j972O25L381O004P231q37
$$ 1356 -215 2282 7071 8547 9142 8384 4528 4026 -244 -11133 -13105 -12480 -9099 -3095 4136 3299
5981C299j819m320n780L871k137p6J269k526L636P816m351l621l76J776l095L799
$$ 3299 1480 -2840 -8620 -4749 -6886 -6962 -5693 -8219 -4583 3233 -1118 -4739 -5115 -3339 -6434 -2635
5965b635J663j258o006Q05O684L623K680k492N00K087k847k19J869J16n64p720
$$ -2635 -972 -2230 -8236 -7431 -747 2876 5556 3064 3564 5651 2804 2585 4454 4570 4006 -3714
5949c714m351K835K089L45O14l077k807L859M855M175K876r45n859J781J00J532
$$ -3714 -8065 -5230 -3141 -2796 -2182 -5259 -8066 -4207 648 4823 7699 6754 895 2676 2776 4308
5933D308q425l6n279L424J1805O183n842L32M786n13k072M64o106k726m618m033
$$ 4308 -4117 -4153 -9432 -6008 5797 11980 6138 6470 11256 10743 8671 9135 3029 303 -4315 -8348
5917h348K269l54N48l39r39j560J680K33N399M950M982l922p333n42J276J256
$$ -8348 -6079 -6433 -5885 -6224 -7163 -8723 -7043 -6810 -1411 3539 8521 4599 -2734 -3276 -2000 -744
5901g44k575O88j39n039k384r74Q565p273j493Q769P163m225k242l748J716O544
$$ -744 -3319 -2631 -2770 -7809 -10193 -11167 -2602 -9875 -11368 -2599 4564 339 -1903 -5651 -3935 2609
5885B609M469R73L322q61o299j525L87l041L022k955r28M586J994q94r335j932
$$ 2609 7078 8051 11373 10512 4213 2688 3075 34 3056 101 -827 3759 5753 4859 -4476 -6408
$$ [...]
##END NTUPLES=NMR SPECTRUM
##END=
