##TITLE=Analysis number 321723
Compound Code cc 48324
Book Reference 496/32/3/2
Project Code adrs
Chemist Name anns
##JCAMPDX= 6.0         $$ Bruker NMR JCAMP-DX V2.0
##DATA TYPE= NMR SPECTRUM
##DATA CLASS= NTUPLES
##ORIGIN= Bruker BioSpin GmbH
##OWNER= nmr
$$ XWIN-NMR		Version 3.5
$$ Wed Aug 23 11:55:33 2006 GMT Daylight Time (UT+1h)  MAYBRIDGE\nmr@NMR_250MHZ
##.OBSERVE FREQUENCY= 250.131544655141
##.OBSERVE NUCLEUS= ^1H
##.ACQUISITION MODE= SIMULTANEOUS (DQD)
##.ACQUISITION SCHEME= undefined
##.AVERAGES= 16
##.DIGITISER RES= 18
##SPECTROMETER/DATA SYSTEM= dpx250
##.PULSE SEQUENCE= zg30
##.SOLVENT NAME= CDCl3
##.SHIFT REFERENCE= (INTERNAL, CDCl3, 0, 16.522)
##AUDIT TRAIL= $$ (NUMBER, WHEN, WHO, WHERE, WHAT)
$$ ##TITLE= Audit trail, XWIN-NMR		Version 3.5
$$ ##JCAMPDX= 5.01
$$ ##ORIGIN= Bruker BioSpin GmbH
$$ ##OWNER= nmr
$$ C:\u/data/dgb/nmr/ADRS/1440/pdata/1/auditp.txt
$$ ##AUDIT TRAIL=  $$ (NUMBER, WHEN, WHO, WHERE, WHAT)
(   1,<2006-08-23 11:55:12.12 +100>,<MAYBRIDGE\nmr>,<NMR_250MHZ>,
      <created by zg, POWCHK disabled, PULCHK disabled
       configuration hash MD5:
       E2 DF 36 D8 04 B2 41 60 5A D7 A3 38 5A 4B D0 FE
       data hash MD5: 64K
       4B 2B 09 4A 2E 40 DA B1 FD 36 22 04 82 D9 10 C0>)
(   2,<2006-08-23 11:55:24.72 +100>,<MAYBRIDGE\nmr>,<NMR_250MHZ>,
      <Start of raw data processing
       ef LB = 0.3 FT_mod = 6 PKNL = 1 SI = 32K 
       data hash MD5: 32K
       6A 1E 84 62 2F 9A 94 56 1E 25 94 93 31 26 3B BB>)
(   3,<2006-08-23 11:55:26.51 +100>,<MAYBRIDGE\nmr>,<NMR_250MHZ>,
      <apk 
       data hash MD5: 32K
       7F EB 9D 90 BC F7 96 60 29 3E 59 9E DD 94 CF 44>)
(   4,<2006-08-23 11:55:27.31 +100>,<MAYBRIDGE\nmr>,<NMR_250MHZ>,
      <abs ABSG = 5 
       data hash MD5: 32K
       1F 2E F1 2F 06 CF 25 06 C5 13 51 66 E0 49 A5 C9>)
$$ ##END=
$$ 
$$ hash MD5
$$ 9C 1C FC 6D 7F 59 A8 E2 7F 6C 3B 3E 1F E3 AF 8D
##$RELAX= 
##$RELAX= 
##$RELAX= 
##$RELAX= 
##$RELAX= 
##$RELAX= 
##$RELAX= 
$$ Bruker specific parameters
$$ --------------------------
##$DU= <C:\u>
##$EXPNO= 1440
##$NAME= <ADRS>
##$PROCNO= 1
##$TYPE= <nmr>
##$USER= <dgb>
##$AMP= (0..31)
100 100 100 100 100 100 100 100 100 100 100 100 100 100 100 100 100 100 
100 100 100 100 100 100 100 100 100 100 100 100 100 100 
##$AQSEQ= 0
##$AQ_mod= 3
##$AUNM= <au_zg>
##$AUTOPOS= <24 >
##$BF1= 250.13
##$BF2= 250.13
##$BF3= 250.13
##$BF4= 250.13
##$BF5= 500.13
##$BF6= 500.13
##$BF7= 500.13
##$BF8= 500.13
##$BYTORDA= 1
##$CFDGTYP= 0
##$CFRGTYP= 5
##$CHEMSTR= <none>
##$CNST= (0..31)
1 1 145 1 1 1 1 1 1 1 1 1 1 1 1 1 1 1 1 1 1 1 1 1 1 1 1 1 1 1 1 1 
##$CPDPRG= <>
##$CPDPRG1= <>
##$CPDPRG2= <>
##$CPDPRG3= <>
##$CPDPRG4= <mlev>
##$CPDPRG5= <mlev>
##$CPDPRG6= <mlev>
##$CPDPRG7= <mlev>
##$CPDPRG8= <mlev>
##$CPDPRGB= <>
##$CPDPRGT= <>
##$D= (0..31)
0 1 0 0 0 0 0 0 0 0.06 0 0 0 0 0 0 0.0002 0 0 0 0 0 0 0 0 0 0 0 0 0 0 
0 
##$DATE= 1156330510
##$DBL= (0..7)
120 120 120 120 120 120 120 120 
##$DBP= (0..7)
150 150 150 150 150 150 150 150 
##$DBP07= 0
##$DBPNAM0= <>
##$DBPNAM1= <>
$$ [...]
##$SUBNAM7= <"">
##$SUBNAM8= <"">
##$SUBNAM9= <"">
##$SW= 20.6930455092707
##$SWIBOX= (0..15)
0 0 3 0 0 0 0 0 0 0 0 0 0 0 0 0 
##$SW_h= 5175.983436853
##$TD= 65536
##$TD0= 1
##$TE= 296.16
##$TE2= 300
##$TE3= 300
##$TEG= 300
##$TL= (0..7)
0 120 120 120 120 120 120 120 
##$TP= (0..7)
150 150 150 150 150 150 150 150 
##$TP07= 0
##$TPNAME0= <>
##$TPNAME1= <>
##$TPNAME2= <>
##$TPNAME3= <>
##$TPNAME4= <>
##$TPNAME5= <>
##$TPNAME6= <>
##$TPNAME7= <>
##$TPOAL= (0..7)
0.5 0.5 0.5 0.5 0.5 0.5 0.5 0.5 
##$TPOFFS= (0..7)
0 0 0 0 0 0 0 0 
##$TUNHIN= 0
##$TUNHOUT= 0
##$TUNXOUT= 0
##$USERA1= <user>
##$USERA2= <user>
##$USERA3= <user>
##$USERA4= <user>
##$USERA5= <user>
##$V9= 5
##$VALIST= <valist>
##$VCLIST= <CCCCCCCCCCCCCCC>
##$VD= 0
##$VDLIST= <DDDDDDDDDDDDDDD>
##$VPLIST= <PPPPPPPPPPPPPPP>
##$VTLIST= <TTTTTTTTTTTTTTT>
##$WBST= 1024
##$WBSW= 4
##$XGAIN= (0..3)
0 0 0 0 
##$XL= 0
##$YL= 0
##$YMAX_a= 596946
##$YMIN_a= -499118
##$ZGOPTNS= <>
##$ZL1= 120
##$ZL2= 120
##$ZL3= 120
##$ZL4= 120
##$ABSF1= 16.522
##$ABSF2= -4.171173
##$ABSG= 5
##$ABSL= 3
##$ALPHA= 0
##$AQORDER= 0
##$ASSFAC= 0
##$ASSFACI= 0
##$ASSFACX= 0
##$ASSWID= 0
##$AUNMP= <proc_1d>
##$AZFE= 0.1
##$AZFW= 0.1
##$BCFW= 0
##$BC_mod= 0
##$BYTORDP= 0
##$COROFFS= 0
##$CY= 12.5
##$DATMOD= 1
##$DC= 0
##$DFILT= <>
##$DTYPP= 0
##$F1P= 14.0000005364418
##$F2P= -0.99999901652339
##$FCOR= 0.5
##$FTSIZE= 32768
##$FT_mod= 6
##$GAMMA= 0
##$GB= 0
##$INTBC= 1
##$INTSCL= 1
##$ISEN= 128
##$LB= 0.3
##$LEV0= 0
##$LPBIN= 0
##$MAXI= 10000
##$MC2= 0
##$MEAN= 0
##$ME_mod= 0
##$MI= 0
##$NCOEF= 0
##$NC_proc= -3
##$NLEV= 6
##$NOISF1= 0
##$NOISF2= 0
##$NSP= 0
##$NTH_PI= 0
##$NZP= 0
##$OFFSET= 16.522
##$PC= 1
##$PHC0= -7.838689
##$PHC1= 7.024774
##$PH_mod= 1
##$PKNL= yes
##$PPARMOD= 0
##$PSCAL= 4
##$PSIGN= 0
##$REVERSE= no
##$SF= 250.13
##$SI= 32768
##$SIGF1= 0
##$SIGF2= 0
##$SINO= 400
##$SIOLD= 32768
##$SREGLST= <1H.CDCl3>
##$SSB= 0
##$STSI= 32768
##$STSR= 0
##$SW_p= 5175.98343685301
##$SYMM= 0
##$S_DEV= 0
##$TDeff= 65536
##$TDoff= 0
##$TI= <Analysis number 999999
Compound Code 99
Book Reference 9
Project Code 9>
##$TILT= no
##$TM1= 0
##$TM2= 0
##$TOPLEV= 0
##$USERP1= <user>
##$USERP2= <user>
##$USERP3= <user>
##$USERP4= <user>
##$USERP5= <user>
##$WDW= 1
##$XDIM= 32768
##$YMAX_p= 470036502
##$YMIN_p= -33161
$$ End of Bruker specific parameters
$$ ---------------------------------
##NTUPLES= NMR SPECTRUM
##VAR_NAME=  FREQUENCY,     SPECTRUM/REAL,   SPECTRUM/IMAG
##SYMBOL=    X,             R,               I
##VAR_TYPE=  INDEPENDENT,   DEPENDENT,       DEPENDENT
##VAR_FORM=  AFFN,          ASDF,            ASDF
##VAR_DIM=   32768,         32768,           32768
##UNITS=     HZ,            ARBITRARY UNITS, ARBITRARY UNITS
##FACTOR=    0.157963299565203, 1,           1
##FIRST=     4132.6476996994, 0,             0
##LAST=      -1043.33573715361, 0,           0
##MIN=       -1043.33573715361, -33161,      0
##MAX=       4132.6476996994, 470036502,     0
$$ Real data points
##PAGE= N=1
##DATA TABLE= (X++(R..R)), XYDATA
$$ [...]
23966 -2431 341 -2103 -2878 1247 1501 1658 6927 2976 4779 10082 10307 8650 5559 -3397 -984 -1716
23950 -1716 -5803 -10244 -12936 -10822 -5397 -1585 -427 1200 -1086 -897 2347 893 2532 9860 10010
23935 10010 4831 -4193 -16802 -18844 -12384 -4735 -2289 4595 4311 -2131 -4401 -4502 -4046 3177 2154
23920 2154 -2365 -3846 -4748 -1650 -1421 208 2961 3804 5905 7144 909 -1089 7022 10123 5547
23905 5547 1482 -1030 3677 5249 4139 3891 3477 7516 3224 -859 790 717 -3655 -2705 1571 618
23889 618 -1329 -6001 -7852 -3095 -3216 -2426 -1479 1726 2468 3294 955 -5182 -8102 -5848 -538 4755
23873 4755 9290 10591 7837 9264 3851 1516 7725 5845 2619 1673 4754 5043 10081 4047 5018
23858 5018 -4848 -7356 -6436 -2210 -156 2657 561 -6594 -3307 -1604 -3237 -8593 -8252 -7793 -4418
23843 -4418 -5781 -4285 3641 5735 4507 6836 2215 3662 295 -6250 -8292 -153 1646 2920 4497
23828 4497 2628 7114 1626 -1192 1481 -1014 3891 5845 707 -2083 2014 5633 3669 -2684 -2537
23813 -2537 -1531 6740 8056 9165 7206 7537 11461 6243 6138 2173 -8824 -6782 1488 1552 -1049
23798 -1049 -3278 -158 8244 6233 5180 5431 6570 8576 5444 2121 335 -3215 3224 6027 2102
23783 2102 -2653 -1049 6155 14159 10430 5293 -3569 -1940 -66 -1224 5579 8264 4518 -179 -2828
23768 -2828 -3124 178 5389 3745 -4194 -13721 -14341 -9510 -6491 -10078 -9080 -4784 -1145 3058 5601
23753 5601 2757 -12030 -11924 -4866 -683 -868 5961 11152 8850 6247 5862 3584 4212 3979 -629 4303
23737 4303 5212 506 -1091 -237 1113 3139 -1878 -8175 -12513 -9310 377 5206 3334 3394 7909 11779
23721 11779 12071 8544 4013 5734 2619 3669 2924 110 -2842 1634 1768 -1350 553 3833 2449
23706 2449 2714 3949 9837 9840 3215 49 -385 -3303 -7205 -1928 -1131 -3866 -5490 -3214 -2666 -899
23690 -899 -5221 -7200 -5719 -1158 -2458 -5216 -2489 776 137 7012 5648 -3343 -3352 -5514 -5303 -2945
23674 -2945 -1460 -8814 -10599 -8755 -8103 -4961 -11223 -12844 -11020 -2976 4184 1013 1468 9122 11456
23659 11456 14115 14163 4380 -815 -6912 -6170 -7647 -8969 -7590 -2576 -2606 -2440 4282 5767 622 -420
23643 -420 -3095 1888 5644 544 -9893 -11794 -5203 1860 8728 8663 10120 10537 7626 937 -2770
23628 -2770 -4613 -2128 3966 6811 11571 12138 8994 4778 -459 -3741 -8415 -4646 -10274 -11732 -11630
23613 -11630 -6251 4888 17529 20729 15407 15121 9784 4380 -1243 -4518 -3005 -2594 2927 4844
23599 4844 2623 487 551 2343 1816 1634 9132 15405 6100 5782 7046 7990 10543 9804 9862 3830 277
23582 277 2582 768 161 2880 6857 8810 7163 -1067 -2179 2313 446 1212 4013 4367 1694 -4835
23566 -4835 -7012 -9084 -7537 -7693 -2460 -4303 -2831 1889 3297 3382 3085 829 -2318 -5741 -7903 -4178
23550 -4178 -2744 -3020 435 2221 10112 13571 10024 9351 5748 -695 831 6869 2788 833 3324
23535 3324 450 6407 6629 3179 8920 6337 9243 17033 10535 4480 -40 -3742 -2591 -3211 -7633
23520 -7633 -7854 -11583 -12752 -11455 -8990 -9188 -6805 -8714 -2294 1725 723 -6888 -3537 -85 8353
23505 8353 12603 7087 600 2626 351 -8294 -4712 -1849 2900 -4607 -1702 1166 9435 12503 11966
23490 11966 8297 2523 3941 6596 8344 1316 631 3558 8940 9550 6720 -379 562 7312 3674
23475 3674 -261 -3136 -2173 -1097 1191 -2012 -3960 -5342 -2115 -2305 -8269 -2739 1020 5751 3894
23460 3894 2346 3268 -4084 -629 4678 4994 863 -4778 -7142 -1769 290 -121 -2092 -2377 -16182
23445 -16182 -19763 -11072 -6304 1023 2194 -1455 -8507 -5559 -3177 -6124 -11681 -10432 -8030 -12610
23431 -12610 -13925 -8901 -9144 -4196 5454 8999 -1570 -2549 -1148 1100 6222 7230 4194 -4316 -6590
23416 -6590 -8689 -1268 2342 -439 -1245 -6438 -6217 2396 7793 9418 4617 2927 4244 1469 -857
23401 -857 525 336 5559 6191 8373 5757 4165 1284 -1190 4094 6796 5591 5776 -3916 -8492 -8080
23385 -8080 -12077 -6653 -3297 -2790 3569 -940 -1731 -2604 83 -764 1400 3146 -602 983 9320 10112
23369 10112 -171 2642 3983 5671 6088 -3571 772 7525 7279 5229 5192 2865 1662 6813 905
23354 905 -5881 -2286 -3675 -9611 -9868 -204 2207 -1768 -3173 -3613 -3858 -1682 -3282 -2386 1611 6191
23338 6191 8173 4057 -1002 -2952 -3295 -3702 -4617 -9956 -9522 -2599 4072 4206 4960 10092 9145 5992
23322 5992 -22 -2733 -3013 -5863 -6929 484 3189 630 -4254 -4040 -2691 -1105 -6617 -5553 -1266
23307 -1266 -3806 -8127 -9350 -6702 -1913 -2438 -2612 -6470 -7669 -4627 -5841 -8035 -5419 -1030 -5194
23292 -5194 -8995 -8149 -6950 -8381 -4748 -2243 -8788 -14825 -8870 -2546 -3574 -545 8775 15547 15488
23277 15488 17477 10506 2137 -2010 30 3650 3908 -1191 -2314 5933 5171 8607 12622 14773 10499
23262 10499 9292 2259 2634 8595 12301 13323 16069 15436 13198 11726 8564 11127 4384 4197 2632
23247 2632 -987 225 3310 5555 5114 3603 2231 -8079 -6594 2687 6149 1541 -3266 -3110 2091
23232 2091 -2489 -5472 2021 5958 491 1629 3416 -91 -3045 -2089 3791 9995 8860 3032 1659
23217 1659 305 -401 -5220 -8342 -3394 -1742 -1596 -7342 -13135 -8388 -7518 -10760 -4286 -1823 -7564
23202 -7564 -8937 -11849 -12938 -10904 -12126 -10492 -11587 -13530 -10504 -4303 6161 4783 -1541 -4974
23188 -4974 917 -1131 -4003 -5188 -2555 -530 -3540 2414 1803 -1778 -26 -2593 -5903 -7838 -4684
23173 -4684 -5934 -10772 -14649 -13696 -9824 -4822 4822 4333 -1585 -7348 -10378 -5402 -6375 -3651 -4885
23158 -4885 -2805 2100 7499 5691 952 1737 11076 15284 9419 594 -3279 -6779 4595 6270 7422
23143 7422 7630 3153 5433 618 -6004 -4395 -194 -6583 -6362 -1828 -1023 821 1 -6884 -7755 -2633
23127 -2633 6798 9047 7732 2226 4307 2573 1558 -1567 -3500 -8350 -10245 -11217 -9983 -5391 -2560
23112 -2560 751 -534 -2376 -283 -218 -6178 -13252 -17518 -14908 -13365 -7142 -5389 -2575 -154 6633
23097 6633 12886 7141 1522 657 3584 7748 1283 -2409 -5182 -3596 -2394 -1473 4911 5038 -598
23082 -598 -3444 447 -1261 -6877 -9768 -8116 -7995 -11666 -9409 -8853 -13198 -9848 -1023 2933 3017 2868
23066 2868 -4129 -6260 -2455 -2332 -2896 -649 -2260 -9 2572 1105 -3258 -7187 -15707 -14873 -14003 -12519
23050 -12519 -8139 347 -4358 -5610 -4654 -8301 -5603 -9468 -21905 -25339 -21878 -15556 -11954 -10041
23036 -10041 -10257 -9781 -8586 -3896 -4134 -5003 -6729 -3390 3830 13197 8322 7863 8761 2959 -3491 -3203
23020 -3203 -3218 -3729 -3454 -4903 -4699 -6770 -13273 -11977 -8494 -1301 -9889 -5736 3134 7396 11562 -601
23004 -601 -4900 -4293 -3668 -6291 -8619 -284 9542 3229 -1014 -8160 -9604 -6845 -3102 700 2425
22989 2425 3835 -1286 -7353 -2132 4231 4518 3257 -1707 -3699 -4174 427 3007 5003 6633 14103
22974 14103 13887 8916 14391 8326 4081 485 -3024 1692 320 -4238 -8602 -4132 -1184 3641 9329
22959 9329 9155 1919 -6337 -4468 1541 8503 4100 994 1653 1660 -2257 -253 -1694 -3415 -6667 -548
22943 -548 3095 2060 -4000 -4101 -3785 -6063 -8506 -10078 -10180 -8519 -2980 1276 7107 3447 -7080
22928 -7080 -6788 -6869 -434 573 3888 7950 8155 2359 130 -568 5841 8090 4280 4479 1556 2809
22912 2809 2911 3904 4384 2157 3225 -1809 -3583 1439 -1823 -8720 -1573 7904 7668 1554 -5215 -3637
22896 -3637 -5316 -11925 -12790 -11016 -7569 -5680 2316 6051 4752 3719 -37 -4526 -2487 -9900 -10977
22881 -10977 -5028 -6073 -2337 3601 5417 732 -1396 2095 -986 -3790 -2848 2326 2326 -1727 -4430
22866 -4430 -6396 -1030 -2534 -2833 -4200 -3187 -990 -3298 -2912 -5128 -7384 2896 6041 5869 -3548
22851 -3548 -7882 -2775 -2594 -6195 -4598 4464 6205 968 -6363 -6329 -2888 3739 -3940 -8061 -6176
22836 -6176 -5929 -4608 -3311 -7863 -6966 -6967 -5608 3952 2690 -1735 -5826 -7865 -2737 1267 -4655 -13092
22820 -13092 -16775 -17399 -13675 -5711 4608 2260 -5144 -7163 -8599 166 5959 7364 5248 4000
22806 4000 5652 11457 15630 14863 13728 15772 14676 5790 -1042 420 3144 -27 -2751 -8737 -7241
22791 -7241 -10651 -13553 -9231 -3240 -880 -6304 -8183 -13394 -11547 -11634 -10272 -221 8586 4082 -2140
22776 -2140 -894 2486 5232 584 -1174 -1505 3000 1240 489 5608 4937 1186 2458 -129 -4653
22761 -4653 -887 3239 -2896 -3549 2568 4596 5182 4722 1314 542 4181 123 -9690 -12668 -9095 -7924
22745 -7924 -9606 -8208 -7522 -1808 -1453 -4218 -7465 -6613 -9825 -2840 2882 4664 7739 11184 1590
22730 1590 -3586 -1478 -3003 -3291 -399 -1036 -438 4120 3529 -390 -1421 -2057 -4901 -5650 -161 -2422
22714 -2422 -3394 -1295 -4157 -10725 -9499 -5643 -6687 -4905 -5379 -5478 -8376 -3605 -1357 -6617 -9752 -11482
22698 -11482 -7098 -9485 -10921 -6960 -6108 -7168 -15756 -10504 -6410 -5723 -1496 1065 1640 -1806 -6927
22683 -6927 -6530 -4377 -8892 -9168 -5416 3603 2501 2587 -1323 -8603 -6650 -3355 2676 5258 4600 -741
22667 -741 -1585 3827 8379 9292 3213 -3379 -1595 180 -4176 -6032 -3616 -3709 -8457 -5260 -1189 4143
22651 4143 3477 -1112 -5071 -422 -1920 -661 2376 3745 7872 8634 8226 6930 767 1393 -740 -2133
22635 -2133 -1559 2289 -252 -1801 1366 1878 -1706 -381 4313 -699 1326 -1213 -2425 99 3480
22620 3480 2151 -578 -439 -1190 2649 -1969 -6928 -2239 1291 337 -1550 -3714 -5657 -9864 -9116 -7914
22604 -7914 -7885 -14717 -15663 -10955 -4906 -1727 -5690 -2917 2016 5119 2983 -3652 -9603 -2667 -1070
22589 -1070 -3841 -1662 -3313 -4822 -3175 2072 3511 3100 5 -4919 -7042 1470 7158 9526 6035
22574 6035 1249 2218 2031 2686 3674 4768 -1301 9862 13930 4927 2737 71 -7605 -8162 -8001 -4934
22558 -4934 -7146 -5169 -1872 -7317 -5787 2046 11373 13640 14266 9421 2820 5919 8098 5711 7286
22543 7286 6272 3872 382 -1559 5881 2764 563 803 3286 3728 -8774 -13510 -12668 -5637 1912
22528 1912 861 -2754 -4283 -6344 -4551 -3254 -11764 -16112 -6331 -1084 -8376 -4488 1453 2701 583
22513 583 -2652 -5953 -6765 -3141 -4611 -5382 -5188 -5851 -5466 672 3696 -3031 -2752 -2482 -3010 1002 -1489
22496 -1489 -2829 1011 -2234 -6938 -6446 3914 2511 3728 3238 2763 1586 -332 -665 -4001 -7224
22481 -7224 -5531 -8600 -4208 2512 4263 4970 80 3524 1555 566 3757 2202 1716 3070 2088 -3471
22465 -3471 -2211 -2108 -4830 -7367 -5232 1337 181 -6561 -7177 -4700 -5791 -2700 2188 9895 13454
22450 13454 6946 3986 3119 4064 6425 8797 7257 8863 2246 3846 5133 7289 2953 4065 1327
22435 1327 -6181 -9034 -9293 -10284 -3842 -3532 -2043 5151 1837 -843 -868 -1947 -6547 -9789 -7459 151
22419 151 6566 9918 6592 -3810 -3976 3602 9829 6069 5472 5363 3307 2855 2601 5802 -423 -2326
22403 -2326 -2630 -9875 -8349 6865 6719 7529 9362 1500 -3157 -2627 380 7485 3496 -824 -2825
22388 -2825 -4943 -2907 174 6097 3170 -735 1450 6895 -1625 -4755 -2904 -4209 -4621 -6261 -8532
22373 -8532 -764 6890 8809 3528 2913 2308 525 -1287 -6705 -7346 -2997 911 -408 -11006 -10831
22358 -10831 -5996 -6369 -2044 443 -1269 -1835 -5501 -6473 -1506 -1304 -962 177 -2568 -6077 -7753 -10700
22342 -10700 -14601 -10155 -4371 -314 966 -10202 -12446 -462 3459 1299 3520 4604 106 -158
22328 -158 -490 3076 331 -3519 -8798 -12692 -13017 -5998 -7339 -6447 -5235 -4003 -279 -2331 591 6121
22312 6121 113 -7476 -6124 -11143 -7971 3097 858 -2513 930 -2057 -5832 -1426 4444 1749
22298 1749 2070 1086 -5065 -6315 -4222 -6112 -3782 -2456 -3190 -251 -4064 -11446 -16261 -8429 -4907
22283 -4907 -8003 -6884 -6142 -4427 2101 7121 3225 3948 8183 3668 1262 -1145 -1518 5110 2568
22268 2568 -8572 -4640 899 -5032 -11758 -11818 -10778 -6634 -6237 -5425 870 3251 1464 -1652 383
22253 383 6978 3425 207 -1045 -6639 -9660 -3119 -4974 -8302 -8472 -2259 -1991 -817 1346 6280
22238 6280 15889 15134 6260 6656 15029 10868 7897 2836 -7 -3111 -6231 2403 3081 9303 13489
22223 13489 6476 4532 10908 12786 12686 6792 1435 -3376 -3519 -7548 -4601 4315 5882 5250 11809
22208 11809 15850 10866 2516 881 -7117 -7663 -8084 -16019 -17468 -11322 -5596 -2481 -3371 -3868 -2411
22193 -2411 -3186 -3421 959 525 1450 3537 5915 3471 6040 4380 1252 -699 310 -2171 -1637 -1464
22177 -1464 217 -1965 -2587 -4085 -2918 -2958 -1342 -7278 -15128 -10884 -866 11630 13247 6600 -284
22162 -284 -741 -125 2135 6741 7666 7263 1287 1429 -1094 -2617 5698 9529 7674 5289 4621 677
22146 677 5045 3845 335 -4774 -10738 -9692 -7126 -2628 4390 6362 1998 -1438 -277 -7122 -11440
22131 -11440 -9360 -12364 -5868 -1747 -8375 -14470 -15258 -13085 -11906 -12550 -10831 -6976 -4543 -5112 -6753
22116 -6753 -3528 -2312 -5941 -6228 -7784 -3979 -1585 -4465 -9690 -7438 53 3365 -2480 -11123 -9940
22101 -9940 -9432 -11906 -11322 -12382 -12516 -10905 -2712 1476 2298 -4317 -514 1053 -1857 -11176 -12770 -8614
22085 -8614 -5476 -15911 -16106 -11905 -5927 1408 1589 952 -1851 802 1504 3860 3918 4551 -102 4596
22069 4596 764 -5679 -7044 -2751 1287 -6416 -17799 -15719 -6169 519 7648 238 310 -4036 -5417
22054 -5417 -1000 -2692 -7897 -8862 -6963 -6651 -1599 2315 3410 2159 6648 8336 8551 10088 7190
22039 7190 2518 -3255 -4102 1645 -302 -3279 -1538 2917 4263 -1292 -9607 -7144 -5450 -7102 -3787
22024 -3787 -3955 -2960 -3036 -3631 2104 405 -3474 -1837 -10009 -12435 -3608 -3737 -10663 -11075 -17376 -14895
22008 -14895 -12862 -2265 -2681 -5453 -3152 -11372 -21060 -12891 -8836 -10048 -9877 -2910 819 -2517 -11635
21993 -11635 -8400 -4766 -3263 -4343 -6343 -5294 357 3662 1491 3798 -1093 -10897 -7715 -665
21979 -665 -40 148 1403 -4951 -5892 -3662 -1947 -4767 -9275 -8645 -3327 3369 3902 7243 10787 19242
21963 19242 19990 14841 15033 15567 8946 6849 6178 8022 6997 3262 -4118 -3759 5527 10516 9252 9697
21947 9697 15075 12741 10531 8133 7024 7299 7399 2673 94 -4893 -7429 -4343 3900 21 761
21932 761 5853 11743 10040 5939 3102 4821 9450 7499 9857 8223 3418 5404 321 -3125 -5503
21917 -5503 -5029 -1946 -3670 -5112 -4309 -4639 -1531 -2599 -5518 -233 4742 3624 -2862 -2109 3921 4713
21901 4713 -615 -9643 -8473 -4821 -5387 -8311 -7845 -6284 25 2883 -1416 -1732 -1220 -1842 -4883 -4019
21885 -4019 -4299 -5352 -6505 -570 125 -2530 -1931 2393 -3764 -2773 827 326 -2578 -349 -2645 2439
21869 2439 9397 3611 3254 7205 1322 -2752 -2356 565 -1786 -1682 -5825 -2032 1307 2538 -27
21854 -27 -5957 -9797 -7032 -3242 1936 3528 756 1067 2061 2573 4942 6397 2543 -2615 -3297 5357
21838 5357 9518 5263 9546 5496 3275 2658 -986 -6809 -9033 -4156 -3718 -3737 2405 369 -9266 -16735
21822 -16735 -17518 -14993 -7532 -9154 -6019 3833 8445 4022 4702 10658 7074 4643 -1756 -8907 -5433
21807 -5433 1033 2466 -896 -2592 -3682 -4882 -9574 -7254 -4016 -4321 -1359 2488 6625 12184 9779
21792 9779 3474 -1682 -3383 -4430 -12737 -7411 -564 -4302 -2521 2122 -1920 -3640 -8342 -10567 -7207
21777 -7207 -11885 -6486 -3926 -2980 -1969 -5010 -4422 -5467 -6971 -3607 -6005 -7720 -6710 -6793 -6821 -2416
21761 -2416 2482 3424 -1244 -447 6566 8913 1084 -4777 -5237 -4258 -4618 -10897 -13454 -10843 -10784 -2851
21745 -2851 986 -4642 -4245 -3238 -1929 5736 8706 13524 6676 -4898 -4590 -656 -518 -3936 -5871
21730 -5871 -12650 -22456 -19284 -17278 -8800 -3201 -3161 -5819 -6649 -7465 -12963 -20836 -27052 -17898 -11404 -3650
21714 -3650 3175 -516 -463 -3034 -4550 -11134 -15075 -11860 -11582 -6805 -8648 -6589 -2475 -1854 -464 372
21698 372 2363 -1242 -5066 -9408 -14698 -14913 -17073 -11285 -3493 -4315 -7036 -6767 -2189 -2438 -759 287
21682 287 -3186 -4080 -6280 -9572 -11356 -16829 -17956 -17757 -11248 -15886 -14378 -2600 -208 -6924 -11129
21667 -11129 -7941 -5964 -5485 -3351 -6534 -7066 -4459 -4270 -12685 -10881 -3541 448 3292 3381 -2463 2204
21651 2204 -1176 -12141 -8985 -5443 -8935 -4838 -1727 6836 13099 14996 12137 6477 1613 1128 7195
21636 7195 11516 12185 11843 3460 -2451 -1810 5244 8175 951 7560 9340 3872 -6214 -8232 -6458
21621 -6458 -5191 -5957 2873 1660 -1642 -2436 -3218 -8611 -9942 -1881 580 3397 332 -2793 -6357
21606 -6357 -8845 -5935 -4592 -3104 -583 -4772 -5475 -5231 -7383 -3440 -772 1575 4999 1380 407
21591 407 -1688 4850 5466 2939 8689 9978 9278 5358 -888 -8415 -3928 5 4694 4606 6455 3669
21575 3669 -385 -6378 -1534 4070 5157 -2680 -2279 406 -5944 -9165 -13675 -12301 -930 0 -3805
21560 -3805 -4158 -8445 -4897 -2072 3768 6822 -2549 -9732 -11766 -9787 -8685 -6561 -5745 -6600 -13399
21545 -13399 -13782 -18650 -20575 -11831 -8851 -10310 -10800 -6213 -1730 -3567 -11146 -4287 4449 3748 -1614
21530 -1614 -1044 3289 1558 3211 1838 -3838 -12456 -13160 -14884 -19260 -19772 -14134 -14609 -5697 -2526 -3527
21514 -3527 1233 2319 2695 5593 -1202 -10452 -5736 -2499 -1000 -1234 -2747 -383 -5636 -12819 -11483
21499 -11483 -5829 223 -4186 -9291 -7415 -4978 195 -3149 2449 2821 -3565 -6938 -5058 -7099 -12305
21484 -12305 -13725 -14149 -11244 -3562 -523 650 -3466 -11404 -5520 1446 4641 2381 -3202 -11824 -6841
21469 -6841 5025 13963 19453 14079 10567 6610 9167 9880 3943 2746 896 4143 10178 5824 4096
21454 4096 1331 1063 -189 -244 -3621 -8039 -5089 -2065 4305 8314 3401 -410 -1420 -4810 -10855
21439 -10855 -12475 -4660 624 -4305 -2829 1522 1731 5523 10660 1808 -9215 -8086 -38 7036
21425 7036 5131 -5068 -8230 -5879 -5924 -11401 -8415 -4034 -9006 -13856 -9504 -3784 -1157 -2039 1856
21410 1856 4477 9728 15046 12178 3046 -6076 -2709 563 -1592 -5953 -2029 -1588 2370 2905 -727
21395 -727 -1072 2497 -1419 -4170 -124 1003 2187 -147 -9461 -13336 -9121 -6790 -8520 -5380 -3378
21380 -3378 -7387 -11352 -14667 -16732 -16655 -7733 -2161 -5404 -3697 -3091 -4778 -2391 -8616 -15400 -15140 -15777
21364 -15777 -11790 -12423 -13411 -11477 -9465 -2170 -2622 -6973 -6786 -6924 -4275 -8354 -12727 -15046 -15779 -14197
21348 -14197 -8219 -10961 -10140 -2879 -1382 -2858 -5063 -1119 2189 -864 -5263 -8609 429 5761 -187
21333 -187 -5030 -12029 -12496 -12502 -17152 -15619 -10552 -7476 -3001 -3116 -5294 -4936 -6705 -7008 -6321 -6013 -5173
21316 -5173 -5780 -11622 -11424 -8566 -9022 -13429 -6662 -4719 -5945 -12345 -15706 -5617 -6230 -7160 -12642 -16234
21300 -16234 -8950 -5712 -5752 -8520 -12316 -3713 4224 7688 9243 6754 3009 -6211 -11029 -6290 -7360
21285 -7360 -4707 915 -3926 -5045 -3566 -1821 -4049 -11358 -9597 2357 4578 -380 -3076 -6720
21271 -6720 -8352 -5566 1662 1694 742 3071 3376 -6163 -12233 -5702 -5750 -2671 3531 -193 5531 12454
21255 12454 8128 -1259 1566 1705 3681 1108 -1117 639 1119 2611 -466 458 -639 -549 -1580 1822
21239 1822 2489 1002 5576 -608 -5052 -8867 -13997 -14200 -13394 -15855 -12165 -7038 -3240 -544 -1276 -7610
21223 -7610 -4937 -4778 -7701 -14649 -17431 -17130 -20561 -19078 -16054 -11575 -8329 -4002 -5855 -767 1410
21208 1410 -695 -2779 3985 7875 13005 9812 -2897 -4759 -4735 -894 -560 -4397 -7187 -2973 4131
21193 4131 1679 -892 -2700 -4479 -3625 -5095 -12403 -9731 -15885 -13848 -4664 7579 8280 3289 -5016
21178 -5016 -8325 -9903 -15985 -16530 -18903 -20828 -17430 -12326 -8376 -8407 -15095 -16952 -18551 -6101 -3438
21163 -3438 -7376 -8219 -5016 1869 9579 13629 12915 6005 4539 -733 -3480 -8847 -9015 -3376 1054
21148 1054 1037 -6081 -1151 -796 -7735 -10202 -13108 -10852 -6714 -464 2033 1057 -1305 -1647 4942 9011
21132 9011 6726 6616 3122 577 -2497 -71 -577 499 -5483 -7882 -9928 -9016 -1418 -75 -710 -5183
21116 -5183 -7586 -6591 -4956 -8945 -11090 -13798 -10374 -6739 -9774 -12463 -12849 -9825 -6817 -9897 -9475
21101 -9475 -3138 998 1423 3864 854 4576 1821 -374 -2064 -5451 -6870 -9141 -9374 -2947 3139
21086 3139 1127 -4114 -13543 -20742 -14356 -8954 -7458 -3748 -1092 -4823 -4109 -1717 -1033 -936 -3461 -6006
21070 -6006 -6903 -5701 -4246 -3971 -7089 -9905 -5683 -705 2161 570 -5937 -14141 -17313 -14578 -10524
21055 -10524 -9320 91 1114 -446 4235 759 -2260 -7265 -12683 -16025 -15175 -11113 -6768 -9833 -6961
21040 -6961 965 3874 6614 4736 -3681 -6111 -3977 -4476 -2663 -3934 -4961 -2805 -1873 63 -7422
21025 -7422 -12422 -14055 -14706 -12744 -4768 -800 -3871 -3087 -2914 -951 5441 -3769 -8831 -6691 -7378 -9295
21009 -9295 -600 5881 -1257 47 -3540 -1702 -650 -6101 -4688 -954 7485 4069 2758 -3552 -16763
20994 -16763 -19118 -12375 -10783 -10287 -5178 -330 -6949 -9318 -6492 -1804 -403 -500 -7212 -14523 -16583
20979 -16583 -6614 -6384 -10691 -11677 -10080 -11143 -12641 -11907 -5960 -7439 -3883 -7942 -10447 -7489 -4571
20964 -4571 -2527 -2452 -11449 -11318 -1697 4219 5998 3398 2175 -604 1039 1749 1907 -6744 -6240 -1267
20948 -1267 133 -1628 -5176 -5930 -13193 -21433 -21264 -14972 -11399 -13773 -16449 -20411 -17221 -10225 -12300
20933 -12300 -10994 -6781 -5403 -7376 -8249 -11585 -9709 -13860 -14300 -15700 -17335 -21229 -20251 -10977 -4248
20918 -4248 -165 -4830 -2836 193 944 -504 -1931 -1800 -6963 -5123 -7770 -2128 5641 2966 -4132
20903 -4132 -1178 -10690 -19213 -17365 -11946 -8938 -4340 -3758 -1531 -1370 195 3424 5607 9919 8636
20888 8636 9433 4717 3182 981 3200 -1134 122 3781 5335 1954 25 -620 2656 6012 3654
20873 3654 732 4598 6657 4523 3149 -535 -2292 -4026 -3717 1517 1401 -3305 -4759 -6641 -3107
20858 -3107 923 851 1408 -946 -928 2941 4417 2546 -2446 -7490 -2011 1338 -3128 -2274 62 -1891
20842 -1891 -6820 -3431 4572 8704 8291 5883 6262 -3635 -7295 -8071 -7526 -5659 -5784 -12521 -10406 -7869
20826 -7869 -4478 -6843 -6061 -1078 -3826 -5540 -8795 -7214 -3310 -1711 4468 2991 -586 4059 6145
20811 6145 326 -2216 2792 2252 -1475 -3689 -6030 -812 929 -145 -3513 -4112 -1093 389 -6784
20796 -6784 -6896 -12811 -10242 -8096 -341 237 461 1979 -1262 2834 6187 5926 5887 5799 1963 -4411 -8781
20779 -8781 -14342 -14028 -18456 -17873 -16440 -9773 501 918 4146 3085 -1258 1884 3804 3709 1335 -1025
20763 -1025 -3875 -1207 1198 5345 6065 -491 -8134 -10541 -8075 -9254 -6733 -3286 -644 -1290 -4451
20748 -4451 -4111 -4732 -6260 -6015 -5198 -6222 -9120 -8637 -6945 -2735 6801 1584 -9683 -14467 -10257 -9559
20732 -9559 -9744 -11390 -12280 -11530 -4394 743 4295 -3801 -11459 -9351 -10547 -10521 -16559 -15475 -13637 -13035
20716 -13035 -5745 -4480 -5231 -8616 -3536 -4562 -3142 -4071 -626 8015 14028 13420 6659 -1409 184
20701 184 2974 2625 4539 4764 -683 -1414 2431 8733 14035 14608 5839 -873 -2432 -5267 -9673 -4658
20685 -4658 -6839 -14392 -12057 -5333 5373 348 -6476 -12006 -16314 -11047 -6101 -4181 -7502 -5931
20671 -5931 -4403 -8438 -5056 -6353 -8521 -8940 -8878 -2695 -3584 -3607 -12551 -10043 -3425 2541 1833 -1456
20655 -1456 -4589 -7036 -273 -2859 -3882 1941 1803 -5968 -7376 -7575 -10115 -10838 -11041 -11954 -12281 -19543
20639 -19543 -12340 -3954 -8543 -12366 -499 6129 -1513 -3334 -6136 -6998 -7571 -10861 -8956 684 6781
20624 6781 701 -2321 -1639 95 2345 3032 8187 5587 -1111 -8546 -7458 -7019 -7836 -2249 -782 -7675
20608 -7675 -9447 -5450 -10160 -9652 -4206 -6249 -6033 -6076 -16612 -19779 -10586 626 -2930 -3095 -3816 -4445
20592 -4445 -6830 -5565 -4139 -4325 232 5862 6866 288 -4335 -6613 -2959 -2879 -7055 -10095 -8699
20577 -8699 -6785 470 7843 3208 1913 2470 1556 -5235 -3699 -908 -5000 -4073 -5471 -5086 -10162 -7463
20561 -7463 -1104 -4524 -5328 -3833 -491 -3161 -9282 -6221 679 -891 -3530 -7640 -10 901 659
20546 659 788 1931 518 -2863 3258 1713 5364 5304 3671 -352 -6674 -4874 -6666 -9584 -19455 -21613
20530 -21613 -15297 -9929 -5238 -3402 -3214 -5223 -12112 -14639 -10039 -3706 -2013 -8314 -10821 -7227 -45
20515 -45 -4406 -11818 -13942 -8091 -4689 -8971 -10700 -10526 -8647 -5933 -5790 -8585 -10165 -2263 760 94
20499 94 2632 -8022 -12381 -6900 -3194 1306 3195 -214 -4526 -6705 -5945 -4457 -2832 -953 -3437
20484 -3437 -6174 -5936 -7906 -9739 -12437 -16660 -18322 -15221 -11427 -7276 -1457 -198 597 326 -2454
20469 -2454 -2414 -3281 -6279 -3524 -3190 -1024 -213 -4103 -3547 -2865 -757 315 -1813 -7442 -1466 -5423
20453 -5423 -9588 -15628 -13035 -8090 -9163 -5363 -9454 -7920 -6551 -1019 -985 -2960 -8922 -8437 -7437
20438 -7437 -9921 -17569 -17573 -11371 -7425 -12073 -20490 -20045 -17097 -8786 -3206 -294 6162 2352 -2498 -1634
20422 -1634 -1313 -8576 -9521 -4648 -5321 -11321 -8954 -3853 1751 1080 -3826 -4760 -1126 -1120 -1406 618 2306
20405 2306 527 936 -1844 -2837 -4477 -2671 246 249 2696 5008 6332 8861 813 -8098 -10360 -9773
20389 -9773 -6346 -491 3959 5903 2340 1840 1214 -1214 -5649 733 3298 -2554 -3866 -6907 -15491
20374 -15491 -14462 -5141 -1409 -3795 -6130 -5850 -6839 -10785 -10536 -6226 -6797 -6705 -2818 -8212 -9446 -4851
20358 -4851 -2879 -143 5756 1143 -3915 -2361 -3059 -8358 -15997 -20025 -16607 -4550 1053 2342 -4780
20343 -4780 -8664 -15690 -12710 -10798 -5295 -7415 -9538 -6135 -5817 -6375 -4242 5132 2568 -6646 -7719
20328 -7719 -2633 4525 11634 8208 110 1753 3827 1546 -53 5430 6781 5989 5557 3550 2636
20313 2636 1870 -2235 -813 -6872 -6532 -7621 -3195 -6432 -12209 -8377 723 -1680 -2952 4519 4124
20298 4124 2448 4900 -1774 -8986 -6242 -1865 -2646 -8957 -3136 -4732 -3648 -1069 1068 626 2847
20283 2847 879 -2846 60 -3795 -1642 3091 8348 7229 5006 2987 -7 -10022 -11191 -8429
20269 -8429 -11632 -10084 -11122 -9816 -4288 -6112 -5097 -2253 -1515 -7778 -7208 -5770 -7745 -4318 4542
20254 4542 7943 7976 3701 -1473 -4242 -673 3551 950 -1968 -6750 -9080 -7952 -9406 -11659 -13872
20239 -13872 -15019 -7045 -1564 -342 3758 4184 7114 4523 518 -4514 -7414 -4722 -3453 230 1223
20224 1223 -955 -4445 -8997 -5306 -6355 -9436 -13646 -12677 -3924 -1119 -4208 -2618 -2429 -495 5580
20209 5580 2863 3866 2648 -1158 -7634 -11341 -13071 -12725 -7450 366 3476 3227 104 -2648 -5111
20194 -5111 -6263 -8943 -12314 -4598 3494 2813 -31 2230 1697 719 2394 1018 5137 7236 -3236
20179 -3236 -8393 -8526 -3039 2700 886 -5840 -9015 -6873 -10966 -4616 -3766 -12077 -14837 -9940 -3386
20164 -3386 3132 1863 3475 -1199 510 -1533 -6742 -6459 -3098 -4449 -6900 -10160 -2478 -526 -779
20149 -779 -8736 -10395 -8125 -10433 -12679 -10755 -10605 -7385 -9330 -14760 -16588 -12413 -8630 -8058 -11787
20134 -11787 -13637 -9320 -3840 -2071 223 -168 -4771 -1254 5538 2561 -5044 -2851 -2172 -7679 -10574
20119 -10574 -5462 1550 3414 1311 3451 7465 7216 3317 4337 2791 4647 4519 -2381 -4587 -8099
20104 -8099 -9664 -6977 -14333 -13167 -15146 -20494 -19526 -14257 -9506 -10684 -8135 -8093 -6929 -1879 104
20089 104 -4227 -7695 -15598 -18113 -13979 -14575 -16372 -16727 -15568 -11567 -7793 -1815 3391 3458 3313 2516
20073 2516 883 568 -4313 -4621 -3727 -1117 -3508 531 3431 7553 7041 2211 -7959 -12211 -14639
20058 -14639 -13112 -12757 -18678 -20223 -15398 -17215 -14804 -10386 -12637 -12514 -9067 -7116 -5653 -4439 -8378
20043 -8378 -10180 -7493 -6749 -5377 -9573 -6860 -2021 -5552 3856 5107 4976 479 -6403 -4926 -961
20028 -961 973 1166 -1947 -2181 -1244 -3695 -2104 -5186 -8476 -6642 -2019 -2146 -644 1949 351 -2319
20012 -2319 -5298 -5894 -8383 -16049 -13049 -7595 -3612 -6154 -12385 -14505 -20401 -15579 -18480 -18284 -20397
19997 -20397 -18698 -16048 -13456 -10186 -3796 566 -1578 -5153 -11436 -10405 -5608 -11525 -7169 891
19983 891 5622 -4166 -7647 -10907 -5566 148 5025 7604 5128 8899 13447 11600 2742 -4309 -4029
19968 -4029 849 -1111 -4088 -2610 -4061 -833 6121 4889 3230 -2426 -12269 -13891 -11609 -18002 -18501
19953 -18501 -13841 -15464 -15064 -7375 876 6118 2932 -1470 -3451 -11935 -11057 -8784 -3397 -1797 -1818
19938 -1818 625 1274 3434 4727 7319 5688 -2853 -4130 -4830 -9099 -11914 -9244 -9088 -5039 2186
19923 2186 3045 -458 -3373 -1313 -3439 -6902 -1199 1361 -959 -4098 -5593 -6170 -2534 -444 1066
19908 1066 2091 3406 3518 1528 -4761 -160 1263 -4620 -9805 -10374 -6116 -3153 -4680 -7294 -8400
19893 -8400 -4141 -3063 1016 -4568 -8867 -621 6734 2502 -451 1456 3364 -198 4364 3641 -349
19878 -349 4604 -1959 -6556 -5615 -7723 -7368 -4771 -5824 518 4532 -1107 -2632 -5998 -6304 286 1034
19862 1034 -3520 -6119 -3058 1448 3199 1929 364 -898 -1203 279 -1242 2468 5949 4548 5067
19847 5067 6777 4394 -2833 -6034 -8663 -6572 -1120 -915 -548 -1307 2670 1777 -5689 -11306 -11995 -17242
19831 -17242 -10197 -180 -151 2799 3549 7448 5166 -1013 2198 -371 222 -1900 -2654 -1024 1211
19816 1211 -1445 -3113 -7251 -9902 -7595 -12005 -17230 -11176 -10048 -10618 -9746 -12558 -13549 -9895 -5488
19801 -5488 -7136 -3303 -2484 -6826 -8020 -2972 -5315 -9706 -6715 -5367 210 -1586 -5867 -9735 -7401
19786 -7401 -1827 -2441 -4514 -2637 -2668 -3784 -10328 -15220 -12460 -3042 2994 2169 4065 2717 1804 -1974
19770 -1974 -1477 -7 755 1570 1971 2097 -220 3297 8232 8175 5578 1241 -1563 -1806 -4145 -812 1396
19753 1396 4226 3429 -1286 -6142 -5211 -7537 -10538 -7387 -11078 -13673 -15921 -8614 -328 -3468 -4660
19738 -4660 -2778 -2898 -2445 -6059 -7843 -4298 -1524 360 5470 4217 4084 4389 4187 4283 6700 5315
19722 5315 599 2154 2738 8138 9259 4035 -2364 -1971 -135 -2805 -6078 -839 3574 -1464 -3834
19707 -3834 -11702 -13336 -7266 -13825 -18077 -14855 -12603 -8177 -6065 -9973 -9811 -5417 4805 3251 -2724
19692 -2724 -4877 -4156 -279 4241 3214 1191 4095 1904 -5891 -5282 -5446 -11050 -10898 -7558 -521 4513
19676 4513 2755 4843 2551 588 -3072 -8378 -13039 -11232 -9288 -3736 -6460 -8256 -10566 -12213 -6874
19661 -6874 1301 4764 2802 -1736 -2316 -6155 -4639 -4699 -5231 -5499 -6841 -10839 -7741 -3398 2556 -851
19645 -851 -5778 -3174 -8191 -11558 -7459 -3182 649 4136 5252 1335 -3209 -3945 -7426 -4785 -7779
19630 -7779 -7905 -9983 -8936 -5308 -4824 -5739 -1151 -4206 -8732 -4079 1548 2228 -2475 762 6802 2103
19614 2103 1596 2200 4423 4872 1554 -111 5190 -30 -5531 -8134 -10892 -12333 -11997 -10915 -12043 -4928
19598 -4928 -1150 -424 2036 -1514 -303 675 -973 204 -4783 -11551 -14346 -11314 -7407 -3296 597
19583 597 -1548 -1904 -5124 -2520 -5977 -9094 -11595 -8267 -14052 -14855 -11909 -5980 -3817 -2184 -3885
19568 -3885 -5361 -10941 -18414 -18524 -8692 -6749 -5307 -522 -965 928 1670 -4159 -5215 5634 3881
19553 3881 2321 2750 -1485 -525 5980 9195 5049 6212 8682 12421 8361 -2429 -4051 -6985 -15472
19538 -15472 -20040 -14912 -10037 -4352 -4229 -8273 -7531 -9539 -8332 -3271 -12010 -13901 -8847 -6119 -9807
19523 -9807 -9420 -1352 8497 8318 -476 -1810 3116 -1737 -1093 -1899 3244 4987 697 -1883 -5125 -1679
19507 -1679 7659 212 -9866 -9299 -6320 -6544 -4624 -5629 -1396 4536 10492 6476 5968 3083 -8628
19492 -8628 -8290 -7054 -8264 -7494 -3688 -8929 -5902 658 -7749 -8128 -9574 -8624 -6754 -11519 -15317 -8277
19476 -8277 -4031 -9232 -14215 -9819 -5760 -7618 -7630 -9467 -9338 -11065 -9635 -9920 -8934 -3366 425 2072
19460 2072 4969 9192 4439 215 -3968 -8345 -7119 -10228 -7316 -4349 -4839 -8324 -8499 -7259 -11923
19445 -11923 -15536 -12609 -15566 -15146 -8101 -8111 -9674 -6614 599 4819 8915 11552 5635 -2473 -6160
19430 -6160 -4724 -3334 -7074 -6938 -10594 -8503 -8734 -10206 -12584 -5303 -4368 -1801 3508 479 -5202
19415 -5202 -8432 -4687 125 -2949 2335 5071 6508 7140 982 -4366 -507 79 -2060 -6951 -10935
19400 -10935 -8061 -5838 -2802 2741 3839 -2023 -6020 -2639 -2562 -9350 -14947 -15058 -10468 -7066 -5910
19385 -5910 -2922 -6258 -7772 -13564 -8904 -9453 -7248 -3871 -8617 -5180 -4981 -10695 -15813 -16812 -12975
19370 -12975 -8794 -6646 -2064 5703 10639 14752 12445 4960 4977 -366 -4238 -6328 -8794 -9014 -3875
19355 -3875 -4289 -3956 -6845 -6857 -9760 -9197 -10072 -7184 -5083 -6908 -6105 -7533 -6853 -11869 -13688 -12967 -5893
19338 -5893 -1823 -2955 6446 14403 12044 7939 7695 1875 3381 2675 4680 6621 5899 -1554 -12403
19323 -12403 -7472 1791 5265 545 -102 -4958 -10165 -8112 -7624 -14254 -1889 7787 8133 1083 -6500
19308 -6500 -4743 -2187 1071 968 -1183 -3124 -7950 -3852 -2083 3354 5539 5393 7186 3468 2632
19293 2632 3180 -562 -7042 -13821 -18711 -19581 -16245 -12071 -3663 4719 2855 6679 5875 301 -4625
19278 -4625 -5862 -11069 -12991 -5554 -11812 -10819 -7223 -2847 8510 14847 7845 4854 -100 -6240 -9403
19263 -9403 -9300 -2134 -4703 -7564 -1596 6426 656 -6011 -3723 -2823 -1779 -1686 -3457 -7619 -5003 -4672
19247 -4672 -4672 817 -2691 -11054 -6218 -1876 -9946 -8638 -4711 -2178 -7508 -11126 -7519 -3942 -7128
19232 -7128 -7107 -6357 -2335 -2268 -10013 -6117 -865 -1627 -1187 -60 4261 6305 9231 7179 2289 2586 -2827
19215 -2827 -9514 -7871 -990 -2321 -3516 -4180 -189 2426 6846 7169 9796 4155 636 -289 2561
19200 2561 4138 4973 -130 489 -5520 -2495 4296 2323 6218 4551 -960 -2179 -2717 4044 639
19185 639 -4529 -2868 -505 -1073 -4083 35 999 -3428 -2846 -6851 -5376 -8447 -14302 -11875 -7950 -1703
19169 -1703 -6169 -8924 -10780 -5528 2989 2229 -558 -5710 -8911 -6577 -5406 -9017 -6967 -3427 1086
19154 1086 7364 10570 9080 6407 3179 1888 1451 7145 11201 13745 2727 -5521 1165 1467 -1387
19139 -1387 3259 5547 3599 6431 4269 -676 -1517 -202 1540 -1664 -4146 -7422 -8937 -9800 -8224
19124 -8224 -8383 -6211 -5433 -5718 -5224 -7848 -9798 -10821 -8240 -9276 -8904 -3160 -1383 -202 -6176 -6849
19108 -6849 -4133 -9754 -5105 3108 6247 7743 -137 -2011 -3213 2533 1815 -2131 -8544 -6783 -5604
19093 -5604 -7677 -7732 -5425 -7725 -4093 4298 7987 7947 5136 1223 859 -2667 -8780 -14573 -16903 -9670
19077 -9670 1092 6967 3678 3562 -3699 -1705 -887 920 -6166 -15227 -14700 -13035 -13538 -473 5186
19062 5186 2110 -2762 -3569 1563 6032 2086 3630 5418 96 -6849 -5049 -2636 -6655 -11329 -7058
19047 -7058 -6590 -9072 -1168 512 -4725 -3253 -4482 761 -1021 2152 266 -2565 -2364 -3430 -7301
19032 -7301 -14769 -14948 -8549 -3670 3423 8094 -4395 -8818 -1582 -6270 -13679 -11876 -8679 -2563 -2390
19017 -2390 1062 -1184 -5862 -7336 -7206 -1366 2187 1456 737 -455 -2074 -4472 -4399 -242 -2146 2575
19001 2575 9986 7899 3905 1763 2324 2198 1306 -3278 -10391 -12277 -9856 -4069 1077 1926 -512 -5425
18985 -5425 -8419 -7626 -6672 -8016 -10353 -7874 -7041 -2576 2345 3124 1096 1177 1867 6247 7312 -2861
18969 -2861 -4806 -3167 5461 14639 21516 17979 8502 4575 4318 6995 7143 7414 9217 7460 8904
18954 8904 6295 -2161 -7407 -9291 -2550 260 6969 7383 7943 6440 3436 2013 -1302 -3858 -5304
18939 -5304 -7095 -4293 -5981 -4966 -5268 -2100 -4875 -3025 -3953 -9765 -9855 -3102 5462 610 673 665 -5141
18922 -5141 -8411 -117 184 -3669 -2537 -7590 -13668 -9180 -5787 -6666 -6677 -5787 -421 4318 1028 -147
18906 -147 -3307 2383 10131 3322 1312 1598 -947 1207 5847 9031 5866 682 -8587 -6020 -2468
18891 -2468 -3186 -2398 -80 4415 9199 9215 7625 10261 12841 6562 751 -2038 5281 1103 2231 5936
18875 5936 1506 -835 166 -1274 4888 6946 4982 671 998 1573 -289 3167 1954 4969 9271
18860 9271 16845 20194 20146 11852 9766 8639 13583 16606 13510 11664 14305 12097 9087 7159 3635
18845 3635 7527 7058 8004 11936 17847 9884 2358 5454 9855 13200 12430 8794 13444 20977 21135 17902
18829 17902 22246 22695 22687 21957 16789 16779 14811 5067 -7 4821 6516 79 2953 4106 7771 8169
18813 8169 10663 12429 12856 4659 3191 7778 6512 5593 8441 15875 20360 17970 16295 11553 6197
18798 6197 7067 6508 11646 17461 17232 17109 19357 19349 11451 6190 9138 12327 8697 12083 15289 15475 17070
18781 17070 16567 14110 18699 16782 13061 11021 19150 21936 16833 24166 26385 32872 39445 31791 38330
18766 38330 44275 46700 50708 55776 55236 55409 40211 29622 29089 31082 29420 29066 28113 20699 25256
18751 25256 27077 26533 27041 25466 25474 21868 20018 18196 20445 19735 24746 28065 25335 27065 32283 34237
18735 34237 38102 34380 37150 36523 36938 43638 42191 41427 46762 53261 57886 65693 72742 84313 100864
18720 100864 123121 158816 196972 235154 278626 311296 342265 380070 400854 403447 393821 380293
18708 380293 362678 346773 327378 320006 329744 348382 372737 398207 420374 438142 446278 433958
18696 433958 415802 390776 353905 313213 270317 233178 208161 186827 164699 144837 132618
18685 132618 118597 108428 98991 89443 86838 80336 78017 69331 62540 66020 69777 73675 71054 66852
18671 66852 63277 56471 57615 71701 71854 63396 63381 68378 64557 55955 55527 55720 47373 50190 52836
18656 52836 50793 46153 42562 43439 41748 36005 38708 40811 39490 34730 34771 36745 34363 36851 41245
18641 41245 40945 39775 37321 39149 37380 36301 34590 37380 39446 35240 35512 34395 30150 31105 27573
18626 27573 18275 19709 15338 21815 26298 25192 19038 20612 19795 27696 26797 20628 24178 23244 20926
18611 20926 22017 27270 27822 21236 18610 24084 21817 15918 16764 22088 29215 35540 34353 28688 23964
18596 23964 29029 27086 20687 13483 7293 6103 9298 11158 7724 9710 10551 8791 12077 12473 15629
18581 15629 18740 18515 21589 24663 29241 27770 22813 17140 13608 12335 8020 10025 14178 17392 13653
18566 13653 11772 8061 3244 7431 9571 11159 7543 13376 12226 13244 17357 15684 20703 24304
18552 24304 20033 18566 16816 18730 17724 26072 26660 23225 17736 19236 20092 24803 26148 20172 15928
18537 15928 14267 16096 16856 20428 23229 24929 27266 26688 25129 22098 19162 17863 15778 19979 21391
18522 21391 25042 28002 25016 21770 19494 18783 12100 9496 9207 16538 13337 7574 4978 4328 9082
18507 9082 17290 22484 22409 20683 19962 14447 13319 16255 15114 15984 16273 17514 13249 10120 14911 22087
18491 22087 24351 22853 15999 17930 18343 26118 34409 33019 33796 29285 29097 30324 29873 26835 26793 32258
18475 32258 35885 34878 30780 28897 25986 24762 27871 31110 32202 31992 32868 30392 25873 21522 27411
18460 27411 31111 28285 22019 16727 14164 14902 14617 15305 16088 19908 24520 39623 43848 41236 30630
18445 30630 25972 22297 25266 30837 30375 30701 26528 24010 26636 27430 33348 28155 24045 23923 26419
18430 26419 27140 37177 42431 34562 25506 24385 27259 29318 33956 35492 36275 34283 41091 50854 49048
18415 49048 42382 39880 35957 37168 42472 40733 36414 37792 40001 41799 45642 46100 44154 48032 49123
18400 49123 44876 49175 54976 60368 67328 66439 62017 59600 58964 62626 73177 80469 87610 93644 105842
18385 105842 107645 108854 113607 110691 107019 108355 114109 114853 113621 115186 114519 117176 117643 118394 125393
18370 125393 129832 133608 136500 136830 136866 132670 125571 123830 110408 104464 99259 92035 94447 93148 95543
18355 95543 101301 98680 99116 95220 92688 92566 90637 90507 86986 86670 89989 83561 77594 76499 83585
18340 83585 96289 98377 91463 86731 84563 85644 83116 80916 80146 80400 77537 72768 78730 83012 79908
18325 79908 79424 84454 81366 82773 84008 75298 69086 71067 70754 72234 69581 72878 78117 86121 92133
18310 92133 95365 105300 110103 113938 115178 113128 108560 115532 120264 120672 127640 132094 132036 131187 132674
18295 132674 137705 148781 161181 174248 181892 190587 202076 217800 234026 254984 280934 316024
18283 316024 355479 385866 415913 450335 474615 491197 504615 511068 506541 497728 500815 511825
18271 511825 523329 532541 542280 565272 573777 565739 547747 524416 497799 470550 445766 416916
18259 416916 398045 385298 366915 354721 348136 345321 349083 352647 357242 363677 363351 355824 349686
18246 349686 348894 344620 338088 344216 349085 352304 360901 375717 382538 389972 401679 410300 415785 414482
18232 414482 415443 413612 415114 408837 401197 399677 402176 408253 419622 425599 418411 419911 431527 433531
18218 433531 431645 431959 437592 445630 443842 448290 456376 460569 467609 473128 470374 464978 472381 479672
18204 479672 490741 498396 500697 499250 502724 511602 529372 543399 551689 561133 569955 585894 598977
18191 598977 604739 616690 635468 656007 666926 683679 696211 714989 741845 768579 802622 826208
18179 826208 841731 869039 896287 932481 970735 1001155 1036918 1078700 1122297 1165948 1205360
18168 1205360 1247067 1295851 1343020 1394777 1456532 1534057 1623331 1737037 1873597 2033394 2213043
18157 2213043 2405791 2606983 2798653 2988106 3170754 3350041 3541791 3740830 3964150
18148 3964150 4224245 4537717 4911512 5367122 5923036 6581700 7361952 8295038 9443673
18139 9443673 10887612 12789473 15375374 18893492 23591213 29647321 36866306 44987335
18131 44987335 53449498 61187874 67639061 72136386 74169012 73780035 71636929 68099323
18123 68099323 64165690 60883378 58819640 58686545 60529240 64066245 68881606 73808088
18115 73808088 78008045 80781020 81409511 79623027 75888338 70529851 64126400 57786141
18107 57786141 52028944 46912223 41698771 36918231 33231548 30084758 26597097 23475022
18099 23475022 21016967 19067607 17399624 15934887 14691339 13641294 12761514 12023780
18091 12023780 11404480 10875180 10403960 9983196 9583789 9193010 8808369 8426076 8048403
18082 8048403 7671973 7311790 6960628 6621350 6309334 6017186 5748619 5504145 5273086
18073 5273086 5061424 4860448 4678038 4503281 4346063 4203284 4073574 3950933 3821952
18064 3821952 3702123 3586774 3472314 3366632 3263687 3160322 3069290 2980726 2894679 2815153
18054 2815153 2738886 2658845 2586363 2522432 2452390 2382014 2322706 2271507 2226513 2180971 2132531
18043 2132531 2086985 2035172 1984450 1934342 1875687 1816192 1754640 1686260 1614397 1549727 1490008
18032 1490008 1432960 1374539 1319554 1272491 1228677 1189470 1144530 1098485 1045866 996691 945175
18021 945175 898941 847848 790719 743492 701252 654628 612988 575838 544174 510867 475797
18010 475797 442997 415929 389915 367669 351187 340293 329214 320363 322873 319501 312518 306235
17998 306235 299738 288426 285954 285222 268860 263264 263612 258769 255795 256948 261884 266022 272372 275522
17984 275522 276265 270203 268660 267632 264518 264162 257365 251925 241064 234295 234435 234428 234072 233019 230748 226316
17968 226316 234460 238759 231265 230218 229366 219273 214358 211200 201760 196212 191409 189569 191103 191964
17954 191964 184518 179489 187841 186332 179756 173358 175482 178693 190591 197533 197023 193821 189004 187193
17940 187193 188286 190623 191467 184242 177661 181526 186728 191380 194401 196518 196981 206079 209501 210910 216188
17925 216188 216960 216856 222049 215116 208441 202087 197494 203687 201257 195661 187945 174544 167460 169286
17911 169286 168835 167922 162315 159704 166596 164026 157974 162422 161205 155127 155195 152271 142714 139116 139773
17896 139773 134160 134296 129361 120542 123442 127274 127191 127160 130194 120014 117991 116456 108409 104823 101592
17881 101592 103784 98727 85197 78499 75107 77082 85033 82177 72239 63551 66514 68509 59064 54910
17867 54910 55476 50698 44671 46532 54341 55117 42380 27168 24879 25361 30265 30528 25217 24079 23614
17852 23614 23061 17864 13595 16190 17494 17968 23468 26947 27375 30810 27381 27466 31677 27177 21939 29766
17836 29766 31851 34097 37456 30331 34533 41141 38580 34064 31452 30964 29271 26366 27826 27776 26201
17821 26201 34438 34503 34333 32246 31843 30652 36503 39947 36524 35933 41607 50289 43827 35651 36592 50782
17805 50782 59693 61429 56658 51620 45804 45488 42696 44182 46089 46280 46478 44757 42277 39788 35063
17790 35063 30204 28225 24606 17598 20563 24185 22292 21429 23892 24077 25582 30836 26030 32045 27701
17775 27701 25877 24418 21993 24054 23729 25684 31459 28636 25253 23705 19328 20673 23557 24429 20580
17760 20580 15428 13404 13347 14354 16557 16242 15206 11455 15832 22110 23474 22600 19100 18796 17123 23533
17744 23533 26926 25698 24056 22436 22644 20795 15781 14457 11885 10973 11959 11675 11879 10799 8681 9883
17728 9883 14848 20162 19039 19919 10619 1543 8575 16772 17805 15603 16435 21095 19560 15302 10836
17713 10836 8125 6358 5539 6047 10379 8264 6864 168 -6316 -3323 294 938 -514 3748 6834
17698 6834 5255 1214 -91 5077 11516 15057 14809 17881 17782 20251 16937 4369 2852 5724 12175
17683 12175 6496 5921 10877 15732 16183 13074 8638 4539 -1899 -5971 -4012 1997 9302 10093 14152
17668 14152 20751 28466 27774 24081 22877 13204 9264 12155 13561 11466 9095 3927 6882 8467 11445
17653 11445 16833 20921 24215 20917 13955 8756 8228 15710 18223 17735 12355 8491 4420 632 10934
17638 10934 12066 13357 13444 6183 9997 14666 11481 9549 7764 3784 1740 -892 -2522 -6512 4626
17623 4626 13369 7885 10898 13111 6545 8263 14113 9893 1096 -3594 -3340 -6630 -9415 -5868 -6395
17608 -6395 -7819 -10087 -8280 -14654 -11424 -11212 -9937 -3198 4768 2882 1772 1222 2787 5361 1048
17593 1048 2821 3240 -2212 -3717 -4765 -9708 -11099 -6503 -2178 2333 241 1369 1416 -1515 -8340
17578 -8340 -9168 -7513 -1804 4396 2937 -832 -5338 -5610 -2955 8552 12738 8622 6513 8540 6407
17563 6407 8118 13375 17415 19980 20126 15670 16860 13549 15261 21179 19077 22398 23974 29974 38464
17548 38464 42119 46731 51550 68063 83318 98282 128512 158549 198924 240301 281109 321815
17536 321815 354744 374269 389276 388992 378581 355273 338162 326816 321350 323269 326176 334474 359979
17523 359979 393851 417131 426469 423946 410224 391833 369327 321415 277208 244327 209946 177128
17511 177128 157214 136820 117090 108712 98823 87789 87848 77530 70353 63903 62410 56578 52611
17498 52611 44002 39579 45451 48516 43808 45386 41209 31678 26684 27759 35448 33127 32603 27850 29370
17483 29370 30664 26917 20942 20844 10860 1358 -6116 -2366 6773 13648 10925 8840 16048 11956 9749
17468 9749 12506 10350 8405 1008 3523 4573 4725 4004 1899 5148 8074 4495 3109 -504 3438
17453 3438 8319 5328 3538 3984 -1011 -2954 -3288 -6876 -1062 1767 2757 7680 6812 11246 21701
17438 21701 30900 36453 32088 23507 15611 7727 10807 16016 14189 15220 9905 3871 10021 12901
17424 12901 8307 3949 5251 5261 6663 5155 -741 -1781 788 2302 -125 3033 8553 2984 154
17409 154 593 1821 5122 2608 2376 -321 -1428 753 2423 6304 2686 -704 -3436 177 4957
17394 4957 10461 9999 9051 11080 10295 2048 -233 1012 938 -4125 -7978 -2010 -2430 -401 -1155 930
17378 930 1330 623 -1272 -3386 -805 -1636 -2665 -1547 5715 9140 3639 6673 5464 -649 5796 3425
17362 3425 -88 -32 659 -1361 -4234 -4330 -1029 5213 8791 2707 1199 -1208 -5994 -9828 -8039 -7487
17346 -7487 -5373 -4706 -2461 1716 -3750 -4039 -5558 809 -4885 -7013 -7260 -1051 6534 10790 10445 9339
17330 9339 4681 1856 -2281 -4113 -2383 -4038 -2562 -2872 -4806 -7276 -2105 -1206 -2497 -2916 -210
17315 -210 1279 -4742 -5607 -958 -4794 -10180 -2106 1320 -6283 -6582 -3322 -4239 -1656 -4466 -8232 -8118
17299 -8118 -985 5681 9685 6703 -2247 -1104 7043 -1373 -7074 399 1413 -4881 -13410 -10389 -254
17284 -254 -1095 -862 -47 385 -1728 -4149 -8765 -8612 -10821 -10972 -5348 -2133 -2205 -8753 -13445 -12880 -10305
17267 -10305 -9370 -6599 -5251 -9704 -9563 -2020 928 -145 211 -4848 2399 136 757 -3362 -2163
17252 -2163 -2712 -10806 -9669 -6090 -3513 -4419 -7455 -12753 -4736 -2523 -6304 2667 6722 9953 13382
17237 13382 6937 6531 -1226 -3254 -2617 -3469 -4894 -2444 2350 3648 6212 7203 12734 12081 11377 14210
17221 14210 10435 7775 2683 1556 15279 21535 17941 20883 21164 10524 4535 5252 11581 11143 11058
17206 11058 17470 19045 20766 23558 27054 26160 28999 29780 25266 19356 18632 18138 10739 10078 12828 12194
17190 12194 13345 13694 15561 17827 12801 6984 15003 16365 19994 21833 17013 15757 16078 17283 12064
17175 12064 11641 15865 15462 12572 10559 2214 5979 8888 6614 5370 6051 9910 12375 4633 6967
17160 6967 16383 22900 21877 13849 4197 5023 11303 10350 3081 4303 1613 4283 11903 14362 12156
17145 12156 5780 4305 4421 10525 9160 16314 18680 14776 12740 13409 15269 12988 13135 9586 9775
17130 9775 11841 13445 20265 24684 23610 21380 26146 28469 24195 18433 15217 11942 16018 19737 20816
17115 20816 15565 5798 7265 13314 16174 8117 9073 13216 11698 9850 11998 13142 9225 12681 16572
17100 16572 18359 16845 19452 14006 16126 21088 22920 29118 22763 13987 12368 14487 20328 27091
17086 27091 31663 34590 36051 38652 42112 51954 67433 76903 84416 94820 115413 148995 191066
17073 191066 242962 297472 352720 394143 420581 444251 445785 435881 404197 372653 345264 320800
17061 320800 308750 316247 348551 390554 423652 453831 473448 473650 460223 427912 389031 345840
17049 345840 312633 274248 240313 211730 180901 159513 139480 128395 125129 117830 106206 104368
17037 104368 101826 90518 81397 78159 72309 64485 57188 52618 60052 66992 66708 64565 63487 64264
17023 64264 60362 56025 53130 55637 55300 49912 47180 52986 50466 46759 44762 39069 40647 43142 38655
17008 38655 34755 38518 46623 47852 42528 38449 32183 29144 24882 23333 23285 22837 27005 28380 23059
16993 23059 17375 16832 18452 20685 22709 23865 22773 19483 19399 15662 17124 12870 10049 12240 18353
16978 18353 16354 10520 8064 16993 19448 18701 18068 15377 14067 12939 15675 17877 15851 7799 10629
16963 10629 19172 22131 22549 21451 16796 13876 17517 18299 16150 17539 12563 6089 -1022 -2860 5327
16948 5327 1715 -958 2869 4027 7337 10647 8335 13072 16643 16289 15329 14064 7859 10483 13422
16933 13422 11296 9579 7794 9519 12867 14496 10696 14711 20381 17821 11822 5682 12196 22006
16919 22006 26407 27977 30060 29766 25143 19506 19089 15664 13715 11348 10416 15234 16658 13678 9184
16904 9184 9108 12585 14208 17998 16273 14495 6993 8696 7840 11424 15697 10983 13188 16682 14223
16889 14223 9751 11070 19248 19681 19923 17954 14605 8986 7438 11216 11928 9586 18629 13323 8982
16874 8982 12655 13515 19621 19846 19265 20093 24367 26867 26562 22449 16083 17410 19870 20468 21651 26754
16858 26754 29186 25893 26483 29294 25749 20467 12286 12023 19158 23668 32731 34549 29201 32710 32689
16843 32689 30269 25683 22306 29199 26787 20115 18785 14028 8682 9571 14579 18741 14449 6728 6316
16828 6316 7186 3494 -2257 10256 19106 18254 19036 24206 28509 26718 25193 19607 20587 20186 23489 23847
16812 23847 21999 22349 26033 21360 21776 26884 24756 21892 23819 26285 29650 28233 22660 21526 25865
16797 25865 23689 26185 32073 37386 38832 33068 27914 27089 33647 32680 33100 33967 31251 31987 38735 40810
16781 40810 40379 44109 52899 53397 54304 56785 61834 66680 73289 75440 80401 88584 97872 105374 107911
16766 107911 109638 112391 110192 99264 87381 89467 91496 95646 105324 104374 111703 118667 126262 129045
16752 129045 122304 111588 105644 101341 99979 94259 88898 85108 87462 92334 93385 87109 85019 79787
16738 79787 80664 79273 67581 65953 69640 70534 71155 69347 64990 62346 62997 67028 66882 66686 68683 74726
16722 74726 73522 71256 71739 68882 67174 70838 72724 73813 74515 78103 74441 75866 82713 84049 84325
16707 84325 78129 63744 64097 59623 57314 58743 58329 52619 43724 47030 63230 74727 79034 81951
16693 81951 82731 90031 93380 92085 92709 87714 82517 83364 86339 88192 85471 89542 94386 93456 96417
16678 96417 97367 105801 111198 112688 114092 118369 119629 119392 116133 116783 111606 108252 105518 95767 91693
16663 91693 96558 97642 102301 103994 109388 111195 111777 113895 116225 122135 125862 131761 141021 153265
16649 153265 152903 150716 152181 153573 156678 161534 173567 188609 193661 203312 211373 219191 237397 251170
16635 251170 260362 266288 269481 271673 279075 279783 279391 275975 283051 297518 306082 317540 333869 347438
16621 347438 362433 367602 367290 373758 371252 370334 367830 359706 358662 359639 366547 371553 370479 377379 387781
16606 387781 392839 395208 397965 404289 404021 404587 404460 400606 401997 412315 418046 420757 426972 430873 441272
16591 441272 450878 452610 452830 455590 464989 479190 474290 476904 487212 501651 516065 534561 545449
16578 545449 564374 582385 592290 602949 619397 638911 660299 682304 701018 723576 740379 756392
16566 756392 775913 804281 831286 860674 883485 916324 952401 985946 1023046 1062750 1100546
16555 1100546 1135445 1178407 1221157 1262353 1301877 1348778 1397759 1449046 1510473 1587588 1681954
16544 1681954 1791404 1921520 2072989 2237651 2406459 2591937 2784292 2983925 3191058
16535 3191058 3406954 3664688 3947879 4273395 4664485 5136960 5676884 6303137 7022591
16526 7022591 7861659 8850707 10042659 11537251 13468869 16070838 19699712 24876841
16518 24876841 32050852 40926040 50697841 60858907 69620896 75376966 78266817 78396242
16510 78396242 75277577 70151534 64710448 59483996 55581668 53967326 55161379 58976279
16502 58976279 64502161 71201750 77666739 81801444 83284779 82288728 78240865 71616800
16494 71616800 64170003 56363842 48839193 42245417 36684950 32033695 28149557 24965746
16486 24965746 22412555 20361305 18702248 17336091 16175790 15166440 14260106 13434087
16478 13434087 12685223 12008143 11396016 10852933 10370037 9935163 9544521 9181515 8821157
16469 8821157 8472162 8131245 7769020 7399072 7039397 6695004 6361539 6047631 5770378
16460 5770378 5510287 5274018 5054467 4845509 4658377 4483750 4328240 4181671 4041918
16451 4041918 3915917 3799309 3699705 3591925 3491653 3390824 3284019 3177012 3078240 2986409
16441 2986409 2900173 2818188 2741023 2671061 2599826 2528332 2461047 2393813 2334507 2284635 2238867
16430 2238867 2190541 2140747 2088715 2040220 1995585 1944596 1887898 1829087 1758127 1683094 1611979
16419 1611979 1540145 1471056 1417272 1362026 1309213 1266729 1230340 1185111 1137144 1089348 1044289
16408 1044289 996123 943770 891548 837452 787196 736646 697685 651700 611423 577855 546752
16397 546752 514301 486083 461464 434507 408855 385034 367760 357168 348291 336092 317760 303753
16385 303753 306210 313530 315201 306901 288696 266518 252760 248726 243548 241588 235711 235264 240886 249238
16371 249238 254614 258786 259403 258340 260085 257102 253065 247699 239475 235494 235677 234357 231810 232355 232728
16356 232728 225405 222274 225575 228903 229781 232595 236346 244282 232841 224192 216603 207266 200294 194598
16342 194598 187718 194605 196371 195927 197150 191698 187343 187303 184314 179775 178198 183937 181861 182598 183888
16327 183888 181051 176067 179294 187155 186471 181910 169375 164000 163190 163189 161147 167220 169959 172987 172054
16312 172054 174815 180462 184736 193009 187322 183608 178827 173065 165148 162465 156697 146879 142578 142196
16298 142196 142346 138078 142367 150407 149992 144935 143570 142230 146403 144037 136990 141315 141894 138812 135515
16283 135515 137915 131671 122686 116536 115346 109840 97076 98947 97859 88666 95149 97848 101451 100254
16269 100254 95860 95949 94094 80602 76473 72768 71207 67823 61814 65682 69937 61580 57024 51516
16255 51516 48534 45446 41308 34470 28153 30954 35341 34025 29925 22269 20849 22681 20048 21519
16241 21519 23524 27414 19154 15459 14761 15467 17986 20650 22578 19616 20770 18293 17103 23950 29227
16226 29227 31657 30085 27903 25118 26589 27977 36998 39011 32108 26887 22932 24503 23416 23833 25013
16211 25013 18574 13520 19123 23397 27606 27490 27091 32899 36092 30632 20685 19399 25598 31098 34301
16196 34301 28895 21117 15557 16760 23325 30432 27674 26066 28221 24380 26724 26947 23757 19700 16732
16181 16732 16093 16455 23967 25511 21260 20573 21600 21836 27280 25963 24223 23658 24709 30158 32123 31906
16165 31906 32199 28700 22813 23278 22861 10779 7119 12960 14708 12830 14101 21030 26733 21060 18028
16150 18028 18257 11315 9433 9286 7843 7267 5332 -6560 -6989 -2635 -1314 7058 16361 16971 20917
16135 20917 17877 15322 13713 11098 9221 9944 16555 15304 10411 9535 9400 11395 13188 4925 8927
16120 8927 14414 13658 7644 5647 16178 17106 8485 7075 2615 6080 7234 3364 -1163 6256 9642
16105 9642 14024 16661 17806 13788 12377 7273 9501 12987 13503 9006 8083 8409 3865 -2301 -3339
16090 -3339 -1085 2645 356 -519 4530 7476 2970 398 2146 1916 892 7510 16758 9919 3866
16075 3866 1272 -1531 2385 10561 11006 6841 11812 5246 150 1174 4863 2974 8881 14087 11892
16060 11892 14471 10627 10468 11745 11815 8698 9038 6152 6021 8639 10590 6123 3855 1732 4690 9628
16044 9628 15497 17211 15045 13593 10179 16959 20073 12804 12415 16458 14971 18497 18374 14002 8049
16029 8049 10039 14284 15764 10900 9544 6455 6836 9824 10683 4931 7284 9905 6261 7330 8953
16014 8953 2256 -2374 -3086 -1325 -329 -4744 -1233 8185 12990 11771 424 -2031 5420 6364 -1429
15999 -1429 -4812 -9929 -13647 -15297 -14485 -14082 -12153 -9259 -8899 -1398 -2942 -921 -2497 -7131 -6006
15984 -6006 -4578 -1183 685 -785 4498 10121 6660 5876 6647 3678 5549 10022 12709 13705 16866
15969 16866 18918 17894 22180 28156 32291 32732 29927 36026 45749 54583 64521 79245 99568 135070
15955 135070 176937 216679 265122 327982 379969 406371 420955 420147 396507 366838 336195 309636
15943 309636 296670 294523 304643 327444 355841 390081 423901 440246 442608 433399 407968 370591
15931 370591 330629 293122 257724 217981 181390 160002 143968 131467 118313 104745 90972
15920 90972 81255 78353 76349 76534 72096 69310 66572 63853 63673 63748 54884 48693 46871 41448 33952
15905 33952 30496 35879 33495 30071 26236 23635 21930 23752 15974 19800 15300 19742 16653 15729 20393
15890 20393 18251 11589 11494 15750 19892 17227 11731 9225 8917 11953 7281 5646 2600 1158 651
15875 651 7647 12674 8154 7945 8216 7801 9945 6983 1324 3154 4345 1656 -932 913 3845 8029
15859 8029 1712 1218 640 -543 4432 6903 3473 -313 625 5339 5983 -2908 -6053 -2724 -4164 -3265
15843 -3265 -2885 -7997 -4531 -1862 -6687 -11419 -10832 -4131 -3494 -701 -736 -1113 3728 5949 5800 -198
15827 -198 3671 7861 7360 -2258 -11884 -14618 -13685 -8134 -5517 -2881 -1691 -5801 -7546 -4952 -6429
15812 -6429 -5044 229 6667 8195 9113 4401 3092 1786 -1207 5198 6429 3671 310 417 6523
15797 6523 9028 11852 9907 6198 130 -3283 -1625 -3081 -5701 -686 4350 8631 7142 515 3761
15782 3761 8730 7745 -1055 -4715 -952 -401 2659 6015 7037 3722 5863 5208 617 4919 8986
15767 8986 5789 4796 10224 5299 4250 2588 770 -2272 -1698 6243 8592 7641 1791 132 -2537
15752 -2537 -5992 540 4516 3981 1331 -7310 -14583 -8828 -6914 -12818 -11902 -5522 -3022 -424 4216
15737 4216 2040 2738 -1970 -6422 -8800 -17166 -18174 -19526 -18834 -17283 -5279 -3741 -5242 -11249 -12964
15722 -12964 -9425 -3144 0 -2924 -8135 -5917 -7223 -10246 -12031 -8422 -3238 -8439 -16449 -16055 -17762
15707 -17762 -15630 -10432 -2963 -2642 -10828 -16557 -17608 -14773 -11953 -10948 -9704 -12637 -9922 -4694 -11961
15692 -11961 -12738 -9703 -10597 -15454 -14756 -19561 -17621 -18738 -16202 -17170 -13356 -3639 -2916 -4915 -2972 -2480
15676 -2480 -5606 -8564 -9986 -14968 -14796 -9795 -8149 -9115 -7392 -6759 -4902 -8830 -11900 -10646 -7651
15661 -7651 -11107 -12030 -12566 -20110 -22828 -15865 -8504 -2605 -7143 -14414 -12576 -9868 -10732 -15820 -12553
15646 -12553 -11257 -14210 -4891 -91 -2014 -10440 -14316 -11649 -8182 -4894 -6336 -5904 -7388 -10342 -7167
15631 -7167 -7589 -10950 -13602 -10286 -9418 -10904 -9807 -7828 -11796 -3743 -28 3414 5999 6545 6970 -3243
15615 -3243 -11365 -14787 -13149 -9819 -4608 -5987 -8202 -15248 -18193 -11658 -9916 -8830 -1085 2763 1667
15600 1667 -1280 -6958 -14007 -7288 -11105 -13521 -12477 -4915 -11490 -18749 -15939 -11092 -9548 -1435 -3869
15585 -3869 -7666 -12945 -14609 -16472 -12712 -16363 -18794 -16503 -14001 -15718 -7353 -1084 -292 -2150 -7489
15570 -7489 -8928 -6983 -2834 6445 3954 -8275 -14271 -19035 -16903 -15239 -19033 -17220 -12726 -14011
15556 -14011 -9426 -2127 -2981 -7984 -11048 -8141 -8129 -12268 -13783 -14289 -11296 -17898 -11283 -8594 -4349
15541 -4349 -7234 -5763 -6577 -10137 -12938 -4875 -4067 -289 80 -5871 -10587 -13219 -14443 -17589 -21058
15526 -21058 -21682 -12782 -8131 -6845 -6197 -9163 -4626 -2286 -5261 -8183 -6807 -10272 -5523 1669 -3135
15511 -3135 -6614 776 1317 -8968 -15197 -15157 -13607 -12111 -13728 -12164 -6830 -6586 -9234 -15563 -16415 -15411
15495 -15411 -21274 -15225 -14250 -11226 -7864 -6664 -1569 4504 3595 3751 2227 7 2648 21 -8653
15480 -8653 -10952 -2522 -3280 -4278 -12360 -13754 -6272 -13350 -14503 -13664 -10038 -9146 -16866 -17566 -13129 -14455
15464 -14455 -12557 -8976 -11554 -16660 -14498 -16106 -12953 -13414 -6090 -3838 -1914 -3202 -8700 -14042 -14744
15449 -14744 -8149 -4782 741 1678 5636 6892 1344 -1797 4418 -1993 -8363 -5039 -6622 -10091 -9532
15434 -9532 -8213 -8047 -10023 -3812 -6348 -7688 -1104 5411 415 -6666 -5773 -130 5018 -2923 -9396
15419 -9396 -17589 -14889 -13434 -8265 -2485 -88 -809 -5035 -6853 -5064 -5442 -6287 -6383 -632 -928 -6544
15403 -6544 -11939 -14644 -12853 -10555 -1323 -3039 -9768 -11422 -14125 -17471 -14782 -10416 -7946 -5013 -8429
15388 -8429 -8535 -6291 -4433 -9596 -11038 -7498 -6902 -8133 -11216 -9903 -10547 -7556 -4823 -7431 -6724 -8966
15372 -8966 -10344 -9551 -12496 -13827 -19303 -15870 -11813 -12480 -7970 -962 1745 -1071 4754 12113 4020
15357 4020 1483 -4455 -9973 -10226 -11621 -6870 -6449 -5818 -7413 -713 2242 326 7850 9183 7304
15342 7304 1565 -7345 -1886 3349 2306 550 -5630 -9386 -11134 -13480 -9277 -5485 -5244 -11446 -8147
15327 -8147 -4031 -4087 -5159 -6885 -8016 -12469 -9454 737 -1932 -6901 -8916 -9048 -14357 -21086 -23675
15312 -23675 -20623 -11162 -9856 -15698 -21789 -17469 -10845 -6365 -6577 1468 -1383 -6514 -4281 -11367 -10902
15297 -10902 -4107 -6926 -7510 -5445 -6996 -11536 -12459 -12415 -6573 -1234 -2785 2559 680 -263 -8975 -7916
15281 -7916 -7207 -12747 -9256 -1394 4524 -1058 -1111 -8637 -10503 -7486 -8327 -12435 -18410 -18352 -6349 1398
15265 1398 11460 17396 7345 -6318 -10708 -13815 -13287 -13294 -9391 -6430 -11456 -12298 -15252 -10014 -1612
15250 -1612 1763 3553 -3436 -8868 -3940 -121 107 -4776 -5014 804 2108 1422 -4875 -4971 -6497 -3432
15234 -3432 -10343 -14730 -15453 -5625 -2847 -2572 -7491 -10964 -8090 -2510 1364 -2295 -9812 -9795 -10870 -10483
15218 -10483 -9755 -11028 -7169 -13359 -11185 -4920 -7189 -1141 4813 4791 4949 5220 8660 4909 3268 3850
15202 3850 2864 9589 6213 411 -367 -2927 -3972 1144 3031 2986 1655 -6816 -7976 -181 -3566 -13457
15186 -13457 -13702 -14777 -13043 -5539 1416 8543 5958 -322 -3409 1303 -1564 -8673 -5897 -2034 -4753
15171 -4753 -8596 -4679 -1546 -6989 -8061 -3834 -2735 -2085 -9822 -11227 -12371 -15345 -11565 -9223 -11377
15156 -11377 -15233 -8428 6690 11100 5482 -1204 -6674 -12664 -21925 -20224 -11491 -9554 -5048 -87
15142 -87 -5177 -10224 -5640 -6335 -8035 -14304 -13909 -10828 -5754 -3453 -5257 -7519 -10223 -10396 -9122 -18072
15126 -18072 -24450 -14506 -8433 -3500 -3996 -1065 1538 -784 -8004 -5948 2920 3655 -614 688 -2768
15111 -2768 -5044 -1521 -2201 -2782 -854 -2145 -205 3803 4206 7821 8902 2799 2877 5746 3189 4865
15095 4865 3715 -2294 -1723 -3633 -5410 -4599 -1691 -3523 -4459 -8478 -8374 -6630 621 1252 -2952 -6363
15079 -6363 914 4607 -185 1423 160 -4041 -1257 1399 -4819 -10420 -8299 -7240 -5182 -667 1239
15064 1239 2602 6557 1163 -2714 3828 965 -7220 -14635 -15742 -10991 -9784 -5033 -4088 -5794 -4456
15049 -4456 -1316 -238 -1425 -5622 -6109 -6518 -10749 -4672 6625 2296 -2582 -4775 -3417 1589 -4301
15034 -4301 -2501 294 4190 -2572 -11886 -12041 -6587 -5048 -7109 -6127 -4940 -5545 -5193 -2220 1627 -4117
15018 -4117 -6906 -6814 -7092 -11685 -9462 -14008 -11601 -3243 4579 6769 1384 -4937 -1306 -9312 -10828
15003 -10828 -5712 -4529 -115 1049 3919 6064 3582 1033 -2904 -5727 -6068 -1085 4056 10602 15802
14988 15802 24894 28098 21058 13821 7629 9104 3383 -3125 -10333 -898 7884 13478 6398 -3238
14974 -3238 -4072 -7025 -4055 -3045 -8218 -10760 -118 -186 -8839 -11004 -4853 -4805 -5947 -2079 -25 -1414
14958 -1414 -6618 -4326 -3118 -2884 -4813 -6322 -8192 -11757 -14486 -8871 267 2684 1753 -8134 -7365
14943 -7365 1731 6039 11228 12897 10671 4992 416 1502 4659 6365 8754 14349 10808 6626 7753
14928 7753 6814 4333 -993 -5200 -1036 -3793 -7188 -2636 173 2721 4637 -1748 -4723 -6246 -3105
14913 -3105 -1380 4252 7375 3328 9155 7240 10529 10150 2670 3137 -1846 -10581 -16286 -18650 -15787
14898 -15787 -14301 -14831 -20269 -23400 -16044 -9563 -9217 -6463 -8012 -8130 -5513 -4936 -5516 -7894 -7630 -5048
14882 -5048 -3060 -2870 -7139 -12294 -5107 3375 2470 6311 4217 1568 -2109 -6399 -6382 -5884 -4441 -1737
14866 -1737 6685 10607 11289 15675 9625 5942 -1816 2330 13567 12443 8678 6365 3791 4347 7319
14851 7319 9563 5107 -4444 -4918 -6538 -5920 -8311 -5413 -5312 -5195 -5099 -1666 -6098 -5799 4452 2421
14835 2421 -5687 -8697 -4967 -7197 -5921 -6447 -8503 -10080 -9877 -5576 -7026 -11497 -10881 -7573 -6915 -10797
14819 -10797 -4690 -3973 967 -1482 -4750 -9140 -12764 -13157 -12203 -13556 -15280 -16803 -6149 1040 351
14804 351 14 -477 182 -1061 971 6351 8800 5887 5040 4363 3533 999 -639 -6214 -7982 -5183
14788 -5183 -3084 -3076 -833 1849 4036 -1783 -5106 -3878 -1248 2414 2025 4231 8133 816 -10195
14773 -10195 -8873 -395 1569 -1320 -2529 -8898 -3667 -3885 -3697 -1304 -5949 -12661 -9811 -1626 3506
14758 3506 5552 6057 4032 2591 -342 5405 8647 2126 -3823 -3836 -1097 -3289 -1845 3363 6405
14743 6405 6738 5772 2175 440 -3434 -2099 1968 -3450 -7092 -1915 -436 573 -3175 -6102 359
14728 359 4396 2792 276 1551 6265 10578 8556 8043 6348 10031 11421 9557 3821 1589 1338
14713 1338 4347 -286 581 687 -616 -2663 -4915 -5491 -559 4672 6822 7793 1661 -242 2882 258
14697 258 7247 8832 5431 6684 7657 5920 5096 11713 17986 11554 5500 -1749 -2816 3212 15
14682 15 -2263 3981 8170 10561 10753 544 -5316 -5729 1933 3028 -796 -3642 351 5745 19715
14667 19715 26215 23295 16541 10877 11695 14862 14529 14525 16149 10174 9400 17695 21603 21532 26193 25847 26531
14650 26531 28477 28756 27171 26681 23781 16446 14538 23835 26540 24666 29946 31697 28211 31178 31755
14635 31755 43660 58314 70309 75099 90468 111317 129019 157544 202462 266867 346301 445605
14623 445605 556126 655587 734019 791593 814955 792742 737087 670423 588278 502259 427856
14612 427856 362750 313855 264989 225391 195285 178428 168109 149429 130516 114442 102442
14601 102442 99569 96679 89920 79068 74243 72763 68841 58335 58356 66384 71584 64568 56376 56398 51356
14586 51356 50897 52896 54571 57881 54149 49857 43971 39535 35141 29532 34488 40154 42202 43574 39492
14571 39492 38236 33892 39542 40822 36396 39153 45761 40810 37249 30201 23528 22032 26576 34454
14557 34454 33382 27251 33367 33781 27982 24574 29091 36798 36155 29974 27213 25309 26560 30920 33802
14542 33802 35629 37004 29998 30031 27889 24412 28683 32346 33113 39691 37114 32745 31280 34032 29384
14527 29384 33760 32704 26178 24057 24927 31802 25154 18569 22119 20244 25510 34065 29183 24491 22771
14512 22771 23851 27913 24026 18613 21619 22228 17285 15981 17814 25659 25969 24947 26543 29003 29447
14497 29447 30450 40467 44122 37592 27633 25841 26441 32031 27768 28360 31035 32280 30016 27348 32303
14482 32303 37303 32602 19719 13446 15089 25475 29193 24338 21375 25267 33801 31535 29586 29673
14468 29673 29640 26111 32835 34594 36693 40059 42149 43758 42208 37727 34680 41801 50471 51990 54358
14453 54358 43360 35681 34920 33303 33921 30060 25596 28525 26620 25902 27114 24816 23194 28691 32690
14438 32690 34972 40043 40843 35605 39789 37670 27957 25515 24602 23045 23433 23253 25266 27717 23126
14423 23126 24773 24481 24241 25125 27862 28516 25495 20747 16791 19797 23613 27218 26062 24810 20241
14408 20241 19570 21557 20733 21693 24137 24074 26514 29511 32013 34545 34620 34032 37014 36701 34000 40546 47901
14391 47901 47528 40430 37337 45098 49849 45249 41437 44721 46330 38792 31691 32702 40338 35887 33921
14376 33921 33757 34288 34826 42882 49777 53656 46562 36221 37341 32340 34140 36675 43734 46198 46846
14361 46846 54946 54642 60184 60478 57826 59210 59760 57835 51778 56454 61224 58896 62677 60550 60280
14346 60280 61631 57111 59040 63766 64974 66584 68843 69671 69504 72559 73165 77834 81128 78623 82825
14331 82825 85617 88916 100256 109764 121391 134491 139745 152961 168234 190265 217962 253747
14319 253747 304430 380650 488257 643594 834106 1053733 1288628 1498541 1640482 1703771
14309 1703771 1695588 1615167 1479750 1309604 1131246 962304 809358 681640 589455 508552
14299 508552 445095 394223 345859 313044 277185 250828 241925 229077 212160 194576 177871 166779
14287 166779 160846 156744 151642 147395 140787 135304 130735 122969 118187 119346 109792 96268 82852 75069
14273 75069 66516 68708 71069 80029 82675 89421 95695 98122 90956 90697 92115 94272 104953 120981
14259 120981 124792 117355 103783 97962 94298 93503 97007 97385 91766 80376 78584 83682 85114 82598
14245 82598 89701 86041 83581 81969 79868 71925 70939 78892 84061 75536 75009 69542 66227 58642 52413
14230 52413 48309 47129 50663 58561 66346 63453 59344 59431 56224 51494 44813 37127 36766 38280 37876
14215 37876 30812 28121 32971 45744 49935 53447 51785 48785 43961 38558 32724 29288 35369 44397
14201 44397 51667 53387 54391 56899 59776 61117 58151 64259 68001 57254 46361 42427 38998 44087
14187 44087 47494 48151 48066 50508 51349 42548 38194 46626 47819 45244 39885 37944 41359 45574 55189
14172 55189 56004 45059 44877 51895 52798 48388 45392 40305 41021 45176 44848 43488 44504 44916 37292 35709
14156 35709 41091 44006 47512 49914 45563 41177 44610 51594 47059 42207 39628 36702 29031 23536
14142 23536 30062 31357 28560 24752 28387 34207 42111 52883 66992 73370 69097 67601 67617 70128
14128 70128 67254 66639 69131 69369 70485 68787 69482 79168 81215 80005 73253 75281 78167 77158 79912
14113 79912 82812 84510 89955 93356 94059 95450 98557 107324 119562 122868 128040 135708 141178 147294
14099 147294 153808 158714 164977 181714 206359 225001 245785 270530 294885 320061 337142 340762
14087 340762 328179 310779 280963 255593 230689 210640 199609 195929 202856 210833 212851 212693 209291
14074 209291 210215 205456 194395 185920 173448 162633 157406 158440 155870 153325 146446 139405 146824 146019
14060 146019 140256 134339 130277 128718 130205 137420 147305 145958 145301 140295 130052 122049 120903 122413
14046 122413 125851 130570 126111 127761 133001 141027 148652 140125 131487 125724 130209 139590 139098 141846
14032 141846 141927 143410 140857 135079 119625 111862 99762 90793 78041 69743 63162 58692 72367 85630
14018 85630 98308 120927 141596 169063 192347 213933 233191 245002 257929 271062 273124 265942
14006 265942 251820 236998 222378 202088 191878 184953 187402 177541 170886 170399 170911 170445 174712 184218
13992 184218 186483 179841 181490 188335 201044 203888 209560 217412 220465 226852 230601 239363 258480 279877
13978 279877 293236 304530 310400 321600 333236 338657 337396 337911 339534 338045 340013 352922 364050
13965 364050 382111 405936 442973 484637 524403 564609 600130 632978 668684 702171 716761
13954 716761 717224 704471 687811 665694 644524 629619 619329 610617 615351 624721 642490 662336
13942 662336 683676 698649 711300 722975 731462 731456 731130 737634 746728 752343 759067 773353 781606 783429
13928 783429 784712 792544 802071 805991 797369 793086 794528 791337 803006 812877 821008 831891 847044
13915 847044 848436 849963 849087 851104 852417 855583 863612 885763 908934 933964 963975 997943 1035811
13902 1035811 1072178 1118332 1166215 1212323 1263577 1316589 1366736 1422481 1470142 1511993 1551858
13891 1551858 1595205 1635996 1685169 1729715 1771704 1813737 1867003 1915310 1962990 2019435 2087860
13880 2087860 2161680 2238611 2319285 2407374 2500993 2594902 2686852 2779957 2869674 2965525 3064134
13869 3064134 3170878 3297020 3437854 3607437 3813855 4059244 4337456 4658308 5036483
13860 5036483 5477046 5986066 6572980 7258041 8060657 8994727 10107816 11453023 13062110
13851 13062110 14948228 17106599 19572321 22379689 25510070 29029695 33212122 38410465
13843 38410465 45137261 54545647 68497428 89449458 118803746 154648950 193998379
13836 193998379 233941222 267979020 289893081 299447089 297096130 281638474 256414230
13829 256414230 227319396 196962199 167368578 141349571 119844719 102193422 87602707
13822 87602707 75664699 66080679 58434152 52281228 47258725 43083266 39545136 36509049
13814 36509049 33898671 31638024 29662670 27921557 26377955 24982733 23706532 22526203
13806 22526203 21420937 20386908 19410106 18487880 17623750 16811243 16048770 15348618 14697360
13797 14697360 14086010 13508185 12969526 12460670 11982165 11537244 11113277 10711234 10338686
13788 10338686 9988228 9649640 9321821 9004809 8690689 8375918 8063249 7765187 7485600
13779 7485600 7221776 6971289 6735569 6515663 6323505 6149707 5991706 5853048 5726316
13770 5726316 5619338 5522308 5425617 5323069 5217412 5107876 4989202 4869117 4757115 4637106
13760 4637106 4510461 4382670 4249785 4106952 3965221 3830201 3709379 3608514 3524471 3445904
13750 3445904 3375912 3323844 3280530 3220579 3142664 3052580 2943145 2820126 2678224 2526147
13740 2526147 2375412 2229869 2078075 1936771 1806276 1686686 1580586 1479046 1373822
13731 1373822 1279548 1197490 1115794 1040875 979483 920923 869090 819244 779478 742588 702996
13720 702996 671094 643775 611524 584837 551274 514453 485797 465843 454388 458206 471208 488269
13708 488269 503569 528991 549552 563289 581361 590884 599226 589187 571820 549966 535868 536140
13696 536140 538809 534843 522816 515335 506585 506063 506776 507686 506144 507871 511409 510929 500437 490614 478214
13681 478214 459173 449833 461579 471228 476979 490996 509618 518835 516349 516147 502048 489594 483200
13668 483200 474369 461221 446243 432547 416430 393236 368444 343875 327766 317215 306569 297878
13656 297878 292257 295714 301690 311382 322377 338652 359946 387131 411081 433134 456177 466151
13644 466151 469282 468828 456539 442451 430531 412795 395933 386315 376550 362654 351974 335881
13632 335881 319294 314533 307863 303735 302095 304852 306484 309521 318853 325859 334875 344519 349873 346134
13618 346134 344631 336912 330858 320116 313754 311586 307216 303820 307662 312780 315403 316617 317872 314667
13604 314667 308426 298172 291113 275336 263127 254862 242306 221323 201056 186118 174418 170674
13592 170674 160007 147180 144931 144774 141713 138043 132171 126103 123157 117387 109593 98339 99649 98095
13578 98095 87905 77782 70158 71351 75121 73332 70991 65835 73018 82120 77527 63804 62700 72711
13564 72711 75624 77068 84602 78622 75320 81251 83006 88384 97452 100132 93333 88768 95754 101436
13550 101436 96900 91702 95058 97545 97097 96277 97235 97465 94253 86738 84906 86466 90486 83536 75357
13535 75357 76958 72685 68558 70511 73634 79553 88096 99546 107604 109897 114175 119341 119527 114492
13521 114492 112645 105560 100149 99093 94824 88117 85801 80999 79856 85876 86320 86068 89216 89454 79313
13506 79313 75761 81081 83683 79871 81095 81316 80597 77837 75112 70427 67002 68380 73234 76877 70121
13491 70121 66323 71496 74289 72586 72996 69630 67464 72298 67101 60480 59670 59864 58726 54377 54462 57004
13475 57004 52984 50211 51470 54082 62279 63280 53372 50238 50576 53691 51791 49051 52614 56973 63297
13460 63297 62151 56345 57618 59562 58808 59244 61778 65025 60321 55152 63834 64533 64029 62931 59799
13445 59799 65213 67447 72790 76027 72864 68300 68414 63805 61483 65550 63372 58809 58924 53318 48690
13430 48690 53253 49850 41964 47847 47953 48988 50597 51912 52937 54619 58260 56726 59034 63436 58125
13415 58125 55109 55552 59881 66524 73834 71408 70482 65876 55666 54488 52294 53339 54145 57788 59484
13400 59484 63314 71189 81485 82142 84031 88263 95197 96375 93148 88598 89720 92992 92597 90962 88404
13385 88404 93720 96789 99141 97552 94571 96039 100484 94733 93764 98049 99969 94740 97497 103717 111075
13370 111075 121261 123407 124446 129095 133619 145996 156261 176877 203686 228553 260679 296842
13358 296842 343461 415712 523494 672718 863679 1077530 1307000 1514322 1660010 1748520
13348 1748520 1767724 1701042 1553324 1386661 1211980 1041008 897034 762122 651378 563544
13338 563544 498469 445140 405688 373314 336135 301632 272748 254296 244402 240259 230582 219670
13326 219670 209887 198396 187870 192029 184667 176982 163474 153742 147592 141370 139346 133271 126899
13313 126899 123445 113796 111541 111558 116285 118535 117926 108653 106253 113558 114022 111157 110821 109508 105405
13298 105405 99980 95885 98577 95057 92855 90183 86946 80983 79082 77732 80369 83724 83941 86981
13284 86981 85838 84281 73229 72709 72761 71550 71370 74381 69683 67560 67106 65097 63384 62331 63230 66565
13268 66565 58535 56437 57677 60527 63402 59553 60687 64255 57696 57009 56701 53057 52520 55681 50487
13253 50487 48873 47888 46455 47904 53588 56856 50174 48689 53935 57294 60087 65681 68276 65531 61266
13238 61266 56263 60839 64233 68405 68858 73625 70865 69155 62750 55311 46440 48432 52457 60072 61113
13223 61113 61737 64324 66354 59988 55279 57870 59830 60765 63813 62366 58658 54319 49414 47397 50097
13208 50097 61851 58622 60189 66723 65561 66303 71116 72728 72558 73973 79341 75255 68629 59902 61736
13193 61736 68191 67291 72385 74110 80783 86267 95329 100638 99580 86164 77236 75741 74405 72996
13179 72996 61401 58186 57180 52260 44283 46983 56164 58661 45875 36742 46085 59530 60174 52686
13165 52686 57374 63429 54910 57909 59853 54638 50569 46778 41387 38433 41093 54454 65488 77809
13151 77809 86725 90554 97929 102292 93161 85259 89527 92623 87051 83097 85105 90590 103784 120442
13137 120442 133240 143120 147966 156775 168548 192709 218749 253220 285597 340721 409819 507077
13125 507077 646048 863295 1191508 1610671 2024497 2357458 2579738 2651983 2583863 2419363
13115 2419363 2157212 1841708 1553296 1319096 1121746 958734 825411 720916 625853 549151
13105 549151 490690 439846 404207 376854 346466 321633 308675 291688 274862 264572 252293
13094 252293 238600 229134 226210 226637 225307 214911 206642 201929 201759 199163 188914 175523 163484
13081 163484 162073 158192 162437 156373 152049 138181 130182 124680 117018 117168 117250 120154 121024 116777 106695
13066 106695 108482 108423 104852 102057 101502 100771 90801 82690 84247 84212 87371 86157 87508 89017 101918
13051 101918 106942 104323 108043 116799 117398 116441 115354 114215 116184 114397 113653 112473 115919 117287 117098
13036 117098 117694 120762 118275 106931 101401 96920 88677 87790 85572 85201 90227 84472 84727 85381 83322
13021 83322 83637 78181 78142 78224 75310 73751 73451 55226 47899 52761 55060 54538 59657 63765 66938 71500
13005 71500 72895 65891 58858 63619 67691 64635 56117 52632 59549 55209 52187 51437 48516 44767 42205
12990 42205 40229 37703 28839 28300 29501 37602 48304 55191 62604 73583 87913 96787 97336 100975
12976 100975 107418 109259 108082 107757 108348 103676 97185 94053 93784 89628 83645 88075 91898 96271 101973
12961 101973 104092 99119 103048 113158 118555 121025 123198 132043 145061 147952 161103 165588 173359
12948 173359 190916 206887 217593 225752 232443 237142 252764 273935 305879 345247 389104 433091
12936 433091 477178 509160 525052 518266 490170 439018 385045 337425 310364 298750 296810 303154
12924 303154 306000 316721 331292 334338 321630 305263 292199 276003 262716 242869 224364 218552
12912 218552 210794 199053 193924 197305 198346 203261 210678 211901 211807 216917 219226 213966 205436 204616 203597
12897 203597 199298 197610 198726 193482 189098 189013 183670 179465 185393 185704 195072 202651 208364 216799 209965
12882 209965 210466 208144 208489 209514 214663 221699 225951 221795 213590 189785 166444 136103 98126 76931
12868 76931 60339 57218 72433 103125 137119 174085 210669 253024 288507 321394 349767 368291
12856 368291 385728 399078 397123 385525 372466 353883 328328 305438 291590 276491 256684 251786
12844 251786 248533 236335 229144 236774 239756 242711 247113 257000 263723 269828 273158 276409 280237 285388
12830 285388 292980 297708 311542 328998 336781 345554 355517 368699 379701 387645 396841 402785 412112
12817 412112 412595 415681 430459 441407 453993 479127 515340 573243 643850 708779 770451 826616
12805 826616 875470 942576 1012901 1070694 1104449 1115908 1097554 1063601 1023855 981271 951197
12794 951197 931321 915150 917358 941426 971860 1004432 1042937 1073481 1085123 1097549 1105755 1112232
12782 1112232 1116409 1127638 1131599 1140667 1147894 1160729 1180987 1197017 1214410 1230935 1237845 1250282
12770 1250282 1247713 1251656 1264333 1285310 1304064 1329210 1365300 1406676 1452384 1493433 1527581 1560502
12758 1560502 1601741 1661093 1756424 1888732 2094775 2437507 3007058 3754078 4234523 4327754
12748 4327754 4430905 4620691 4461547 4039087 3707303 3500928 3360456 3228347 3114878
12739 3114878 3032197 2977062 2948986 2951462 2972114 2995768 3017177 3044641 3085300 3143225 3216123
12728 3216123 3294355 3380452 3486220 3604706 3729228 3856868 3990056 4125903 4268721 4414405
12718 4414405 4556314 4692105 4824728 4965521 5133772 5338910 5594082 5901883 6254882
12709 6254882 6683397 7194665 7820705 8580226 9477338 10473139 11551242 12726876 14005417
12700 14005417 15381956 16880739 18530966 20405889 22627148 25274328 28442116 32278220
12692 32278220 37002878 42897306 50310586 59792942 72169641 88878774 112702720 148586049
12684 148586049 202789616 274557745 348208145 408229807 450154788 470036502 466363754
12677 466363754 443718458 405813889 354180579 300293044 254383458 216873624 184905092
12670 184905092 157115494 133676072 114649471 99464295 87386783 77758742 70011736
12663 70011736 63681022 58423970 54012382 50270931 47079946 44344885 41972894 39845970
12655 39845970 37870017 36031573 34311013 32689168 31163824 29705864 28314185 26997748
12647 26997748 25760847 24612796 23555810 22581134 21667585 20803005 19984885 19210350 18474765
12638 18474765 17780706 17135604 16524610 15946503 15396342 14879424 14383544 13895523 13423462
12629 13423462 12949792 12478481 12015150 11556924 11119106 10715029 10345211 10009004 9708978
12620 9708978 9435064 9188970 8967612 8779448 8618798 8466692 8314721 8162280 8007690
12611 8007690 7843125 7675325 7495965 7317683 7133718 6932407 6730702 6529099 6319221
12602 6319221 6103183 5894736 5702821 5543212 5411831 5304243 5226442 5164236 5105650 5042047
12592 5042047 4955211 4837215 4686146 4499753 4282289 4055002 3814774 3581728 3359969 3143865
12582 3143865 2948391 2774624 2601675 2435802 2285177 2140679 1993431 1853277 1730413
12573 1730413 1615483 1516433 1422874 1344133 1276568 1214157 1155619 1109991 1067186 1018869 968819
12562 968819 918371 871382 822198 776865 750464 744859 762232 792205 821572 848930 885506 926047
12550 926047 958847 986284 993297 975848 937812 896130 868474 855706 845562 847398 843363 827725
12538 827725 819487 817789 816933 815813 815189 820400 830159 834704 832022 814090 789755 761333 739760 728906
12524 728906 728125 739860 759298 779336 789513 791013 787994 779197 769769 760324 747204 728738 710056
12511 710056 694657 670422 635921 592395 552393 521853 504476 499139 488426 485329 486502 494403
12499 494403 504439 514962 536770 568024 602043 645401 687646 722485 746009 757409 752374 738209
12487 738209 711997 685788 658554 633128 605277 586075 573840 552031 535191 515550 508737 514709
12475 514709 510929 504220 501099 504213 512727 518012 518746 518600 522603 526809 539562 541734 529814 515715
12461 515715 504928 497907 488856 480104 474535 476186 476345 479328 484118 480149 471820 453002 427841 405727
12447 405727 388765 373356 356542 334743 314935 292490 275337 262208 249085 240765 232610 226563
12435 226563 222905 223143 220265 222427 213104 207654 204895 195429 187450 173998 159524 146709 136003
12422 136003 137113 137346 135198 129398 125468 124850 124981 122722 120957 120731 125051 125511 121835 120747 124107
12407 124107 137341 140630 140066 146496 152260 148305 150278 144021 142260 143582 144661 143040 148819 149140
12393 149140 147330 146390 142302 139456 141770 146961 141551 136311 129035 120777 118843 110575 101992 97165
12379 97165 97781 108088 119712 126775 140622 155626 159386 157180 163505 169780 162728 166420 167742 160387
12365 160387 150807 151996 149580 146032 136565 136692 134186 127641 129476 135789 142056 142960 137860 126306
12351 126306 121417 125380 124008 125125 129618 130058 126024 124937 122976 119940 117123 116998 116018 114847 112759
12336 112759 114852 115616 122804 127781 123150 121604 123700 126719 119092 108797 101475 98034 98947 98488 94502
12321 94502 89348 91309 94741 91863 87685 87669 96248 97597 92104 93559 90396 84797 87342 85708 87343
12306 87343 91681 101495 103324 114912 119693 116080 112837 114379 114631 108569 100654 95768 92037 92690 95173
12291 95173 99336 94456 90755 92627 93711 97405 104051 105615 100842 96771 93368 90023 85568 86337 86301
12276 86301 86441 83354 80919 82960 77893 78601 74347 66729 71638 83742 86702 86560 93868 98227 93126
12261 93126 108533 104477 104573 108998 111480 113084 109956 106585 111388 118792 127231 136963 148276 168283
12247 168283 193980 217631 258070 306807 353497 413934 499534 609298 768259 1021675 1382658
12236 1382658 1803949 2188732 2492427 2672054 2704044 2594382 2388667 2097887 1781931 1512471
12226 1512471 1294425 1106115 941945 798902 684968 598681 526637 479152 438274 404035
12216 404035 378009 354077 328924 314576 295838 268679 247738 234571 220781 225061 226871 222710
12204 222710 215754 211450 209890 208059 204817 195376 191282 179390 168455 162972 154692 151041 147709 138771
12190 138771 128554 115050 112553 118784 123106 122119 125266 121157 125091 127525 112695 100866 92763
12177 92763 92324 89772 84585 85975 89829 92309 85885 81708 82539 81388 74840 77223 74307 67856 67104
12162 67104 67506 67449 68311 60403 52617 51377 41650 35892 40434 39880 37971 43640 52694 51731 56184 57811
12146 57811 60481 60195 55207 54955 56106 59358 56227 52390 48887 48690 44668 40439 39416 32464 30599
12131 30599 23728 20664 25562 21369 18724 18749 16440 13640 12687 17813 13483 7076 4841 6391 10733
12116 10733 17534 19237 16237 18940 26016 25684 22256 22463 28226 33782 31627 27874 35925 38103 30426
12101 30426 27533 30071 28706 33257 43001 48805 46229 36129 34413 29686 23433 18023 27445 34421
12087 34421 33470 29312 35541 41044 35262 25940 21899 16987 14152 10386 15705 18684 16844 16209 18131
12072 18131 12733 11364 14574 15509 12391 16265 20554 24561 23688 18397 21728 24159 21601 19029 19037 15211
12056 15211 12576 13459 11998 6337 5805 2603 3898 4772 396 1681 4933 8489 9360 11595 14979
12041 14979 16053 11322 13243 6644 6065 4954 664 4480 5834 8676 7372 8171 3597 2475 1290
12026 1290 -1020 -2892 35 6783 2763 -2555 1878 1440 668 -1843 988 4898 5747 -1537 402
12011 402 7436 14030 15597 12823 5602 12704 13359 10389 9935 16562 22051 27413 30897 29721 28701
11996 28701 28701 18660 16854 11806 15942 25175 23394 25124 31823 31834 26989 22508 27462 27563 27338 29940
11980 29940 29385 33409 28066 27324 40962 56339 60470 55672 57516 56945 49103 34183 32589 28249
11966 28249 25193 23675 24189 20277 16777 21124 20845 21372 23149 18874 18326 18072 17371 16789 16505 13790
11950 13790 9792 8152 11168 9848 5875 10487 14421 8560 4663 7345 4042 1448 4507 16859
11936 16859 18874 16706 11092 11173 21712 24236 25331 30022 45128 65229 69066 72405 84604 88407
11922 88407 78146 67084 55036 45272 42170 42348 46771 43272 36657 28165 28166 26410 23450 27270 25598
11907 25598 18117 21221 17334 14374 14079 12771 16047 18748 17915 13707 11134 14469 13157 4735 -244
11892 -244 9310 16926 19163 19773 15711 5530 -263 8422 7914 4498 3864 3200 4973 10733 17504 18588
11876 18588 20528 17210 18687 14449 9723 13853 14327 6374 286 2832 1983 -2301 -5888 -7742 -13141
11861 -13141 -9343 -3205 -2842 799 7046 9747 11133 9982 5793 704 6347 6217 1575 2012 11666
11846 11666 10753 9264 11850 11581 7913 14983 13145 2577 -3445 101 8816 15549 17356 16138 18518
11831 18518 16163 9357 1525 -11239 -7807 -2532 5739 9106 13962 10387 1514 2562 3306 -547
11817 -547 59 -1713 -3859 -6578 -2747 2727 749 -3936 455 -775 -2110 3500 4858 2351 2749
11802 2749 4162 5577 13823 15762 13452 12196 13752 9258 -2464 -6041 -5633 1607 10126 7094 4544
11787 4544 3625 8677 15188 12686 7623 11510 13210 10818 8806 9580 12760 7483 1767 1255 -157
11772 -157 3386 10033 13216 10591 5851 7291 9600 8669 6161 702 -983 1497 4583 9050 8751
11757 8751 12193 11871 9488 3532 4094 9233 5847 10584 15864 18150 19618 16180 12578 8778 7728
11742 7728 6519 9593 8463 5088 3435 6637 8270 12006 11031 11377 7903 10763 9311 12709 14308
11727 14308 10912 6565 3430 -2474 498 9794 14227 12395 12442 11359 9775 12383 15570 15657 6284
11712 6284 1525 -2367 -4463 877 -17 -2332 1739 6569 7174 11560 10418 2467 -2529 449 2439
11697 2439 8526 7774 5663 3599 -1742 -3146 -3349 -5169 1528 7718 11635 10275 4506 3143 4904
11682 4904 8721 4509 3624 1968 2538 3055 7420 10291 13167 11390 12626 10807 15432 11625 4442
11667 4442 1597 2149 -1019 -2378 3801 2924 -96 -986 -2941 -2720 -5881 1592 5652 2682 1392 304
11651 304 -3187 -9602 -5297 3039 -100 -2489 2652 1132 -5281 -8164 -4464 3079 3447 1134 -3879
11636 -3879 -7596 -3946 492 -4085 -4911 -3471 -5541 -4817 -8401 -11063 -12167 -11235 -10376 -5019 561 175
11620 175 1242 812 3587 9389 13263 6961 6081 -1745 6604 10143 6404 2480 2676 7435 8294 3519
11604 3519 4515 781 2379 -2486 -2835 -9262 -5699 2582 4668 762 6190 7085 4298 2080 -69
11589 -69 4984 8670 -1255 -5272 -1111 2008 926 -4007 -10040 -2523 10813 17710 17478 15604 11249
11574 11249 10917 10938 8914 4306 1577 -720 -2115 2371 5368 9300 12130 4055 1644 -3311 -5850
11559 -5850 -7355 -5864 -8090 -9829 -4992 -3794 1753 9116 8486 5364 4780 8022 8341 12104 6166
11544 6166 -3392 -14504 -7449 -3043 6445 10832 8504 3500 -294 -14493 -23978 -33161 -26106 -14846
11530 -14846 -1858 19544 33967 53717 66902 74319 75053 68894 54976 30001 14089 2565
11518 2565 -12022 -16127 -12345 -3784 -2410 -2782 -12175 -18335 -15398 -19581 -20783 -13166 88 6457
11504 6457 3988 104 1268 5984 10229 6769 7407 1294 -1383 -2635 -1138 -464 4383 444 -7733
11489 -7733 -11596 -17729 -14218 -4008 12 -2361 -5087 -2899 -2702 -2759 2412 8599 6197 2336 292
11474 292 -7825 -5855 -1585 4462 6907 5916 4044 6342 4450 6404 4605 7448 9446 11335 12902
11459 12902 11679 12751 8109 1313 -4838 -6279 -1766 -1679 -2280 -1713 4892 7692 11471 15639 20893
11444 20893 23295 20327 20279 20014 23421 22746 21322 15547 16724 12546 12842 15742 15496 11145 2916 577
11428 577 2622 2306 3764 -217 -921 1025 137 8952 10214 6128 7480 9555 8950 1283 853 -4017
11412 -4017 1160 6875 7834 9242 4830 4304 3382 -847 2828 3946 1755 -2534 1659 3023 662
11397 662 -1908 -602 5329 11178 5961 3722 -5550 -10039 -9873 -7824 -2661 -70 616 3975 4816 10012
11381 10012 17071 18202 16944 10522 1474 -2694 -5001 3567 8253 6901 8091 6429 4403 8163
11367 8163 7850 -1621 -4343 351 -686 -7103 -8717 -5337 630 1628 2117 -629 3356 4399 2883
11352 2883 988 6486 10154 6358 5919 3033 2485 5036 2810 3062 9055 12755 17043 17801 10130 2224
11336 2224 -110 3272 9217 7960 9770 8823 5969 4473 7198 9861 10024 4134 11992 7834 8165
11321 8165 9618 7749 11390 29645 39598 49914 64893 91812 141332 219342 284692 291560 291233
11308 291233 307012 295911 240045 191547 163364 142352 110399 80684 65787 58135 55113 50631
11296 50631 47616 47128 37942 33641 31123 29325 18749 16652 15259 14154 16699 25816 29782 24461
11282 24461 17889 19917 16754 21041 17308 10982 7395 9733 6759 6808 15671 16951 14242 10178 5139
11267 5139 1579 5176 9405 8471 12569 7697 -2804 -9754 -8766 -1057 7866 11086 9707 2545 -5869
11252 -5869 -6898 -4486 -626 160 4592 5711 7377 14554 15410 11056 6343 5874 3449 227 9150
11237 9150 15927 17444 13786 7240 14118 18555 18424 23098 28222 20875 15482 15075 23319 20229 11995
11222 11995 11680 17386 12909 10515 11620 11556 17670 19458 20448 12741 2860 340 -1785 -5900 -2672
11207 -2672 5099 4891 4248 7330 2300 2031 6232 7233 8458 12159 16601 12644 5736 11564 6846
11192 6846 4631 5449 -6806 -5365 -800 1446 3606 4255 96 463 1740 4270 3414 3386 1082 -1104
11176 -1104 -1909 -1112 -1899 -1964 2489 -977 -5560 968 -1859 -10485 -13888 -16605 -8381 409 3423 1028
11160 1028 4182 2295 -1127 -4626 -7380 -11707 -10740 -4274 2735 4528 5339 3363 539 -157 2380
11145 2380 9220 13856 7841 10088 8379 163 -3309 -238 -3815 -2795 759 436 -1367 1509 -10318
11130 -10318 -10196 -2249 1783 16 2843 1973 1797 2784 9058 4688 -2305 2049 2263 372 -3919 2682
11114 2682 6158 4794 2383 -3559 -2732 -4015 -5430 2153 4341 -4684 215 4930 206 -4607 -8997
11099 -8997 -10309 -6745 -10202 -5592 -3721 -2964 -7424 -8226 -6175 -4151 1033 3439 302 2823 3022
11084 3022 4732 486 979 1401 821 4080 2148 4016 7570 7960 12273 13000 13413 5478 2999 -546
11068 -546 509 3221 11740 15723 12047 10591 18262 19330 12184 12066 9349 9851 10577 10442 15391 12187
11052 12187 8439 3989 6153 2425 1518 4370 6187 6635 -464 -6093 -6127 -3306 3617 2267 4149
11037 4149 10063 10491 9726 -2442 -5050 -2808 -1429 819 5752 3621 2457 -1170 -7481 103 54
11022 54 -4630 -3134 -2752 -8421 -7882 -2570 -3516 -3591 -9498 -9460 -9633 -8659 -1995 -1805 -4310 -5604 -8261 -7452
11004 -7452 -7525 -5433 64 -3716 -11797 -7625 -5023 -4218 -5486 4271 7129 7710 837 -5292 -5009 -3222
10988 -3222 -1179 550 712 -1332 -3861 -2835 1877 3470 2322 -1307 3785 5549 3336 3178 -1778
10973 -1778 1229 1911 3662 -889 -6561 -2161 -332 -1533 -1771 -2660 -3964 -4866 -1945 1158 1010 -5088
10957 -5088 -6193 -3026 -959 1987 -2000 -8127 -7963 -11894 -9338 1474 5476 3232 -691 -2069 -3184
10942 -3184 30 -914 -10872 -13542 -2332 2918 -812 -4022 -3529 -5995 -12989 -11455 -2357 5324 5693
10927 5693 5559 5804 49 109 118 1510 1121 -2141 -1906 6949 4470 1634 4568 892 1223 6366 6959
10910 6959 9449 5742 3681 2566 5528 6705 1582 -4662 -2255 2329 -8391 -13880 -12073 -6687
10896 -6687 -6330 -5750 -10345 -10657 -4471 -3699 606 3666 3488 3940 1541 26 -2217 -2496 -7619 -8235 -3660
10879 -3660 3590 -1450 -2671 195 -3186 -11618 -11643 -4553 -6016 -6063 -8480 -16598 -16564 -4589 3858 6403
10863 6403 4276 981 -1390 2215 -798 1712 1180 497 3494 1720 -2034 -1855 -3929 -8057 -16662
10848 -16662 -18891 -10169 -1664 -895 -2765 -660 -723 -2553 -3281 2310 3667 1507 3646 1103 -10156
10833 -10156 -10869 -13768 -15857 -6254 2452 902 1082 2984 -535 -9330 -15087 -15326 -13321 -6787 -8614
10818 -8614 -9617 -9129 -4626 -5568 -9198 -7374 1386 5999 -2319 -6791 340 2161 -1973 -7018 -4002
10803 -4002 3026 -322 576 4547 -6881 -9286 -5905 -6936 -10494 -9504 -6143 -1159 -4874 -1761 -4597
10788 -4597 -9935 -5888 -6565 -1466 2755 393 -26 -3855 -7838 -12153 -15358 -11511 -10467 -8736 -6875
10773 -6875 -352 1193 -1824 -7922 -12741 877 -1698 -1608 -3756 -5539 -6858 -326 2486 -3686 -5858
10758 -5858 -5041 -1499 -1404 335 -5195 -4636 -5967 -1461 220 -1505 -741 1512 -3987 -10312 -1946 7807
10742 7807 7982 -935 -5645 -9502 -12110 -9272 -10466 -8817 -4882 -3357 -2755 3194 5411 5913 7735
10727 7735 7522 -2145 -7747 -4934 -8165 -5870 1953 9944 5768 493 -3839 -5537 -5787 -2069 9010
10712 9010 13485 11900 4785 5729 8535 7427 9070 11628 7328 10776 9488 3580 2731 -778 -2678
10697 -2678 -6773 -4681 -3040 -1511 2144 4648 4539 -184 -1400 7455 3127 -2527 5297 7841 5682
10682 5682 5808 -2432 -1954 -2996 -6069 -9700 -11288 -9220 -10717 -9209 -528 2325 1987 1360 7750 7860
10666 7860 -1241 -3553 2103 2183 725 -2490 573 3173 4400 -14 -1747 -3412 5370 14774 11587
10651 11587 9261 6771 4569 7544 9976 9137 4042 3888 3594 -2485 -4162 -1169 1861 4534 840
10636 840 -3323 -1998 6999 9429 6309 1953 -778 2112 9493 9275 2788 -753 -1760 8439 6011
10621 6011 2607 4306 3208 -81 -4251 -6346 -130 3014 4790 4800 4307 7277 7916 18186 19005 12440
10605 12440 5679 1065 1139 -1649 -46 6360 11307 8295 -498 -5183 -4811 2158 6204 6710 2936
10590 2936 -673 1990 -785 -1707 -3485 928 606 7170 8811 12192 11178 15018 13073 13001 14090 10971
10574 10971 9279 12078 13153 9833 12243 16518 11281 10881 10164 11760 11154 3012 1473 -629 -2435
10559 -2435 1346 6446 10653 7853 6043 5687 5695 1887 299 10272 17481 14404 10645 8171 11331 13883
10543 13883 8125 2010 5162 8039 9183 11437 8979 14059 17940 21951 21076 15603 17884 17608 15594
10528 15594 14356 10882 12450 9468 14114 15321 15353 18603 23362 21579 19819 18751 20874 20674 19590
10513 19590 22537 23249 21708 22961 27315 31475 37821 33344 27401 24883 24853 27216 28508 20771 19446
10498 19446 20231 22936 22005 23492 16897 25507 29747 30000 25116 24121 29298 37965 44272 49961 50168 44097
10482 44097 43076 46301 48719 41366 33872 29096 32842 33097 32856 39362 50829 43559 38434 37619 48756
10467 48756 57145 51001 51901 54580 56634 60015 69483 60922 57611 60686 62532 65092 67237 70249 71216
10452 71216 70083 73465 82967 81451 76668 73997 76548 85891 91724 94946 105127 119447 128321 131651
10438 131651 131882 129943 124665 135544 143921 137894 145244 161406 173476 183533 196624 205279 215112
10425 215112 220143 234228 249688 264168 283403 299060 310801 331114 356721 380907 415078 441573
10413 441573 474155 515923 561211 611668 661057 716899 775907 843222 920955 999422 1095312
10402 1095312 1194657 1295734 1398991 1511008 1617502 1716570 1809250 1885220 1944030 1983261
10392 1983261 2005631 1999832 1967556 1932294 1875937 1793065 1706034 1621213 1532723 1447566 1362949
10381 1362949 1280826 1204797 1124529 1043947 977747 912796 853798 799164 745117 700026 656431
10370 656431 615135 582653 556798 527580 508246 492731 480647 471284 453860 428804 407786 389940
10358 389940 374339 359618 349769 330338 315932 304655 296245 279268 259695 252586 253217 248486 231849
10345 231849 215293 212634 211405 200318 197938 197004 187404 178048 169509 165792 161027 161367 157832 152991
10331 152991 151006 144212 142614 136722 134386 127207 124410 125676 123626 119205 114358 106711 109791 109515
10317 109515 104952 101357 101094 101409 94135 95036 96508 97459 94874 93116 83009 84050 86358 91701 88739
10302 88739 81411 73812 68559 61245 58282 58147 56491 52883 52179 47526 52570 54218 54468 57260 59842
10287 59842 55529 52113 50876 49807 56270 64937 70051 73898 71604 81374 96307 104707 111373 117810
10273 117810 121670 131651 142220 146273 146553 140496 130306 117671 103351 93474 80355 68928 59170
10260 59170 53516 48601 45892 48896 46734 43085 42836 39514 45082 47532 52337 47010 37226 35670 37424
10245 37424 34990 35277 30120 29594 28150 25225 23065 12004 7852 15257 29915 38890 34136 30404
10231 30404 31006 28593 22627 17390 21175 23964 25042 22646 25440 21606 17641 14166 11166 16063 18776
10216 18776 19880 15263 17422 14396 9537 10608 17592 21117 13950 17396 12913 14049 19290 21305
10202 21305 19138 12963 12053 8766 3736 10439 19334 17351 14854 10633 3790 3027 1927 10203 11751
10187 11751 10373 12112 8263 -105 2370 7330 3920 3113 -2427 -312 931 -1648 -4795 -2690 6269
10172 6269 9935 10292 9564 7681 4396 -299 2118 5704 9065 5912 4080 7043 10325 16382 5863
10157 5863 5433 5807 2734 2685 6346 9254 5717 2916 1192 -919 -401 -5487 -2235 1600 1612 3331
10141 3331 2551 -3525 -10381 -4476 -5203 -11469 -7616 5384 16858 19205 16416 8563 12775 14967 9764
10126 9764 11760 15030 8605 6722 7169 6243 5790 12849 16590 14728 7731 8985 10926 10765 9451 11140
10110 11140 6791 -3771 -503 1380 -764 873 3738 433 3969 9908 9939 3683 39 -736 3404
10095 3404 3517 3223 -1671 7384 9132 4615 -4032 -6149 -6941 -9011 -5145 4665 4015 -672 -30 2457
10079 2457 -2727 -6606 -5428 2263 -2352 -5767 -3803 -6366 -10790 -3489 -2095 -3008 1342 12246 12923
10064 12923 7964 1695 -9443 -8163 -8478 -5236 11 -4772 -4287 -4413 -6005 -1742 4365 127 1736
10049 1736 575 -1530 1174 4219 5456 647 -6080 -13761 -11113 -5261 -2687 -2476 -9125 -5909 -1263
10034 -1263 2069 1574 -847 143 -16 2480 6937 11192 4762 3165 4304 5294 -1744 -4861 -2303 2785
10018 2785 6875 3642 4362 7319 7046 3306 1142 -2418 -3496 -5459 -5817 -4670 -6321 -3258 1167
10003 1167 7246 7983 11766 14017 10583 2379 -5009 -9314 -3774 -342 2525 69 -1400 -5902 -341
9988 -341 1512 7864 13141 11679 10982 5375 12062 12367 5110 930 8980 24296 47372 73678 81027
9973 81027 75888 73102 75783 71429 66641 60759 49749 35724 27897 26780 26268 25437 22760 27836 28373
9958 28373 19870 10207 8322 12648 19318 20964 12889 11676 12759 9562 8588 7971 2975 3473 3800 5367
9942 5367 3805 -3234 -6662 -845 1861 -1237 -1082 2681 4291 -267 -5178 -912 -979 -1429 3764 151
9926 151 -3971 -6881 -1568 -5866 -5060 -500 3035 -2241 -4135 -584 -969 2611 7960 4076 -263 -6595
9910 -6595 -5296 -5848 -2048 -1811 1491 4089 -881 -4683 -1418 15608 15682 6517 1546 5092 4301 6191
9894 6191 6373 7312 8861 7422 3453 6329 14985 16985 16143 19719 21260 17335 13989 16802 19852 12329
9878 12329 6958 10733 20163 28614 29835 26648 35267 39836 51548 67132 87091 93422 100993 114358
9864 114358 123015 130593 127660 126767 131260 132582 130441 132782 140193 155400 177725 210690 250284 312104
9850 312104 420950 612786 862843 1126481 1288296 1345564 1376589 1357546 1231305 1033081
9840 1033081 845304 713333 614134 517754 429934 356154 307234 268590 242567 213203 190840
9829 190840 173401 164798 154289 143876 133123 125385 123073 126025 124318 113215 107215 97208 86931
9816 86931 77442 75947 69852 66076 64584 67969 70253 62244 63433 67667 65790 55980 48015 46420 50347
9801 50347 46000 42596 39668 32354 32186 28405 34583 39721 33956 24693 29557 34513 27458 27899 32284
9786 32284 33307 37783 39283 40714 43974 42519 43613 53011 50948 47525 39451 33329 38466 33015 25667
9771 25667 23867 22274 20987 17833 10189 10926 13304 21981 22250 16274 14120 17367 20197 16546 19740
9756 19740 15561 11298 10934 10287 16191 18894 18673 16492 15965 16834 10745 8033 4949 5046 4920 4960 4940 12916
9738 12916 17413 9346 4526 -3563 554 8932 5294 1217 -2446 -8575 -8428 -8272 -7799 -208 42 548
9722 548 5502 5923 6801 7437 8301 3655 -275 -6017 -8523 2678 7763 11635 2920 -5853 -8079 -11547
9706 -11547 -5626 2004 7038 2449 12 -1535 216 1617 -2562 -1428 8841 14626 9308 8228
9692 8228 7404 5247 2009 1912 -682 -3351 -3557 -269 -1452 230 5099 10997 9192 6597 3312 7266
9676 7266 5836 1118 1800 -865 -2526 -5712 -3422 -1957 711 4985 6947 5076 -2246 -178 1830
9661 1830 329 -1254 -6422 -8395 -3135 -152 1095 415 3870 -1169 -5588 -4373 -4061 -1235 793
9646 793 4583 14995 14719 10017 5239 2809 4111 3414 -874 -6467 -7469 -4587 -7674 -11972 -9452
9631 -9452 -9411 -10480 -16613 -13192 -5198 630 -751 1555 1740 -546 2163 -2592 -4012 2139 8250 5458
9615 5458 2959 11324 10556 3008 5736 10929 11200 5165 1415 -2031 -2714 -4727 -5251 -6162 -7398 -5394
9599 -5394 4621 4638 4004 80 -6303 -3745 302 503 201 -3568 -779 318 -1166 -820 -3801 -5847
9583 -5847 -8612 -9559 -5789 4286 -969 -3864 -42 4562 5049 -544 -2336 -2743 -3655 -3898 -5961 -3983
9567 -3983 -6770 -12789 -11394 -7313 -4147 -4791 -6625 -10480 -10807 -4668 -1899 -4569 504 -1273 -1025 3318
9551 3318 2285 -1924 -1980 1906 5320 8941 6604 5370 1852 415 -4113 -5608 -1167 6682 9544
9536 9544 6687 3357 3015 -1847 -10577 -9381 -6113 -168 -166 -4604 -5477 -5682 -3641 4932 4150 1147 -2381
9519 -2381 -1417 948 -897 437 -1096 -4364 -11850 -12447 -10155 -9026 -7424 1490 3107 5923 7945
9504 7945 7246 4782 8066 9823 4159 1322 -89 2786 669 -1329 -949 -3721 -5850 -8639 -8755 -6448
9488 -6448 1400 1911 1043 3052 5210 -2514 -10811 -17398 -14864 -15452 -13398 -4969 -8523 -6132 -4491 -4324
9472 -4324 -6116 -1838 -1076 -3727 -3567 -2562 -8423 -5263 -6339 1804 2066 3336 4810 3387 -4037 2115
9456 2115 8622 2829 -2136 89 830 298 1301 -1428 -4240 -1736 -458 1333 3843 4285 301 2170
9440 2170 5886 6492 7562 5972 6258 2714 7294 2129 -2616 -3060 6222 8165 7463 6613 3384 6115
9424 6115 8830 6166 3483 6841 -275 -2997 3161 187 1826 4024 5601 4800 5048 4803 8618 10447
9408 10447 10016 6352 7485 11432 9548 4681 6557 2998 2343 867 -844 -2262 -2495 -2152 -6340 131
9392 131 9600 4978 7267 7592 10972 11128 13714 14473 5843 -27 304 -2184 -9244 -4512 -2661 4594
9376 4594 9176 1576 2802 8711 7391 -702 -2580 -2331 -3691 -12663 -15867 -15303 -11027 -5929 -3049
9361 -3049 -10419 -4087 938 -108 -1637 -1515 -1125 1744 2972 -834 -2201 622 1635 -1498 -6020
9346 -6020 -9695 -9905 -16302 -18296 -22571 -16277 -2960 2281 2123 -6077 -4498 1360 2815 6912 8276
9331 8276 442 -5760 -9614 -8578 -8844 -6378 2701 1697 -2901 -4491 -2763 -6335 -3323 -1821 -2658
9316 -2658 -1297 -3184 -1401 -6821 -9632 -6165 4578 8787 9643 13395 10114 6356 2676 3132 8957
9301 8957 17444 16129 6161 8177 13025 15265 2025 -170 900 6155 6783 1903 -3414 -3780 188
9286 188 3831 1737 3595 7897 10616 9475 3889 4494 6234 11454 6822 3232 2533 1709 2340 3437
9270 3437 7622 7490 193 -1062 1653 5451 2702 2233 3253 2581 1784 11970 12392 10607 15605 13174
9254 13174 6826 7018 2799 7837 9997 7014 5602 1146 3892 8195 5972 5755 11061 10423 6787
9239 6787 3252 -213 784 4587 4429 7516 12698 12034 5500 5068 12949 8519 -2407 -9671 -19768
9224 -19768 -15606 -4824 10123 15292 14006 11946 15499 17388 16059 9169 12270 17894 5766 1476
9210 1476 2665 -446 -5084 -9607 -9661 -11114 -3987 -752 1501 1395 -1456 -3396 -4196 900 -4045 -13543
9194 -13543 -8125 -6042 -7900 -13408 -10286 -6272 -954 5772 1014 2061 1447 381 -3212 -3143 -485
9179 -485 -693 1491 6318 7318 3056 -560 -4558 -5007 -1168 -594 -1506 -2475 -493 1256 2842 -1993
9163 -1993 243 3441 3156 -3343 -4812 -5322 -6047 -4055 -5090 -1050 -3353 -2485 -3071 -2069 -1034 2303
9147 2303 2813 -4235 -6859 -2839 1265 -5233 -5937 -433 -1464 -1946 -7446 -5164 -2495 -576 -1120 -7049
9131 -7049 -7759 380 5815 4227 -684 3101 376 2551 3543 3454 2045 6413 8558 1290 -7749 -10496
9115 -10496 -6320 -9454 -12627 -14353 -9721 -3856 5042 8308 10830 8494 6078 4952 1775 3947 533
9100 533 -3658 -5260 1851 6226 4811 312 3107 4675 3410 2853 -5328 -1421 110 512 -10481
9085 -10481 -15618 -9278 -2749 -6592 -8566 -4902 -1681 -1325 -3272 -5984 -2259 311 5424 2968 -2421
9070 -2421 -2081 -4356 -2971 -213 1358 4218 2640 -2040 -4687 -5899 -5518 1149 3384 3757 656 -193
9054 -193 -222 214 -3052 -2369 2361 -4485 -4519 -4975 -6218 -4611 -6307 -4825 -4210 -4489 -857 -2179 2046
9037 2046 4000 -526 109 -2750 -8114 -8041 -325 -829 -2450 -2123 -7899 -6964 -3605 -1850 -4051 -6281
9021 -6281 -8680 -7828 -4762 -6104 -4110 -4959 -5420 -7269 -2695 3349 -2632 -5175 -5653 -3543 -4704 -4905
9005 -4905 -9992 -13947 -12058 -6377 -5623 -5821 -8494 -6445 -5596 -7761 -10517 -12851 -12268 -10023 -8871 -9578
8989 -9578 -8105 -7854 -11786 -16548 -14999 -13146 -16164 -6661 -6196 -10096 -4411 -3109 -8135 -4654 -1180
8974 -1180 1560 -1386 332 3523 -3086 -3306 -3436 27 1540 -4618 -6576 -6864 -6498 3079 8852 6914
8958 6914 4031 10964 11808 2709 -963 -3748 -6019 -10775 -16825 -19017 -15468 -6847 2077 5083 5922
8943 5922 5163 4497 7269 828 -1872 -7459 -11248 -6488 2347 -695 -4975 239 3677 3382 6356 8979
8927 8979 8698 2927 -1519 -607 3066 6958 593 -688 1450 -99 -2193 -796 -451 -6180 -1257 6786
8911 6786 6236 860 -2035 -239 1466 4011 4810 1488 631 1712 -230 -4151 -849 2304 737 1876
8895 1876 5944 5747 7516 7446 -926 -8382 -9030 -5173 -2728 3445 5761 4249 8039 10655 1963 -6747
8879 -6747 -7524 -6570 -2369 -7932 -5570 -3179 3987 4709 -3546 -6683 -6835 -4227 -3348 -3492 1624 8307
8863 8307 3518 -4481 -9944 -8106 -3363 -4778 -6577 -5721 -8870 -4874 -7795 -10677 -628 10877 10829
8848 10829 2015 598 3390 2358 1983 2615 1263 -3040 -7453 -13827 -14036 -16057 -10940 -938 3442
8833 3442 81 2591 1086 -4004 -6639 -15115 -6998 2979 4624 8984 10293 4731 -1729 6093 5064
8818 5064 -2438 3374 4304 4348 4013 6659 2570 -3363 -10507 -15221 -14661 -3554 548 -4476 -11550 -5895
8802 -5895 -1784 -7548 -3979 -839 -218 1741 -1836 527 2426 -2745 -161 -143 4480 1517 -1628 -786
8786 -786 -516 -2799 3193 4805 2780 -3415 -4928 -494 1560 -232 -2550 2443 3210 3011 9311 10405
8770 10405 6692 7082 4513 3228 2369 -111 5106 5612 6256 2449 3166 8567 7769 1398 2912 7214
8754 7214 9087 7869 8637 3345 -2474 -4580 -2239 -460 865 2733 5310 8680 15582 10436 7333
8739 7333 -863 -6039 -7180 -4961 -887 2021 1479 575 -216 -1464 -4131 5356 5447 340 -3525 -9214
8723 -9214 -9489 -157 6922 4368 4191 8247 1195 -752 -72 -150 -1547 2157 -9956 -13555 -15308 -7305
8707 -7305 -3694 -3082 -3889 395 515 -8255 -13956 -8917 377 2601 3292 7836 5943 4002 7172 8381
8691 8381 3732 2897 654 -3098 -3812 -9036 -9687 -6430 -6600 -13088 -15401 -16172 -13100 -6440 -4958 -9260
8675 -9260 -14572 -13956 -10704 -4054 -2447 -8038 -4257 3783 9525 11611 10523 6873 5803 11322 13968
8660 13968 8162 6137 8171 8244 6651 2228 3045 8983 12548 18400 15053 14119 15693 15769 16638 11118
8644 11118 5669 7741 244 -4444 -5732 607 6271 3772 -2034 -1772 3955 3655 3069 195 -3847
8629 -3847 3810 4079 3564 128 -3062 -1797 2234 8983 8252 7124 6265 9834 11145 10741 13796 8620
8613 8620 -514 2570 1329 -3370 -8145 -6784 -4417 -9734 -11859 -8849 -13236 -11537 -5608 -6328 -6524
8598 -6524 -8415 -12392 -11185 -3696 -4440 -7316 -3148 -2276 -2084 1250 2427 -1821 4750 20254 21789
8583 21789 17318 13816 4209 3286 7339 9649 9479 4034 3462 472 -3141 -489 -1557 533 -345 946
8567 946 8 -3229 -3225 881 2127 1279 4926 1011 2584 10321 7967 11558 10956 5193 4321 5364 6225
8550 6225 7849 6705 4084 6719 8580 11683 19052 19294 22627 13400 11824 18989 19745 18612 17153
8535 17153 20749 20811 9135 5989 7648 14292 15553 11322 2952 -1744 -7005 -5855 -738 -337 2606
8520 2606 7742 11095 10834 7185 2577 -7898 -3152 4844 10236 15080 14248 4700 1021 2333 -95
8505 -95 -1464 1318 -2637 858 6676 4718 1715 8050 14473 16020 17254 15637 8744 2346 3007 7534
8489 7534 6609 -2297 -6351 -7125 -10354 -11299 -6802 3342 17263 28037 35359 40757 44388 38686 40335
8474 40335 46582 48046 30981 16536 12860 10125 10086 6785 2183 8806 10244 3520 3577 -1213 -2907
8459 -2907 995 1231 -1898 -5507 -9145 -10622 -9032 687 7975 7072 8563 7152 5037 6671 7625 10098
8443 10098 13041 17969 14838 19168 30240 32289 31179 30925 33674 35398 27324 23462 30218 21756 12477
8428 12477 8531 6504 8999 7318 9761 2389 -3588 -5607 -5438 -8737 -9016 -8394 4099 8132 2376
8413 2376 -3446 -4300 -6954 -3393 -255 1694 4735 9020 6944 3298 4428 5906 12866 19844 17095
8398 17095 16917 7277 4167 2495 3345 -621 1791 4212 4439 4048 4986 5697 9031 15657 16931 15932
8382 15932 9825 1286 1281 1935 3893 2562 -4026 -9819 -5693 1407 3974 7133 4659 4135 2962 -2244
8366 -2244 -1513 3404 6734 7268 6423 6554 3041 -67 836 1735 -2901 -3009 853 1916 2293 -2085 -6862
8349 -6862 -6749 -5209 -5218 -613 2269 2622 678 -1405 -2456 3894 4749 1767 570 7002 5395 4763 -382
8332 -382 -3684 -6506 -7954 541 7543 6174 4276 4276 3164 -2190 1725 2795 -1127 -3397 -1656 -1890
8316 -1890 -827 -489 -3751 -1899 631 -804 -4109 -1887 -2655 3245 4378 3397 -1800 -6275 -7284 -5367
8300 -5367 -7153 -7524 -8327 -11628 -11608 -5466 -1299 1029 -65 -700 3688 5119 1577 2466 427 -3326
8284 -3326 -3564 -5413 -4279 4541 3691 2425 -201 -2282 -10109 -12502 -8548 -6538 143 -1460 -4960
8269 -4960 -1389 -2300 -4784 -3495 -3174 -3034 -9000 -11615 -5373 -7068 -3988 -3691 -5783 -4786 -598 708
8253 708 -10267 -10940 -5057 -222 4111 3055 -469 2617 7113 10039 7409 4562 2230 -1367 -284
8238 -284 5494 12777 11122 1374 1820 -96 -4243 -7643 -3983 509 2075 -3287 -6700 -7062 -6231 -4162
8222 -4162 -4659 -7867 -8385 -6427 -6856 -9789 -11307 -6395 -4094 -2580 -8601 -7453 -5114 -1067 108 -4564
8206 -4564 -5952 1914 7688 6094 5378 -688 -5823 2040 5808 661 -4952 -6853 -1061 139 6081
8191 6081 5635 6019 7044 6448 6288 2350 3349 1144 -4624 -913 1336 -3679 -2200 -2358 -379 -2365
8175 -2365 -7187 -5401 -4197 -8598 -12621 -9910 -6077 -9755 -10361 -5596 -1526 797 -2134 -7245 -5147
8160 -5147 1250 6118 3768 3421 8344 7580 1071 -6125 -6548 -7640 -1911 2498 745 -5701 -10004 -11278
8144 -11278 -14801 -13109 -9241 -5152 -12204 -13894 -10532 -13122 -13815 -9882 -6299 -2409 -4068 -2991 -7999
8129 -7999 -11053 -6847 -5389 -7368 -6386 -6644 -10303 -5621 -383 -823 -6306 -2140 224 972 -2027 -6981
8113 -6981 -2979 -1525 3416 9361 2347 6364 9466 -166 1580 5234 9325 5392 3693 3311 630
8098 630 -8322 -7414 -5184 -389 2531 2125 1841 7570 12978 8592 11485 9743 7646 9765 11192 9283
8082 9283 6812 -3176 -882 1863 -5972 -12157 -10784 -1556 2358 452 3143 4528 6512 1712 2258
8067 2258 4276 1734 1657 -1263 -7830 -10180 -4941 -1405 -2295 -1343 -5164 125 4943 10236 13819 12421
8051 12421 12620 4750 674 -1644 1144 -1622 6882 6523 5306 3418 6109 6441 2125 1396 4217 2651
8035 2651 976 4667 8989 12918 12203 3867 -3615 -12582 -14698 -4547 -7627 -7911 -1762 -1476 6560
8020 6560 7623 2496 5588 8877 2099 -2770 -12981 -13078 -6833 -9068 -3416 1892 -4748 -8335 -4946
8005 -4946 -2127 -5366 -7215 -2200 -1108 3945 6206 12463 17445 14514 12248 14012 12117 6715 6633
7990 6633 8125 8119 3365 -2389 -4746 -1203 -2744 -7874 -5126 -2142 2203 3311 4720 1618 -4375 -1641
7974 -1641 6169 7906 3664 -1118 1140 2153 5759 1952 2003 1039 1653 3040 7571 3536 -4378 -5439
7958 -5439 -6953 -916 747 2629 5622 3235 -1802 4694 6580 2595 232 288 865 468 -4025 183
7942 183 5332 5636 1173 -119 -8752 -3730 -2040 -4051 2584 8235 9664 14118 4780 91 -6654
7927 -6654 -3792 3104 2933 2529 -2555 1777 1794 1142 -2178 1250 2505 1830 -1272 -1716 -6618 -11392 -9025
7910 -9025 -2732 -1360 -3284 4498 -246 -5135 462 2557 7410 13828 13302 12007 9325 5677 9210
7895 9210 10168 8727 7453 -2599 -9098 -9797 -12320 -11136 -6945 1680 2850 -1474 -8571 -7212 -2398
7880 -2398 -3434 -6986 -7203 -7095 -6329 -8711 -6832 -8838 -6020 -9406 -8241 -7755 -11147 -13239 -10596 -7083
7864 -7083 -2389 5221 3204 -609 -5129 -8801 -6381 -1707 -4258 -8638 -10985 -5407 251 11638 11777
7849 11777 6611 3135 5831 3569 5468 8297 7144 10386 11319 4990 167 6370 13227 11284 3487
7834 3487 3503 6023 4516 9445 12848 12281 9980 8238 6954 10194 7133 -3678 -13304 -9608 -5722
7819 -5722 -6319 -4101 -7116 -3907 1416 2898 4768 6605 8277 4129 -4684 -10781 -11440 -8639 -4932
7804 -4932 -1467 585 2244 3098 3996 5287 3555 -1826 -8793 -6107 -4677 -4190 -5858 -7678 -11007 -8290
7788 -8290 -3494 -6833 -9953 -6122 -9957 -12256 -12765 -12183 -8589 -10432 -9321 -5698 -1017 -1891 -972 -1443
7772 -1443 -5108 -9453 -10938 -9099 -8663 -13859 -13122 -13822 -10033 -4828 -8363 -9918 -15173 -14530 -16862 -16108
7756 -16108 -14448 -8422 -8207 -4794 -4165 592 8074 14771 3088 -3323 -3293 -2927 -185 915 -93 -3012
7740 -3012 -5390 -9252 -8566 -4220 1204 1590 2465 -883 -1345 -2203 -5399 -2467 -240 -1857 -8248 -6863
7724 -6863 -7090 -3935 -3688 -1765 -3240 -10403 -5014 -2842 -3015 -2188 1505 3452 -228 -4787 -11665 -16971
7708 -16971 -22250 -24545 -19726 -15031 -9260 -199 4972 3880 99 -3530 -6695 -8982 -14667 -14543 -10765
7693 -10765 -9217 -12568 -15339 -13837 -9560 197 2915 7764 10038 2864 2804 4268 4741 3241 683
7678 683 -3750 -10701 -12036 -8855 -4838 -4779 -4175 2841 6844 2759 2131 -2628 -9730 -6877 -2733 -949
7662 -949 4816 7336 -1624 -9695 -13100 -9932 -7264 -7647 -8444 -5898 -5248 -5225 -1426 -8838 -10143 -7744
7646 -7744 -10650 -5750 -5039 -3160 -2453 -582 -1067 1249 57 3156 3209 -2802 -1372 617 -1004 -9416
7630 -9416 -11073 -7513 -9421 -2262 -8880 -13343 -14180 -13436 -220 4833 2678 1393 -1416 -4477 -11659
7615 -11659 -12391 -7514 -1893 -4316 -8787 -12302 -17230 -20454 -17221 -8937 -7111 -8006 -10765 -9294 -2207
7600 -2207 1954 -4469 -4082 -5297 -2591 3135 -106 -5858 -8632 -6181 -8949 -14286 -14821 -17052 -13050
7585 -13050 -12948 -10877 -17351 -20380 -17379 -13114 -9585 -13363 -8144 -12857 -9353 -4872 -303 -2782 -5329
7570 -5329 -2844 -4157 1363 -916 4097 7195 7343 4065 -5574 -10005 -9131 -3699 -930 -77 -474 5248
7554 5248 3541 -6601 -11635 -8526 -3584 2851 5750 8329 7328 9853 9923 3525 2169 -2 1424
7539 1424 -3987 -3103 4184 1503 -3147 -4770 -6180 -10439 -9025 -11058 -7457 -7875 -1909 -1101 -3304 -5565
7523 -5565 -8066 -6601 -6481 -8014 -9731 -4950 -3110 -2212 -7112 -4945 -2011 -5053 -10323 -7405 -6071
7508 -6071 -8520 -15601 -16074 -19602 -15861 -14800 -17319 -9610 -2555 -3166 -2188 3626 8138 7384 8275 10074
7492 10074 10661 4019 -5987 -5690 -1592 -8706 -16735 -15484 -13302 -17026 -10535 -5880 -3643 -4848 -2550
7477 -2550 -786 -2718 -5294 -6646 -10542 -8602 -8926 -11240 -11831 -13736 -8013 3092 3695 2254 103
7462 103 -2711 -688 815 1055 -1619 -387 2738 -1381 -1605 787 4978 9077 8565 1256 -6640 -2770
7446 -2770 -3929 -12185 -9477 -9398 -12054 -5836 -5439 -6595 -530 -2388 -6714 3347 3051 246 -1766 -1559
7430 -1559 -1300 625 6661 2341 2384 7797 4543 -2151 -305 -3787 -10330 -8112 -1417 -2402 -5374 -3747
7414 -3747 -158 -929 -13515 -16716 -10617 -7918 -16994 -23425 -17822 -10761 -2830 -2507 -2707 -4675 -1692
7399 -1692 -3804 -7565 -5179 -4247 -6122 -11061 -7437 -3959 1133 4050 -1831 -6323 -871 7056 6146
7384 6146 5072 -959 2465 5777 3748 945 -2677 -8160 -5307 -5745 -9469 -5715 58 -5592 -5282
7369 -5282 -1261 1278 4743 3578 -4422 -4727 433 -119 -1609 -5386 -7210 -10310 -10217 -7497 -2446 1843
7353 1843 4325 5501 7165 9527 4766 -1142 2615 7526 11885 6272 2298 1565 -3387 -5204 -509
7338 -509 -261 -3024 -7532 -3161 122 -2574 -8625 -6364 -5638 -6667 -7864 -1941 6329 9664 12440 3236
7322 3236 -5575 -2659 -333 2106 -694 -4265 -3886 -7623 -16960 -11905 -3914 -960 -4344 -4927 -41
7307 -41 2581 3151 6827 6203 2380 5566 2080 -5783 -3599 -81 63 2557 -1924 -4895 -6541 -3199
7291 -3199 -1864 -8213 -8132 -4249 -33 -2334 -4081 1864 5373 3393 5259 3296 997 7590 11902
7276 11902 10583 6992 2264 -4547 -8673 -4922 -2182 -511 -5415 -4050 4472 7350 -1497 597 1534
7261 1534 -4271 -1103 2104 -67 -843 -6564 -5836 -7847 -11641 -9843 -3610 -9285 -10368 -7566 -650
7246 -650 1519 -3683 -5304 -3626 -2846 -12107 -17975 -22078 -20629 -20255 -19880 -16472 -11290 -6783 4314 11634
7230 11634 8768 188 -2127 1461 -251 2952 -4783 -6564 -9073 -6955 -7887 -3350 138 3038 -1534
7215 -1534 -5240 -12068 -15650 -9156 -3374 4937 10691 8843 4693 8089 4278 -2346 -1613 3322 503
7200 503 -4302 -6009 -1668 -1211 -5085 -3874 -383 -2760 -7358 -7372 -6690 -5340 -9205 -13697 -12004 -5267
7184 -5267 -7126 -7846 222 -218 -7732 -13010 -10351 -214 5879 1419 -8917 -12229 -9858 -8773 -7362
7169 -7362 -4330 1760 2696 -1385 -4179 -10664 -7088 -6908 -8319 -3298 -3398 -620 2585 4945 -4644 -17787
7153 -17787 -20151 -10985 -1177 -2139 -4639 -6286 -8012 -10920 -11234 -10145 -4015 -3558 -3808 -5114 -9397 -11308
7137 -11308 -13994 -12048 -10421 -9888 -5150 -375 2976 -644 -2454 -565 -602 2045 697 -4021 -6468
7122 -6468 -9491 -11887 -7627 -3983 -4202 -2523 -9146 -3367 3711 5863 228 -4804 -5401 -1621 -848 876
7106 876 -419 -4648 -7227 -10282 -13305 -5771 1843 8435 1707 -3167 -3759 -3425 -6683 -5329 2406 5726
7090 5726 2649 -4530 -14866 -19713 -15156 -10540 -29 835 -9021 -7937 -11565 -8026 -3331 -1666 548
7075 548 2622 -1459 958 -912 -2000 2003 6883 8044 3932 -1683 -3784 -2127 4250 9720 7053
7060 7053 7328 -1922 -9594 -10487 -8114 -11359 -18887 -10838 -4010 -209 4209 3108 -394 -1322 -350 -2040
7044 -2040 3898 4772 -5899 -12805 -5276 -1598 -779 1301 -345 72 8960 10334 8343 5361 -3773
7029 -3773 -1534 -261 -861 -2268 -3832 -5593 -6775 -13932 -12240 -7377 -8422 -4105 2262 1578 125
7014 125 -1581 2078 -2039 -6526 -4633 -2807 2428 -456 341 3280 2830 -3247 -8949 -4817 1606 -780
6998 -780 1276 81 -884 4427 4566 2116 -442 -601 -369 -8883 -5729 -6018 -8907 -10658 3362 2752
6982 2752 -8138 -14370 -13141 -16676 -9398 -6214 -8494 -2858 -4296 -8501 -5024 -916 -776 1130 7970
6967 7970 11738 5564 -306 1358 -114 -2223 -1832 -1004 -100 1760 5543 -648 2191 10685 9848 8368
6951 8368 6102 728 4759 6353 -530 -6974 -11700 -8955 -5750 336 2791 -5149 -9734 -6837 -9813
6936 -9813 -6056 -175 -3478 -9136 -7817 -5024 -5207 -4775 -5237 -5885 -5568 353 1248 -6450 -9683 -4810
6920 -4810 -3187 -5291 -8292 -7822 -8129 -13660 -12300 -7617 -3881 -6191 -5017 -5898 -10592 -11075 -3047 -492
6904 -492 6943 892 -3785 -5683 -1286 -2055 -10036 -12967 -17475 -19601 -13986 -12220 -10598 -4748 -2647
6889 -2647 -3197 -4362 1453 7888 15944 11586 795 80 -1316 -1391 -3555 -11347 -17209 -12210 -7233 5730
6873 5730 13113 15691 11506 6471 3324 8652 5079 -2563 -3346 -1781 2565 4627 4638 2810 -2405 -2402
6857 -2402 2212 2720 -1295 -2357 -3881 -4189 -3675 -4355 -551 6248 3279 -2028 -4264 -1065 858 6421
6841 6421 10905 9187 5586 6701 6607 5922 1618 -702 -1313 -1068 2302 -1804 -8087 -10192 -6349 2179
6825 2179 2791 -521 -6733 -11025 -12417 -9209 -4288 -4216 -8903 -3827 -5515 -5179 -7367 -16537 -21021 -14529
6809 -14529 -5621 -6094 -7359 -114 4153 2103 -7231 -17561 -20509 -18867 -18619 -12849 -9873 -12590 -12248
6794 -12248 -14754 -12269 -8319 -9818 -12337 -12715 -12778 -4764 -1073 -2391 -3344 -1938 -255 -738 3316 6092
6778 6092 109 -985 -509 4366 4662 -752 -2426 -4705 -6844 702 7545 1402 -4318 -13950 -13688 -11393
6762 -11393 -4384 -6367 -4471 -2660 -428 -1045 -4773 -6107 -12966 -8466 -7598 -4320 -6121 -5068 -3736
6747 -3736 3965 12099 6628 -1702 -2061 -4467 -6681 -5959 229 -8065 -9252 -8773 2123 4788 1337
6732 1337 4748 8271 2425 1190 -644 -6347 -6264 -7367 -1433 5037 3290 -3269 -4268 -2427 -5601 -5760
6716 -5760 1151 14987 12017 1683 -2685 990 8635 4514 -4491 -3770 -3526 -4862 -2838 -2028 -946
6701 -946 -4073 797 1997 2705 2756 1815 1093 -2146 -5840 -3048 -3416 -4136 -11721 -10435 -6808 -4437 -2498
6684 -2498 -4136 -8521 -14471 -5387 -1156 934 1926 4575 1977 -4803 -11635 -11225 -10202 -4926 -12644
6669 -12644 -12995 -5342 -4635 -2110 -1928 -4540 -7565 -10812 -9121 -7379 2876 2704 4960 6687 9695
6654 9695 1244 -1764 -464 -5510 -7421 -7745 -7301 -7116 -9826 -4604 -4307 -747 -5881 -11723 -7379 -965
6638 -965 51 -1791 -1846 3808 5520 2040 -7371 -13245 -15655 -11228 -5651 -5683 -9115 -6534 -2635 -3153
6622 -3153 146 -157 -5575 -5491 -3121 -4755 -4588 -6990 -2815 -11924 -17634 -17607 -12312 -7698 -6109 -9270
6606 -9270 -7064 1024 -5395 -1526 -2024 -3622 -7761 -12127 -11731 -6927 -5683 -2538 3853 6991 5022
6591 5022 1772 2314 -935 -4354 -5948 -4009 -2901 2889 -179 -2852 -32 -8490 -11665 -10177 -12193
6576 -12193 -10350 -8954 -9164 -5130 -6791 -6503 -4889 -7637 -8544 -8165 -1763 -3980 -5529 -454 -2021 -4161
6560 -4161 -9920 -8155 -2916 -3158 -246 6220 12373 12311 8051 -188 -4767 -13407 -14858 -12426 -9462 -7555
6544 -7555 -3171 -173 1295 1371 719 6405 9525 13300 13400 8002 3294 1545 -4905 -8291 -9825 -16676
6528 -16676 -18480 -17431 -10152 -4158 -5692 -7448 -9407 -12818 -6730 -6745 -13550 -7031 -946 4573 1012
6513 1012 2352 8241 7423 360 -963 -1479 -5851 -8659 -8359 -2590 -2284 -8737 -12340 -9384 -7370 -2695
6497 -2695 -837 -6512 -10430 -12531 -9500 -9345 -5266 -4778 -10368 -8654 -8055 -7082 -5704 1329 3628 -876
6481 -876 -9445 -12579 -13490 -14158 -6758 -4262 -6340 -7295 -4990 -6520 -5754 -5279 -7500 -1356 -377 3203 6288
6464 6288 -15 -8463 -11513 -8450 -9796 -8988 -3216 -1574 4786 4987 4456 6262 8667 10486 11260 9404
6448 9404 6534 6039 8248 9855 7084 -2461 -6519 -12278 -18522 -14968 -9029 -4568 -5528 -5334 -3332 -1775
6432 -1775 -4800 -6369 -2241 -1691 -2788 -9739 -10256 -12620 -18380 -13175 -4108 3412 6428 7771 6228
6417 6228 10271 4491 112 -4516 -8960 -5837 -161 6000 2689 -8526 -11953 -3794 -4931 -9186 -6301
6402 -6301 -2862 -2030 2069 392 -7384 -4617 -3238 3804 5166 1974 5577 6116 8056 10361 10131 4074
6386 4074 -2650 -9343 -5085 -4984 -1717 -2280 -298 2121 300 4336 1851 1669 3120 5172 2319 4818
6370 4818 4096 -643 2810 -1035 -5161 -8305 -13610 -14471 -14408 -17940 -21946 -12702 -2784 -990 3517 1213
6354 1213 904 2054 6492 8054 6114 -2302 -10507 -13424 -14951 -8515 -5274 -2939 -218 704 -7415
6339 -7415 -11492 -7110 -1570 -5469 -8657 -6358 -6672 -1330 7442 13231 10199 2214 -4978 -5550 -3729
6324 -3729 -493 -4832 -2624 -2494 -1735 1749 2588 -1627 -4990 -9471 -7880 -9139 -13949 -14623 -14882 -10808
6308 -10808 -14557 -16432 -15324 -3555 4234 2731 -1275 49 274 1757 11107 7340 -1106 607 -3633
6293 -3633 -9220 -9827 -6893 -6415 -9729 -12833 -8527 -6690 -3867 2613 121 679 3038 956 -4028 -7268
6277 -7268 -9312 -10285 -10843 -12549 -9458 -3666 -4837 -3297 1628 -1838 -5631 -10539 -5636 -2709 837
6262 837 -3788 -10723 -15411 -18224 -7765 -3983 -6973 -10237 -9411 -13704 -12860 -11373 -6669 -6756 -10515 -6378
6246 -6378 -3481 788 43 97 -4519 -5918 -4903 1840 3102 -4729 -1127 -739 -9437 -13749 -1249 4934
6230 4934 3239 -601 -2090 -2424 1150 1534 -5562 -1142 1065 3355 6125 1310 -3617 -6531 -9294
6215 -9294 -7168 -512 6337 5556 4251 -528 -3421 2481 1296 725 648 1900 1689 2230 -2269 -6121
6199 -6121 -14997 -10658 -247 -1753 2949 6556 1438 1354 4091 10342 13728 12132 9379 11659 10674
6184 10674 3942 5990 1521 -707 1493 1784 7838 7299 2781 6442 6208 2832 275 -3283 -2257
6169 -2257 -3591 -5903 -4047 -2102 -8190 -4643 -3133 -5742 -3596 -1842 -2982 1571 -4553 -7906 -2682
6154 -2682 2655 -1294 -7026 -5106 -2313 -771 -4831 -914 4386 3485 -1000 -4101 -3870 -4227 -4539 -4487
6138 -4487 -9801 -6748 1796 1653 -5109 -473 2665 3521 -975 -2069 -3844 -2420 1575 4922 3382
6123 3382 6785 8801 1165 -633 4558 1751 -3959 -7241 -9262 -10362 -12701 -8795 -7792 -12500 -6575
6108 -6575 400 -930 778 4914 6216 4749 3615 2625 3387 1503 6138 6364 2447 -1214 -3859 -3580
6092 -3580 -16584 -19647 -16062 -12542 -10614 -2782 5485 4211 -8162 -13702 -5197 -4770 -7667 -11261 -16068
6077 -16068 -13021 -14121 -23970 -21597 -11759 -11251 -11626 -12161 -7453 -7521 -4327 -4022 -2869 3826 3081 674
6061 674 2244 4833 8197 8241 3341 -95 3103 1561 -2318 1096 2854 -2451 -6375 -11022 -10562 -14908
6045 -14908 -13746 -4878 -6722 -14079 -12199 -8802 -13767 -9031 -1946 -6189 -6168 -2492 -3579 -6226 -13691
6030 -13691 -11892 -4432 -6116 -8071 -4104 -3847 -3326 -4532 -3711 -706 6997 11061 8653 62 -5338
6015 -5338 1957 8103 -289 -2863 -1193 5957 5565 2957 3733 -1530 -9010 -8807 -4943 -3331 -3442 -153
5999 -153 -534 -4386 -6343 -6093 32 5651 9637 11937 13821 11443 5517 -1393 -4630 3927 5624 7210
5983 7210 9063 2656 2972 -796 -6257 -2584 4493 6269 2481 -4861 -5673 -5420 -6061 -1148 -5896 -12846
5967 -12846 -8399 -6842 -15919 -14209 -11391 -11997 -11218 -11380 -9425 -10837 -3202 1548 -4050 -4264 -2683 -1623
5951 -1623 -5219 -8337 -5739 -5747 -5196 -8553 -7121 -3705 -1959 2590 2089 -4233 -10825 -6462 3099 -872
5935 -872 -5823 -5153 -4976 4747 9460 4377 3523 207 -8246 -9087 -2060 -488 4054 70 -4731 -91
5919 -91 5112 2106 -2341 -6310 -5512 -6835 -11511 -11302 -7079 -6193 -3973 -200 -1716 -3874 -7881 -12426
5903 -12426 -4770 2433 -1376 -6395 57 4322 1814 -458 5832 6024 508 -4729 -5885 -10169 -9778
5888 -9778 -6520 -4240 1086 1354 -777 -8265 -9859 274 5396 9421 2896 2879 833 2632 5417
5873 5417 7490 7431 4047 2885 4315 2103 6464 8893 3399 1520 1050 -2527 608 939 -1311 -232
5857 -232 -694 -5815 -1936 -2425 -2325 -5508 -7485 -6791 -5242 -3959 -703 -748 -1280 -4204 -6693 -1797 2301
5840 2301 -2937 -5149 -7127 -9286 -11064 -10899 -4793 2672 5377 2762 1230 1765 -1541 1902 -238
5825 -238 -2354 1563 -144 -2920 -137 5351 6636 3387 5392 -1122 -2259 -4298 -1242 1749 -1584
5810 -1584 -8377 -3762 -3816 -8760 -10820 -8500 -5390 -5294 -2402 2193 7875 10813 9709 -1764 -8611 -8804
5794 -8804 -17547 -15121 -6031 -8931 -6641 -2028 -2601 -313 34 5261 5984 -2498 -3417 3575 8373 7027
5778 7027 -1378 -7025 -8804 -8310 -10414 -4243 2204 5239 691 -76 -4057 -335 -6729 -13214 -7792
5763 -7792 -4251 -5479 -8601 -9064 -1368 -2406 -4989 -7173 -6599 -6329 -12976 -11035 361 6994 5728
5748 5728 1351 -6583 -9958 -4918 -5998 -2998 -1415 -6201 -6278 2841 4613 768 -3315 -192 1893
5733 1893 -579 -1514 2549 7622 -2108 -3374 -6734 -1339 769 -91 -4470 -9187 -3951 -970 2466
5718 2466 3023 -561 -210 -5923 -4235 -2194 -5354 -2704 4331 4411 1496 5106 923 1404 5565 3300
5702 3300 -1448 -6160 -4953 3514 15239 12353 3434 4466 1965 -2047 -6900 -13319 -10675 -1106 725
5687 725 560 -5055 -8608 -759 300 -771 -5002 -4635 1233 5653 3113 5201 2626 -5694 -11166 -7685
5671 -7685 -7171 -6949 -1854 -1852 -7243 -9321 -2737 1306 -32 -526 1283 6250 3840 5398 8018 8868 7871
5654 7871 8545 7361 10913 4148 4249 11387 13179 8638 7901 8389 3278 3429 6965 5478 213 -5949
5638 -5949 -15175 -8920 -2206 471 -884 1691 1381 1853 3920 3236 3762 1758 -5025 -1658 1620 8303
5622 8303 14338 11702 10699 9137 12114 7069 8784 2569 1204 -5582 -4392 -8450 -3179 3439 2997
5607 2997 1044 -962 -5695 -7473 -2916 -6114 -7974 772 766 3341 3981 929 2095 -1486 2027 -2300
5591 -2300 -3318 -9966 -5556 -872 -2941 -6262 -7604 -7508 1607 10583 11946 10352 -2709 -11028 -8422
5576 -8422 -1939 186 45 1582 -5628 -8802 -1129 -2023 -114 8969 6037 1617 1649 656 593 -2116 -5792
5559 -5792 3664 12151 11162 7248 329 -8966 -16066 -19800 -13595 -7403 -6819 -2365 -8820 -19094 -17811
5544 -17811 -17229 -6452 -2701 -1796 6400 4663 -825 -9766 -12117 -12751 -12574 -16579 -19140 -17477 -14756
5529 -14756 -11463 -9782 -12349 -11307 -8092 -5278 -3870 -1518 -7424 -9490 -7253 -5067 -3645 -1565 -6572
5514 -6572 -7596 -5197 -455 -736 -5955 -2296 1449 5347 10094 12404 7550 1451 5418 -1110 -4607
5499 -4607 -3519 695 1783 -1872 136 -6205 -11469 -19383 -17991 -17244 -12500 -5792 4567 8223 3295
5484 3295 -2133 -6319 -11999 -18098 -15127 -6105 -4808 -7169 -5925 -7816 -6477 -3581 -6584 3005 -2172
5469 -2172 -5014 6100 8716 4705 -1348 -1854 -7136 -1092 2073 6778 7999 1398 -231 -1744 -1185
5454 -1185 638 1420 -1309 -3969 -6942 -5725 -2009 -2641 -742 -48 3913 -6715 -11178 -11293 -6398 -2419
5438 -2419 -531 631 6268 790 -2101 -1152 6130 2929 -369 3457 7773 7996 3768 4073 1210 4240
5422 4240 12348 11424 687 1444 5364 11753 9675 7738 6524 3979 3649 6182 9340 9532 7621 4930
5406 4930 -831 -3599 -2524 -5953 2040 2786 -4720 -9099 -13920 -16114 -14817 -5176 1181 3909 532
5391 532 7408 15865 7788 6759 4954 2861 -5120 -9915 -14027 -12050 -11456 -14240 -13349 -7263 -919 2331
5375 2331 2713 2649 5031 -835 -6192 -7879 -3539 400 -611 876 -845 -3676 -3928 -5521 -1716 -5877
5359 -5877 -11107 -9959 -9768 -6407 -7442 -4144 237 6689 10089 9959 6378 5099 3434 5950 6454 1117
5343 1117 3688 -712 -3457 3557 3505 -58 -3505 800 4541 1457 1033 7312 9404 3689 3448 9983
5327 9983 13945 9855 3842 1495 2816 9458 4321 4459 4295 2005 369 -7749 -6332 -10430 -14126
5312 -14126 -11123 -3047 -939 -333 -2840 -6043 -7286 -9634 -5244 -1181 -252 332 2455 5038 1769
5297 1769 -10152 -16093 -11788 -9536 -9879 -5801 -3768 -6557 -7465 -3805 246 -1778 -3409 -2434 1255
5282 1255 2361 4044 -4773 -9508 -8924 -7537 -9280 -12102 -7584 -6117 1204 6634 10432 11851 10825
5267 10825 12005 13865 9227 8253 13489 12265 1188 -8252 -11069 -3911 1703 4800 9495 4065 2227
5252 2227 8553 17401 21828 15201 10928 7659 2801 -3243 -7859 -2546 4317 2593 911 -2954 -8768
5237 -8768 -11725 -11386 -5182 -2271 -3667 -1314 3006 1033 -2737 -4362 -3954 -3537 -5463 -5478 -3437 -770
5221 -770 2625 5492 6904 6312 4145 -2319 1160 4174 5296 45 5216 6268 -4831 -11049 -7511
5206 -7511 -2016 -2648 -7642 -5990 3799 5603 2421 4579 3379 -1839 -14103 -13668 -13200 -4810 857
5191 857 -4736 -3862 -9056 -6702 -4663 -7675 -3412 -2199 -2667 -96 175 734 4960 5956 5087 -145 3276
5174 3276 2348 324 6624 362 -5929 -5978 -2161 -3765 -4906 314 7259 1470 -1075 4310 8515 8269
5158 8269 7454 5273 7181 3752 722 -1915 -4420 782 -4531 -12694 -10115 -8317 -6431 -8028 -7112
5143 -7112 -4067 -8597 -11738 -2812 1099 2127 -5032 -4113 -3885 -2732 -1893 1004 -1270 -8848 -8911 -10566
5127 -10566 -9252 -5696 -6851 -10324 -16680 -13583 -11769 -11700 -10163 -9933 -7807 -3934 6858 9975 11562
5112 11562 12850 6684 1827 -1274 2050 4522 9706 960 3769 2785 -7261 -13750 -6743 -1352 -2658
5097 -2658 -10856 -9672 -5565 -4279 -3205 219 2241 5099 5541 8239 8113 6665 3755 2313 -1352
5082 -1352 -4533 2059 4037 3466 593 -5855 -12244 -17207 -14654 -14604 -11760 -8569 -7997 -10497 -14673 -5872
5066 -5872 -5069 -3578 -6422 -8421 -7289 -9032 -10220 -7299 -7755 -5142 -1078 3741 2284 -5161 -3813
5051 -3813 -5136 -8048 -6463 -5797 -6079 -3348 -2208 -7013 -9720 -9730 -7202 -2894 1371 -936 -192 2763
5035 2763 5556 9715 12010 6346 2394 559 -910 -1857 -2217 -1003 225 1619 3166 2695 12101 18529
5019 18529 13488 13221 14929 14970 10942 9444 7133 11214 9700 7518 7406 8011 5449 -4071 -5265 -7398
5003 -7398 -2551 1016 -1360 -1545 -4872 -2871 -5047 -6406 -8222 -2710 1060 3256 2980 2689 1878 5182
4987 5182 9822 6011 2270 2457 2326 3920 319 -4290 689 2645 -513 -6117 -6857 -6123 -4916 -2834
4971 -2834 2629 7431 597 -2511 -5975 -11172 -12840 -11344 -11756 -6347 -4841 -5023 -3803 -6506 -10425
4956 -10425 -15736 -11588 -5032 -895 725 -5404 -11180 -10778 -9075 -1600 -702 3130 6016 8821 2902
4941 2902 -4180 -745 7676 10840 11866 14732 15883 12955 11283 9017 3439 3722 357 -5729 -4621
4926 -4621 148 5052 6971 8920 6225 2543 1489 6132 2195 -365 5815 5731 355 -5625 -7005
4911 -7005 -1387 2179 6324 491 -5589 -6694 -8710 -5002 -3929 -5458 -4530 1260 5282 2183 4473
4896 4473 4442 788 4229 2365 2418 5680 5561 3280 -3053 -474 285 2095 1942 2742 -2760 -7960 -9059
4879 -9059 -5770 -3420 2123 -3412 -7080 -4247 -8323 -8438 -5379 -5183 4239 6583 2011 784 5576
4864 5576 10239 10383 7941 611 -722 2247 278 -6874 -4451 -3559 756 408 -7643 -10408 -3801 -1487
4848 -1487 -4983 1464 7534 2257 -3101 399 1394 4234 6050 9336 4628 5668 -574 -2165 -1230
4833 -1230 -6570 -12053 -11892 2504 -901 -7022 -2648 4403 9525 6583 4674 4269 921 3232 3487
4818 3487 827 5508 542 -3355 -945 -98 418 2093 1874 3258 6237 4610 110 -6713 -14369 -8515
4802 -8515 -4387 -460 1141 -5008 -9266 -7466 -2405 -2922 -6250 -3197 1879 -1561 -5395 -6105 -3248
4787 -3248 -677 1227 -2038 -4263 4153 12715 12787 8536 3039 8414 9205 6767 3015 1750 2095 3893
4771 3893 -1217 -3358 -3703 -2275 6768 6257 928 5109 1264 -4499 -8288 -5309 1636 5719 6091 3840
4755 3840 6641 16044 10216 1323 -1854 -3643 -1329 -1423 774 -2424 -2142 -8052 -10653 -5044 -2074 -3090
4739 -3090 -3594 -3709 -975 -1458 -1347 -6346 -6626 -6693 -1411 80 -630 7353 7354 6028 4253 8495 6874 6045
4721 6045 -1951 -3516 -2320 505 2672 3455 2987 3659 -1429 -7365 -6468 -246 3235 -109 9843 9788
4705 9788 4299 464 -4773 244 4138 1848 2522 1894 735 -1427 -676 1629 -2010 -3906 -443 -2481
4689 -2481 -5790 -4547 -2538 767 -3765 -1508 -1752 -6373 -14541 -16450 -11418 -10612 -11273 -9969 -9275 -2788
4673 -2788 766 142 -3280 -3164 728 393 -2113 -2374 -3748 913 4114 1857 551 -171 2849 2262
4657 2262 -4404 -6996 -8244 -7515 -6240 -1415 -3071 -9471 -753 6516 7135 6451 12424 10512 5518 2178
4641 2178 -2484 -2549 3363 10645 7423 1815 -3877 -2939 -4915 -6158 1391 3734 5631 10755 11453 6309
4625 6309 2149 6261 7397 9195 11052 3696 -455 7419 8674 6450 9096 9002 3894 5529 -708
4610 -708 -3551 -5382 269 1917 3239 -2635 -8625 -5927 -2486 -4963 -10772 -11225 -6800 -5975 -4998 -3672
4594 -3672 -5283 -6780 -2255 4216 4734 8970 8135 1241 10 1508 4997 -95 -6101 -8177 -14353
4579 -14353 -16573 -15012 -9342 -6854 -1569 348 -1294 -3301 -620 -2509 78 -3045 -9325 -10757 -13622
4564 -13622 -12672 -12248 -8711 381 6136 5177 810 4311 9279 3921 -2525 -3562 -2159 -1688 -208 4629
4548 4629 6674 4984 2853 4660 3698 1259 -2047 -2337 4629 5757 6276 2866 1614 -320 1330 3961
4532 3961 4979 -553 -2589 -2667 696 2475 4222 -1287 -4019 3612 3488 2644 1361 -952 5009 14299
4516 14299 14941 8284 5448 2498 2095 -546 486 9833 8847 3124 -5908 -7397 -10605 -9060 -6368
4501 -6368 -449 -1180 -1462 -3222 -4328 -8366 -3145 4707 -235 -3482 -2377 -1636 -1563 -4799 -4653 -5955
4485 -5955 -7464 -3973 -3093 2251 3932 6556 9268 4906 -2898 -10343 -5812 -1600 -2841 1806 5119
4470 5119 6137 3509 3690 1723 -2421 -5634 -1689 7000 10299 8852 -231 214 1911 3040 10319
4455 10319 8379 8949 14285 17722 14376 11003 5047 8398 9308 13662 11610 8412 896 479 3481
4440 3481 5013 6792 -333 989 12191 16257 10069 5763 11775 12234 11263 11750 1996 -3823 -5546
4425 -5546 -660 1360 -4001 -635 3192 -2074 742 2611 4462 3346 1512 -1338 -4131 -1779 889
4410 889 2083 7427 7617 -2977 -133 3998 1950 1169 -2102 695 2969 1783 992 -1595 -5738 986
4394 986 7597 11726 12095 6361 -765 280 638 -2533 1985 1986 4222 2184 1793 3799 2396 6881 9916
4377 9916 6027 5849 4405 5911 14611 10357 9032 9097 5940 -2310 2084 5683 4539 2071 2660 2340
4361 2340 7141 5235 10365 58 -5146 1869 4629 5504 1955 7985 10075 7251 5994 295 -1542
4346 -1542 429 -682 -1339 -2605 2107 4567 3200 165 -3133 -11456 -10984 -959 -2899 493 4443
4331 4443 2048 5367 7924 5493 2525 423 -899 -1229 2946 2923 3169 5358 1332 -1600 2038 6333
4315 6333 12329 8972 1388 -3127 -3543 328 -1755 -2985 -1937 2744 353 -1877 -3485 -2809 2006
4300 2006 8479 6630 -2367 -9234 -11312 -1095 1763 -1355 -2496 -644 652 1053 -2124 -4617 -3976
4285 -3976 -2178 2756 5303 3380 5402 5914 7913 6374 6830 7415 1047 -5080 -5933 -5700 -3807 2391
4269 2391 430 -5300 -3763 5160 9403 6691 3984 5843 9622 13748 6190 3861 4286 -1060 -2223
4254 -2223 -1501 -2857 -3310 1107 -3433 -8812 -7041 -5256 542 6980 4272 642 -8036 -7025 -5458
4239 -5458 -10227 -5690 2923 8942 3625 -714 772 -5633 -7752 -689 4143 253 -4687 -3666 -371
4224 -371 2531 2453 -8881 -6747 -1964 -10718 -13178 -12757 -8111 -5289 -7397 -7222 -3588 -11064 -7004 207
4208 207 1931 867 -166 2405 3995 10041 10916 11599 6845 10206 19093 18290 11752 3866 -1945 -8106
4192 -8106 -5481 -3006 2670 4147 1269 7743 7208 7163 2947 3497 -981 -3536 -1356 -2250 -465 -43
4176 -43 -5227 -5722 -3130 555 7954 14137 10140 4076 -1420 -5199 -6355 -4853 -521 3884 2169 1475
4160 1475 312 -4933 -3933 6048 11892 7221 6480 6068 2571 2405 -517 -5240 -4160 -1553 -660 4198
4144 4198 -693 -476 4389 1315 3101 9230 9023 4017 -1174 4255 2901 2453 386 4859 7392 5952
4128 5952 -801 -377 -3362 -1728 2405 2151 8857 7112 2044 3523 3656 -2329 -3152 -4068 -6439 -3155
4112 -3155 -2661 -2542 -8249 -3820 3375 8810 8800 1539 -181 2668 3006 3316 -7808 -8181 -7112 -8496
4096 -8496 -10824 -6901 -2320 3483 7284 1281 -3950 -8313 -14561 -7376 -2920 -3579 -1947 -3393 -10033
4081 -10033 -9957 -7586 -4375 5990 7742 11863 12635 1395 -5195 -6170 -5920 -1870 4680 10378 5247
4066 5247 3608 6302 3833 -2958 -5068 -9293 -11412 -14552 -11229 -4786 -1594 -1960 1294 3516 4756
4051 4756 -721 971 3002 -2523 -4384 -8145 -7289 -6786 -4901 -209 -1717 -1948 -1340 -836 4147 5477
4035 5477 7243 9124 11394 9451 439 -10035 -12452 -8470 -3927 -3104 1752 3066 879 1458 -519
4020 -519 3752 7326 5105 6556 11012 7064 2790 3503 882 -2136 1715 1315 3789 7644 4923 1775
4004 1775 -2039 -4317 -593 91 1260 4824 806 -6103 -3676 574 -5474 -15703 -19410 -15199 -10507
3989 -10507 -2682 2752 7688 7259 4852 4541 4055 -1305 -3510 -805 -2129 -6286 -3970 -4502 290 -1621
3973 -1621 -9929 -5991 -2468 -2181 205 -2443 -4786 3352 2199 1085 766 -355 -6996 -9282 -13573
3958 -13573 -10665 -2983 -1444 -2482 -3518 -3303 -1686 676 6310 809 -1505 1462 4421 7044 1434
3943 1434 -8214 -11873 -6227 -2140 -192 -1962 64 -4684 -4971 -2676 3440 -529 -8539 -14032 -13310
3928 -13310 -5130 -4869 -6785 -7145 -10591 -16519 -12311 -6912 -8197 -6029 -4523 -5247 -6396 -5131 -7495
3913 -7495 -3695 6587 6366 5644 -1361 -1796 1606 5095 7200 5668 1203 -389 -1651 -5833 -1673
3898 -1673 -470 1582 8990 9939 11868 11757 9987 9530 9205 13963 18040 18282 16754 8321 2513 -4598
3882 -4598 -2265 -2005 -5498 -7495 -4297 3767 4062 4513 9540 16496 9775 3782 2445 -2488 -5810 -4437
3866 -4437 -4142 153 -4437 -10067 -9482 -3529 3323 3774 -1189 -3154 -5488 -3801 -6271 -5720 1774 5704
3850 5704 8880 5758 5207 6861 12647 10833 4944 -2243 -6453 -2864 4953 13594 13710 9059 1885
3835 1885 -307 1679 4323 6075 9134 7754 4720 -4246 -5941 -5041 -5652 -564 837 5268 9645
3820 9645 8294 2173 1665 3885 6538 5366 588 2640 2207 -2534 -3952 -1618 1238 3112 -1242
3805 -1242 -7532 -13992 -9821 -4970 811 -525 5280 4358 1892 6341 10434 11494 13529 12082 5284
3790 5284 3258 2799 4924 -3889 -9954 -9944 -783 2379 516 -4274 690 -1469 -388 -870 -1498 1110
3774 1110 -2999 422 3342 -1444 -778 -4364 -2499 3257 7832 7850 5438 -6773 -6375 -1039 -1005 -2997
3758 -2997 -5076 -3479 1622 4174 8446 9695 5230 -1703 2746 1186 -1741 -718 -1951 -6877 -10263
3743 -10263 -3531 1103 2391 2889 4895 -15 -5199 -2480 -5530 -7820 -6710 -2700 -1046 -6607 -9593
3728 -9593 -6348 1670 1506 3255 6491 5535 1116 -6378 -13881 -9385 -7661 -10165 -9039 -7409 -7944 -5597
3712 -5597 -1916 3943 4503 3787 5922 4892 4565 8274 3948 1292 -6528 -8263 -2534 -4787 -10642 -8155
3696 -8155 -3788 -4163 -7218 -3006 3873 4520 5684 5313 -1307 886 6393 2543 -4613 -4275 -1437 8551
3680 8551 5414 549 -987 216 426 -1606 1060 1847 4727 1989 -3951 -5686 -5186 -1804 1111 7447
3664 7447 10373 6793 1596 5893 3641 -2026 2748 1380 -2808 3466 439 -1520 3069 386 34
3649 34 -6159 -3211 3603 5948 3759 2989 7544 3970 -2935 -7316 1041 7129 12181 12735 7874 654
3633 654 3418 6927 7346 4785 8836 8038 -1827 -4525 -110 1388 2277 -709 -4964 -322 5902 3977
3617 3977 -1946 -1977 -5401 -5975 -2244 -772 -536 -8005 -16012 -15204 -8835 -9794 -7055 -7710 -4064 -580 208
3600 208 171 4683 4824 6581 10462 9156 4363 9930 8852 -1269 -3115 -1250 -2127 -5639 -11934 -11612
3584 -11612 -10320 -8929 -9870 -8726 -8163 -9479 -3451 272 -2440 -3163 2304 4933 5599 10411 9634 -3663
3568 -3663 -8426 -7703 -8263 -6525 -13544 -18171 -12679 -7530 -1767 806 -7205 -4003 -932 263 -5386
3553 -5386 -2863 238 1585 2176 4422 8518 8970 3870 5095 3965 -4950 -6037 -4579 -2665 -652
3538 -652 -5037 -1619 5062 2729 -4852 -2680 3151 -858 -8898 -11891 -6360 -5619 -1804 2617 7912
3523 7912 5144 2594 6587 10873 7647 -3091 -7315 -11300 -8127 -3419 -1220 -3599 2423 6305 7075
3508 7075 11516 9882 12554 13196 7500 7664 9369 8274 4839 530 234 2614 6804 2879 788 4758
3492 4758 2270 -6267 -10289 -7144 -11812 -13117 -11969 3971 11770 11042 1946 -480 -2669 -1939 -1582
3477 -1582 168 2566 7176 5398 2084 -596 3247 6826 4686 -604 -2552 -8267 -6489 -3141 1014
3462 1014 796 3755 387 -91 -375 -1289 -600 -1483 1776 2779 5559 3063 4372 12481 12313 13876 15241
3445 15241 10480 3228 -2691 -3509 -8928 -3907 669 6956 6522 1237 -836 2867 7118 6367 2762
3430 2762 4651 1786 -1109 1214 18 4068 2754 2516 2334 2475 7172 12988 8698 2275 -5296 -6087
3414 -6087 -2233 -295 1441 -1881 1787 6974 6611 1515 3556 -944 5695 8206 6678 9870 10190
3399 10190 8483 3503 4685 3137 3848 1388 353 3589 3025 6819 10328 10349 11724 10718 9766 7912
3383 7912 4484 -1875 -5407 -9462 -8190 1223 2711 1133 4062 6251 5112 6813 9120 6674 2689
3368 2689 -1479 -913 -1159 6902 7329 825 -3773 -1637 -1687 4252 5064 4498 278 2017 3618 7004 8160
3351 8160 5945 5295 3904 4173 6067 12589 8922 -2344 -9189 -12002 -10255 -2834 4256 6706 3546
3336 3546 -3250 -4060 -5564 -8981 -9835 -4116 748 -3947 -2319 -2752 867 11719 15250 9092 -19
3321 -19 1092 2038 -5383 -3179 -7501 -5423 -4272 3235 6759 6227 4946 6448 8972 6296 98 -1308
3305 -1308 -2195 -4029 -1539 5438 6128 3424 6934 5241 4497 268 2222 -2027 -4100 -3994 6614 2680
3289 2680 3233 9007 4326 1033 -23 1823 -765 1741 -4517 -4210 1196 121 2577 3471 9857 12367
3273 12367 7415 -6149 -11275 -7014 -4316 -10447 -10834 -8088 257 1921 -837 -3814 -8238 -13186 -12599
3258 -12599 -16457 -13520 -7958 -4715 -6640 -6378 -7800 -5109 519 799 -7253 -14308 -14522 -11694 -12299 -9144
3242 -9144 -11033 -9802 -6126 -2491 213 -271 6165 5355 4902 3768 1048 811 5699 4187 -18 -546
3226 -546 1442 3821 5744 6900 -5450 -5517 -2079 -2408 -2101 -984 1478 1677 4389 5002 -2030 5630
3210 5630 12584 18307 13638 7233 11380 12777 10663 8974 4236 522 -92 2026 3356 1304 2634
3195 2634 -1532 2122 -312 3160 7570 -3128 -6301 -888 5484 3684 -1921 -1697 1172 -932 2801
3180 2801 5026 184 -4282 -569 515 -4479 -4489 -8318 -13328 -11497 -3900 -1828 -4438 -4048 1075 -3600
3164 -3600 -12649 -16370 -4380 4814 4205 -4308 -7252 -9617 -2787 4165 803 -3041 -5832 444 3086
3149 3086 7582 6041 -4611 -12034 -14087 -12699 -6513 -6097 -5477 481 -1385 -7521 -4383 -3462 -401
3134 -401 6234 10763 8239 5355 6139 650 2076 1623 4940 4698 924 2943 1688 3211 6377 2825
3118 2825 5146 4716 5393 6981 6685 11143 6832 5326 2997 5188 10365 6021 1671 1316 4473 3763
3102 3763 610 6519 5613 -1801 -281 -1158 -6316 -7397 -3052 -1694 -1236 5029 8506 6228 574 1654
3086 1654 475 -2864 -2703 -2881 -2122 4473 5225 3612 4959 -3251 -7920 -10434 -13666 -8173 -2995 -2779
3070 -2779 131 954 3959 4096 -911 -1756 -4355 -478 8802 8876 8551 5878 -2233 1080 1444 -2533 -10345
3053 -10345 -13603 -11515 -5167 730 551 6866 10829 7580 -2099 -4324 -5327 -2609 1206 9299 10432
3038 10432 16829 17280 11687 6401 882 330 -263 2706 4721 3512 -165 -6255 -8421 -5673 -7212
3023 -7212 -163 3648 5739 6806 2956 1979 10438 10907 9145 1858 -3479 -1848 -3308 -7298 -5238
3008 -5238 -843 2524 2482 8293 11797 13526 9264 13007 14836 12933 13220 10089 9882 9937 7660 4831
2992 4831 1737 -2132 -4383 -2396 -744 -2432 -5900 -6469 -7358 -9955 -11176 -11067 -6545 -6339 -2662 -3882
2976 -3882 -4029 -7307 -10261 -10955 -8383 -7959 -7607 -1068 7680 7612 512 -5335 -5128 4118 12166 6338 1620
2959 1620 2371 -1138 -2464 -3767 983 211 413 570 -1325 -4422 -1540 6686 6371 6671 2589 -1927
2943 -1927 -2476 -2136 -5230 -2538 -1055 -9470 -8213 -7237 -5664 -9833 -11110 -9675 -8084 -2020 2962 3113
2927 3113 5825 5476 3730 273 -6084 -2769 726 7119 7083 11960 16216 16095 9986 8348 6784 -2815
2911 -2815 -4166 -1624 -2505 -2085 3072 4294 7632 12094 6957 3092 5783 6246 8873 10887 12062 472
2895 472 304 4891 -406 -1110 3200 4163 5512 1559 4664 46 199 2033 1509 5628 6944 4574
2879 4574 -1149 -2020 511 -3004 -4219 -3163 -743 1479 -2247 -1959 271 -1373 -2223 6684 11398 -2125
2863 -2125 -2518 2447 14729 14349 5927 5843 9697 13377 14238 12674 13053 11242 4130 -5038 -5489 -430
2847 -430 3543 7324 8494 14387 13460 10022 3999 5645 5994 921 -824 5582 11117 6862 2545 -2505
2831 -2505 -3575 -2466 -511 -1267 2772 4502 -5338 -8142 -6914 -3924 1338 1450 -5733 -5725 -12831 -12782 -7193
2814 -7193 -2549 -4082 -2104 154 3033 1124 -3066 -4493 -5162 -5269 -5105 -260 4748 8176 3685 3412
2798 3412 5060 2218 804 816 4980 7329 3041 -6113 -8169 -2407 -1055 -3397 -2592 -6801 -1740 -1312
2782 -1312 -1879 -725 -1755 -3937 -3746 -1665 892 2896 2804 -1909 2846 5689 4252 2705 3984 4797
2766 4797 3990 8747 7269 475 -1047 -6637 -12877 -6422 -486 2742 -764 2257 5019 7749 14651
2751 14651 15871 15163 12340 7492 7875 7166 4244 2404 788 4172 6165 1082 1140 -273 -5618 -3955
2735 -3955 905 -2935 514 4816 3716 925 -186 1425 -2921 -4845 1312 819 1616 3627 4143 1454
2719 1454 -319 -4874 -135 -5084 439 2737 1858 6424 10222 6633 4102 -3937 -8755 -1872 -4820
2704 -4820 -1741 -378 2182 -1980 -7463 -8813 -3172 9592 5180 1757 1697 3235 6588 6502 9764 10843
2688 10843 11450 4255 -1985 1264 2585 2352 7607 3320 6381 8903 7549 3028 1510 -4778 -3402
2673 -3402 2356 3722 6134 5490 4965 2854 -5517 -3038 6399 5893 893 3419 6094 -329 2543 5560
2657 5560 290 3338 7664 1024 1534 4064 5926 7035 4295 -1554 -843 -1398 2686 4487 3123 -2435
2641 -2435 -3726 440 -66 5329 8580 6237 2081 -2933 -579 3555 1879 1678 2113 1776 -1061 -2166
2625 -2166 -5879 -1622 1745 -1442 -250 1959 8467 6662 9778 9400 9198 7321 -1406 -5681 -4963 98
2609 98 -566 777 1808 5745 6638 -43 1568 3400 3626 5124 7221 8387 5216 -383 -1499 -2019
2593 -2019 -1498 -4891 -12122 -11843 -7535 -2115 5820 3335 452 -4345 -9176 -973 1765 -701 -428 381
2577 381 4549 5254 2375 -1137 -562 -7324 -4588 2827 -2579 -2293 3579 -2964 -13577 -7986 1696 1859
2561 1859 1327 4542 6500 4446 3262 1375 829 2423 -5974 -5804 -2699 -333 3559 8336 9418 3138
2545 3138 1381 9463 11198 7919 4781 6189 4397 1943 -6254 -9934 -8482 -10451 -9517 -4400 -1957
2530 -1957 -6317 -5996 -4085 -5471 -6528 -5453 -6683 -9125 -7868 -8866 -8011 -5454 -3412 -5732 -3713 3688
2514 3688 2546 -2138 -3811 -1429 -3025 836 6302 763 -2074 -6843 -8793 -9415 -11294 -11306 -7773 -8398
2498 -8398 -1403 5697 3080 -3420 728 4513 558 -751 1354 2430 4962 4319 4618 7137 5950
2483 5950 6926 3366 5059 1619 4778 5687 5762 4864 2562 1166 -3476 -1709 1672 -576 -415 -5980
2467 -5980 -8254 -9312 -3856 -1337 -501 375 -1583 2534 3411 325 1405 1855 348 -948 -8318 -2423
2451 -2423 1437 -2869 -6717 -7745 -10070 -5595 -6627 -5369 -3601 -4754 -7774 -13027 -18318 -13926 -9722
2436 -9722 1336 10289 11509 10571 6725 -2443 -938 7734 9301 6192 8584 8275 5395 -471 176
2421 176 3947 3285 984 2892 4017 1980 8229 10936 12548 7675 -1220 -3682 -2047 -3997 -3928 1153
2405 1153 757 3146 4364 2640 -4558 -1072 3792 -754 -1599 2764 1445 -2917 -5414 573 1373 -1228
2389 -1228 3967 3495 4660 6262 3723 1917 -3199 -2263 2751 -42 -3809 -1343 -1332 -730 -1272 2244
2373 2244 3531 1852 -9200 -4011 -3885 -3546 168 -1581 -4050 -3849 -1003 -1341 5458 6822 -160 4025
2357 4025 1793 -5450 -6285 -3464 -3689 3526 5571 3352 3184 7198 6614 5455 2372 -2 -1821 2469
2341 2469 2179 1947 4467 5273 7163 11652 12676 9327 7920 6810 7662 557 -2592 557 -1057 -2030
2325 -2030 -1455 3599 4414 7358 9857 5746 1839 -702 -2561 -174 2840 1480 -4010 -6103 -6517 -6641
2309 -6641 -10397 -5728 3456 4235 1809 4365 6929 9408 8333 895 -7808 -4959 5451 11767 11285
2294 11285 -785 -5044 -4487 3317 11511 10978 11557 9721 4552 2715 -144 1929 -918 -1306 -7734
2279 -7734 -7167 897 3915 -405 -5652 -3453 6364 1289 -2791 -2185 -4121 -3351 -1541 2570 6495 10853
2263 10853 12215 10409 5599 3120 5491 6400 2725 -2487 3811 502 -7492 -9616 -7941 1527 4074
2248 4074 -1404 -2740 -414 7503 3825 2240 1258 2469 6623 4809 5199 6308 2772 -735 2385
2233 2385 2064 -1149 -5673 -4358 -6245 -7880 -3131 4515 -1614 -7258 -8643 -2651 2040 -106 -3376
2218 -3376 -6775 -9072 -10372 -2232 -555 -5962 -6111 -3811 -5894 -2066 -1261 -3683 -5252 -89 7107
2203 7107 9429 6888 6998 1677 788 -7051 -9776 -13333 -6934 26 4810 5078 5131 6582 643 -1291
2187 -1291 615 -4621 -9262 -4923 3173 2664 -1658 1170 1179 -623 6445 4905 3827 10441 4683 -3200
2171 -3200 -6681 -6621 -2087 6843 11616 12077 11087 7179 -1225 -6309 -2165 1297 -6115 -7992 359 9612
2155 9612 6575 923 6675 15507 9926 5192 2639 -4250 -8610 -11361 -2123 408 4737 -986 -4503
2140 -4503 -2658 2371 -5239 -7235 -4086 -2152 -409 281 -318 -6101 -5665 4546 2189 2486 13521
2125 13521 12412 6494 6200 8822 9045 10378 14252 7818 -7388 -5625 5076 6446 1378 -252 1245
2110 1245 3613 2822 7324 7209 9113 11885 14908 14030 9851 8687 11011 10291 3766 2556 930 -3751
2094 -3751 -6079 -1833 2147 2000 13 -2300 2594 8656 1262 2657 6853 11061 9934 6484 3991
2079 3991 628 2402 6222 5349 4114 -906 -1001 -502 1934 2384 1011 3126 6430 3276 -1404 1961
2063 1961 4898 10604 8779 7088 7939 4031 635 2677 972 4580 8059 11513 9802 4198 5936
2048 5936 -2102 -7350 -2256 4090 3050 4601 6154 1228 2984 -2185 -3187 1067 5149 5643 9739
2033 9739 11591 5781 4144 6828 10010 2729 -2656 -1515 -1947 3818 5383 3396 -3018 -7807 -10739
2018 -10739 -10387 -4452 -3389 -3167 2137 963 -1807 -3864 -1732 1358 -5352 -6297 -2914 254 2083
2003 2083 2802 -1035 -2272 523 3774 9797 10416 4534 3080 -10 2814 4343 7120 4494 -6709
1988 -6709 -5793 1623 4855 7202 6745 1150 -1703 352 3887 7432 3898 -16 -388 1411 -1873 -838
1972 -838 5967 6656 14 -4236 -3383 -3993 -1468 -2929 -4765 -5992 -4800 -9393 -7030 2058 4160 8417
1956 8417 2781 -41 -851 1229 7446 1479 -3617 -4007 -4325 2556 1097 2046 769 -5106 -2933 -251
1940 -251 1132 2812 1559 -3890 -722 275 3456 7827 14505 17461 21464 16215 13673 14452 9726 4478
1924 4478 5285 9374 8042 1770 -2487 -1072 -239 -261 -8892 -9510 -13920 -10198 -1928 5898 12045 11907
1908 11907 9467 6313 1708 -684 -33 5973 15291 17150 14684 10293 7315 10665 5714 3331 2752
1893 2752 1954 -2574 -3073 3910 5734 347 -1868 1154 1625 2270 1211 1512 3393 7188 2135 3384
1877 3384 9678 3424 -1332 -2362 5299 2925 -462 583 6917 3578 7966 2754 2005 6479 527
1862 527 -1953 -1474 -613 -804 206 5499 532 -4938 -9160 -11460 -5420 1867 5744 5777 7992 7500 -273
1845 -273 -4075 -4157 -5134 -2913 -163 -727 851 4725 11066 18921 14116 3202 -959 1860 -230 4724
1829 4724 10325 9976 4757 5720 6958 4039 2499 3576 -2350 -3194 -1651 817 550 -5168 -10454 -15599
1813 -15599 -7292 2291 -4205 -7344 9 6463 5962 6624 11222 7022 11252 7523 1578 5639 3999
1798 3999 3278 6211 8869 4425 1921 6718 7968 5645 1513 6739 8877 5140 -2229 -5346 -13054
1783 -13054 -13821 -6065 6407 10358 10802 8550 4878 3989 -13 -1931 314 2433 3046 -1134 -2857
1768 -2857 3395 6684 6540 3880 4339 9022 6529 295 -949 -4478 -8591 -1634 4916 -127 -4472
1753 -4472 -1773 2931 1213 762 -829 3395 6030 7161 7788 15694 13454 7849 11518 16081 7770
1738 7770 4631 -2399 511 1068 2574 12000 8910 1858 -2444 -4985 -9588 -7888 -229 8244 8527
1723 8527 7964 3890 -2742 -3415 -6774 -2759 917 5530 7119 3988 2695 2820 -3889 -8296 -14209 -14025
1707 -14025 -10885 -3449 -3615 -4858 -5227 -5215 -826 -2554 -4276 2247 1334 -1201 1976 5306 6178 5182
1691 5182 1269 1540 1087 -1034 -824 -133 -1130 -1889 -989 -204 1247 -1564 -842 -469 -1257 -6765 66 -2068
1673 -2068 -8804 -3401 -452 -3866 -7046 454 -5067 -4408 -3716 -1899 346 6155 6006 5947 12259 18805
1657 18805 22245 15822 3777 -3404 1171 10844 10686 4461 5042 9070 15371 16143 14098 4438 -10619
1642 -10619 -6572 -2906 -6009 -7540 -3386 -2614 -1560 -1534 -2277 5662 7312 4144 1485 -336 2767 6413
1626 6413 -250 -7248 -7770 -4826 -5437 -10486 -1260 -2043 892 3069 -2081 -4407 -3790 -5245 -3187 3560
1610 3560 8126 8366 8424 8117 11870 12300 9402 10928 15029 14812 15780 11938 6543 7276 862 400 -2484
1593 -2484 277 -6570 -8624 -5732 -295 -641 168 2882 5134 19 -2239 -2417 -1962 1546 3122 -482
1577 -482 -5671 -4459 -8124 -11346 -4845 -1348 1699 632 1158 -730 -718 1658 6431 7352 6060 9900
1561 9900 3213 2374 7903 15872 19544 18561 14439 12530 13276 14167 10688 2780 1801 2226 2609 -23 -2012
1544 -2012 -7584 -9312 -4935 1088 133 -2440 561 7182 10437 7066 2552 -1828 -1198 -1363 3840 4852
1528 4852 7147 10742 8793 6855 10028 8270 5069 3918 4537 7174 9288 8452 2503 -4267 -7844
1513 -7844 -4945 -3248 1178 2304 8890 10642 4290 6712 5126 -2349 -5914 -8254 -5946 -4698 -2034
1498 -2034 1470 -6480 -8227 -4937 -6639 -5064 -1457 -3554 -7039 -4868 67 -1780 -739 -4185 -3605
1483 -3605 -924 8030 12686 9682 9244 6360 6818 8042 6871 9356 11784 10337 8228 10225 8642
1468 8642 6894 7610 5484 3213 2361 152 2197 -1279 2932 934 522 1586 2120 4326 8688 7829
1452 7829 9623 14805 14205 8538 -1800 355 2175 -3073 -60 1771 3749 -976 -490 2591 -593
1437 -593 -3021 -8752 -4938 -1074 411 669 -58 -3986 -2465 -3698 -7415 -6202 -317 6986 10222 9390
1421 9390 8027 -6970 2495 15285 9854 6971 173 -4229 -6965 -4507 -5072 343 6135 8378 3813
1406 3813 -465 -749 2036 -2666 -3664 -3814 -3879 -1875 1204 -2827 -2994 -3002 1516 7063 6487 -1708 -3703
1389 -3703 -5444 -8654 -12361 -13201 -13038 -2676 2552 5925 1750 265 2629 5487 1369 -4509 -5635
1374 -5635 -8635 -14525 -17359 -17238 -8441 -2544 -1662 743 6691 8128 2511 -4409 -6561 -10486 -7655
1359 -7655 -3290 885 1742 -209 -1569 -2704 -5266 -3604 631 -299 -5031 1195 3757 1109 -1635
1344 -1635 -1719 -3263 -4687 -8170 -9264 608 4587 1824 -1915 -3506 -4840 -6965 -3902 -1718 2313
1329 2313 5596 7811 3621 1736 -2803 -7925 -5551 -3857 -10025 -10764 -5808 -3714 -3779 -9131 -7989 -3294
1313 -3294 -877 -2081 -4741 -7651 -1077 3465 -990 -1297 2324 -2656 -7574 -9550 -6834 -8790 600
1298 600 2660 -257 -2218 1820 1143 1712 5762 -1644 333 8119 7388 8611 4351 869 2519 1957
1282 1957 -1579 -3542 -3371 -208 -630 -1655 -4333 3772 5316 8493 9319 5696 4693 4148 -4581 -11392
1266 -11392 -7803 -4130 -3640 -996 4596 4617 7497 10436 7248 2942 -19 -4193 -740 4826 7106
1251 7106 8305 3389 -405 -6119 -3005 -835 -4727 -1616 -7172 -13946 -14118 -13694 -11283 -6576 -1508
1236 -1508 5684 479 -5417 -6259 -4952 -7376 -3490 -2661 46 3424 5715 8062 8439 6056 3847 -2275
1220 -2275 -7356 -749 -4367 -11534 -12650 -10429 -9949 -9950 -9699 -5914 -5525 -5939 -4583 -1641 4712 6788 9657
1203 9657 4776 -910 -1297 5357 2737 862 2454 6037 6126 2518 -921 -2989 -5050 -8054 -6277 -6171
1187 -6171 -10808 -12628 -2387 1179 4599 8196 10461 10064 5576 766 -1631 -2043 171 740 -1794
1172 -1794 -7751 -10194 -11339 -12224 -12150 -7172 -4589 -2205 -4757 -8843 -9207 -4450 -6573 -6620 -5821 -7861 -2998
1155 -2998 -5229 -14423 -12534 -8944 -2971 4568 5402 2286 -4712 -10902 -8176 -3697 -2693 -222 5735
1140 5735 9570 11614 11322 8606 1232 1453 -3644 -6033 -4767 -396 -2259 -5747 -1193 3996 146
1125 146 393 -3732 -3485 -2177 -3263 4223 4665 -2276 -1766 6123 7076 6327 11142 11052 9169 1418 -5196
1108 -5196 -8572 -4837 1011 4130 -1615 -3096 -3932 -4019 -12010 -10030 -8777 -18418 -14110 -8963 -7643 -3197
1092 -3197 1100 6414 10345 10269 4378 2249 6577 221 -4271 -4498 -8220 -2822 451 -1448 689 3511
1076 3511 7682 5807 2450 -20 1604 1006 1913 -3674 -4310 -4873 -11998 -15400 -6924 1503 -1034 2143
1060 2143 5061 339 1596 1475 2810 5185 2709 -1395 -7566 -10803 -14365 -8808 607 3021 -1211
1045 -1211 3464 11021 14392 14258 8853 7074 -4180 -13965 -8541 -1985 -6331 -14896 -10854 -2416 2654
1030 2654 -1062 -6300 -6023 -5609 -4671 -2357 -2407 -5301 -10132 968 6360 4799 9204 9558 8096 2188
1014 2188 -169 2331 3436 6181 5636 6929 6191 6539 7316 4244 564 -3255 -7824 -9774 -1646 4507
998 4507 1284 622 -246 -4013 -2904 -462 5329 10400 12269 9756 6930 2917 5759 8360 7499 5062
982 5062 7464 11013 11669 12487 13704 17428 11391 8731 9955 7167 5873 8858 4447 4208 6004 4590
966 4590 -2916 -8370 -6723 -4649 -5398 -11316 -8950 -7657 -5180 -6454 -5675 -612 7348 8357 15687 15038
950 15038 2554 7763 14872 13060 7533 8570 6536 1685 1517 -536 -2348 -5294 222 2290 936
935 936 -11778 -12206 -7951 -2760 -5837 -3404 -3027 -6501 -4395 -4619 -10999 -7295 1292 5996 5246 -440
919 -440 -3688 -9143 -8443 -3269 1594 826 -4424 -13007 -12959 -10932 -11118 -10912 -11404 -5938 -4118 -6840 -1701
902 -1701 -3829 -13790 -3412 423 -7110 -18670 -18294 -10038 -323 5519 8975 2249 -5654 -5073 -11052
887 -11052 -16719 -19702 -14355 -9730 -6495 -8526 -7244 -6010 -7301 -8221 -6684 -4753 -3560 7689 11213
872 11213 4251 -921 2425 3464 4101 -159 -734 -523 -3278 -3084 -2614 -6845 -9937 -4732 -8156 -7618
856 -7618 -4063 739 -1748 198 5217 6491 4435 -78 -1622 177 3157 3468 4557 3312 -4095
841 -4095 -6704 -10435 -1819 3021 2342 -2613 -6351 -8820 -14876 -9545 -6756 -9020 -10218 -4807 -1940
826 -1940 -5451 -4850 3905 4159 -2315 -10763 -10331 -6473 -794 7158 5448 158 -3059 -2880 375 1885
810 1885 -3856 -10733 -10153 -4302 620 -2452 -7139 -3657 -2778 -7340 -9644 -9187 -2720 2629 610 -5020
794 -5020 -9486 -8291 -9925 -12926 -7389 -5357 2390 5639 1100 -5701 -5624 -10182 -11863 -7103 1637 2300
778 2300 -1923 -6605 -8425 -3880 -1882 3436 3146 -3410 -8860 -10586 145 8777 9151 2990 2307 4111
762 4111 -738 -3263 -231 3593 1309 -3909 -210 47 -1647 -10086 -12912 -5518 2296 5919 3410
747 3410 3291 5122 -219 -5671 -1752 -1117 -597 365 1835 1551 5727 12562 4991 -3533 -9274 -3333
731 -3333 -1888 -3908 -4610 -8234 -7779 -7671 -4684 3020 6381 7406 8519 4907 14551 10785 9701 9661
715 9661 12257 10403 1769 -2628 -712 -3020 -7115 -9643 -6152 -3164 -7373 -3905 -413 4705 3108
$$ [...]
##END NTUPLES=NMR SPECTRUM
##END=
