##TITLE=Analysis number 321676
Compound Code cc 48639
Book Reference 485/164
Project Code adrs
Chemist Name sasam
##JCAMPDX= 6.0         $$ Bruker NMR JCAMP-DX V2.0
##DATA TYPE= NMR SPECTRUM
##DATA CLASS= NTUPLES
##ORIGIN= Bruker BioSpin GmbH
##OWNER= nmr
$$ XWIN-NMR		Version 3.5
$$ Tue Aug 22 12:24:37 2006 GMT Daylight Time (UT+1h)  MAYBRIDGE\nmr@NMR_250MHZ
##.OBSERVE FREQUENCY= 250.131544655141
##.OBSERVE NUCLEUS= ^1H
##.ACQUISITION MODE= SIMULTANEOUS (DQD)
##.ACQUISITION SCHEME= undefined
##.AVERAGES= 16
##.DIGITISER RES= 18
##SPECTROMETER/DATA SYSTEM= dpx250
##.PULSE SEQUENCE= zg30
##.SOLVENT NAME= CDCl3
##.SHIFT REFERENCE= (INTERNAL, CDCl3, 0, 16.522)
##AUDIT TRAIL= $$ (NUMBER, WHEN, WHO, WHERE, WHAT)
$$ ##TITLE= Audit trail, XWIN-NMR		Version 3.5
$$ ##JCAMPDX= 5.01
$$ ##ORIGIN= Bruker BioSpin GmbH
$$ ##OWNER= nmr
$$ C:\u/data/dgb/nmr/ADRS/1330/pdata/1/auditp.txt
$$ ##AUDIT TRAIL=  $$ (NUMBER, WHEN, WHO, WHERE, WHAT)
(   1,<2006-08-22 12:24:17.13 +100>,<MAYBRIDGE\nmr>,<NMR_250MHZ>,
      <created by zg, POWCHK disabled, PULCHK disabled
       configuration hash MD5:
       E2 DF 36 D8 04 B2 41 60 5A D7 A3 38 5A 4B D0 FE
       data hash MD5: 64K
       DE C1 82 D5 0B E2 CB 55 8C E0 B5 C6 C9 2C E9 D8>)
(   2,<2006-08-22 12:24:28.97 +100>,<MAYBRIDGE\nmr>,<NMR_250MHZ>,
      <Start of raw data processing
       ef LB = 0.3 FT_mod = 6 PKNL = 1 SI = 32K 
       data hash MD5: 32K
       73 00 5A B6 A1 16 EF 2A 48 98 62 9E 8B DD 88 13>)
(   3,<2006-08-22 12:24:30.57 +100>,<MAYBRIDGE\nmr>,<NMR_250MHZ>,
      <apk 
       data hash MD5: 32K
       C6 25 80 EA 09 B7 85 0A 7C 2B 7C 61 94 63 A7 E2>)
(   4,<2006-08-22 12:24:31.32 +100>,<MAYBRIDGE\nmr>,<NMR_250MHZ>,
      <abs ABSG = 5 
       data hash MD5: 32K
       8B 2A 45 33 E6 E7 02 06 92 5B CE 61 E7 69 3A 0D>)
$$ ##END=
$$ 
$$ hash MD5
$$ 66 F2 48 F6 37 0F 50 89 AF 9B 5C B0 D4 67 DA D0
##$RELAX= 
##$RELAX= 
##$RELAX= 
##$RELAX= 
##$RELAX= 
##$RELAX= 
##$RELAX= 
$$ Bruker specific parameters
$$ --------------------------
##$DU= <C:\u>
##$EXPNO= 1330
##$NAME= <ADRS>
##$PROCNO= 1
##$TYPE= <nmr>
##$USER= <dgb>
##$AMP= (0..31)
100 100 100 100 100 100 100 100 100 100 100 100 100 100 100 100 100 100 
100 100 100 100 100 100 100 100 100 100 100 100 100 100 
##$AQSEQ= 0
##$AQ_mod= 3
##$AUNM= <au_zg>
##$AUTOPOS= <27 >
##$BF1= 250.13
##$BF2= 250.13
##$BF3= 250.13
##$BF4= 250.13
##$BF5= 500.13
##$BF6= 500.13
##$BF7= 500.13
##$BF8= 500.13
##$BYTORDA= 1
##$CFDGTYP= 0
##$CFRGTYP= 5
##$CHEMSTR= <none>
##$CNST= (0..31)
1 1 145 1 1 1 1 1 1 1 1 1 1 1 1 1 1 1 1 1 1 1 1 1 1 1 1 1 1 1 1 1 
##$CPDPRG= <>
##$CPDPRG1= <>
##$CPDPRG2= <>
##$CPDPRG3= <>
##$CPDPRG4= <mlev>
##$CPDPRG5= <mlev>
##$CPDPRG6= <mlev>
##$CPDPRG7= <mlev>
##$CPDPRG8= <mlev>
##$CPDPRGB= <>
##$CPDPRGT= <>
##$D= (0..31)
0 1 0 0 0 0 0 0 0 0.06 0 0 0 0 0 0 0.0002 0 0 0 0 0 0 0 0 0 0 0 0 0 0 
0 
##$DATE= 1156245856
##$DBL= (0..7)
120 120 120 120 120 120 120 120 
##$DBP= (0..7)
150 150 150 150 150 150 150 150 
##$DBP07= 0
##$DBPNAM0= <>
##$DBPNAM1= <>
$$ [...]
##$SUBNAM7= <"">
##$SUBNAM8= <"">
##$SUBNAM9= <"">
##$SW= 20.6930455092707
##$SWIBOX= (0..15)
0 0 3 0 0 0 0 0 0 0 0 0 0 0 0 0 
##$SW_h= 5175.983436853
##$TD= 65536
##$TD0= 1
##$TE= 295.16
##$TE2= 300
##$TE3= 300
##$TEG= 300
##$TL= (0..7)
0 120 120 120 120 120 120 120 
##$TP= (0..7)
150 150 150 150 150 150 150 150 
##$TP07= 0
##$TPNAME0= <>
##$TPNAME1= <>
##$TPNAME2= <>
##$TPNAME3= <>
##$TPNAME4= <>
##$TPNAME5= <>
##$TPNAME6= <>
##$TPNAME7= <>
##$TPOAL= (0..7)
0.5 0.5 0.5 0.5 0.5 0.5 0.5 0.5 
##$TPOFFS= (0..7)
0 0 0 0 0 0 0 0 
##$TUNHIN= 0
##$TUNHOUT= 0
##$TUNXOUT= 0
##$USERA1= <user>
##$USERA2= <user>
##$USERA3= <user>
##$USERA4= <user>
##$USERA5= <user>
##$V9= 5
##$VALIST= <valist>
##$VCLIST= <CCCCCCCCCCCCCCC>
##$VD= 0
##$VDLIST= <DDDDDDDDDDDDDDD>
##$VPLIST= <PPPPPPPPPPPPPPP>
##$VTLIST= <TTTTTTTTTTTTTTT>
##$WBST= 1024
##$WBSW= 4
##$XGAIN= (0..3)
0 0 0 0 
##$XL= 0
##$YL= 0
##$YMAX_a= 393198
##$YMIN_a= -468448
##$ZGOPTNS= <>
##$ZL1= 120
##$ZL2= 120
##$ZL3= 120
##$ZL4= 120
##$ABSF1= 16.522
##$ABSF2= -4.171173
##$ABSG= 5
##$ABSL= 3
##$ALPHA= 0
##$AQORDER= 0
##$ASSFAC= 0
##$ASSFACI= 0
##$ASSFACX= 0
##$ASSWID= 0
##$AUNMP= <proc_1d>
##$AZFE= 0.1
##$AZFW= 0.1
##$BCFW= 0
##$BC_mod= 0
##$BYTORDP= 0
##$COROFFS= 0
##$CY= 12.5
##$DATMOD= 1
##$DC= 0
##$DFILT= <>
##$DTYPP= 0
##$F1P= 14.0000005364418
##$F2P= -0.99999901652339
##$FCOR= 0.5
##$FTSIZE= 32768
##$FT_mod= 6
##$GAMMA= 0
##$GB= 0
##$INTBC= 1
##$INTSCL= 1
##$ISEN= 128
##$LB= 0.3
##$LEV0= 0
##$LPBIN= 0
##$MAXI= 10000
##$MC2= 0
##$MEAN= 0
##$ME_mod= 0
##$MI= 0
##$NCOEF= 0
##$NC_proc= -3
##$NLEV= 6
##$NOISF1= 0
##$NOISF2= 0
##$NSP= 0
##$NTH_PI= 0
##$NZP= 0
##$OFFSET= 16.522
##$PC= 1
##$PHC0= 151.0048
##$PHC1= 3.614276
##$PH_mod= 1
##$PKNL= yes
##$PPARMOD= 0
##$PSCAL= 4
##$PSIGN= 0
##$REVERSE= no
##$SF= 250.13
##$SI= 32768
##$SIGF1= 0
##$SIGF2= 0
##$SINO= 400
##$SIOLD= 32768
##$SREGLST= <1H.CDCl3>
##$SSB= 0
##$STSI= 32768
##$STSR= 0
##$SW_p= 5175.98343685301
##$SYMM= 0
##$S_DEV= 0
##$TDeff= 65536
##$TDoff= 0
##$TI= <Analysis number 999999
Compound Code 99
Book Reference 9
Project Code 9>
##$TILT= no
##$TM1= 0
##$TM2= 0
##$TOPLEV= 0
##$USERP1= <user>
##$USERP2= <user>
##$USERP3= <user>
##$USERP4= <user>
##$USERP5= <user>
##$WDW= 1
##$XDIM= 32768
##$YMAX_p= 494519688
##$YMIN_p= -80885
$$ End of Bruker specific parameters
$$ ---------------------------------
##NTUPLES= NMR SPECTRUM
##VAR_NAME=  FREQUENCY,     SPECTRUM/REAL,   SPECTRUM/IMAG
##SYMBOL=    X,             R,               I
##VAR_TYPE=  INDEPENDENT,   DEPENDENT,       DEPENDENT
##VAR_FORM=  AFFN,          ASDF,            ASDF
##VAR_DIM=   32768,         32768,           32768
##UNITS=     HZ,            ARBITRARY UNITS, ARBITRARY UNITS
##FACTOR=    0.157963299565203, 1,           1
##FIRST=     4132.6476996994, 0,             0
##LAST=      -1043.33573715361, 0,           0
##MIN=       -1043.33573715361, -80885,      0
##MAX=       4132.6476996994, 494519688,     0
$$ Real data points
##PAGE= N=1
##DATA TABLE= (X++(R..R)), XYDATA
$$ [...]
$$ plain form
14723 -221 10 -3933 -5484 1641 8348 -647 -16551 -23725 -25375 -22317 -17070 -13395 -13100 -25686 -14251
14708 -14251 3208 16625 18951 17469 10971 -5160 -14576 -24734 -14743 2505 -6836 -15051 -26678
14695 -26678 -50538 -39260 -21835 -12569 -2057 3538 -14593 -12529 -160 -9745 -22839 -25010 -27620
14682 -27620 -11319 2052 -18133 -22464 -14013 -22263 -10505 -12880 -1291 10517 28869 33538 17771
14669 17771 12609 -5158 -23458 -21906 -10909 7097 13325 13818 6539 -6848 -7902 -8161 -4816 12993
14655 12993 17235 10749 14096 21908 28392 16753 -13419 -20719 -994 -5287 5412 3176 -6980
14642 -6980 -4455 9666 850 17266 25546 27397 32272 18948 13712 13147 19679 9897 13934 235
14628 235 8461 27158 38934 31142 13318 -4744 -7331 -9680 -8214 -3673 -6479 -11274 11437 38030
$$ packed form
14723b21K31l943j551P125O707q995j5904p174j650L058N247L675K95j2586J1435
14708a4251J7459J3417K326j482o498j6131r416j0158R991J7248r341q215j1627
14695b6678k3860J1278J7425R266J0512N595j8131K064J2369r585j3094k171k610
14682b7620J6301J3371k0185m331Q451q250J1758k375J1589J1808J8352M669j5767
14669A7771n162j7767j8300J552J0997J8006O228M93p279j3387j054k59L345J7809
14655A2993M242o486L347P812O484j1639l0172p300J9725m293J0699k236j0156
14642f980K525J4121q816J6416Q280J851M875j3324n236n65O532r782M037j3699
14628B35Q226J8697J1776p792j7824j8062k587k349J466M541k806m795K2711K6593
$$ plain form
14614 38030 44655 33018 11221 -10504 11796 12028 220 -1781 1310 2142 -2877 -14233 -14590 -11213
14600 -11213 -10147 4074 9776 13 6441 14309 24737 22565 8312 38 -10943 -12514 -9550
14587 -9550 -12503 -23900 -20208 -18192 637 6801 8497 139 -11213 -1373 7389 8147 -217 -8906
14573 -8906 -11139 -19624 -26356 -9175 -3256 -26400 -50990 -39695 -37905 -40702 -15224 12619 26972
14560 26972 10352 11851 15017 16111 -11015 -17036 -2500 8664 6924 11372 25951 26536 11919
14547 11919 -2417 -13559 -24867 -15966 12966 1673 -8141 -21387 -22768 -17009 -3645 5788 1652
14534 1652 -3370 -3606 -5338 -7419 -7669 -12812 -7474 1647 -1741 -12671 -5672 2339 -8400 -15118 -22223
14519 -22223 -18436 -21903 -25057 -8048 9052 2466 -6139 -21269 -27498 -30633 -39117 -41501 -17377
$$ packed form
14614C8030O625j1637k1797k1725K2300K32j1808k001L091Q32n019j1356l57L377
14600a1213J066J4221N702r763O428P868J0428k172j4253q274j0981j571K964
14587i550k953j1397L692K016J8829O164J696q358j1352R840Q762P58q364q689
14573h906k233q485o732J7181N919k3144k4590J1295J790k797K5478K7843J4353
14560B6972j6620J499L166J094k7126o021J4536J1164j740M448J4579N85j4617
14547A1919j4336j1142j1308Q901K8932j1293r814j3246j381N759J3364R433m136
14534A652n022k36j732k081k50n143N338R121l388j0930O999Q011j0739o718p105
14519b2223L787l467l154J7009J7100o586q605j5130o229l135q484k384K4124
$$ plain form
14506 -17377 -12735 -8396 24412 43313 34743 11686 -12844 -12929 3298 -10897 -17821 -23982 -37599
14493 -37599 -14028 -7669 -26532 -24867 -22660 -9879 -11045 -1862 11354 30716 29741 20169 7680
14480 7680 -2773 -16725 -32982 -21375 -11405 -19021 -13196 -26525 -46827 -43278 -46828 -65660 -54068
14467 -54068 -32217 -28410 -37148 -23195 -7256 -943 -3571 -2448 12250 -2152 -4424 -19028 -19183
14454 -19183 -22142 -26696 -40580 -38405 -9775 4078 7074 11357 693 4818 -7124 -25711 -28345
14441 -28345 -28068 -20746 -27450 -42539 -38712 -37893 -53059 -49785 -37486 -24383 -2341 642 -11480
14428 -11480 -44451 -38819 -27765 -32745 -31772 -25627 -38877 -39083 -30965 -22245 -18547 -8984 -15444 -12290
14414 -12290 -16582 -7546 7633 18835 2630 -6866 1915 10646 14947 13030 7713 11782 -21928
$$ packed form
14506a7377M642M339L2808J8901q570k3057k4530q5J6227j4195o924o161j3617
14493c7599K3571O359j8863J665K207J2781j166R183J3216J9362r75r572j2489
14480G680j0453j3952j6257J1607R970p616N825j3329k0302L549l550j8832J1592
14467e4068K1851L807q738J3953J5939O313k628J123J4698j4402k272j4604j55
14454a9183k959m554j3884K175K8630J3853K996M283j0664M125j1942j8587k634
14441b8345K77P322o704j5089L827Q19j5166L274J2299J3103K2042K983j2122
14428a1480l2971N632J1054m980R73O145j3250k06Q118Q720L698R563o460L154
14414a2290m292R036J5179J1202j6205r496Q781Q731M301j917n317M069l3710
$$ plain form
14401 -21928 -22309 -140 3135 2865 3311 7822 23848 12503 5328 3658 15061 17429 -4159 -6524
14387 -6524 5399 -420 -7090 -2250 2293 -10971 -12152 -4235 -2556 -13935 -21427 -31785 -33236 -27146
14373 -27146 -17971 -17643 -25217 -19090 -21046 -39300 -46888 -34627 -23905 -18851 -10427 -16979 -15891 13017
14359 13017 -12652 -21897 -27770 -7497 -327 -13019 -12749 -16943 4288 11145 -10849 -20375 -16381
14346 -16381 -36983 -27158 -7212 -673 2918 -2968 9270 23957 20323 7607 -14003 -34440 -50464
14333 -50464 -48012 -16729 8092 14824 6714 -2293 -18608 -16310 -10934 -10824 -10489 -15625 -5018 1323
14319 1323 -1972 -9376 -21144 -28064 -23516 -12787 -4183 1270 -9860 -28598 -27957 -31711 -37698 -57724
14305 -57724 -59135 -33753 -14183 -13801 -8528 -22615 -27349 -30236 -47601 -34435 -31930 -23222 -258
$$ packed form
14401b1928l81K2169L275k70M46M511J6026j1345p175j670J1403K368k1588k365
14387f524J1923n819o670M840M543j3264j181P917J679j1379p492j0358j451O090
14373b7146R175L28p574O127j956j8254p588J2261J0722N054Q424o552J088K8908
14359A3017k5669r245n873K0273P170j2692K70m194K1231O857k1994r526L994
14346a6381k0602R825J9946O539L591n886J2238J4687l634j2716k1610k0437j6024
14333e0464K452L1283K4821O732q110r007j6315K298N376J10L35n136J0607O341
14319A323l295p404j1768o920M548J0729Q604N453j1130j8738O41l754n987k0026
14305e7724j411K5382J9570L82N273j4087m734k887j7365J3166K505Q708K2964
$$ plain form
14292 -258 7133 -12715 -19186 -18844 -25252 -39376 -41152 -34768 -25121 -10270 1330 -4011 -42118 -42326
14278 -42326 -35818 -47858 -44572 -30059 -24415 -23572 -5896 2935 -18130 -30948 -20994 -23449 -19666
14265 -19666 -8113 16691 16824 -1652 -1134 -11067 -20117 -15558 -14353 -24470 -15160 -17627 -11735 20175
14251 20175 50836 49476 32631 17192 10378 -4537 -6711 -23157 -21649 5454 3702 4119 10443
14238 10443 15850 13923 5589 2177 -18826 -29369 -30814 -38805 -35284 -32862 -27196 -4855 11350
14225 11350 18753 13823 -1487 -5824 2298 13647 6716 -2738 -3872 15721 39765 34215 27092
14212 27092 12377 -9166 -16246 -5655 -7023 -3187 -19358 -36800 -15054 5300 -6908 -11699
14200 -11699 -38439 -34021 -28493 -28862 -1031 -4244 -16782 -18845 -24990 -26641 -24202 -37875 -55920
$$ packed form
14292b58P391j9848o471L42o408j4124j776O384R647J4851J1600n341l8107k08
14278d2326O508j2040L286J4513N644Q43J7676Q831k1065j2818R954k455L783
14265a9666J1553K4804J33j8476N18r933r050M559J205j0117R310k467N892L1910
14251B0175L0661j360j6845j5439o814j4915k174j6446J508K7103j752M17O324
14238A0443N407j927q334l412k1003j0543j445p991L521K422N666K2341J6205
14225A1350P403m930j5310m337Q122J1349o931r454j134J9593K4044n550p123
14212B7092j4715k1543p080J0591j368L836j6171j7442K1746K0354j2208m791
14200a1699k6740M418N528l69K7831l213j2538k063o145j651K439j3673j8045
$$ plain form
14187 -55920 -36758 -14678 6771 18538 16152 18662 6047 8140 20071 10652 21379 19102 17735
14174 17735 8148 6557 13366 8191 3515 10590 -4928 -40284 -37359 -23499 -31842 -24776 -31990 -36574
14160 -36574 -35357 -29334 -25924 -16515 -15336 2163 -11485 -18061 -31737 -24264 -15958 -11164 -46704
14147 -46704 -55820 -25597 -8673 -22506 -28428 -11339 -516 4583 -27310 -49398 -39754 -23193
14135 -23193 -21375 -30800 -26369 -33200 -35847 -32612 -11393 -18002 -28545 -32874 -21436 -23767 -28875 -12968
14121 -12968 -11352 -7932 -4569 2527 595 -313 2587 -362 -11686 -22717 -17406 -8779 -4015 7755
14107 7755 3971 613 -6638 8842 5824 -2523 -10499 6112 3311 -24306 -38443 -40610 -17194
14094 -17194 -29983 -21739 -2404 -1146 -5997 -10163 -26263 -27847 -22746 -16338 -10297 -24581 -24506 -25099
$$ packed form
14187e5920J9162K2080K1449J1767k386K510j2615K093J1931r419J0727k277j367
14174A7735r587j591O809n175m676P075j5518l5356K925J3860q343P066p214m584
14160c6574J217O023L410R409J179J7499j3648o576j3676P473Q306M794l5540
14147d6704r116L0223J6924j3833n922J7089J0823N099l1893k2088R644J6561
14135b3193J818r425M431o831k647L235K1219o609j0543m329J1438k331n108J5907
14121a2968J616L420L363P096j932r08K900k949j1324j1031N311Q627M764J1770
14107G755l784l358p251J5480l018q347p976J6611k801k7617j4137k167K3416
14094a7194j2789Q244J9335J258m851m166j6100j584N101O408O041j4284P5n93
$$ plain form
14080 -25099 -21208 -12633 -5271 10993 15944 25635 37773 26993 13126 4063 6822 25129 30967
14067 30967 12384 373 -2553 5724 7685 10506 14661 29384 15325 2467 11513 15933 3780
14054 3780 -12553 3210 13205 -7980 -14729 11291 2060 8796 -5225 -14361 -4651 8976 20900
14041 20900 15285 -4032 -20120 -8741 16250 8930 14211 18576 2545 -13453 2058 7903 -1647
14028 -1647 -16303 -3363 868 -14265 -20328 4341 12448 5294 3053 2878 -3885 -11973 -11823 -22719
14014 -22719 -24695 -36065 -39048 -36788 -33159 -12191 -18148 -23107 -13452 -1081 722 -10629 -14932
14001 -14932 -7265 -12411 -8178 -10126 -6381 2120 18218 12100 25521 21806 -333 6143 17980
13988 17980 1037 -1144 5615 1029 3231 11788 4939 11567 12961 -2938 -22227 -14337 -7023 -15173
$$ packed form
14080b5099L891Q575P362J6264M951R691J2138j0780j3867r063K759J8307N838
14067C0967j8583j2011k926Q277J961K821M155J4723j4059j2858R046M420j2153
14054C780j6333J5763R995k1185o749K6020r231O736j4021r136R710J3627J1924
14041B0900n615j9317j6088J1379K4991p320N281M365j6031j5998J5511N845r550
14028a647j4656J2940M231j5133o063K4669Q107p154k241j75o763q088J50j0896
14014b2719j976j1370k983K260L629K0968n957m959R655J2371J803j1351m303
14001a4932P667n146M233j948L745Q501J6098o118J3421l715k2139O476J1837
13988A7980j6943k181O759m586K202Q557o849O628J394j5899j9289P890P314q150
$$ plain form
13974 -15173 -12997 -14589 -7373 -7103 -17093 -19067 -1703 -6186 -9533 -11935 -26428 -36682 -25771 2666
13960 2666 16488 11397 992 -20132 -14050 -7104 -12523 -14649 -10424 -33958 -39179 -23148 -16662
13947 -16662 -19860 -10049 -3985 -2039 -16425 -23235 -16828 7101 21236 25308 -8270 -40310 -22954
13934 -22954 -8231 -22494 -38198 -23370 -11768 -436 -4757 -14064 -26360 -25284 -25488 -18136 -15731
13921 -15731 6067 1741 -2857 -8312 -13080 -16152 -14184 -3506 -5864 -16344 -15703 -8613 3093 -14838
13907 -14838 -22467 -22665 -11744 -6933 -20434 -39635 -31971 -25789 -14802 -6042 14648 10520 -11420
13894 -11420 -25437 -29377 -31125 -26946 -23224 -32296 -38217 -34692 -28242 -14902 -11216 -7799 3219 8469
13880 8469 10639 4441 -12415 -2740 -10965 -7255 -2438 -4640 2584 561 1887 -14658 -22463 -13105
$$ packed form
13974a5173K176j592P216K70r990j974J7364m483l347k402j4493j0254J0911K8437
13960B666J3822n091j0405k1124O082O946n419k126M225k3534n221J6031O486
13947a6662l198R811O064J946j4386o810O407K3929J4135M072l3578l2040J7356
13934b2954J4723j4263j5704J4828J1602J1332m321r307j2296J076k04P352K405
13921a5731K1798m326m598n455m768l072J968J0678k358j0480O41P090J1706j7931
13907a4838p629j98J0921M811j3501j9201P664O182J0987Q760K0690m128k1940
13894a1420j4017l940j748M179L722r072n921L525O450J3340L686L417J1018N250
13880H469K170o198j6856R675q225L710M817k202P224k023J326j6545p805R358
$$ plain form
13866 -13105 -10928 -11851 -15249 -18773 -20322 -27088 -19145 -7307 -13728 -8574 -5951 -14360 -30523 -26244
13852 -26244 -18120 -6124 -17759 -30958 -28284 -7814 -11675 -25360 -46586 -45443 -29861 -24916 -23612
13839 -23612 -13181 3675 7811 -6133 -9554 881 -13181 -11037 -7219 -9612 -29234 -23903 -20074
13826 -20074 -16553 -4386 10402 6345 -1037 -19393 -18284 -11887 -11740 -17093 -19719 -23851 -17710 -11813
13812 -11813 -1294 17179 8726 -6554 775 10679 3165 -4990 -17177 -15301 -12307 -9775 -6733
13799 -6733 -36880 -58174 -39093 -21643 -4436 -7625 -6936 1529 16459 13174 -18718 -18696 -23794 -34649
13785 -34649 -36171 -12794 -31203 -57234 -56295 -45809 -12993 8074 -9866 -21411 -17125 -27210
13773 -27210 -15946 -990 -12425 -13771 -22503 -21384 -24381 -42226 -52354 -35353 -15724 -22972 -44323
$$ packed form
13866a3105K177r23l398l524j549o766P943J1838o421N154K623q409j6163M279
13852b6244Q124J1996j1635j3199K674K0470l861j3685k1226J143J5582M945J304
13839b3612J0431J6856M136j3944l421J0435j4062K144L818k393j9622N331L829
13826b0074L521J2167J4788m057p382j8356J109O397J47n353k626m132O141N897
13812a1813J0519J8473q453j5280P329R904p514q155j2187J876K994K532L042
13799f733l0147k1294J9081J7450J7207l189O89Q465J4930l285l1892K2n098j0855
13785c4649j522K3377j8409k6031R39J0486L2816K1067j7940j1545M286j0085
13773b7210J1264J4956j1435j346q732J119k997j7845j0128J7001J9629p248k1351
$$ plain form
13760 -44323 -42090 -19642 -8481 -18438 -13330 -4659 20687 38244 25654 134 -8512 -5337 -7830
13747 -7830 643 -8687 4183 10790 6400 -16672 -6871 -8156 -10331 -10368 -5314 -12797 -7202 -4691 -27464
13732 -27464 -27199 -20945 -20229 -21126 -22100 -15837 -16289 -11801 -8001 -3024 7456 9805 11395 -781 -5323
13717 -5323 -15369 -35363 -46201 -34681 -17044 -18905 -16693 -9382 -14597 -25313 -24914 -17719 -8803
13704 -8803 -15401 -46919 -52649 -37399 -29622 -41608 -51623 -52929 -55627 -56164 -43494 -27727 -23796
13691 -23796 -43 17305 -2442 -34045 -30584 -20231 -559 8754 8855 9675 12857 -2205 -14766
13678 -14766 -9521 -128 4916 8184 24408 10906 -10258 -30223 -16647 -11829 -12981 4424 -10050
13665 -10050 -10210 3142 4548 2519 -1122 892 15928 3394 966 7889 19444 30251 26287
$$ packed form
13760d4323K233K2448J1161r957N108Q671K5346J7557j2590k5520q646L175k493
13747g830Q473r330J2870O607m390k3072R801j285k175l7N054p483N595K511k2773
13732b7464K65O254P16q97r74O263m52M488L800M977J0480K349J590j2176m542
13717e323j0046j9994j0838J1520J7637j861K212P311n215j0716L99P195Q916
13704h803o598l1518n730J5250P777j1986j0015j306k698n37J2670J5767L931
13691b3796K3753J7348j9747l1603L461J0353J9672R313J01Q20L182j5062j2561
13678a4766N245R393N044L268J6224j3502k1164j9965J3576M818j152J7405j4474
13665a0050j60J3352J406k029l641K014J5036j2534k428O923J1555J0807l964
$$ plain form
13652 26287 9375 -4175 -5853 9515 21672 16868 11483 -12691 -27672 -24455 -39635 -34257 -33498
13639 -33498 -49518 -42947 -26289 17682 14602 7412 5024 -18460 -28631 -7743 2052 -15074 -30114
13626 -30114 -34872 -18419 -22901 -43416 -33108 -22712 -26802 -26641 -34146 -28289 -15419 -5879 -7482
13613 -7482 7504 3946 12545 13589 8155 -4447 -18542 8018 30738 36537 24146 23403 32774
13600 32774 23149 5397 -6320 -1814 4960 5726 -875 -5464 7830 21214 15981 14742 14865 13306
13586 13306 18476 12965 -8524 -25514 -16387 -18965 -23239 -22461 -25868 -7171 14113 3074 -20957
13573 -20957 -18091 -19799 -16430 -4870 12126 21348 13157 2006 -570 -10113 -6161 8128 -9101
13560 -9101 -21412 -11370 -1746 -9537 -476 15979 8008 -906 2461 1551 2780 -20652 -21082 -16491
$$ packed form
13652B6287j6912j3550j678J5368J2157m804n385k4174j4981L217j5180N378P59
13639c3498j6020O571J6658M3971l080p190k388k3484j0171K0888R795j7126j5040
13626c0114m758J6453m482k0515J0308J0396m090J61p505N857J2870R540j603
13613g482J4986l558Q599J044n434j2602j4095K6560K2720N799j2391p43R371
13600C2774r625j7752j1717M506O774P66o601m589J3294J3384n233j239J23j559
13586A3306N170n511k1489j6990R127k578m274P78l407J8697K1284j1039k4031
13573b0957K866j708L369J1560J6996R222q191j1151k576r543L952J4289j7229
13560i101j2311J0042R624p791R061J6455p971q914L367r10J229k3432m30M591
$$ plain form
13546 -16491 -39362 -37332 -21864 -27268 -29324 -11868 -15800 -23622 -28298 -26403 -18548 -14302 -5521 17442
13532 17442 15727 14535 1555 -10897 6074 17182 5298 1922 -7090 -10148 -12125 -1499 -3916
13519 -3916 -7113 -16751 -25787 -28504 -27652 -15426 -27519 -30454 -15830 -12474 -30495 -37786 -50910 -54287
13505 -54287 -51821 -37194 -24615 -1609 17208 26022 19836 3801 -3400 -4766 -4762 -2068 -12739 -26689
13491 -26689 -20383 -11359 -8480 -7029 -16352 -19365 -20489 -20741 -15172 -12580 -14595 -3651 6516 17748
13477 17748 33689 24188 2459 -4510 -2644 -20259 -35878 -23422 -19738 -22812 -19762 -1713 -3811
13464 -3811 -126 -526 11433 20287 24927 17245 2983 -5347 -8814 1317 -4637 -6308 3979 20227
13450 20227 16147 27752 16100 -7646 -15437 -34500 -32849 -11479 16366 36017 22816 20698
$$ packed form
13546a6491k2871K030J5468n404k056J7456l932p822m676J895P855M246Q781K2963
13532A7442j715j192j2980j2452J6971J1108j1884l376r012l058j977J0626k417
13519c916l197r638r036k717Q52J2226j2093k935J4624L356j8021p291j3124l377
13505e4287K466J4627J2579K3006J8817Q814o186j6035p201j366MK694j0671j3950
13491b6689O306R024K879J451r323l013j124k52N569K592k015J0944J0167J1232
13477A7748J5941r501k1729o969J866j7615j5619J2456L684l074L050J8049k098
13464c811L685m00J1959Q854M640p682j4262q330l467J0131n954j671J0287J6248
13450B0227m080J1605j1652k3746p791j9063J651K1370K7845J9651j3201k118
$$ plain form
13438 20698 8278 -11150 828 24788 50828 56801 47526 31630 35044 38186 20178 -10196
13426 -10196 -6705 -2573 14906 36262 47885 42835 25400 15740 17201 19836 11577 -10100 -28499
13413 -28499 -18386 -2079 4951 -1101 -875 11128 6816 -4074 -9149 7011 22357 5609 -18217
13400 -18217 -20739 -17367 -3234 -7393 -11566 -25027 -32897 -22608 -8101 -12802 -3728 -3865 -4936 7701
13386 7701 5778 -6632 -14912 -8571 2040 -7248 -5216 2405 -4563 -4221 -24600 -38828 -25868 -15091
13372 -15091 -32758 -37757 87 -7804 -20030 -15352 -18677 -34933 -26448 -15076 -22402 -25297 -14054
13359 -14054 -1202 301 -826 -9583 -11469 -4183 2216 -253 -13848 -27458 -35394 -61076 -59659
13346 -59659 -42155 -50260 -35708 -18955 -28608 -18902 -19003 -20889 -23817 -22387 -10404 724 10088
$$ packed form
13438B0698j2420j9428J1978K3960K6040N973r275j5896L414L142j8008l0374
13426a0196L491M132J7479K1356J1623n050j7435r660J461K635q259k1677j8399
13413b8499J0113J6307P030o052K26J2003m312j0890n075J6160J5346j6748k3826
13400a8217k522L372J4133m159m173j3461p870J0289J4507m701R074j37j071J2637
13386G701j923j2410q280O341J0611r288K032P621o968L42k0379j4228J2960J0777
13372a5091j7667m999L7844p891j2226M678l325j6256Q485J1372p326k895J1243
13359a4054J2852J503j127q757j886P286O399k469j3595j3610p936k5682J417
13346e9659J7504q105J4552J6753r653R706j01j886k928J430J1983J1128R364
$$ plain form
13333 10088 -5391 -14757 -21800 -21195 -12308 -4964 1763 -3884 11613 -6790 -19821 -28723 -27833 -21760
13319 -21760 4002 4725 8 -3434 -7150 -14380 -12520 -10934 -6094 887 -2875 4277 -4805 -7708
13305 -7708 7400 7388 -519 141 -12455 -25359 -27965 -24595 -17803 -13139 -7257 -9030 -8963 -20754 -23151
13290 -23151 -30605 -30959 -20837 -1392 -4 -538 -14101 -24045 -8328 -9181 -34949 -18089 2756
13277 2756 -9932 -20753 -16256 -11592 -21698 -17670 -10122 -10619 -17484 -16634 6027 33118 34489 23753
13263 23753 2189 -2509 19441 18954 5537 11356 12998 250 -16873 -7926 -2947 2145 17561
13250 17561 37872 23394 26738 17067 6518 9853 11592 -4068 -2314 -15563 -34992 -38967 -36496
13237 -36496 -35613 -15305 -3760 12846 10493 -23208 -33063 -34267 -32601 -18788 -19273 -13416 -10415 -11567
$$ packed form
13333A0088j5479r366p043O05Q887P344O727n647J5497j8403j3031q902Q90O073
13319b1760K5762P23m717l442l716p230J860J586M840O981l762P152r082k903
13305g708J5108j2p907O60j2596j2904k606L370O792M664N882j773O7j1791k397
13290b3151p454l54J0122J9445J388n34j3563r944J5717q53k5768J6860K0845
13277B756j2688j0821M497M664j0106M028P548m97o865Q50K2661K7091J371j0736
13263B3753k1564m698K1950m87j3417N819J642j2748j7123Q947M979N092J5416
13250A7561K0311j4478L344r671j0549L335J739j5660J754j3249j9429l975K471
13237c6496Q83K0308J1545J6606k353l3701r855j204J666J3813m85N857L001j152
$$ plain form
13223 -11567 -2458 714 -10885 -7748 -4518 5410 2154 -6971 -10383 -9869 -3716 -10300 -3308 13730
13209 13730 -151 5083 19949 19779 9798 -9994 -38871 -35280 -20838 -7732 7439 -25194 -39950
13196 -39950 -32161 -26881 -18375 -34018 -30805 -36981 -60271 -60395 -34148 -24676 -14412 -6244 -23880
13183 -23880 -21781 1416 5359 11039 -108 1450 7205 16154 18116 11571 -7160 -17045 -16912 511
13169 511 12991 -5601 -19339 -13465 -705 -3110 -26530 -26210 -19857 -9073 -19595 -2074 -803
13156 -803 2803 -10102 -4142 -5839 -2636 -4543 -5630 -8447 -7875 13454 19485 17294 30502 27880
13142 27880 16717 13983 14606 18719 -2318 -8069 7110 29648 15824 3773 5404 7024 5378
13129 5378 11214 5926 -1970 2194 -13592 -757 15990 13533 3506 5952 10809 10215 15278 7095
$$ packed form
13223a1567R109L172j1599L137L230R928l256r125l412N14O153o584O992J7038
13209A3730j3881N234J4866j70r981j9792k8877L591J4442J3106J5171l2633j4756
13196c9950P789N280Q506j5643L213o176k3290j24K6247R472J0264Q168j7636
13183b3880K099K3197L943N680j1147J558N755Q949J962o545j8731r885J33J7423
13169E11J2480j8592j3738N874J2760k405k3420L20O353J0784j0522J7521J271
13156h03L606j2905N960j697L203j907j087k817N72K1329O031k191J3208k622
13142B7880j1163k734O23M113k1037n751J5179K2538j3824j2051J631J620j646
13129E378N836n288p896M164j5786J2835J6747k457j0027K446M857n94N063q183
$$ plain form
13115 7095 1483 -15655 -22897 -23740 -29689 -34448 -33534 -16110 -16157 -24836 -20857 -20868 -3752 7598 -829
13100 -829 -17335 -1602 21887 21157 2072 -9341 -903 -11508 -1779 -6635 11434 18601 3002
13087 3002 -18393 -31614 -25135 -9274 -17533 -26237 -17019 -8871 -11553 -12259 -8812 -3103 -6149 8400
13073 8400 10644 -8780 -19916 -16560 -7596 5075 -2694 -8330 5715 164 -6371 -9153 -8046 -3093
13059 -3093 839 -5479 -24933 -36545 -11984 1350 12808 26892 29655 18101 -7434 -1883 1167
13046 1167 4217 3785 22 -3873 -15483 -18881 -13516 -5496 11939 18160 12787 1832 -10458 -3915
13032 -3915 -1807 6946 4437 -1506 -21177 -18554 -10609 -21651 -31250 -31358 -30580 -18810 -6867 -9322
13018 -9322 -10937 -18966 -36270 -15727 -5649 -5445 -22495 -52248 -44840 -28978 -12917 -9341 -11592
$$ packed form
13115G095n612j7138p242q43n949m759R14J7424m7q679L979j1J7116J1350q427
13100h29j6506J5733K3489p30j9085j1413Q438j0605R729m856J8069P167j5599
13087C002k1395j3221O479J5861q259q704R218Q148k682p06L447N709l046J4549
13073H400K244j9424j1136L356Q964J2671p769n636J4045n551o535k782J107M953
13059c093L932o318j9454j1612K4561J3334J1458J4084K763j1554k5535N551L050
13046A167L050m32l763l895j1610l398N365Q020J7435O221n373j0955j2290O543
13032c915K108Q753k509n943j9671K623P945j1042r599j08P78J1770J1943k455
13018i322j615q029j7304K0543J0078K04j7050k9753P408J5862J6061L576k251
$$ plain form
13005 -11592 -1946 -10886 24122 34174 24932 13755 21143 11846 11794 5121 -6445 -6247 -19375 -14082
12991 -14082 -16702 -22727 -25231 -25593 -10706 935 4579 -5157 -19436 -29417 -15346 -6283 5045
12978 5045 12801 3872 -5859 -4689 -1438 -12733 4951 6562 -2325 -16152 -26370 -22004 -8983
12965 -8983 -9758 4347 -11070 -32083 -19998 -12560 -29495 -29007 -26575 -28331 -22886 -14695 -31836 -27847
12951 -27847 -26886 -20809 -19418 -24493 -34616 -25197 -16033 -24209 -28838 -40249 -31383 -16973 -2360 -7044
12937 -7044 -6522 -7213 4189 15517 12773 -13199 -28659 -17180 -13519 -13396 -10194 -101 12510 9580
12923 9580 2444 -14883 -18453 -16054 3495 11543 -12603 -32382 -23952 -3748 -687 -6624 -2898
12910 -2898 12718 15854 16874 18248 4714 4896 10231 9976 16102 21731 30748 36100 39978 35599 17715
$$ packed form
13005a1592R646q940L5008J0052r242j1177P388r297n2o673j1566J98j3128N293
12991a4082k620o025k504l62J4887J1641L644r736j4279r981J4071R063J1328
12978E045P756q929r731J170L251j1295J7684J611q887j3827j0218M366J3021
12965h983p75J4105j5417k1013J2085P438j6935M88K432j756N445Q191j7141L989
12951b7847R61O077J391n075j0123R419R164q176m629j1411Q866J4410J4613m684
12937g044N22o91J1402J1328k744k5972j5460J1479L661J23L202J0093J2611k930
12923I580p136j7327l570K399J9549Q048k4146j9779Q430K0204L061n937L726
12910b898J5616L136J020J374j3534J82N335k55O126N629R017N352L878m379j7884
$$ plain form
12895 17715 26813 37069 29233 17679 5921 2746 13591 30765 35587 48697 44048 45200 51537
12882 51537 47417 58688 83888 76383 90130 106085 130018 143082 155945 153948 156041 169725
12870 169725 184127 181019 188905 177146 158636 158080 156107 157464 151320 142997 147002 173026 186196
12857 186196 214991 280225 336393 378029 413587 452234 467952 470747 464252 440923 438904 425253
12845 425253 414921 405098 403513 371859 350662 312669 294431 293172 273495 251445 250272 241823
12833 241823 229765 227067 216626 215157 209589 202298 198911 179529 175825 182825 192419 171442 164755
12820 164755 170599 168764 165808 189246 207314 224503 220488 211064 194784 195671 199971 195631 173970
12807 173970 160663 138307 134911 127082 106921 86949 70556 69370 69719 63744 48213 43910 45022
$$ packed form
12895A7715R098J0256p836j1554j1758l175J0845J7174M822J3110m649J152O337
12882E1537m120J1271K5200p505J3747J5955K3933J3064J2863j997K093J3684
12870A69725J4402l108P886j1759j8510n56j973J357o144q323M005K6024J3170
12857A86196K8795O5234N6168M1636L5558L8647J5718K795o495k3329k019j3651
12845D25253j0332r823j585l1654k1197l7993j8238j259j9677k2050j173q449
12833B41823j2058k698j0441j469n568p291l387j9382l704P000R594k0977o687
12820A64755N844j835k956K3438J8068J7189m015r424j6280Q87M300m340k1661
12807A73970j3307k2356l396p829k0161j9972j6393j186L49n975j5531m303J112
$$ plain form
12794 45022 50017 62935 60987 49502 54560 64031 56562 43866 38251 17363 18185 28892 25396
12781 25396 33507 31178 23508 24344 29865 24980 11246 13796 -339 9231 24262 21667 19833 12905
12767 12905 -16681 -17709 4275 17235 19216 11291 15218 26629 32559 19822 31311 56454 41429
12754 41429 9202 -10179 -524 14634 2463 -15131 -16130 -7481 -20829 -38790 -43180 -35494 -31042
12741 -31042 -28039 -21271 -34726 -43096 -30386 -20638 -18083 -12560 -8358 8516 1550 -11965 3053
12728 3053 11864 -4451 -6869 4804 -5343 6913 10272 638 -3046 18218 26713 46616 26210
12715 26210 4143 4078 -10175 -5798 -1931 -5782 -1394 2082 8247 16193 13247 19206 11799 6016
12701 6016 26439 36690 18649 -7003 4858 28599 33441 35946 40158 25906 27354 31245 45750
$$ packed form
12794D5022M995J2918j948j1485N058R471p469j2696n615k0888Q22J0707l496
12781B5396Q111k329p670Q36N521m885j3734K550j4135R570J5031k595j834o928
12767A2905k9586j028K1984J2960J981p925L927J1411N930j2737J1489K5143j5025
12754D1429l2227j9381R655J5158j2171j7594r99Q649j3348j7961m390P686M452
12741c1042L003O768j3455q370J2710R748K555N523M202J6874o966j3515J5018
12728C053Q811j6315k418J1673j0147J2256L359r634l684K1264Q495J9903k0406
12715B6210k2067o5j4253M377L867l851M388L476O165P946k946N959p407n783
12701F016K0423J0251j8041k5652J1861K3741M842K505M212j4252J448L891J4505
$$ plain form
12688 45750 58628 63069 57650 57327 44705 41542 43491 35962 48667 41814 27107 13845 28404
12675 28404 37795 43567 43927 35453 26240 -868 -21226 -4434 19849 20540 11567 33126 34189 31231
12661 31231 15349 -9602 -22907 -16254 -437 15837 24931 36212 31368 29055 56081 69579
12649 69579 58506 48813 54949 54596 39780 23026 16448 33805 44538 67688 69892 47523 34193
12636 34193 40525 36049 31978 36703 34193 21932 8201 2836 3960 19671 15514 28145 21793
12623 21793 25868 28969 50829 69424 65402 76792 83331 104299 121001 150408 184190 182661 192404
12610 192404 216249 209260 179028 187321 193857 177173 159522 137262 122645 122353 109052 116357 118141
12597 118141 97232 74657 81093 84175 88549 84108 58537 51859 58365 75563 65162 54490 54687
$$ packed form
12688D5750J2878M441n419l23j2622l163J949p529J2705o853j4707j3262J4559
12675B8404R391N772L60q474r213k7108k0358J6792K4283O91q973K1559J063k958
12661C1231j5882k4951j3305O653J5817J6274R094J1281m844k313K7026J3498
12649F9579j1073r693O136l53j4816j6754o578J7357J0733K3150K204k2369j3330
12636C4193O332m476m071M725k510j2261j3731n365J124J5711m157J2631o352
12623B1793M075L101K1860J8595m022J1390O539K0968J6702K9407L3782j529R743
12610A92404K3845o989l0232Q293O536j6684j7651k2260j4617k92j3301P305J784
12597A18141k0909k2575O436L082M374m441k5571o678O506J7198j0401j0672J97
$$ plain form
12584 54687 62449 77654 85321 81142 85144 94036 115677 139057 158808 145029 135783 119685 93799
12571 93799 99611 114512 130001 112304 105605 112416 131655 145415 156412 181385 205697 215195
12559 215195 208077 224512 254322 255458 244359 251803 272834 297353 308092 309513 311281 302724 314590
12546 314590 335331 359924 349282 311154 337027 362489 383761 411074 406416 394052 395353 398803
12534 398803 399041 411036 414629 408531 425447 433605 441950 443995 435906 428955 437135 450515 446372 455759
12520 455759 483396 519019 553958 591376 619857 661511 722968 765128 795871 813077 806700 793292
12508 793292 789507 773537 764432 763037 755502 753301 757523 760703 771049 781859 788882 793018 814588
12495 814588 835522 847198 871626 918985 960716 976407 1032903 1108470 1136917 1163732 1190223
$$ packed form
12584E4687P762J5205P667m179M002Q892K1641K3380J9751j3779r246j6098k5886
12571I3799N812J4901J5489j7697o699O811J9239J3760J0997K4973K4312R498
12559B15195p118J6435K9810J136j1099P444K1031K4519J0739J421J768q557J1866
12546C14590K0741K4593j0642l8128K5873K5462K1272K7313m658j2364J301L450
12534C98803K38J1995L593o098J6916Q158Q345K045q089o951Q180J3380m143R387
12520D55759K7637L5623L4939L7418K8481M1654O1457M2160L0743J7206o377j3408
12508G93292l785j5970r105j395p535k201M222L180J0346J0810P023M136K1570
12495H14588K0934J1676K4428M7359M1731J5691N6496P5567K8447K6815K6491
$$ plain form
12484 1190223 1237307 1276760 1294176 1298290 1286189 1290595 1308820 1307189 1308105 1336854 1375119 1398302
12472 1398302 1421601 1447952 1518916 1608281 1674096 1759043 1831279 1913239 2003044 2088767 2153516
12461 2153516 2239744 2343242 2453572 2579956 2745616 2958044 3200269 3483549 3830049 4208128
12451 4208128 4644343 5146856 5734977 6386511 7077876 7829857 8682817 9702758 10978584
12442 10978584 12645664 14910126 18119497 22595192 28683487 36433025 45411337 54718044
12434 54718044 63148256 69715508 73817652 75423622 75013540 73383155 71378806 69540528
12426 69540528 67808937 65654816 62587343 58579115 54014359 49445634 45264502 41635835
12418 41635835 38538300 35906394 33711742 31933120 30554185 29608251 29106112 29027179 29343584
$$ packed form
12484A190223M7084L9453J7416M114j2101M406J8225j631R16K8749L8265K3183
12472A398302K3299K6351P0964Q9365O5815Q4947P2236Q1960Q9805Q5723O4749
12461B153516Q6228J03498J10330J26384J65660K12428K42225K83280L46500L78079
12451D208128M36215N02513N88121O51534O91365P51981Q52960J019941J275826
12442A0978584J667080K264462L209371M475695O088295P749538Q978312R306707
12434E4718044Q430212O567252M102144J605970m10082j630385k004349j838278
12426F9540528j731591k154121l067473m008228m564756m568725m181132l628667
12418D1635835l097535k631906k194652j778622j378935r45934n02139p8933L16405
$$ plain form
12409 29343584 29923669 30662465 31437704 32201622 32961030 33760104 34616828 35605445 36789021
12400 36789021 38207886 39784549 41370536 42793471 43869926 44419245 44410228 43893310 42976013
12391 42976013 41831644 40588688 39390279 38289406 37287416 36396053 35570644 34708465
12383 34708465 33755594 32709632 31521138 30214224 28899767 27648284 26573278 25726161
12375 25726161 25145575 24881495 25024092 25647876 26851926 28707780 31293003 34435521 37722032
12366 37722032 40434000 41807968 41441430 39480262 36564505 33366506 30299930 27521163
12358 27521163 25049605 22846035 20885313 19130964 17601850 16255091 15094671 14050152
12350 14050152 13128940 12324740 11590781 10936071 10341412 9814611 9337959 8911053 8531611
$$ packed form
12409B9343584N80085P38796P75239P63918P59408P99074Q56724R88617J183576
12400C6789021J418865J576663J585987J422935J076455N49319r017n16918r17297
12391D2976013j144369j242956j198409j100873j001990q91363q25409q62179
12383C4708465r52871j045962j188494j306914j314457j251483j075006q47117
12375B5726161n80586k64080J42597O23784J204050J855854K585223L142518L286511
12366C7722032K711968J373968l66538j961168k915757l197999l066576k778767
12358B7521163k471558k203570j960722j754349j529114j346759j160420j044519
12350A4050152r21212q04200p33959o54710n94659n26801m76652m26906l79442
$$ plain form
12341 8531611 8170026 7838419 7539153 7253905 6987106 6709329 6479340 6274149 6050899
12332 6050899 5825278 5607058 5429615 5261317 5107120 4946710 4783861 4637834 4499174
12323 4499174 4378049 4265613 4170043 4063319 3962980 3842217 3727721 3630860 3532742 3443376
12313 3443376 3325384 3212870 3122271 3039229 2956422 2893657 2817501 2742925 2670534 2619692 2568183
12302 2568183 2512874 2453570 2388676 2316019 2236256 2163097 2085700 2017143 1967834 1898013 1853853
12291 1853853 1784255 1720349 1681471 1636989 1598273 1567382 1520557 1477020 1464777 1450964 1407999
12280 1407999 1371493 1320190 1286903 1260401 1227652 1192944 1159410 1133457 1112716 1098667 1075030
12269 1075030 1021959 981955 969102 963585 940082 938016 928846 905148 878213 845454 823634 802607
$$ packed form
12341H531611l61585l31607k99266k85248k66799k77777k29989k05191k23250
12332F050899k25621k18220j77443j68298j54197j60410j62849j46027j38660
12323D499174j21125j12436r5570j06724j00339j20763j14496r6861r8118q9366
12313C443376j17992j12514r0599q3042q2807o2765p6156p4576p2391n0842n1509
12302B568183n5309n9304o4894p2657p9763p3159p7397o8557m9309o9821m4160
12291A853853o9598o3906l8878m4482l8716l0891m6825m3537j2243j3813m2965
12280A407999l6506n1303l3287k6502l2749l4708l3534k5953k0741j4049k3637
12269A075030n3071m0004j2853n517k3503k066r170k3698k6935l2759k1820k1027
$$ plain form
12257 802607 789770 776563 769387 783129 795024 785733 754463 728277 722160 716720 704497 679549
12245 679549 663392 643811 608183 601728 622743 620109 585758 547885 524785 519762 514968 504098
12233 504098 509232 522759 531497 538123 522747 529622 522506 495819 475697 479466 468750 457369 437592
12220 437592 422748 417656 404501 386991 390150 382298 379303 380503 379043 375712 377848 386179 384844
12207 384844 357831 342719 328205 326423 333487 342661 338125 341939 337130 321079 302739 288299 285473
12194 285473 292698 305521 327818 336132 332216 333641 326628 338386 336351 329968 320890 323569 326934
12181 326934 323823 307613 308672 322371 316955 302800 273242 268269 313115 315969 318816 305523 295809
12168 295809 293633 297685 297139 289334 281378 297479 283542 252763 255786 285643 327421 352441 353198
$$ packed form
12257H02607j2837j3207p176J3742J1895r291l1270k6186o117n440j2223k4948
12245F79549j6157j9581l5628o455K1015k634l4351l7873k3100n023m794j0870
12233E04098N134J3527Q738O626j5376O875p116k6687k0122L769j0716j1381j9777
12220D37592j4844n092j3155j7510L159p852k995J200j460l331K136Q331j335
12207C84844k7013j5112j4514j782P064R174m536L814m809j6051j8340j4440k826
12194B85473P225J2823K2297Q314l916J425p013J1758k035o383r078K679L365
12181C26934l111j6210J059J3699n416j4155k9558m973M4846K854K847j3293r714
12168B95809k176M052n46p805p956J6101j3937l0779L023K9857M1778K5020P57
$$ plain form
12155 353198 379546 448508 515357 621263 736957 818185 870354 884945 832114 734527 653729
12144 653729 582106 520824 484210 450559 425882 399945 366814 353099 347175 354926 342270 302972
12132 302972 282533 265525 250151 246825 251836 249681 225465 229807 234824 247665 262961 271352 266620
12119 266620 270729 271369 282841 326183 383778 448559 529420 601624 653006 681725 684442 668683
12107 668683 628098 562775 501109 438026 370577 358408 350511 326065 286007 281980 278940 260276
12095 260276 252061 244839 235045 235971 230333 212595 188250 180529 179329 164828 153476 153960 162120 182422
12081 182422 189373 184449 185870 162659 141299 149587 163865 154071 147033 143147 145825 167201 159296
12068 159296 136097 128296 115388 136579 139628 135012 143331 136139 126104 126595 123325 136484 151496
$$ packed form
12155C53198K6348O8962O6849J05906J15694Q1228N2169J4591n2831r7587q0798
12144F53729p1623o1282l6614l3651k4677k5937l3131j3715n924P751j2656l9298
12132C02972k0439j7008j5374l326N011k155k4216M342N017J2841J5296Q391m732
12119B66620M109O40J1472M3342N7595O4781Q0861P2204N1382K8719K717j5759
12107F68683m0585o5323o1666o3083o7449j2169p897k4446m0058m027l040j8664
12095B60276q215p222r794R26n638j7738k4345p721j200j4501j1352M84Q160K0302
12081A82422O951m924J421k3211k1360Q288J4278r794p038l886K678K1376p905
12068A59296k3199p801j2908K1191L049m616Q319p192j0035M91l270J3159J5012
$$ plain form
12055 151496 142083 122623 120983 127630 151242 151177 128073 117743 116883 113699 110914 128366 137538 128835
12041 128835 120126 118067 108538 101240 97045 110112 114299 118516 109349 109884 101598 100957 95910 100730
12027 100730 112877 104371 107957 121545 123970 131284 135848 140147 126267 132212 133187 121307 142200
12014 142200 167918 184861 222274 276219 325749 378253 399099 406750 406262 386820 361860 356556
12002 356556 320713 280544 260391 258716 257739 236821 203506 191501 192173 183059 156714 153552 146730
11989 146730 137569 126052 120966 115187 135495 146883 147725 148328 155767 154318 163349 167093 175775 192026
11975 192026 175914 145325 138966 163563 187613 208197 239809 243592 234001 213915 204428 204553 197427
11962 197427 177241 171430 188648 182501 155871 145881 162677 183267 190074 188489 166643 173056 193964
$$ packed form
12055A51496r413j9460j640O647K3612o5k3104j0330q60l184k785J7452R172q703
12041A28835q709k059r529p298m195J3067M187M217r167N35q286o41n047M820
12027A00730J2147q506L586J3588K425P314M564M299j3880N945R75j1880K0893
12014A42200K5718J6943L7413N3945M9530N2504K0846P651m88j9442k4960n304
12002C56556l5843m0169k0153j675r77k0918l3315j2005O72r114k6345l162o822
11989A46730r161j1517n086n779K0308J1388Q42O03P439j449R031L744Q682J6251
11975A92026j6112l0589o359K4597K4050K0584L1612L783r591k0086r487J25p126
11962A97427k0186n811J7218o147k6630r990J6796K0590O807j585k1846O413K0908
$$ plain form
11949 193964 190816 181896 177766 192280 205917 234175 238309 270105 280851 280547 279378 289463 289960
11936 289960 285495 265459 250887 251546 247230 236159 216465 207571 205165 215179 204555 178025 168484
11923 168484 175592 191389 176672 173521 168097 165718 190339 204231 188430 176360 180520 190049 210441
11910 210441 245533 248462 240668 238434 214003 203492 198460 187670 177411 155396 117816 99802
11898 99802 86416 100738 108258 101026 91071 99728 104639 103681 102534 98855 68851 48137 52402 43651
11884 43651 46230 37140 47014 85191 90967 76541 53745 45981 46075 63399 74447 73009 61665
11871 61665 69854 69047 63820 67614 53398 39476 18834 20646 34105 41321 57154 53312 50504
11858 50504 53307 52912 52364 68696 46362 26247 21893 23874 41327 42803 37440 44021 38103 10627
$$ packed form
11949A93964l148q920m130J4514J3637K8258M134L1796J0746l04j169J0085M97
11936B89960m465k0036j4572O59m316j1071j9694q894k406J0014j0624k6530r541
11923A68484P108J5797j4717l151n424k379K4621J3892j5801j2070M160R529K0392
11910B10441L5092K929p794k234k4431j0511n032j0790j0259k2015l7580j8014
11898I9802j3386J4322P520p232r955Q657M911r58j147l679l0004k0714M265q751
11884D3651K579r090R874L8177N776j4426k2796p764R4J7324J1048j438j1344
11871F1665Q189q07n227L794j4216j3922k0642J812J3459P216J5833l842k808
11858E0504K803l95n48J6332k2334k0115m354J981J7453J476n363O581n918k7476
$$ plain form
11844 10627 17653 21626 38743 58272 52831 45657 39784 46026 49263 53159 59537 56670 52167 39163
11830 39163 16320 8366 2413 9520 21101 22266 50447 61350 39916 26222 32705 27628 27509
11817 27509 45014 58418 41619 34514 37094 26164 25698 33854 21673 24313 30969 43999 63790
11804 63790 66355 56440 61493 49490 31653 44463 50979 53396 35833 28587 27229 30828 45670
11791 45670 54053 49512 35579 21334 37442 45542 42056 34960 33201 28919 35040 33873 34699 37210
11777 37210 44299 38470 35733 22677 37868 48788 39255 28631 19731 22797 12776 4801 11401
11764 11401 36813 55846 47602 37378 37987 54386 49308 46350 55266 67472 59089 31057 26678
11751 26678 31165 29944 44827 43682 50674 37701 46565 57313 37463 14561 -7535 472 17019
$$ packed form
11844A0627P026L973J7117J9529n441p174n873O242L237L896O378k867m503j3004
11830C9163k2843p954n953P107J1581J165K8181J0903k1434j3694O483n077j19
11817B7509J7505J3404j6799p105K580j0930m66Q156j2181K640O656J3030J9791
11804F3790K565r915N053j2003j7837J2810O516K417j7563p246j358L599J4842
11791D5670Q383m541j3933j4245J6108Q100l486p096j759m282O121j167Q26K511
11777C7210P089n829k737j3056J5191J0920r533j0624q900L066j0021p975O600
11764A1401K5412J9033q244j0224O09J6399n078k958Q916J2206q383k8032m379
11751B6678M487j221J4883j145O992j2973Q864J0748j9850k2902k2096Q007J6547
$$ plain form
11738 17019 26424 11526 -3636 5725 17363 16569 3425 11527 29005 17872 10412 40971 74195
11725 74195 67879 56171 43306 24023 2363 -6801 18480 22693 27754 36543 34018 38634 50176
11712 50176 50323 44362 32227 17761 25128 17157 17141 9198 -5508 1054 16166 25547 23734 5855
11698 5855 -988 -4946 -20504 -17548 385 4183 11078 9629 22211 28754 43722 20044 13783
11685 13783 25739 33729 26511 13419 4908 3669 2426 8856 -425 -1841 -8633 -13932 -9434 3345
11671 3345 17815 23447 17745 6336 -10023 -22413 -10303 4239 8675 -12999 -17375 -18288 -8426
11658 -8426 3746 21944 42179 41063 38404 32514 12244 11374 31371 22414 22010 7673 -9607
11645 -9607 -8721 15686 27866 36927 48826 37432 25592 38203 41584 46120 39096 30960 10367
$$ packed form
11738A7019R405j4898j5162R361J1638p94j3144Q102J7478j1133p460L0559L3224
11725G4195o316j1708j2865j9283k1660r164K5281M213N061Q789k525M616J1542
11712E0176J47n961j2135j4466P367p971j6p943j4706O562J5112R381j813j7879
11698E855o843l958j5558K956J7933L798O895j449J2582O543J4968k3678o261
11685A3783J1956P990p218j3092q511j239j243O430r281j416o792n299M498J2779
11671C345J4470N632n702j1409j6359j2390J2110J4542M436k1674m376r13R862
11658h426J2172J8198K0235j116k659n890k0270q70J9997q957m04j4337j7280
11645i607Q86K4407J2180R061J1899j1394j1840J2611L381M536p024q136k0593
$$ plain form
11632 10367 -2915 -4243 14463 23626 32046 8502 2166 9976 5411 19882 21448 3603 17239
11619 17239 30348 11189 6099 499 14268 6566 8234 17219 35132 30117 40316 41831 37746
11606 37746 45247 42789 27758 24673 19017 19539 23965 24590 10613 -494 -1866 17536 30633 49959
11592 49959 45629 35317 30061 22632 5526 14733 5369 -12256 715 2512 -13646 -25910 -20103
11579 -20103 -10711 -9020 -16518 -5749 12072 6970 7802 14922 17542 13492 15745 21822 29069 17497
11565 17497 13688 23628 31222 39040 34807 20420 220 -11901 -9179 2683 12785 3690 12803
11552 12803 21177 4085 2079 10218 5665 532 19465 2590 1948 21743 36457 33488 43627
11539 43627 40990 35843 37684 21564 8341 -728 -538 2849 -5785 4505 648 6752 22106 15144
$$ packed form
11632A0367j3282j328J8706R163Q420k3544o336P810m565J4471J566j7845J3636
11619A7239J3109j9159n090n600J3769p702J668Q985J7913n015J0199J515m085
11606C7746P501k458j5031l085n656N22M426O25j3977j1107j372J9402J3097J9326
11592D9959m330j0312n256p429j7106R207r364j7625J2971J797j6158j2264N807
11579b0103R392J691p498J0769J7821n102Q32P120K620m050K253O077P247j1572
11565A7497l809R940P594P818m233j4387k0200j2121K722J1862J0102r095R113
11552A2803Q374j7092k006Q139m553n133J8933j6875o42J9795J4714k969J0139
11539D3627k637n147J841j6120j3223r069J90L387q634J0290l857O104J5354o962
$$ plain form
11525 15144 8755 1228 -2133 7442 25390 11640 -2219 -140 10469 33951 43849 28266 6968
11512 6968 18666 38089 50945 40415 16266 12453 1263 -4027 13383 15764 18505 29180 25722
11499 25722 7761 2544 11375 15664 17353 28051 24020 26431 22619 11054 -1069 71 12698
11486 12698 8284 -5677 -9739 1360 14332 39861 54437 33281 22466 17505 10661 18653 14269
11473 14269 27889 37147 31757 12872 -9955 -10875 -10998 5153 7501 903 -5978 -1977 6022 24276
11459 24276 26716 12758 4844 -6439 -7266 4320 3755 17935 27825 19655 25858 35841 19662 6872
11445 6872 28804 25794 19546 23620 4537 -9162 -10640 -10731 -12607 -10190 7996 4840 -791 -9465
11431 -9465 -15734 -11543 -5159 5712 -877 3122 12327 18055 13603 -4759 -1792 10124 5259 -2382
$$ packed form
11525A5144o389p527l361R575J7948j3750j3859K079J0609K3482R898j5583k1298
11512F968J1698J9423J2856j0530k4149l813j1190n290J7410K381K741J0675l458
11499B5722j7961n217Q831M289J689J0698m031K411l812j1565j2123J140J2627
11486A2698m414j3961m062J1099J2972K5529J4576k1156j0815m961o844P992m384
11473A4269J3620R258n390j8885k2827r20j23J6151K348o598o881M001P999J8254
11459B4276K440j3958p914j1283q27J1586n65J4180R890q170O203R983j6179j2790
11445F872K1932l010o248M074j9083j3699j478r1j876K417J8186l156n631q674
11431i465o269M191O384J0871o589L999R205N728m452j8362K967J1916m865p641
$$ plain form
11417 -2382 2195 -50 8717 -17933 -11065 -8242 4966 16085 25960 31464 15914 22150 26086 27917
11403 27917 24334 4132 -20570 -21152 -11123 -16834 -28129 -28559 -23607 -3474 7378 14540 13730 10181
11389 10181 429 -2749 -11872 -7137 -10450 4737 16917 13344 9566 7480 4600 5749 2131 -15615
11375 -15615 -29853 -19277 -5100 10685 -1088 -8611 -7383 -9949 -11693 -15359 -19868 -12767 -13259
11362 -13259 -26146 -20187 -2861 -5232 3817 -7711 -22227 -24259 -17049 -3115 10138 14122 13396
11349 13396 21657 28315 21478 4207 -12776 1697 3110 6172 28328 27136 8320 4298 2730
11336 2730 -12919 -13057 -1528 8808 10301 3708 -200 -21860 -14669 -13064 1711 28076 12092
11323 12092 1470 3547 1333 -1526 -6979 -10361 4147 15360 16793 7649 10479 -2701 -15591
$$ packed form
11417b382M577k245Q767k6650O868K823J3208J1119R875N504j5550O236L936J831
11403B7917l583k0202k4702n82J0029n711j1295m30M952K0133J0852P162q10l549
11389A0181r752l178r123M735l313J5187J2180l573l778k086k880J149l618j7746
11375a5615j4238J0576J4177J5785j1773p523J228k566j744l666m509P101m92
11362a3259j2887N959J7326k371R049j1528j4516k032P210J3934J3253L984p26
11349A3396Q261O658o837j7271j6983J4473J413L062K2156j192j8816m022j568
11336B730j5649j38J1529J0336J493o593l908k1660P191J605J4775K6365j5984
11323A2092j0622K077k214k859n453l382J4508J1213J433r144K830j3180j2890
$$ plain form
11310 -15591 -18812 -14642 -22505 -9458 23866 25084 541 -11625 2469 -7800 -7505 18411 12831
11297 12831 15469 -8503 -16040 -25790 -28341 -23061 -17422 -13973 -15256 86 6490 17043 5807
11284 5807 -1831 -19775 -35342 -31176 -24590 -368 8945 4524 13119 14943 15316 23575 29201 17860
11270 17860 11834 8987 -3251 13823 27060 9951 -18176 -16560 -412 13806 30447 45936
11258 45936 31655 20490 11215 -643 15509 29135 15551 10455 11508 6183 7724 23611 13834
11245 13834 14317 19984 24115 18523 25324 33838 17155 603 -6749 -9132 -5681 735 -890 -14294
11231 -14294 3578 11383 -2259 -6095 3787 23039 2640 2995 21767 9646 -20659 -20968 -17906
11218 -17906 766 2882 1283 -3249 3588 18993 21655 24632 32210 9689 10622 22754 21216 12171
$$ packed form
11310a5591l221M170p863J3047L3324J218k4543j2166J4094j0269K95K5916n580
11297A2831K638k3972p537r750k551N280N639L449j283J5342O404J0553j1236
11284E807p638j7944j5567M166O586K4222R313m421Q595J824L73Q259N626j1341
11270A7860o026k847j2238J7074J3237j7109k8127J616J6148J4218J6641J5489
11258D5936j4281j1165r275j1858J6152J3626j3584n096J053n325J541J5887r777
11245A3834M83N667M131n592O801Q514j6683j6552p352k383L451O416j625j3404
11231a4294J7872P805j3642l836R882J9252k0399L55J8772j2121l0305l09L062
11218a7906J8672K116j599m532O837J5405K662K977P578k2521R33J2132j538r045
$$ plain form
11204 12171 2365 -17005 -17613 -6190 289 -1295 2537 1213 7398 20408 18813 26819 17759 3890
11190 3890 6329 8925 5049 -4169 2326 4761 -11786 778 7970 4171 5785 19450 26451 14962
11176 14962 209 1093 4055 -2954 -4001 4586 19043 20429 -10014 -25293 -7570 -3183 -6734
11163 -6734 1205 14460 28107 27871 11628 4310 -1511 8980 9375 18643 19596 10240 13299 29054
11149 29054 48238 35829 9932 -6173 4157 11651 10879 6201 5727 8529 31305 15922 10080
11136 10080 -840 -12130 -22632 -21088 -27451 -34150 -22514 -17356 -24652 -23912 -8439 3180 21524
11123 21524 24433 10874 -1488 -5064 6692 10670 5600 17325 2402 -15246 634 19083
11111 19083 31923 31792 22549 13289 15441 14970 30295 33447 25960 31333 32911 33009 16132 4331
$$ packed form
11204A2171r806j9370o08J1423O479j584L832j324O185J3010j595Q006r060j3869
11190C890K439K596l876r218O495K435j6547J2564P192l799J614J3665P001j1489
11176A4962j4753Q84K962p009j047Q587J4457J386l0443j5279J7723M387l551
11163f734P939J3255J3647k36j6243p318n821J0491L95R268R53r356L059J5755
11149B9054J9184j2409k5897j6105J0330P494p72m678m74K802K2776j5383n842
11136A0080j0920j1290j0502J544o363o699J1636N158p296P40J5473J1619J8344
11123B1524K909j3559j2362l576J1756L978n070J1725j4923j7648J5880J8449
11111A9083J2840j31r243r260K152m71J5325L152p487N373J578R8j6877j1801
$$ plain form
11097 4331 23643 35279 26225 30326 4167 4920 18053 9948 19371 17903 6321 30291 43179
11084 43179 42425 28593 7933 13210 21177 26020 23524 11753 -33313 -47978 -20536 -28 -12477
11071 -12477 -15906 -22464 8936 23975 3973 2915 -2452 1931 8738 25147 22849 12199 4415
11058 4415 2238 21853 14544 -20781 -35410 -28328 -13116 10451 10470 -6899 -9542 6472 7189 -12712
11044 -12712 -5034 10388 7661 -3202 -16035 -31446 -20448 19809 24224 31211 9254 20053
11032 20053 22439 -3229 -15677 -22658 -22135 -31105 -16570 9683 8961 7605 1394 -5253 -9483 24948
11018 24948 37294 19995 2596 -3126 2959 2130 1848 3301 -7495 -11225 -115 1785 -2809 14049
11004 14049 20887 5138 -14657 -26663 -13377 -12416 -22869 -28882 -7783 -11565 -15867 -25975 -12068
$$ packed form
11097D331J9312J1636r054M101k6159P53J3133q105R423j468j1582K3970J2888
11084D3179p54j3832k0660N277P967M843k496j1771m5066j4665K7442K0508j2449
11071a2477l429o558L1400J5039k0002j058n367M383O807J6409k298j0650p784
11058D415k177J9615p309l5325j4629P082J5212K3567J9j7369k643J6014P17j9901
11044a2712P678J5422k727j0863j2833j5411J0998M0257M415O987k1957J0799
11032B0053K386k5668j2448o981N23q970J4535K6253p22j356o211o647m230L4431
11018B4948J2346j7299j7399n722O085q29k82J453j0796l730J1110J900m594J6858
11004A4049O838j5749j9795j2006J3286R61j0453o013K1099l782m302j0108J3907
$$ plain form
10991 -12068 -4203 -20006 -28843 -9429 -6232 178 8514 3839 -5017 -16764 -21066 -13136 23198
10978 23198 48842 33851 10162 16528 25144 25531 38002 20185 3460 6696 -11104 -16275 -16990
10965 -16990 -10845 -13516 -18632 -21903 -21190 -10910 -5911 -23445 -25579 -17294 -8683 26093 25919 17840
10951 17840 5648 5597 12552 21821 14369 24534 35165 32205 41269 38059 29528 24836 28248 24987
10937 24987 21842 49598 48237 20575 20469 22971 12343 -2929 -10895 -6271 16970 27126 32352
10924 32352 34870 31079 27115 20922 35059 71892 85128 92375 121068 135539 133240 121466 102294
10911 102294 116053 125018 125137 120529 132770 141794 142756 129003 106423 104229 113658 120252 138721
10898 138721 152837 176585 200604 200136 196723 196343 190209 182345 164124 164329 156280 140636 149811 156297
$$ packed form
10991a2068P865j5803q837J9414L197O410Q336m675q856j1747m302P930L6334
10978B3198K5644j4991k3689O366Q616L87J2471j7817j6725L236j7800n171p15
10965a6990O145k671n116l271P13J0280M999j7534k134Q285Q611L4776j74q079
10951A7840j2192n1O955R269p452J0165J0631k960R064l210q531m692L412l261
10937B4987l145K7756j361k7662j06K502j0628j5272p966M624K3241J0156N226
10924C2352K518l791l964o193J4137L6833J3236P247K8693J4471k299j1774j9172
10911A02294J3759Q965J19m608J2241R024R62j3753k2580k194R429O594J8469
10898A38721J4116K3748K4019m68l413l80o134p864j8221K05q049j5644R175O486
$$ plain form
10884 156297 169218 172593 183388 201158 208373 208722 226521 240386 238436 236249 253293 261908 271419
10871 271419 269524 290719 308250 322045 339393 352363 338491 337017 343017 342794 336027 320526 284450
10858 284450 274067 278063 263939 252939 269584 287522 275195 260342 240343 241283 243959 245570
10846 245570 247482 229111 218865 209960 202687 206587 225509 251842 244598 256690 270479 273879 262740
10833 262740 269814 243333 214021 211534 208980 193986 178214 162473 140261 126673 124349 126331
10821 126331 132298 136617 152724 160736 153153 177388 213657 207724 200795 191352 189272 178048 166510
10808 166510 151702 130631 123355 112034 96355 103950 98325 102133 99639 94708 77039 55704 56587
10795 56587 59237 81800 110552 102702 77858 60668 50437 49218 31886 40562 54756 45632 58762
$$ packed form
10884A56297J2921L375J0795J7770P215L49J7799J3865j950k187J7044Q615R511
10871B71419j895K1195J7531J3795J7348J2970j3872j474O000k23o767j5501l6076
10858B84450j0383L996j4124j1000J6645J7938j2327j4853j9999R40K676J611
10846B45570J912j8371j0246q905p273L900J8922K6333p244J2092J3789L400j1139
10833B62740P074k6481k9312k487k554j4994j5772j5741k2212j3588k324J982
10821A26331N967M319J6107Q012p583K4235L6269n933o929r443k080j1224j1538
10808A66510j4808k1071p276j1321j5679P595n625L808k494m931j7669k1335Q83
10795E6587K650K2563K8752p850k4844j7190j0231j219j7332Q676J4194r124J3130
$$ plain form
10782 58762 70790 67029 52642 64899 68207 77433 84535 71611 50890 44162 34637 35343 43103
10769 43103 55670 49049 39019 40063 50858 55705 58532 76206 71193 62689 65720 50553 39354
10756 39354 6957 6198 25568 47761 61207 58644 58289 58805 44891 23091 37274 34790 41023
10743 41023 64023 59888 68908 78114 88411 101997 95524 75122 79318 71347 77792 85211 80506
10730 80506 75865 77447 72371 77948 101161 95698 87163 88020 89397 101466 107107 113915 89447 69884
10716 69884 60486 74727 96181 107858 117130 114194 118488 107581 107315 122441 113890 108178 118460
10703 118460 119524 102460 90005 88564 90504 86136 88184 93255 75209 71425 81748 91579 97947
10690 97947 88416 109803 126433 120209 100439 97319 84438 84397 95189 113984 119848 96847 90538
$$ packed form
10782E8762J2028l761j4387J2257L308R226P102j2924k0721o728r525P06P760
10769D3103J2567o621j0030J044J0795M847K827J7674n013q504L031j5167j1199
10756C9354l2397p59J9370K2193J3446k563l55N16j3914k1800J4183k484O233
10743D1023K3000m135R020R206J0297J3586o473k0402M196p971O445P419m705
10730H0506m641J582n076N577K3213n463q535Q57J377J2069N641O808k4468j9563
10716F9884r398J4241K1454J1677R272k936M294j0907k66J5126q551n712J0282
10703A18460J064j7064j2455j441J940m368K048N071j8046l784J0323R831O368
10690I7947r531K1387J6630o224j9770l120j2881m1J0792J8795N864k3001o309
$$ plain form
10677 90538 105929 110521 112670 119680 114958 119680 137970 128650 111514 123469 117732 129509 125697
10664 125697 122406 125200 125077 106831 110731 119536 108739 116007 117979 100809 101507 98483 95421 91222
10650 91222 95180 96436 89455 81245 74389 84502 95315 119927 137134 138271 118411 95351 96083
10637 96083 112574 124622 127614 122272 135995 136624 150076 177594 200564 208851 226993 246322 257726
10624 257726 274049 275197 260802 251144 234628 220594 211183 209231 202757 197552 215649 215216 206810
10611 206810 201169 205790 192948 201185 221707 235476 239315 254374 269911 260215 254563 251664 251907
10598 251907 292711 308608 305849 323436 338266 333387 333299 338297 340045 340943 336937 327088 316898 309453
10584 309453 301354 307129 313659 311413 307422 301297 310966 304355 324230 350318 356159 355744 340532 327416
$$ packed form
10677I0538J5391M592K149P010m722M722J8290r320j7136J1955n737J1777l812
10664A25697l291K794j23j8246L900Q805j0797P268J972j7170O98l024l062m199
10650I1222L958J256o981q210o856J0113J0813K4612J7207J137j9860k3060P32
10637I6083J6491J2048K992n342J3723O29J3452K7518K2970Q287J8142J9329J1404
10624B57726J6323J148j4395r658j6516j4034r411j952o474n205J8097m33q406
10611B06810n641M621j2842Q237K0522J3769L839J5059J5537r696n652k899K43
10598B51907M0804J5897k759J7587J4830m879q8M998J748Q98m006r849j0190p445
10584C09453q099N775O530k246l991o125R669o611J9875K6088N841m15j5212j3116
$$ plain form
10570 327416 311204 316098 333625 347337 345361 329341 335561 364949 383020 368728 369511 391025
10558 391025 407845 417849 416550 416838 422818 437599 442578 427869 431809 431723 444931 458486 460380
10545 460380 443194 459931 474889 476775 484247 480412 489895 503997 506551 505313 514748 540912 587899
10532 587899 605740 602590 586952 596048 614180 630335 646649 665340 668349 696315 744502 769745
10520 769745 789951 818767 840726 859736 869514 904394 950464 1002825 1054834 1130177 1208622 1256044
10508 1256044 1307295 1380528 1457286 1527777 1603907 1660397 1741090 1854675 1963036 2079011 2233697
10497 2233697 2422525 2627647 2854736 3114896 3426150 3727941 4089208 4537031 5076890
10488 5076890 5743579 6545172 7530074 8763442 10314362 12262539 14688746 17609512 20968446
$$ packed form
10570C27416j6212M894J7527J3712j976j6020O220K9388J8071j4292P83K1514
10558C91025J6820J0004j299K88N980J4781M979j4709L940q6J3208J3555J894
10545D60380j7186J6737J4958J886P472l835R483J4102K554j238R435K6164M6987
10532E87899J7841l150j5638R096J8132J6155J6314J8691L009K7966M8187K5243
10520G69745K0206K8816K1959J9010R778L4880M6070N2361N2009P5343P8445M7422
10508A256044N1251P3233P6758P0491P6130N6490Q0693J13585J08361J15975J54686
10497B233697J88828K05122K27089K60160L11254L01791L61267M47823N39859
10488E076890O66689Q01593R84902J233368J550920J948177K426207K920766L358934
$$ plain form
10479 20968446 24511156 27751511 30134282 31264498 31127656 30059536 28495043 26773894
10471 26773894 25130016 23671355 22452535 21501737 20859418 20537262 20577768 20965083 21697304
10462 21697304 22730152 23918439 25108773 26136343 26872434 27310965 27542061 27738887 28111697
10453 28111697 28830198 30026078 31702317 33754177 35928495 37896090 39319955 39921385
10445 39921385 39635928 38664330 37308831 35908753 34702737 33820114 33239749 32891887 32632606
10436 32632606 32289745 31688782 30774943 29622390 28308653 26965562 25673088 24553276
10428 24553276 23678555 23105257 22836162 22912385 23377090 24255016 25591946 27367492 29472006
10419 29472006 31676455 33558321 34645638 34696219 33690029 31864891 29611753 27263681
$$ packed form
10479B0968446L542710L240355K382771J130216j36842j068120j564493j721149
10471B6773894j643878j458661j218820r50798o42319l22156M0506L87315P32221
10462B1697304J032848J188287J190334J027570P36091M38531K31096J96826L72810
10453B8111697P18501J195880J676239K051860K174318J967595J423865O01430
10445C9921385k85457r71598j355499j400078j206016q82623n80365l47862k59281
10436C2632606l42861o00963r13839j152553j313737j343091j292474j119812
10428B4553276q74721n73298k69095P6223M64705Q77926J336930J775546K104514
10419B9472006K204449J881866J087317N0581j006190j825138k253138k348072
$$ plain form
10411 27263681 25006275 22926408 21041014 19324447 17778203 16408972 15178749 14076025
10403 14076025 13083854 12228938 11471486 10787778 10142433 9557615 9063237 8610036 8188715
10394 8188715 7816887 7473111 7146470 6849092 6597369 6358825 6118998 5894039 5718987
10385 5718987 5507252 5302489 5132272 4949645 4769035 4598490 4441610 4303351 4173165
10376 4173165 4045899 3922877 3807769 3702297 3604357 3505697 3409582 3321479 3194252 3081870
10366 3081870 2979571 2891010 2820644 2744305 2663929 2577494 2498761 2437654 2381179 2340795 2280971
10355 2280971 2218105 2169628 2109071 2045976 1990065 1924808 1863658 1816151 1770462 1730621 1698553
10344 1698553 1647148 1600673 1567085 1533975 1484873 1458340 1427583 1384489 1362413 1335327 1295819
$$ packed form
10411B7263681k257406k079867j885394j716567j546244j369231j230223j102724
10403A4076025r92171q54916p57452o83708o45345n84818m94378m53201m21321
10394H188715l71828l43776l26641k97378k51723k38544k39827k24959j75052
10385E718987k11735k04763j70217j82627j80610j70545j56880j38259j30186
10376D173165j27266j23022j15108j05472r7940r8660r6115q8103j27227j12382
10366C081870j02299q8561p0366p6339q0376q6435p8733o1107n6475m0384n9824
10355B280971o2866m8477o0557o3095n5911o5257o1150m7507m5689l9841l2068
10344A698553n1405m6475l3588l3110m9102k6533l0757m3094k2076k7086l9508
$$ plain form
10333 1295819 1261367 1242448 1212721 1193788 1162030 1109792 1071535 1053630 1040362 1032041 1006329
10322 1006329 963089 925365 905171 879575 856811 823040 801594 774268 755065 735098 727494
10311 727494 711895 695918 684344 662789 658751 661198 663367 668645 662453 645898 618801 586312
10299 586312 583200 595930 599789 593546 553912 526062 526934 508791 492682 494362 466811 442548 429337
10286 429337 426019 438331 443385 414697 394430 389734 382314 369573 361807 346328 324011 326302 340100
10273 340100 350048 353285 336879 335312 344610 331087 294230 275142 276409 284678 276173 287254 289997
10260 289997 280855 278243 276178 284523 287754 279987 266739 267557 254827 251672 246092 261432 278126
10247 278126 264955 255144 250743 243997 236744 219105 220755 225706 229774 238127 245329 240687 233200 215041
$$ packed form
10333A295819l4452j8919k9727j8933l1758n2238l8257j7905j3268q321k5712
10322A006329m3240l7724k0194k5596k2764l3771k1446k7326j9203j9967p604
10311G27494j5599j5977j1574k1555m038K447K169N278o192j6555k7097l2489
10299E86312l112J2730L859o243l9634k7850Q72j8143j6109J680k7551k4263j3211
10286D29337l318J2312N054k8688k0267m696p420j2741p766j5479k2317K291J3798
10273C40100R948L237j6406j567R298j3523l6857j9088J267Q269q505J1081K743
10260B89997r142k612k065Q345L231p767j3248Q18j2730l155n580J5340J6694
10247B78126j3171r811m401o746p253j7639J650M951M068Q353P202m642p487j8159
$$ plain form
10233 215041 225188 221342 226371 238649 241151 260596 265329 249029 228559 229165 234680 221672 222059
10220 222059 218824 224887 220535 223109 214603 205862 201659 203784 195218 198521 214636 199099 186460
10207 186460 186971 180669 167904 187013 200405 190351 177805 191244 176536 176660 177126 174624 174413
10194 174413 147482 151822 172425 181705 166673 161255 158231 156243 171229 157437 147075 160494
10182 160494 162412 152376 147724 143240 151889 153396 138810 142110 137895 123447 111762 112501 126635
10169 126635 121229 145773 155784 158340 154624 132781 108375 85974 70105 75650 102486 113422
10157 113422 125639 115930 98290 86204 81623 61308 59195 46915 47696 70744 86287 91335 89093
10144 89093 100533 102385 104679 107724 92216 110995 122975 109192 87086 86380 102676 114708 118817
$$ packed form
10233B15041J0147l846N029J2278K502J9445M733j6300k0470O06N515j3008L87
10220B22059l235O063m352K574q506q741m203K125q566L303J6115j5537j2639
10207A86460N11o302j2765J9109J3392j0054j2546J3439j4708J24M66k502k11
10194A74413k6931M340K0603R280j5032n418l024j988J4986j3792j0362J3419
10182A60494J918j0036m652m484Q649J507j4586L300m215j4448j1685P39J4134
10169A26635n406K4544J0011K556l716k1843k4406k2401j5869N545K6836J0936
10157A13422J2217r709j7640j2086m581k0315k113j2280P81K3048J5543N048k242
10144H9093J1440J852K294L045j5508J8779J1980j3783k2106p06J6296J2032M109
$$ plain form
10131 118817 119442 114580 95505 82419 59600 45096 51749 57118 84924 100718 90846 63223 47136
10118 47136 72215 79523 78253 68889 81874 106581 110281 91025 87129 78818 91227 90779 87736
10105 87736 89686 90121 93134 87301 89270 89271 86348 71953 69174 80863 93527 107138 101642 75953
10091 75953 69359 72213 83307 87783 74273 71662 74762 85298 79867 77850 80257 80598 70486 87309
10077 87309 101421 103992 108422 115213 114482 106073 109647 117461 130067 133776 165263 199863 210524
10064 210524 212979 188693 168919 189665 205585 228567 240255 263995 319125 368239 424825 476472
10052 476472 575902 768994 1127402 1734640 2249896 2359513 2116586 1657897 1307022 1086727
10042 1086727 945960 865028 764695 677612 622097 564351 521057 493557 476834 450948 429370
$$ packed form
10131A18817O25m862j9075j3086k2819j4504O653N369K7806J5794r872k7623j6087
10118D7136K5079P308j270r364J2985K4707L700j9256l896q311J2409m48l043
10105H7736J950M35L013n833J969Jk923j4395k779J1689J2664J3611n496k5689
10091G5953o594K854J1094M476j3510k611L100J0536n431k017K407L41j0112J6823
10077H7309J4112K571M430O791p31q409L574P814J2606L709L1487L4600J0661
10064B10524K455k4286j9774K0746J5920K2982J1688K3740N5130M9114N6586N1647
10052D76472R9430J93092L58408O07238N15256J09617k42927m58689l50875k20295
10042A086727j40767q0932j00333q7083n5515n7746m3294k7500j6723k5886k1578
$$ plain form
10031 429370 419905 411454 402986 401189 401400 406680 400474 388666 362537 369197 389086 403041 385239
10018 385239 349367 334752 312384 296190 284284 280321 295774 312520 303699 301229 298961 276898
10006 276898 259084 234620 224001 214290 222950 232225 251507 253695 252387 260806 272957 281969 282229
9993 282229 287681 288303 279112 264187 266621 260248 242579 230653 209848 194460 172533 155014 154919
9980 154919 159181 148312 132127 120540 112134 102815 103121 125280 120776 101871 76370 68716 85782
9967 85782 101705 115770 109402 106691 95869 77864 70035 75434 81067 90579 98657 115349 119333
9954 119333 110223 114384 117497 132958 125831 105904 85060 86012 91252 89745 87568 75818 64071
9941 64071 66602 63125 60237 76510 76078 61958 55279 62713 45873 46409 37445 36041 37197 42079
$$ packed form
10031D29370r465q451q468j797K11N280o206j1808k6129O660J9889J3955j7802
10018C85239l5872j4615k2368j6194j1906l963J5453J6746q821k470k268k2063
10006B76898j7814k4464j0619r711Q660R275J9282K188j308Q419J2151R012K60
9993B82229N452O22r191j4925K434o373j7669j1926k0805j5388k1927j7519r5
9980A54919M262j0869j6185j1587q406r319L06K2159m504j8905k5501p654J7066
9967H5782J5923J4065o368k711j0822j8005p829N399N633R512Q078J6692L984
9954A19333r110M161L113J5461p127j9927k0844R52N240j507k177j1750j1747
9941F4071K531l477k888J6273m32j4120o679P434j6840N36q964j404J156M882
$$ plain form
9927 42079 44390 51646 60368 77026 60430 47878 44408 37179 35677 37456 32656 19464 54810
9914 54810 57539 57402 62268 48439 41362 46314 61316 56799 60582 66824 74737 70372 51615 39480
9900 39480 40889 49971 58295 49119 51644 53615 51741 82948 80158 81544 83081 77948 73582 77500
9886 77500 101237 112384 101763 105266 114141 121257 93858 66683 66933 70977 65446 66060 81767 104905
9872 104905 89981 74115 69612 81738 111290 120434 121409 133225 139860 149051 151689 141511 145219
9859 145219 165019 193862 205542 215169 218091 211898 190021 190507 181989 182256 163697 124356 96718
9846 96718 93603 99217 113850 113776 102316 89571 90512 85548 68021 86795 105706 104428 101807 87923
9832 87923 58454 43163 51136 68630 64218 58366 61272 52262 62871 74368 70949 59023 69936
$$ packed form
9927D2079K311P256Q722J6658j6596j2552l470p229j502J779m800j3192L5346
9914E4810K729j37M866j3829p077M952J5002m517L783O242P913m365j8757j2135
9900C9480J409R082Q324r176K525J971j874L1207k790J386J537n133m366L918
9886G7500K3737J1147j0621L503Q875P116k7399k7175K50M044n531O14J5707K3138
9872A04905j4924j5866m503J2126K9552R144R75J1816O635R191K638j0178L708
9859A45219J9800K8843J1680R627K922o193k1877M86q518K67j8559l9341k7638
9846I6718l115N614J4633p4j1460j2745R41m964j7527J8774J8911j278k621j3884
9832H7923k9469j5291P973J7494m412n852K906r010J0609J1497l419j1926J0913
$$ plain form
9819 69936 60525 39311 43471 59439 60016 47397 38440 33096 49527 54205 53486 54263 30636 33848
9805 33848 64674 59047 66888 62082 66160 84167 95644 92134 77703 71048 80460 85409 70880
9792 70880 60340 41205 39833 42293 49562 60054 45771 28947 41390 53349 72036 60423
9780 60423 44867 59035 63916 55715 43287 34744 50788 56288 59670 57098 53799 55098 54922 55646
9766 55646 53052 48970 65717 74128 54165 34081 46202 64276 61011 64287 58806 45821 54928
9753 54928 61950 65233 72673 78004 63802 53695 54620 51577 68417 61235 49069 64929 68811 79537
9739 79537 86260 78152 82946 84702 85000 84879 91484 88407 63445 64430 69741 74314 84445 104172 123169
9724 123169 111885 107077 105457 117877 114957 128501 150105 152212 144414 126065 127975 134945 147933
$$ packed form
9819F9936r411k1214M160J5968N77j2619q957n344J6431M678p19P77k3627L212
9805C3848L0826n627P841m806M078J8007J1477l510j4431o655R412M949j4529
9792G0880j0540j9135j372K460P269J0492j4283j6824J2443J1959J8687j1613
9780F0423j5556J4168M881q201j2428q543J6044N500L382k572l299J299j76P24
9766E5646k594m082J6747Q411j9963k0084J2121J8074l265L276n481j2985R107
9753E4928P022L283P440N331j4202j0107R25l043J6840p182j2166J5860L882J0726
9739G9537O723q108M794J756K98j21O605l077k4962R85N311M573J0131J9727J8997
9724A23169j1284m808j620J2420k920J3544K1604K107p798j8349J910O970J2988
$$ plain form
9711 147933 181930 205351 251511 283197 302993 312225 318132 322552 322098 347723 374655 380167 401132
9698 401132 419418 418259 411919 413292 401633 382210 358651 336192 328136 334229 328821 294266 290016
9685 290016 276452 271423 255524 255927 240934 230080 203265 194180 196753 195431 204513 188075 172215
9672 172215 168989 143702 139720 149209 165702 175548 150531 117576 134295 138709 139191 121854 94386
9659 94386 91806 111723 125421 106536 80965 78316 70979 83304 100675 109154 79679 82811 98887
9646 98887 90868 82130 80849 79000 87426 81666 76754 99119 131251 136505 124600 123231 138363 119968
9632 119968 92555 73746 84892 115155 130084 117231 92963 93956 107258 115725 104504 101420
9620 101420 89112 68778 64420 71780 85220 85883 87945 100297 92152 87827 105439 102575 120803
$$ packed form
9711A47933L3997K3421M6160L1686J9796R232N907M420m54K5625K6932N512K0965
9698D01132J8286j159o340J373j1659j9423k3559k2459q056O093n408l4555m250
9685B90016j3564n029j5899M03j4993j0854k6815r085K573j322R082j6438j5860
9672A72215l226k5287l982R489J6493R846k5017l2955J6719M414M82j7337k7468
9659I4386k580J9917J3698j8885k5571k649p337J2325J7371Q479k9475L132J6076
9646I8887q019q738j281j849Q426n760m912K2365L2132N254j1905j369J5132j8395
9632A19968k7413j8809J1146L0263J4929j2853k4268R93J3302Q467j1221l084
9620A01420j2308k0334m358P360J3440O63K062J2352q145m325J7612k864J8228
$$ plain form
9607 120803 111925 99942 104704 106781 93184 70249 78716 76457 69110 76871 80242 71330 80834 90880
9593 90880 78876 76103 68516 53081 47718 66564 80949 84896 97546 89604 85220 64069 61505
9580 61505 65554 59774 61491 62219 79574 84017 67304 66401 73647 73618 67984 58393 48702 65627 87554
9565 87554 80390 62797 62759 70246 83441 83803 73905 53169 41587 53902 72937 81267 68456 62430
9551 62430 60113 59518 70982 59403 56947 42378 40304 46096 62730 81936 111248 129952 124053
9538 124053 122375 138193 129652 114882 105062 98556 85452 83750 75146 81713 70085 46193 46869
9525 46869 62596 81080 98729 105193 107858 117483 122315 133635 130374 113981 95508 102006 89161
9512 89161 84459 87051 73486 66660 70490 83857 100103 112151 102490 97547 100942 88793 101825
$$ packed form
9607A20803q878j1983M762K077j3597k2935Q467k259p347P761L371q912R504J0046
9593I0880j2004k773p587j5435n363J8846J4385L947J2650p942m384k1151k564
9580F1505M049n780J717P28J7355M443j6713r03P246k9n634r591r691J6925K1927
9565H7554p164j7593l8P487J3195L62r898k0736j1582J2315J9035Q330j2811o026
9551F2430k317n95J1464j1579k456j4569k074N792J6634J9206K9312J8704n899
9538A24053j678J5818q541j4770r820o506j3104j702q604O567j1628k3892O76
9525D6869J5727J8484J7649O464K665R625M832J1320l261j6393j8473O498j2845
9512H9161m702K592j3565o826L830J3367J6246J2048r661m943L395j2149J3032
$$ plain form
9499 101825 95487 95176 96566 93016 82222 64025 74199 71392 61806 62469 70290 74788 80573 82701
9485 82701 77560 93550 93199 99348 124083 137427 143491 120422 87693 70076 70197 74108 85471
9472 85471 86266 96811 89845 63118 74214 81401 103521 98493 90161 106546 108237 109654 115709 110457
9458 110457 116052 136346 149577 169118 144617 110984 114006 124522 122842 113411 111745 103696 98566
9445 98566 111121 126196 135472 146894 160933 160537 129515 107177 121208 128753 117361 131902 135925
9432 135925 137182 159869 160681 150073 134081 113073 83007 76852 92478 100442 108792 116208 111650
9419 111650 130586 143725 130101 125363 128563 125251 107389 93968 111585 117120 103487 94967 95411
9406 95411 113540 117044 118364 123564 141254 150900 145783 132938 138828 139532 140237 165590 178602 172029
$$ packed form
9499A01825o338l11J390l550j0794j8197J0174k807r586O63P821M498N785K128
9485H2701n141J5990l51O149K4735J3344O064k3069l2729j7617J21L911J1363
9472H5471P95J0545o966k6727J1096P187K2120n028q332J6385J691J417O055n252
9458A10457N595K0294J3231J9541k4501l3633L022J0516j680r431j666q049n130
9445I8566J2555J5075R276J1422J4039l96l1022k2338J4031P545j1392J4541M023
9432A35925J257K2687Q12j0608j5992k1008l0066o155J5626P964Q350P416m558
9419A11650J8936J3139j3624m738L200l312j7862j3421J7617N535j3633q520M44
9406I5411J8129L504J320N200J7690R646n117j2845N890P04P05K5353J3012o573
$$ plain form
9392 172029 177287 168768 146974 156972 168171 165727 175372 167094 157067 166496 184259 184306 166645 158407
9378 158407 159277 168027 183712 186519 168708 153702 152466 153722 147653 167158 181266 174762 199297
9365 199297 201911 187376 186150 217149 240779 228284 205367 204148 215076 220616 217083 224064 227771
9352 227771 232041 237041 240657 263719 282319 281208 277112 261025 252374 255246 260767 260857 284846 276806
9338 276806 268100 279560 294150 280041 277910 296071 320440 319834 313186 312519 308716 293810 273135
9325 273135 276172 287493 301351 305344 315910 330097 324958 316288 325771 330273 347495 367241 358282
9312 358282 355766 382708 393869 390824 399926 404977 428860 446047 426461 403031 408581 435973 447899
9299 447899 457998 464343 458438 467909 484189 479894 482850 493643 490415 501351 505946 510733 524057
$$ packed form
9392A72029N258q519k1794R998J1199k444R645q278j0027R429J7763M7j7661q238
9378A58407Q70Q750J5685K807j7811j5006j236J256o069J9505J4108o504K4535
9365A99297K614j4535j226L0999K3630j2495k2917j219J0928N540l533O981L707
9352B27771M270N000L616K3062J8600j111m096j6087q651K872N521R0K3989q040
9338B76806q706J1460J4590j4109k131J8161K4369o06o648o67l803j4906k0675
9325B73135L037J1321J3858L993J0566J4187n139q670R483M502J7222J9746q959
9312C58282k516K6942J1161l045R102N051K3883J7187j9586k3430N550K7392J1926
9299D47899J0099O345n905R471J6280m295K956J0793l228J0936M595M787J3324
$$ plain form
9286 524057 523736 537514 547538 543285 563811 607032 617553 626639 635395 644923 673559 690021 723580
9273 723580 724039 710899 735739 754557 749484 729068 738558 750580 762649 770187 776609 782918 808688
9260 808688 805629 813550 819915 828330 842652 864014 877383 897760 900290 896664 908240 917824 905345
9247 905345 926564 960189 969560 969942 961727 954220 942528 945088 956042 971397 963136 964160 1014036
9234 1014036 1039310 1054214 1065451 1061156 1066388 1048911 1052352 1076454 1089486 1101708 1096543 1096431 1088150
9221 1088150 1084101 1060643 1044356 1020687 981318 978970 951723 946961 952243 966127 961068 941116
9209 941116 916558 919792 915619 906121 913243 894770 886724 847629 838689 836715 813663 801878 810353
9196 810353 799755 780422 786903 795045 792617 792883 773582 754364 742265 747388 756011 759192 772496
$$ packed form
9286E24057l21J3778J0024m253K0526M3221J0521R086Q756R528K8636J6462L3559
9273G23580M59j3140K4840J8818n073k0416R490J2022J2069P538O422O309K5770
9260H08688l059P921O365Q415J4322K1362J3369K0377K530l626J1576R584j2479
9247I05345K1219L3625R371L82q215p507j1692K560J0954J5355q261J024M9876
9234A014036K5274J4904J1237m295N232j7477L441K4102J3032J2222n165j12q281
9221A088150m049k3458j6287k3669l9369k348k7247m762N282J3884n059j9952
9209I41116k4558L234m173r498P122j8473q046l9095q940j974k3052j1785Q475
9196H10353j0598j9333O481Q142k428K66j9301j9218j2099N123Q623L181J3304
$$ plain form
9183 772496 778262 783927 776621 767674 752713 759604 770537 771845 801412 840836 877553 933287 1029242
9170 1029242 1154978 1242275 1290035 1368326 1477359 1606425 1788206 1989204 2151054 2292071
9160 2292071 2393093 2416735 2393166 2308500 2171872 2025542 1893623 1737881 1596467 1464045
9150 1464045 1352344 1245863 1153656 1065510 988654 929298 867202 815877 772050 748387 705371
9139 705371 674021 661260 657493 643228 623022 604402 591712 578483 558914 552654 540783 535682
9127 535682 527725 526035 526984 510026 483313 453754 456383 469779 471289 457374 455887 433958 427345
9114 427345 420832 404536 412808 411335 394715 399478 398494 378470 371880 364085 355616 353143 348585 341199
9100 341199 325376 310451 294871 288458 306133 314616 312598 307944 309253 311916 310866 303440 294899
$$ packed form
9183G72496N766N665p306q947j4961O891J0933J308K9567L9424L6717N5734R5955
9170A029242J25736Q7297M7760P8291J09033J29066J81781K00998J61850J41017
9160B292071J01022K3642k3569q4666j36628j46330j31919j55742j41414j32422
9150A464045j11701j06481r2207q8146p6856n9356o2096n1325m3827k3663m3016
9139G05371l1350j2761l767j4265k0206j8620j2690j3229j9569o260j1871n101
9127E35682p957j690R49j6958k6713k9559K629J3396J510j3915j487k1929o613
9114D27345o513j6296Q272j473j6620M763r84k0024o590p795q469k473m558p386
9100C41199j5823j4925j5580o413J7675Q483k018m654J309K663j050p426q541
$$ plain form
9087 294899 277996 265640 274007 278491 281286 271696 254723 227349 222985 226145 204363 214201 215750
9074 215750 203065 186426 173167 163243 171344 188021 199663 225169 222291 231556 248223 254592 251066
9061 251066 249706 245286 258369 247190 229888 240441 258859 300456 310680 303642 277574 272176
9049 272176 254573 229035 223186 233482 252743 232360 220061 227267 220774 213262 211622 233714 255933
9036 255933 274461 258410 247374 260335 276934 265482 259548 244297 241352 259956 236212 226230
9024 226230 254813 260482 275415 295477 339845 384444 408484 429661 420379 406899 420192 439634
9012 439634 439009 408805 397576 378557 362280 333851 315808 294425 270402 263610 272396 298247
9000 298247 297527 284226 277645 300682 302261 292936 295476 275115 273279 279647 274594 266655 251939 212601
$$ packed form
9087B94899j6903j2356Q367M484K795r590j6973k7374m364L160k1782R838J549
9074B15750j2685j6639j3259r924Q101J6677J1642K5506k878R265J6667O369l526
9061B51066j360m420J3083j1179j7302J0553J8418M1597J0224p038k6068n398
9049B72176j7603k5538n849J0296J9261k0383j2299P206o493p512j640K2092K2219
9036B55933J8528j6051j1036J2961J6599j1452n934j5251k945J8604k3744r982
9024B26230K8583N669J4933K0062M4368M4599K4040K1177r282j3480J3293J9442
9012D39634o25l0204j1229j9019j6277k8429j8043k1383k4023o792Q786K5851
9000B98247p20j3301o581K3037J579r325K540k0361j836O368n053p939j4716l9338
$$ plain form
8986 212601 174657 165663 157559 161590 174133 154266 138617 138202 170294 194497 174953 149811 140232
8973 140232 146914 173970 174655 150744 139117 148811 153296 160036 168630 152121 146780 156843 159189
8960 159189 136734 116484 106448 120680 139306 133265 103080 109210 155731 196529 199314 187332
8948 187332 189928 182935 197807 215855 229989 228661 236007 233006 229966 246905 248843 241541 220741
8935 220741 208317 192477 173952 170903 162286 138564 134449 133774 160348 163853 171117 154996 150157
8922 150157 126853 115749 114090 99426 93772 111753 171503 236790 280137 288041 275423 293946
8910 293946 324613 334025 340658 357319 371299 366950 365105 385870 409745 400585 401809 387616 339265
8897 339265 295112 284468 287911 325214 373679 466944 588322 708388 816443 895925 938391
$$ packed form
8986B12601l7944q994q104M031J2543j9867j5649m15L2092K4203j9544k5142r579
8973A40232O682K7056O85k3911j1627R694M485O740Q594j6509n341J0063K346
8960A59189k2455k0250j0036J4232J8626o041l0185O130M6521M0798K785j1982
8948A87332K596o993J4872J8048J4134j328P346l001l040J6939J938p302k0800
8935B20741j2424j5840j8525l049q617k3722m115o75K6574L505P264j6121m839
8922A50157k3304j1104j659j4664n654J7981N9750O5287M3347P904j2618J8523
8910B93946L0667R412O633J6661J3980m349j845K0765K3875r160J224j4193m8351
8897C39265m4153j0644L443L7303M8465R3265J21378J20066J08055P9482M2466
$$ plain form
8886 938391 933979 878416 844267 847707 833192 839355 855368 853400 854423 872767 875276 875188 864794
8873 864794 860583 845661 824740 818505 834389 890451 932189 962169 975272 995226 1020028 1024114
8861 1024114 1056630 1075868 1068407 1039050 1048273 1034439 1019676 1049656 1095211 1144897 1185732 1232066
8849 1232066 1288919 1353287 1413087 1455750 1512531 1577190 1624589 1664423 1693235 1691494 1702419 1703214
8837 1703214 1719263 1755914 1772777 1794717 1803837 1831407 1910887 2011069 2097063 2219900 2449306
8826 2449306 2848502 3440694 4189586 4759476 4918248 4687963 4279253 3920912 3709008 3593045
8816 3593045 3481351 3360094 3258090 3163442 3109333 3089022 3071022 3054320 3065578 3099507 3176960
8805 3176960 3275608 3397693 3498214 3612783 3744013 3927055 4111344 4301929 4518470 4767672
$$ packed form
8886I38391m412n5563l4149L440j4515O163J6013j968J023J8344K509q8j0394
8873H64794m211j4922k0921o235J5884N6062M1738K9980J3103J9954K4802M086
8861A024114L2516J9238p461k9357R223j3834j4763K9980M5555M9686M0835M6334
8849A232066N6853O4368N9800M2663N6781O4659M7399L9834K8812j741J0925P95
8837A703214J6049L6651J6863K1940R120K7570P9480J00182Q5994J22837K29406
8826B449306L99196N92192P48892N69890J58772k30285m08710l58341k11904j15963
8816C593045j11694j21257j02004r4648n4109k0311j8000j6702J1258L3929P7453
8805C176960R8648J22085J00521J14569J31230J83042J84289J90585K16541K49202
$$ plain form
8795 4767672 5011284 5273696 5542171 5822027 6117303 6488231 6951342 7502232 8109858 8806885
8785 8806885 9631438 10624301 11785758 13157368 14762134 16657315 18899105 21541532 24753953
8776 24753953 28636651 33181600 38313072 44076958 50847386 59345118 70627048 86324286
8768 86324286 108866765 142095819 192109260 266279104 363217701 452754938 494519688
8761 494519688 478614172 420150723 353394451 299322595 259864281 229522144 203376348
8754 203376348 180037114 159564332 142078935 127327930 114831737 104151480 94979582
8747 94979582 86923920 79680479 73195488 67456806 62407623 58022329 54245689 51017233
8739 51017233 48239525 45827570 43710216 41836914 40176115 38619654 37050917 35410825
$$ packed form
8795D767672K43612K62412K68475K79856K95276L70928M63111N50890O07626O97027
8785H806885Q24553R92863J161457J371610J604766J895181K241790K642427L212421
8776B4753953L882698M544949N131472N763886O770428Q497732J1281930J5697238
8768H6324286K2542479L3229054N0013441P4169844R6938597Q9537237M1764750
8761D94519688j5905516n8463449o6756272n4071856l9458314l0342137k6145796
8754B03376348k3339234k0472782j7485397j4751005j2496193j0680257r171898
8747I4979582q055662p243441o484991n738682n049183m385294l776640l228456
8739E1017233k777708k411955k117354j873302j660799j556461j568737j640092
$$ plain form
8731 35410825 33718296 32075706 30544363 29165683 27927209 26825853 25833047 24929694
8723 24929694 24076680 23278125 22526672 21798432 21102630 20414813 19750359 19106874 18479476
8714 18479476 17849139 17230963 16639702 16053415 15473194 14908310 14392959 13940125 13537783
8705 13537783 13160774 12798330 12494537 12193958 11877968 11544953 11232680 10949379 10676098
8696 10676098 10406346 10174742 9924423 9670545 9419307 9144265 8888853 8675526 8465856
8687 8465856 8291235 8122519 7965357 7818278 7668420 7493438 7294055 7092834 6912580 6726603
8677 6726603 6550098 6401806 6272073 6128002 5973033 5825949 5694939 5569816 5443443 5293127
8667 5293127 5150584 5032978 4957223 4907356 4862918 4775511 4644201 4481911 4333734 4216226
$$ packed form
8731C5410825j692529j642590j531343j378680j238474j101356r92806r03353
8723B4929694q53014p98555p51453p28240o95802o87817o64454o43485o27398
8714A8479476o30337o18176n91261n86287n80221n64884n15351m52834m02342
8705A3537783l77009l62444l03793l00579l15990l33015l12273k83301k73281
8696A0676098k69752k31604k50319k53878k51238k75042k55412k13327k09670
8687H465856j74621j68716j57162j47079j49858j74982j99383k01221j80254j85977
8677F726603j76505j48292j29733j44071j54969j47084j31010j25123j26373j50316
8667E293127j42543j17606p5755m9867m4438q7407j31310j62290j48177j17508
$$ plain form
8657 4216226 4111109 4027286 3946600 3867966 3791959 3699012 3625717 3561204 3481216 3424427 3390089
8646 3390089 3337766 3264777 3192722 3098881 2982468 2873077 2744987 2578733 2418255 2301421
8636 2301421 2227692 2177927 2149438 2118024 2075290 2028639 1979732 1927709 1883435 1828392 1788976
8625 1788976 1752581 1724134 1666357 1614036 1594430 1586737 1566719 1535593 1538704 1545784 1577256 1622829
8613 1622829 1675622 1744673 1840550 1957961 2109992 2333175 2613499 2966900 3489616 4374139
8603 4374139 5834470 8104068 10711321 12204071 12092701 10579987 8801842 7420988
8595 7420988 6501068 5847913 5267844 4751887 4302143 3906726 3597692 3346506 3123982 2939818
8585 2939818 2798891 2676694 2581076 2499475 2446450 2407066 2404131 2435150 2470953 2529510 2686726
$$ packed form
8657D216226j05117q3823q0686p8634p6007r2947p3295o4513p9988n6789l4338
8646C390089n2323p2989p2055r3841j16413j09391j28090j66254j60478j16834
8636B301421p3729m9765k8489l1414m2734m6651m8907n2023m4274n5043l9416
8625A788976l6395k8447n7777n2321j9606p693k0018l1126L111P080L1472M5573
8613A622829N2793O9051R5877J17411J52031K23183K80324L53401N22716Q84523
8603D374139J460331K269598K607253J492750j11370j512714j778145j380854
8595G420988r19920o53155n80069n15957m49744l95417l09034k51186k22524j84164
8585B939818j40927j22197r5618q1601n3025l9384k935L1019L5803N8557J57216
$$ plain form
8574 2686726 2941943 3421929 4342237 5985565 8153269 9397514 9364151 8124835 6638731
8565 6638731 5601647 4949928 4515344 4126665 3777303 3455013 3193877 2994300 2827473
8556 2827473 2671108 2555149 2436465 2338296 2235560 2132466 2032075 1946874 1870127 1803679
8546 1803679 1733902 1677220 1649596 1620383 1593646 1563378 1546543 1516326 1455003 1428149 1402746
8535 1402746 1382342 1386317 1387095 1387171 1388859 1380014 1353544 1329893 1295259 1279252 1263441 1245455 1235359
8522 1235359 1224735 1219128 1224333 1217731 1214682 1198978 1169007 1137190 1106984 1069047 1038228 1016261
8510 1016261 995325 971593 969900 984274 972428 926887 869063 831607 786794 766974 745133 724357
8498 724357 708649 694257 687978 670385 655597 639450 629914 627969 608695 585010 561398 540698
$$ packed form
8574B686726K55217M79986R20308J643328K167704J244245l3363j239316j486104
8565F638731j037084o51719m34584l88679l49362l22290k61136j99577j66827
8556B827473j56365j15959j18684r8169j02736j03094j00391q5201p6747o6448
8546A803679o9777n6682k7624k9213k6737l0268j6835l0217o1323k6854k5403
8535A402746k0404L975P78P6J688q845k6470k3651l4634j6007j5811j7986j0096
8522A235359j0624n607N205o602l049j5704k9971l1817l0206l7937l0819k1967
8510A016261k0936k3732j693J4374j1846m5541n7824l7456m4813j9820k1841k0776
8498G24357j5708j4392o279j7593j4788j6147r536j945j9274k3685k3612k0700
$$ plain form
8486 540698 525262 515371 507963 501986 509638 502234 484682 488252 483584 471105 438133 441004 421973
8473 421973 394828 385876 381269 374661 366199 381134 390251 380632 386445 388869 378253 381035 389751 367812
8459 367812 369591 382052 374474 370150 368771 382630 375641 372540 353555 373097 391279 409770 406366
8446 406366 375057 360477 374883 390087 371805 348400 330866 343423 336604 327003 309874 311346
8434 311346 312493 301434 299539 289577 286691 295403 300414 312220 308743 316058 331211 350374 349542 317427
8420 317427 310836 301002 301597 312884 320361 314212 305564 308403 304832 295905 288786 289877 272880 265254
8406 265254 272357 259735 230912 215340 203494 227010 246022 255885 271417 274638 270664 259827
8394 259827 256814 272991 277330 274363 293664 302614 309943 306949 299956 323030 331843 331901 333835 368969
$$ packed form
8486E40698j5436r891p408n977P652p404j7552L570m668j2479l2972K871j9031
8473D21973k7145q952m607o608q462J4935R117r619N813K424j0616K782Q716k1939
8459C67812J779J2461p578m324j379J3859o989l101j8985J9542J8182J8491l404
8446D06366l1309j4580J4406J5204j8282k3405j7534J2557o819r601j7129J472
8434C11346J147j1059j895r962k886Q712N011J1806l477P315J5153J9163q32l2115
8420C17427o591r834N95J1287P477o149q648K839l571q927p119J091j6997p626
8406B65254P103j2622k8823j5572j1846K3516J9012R863J5532L221l974j0837
8394B59827l013J6177M339k967J9301Q950P329k994o993K3074Q813N8J934L5134
$$ plain form
8380 368969 382355 375470 361755 363226 377983 391478 415603 437457 454640 484543 545047 617892
8368 617892 687828 777821 883942 1022179 1184313 1381938 1588180 1769115 1930858 2037940
8358 2037940 2099819 2071805 1977537 1859751 1716076 1577517 1427704 1283710 1163139 1047653
8348 1047653 945421 891022 826379 748558 666936 637178 610786 551436 523076 518523 498416
8337 498416 460839 440719 425334 435772 438342 436804 417151 381316 341212 336743 339166 344213 334353
8324 334353 321480 312727 301205 301123 304899 302674 296829 275105 284375 300015 308797 306697 293610 283476
8310 283476 279955 287596 276075 267395 244797 219524 208982 194593 180039 158911 158436 153400 153231
8297 153231 180599 189401 165178 149097 166621 180689 177520 179529 182691 204717 214843 209743 204860
$$ packed form
8380C68969J3386o885j3715J471J4757J3495K4125K1854J7183K9903O0504P2845
8368F17892O9936Q9993J06121J38237J62134J97625K06242J80935J61743J07082
8358B037940O1879k8014r4268j17786j43675j38559j49813j43994j20571j15486
8348A047653j02232n4399o4643p7821q1622k9758k6392n9350k8360m553k0107
8337D98416l7577k0120j5385J0438K570j538j9653l5835m0104m469K423N047r860
8324C34353j2873q753j1522q2L776k225n845k1724R270J5640Q782k100j3087j0134
8310B83476l521P641j1521q680k2598k5273j0542j4389j4554k1128m75n036j69
8297A53231K7368Q802k4223j6081J7524J4068l169K009L162K2026J0126n100m883
$$ plain form
8284 204860 186261 170115 164907 160763 159120 169308 163821 161052 159357 146964 151969 141588 132716
8271 132716 128385 125978 125329 126438 132380 135615 146523 161412 176358 175448 170005 151539 130799 123684
8257 123684 118612 120584 146974 163859 167755 180612 179802 177815 174726 182200 183187 180061 189918 195551
8243 195551 198837 194830 178859 153304 150973 158094 173833 167587 173634 191850 195380 167845 149733
8230 149733 158165 165814 148591 140067 132755 153144 182641 200408 200864 187302 175579 160906 161185
8217 161185 164819 164288 157250 161821 164287 156180 147989 152227 176299 181078 184139 170492 159665 166422
8203 166422 176730 182480 169870 177414 201492 232763 240769 224540 204987 196068 203427 202395 200044
8190 200044 190975 192972 215645 228523 236727 258943 247572 234289 214733 197019 195762 192690 165220
$$ packed form
8284B04860j8599j6146n208m144j643J0188n487k769j695j2393N005j0381q872
8271A32716m331k407o49J109N942L235J0908J4889J4946r10n443j8466k0740p115
8257A23684n072J972K6390J6885L896J2857q10j987l089P474R87l126R857N633
8243A95551L286m007j5971k5555k331P121J5739o246O047J8216L530k7535j8112
8230A49733Q432P649j7223q524p312K0389K9497J7767M56j3562j1723j4673K79
8217A61185L634n31p038M571K466q107q191M238K4072M779L061j3647j0827O757
8203A66422J0308N750j2610P544K4078L1271Q006j6229j9553q919P359j032k351
8190B00044r069J997K2673J2878Q204K2216j1371j3283j9556j7714j257l072k7470
$$ plain form
8177 165220 171770 171247 156431 166652 166791 163994 176799 186907 186677 191063 206744 223731 228130 250319
8163 250319 265891 300356 335400 366652 375543 368659 368683 371379 355818 319423 283485 255914 267777
8150 267777 262404 232127 218866 211790 216884 224740 208628 193407 175374 143811 136133 139881 150255
8137 150255 158657 156324 142097 141422 160202 176038 162004 142585 129587 146979 168525 176927 188724
8124 188724 170749 172626 167929 170220 197856 232363 266087 311140 372320 453060 532742 561463
8112 561463 573041 534816 503564 454623 409542 369633 346102 328096 306408 292855 290630 255296
8100 255296 224984 218645 219570 212296 209317 213744 220578 215691 214137 211418 217477 218507 207668 195045
8086 195045 172973 179222 194339 188607 199066 208755 191023 166593 151315 141524 153285 182151
$$ packed form
8177A65220O550n23j4816J0221J39k797J2805J0108k30M386J5681J6987M399K2189
8163B50319J5572L4465L5044L1252Q891o884K4K696j5561l6395l5938k7571J1863
8150B67777n373l0277j3261p076N094P856j6112j5221j8033l1563p678L748J0374
8137A50255Q402k333j4227o75J8780J5836j4034j9419j2998J7392K1546Q402J1797
8124A88724j7975J877m697K291K7636L4507L3724M5053O1180Q0740P9682K8721
8112E61463J1578l8225l1252m8941m5081l9909k3531j8006k1688j3553k225l5334
8100B55296l0312o339R25p274k979M427O834m887j554k719O059J030j0839j2623
8086A95045k2072O249J5117n732J0459R689j7732k4430j5278r791J1761K8866
$$ plain form
8074 182151 194594 207293 234532 256108 275352 288397 333083 341972 332201 319924 311023 300973
8062 300973 293664 282128 273040 263384 256657 251950 252618 245815 212857 187175 196039 188314 175215 180143
8048 180143 191175 194963 179209 165718 162473 176312 166049 151405 164113 176336 146448 131376
8036 131376 141393 156028 155422 144448 134187 142098 145529 148243 149330 137918 138388 136431 157451
8023 157451 153432 147559 171023 188510 179232 148988 142017 163300 142280 112703 103783 116850 139809
8010 139809 139023 134090 144059 142882 127017 127935 127113 100171 94508 96185 87217 89165 89948 98846 124239
7995 124239 137242 142807 138961 145803 135787 116360 100119 112097 116303 123257 123798 111436 117422
7982 117422 113330 117593 121028 142781 140139 115122 95998 97293 90319 88593 94284 107090 113481
$$ packed form
8074A82151J2443J2699K7239K1576J9244J3045M4686Q889r771j2277q901j0050
8062C00973p309j1536r088r656o727m707O68o803l2958k5682Q864p725j3099M928
8048A80143J1032L788j5754j3491l245J3839j0263j4644J2708J2223k9888j5072
8036A31376J0017J4635o06j0974j0261P911L431K714J087j1412M70j957K1020
8023A57451m019n873K3464J7487r278l0244o971K1283k1020k9577q920J3067K2959
8010A39809p86m933R969j177j5865R18q22k6942n663J677q968J948P83Q898K5393
7995A24239J3003N565l846O842j0016j9427j6241J1978M206O954N41j2362N986
7982A17422m092M263L435K1753k642k5017j9124J295o974j726N691J2806O391
$$ plain form
7969 113481 126839 116675 119146 117435 122309 135941 133275 118555 113326 103765 112485 125010 119358
7956 119358 106688 105348 93575 97590 115866 116496 142437 148282 135291 125321 118694 140171 130625
7943 130625 123664 131453 123762 105372 119328 140640 122887 111219 110842 113558 113593 106614 104543 98198
7929 98198 100319 108800 113103 110625 111140 94748 97052 98731 110313 109621 85436 81574 84488 82167
7915 82167 84450 83901 73340 74600 56025 55939 65787 69923 81643 95947 117419 120432 122877 135124
7901 135124 133879 139787 129933 115353 126162 125881 119349 121906 129322 126260 107278 93452 80106
7888 80106 83246 65763 74275 103294 111743 96001 92094 87650 82033 85805 79748 87498 83893 71004
7874 71004 69660 75482 76517 83675 74881 71154 78757 65530 34452 31817 37215 42109 43087 56362
$$ packed form
7969A13481J3358j0164K471j711M874J3632k666j4720n229r561Q720J2525n652
7956A19358j2670j340j1773M015J8276O30K5941N845j2991r970o627K1477r546
7943A30625o961P789p691j8390J3956K1312j7753j1668l77K716L5o979k071o345
7929I8198K121Q481M303k478N15j6392K304J679J1582o92k4185l862K914k321
7915H2167K283n49j0561J260j8575q6R848M136J1720J4304K1472L013K445J2247
7901A35124j245N908r854j4580J0809k81o532K557P416l062j8982j3826j3346
7888H0106L140j7483Q512K9019Q449j5742l907m444n617L772o057P750l605j2889
7874G1004j344N822J035P158q794l727P603j3227l1078k635N398M894R78J3275
$$ plain form
7860 56362 80186 75504 55273 61019 73275 63124 66831 66523 64448 59745 62980 72115 56115 43246
7846 43246 48811 59197 56431 50975 62475 57961 58556 63199 56312 61702 60967 66951 47848 35791
7832 35791 24459 39051 65656 75691 68504 49015 30233 40302 49637 37276 25294 26857
7820 26857 19485 11673 13312 23588 35551 51575 75249 84029 78202 66104 57133 49874 53537
7807 53537 35404 32813 59218 71180 57583 50576 52743 28985 33624 44165 43705 50265 55727
7794 55727 60304 50608 42300 33024 19185 -2324 3350 20704 30036 39470 23291 46913 66627
7781 66627 49272 30316 24665 11131 6504 20453 32989 21196 28130 52681 63263 51515
7769 51515 36021 41044 33314 30496 28997 38012 40697 15501 4264 -1735 1771 20873 31930
$$ packed form
7860E6362K3824m682k0231N746J2256j0151L707l08k075m703L235R135j6000j2869
7846D3246N565J0386k766n456J1500m514N95M643o887N390p35N984j9103j2057
7832C5791j1332J4592K6605J0035p187j9489j8782J0069R335j2361j1982J563
7820B6857p372p812J639J0276J1963J6024K3674Q780n827j2098q971p259L663
7807E3537j8133k591K6405J1962j3597p007K167k3758M639J0541m60O560N462
7794E5727M577r696q308r276j3839k1509N674J7354R332R434j6179K3622J9714
7781F6627j7355j8956n651j3534m627J3949J2536j1793O934K4551J0582j1748
7769E1515j5494N023p730k818j499R015K685k5196j1237n999L506J9102J1057
$$ plain form
7756 31930 36239 52815 69026 64511 50694 47269 61701 56382 26711 11670 14280 20913 17560
7743 17560 5199 26178 41263 47431 47056 31226 47635 51597 37802 51681 59140 37284 43967
7730 43967 65655 77995 81225 68989 60838 47592 22374 11122 14094 19945 33831 31821 31253
7717 31253 26369 22479 28659 18720 25765 42785 46565 46735 46111 40798 47380 35038 44150 65766
7703 65766 68122 65437 43530 30775 26791 46900 30127 28086 25400 23234 28556 43197 52267
7690 52267 48346 32107 25341 22057 26019 33692 56465 85747 64467 39592 37733 33826 29776
7677 29776 31554 28615 27127 31059 31976 25508 24414 27741 26182 31190 43877 38390 24594 35669
7663 35669 42373 48719 36212 55304 60531 59256 67749 41011 16777 10373 35648 32269 40855
$$ packed form
7756C1930M309J6576J6211m515j3817l425J4432n319k9671j5041K610O633l353
7743A7560j2361K0979J5085O168l75j5830J6409L962j3795J3879P459k1856O683
7730D3967K1688J2340L230j2236q151j3246k5218j1252K972N851J3886k010n68
7717C1253m884l890O180r939P045J7020L780J70o24n313O582j2342R112K1616
7703F5766K356k685k1907j2755l984K0109j6773k041k686k166N322J4641R070
7690E2267l921j6239o766l284L962P673K2773K9282k1280k4875j859l907m050
7677B9776J778k939j488L932R17o468j094L327j559N008J2687n487j3796J1075
7663C5669O704O346j2507J9092N227j275Q493k6738k4234o404K5275l379Q586
$$ plain form
7650 40855 40267 35534 31061 18149 26503 30007 20191 14163 15063 27199 35284 13554 -236 -833
7636 -833 -7587 -16686 -9468 17780 25250 25345 34332 16356 2633 -5726 13558 13975 18660 14904 36073
7621 36073 34238 27996 21945 21835 43034 60158 61909 38255 42239 50989 42965 35867 25033 5910
7607 5910 7944 27434 32623 28575 31426 42521 32934 33091 23718 -41 -17235 -12785 -16801 -18711
7593 -18711 -24720 -25141 -5213 9468 20032 34211 27818 7307 -11970 -10815 619 16986 18534
7580 18534 28326 15548 12506 36329 39104 19622 13247 14848 34568 26896 24094 18081 12568 20345
7566 20345 31104 43360 48706 50802 29735 22372 7196 20754 29634 47311 43893 45083 44212
7553 44212 22020 11989 15720 12288 28038 49588 50987 56453 38213 22005 6460 8827 18003
$$ packed form
7650D0855n88m733m473j2912Q354L504r816o028R00J2136Q085k1730j3790n97
7636h33o754r099P218K7248P470R5Q987j7976j3723q359J9284M17M685l756K1169
7621C6073j835o242o051j10K1199J7124J751k3654L984Q750q024p098j0834j9123
7607E910K034J9490N189m048K851J1095r587J57r373k3759j7194M450m016j910
7593a8711o009m21J9928J4681J0564J4179o393k0511j9277J155J1434J6367J548
7580A8534R792j2778l042K3823K775j9482o375J601J9720p672k802o013n513P777
7566B0345J0759J2256N346K096k1067p363j5176J3558Q880J7677l418J190q71
7553D4212k2192j0031L731l432J5750K1550J399N466j8240j6208j5545K367R176
$$ plain form
7540 18003 33743 27343 2482 -19427 -14965 5925 21730 10170 509 12571 25742 39343
7528 39343 42194 26795 32109 34013 41997 40881 20097 20059 31135 16160 10452 25464 28412 35393
7514 35393 40500 47580 28668 22997 25278 31168 55786 52419 31961 44623 32280 30119 16487
7501 16487 3863 5662 15492 4993 5893 19831 16865 7024 -9934 1765 13478 30058 26136
7488 26136 31603 34809 28526 33350 47933 46375 44325 44574 38114 36423 11693 1661 17937 6398
7474 6398 21983 26976 15490 6378 5706 -8846 3230 6110 18132 31536 36189 35752 29181 31389
7460 31389 19289 3970 8397 10987 7073 17970 14316 1953 -10526 17163 40078 44728 52143
7447 52143 44119 45000 23679 -6524 9531 11139 9345 24252 28364 23410 34249 48309 46790
$$ packed form
7540A8003J5740o400k4861k1909M462K0890J5805j1560r661J2062J3171J3601
7528C9343K851j5399N314J904P984j116k0784l8J1076j4975n708J5012K948O981
7514C5393N107P080j8912n671K281N890K4618l367k0458J2662j2343k161j3632
7501A6487j2624J799R830j0499R00J3938k966r841j6958J1699J1713J6580l922
7488B6136N467L206o283M824J4583j558k050K49o460j691k4730j0032J6276j1539
7474F398J5585M993j1486r112o72j4552J2076K880J2022J3404M653m37o571K208
7460C1389j2100j5319M427K590l914J0897l654j2363j2479K7689K2915M650P415
7447E2143q024Q81k1321l0203J6055J608j794J4907M112m954J0839J4060j519
$$ plain form
7434 46790 46497 35016 10719 16634 29687 45089 52433 29751 25055 40230 51203 46670 34933
7421 34933 34807 31963 8483 -1267 -7166 -10022 -5359 17941 24414 28047 31379 36249 30357 9523
7407 9523 14158 38834 37120 27041 27931 26421 41924 45958 46247 45879 36921 17720 6383 23717
7393 23717 45236 41608 21322 -5377 -5544 1027 1957 -2359 -16025 -5789 14833 25688 -1130
7380 -1130 -6227 2538 11090 14095 8902 10325 5668 8663 16608 -2784 -14276 -17011 -3587 5190
7366 5190 4642 -3646 -12031 -14146 -5130 17745 22414 18378 24566 8353 -10133 2289 15589 22898
7352 22898 25587 30365 26379 22177 7599 -117 8615 28543 39787 45679 46465 62386 52568 42499
7338 42499 37903 38272 23227 19721 14596 24674 26410 38242 18692 17415 -8692 -12546 582
$$ packed form
7434D6790k93j1481k4297N915J3053J5402P344k2682m696J5175J0973m533j1737
7421C4933j26k844k3480r750n899k856M663K3300O473L633L332M870n892k0834
7407I523M635K4676j714j0079Q90j510J5503M034K89l68q958j9201j1337J7334
7393B3717K1519l628k0286k6699j67O571R30m316j3666J0236K0622J0855k6818
7380a130n097Q765Q552L005n193J423m657K995P945j9392j1492k735J3424Q777
7366E190n48q288q385k115R016K2875M669m036O188j6213j8486J2422J3300P309
7352B2898K689M778l986m202j4578p716Q732J9928J1244N892P86J5921r818j0069
7338D2499m596L69j5045l506n125J0078J736J1832j9550j277k6107l854J3128
$$ plain form
7325 582 9463 -9738 -10406 8065 7356 1825 7447 3028 11948 17077 22926 42396 28657 25675 27106
7310 27106 24984 23270 22582 23590 33219 32720 38744 43335 37170 23662 29932 37871 42294 35120 37515
7295 37515 47666 33170 18500 2651 21964 21193 14204 19680 31848 50613 44809 48869 47787
7282 47787 43829 25655 18584 17309 26100 19674 21448 26951 29910 32468 36996 33919 43865 53777
7268 53777 34239 25250 17935 38785 53581 47925 35308 27209 14604 7847 1904 -1005 -11773
7255 -11773 -20302 -24708 -27277 -34708 -19641 7141 18208 26949 45558 56297 54505 22923 34561
7242 34561 50489 60966 59848 54882 52696 24521 15599 8767 14473 -15126 -23860 -6934 11163
7229 11163 30986 18080 16638 21485 10974 5404 -5850 4291 4791 12490 -2063 -3002 -4236 2127
$$ packed form
7325E82Q881j9201o68J8471p09n531N622m419Q920N129N849J9470j3739k982J431
7310B7106k122j714o88J008R629m99O024M591o165j3508O270P939M423p174K395
7295C7515J0151j4496j4670j5849J9313p71o989N476J2168J8765n804M060j082
7282D7787l958j8174p071j275Q791o426J774N503K959K558M528l077R946R912
7268E3777j9538q989p315K0850J4796n656j2617q099j2605o757n943k909j0768
7255a1773q529m406k569p431J5067K6782J1067Q741J8609J0739j792l1582J1638
7242C4561J5928J0477j118m966k186k8175q922o832N706k9599q734J6926J8097
7229A1163J9823j2906j442M847j0511n570j1254J0141N00P699j4553r39j234O363
$$ plain form
7215 2127 12437 24274 42015 20128 9442 10454 6489 19101 35321 21951 -14050 -38910
7203 -38910 -33668 -15129 7037 2634 3110 16924 7763 -19602 -5358 -1355 -902 6731 5626 17785
7189 17785 21396 16999 15572 15413 11926 21075 23466 22385 12593 7452 6716 -7457 -9501 -12328 3083
7174 3083 -7942 -9058 6277 17036 15808 16407 5046 -11445 -13013 -22295 -696 3055 7189 11072
7160 11072 21522 29402 16758 24633 39069 30797 12073 15101 15151 15069 22510 18531 17114 14859 10136
7145 10136 15857 5134 -7975 -8371 -1011 -177 9115 16853 8371 3466 9814 -12334 -20820 -15279
7131 -15279 -9224 -48 -1756 2883 -2103 -9679 -5712 -8107 -4923 3029 11937 -9349 -21187 6238
7117 6238 34952 48604 38075 43238 28486 30789 33521 28510 20385 12432 19670 10064 -9020 6296
$$ packed form
7215B127J0310J1837J7741k1887j0686J012l965J2612J6220j3370l6001k4860
7203c8910N242J8539K2166m403M76J3814r161k7365J4244M003M53P633j105J2159
7189A7785L611m397j427j59l487R149K391j081r792n141p36j4173k044k827J5411
7174C083j1025j116J5335J0759j228N99j1361j6491j568r282K1599L751M134L883
7160A1072J0450P880j2644P875J4436q272j8724L028N0q2P441l979j417k255m723
7145A0136N721j0723j3109l96P360Q34R292P738q482m905O348k2148q486N541
7131a5279O055R176j708M639m986p576L967k395L184P952Q908k1286j1838K7425
7117F238K8714J3652j0529N163j4752K303K732n011q125p953P238r606j9084J5316
$$ plain form
7103 6296 19052 17191 7516 2044 -10841 -2574 10275 18334 9439 7144 20166 38153 22297
7090 22297 19561 23284 22642 15372 -11181 -27119 -18362 -9580 11339 14503 15514 23466 10877 1603
7076 1603 15837 16503 19831 44316 48200 37043 10720 12750 1330 8692 23854 20922 28100 1714
7062 1714 -31265 -42107 -23535 6812 9206 25047 36342 38052 31961 17326 3873 -796 -4550
7049 -4550 -20500 -11422 -5590 -986 13582 11148 27887 33747 31469 32441 38247 40816 7267 -28558
7035 -28558 -45170 -37673 -4554 14006 4006 -1016 -8591 -7566 7958 8118 -6194 6353 17397
7022 17397 25481 30300 21450 33145 37675 9292 145 1934 -7062 -12377 4601 19361 22693 3746
7008 3746 -2005 4382 14581 8939 11050 13639 8616 14237 11957 23312 35210 16897 -9585 -5188
$$ packed form
7103F296J2756j861r675n472j2885Q267J2849Q059q895k295J3022J7987j5856
7090B2297k736L723o42p270k6553j5938Q757Q782K0919L164J011P952j2589r274
7076A603J4234O66L328K4485L884j1157k6323K030j1420P362J5162k932P178k6386
7062A714l2979j0842J8572L0347K394J5841J1295J710o091j4635j3453m669l754
7049d550j5950R078N832M604J4568k434J6739N860k278R72N806K569l3549l5825
7035b8558j6612P497L3119J8560j0000n022p575J025J5524J60j4312J2547J1044
7022A7397Q084M819q850J1695M530k8383r147J789q996n315J6978J4760L332j8947
7008C746n751O387J0199n642K111K589n023N621k280J1355J1898j8313k6482M397
$$ plain form
6994 -5188 11464 34144 38514 22655 13604 11357 6156 14275 24734 14206 28463 29919 17234
6981 17234 8611 13279 16822 4944 3457 8044 15689 3956 -626 -8970 -6616 4652 22754 19364
6967 19364 17928 11378 -14137 -18378 -4170 -22032 -33227 -23997 -30100 -21706 -51 17924 12625
6954 12625 -13667 -24700 1084 -9850 -5060 8469 16725 11429 -2733 -3361 14055 4005 1778
6941 1778 6474 7024 1738 17151 33204 35419 24748 31904 31303 24529 21608 25951 18658 15224 36345
6926 36345 35386 16131 20826 32029 24819 31539 32253 10507 -11494 -6512 -11382 -2965 12269 30933
6912 30933 29037 25888 33809 18740 -2635 -5761 -8682 6697 12720 7948 7900 11337 15566 8207
6898 8207 -15 13725 27146 23238 13804 -8340 -6770 10152 2967 -6617 -7622 -4475 6856 20286
$$ packed form
6994e188J6652K2680M370j5859r051k247n201Q119J0459j0528J4257J456j2685
6981A7234q623M668L543j1878j487M587P645j1733m582q344K354J1268J8102l390
6967A9364j436o550k5515m241J4208j7862j1195R230o103Q394K1655J7975n299
6954A2625k6292j1033K5784j0934M790J3529Q256n296j4162o28J7416j0050k227
6941A778M696N50n286J5413J6053K215j0671P156o01o774k921M343p293l434K1121
6926C6345r59j9255M695J1203p210O720P14k1746k2001M982m870Q417J5234J8664
6912C0933j896l149P921j5069k1375l126k921J5379O023m772m8L437M229p359
6898H207q222J3740J3421l908r434k2144J570J6922p185r584j005L147J1331J3430
$$ plain form
6884 20286 33576 32158 24164 27992 8587 10118 18645 39048 29174 14783 -9854 -5354 17954
6871 17954 20672 -829 -18447 -14119 -11557 -3507 6629 16391 18277 17377 14174 23010 8471 14287
6857 14287 5603 21063 42596 39748 24899 20088 10299 -3728 -15335 7783 15619 8929 3815
6844 3815 17584 22349 27286 7361 -7001 2796 10681 10567 3030 -4169 -17920 -10241 -4069 851
6830 851 -17190 -18855 2891 4543 7293 42168 53867 47099 41309 25451 18233 -13659 -8034 28660
6816 28660 32982 33800 25463 27361 37309 22350 11931 13287 7710 -4552 -4838 1863 7350 7819 7439
6801 7439 4116 10445 15348 12446 32284 47356 30697 13521 11279 17659 13031 3301 -15668 2566
6787 2566 28530 38012 31805 30511 31286 41798 32150 20263 17865 28044 21164 16650 14555 12749
$$ packed form
6884B0286J3290j418p994L828j9405J531Q527K0403r874j4391k4637M500K3308
6871A7954K718k1501j7618M328K562Q050J0136R762J886r00l203Q836j4539N816
6857A4287q684J5460K1533k848j4849m811r789j4027j1607K3118P836o690n114
6844C815J3769M765M937j9925j4362R797P885j14p537p199j3751P679O172M920
6830H51j8041j665K1746J652K750L4875J1699o768n790j5858p218l1892N625L6694
6816B8660M322Q18q337J898R948j4959j0419J356n577j2262k86O701N487M69l80
6801G439l323O329M903k902J9838J5072j6659j7176k242O380m628r730j8969J8234
6787B566K5964R482o207j294P75J0512r648j1887k398J0179o880m514k095j806
$$ plain form
6773 12749 -5470 3034 8223 3689 -14829 -17990 -5157 -6125 -28508 -35566 -18651 -13839 -6727 -8775
6759 -8775 -542 -8651 -6555 -7956 -21014 -30804 -7528 12792 7493 -3340 2576 12983 -8834
6746 -8834 -3297 7957 -3213 -16242 -13145 -5811 -21787 -24083 1934 17479 2391 1336 10224
6733 10224 24265 18670 27608 49933 41956 18275 21196 46715 59023 45723 15989 17430 40392
6720 40392 30232 25288 20999 11034 10524 4128 -7312 -4631 -5007 -10391 -1704 21209 11893 -7051
6706 -7051 -10119 -21289 -12915 7567 19273 20300 10037 7187 -2728 4668 12782 9077 13799 11668
6692 11668 16466 31998 10903 9231 4583 2334 -2327 -1454 18496 13535 4303 -8756 -7724 -2117
6678 -2117 17728 19250 20516 11794 21817 14339 2685 -3697 -2266 -8546 -734 19436 20898 -3495
$$ packed form
6773A2749j8219Q504N189m534j8518l161J2833r68k2383p058J6915M812P112k048
6759h775Q233q109K096j401j3058r790K3276K0320n299j0833N916J0407k1817
6746h834N537J1254j1170j3029L097P334j5976k296K6017J5545j5088j055Q888
6733A0224J4041n595Q938K2325p977k3681K921K5519J2308j3300k9734J441K2962
6720D0392j0160m944m289r965n10o396j1440K681l76n384Q687K2913r316j8944
6706g051l068j1170Q374K0482J1706J027j0263k850r915P396Q114l705M722k131
6692A1668M798J5532k1095j672m648k249m661Q73J9950m961r232j3059J032N607
6678b117J9845J522J266q722J0023p478j1654o382J431o280P812K0170J462k4393
$$ plain form
6664 -3495 -15339 -6524 10058 3968 -20175 -5971 11646 12838 3964 -2940 -855 -14997 -17306
6651 -17306 -3831 -4251 2605 -29 -20744 -52705 -49966 -31647 -27973 -33181 -17635 -10361 -3351 -4083
6637 -4083 -9584 -10462 -4272 4009 8305 10891 9931 -9292 -13228 -6149 9215 17207 -4277 -11151 -20830
6622 -20830 -23154 3536 3776 -6142 -10501 -8157 14013 -6839 -3857 17727 15898 12265 2724 -11892
6608 -11892 -27916 4058 25452 21902 19531 -931 -19187 -19326 -1430 3221 -593 -4970 -6037
6595 -6037 -2414 -1531 -12851 -6471 -1785 -7379 -6826 -7537 -9067 -16046 -13402 -875 12385 8292 7494
6580 7494 8038 9741 13822 4418 8732 13393 17043 20840 30754 23654 8498 1100 707 11857 40985
6565 40985 57155 41577 31597 33338 44128 38987 34490 30200 30849 28445 18311 14273 16087 9545
$$ packed form
6664c495j1844Q815J6582o090k4143J4204J7617J192q874o904K085j4142k309
6651a7306J3475m20O856k634k0715l1961K739J8319L674n208J5546P274P010p32
6637d083n501q78O190Q281M296K586r60j9223l936P079J5364P992k1484o874r679
6622b0830k324K6690K40r918m359K344K2170k0852K982K1584j829l633r541j4616
6608a1892j6024L1974K1394l550k371k0462j8256j39J7896M651l814m377j067
6595f037L623Q83j1320O380M686n594N53p11j530o979K644J2527J3260m093p98
6580G494N44J703M081r404M314M661L650L797R914p100j5156p398l93J1150K9128
6565D0985J6170j5578r980J741J0790n141m497m290O49k404j0134m038J814o542
$$ plain form
6551 9545 9757 6624 674 2414 6630 -22931 -19162 1127 10678 19334 -5992 -28334 -26566 -13895
6537 -13895 -14152 -6101 26836 29823 15284 8248 16070 5164 -7338 -14025 -12654 -1427 11710
6524 11710 13184 3846 1364 2215 -13042 1545 6795 -12396 -12194 -16873 -17043 22877 22340 15204 196
6509 196 -7119 -4788 -9813 -18214 3334 -3327 -7856 -1361 -3799 19222 37439 44692 36464 48707
6495 48707 45468 38415 27151 7180 -802 1308 -24321 -43414 -27790 -8398 313 5637 13454
6482 13454 34002 34175 11181 -18483 -17812 8208 23194 40707 14234 11714 8375 -4326 -25491
6469 -25491 -11062 466 13165 18850 11852 -5785 -1167 -1863 -3973 -19632 -24851 -8989 -10404
6456 -10404 -10072 -6794 3539 2377 -16569 -42207 -29524 -7381 6711 3682 -11127 -7007 3082
$$ packed form
6551I545K12l133n950J740M216k9561L769K0289R551Q656k5326k2342J768J2671
6537a3895k57Q051L2937K987j4539p036P822j0906j2502o687J371J1227J3137
6524A1710J474r338k482Q51j5257J4587N250j9191K02m679j70L9920n37p136j5008
6509A96p315K331n025q401K1548o661m529O495k438K3021J8217P253q228J2243
6495D8707l239p053j1264j9971p982K110k5629j9093J5624J9392Q711N324P817
6482A3454K0548J73k2994k9664O71K6020J4986J7513k6473k520l339j2701k1165
6469b5491J4429J1528J2699N685o998j7637M618o96k110j5659n219J5862j415
6456a0404L32L278J0333j162j8946k5638J2683K2143J4092l029j4809M120J0089
$$ plain form
6443 3082 1740 -1091 -1916 7507 10985 -3186 5415 -5732 -30490 -28950 5599 5901 -5923 -13724
6429 -13724 -11906 -21123 -2662 8399 5367 -7105 -26824 -13552 -1211 18377 12334 9824 10917
6416 10917 22419 20828 14884 7029 11444 16857 2515 -3325 4627 2382 13055 18235 23624 26662
6402 26662 26289 35531 39790 40878 25513 13384 10850 989 10193 17158 3976 -7987 -743 -7262
6388 -7262 -22400 -17591 -15409 281 -10176 -21932 -22619 -13189 -4678 2207 -2105 -2933 -8534 -6363
6374 -6363 -7771 -7476 316 -3637 -1117 19581 8544 -1483 -14101 -17944 -17222 -12893 -8216 -11372
6360 -11372 -23244 -892 8439 11205 2835 7162 17601 8377 12088 9120 132 -2143 -2768 -17911
6346 -17911 -19944 4337 15857 11229 13209 6091 -13175 -7099 6301 12450 34791 15437 -8258
$$ packed form
6443C082j342k831q25R423L478j4171Q601j1147k4758J540L4549L02j1824p801
6429a3724J818r217J8461J1061l032j2472j9719J3272J2341J9588o043k510J093
6416A0917J1502j591n944p855M415N413j4342n840P952k245J0673N180N389L038
6402B6662l73R242M259J088j5365j2129k534r861R204O965j3182j1963P244o519
6388g262j5138M809K182J5690j0457j1756o87R430Q511O885m312q28n601K171
6374f363j408K95P792l953K520K0698j1037j0027j2618l843P22M329M677l156
6360a1372j1872K2352R331K766q370M327J0439r224L711k968q988k275o25j5143
6346a7911k033K4281J1520m628J980p118j9266O076J3400O149K2341j9354k3695
$$ plain form
6333 -8258 -28417 -35576 -31105 -21737 -9850 -3345 3470 -8676 -10349 -8286 940 8426 11722 6361
6319 6361 -6674 -12335 956 9057 8481 12898 5192 6605 6636 2347 -3402 3394 5804 9831 6135
6304 6135 -5581 6378 27568 42781 38754 24229 -87 6645 25680 46282 37947 10255 -15074
6291 -15074 -8487 9410 615 -9524 -8513 -10384 -16216 -12731 -9429 346 -5558 -14723 -1181 -8340
6277 -8340 -2322 -7297 -14483 -7266 -31790 -39053 -49000 -52194 -55238 -39381 -27668 -38460 -38574 -36592
6263 -36592 -18865 -12807 2770 -7441 -13453 -11291 -3692 -7992 -9588 -10296 -23474 -35146 -26525 -12062
6249 -12062 -6288 -678 -20554 -44623 -35751 -41558 -36186 -28097 -25100 -15501 -23739 -24017 -25515 -22174
6235 -22174 757 11761 514 -10644 -12917 -12010 -6862 11891 19725 17195 18609 14453 -16469
$$ packed form
6333h258k0159p159M471R368J1887O505O815j2146j673K063R226P486L296n361
6319F361j3035n661J3291Q101n76M417p706J413L1m289n749O796K410M027l696
6304F135j1716J1959K1190J5213m027j4525k4316O732J9035K0602q335k7692k5329
6291a5074O587J7897q795j0139J011j871n832L485L302R775n904r165J3542p159
6277h340O018m975p186P217k4524p263r947l194l044J5857J1713j0792j14J982
6263c6592J7727O058J5577j0211o012K162P599m300j596p08j3178j1672Q621J4463
6249a2062N774N610j9876k4069Q872n807N372Q089K997R599q238k78j498L341
6235b2174K2931J1004j1247j1158k273R07N148J8753P834k530J414m156l0922
$$ plain form
6222 -16469 -30830 -12423 14084 15769 8946 -1334 -1885 -14340 -23230 -31844 -38645 -28321 -9261
6209 -9261 3871 -4248 -31509 -31467 -12490 -9392 413 -6053 10062 5143 -5713 -27986 -23810 -13789
6195 -13789 -14180 -22652 -9950 3995 6049 25186 21747 863 -5517 -48 16541 16163 17854 19390
6181 19390 10937 9949 -5 4173 -22 -19783 -9899 -9514 -20335 -8774 20648 27042 5201 -8430
6167 -8430 -1050 -10044 -7461 -9632 -12435 -7170 -535 3513 15435 8526 4580 12564 24338 12360
6153 12360 -2812 -9512 -6555 -1576 6971 9265 7458 12100 5218 10834 19703 17400 21367 3105
6139 3105 3088 -7380 -24583 -23224 -31010 -38712 -31484 -3951 8738 1355 -7739 -7902 -11451 -4085 -13890
6124 -13890 -6983 -4925 0 10095 22065 42039 44892 37431 25930 27082 28730 30308 7942
$$ packed form
6222a6469j4361J8407K6507J685o823j0280n51j2455q890q614o801J0324J9060
6209i261J3132q119k7261M2J8977L098R805o466J6115m919j0856k2273M176J0021
6195a3789l91q472J2702J3945K054J9137l439k0884o380N469J6589l78J691J536
6181A9390q453r88r954M178m195j9761R884L85j0821J1561K9422O394k1841j3631
6167h430P380q994K583k171k803N265O635M048J1922o909l946P984J1774j1978
6153A2360j5172o700K957M979Q547K294j807M642o882N616Q869k303L967j8262
6139C105j7j0468j7203J359p786p702P228K7533J2689p383r094j63l549P366r805
6124a3890O907K058M925J0095J1970J9974K853p461j1501J152J648J578k2366
$$ plain form
6111 7942 -10691 -4099 -16639 -42510 -41103 -28390 -20950 -3324 9229 7448 -3426 192 8401
6098 8401 -9245 -1422 8646 1173 14090 1424 7464 24249 41973 42474 13694 -12904 -11214
6085 -11214 -4902 1546 24008 27300 13297 -25085 -28181 -20713 4540 7355 -9529 -27475 -1677
6072 -1677 12419 -3861 -28486 -38736 -41289 -25143 -3451 -15749 -50348 -56195 -33684 -13982
6060 -13982 14713 5620 -16963 -4587 3891 11337 22477 24958 26607 12758 5242 -7166 -2557
6047 -2557 27008 -793 -27209 -40784 -36635 -22961 -4630 6168 29986 38207 17541 -915
6035 -915 -3616 10223 16198 14923 9322 12011 17897 22378 24615 13313 301 -8041 -370 13416
6021 13416 10594 22071 19240 4944 8126 -5568 13355 11804 13149 23006 41938 34573 22389
$$ packed form
6111G942j8633O592j2540k5871J407J2713P440J7626J2553j781j0874L618Q209
6098H401j7646P823J0068p473J2917j2666O040J6785J7724N01k8780k6598J690
6085a1214O312O448K2462L292j4003l8382l096P468K5253K815j6884j7946K5798
6072a677J4096j6280k4625j0250k553J6146K1692j2298l4599n847K2511J9702
6060a3982K8695r093k2583J2376Q478P446J1140K481J649j3849p516j2408M609
6047b557K9565k7801k6416j3575M149J3674J8331J0798K3818Q221k0666j8456
6035i15k701J3839N975j275n601K689N886M481K237j1302j3012q342P671J3786
6021A3416k822J1477k831j4296L182j3694J8923j551J345R857J8932p365j2184
$$ plain form
6008 22389 16337 2123 -14958 -23285 -4194 -10381 -8431 12637 8031 -10917 -3817 13822 34737
5995 34737 45493 36628 24357 24294 45127 43296 21419 23785 18877 -11098 -24560 -16554 -25845 -20870
5981 -20870 1368 15077 2353 -10886 -21654 -25018 -10088 -6268 4126 -3871 -2281 3145 2728
5968 2728 -4126 -3578 -7817 -6480 -737 1685 13538 15275 13146 5568 8318 2109 5703 16041 10366
5953 10366 16336 25896 22669 -732 -15089 -4229 718 2219 11673 26252 24786 9914 4628
5940 4628 3744 -5707 -9594 6843 24637 22856 34060 13500 4277 8465 20051 15537 11005 4471
5926 4471 -11923 -8448 -2453 -13605 -26115 -24464 -34617 -43842 -43054 -34261 -13349 4167 6337 -6578
5912 -6578 -12430 -20136 -30716 -41989 -17553 -20619 -43468 -64319 -55811 -42267 -29330 -22826 -26538
$$ packed form
6008B2389o052j4214j7081q327J9091o187J950K1068m606j8948P100J7639K0915
5995C4737J0756q865j2271o3K0833j831k1877K366m908k9975j3462Q006r291M975
5981b0870K2238J3709j2724j3239j0768l364J4930L820J0394p997J590N426m17
5968B728o854N48m239J337N743K422J1853J737k129p578K750o209L594J0338n675
5953A0366N970R560l227k3401j4357J0860M947J501R454J4579j466j4872n286
5940D628q84r451l887J6437J7794j781J1204k0560r223M188J1586m514m532o534
5926D471j6394L475N995j1152j2510J651j0153r225P88Q793K0912J7516K170j2915
5912f578n852p706j0580j1273K4436l066k2849k0851Q508J3544J2937O504l712
$$ plain form
5899 -26538 -24529 -30521 -14296 17772 24113 17139 17253 25147 30001 44629 51612 25086 15245 27487
5885 27487 26243 23207 16263 8233 4857 -2663 -11096 -11520 -530 -7687 -4155 -12736 877 5460
5871 5460 -268 10627 16796 65 -14034 -7822 -8833 -8241 6396 11525 -7375 -27255 -13380
5858 -13380 -4581 8236 7770 -4992 -7832 -941 -6377 -25312 -8626 25627 20616 20467 6697 318
5844 318 4061 -9379 -27791 3150 19359 -8135 -18587 -11416 -5065 -7601 -1330 14612 18611
5831 18611 1084 -1028 14731 3649 -18676 -22315 -21433 -37616 -40322 -26061 -14200 1574 26431
5818 26431 22289 15927 2323 -18100 -2159 3171 17591 41038 32913 25327 21457 4763 -5368
5805 -5368 7294 37826 41244 26885 22068 141 -2902 14037 23903 14874 49 -6857 793
$$ packed form
5899b6538K009n992J6225L2068O341o974J14P894M854J4628O983k6526r841J2242
5885B7487j244l036o944q030l376p520q433m24J0990p157L532q581J3613M583
5871E460n728J0895O169j6731j4099O212j011N92J4637N129j8900j9880J3875
5858a3380Q799J2817m66j2762k840O891n436j8935J6686L4253n011j49j3770o379
5844C18L743j3440j8412L0941J6209k7494j0452P171O351k536O271J5942L999
5831A8611j7527k112J5759j1082k2325l639Q82j6183k706J4261J1861J5774K4857
5818B6431m142o362j3604k0423J5941N330J4420K3447q125p586l870j6694j0131
5805e368J2662L0532L418j4359m817k1927l043J6939R866r029j4825o906P650
$$ plain form
5792 793 -11994 -12795 665 34367 29158 20404 24846 12411 194 -19818 -16588 5474 -12963
5779 -12963 -24196 -23438 -10385 19789 15144 -3784 -20140 -18947 -29536 -27012 -20730 -40224 -47192
5766 -47192 -32168 -8227 -10510 -17829 -1462 8439 15373 9916 25024 12954 9916 7360 11040
5753 11040 -80 5353 -1055 -27277 -23280 -19592 -8279 6570 14161 9049 -11318 -10091 -4568
5740 -4568 3954 4597 19070 22627 13033 8273 6052 -674 -10080 -2883 -6520 -1930 -1030 -18796 -7085
5725 -7085 6709 -7778 -11643 -8922 -6030 -18020 -12272 4534 12916 -7958 -22315 -10738 16112
5712 16112 24529 25697 -547 -6922 -221 -635 8483 486 8169 9189 4708 10999 3337 -12633
5698 -12633 -13945 14143 22177 11102 30950 31331 8769 -3341 -20684 -21209 -12612 -1766 -926 15346
$$ packed form
5792G93j2787q01J3460L3702n209q754M442j2435j2217k0012L230K2062j8437
5779a2963j1233P58J3053L0174m645j8928j6356J193j0589K524O282j9494o968
5766d7192J5024K3941k283p319J6367R901O934n457J5108j2070l038k556L680
5753A1040j1120N433o408k6222L997L688J1313J4849P591n112k0367J227N523
5740d568Q522O43J4473L557r594m760k221o726r406P197l637M590R00j7766J1711
5725g085J3794j4487l865K721K892j1990N748J6806Q382k0874j4357J1577K6850
5712A6112Q417J168k6244o375O701m14R118p997P683J020m481O291p662j5970
5698a2633j312K8088Q034j1075J9848L81k2562j2110j7343n25Q597J0846Q40J6272
$$ plain form
5684 15346 15560 27838 13736 -4849 9714 10130 4467 14447 25164 18417 8761 -11168 2129
5671 2129 9315 25588 44039 46666 35105 22546 38972 29904 5681 13294 14728 -5860 -9248
5658 -9248 2357 20776 33059 31631 30917 13699 -5395 -14630 -6163 -7319 -5602 4032 5318 8777
5644 8777 727 -362 -7859 2043 7292 -6712 -10363 2863 -8831 -24030 -21164 -17251 -13603 -16057
5630 -16057 -3904 1757 8166 3402 -11124 -18890 -16895 -11884 -17603 -9210 -5740 -13870 -11678 -19150
5616 -19150 -16111 -9723 -3693 -12615 -20915 -16833 -6213 2072 7605 3669 12798 25448 33355 36633
5602 36633 22780 5650 12184 4435 -13492 -12997 -22433 -16660 13045 28958 21949 12221 7456 1138
5588 1138 -12044 -11261 -9989 -20139 -23070 -30569 -22654 5688 19026 6728 -5616 -26133 -19389
$$ packed form
5684A5346K14J2278j4102j8585J4563M16n663R980J0717o747r656j9929J3297
5671B129P186J6273J8451K627j1561j2559J6426r068k4223P613J434k0588l388
5658i248J1605J8419J2283j428p14j7218j9094r235Q467j156J717R634J286L459
5644H777q050j089p497R902N249j4004l651J3226j1694j5199K866L913L648k454
5630a6057J2153N661O409m764j4526p766J995N011n719Q393L470q130K192p472
5616a9150L039O388O030q922q300M082J0620Q285N533l936R129J2650P907L278
5602C6633j3853j7130O534p749j7927M95r436N773K9705J5913p009r728m765o318
5588A138j3182P83J272j0150k931p499P915K8342J3338j2298j2344k0517O744
$$ plain form
5575 -19389 -10855 8891 22136 7966 1855 3924 21777 17384 9479 9148 4561 -14014 -17950 -10162
5561 -10162 1396 2883 1461 1087 -6892 -15077 -24883 -17303 -16910 -25182 -21585 -29021 -24020 -15737 9100
5546 9100 13389 -1262 -7197 -8161 14457 26833 21515 15532 7979 15816 9657 3995 7699 1474
5532 1474 -8895 -5225 -5758 -13848 3804 239 5225 4476 3049 -20955 -25270 -9030 12279 7031
5518 7031 -1167 -115 -1046 5780 17751 19941 17400 27414 12749 4977 9332 8433 1017 -18659
5504 -18659 -35147 -34275 -40573 -35265 -13798 -8670 -6360 6093 152 -3306 -6979 -13239 -8821 -7203
5490 -7203 -17808 -1598 -4048 -29760 -37588 -22013 -30577 -43815 -36015 -38977 -32726 -24084 -28121 -36663
5476 -36663 -28019 -5765 9139 -129 -9255 7019 9553 -5750 -23227 -34712 -22481 9145 15926
$$ packed form
5575a9389Q534J9746J3245j4170o111K069J7853m393p905l31m587j8575l936P788
5561a0162J1558J487j422l74p979q185r806P580L93q272L597p436N001Q283K4837
5546I100M289j4651n935r64K2618J2376n318n983p553P837o159n662L704o225
5532A474j0369L670n33q090J7652l565M986p49j427k4004m315J6240K1309n248
5518G031q198J052r31O826J1971K190k541J0014j4665p772M355q99p416j9676
5504a8659j6488Q72o298N308K1467N128K310J2453n941l458l673o260M418J618
5490g203j0605J6210k450k5712p828J5575q564j3238P800k962O251Q642m037q542
5476c6663Q644K2254J4904r268r126J6274K534j5303j7477j1485J2231L1626O781
$$ plain form
5463 15926 8406 1249 -11259 -5284 436 -24514 -20728 2474 -18562 -22018 -19003 -33562 -29318
5450 -29318 -39089 -30416 -9775 1637 6456 5548 1855 -588 -2990 11081 6044 -9135 -11015 -17165
5436 -17165 -21977 -20317 -34664 -34295 -16727 -231 -11844 -12719 -12449 -16338 -28968 -31972 -19576 -7925
5422 -7925 -2132 12073 9407 1701 12625 7990 6246 11485 16462 9873 6421 -10948 -9909 -20651
5408 -20651 -19380 865 26428 34734 15285 3904 -9670 -422 24809 23449 6633 13020 18216
5395 18216 -5802 -22573 9083 17006 16513 13262 -5231 -8978 -11430 -11640 -8904 8905 24060 27508
5381 27508 23246 10288 5061 21101 38466 49781 43770 24309 -19600 -8422 -3978 -15059 -13223
5368 -13223 -31662 -51974 -55029 -37630 -29845 -11561 -10463 -10724 -6166 -9086 -14336 -21083 -23246 -16905
$$ packed form
5463A5926p520p157j2508N975N720k4950L786K3202k1036l456L015j4559M244
5450b9318r771Q673K0641J1412M819r08l693k443k402J4071n037j5179j880o150
5436a7165m812J660j4347L69J7568J6496j1613q75K70l889j2630l004J2396J1651
5422g925N793J4205k666p706J0924m635j744N239M977o589l452j7369J039j0742
5408b0651J271K0245K5563Q306j9449j1381j3574R248K5231j360j6816O387N196
5395A8216k4018j6771L1656P923m93l251j8493l747k452k10K736J7809J5155L448
5381B7508m262j2958n227J6040J7365J1315o011j9461m3909J1178M444j1081J836
5368a3223j8439k0312l055J7399P785J8284J098k61M558k920n250o747k163O341
$$ plain form
5354 -16905 -27318 -35553 -19616 -9372 -18240 -16938 1741 1307 -4035 1399 -2434 4692 4007 -503
5340 -503 -21734 -16929 -11907 14792 22773 293 708 1990 13564 21310 10726 -2816 2961 14369
5326 14369 11064 -1133 -15909 -6635 18578 9078 4046 8415 -521 -12076 -12348 -19195 -24473 -22624
5312 -22624 -20910 -23651 -21067 -6579 15617 14899 7717 5646 12300 21489 27256 19666 8094 1202
5298 1202 18700 19633 15851 -2467 -427 -887 -2787 -8906 -8547 1172 6151 -96 9006 11323 22411
5283 22411 32858 32929 38329 23921 -7554 -15124 -20376 -9966 418 -18354 -10853 3328 -4025
5270 -4025 -17878 -24917 -12466 -719 4770 5247 14877 16466 17783 4035 -12510 -27 1855 -12139
5256 -12139 -27385 -36592 -44161 -43331 -42611 -29893 -14123 -8619 -5564 -1290 6963 10847 18736 8028
$$ packed form
5354a6905j0413q235J5937J0244q868J302J8679m34n342N434l833P126o85m510
5340e03k1231M805N022K6699P981k2480M15J282J1574P746j0584j3542N777J1408
5326A4369l305j2197j4776R274K5213r500n032M369q936j1555k72o847n278J849
5312b2624J714k741K584J4488K2196p18p182k071O654R189N767p590j1572o892
5298A202J7498R33l782j8318K040m60j900o119L59R719M979o247R102K317J1088
5283B2411J0447P1N400j4408l1475p570n252J0410J0384j8772P501J4181p353
5270d025j3853p039J2451J1747N489M77R630J589J317j3748j6545J2483J882j3994
5256a2139j5246r207p569Q30P20J2718J5770N504L055M274Q253L884P889j0708
$$ plain form
5242 8028 10403 -8961 -20064 -16002 -12943 -16172 -21837 -27328 -26539 -13857 -29388 -31412 -3549 18915
5228 18915 35844 24872 6007 -5542 -4892 -17382 -18400 1524 11483 17905 20049 5669 9457
5215 9457 2168 -22428 -20125 8027 11571 -24749 -26163 -31265 -19619 -4714 -7027 -1674 -3478 -11347
5201 -11347 -5199 -10158 -652 -606 4440 2231 1077 963 245 -3423 -9005 -17493 -24731 -15367 -11531 -2590
5185 -2590 2364 -9992 -15983 -6202 4937 971 2815 14918 11503 744 8603 2930 -12762 -8774
5171 -8774 -10001 4378 884 -13206 -35992 -40254 -25737 -31561 -19187 -16799 -11327 171 25339
5158 25339 7221 -24078 -12666 -3828 6131 -9704 -10050 -4154 1308 -5522 -5615 5018 -21324 -24215
5144 -24215 -18049 -10721 12646 27984 17326 9051 -698 -24249 -9708 13349 13493 7731 8384 2670
$$ packed form
5242H028K375j9364j1103M062L059l229n665n491P89J2682j5531k024K7863K2464
5228A8915J6929j0972j8865j1549O50j2490j018J9924R959O422K144j4380L788
5215I457p289k4596K303K8152L544l6320j414n102J1646J4905k313N353j804p869
5201a1347O148m959R506M6N046k209j154j14p18l668n582q488p238R364L836Q941
5185b590M954j2356n991R781J1139l966J844J2103l415j0759P859n673j5692L988
5171h774j227J4379l494j4090k2786m262J4517n824J2374K388N472J1498K5168
5158B5339j8118l1299J1412Q838R959j5835l46N896N462o830r3J0633k6342k891
5144b4215O166P328K3367J5338j0658q275r749k3551J4541K3057J44n762O53n714
$$ plain form
5130 2670 5500 11098 -4299 -5467 18794 44368 32487 13609 17847 20168 5287 1682 -4492
5117 -4492 -6662 14559 16962 11430 -116 -11482 -6281 -7281 -498 5273 1929 11372 12580 32464
5103 32464 25141 31634 35234 26787 14978 4859 9862 16027 12875 27302 33521 48878 42570 29186
5089 29186 30799 30337 20410 -4095 -5676 8697 3094 -13969 -27590 -19521 -7396 356 10147 6279
5075 6279 -4655 -5172 -26865 -45517 -35071 -25216 -26522 -12108 -9905 -10872 -35856 -48325 -36927
5062 -36927 -40236 -29619 -24132 -7974 -13310 -21060 -6124 14340 -24 -17027 -25595 -31242 -25112
5049 -25112 -25823 -19018 -16560 -14708 -10739 -8536 -20072 -9364 13447 15994 16363 18522 13716 5269
5035 5269 -16100 -23429 -14639 -24256 -16630 6564 -7495 -11989 -3486 2334 -3758 -8458 -10004 -13838
$$ packed form
5130B670K830N598j5397j168K4261K5574j1881j8878M238K321j4881l605o174
5117d492k170K1221K403n532j1546j1366N201j000O783N771l344R443J208J9884
5103C2464p323O493L600q447j1809j0119N003O165l152J4427O219J5357o308j3384
5089B9186J613m62r927k4505j581J4373n603j7063j3621Q069J2125P752R791l868
5075F279j0934n17k1693j8652J0446R855j306J4414K203r67k4984j2469J1398
5062c6927l309J0617N487J6158n336p750J4936K0464j4364j7003q568n647O130
5049b5112p11O805K458J852L969K203j1536J0708K2811K547L69K159m806q447
5035E269k1369p329Q790r617P626K3194j4059m494Q503N820o092m700j546l834
$$ plain form
5021 -13838 -8179 -3362 -12035 -5826 -10536 1890 5227 -9253 -16219 -27817 -27907 -5743 10910 16528
5007 16528 -8563 -2601 281 -7568 -2276 18411 17004 4917 -8586 -16447 -11806 5593 12401
4994 12401 5935 -904 6678 11358 -10498 -13555 -31666 -41150 -24841 -21749 -5582 -8406 -14433 -11452
4980 -11452 -3232 -3816 -474 -10352 -21367 -24544 -35010 -34129 -30874 -27110 -27379 -25489 -21779 -29846 -34985
4965 -34985 -19296 -7921 16962 17068 -4948 -14029 -25611 -32983 -31917 -26390 -21252 -27281 -21010 3716
4951 3716 7265 3296 823 23223 41350 16690 -6055 -3686 -1927 94 -6335 1625 12440 3583
4937 3583 -3097 11645 27293 32480 22571 10829 -13406 -16967 -4483 4312 9385 7668 5341 4994
4923 4994 5997 -469 10128 7986 17506 21591 8393 -13357 -27701 -27504 4292 8523 -3712 1556
$$ packed form
5021a3838N659M817q673O209m710J2426L337j4480o966j1598r0K2164J6653N618
5007A6528k5091N962K882p849N292K0687j407j2087j3503p861M641J7399O808
4994A2401o466o839P582M680k1856l057j8111r484J6309L092J6167k824o027K981
4980a1452Q220n84L342r878j1015l177j0466Q81L255L764k69J890L710q067n139
4965c4985J5689J1375K4883J06k2016r081j1582p372J066N527N138o029O271K4726
4951C716L549l969k473K2400J8127k4660k2745K369J759K021o429P960J0815q857
4937C583o680J4742J5648N187r909j1742k4235l561J2484Q795N073j717k327l47
4923D994J003o466J0597k142R520M085j3198k1750j4344J97L1796M231j2235N268
$$ plain form
4909 1556 -886 -6011 8811 8679 -3497 -3741 3326 -462 5582 953 -14959 -28538 -34865 -25311
4895 -25311 -5204 -4225 -8309 5377 20952 21901 11632 -8912 -6914 3756 2409 -6441 -35459
4882 -35459 -46855 -24868 -15083 -23613 -14879 -3310 -14019 -29216 -13456 3470 13496 18279 16556
4869 16556 17105 14216 6230 -4972 -6409 -17240 -26063 -17438 -35296 -47175 -23913 -17885 -28397
4856 -28397 -22373 -20500 -13729 2710 1016 15599 26566 -539 2665 3437 13425 11936 13592 719
4842 719 -14453 -15876 919 8756 -5316 -7967 -11594 -12855 13650 17428 1068 -24956 -32808 -39690
4828 -39690 -33856 -12873 -1082 -13266 -17034 -4481 -8755 -15532 -11158 -8510 -19275 -11916 -14598
4815 -14598 -15179 1419 9823 -1335 5490 -657 56 -17041 -11232 -9548 -17794 -25764 -12087 -3377
$$ packed form
4909A556k442n125J4822j32j2176k44P067l788O044m629j5912j3579o327R554
4895b5311K0107R79m084J3686J5575R49j0269k0544J998J0670j347q850k9018
4882c5459j1396K1987R785q530Q734J1569j0709j5197J5760J6926J0026M783j723
4869A6556N49k889p986j1202j437j0831q823Q625j7858j1879K3262O028j0512
4856b8397O024J873O771J6439j694J4583J0967k7105L204P72R988j489J656j2873
4842G19j5172j423J6795P837j4072k651l627j261K6505L778j6360k6024p852o882
4828c9690N834K0983J1791j2184l768J2553m274o777M374K648j0765P359k682
4815a4598n81J6598Q404j1158O825o147P13j7097N809J684q246p970J3677Q710
$$ plain form
4801 -3377 -7952 -9206 8336 -4363 -10375 -11618 -2541 -14852 -25265 -7444 461 -5938 21740
4788 21740 28455 25466 35031 26914 18975 17501 16740 -6624 440 22007 22257 11177 -23067 -8641
4774 -8641 -2983 3935 17208 8970 -2330 -1296 -10154 -19770 -22351 -33207 -27250 -5348 -16186 -15640
4760 -15640 -8424 8403 16840 17008 25029 12086 6944 22852 30789 22602 10054 -10929 -16459 -14078
4746 -14078 -6454 6766 12286 21089 13418 18942 34607 27517 3087 1319 3614 -18217 -22957 -21750
4732 -21750 -23388 -30001 -25381 3565 13000 10358 6360 -7480 -12102 -10771 -7988 -17597 -13904 -15601
4718 -15601 3 13405 12738 -11 -12448 -8820 1578 2633 -4095 5944 -246 6630 6976 3892
4704 3892 -6736 1169 -1496 -3677 -2857 -15110 -19803 -27816 -19413 142 -1305 -8032 -11966 -6878
$$ packed form
4801c377m575j254J7542j2699o012j243R077j2311j0413J7821P905o399K7678
4788B1740O715k989R565q117p939j474p61k3364P064K1567K50j1080l4244J4426
4774h641N658O918J3273q238j1300J034q858r616k581j0856N957K1902j0838N46
4760a5640P216J6827Q437J68Q021j2943n142J5908P937q187j2548k0983n530K381
4746a4078P624J3220N520Q803p671N524J5665p090k4430j768K295k1831m740J207
4732b1750j638o613M620K8946R435k642l998j3840m622J331K783r609L693j697
4718a5601J5604J3402o67j2749j2437L628J0398J055o728J0039o190O876L46l084
4704C892j0628P905k665k181Q20j2253m693q013Q403J9555j447o727l934N088
$$ plain form
4690 -6878 6041 3259 -3996 9554 24366 22004 6541 1041 -2977 -1784 -391 3546 -9465 -2133
4676 -2133 9261 9627 -11288 -16877 -10771 -9097 -4997 4954 6810 -853 15379 36402 14418 -10526
4662 -10526 -3053 11290 29045 41441 19023 18203 6377 -3160 -28465 -44363 -63392 -48255 -34283
4649 -34283 -18175 -1033 105 -8573 -10267 -13180 -21120 -34198 -40138 4079 14964 9326 5172
4636 5172 13376 14545 15732 19718 17070 17672 1521 -24916 -23211 -32800 -34524 -32470 -26965 -21997 -33527
4621 -33527 -42315 -35137 -614 11275 554 -13758 -9941 -1303 -1824 -4392 -6379 -8209 -2968 24067
4607 24067 1087 -15345 -12417 -2371 -12821 -21543 -13534 -16268 -14692 -13060 -20733 -35010 -37329
4594 -37329 -12529 17201 40472 28483 -13713 -27259 -27670 -22253 -9570 272 -11209 -4346 5896
$$ packed form
4690f878J2919k782p255J3550J4812k362j5463n500m018J193J393L937j3011P332
4676b133J1394L66k0915n589O106J674M100R951J856p663J6232K1023k1984k4944
4662a0526P473J4343J7755J2396k2418q20j1826r537k5305j5898j9029J5137J3972
4649c4283J6108J7142J138q678j694k913p940j3078n940M4217J0885n638m154
4636E172Q204J169J187L986k648O02j6151k6437J705r589j724K054N505M968j1530
4621c3527q788P178L4523J1889j0721j4312L817Q638n21k568j987j830N241K7035
4607B4067k2980j6432K928J0046j0450q722Q009k734J576J632p673j4277k319
4594c7329K4800K9730K3271j1989m2196j3546m11N417J2683R842j1481O863J0242
$$ plain form
4581 5896 10382 -4122 -626 153 -11859 14176 4985 -18205 -1188 4023 -15093 -43048 -32729
4568 -32729 -35352 -49387 -48561 -31499 -8678 12069 4529 2211 14851 8536 2022 -12974 -31600
4555 -31600 -15506 12367 17610 -14195 -24515 -16169 -18353 -29212 -20536 -13062 1470 3651 13531
4542 13531 12773 16487 14966 14377 20809 26541 10904 -2362 -9255 -10149 -17545 -9116 -10605 -12638 -2674
4527 -2674 -12813 -14845 -4769 15977 18317 8956 -5783 -2150 10457 11230 -6657 -9916 -11326 2342
4513 2342 -27411 -33195 -32526 -41005 -29876 -22845 -30554 -19510 -24114 -25548 -21096 -13388 -8553 -15665
4499 -15665 -17369 -21849 -12323 8347 -12296 -27851 -38579 -45779 -52595 -46017 -37942 -40324 -39964 -41215
4485 -41215 -38654 -43818 -13084 12768 -13601 -23157 -9877 -4754 1820 126 -10703 -9323 -4403
$$ packed form
4581E896M486j4504L496P79j2012K6035r191k3190J7017N211j9116k7955J0319
4568c2729k623j4035Q26J7062K2821K0747p540k318J2640o315o514j4996j8626
4555c1600J6094K7873N243l1805j0320Q346k184j0859Q676P474J4532K181R880
4542A3531p58L714j521n89O432N732j5637j3266o893q94p396Q429j489k033R964
4527b674j0139k032J0076K0746K340r361j4739L633J2607P73j7887l259j410J3668
4513B342k9753n784O69q479J1129P031p709J1044m604j434M452P708M835p112
4499a5665j704m480R526K0670k0643j5555j0728p200o816O578Q075k382L60j251
4485d1215K561n164L0734K5852k6369r556J3280N123O574j694j0829J380M920
$$ plain form
4472 -4403 -22170 -42228 -56272 -35678 -31233 -24519 -264 20371 21380 20729 11662 -8389 -10001
4459 -10001 1616 19056 18799 15693 -3844 -1998 10767 4740 -2141 -10999 -22288 -631 6593
4446 6593 7326 29322 46315 43674 38565 31420 6929 -5095 -8419 -28875 -27097 -26055 -17167 3680
4432 3680 8827 6429 3599 -9037 -5326 21726 11931 6830 -3196 -7757 -4943 -9591 -4430 1413
4418 1413 188 -27742 -40802 -24786 -13215 2131 1391 -15146 -17549 -26778 -23987 -23198 -24433 -17341
4404 -17341 -17749 -36948 -45159 -25947 -15387 -14183 -19808 -24655 -21534 -13913 -3174 8321 3629 -6980
4390 -6980 -12652 -10796 -11082 -20211 -13911 -19907 -18171 -7837 4887 3033 -437 4782 14311 688
4376 688 -8586 -11090 -17306 -27943 -20407 -16111 -16110 -7010 -5144 5596 15518 7629 11527 25931 16079
$$ packed form
4472d403j7767k0058j4044K0594M445O714K4255K0635J009o51r067k0051j612
4459a0001J1617J7440k57l106j9537J846J2765o027o881q858j1289K1657P224
4446F593P33K1996J6993k641n109p145k4491j2024l324k0456J778J042Q888K0847
4432C680N147k398k830j2636L711K7052r795n101j0026m561K814m648N161N843
4418A413j225k7930j3060J6016J1571J5346p40j6537k403r229K791P89j235P092
4404a7341m08j9199q211J9212J0560J204n625m847L121P621J0739J1495m692j0609
4390f980n672J856k86r129O300n996J736J0334J2724j854l470N219R529j3623
4376F88r274k504o216j0637P536M296JR100J866J0740R922p889L898J4404r852
$$ plain form
4361 16079 -3188 5733 9867 11771 7014 -4925 -2427 15434 18128 252 7279 -9583 -22715
4348 -22715 -15566 -8234 0 8210 14429 26810 30756 29148 24240 10029 -3158 -13017 -17309 -13289
4334 -13289 -29525 -29902 -19892 -21812 -30162 -24825 -23106 -29918 -22807 -15486 -19413 -13596 -36921 -29430
4320 -29430 -2647 -6278 -27648 -36049 -30062 -25205 3091 7834 1266 -10513 -12281 -25823 -32149
4307 -32149 -30795 -21423 6715 41958 28829 17327 6315 -4403 -15146 -26278 -37904 -43393
4295 -43393 -28996 -24499 -27930 -29831 -10546 -24829 -26760 -24670 -8932 -8941 -8479 -14669 -35922 -28230
4281 -28230 -12555 -24939 -8514 22647 16249 8731 -5684 -4229 -9402 -21925 -33405 -17772 -10824
4268 -10824 -14589 -14228 -540 10497 17167 27000 23324 21777 3568 -2815 13071 13065 15998 9510 1817
$$ packed form
4361A6079j9267Q921M134J904m757j1939K498J7861K694j7876P027j6862j3132
4348b2715P149P332Q234Q210O219J2381L946j608m908j4211j3187r859m292M020
4334a3289j6236l77J0010j920q350N337J719o812P111P321l927N817k3325P491
4320b9430K6783l631k1370q401N987M857K8296M743o568j1779j768j3542o326
4307c2149J354R372K8138L5243j3129j1502j1012j0718j0743j1132j1626n489
4295d3393J4397M497l431j901J9285j4283j931K090J5738rM62o190k1253P692
4281b8230J5675j2384J6425L1161o398p518j4415J455n173j2523j1480J5633O948
4268a0824l765L61J3688J1037O670R833l676j547j8209o383J5886oK933o488p693
$$ plain form
4253 1817 -20000 -15931 -12539 -18909 -27625 -17800 -15248 -7980 4131 22587 31444 27697 12973 -4342
4239 -4342 -15582 -28506 -20593 -23026 -16056 -19090 6802 10153 1509 9821 15575 5412 8983 -13498
4225 -13498 -33612 -31390 -16368 -24025 -19053 -24015 -11958 -9422 5428 16963 12733 2541 -4193
4212 -4193 705 -8678 -13819 -12339 -9055 -8781 -8602 -13735 -6685 19683 32507 29036 15538 8706 13712
4197 13712 -7174 -9708 -11052 -33409 -49587 -40794 -38737 -36122 -24827 -13430 3285 7415 8698
4184 8698 11788 16343 23760 37192 13363 -16897 -39826 -28456 -19644 -25016 -17520 -10055 -6631 420
4170 420 9737 7273 -8635 -16358 -26154 -21012 -4915 -1796 6137 12937 5832 12762 6403 2108 -12801
4155 -12801 0 9991 28949 19953 -2173 -3920 15197 15511 4744 -2499 -11329 -13910 7368
$$ packed form
4253A817k1817M069L392o370q716R825K552P268J2111J8456Q857l747j4724j7315
4239d342j1240j2924P913k433O970l034K5892L351q644Q312N754j0163L571k2481
4225a3498k0114K222J5022p657M972m962J2057K536J4850J1535m230j0192o734
4212d193M898r383n141J480L284K74J79n133P050K6368J2824l471j3498o832N006
4197A3712k0886k534j344k2357j6178Q793K057K615J1295J1397J6715M130J283
4184H698L090M555P417J3432k3829l0260k2929J1370Q812n372P496P465L424P051
4170D20R317k464j5908p723r796N142J6097L119P933O800p105O930o359m295j4909
4155a2801J2801R991J8958q996k2126j747J9117L14j0767p243q830k581K1278
$$ plain form
4142 7368 -201 -17845 -24828 -6483 13747 18540 12015 23003 29943 23958 15985 1368 -15767
4129 -15767 -11076 5037 6889 8953 7969 -4799 -12630 -20129 -25888 -11892 -10707 -32235 -40205 -36717
4115 -36717 -31872 -33869 -20587 -6428 -11672 -17771 -10537 -19782 -39972 -45867 -56575 -52264 -52030 -34733
4101 -34733 -40918 -50559 -32794 -26802 -36258 -34716 -17512 -10071 -12750 -6032 -5281 -32077 -36851 -36461
4087 -36461 -23180 -23216 -7670 529 17658 25607 16096 -11379 -15850 -11452 -39 8359 18845 17016
4073 17016 6892 -12888 -34777 -22959 1438 -1280 -6039 -6058 -15510 -16985 -1777 19296 -16540
4060 -16540 -31116 -31980 -48114 -39675 -23214 -13507 9870 12829 16709 -3308 -1346 -10139 -19053 -17641
4046 -17641 -2719 3697 -19003 -19095 -19081 -7384 26098 30565 739 -11537 -13472 -27763 -37435 -22703
$$ packed form
4142G368p569j7644o983J8345K0230M793o525J0988O940n985p973j4617j7135
4129a5767M691J6113J852K064r84j2768p831p499n759J3996J185k1528p970L488
4115c6717M845j997J3282J4159n244o099P234r245k0190n895j0708M311K34J7297
4101c4733o185r641J7765N992r456J542J7204P441k679O718P51k6796m774L90
4087c6461J3281l6J5546Q199J7129P949r511k7475m471M398J1413Q398J0486j829
4073A7016j0124j9780k1889J1818K4397k718m759j9r452j475J5208K1073l5836
4060a6540j4576q64j6134Q439J6461R707K3377K959L880k0017J962q793q914J412
4046a7641J4922O416k2700r2J4J1697L3482M467k9826j2276j935j4291r672J4732
$$ plain form
4032 -22703 -12454 15569 22021 12245 27034 14952 -957 -11863 -5984 -3570 16761 11412 9656
4019 9656 885 -4064 -7603 19024 27731 7734 2472 6653 18516 33118 12102 6588 -27 14296
4005 14296 20658 23707 19145 18766 26926 10013 4933 -987 -21657 -28247 -22602 -16407 -5303 -6517
3991 -6517 -6933 -450 5528 11453 1666 509 1799 7150 13525 19604 6001 -8925 -6970 -26887
3977 -26887 -36821 -32853 -22931 -19329 -5188 12747 14123 11682 17018 23187 10531 34749 27077 10776
3963 10776 -4092 -9694 -20100 -18203 -13455 -4820 -10374 -18750 -13956 -8760 -11183 -10160 -5181 -5689
3949 -5689 4273 -2424 -13060 -21326 -31294 -36834 -24609 -23156 -22073 -28000 -31237 -12169 -14391 10337
3935 10337 15154 11290 6346 7914 -6845 221 -1737 -9761 -17937 -15164 2729 7522 13279 11479
$$ packed form
4032b2703J0249K8023O452r776J4789j2082j5909j0906N879K414K0331n349j756
4019I656q771m949l539K6627Q707j9997n262M181J1863J4602k1016n514o615J4323
4005A4296O362L049m562l79Q160j6913n080n920k0670o590N645O195J1104j214
3991f517m16O483N978N925r787j157J290N351O375O079j3603j4926J955j9917
3977b6887r934L968R922L602J4141J7935J376k441N336O169j2656K4218p672j6301
3963A0776j4868n602j0406J897M748Q635n554q376M794N196k423J023M979n08
3949e689R962o697j0636q266r968n540J2225J453J083n927l237J9068k222K4728
3935A0337M817l864m944J568j4759P066j958q024q176K773J7893M793N757j800
$$ plain form
3921 11479 13801 29193 27429 11150 665 12984 16154 4729 -4867 1822 15969 16647 -3962
3908 -3962 -12988 4174 3780 -7915 -12106 -1510 -2252 -2567 -16628 -17154 -19190 -18 -1092 -8496 -22380
3893 -22380 -44600 -49733 -18937 -9340 -19095 -15485 -17445 10569 6780 668 -12880 -12104 8401 1986
3879 1986 -4857 664 -13316 -11335 -11096 -3357 -9055 -13110 736 -1109 -18130 -28599 -26812 -9453
3865 -9453 -22362 -39213 -18482 -7498 -738 -13784 -21281 -8162 12954 1382 -13398 -254
3853 -254 7021 16069 29816 -634 -10831 -7626 -16211 -12199 -29513 -17367 -52 337 -11027 -4679
3839 -4679 -2839 -5606 -8774 -3354 5462 15720 4796 -5826 563 5985 2718 -4183 12234 21124
3825 21124 6381 -6677 2473 -1058 -1932 6458 -1230 -19934 -16033 -20902 -27850 -31539 -18708 -10975
$$ packed form
3921A1479K322J5392j764j6279j0485J2319L170j1425r596O689J4147O78k0609
3908c962r026J7162l94j1695m191J0596p42l15j4061n26k036J9172j074p404j3884
3893b2380k2220n133L0796R597r755L610j960K8014l789o112j3548P76K0505o415
3879A986o843N521j3980J981K39P739n698m055J3846j845j7021j0469J787J7359
3865i453j2909j6851K0731J0984O760j3046p497J3119K1116j1572j4780J3144
3853b54P275R048J3747l0450j0197L205q585M012j7314J2146J7315L89j1364O348
3839d679J840k767l168N420Q816J0258j0924j0622O389N422l267o901J6417Q890
3825B1124j4743j3058R150l531q74Q390p688j8704L901m869o948l689J2831P733
$$ plain form
3811 -10975 9954 17077 21042 14203 12278 14938 8672 -135 -14058 -24631 -16568 -10051 -7843 15604
3797 15604 2987 -23187 -19241 -22882 -14121 -12228 -12613 4285 -8964 -17742 -40911 -41773 -15445 -14569
3783 -14569 -31258 -14697 -20697 -21843 -19470 -20169 -22733 -25951 -10024 714 -17454 -29078 -27532
3770 -27532 -23725 -13035 -7456 -2978 -2107 466 15021 29636 31947 15862 -17855 -12879 -11551 -14354
3756 -14354 -2600 14281 -15728 -44236 -13530 5732 11057 -8486 -26126 -14235 1095 -2552
3744 -2552 -5709 14642 18763 5614 6136 4698 -1375 -2888 -6906 -8272 -15584 -1721 34 -14987
3730 -14987 -5402 -9227 -16115 -10500 -17581 -36934 -19244 -8359 -8830 -6432 3954 13002 6491 -14450
3716 -14450 -36186 -31501 -21584 -9267 11074 12334 8352 -11240 5210 19383 7971 -2664 -4155
$$ packed form
3811a0975K0929P123L965o839j925K660o266q807j3923j0573Q063O517K208K3447
3797A5604j2617k6174L946l641Q761J893l85J6898j3249q778k3169q62K6328Q76
3783a4569j6689J6561o000j146K373o99k564l218J5927J0738j8168j1624J546
3770b7532L807J0690N579M478Q71K573J4555J4615K311j6085l3717M976J328k803
3756a4354J1754J6881l0009k8508L0706J9262N325j9543j7640J1891J5330l647
3744b552l157K0351M121j3149N22j438o073j513m018j366p312J3863J755j5021
3730a4987R585l825o888N615p081j9353J7690J0885m71K398J0386R048o511k0941
3716a4450k1736M685R917J2317K0341J260l982j9592J6450J4173j1412j0635j491
$$ plain form
3703 -4155 -13164 -7575 8964 3376 1497 4200 -4949 3444 -5717 -6566 1042 5657 23616 15380 3296
3688 3296 14279 15800 17121 5438 -9245 -2340 5995 -3196 -3263 -6803 -2549 12338 30467 41676
3674 41676 32088 33143 23923 12973 1130 9709 9926 -10575 -33923 -33398 -6131 -11097 -15877 -19901
3660 -19901 -20468 -19697 -14519 -30966 -23977 -23944 -19124 -3072 9956 11891 16306 15365 -2696 -13611 -14734
3645 -14734 -2007 -6696 -24650 -31239 -23776 -26228 -25048 -14274 -13822 -36908 -39829 -40467 -19412 -14887
3631 -14887 -11639 -11663 -24878 -31860 -35214 -32736 -18409 -4577 -1728 -16574 -14355 -27098 -17111 -20768
3617 -20768 -16501 -1206 10382 9098 21094 18945 -2035 -6424 13803 33596 15495 1860 11142
3604 11142 22611 -11850 -24159 -8405 -12634 -10291 3396 23590 26581 1817 -2999 11812 13142
$$ packed form
3703d155r009N589J6539n588j879K703r149Q393r161q49P608M615J7959q236j2084
3688C296J0983J521J321j1683j4683O905Q335r191o7l540M254J4887J8129J1209
3674D1676r588J055r220j0950j1843Q579K17k0501k3348N25K7267m966m780m024
3660a9901n67P71N178j6447O989L3M820J6052J3028J935M415r41j8061j0915j123
3645a4734J2727m689j7954o589P463k452J180J0774M52k3086k921o38K1055M525
3631a4887L248k4j3215o982l354K478J4327J3832K849j4846K219j2743R987l657
3617b0768M267J5295J1588j284J1996k149k0980m389K0227J9793j8101j3635R282
3604A1142J1469l4461j2309J5754m229K343J3687K0194K991k4764m816J4811J330
$$ plain form
3591 13142 2894 -4896 -7430 8470 23205 31929 30066 27314 23112 9248 5739 -17591 -28943
3578 -28943 -8110 597 5009 16216 8860 -10007 -21665 -25192 -8077 -2131 -986 -3112 -10789
3565 -10789 -1245 4834 -4935 -3297 18632 15473 11032 2068 -6224 -517 8560 3269 -7551 5207
3551 5207 37756 33935 10111 -12737 -25972 -17235 -7054 -12041 -20302 -13966 -19283 -31697 -33953
3538 -33953 -32094 -18513 -229 16322 26519 17246 11957 -4998 7355 16198 24945 7080 -4105
3525 -4105 -7831 -22850 -29592 -17162 -6171 871 4362 -1231 -17480 -15821 -19948 -2608 5476 -1219
3511 -1219 -19606 -36898 -33118 -17459 714 -1230 4375 450 -15511 -10525 -4404 -4853 -1914 2824
3497 2824 15500 -1487 -446 13825 5672 -16389 -14404 -1589 -5071 -7255 11165 26339 31279
$$ packed form
3591A3142j0248p790k534J5900J4735Q724j863k752m202j3864l509k3330j1352
3578b8943K0833Q707M412J1207p356j8867j1658l527J7115N946J145k126p677
3565a0789R544O079r769J638K1929l159m441q964q292N707R077n291j0820J2758
3551E207L2549l821k3824k2848j3235Q737J0181m987q261O336n317j2414k256
3538c3953J859J3581J8284J6551J0197r273n289j6955J2353Q843Q747j7865j1185
3525d105l726j5019o742J2430J0991P042L491n593j6249J659m127J7340Q084o695
3511a219j8387j7292L780J5659J8173j944N605l925j5961M986O121m49K939M738
3497B824J2676j6987J041J4271q153k2061J985J2815l482k184J8420J5174M940
$$ plain form
3484 31279 39764 42946 26989 1002 -24152 -41108 -24433 -2295 9171 -3422 1734 7505 -11806
3471 -11806 -24592 -15805 -19533 -25262 -16537 -20729 -10636 -5671 -3870 -11990 -25901 -19897 -23932 -33188
3457 -33188 -24182 -22747 -22281 -11419 -5373 -24835 -24056 -7975 -7449 -8903 -13680 4723 14428 6683
3443 6683 17229 14181 -13983 -9438 -4095 -1392 13365 32119 21829 -7196 2908 17603 18888
3430 18888 19634 27380 14367 -7751 -13449 -22673 -12233 -8564 3116 -4006 -9851 -13417 -12688 7484
3416 7484 5480 -23934 -18120 -16304 -13380 -7576 -10512 -24360 -8834 5116 -1118 -17089 -22211 -19646
3402 -19646 -25220 -29135 -25312 -6446 -3643 -9677 -14789 -11587 -12277 -6127 793 7875 15680 12401 13028
3387 13028 2246 -12834 -9991 -10063 -7125 -14617 -14059 -24718 -26327 -4270 10394 10581 -3558 -8006
$$ packed form
3484C1279Q485L182j5957k5987k5154j6956J6675K2138J1466j2593N156N771j9311
3471a1806j2786Q787l728n729Q725m192J0093M965J801q120j3911O004m035r256
3457c3188R006J435M66J0862O046j9462P79J6081N26j454m777J8403R705p745
3443F683J0546l048k8164M545N343K703J4757J8754j0290k9025J0104J4695J285
3430A8888P46P746j3013k2118n698r224J0440L669J1680p122n845l566P29K0172
3416G484k004k9414N814J816K924N804k936j3848J5526J3950o234j5971n122K565
3402a9646n574l915L823J8866K803o034n112L202o90O150O920P082P805l279O27
3387A3028j0782j5080K843p2K938p492N58j0659j609K2057J4664J87j4139m448
$$ plain form
3373 -8006 4087 1668 -5995 -13961 -17810 -15827 -20290 -36010 -44378 -27027 -8160 -391 -11892 -27258
3359 -27258 -26745 -16633 -21231 5284 15040 -1261 -3363 10260 6007 -531 -17943 -12129 4552
3346 4552 -3631 -8520 2904 974 1164 1471 -11314 -18402 -23474 -19425 -26915 -42767 -25243 1397
3332 1397 6334 -10858 -28588 -38075 -47784 -31908 -9687 91 -2895 6358 5469 5261 -15680 -22976
3318 -22976 -6746 4153 -899 -8038 4429 11717 5040 -10219 -29456 -29195 -25506 -29931 -22098 -27075
3304 -27075 -27845 -31834 -39868 -21406 -14026 -19313 -22972 -18867 -19797 -11315 4982 -7288 -23304 -12967
3290 -12967 -3086 -10247 -3239 -3720 -7741 -15249 -13578 -13272 -6360 4240 15075 -1441 -12816 -24581
3276 -24581 -47498 -26459 -7506 -4087 2959 -11999 -14979 -26901 -25841 -23228 -33493 -27296 -27665
$$ packed form
3373h006J2093k419p663p966l849J983m463j5720q368J7351J8867P769j1501j5366
3359b7258N13J0112m598K6515R756j6301k102J3623m253o538j7412N814J6681
3346D552q183m889J1424j930J90L07j2785p088n072M049p490j5852J7524K6640
3332A397M937j7192j7730r487r709J5876K2221R778k986R253q89k08k0941p296
3318b2976J6230J0899n052p139J2467P288o677j5259j9237K61L689m425P833m977
3304b7075p70l989q034J8462P380n287l659M105r30Q482J6297j2270j6016J0337
3290a2967R881p161P008m81m021p508J671L06O912J0600J0835j6516j1375j1765
3276b4581k2917K1039J8953L419P046j4958k980j1922J060K613j0265O197l69
$$ plain form
3263 -27665 -18164 -9353 -15943 -23293 -5729 14712 7851 4580 2024 14780 18486 13161 9063 -14476
3249 -14476 -18211 -15472 -22121 -20130 -2349 10206 6646 5472 2358 1487 4794 -2911 1684 -7409
3235 -7409 3083 10755 -1938 -7708 -12998 -27756 -11538 6200 -3280 615 6288 13370 23886
3222 23886 18810 6620 -10215 -7509 -298 1144 -4483 7639 13190 20665 -4421 -10742 -3993 -8737
3208 -8737 -4292 -10181 -7768 -15996 -11483 1849 -16142 -27452 -9429 8413 14087 8087 -3299
3195 -3299 -5903 4977 -10032 -2206 12259 1679 -24665 -30348 -25310 -17141 -4426 -7734 -14282
3182 -14282 -23253 -6658 -2075 7145 9630 12795 10501 9932 16828 28699 25708 16134 20819 31624
3168 31624 25396 18647 19040 11462 5364 -2819 -19812 -37321 -34042 -27358 -3640 -3123 9585 30275
$$ packed form
3263b7665R501Q811o590p350J7564K0441o861l271k556J2756L706n325m098k3539
3249a4476l735K739o649J991J7781J2555l560j174l114q71L307p705M595r093
3235g409J0492P672j2693n770n290j4758J6218J7738r480L895N673P082J0516
3222B3886n076j2190j6835K706P211J442n627J2122N551P475k5086o321O749m744
3208h737M445n889K413q228M513J3332j7991j1310J8023J7842N674o000j1386
3195c299k604J0880j5009P826J4465j0580k6344n683N038Q169J2715l308o548
3182a4282q971J6595M583R220K485L165k294n69O896J1871k991r574M685J0805
3168C1624o228o749L93p578o098q183j6993j7509L279O684K3718N17J2708K0690
$$ plain form
3154 30275 25134 3546 -1503 -7573 -13188 -4442 -2052 -5022 -6439 727 -1135 -6079 -2776 -1458
3140 -1458 -11198 -6573 -4741 -9816 -16504 -25051 -16007 91 3586 8587 4884 -3370 2630 -5169 -15373
3125 -15373 11418 24973 8633 -17362 -22949 -14409 -6601 -14216 -27896 -17540 2420 22267 25677
3112 25677 14594 -858 -6561 -1782 2258 1334 2744 -7967 -11742 -20521 -19371 -13331 1505 -147
3098 -147 -645 1844 4894 -75 7965 21666 26710 41422 51545 31334 32516 43135 38381 30139
3084 30139 38353 37262 23297 1540 -15013 -330 1121 7040 10753 4735 2841 3090 12324 23010
3070 23010 26197 19216 8660 -9497 -32952 -32829 -29884 -16494 -8619 5550 1603 1208 -2496 -5856
3056 -5856 -2946 -4684 -5188 1357 7506 -6650 -15909 -10506 -14759 -14812 -33531 -35488 -32378 -33631 -30358
$$ packed form
3154C0275n141k1588n049o070n615Q746K390k970j417P166j862m944L303J318
3140a458r740M625J832n075o688q547R044J6098L495N001l703q254O000p799j0204
3125a5373K6791J3555j6340k5995n587Q540P808p615j3680J0356J9960J9847L410
3112B5677j1083j5452n703M779M040r24J410j0711l775q779J150O040J4836j652
3098a47m98K489L050m969Q040J3701N044J4712J0123k0211J182J0619m754q242
3084C0139Q214j091j3965k1757j6553J4683J451N919L713o018j894K49R234J0686
3070B3010L187o981j0556j8157k3455J23K945J3390P875J4169l947l95l704l360
3056e856K910j738n04O545O149j4156r259N403m253n3j8719j957L110j253L273
$$ plain form
3041 -30358 -26830 -16907 -15962 -13062 -7754 -8472 -10231 3302 4959 -19809 -8595 10644 9864 -4208
3027 -4208 -6105 -4572 -2649 10406 -718 -15530 -11043 6831 13834 4472 -3112 -1000 4740 1226
3013 1226 -12179 -1821 8457 7110 1073 -4479 -12287 -24938 -20563 -26620 -5079 -279 8237 21027
2999 21027 14152 19952 5671 -866 15256 26692 15425 -3332 -1687 647 -4012 -11687 -25332
2986 -25332 -26480 -16603 -9772 -10584 -16824 -10532 -16618 -33184 -27435 -16249 -26619 -33881 -25771 -16519
2972 -16519 -1508 -3541 -22508 -39596 -25405 -29481 -19393 -19598 -25730 -3046 9220 8349 -12043
2959 -12043 -21060 1033 5278 5241 144 -4011 5577 -11168 -20859 -26580 -4739 4832 3560 972
2945 972 4545 5986 2556 -4870 -15995 -11199 -9585 -17769 -4447 8420 -354 4972 -21765 -48066
$$ packed form
3041c0358L528R923R45K900N308p18j759J3533J657k4768J1214J9239p80j4072
3027d208j897J533J923J3055j1124j4812M487J7874P003r362p584K112N740l514
3013A226j3405J0358J0278j347o037n552p808j2651M375o057K1541M800Q516J2790
2999B1027o875N800j4281o537J6122J1436j1267j8757J645K334m659p675j3645
2986b5332j148R877O831q12o240O292o086j6566N749J1186j0370p262Q110R252
2972a6519J5011k033j8967j7088J4191m076J0088k05o132K2684J2266q71k0392
2959a2043r017K2093M245l7n097m155R588j6745r691n721K1841R571j272k588
2945I72L573J441l430p426j1125M796J614q184J3322J2867q774N326k6737k6301
$$ plain form
2931 -48066 -45863 -19610 -5095 10633 17164 15148 12236 10957 3964 5562 -11675 -19869 -11769 -10107
2917 -10107 -17557 -16479 -22196 -16456 -5464 -7321 -31849 -71299 -53907 -29249 -9876 -20557 -21837
2904 -21837 2172 18495 12903 22277 8736 -5004 -15965 7923 15390 4198 -6369 -28696
2892 -28696 -40981 -21514 -7298 13287 -2404 -10704 -2310 -12236 -11411 -775 14619 1396 -13396
2879 -13396 -8604 4904 5573 1761 5406 18546 5711 -12297 -12176 -31711 -27262 -21195 -5423 -6593
2865 -6593 -5607 401 -2574 -6465 157 -26444 -27416 -631 17894 5473 3793 -6786 -28900 -31071
2851 -31071 -30265 -16805 -32091 -29025 -22997 -22086 -45910 -44768 -34152 -24955 -44714 -55121 -50047 -30187
2837 -30187 -30712 -64576 -62885 -30724 2263 5088 8810 14130 24751 22212 21671 26201 13583 8428
$$ packed form
2931d8066K203K6253J4515J5728O531k016k912j279o993J598j7237q194Q100J662
2917a0107p450J078n717N740J0992j857k4528l9450J7392K4658J9373j0681j280
2904b1837K4009J6323n592R374j3541j3740j0961K3888P467j1192j0567k2327
2892b8696j2285J9467J4216K0585j5691q300Q394r926Q25J0636J5394j3223j4792
2879a3396M792J3508O69l812L645J3140j2835j8008J21j9535M449O067J5772j170
2865f593R86O008k975l891O622k6601r72K6785J8525j2421j680j0579k2114k171
2851c1071Q06J3460j5286L066O028R11k3824J142J0616R197j9759j0407N074J9860
2837c0187n25l3864J691L2161L2987K825L722N320J0621k539n41M530j2618n155
$$ plain form
2823 8428 19563 47301 36799 18428 7761 -3384 -19169 154 -350 -11307 2510 -1869 -12156
2810 -12156 -27983 -15868 -2818 -1140 -13045 -9909 1193 -10483 -9585 -2548 3904 -2479 -18699
2797 -18699 -12724 -2280 -1119 -18460 -15186 -6510 -8404 9638 17975 12754 -2057 -3209 4554 6852
2783 6852 -1223 6055 3033 6126 16992 10517 16446 11374 -4536 -15150 -8806 -25408 -20072 -14094
2769 -14094 -15440 -9712 9372 23796 19056 -330 -1891 11001 786 -12237 -9093 -9461 744
2756 744 11830 1123 -7830 -3213 6440 11108 -3164 2165 12868 19790 32834 25387 3575 -5940
2742 -5940 -16986 -20944 -26229 -36993 -41393 -23932 4376 -1449 -14852 -3959 -4684 -7592 -2710 -6618
2728 -6618 -1341 -2492 -11711 -1552 3519 3582 2426 665 5250 -6635 -15766 -7674 -17590 -21807 -25122
$$ packed form
2823H428J1135K7738j0502j8371j0667j1145j5785J9323n04j0957J3817m379j0287
2810a2156j5827J2115J3050J678j1905L136J1102j1676Q98P037O452o383j6220
2797a8699N975J0444J161j7341L274Q676j894J8042Q337n221j4811j152P763K298
2783F852q075P278l022L093J0866o475N929n072j5910j0614O344j6602N336N978
2769a4094j346N728J9084J4424m740j9386j561J2892j0215j3023L144l68J0205
2756G44J1086j0707q953M617R653M668j4272N329J0703O922J3044p447k1812r515
2742e940j1046l958n285j0764m400J7461K8308n825j3403J0893p25k908M882l908
2728f618N277j151r219J0159N071O3j156j761M585j1885r131Q092r916m217l315
$$ plain form
2713 -25122 -8788 10610 18161 10254 17947 40531 36989 26004 11572 2911 -3256 -9800 -10163 4133
2699 4133 5134 -628 4084 11031 3428 6260 18010 29578 41654 44552 39364 22839 18688 19969
2685 19969 16434 18212 23978 28605 40621 29242 5113 10322 6026 -8308 -2043 -1286 -1598 -3799
2671 -3799 -3108 28785 37208 12521 -7224 -8237 -12519 -12451 -9564 -2517 -183 8534 6771 -2981 -15865
2656 -15865 -24495 -33766 -37219 -36326 -38053 -9911 -1582 -26596 -12770 -847 6651 8367 7796 -8267
2642 -8267 4067 10238 4181 5858 -18021 -14394 -6103 -1457 -15179 -34116 -36314 -24854 -12996
2629 -12996 -10303 -8020 2549 9607 -213 5719 -21022 -30429 -26991 -19087 -25125 -33822 -13315 781
2615 781 -8815 -1889 227 -1208 -4387 6485 7496 -14750 -10602 -6834 -483 -2525 -9998 -2759 -3355
$$ packed form
2713b5122J6334J9398P551p907P693K2584l542j0985j4432q661o167o544l63J4296
2699D133J001n762M712O947p603K832J1750J1568J2076K898n188j6525m151J281
2685A9969l535J778N766M627J2016j1379k4129N209m296j4334O265P57l12k201
2671c799O91L1893Q423k4687j9745j013m282O8K887P047K334Q717j763r752j2884
2656a5865q630r271l453Q93j727K8142Q329k5014J3826J1923P498J716n71j6063
2642h267J2334O171o057J677k3879L627Q291M646j3722j8937k198J1460J1858
2629a2996K693K283J0569P058r820N932k6741r407L438P904o038q697K0507J4096
2615G81r596O926K116j435l179J0872J011k2246M148L768O351k042p473P239n96
$$ plain form
2600 -3355 7158 -6425 -13091 -1212 -12641 -21564 -26442 -31793 -21274 -11541 10129 11728 -10793
2587 -10793 -3450 6985 -169 -14760 -13483 -15431 -25717 -19228 -7567 -7364 -11044 -2484 8083 -16049
2573 -16049 -32272 -25787 -19488 -19582 -2352 -6970 -20847 -28647 -17696 9345 35771 16518 21878
2560 21878 25789 11941 3754 -1171 -12590 5069 11356 1454 12307 6785 5836 12652 19631 34380
2546 34380 14128 6729 5180 1320 12940 7141 -1198 -1939 14597 22283 15556 -13294 -22148 -9172
2532 -9172 10057 14324 17244 -5491 -28436 -36665 -38926 -16335 -6079 -5818 -21531 -8783 6832
2519 6832 19328 25093 12416 7037 10596 13587 26827 22699 -4250 -15892 -3101 16762 21222
2506 21222 -4319 -11346 -3600 -18014 -9722 -8572 -10262 -9382 -6675 -1434 446 8670 16001 18678
$$ packed form
2600c355J0513j3583o666J1879j1429q923m878n351J0519R733K1670J599k2521
2587a0793P343J0435p154j4591J277j948j0286O489J1661K03l680Q560J0567k4132
2573a6049j6223O485O299r4J7230m618j3877p800J0951K7041K6426j9253N360
2560B1878L911j3848q187m925j1419J7659O287r902J0853n522r49O816O979J4749
2546C4380k0252p399j549l860J1620n799q339p41J6536P686o727k8850q854J2976
2532i172J9229M267K920k2735k2945q229k261K2591J0256K61j5713J2748J5615
2519F832J2496N765j2677n379L559K991J3240m128k6949j1642J2791J9863M460
2506B1222k5541p027P746j4414Q292J150j690Q80K707N241J880Q224P331K677
$$ plain form
2492 18678 39408 22328 -7238 -2555 7295 3303 7408 26742 35602 26253 11231 -407 -9376
$$ packed form
2492A8678K0730j7080k9566M683R850l992M105J9334Q860r349j5022j1638q969
$$ [...]
##END NTUPLES=NMR SPECTRUM
##END=
