##TITLE=Analysis number 320746
Compound Code cc 48646
Book Reference 483/36/2
Project Code adrs
Chemist Name mattw
##JCAMPDX= 6.0         $$ Bruker NMR JCAMP-DX V2.0
##DATA TYPE= NMR SPECTRUM
##DATA CLASS= NTUPLES
##ORIGIN= Bruker BioSpin GmbH
##OWNER= nmr
$$ XWIN-NMR		Version 3.5
$$ Fri Jul  7 09:31:47 2006 GMT Daylight Time (UT+1h)  MAYBRIDGE\nmr@NMR_250MHZ
##.OBSERVE FREQUENCY= 250.131544655141
##.OBSERVE NUCLEUS= ^1H
##.ACQUISITION MODE= SIMULTANEOUS (DQD)
##.ACQUISITION SCHEME= undefined
##.AVERAGES= 16
##.DIGITISER RES= 18
##SPECTROMETER/DATA SYSTEM= dpx250
##.PULSE SEQUENCE= zg30
##.SOLVENT NAME= CDCl3
##.SHIFT REFERENCE= (INTERNAL, CDCl3, 0, 16.522)
##AUDIT TRAIL= $$ (NUMBER, WHEN, WHO, WHERE, WHAT)
$$ ##TITLE= Audit trail, XWIN-NMR		Version 3.5
$$ ##JCAMPDX= 5.01
$$ ##ORIGIN= Bruker BioSpin GmbH
$$ ##OWNER= nmr
$$ C:\u/data/dgb/nmr/ADRS/2500/pdata/1/auditp.txt
$$ ##AUDIT TRAIL=  $$ (NUMBER, WHEN, WHO, WHERE, WHAT)
(   1,<2006-07-07 09:31:25.94 +100>,<MAYBRIDGE\nmr>,<NMR_250MHZ>,
      <created by zg, POWCHK disabled, PULCHK disabled
       configuration hash MD5:
       E2 DF 36 D8 04 B2 41 60 5A D7 A3 38 5A 4B D0 FE
       data hash MD5: 64K
       DC 4E 08 48 20 07 79 BC 58 F3 B8 CD 86 A7 18 CF>)
(   2,<2006-07-07 09:31:38.41 +100>,<MAYBRIDGE\nmr>,<NMR_250MHZ>,
      <Start of raw data processing
       ef LB = 0.3 FT_mod = 6 PKNL = 1 SI = 32K 
       data hash MD5: 32K
       A0 76 54 3B DF 0B 10 7D C5 47 8D 2D 9F 71 E6 F2>)
(   3,<2006-07-07 09:31:40.02 +100>,<MAYBRIDGE\nmr>,<NMR_250MHZ>,
      <apk 
       data hash MD5: 32K
       9B 31 F1 06 D7 D3 D8 EB 6A 0D CF D0 EC E1 78 2A>)
(   4,<2006-07-07 09:31:40.83 +100>,<MAYBRIDGE\nmr>,<NMR_250MHZ>,
      <abs ABSG = 5 
       data hash MD5: 32K
       91 CC 1A 9A 8B 7F 1E E9 93 C8 02 82 DD C0 5D 72>)
$$ ##END=
$$ 
$$ hash MD5
$$ 95 7C 71 E0 D0 1E CD 00 B0 6B 64 EF 2D 0B 3E 28
##$RELAX= 
##$RELAX= 
##$RELAX= 
##$RELAX= 
##$RELAX= 
##$RELAX= 
##$RELAX= 
$$ Bruker specific parameters
$$ --------------------------
##$DU= <C:\u>
##$EXPNO= 2500
##$NAME= <ADRS>
##$PROCNO= 1
##$TYPE= <nmr>
##$USER= <dgb>
##$AMP= (0..31)
100 100 100 100 100 100 100 100 100 100 100 100 100 100 100 100 100 100 
100 100 100 100 100 100 100 100 100 100 100 100 100 100 
##$AQSEQ= 0
##$AQ_mod= 3
##$AUNM= <au_zg>
##$AUTOPOS= <36 >
##$BF1= 250.13
##$BF2= 250.13
##$BF3= 250.13
##$BF4= 250.13
##$BF5= 500.13
##$BF6= 500.13
##$BF7= 500.13
##$BF8= 500.13
##$BYTORDA= 1
##$CFDGTYP= 0
##$CFRGTYP= 5
##$CHEMSTR= <none>
##$CNST= (0..31)
1 1 145 1 1 1 1 1 1 1 1 1 1 1 1 1 1 1 1 1 1 1 1 1 1 1 1 1 1 1 1 1 
##$CPDPRG= <>
##$CPDPRG1= <>
##$CPDPRG2= <>
##$CPDPRG3= <>
##$CPDPRG4= <mlev>
##$CPDPRG5= <mlev>
##$CPDPRG6= <mlev>
##$CPDPRG7= <mlev>
##$CPDPRG8= <mlev>
##$CPDPRGB= <>
##$CPDPRGT= <>
##$D= (0..31)
0 1 0 0 0 0 0 0 0 0.06 0 0 0 0 0 0 0.0002 0 0 0 0 0 0 0 0 0 0 0 0 0 0 
0 
##$DATE= 1152261084
##$DBL= (0..7)
120 120 120 120 120 120 120 120 
##$DBP= (0..7)
150 150 150 150 150 150 150 150 
##$DBP07= 0
##$DBPNAM0= <>
##$DBPNAM1= <>
$$ [...]
##$SUBNAM7= <"">
##$SUBNAM8= <"">
##$SUBNAM9= <"">
##$SW= 20.6930455092707
##$SWIBOX= (0..15)
0 0 3 0 0 0 0 0 0 0 0 0 0 0 0 0 
##$SW_h= 5175.983436853
##$TD= 65536
##$TD0= 1
##$TE= 295.16
##$TE2= 300
##$TE3= 300
##$TEG= 300
##$TL= (0..7)
0 120 120 120 120 120 120 120 
##$TP= (0..7)
150 150 150 150 150 150 150 150 
##$TP07= 0
##$TPNAME0= <>
##$TPNAME1= <>
##$TPNAME2= <>
##$TPNAME3= <>
##$TPNAME4= <>
##$TPNAME5= <>
##$TPNAME6= <>
##$TPNAME7= <>
##$TPOAL= (0..7)
0.5 0.5 0.5 0.5 0.5 0.5 0.5 0.5 
##$TPOFFS= (0..7)
0 0 0 0 0 0 0 0 
##$TUNHIN= 0
##$TUNHOUT= 0
##$TUNXOUT= 0
##$USERA1= <user>
##$USERA2= <user>
##$USERA3= <user>
##$USERA4= <user>
##$USERA5= <user>
##$V9= 5
##$VALIST= <valist>
##$VCLIST= <CCCCCCCCCCCCCCC>
##$VD= 0
##$VDLIST= <DDDDDDDDDDDDDDD>
##$VPLIST= <PPPPPPPPPPPPPPP>
##$VTLIST= <TTTTTTTTTTTTTTT>
##$WBST= 1024
##$WBSW= 4
##$XGAIN= (0..3)
0 0 0 0 
##$XL= 0
##$YL= 0
##$YMAX_a= 455756
##$YMIN_a= -598574
##$ZGOPTNS= <>
##$ZL1= 120
##$ZL2= 120
##$ZL3= 120
##$ZL4= 120
##$ABSF1= 16.522
##$ABSF2= -4.171173
##$ABSG= 5
##$ABSL= 3
##$ALPHA= 0
##$AQORDER= 0
##$ASSFAC= 0
##$ASSFACI= 0
##$ASSFACX= 0
##$ASSWID= 0
##$AUNMP= <proc_1d>
##$AZFE= 0.1
##$AZFW= 0.1
##$BCFW= 0
##$BC_mod= 0
##$BYTORDP= 0
##$COROFFS= 0
##$CY= 12.5
##$DATMOD= 1
##$DC= 0
##$DFILT= <>
##$DTYPP= 0
##$F1P= 14.0000005364418
##$F2P= -0.99999901652339
##$FCOR= 0.5
##$FTSIZE= 32768
##$FT_mod= 6
##$GAMMA= 0
##$GB= 0
##$INTBC= 1
##$INTSCL= 1
##$ISEN= 128
##$LB= 0.3
##$LEV0= 0
##$LPBIN= 0
##$MAXI= 10000
##$MC2= 0
##$MEAN= 0
##$ME_mod= 0
##$MI= 0
##$NCOEF= 0
##$NC_proc= -4
##$NLEV= 6
##$NOISF1= 0
##$NOISF2= 0
##$NSP= 0
##$NTH_PI= 0
##$NZP= 0
##$OFFSET= 16.522
##$PC= 1
##$PHC0= 163.434
##$PHC1= 4.289686
##$PH_mod= 1
##$PKNL= yes
##$PPARMOD= 0
##$PSCAL= 4
##$PSIGN= 0
##$REVERSE= no
##$SF= 250.13
##$SI= 32768
##$SIGF1= 0
##$SIGF2= 0
##$SINO= 400
##$SIOLD= 32768
##$SREGLST= <1H.CDCl3>
##$SSB= 0
##$STSI= 32768
##$STSR= 0
##$SW_p= 5175.98343685301
##$SYMM= 0
##$S_DEV= 0
##$TDeff= 65536
##$TDoff= 0
##$TI= <Analysis number 999999
Compound Code 99
Book Reference 9
Project Code 9>
##$TILT= no
##$TM1= 0
##$TM2= 0
##$TOPLEV= 0
##$USERP1= <user>
##$USERP2= <user>
##$USERP3= <user>
##$USERP4= <user>
##$USERP5= <user>
##$WDW= 1
##$XDIM= 32768
##$YMAX_p= 430831945
##$YMIN_p= -146225
$$ End of Bruker specific parameters
$$ ---------------------------------
##NTUPLES= NMR SPECTRUM
##VAR_NAME=  FREQUENCY,     SPECTRUM/REAL,   SPECTRUM/IMAG
##SYMBOL=    X,             R,               I
##VAR_TYPE=  INDEPENDENT,   DEPENDENT,       DEPENDENT
##VAR_FORM=  AFFN,          ASDF,            ASDF
##VAR_DIM=   32768,         32768,           32768
##UNITS=     HZ,            ARBITRARY UNITS, ARBITRARY UNITS
##FACTOR=    0.157963299565203, 1,           1
##FIRST=     4132.6476996994, 0,             0
##LAST=      -1043.33573715361, 0,           0
##MIN=       -1043.33573715361, -146225,     0
##MAX=       4132.6476996994, 430831945,     0
$$ Real data points
##PAGE= N=1
##DATA TABLE= (X++(R..R)), XYDATA
$$ [...]
15983b7167J1132j2501j8754j0782j540j0697j9730n523R785K7087M3685J054
15971a3951j4728R760R926j2363j0299j0678k0095j3671P620M8904L3448R959
15959B3832K009r861l820l6454l3398K6165L6657K1829j1235m6002M303k95j7926
15946d4196q881J1600K0587q599k5963j201J4280N833J9715J9372K1550J0569
15934C4666j313k7672k0295k4186L1176j5748l2946J5232J1003k56k0954J4366
15922c6927J6440K4109J6252J7260l2812j5377r27k0230Q677l510n777J2434J5005
15909e383N676Q025R844q555q103l2304J9173P07o734n037J324j7397Q373r798
15895d0189j2959j0131K858J6649l219j4069K172n840P179M7606l086q557R301
$$ plain form
15983 -27167 -16035 -28536 -47290 -58072 -59612 -70309 -90039 -95562 -85777 -58690 -15005 -13951
15971 -13951 -28679 -18919 -8993 -21356 -31655 -42333 -62428 -76099 -68479 -19575 13873 23832
15959 23832 25841 15980 12160 -24294 -57692 -31527 5130 26959 15724 -30278 -25975 -26270 -44196
15946 -44196 -53077 -41477 -20890 -29489 -55452 -56653 -42373 -36540 -16825 2547 24097 34666
15934 34666 33353 5681 -14614 -38800 -7624 -23372 -56318 -41086 -30083 -30339 -51293 -36927
15922 -36927 -20487 3622 19874 37134 4322 -11055 -11982 -32212 -23535 -27045 -32822 -20388 -5383
15909 -5383 293 8318 18162 9607 1504 -30800 -11627 -10920 -17654 -22691 -21367 -38764 -30391 -40189
15895 -40189 -53148 -63279 -60421 -43772 -46991 -61060 -58888 -64728 -57549 -9943 -13029 -21586 -12285
15882a2285J5398p306m2281p882Q085r892r593N33j1398n321J0272p700k910m706
15868h6986J5338o992k984J1291J1932M929J7152J0860P64r5j0q98k0653j6428
15854f2780K499n90k2428K2195N3599K3951R575P772M745J3073j4010k4112j0921
15841B568k9280K2461J4931m862j1754r091j0974J1191q273L2100M2109l1741
15829A9385L15K7430m187j8021m0985l5358M258N611k615O623m427j1533J7643
15816c5861K8805J7776k5717m34Q673J2305j4681R68J2580P6k8808J6675M631
15803c012m327j0420n379l056n879N912J1334j0840M110J5354l729k0994j2898
15790d3824j5930k4539L3951J3057P93J932M3P635r103j2090q842j754j5712J3553
$$ plain form
15882 -12285 3113 -4193 -46474 -54356 -46271 -56163 -65756 -65223 -76621 -81942 -71670 -79370 -82280 -86986
15868 -86986 -71648 -78640 -81624 -70333 -58401 -53472 -36320 -25460 -24696 -24791 -24801 -25699 -46352 -62780
15854 -62780 -60281 -60871 -83299 -61104 -7505 16446 26021 33793 38538 51611 37601 13489 2568
15841 2568 -26712 -4251 10680 5818 -5936 -15027 -26001 -14810 -23083 9017 51126 19385
15829 19385 19700 47130 42943 24922 -16063 -51421 -47163 -41552 -44167 -37544 -41971 -53504 -35861
15816 -35861 -7056 10720 -14997 -15431 -6758 5547 -9134 -8166 4414 4490 -24318 -7643 -3012
15803 -3012 -7339 -17759 -23138 -26194 -32073 -26161 -14827 -25667 -21557 -6203 -9932 -30926 -43824
15790 -43824 -59754 -84293 -50342 -37285 -36492 -34560 -34517 -26882 -35985 -48075 -56917 -58671 -74383 -60830
15776f0830M2213K1524n573M554j1042j5312k463J3337l0426m0271q98M1318J5101
15763b8768P843j3764p561k5788p036M5452J3675j6983j720P568O680o542k4690
15750e1634J0051J8458J5554k7928j2890q130r145j385L1455K534k7820O545q238
15737f2573M1967L3603j6785j7469l584K49J335o59M216J1982l912m840J945r942
15723b4467J7843R37J882L1861k255L652j2512j490o994r458l4429k812J1248
15710b6994Q152m974K2326K801j9285o243P728K1455J6599n814k0686J1391K0838
15697B7294m890l0866j284J1520J6270K1813P764j3747q580j0128R051k49j9837
15684D131n422K380m6333M139L9926J8100n363l1764j3042M463M826j1232o73
$$ plain form
15776 -60830 -18617 2907 -2666 1888 -9154 -24466 -26929 -13592 -44018 -84289 -85187 -43869 -28768
15763 -28768 -20925 -34689 -42250 -68038 -75074 -29622 -15947 -32930 -34650 -27082 -20402 -26944 -51634
15750 -51634 -41583 -23125 -7571 -35499 -48389 -56519 -65664 -67049 -35594 -33060 -60880 -54335 -62573
15737 -62573 -20606 12997 -3788 -21257 -24841 -24592 -23257 -23916 -19700 -7718 -11630 -16470 -14525 -24467
15723 -24467 -6624 -5687 -3805 28056 25801 29453 16941 15451 8457 -1001 -35430 -38242 -26994
15710 -26994 -18842 -23816 -1490 1311 -17974 -24217 -16489 4966 21565 15751 -4935 6456 27294
15697 27294 22404 -8462 -9746 1774 18044 39857 47621 33874 25294 15166 24217 23968 4131
15684 4131 -1291 1089 -45244 -41105 -1179 16921 11558 -20206 -33248 -28785 -23959 -35191 -35864
15671c5864n849l9514j6293K4817M3724M171k792r822K423N916j6281L2037J9391
15658F064k4571q50J6394J8748l0137L849j9339k7026K3703L4997n083k9753J3101
15645a9903J8564j34Q78n511r484j3521K14M997R934J7173j6963J029R203Q049
15631D525j817k9277J350N2062J0660j1816k9654l226J52o157j5155J0121L674
15618a4558L789m577q484j7647k7247J0850K5306j7850L069K4610n863j1551J5356
15605b4797Q064N350j1406k74L085k4444P2o282J279J3938K424j1772p867J300
15591e1330K1723Q744M977j5773r192j063J5533L3799j38j1324K0543J8288k0068
15578A4719M516r827q029K7764k6085O620K4494O967m415l2328j1019j9999j3203
$$ plain form
15671 -35864 -41713 -81227 -97520 -72703 -28979 -24808 -27600 -37422 -34999 -29083 -45364 -13327 6064
15658 6064 -18507 -19357 -2963 15785 -14352 -10503 -29842 -56868 -33165 1832 -3251 -33004 -19903
15645 -19903 -1339 -1473 -595 -6106 -15590 -29111 -28897 -23900 -13966 3207 -13756 -12727 -3524 4525
15631 4525 2708 -26569 -25219 26843 37503 25687 -3967 -7193 -7041 -13198 -28353 -18232 -14558
15618 -14558 -10769 -15346 -23830 -41477 -68724 -57874 -32568 -50418 -47349 -22739 -28602 -40153 -24797
15605 -24797 -16733 -11383 -22789 -23063 -19978 -44422 -44350 -50632 -49353 -35415 -32991 -44763 -52630 -51330
15591 -51330 -29607 -20863 -15886 -31659 -40851 -41914 -26381 7418 7280 -4044 16499 34787 14719
15578 14719 19235 9408 1379 29143 3058 9678 34172 41139 36724 4396 -6623 -26622 -39825
15565c9825M727J6294O220n264K3794L2434j4852j6932M499k0908k5848q960o877
15552e1498N511J9150L2637j340j5893m482K902J4947q536M584j8725k0707J6959
15539b4491M3734P635l1142J1451L574N447O89O033L784K2151p806L9j6324k6024
15525a250k9180j4865L2586J3886R470J009k2024n805j8996j1961l786k165K877
15512e0204P76k225K7856M3350O157j1150k6115k210K2469o536K7119M125Q708
15499D2120k6062j6021J1187J9306J0034K3l0931k8973j71K0445J206J1466M70
15486A4099O462l014J3038J76K933l3958J1697J7742J3425J4400q239j112k3076
15473B4573k4424L046K3566k7034m1211O667L3685L2666L6102j0645k4274j1350
$$ plain form
15565 -39825 -35098 -18804 -12584 -17848 5946 38380 23528 6596 11095 -9813 -35661 -44621 -51498
15552 -51498 -45987 -26837 5800 4460 -11433 -15915 -13013 1934 -6602 -2018 -20743 -41450 -24491
15539 -24491 19243 26878 -4264 7187 10761 16208 16897 22930 26714 48865 41059 41098 24774 -1250
15525 -1250 -30430 -45295 -12709 1177 10647 11656 -10368 -16173 -35169 -47130 -50916 -53081 -50204
15512 -50204 -49428 -51653 -23797 19553 25710 14560 -11555 -13765 8704 2168 29287 33412 42120
15499 42120 16058 37 11224 30530 40564 40587 9656 -19317 -19488 957 2163 13629 14099
15486 14099 20561 17547 30585 30761 33694 -264 11433 29175 42600 57000 48761 47649 24573
15473 24573 149 3195 26761 -273 -41484 -34817 -1132 31534 67636 56991 32717 21367
15461B1367k666R647J6790Q682k2844m213j2547k5402l2896j033K2443L979k859
15448b1552j1771J3671J8419J3095J3446J590j3457j835L288J6033p39j1152J7810
15435C6846J1234k4969l3437J4672q549P724n453R93j4887l059l512m025L0485
15422D063P584j643Q356j2749j6764m772k6719Q234L0937K0383K5470P245l8416
15409A1209l1669P022o547j299M105j7827n275K0338K1926l18k6053j5580M1650
15396A682J9397J1248j2198k7545j9717K7911J3552j1096j8479j847J4163L4660
15384C1731J0528p89k6829k1027M0189L8294l0916o725j7320N772L379N2O864
15371C3203J8916K516k6167j2445K0727K1392j8327k2121j794N676j1077M457
$$ plain form
15461 21367 18701 28348 45138 53820 30976 26763 14216 -11186 -44082 -45115 -22672 -18693 -21552
15448 -21552 -33323 -19652 -1233 11862 25308 26898 13441 11606 14894 30927 30188 19036 36846
15435 36846 48080 23111 -10326 4346 -4203 3521 -1932 -939 -15826 -18885 -22397 -26422 4063
15422 4063 11647 10004 18360 5611 -11153 -15925 -42644 -34410 -3473 16910 42380 49625 11209
15409 11209 -20460 -13438 -19985 -21284 -17179 -35006 -40281 -19943 1983 1665 -24388 -39968 1682
15396 1682 21079 32327 20129 -7416 -27133 778 14330 3234 -15245 -17092 -2929 31731
15384 31731 42259 41470 14641 -6386 33803 72097 41181 34456 17136 22908 26287 26339 33203
15371 33203 52119 54635 28468 16023 36750 58142 39815 17694 15900 21576 10499 14956
15359A4956l294j176n137j581J6103k504k0495K2271O117k1036K435P433k5371
15346a1279Q596J3557j2834K018j3445n351o380l756J0072K4208K6264j586o362
15333B3722m417j2308J7805k2617k9348K7570J5508K498m520j6733J0231o104
15321A287J3756q918Q499j0840J2763j0810k3066l0515r72M985j3935O135K4258
15308b7373m212r875O778K672K0062K9087J0511m362j1406j1713j0622M636l5
15295e852J2748M572J8113r425l3698m305J2013J9118j4069j0624J1402l751j0234
15282a3992P646J5996j0941n10p71k0603O406J210k6224J0549N538L329J5149
15269g218k378k2249o685l484p448q642m516j7197J4238K5686K8794l74J8055
$$ plain form
15359 14956 11662 10486 5349 3768 19871 17367 -3128 19143 25260 4224 6659 14092 -11279
15346 -11279 -2683 10874 -1960 58 -13387 -18738 -25118 -28874 -18802 5406 31670 30084 23722
15333 23722 19305 6997 24802 2185 -27163 407 15915 18413 13893 -2840 7391 1287
15321 1287 15043 6125 14624 3784 16547 5737 -17329 -47844 -48816 -43831 -57766 -51631 -27373
15308 -27373 -31585 -41460 -34682 -32010 -11948 17139 27650 23288 11882 169 -10453 -5817 -5852
15295 -5852 6896 11468 29581 20156 -13542 -17847 -5834 13284 -785 -11409 -7 -3758 -13992
15282 -13992 -6346 9650 -1291 -1801 -2572 -23175 -16769 -15559 -41783 -31234 -25696 -22367 -7218
15269 -7218 -9596 -31845 -38530 -42014 -49462 -58104 -62620 -79817 -65579 -39893 -11099 -11473 6582
15256F582N024L91J9082J532N411R033m27j2248k1681j744Q599L4675l6455l3801
15242a6027J3957J1635m743q784p092q507K7066K0064Q28j2927o408k819j098
15229E145N344O020j006j1757j4244M454J4684k792j058K0579m742j8515q083
15216e971M911k3585n220K4019P263l879n59p700J886J0775N323p357J082J1185
15202A2173K7435J0690k0886K545K1179r733l2477j4123N311k008J8537J4078
15190C2721j7408Q695M47j733N156j1697k262p297k2552j9402j3761R219j5219
15177e5093R824M4629L0838q823k5248J800K2121j2193Q470J2969p709k1070P847
15164H362J9993K27q758k7089j608P411m837n0205p115L3065n762K2778J8508
$$ plain form
15256 6582 11606 11997 31079 32611 38022 47055 46628 34380 12699 10955 19554 54229 17774 -16027
15242 -16027 -2070 9565 4822 -3962 -11054 -19561 7505 27569 28397 15470 9062 6243 5145
15229 5145 10489 16509 15503 3746 -10498 -6044 8640 5848 4790 25369 20627 2112 -5971
15216 -5971 -1060 -24645 -29865 -5846 1417 -2462 -3021 -10721 -8835 1940 7263 -94 988 12173
15202 12173 39608 50298 29412 31957 53136 43403 10926 -3197 2114 106 18643 32721
15190 32721 15313 24008 24455 22722 27878 16181 13919 6622 -15930 -35332 -49093 -39874 -55093
15177 -55093 -45269 -640 30198 21375 -3873 -2073 20048 7855 16325 29294 21585 515 8362
15164 8362 28355 28582 19824 -7265 -8873 -1462 -6299 -56504 -63619 -30554 -36316 -13538 4970
15151D970J3504J2863J3705O730k6288r599J0119O937K2554j7903l9121J6491
15139A4962L0111M216j4886l4858m3125j711K1649J0666j9770O306J8683K5092
15127A7335J2129K2083r74k4238r865k0000l5414j7953J1838K6940J0689j9965
15115b7395o052M288L0330L2715j2239m096m809P075j2382j2820j868j5608K929
15102a9932Q615K1250L1265K1355j467k4210l6842j5893n046k974j2715P093M6104
15089A6603K3663j5288k199j6145q831J468P770J057j0298J4701p9J1250n610
15076A8062l1974k055o782K052j308K7025K6758j0945k8955L377M252J4304m773
15063I038L4532J1423p217j2046P780k6489j4240j0446R570K602o486K165r889
$$ plain form
15151 4970 18474 31337 45042 51772 25484 15885 26004 32941 55495 37592 -1529 14962
15139 14962 45073 49289 34403 -455 -43580 -45291 -23642 -12976 -32746 -26440 -7757 17335
15127 17335 29464 51547 50573 26335 16470 -3530 -38944 -56897 -45059 -18119 -7430 -27395
15115 -27395 -33447 -29159 1171 33886 21647 17551 12742 19817 7435 -5385 -7253 -22861 -19932
15102 -19932 -11317 9933 41198 62553 61086 36876 34 -15859 -20905 -23879 -36594 -29501 16603
15089 16603 40266 24978 22779 6634 -2197 -729 7041 8098 -2200 12501 12422 23672 18062
15076 18062 -13912 -15967 -22749 -20697 -22005 5020 31778 20833 -8122 -4745 -493 13811 9038
15063 9038 43570 54993 47776 35730 43510 17021 2781 -7665 1905 4507 -1979 186 -9703
15050i703J1043j1615Q315J5451N83Q369J6576m913Q946j1248o560J3532l094
15037C5682j529K3183J8231n285j2415k4386k2370o862n723l1778j1700Q139J056
15024c5757o233m331n572J3319J3455p666O26K1152L5541k372P5j1643K986J022
15010A4602k0178j3627n286J7995Q389j0210j3433Q807K3628J7906J2254k562
14998C8285l9348P510P314J9832L9648K2715j0295n237m1215j3070j0809N517
14986B0847k685P634J6369N030l4978k8279J3042N774j25K7734L797O41j8714
14973A6087K628K4442O838m782p505J1251R781j3102k1804j4260M720K003j5990
14960C07j4005j9861K722J3393j4081o988K7570L9635K7902j7583j3658k173j6196
$$ plain form
15050 -9703 1340 -10275 -1960 13491 14074 22443 39019 34106 43052 31804 25244 38776 35682
15037 35682 34153 57336 75567 70282 57867 33481 11111 4249 -1474 -33252 -44952 -36813 -35757
15024 -35757 -41990 -46321 -51893 -38574 -25119 -32785 -32159 -11007 24534 22162 22237 10594 13580 14602
15010 14602 -5576 -19203 -24489 -6494 1895 -8315 -21748 -12941 10687 28593 40847 38285
14998 38285 -1063 6447 13761 33593 73241 95956 85661 80424 39209 26139 15330 20847
14986 20847 18162 25796 42165 47195 12217 -16062 -3020 2754 2629 30363 34160 34801 16087
14973 16087 18715 43157 49995 45213 37708 48959 58740 45638 23834 9574 14294 16297 307
14960 307 -13698 -33559 -30837 -17444 -31525 -38513 -10943 28692 56594 39011 25353 23180 6984
14947F984J5165j331k0000k195j3897J3182J5574k608K987j2810r358J2061k2612
14934a8858m64J5933l92J0189L2618j9419Q640j3713l2361K0104L7499N762j5711
14921B9827M203j7202O92j3279n362N366r359P983J6547k812q774l319O407J5870
14907B6788J6062R194j5234j2459J8759K6885K5729l3074k8318j3482L9693J4979
14895G5522L040j5947j5575j0675o490j8954J1620L5829j9459j415O40j1698j5289
14882A1149q158j3111n173J4307M507K5534j1631M765J1982j1043j5718N914Q555
14869B1879J3455m734k3479j8477p371k1528J2686M5857K6896p026L12m185P293
14856D1578J777m280k1306o849l103J9535j5494N198K4396J1852j295J69J428
$$ plain form
14947 6984 22149 20818 818 -1377 -15274 -2092 13482 10874 13861 1051 -8307 3754 -18858
14934 -18858 -19322 -3389 -3781 6408 39026 19607 28247 14534 -17827 2277 39776 45538 29827
14921 29827 34030 16828 17520 4241 -1121 4245 -5114 2869 19416 16604 7830 4511 10918 26788
14907 26788 42850 52044 36810 24351 43110 69995 95724 62650 34332 20850 60543 75522
14895 75522 78562 62615 47040 36365 29875 10921 22541 58370 38911 37496 38136 26438 11149
14882 11149 2991 -10120 -15293 -986 3521 29055 17424 22189 34171 23128 7410 13324 21879
14869 21879 35334 30600 7121 -11356 -18727 -40255 -27569 18288 45184 38158 38470 34285 41578
14856 41578 43355 39075 17769 10920 7817 27352 11858 17056 41452 53304 52009 52178 53606
14843E3606j188j8327P212P239J6058j1416j2349l1662r606J4754k655j4402L231
14830D95J6332J1161l844j6180r685L5639r164k6474l150J3682k08K05K7646K2547
14816E9002M671J3105j2430j637J7532n8146k2324N507P524j426j1493j455m422
14803e992L753j922Q78k632J7809J7027L693j1789k7049N148O777k0167k686K0293
14789C141k1727N741K1983j8544j7747J5807J7806J8602k8212k49J5152P843J5886
14776C5482K4947l1900j0918j1932R584J1497J1782J4498K088J7l4536j0415J2970
14763B3164O239J4251j969j8809j6041j424J40l0824K7798O844j1380Q279K8877
14750C5145J5494J672l3456j1323K3361N332J912j8935N81J6426R523j8396j3575
$$ plain form
14843 53606 52418 34091 41303 48542 64600 53184 40835 9173 -433 14321 11666 -2736 495
14830 495 16827 27988 24144 7964 -1721 33918 24754 -1720 -4870 8812 8604 8809 36455 59002
14816 59002 63673 76778 64348 62711 80243 22097 -227 5280 12804 11378 -115 -1570 -5992
14803 -5992 -2239 -4161 -3283 -5915 11894 28921 32614 20825 -6224 -1076 5701 -14466 -17152 3141
14789 3141 -18586 -12845 9138 -9406 -27153 -11346 6460 25062 -3150 -3399 11753 19596 35482
14776 35482 60429 28529 17611 5679 15263 26760 38542 53040 55128 55145 20609 10194 23164
14763 23164 29403 43654 41685 22876 6835 5411 5551 -25273 2525 9369 -2011 6268 35145
14750 35145 50639 52311 18855 7532 30893 36225 38137 19202 19783 36209 45732 27336 13761
14737A3761K8476R785K4116j6725j9031J79r914m675J2307J3461k0098q565k264
14724B0813J394J0917P59J9525m192J8237K3449M04m096k1163r672j664K1607
14711G6318j3996l7122k1518m419n497o68J2231n828O355J2495J1257k9595r178
14698i165K1740n067l3624q828M8572K0446L629k2438Q233K644p328M8036r317
14685E7533k4667O199Q987j622j4489j4154O577L1943K1118j4047j2241J243O953
14672E9333J8349J1009j5576l0999k7777l533l334j0027K2912J5417j3620N058
14660B7212m732j4439J8983L4920k5657j1917L073J6879m344K2688P791k055k7544
14647D0858J00K1509p566m054l675J2462k6437l858L1659j828n799k3882j2285
$$ plain form
14737 13761 42237 52022 76138 59413 40382 40561 30647 25972 38279 51740 31642 23077 20813
14724 20813 22207 33124 33883 53408 49216 67453 90902 91306 87210 66047 56375 54711 76318
14711 76318 62322 25200 3682 -737 -6234 -6902 5329 -499 5856 18351 29608 13 -9165
14698 -9165 12575 7508 -26116 -34944 13628 34074 37703 15265 23498 26142 18814 66850 57533
14685 57533 32866 39065 48052 46430 31941 17787 24364 56307 77425 63378 51137 52380 59333
14672 59333 77682 88691 73115 42116 14339 10806 7472 -2555 20357 35774 22154 27212
14660 27212 22480 8041 27024 61944 36287 24370 27443 44322 39978 62666 70457 68402 40858
14647 40858 40958 62467 54901 50847 47172 59634 33197 29339 60998 59170 53371 29489 17204
14634A7204N234j2976R07J4196O397j7204j2387J4202O12p826O619K4302Q201
14621D7481k4725o416o404L588j236K5989Q305J2099r587j2786o107J5328j4378
14608C1151l3665k685J928j0875K6974K9516J7106Q172L567j4623j2261r118j0326
14595B4861k0002L719J7767M688R442N73O919j861M200l3980P754K0358R46j9489
14581B5895N639k599N914j3850L331l736o716l881j5964J2473J8393J6635j2253
14568B9281j4888k0006J3905J5106L112k1239K648L769J18Q234K8455p291l3025
14555H179R662K5725j9858k767k1141n482K0870N074J0610j1515J2562J6033k8495
14542A9457J8710J9832j6110J41K5798J08l8423k6900m073J2409L0149K2151M865
$$ plain form
14634 17204 22438 9462 10369 24565 30962 13758 1371 15573 16185 8359 14978 39280 47481
14621 47481 22756 16340 9936 13524 12288 38277 46582 58681 49094 36308 30201 45529 31151
14608 31151 -2514 -5199 -3271 -14146 12828 42344 59450 67622 71189 56566 44305 35187 24861
14595 24861 4859 8578 26345 31033 40475 41048 47967 46106 50306 16326 24080 44438 45384 25895
14581 25895 31534 28935 34849 20999 24330 20594 13878 9997 -5967 6506 24899 41534 29281
14568 29281 14393 -5613 8292 23398 26510 5271 7919 11688 11806 20040 48495 41204 8179
14555 8179 17841 43566 23708 20941 -200 -5682 15188 20262 30872 19357 31919 47952 19457
14542 19457 38167 57999 41889 42030 67828 67936 29513 2613 -1460 10949 41098 63249 68114
14529F8114k5276K320k4603j0126K2820J1567k1503n926K3172K5085J4275M6n390
14516G4575j8624J3127r299r618q409m1806N894L2609K7132K6018j1842n098K608
14503G7267k6222k1860k1094K4118L9105k184l7381R09J3480K5687Q307J6880
14491I7012k45n4845l1917j1098J2548O383K5169q702j6611p968N433j9623l5151
14478c9615L1118N9174R696O881k7500j1973j0049P415O683m917J0223O302P144
14465E0582j5429j9126M4233K7282j0007Q528j0687K067p393M456J5672J4906
14453A05084l6802l2618j0280k5275j2126P841K0439r724R179K4012M697O651
14441E1078J2121j1584j3097J4986P322r054k7048k6147J7258J1372K3005J4126
$$ plain form
14529 68114 42838 45158 20555 10429 33249 44816 23313 17387 40559 65644 79919 79965 74575
14516 74575 55951 69078 59779 50161 41752 -54 5840 38449 65581 91599 79757 74659 77267
14503 77267 51045 29185 8091 32209 71314 69130 31749 32658 46138 71825 80132 97012
14491 97012 96767 41922 10005 -1093 11455 17838 43007 34305 17694 9726 15159 -4464 -39615
14478 -39615 -8497 50677 60373 67254 39754 27781 17732 25147 31830 26913 37136 43438 50582
14465 50582 35153 16027 60260 87542 77535 86063 75376 77443 70050 74506 90178 105084
14453 105084 68282 35664 25384 109 -12017 -4176 16263 6539 15718 39730 44427 51078
14441 51078 63199 51615 38518 53504 60826 51772 24724 -1423 15835 27207 50212 64338
14429F4338K7125K1785k2998l6247j0643k7297j0320m050j0276J4507K4312K1801
14417E2037k596J2435R253m99j2589K232j7512J7079j8323k143L847J0313M898
14404E8432k5828l219j196k0532j4379L2827M2079k028j5948L1930L98l5370j9203
14391B7963K4711J2218j9418m5984j0075L2988L6961k921Q631N640k379j0701
14379E7634k1902q340P278P983J9888j8532J6451K866j0556m389L420j828J2903
14366F2876l759j1611J2805L0091R705k4456J610q713j4740j7576j0992J0477
14354C5717M1844J7548k2459l0697m0668r205p531J7375O6366M7074k995l7554
14342G4815n5536J2120K9806n041l8617k9449n846K5826L5694J4613k015R683
$$ plain form
14429 64338 91463 113248 90250 54003 43360 16063 5743 1693 -8583 5924 30236 52037
14417 52037 49441 61876 71129 70630 58041 60273 42761 59840 41517 39374 43221 53534 58432
14404 58432 32604 29385 28189 7657 -6722 26105 68184 66156 50208 82138 82536 47166 27963
14391 27963 52674 64892 45474 -510 -10585 22403 59364 56443 65074 70714 68335 57634
14379 57634 35732 27392 34670 42653 62541 44009 60460 63326 52770 48381 51801 49973 62876
14366 62876 59117 47506 60311 90402 100107 75651 77261 68548 53808 36232 25240 35717
14354 35717 77561 95109 72650 41953 1285 -7920 -15451 1924 68290 115364 112369 74815
14342 74815 19279 31399 61205 56164 17547 -11902 -17748 8078 43772 58385 56370 66053
14330F6053k9906j1861L555q809J4507J6556l891j3880m77K0409J0598o025J6543
14317G3372j3423j8138K2237J733k4687j34K2698l514M589j2196L9968L3934k8928
14304I7511n4228k2373Q038k874l40L627L9876j0455O53K7613K5886L0140J6649
14291A59723k0043k2420l1414Q314j4523k1768j5916j2523J4407L736J0482K708
14279F0763n041J2275J5191K2284l5806r501k0552O394K6745J0596k1604j4933
14267D6811J7792j6954j3810K4139J3309J5372K0026j4820k5673j1343j2527j1311
14255C1011R22J3827k237j0167L0583M8878P454k3390J1982Q177l3334k7301J8703
14242G5108R86j1015p36r615j9358j3811L8826K7272r018j7331p278K27M311R630
$$ plain form
14330 66053 36147 24286 27841 19032 33539 50095 46204 32324 31847 52256 62854 56829 73372
14317 73372 59949 41811 64048 65781 41094 40960 63658 60144 64733 52537 92505 126439 97511
14304 97511 43283 20910 28948 26074 25734 29361 69237 58782 59435 87048 112934 143074 159723
14291 159723 139680 117260 85846 94160 79637 57869 41953 29430 43837 47573 58055 60763
14279 60763 55722 67997 83188 105472 69666 60165 39613 46007 72752 83348 61744 46811
14267 46811 64603 47649 33839 57978 71287 86659 106685 91865 66192 54849 42322 31011
14255 31011 31933 45760 43523 33356 63939 112817 120271 96881 108863 117040 83706 56405 75108
14242 75108 76094 65079 64343 54728 35370 21559 60385 87657 78639 61308 54030 54257 58568 68198
14228F8198P242q571O746R71j4870p294J9403J6494J7723P538K4049l0101k3996
14215H3532J3909O513j8432j8218M922K270j837j5163j0969o733L8073N998O424
14202I0289r610P610l5413j4251J7601j2634j6438j0225J7160j556l0400n480
14190c347J2446l7121K0540K7843J6836J1294j3032Q370J9155K6621j8680j1102
14178E9823j3808P252k2645k8731J5267K9434K5851l628n032K3523k2937k0437
14166D3932j6450o476J9728J7995m731J9071J3643L1181K920q540j2625m750J9320
14153A14218K7166J2545m2716m0720k0099q771j800J1419k545K1713O835J4728
14141I1973J2098p156J0067O146j0927q44j3215l2429J464L5825k309l9101k6241
$$ plain form
14228 68198 75440 66869 73615 74586 59716 52422 71825 88319 106042 113580 137629 107528 83532
14215 83532 97441 103954 85522 67304 72226 74496 72659 57496 46527 39794 77867 83865 90289
14202 90289 80679 88289 52876 38625 56226 43592 27154 16929 34089 32533 2133 -3347
14190 -3347 9099 -28022 -7482 20361 37197 48491 35459 43829 62984 89605 70925 59823
14178 59823 46015 53267 30622 1891 17158 46592 72443 68815 63783 87306 64369 43932
14166 43932 27482 21006 40734 58729 53998 73069 86712 117893 120813 112273 99648 94898 114218
14153 114218 141384 153929 111213 70493 50394 41623 39823 51242 48697 70410 77245 91973
14141 91973 104071 96915 106982 113128 102201 101357 88142 55713 57177 93002 90693 51592 25351
14128B5351K9029L2521Q264J510l308j5283j5659K9425J9605R543j0281j1001
14116I9716M77J7001j0228l4958j3046J5502K3567k0717k1646J9893j0125n192
14104F0244O138k271R337p624o332R684j825q061j0751k412R106L6869J5613j1346
14090I6369j3375k1089p87J4664j1729k9161K1710L0945J3601Q31l674k6715j5594
14077E5996J5782j0459J3102J6177J1060N73q05J3111j2695O058O774l143j0431
14064A01100j6759J7235r207k4380q029Q177J6002J889J4757J4009J0523N862
14052A31179j2790l8911j7811K4909p397P390n061N081J1820j8575L431K3029
14040A06294j0266L733k5350j2286P271L672K9920j8447o726J94J2864J9424k4416
$$ plain form
14128 25351 54380 86901 95165 96675 93367 78084 62425 91850 111455 120998 110717 99716
14116 99716 100193 117194 106966 72008 58962 74464 98031 77314 55668 75561 65436 60244
14104 60244 66382 64111 73448 65824 59492 69176 67351 59290 48539 46127 55233 92102 107715 96369
14090 96369 82994 61905 61118 75782 64053 34892 56602 87547 101148 101979 98305 71590 55996
14077 55996 71778 61319 74421 90598 101658 102231 101426 114537 101842 107900 114674 111531 101100
14064 101100 84341 101576 92369 67989 59960 68137 84139 86028 100785 114794 125317 131179
14052 131179 118389 79478 61667 86576 79179 86569 81508 86589 98409 79834 83265 106294
14040 106294 96028 99761 74411 62125 69396 73068 102988 84541 77815 78009 90873 110297 85881
14027H5881o387J6628M827k0418j6222p966J7705K5271P225p330k2074L497L4814
14014A15451K1564j7096k5209j5193j5081n734j4835J3294L5687M3247j4231L679
14002A25543J4719Q315j0491J0791J7345j9041l6508k1112j4457Q785J3225Q769
13990A05883J701p524P94J116j9247j2848K5561J6347J8893k4552r53L2189K4832
13977A62192O611P635N0778R272k1493l1676j7419J87p8j9005j8223O200n21L0816
13963A65276K5778o889J0440n622k2552J2147L2059L0904L351N754j40j8436j9143
13950B12927L868L755L6378N8157J2110K7315L6267N0603L7308J3795J4836K6364
13938E33683J3838J3394J3990K0173O1274N7791O2180N5541P3963O7251Q7801
$$ plain form
14027 85881 79494 96122 100949 80531 64309 56343 74048 99319 106544 99214 77140 80637 115451
14014 115451 137015 119919 94710 79517 64436 58702 43867 57161 92848 136095 121864 125543
14002 125543 140262 148577 138086 148877 166222 147181 110673 89561 75104 83889 97114 105883
13990 105883 107584 100060 100854 101970 82723 69875 95436 111783 130676 106124 105171 137360 162192
13977 162192 168803 176438 227216 236488 214995 183319 165900 166087 166009 147004 128781 134981 134460 165276
13963 165276 191054 184165 194605 188983 166431 178578 210637 241541 244892 250646 250506 232070 212927
13950 212927 216795 220550 256928 315085 327195 354510 390777 441380 478688 492483 507319 533683
13938 533683 547521 560915 574905 595078 656352 714143 776323 831864 905827 973078 1060879
13927A060879R3196O9218N9745O0087J03697J02089R8672Q3341Q5439O6277N4299
13916A936939P0467O9339N2357j5235m2233k2821k3013k5573o3646l3688o6036
13905A836857q2159p0181r6763o6471p0667r6516m8307q9723p2976l8653n5632
13894A048809q0650n6758l0643n5834m1394k418l6364m7169m9980k2498M737j3421
13882F16417l3200j7353N99j9025j4524l4490q474L098j3638o839k4440k1433
13870D26698j8377j3112J6726l571j4322k1880l1249l5322l6274n86J8635j4833
13858B72533j2859n812M043J0061m22K1007k1685k436j6549j1346j9878n554j1460
13845A99643j3382J928N77L732M05J1390J936j3955r552m308j912N461N488j1025
$$ plain form
13927 1060879 1154075 1223293 1283038 1343125 1446822 1548911 1647583 1730924 1816363 1882640 1936939
13916 1936939 2007406 2076745 2129102 2113867 2071634 2048813 2025800 2000227 1936581 1902893 1836857
13905 1836857 1754698 1684517 1587754 1521283 1450616 1354100 1305793 1216070 1143094 1104441 1048809
13894 1048809 968159 911401 880758 824924 783530 781112 744748 697579 647599 625101 629838 616417
13882 616417 583217 565864 566463 547438 532914 498424 489950 493048 479410 472571 448131 426698
13870 426698 408321 395209 411935 408364 394042 372162 340913 305591 269317 268731 287366 272533
13858 272533 259674 253862 257905 267966 267544 288551 266866 264430 247881 236535 216657 211103 199643
13845 199643 186261 188189 188766 192498 192903 204293 206229 192274 182722 178414 176502 181963 187451 176426
13831A76426P489n34l4260j5571k200l96j3002j0085Q336J6579j8848p448L2939
13818A39425J3773j8367q974K3637J4570j419j9671k3453J1709r66j1097j648
13806A17519j4003K915J9420q288J3735K4859j7890l0778r215L331q121k0J8273
13793A11737O566M644k088J2098l1693j6327j5758Q785N1109J2746k5463R5j8282
13780I8169k6135N942m682P10K3259j0142o468R050K5456m207j6632K1922j85
13767A16057J311J1546k3606j6404n970J9822K4911k2248M927m378k3354J6346
13755I8960j9581l994K2681K1485J3258j3464q81L377k3012l3628K176o847P071
13742F7601K6682K3018J2656K5682R492l0537l0840Q015l023n69k8509j4548j4294
$$ plain form
13831 176426 183915 183381 149121 133550 131350 130954 117952 107867 116203 132782 113934 106486 139425
13818 139425 153198 134831 125857 149494 164064 162645 142974 119521 131230 130264 119167 117519
13806 117519 103516 106431 125851 117563 131298 156157 138267 107489 98274 101605 93484 93464 111737
13793 111737 118303 122947 120859 132957 101264 84937 69179 77964 129073 141819 116356 116451 98169
13780 98169 72034 77976 73294 74004 97263 87121 80653 89703 115159 110952 94320 116242 116057
13767 116057 117368 128914 105308 88904 82934 102756 127667 105419 110346 105968 82614 98960
13755 98960 79379 75385 98066 119551 132809 119345 118464 121841 98829 65201 67377 60530 67601
13742 67601 94283 117301 129957 155639 165131 134594 103754 111769 108746 108177 79668 65120 50826
13729E0826k2173J9887L7591K3811J858j2717R446r7l096n285N958J2776l097
13716A15688K594J0650P678j257J9074K0886k5007k9954O507k1683j8528J2126
13704I8774Q130j8999J351K4954K8283J5511j2593j6690p461m778N59K114J753
13691A20908j9814j6994N622J4355J4617J7722K112l765J4531j1436m0935J1120
13679A08043M8266j5348l754R8K30J8211O381m0429j9998K4847J5967P843j1988
13666A38369j6099k418k002O220R551J1333j0609l5891L619K526q593J0102K427
13653A08535J491j271k1141R568J7528J0147j239R18j8457m55j8690J1914K4155
13640A23003R65J5880J729Q01K2911k850r989L80j3732r216j3785j8561O762J7784
$$ plain form
13729 50826 28653 48540 86131 109942 111800 99083 108529 108432 105336 100051 106009 118785 115688
13716 115688 118282 128932 136610 135353 154427 175313 150306 120352 126859 105176 86648 98774
13704 98774 106904 87905 89256 114210 142493 158004 145411 128721 121260 116482 117041 119155 120908
13691 120908 101094 84100 89722 104077 118694 136416 138528 134763 149294 137858 96923 108043
13679 108043 156309 140961 137207 137305 137535 155746 162127 121698 101700 126547 142514 150357 138369
13666 138369 122270 119852 117850 124070 133621 144954 134345 98454 102073 104599 96006 106108 108535
13653 108535 110026 108755 87614 97182 114710 124857 123618 124536 106079 105624 86934 98848 123003
13640 123003 123968 139848 141577 142378 165289 162439 152450 152830 139098 129882 116097 97536 104298 122082
13626A22082j1335j5743L6407j9258J39K7726J5997j3985K4076K2141o920l4302
13614A47025l2177L2128n48l5975r251J9923K5224L0401j1979j3004k6539p507
13602A17721J119k0473K8674Q870j0254k1230J2961K3585j220n067j4969J5595
13590A35312M9033m658j2647p685J045j2585Q47N327J9515P604j0183n908J1173
13577A76190L4382l0901k1646j8143N860J7104j8545k7098j960J3083R843J8219
13565A56388R694k598j1282K665j3980M691J870l0375j9159P998K1167K367J1103
13552A40549J059M651K7114K4341M264k6995j2509J9244J1831p053k9894l110
13540A53492L8391J3281j2547k2105N279j5903J2486Q433k43j4921J2944o916
$$ plain form
13626 122082 110747 95004 131411 112153 112292 140018 156015 142030 166106 188247 181327 147025
13614 147025 114848 146976 146428 110453 101202 121125 146349 176750 164771 151767 125228 117721
13602 117721 118840 98367 127041 135911 125657 104427 117388 140973 139753 134686 119717 135312
13590 135312 184345 179687 167040 159355 160400 147815 148662 153989 173504 181108 170925 165017 176190
13577 176190 210572 179671 158025 139882 145742 162846 144301 117203 115243 128326 138169 156388
13565 156388 166082 163484 152202 154867 140887 145578 147448 117073 97914 105912 127079 129446 140549
13552 140549 141608 146259 173373 197714 201978 174983 162474 181718 193549 186496 156602 153492
13540 153492 191883 205164 192617 170512 175791 159888 172374 180807 180564 165643 178587 171671
13528A71671j3608k6717k997P275J9284J0494k0814j1519K217J624j0673K3106
13516A49343K236P986j7714p277J845L2243K2943Q756L32m1807r02J8533k27J21
13502A76411k2639j0608j0982l0143l51L8513M3922k2884M590m514l723l387j7959
13489A36246J1088K8905l5918j2501J0433R504L531m724J2377K5769j546l4601
13477A48563j1618R476J1565m739J3741K3607R554n084J824M2722m906Q381k3866
13464B19220K4982M8229Q811j2549p808M573K0424J7106L950M2270N9054R256
13452D37518M2508N9893P0492P9719P5634Q7605P9301P4794Q306o592J4928r092
13440A015014l6236n6131m0067j521J0358K0755K7440M4923N2372K7689L3105
$$ plain form
13528 171671 158063 131346 128349 135624 154908 165402 144588 133069 135286 136910 126237 149343
13516 149343 151579 159565 141851 134574 136419 168662 191605 200361 200693 158886 157984 176517 176290 176411
13502 176411 153772 143164 132182 102039 101688 140201 184123 161239 165829 161315 157592 154205 136246
13489 136246 147334 176239 140321 127820 138253 147757 151288 146564 158941 184710 183164 148563
13477 148563 136945 146421 157986 153247 166988 190595 200149 195065 196889 239611 234705 243086 219220
13464 219220 244202 292431 301242 288693 280885 285458 305882 322988 326938 369208 428262 437518
13452 437518 480026 539919 610411 690130 765764 853369 932670 1007464 1015770 1009178 1024106 1015014
13440 1015014 978778 922647 882580 881059 891417 912172 939612 984535 1036907 1064596 1097701
13429A097701P407l871l9454q2238q0350r0428o9040p1550j22655o7803j5848
13418D61871l2140p103j4181L572K5310n7495l8088l0138L3495P522l0911J2973
13406C34687l747P516K0208j5913j8907j2588n925J0992R650Q059Q900j5139J9760
13393C47553j5388k7944O337J4912K4178n065p497k4701l051J4560j2147j8955
13381B92792j1980P691j5902k7028k5583K0923K1873K7829M8839j0802k378L9438
13369C65712J7399M297J3182K1103P2707N6419L1372P8873R5018R2849J21412
13358I70343J10562O0077N1236M8739l1732n8162j7462k9963q0099m5091K4338
13347A002786K0907K1501N7040M2456L3095L5062k4195n3950m3563m4702o8325
$$ plain form
13429 1097701 1105108 1101237 1061783 979545 899195 808767 739727 668177 545522 477719 461871
13418 461871 429731 422628 408447 412019 437329 379834 341746 311608 345103 352625 321714 334687
13406 334687 330940 338456 358664 342751 323844 311256 305331 316323 325973 334032 342932 327793 347553
13393 347553 332165 304221 310558 325470 349648 344583 337086 312385 309334 323894 311747 292792
13381 292792 280812 288503 272601 245573 219990 240913 262786 290615 339454 328652 326274 365712
13369 365712 383111 387408 400590 421693 494400 550819 582191 661064 756082 848931 970343
13358 970343 1080905 1140982 1192218 1240957 1209225 1151063 1133601 1103638 1023539 978448 1002786
13347 1002786 1023693 1045194 1102234 1144690 1177785 1212847 1188652 1134702 1091139 1046437 978112
13336I78112j37666j01910p0127o0200o4895o5336j9164n156j4356k5666k1427
13325C92209J0191p600j1034k2897J7171R927j8187J721m403k0090j3351J622
13313C35279p517j2430N836o661L444j8509j0752N527J4671r284j7681L0194K0526
13300C32643m5709k6209M920J8093o493k3327j8161L633L7795R986j2846k396
13288B71929m331J450O734j614R511k8241n855k505J3080K6008j5681N740K146
13275B78371j0847j8926q200J7511P329J2471j0876k1821q008q730Q03J9906Q748
13262B57731Q485k5368J8244L3632n250k1151j2960q56j3167o937K2747o234M687
13249B53603n603l3505K5977N642k2404j7529J3416K0561J1449r610j8693J5676
$$ plain form
13336 978112 840446 738536 668409 608209 543314 477978 458814 453658 439302 413636 392209
13325 392209 402400 394800 383766 360869 378040 387967 369780 371501 367098 347008 333657 335279
13313 335279 327762 315332 321168 314507 317951 299442 288690 294217 308888 299604 281923 312117 332643
13300 332643 286934 260725 265645 283738 277245 253918 235757 239390 277185 287171 274325 271929
13288 271929 267598 269048 275782 274168 283679 255438 249583 247078 260158 286166 270485 276225 278371
13275 278371 267524 248598 240398 257909 265238 277709 266833 245012 237004 228274 229077 248983 257731
13262 257731 266216 240848 259092 292724 287474 266323 253363 252507 239340 232403 255150 248916 253603
13249 253603 248000 214495 240472 246114 223710 206181 219597 240158 251607 241997 223304 238980
13237B38980j6033L01J2152k027L5744K3417r985j7930k0776J1729J2706K1776
13225B90054k1173k7126r882p698N338J3046L0305K6517j0828j2558O83J3516
13213B90194L828j2861l6703j4761J638J2826p854j139L9144L4301p612j2448
13201B88553J2684L9859n976n390k2558l4155J2359K1622J9586m0588k0482J6886
13189B82400K9409n790J0633L5462r978k7138l0230j0067L524K1020l2104k0388
13177B46753O762j01L878K1066j0978k655K3172M225o916J2618J6676J3552J2456
13164C40508l0911j3645P43r518J9886J7306j7332J8231K5979L4225K8713m496
13152D09689j0922J1544O791L2548K2077J3868m3532l7494l1759l1555k7401j9697
$$ plain form
13237 238980 222947 223248 235400 233373 269117 292534 282549 264619 243843 255572 268278 290054
13225 290054 268881 241755 231873 224175 229513 242559 272864 299381 288553 275995 276678 290194
13213 290194 294022 281161 244458 229697 231335 244161 236307 235168 274312 308613 301001 288553
13201 288553 301237 341096 335120 329730 307172 273017 285376 306998 326584 285996 265514 282400
13189 282400 311809 306019 316652 352114 342136 314998 284768 274701 278225 299245 267141 246753
13177 246753 253515 253414 257292 278358 267380 264725 287897 292122 285206 297824 314500 328052 340508
13164 340508 309597 295952 296695 287177 307063 324369 307037 325268 351247 385472 414185 409689
13152 409689 398767 410311 417102 449650 471727 485595 442063 404569 372810 341255 313854 294157
13140B94157L393K0855J5224K2158J4003j5291m435K266j2050L237k6438J4131
13128C31210J0039K5315M615p061j8942j7564m481j432j3442K3501K8302K5181
13116C85241j040k0365k0855J5968M2012L4400k6160L87K2498j215J4016K4355
13104D69242M7697J8536m302q558m3065l6141q495k6858n746J2540q260j0147
13092C96443j7400j7084l1302j1255Q872J3908o364P347M2672J3098L966m643
13080C98258j6518j1869J6112P424k0287n42J5261L1528k6892r353K2906p688
13068C98340r396R57j8781j4957J5685J9568o481O638K6288R074N636j868K085
13055D32788p324J3253J1982k1285k6117K3251L4052K5076O929k3329m7890p275
$$ plain form
13140 294157 297550 318405 333629 355787 369790 354499 350064 352330 340280 343517 317079 331210
13128 331210 341249 366564 371179 364118 345176 327612 323131 321699 308257 331758 360060 385241
13116 385241 384201 363836 342981 358949 400961 435361 409201 409588 432086 430871 444887 469242
13104 469242 516939 535475 531173 522615 479550 443409 434914 408056 402310 414850 406590 396443
13092 396443 379043 361959 330657 319402 328274 342182 335818 343165 385837 398935 402901 398258
13080 398258 381740 369871 385983 393407 373120 372578 387839 419367 392475 383122 406028 398340
13068 398340 388944 389901 371120 356163 371848 391416 384935 391573 417861 426935 432571 430703 432788
13055 432788 425464 438717 450699 429414 403297 426548 460600 485676 492605 469276 421386 414111
13043D14111J105J4344p680L068J6748o775j8777R045j999p55K0017L2916J2447
13030D87815r281k4153o206j078j390k6776K7889K0898L6537N520m773j0530o203
13017D88269j4038p684k1156K3081J1217J804j5724j2834P858L4194q134K71q051
13004D79073q434J4795J9509l139m186l06l491K8563n802k9319J9942J6530O949
12991E30684O064J4340J0319k441J812l1958j1098K5379J9327q469M40J780K1928
12978E78107N842K4736K7747Q328l592P2359O9067L4953M9525K1588O0203J04120
12966A052983J17499J25025Q1620N7786K5785j1806n2635r3447r0921j20204j36787
12955I54898q2075l3085k8371j2870l1541l1266r507j8061n0952j7833p225q54
$$ plain form
13043 414111 415216 429560 421880 424948 441696 434921 416144 425189 423190 422435 442452 475368 487815
13030 487815 478534 454381 448175 447097 445707 418931 446820 467718 504255 509775 505002 494472 488269
13017 488269 474231 466547 445391 468472 479689 481493 465769 452935 460793 494987 486853 487124 479073
13004 479073 470639 485434 504943 501804 497618 497312 493821 522384 516582 487263 507205 523735 530684
12991 530684 536748 551088 561407 558966 560778 528820 517722 543101 562428 553959 554399 556179 578107
12978 578107 583949 608685 636432 644760 641168 713527 782594 817547 867072 888660 948863 1052983
12966 1052983 1170482 1295507 1377127 1434913 1460698 1448892 1396257 1302810 1211889 1091685 954898
12955 954898 872823 839738 811367 798497 766956 735690 726183 708122 657170 639337 632112 631258
12943F31258R676K571Q020J9318o248k4800j5361p986K6677J0989n565K8656Q963
12930F86168l521J0494P747j9712j2704K3709l15j1618O482j1382k999J9203k699
12917F88853j5875L874M371m522K5372K0798O872k7806O819n7l8767j9229k440
12904F48263j0606J2647J3016q011R61K9401R429j4330J1470K4305J2825j8393
12892G10977L035J3733J4019N699L385K1339m958J0381L0881m634L119Q681M3058
12879H58715J2554K3257M3533r982p969N0972P0898N1814Q7155J31054J54958
12868A466959J71311K18825K44009K36853K23229J67891R3627j3323j19223k03549
12858B486609k05851k16817k25010j92534j48028q5361m5485m2029m3820m8317
$$ plain form
12943 631258 640934 643505 651525 670843 664595 639795 624434 616448 643125 654114 648549 677205 686168
12930 686168 682647 693141 700888 681176 668472 692181 691866 680248 686730 675348 672349 691552 688853
12917 688853 672978 676852 681223 676701 702073 722871 729743 701937 708756 708699 669932 650703 648263
12904 648263 637657 650304 663320 655309 656270 685671 695100 680770 692240 716545 729370 710977
12892 710977 714012 727745 741764 747463 750848 772187 767229 777610 808491 803857 806976 815657 858715
12879 858715 871269 894526 938059 928077 920108 971080 1041978 1093792 1180947 1312001 1466959
12868 1466959 1638270 1857095 2101104 2337957 2561186 2729077 2822704 2809381 2690158 2486609
12858 2486609 2280758 2063941 1838931 1646397 1498369 1413008 1367523 1325494 1281674 1233357
12848A233357K4370k615J4450K604J3150k209K173J4791J6797n485J2806K6438
12836A350627L7887j178R74K7111J3484j4167k2242Q612K1750k6305m5057l6197
12824A315299l2328j0545j4203k8495l7318J3638J8843j047k2122m5626k0268
12813A135828N513L3663L7943J7241J5465J3934M6616M7548J9485M3823N3785
12802A470844K6745J955N848j2010j3727j25P657l553j2372j3743M7904P5391
12790A580814J21807J41372J64558K03680K18197K40205K18628P9173r981q3010
12780B875443j54110k26064k77736k59485k24871j91426j32795j13388p6209n6652
12770A162707m0068J1275j1590J7424L341l778k603j868n066k7252l1052j8784
$$ plain form
12848 1233357 1257727 1255112 1269562 1272166 1285316 1283107 1285280 1300071 1316868 1311383 1324189 1350627
12836 1350627 1388514 1387336 1388310 1415421 1428905 1414738 1392496 1401108 1422858 1396553 1351496 1315299
12824 1315299 1282971 1272426 1258223 1229728 1192410 1206048 1224891 1223844 1201722 1156096 1135828
12813 1135828 1141341 1175004 1212947 1230188 1245653 1259587 1306203 1353751 1373236 1417059 1470844
12802 1470844 1497589 1499544 1505392 1493382 1479655 1479530 1487187 1483634 1471262 1457519 1505423 1580814
12790 1580814 1702621 1843993 2008551 2212231 2430428 2670633 2889261 2968434 2958453 2875443
12780 2875443 2721333 2495269 2217533 1958048 1733177 1541751 1408956 1295568 1219359 1162707
12770 1162707 1122639 1133914 1122324 1139748 1143089 1139311 1136708 1134840 1129774 1102522 1071470 1052686
12758A052686n954k0230l0351k4253r104J4096J2421m701L24n161k8631K696k2137
12745I31701l1236J4069K0770J5263k457l2432l9751N031R729j542K8434L8772
12733I56351M689k4824K4850M007k2327M2517L2542Q789J2323J4320j1054l562
12721A038621K1744K4284J2235l589K0615J2258k7120j0063j1444l722q070Q723
12709A074472O607K1552N75P605K3290O871M965r945M552K5147l375n5906r785
12696A096625Q197m560k901J8351j2473J0874N108j0231K4884K1494J0438J6860
12684A182666K1103K6480N492J4981K0892J924L5514N8279Q5391Q9401R1850N5540
12672A689513N1676Q2124O2576L2726M7804K9385k6473m0481j5005l9780j884
$$ plain form
12758 1052686 1046732 1026502 996151 971898 962794 976890 989311 984610 984934 979773 951142 953838 931701
12745 931701 900465 914534 935304 950567 948110 915678 875927 880958 890687 889145 917579 956351
12733 956351 961040 936216 961066 965073 942746 985263 1017805 1026594 1038917 1053237 1042183 1038621
12721 1038621 1060365 1084649 1096884 1093295 1113910 1126168 1099048 1088985 1077541 1073819 1065749 1074472
12709 1074472 1081079 1102631 1103206 1110811 1134101 1140972 1145937 1135992 1140544 1165691 1162316 1106410 1096625
12696 1096625 1104822 1100262 1097361 1115712 1103239 1114113 1119221 1108990 1133874 1155368 1165806 1182666
12684 1182666 1203769 1230249 1235741 1250722 1271614 1273538 1309052 1367331 1452722 1542123 1633973 1689513
12672 1689513 1741189 1823313 1885889 1918615 1966419 1995804 1969331 1928850 1913845 1874065 1872181
12661A872181j5936k6427j461J5264J4631M0038K2558L1755N6529L6746L8695
12650B084573N0428L8485L4819K6357J143J4904M1383M1830L6783N6117K3030
12639B449852J956K2196K2165K2974n092j2267K5932R092j68J7619K5066j1285
12627B568040l6242r117L9497M4327L2243j784K0549K5273L7531O3345J59683
12616B943345J53159J94483J95507K10124J93030J98934J49708R6695N4760j5397
12606D374348o8769j13728j19985q5731k2364K0858L3758Q3659J20357J09172
12596D331575J12243P1875M5115J194L0278j691o111N2171N7248O6315Q6990J35223
12584D982425J63975J60204J54045J66277J94532K13231K15280J98195K70525
$$ plain form
12661 1872181 1856245 1829818 1828357 1843621 1858252 1898290 1920848 1952603 2009132 2045878 2084573
12650 2084573 2135001 2173486 2208305 2234662 2235805 2250709 2292092 2333922 2370705 2426822 2449852
12639 2449852 2451808 2474004 2496169 2519143 2514051 2501784 2527716 2536808 2536640 2554259 2579325 2568040
12627 2568040 2531798 2522681 2562178 2606505 2638748 2636964 2657513 2682786 2720317 2783662 2943345
12616 2943345 3096504 3290987 3486494 3696618 3889648 4088582 4238290 4334985 4389745 4374348
12606 4374348 4305579 4191851 4071866 3986135 3963771 3984629 4018387 4102046 4222403 4331575
12596 4331575 4443818 4515693 4560808 4562002 4592280 4590589 4584478 4636649 4693897 4760212 4847202 4982425
12584 4982425 5146400 5306604 5460649 5626926 5821458 6034689 6249969 6448164 6718689
12575F718689K91998K62193L05890L39864L62176M06284M45604N72510N77671
12566A0282879O74362P86636Q96969J047886J238585J459319J668863J881043
12558A9936542K118325K346261K622827L030829L562875M443361N691676P490808
12550E1243504R912878J2977314J6506114J9832485K1927778K1955001J9424702
12543A73779776J4050220N882374l663586j2443011j9231759k3033860k3174543
12536A12165611k0414669j6337967j2438131r172872o719944m900706l672788
12529C8508534k835517k286669j917904j704797j628450j532899j403661j264353
12521B3934284j133517r53440q18399o73231n21234m29218l48013k83341j85840
$$ plain form
12575 6718689 7010687 7272880 7578770 7918634 8280810 8687094 9132698 9705208 10282879
12566 10282879 10957241 11743877 12640846 13688732 14927317 16386636 18055499 19936542
12558 19936542 22054867 24401128 27023955 30054784 33617659 38061020 43752696 51243504
12550 51243504 61156382 74133696 90639810 110472295 132400073 154355074 173779776
12543 173779776 187829996 193712370 190048784 177605773 158374014 135340154 112165611
12536 112165611 91750942 75412975 62974844 53801972 47082028 42181322 38508534
12529 38508534 35673017 33386348 31468444 29763647 28135197 26602298 25198637 23934284
12521 23934284 22800767 21847327 21028928 20355697 19834463 19405245 19057232 18773891 18588051
12512A8588051j56810j67457j50218r8661j04440r9298j84695k31151l42553m35204
12502A6617564n19558n98412n92955n71954n49558n08118n00952m68597m12729
12493A1894731l69629l75194l72539l49915l03732k58258k03502k10176k00310
12484I251476j92374j73633j13741j15951j00850j09327q9220n6937o1895l7624
12474H199924m5446l0299j9206J9809L4011J5373K0766N8114K7435l5018q9455
12463H156008j12699j28959j35095j17228l4104M967J5822R5627Q5961J22824
12453G953124J94291K09322K27648K53952K93331K94226K69116K42469K43544
12444A0181023J95418J75331K17705J94724J67137K12590L35751M15930M65099
$$ plain form
12512 18588051 18431241 18263784 18113566 18014905 17910465 17811167 17626472 17395321 17052768 16617564
12502 16617564 16098006 15499594 14906639 14334685 13785127 13277009 12776057 12307460 11894731
12493 11894731 11525102 11149908 10777369 10427454 10123722 9865464 9661962 9451786 9251476
12484 9251476 9059102 8885469 8771728 8655777 8554927 8445600 8356380 8299443 8237548 8199924
12474 8199924 8154478 8124179 8104973 8124782 8158793 8174166 8194932 8253046 8280481 8245463 8156008
12463 8156008 8043309 7914350 7779255 7662027 7627923 7632890 7648712 7744339 7830300 7953124
12453 7953124 8147415 8356737 8584385 8838337 9131668 9425894 9695010 9937479 10181023
12444 10181023 10376441 10551772 10769477 10964201 11131338 11343928 11679679 12095609 12560708
12435A2560708N12056N98279O90633Q28553R74638J079423J247763J465975J719764
12426B1677792J993198K344949K777901L319544L951916M674903N454033O186492
12418E2380728O836894P119606O901773O058919M518240K453017J95833k066399
12410H4398611l915130n002349n222290m799508l986604l004438j992119j030617
12402E5445556j59362O28064J351742K001462K561598L077616L448103L810619
12394G2165398M151804M450963M672933M799808M822845M692207M345107L808161
12386A07909226L066602K125269J074960j5836j092155k108252k922319l597847
12378A04439648l992772m202506m289149m230973m035787l815805l486289l121292
$$ plain form
12435 12560708 13072764 13671043 14361676 15190229 16164867 17244290 18492053 19958028 21677792
12426 21677792 23670990 26015939 28793840 32113384 36065300 40740203 46194236 52380728
12418 52380728 59217622 66337228 73239001 79297920 83816160 86269177 86465010 84398611
12410 84398611 80483481 75481132 70258842 65459334 61472730 58468292 56476173 55445556
12402 55445556 55286194 55914258 57266000 59267462 61829060 64906676 68354779 72165398
12394 72165398 76317202 80768165 85441098 90240906 95063751 99755958 104101065 107909226
12386 107909226 110975828 113101097 114176057 114160221 113068066 110959814 108037495 104439648
12378 104439648 100446876 96244370 91955221 87724248 83688461 79872656 76386367 73265075
12370G3265075k755165k335722j877383j404374q60847k27472M44923J176009
12362F5425044K013641K808860L610519M250645M535146M383952L737850K490708
12354I3256365Q23628j112167l083618m757570n941132o406097o263485n766936
12346F0748988m957511m178590l472861k912183k544973k440499k416454k383983
12338C5441934k405191k341765k119742j786484j505253j277957j129355r67437
12330B1908750q38730p53425p17646o55713n71067n20543m86183m60648m16725
12321A6488070l94720m07900l84630m08068l97390m12328m21799m31024l97554
12312A2832657l83192l66448l63318l82923l69690l35054l07223l04565k51782
$$ plain form
12370 73265075 70509910 68174188 66296805 64892431 64031584 63804112 64249035 65425044
12362 65425044 67438685 70247545 73858064 78108709 82643855 87027807 90765657 93256365
12354 93256365 94079993 92967826 89884208 85126638 79185506 72779409 66515924 60748988
12346 60748988 55791477 51612887 48140026 45227843 42682870 40242371 37825917 35441934
12338 35441934 33036743 30694978 28575236 26788752 25283499 24005542 22876187 21908750
12330 21908750 21070020 20316595 19598949 18943236 18372169 17851626 17365443 16904795 16488070
12321 16488070 16093350 15685450 15300820 14892752 14495362 14083034 13661235 13230211 12832657
12312 12832657 12449465 12083017 11719699 11336776 10967086 10632032 10324809 10020244 9768462
12303I768462k07384j68539j14006o7739l6627j9317j2070k2406n8144r4601j82801
12292H784828k66558l21579l97906l74755l80111l78009l31874k63261k27352
12283E843423j75540j55276j44201j40448j02539p7151j00840j15125j12694j19457
12273D600152j32843j51287r1843p9814q4477q3733m0091m6083n6245j6519l9940
12262C777277o2704l6914n449j0670j1372K4274l4114n9474m9666j029o491l7090
12250C486578j4767N77r786J7773J6245K9755L3162p357J9911J9056J9460J4354
12238C624961N2528P3534P0108J04092R9318P3601P7877P9701J13899J34271J34298
12227D638188J21055J40194J68015K06498K54824K61906L03904L77352M51418
$$ plain form
12303 9768462 9561078 9392539 9278533 9210794 9174167 9154850 9142780 9120374 9062230 8967629 8784828
12292 8784828 8518270 8196691 7798785 7424030 7043919 6665910 6334036 6070775 5843423
12283 5843423 5667883 5512607 5368406 5227958 5125419 5048268 4947428 4832303 4719609 4600152
12273 4600152 4467309 4316022 4224179 4144365 4059888 3976155 3936064 3889981 3833736 3817217 3777277
12262 3777277 3714573 3677659 3672210 3661540 3650168 3674442 3640328 3580854 3531188 3530159 3523668 3486578
12250 3486578 3471811 3472388 3462602 3480375 3496620 3526375 3559537 3552180 3572091 3591147 3610607 3624961
12238 3624961 3677489 3751023 3821131 3925223 4024541 4098142 4176019 4255720 4369619 4503890 4638188
12227 4638188 4759243 4899437 5067452 5273950 5528774 5790680 6094584 6471936 6923354
12218F923354N34394O05329P22258Q67201J018242J234484J448145J685724J878568
12209A6917699K022711K164970K326940K544576L004740L808239N135846P274888
12201D5200609J0405854J4524239J9375869K4165669K7797645K8788383K5622634
12194A95880902J7875322P023415n426938j8026959k7799278l2121929l0716110
12187A06688425k5011181j7858891j1949029p958892n365508l654139k609558
12180C2281227j944523j606836j481416j473132j539428j530447j442417j250639
12172B0012389j026525q08010o26265m96399l90025k85597k41373k25406j58160
12163A5754629j00983j46112j22308q7596p2102j35908k49507l44374m12974n22519
$$ plain form
12218 6923354 7457748 8063077 8785335 9652536 10670778 11905262 13353407 15039131 16917699
12209 16917699 18940410 21105380 23432320 25976896 28981636 32789875 37925721 45200609
12201 45200609 55606463 70130702 89506571 113672240 141469885 170258268 195880902
12194 195880902 213756224 220779639 215352701 197325742 169526464 137404535 106688425
12187 106688425 81677244 63818353 51869324 43910432 38544924 34890785 32281227
12180 32281227 30336704 28729868 27248452 25775320 24235892 22705445 21263028 20012389
12172 20012389 18985864 18177854 17551589 17055190 16665165 16379568 16138195 15912789 15754629
12163 15754629 15653646 15507534 15385226 15297630 15225528 15089620 14840113 14495739 14082765 13560246
12153A3560246o37378p01972o96946o61635o49502n47685m49614l97821l24626
12144H493067k97425k97445k35565k34105k73795k99661k85105k77733l11511
12135E980722l10662k85611k36295k04002j94695j78958j74914j55383j07245
12126D132957p8382r6957l9744j3490m8700j7167K760K5991K8116j4667m8299
12115C832418j04550j42064j51430j61316j92005j75168j61768j64007j09639
12106B470471j14272j01073p1547p5004r7012j09257j01736o4882n0203n1397
12096A634088m2816j7656k9814n5442l7206l7642r185j9213k1877k7455m4756
12085A291026m6446m8732n1737q0343p9639l6261l7758j0831k3449l4935l5549
$$ plain form
12153 13560246 12922868 12220896 11523950 10862315 10212813 9665128 9215514 8817693 8493067
12144 8493067 8195642 7898197 7662632 7428527 7154732 6855071 6569966 6292233 5980722
12135 5980722 5670060 5384449 5148154 4944152 4749457 4570499 4395585 4240202 4132957
12126 4132957 4054575 3957618 3917874 3904384 3855684 3838517 3841277 3867268 3895384 3880717 3832418
12115 3832418 3727868 3585804 3434374 3273058 3081053 2905885 2744117 2580110 2470471
12106 2470471 2356199 2255126 2183579 2108575 2011563 1902306 1800570 1735688 1685485 1634088
12096 1634088 1591272 1573616 1543802 1488360 1451154 1413512 1404327 1385114 1363237 1335782 1291026
12085 1291026 1244580 1195848 1144111 1063768 984129 947868 910110 899279 875830 840895 805346
12074H05346j7568j5570k5645k3870k4359k0189l7854l5998m8743l1210k2311
12063E02029o904k102l5092k6273l4432k8767l5913l9907J7900K5037j7774j5029
12051C02773j1373k680J619p396N67K5961K5894J2332p822l4966J8598P628J957
12038C33092J45r949j3192l6317p6520l433J8672K5563J3469p515p950J2149m1636
12025B06578O18J1811K1779K2551j7856j2227L7266R444M2650N3889O3160Q8752
12013E28415J25587J17876J18524Q6345Q3573M5372J5514l2350o7948p6121j31388
12002H13399j39937q3442p4087p2532n3119k4081j2849k5652k4581k1325M25R697
11990B91916K9914q452p650l744K984K41l1138J5886J0093J8841J0956n77k8313
$$ plain form
12074 805346 787778 772208 746563 722693 698334 678145 640291 604293 555550 524340 502029
12063 502029 495125 493023 457931 431658 397226 368459 332546 292639 310539 335576 317802 302773
12051 302773 291400 288720 290339 282943 283510 309471 335365 347697 339875 304909 323507 331135 333092
12038 333092 333237 323288 310096 273779 197259 193826 212498 238061 251530 244015 236065 248214 206578
12025 206578 207196 219007 240786 263337 245481 233254 270520 279964 322614 376503 439663 528415
12013 528415 654002 771878 890402 976747 1060320 1105692 1121206 1088856 1020908 944787 813399
12002 813399 673462 590020 515933 443401 390282 366201 353352 327700 303119 281794 282219 291916
11990 291916 321830 313378 305728 301984 304968 305209 274071 289957 300050 318891 329847 329270 300957
11977C00957j0024J0254J2024k8232L129J8902J4858K342R368J0592K7247O2087
11965D33504K9778K5829K6497J4668L4742M6449P4322M4870M0682N5805P4199
11954I01345O8549L9931O8095R6987Q3342O4270N5023m445j5739o7437q5923q9878
11942A114120q7793p4916n9425r1842o6500l6461j1405Q495N8911L6652L5210
11931H25046R716P355N7677M8576N4882O8527J04582N8776P0582O3235J5353j109
11919A383198k1077m2237q0168j15912j43559j47107r2835p9288l6281n1136j1903
11908E61695k0176k3544K846L935J9304L815o69L569L1177k139j9668P61R28o833
11894E55001l6448m4173m0266J681k5694m2891m3695r745m674j7486j5799j5705
$$ plain form
11977 300957 290933 301187 313211 284979 288108 307010 321868 324210 333578 344170 371417 433504
11965 433504 463282 489111 515608 530276 565018 611467 685789 730659 771341 827146 901345
11954 901345 969894 1009825 1077920 1174907 1258249 1322519 1377542 1373097 1357358 1289921 1203998 1114120
11942 1114120 1026327 951411 891986 800144 733644 697183 685778 694273 753184 789836 825046
11931 825046 834762 842117 899794 948370 1003252 1071779 1176361 1235137 1305719 1368954 1384307 1383198
11919 1383198 1362121 1319884 1239716 1123804 980245 833138 740303 661015 624734 573598 561695
11908 561695 541519 517975 520821 524756 544060 547875 547206 550775 581952 579813 560145 560906 561834 555001
11894 555001 518553 474380 434114 435795 410101 367210 323515 313770 309096 291610 275811 260106
11882B60106J0114k7002k4035J4052r8q406j5258L073K4278N702K0894L0604J5835
11869C09859N6604N0312M4908O6102M9272R8492P8628P2557O0274N9116K9262
11858I75386m4309n5476p5012p3265j03831j11443j14669j07225n3769k1568l192
11847B11627j2334j9573o123J709o301j590j7018j3599L382j0395l514l5653r123
11834H1495o657J1244J0083K985j9081k9234p459Q582J0603j5002j0137J0395
11822D7817K6802j3802o117l845Q867K1011r622j4546o027j5041m084J3195K8704
11809G3312R178k736k2635j2398j8482k589L6984r755m5234R36K3130J5466K4396
11796F9573L018k1797K4410K3073J0579K4293L7255k68J6735Q088j9181q264J2765
$$ plain form
11882 260106 270220 243218 219183 233235 233137 224731 209473 212546 236824 242526 263420 294024 309859
11869 309859 366463 416775 461683 527785 577057 675549 754177 826734 887008 946124 975386
11858 975386 931077 875601 800589 727324 623493 512050 397381 290156 236387 214819 211627
11847 211627 199293 179720 173597 175306 169005 167415 150397 136798 140180 129785 126271 90618 81495
11834 81495 74838 86082 96165 99150 80069 50835 43376 51958 62561 47559 37422 47817
11822 47817 74619 60817 54700 50855 59722 80733 71111 56565 50538 35497 31413 44608 73312
11809 73312 82490 79754 57119 44721 26239 23650 60634 50879 5645 6581 29711 45177 69573
11796 69573 72591 50794 75204 98277 108856 133149 170404 170136 186871 194959 175778 167514 180279
11783A80279K2804M9114M4611L5918O9435N8446J06381J04931J06463J49555J11766
11772A039703O8753M7883K2693o7803j23805j17607j24622j10176p2480m7961
11762E14578N326J2768N8484N6165O6501J15615J55422K08888K34694K24306K07435
11751A860182J76530J09505j4784j02110k03061k26845k56348k38517k12678j36190
11741G55684r8269j06682o4128l7267m0771m2551n5940l1013L2217Q933k2754
11730B97459l3203r574m172J7721k2017k5295J0463Q690p062k1646l3911l31J9798
11717A96920m388j4322J5002n556L310N845r35O5N408j7413j0245l4942j2659
11704A26090L0787j9045k2415l602n468n518q071o663J6688K0183O067L418k523
$$ plain form
11783 180279 203083 252197 296808 332726 402161 460607 566988 671919 778382 927937 1039703
11772 1039703 1108456 1156339 1179032 1111229 987424 869817 745195 635019 562539 514578
11762 514578 519904 532672 591156 647321 713822 829437 984859 1193747 1428441 1652747 1860182
11751 1860182 2036712 2146217 2131433 2029323 1826262 1599417 1343069 1104552 891874 755684
11741 755684 657415 550733 486605 449338 408567 366016 310076 279063 311280 320213 297459
11730 297459 264256 254682 250510 268231 246214 220919 231382 240072 233010 211364 177453 177122 196920
11717 196920 192532 178210 193212 187656 190966 196811 195876 195941 201349 183936 173691 138749 126090
11704 126090 156877 137832 115417 111815 106347 100829 92758 86095 102783 122966 129033 132451 129928
11691A29928K187L0482M3465J6580j2020j9490J3568L3374K4126K5909K5929O8393
11679C82431P7221J14648J29645J97555K01197J99632J88219J67947R1880M2985
11669A793360m9480j34324k17249k15246j92195k11089j72143j02464m4930m4816
11659D09424q2969o9520o6882k3343O272n033k3821k1390L7899K0175k5354k0732
11647A34726m334j3891q707L0785O685j8710J3579M486m319k9009R054L3708K3238
11634A77291l4875k6445p546K8775j648m694k8057K1m052k4485j2521J6725N350
11621H3839l893j0399L7201J4125k0584k9315J5361j5803o551J0179r069J1363
11609G6454J5283r801j8372j6375M264r638J722J3412O744j2652l4424R186M0774
$$ plain form
11691 129928 132115 162597 206062 222642 210622 191132 204700 238074 262200 288109 314038 382431
11679 382431 459652 574300 703945 901500 1102697 1302329 1490548 1658495 1750375 1793360
11669 1793360 1743880 1609556 1392307 1177061 984866 773777 601634 499170 454240 409424
11659 409424 326455 256935 190053 166710 172982 167949 144128 122738 160637 180812 155458 134726
11647 134726 130392 116501 107794 138579 145264 126554 140133 144619 140300 111291 120345 154053 177291
11634 177291 142416 115971 108425 137200 135552 130858 102801 102822 98770 74285 61764 78489 83839
11621 83839 79946 69547 106748 120873 100289 70974 86335 70532 63981 74160 65091 76454
11609 76454 91737 81936 63564 47189 51453 41815 43537 56949 63693 51041 16617 25803 66577
11596F6577L308k7347k8088K5744J1516j3718R368J590j1296k679j1290k3349
11584C36k1311m051L9657K919J2365L3626J289j2564k1159k4839R942L9650J0299
11571F6159j587R088J333r54j8198J2056K8458J606l0949L860r790J1494M0116
11558A12692R570j8767k4413M7M512l2814k1097m98J2631K1857J9814J5184J3836
11545A12554j1310l8811j3380L2954M2428K9164m461Q502K5553j3194m3557l7615
11533H8827n9457j0817K4478M9479J2351m351j3762j5564q322j9160l2708Q636
11521A9630K2542j728k5642j075L3101J4186j3737r677j455l97r560L1635K9514
11508H7337J1429l053j2826P260k3604k199R778p41j334J9867K006k6019j6401
$$ plain form
11596 66577 69885 42538 14450 40194 51710 37992 47360 48950 37654 34975 23685 336
11584 336 -20975 -25026 14631 17550 29915 63541 64830 52266 31107 6268 16210 55860 66159
11571 66159 64572 73660 74993 74039 55841 67897 96355 97961 67012 70872 61082 72576 112692
11558 112692 122262 103495 79082 79129 83641 50827 29730 29232 41863 63720 83534 98718 112554
11545 112554 101244 62433 49053 82007 124435 153599 149138 157640 183193 169999 126442 88827
11533 88827 29370 18553 43031 92510 104861 100510 86748 71184 62862 43702 10994 19630
11521 19630 42172 40444 14802 13727 46828 61014 47277 37600 36145 35748 26188 57823 87337
11508 87337 98766 95713 82887 90147 66543 64344 74122 73381 72047 91914 93920 67901 51500
11495E1500N939k8070q579P390J0355J3563k58M3211R724K560j2822j7727q625
11482F8161O36j9006J5758K1875j9188P160l987l178J7215K0884j620k5315r503
11469F9892R381J1710J2277k6952J9312J9540j1981m0719k8797n021J8281j771
11457D5152p926n36k405p908K0619K1047J4056j1672J2727L646j6280K21K7281
11444I8022M312p795R995r421l344J4171L3231R440k4204l2403L850M2555j8274
11431A20135j4634j7720j7125k1748J5965K4684q267Q50l906j7620J0995L1181
11419A02790J976r852M549j4579L1339J2251J890j1666l4318K885m51j7414J1417
11406H0817L4917J3116l1272l6954m217o811K2172J9261L011M542J2597M691J7413
$$ plain form
11495 51500 57439 29369 20790 28180 38535 52098 51840 95051 104775 107335 94513 76786 68161
11482 68161 68797 49791 65549 87424 68236 75396 71409 68231 85446 106330 104710 79395 69892
11469 69892 79273 90983 103260 76308 95620 115160 103179 62460 33663 28642 46923 45152
11457 45152 37226 36690 34285 26377 46996 68043 82099 70427 83154 86800 70520 70741 98022
11444 98022 102334 94539 104534 95113 91769 105940 139171 148611 124407 92004 95854 138409 120135
11431 120135 105501 87781 70656 48908 64873 89557 81290 82140 78234 60614 71609 102790
11419 102790 104766 94914 99463 84884 116223 128474 130364 118698 84380 87265 86814 69400 80817
11406 80817 115734 128850 97578 60624 56407 49596 71768 91029 94040 98582 111179 115870 133283
11393A33283n291j6487j3489r003r731k4597k4697K8415J1788K0931L1778J4729
11381A37629j2841Q255K553L365j7928k0821q03L0604l012J1018R063j2470o92
11368A33920o491P881j3021R45j069o968J6084K4351J4156O4787O7402K9442K7213
11355C58632M1684J3881m706j3551n9042p3908n1973j5912j0782j3579k8839j1738
11343A30167L8369J7701k9377J8621K7794J3763J9165K5084J1448m082k3222K1853
11331B67284L0286k789l257P769L7488P6688K5006M4410N753k1015n5419o9168
11319C43036l3217l2762l3953j1221k7363j3483j2395n583l2008J5147K5654L7824
11307B19676J7156K7586K0396J5489m938m455k8006l9002j1314N614L868n3296
$$ plain form
11393 133283 127992 111505 98016 89013 79282 54685 29988 58403 70191 91122 122900 137629
11381 137629 124788 133043 135596 138961 121033 100212 99409 130013 127001 138019 147082 134612 133920
11368 133920 127429 135310 122289 123234 122165 115197 131281 155632 169788 234575 301977 331419 358632
11355 358632 400316 414197 409491 395940 336898 262990 211017 195105 184323 170744 141905 130167
11343 130167 168536 186237 156860 175481 203275 217038 236203 261287 272735 268653 245431 267284
11331 267284 297570 294781 291524 299293 336781 413469 438475 482885 488638 467623 412204 343036
11319 343036 309819 277057 243104 231883 204520 191037 178642 173059 141051 156198 181852 219676
11307 219676 236832 264418 284814 300303 295365 290910 262904 223902 212588 218202 222070 168774
11295A68774J1774k970j0401q230L0042L3302J224j1491J8568r567l4612j2583
11283A73830N114J1147J8432Q103q484o974J7201J5295j5299j7538R445k6669
11271A83603J7937j3465p980N148j613j9889p131J6941J2611J9122l674q641N449
11258A98418o028j7734j8381k2153K1485L9471K2838N762j465j5452l421K170
11246B05510m323J5282j5378j0955J3469K42Q722p948k2263q340L576j2767J7897
11233A82724L0218K0181P684L980J1489R760j6931j9511L874J701p057q296k6986
11220A92830k1907J7391J4109R77j2407K1833J8048M1970j0770j1460l5135k6661
11208A88818K0999K4373J9772P242k6916p507l3825K165K2691K2079J5293O11
$$ plain form
11295 168774 180548 177578 167177 158947 188989 222291 223515 212024 230592 221025 186413 173830
11283 173830 178944 190091 208523 216626 208142 201168 218369 233664 218365 200827 210272 183603
11271 183603 201540 188075 180095 185243 183630 163741 156610 173551 186162 205284 201610 192969 198418
11258 198418 192390 174656 156275 134122 155607 195078 217916 223678 222213 206761 203340 205510
11246 205510 201187 216469 201091 190136 203605 203847 212569 204621 182358 174018 177594 164827 182724
11233 182724 212942 233123 240807 244787 256276 266036 249105 229594 233468 235169 228112 219816 192830
11220 192830 170923 188314 202423 203400 190993 212826 230874 272844 262074 250614 215479 188818
11208 188818 209817 234190 253962 261204 234288 226781 192956 195121 217812 239891 255184 255795
11196B55795j5488k2040p050J4218J5497o56J3416O24l347L960j3176J138J8860
11183B61751l4767j3243P581K7121N4Q233J6171K405J1472P599J1234L331j0590
11170B98352o670o989J3974K8824k475l4273K548K8191J0436k069j298K2393J9365
11157C70309n7579m7563K781J0789P78l00L799k553o698P711l686L6324K1844
11144C35956J6005j4480k1637q54O170p38K2407j6481n0435l093L7988K077j0163
11131C02722J4718K4231p312l4661j2280O710K3219l905N047k0698j5883J3710
11119B95618M3741L2309P984J8093K0880J5271J0760K2174q29j2595j8747j7082
11107D17577k4258J182l0453k1843o439N739O115J2021K0791L0508j5771j3025
$$ plain form
11196 255795 240307 218267 211217 225435 240932 240276 253692 254316 250969 254929 241753 242891 261751
11183 261751 226984 213741 221322 248443 248497 256730 272901 275306 286778 294377 305611 308942 298352
11170 298352 291682 284693 298667 327491 325016 290743 293291 321482 331918 329849 328551 350944 370309
11157 370309 312730 265167 267948 278737 279515 279215 283014 280461 273763 281474 277788 314112 335956
11144 335956 351961 337481 315844 314990 321160 320422 342829 326348 275913 272820 310808 312885 302722
11131 302722 317440 341671 334359 299698 287418 294128 317347 313442 318489 297791 281908 295618
11119 295618 339359 371668 379652 397745 418625 433896 444656 466830 466001 453406 434659 417577
11107 417577 393319 394501 364048 342205 335766 341505 347620 359641 380432 410940 395169 382144
11095C82144L552j1767L6333J5531j219K2414J7283k3130k0384l69N228l9505
11083C86111k9166K0570j9643m537m095k7382M917K3586M697O825J0449O058J0103
11070C88493J2436L1425K1655m8478j5387L6628j0204j7423j402K148j2239J037
11058C88689j5055j2682j1604K9255J5746O52p086J332M2085j682M141R963L208
11045D46962K2890K640o145Q933R993J3324N15M7681Q4713M3713M8138J5916o718
11032G32555l0980m0296l8464l4280o871m8866k3772R281o7l641m1482j3523K1317
11019D80911j3543M753j0041K0293M1933K0397J9675M912K199J2072M4614M0622
11007F68797L1476M1746P5562L6195p926k6156k1151n3399m8788l8673l6386m2508
$$ plain form
11095 382144 385696 373929 410262 425793 424574 446988 464271 441141 420757 420388 425616 386111
11083 386111 356945 377515 357872 353335 349240 321858 326775 350361 355058 361883 372332 378390 388493
11070 388493 400929 432354 454009 405531 390144 426772 416568 399145 397743 399891 387652 388689
11058 388689 373634 360952 349348 378603 394349 395001 387915 389247 431332 429650 433791 443754 446962
11045 446962 469852 472492 466347 475280 485273 498597 499112 546793 631506 675219 723357 739273 732555
11032 732555 701575 661279 622815 588535 581664 532798 509026 518307 518240 514599 473117 459594 480911
11019 480911 467368 472121 462080 482373 524306 544703 564378 569290 571489 583561 628175 668797
11007 668797 700273 742019 817581 853776 845850 819694 798543 745144 696356 657683 621297 578789
10995E78789j3614k3337k5026k6010K3259M4759K7551M878k609k9142J162J6472
10983E77132N887K6963j6856k3842k5902J6225M624P998K2007J8688O46l1803
10971E81767j9201r860j9964l2725J6734J9832j2707q898M1722K5108L175J0683
10959E95666J6454K660j3970m4270j7275K3419J6551J4577j117J4996J1829R457
10947F28977J3526l7408p784L4597L6575J315j123p731j332K5783J2290J5987
10935G13672J8088N2483K9030l1202j3860L1011J6538L9686K6432k546L8347L8647
10923I56326O609L496N788M256P611k5405k2204q422p48j9052J6497K1324j2436
10910I33640J6704J3513K6607M266j752J8898J1049J1481J1454q78M7527K5694
$$ plain form
10995 578789 565175 541838 516812 490802 514061 558820 586371 591249 588640 559498 560660 577132
10983 577132 583019 609982 593126 569284 543382 559607 564231 572229 594236 612924 613570 581767
10971 581767 562566 552706 532742 500017 516751 536583 523876 514978 556700 581808 584983 595666
10959 595666 612120 614780 600810 556540 539265 562684 579235 593812 592695 607691 619520 628977
10947 628977 642503 605095 597311 631908 668483 669798 668675 660944 659612 685395 697685 713672
10935 713672 731760 784243 813273 782071 768211 799222 815760 855446 881878 879332 917679 956326
10923 956326 962935 966431 972219 976475 984086 958681 936477 928055 927307 908255 924752 946076 933640
10910 933640 950344 963857 990464 994730 992978 1011876 1022925 1034406 1045860 1044982 1092509 1118203
10898A118203L9464J1850K65K009k8016p973J7702j8424j9457J6215R085J797
10886A142720k252K1245J4482l6194l4216J7801K5877L150K606Q202K2530K4839
10874A210790L3011M2119K2994N2798N7344O6118J19748J39236J58991J86106
10864B089255K37804K14574J51508O2807J9628j07751k42632k92159k58367k16444
10854A658223j42656j02371r5044q2231l7568j8849P829k1794o0866l9267l946
10843A061460J700l0177k7283k918j0650K2575J1614k3405k0734J9694J5539j5414
10831A002001j4860K2626J2405k1654k7934j6011k089K1593q730k9148k7969k632
10819I07598k897J6030j2898j0032O547o968j38r134q368J2891N338j0114P375
$$ plain form
10898 1118203 1157667 1169517 1169782 1171791 1143775 1135802 1153504 1135080 1115623 1131838 1140923 1142720
10886 1142720 1140468 1161713 1176195 1140001 1105785 1123586 1149463 1152613 1155219 1163421 1185951 1210790
10874 1210790 1243801 1285920 1308914 1361712 1419056 1485174 1604922 1744158 1903149 2089255
10864 2089255 2327059 2541633 2693141 2755948 2775576 2667825 2425193 2133034 1874667 1658223
10854 1658223 1515567 1413196 1318152 1235921 1198353 1179504 1187333 1165539 1104673 1065406 1061460
10843 1061460 1063160 1032983 1005700 1002782 992132 1014707 1026321 1002916 982182 1001876 1017415 1002001
10831 1002001 987141 1009767 1022172 1000518 972584 956573 954484 976077 967347 938199 910230 907598
10819 907598 904701 920731 907833 897801 904348 897380 897242 888108 879740 892631 897969 887855 895230
10806H95230r802N884p634O747J8800J1439QO982o15L1662K5950K6607L4095l858
10792A041495j8545J43J4211k1399k3310O158P990l929j1628k738K6205K5487
10780A040140K7091l983j5113P692j3717r109j0777K4786Q572L6243K1572k6068
10768A087329k1660L586K2659o987P845K6037j7143J7280P728j1401j5718M0196
10756A139751J6486k709O009K2279K0797J1144J0512J142K6703J4167l2537m9594
10744A184150J0589L4208L198J0490K7583J8724K7838K4446J1986J7392L42k2214
10732A348732j5309J55K9347J7536P662K676J550m411j4696j0840L6176N352K5785
10719A429715M1520K094j3865J0438j9628J3394L8761J0703m948j5076j6740J5579
$$ plain form
10806 895230 885428 891312 883678 890425 909225 920664 920672 927654 927039 958701 984651 1011258 1045353 1041495
10792 1041495 1022950 1023093 1037304 1015905 992595 998753 1006743 1002814 991186 988448 1014653 1040140
10780 1040140 1067231 1063248 1048135 1055827 1042110 1033001 1022224 1047010 1055582 1091825 1113397 1087329
10768 1087329 1065669 1069255 1091914 1084927 1092772 1118809 1101666 1118946 1126674 1115273 1099555 1139751
10756 1139751 1156237 1153528 1159537 1181816 1202613 1213757 1224269 1225411 1252114 1266281 1233744 1184150
10744 1184150 1194739 1228947 1232145 1242635 1270218 1288942 1316780 1341226 1353212 1370604 1370946 1348732
10732 1348732 1333423 1333578 1362925 1380461 1388123 1390799 1392349 1387938 1373242 1362402 1398578 1403930 1429715
10719 1429715 1471235 1473329 1459464 1469902 1450274 1463668 1502429 1513132 1508184 1493108 1476368 1491947
10707A491947J2752J9411J8169Q741M2741N9035L3810L2500P260K5199O719q250
10695A750034J3800L2890L0990J8597j087K650J4486J934j0616k5472j0873J7489
10683A834822J5296J4331K5282J3058M431n840P046J3497M24J7707K9770J9527
10671A989351K1895K3692M8937K9512R840L3730M5398O762J541J3581L0307J3669
10659B268215K022J649J7454Q667K4183K6707J1320M4232M1281M1432N5928P6896
10647B619986Q3288N3790L7123N0596O4013P0959P1950P6435N3482P6489J16688
10636C374799J05973J26773J78994J49400J43141J55216J73555J89491J92854
10627D790196J66656J52203J12934Q9280N4556l0209q0208q6968m9206l4626j1332
$$ plain form
10707 1491947 1504699 1524110 1542279 1551020 1593761 1652796 1686606 1719106 1726366 1751565 1758284 1750034
10695 1750034 1763834 1796724 1827714 1846311 1845224 1847874 1862360 1864294 1853678 1828206 1817333 1834822
10683 1834822 1850118 1864449 1889731 1902789 1907220 1901380 1908426 1921923 1922347 1940054 1969824 1989351
10671 1989351 2011246 2034938 2083875 2113387 2123227 2156957 2202355 2209117 2210658 2224239 2254546 2268215
10659 2268215 2270237 2271886 2289340 2298007 2322190 2348897 2360217 2404449 2445730 2487162 2543090 2619986
10647 2619986 2703274 2757064 2794187 2844783 2908796 2979755 3051705 3128140 3181622 3258111 3374799
10636 3374799 3480772 3607545 3786539 3935939 4079080 4234296 4407851 4597342 4790196
10627 4790196 4956852 5109055 5221989 5311269 5365825 5335616 5255408 5168440 5119234 5084608 5073276
10616E073276l365M8417L7701L8348O9907J12338J13983J06336J43155J31561
10606E871657J10505R4118Q1719O9219P1254J00650J42772J18312J66756J79054
10596G006016J78039J44335Q1413J6109m134l0249q5271n9389r1023n6312o5860
10585G033674o0507l5556r470k8622k2250k721J8198K9221O0587O4942P0112R2780
10573G210388J61903J43904J60400J94770J81588J49804J38338J30619J11636
10564H583350J26281J29424R3713O9551M6377K4964J11285J81527J75056J84129
10554I725657K25619K38797K00833J55927J03003N4381K9964J2846L6314J01593
10544A0884934R2663J12314J56070J87674K09238J88454K14528K75654K71999
$$ plain form
10616 5073276 5069911 5118328 5156029 5194377 5264284 5376622 5490605 5596941 5740096 5871657
10606 5871657 5982162 6076280 6157999 6227218 6298472 6399122 6541894 6660206 6826962 7006016
10596 7006016 7184055 7328390 7409803 7425912 7421778 7391529 7306258 7246869 7155846 7099534 7033674
10585 7033674 6973167 6937611 6928141 6899519 6877269 6874548 6892746 6921967 6982554 7047496 7117608 7210388
10573 7210388 7372291 7516195 7676595 7871365 8052953 8202757 8341095 8471714 8583350
10564 8583350 8709631 8839055 8932768 9002319 9048696 9073660 9184945 9366472 9541528 9725657
10554 9725657 9951276 10190073 10390906 10546833 10649836 10704217 10734181 10747027 10783341 10884934
10544 10884934 10977597 11089911 11245981 11433655 11642893 11831347 12045875 12321529 12593528
10535A2593528L17897L52952L88868M76642N08322N87676O95209P27493Q21453
10526A7470040R43827J031255J071292J224775J398570J564005J815364K031418
10518B8550546K296614K628057K966277L360800L762525M180852M553361M837444
10510E7136476M992184M847820M452440L814551K888879J746901N35727n80695
10502G9834283j501206k164265k424825k317646j984576j522860r19787k50890
10494F6748228M28834J025736J522859J984583K302762K442488K473396K459235
10486H1388121K401875K356409K331262K440268K619610K772898K834800K725710
10478A01870953K446763J954763J328352O15744o0811o88704j201212j525131
$$ plain form
10535 12593528 12911425 13264377 13653245 14129887 14638209 15225885 15921094 16648587 17470040
10526 17470040 18413867 19445122 20516414 21741189 23139759 24703764 26519128 28550546
10518 28550546 30847160 33475217 36441494 39802294 43564819 47745671 52299032 57136476
10510 57136476 62128660 66976480 71428920 75243471 78132350 79879251 80414978 79834283
10502 79834283 78333077 76168812 73743987 71426341 69441765 67918905 66999118 66748228
10494 66748228 67177062 68202798 69725657 71710240 74013002 76455490 78928886 81388121
10486 81388121 83789996 86146405 88477667 90917935 93537545 96310443 99145243 101870953
10478 101870953 104317716 106272479 107600831 108216575 108155764 107467060 106265848 104740717
10470A04740717j614651j587366j412102j167075r14436o97871n02990l19788
10462I6524438j69722J08018N25817J067093J914738L043873M454788O156201
10454A13625244Q287845J0999366J4619088J9518933K6040777L4431076M3985628
10447B71507957N1210869M9396839L6101159J9105174L509947j9155326m9886712
10440C61789907o4434302n6015849m1175570k9310550k1228390j5728527j1878525
10433A22018194r068690o967722n397258m191294l263196k600899k152902j896847
10425H6479386j719877j602923j492222j455576j371974j275626j244142j214027
10417G5103019j201239j211734j256022j300741j339945j372808j392362j425786
$$ plain form
10470 104740717 103126066 101538700 100126598 98959523 98045087 97347216 96844226 96524438
10462 96524438 96354716 96462734 96988551 98055644 99970382 103014255 107469043 113625244
10454 113625244 121913089 132912455 147531543 167050476 193091253 227522329 271507957
10447 271507957 322718826 372115665 408216824 427321998 430831945 411676619 361789907
10440 361789907 297355605 241339756 200164186 170853636 149625246 133896719 122018194
10433 122018194 112949504 105981782 100584524 96393230 93130034 90529135 88376233 86479386
10425 86479386 84759509 83156586 81664364 80208788 78836814 77561188 76317046 75103019
10417 75103019 73901780 72690046 71434024 70133283 68793338 67420530 66028168 64602382
10409F4602382j502705j558517j686201j890900k114911k293561k384362k405457
10401D8765768k306434k147856k000215j868547j724988j598748j500737j373208
10393C4245035j329608j247858j171681j075202j023944r71977r30833q72710
10385B5621222q68492q36641q20912p84804p53019o91279o59613o45091o19071
10376A8942300n97692n59240n25877n32031n10667m87821m55107m46736m37609
10367A4389520m23040m45119m35029m24498m04661l94575l76909l45707l35537
10358A0804445l16475l07694k66253k69373l07678k90149k82362k43962k29940
10349H290559k33778k31466k27266k21601j94020j44523j69760j61965j70966
$$ plain form
10409 64602382 63099677 61541160 59854959 57964059 55849148 53555587 51171225 48765768
10401 48765768 46459334 44311478 42311263 40442716 38717728 37118980 35618243 34245035
10393 34245035 32915427 31667569 30495888 29420686 28396742 27424765 26493932 25621222
10385 25621222 24752730 23916089 23095177 22310373 21557354 20866075 20206462 19561371 18942300
10376 18942300 18344608 17785368 17259491 16727460 16216793 15728972 15273865 14827129 14389520
10367 14389520 13966480 13521361 13086332 12661834 12257173 11862598 11485689 11139982 10804445
10358 10804445 10487970 10180276 9914023 9644650 9336972 9046823 8764461 8520499 8290559
10349 8290559 8056781 7825315 7598049 7376448 7182428 7037905 6868145 6706180 6535214
10340F535214j58387j67567j65380j35460j53245j71418j62962j38937j62169
10331E119689j85307j99885j70816j38890j38535j19306r0323o3910l9917p8747
10321C894053j21081j00447j11954j27525j08423j05118q3012m9566m2641p6811
10311B967475j19027j14997j08223j21221j22474q9347p3406o8725n5447k1548
10301B073060k4625l9318l9928n0269n2244k6696k7744m0373o6329k2959j6092
10290A666483n5506k4841k2863l0886n8356k3008n1129l1709l660j3925k7045
10279A323555j6108L987j8528r83l6060p4586o5358m5379k1974j3398j9201k1078
10267I94889m7103r123J3511J7512K0449j0682j9560J4835J2811r111K0252K1763
$$ plain form
10340 6535214 6376827 6209260 6043880 5908420 5755175 5583757 5420795 5281858 5119689
10331 5119689 4934382 4734497 4563681 4424791 4286256 4166950 4076627 4012717 3972800 3894053
10321 3894053 3772972 3672525 3560571 3433046 3324623 3219505 3136493 3086927 3044286 2967475
10311 2967475 2848448 2733451 2625228 2504007 2381533 2292186 2218780 2150055 2094608 2073060
10301 2073060 2048435 2009117 1969189 1918920 1866676 1839980 1812236 1771863 1705534 1682575 1666483
10290 1666483 1610977 1586136 1563273 1532387 1474031 1451023 1399894 1368185 1364525 1350600 1323555
10279 1323555 1307447 1311434 1292906 1291923 1255863 1181277 1115919 1070540 1048566 1035168 1015967 994889
10267 994889 947786 938663 952174 969686 990135 979453 959893 974728 987539 978428 998680 1020443
10255A020443k3706l536N407q935P752K52k3441l8625k785n368k4368j9774N155
10242H88471k63Q200l952k1552n081J832O415q326k8555O148J021l2338j9354
10229G92666l647l587j9835M289q836j1925R5o688l1446L237N36n755l5389l1326
10215F42389J0445K1616j8679k4757R234J1765m039J5355J2644J648K880K8490
10203G08991R434N91K8245m917o238j0889j7307j138m7J3356L0205J0047K9845
10190G90178K2650J8616M0508R0458R5501P2491P9140J26522J37639J95999K81420
10179A951122L39899L99888M80447M98325M94151M43736L86449K41565L2298j88335
10169E079545l58667m97664n57889n21881m59890l78606k93342k44888j57178
$$ plain form
10255 1020443 996737 993201 998608 989673 997425 997677 974236 935611 932826 927458 903090 883316 888471
10242 888471 888208 896408 892456 870904 865823 867655 874070 865744 837189 843337 844358 812020 792666
10229 792666 789019 785432 765597 769886 761050 749125 749220 742532 711086 714323 714859 709104 673715 642389
10215 642389 652834 674450 655771 631014 640248 652013 647974 663329 675973 677621 680501 708991
10203 708991 718425 719016 747261 742344 736106 725217 707910 706772 706725 720081 750286 760333 790178
10190 790178 812828 831444 871952 962410 1057911 1130402 1209542 1336064 1473703 1669702 1951122
10179 1951122 2291021 2690909 3171356 3669681 4163832 4607568 4994017 5235582 5267880 5079545
10169 5079545 4720878 4223214 3665325 3143444 2683554 2304948 2011606 1766718 1609540
10160A609540j21253r4283q5053n3670k0038j8425j9025K0118N5131N0938Q3898
10149A407878Q5483J06420J50229J89116K24383K94596L69493M71286M81888M97958
10139D278730M52219L57112K18624K2885j66902l22720m33752n19512n38781m96571
10129B851332m05201l49342k79709k15476j43076j17590r1890r4250r1551r0709
10119I72538n3584l7569k5201l5355j1564j7735l5220m575k9206j4935m983J752
10107G04363j4485l8234j0469p396J308K1456K6510m1306l2466L111J2345j169
10095F23568J1248j0035k1591j5718k9350k2341L200m102l186K1355L7568L0269
10083F20885K7366q694Q089n301m766L464l4555m870k551k8740k7519O66k4888
$$ plain form
10160 1609540 1488287 1394004 1308951 1255281 1235243 1216818 1197793 1217911 1273042 1323980 1407878
10149 1407878 1493361 1599781 1750010 1939126 2163509 2458105 2827598 3298884 3780772 4278730
10139 4278730 4730949 5088061 5306685 5329570 5162668 4839948 4406196 3886684 3347903 2851332
10129 2851332 2446131 2096789 1817080 1601604 1458528 1340938 1249048 1154798 1063247 972538
10119 972538 918954 881385 856184 820829 809265 791530 756310 751735 722529 707594 702611 704363
10107 704363 689878 651644 641175 633779 635087 656543 683053 641747 609281 612392 624737 623568
10095 623568 634816 624781 603190 587472 558122 535781 538981 534879 531693 553048 590616 620885
10083 620885 648251 639557 647646 642345 637579 641043 606488 601618 599067 570327 542808 543474 518586
10070E18586k0884J2428M77j4008N570k363p8R557K8124L4043K6023R791J8647
10057F25913r272k2263j9844j679O92R463K8839K6025J6747j3678k0630J6787
10045F37100j725n711k0911j924r814J2815J6309l967k4553j8449k652J4282N971
10032E96771K0787K9076O1729P5655Q4726J32777J87175K16439K51691K71573
10022A928399J99324J05601J452j16697k22085k91979l03948k27548j53210j11845
10012H07464n1811l4151l7382m1442m5388l6505k6612o6965m3285O94k4256n5518
10000C44843o2256j7949M011P759k1505k7599K2269Q973n657k0797j2949j7883
9988B01260l290k0187J2520N0462J5162j2647R9k3516j7180J267J0375j6792o051
$$ plain form
10070 518586 497702 510130 510607 496599 502169 499806 499728 509285 537409 571452 597475 607266 625913
10057 625913 616641 594378 574534 572855 573547 583010 611849 637874 654621 640943 620313 637100
10045 637100 635375 629664 608753 606829 597015 609830 626139 622172 597619 579170 576518 590800 596771
10032 596771 617558 646634 708363 784018 868744 1001521 1188696 1405135 1656826 1928399
10022 1928399 2127723 2233324 2234776 2118079 1895994 1604015 1300067 1072519 919309 807464
10012 807464 755653 721502 684120 642678 597290 560785 534173 467208 423923 424617 400361 344843
10000 344843 282587 264638 268649 276408 254903 227304 249573 258546 252889 232092 219143 201260
9988 201260 197970 177783 190303 240765 255927 243280 243379 219863 202683 203950 214325 197533 191482
9975A91482J2047j3456k9891j357N942l47j3695n629k405J7963k4936P164l579
9962A39303m895j8684j4778k0417N258J064j0281l6843j3553l3976J7569K9842
9950C9609J3876r325K948j0960o795J0779J4707J4022L229J0111P603k7118l5074
9937B7612J2024L5217J7145l246j0663N239r238O102r272k8429k907J5648K0633
9924G5865J1705k4017j3121j9934n283J0155J1113O603P677J4439J546O007j1354
9911G1401j211J890l9797o04L1227N161k9879O1K1619o718k5521J1569Q562r113
9897C8647j4477M488L636J7055j6481m2294j4068K0210L0392o944j2746r319K0553
9884A8652L2545k2525K676K5038j9949j8650j2119j0873n349J6312J6388J2419
$$ plain form
9975 191482 203529 190073 160182 158825 164767 164420 150725 145096 142691 160654 135718 142882 139303
9962 139303 134408 115724 100946 80529 85787 86851 76570 39727 26174 -7802 9767 39609
9950 39609 53485 44160 47108 36148 29353 40132 54839 68861 72090 82201 89804 62686 27612
9937 27612 39636 74853 91998 88752 78089 83328 74090 80192 70920 42491 39584 55232 75865
9924 75865 87570 63553 50432 30498 25215 35370 46483 53086 60763 75202 76748 82755 71401
9911 71401 70190 72080 32283 31679 62906 68067 38188 38249 59868 53150 27629 39198 47760 38647
9897 38647 24170 28658 32294 49349 32868 -9426 -23494 -3284 27108 20164 7418 -1901 18652
9884 18652 51197 28672 31348 56386 36437 17787 5668 -5205 -10554 5758 22146 34565
9872C4565j3381k8035P555J50n051J1253j8699J8611j30l739j198m9m320K7024
9858B4556q361j0435j4140l4337l0152N6444M8875J0316l3271P970K9193N6208
9846A02866L5281N8617J01036J23768J16053Q4410N3050N3433K3501r4952j86210
9835D70853j81556j00762p0872n1215j8750J396r398Q025j8704N067j879j7134
9823A5071J1090R688j53q814K6518j883q591K015j9784l741N256J945L7216j0614
9809E5219l6967j2043Q409J2738j282k4443m2844P884K4844q112N865Q873J8241
9796A6382K774k9477j7302O518Q095L389l881k402j5688j13L962m882P537L083
9782b2005L6827J2187j8021K615J2653j561M53J6827J431O201q02m970L9222M1925
$$ plain form
9872 34565 21184 -6851 704 854 -4197 7056 -11643 6968 6838 3099 1901 1852 -2468 24556
9858 24556 16195 5760 -8380 -42717 -72869 -16425 32450 42766 9495 17465 46658 102866
9846 102866 138147 196764 297800 421568 537621 622031 675081 728514 752015 657063 470853
9835 470853 289297 188535 117663 66448 47698 49094 39696 47721 29017 34084 32205 15071
9823 15071 26161 35849 35696 26882 53400 51517 42926 44941 25157 21416 26672 28617 65833 55219
9809 55219 18252 6209 14618 27356 26074 1631 -41213 -33329 -8485 -16597 -10732 -1859 16382
9796 16382 19156 -10321 -27623 -21105 -13010 -9621 -13502 -15904 -31592 -31705 -27743 -32625 -25088 -22005
9782 -22005 14822 27009 8988 11603 24256 22695 23148 39975 41406 47607 46805 41835 81057 122982
9768A22982l224J0068K2767O404p695l955k2633n5261l7511k9292j1525O657j2257
9755a4475p445p412M11R533j4472q142r649j3651N525J0843j3473J1827J8879
9742c1701R09j1655P610J0097o631p534K5240j3256q5K001R355K0781L148j3945
9728e666L1484R966K7016N922j0910Q508J8338K0654L2378N1614M7182O6355O7116
9715C69957N6211L6245k472j1298n1393o7426q7852o0752n3916l7580l5237l7872
9703A6615J178M022r318k1991K3248R034j9383J2199L2125k7896j3641O423J7350
9690B9965p274k0839K934J750o831J5998K3099l2266o41J514J4382N237j845j4513
9676A0670l0007j0621j3847O446L6260K2924J8488P514l574p501Q42j803k0443
$$ plain form
9768 122982 119758 129826 152593 158997 151302 147347 124714 69453 31942 2650 -8875 -2218 -14475
9755 -14475 -21920 -29332 -28921 -19388 -33860 -42002 -51651 -65302 -59777 -48934 -62407 -50580 -31701
9742 -31701 -30792 -42447 -34837 -24740 -31371 -38905 -13665 -26921 -27006 -25005 -15650 5131 8279 -5666
9728 -5666 25818 35784 62800 68722 57812 66320 84658 105312 137690 189304 236486 302841 369957
9715 369957 426168 462413 459941 448643 397250 329824 241972 181220 127304 89724 54487 16615
9703 16615 17793 21815 12497 -9494 13754 22788 3405 15604 47729 19833 6192 12615 29965
9690 29965 22691 1852 4786 6536 -295 15703 38802 6536 5895 7409 21791 27028 25183 10670
9676 10670 -19337 -29958 -43805 -37359 -1099 21825 40313 47827 44253 36752 37594 35791 15348
9663A5348j820J2280R372j5468k4077K3305K9634k2388j5276j9139j7163K6658
9651A266L6018J0248J1370l2572k3081j07j355J8004j84l8771r706J4443J104
9638a3323j1020k3702M734o008k1218K4440R177k416j945j4048k8119l684J0200
9625g6932J0053J5734K3710Q728p636k1363K3156K9483r593j9344P735K9583R60
9612A4274j5988j3234q821K0077J7088m468n666j0671J8822Q719K5260M303j94
9599D9501N514k7715j6804j0207o266K1035M647M276j3553k2568R026K2603m918
9586A4571k49J8072K8658k0614r927q714k3118k1620m751J9625L2331Q82k0475
9573D671K1147P794j0279K994k56P552J2584P026M66k4339j2250j18r678J2159
$$ plain form
9663 15348 13528 25808 35180 19712 -4365 18940 48574 26186 10910 -8229 -25392 1266
9651 1266 37284 47532 58902 26330 3249 3142 1787 19791 19607 -19164 -28870 -14427 -13323
9638 -13323 -24343 -48045 -43311 -49319 -70537 -46097 -36920 -39336 -41281 -55329 -83448 -87132 -76932
9625 -76932 -66879 -51145 -27435 -18707 -26343 -47706 -24550 4933 -4660 -24004 -16269 13314 14274
9612 14274 -1714 -14948 -23769 -3692 13396 8928 3262 -7409 11413 20132 45392 49695 49501
9599 49501 55015 27300 10496 289 -5977 15058 19705 23981 10428 -12140 -3114 19489 14571
9586 14571 14322 32394 61052 40438 30511 21797 -1321 -22941 -27692 -8067 24264 25146 4671
9573 4671 25818 33612 23333 26327 26071 33623 46207 53233 53699 29360 17110 16992 7314 19473
9559A9473Q70j0563m0435K396Q297K9340J9743j9619l4045m537J5495k8668L657
9546c8596K3105J0095J3045k2319r804p141O659M1236K0240k4360k8178k5127
9534d1145j4980L8222N2642K2160J9487k8828k9371l057j1464l016J6167Q926
9522B5743m163l342q966j276J9113j344j5214k1945l174K4325R546j3477R832
9509A5658l400L287J8166o888k1525J211K0577m214R47n922P385J5580k9827l012
9495H023L538J6291m722j7162o492K7726P378l038N264k4255j870K6928n240j7749
9481A4620J8447J1858k4795l3081n256M022J9477N325k713l294J4585J2605J0202
9468D2002o554M639J2316l1125j6807m404r181L842L2338k3756j2782O635k711
$$ plain form
9559 19473 20343 9780 -30655 -28259 -19962 9378 29121 9502 -24543 -29080 -13585 -42253 -38596
9546 -38596 -15491 -5396 7649 -14670 -24474 -31615 -24956 16280 36520 12160 -16018 -41145
9534 -41145 -56125 -17903 34739 56899 76386 47558 18187 15130 3666 650 16817 25743
9522 25743 21580 18238 9272 7996 27109 25765 10551 -11394 -14568 9757 19303 5826 15658
9509 15658 12258 15545 33711 26823 5298 6509 27086 22872 23819 17897 25282 40862 11035 8023
9495 8023 11561 27852 23130 5968 -524 27202 34580 31542 36806 12551 10681 37609 32369 14620
9481 14620 33067 44925 20130 -12951 -18207 -14185 5292 10617 7904 4610 19195 31800 42002
9468 42002 35448 40087 52403 21278 4471 67 -9114 -5272 27066 3310 -9472 -2837 -5548
9455e548j2795q751M963M137l037R499j3q63K7492K9067Q237j7933n4701O705
9441a3541J3269L411L8375J8588j3706j2335N319N535M28j5097j761J54K1387
9428E0026K4592r76m759l3141K7171l719m5964n607K0695J2299K688O524J3680
9415F3509M028n079K3468o945j1686n0399r02L0066J3484J9665k7532N509K836
9402F0022J8000J1306j3993k855j3914K91J1036j5872l2930k9977M386K1874J3043
9389C0417J8053p008j1190R024K0366j683K0960j6539J44j8775n746K6440j0017
9376E4446K0497q938m1437l642J1107j767j5152K718j3000J2761M1059l184j6603
9363C8865LM179n781R967K3444K578p67l2326q541O64j2384o852L4728L4784p834
$$ plain form
9455 -5548 -18343 -27094 -22131 -17994 -21031 -11532 -11545 -12408 15084 44151 52388 34455 -20246 -13541
9441 -13541 -272 3139 41514 60102 46396 34061 39380 44915 45343 30246 28485 28639 50026
9428 50026 74618 73642 68883 35742 62913 59194 13230 7623 28318 40617 43305 49829 63509
9415 63509 67537 62458 85926 78981 67295 16896 15994 46060 59544 79209 51677 57186 60022
9402 60022 78022 89328 75335 72480 58566 58857 69893 54021 21091 -8886 -4500 17374 30417
9389 30417 48470 41462 30272 39296 59662 57979 78939 62400 62544 43769 38023 64463 54446
9376 54446 74943 66005 24568 20926 32033 30266 15114 17832 4832 17593 58652 55468 38865
9363 38865 38868 43047 37266 47233 70677 73255 72488 40162 31621 32285 19901 13049 47777 82561 74727
9348G4727q546k0473o809Q349n806j8214j4567L3989K9363m956k1641q988K2460
9335E8888p084o091j6678j6594k5973J9155J7286P295K3926L2092O209N574j5258
9322H2747l1131r304J3050K3678j8231j8007j534j694k0665k2124K450L3423L2670
9309F5328J3166j3910k1266j0711m858j0581p694m3553j39K5511M0817J8015j293
9296D8832l0732K7458L0J5839j7189k839j388n736L857l1646p149J7010M63j8716
9282a906j1552K6652M1647N553k3829j5859k274J9347j824j1487N747k692j1750
9269A5773R467P345m2476j4016K749J2652R232J4527K7555J0802p919k0223p194
9256A8274p84L021J3951L324k5367k0938k2060R928L046r022K3845J9893J6335
$$ plain form
9348 74727 66181 45708 38899 47248 41442 23228 8661 42650 72013 67057 45416 36428 58888
9335 58888 51804 45713 29035 12441 -13532 5623 22909 30204 54130 86222 92431 98005 82747
9322 82747 51616 42312 55362 79040 60809 42802 41268 39574 18909 -3215 -765 32658 65328
9309 65328 78494 64584 43318 32607 27749 17168 9474 -34079 -34218 -8707 32110 50125 48832
9296 48832 18100 45558 45588 61427 44238 41399 40011 34275 38132 6486 -663 16347 16810 -1906
9282 -1906 -13458 13194 54841 60394 36565 20706 18432 37779 35955 24468 30215 27523 15773
9269 15773 25240 32585 -9891 -23907 -21158 -8506 726 15253 42808 53610 45691 25468 18274
9256 18274 17490 20511 34462 37786 12419 -8519 -30579 -20651 -17605 -26627 -2782 17111 33446
9243C3446l79K706k968j2262j1249j1879J894L222o285K0664R29l8431K271J4761
9229c560J5699Q348o650K04j1534k8284j9562M0021J4165q999J0091P646J3988
9216C1573k9188J9701K3821L430k5080j5603j7258j3419P759M7563J3673K243
9204D9215m278j7773j449o186N399K485N996m323j0582M199J757j0116K47q722
9190E869Q518K9711j1634j4800J4055j3629k577J717j4354j3407J8956L429j1178
9177F76n248j916K0596n117j1733O525k9895m1898j0553J4473K9037m686J1720
9164b8019K0547K6988K5479O799k8404k1977o225L50R841r622k795m511J2322
9151G73J9149L569j3738k246J7412J0706k4856j7831J0829O259k0343n707J7413
$$ plain form
9243 33446 33067 35773 32805 20543 9294 -2585 -691 2531 -3754 16910 17839 -20592 -18321 -3560
9229 -3560 12139 20487 13837 14041 2507 -25777 -45339 -5318 8847 -152 9939 17585 31573
9216 31573 2385 22086 45907 49337 24257 8654 -8604 -22023 -14264 33299 46972 49215
9204 49215 44937 27164 25715 19529 24928 27413 33409 29086 18504 22703 24460 14344 14591 5869
9190 5869 14387 44098 32464 17664 31719 18090 15513 17230 2876 -10531 8425 11854 676
9177 676 -4572 -6488 14108 8991 -2742 3783 -26112 -68010 -78563 -64090 -35053 -39739 -28019
9164 -28019 -7472 19516 44995 51794 23390 1413 -4812 -4462 5379 -4243 -7038 -11549 773
9151 773 19922 23491 9753 7507 24919 35625 10769 -7062 3767 10026 -10317 -16024 1389
9138A389J7185J2727J018r9N415L5395l6218j0441Q492j1975M553L453l4029j2638
9124a5773p471n306L1511J8336P624k8543j530K5566J02J713K2884j1257j7792
9111B0064k9141K8801N333j0321p208N440R99L008J5288Q695j6233l9383J2447
9098b211K4375j0652k0460J034K255K1339P761j7159j6259P407K6083k4000j2100
9085a2587J8274K0453J2993N361q205j6887J4681N744j4418J6748M9298J3305
9073A04760m2976l4346j4367J3666j0626k2706k2797Q797M1802J7809j6547j4378
9061H091o788R0k1099m121o457r181J0190L9723N402K8859L6625m390m8607j4313
9047A4024k0223q519Q645O6820L902k3623j5870o283k0629J3949M3079L7004j0277
$$ plain form
9138 1389 18574 31301 32319 32220 37635 73030 36812 26371 34863 22888 27441 30894 -3135 -15773
9124 -15773 -23244 -28550 2961 21297 28921 378 -1152 24414 24516 26229 49113 37856 20064
9111 20064 -9077 19724 25057 14736 7528 12968 13967 16975 32263 40958 24725 -14658 -2211
9098 -2211 22164 11512 -8948 -7914 -5659 15680 23441 6282 -9977 -2570 23513 -487 -12587
9085 -12587 5687 26140 39133 44494 36289 19402 34083 39827 25409 42157 91455 104760
9073 104760 61784 27438 13071 26737 16111 -6595 -29392 -20595 21207 39016 22469 8091
9061 8091 1303 1393 -19706 -23827 -30284 -39465 -29275 10448 15850 44709 81334 76944 28337 14024
9047 14024 -6199 -14718 -6073 60747 64649 41026 25156 18873 -1756 12193 55272 92276 81999
9034H1999k1591j9162k0306K1234j3382n929K2418J5567Q812R388j9851j023j8721
9021C9453m3745m5280L6149K0047J3878k091L891M101m55J3682L1848N323n7211
9008A9590j3880p347J322J2707r32j417j1893j70k2699j8073K9793K1549R642
8995A8192J8293L7306m846k8142N519n653O225k1111j4533J1478p689P230k8146
8982e877K1769K1771M641k129L4895j6692j6323O999Q342k813r343k413n59k6093
8968A6175j0177K3092L194k3439j4329J7245K8173N37k8292n167j452J5921J6017
8955C7498J9541L630J195j8279p726k6854p09K6941N0171k133j1717o614Q975
8942G3919l934l498K7619k702l9483p284J611k468K0843K764l68J7097P705j9923
$$ plain form
9034 81999 60408 41246 20940 42174 28792 22863 45281 60848 69660 79048 59197 58174 39453
9021 39453 -4292 -49572 -13423 6624 20502 18411 22302 26403 25948 39630 71478 76801 19590
9008 19590 5710 -1637 -315 12392 11460 10043 -1850 -2020 -24719 -42792 -12999 8550 18192
8995 18192 36485 73791 68945 40803 46322 40669 46894 25783 11250 22728 15039 22269 -5877
8982 -5877 15892 37663 42304 40175 75070 58378 42055 49054 57396 54583 45240 42827 42268 16175
8968 16175 5998 29090 32284 8845 -5484 11761 39934 40471 12179 7012 5560 21481 37498
8955 37498 57039 60669 61864 43585 35859 9005 8296 35237 85408 83275 71558 64944 73919
8942 73919 69985 66487 94106 91404 51921 44637 46248 43780 64623 67387 67019 84116 91821 71898
8928G1898j961J7824K2307k4757j6139J2842L1154j0860j4070l1512r927K7475
8916G4274Q227k8241j8586n176K4183L2441P692k2019j4289L1094p24k9985k3745
8903C5146N685p788P024K6011N1548L4476K0707n7353m0326J1919R046j2400J0973
8890I4668K4249k1047l4636m245O063K5465K3121j3640m3p580n625k325O335j9718
8876G1042O468O400P015L2830j0279k5553l316J501p008j7983j5050J1532J5013
8863G2612K0279j7040j0822Q407m454p142L316K9359K8701j8851p242J4677J2655
8850A24455k4348j8081M128j4383m34J9204J4986r235l2115l318J3651M3395m560
8837A13345k0265p408n249j875R216N325P717p047j9694M275P31K660j5538K6134
$$ plain form
8928 71898 69937 87761 110068 85311 69172 82014 113168 102308 88238 56726 46799 74274
8916 74274 82501 54260 35674 30498 54681 87122 94814 72795 58506 89600 88876 58891 35146
8903 35146 40831 33043 40067 66078 117626 152102 172809 115456 75130 87049 96095 83695 94668
8890 94668 118917 97870 63234 58989 65052 90517 113638 99998 99955 92375 86750 84425 90760 71042
8876 71042 77510 83910 90925 123755 113476 87923 84607 86108 79100 61117 46067 57599 72612
8863 72612 92891 75851 65029 73436 68982 61840 65156 94515 123216 104365 97123 111800 124455
8850 124455 100107 82026 86154 71771 71337 90541 105527 96292 64177 60859 74510 117905 113345
8837 113345 93080 85672 80423 78548 87764 93089 100806 93759 74065 78340 79071 81731 66193 92327
8823I2327K2901j2578J3075j4396m8780j6658J0860M7042J778k5983N0146L2634
8811A52368n226L324j6814k803j6494j0331o793J6560K3759j9576j0011J8263
8799A26226j3385R671k0829j5573K4820J4176J1844k9373O18k0568r136k0248
8787E8243R483J6777L563o415k4036q295K5765j1182k924J8653L5658q126K287
8774A09451N604j7785J0540j8007P883J4437j374j2027j5625J3119J197O917J6776
8761A21106j3502o472J7190q523j909Q731K9906q245M259j2896j6496k0888J2692
8748A04953J0707J8541L654R742M517K5146K3034j2909K605o844j7781k9302q361
8735A27702j2068j7566N778Q873N242J9809K0863r507L18l2622k4584J0310j0722
$$ plain form
8823 92327 115228 102650 115725 101329 52549 35891 46751 93793 95571 69588 119734 152368
8811 152368 147142 150466 133652 130849 114355 104024 97231 113791 137550 117974 107963 126226
8799 126226 112841 122512 101683 86110 110930 125106 136950 107577 108195 87627 78491 58243
8787 58243 67726 84503 88066 81651 57615 49320 75085 63903 60979 79632 115290 107164 109451
8774 109451 115055 97270 107810 89803 97686 112123 110749 98722 83097 96216 97413 104330 121106
8761 121106 107604 101132 118322 109799 107890 116621 146527 138282 142541 129645 113149 92261 104953
8748 104953 115660 134201 137855 147597 152114 177260 200294 187385 189990 183146 165365 136063 127702
8735 127702 115634 98068 103846 112719 117961 137770 158633 149126 149444 116822 92238 102548 91826
8722I1826K1049K3430J1893k7481j4542L1329K7123j7424j2054Q176K2687J9246
8710A85258K556j8086k1479l042k4278k8083j8121k3924L9294N5026L1625J033
8698A77779K123R200L566O232L197K0911L693n1138k3512m7341j8300n263k4965
8685E6182J2165J2271J3434J1998N155J3267J8713k7123j5201o428j8518Q949
8673H4864M3054K0422p357j9442o998n892k961K8468O308l0085j0607L6241j5699
8660A20316k32M246L976p253J2061M319M6k3796N189J1782O34q622j3132J3827
8646A23361l2J1050P0026M6211N636p409n630J8205K162l0160n4999j7323M110
8633A65208J0182l3773m7350k1470k813j5547J4961J2163L0618j6603n82M870
$$ plain form
8722 91826 112875 136305 148198 120717 106175 137504 164627 147203 135149 143325 166012 185258
8710 185258 187814 169728 148249 145207 120929 92846 74725 50801 90095 145121 176746 177779
8698 177779 179902 189102 192668 198900 202097 223008 226701 175563 152051 104710 86410 81147 56182
8685 56182 68347 80618 94052 106050 111205 124472 143185 116062 100861 94433 75915 84864
8673 84864 127918 148340 140983 121541 114543 108651 105690 134158 140466 110381 99774 136015 120316
8660 120316 120084 124330 128306 121053 133114 137433 137479 113683 118872 130654 131288 122666 109534 123361
8646 123361 123329 134379 204405 250616 256252 248843 243213 261418 263580 233420 178421 161098 165208
8633 165208 175390 141617 94267 72797 69984 54437 69398 81561 112179 95576 94994 99864
8621I9864k4770J0849j0292j5511j0128M985M9137O317M575L5302J3126r904j6305
8608A37245J1747J8346j9470k3414J6537R928L4666K5030K2371M9216M4222P6910
8596D03334P3150J1442J6224J6948n6150j28388p7626k1587n327j9114l0402k8132
8584A54372l06j4568R853J0826K947J4333R000O306j8196j7437o048l531k2601
8571A24950k1408J2285J7897J5220M60J164j4299j3941K694n377o710j0252n076
8558I7607K6076P059R542O291K3038Q851K4397M1816K215J9466q157l3434o2292
8545A62475l6296q976j906j5334p423P073K2909J4614l7398l690K3810O828M182
8532A30868N87j4652j7483R702O493q350l2852k2360j5296M698J091J9048N2231
$$ plain form
8621 99864 75094 85943 75651 60140 50012 54997 104134 110451 115026 150328 163454 153550 137245
8608 137245 148992 167338 147868 124454 140991 150919 185585 210615 232986 282202 326424 403334
8596 403334 476484 487926 504150 521098 464948 336560 258934 237347 232020 212906 182504 154372
8584 154372 154066 139498 149351 160177 163124 177457 186457 192763 174567 157130 151082 147551 124950
8571 124950 103542 115827 133724 148944 149404 150568 136269 122328 125022 119645 112935 102683 97607
8558 97607 123683 130742 140284 146575 169613 178464 202861 244677 246892 266358 258201 224767 162475
8545 162475 126179 117203 115297 99963 92540 99613 122522 137136 99738 96048 119858 126686 130868
8532 130868 131455 116803 99320 109022 115515 107165 74313 51953 36657 41355 42446 61494 113725
8519A13725O241l5496j097L4930o086k3007O140j7578n108o845j910J5500N936
8506H5345L495k6853J0049K1932p817k0899l0355m3636M7510M9997j568L242L03
8493I0745j0960l1605j9126j5373J5840K3367K9772o313q154p713J4554j2649
8481F2385j5780r109L17J10o092m121K52Q34N350R363J7110J2415k8141L477J061
8466D9431k3008n797J3930J122J4166J7666l1682o691j6884j221q589K35M683
8453G361n292j2580J1298J0355p093J2301L522J750k645Q408Q357k895j931r957
8439B0959P686K0380j6490r007o80r924J5610L5617q217q219k9539j8607J8698
8426A8267L5865P605k4457N402L42j6266n507l76o507K160J3405O00k8450o323
$$ plain form
8519 113725 119966 84470 83373 118303 112217 89210 95350 77772 72664 65819 63909 79409 85345
8506 85345 88840 61987 72036 93968 86151 65252 34897 -8739 38771 88768 87200 90442 90745
8493 90745 79785 48180 29054 13681 29521 52888 82660 76347 68193 60480 75034 62385
8481 62385 46605 37496 37813 37923 31831 27710 27962 28796 34146 43509 60619 73034 44893 48370 49431
8466 49431 26423 20626 34556 35678 49844 67510 35828 29137 12253 11032 2443 2678 7361
8453 7361 2069 -10511 787 11142 4049 16350 19872 21622 18977 27385 35742 32847 30916 20959
8439 20959 28645 49025 32535 23528 22848 12924 28534 64151 55934 47715 18176 -431 18267
8426 18267 54132 61737 37280 42682 43024 26758 21251 20875 14368 16528 29933 30533 2083 -4240
8412d240J6989J0894L302j0502j6698P037j967Q05J2179K9527Q522k2970O651
8399C9529o964L15l6176q351J7213k3534L0639M9157M149j6701J0954k2923l4008
8386C299J857O591O86J7142j1046J0437J5746o853R585K7090J0031J2563k8874
8373F8254k9977j6057N591j7928n956n358J363K2400J0879J6940k6220k2679k3696
8360b2444j09K0829K3587m965O409J0575q695L627P94j4692J9598K6006M0590
8347A01110J6704l400O422m6683l9545j9199q853n848j3174p484K3891m962j2881
8334a3902J0680N0920J9360j3315J1028O270K551l4583m339m160K6082J3610l0480
8321C9722l8336M618K6190r012r89O086J4648m696q752j243J693J2216N094j2261
$$ plain form
8412 -4240 12749 23643 26945 16443 -255 6782 4815 5620 17799 47326 55848 32878 39529
8399 39529 32565 32880 -3296 -11647 5566 -17968 12671 61828 65977 49276 60230 37307 3299
8386 3299 5156 11747 12433 29575 18529 28966 44712 37859 47444 74534 84565 97128 68254
8373 68254 38277 22220 27811 9883 3927 -1431 -68 22332 33211 50151 23931 1252 -22444
8360 -22444 -22553 -1724 21863 16898 23307 33882 25187 28814 29608 14916 34514 60520 101110
8347 101110 117814 114414 120836 74153 34608 15409 6556 708 -12466 -19950 3941 -1021 -13902
8334 -13902 -3222 47698 67058 53743 64771 71041 73592 39009 34670 30510 56592 70202 39722
8321 39722 1386 6004 32194 23182 22193 28279 42927 38231 29479 28236 29929 42145 47239 34978
8307C4978j0639K071m4428j3337J6316J7855L472Q803J8484L95n640J1721N318
8294D5369k388l5501K4304j3113J2009O143l791J4147K4181j1108M043J4l818
8281F0491k1015m1343j4076J8117J3590n300k4940L5246J9031j6071j9642M820
8269H908M5780K859m103j1666L860o794r172N361K2449R763k9211k0421Q899q454
8255A8058J792J2062J8335R229k3019k1404j0529J6189j903K756m295k138J0883
8242B6016J2813o272J1164l002m472K6672K5285l648n3293j2860n510J3531K312
8229B8736j0399K4894j5784j1705L0168R673l348j2048j612L195M096L722J9568
8216F9156Q633k1414m0723J8293J3779J1905j0541l1405o858J0003o218J0628
$$ plain form
8307 34978 24339 26410 -18018 -31355 -15039 2816 6288 15091 33575 33970 28330 40051 45369
8294 45369 42981 7480 31784 18671 30680 36823 33032 47179 71360 60252 64295 64309 60491
8281 60491 39476 -1867 -15943 2174 15764 10464 -14476 20770 39801 23730 4088 8908
8269 8908 54688 57547 53444 41778 45638 38844 29672 35033 57482 67245 38034 17613 26512 18058
8255 18058 19850 31912 50247 59476 36457 15053 4524 20713 18810 21566 17271 15133 26016
8242 26016 38829 32557 43721 40719 36247 62919 88204 84556 31263 18403 12893 26424 28736
8229 28736 18337 43231 27447 15742 45910 55583 52235 40187 38575 41770 45866 49588 69156
8216 69156 77789 56375 15652 33945 47724 59629 49088 17683 10825 20828 14610 25238
8204B5238m352r543N080N6477K8872j3420l5295J8577K2039j9092j3628O513L562
8191G1028l97k1623j0851J4411K0867j933J7428k7001k893j669j5386K8583k0365
8178E0199l897K006l1623q45L118K779p599j7568K2180K8043K4039j0872m4650
8165A5310j6747k998J7609k054N72M1694k629o097j1374j4405J3787K0028L01
8152E2997j2188L6326K6345j5467j5261l0670k3279k612P544L7853R217j5562
8140E5243J121m903R570p467J2754J5094k5215n621J0747k228J6537j1343j7830
8127D6459N765M660R780j3679r684Q966j2216q006K632J1881k6730n649m846j5115
8113e782R533N0908J2131j3894N987K8715j6379m4892l73n033l6563R13O461j0665
$$ plain form
8204 25238 20886 11343 16423 72900 101772 88352 53057 71634 93673 74581 60953 67466 71028
8191 71028 70631 49008 38157 52568 73435 71502 88930 61929 59036 57367 41981 70564 50199
8178 50199 46302 48308 16685 15840 18958 21737 14138 -3430 18750 46793 70832 59960 15310
8165 15310 -1437 -4435 13174 11120 11692 53386 50757 44660 33286 18881 32668 52696 52997
8152 52997 40809 77135 103480 88013 72752 42082 18803 16191 23735 61588 70805 55243
8140 55243 56364 51461 61031 53564 66318 81412 56197 50576 61323 59095 75632 64289 46459
8127 46459 52224 56884 66664 52985 43301 52267 40051 32045 34677 46558 19828 14179 9333 -5782
8113 -5782 3751 54659 66790 52896 58883 87598 71219 26327 25954 20921 -15642 -14729 -8268 -18933
8099a8933L1269K0643P491K753m230k4371j622P744N757K0202j0077K248Q730
8086D7604J906K247n045q232k6653J5430r909m3747o718K2923K148o604K3326
8073H676O554L075J3955K9832J724p159P047O033k9143j2082j485j5594j2145
8060g12J4653J6660Q979j2487l054J0747j284n609m838m346j3128j2440J8742
8047A1883J0552p503j5268j555N704R51j6767Q116M97j3226J2071K9417j4376
8034A0496J6559J6634j1182j5835J0960K8734j141j5087j4429L301J420P325j9344
8021A8411l0451J0113J9925K5302j4060l0802o099O838M935K463K596j3080o945
8008a0854J916L085K6957K1339J0345k2057j2896j2773r097J3233R008Q50Q618
$$ plain form
8099 -18933 12336 32979 40470 43223 38993 14622 13000 20744 26501 46703 36626 38874 47604
8086 47604 49510 51757 46712 38480 11827 27257 17348 -26399 -33117 -10194 -8046 -14650 8676
8073 8676 15230 18305 32260 62092 63816 56657 63704 69737 40594 28512 27027 11433 -712
8060 -712 13941 30601 39580 27093 24039 34786 33502 27893 23055 18709 5581 -6859 11883
8047 11883 22435 14932 -336 -1891 3813 4764 -12003 -3887 -3390 -16616 -4545 24872 10496
8034 10496 27055 43689 32507 16672 27632 56366 55225 40138 25709 29010 30430 37755 18411
8021 18411 -12040 -1927 17998 43300 29240 -1562 -7661 -823 4112 6575 9171 -3909 -10854
8008 -10854 -8938 -5853 21104 42443 52788 30731 17835 5062 -4035 9198 18206 19056 27674
7995B7674k1545Q318L366k7726k4731M04R097O183K1934R961M57j0958K6133j0901
7981A7666j7966j8027q652N259P224J5022j0055n888k2757L863J6898J2582m27
7968e258j3473P439k7944K713K6781K2189J1535J1500j4711k4793k8755J0059
7956b2718L6608j208j6793P022J0386N486k4638O415J1318q487J3335J5027r941
7943B1812j576J2157J135k3149k1975Q494J6161k2682r179P856j4267p764N410
7930b7567j350j0261k956K9668K0637k4197K388L6803J5212o915O857M358R52
7917D3629j3880j5893j9673J1030r465q845L781R150k167j0673R82j3845Q671
7904a7198J5797O290j7799J8643L7498j9348P110K7335J0400j9322j0516J1215
$$ plain form
7995 27674 6129 14447 17813 -9913 -34644 -34240 -25143 -18960 2974 12935 13392 2434 28567 17666
7981 17666 -300 -18327 -26979 -21720 -14496 526 -9529 -15417 -38174 -34311 -17413 -4831 -5258
7968 -5258 -18731 -11292 -39236 -36523 -9742 12447 23982 35482 20771 -4022 -32777 -22718
7956 -22718 13890 12682 -4111 2911 13297 18783 -5855 560 11878 3391 16726 31753 21812
7943 21812 20236 32393 33528 10379 -11596 -3102 13059 -9623 -18802 -10946 -25213 -32977 -27567
7930 -27567 -28917 -39178 -42134 -12466 8171 -16026 -13638 23165 38377 31462 38319 42677 43629
7917 43629 29749 13856 -5817 5213 -4252 -13097 -9316 -166 -2333 -13006 -12024 -25869 -17198
7904 -17198 -1401 4889 -12910 5733 43231 23883 30993 58328 68728 49406 38890 50105
7892E0105j4168l2319L999o597r452O031J64n986K306l1361k5562K3159J6751
7879b2930j8110l855M112m618L881J0317l770Q123j970j2539J0939J3512J7543
7866F35j616M888k9947r7R90K032J7219m2304m006L2409K4484J2072m35k5983
7852i659m181l1431p44N742N234J4592K3831j8621k456K3829j7113j3979J7489
7839g467Q693k950J110l76l715j3059j9526L1865J8367M782R856L890k6064m3518
7825c8112k2067J4653K7575J342j4982K5487Q925q286l3844k2933J5533K8273
7813a8436P879j8927k2081N640n84j4486R8K037J9945R206k907O971J5900J2690
7799B945L462p230Q937j1682n648k1769j1223L0801k1484N180k3147j2589K866
$$ plain form
7892 50105 35937 3618 7617 1020 -8432 -2401 -2237 -8223 -5917 -37278 -62840 -39681 -22930
7879 -22930 -41040 -44895 -40783 -45401 -41520 -31203 -34973 -26850 -28820 -41359 -30420 -16908 635
7866 635 -981 3907 -26040 -26137 -25147 -23115 -5896 -48200 -52206 -19797 4687 16759 16324 -9659
7852 -9659 -13840 -45271 -46015 -40273 -35039 -20447 3384 -15237 -17693 6136 -10977 -24956 -7467
7839 -7467 1226 -1724 -614 -990 -4705 -17764 -37290 -5425 12942 17724 27580 31470 5406 -38112
7825 -38112 -60179 -45526 -17951 -16609 -31591 -6104 2821 -5465 -39309 -62242 -46709 -18436
7813 -18436 -10557 -29484 -51565 -45925 -46509 -60995 -60897 -58860 -38915 -29709 -32616 -25645 -9745 2945
7799 2945 6407 -823 8114 -3568 -9216 -30985 -42208 -11407 -32891 -27711 -50858 -63447 -60581
7786f0581J3599R137o395l723J671k460j111L623j6143M335k1694K6133J5300
7773c8309j4495m570N3136N199l4874R765L492R269k4223k947P021K1952k9742
7760c9326o888K5407J7242Q21l6906j5724r296p482L1487j4446k3949l556R713
7747g2903J5068n415l2082m574K1244N177J0334R063L7903R849k3485k1862m076
7734e5759L882J477J560m204K9524O798j2867j8602R096o52j6968j5820R030j5573
7720g9078j6005L1756K4086J6113J3231k661n2503k0716j6754j34K5687n891j0886
7707i3755j1224N341J6757L2011q582o3257k2583J6387M8549J6076J5650p122
7695e5752l22n663o073J4624K6562j883k1979J2952P150n442j5578j9707Om422
$$ plain form
7786 -60581 -46982 -37845 -44240 -47963 -46292 -48752 -49863 -46240 -62383 -58048 -79742 -53609 -38309
7773 -38309 -52804 -57374 -4238 961 -33913 -24148 -20656 -11387 -35610 -38557 -31536 -9584 -39326
7760 -39326 -46214 -20807 -3565 -2744 -39650 -55374 -64670 -72152 -40665 -55111 -79060 -82616 -72903
7747 -72903 -57835 -63250 -95332 -99906 -78662 -73485 -63151 -54088 -16185 -6336 -29821 -51683 -55759
7734 -55759 -51877 -50400 -48840 -53044 -23520 -16722 -29589 -48191 -39095 -39747 -56715 -72535 -63505 -79078
7720 -79078 -95083 -63327 -39241 -23128 -9897 -12558 -65061 -85777 -102531 -102665 -76978 -82869 -93755
7707 -93755 -104979 -99638 -82881 -50870 -59452 -122709 -145292 -128905 -80356 -64280 -48630 -55752
7695 -55752 -56074 -61737 -67810 -53186 -26624 -28507 -50486 -37534 -30384 -35826 -51404 -71111 -71105 -75527
7681g5527J1855L383M757k6930j7642M613M3456L0331J5895N896k4729l9647R333
7668e4956J5390O535r054j0084o220j1984J5454J8261N436k4532j6352m064Q334
7655f7836J2522L1120Nk6469j1785J7822j1341j4010j6861J0048P831O309m698
7642f7343P91J8355J5934K2996o066n966j9701n258r156k6238j9003k4707K4720
7629a00642L199K7512J9699q382l819l093K1469l947N642q943o568J1507J0806
7616c5560q953k3205k6371L6682L1553J2938p176p309m198q899p736p785j3448
7603f9467K7045Q442n411r035q327m516j2414J5996K9845L437n341k8442q650
7590f6838Q88q800J2393P081j759J4496l1018l4257k2778N2625K0021j2455k5437
$$ plain form
7681 -75527 -63672 -60289 -55532 -82462 -100104 -95491 -52035 -21704 -5809 87 -24642 -64289 -54956
7668 -54956 -39566 -33031 -42085 -52169 -58389 -70373 -54919 -36658 -31222 -55754 -72106 -76170 -67836
7655 -67836 -55314 -24194 -24189 -50658 -62443 -44621 -55962 -69972 -86833 -76785 -68954 -62645 -67343
7642 -67343 -66552 -48197 -32263 -9267 -15333 -21299 -41000 -46258 -55414 -81652 -100655 -125362 -100642
7629 -100642 -97443 -69931 -50232 -58614 -62433 -65526 -44057 -48004 -42362 -51305 -57873 -46366 -35560
7616 -35560 -44513 -67718 -94089 -57407 -25854 -12916 -20092 -27401 -31599 -40498 -48234 -56019 -69467
7603 -69467 -42422 -33980 -39391 -48426 -56753 -61269 -73683 -57687 -27842 -24405 -29746 -58188 -66838
7590 -66838 -65950 -74750 -62357 -55276 -57035 -42539 -73557 -107814 -130592 -77967 -57946 -70401 -95838
7577i5838R87M5609N6902j2371l2246k1675j796R509J3734j2053j7075O930p374
7564f6757j7739j7151M369J1169J1837n954j0871J3658j7571J1003K7093j1750
7552f8664j3497N486Q76J6708J2220k1661L506J1638J2602j7853o556m818m9774
7539a19787K162K5930J1962P827j2495p095MR709O503j6760j4911n165j4926K2165
7525a04877K8897k9040k6591j4614N498L0984M682K1752o673j375J7107K636j1961
7512h3575Q229K6651K6724j3197r945r217J2863o827k2239J7563J3238j3310l7355
7499i0397k96J3643J8538M816J2302j4084N934k671J046K2643r385l5277J0969
7486f2219K1441n933J882L2388Q438j5803j2077j7646j2642K0593L733J907J0770
$$ plain form
7577 -95838 -94851 -49242 7660 -4711 -36957 -58632 -60428 -50919 -37185 -49238 -66313 -59383 -66757
7564 -66757 -84496 -101647 -97278 -86109 -74272 -80226 -91097 -77439 -95010 -84007 -56914 -68664
7552 -68664 -82161 -76675 -75799 -59091 -46871 -68532 -65026 -53388 -40786 -58639 -65195 -70013 -119787
7539 -119787 -117625 -91695 -79733 -71906 -84401 -91496 -91492 -81783 -75280 -92040 -106951 -112116 -127042 -104877
7525 -104877 -75980 -105020 -131611 -146225 -140727 -109743 -105061 -83309 -89982 -91357 -74250 -71614 -83575
7512 -83575 -75346 -48695 -21971 -35168 -45113 -54330 -41467 -48294 -70533 -52970 -39732 -53042 -90397
7499 -90397 -90693 -77050 -58512 -53696 -41394 -55478 -49544 -52215 -51169 -28526 -37911 -73188 -62219
7486 -62219 -40778 -46711 -44829 -12441 -4003 -19806 -31883 -49529 -62171 -41578 -37845 -35938 -25168
7473b5168m255j3200o83l4146J7215K2544K164k3082N471J1299K2368N198o845
7460b1120j8950Q049j0377Q502K1466P242j2978k4819j3465n239Q647J9126j3758
7447d7674j1050j1740m739J5059L901O327k258J7980j7393m6010J8555K6677L1826
7434b0539J690k1442J1570J6003J3645O41k9530l6552k642m615J6501p096J3102
7421d9264k149J152J5985J8767p215j6084l0383j7017J6063q490J864K1579L86
7408e4806R845j3976J5422L3274J8052j7787l9946M585K3830Q308J3300p549q218
7395a5666K1527j6183l3546M052l3048M65o190Q333K5093K3010Q811j2453o594
7382c2389j3734m3586q874L536k490k6240Q789J3807O678K4593K8512K628j037
$$ plain form
7473 -25168 -29423 -42623 -43306 -77452 -60237 -37693 -35529 -58611 -53140 -41841 -19473 -14275 -21120
7460 -21120 -40070 -32021 -42398 -33896 -12430 -5188 -18166 -42985 -56450 -61689 -53042 -33916 -47674
7447 -47674 -58724 -70464 -75203 -60144 -56243 -49916 -52174 -34194 -51587 -97597 -79042 -52365 -20539
7434 -20539 -18849 -40291 -28721 -12718 927 1568 -27962 -64514 -67156 -71771 -55270 -62366 -49264
7421 -49264 -51413 -50261 -34276 -15509 -22724 -38808 -69191 -86208 -70145 -78635 -76771 -55192 -54806
7408 -54806 -44961 -58937 -43515 -10241 7811 -9976 -49922 -45337 -21507 -13199 101 -7448 -15666
7395 -15666 5861 -10322 -43868 -39816 -72864 -72399 -78589 -70256 -45163 -22153 -13342 -25795 -32389
7382 -32389 -46123 -89709 -98583 -95047 -97537 -123777 -114988 -101181 -94503 -69910 -41398 -38770 -39807
7369c9807k1987m861J9799J0085M892m528j5349N557n836J2686J2060p040o424
7356d0753m441q097J7967L7089j9094r046k660J4421l0603j600r773k8133P18
7343h4005K8397K6232R440N913r090j6194l2996M387L1061O299j4105k0701l3195
7330i8557j326L7390j801M868J4159K8132k450j2304o164j0598O602j5123j9018
7317g6190j1976j1969J734K3283p575L950J2350J506K614K2311L715j5817J0340
7304d1724j5617k212M721K8283J3955J0499P812r40l3278p572J3000J4632j1896
7291b0337j1965r542o812j2901J949J1321j5996J6063J9581k8609j7665Q693J5357
7278e0863L305L64k8068J0443J182n112J1156O246J6923m896P16J9458l416l690
$$ plain form
7369 -39807 -61794 -66655 -46856 -36771 -31879 -36407 -51756 -46199 -52035 -39349 -27289 -34329 -40753
7356 -40753 -45194 -53291 -35324 1765 -17329 -26375 -29035 -14614 -45217 -46817 -56590 -84723 -84005
7343 -84005 -55608 -29376 -19936 -14023 -23113 -39307 -72303 -67916 -36855 -30556 -44661 -65362 -98557
7330 -98557 -99883 -62493 -64294 -59426 -45267 -17135 -19585 -31889 -38053 -48651 -42049 -57172 -76190
7317 -76190 -88166 -100135 -98401 -75118 -82693 -78743 -66393 -64887 -62273 -39962 -36247 -52064 -41724
7304 -41724 -57341 -59553 -54832 -26549 -12594 -2095 5717 4777 -28501 -36073 -23073 -8441 -20337
7291 -20337 -32302 -41844 -48656 -61557 -59608 -48287 -64283 -48220 -28639 -57248 -74913 -66220 -50863
7278 -50863 -47558 -47194 -75262 -64819 -63637 -68749 -57593 -51347 -34424 -39320 -38604 -19146 -22562 -26252
7264b6252m289L170J3322m280k0551j331j1889r435J3067r353P021K1902l601
7251c2499k0075j4753J0623J7468j5979j8413J1224K5606k2673k0656P077O320
7239f6730j2044J4756K2650m702J2360n15j1789o381J9551J6214j2167l0222k4510
7226h3529m2K3890J7098j98K445P932L057p700p132m113L799n519Q578N403J1320
7211b4711J5602k4175k0162o31k1780j1752R563P161J0233J2692K3936o838l0870
7198f1732N743n317o881J6392K1801j757L1254M893p700r281n859J5496k1777
7185b4725l5463p083o30K4248J2545k708j1933k694l1073j9131M6727J5310p289
7172d3899l95J4695j2296M198J2928j6020k4275P521K6858J480j3758J410j6950
$$ plain form
7264 -26252 -30541 -27371 -14049 -18329 -38880 -40211 -52100 -61535 -48468 -57821 -50800 -28898 -32499
7251 -32499 -52574 -67327 -56704 -39236 -55215 -73628 -62404 -36798 -59471 -80127 -73050 -66730
7239 -66730 -78774 -64018 -41368 -46070 -33710 -34225 -46014 -52395 -32844 -16630 -28797 -59019 -83529
7226 -83529 -83571 -59681 -42583 -42781 -40336 -32404 -29347 -37047 -44179 -48292 -44493 -50012 -41434 -36031 -24711
7211 -24711 -9109 -33284 -53446 -54077 -75857 -87609 -78046 -70885 -60652 -47960 -24024 -30862 -61732
7198 -61732 -55989 -61306 -68187 -51795 -29994 -31751 -497 4396 -3304 -12585 -18444 -2948 -24725
7185 -24725 -60188 -67271 -67901 -43653 -31108 -33816 -45749 -48443 -79516 -98647 -51920 -36610 -43899
7172 -43899 -44294 -29599 -41895 -37697 -24769 -40789 -65064 -57543 -30685 -29205 -42963 -41553 -58503
7159e8503n204j819P998P18K0010P43j3458j4025j1390N812J1107r18q088K292
7145f4725k185J8029J1468q286R000J5651q316k8273n479M31N600J3175k907j6572
7131f3389J4163J7107J60r400M791K206J0809j4595j7210M50R345j4472L696K7003
7117b9336k846K325j6656j3617R214k1868O648K2893R661k0688j9780L1659p4
7104d2465j7313K3967j714J1112K0704J5197k0937k4259J3739p855k7637L486
7092e3975J7005J0114K7141j6822k35j889k8920k709O836l1905k3734K2531J8772
7079e7790r415n096m036q300P917L2212J6812n05J2309k5449n131K0458K1052
7066d962J05Q44p230k3665o416m727l7680m531j4424L4095J4105K2986M060K263
$$ plain form
7159 -58503 -63707 -65526 -57528 -56810 -36800 -36057 -49515 -63540 -74930 -69118 -58011 -58929 -67017 -64725
7145 -64725 -66910 -48881 -37413 -45699 -36699 -21048 -29364 -57637 -63116 -62685 -57085 -43910 -46817 -63389
7131 -63389 -49226 -32119 -31959 -41359 -36568 -34362 -23553 -38148 -55358 -54908 -45563 -60035 -56339 -29336
7117 -29336 -32182 -29857 -46513 -60130 -50916 -72784 -66136 -43243 -33582 -54270 -74050 -42391 -42465
7104 -42465 -59778 -35811 -37525 -26413 -5709 9488 -11449 -35708 -21969 -29824 -57461 -53975
7092 -53975 -36970 -26856 285 -16537 -16772 -18661 -47581 -50290 -43454 -75359 -99093 -76562 -57790
7079 -57790 -67205 -72301 -76337 -84637 -76720 -44508 -27696 -28201 -15892 -41341 -46472 -26014 -4962
7066 -4962 -4857 -4013 -11243 -34908 -41324 -46051 -83731 -88262 -102686 -68591 -54486 -31500 -27440 -25177
7052b5177j2512k9672l540R710K4789q176o783J5016O803m3869K1712K8205Q425
7039a5069j2504j7332R555J2652j8740N987K0658J4300k7427n870J8715k258j7265
7026c4598k0059n725L4750K2426K673j5930n6043k14M8753K8588N912M90q880
7013B143j7195k0980k4k2546l5505K0124J6045L703J9537n702r048K4017J5707
7000i724R772j1832j9857N261j6035k3851R681J5391j8957n910O17O130L205m811
6986f0920j2622l14M7L5822J2J092L6682J358J4124j3996l3813m939j4463p57
6972e2687j2598J8064m004L296R877M5790n475j4936p359k2982k4164j2744K2370
6959e7552J4810N643L75r30J5118j4220l4336K955j2157P381J7964J0852q965
$$ plain form
7052 -25177 -37689 -67361 -70901 -61191 -36402 -44578 -51361 -36345 -29542 -73411 -51699 -23494 -15069
7039 -15069 -27573 -44905 -35350 -22698 -41438 -35451 -14793 -493 -27920 -33790 -15075 -17333 -34598
7026 -34598 -54657 -60382 -25632 -3206 -533 -16463 -72506 -72720 -23967 4621 10533 11023 2143
7013 2143 -15052 -36032 -36056 -58602 -94107 -73983 -57938 -54235 -34698 -40400 -49448 -25431 -9724
7000 -9724 48 -11784 -31641 -26380 -42415 -66266 -56585 -41194 -60151 -66061 -65444 -59314 -56109 -60920
6986 -60920 -73542 -73856 -73809 -37987 -37975 -36883 -201 1157 15281 1285 -32528 -37467 -51930 -52687
6972 -52687 -65285 -47221 -51225 -47929 -38052 7738 2263 -12673 -20032 -43014 -67178 -79922 -57552
6959 -57552 -42742 -37099 -36724 -37654 -22536 -36756 -71092 -68137 -80294 -72913 -54949 -44097 -53062
6946e3062K760k7390J673M2827J1105j2216J0718l883j0178q324J5603J8406J9522
6933G561Q357j4687j4380p425J8363R008P496k7842k1194R187J5254K511J1027
6920C236L161j5703j4498m994n973k4589n802m702J9472R929K2231r937j9896
6907d8065J153K0775L0289J5434J879K649k5837j2677p883N839N946q861j0543
6894b9902j9226P881j2813R209L7604j403j1455j0976L183j6213k5320K0441J3850
6881c5140l168K443K0584L619j3431m888n359l923l6955K073J6412L0947J5666
6868a1120j3308J192p832j1253J5350j4086j9770j1362M427N789K1773j2804l2257
6855h5261j0784J0243J3402R347P636K4160J5631Q60k7958q094K1055p867k193
$$ plain form
6946 -53062 -50302 -77692 -76019 -33192 -22087 -34303 -23585 -27468 -37646 -45970 -30367 -11961 7561
6933 7561 15918 1231 -13149 -20574 -2211 6797 14293 -13549 -34743 -25556 -10302 -7791 3236
6920 3236 6397 -9306 -23804 -28798 -34771 -59360 -65162 -69864 -50392 -40463 -18232 -28169 -48065
6907 -48065 -46912 -26137 4152 19586 21465 24114 -1723 -14400 -22283 -16444 -10498 -19359 -29902
6894 -29902 -49128 -41247 -54060 -44851 -7247 -8650 -20105 -31081 -27898 -44111 -69431 -48990 -35140
6881 -35140 -38308 -35865 -15281 -11662 -25093 -29981 -35340 -39263 -76218 -74145 -57733 -26786 -11120
6868 -11120 -24428 -23236 -31068 -42321 -26971 -41057 -60827 -72189 -67762 -61973 -40200 -53004 -85261
6855 -85261 -96045 -85802 -72400 -63053 -55417 -31257 -15626 -14766 -42724 -50818 -29763 -37630 -39823
6842c9823n802l1971k4866K2837P408J4623k3366p256L212K384P724l43k5219
6829a00458N555J0712J4469P282J9218J088j8591J1461J9183l533n996J0247R784
6816a9579J5279L814j8255k3936p13j8260M309J8019k385o089L7853M52l2651
6803d2142j859l787K8279j530J2009k460k5039k4580m296J8921J4704n800o019
6790d3599J6484Q435j2221k5436l543L0114Q263j8590J1425r375p324J0190J8376
6777a6801J3962P204k6419l3533n18j0578j2901J6011J2164J3848J3910L291j4527
6764c4887p897o574M0179N083Q671R526k547m896j0089j1518j0840n468q248j0512
6750e0017O762K8755P282J290j7521k5906l824L2347K5397J6315n719q795k2899
$$ plain form
6842 -39823 -45625 -77596 -102462 -79625 -72217 -57594 -80960 -88216 -85004 -82620 -74896 -75239 -100458
6829 -100458 -94903 -84191 -69722 -62440 -43222 -42134 -60725 -49264 -30081 -33614 -39610 -29363 -19579
6816 -19579 -4300 -486 -18741 -42677 -43390 -61650 -57341 -39322 -41707 -47796 -9943 -9491 -42142
6803 -42142 -44001 -47788 -19509 -21039 -9030 -11490 -36529 -61109 -65405 -46484 -31780 -37580 -43599
6790 -43599 -27115 -18680 -30901 -56337 -59880 -29766 -21503 -40093 -28668 -38043 -45367 -35177 -16801
6777 -16801 -2839 4365 -22054 -55587 -56105 -66683 -79584 -63573 -51409 -37561 -23651 -20360 -34887
6764 -34887 -42784 -49358 -9179 -4096 4575 14101 11554 6658 -3431 -14949 -25789 -31257 -39505 -50017
6750 -50017 -43255 -14500 -7218 -5928 -23449 -49355 -53179 -20832 4565 20880 15161 6366 -16533
6737a6533j0812J2272Q956m078k2142J1418J0936K0869j5073j0230Q396l182J0980
6724A777k616M041p179K1463O362j3541j7026k7226p397Q114j528m268n343k4215
6710f8582j3703M791n970K3937L2451j6539J667J7218M749k5696M977q788k6280
6697g5768J4114L6541P981j3251K940J0575Q534P316R672k8017m1494K754J7439
6684d0664K5881K654M350N244j5210j8565k5125J8647P704M009l069K4018L485
6671f641k3971j8586J5814M223l246j6261j7566K2864J7699j0393L9880P597k9609
6658a8196j0002P138k632n017j4693m394J7884L1703R950j5151j7232J10q329
6645b8861M529J6977k2128L958K9111L41k5333k7372K7218J9271K411L619l433
$$ plain form
6737 -16533 -27345 -15073 -6117 -10195 -32337 -20919 -9983 10886 -4187 -14417 -6021 -9203 1777
6724 1777 -839 3202 -3977 17486 23848 10307 -6719 -33945 -41342 -33228 -34756 -39024 -44367 -68582
6710 -68582 -82285 -77494 -83464 -59527 -27076 -43615 -41948 -24730 -19981 -45677 -40700 -49488 -75768
6697 -75768 -61654 -25113 -17132 -30383 -27443 -16868 -8334 -1018 8654 -19363 -60857 -58103 -40664
6684 -40664 -14783 -12129 -7779 -2535 -17745 -36310 -61435 -42788 -35084 -31075 -34144 -10126 -6641
6671 -6641 -30612 -49198 -33384 -29161 -32407 -48668 -66234 -43370 -25671 -36064 3816 11413 -18196
6658 -18196 -28198 -21060 -23692 -28709 -43402 -47796 -29912 1791 11741 -3410 -20642 -20532 -28861
6645 -28861 -24332 -7355 -29483 -25525 3586 3927 -21406 -48778 -21560 -2289 122 3741 308
6632C08m165r829n673j2785j9136o750j2980l201M0923Q140Q26p395J242j9262
6618d9737j0702m06J1973J6443o835j4987k1781j4824M3645R727K9217J9893K172
6605A3798l7035l6647j4127J9822K0717K1705L977l8243l3867J2967o46M232j4909
6592g8256k3995K5468L7684N788L9K0928J1011J41n004l0845k3409l1590J3420
6579g8620K2750J967J2399N463M161M412k334K813K7915k335j9145k8051J0538
6566c8067M656R180m559q202q933m426Q551M2020J9189j9573k0030N490q177l363
6552b6244L0195k0917l9240m322Q667k921l1809J1389k331K1339L8429l833j7497
6539c9095r430N081L228R130J4646j3312p08K0649J6219j3338j6362j5453j9083
$$ plain form
6632 308 -3857 -13686 -19359 -32144 -51280 -58030 -71010 -74211 -33288 -25148 -24322 -31717 -30475 -49737
6618 -49737 -60439 -60845 -48872 -32429 -39264 -54251 -76032 -90856 -47211 -37484 -8267 11626 13798
6605 13798 -23237 -59884 -74011 -54189 -33472 -11767 -7790 -46033 -79900 -66933 -67579 -63347 -78256
6592 -78256 -102251 -76783 -39099 -33311 -33272 -12344 -1333 -1192 -6196 -37041 -60450 -92040 -78620
6579 -78620 -55870 -53903 -41504 -36041 -31880 -27468 -29802 -26989 926 -1409 -20554 -48605 -38067
6566 -38067 -33411 -24231 -28790 -36992 -45925 -50351 -41800 220 19409 -164 -20194 -14704 -22881 -26244
6552 -26244 3951 -16966 -56206 -60528 -51861 -54782 -86591 -75202 -77533 -56194 -17765 -21598 -39095
6539 -39095 -48525 -43444 -40216 -31086 -16440 -29752 -30460 -9811 6408 -6930 -23292 -38745 -57828
6526e7828j845J2415K750N427k0297l609R315J6740J2342j4811k4833J1802j1718
6513f4150l8418J1357N0737J2093j9486m795k0696K756Q674K3076o571J1708J8187
6500a5528J3307Q118k1973j8334J8238J6917j1304k2904k4772J1371L0161P670
6488i033j4797J948r471P187J1831J905m129l3307k0692J3770M114J9985Q522
6475b2167n146l874r594R107Q591m315r410J6857J8029j85m8984j8030M0609P218
6461b1294j8506K1995R916k7373J063L5135O224k0449Q888j173j2946k5422O651
6448c7291k360j9926m272J2517J7679J4967P818J0756n812k3245K6161J2536j5554
6435f026k0970j9448p007K3342Q388N188o914K8864p983j3312M157J280n767r413
$$ plain form
6526 -57828 -59673 -47258 -44508 -39081 -59378 -62987 -53672 -36932 -24590 -39401 -64234 -52432 -64150
6513 -64150 -102568 -91211 -40474 -28381 -47867 -52662 -73358 -70602 -61928 -38852 -45423 -33715 -15528
6500 -15528 -2221 5897 -16076 -34410 -16172 745 -10559 -33463 -58235 -46864 -16703 -9033
6488 -9033 -23830 -21882 -31353 -24166 -12335 -10430 -14559 -47866 -68558 -54788 -50674 -30689 -22167
6475 -22167 -27313 -31187 -40781 -31674 -23083 -27398 -36808 -19951 -1922 -2107 -51091 -69121 -28512 -21294
6461 -21294 -39800 -17805 -7889 -35262 -34199 936 7160 -13289 -4401 -5574 -18520 -43942 -37291
6448 -37291 -39651 -59577 -63849 -51332 -33653 -18686 -10868 -112 -5924 -29169 -3008 9528 -6026
6435 -6026 -26996 -46444 -53451 -30109 -21721 -16533 -23447 5417 -2566 -15878 -11721 -10441 -16208 -25621
6421b5621j7499O985L8085L627l087j0324k072O081J5557j7926j3332M720k4128
6408c8934J5486L2919R522k9630j4060o597j102j0245M525j2632o011P879R518
6395c9362P614m5q352k3725J1320J1978J2531j4311p838P413J7012J074n68J0136
6381a5123k5872k0574J0900p233J648N335R989J654l644K979p450J9221l622J4620
6367a7172j8717j8872j8116R934J5989J3180R548k1402j0085J2447N040m736J8074
6354b4888P018J1917k6678l6855K16L4454M27j7360J3800R018J7265k151R37k769
6340a5649l1187j2416j0098j1457k3905J2523J9849K4685K4925K8622J4149L473
6328B3514m992m246j8105j3567Q929M948k5368l5736K005K9110M764l925L8289
$$ plain form
6421 -25621 -43120 -36135 1950 5577 2490 -7834 -9906 -3825 11732 -6194 -19526 -14806 -38934
6408 -38934 -23448 9471 18993 -10637 -24697 -31294 -32396 -42641 -38116 -50748 -56759 -48880 -39362
6395 -39362 -31748 -31793 -40145 -63870 -52550 -40572 -28041 -42352 -50190 -42777 -25765 -24691 -25259 -15123
6381 -15123 -40995 -61569 -50669 -57902 -56254 -50919 -40930 -39276 -42920 -39941 -47391 -28170 -31792 -17172
6367 -17172 -35889 -54761 -72877 -62943 -46954 -33774 -24226 -45628 -55713 -43266 -38226 -42962 -24888
6354 -24888 -17870 -5953 -32631 -69486 -69270 -34816 -34389 -51749 -37949 -28931 -11666 -13817 -12880 -15649
6340 -15649 -46836 -59252 -69350 -80807 -104712 -92189 -72340 -47655 -22730 5892 20041 23514
6328 23514 18522 14276 -3829 -17396 -8467 -3519 -28887 -64623 -62618 -33508 -28744 -32669 5620
6315E620m97k9283j5513O720R582M905r948l060k1086o734M6139J4753l7355k8993
6301f4750K377N207n082P813r399K507L6638j129j9309j9692M868k4450J7825
6288f6576N6487o64j8156J2491l010n327j2642j0018j0219L258j676J221L5297
6275a9534L9653o920k8009r82J4168j847Q94O265n836M038k5527j0371J7580J7773
6261A345j8582k2769K541l156J9133k622l1062j6529J4099R715k4633R782M599
6248e8139K1942q73N2q011j5660O588j4644J3853K4135j1671k895j1982N290j2394
6234f4409j5934J3754K9043O70Q86R087j2811k4667R313J4059j586l006j1876
6221e7477m239J2251N279j060M853Q08m534k9103P062J3560P828M353q38j9752
$$ plain form
6315 5620 5123 -24160 -39673 -32953 -23371 -18466 -28414 -31474 -52560 -59294 -13155 1598 -35757 -64750
6301 -64750 -62373 -57166 -62248 -54435 -63834 -61327 -24689 -25818 -45127 -64819 -59951 -84401 -66576
6288 -66576 -10089 -10753 -28909 -16418 -19428 -24755 -37397 -47415 -57634 -54376 -56052 -54831 -19534
6275 -19534 20119 13199 -14810 -15792 -1624 -3471 -2577 3688 -2148 1890 -23637 -34008 -16428 1345
6261 1345 -17237 -40006 -37465 -40621 -21488 -24110 -55172 -71701 -57602 -47887 -72520 -62738 -58139
6248 -58139 -36197 -37070 -37018 -45029 -60689 -54101 -68745 -54892 -30757 -42428 -45323 -57305 -52015 -64409
6234 -64409 -80343 -66589 -37546 -36876 -35990 -26903 -39714 -64381 -55068 -41009 -42595 -45601 -57477
6221 -57477 -61716 -49465 -44186 -45246 -40393 -39585 -44119 -73222 -66160 -52600 -44772 -40419 -41257 -61009
6207f1009J1882j110k0660j4934K9866J6017j6689N891K0120L6311J0072k5286
6195i529n2420J3732J4607j3791j14K3435R19K7391j6609k1553Q39J7427m635
6182b0301k3976J4723P828K6530K2486j1729n100O583r772j3519J0866r646k7431
6169c2458K4884K2989l3022j0614N064k9343r466K1838L3258J337k4618j5848
6157d5999k9304J287R415M5965k4536k5095l7550p235K3982L2297L5764j3496
6145c4505k7402L9894l475j4916l28k286J0086P363j5687j4344M584m476P443
6132d8049K5840K2163N350k5179k8491J7758M571J2089O036J4088K1090k5103
6120B163j0398O089q612j5959p323P627J6993K3707N429j1570o469J2626k8250
$$ plain form
6207 -61009 -49127 -50237 -70897 -85831 -55965 -39948 -56637 -50746 -30626 5685 15757 -9529
6195 -9529 -61949 -48217 -33610 -47401 -47515 -24080 -23161 4230 -12379 -33932 -33093 -15666 -20301
6182 -20301 -44277 -29554 -21726 4804 27290 15561 10461 17044 7272 -6247 4619 -5027 -32458
6169 -32458 -7574 15415 -17607 -28221 -23157 -52500 -61966 -40128 -6870 -5533 -30151 -45999
6157 -45999 -75303 -74016 -64601 -18636 -43172 -68267 -105817 -113052 -89070 -56773 -21009 -34505
6145 -34505 -61907 -22013 -25488 -40404 -40732 -43018 -32932 -25569 -41256 -55600 -51016 -55492 -48049
6132 -48049 -22209 -46 5304 -19875 -48366 -30608 -26037 -13948 -7912 6176 27266 2163
6120 2163 -8235 -2146 -10758 -26717 -34040 -26413 -9420 14287 19716 8146 1677 14303 -13947
6107a3947J4521K748P332m9j2862r452k4065P03p089L3209J7033n067j8365L245
6093a2105o549J6080J8660l2848l5437R385J4789j406j3168j4706Q305N134L339
6080d0527L1499J3687k0731J459o33q449J6068J4146j8k3470k0866L740L6820
6067B725K9109j3229k9810M39j3824J2130j2276r488l123o821k9583m761J7277
6054f1235K5136L4532K263j1105J2661K223j1855j0992K088O780j7531J4575p974
6041b0434J1505K4031j4616K503J3700k5348j3367J3730L798N99j7068l176J9027
6028e116J257P70j0926l39J4595o235k303J3357j1185j8925k577l5644m783R142
6014e8912k10L1194K0325J0709J4846j371j9974j3875J983J0745J09j3819j4717
$$ plain form
6107 -13947 574 3322 10654 10605 -2257 -11709 -35774 -35071 -42160 -8951 8082 3015 -15350 -12105
6093 -12105 -18654 -2574 16086 -16762 -52199 -42814 -28025 -29431 -42599 -57305 -49000 -43866 -40527
6080 -40527 -9028 4659 -16072 -14613 -15246 -23695 -7627 6519 6501 -16969 -37835 -34095 2725
6067 2725 31834 18605 -11205 -10766 -24590 -12460 -24736 -34224 -37347 -44168 -73751 -78512 -61235
6054 -61235 -36099 -1567 696 -10409 2252 4475 -7380 -18372 -16284 -9504 -27035 -12460 -20434
6041 -20434 -8929 15102 486 2989 16689 -8659 -22026 -8296 -4498 -3899 -20967 -24143 -5116
6028 -5116 -3859 -3089 -14015 -14354 241 -5994 -8297 5060 -6125 -25050 -27627 -63271 -68054 -58912
6014 -58912 -59122 -27928 -7603 3106 17952 16581 -3393 -17268 -15285 -4540 -4431 -18250 -32967
6001c2967J2643P606R048Q646K4294M165k9206j8051j6226J3119r162J9482J6558
5988I949J7986l841k6074k9553m624p060j989J010J279k095l0426K6640j0767
5975e9565n867k177n119N196M0975K1608j4286J881l345k3700j4624J1099N95
5962d7329J485L0224L252Q639p705n476K4942p239j5091k1728j4683N944Q576
5949c6189m280O875J7078L6238J3813j1094j4753l3300K369L2399p901O556J7117
5936B4928k9607m4336O069J0860j0953r289N42J0474p264K208j0261O158M9280
5923a191J3621N5Q199K4509L1720J4577j4718j8405j5025k6702k6674k9202k158
5910d1394L131k7640J0955R798K2005l550P016k240N477J6508K7722l8805k5584
$$ plain form
6001 -32967 -20324 -12718 -3670 4976 29270 33435 4229 -13822 -30048 -16929 -26091 -6609 9949
5988 9949 27935 24094 -1980 -31533 -36157 -43217 -45206 -44196 -42917 -45012 -75438 -48798 -59565
5975 -59565 -65432 -67609 -72728 -67532 -26557 -4949 -19235 -17354 -20699 -44399 -59023 -47924 -47329
5962 -47329 -45844 -15620 -12368 -3729 -11434 -16910 8032 793 -14298 -36026 -50709 -44765 -36189
5949 -36189 -40469 -33594 -16516 19722 33535 22441 7688 -25612 -23243 9156 1255 7811 24928
5936 24928 -4679 -49015 -42946 -32086 -43039 -52328 -51786 -41312 -48576 -46368 -56629 -50471 -1191
5923 -1191 12430 12485 20684 45193 76913 91490 76772 58367 43342 16640 -10034 -39236 -41394
5910 -41394 -38263 -65903 -54948 -45150 -23145 -26695 -19679 -21919 -16442 66 27788 -11017 -36601
5897c6601P854l75J6011L6873K4546k6251j7373o731R048k3804j2880L2119K3384
5884B5820j1127j5100P30K9858Q717l2289o19j3068Q414j144k4997k7963j7465
5871g0233K5306k1519J3446J6577M018M539o775q184P180K4328L894J656J8297
5858A2530J8515j696k5446j2985J0998j0979j0723j3083j3279p944K054P756K4401
5845a9881K3411N835J5387r85j7754J3694o85k1048j2161P432R76n015N335j9733
5831b5192p444J0005O43K7130K408j1680j0346n473J263j7106l591L1171K1802
5818A3590k2361m7441j0599L9639R737Q48o079R097n4J6616K0378j0217o092j571
5804E491j1060j0805J559N824J1046k4133j3076K040O121J313P763J2777J9210
$$ plain form
5897 -36601 -28747 -29122 -13111 23762 48308 22057 4684 -2047 7001 -16803 -29683 2436 25820
5884 25820 14693 -407 323 30181 38898 6609 5990 -7078 1336 192 -24805 -52768 -70233
5871 -70233 -44927 -66446 -53000 -36423 -32405 -27866 -34641 -42825 -35645 -11317 -7423 -5767 12530
5858 12530 31045 29349 3903 -9082 1916 -9063 -19786 -32869 -46148 -54092 -52038 -44282 -19881
5845 -19881 3530 9365 24752 23767 6013 19707 19022 -2026 -14187 -6755 -5779 -10794 -5459 -25192
5831 -25192 -32636 -22631 -21988 5142 7550 -4130 -14476 -19949 -18686 -35792 -39383 -8212 13590
5818 13590 -8771 -56212 -66811 -27172 -17435 -16587 -22666 -13569 -13623 2993 23371 13154 7062 5491
5804 5491 -5569 -16374 -14815 -8991 2055 -22078 -35154 -33114 -26993 -25680 -17917 -5140 14070
5791A4070J0396J5392J914l718p401j0682q829k3446j3963J9910r747R47K7760
5778A2603p588r122q162L9636q447j0747J5259j5543k2042K501J2177j3928l2616
5765d6019n234L1161J0859n071k4700p497Q912j2560j1487o502M009J9169L8625
5752f335K5316K5264k9560n1324l8862K115L6136K3966r773M040J3156J0898N627
5739A0664K668j5584j9827J6686J9117j3454j3354J8619M926j0947p785j318J0125
5726E36j6002J927p916J988J4753K4088j5838m4353j6170J1268L627J1097K7932
5713c063L0705l473l3378J8619J500k0972K478N954p063j2052j5529K3344R700
5700c230k7633j392J7311p927M253R035P767M243k1n322l99J9329p400j7507K706
$$ plain form
5791 14070 24466 39858 41772 38054 30653 19971 11142 -12304 -26267 -6357 -16104 -15157 12603
5778 12603 5015 -4107 -12269 27367 18920 8173 23432 7889 -14153 -11652 525 -13403 -46019
5765 -46019 -51253 -20092 -9233 -14304 -39004 -46501 -37589 -50149 -61636 -68138 -64129 -44960 -6335
5752 -6335 18981 44245 14685 -36639 -75501 -73386 -37250 -13284 -23057 -19017 -5861 5037 10664
5739 10664 13332 -2252 -22079 -5393 13724 270 -13084 5535 10461 -486 -8271 -9589 536
5726 536 -15466 -13539 -21455 -19467 -4714 19374 3536 -40817 -56987 -45719 -42092 -30995 -3063
5713 -3063 27642 24169 -9209 9410 10910 -10062 -7584 -1630 -8693 -20745 -36274 -12930 -3230
5700 -3230 -30863 -32255 -14944 -22871 -18618 -9583 -1816 2427 2406 -2916 -3315 16014 8614 -8893 -6187
5685f187J5131J027l2633l4295J5793J0593k216J7443l638n835q744j1725K5136
5672b0150o600j4569L6786J3235o0507n492J3807O6534P305k3325j8299l0932
5660d2207p169L986J5382L0648K52j9870J7845K1852l093J1257K554K639j8395
5647A5681j3277N11o214m934j0658J673l1832j4339L4092J5254J2344n051m022
5634a0772O889J305J492k6718k7218l0239j0931K3161J2497J3867Q137K297q920
5621d5153J8575p874J4547O051K6234M408j6452k5168M379o06k615j287j4015
5608c8976j302J0595j9334L27J4616N377K4422J2129L847Kj3287j530K0034q192
5594H728j9583R489k0187j4207K5586l673k132Q28l585q611K6013J5522m531K900
$$ plain form
5685 -6187 8944 9971 -22662 -56957 -41164 -30571 -32787 -15344 -18982 -24817 -33561 -45286 -20150
5672 -20150 -26750 -41319 -4533 8702 -51805 -57297 -43490 23044 30349 7024 -11275 -42207
5660 -42207 -49376 -45390 -30008 640 892 -18978 -1133 20719 17626 28883 31437 34076 15681
5647 15681 2404 2915 -3299 -8233 -18891 -17218 -49050 -63389 -29297 -14043 -1699 -6750 -10772
5634 -10772 -3883 -2578 -1086 -27804 -55022 -85261 -96192 -73031 -60534 -46667 -38530 -36233 -45153
5621 -45153 -26578 -34452 -19905 -13854 12380 16788 336 -24832 -20453 -21059 -23674 -24961 -38976
5608 -38976 -40278 -29683 -49017 -48690 -34074 -28697 -4275 7854 11701 11703 -1584 -3114 16920 8728
5594 8728 -10855 -1366 -21553 -35760 -10174 -13847 -15979 -15151 -18736 -27347 -1334 14188 9657 12557
5580A2557J615m863j1937k3628J1846J5745J6318j2619l4939o369K6364j6078
5568b5988l506J2865o660k967k045M2794J0644k4447J5826m879j2458p731j339
5555i891k1530j0845K8733n217j4888O909J2296N729k2639k4395p685Q356K5824
5542b9243J8492j2976l385o834m529j5956L751l949J1409K1792L775j468J2310
5529f811K2533M654j006k9767k0132J1430j6575j0707J9749J7068l022K9017L0931
5516D7362j6465j3018j0930j073q498k373k296Q815J7337p695l7421r057J2916
5503b2396J9378J2394k2674j7019l558P562r451j444j095q08J8874J2243L807
5490d187j7978k3961j0977N182j7416L275Q537L1378M5197N0156r247r563M289
$$ plain form
5580 12557 14172 9309 -2628 -26256 -14410 1335 17653 5034 -29905 -36274 -9910 -25988
5568 -25988 -29494 -16629 -23289 -26256 -28301 14493 25137 690 16516 11637 -821 -8552 -9891
5555 -9891 -31421 -42266 -13533 -18750 -33638 -26729 -14433 -8704 -31343 -55738 -63423 -55067 -29243
5542 -29243 -10751 -23727 -27112 -33946 -38475 -54431 -50680 -54629 -43220 -21428 -17653 -19121 -6811
5529 -6811 15722 20376 19370 -10397 -30529 -19099 -35674 -46381 -26632 -9564 -12586 16431 47362
5516 47362 30897 17879 6949 5876 -2622 -4995 -7291 1524 18861 11166 -26255 -35312 -22396
5503 -22396 -3018 9376 -13298 -30317 -33875 -26313 -35764 -37208 -38303 -39111 -20237 -7994 -4187
5490 -4187 -22165 -46126 -57103 -51921 -69337 -66062 -57525 -26147 19050 69206 59959 50396 54685
5477E4685k5626n963L4703L528r358K854o035r736j4082K403j3785J512K339j6800
5463F39j5526j8630l0569j798J4241J851K050j343M2128N033M322m354j5695r497
5449b7148P493J6974J6834j3854R593r333q984R17o990o453o993j664N562L414
5435b0632J8980L2593k865j5413l1866j0827j7834Q729L4545j553R99p041p552
5422a9737K9552j7776p69P7l5339R836O999p275L819K0823Q589M817K792k6665
5408b0257Q126q40r146r286N789Q728J467J817J8764P187l2787O571K8337K9095
5394D3565k7223k6694q110R919J6769m149j7746P085R870j0019j9244k640L033
5381b5584j2283k0554j366L815J5321k18j0182m187L1675J2849L488K538j776
$$ plain form
5477 54685 29059 23096 57799 61327 51969 54823 48788 39052 24970 27373 13588 15100 17439 639
5463 639 -14887 -33517 -64086 -65884 -51643 -49792 -47742 -49085 -6957 -1924 2398 -1956 -17651 -27148
5449 -27148 -19655 -2681 14153 299 9892 559 -8425 -7508 -14498 -20951 -27944 -29608 -24046 -20632
5435 -20632 -1652 30941 28076 12663 -19203 -30030 -47864 -39135 -4590 -6143 -5144 -12185 -19737
5422 -19737 9815 -7961 -8730 -8653 -43992 -34156 -27157 -34432 -30613 -9790 -1201 3616 6408 -20257
5408 -20257 -12131 -12971 -22117 -31403 -25614 -16886 -15419 -13602 5162 12349 -20438 -13867 14470 43565
5394 43565 16342 -10352 -18462 -8543 8226 4077 -13669 -6584 3286 -6733 -25977 -28617 -25584
5381 -25584 -37867 -58421 -59787 -55972 -40651 -40869 -51051 -55238 -23563 -10714 -7226 -4688 -6464
5368f464j9945j8499P436M6380M0508l7568m1837L99K5211l908m129l169j8077
5355c3662j6170L1436J3653J3636J2643R33L483Q620J5713l0988r169j5679l7635
5342d3186j4604O866K3115K2814K1116j7601O566k3943J0353K4054l690K0377
5330C2237L717j0107k8271j7349K0174j3151j1643r32k3247J9538L2797K3509
5318B7272K0691j3803j3736j9589q658R466J245j6010j7241l1840Q612M4266K1481
5305A2156j9724o436K1036Q701J0619m724O13K434R39k7854j0486J1403o361K2772
5291A5088K3730m3068P34J8211P865j8217j182m691P58o043J0953J6548r218J6543
5277B8011l648j5116O429O156o190J937J4535J8084j27k7388l0509j7168j5996
$$ plain form
5368 -6464 -26409 -44908 -37472 8908 49416 11848 -29989 -29590 -4379 -8287 -12416 -15585 -33662
5355 -33662 -49832 -18396 -4743 8893 21536 22469 25952 34572 50285 19297 10128 -5551 -43186
5342 -43186 -57790 -50924 -27809 -4995 16121 -1480 5086 -18857 -8504 15550 11860 32237
5330 32237 35954 25847 -2424 -19773 401 -12750 -24393 -25325 -48572 -29034 3763 27272
5318 27272 47963 34160 20424 835 -7823 1643 2888 -13122 -30363 -62203 -53591 -9325 12156
5305 12156 -7568 -14004 7032 15733 26352 21628 22241 24675 25614 -2240 -12726 -1323 -7684 15088
5291 15088 38818 -4250 -3516 14695 22560 4343 3161 -1530 -772 -6815 4138 20686 11468 28011
5277 28011 24363 9247 15676 21832 15642 17579 32114 50198 50071 22683 -7826 -24994 -40990
5264d0990O533K9571P194j7083j9276J5122q753M634k0095j1190J4743K1693K0996
5251C099K7126L549j827p077M194l7354l4648K725O2157K7331p919l1624r933
5238b01m2784j6968J3156J7608J8035O702r883J1241J9765l2074j1771j8825n353
5225e1352j3006K0817l341p019K8658o455M214p353j815M657j876J6264l554j416
5211b2577j8252J1782K4774j0175L199K443O223m312j1146q744N094Q422J7977
5198D708O59Q171K4967r380j5798L350j6270k6929r759O650M221J1744k813J8080
5184A601K843j4205K9034k5891j5714J5794j2085R41J0296L505O287L7438l9712
5171A32k2215J4618r128l5917J2134K7697r880p851K8528n96j0388j8459N4N3362
$$ plain form
5264 -40990 -34457 -4886 2308 -14775 -34051 -18929 -27682 -23048 -43143 -54333 -39590 -17897 3099
5251 3099 30225 33774 31947 24870 29064 -8290 -42938 -40213 21944 49275 41356 9732 -201
5238 -201 -42985 -59953 -46797 -29189 -11154 -4452 -14335 -3094 16671 -15403 -27174 -45999 -51352
5225 -51352 -64358 -43541 -46882 -53901 -25243 -31698 -27484 -34837 -36652 -31995 -33871 -17607 -21161 -22577
5211 -22577 -40829 -29047 -4273 -14448 -11249 -8806 -2583 -6895 -18041 -26785 -21691 -13269 4708
5198 4708 5367 13538 38505 29125 13327 16677 407 -26522 -36281 -29631 -25410 -13666 -16479 1601
5184 1601 4444 -9761 19273 -6618 -22332 -6538 -18623 -17682 -7386 -3881 2406 39844 132
5171 132 -22083 -7465 -16593 -52510 -40376 -12679 -22559 -30410 -1882 -2478 -12866 -31325 -31271 22091
5157B2091K2970m4421l2177j6939K3294N534N447L4474P288N420m217L563j1067
5144B1260m1035P77J9011K773p936j325k663J7465J8905K3897Q33j7737l3949
5131B76j1704R709M58k3093n265J2942J9691K204j6308j1529N305K262j1091j3650
5117c9793k982N603K2958K4028j1714l1679k7089J4658M1449o841J0202m170n846
5104a1216K2646M5166j1941l2773m448m21L865j2013p149j0607j9304J1279J7400
5091i516J1117j0343j9980J3394J4781j3399J0132J8728j9008o718k612K726j0019
5078b0717l9237j5495J3531L5004K6367J8130n708K8L3903j6049l2827r581K5164
5065A2513k3799Q206m844m885j649R922J5551K7907l4051j3923K1428J0790P22
$$ plain form
5157 22091 45061 640 -31537 -48476 -25182 -19648 -14201 20273 27561 32981 28764 32327 21260
5144 21260 -19775 -18998 13 2786 -5150 -6475 -9138 8327 27232 51129 51962 34225 276
5131 276 -11428 -1719 -1261 -24354 -29619 -16677 3014 5218 -11090 -22619 -17314 -15052 -26143 -39793
5117 -39793 -42775 -37172 -14214 9814 -1900 -33579 -60668 -46010 -4561 -11402 -1200 -5370 -11216
5104 -11216 11430 56596 44655 11882 7434 7013 10878 -1135 -8284 -18891 -38195 -26916 -9516
5091 -9516 1601 -8742 -28722 -15328 -547 -13946 -3814 14914 -4094 -10812 -13424 -10698 -20717
5078 -20717 -59954 -75449 -61918 -26914 -547 17583 11875 11903 45806 29757 -3070 -12651 12513
5065 12513 -11286 -3080 -7924 -12809 -14458 -4536 11015 38922 4871 -9052 12376 23166 23888
5052B3888k7517p607j2169j932L9379L7271q697n5572q375j7949L339K2627R227
5039d087l627n089k071j5426M208L3060J0672j2255p036r504k1352k2893q865
5026f4265j539K7541J9618P067L1359J7634q524M711k5168q232Q336j0150q264
5013i876J4174P141j4041Q552L777k6846p342J1044J9806q252Q002P639j1569
5000B209J4276j1411j1441k152j1557k030J8911M329l7525k6078Q072K2477K1219
4987a0701K9077J5582k6158k4817J2857j73L672j1727M46j405j0380j1167J4434
4974b0460O740Q083n948k0771J8586j303O526J2969J8941j5877l9524j5756J6390
4961c1404J3277J7816q003j5297L8038R474L744o944q81p664K1857n056l6898
$$ plain form
5052 23888 -3629 -11236 -23405 -25337 14042 51313 42616 -12956 -21331 -39280 -35941 -13314 -4087
5039 -4087 -7714 -12803 -14874 -30300 -26092 6968 17640 5385 -1651 -11155 -32507 -55400 -64265
5026 -64265 -65804 -38263 -18645 -11578 19781 37415 28891 33602 8434 202 8538 -1612 -9876
5013 -9876 4298 11439 -2602 5950 9727 -17119 -24461 -13417 6389 -1863 6139 13778 2209
5000 2209 16485 5074 -6367 -8519 -20076 -22106 -3195 1134 -36391 -62469 -54397 -31920 -10701
4987 -10701 18376 33958 7800 -17017 -4160 -4333 -661 -12388 -11942 -13347 -23727 -34894 -20460
4974 -20460 -13720 -5637 -11585 -32356 -13770 -15073 -8547 4422 23363 7486 -32038 -47794 -31404
4961 -31404 -18127 -311 -8314 -23611 14427 23901 27645 20701 19820 12156 34013 28957 -7941
4948g941k7486p449J470k320J1825m868k7647K6496K6483j277p405K51R913J5416
4934E461L96l164j026p08O453K6601k472j1003O269j4903R368P141P998r562k4648
4919B201l1470P322K5671J0333J7389p098k5606J4397N473k2177L8845K4486k0450
4906C9316j8207k4556k0557O609k7575K3516M13q993N666j5362O853M600L46j685
4892b9616J1999J3370K058L853n019p079j946K1865J4680j5968L360j1986R810
4879I381J2931K0371k5180p537j052J3133J66j9906q045k4338p398J8203K1709
4866B438l985l922K110p183k5397J242J5127J1099J9307N827J3467j7290n795
4853G045J4854J1088n61P082J1413k5778l9582j3829k144J4676J3955j4768J0530
$$ plain form
4948 -7941 -35427 -42876 -41406 -43726 -31901 -36769 -64416 -37920 -11437 -12714 -20119 -19868 -9955 5461
4934 5461 5857 2693 1667 959 7412 34013 31541 20538 26807 11904 21272 28413 36411 26849 2201
4919 2201 -29269 -21947 3724 14057 31446 24348 -1258 13139 18612 -3565 35280 59766 39316
4906 39316 21109 -3447 -24004 -17395 -44970 -21454 -21041 -30034 -24368 -39730 -32877 -28277 -27931 -29616
4892 -29616 -17617 -4247 -2189 1664 -3355 -10434 -12380 9485 24165 8197 11557 -429 9381
4879 9381 22312 42683 17503 9966 8914 22047 22213 2307 -5738 -30076 -37474 -19271 2438
4866 2438 -1547 -5469 -3359 -10542 -35939 -34697 -19570 -8471 10836 16663 30130 12840 7045
4853 7045 21899 32987 32426 39508 50921 25143 -14439 -28268 -30412 -15736 -1781 -16549 -6019
4840f019K7747k5963o298P598k3282Q22K7011n387j2648k524J2383K8221l572
4827A8089l971M610M667q602j5125j1771r523j84K1813J5033p018q03k0009k1932
4813c4726m997K7682L4903k857k2072K0741K01q391P877J1631J2010O619k3987
4800B4634l2581q151J7211J5548N528j2572K260p595j6589j0590J3872Q21k02
4787h406R398j636j4055o429R29Q137K2542k7013k4215J8340K7754K5241O093
4774C6680J638j4508q625K8774k662j5271j1070k6979l55k739l089m922J1328
4761a1800K1288J6753J8654n981P465k5277j0483j0926j1473K4034p279N019K7130
4748C7124p551m6511Q952J8181J359N404m323r677j1243J154k8750L7140P221
$$ plain form
4840 -6019 21728 -4235 -10533 -2935 -26217 -25395 1616 -3771 -16419 -18943 -6560 21661 18089
4827 18089 14118 18728 23395 14793 -332 -12103 -21626 -21810 3 15036 8018 7215 -12794 -34726
4813 -34726 -39723 -12041 22862 20005 -2067 18674 18875 10484 18361 29992 42002 48621 24634
4800 24634 -7947 -16098 1113 16661 22189 9617 11877 4282 -12307 -22897 -9025 -8204 -8406
4787 -8406 992 -644 -14699 -21128 -20199 -12062 10480 -16533 -40748 -22408 5346 30587 36680
4774 36680 38318 23810 15185 43959 41297 26026 14956 -12023 -12378 -15117 -18206 -23128 -11800
4761 -11800 9488 26241 44895 38914 46379 21102 10619 -307 -11780 12254 4975 9994 37124
4748 37124 29573 -16938 -7986 10195 11554 16958 12635 2958 -8285 -7131 -35881 1259 8480
4735H480k9450J4144Q715j8400n919j105J6422J3364k0978j5702j0704J4586K5458
4722a089N416r819k4172o67J421J6669K4117j4256J9913N019p001m247p432j945
4708A927j3084l137J975K4324K0976k7881o55P998n430j3063J6069L2025j7522
4695B4522k5412j228P809Q814k973L4370j385l1383r063K0363o22j8469Q584p288
4681F639J1290K0021l933L065j6739l0812N860p210j1140j5444N167N86j1950
4668d4600M786N283M655K8357L1795l8913q364K6207K879J025q508j2683j1335
4655a9416m996J2618J0089K188K7321j5046j149j4173j4097Q627J2028o86k644
4642F64J1465N48j713m629J9092j2939k8387J1529k0883J8770K1081O319j4840
$$ plain form
4735 8480 -20970 -6826 1889 -16511 -22430 -23535 -7113 6251 -14727 -30429 -41133 -26547 -1089
4722 -1089 4327 -5492 -29664 -30331 -28910 -12241 11876 -2380 17533 22552 15551 11304 3872 1927
4708 1927 -11157 -14294 -12319 12005 32981 5100 4445 12443 7013 -6050 10019 42044 24522
4695 24522 -890 -2118 5691 14505 11532 45902 44517 13134 4071 24434 23812 5343 13927 6639
4681 6639 17929 37950 34017 37082 20343 -10469 -4609 -11819 -22959 -38403 -33236 -32650 -44600
4668 -44600 -39814 -34531 -29876 -1519 30276 -8637 -17001 9206 12085 13110 4602 -8081 -19416
4655 -19416 -24412 -11794 -1705 483 27804 12758 11609 -2564 -16661 -8034 3994 3308 664
4642 664 12129 12677 10964 6335 25427 12488 -15899 -4370 -25253 -6483 14598 20917 6077
4629F077o374J0404K8545R449o855k9493J317j0511p591k165j1907L066J0233
4616e805R147k1160o747M246J2035J384K3322M2701R15l033j6156j4525J1901
4603C8225j2268j2458l059o441k989J9867K4661O342j768j8527j9947k4942j1498
4590b4802o325J6140N8j6980J8808L0836L060J0713J0031n723j4111j0717j1736
4577g48k663K3985j8709k7142L933Q197J9331J4244k7780R670M400K748q403N679
4563F742L6136L311k5813N788l370k6717j2159J2177m936J3732J0450j2379k5712
4550b2750j8317K677K7139Q851o522o781J9547k876j690K7860O693J1459j4585
4537C0705k5027p370j4406L219L1524M1511K8416M121j5936j5151o171m342k2547
$$ plain form
4629 6077 -297 10107 38652 48101 41246 11753 13070 2559 -5032 -7197 -19104 -16038 -5805
4616 -5805 3342 -17818 -24565 -20319 -8284 -6900 16422 59123 60038 57005 40849 26324 38225
4603 38225 25957 13499 10440 3999 1010 20877 45538 51880 50112 31585 11638 -13304 -24802
4590 -24802 -31127 -14987 -14929 -31909 -13101 17735 20795 31508 41539 35816 21705 10988 -748
4577 -748 -3411 20574 1865 -25277 -21344 -13147 6184 20428 -7352 2318 6718 9466 1063 6742
4563 6742 42878 46189 20376 26164 22794 -3923 -16082 -3905 -8841 4891 15341 2962 -22750
4550 -22750 -41067 -38390 -11251 -2400 -8922 -15703 3844 968 -722 27138 33831 45290 30705
4537 30705 5678 -1692 -16098 -12879 18645 60156 88572 92693 76757 61606 55435 51093 28546
4524B8546l6563j3342j4381L0549N466l3805m276j3409P185n176m631J3755K6377
4511a3705k94O564J347k5093J0860J3846J0615l34j7930N495J7566m971O458j8960
4497h536j5744j0802R551J1368J3058l202J5103J4183k7430l2154N054K9589l102
4484c064q721p640L236L2002M083J1439R44M066m6631k1451J036O723K787p566
4470b8757L8335O027O472R901J181N125p610o032K7177o423p031o845j8378j5115
4456a973Q658K800J2676Q002J4370M316k2816k0694j5048Q357K0161p071j5343
4443c605L2057J3207j3316l1312k2434j2850J8350L2849J211m1364l2946K2705
4431c7448J3467K1960r923j4255K2271K2145j5339l7120l672j0533R46J4938L1046
$$ plain form
4524 28546 -8017 -21359 -35740 -5191 275 -33530 -37806 -51215 -44030 -49206 -53837 -40082 -13705
4511 -13705 -13999 -7435 -6088 -31181 -20321 -6475 4140 3806 -14124 -8629 8937 3966 10424 -8536
4497 -8536 -24280 -35082 -25531 -14163 -1105 -4307 10796 24979 -2451 -34605 -29551 38 -3064
4484 -3064 -11785 -19425 -16189 15813 19896 31335 32279 36345 -10286 -31737 -30701 -23978 -21191 -28757
4470 -28757 9578 15605 22077 31978 33159 38284 30674 24642 51819 45396 38365 31520 13142 -1973
4456 -1973 6685 9485 22161 30163 44533 48849 26033 5339 -9709 -1352 18809 11738 -3605
4443 -3605 28452 41659 28343 -2969 -25403 -38253 -19903 12946 14157 -27207 -60153 -37448
4431 -37448 -23981 -2021 -11944 -26199 -3928 18217 2878 -34242 -37914 -48447 -47501 -32563 -1517
4418a517K3539j2243k3959o138P782K2465r75J097k4j2844J1037Q893m399j0580
$$ plain form
4418 -1517 22022 9779 -14180 -20318 -12536 9929 8954 10051 10027 -2817 8220 17113 12714 2134
$$ [...]
##END NTUPLES=NMR SPECTRUM
##END=
