##TITLE=Analysis number 319888
Compound Code cc 48946
Book Reference 468/75
Project Code adrs
Chemist Name colinb
##JCAMPDX= 6.0         $$ Bruker NMR JCAMP-DX V2.0
##DATA TYPE= NMR SPECTRUM
##DATA CLASS= NTUPLES
##ORIGIN= Bruker BioSpin GmbH
##OWNER= nmr
$$ XWIN-NMR		Version 3.5
$$ Thu Jun  1 14:18:53 2006 GMT Daylight Time (UT+1h)  MAYBRIDGE\nmr@NMR_250MHZ
##.OBSERVE FREQUENCY= 250.131544655141
##.OBSERVE NUCLEUS= ^1H
##.ACQUISITION MODE= SIMULTANEOUS (DQD)
##.ACQUISITION SCHEME= undefined
##.AVERAGES= 16
##.DIGITISER RES= 18
##SPECTROMETER/DATA SYSTEM= dpx250
##.PULSE SEQUENCE= zg30
##.SOLVENT NAME= CDCl3
##.SHIFT REFERENCE= (INTERNAL, CDCl3, 0, 16.522)
##AUDIT TRAIL= $$ (NUMBER, WHEN, WHO, WHERE, WHAT)
$$ ##TITLE= Audit trail, XWIN-NMR		Version 3.5
$$ ##JCAMPDX= 5.01
$$ ##ORIGIN= Bruker BioSpin GmbH
$$ ##OWNER= nmr
$$ C:\u/data/dgb/nmr/ADRS/160/pdata/1/auditp.txt
$$ ##AUDIT TRAIL=  $$ (NUMBER, WHEN, WHO, WHERE, WHAT)
(   1,<2006-06-01 14:18:32.43 +100>,<MAYBRIDGE\nmr>,<NMR_250MHZ>,
      <created by zg, POWCHK disabled, PULCHK disabled
       configuration hash MD5:
       E2 DF 36 D8 04 B2 41 60 5A D7 A3 38 5A 4B D0 FE
       data hash MD5: 64K
       16 2D 19 8A F1 EE D9 9C DE 57 28 1F 2B BB 96 75>)
(   2,<2006-06-01 14:18:44.54 +100>,<MAYBRIDGE\nmr>,<NMR_250MHZ>,
      <Start of raw data processing
       ef LB = 0.3 FT_mod = 6 PKNL = 1 SI = 32K 
       data hash MD5: 32K
       86 BA A8 43 9C D0 C9 A3 D1 31 7C D0 28 53 6D 74>)
(   3,<2006-06-01 14:18:46.21 +100>,<MAYBRIDGE\nmr>,<NMR_250MHZ>,
      <apk 
       data hash MD5: 32K
       EA 50 29 08 D6 32 E4 74 FE 25 4C 27 04 D7 62 8F>)
(   4,<2006-06-01 14:18:47.05 +100>,<MAYBRIDGE\nmr>,<NMR_250MHZ>,
      <abs ABSG = 5 
       data hash MD5: 32K
       98 DC 1A 0F 5C C2 93 E2 94 B0 F8 63 9B 7C 57 3A>)
$$ ##END=
$$ 
$$ hash MD5
$$ 9B 02 C1 95 06 4F 6F DE 1A 52 35 EB C4 94 D9 BE
##$RELAX= 
##$RELAX= 
##$RELAX= 
##$RELAX= 
##$RELAX= 
##$RELAX= 
##$RELAX= 
$$ Bruker specific parameters
$$ --------------------------
##$DU= <C:\u>
##$EXPNO= 160
##$NAME= <ADRS>
##$PROCNO= 1
##$TYPE= <nmr>
##$USER= <dgb>
##$AMP= (0..31)
100 100 100 100 100 100 100 100 100 100 100 100 100 100 100 100 100 100 
100 100 100 100 100 100 100 100 100 100 100 100 100 100 
##$AQSEQ= 0
##$AQ_mod= 3
##$AUNM= <au_zg>
##$AUTOPOS= <34 >
##$BF1= 250.13
##$BF2= 250.13
##$BF3= 250.13
##$BF4= 250.13
##$BF5= 500.13
##$BF6= 500.13
##$BF7= 500.13
##$BF8= 500.13
##$BYTORDA= 1
##$CFDGTYP= 0
##$CFRGTYP= 5
##$CHEMSTR= <none>
##$CNST= (0..31)
1 1 145 1 1 1 1 1 1 1 1 1 1 1 1 1 1 1 1 1 1 1 1 1 1 1 1 1 1 1 1 1 
##$CPDPRG= <>
##$CPDPRG1= <>
##$CPDPRG2= <>
##$CPDPRG3= <>
##$CPDPRG4= <mlev>
##$CPDPRG5= <mlev>
##$CPDPRG6= <mlev>
##$CPDPRG7= <mlev>
##$CPDPRG8= <mlev>
##$CPDPRGB= <>
##$CPDPRGT= <>
##$D= (0..31)
0 1 0 0 0 0 0 0 0 0.06 0 0 0 0 0 0 0.0002 0 0 0 0 0 0 0 0 0 0 0 0 0 0 
0 
##$DATE= 1149167911
##$DBL= (0..7)
120 120 120 120 120 120 120 120 
##$DBP= (0..7)
150 150 150 150 150 150 150 150 
##$DBP07= 0
##$DBPNAM0= <>
##$DBPNAM1= <>
$$ [...]
##$SUBNAM7= <"">
##$SUBNAM8= <"">
##$SUBNAM9= <"">
##$SW= 20.6930455092707
##$SWIBOX= (0..15)
0 0 3 0 0 0 0 0 0 0 0 0 0 0 0 0 
##$SW_h= 5175.983436853
##$TD= 65536
##$TD0= 1
##$TE= 295.16
##$TE2= 300
##$TE3= 300
##$TEG= 300
##$TL= (0..7)
0 120 120 120 120 120 120 120 
##$TP= (0..7)
150 150 150 150 150 150 150 150 
##$TP07= 0
##$TPNAME0= <>
##$TPNAME1= <>
##$TPNAME2= <>
##$TPNAME3= <>
##$TPNAME4= <>
##$TPNAME5= <>
##$TPNAME6= <>
##$TPNAME7= <>
##$TPOAL= (0..7)
0.5 0.5 0.5 0.5 0.5 0.5 0.5 0.5 
##$TPOFFS= (0..7)
0 0 0 0 0 0 0 0 
##$TUNHIN= 0
##$TUNHOUT= 0
##$TUNXOUT= 0
##$USERA1= <user>
##$USERA2= <user>
##$USERA3= <user>
##$USERA4= <user>
##$USERA5= <user>
##$V9= 5
##$VALIST= <valist>
##$VCLIST= <CCCCCCCCCCCCCCC>
##$VD= 0
##$VDLIST= <DDDDDDDDDDDDDDD>
##$VPLIST= <PPPPPPPPPPPPPPP>
##$VTLIST= <TTTTTTTTTTTTTTT>
##$WBST= 1024
##$WBSW= 4
##$XGAIN= (0..3)
0 0 0 0 
##$XL= 0
##$YL= 0
##$YMAX_a= 321852
##$YMIN_a= -575477
##$ZGOPTNS= <>
##$ZL1= 120
##$ZL2= 120
##$ZL3= 120
##$ZL4= 120
##$ABSF1= 16.522
##$ABSF2= -4.171173
##$ABSG= 5
##$ABSL= 3
##$ALPHA= 0
##$AQORDER= 0
##$ASSFAC= 0
##$ASSFACI= 0
##$ASSFACX= 0
##$ASSWID= 0
##$AUNMP= <proc_1d>
##$AZFE= 0.1
##$AZFW= 0.1
##$BCFW= 0
##$BC_mod= 0
##$BYTORDP= 0
##$COROFFS= 0
##$CY= 12.5
##$DATMOD= 1
##$DC= 0
##$DFILT= <>
##$DTYPP= 0
##$F1P= 14.0000005364418
##$F2P= -0.99999901652339
##$FCOR= 0.5
##$FTSIZE= 32768
##$FT_mod= 6
##$GAMMA= 0
##$GB= 0
##$INTBC= 1
##$INTSCL= 1
##$ISEN= 128
##$LB= 0.3
##$LEV0= 0
##$LPBIN= 0
##$MAXI= 10000
##$MC2= 0
##$MEAN= 0
##$ME_mod= 0
##$MI= 0
##$NCOEF= 0
##$NC_proc= -3
##$NLEV= 6
##$NOISF1= 0
##$NOISF2= 0
##$NSP= 0
##$NTH_PI= 0
##$NZP= 0
##$OFFSET= 16.522
##$PC= 1
##$PHC0= 168.5164
##$PHC1= 6.841659
##$PH_mod= 1
##$PKNL= yes
##$PPARMOD= 0
##$PSCAL= 4
##$PSIGN= 0
##$REVERSE= no
##$SF= 250.13
##$SI= 32768
##$SIGF1= 0
##$SIGF2= 0
##$SINO= 400
##$SIOLD= 32768
##$SREGLST= <1H.CDCl3>
##$SSB= 0
##$STSI= 32768
##$STSR= 0
##$SW_p= 5175.98343685301
##$SYMM= 0
##$S_DEV= 0
##$TDeff= 65536
##$TDoff= 0
##$TI= <Analysis number 999999
Compound Code 99
Book Reference 9
Project Code 9>
##$TILT= no
##$TM1= 0
##$TM2= 0
##$TOPLEV= 0
##$USERP1= <user>
##$USERP2= <user>
##$USERP3= <user>
##$USERP4= <user>
##$USERP5= <user>
##$WDW= 1
##$XDIM= 32768
##$YMAX_p= 352244462
##$YMIN_p= -58663
$$ End of Bruker specific parameters
$$ ---------------------------------
##NTUPLES= NMR SPECTRUM
##VAR_NAME=  FREQUENCY,     SPECTRUM/REAL,   SPECTRUM/IMAG
##SYMBOL=    X,             R,               I
##VAR_TYPE=  INDEPENDENT,   DEPENDENT,       DEPENDENT
##VAR_FORM=  AFFN,          ASDF,            ASDF
##VAR_DIM=   32768,         32768,           32768
##UNITS=     HZ,            ARBITRARY UNITS, ARBITRARY UNITS
##FACTOR=    0.157963299565203, 1,           1
##FIRST=     4132.6476996994, 0,             0
##LAST=      -1043.33573715361, 0,           0
##MIN=       -1043.33573715361, -58663,      0
##MAX=       4132.6476996994, 352244462,     0
$$ Real data points
##PAGE= N=1
##DATA TABLE= (X++(R..R)), XYDATA
$$ [...]
16838B9603M03j0669N256k900k128q283o290n324M813O032J0149L1140J1716j2151
16824E1367k6012j5994J4584l15j4767n172n733K934J0260n416o230K5P614L560
16810A0705N102j1871Q497P037n746j0750o127l778K40p431m436O218N719P078
16796D57N409k13O35j6M156J041j9580Q48P401J6405k151j1699j0231R987j186
16781A263n360m62r36K425J0847j0962j3632m345p5M488j513J8943M799j568l041
16766H71j071M689j402j0759j0685j542m178P433j4359j2881R726O244J0934P650
16752i330M931L366j076P462N669r132r325J63J4982M064M04n739k4052p188P541
16737a7260J3405J2433m069N373o662J2931J0141j0039n099K892l855n516p101
$$ plain form
16838 29603 30006 19337 24593 21693 19565 11282 4992 -332 4481 10513 20662 51802 63518 51367
16824 51367 25355 9361 23945 23630 8863 3691 -2042 892 11152 5736 -494 -469 7145 10705
16810 10705 15807 3936 12433 19470 13724 2974 -3153 -6931 -6691 -14122 -18558 -12340 -6621 457
16796 457 5866 5653 6288 6272 10428 11469 -8111 -7263 138 16543 14392 2693 -7538 2449 1263
16781 1263 -4097 -4559 -5495 -3070 7777 -3185 -16817 -21162 -21237 -16749 -18262 681 5480 3912 871
16766 871 -200 4489 3087 -7672 -18357 -19899 -24077 -16644 -31003 -43884 -34158 -27914 -16980 -9330
16752 -9330 -4399 -1033 -2109 5353 11022 1890 -7435 -7272 7710 11774 12178 6439 -17613 -24801 -17260
16737 -17260 -3855 8578 4509 9882 3220 16151 26292 16253 11154 14046 10191 4675 -2426
16724b426r640P221J8151N268k409k513L43p823j1378l999O59J2691l160L87l395
16709b023P156J1087Q213o058j3057l118j342j113n792p2O039O970k340K044O01
16694G195J2503r806j4440P940n736m909r164j3705J0271J6035N247J769J6880
16681B0080j5269r099J0206o60o087o928L092j1633K657J6146k916L122k884k1507
16667b1680O237Q863J915N012N242P610K1549L641p501q986q597N755N270j8822
16653E508r626r33J676o547j4658j531m199M360P086n403j2655K96J2452L229
16639b0945J799R777J0641M20j3946Q596O939p21Q051o74n427j1219J3204q54
16625E641j134j937K057m904k847n101o946Q168M600P149n005n151o984J88P917
$$ plain form
16724 -2426 -12066 -4845 13306 18574 16165 13652 13995 6172 -5206 -9205 -8546 4145 985 1372 -2023
16709 -2023 5133 16220 24433 18375 5318 2200 858 -255 -6047 -6119 -80 6890 4550 6594 7195
16694 7195 19698 9892 -4548 3392 -2344 -7253 -16417 -30122 -19851 -3816 1431 3200 20080
16681 20080 4811 -4288 5918 5258 -829 -7757 -4665 -16298 -13641 2505 -411 2711 -173 -21680
16667 -21680 -15443 -6580 -4665 347 5589 13199 34748 38389 30888 21902 13305 19060 24330 5508
16653 5508 -4118 -5051 -3375 -9922 -24580 -26111 -30310 -25950 -18864 -24267 -36922 -36626 -24174 -20945
16639 -20945 -19146 -9369 1272 1692 -12254 -3658 3281 2560 10611 9937 4510 -6709 6495 5641
16625 5641 4507 2570 4627 -277 -3124 -8225 -15171 -7003 -2403 4746 -259 -5410 -12394 -12206 -4289
16610d289L444J9025J4305j273j942M258M740l456L905o496o80k120m072j4235
16596A1114J7L918l834j4202Q2Q407k382j6743p860K1806P075Q666j963j5956
16582a855o091M678R048J2532L82r90M390P914O822j2984j7074l122J2384j062
16568A4972L621Q523R717M820j7554o926N197L441Q255M661J39k0524j480J4162
16554C1024Q130r594L628n98n558k9136k0215J0452L067L47R546N936m513L734
16540F250j1875j6169n922Q170R681K392q834M753l463j833J9507J6696n475q778
16526E100L56R168r734r317J5147J9856J2056R89n037j4478o822N689p915k000
16512A3058J3472J0762p45j5935j5944r498m227J3412J4357j696j3764j136O620
$$ plain form
16610 -4289 -845 18180 32485 31212 29270 33528 38268 34812 38717 32221 31541 29421 25349 11114
16596 11114 11131 15049 11215 -2987 -2905 5502 3120 -13623 -21483 323 7398 16064 14101 -1855
16582 -1855 -7946 -3268 5780 18312 18694 17704 22094 30008 36830 23846 6772 3650 16034 14972
16568 14972 18593 27116 36833 41653 24099 17173 22370 25811 34066 38727 38866 18342 16862 31024
16554 31024 39154 29560 33188 32590 27032 -2104 -22319 -11867 -8800 -8453 1093 7029 2516 6250
16540 6250 -5625 -21794 -27716 -19546 -9865 -7473 -16307 -11554 -15017 -16850 2657 19353 13878 5100
16526 5100 5456 14624 4890 -4427 10720 30576 42632 43621 38584 24106 17284 22973 15058 13058
16512 13058 26530 37292 36547 20612 4668 -4830 -9057 4355 18712 17016 3252 2116 8736
16499H736j2734q021M548M197K081P28o23L959l501L288J102r84n517p29J6589
16484A3119R97m485Q72k631j3116n709R79q871Q795Q803k766J1149J5834k982
16470A9988j3929r008J1197K56m746J81k350j3867R410N81j1909j2622l26J5328
16456a1816N859N295J1052K121l751k3921o016M75Q278l644K323R505R33J932
16442a375n909n686p151q142L055N523K391N740l808q457m132J0564J5982R336
16428G931M244j195J2919j206L57J0525k6617j5541J3191J6791o149j8097k1908
16415b4755N31M491n470l551J4337K1506q139r263J3713o247o5p712n093l78J1977
16400d118Q08j4596J627m08L741m115J536K822L454N747J367O795p390K398J4011
$$ plain form
16499 8736 -3998 -12019 -7471 -3274 -1193 -465 -1088 2871 -630 2658 3760 2776 -2741 -3470 13119
16484 13119 14116 9631 10503 7872 -5244 -10953 -9974 -18845 -10050 -1247 -4013 7136 22970 19988
16470 19988 6059 -2949 8248 8504 3758 3939 1589 -12278 -2868 -2287 -14196 -26818 -27144 -11816
16456 -11816 -5957 -662 10390 12511 8760 -15161 -21177 -20702 -12424 -16068 -13745 -4240 -3307 -1375
16442 -1375 -7284 -12970 -20121 -28263 -25208 -19685 -17294 -11554 -15362 -23819 -27951 -17387 -1405 7931
16428 7931 12175 10980 23899 22693 23050 33575 6958 -8583 4608 21399 15250 -2847 -24755
16415 -24755 -24224 -19733 -25203 -28754 -14417 7089 -1050 -10313 3400 -2847 -2912 -10624 -15717 -16095 -4118
16400 -4118 -3310 -17906 -16279 -16687 -12946 -17061 -15525 -12703 -9249 -3502 -2135 4660 -2730 -332 13679
16385A3679j5845n499j1421k382L976J1329P762k814J0398J7258J0235m021q9
16372C2566L403R512o636o559n369J994j7311k760l048OO658q466J0589j4069
16358E10j235P555j997M401M604n583q348M57M509o988P59pn887n793P007P486
16342A450R157j0259o560n577O451J7945k698K0120J1311J4635M052k313j4572
16329D3142P164j606l426N229K0506J0053r82k7582j7393j6737p067R302q022
16316A2581M890n653n409j7473m701J6590J2437K997m826q745K519j5767k188
16303a2748J0094r58j3871j0835P268J8996j631Q302l389N355J3845R907j4973
16290A5362r819r79J0854l093O606l62K035k270R145O452P56o736j0777n109m81
$$ plain form
16385 13679 -2166 -7665 -19086 -21468 -17492 -6163 1599 -1215 9183 26441 36676 32655 32566
16372 32566 35969 45481 38845 32286 26917 28911 11600 8840 5792 5798 12456 3990 14579 510
16358 510 -725 6830 4833 9234 13838 8255 -93 364 4873 -2115 -1356 -1363 -7250 -13043 -6036 1450
16342 1450 10607 348 -6212 -11789 -5338 12607 9909 30029 41340 55975 60027 57714 43142
16329 43142 50306 48700 45274 50503 71009 81062 80080 52498 35105 18368 11301 20603 12581
16316 12581 17471 11818 6409 -11064 -15765 825 13262 16259 11433 2688 5207 -10560 -12748
16303 -12748 -2654 -3612 -17483 -28318 -21050 -2054 -3685 4617 1228 6583 20428 30335 15362
16290 15362 5543 4564 15418 12325 18931 18569 20604 18334 27479 33931 34687 27951 17174 12065 11584
16275A1584O723r51n361J921l50O47j4059n983J4352J1899r01j1285q358l974
16261d096J0328O603m592k921j1992P65n3j025R416l31O182j4020j189R342J3637
16246A6054r141l372j1720o802O538J0035J1065J911o789r989o312j355P512N990
16232C625M332j440p108j936R036M468M798L323l041j1518k380m736O720J281
16218E424k733J0532j1118O454P251j0421m488n95o583k954J96N89L375J0157
16204E086p836j5164j776m32J1892J4320k625j5625m258O495m264L215m988N633
16190a0327L502L282P416R297J483K143L64j0683j0456O975l723r510J7156J3978
16176B0897j6822K03m098j736R066j5008m700j118m186L205J0653n129n478K0121
$$ plain form
16275 11584 18307 17356 11995 13916 13566 14213 154 -5829 8523 20422 19521 8236 -122 -4096
16261 -4096 6232 12835 8243 5322 -6670 -5905 -5958 -6983 2433 2102 8284 -5736 -6925 2417 16054
16246 16054 6913 3541 -8179 -14981 -8443 1592 12657 14568 7779 -2210 -8522 -9877 -2365 3625
16232 3625 7957 6517 -591 -2527 6509 10977 15775 19098 16057 4539 2159 -2577 4143 5424
16218 5424 2691 13223 2105 8559 15810 5389 901 306 -6277 -9231 -9035 -8446 -5071 5086
16204 5086 -2750 -17914 -19690 -20122 -8230 6090 3465 -12160 -16418 -9923 -14187 -10972 -15960 -10327
16190 -10327 -6825 -3543 3873 13170 14653 16796 17160 6477 -3979 2996 -727 -10237 6919 20897
16176 20897 4075 4278 180 -1556 7510 -7498 -12198 -13316 -17502 -14297 -3644 -8773 -14251 5870
16162E870J6665P737o523j6036j1392l318m074R880j1985j1958O830J8411P709
16149G816J877r587j3179J1475J2318l415j7678j474K262p619o773J5826R147
16136I96J087k409j385j1178n939J0034J9274r46P16N741m047j202Q38J240P000
16121A9820P58k1421q399N029J223k363O842J6801O880q13K288j514q195m975
16107A1961M813j492j7601m838k510r761q252l581J3768P735K655q694p378l152
16093b6327K659N640J8268J6980k811pk996l703o720p025O220J619j015k941j0945
16078a3104p992O068n52l516o718Q626J1385J3208J109m103j2151q741L571J778
16064a1132j8088K706J0039K180o636l818l702P698R102O358J0419l380Q26j72
$$ plain form
16162 5870 22535 30272 23749 7713 -3679 -6997 -11071 -1191 -13176 -25134 -18304 107 7816
16149 7816 9693 106 -13073 -1598 10720 7305 -10373 -11847 -9585 -17204 -23977 -8151 996
16136 996 2083 -326 -1711 -12889 -18828 -8794 10480 9534 10250 15991 11944 10742 11580 12820 19820
16121 19820 20578 -843 -9242 -4213 -2990 -5353 1489 18290 25170 24357 26645 25131 16936 11961
16107 11961 16774 15282 -2319 -7157 -9667 -19428 -27680 -31261 -17493 -9758 -7103 -15797 -23175 -26327
16093 -26327 -23668 -18028 240 17220 14409 14402 11406 7703 983 -6042 178 1797 782 -2159 -13104
16078 -13104 -21096 -15028 -15580 -19096 -25814 -17188 -5803 7405 8514 4411 -7740 -16481 -12910 -11132
16064 -11132 -29220 -26514 -16475 -14295 -20931 -24749 -28451 -20753 -11651 -5293 5126 1746 2572 2400
16050B400K62p234q952j882J3515O881M305Q6p870q944J223P205J3242n123p778
16035A336R103R323q720j4114j206j746L106n867j5072l401K218Q134j772N190
16021a3488J965Q90R093J1083m835M853p168j0072o81P614M60k802N541N241L679
16006A1373k523n029j1964j2227o112J4796L402r309p85Q174P566o75j4389J000
15992a6702J8690Q465l921o468K922J3108n59p092j0041n61J4283O170M2j0320
15978H016L085l001j2715r297n227O086p442m808R532L541R194P062r567j1971
15964a7512N563J8304O999n225j7178J005O570J5264J931N554j3733k7494j3693
15951c3645O932J5156J5163J1153O591j0633j8787r414O974q12R36P726J141j5236
$$ plain form
16050 2400 2662 -4572 -13524 -15406 -1891 4990 9295 9381 1511 -7433 -6210 995 14237 9114 1336
16035 1336 10439 19762 11042 -3072 -4278 -6024 -2918 -8785 -23857 -27258 -25040 -16906 -18678 -13488
16021 -13488 -11523 -10633 -1540 9543 4708 9561 2393 -7679 -8360 -746 -286 -3088 2453 7694 11373
16006 11373 8850 3821 -8143 -20370 -26482 -11686 -8284 -17593 -18378 -10204 -2638 -3313 -17702 -16702
15992 -16702 1988 10453 6532 64 2986 16094 15535 8443 -1598 -2159 12124 18294 18336 8016
15978 8016 11101 8100 -4615 -13912 -19139 -13053 -20495 -25303 -15771 -12230 -3036 4026 -5541 -17512
15964 -17512 -11949 6355 13354 8129 -9049 -8044 -1474 13790 15721 21275 7542 -19952 -33645
15951 -33645 -26713 -11557 3606 14759 21350 10717 -8070 -17484 -10510 -11322 -10386 -2660 -1519 -16755
15937a6755l964j872Q033J1391R953r298j1872J875R163r52J922l979j13K503
15923c965j0105k826J1592P649r010o904n741P987o321q635L780J4107j3118q852
15909c0362J1243O553q351j547J978j679Q700J4282j0473o208N09N945j0134q65
15895b0409J537l706Q805K0988m278j6665K835K4475j2474j783m784j0388M665
15882a1182K035k0331j0380L819J2659J464Q328Q830N15n727l948L935K751J1839
15868D607N821J072j353m188k032J1596K465k3504j864K996M180p195l135L918
15854f616M94M773q683j2727n005O220J4565r71J629K994r270n97m834R417K891
15839e720J0257j478k984Q446m409O651M495m274j3163j2565p585N402J00O507
$$ plain form
15937 -16755 -20719 -22591 -14558 -3167 6786 -2512 -14384 -12509 -3346 -4298 -2376 -6355 -6468 -3965
15923 -3965 -14070 -16896 -5304 2345 -6665 -13569 -19310 -11323 -17644 -26279 -22499 -8392 -21510 -30362
15909 -30362 -19119 -12566 -20917 -22464 -20486 -22165 -13465 817 -9656 -15864 -15355 -9410 -19544 -20409
15895 -20409 -18872 -22578 -13773 7215 2937 -13728 -10893 13582 1108 -675 -5459 -15847 -11182
15882 -11182 -9147 -29478 -39858 -36039 -23380 -21916 -13588 -4758 -4243 -9970 -13918 -9983 -7232 4607
15868 4607 10428 11500 10147 5959 3927 15523 17988 -5516 -7380 -4384 -204 -7399 -10534 -6616
15854 -6616 -6122 -1349 -10032 -22759 -27764 -21544 -6979 -7950 -6321 -3327 -12597 -13194 -18028 -8611 -5720
15839 -5720 4537 3059 75 8521 4112 10763 15258 10984 -2179 -14744 -22329 -16927 -16827 -10320
15825a0320L100p111J31P518k821j2715J748Q405K897m73J0982J2147K696r255
15811F929m528j9137p075O591N61P872j9056k2521r75N368P993J0995o42Q035
15797a9590k846J891J0488L696J1293J8598m609n284K21J353M247K5184l783j9262
15783B1597j0539o256l023J079J1167n275p607m13j0949J8J5560r22J375J360
15769G172j6507m699L187P107M660r822K403k443J292R230q47K95j2718j2536
15755b4226j4965L198K1899n10j4374J0544N490M309Q144J105r754L251K959n075
15741h005O374L496j16N693L989p241O96j2956n996M651n896p254k555Q185N753
15726a1182P559R097m493l170o875J1468n547k363O643n390J140J4819P51r665
$$ plain form
15825 -10320 -7220 -14331 -14200 -6682 -9503 -22218 -20470 -12065 -9168 -9641 1341 13488 16184 6929
15811 6929 2401 -16736 -23811 -17220 -16659 -8787 -27843 -50364 -51339 -45971 -37978 -26983 -27625 -19590
15797 -19590 -22436 -20545 -10057 -6361 4932 23530 18921 13637 13858 15211 19458 44642 40859 21597
15783 21597 11058 4802 1779 2858 14025 8750 1143 730 -10219 -10201 5359 4437 5812 7172
15769 7172 -9335 -14034 -10847 -3740 920 -8902 -6499 -8942 -7650 1580 733 1028 -11690 -24226
15755 -24226 -39191 -35993 -14094 -14604 -28978 -18434 -12944 -8635 -491 614 -9140 -5889 -2930 -8005
15741 -8005 -1631 1865 1749 7442 11431 4190 4886 -8070 -14066 -9415 -15311 -22565 -25120 -16935 -11182
15726 -11182 -3623 5474 981 -2189 -9064 2404 -3143 -5506 1137 -4253 -3113 11706 12457 2792
15712B792J495l767J721j690k472j896L636l833O729o241m770j685q984j1376
15698c0341J3720K936n064J227p75l699K117j2189O212K2783O977m076p267n582
15684a3021M175J5927j841p874q990m383J404p587k001K138m870j8844P177N181
15670c3409O607J0029j2816j4021J6402J2838m625k676L738k456r009J4076J8471
15657C149L165Q123j3573j1203O580L548m429J8O20K278J000o239j7935l293M550
15642b3641J6141Q86m541q852j91p0n696j757p56J1015l8l9J6642l690M226J7962
15626A7601n504j235R108o212o42r586j2018j1524N398k904n845K558J856N400
15612a3549L631Q330P878j167q681j2024J8568K952K482j2304j3590j2769r071
$$ plain form
15712 2792 4287 520 2241 551 -1921 -3817 -181 -4014 2715 -3526 -8296 -9981 -18965 -30341
15698 -30341 -16621 -13685 -18749 -17522 -18297 -21996 -19879 -32068 -25856 -3073 3904 -172 -7439 -13021
15684 -13021 -8846 7081 5240 -2634 -11624 -16007 -14603 -22190 -24191 -22053 -26923 -45767 -38590 -33409
15670 -33409 -26802 -16773 -29589 -43610 -27208 -14370 -18995 -21671 -17933 -20389 -29398 -15322 3149
15657 3149 6314 14437 864 -10339 -3759 -211 -4640 -4622 -4002 -1724 -724 -6963 -24898 -28191 -23641
15642 -23641 -7500 -6614 -11155 -20007 -20198 -20268 -25964 -27721 -28477 -17462 -17500 -17539 -897 -4587 -361 17601
15626 17601 12097 10862 19970 13758 13116 3530 -8488 -20012 -14614 -17518 -23363 -20805 -18949 -13549
15612 -13549 -9918 -1588 6290 5123 -3558 -15582 2986 5938 8420 -3884 -17474 -30243 -39314
15599c9314M304R108J0306R540q048l845L81J2919m375p594r608L255O535m136
15585b0572K695P562j3006p826N645J0467J59J0489l886q724K284L874Q186k091
15571d744k45j905m522J4181o685o471o29L858n919N040R674r392j3129r183o299
15556c6370O173m477R127M121p689N425Q286n370L46P876n294j0795k366L462
15542b7545P200K2923j0731N614o071k3413J688J7896o626L728J4717O872Q779
15529A5031j2919o213r303o92J2166Q06K874k197p078o219j6268n373R348P641
15515a8396J4537O409K782J275J1877l300k3889j022J8443q983k13J4196j772
15502A1944m705K212k840j2942p470j317R914J372o052m492J8399R945j1131j5884
$$ plain form
15599 -39314 -35010 -25902 -15596 -6056 -14104 -17949 -17568 -4649 -9024 -16618 -26226 -22971 -16436 -20572
15585 -20572 -17877 -10315 -23321 -31147 -25502 -15035 -14876 -4387 -8273 -16997 -14713 -10839 -2653 -4744
15571 -4744 -4989 -6894 -11416 2765 -3920 -10391 -11020 -7162 -13081 -8041 1633 -7759 -20888 -30071 -36370
15556 -36370 -30197 -34674 -25547 -21426 -29115 -23690 -15404 -20774 -20428 -12552 -17846 -28641 -31007 -27545
15542 -27545 -20345 2578 -8153 -2539 -8610 -32023 -30335 -12439 -19065 -15337 -620 6252 15031
15529 15031 2112 -4101 -13404 -14096 -1930 -1124 1750 -447 -7525 -13744 -30012 -35385 -26037 -18396
15515 -18396 -3859 2550 5332 6607 18484 15184 -8705 -9727 8716 -267 -480 13716 11944
15502 11944 7239 9451 6611 -6331 -13801 -15118 -5204 -3832 -9884 -14376 4023 13968 2837 -13047
15488a3047j0256R157M022o413l375J7491j637J4266M637j8945j0560j1587o82
15475b6929P987j0883J6454J5801l202o829j63N560M352J2987j3705L591R124
15462A4145m413n733M617q953j3845j2800O725K0618O962r76M50j414k739q095
15448e451o424j768J2278M264l899k098P079o180o427j3047n795R050K1707O115
15434I404J728o503J3L663j0532m323M045j1842K447J284k484P024p047M714L003
15419e406l623p50L698l260P510J2813k372j250O176O49j022r939m190O806m923
15404I17j0237l85l736O56p81P3m406q791J003o289J1368R908M981k220n262j408
15388a4609l287J3289r24n80M166O578R401j5916j0492o482K726J0695J0197J687
$$ plain form
15488 -13047 -23303 -14146 -10124 -16537 -19912 -2421 -4058 10208 14845 -4100 -14660 -26247 -26929
15475 -26929 -18942 -29825 -13371 2430 -772 -7601 -7764 -2204 2148 15135 1430 5021 14145
15462 14145 9732 3999 8616 -337 -14182 -26982 -20257 361 7323 6347 6797 5383 2644 -5451
15448 -5451 -11875 -13643 -1365 2899 -1000 -3098 3981 -2199 -8626 -21673 -27468 -18418 3289 9404
15434 9404 11132 4629 4642 8305 -2227 -6550 -2505 -14347 -11900 -10616 -13100 -6076 -13123 -8409 -5406
15419 -5406 -9029 -9779 -6081 -9341 -1831 10982 8610 7360 13536 14185 13163 3224 -966 5840 917
15404 917 -9320 -9705 -13441 -12785 -13566 -13493 -17899 -26690 -25687 -31976 -20608 -10700 -5719 -7939 -13201 -14609
15388 -14609 -17896 -4607 -5531 -6111 -1945 4633 14034 -1882 -12374 -18856 -16130 -5435 4762 6449
15374F449k448j0043k873q017l747j5920N337m034M704M251J5701P673m477k366
15360i810O673J640N860j998p778L279J885N569o075J119r572J111Q060j1286
15346a1323o087n218P368r290N457M414O778q478J289J2462J2778r39o256n319
15332b364J1352K843j1195j7138o365Q036o05O155P420m805q485P635l198M007
15318f707N388P669K656l453p808Q983J2281j2175j4209j6129n877J765R581J5889
15304b146j911n309j2015j839J4827J3550J0839p068P342j518j119k356j1607
15291c30O18M639O808J5530j900n975k4352q632l252j1397l146L210Q493J4194
15277e492L615j7041p217p006J978l81J0648O286K2415J4177m710M095j3629l3303
$$ plain form
15374 6449 4001 -6042 -8915 -16932 -20679 -36599 -31262 -35296 -30592 -26341 -10640 -2967 -7444 -9810
15360 -9810 -3137 -1497 4363 2365 -5413 -2134 -249 5320 -755 364 -9208 -8097 -37 -11323
15346 -11323 -17410 -22628 -15260 -24550 -19093 -14679 -7901 -16379 -15090 -2628 10150 9211 2955 -2364
15332 -2364 8988 11831 636 -16502 -22867 -14831 -15436 -9281 -1861 -6666 -15151 -7516 -10714 -6707
15318 -6707 -1319 6350 9006 5553 -2255 6728 19009 6834 -7375 -23504 -29381 -27616 -18035 -2146
15304 -2146 -4057 -9366 -21381 -23220 -8393 5157 15996 8928 16270 14752 13633 11277 -330
15291 -330 288 4927 11735 27265 25365 19390 -4962 -13594 -16846 -28243 -31389 -28179 -19686 -5492
15277 -5492 -1877 -18918 -26135 -33141 -31163 -31544 -20896 -14610 7805 21982 17272 21367 7738 -25565
15263b5565k225R434N044m686M16N876L9l162O036J1668j269j7633m235p124J0509
15248a6877K0860l41j1261K832j2780Q591O194n293M858k225q554n190N748J841
15234a1597j251R884o778J954N141K716J324j6924o862K869R294K512J2087M793
15220I162J0767j678j4474j4061j3554L375Q079K752R311R806l542O269l298r791
15206h77L300J260R536r669l954J0444l236P792n74k855r334k333n561l343M842
15191d562J0837j4439j7007q33J934j005L994M900R000L412j18n942o949K503
15177a4275K387M564p981R695m831q038P673P13j54l457J9247j873j8104K726
15163a1708N426j0295K881m841J118R81J7552k601R230J141P17M774j1175o608
$$ plain form
15263 -25565 -27790 -18356 -13312 -17998 -17582 -11706 -11667 -14829 -8793 2875 1606 -16027 -20262 -27386 -16877
15248 -16877 3983 3642 -7619 -4787 -17567 -8976 -2782 -8075 -3217 -5442 -13996 -19186 -13438 -11597
15234 -11597 -12848 -2964 -9742 -7788 -2647 69 1393 -15531 -22393 -19524 -10230 -7718 4369 9162
15220 9162 19929 18251 3777 -10284 -23838 -20463 -12384 -9632 -321 9485 5943 12212 8914 -877
15206 -877 2423 3683 13219 3550 -404 10040 6804 14596 14022 11167 1833 -500 -6061 -9404 -4562
15191 -4562 6275 -8164 -25171 -26004 -24070 -25075 -21081 -16181 -7181 -3769 -3887 -9829 -16778 -14275
15177 -14275 -11888 -7324 -15305 -5610 -10441 -18479 -10806 -10093 -10247 -13704 5543 3670 -14434 -11708
15163 -11708 -6282 -16577 -13696 -18537 -17419 -16438 1114 -1487 7743 8884 9601 14375 3200 -3408
15149c408L166l838j3800j303J0417Q122J1924Q1K97j1171j1713J622R775o752
15135f581j5481m692L174J3397R20j1486N285K8n29J9066M823m921r604m989L364
15120h226J5249n762p38J3251k070p103r281k157k029m882j185L660j5393k0655
15106d7321o102J7685J7887N963P200M99M670Q015N191M079j915p066k559K956
15092I182p754j6951N280J3270J5160p918l125j1464n953O126K87l716m915q695
15078b1186j2285L224J6207K1164L105k276j2032o485N167j823K492j296j5953
15065b1977p366K76P125Q190P961J8219J1478L217J176q633j2849j1891k49j0458
15051a5781O28j885q687J005m007o737J4586J881K840O981O144K071l980p581
$$ plain form
15149 -3408 -242 -4080 -17880 -19183 -8766 -644 11280 11361 11658 487 -11226 -9604 171 -6581
15135 -6581 -22062 -26754 -23580 -10183 -9263 -20749 -15464 -15436 -15965 3101 7924 3003 -6601 -11590 -8226
15120 -8226 7023 1261 523 13774 11704 4601 -4680 -6837 -8866 -13748 -14933 -11273 -26666 -47321
15106 -47321 -53423 -35738 -17851 -11888 -4688 -4189 481 8496 13687 17766 15851 8785 6226 9182
15092 9182 1428 -15523 -10243 3027 18187 10269 7144 -4320 -10273 -4147 -3860 -7576 -12491 -21186
15078 -21186 -33471 -30247 -14040 7124 10229 7953 -4079 -10564 -5397 -7220 -4728 -6024 -21977
15065 -21977 -29343 -29067 -21942 -13752 -5791 12428 23906 27123 28299 19666 6817 -5074 -5323 -15781
15051 -15781 -15153 -17038 -25725 -24720 -28727 -35464 -20878 -18997 -16157 -9176 -3032 -961 -4941 -12522
15037a2522P746k063n546k803O127N78O112O628m615j4496L088J4024J403l894
15023b33j0786n8J4778l046j2998M017q478L942J2515K030j8529k5258p647J4401
15009c5350Q174M772J3490N663P215J1866p617L97j209j7839j819N744K302j7357
14995b1568p318J5071R314l651k48N816K733N207M228O777P618m744j4615o878
14981b258r743J0762J3971q815j5626l803k619j461l460N414j007Q782J0897j0535
14967i501K071j0111k3056Q317Q257R498J4450N822l566O169k416r338j6577j9198
14953c9179M541J0715M83J2559P419o083j1036o554l333N324n159k250J4715J6659
14939a179Q643n794j1836n708j165r02N246J643R76J192n647j287q382O441L759
$$ plain form
15037 -12522 -4776 -6839 -12385 -15188 -9061 -8483 -2371 4257 -358 -14854 -11766 2258 3661 -233
15023 -233 -11019 -11077 3701 655 -12343 -8326 -16804 -12862 -347 1683 -16846 -42104 -49751 -35350
15009 -35350 -27176 -22404 -8914 -3251 3964 15830 8213 8610 7401 -10438 -12257 -6513 -4211 -21568
14995 -21568 -28886 -13815 -4501 -8152 -8400 -2584 149 5356 9584 16361 23979 19235 4620 -2258
14981 -2258 -12001 -1239 12732 3917 -11709 -15512 -18131 -19592 -23052 -17638 -18645 -9863 1034 -9501
14967 -9501 -7430 -17541 -40597 -32280 -24023 -14525 -75 5747 2181 8350 5934 -3404 -19981 -39179
14953 -39179 -34638 -23923 -23440 -10881 -3462 -9545 -20581 -27135 -30468 -25144 -30303 -32553 -17838 -1179
14939 -1179 7464 1670 -10166 -15874 -17039 -17941 -12695 -11052 -10076 -8884 -14531 -15818 -24200 -17759 -14000
14924a4000l596o795n191J5414P134N273l8L176k493j5519L760J1995R138o249
14910B009K852j214j3658m341O690q108L574M759P095m640l579k986L865Q136
14896D54j619o049O578k507K317l657L74r81O74J0039m686L569O44O353o870j3180
14880h547K525j2049P216K869j0216R665O421n189M162q737K782J5221J0039n456
14866A0706n929K15n30m511l844k503q164k734p70j0913r390P291L871o899J1214
14851b2890J4314m941K276p59K079Q938n148M947P744J010n634j8049J339J0716
14837d058J1861l359L87n413j0879K906J306k638p17L965L314J738n818J0379
14823B974L117l352j3130o587J747O776L593r594l67K984J0855Q256L607k376
$$ plain form
14924 -14000 -17596 -24391 -29582 -14168 -7034 -1761 -1799 1377 -1116 -16635 -12875 -880 8258 2009
14910 2009 4861 3647 -10011 -14352 -7662 -15770 -12196 -7437 -342 -4982 -8561 -11547 -7682 454
14896 454 -1165 -7214 -636 -3143 -826 -4483 -4109 -5090 -4416 5623 937 4506 5150 11503 4633 -8547
14880 -8547 -6022 -18071 -10855 -7986 -18202 -8537 -2116 -7305 -3143 -11880 -9098 6123 16162 10706
14866 10706 4777 4992 4462 -49 -3893 -6396 -14560 -17294 -18064 -28977 -38367 -31076 -27205 -34104 -22890
14851 -22890 -8576 -13517 -11241 -12000 -9921 -983 -6131 -1184 6560 7570 1936 -16113 -14774 -4058
14837 -4058 7803 4444 4831 -582 -11461 -8555 -7249 -9887 -10604 -6639 -3325 -1587 -7405 2974
14823 2974 6091 2739 -10391 -16978 -15231 -8455 -4862 -14456 -14823 -11839 -984 7272 10879 8503
14809H503J0220J606r403k022M183L232p368j672J2115j0958k1480n56J6582J5534
14795A8516q937j3829O380j503j3827j0169Q585l23N073J174J4130J744j916j1005
14781e907r997R949j7335J855Q003J238O078K226k201l145L644n698j3738l495
14767b8523P842R337l234j5816l532J6331J9797L094m845L386l679l759J5741
14754A2140j0362J596R792l663j0104K109o583p264N830L682o167m980n961Q318
14740a1617r801r383P512Q365R329j8205j5688L105M319k160n515j8924K8902
14727b9761K5572L672j0716K540l897j526l4N482o84o227J0035Q026M014k4764
14713a8268j1552P685O166P853N438l895J2407R011o228q174j4851O795J4043
$$ plain form
14809 8503 18723 20329 10926 8904 13087 16319 8951 7279 19394 8436 -13044 -13600 2982 18516
14795 18516 9579 -4250 2130 627 -13200 -23369 -14784 -15107 -10034 -8860 5270 7014 5098 -5907
14781 -5907 -15904 -5955 -23290 -21435 -13432 -12194 -6116 -3890 -6091 -9236 -5592 -11290 -25028 -28523
14767 -28523 -20681 -11344 -14578 -30394 -33926 -17595 2202 5296 451 3837 158 -3601 12140
14754 12140 1778 3374 13166 9503 -601 1508 -5075 -12339 -6509 -2827 -8994 -13974 -19935 -11617
14740 -11617 -21418 -30801 -23289 -14924 -5595 -23800 -39488 -36383 -32064 -34224 -39739 -58663 -29761
14727 -29761 -4189 -517 -11233 -8693 -12590 -14116 -14150 -8668 -9352 -15579 -5544 2482 6496 -18268
14713 -18268 -29820 -22135 -15969 -8116 -2678 -6573 5834 14845 8617 443 -14408 -7613 6430
14700F430P888r753j2618l894P496q293j0042K709R026N410J270k327k486r112
14686a8296n14M391O557J400M04J3286L570j7282j4115J133J7701J2467K7l924
14672F805j27j0181m08M651k878m392j1744p260N72J426Q761R964j867j1896N672
14657a2902J5247k317K837L240L362j7441k5632o237K3472R813N737k559k019
14644e399o267P055J3269m824p948P790J3653n767r090r202J552R096K794p957
14630a245M879j5272j8910J1853J255j609M172j2376l303J908J4396J7461j976
14617A233o404j736j586J4505m391k0500j8933N25N308k303P440M908J2693O480
14603b761N698o694j2632q745Q483P751l825J8161p824K097q823R935r72j2544
$$ plain form
14700 6430 14318 4565 -8053 -11947 -4451 -12744 -22786 -20077 -11051 -5641 -4371 -6698 -9184 -18296
14686 -18296 -18810 -14419 -7862 -6462 -6058 7228 10798 -6484 -20599 -19466 -1765 10702 10729 6805
14672 6805 6678 -3503 -3911 740 -2138 -6530 -18274 -25534 -24962 -23536 -14775 -4811 -6678 -18574 -12902
14657 -12902 2345 28 2865 6105 9467 -7974 -33606 -39843 -16371 -6558 -821 -3380 -5399
14644 -5399 -11666 -4611 8658 3834 -4114 3676 17329 11562 2472 -6730 -5178 3918 6712 -1245
14630 -1245 3634 -11638 -30548 -18695 -17440 -19049 -14877 -27253 -30556 -28648 -14252 3209 1233
14617 1233 -5171 -6907 -8493 6012 1621 -18879 -37812 -37287 -31979 -34282 -26842 -21934 -9241 -2761
14603 -2761 2937 -3757 -16389 -25134 -16651 -8900 -12725 5436 -2388 -291 -9114 821 -151 -12695
14589a2695j0445N182L413K515P193N889O386J0998J684j6638j3114O936N0j2682
14575a5328j1314L594J6790N621j1118J2772O691l480M044P71n704k0110J355
14562a5416J5757M724J1597M549r595j4471j177l793L345J3613n263r101J810
14549c421j097n653l52Q363R046L518j4374j2515J502R02o624M743J8368L521
14535E927j5126m555j239J2282p033k949J1646n245l311n449M462N134l871L801
14521e526J861L010k920r664N356m309q606L177R082J2370k102j3134K844k001
14507a0562L734J0286k276q056N073Q735J239M015r510j0137j4703l053Q042o82
14493a7855k378J0029l583n409R531J138R331N794j1966k861n122j1252l43O285
$$ plain form
14589 -12695 -23140 -17958 -14545 -12030 -4837 1052 7438 18436 20120 3482 -9632 -2696 -2646 -15328
14575 -15328 -26642 -23048 -6258 -637 -11755 1017 7708 4228 8272 9043 3339 -16771 -15416
14562 -15416 341 5065 16662 21211 11616 -2855 -4032 -7825 -4480 9133 3870 -5231 -3421
14549 -3421 -4518 -10171 -10523 -2160 6886 10404 -3970 -16485 -14983 -14081 -20705 -15962 2406 5927
14535 5927 -9199 -13754 -14993 -2711 -9744 -12693 -1047 -6292 -9603 -15052 -10590 -5456 -9327 -5526
14521 -5526 -3665 -655 -3575 -13239 -7883 -12192 -20798 -17621 -8539 3831 1729 -11405 -8561 -10562
14507 -10562 -6828 3458 1182 -6874 -1801 6934 8173 12188 2678 -7459 -22162 -25215 -17173 -17855
14493 -17855 -20233 -10204 -13787 -19196 -9665 -8527 804 6598 -5368 -8229 -13351 -24603 -24946 -18661
14479a8661J1717J0339k582j1652l234o077j479R869K62j4197O078M052K876J2742
14465E3j489J985P912k278j8534m580j39N06K06J2364l192L751k197K734J22j8938
14449b1714L137L313j1215p64N678O225q311p750K326J4137J0774m214l3366q281
14435e0025J8281J0845m733j4917j217R832J1612J3372K242k646m556J2714p510
14422f706N859O759K073K423L97J883q029j6249j595Q766J888j679o334m720R190
14407f074k527Q371R763O210l119r863j0474M988l677j635q36k208R63r774P172
14392a2720j4681p134j023O836J1854M428R110j0203n487J3261K1506K072j7432
14379C87k2644L818J578L734J1240N887j941q528p585j3186J5268J9578O46j2725
$$ plain form
14479 -18661 -6944 3395 813 -10839 -14073 -20150 -21629 -11760 -11498 -25695 -19617 -15565 -12689 53
14465 53 -1436 549 8461 6183 -12351 -16931 -17070 -16564 -16358 -3994 -7186 -3435 -5632 -2898 -2776 -21714
14449 -21714 -18577 -15264 -26479 -27243 -21565 -15340 -23651 -31401 -29075 -14938 -4164 -8378 -41744 -50025
14435 -50025 -31744 -20899 -25632 -40549 -41766 -31934 -20322 -6950 -4708 -7354 -11910 804 -6706
14422 -6706 -847 5912 7985 10408 10805 12688 4659 -11590 -13185 -4419 -2531 -4210 -10544 -15264 -6074
14407 -6074 -8601 -230 9533 15743 12624 2761 -7713 -2725 -6402 -8037 -8873 -11081 -10118 -19892 -12720
14392 -12720 -27401 -34535 -35558 -28722 -16868 -12440 -3330 -13533 -19020 -5759 15747 17819 387
14379 387 -22257 -18439 -16861 -13127 -1887 4000 2059 -6469 -14054 -27240 -11972 7606 8252 -4473
14365d473n672q783Q047J957p518M711N127J0091M126l284m963J686q180L784
14351c344M081L227J226K282k468j4553k236p589m39J356P860J0467k413j1107
14337a3650M109l849r508J624M576J8204N189l360M520j0218j5075n754N371j749
14323a9570m678l503m101R355Q587o425O67J3530O065n30l653K961p435L919J3283
14308H472M166L619r98r972j1211j611J2092n567m795l106q6J1671O564m917k398
14293A923R045R248p356j5605o725l218J11M806R643o405n642p477K308J9388
14279D044j990j5783n771J6386N067q797q792n724m380J1914O139k80J0796l88
14265B441m441M297O588R017l61p607l771m527j6062j835J4070R58l732J977L000
$$ plain form
14365 -4473 -10145 -18928 -10881 -8924 -16442 -11731 -6604 3487 7613 4329 -634 1052 -7128 -3344
14351 -3344 737 3964 5190 7472 5004 -9549 -11785 -19374 -19813 -18457 -10597 -130 -2543 -13650
14337 -13650 -9541 -13390 -22898 -21274 -16698 1506 6695 3335 7855 -2363 -17438 -23192 -17821 -19570
14323 -19570 -24248 -27751 -31852 -22497 -13910 -20335 -19668 -6138 -73 -603 -4256 -1295 -8730 -4811 8472
14308 8472 12638 16257 15259 5287 -5924 -7535 4557 -1010 -5805 -8911 -8997 2674 9238 4321 1923
14293 1923 10968 20216 12860 -2745 -9470 -12688 -12577 -7771 1872 -4533 -10175 -17652 -15344 4044
14279 4044 2054 -13729 -19500 -3114 1953 -6844 -15636 -21360 -25740 -13826 -7687 -7967 2829 2441
14265 2441 -2000 2297 8885 17902 17541 9934 6163 1636 -14426 -16261 -2191 -1233 -4965 -2988 12
14250A2M394q81n973L254j455O4o598q52J0466M592r437J326N076M296p830J884
14234B338o924n208N605M4Q37P209j4908k45M536n334m16P587j35j787O840R008
14218I047j0735j9376j620J3328R072p672K319o90p685m138k741j899m571R925
14204a7436R262J8139j193o422R987N075m399j715j759o78M783o037j6996p485
14190a6874J189L951J0607m793k792Q720K070N509k902k2932q887J9642J7265
14177I773n115p399N470K256j1224J0037J87r455j7511R302k363n279l601m630
14163b9552K566K815L088P281j494J100L72J719j2431K367l444J6128J5760O050
14149A2325J1768O893j5853j5561q6m005j6147n988J3927O920l874n456L78K533
$$ plain form
14250 12 4406 3525 -2448 806 -649 -585 -7183 -8035 2431 7023 -2414 -1088 3988 8284 454 2338
14234 2338 -4586 -9794 -4189 -4145 -3308 3901 -11007 -11252 -6716 -12050 -12466 -4879 -5014 -6801 39 9047
14218 9047 -1688 -21064 -22684 -9356 -284 -7956 -5637 -6327 -14012 -18150 -20891 -22790 -27361 -17436
14204 -17436 -8174 9965 8772 2350 12337 17412 13013 11298 9539 8861 13644 7607 -9389 -16874
14190 -16874 -15685 -11734 -1127 -5920 -8712 8 2078 7587 4685 -18247 -27134 -7492 9773
14177 9773 4658 -2741 2729 4985 -6239 3798 3985 -5470 -22981 -13679 -16042 -21321 -24922 -29552
14163 -29552 -26986 -24171 -21083 -13802 -15296 -14196 -13824 -12105 -24536 -22169 -25613 -9485 6275 12325
14149 12325 24093 30986 15133 -428 -514 -4519 -20666 -26654 -12727 -5807 -9681 -15137 -14759 -12226
14135a2226P170Q047j3137J73Q40J296P629M612O861J1209j6211n734j2231n92
14121a2294J3942j1063J510N899Q14K4676j452k0203j4920l451o700m494P921
14108a9815J72L737J6541n338j6022P863q946p973m292Q101P697j0351J7394J5588
14094D356o492l272P329j330r785o467j0800M47R2N936p57o069m749L387j1321
14079c9495k870J6397K0016J027k329n807K86r442P50J2549l045j816M873j931
14065a0837N189N385j995k582k022J4656J2372l728o231q552o957k187j978L633
14051e834L053m440o118k60l087k851K5470J1277r663j361j796o359Q334l391
14037B974q297L136M614j0022N272K793j0465l726k884k684N975N479k1J351K960
$$ plain form
14135 -12226 -5056 2991 -10146 -9973 -9133 -7837 -208 4404 11265 22474 6263 529 -11702 -12294
14121 -12294 1648 -9415 -7905 -2006 -1192 23484 22032 1829 -13091 -16542 -23242 -27736 -19815
14108 -19815 -19643 -15906 635 -4703 -20725 -12862 -21808 -29781 -34073 -25972 -18275 -28626 -11232 4356
14094 4356 -2136 -5408 1921 591 -9194 -15661 -26461 -26014 -25922 -19986 -20743 -26812 -31561 -28174 -39495
14079 -39495 -42365 -25968 -5952 -4925 -7254 -13061 -12775 -22217 -21467 -8918 -11963 -13779 -8906 -10837
14065 -10837 -5648 -263 -2258 -4840 -6862 7794 20166 16438 10207 1655 -5302 -7489 -9467 -5834
14051 -5834 -2781 -7221 -13339 -13599 -16686 -19537 5933 17210 7547 6186 4390 -1969 6365 2974
14037 2974 -5323 -2187 2427 -7595 -2323 470 -9995 -13721 -16605 -19289 -13314 -7835 -7856 -6505 -3545
14022c545j280r723k372o485R217J1273p656k608n937p13J0379N647O030M198
14008F425n780p519m618j2119N207K2305K377l91k958r965k676o273n305K4923
13994C633J5389j613L516p682P367K814R77J4216J4599Q543J4275J5334J5988
13981A07356L3841L8865N6404P4906P6965P5703O4282N5478L5107J9135o464k3402
13969F08176n3337o8177q2105p0985q3343n6160l9142l7628k5586m300p921j1618
13957F7874L357O441k294j5281j2558j5768M247J0482J634j3833o138J3592Q357
13944E0112m702n967j2928j0334L623p534M80N31M962p377P031P111m372j2779
13930G857k437Q182n799j2555j1436J4875j749k310Q539j370k66K630m727J8304
$$ plain form
14022 -3545 -4825 -14548 -16920 -23405 -14188 -2915 -10571 -13179 -19116 -19829 -9450 -3803 2227 6425
14008 6425 645 -6874 -11492 -23611 -18404 3901 6278 5887 2929 -7036 -9712 -15985 -21290 3633
13994 3633 19022 17409 20925 13243 20610 23424 24401 38617 53216 61759 76034 91368 107356
13981 107356 141197 180062 236466 311372 388337 464040 528322 583800 618907 638042 631578 608176
13969 608176 554839 486662 404557 333572 250229 194069 154927 117299 91713 87413 79492 67874
13957 67874 71231 77672 75378 60097 47539 31771 36018 46500 48134 34301 28163 41755 50112
13944 50112 45410 39443 26515 16181 19804 12270 12750 13281 18243 10866 17897 25008 20636 7857
13930 7857 5420 13602 7803 -4752 -16188 -1313 -3062 -5372 3167 1797 1531 4161 -566 17738
13916A7738K85j6611j3709j5592J7228J8242J7130K620N204j0909j2552j0196
13904a122l234P21l116J2411k653Q68M230L764l35n999P842j0099q656N75p686
13889a2489O584J4847M482j7838j1804J1802n570o250J0430Q289R517K091l916
13876A0175o961j0086M903K4817l547j7647P512J767o621k179n798j0165M461
13863i369j926L478l292j5235J5585M194j0320j301P72O835j030L789K759j0588
13849a5649M819O509n761J75L7J109j601Q062L726M831o749m262j3600P335j1175
13834b2194K865j43K853J2660R980k165K952J888l122j0805K561L457m970M663
13820D80m592r595o134J523J1062j4307j212J4073O330o302L303L913K105p725
$$ plain form
13916 17738 18023 1412 -12297 -27889 -10661 7581 24711 27331 32535 21626 9074 -1122
13904 -1122 -4356 -3635 -6751 5660 3007 3875 8105 11869 11534 5535 13377 3278 -5378 -4803 -12489
13889 -12489 -5905 8942 13424 -4414 -16218 -4416 -9986 -16236 -5806 2483 12000 14091 10175
13876 10175 3214 -6872 -1969 22848 19301 1654 9166 10933 4312 2133 -3665 -13830 -9369
13863 -9369 -11295 -7817 -11109 -26344 -10759 -6565 -16885 -18186 -17414 -10579 -11609 -7820 -5061 -15649
13849 -15649 -10830 -4321 -10082 -9907 -9870 -8761 -10362 -2300 1426 6257 -492 -4754 -18354 -11019 -22194
13834 -22194 -19329 -19472 -16619 -3959 6021 3856 6808 8696 5574 -5231 -2670 787 -4183 480
13820 480 -4112 -13707 -19841 -18318 -7256 -21563 -22775 -8702 -2372 -8674 -5371 -1458 647 -7078
13806g078k118J057L166o097O398J7626N526m926j0002L295J3106O18r203J0362
13792B1730R943n813k5033q185O480L144m441p405O492K444p633m652q323P43
13778b0509J2662J0813K467J239J839J518j3971j5470J875L907L62j1162n421
13765b9851N777l302N507J050M719J0859J749n913O272K822P337l817k1967r045
13751b7803l127j540J133J3884J6037p13N175J0589j3065K060j198Q93J0036J7531
13737B9892Q913q319n514M07q069n046M10M016q869J3037J0757M05K279m94P385
13722D1190k258j1342j4393M616J601j375P49j4351n955j6589P177R174J931j7921
13708a7746j1594l872J4708K4359p076n212M626l010J2772m089j1119P332P584
$$ plain form
13806 -7078 -9196 -8139 -4973 -11070 -4672 12954 18480 13554 3552 6847 19953 20571 11368 21730
13792 21730 31673 25860 827 -7358 -878 2266 -2175 -9580 -3088 -644 -8277 -12929 -21252 -20509
13778 -20509 -7847 2966 5433 6672 8511 10029 -3942 -19412 -17537 -13630 -13268 -24430 -29851
13765 -29851 -24074 -27376 -21869 -20819 -16100 -5241 -3492 -9405 -3133 -311 7026 3209 -18758 -27803
13751 -27803 -30930 -32470 -31337 -17453 -1416 -2129 3046 13635 570 2630 1432 2325 12361 29892
13737 29892 38805 30486 24972 25379 17310 12264 12674 16690 7821 20858 31615 32020 34299 33805 41190
13722 41190 38932 27590 13197 17813 19414 18039 18788 4437 -1518 -18107 -10930 -1756 175 -17746
13708 -17746 -29340 -33212 -18504 5855 -1221 -6433 -1807 -4817 7955 3866 -7253 79 7663
13695G663M148J024n156M317M063j5179r714J6009N83J1837j2610p862j700J0052
13681G475N492Q221l934q886j6032o872l733j0456J796J0892J7846K467J974j3434
13667g184P185j41j2159Q940J7823Q780n684L030J2479p57j4174j3315k811q892
13653f880J4042O787j2053k827R639R522J275j2494P505K664O454o78p207q107
13639G642Q193r613J581N722r198n840p3N437p824n984J2170k702N693J999p594
13624c91j312p861j3780J1837K3727L745l769m95n261k925k809O304j510R963
13610A5463K362r38q426j1443O74J0739j1344n081M46n468k084J2447n523q639
13596a6815l1Q218Q632p669J433r653k383P727j100P563M946k40M919M289j0674
$$ plain form
13695 7663 11811 12835 7679 11996 16059 880 -8834 7175 7758 19595 6985 -877 -2577 7475
13681 7475 12967 21188 17254 8368 -7664 -14536 -18269 -28725 -26929 -16037 1809 4276 6250 -7184
13667 -7184 1 -140 -12299 -3359 14464 23244 17560 20590 33069 32312 18138 4823 2012 -6880
13653 -6880 7162 13949 1896 -931 8708 18230 19505 7011 14516 17180 23634 22956 15749 7642
13639 7642 15835 6222 7803 13525 4327 -1513 -1586 3851 -3973 -9957 2213 -489 5204 7203 -391
13624 -391 -1703 -9564 -23344 -11507 12220 15965 12196 11701 6440 3515 706 7010 5500 15463
13610 15463 17825 16887 8461 -2982 -2308 8431 -2913 -7994 -7548 -13016 -15100 -2653 -8176 -16815
13596 -16815 -16846 -8628 4 -7665 -6232 -15885 -18268 -10541 -11641 -4078 868 628 5547 9836 -838
13581h38Q40p454j5538L99R738R214J1775R795j2539n739k775n263KL396N192
13566B05N666k01m789J158J6864Q603K007k6104j7588L736M355M583r08L230p171
13551f354q860j0975P46N687P388K942l025j756K3813N555j5175j6699P096M210
13537e407n429o302n264k566O748n577M229K941P337J67n41O99l376K153K145
13522h043M552J5211o301M36P232p016j4106k690R999o028k815m754P642l576
13508a0257J1626J2074J1219j5802o606r181k903Q586K735l254L135N22J89j1985
13494i902p796p597L351J1812j6496j9030J9081J1088K949r848l540P834n32M944
13480a3682J5196P485J919j2154k47j6375l667N885M999K2556M531o868p74M01
$$ plain form
13581 -838 2 -7452 -22990 -22591 -12853 -3639 8136 17931 5392 -347 -3122 -8385 -8383 -4987 205
13566 205 5871 5670 881 2039 18903 27506 29513 3409 -14179 -10443 -6088 -1505 -2413 817 -6354
13551 -6354 -15214 -26189 -25443 -19756 -12368 -9426 -12451 -14207 9606 15161 -14 -16713 -9617 -5407
13537 -5407 -10836 -17138 -22402 -24968 -18220 -23797 -19568 -16627 -9290 -9123 -9664 -8965 -12341 -10188 -8043
13522 -8043 -3491 11720 5419 5855 13087 6071 -8035 -10725 -726 -6754 -9569 -14323 -6681 -10257
13508 -10257 1369 13443 24662 8860 2254 -6927 -9830 -1244 1491 -1763 1372 1894 2083 -9902
13494 -9902 -17698 -25295 -21944 -10132 -26628 -45658 -26577 -15489 -12540 -22388 -25928 -18094 -18626 -13682
13480 -13682 1514 8999 10918 -1236 -1483 -17858 -21525 -15640 -10641 11915 16446 9578 8804 9205
13466I205j0509J92m394n936n311j119L820o764o914R139J9593J1970k193o609
13452D170j6756n001J1344J5110P901J293j3117n092K115n701n879o302R325o595
13438a3185o690m727P810j701l661r204J250N023O894J3645J6865K466p438m626
13424B721m793l958J310J457j6225K073J2826j5408J1826J2204K192J0389q119
13411H495r729N027o0j210j3413j0979j510N671K571m805m970Q997N725p72O989
13396c973o636j6047l077O118J4437R050J5070L071j3746j1520J794j0429j4477
13383c0365j370m5J0288J017K638J0696j93l821J4268q028p98Q323M622J0344
13369A7576k731q502k4251j4404L987R921j1597R202R303O779P292k909j0987
$$ plain form
13466 9205 -1304 -1112 -5506 -11442 -16753 -17872 -14052 -20816 -27730 -18591 1002 12972 10779 4170
13452 4170 -12586 -17587 -6243 8867 16768 18061 4944 -148 1967 -3734 -9613 -15915 -6590 -13185
13438 -13185 -19875 -24602 -16792 -18493 -22154 -31358 -30108 -25085 -18191 -4546 12319 14785 7347 2721
13424 2721 -2072 -6030 -4720 -3263 -19488 -17415 -4589 -19997 -8171 4033 6225 16614 8495
13411 8495 -1234 3793 3733 2523 -10890 -21869 -23379 -17708 -15137 -19942 -24912 -15915 -10190 -10962 -3973
13396 -3973 -10609 -26656 -29733 -23615 -9178 -128 14942 18013 4267 -7253 -5459 -15888 -30365
13383 -30365 -31735 -31780 -21492 -20475 -17837 -7141 -7334 -11155 3113 -4915 -5713 2610 7232 17576
13369 17576 14845 6343 -17908 -32312 -28325 -18404 -30001 -20799 -11496 -4717 2575 -334 -11321
13356a1321k398J348N206n73p115M675O254r440r715N685J3636M185k509r078
13342a1160j8003O008K2093P029J062M64j8797q973J2601o757j4870p774K0742
13329a6335Q687N808J0308o28j385o442J4009Q151n369k258M100M407n060j2818
13315E175j1572j1564O137J7751m515p73N241p383j330r292j0761N782j63o042
13301b3309k0239J3394J0191Q679M812K506M236j3741K051J1468O975k569m23
13288D031n408J308K920o711K348J460j509k522j1889L800N800J3718l602p903
13274d159N695Q698P681k5341j1215J0812J2824r451q138M947l251P032K958K393
13260A485k602o846K570L253M326M354J669j8120j539N166k258n080J7547J5858
$$ plain form
13356 -11321 -13719 -12371 -7165 -7738 -14853 -10178 -3924 -13364 -23079 -17394 -3758 427 -2082 -11160
13342 -11160 -29163 -23155 -1062 5967 7029 7493 -11304 -20277 -7676 -14433 -29303 -37077 -16335
13329 -16335 -7648 -1840 8468 7840 6455 13 14022 22173 16804 14546 18646 23053 17993 5175
13315 5175 -6397 -17961 -11824 5927 1412 639 5880 -1503 -2833 -12125 -22886 -17104 -17267 -23309
13301 -23309 -43548 -30154 -19963 -11284 -6472 -3966 270 -13471 -11420 48 7023 4454 4031
13288 4031 -1377 -69 2851 -3860 -1512 -52 -1561 -4083 -15972 -12172 -6372 7346 3744 -4159
13274 -4159 1536 10234 17915 -7426 -18641 -7829 4995 -4456 -12594 -7647 -10898 -3866 -908 1485
13260 1485 -1117 -7963 -5393 -2140 2186 6540 8209 -9911 -11450 -6284 -8542 -13622 3925 19783
13246A9783j636j3338J233J0560j2183k4929Q046J2776Q409p625M188j5896P130
13233c482O500J185N238k159j3000K752K1990Q828q256r093j773r028l105j3519
13219a6922n353o857J993J9131J5473O408N385J08J477L932P084j8245Q203j9966
13205A851j3333n866K3339L014o741j472N602r984j1980K910J0023n963j0402
13192a9002J3447L873j2060l519J256N597M280K848N855j949p60N243L688N779
13178A4576l066j9400p151m120j2864k715R190K2387R202L422j9362j0335J4264
13165e972J187j6718L860J7711J006P202O284m244j0588K223r66p867o106j8307
13151c1295l912O44R52J4035K0370L023L909K697j1828j198n99n146L035J2499
$$ plain form
13246 19783 18147 4809 6042 16602 4419 -20510 -12464 312 8721 1096 5284 -10612 -3482
13233 -3482 3018 4203 9441 7282 -5718 -2966 19024 27852 19596 10503 8730 -298 -3403 -16922
13219 -16922 -22275 -29132 -27139 -8008 7465 13873 19258 19366 20843 24775 31859 13614 21817 1851
13205 1851 -11482 -17348 5991 9005 2264 792 6394 -3590 -15570 -12660 -2637 -8600 -19002
13192 -19002 -5555 -1682 -13742 -17261 -16005 -10408 -6128 -3280 2575 626 -134 5109 8797 14576
13178 14576 11510 -7890 -15041 -19161 -32025 -34740 -25550 -3163 6039 9461 -9901 -20236 -5972
13165 -5972 -4785 -21503 -17643 68 1074 8276 14560 10316 -272 1951 985 -6882 -12988 -31295
13151 -31295 -35207 -34563 -33611 -19576 794 3817 7726 10423 -1405 -2603 -3202 -8348 -5313 7186
13137G186K014L489J2719p846k7527l659K037Q104k2073O049J3909J882K451J131
13123a34l129J140M76q663P37o382m536M650K165P546K4306M189k90j3010j9085
13108a0020l23K719K812m837m949P74N541n576N672O54J4203N338k370l704j0070
13093d136J834J5467r244L41J6661k031k97p605j5086N38J559k050J0116P814
13079A3881o345q376j4061j644J5540J3901K460j1662j4066m614O845J1392P857
13066A1108J869J567j849o028K669K990j1524l614J235p803q473J5594L184n811
13052d886J2542m746J722J803j309m117K233L847l72p521r569J312K0460N798
13038A7197l326k535o684L611p486j0050L562J0956L8q29J2180l526k7928k2878
$$ plain form
13137 7186 9200 12689 25408 17562 -9965 -13624 -11587 -3483 -25556 -19507 -5598 -3716 -1265 -134
13123 -134 -3263 -2123 -1647 -10310 -9573 -15955 -20491 -15841 -13676 -6130 18176 22365 22075 9065 -10020
13108 -10020 -10343 -7624 -4812 -9649 -14598 -13824 -8283 -13859 -8187 -7533 6670 12008 9638 5934 -4136
13093 -4136 -2302 13165 3921 4262 20923 18892 18595 10990 -4096 -3558 -1999 -4049 6067 13881
13079 13881 7536 -840 -14901 -16545 -1005 12896 15356 3694 -10372 -14986 -8141 3251 11108
13066 11108 12977 14544 12695 6667 9336 12326 802 -2812 -1577 -9380 -17853 -2259 925 -4886
13052 -4886 7656 2910 4632 6435 5126 1009 3242 7089 6717 -804 -10373 -9061 11399 17197
13038 17197 13871 11336 4652 8263 777 -9273 -5711 5245 5283 4454 16634 13108 -14820 -37698
13024c7698K3504Q112j118K78k375R323n498q348r86R184j678j2226p566L603
13010b3489J0602K62l306M042J1097k193J087P232p064o916J0358J319L16M323
12996G670r620K226k957O951l679N068P755j1471j041k88P338R932K88J0845r36
12981B8081k757N021m773k593L674J0953O187j0635j686J0178P129J0255N970
12968F5004n280J3548j593J4287K4173K1230K0896M1392N3214P3232Q7977R5341
12956E03421R7534R4511Q0326N6612K0130j3330m6959q5372r5924q7031q4708
12945D39210o9377o3078n5854l5874k6010j6220q196r898j6946p898j1174M526
12933A23211j0642j907r087l020N388J3124M599O855L111N546P667Q380j2210
$$ plain form
13024 -37698 -14194 -6082 -7200 -6922 -9297 26 -5472 -13820 -14806 -5622 -7300 -19526 -27092 -23489
13010 -23489 -12887 -12625 -15931 -11889 -792 -2985 -1898 5334 -1730 -8646 1712 3031 3347 7670
12996 7670 -1950 276 -2681 4270 591 5659 13414 1943 902 614 7952 17884 18172 29017 28081
12981 28081 25324 30345 25572 22979 26653 37606 43793 33158 31472 41650 48779 59034 65004
12968 65004 59724 73272 71679 85966 110139 131369 152265 193657 246871 320103 408080 503421
12956 503421 600955 695466 775792 832404 852534 839204 792245 706873 610949 523918 439210
12945 439210 369833 306755 250901 215027 189017 172797 164601 154703 137757 129859 118685 123211
12933 123211 112569 110662 101575 98555 103943 117067 121666 128521 131632 137178 144845 153225 141015
12920A41015j2902j6217k578K142j250k147k951j6562k0151M3j8591j6421K594
12907C6024N44J236R330Q076K474m987j3452Q992P472n78n633M356j552L976r310
12892D6968k6043l985J1869L456j1616M344Q463n268J390O873k430O994P440k586
12878D5869j3453j0461Q484R322J2277q03q245j957k243r446j9437l516K708j24
12864H975l324j651J43r809n91r993p103J2929K692P534J3649J6994J1276q989
12850C2732L091m616j0722P589R881p19j6672N8N960O611p981m750k842J03O175
12835B3898n03m222K512n414m145n190K130p180j7767j280P948L434R288J0170
12821A3679Q214m44j0519m2O302l747j205j022m263J777J966l94o031m355Q08
$$ plain form
12920 141015 128113 111896 109318 111460 110210 108063 105112 88550 68399 68442 49851 33430 36024
12907 36024 36568 37804 47134 55210 57684 52697 39245 48237 55709 55131 49498 53854 52302 56278 46968
12892 46968 20925 16940 28809 32265 20649 24993 33456 28188 29578 36451 34021 41015 48455 45869
12878 45869 32416 21955 30439 39761 52038 51235 42990 41033 38790 29344 9907 6391 9099 8975
12864 8975 5651 4000 4143 -5666 -6257 -16250 -23353 -10424 -7732 -198 13451 30445 41721 32732
12850 32732 35823 31207 20485 28074 37955 37236 20564 20622 26582 33193 25212 20462 17620 17723 23898
12835 23898 23395 19173 21685 16271 12126 6936 9066 1886 -15881 -17161 -9213 -5779 3509 13679
12821 13679 21893 21449 10930 10888 17190 13443 12238 11216 6953 8730 10696 10302 4271 -84 724
12806G24l458Q260J0333j3274j1198P520j845o258J4386J2360P44l25J8038N07
12792C6514R183J9876J6558J8270J2843J817o939j0997P379m066J850J403J377
12779A05068j7480k6003j3091P670L469j2810n577q35M75J282J0581N518l254
12766E5013J4492l027l543l885L095j52J391P469K888K91j6109k742k272p328
12752D5581M288l696P380k854j2425K370n978j0635m155M339Q93k75o677M227
12738B2383l665j5074M313n242o144m458P636L1336P399r655J033m32K6962K7825
12724H4217R184j9503j5469o28p164N23k266M248k482K454o463O735Q978Q553
12710G0917j535j5952M673K591n229n536J936L252K153Q682M970l945K50L416
$$ plain form
12806 724 -2734 5526 15859 2585 -8613 -1093 -2938 -9196 5190 17550 18294 17969 36007 36514
12792 36514 45697 65573 82131 100401 113244 115061 108122 97125 104504 100438 102288 103691 105068
12779 105068 87588 61585 48494 56164 59633 46823 41246 40411 40886 42168 52749 58267 55013
12766 55013 69505 66478 62935 59050 62145 61993 63384 70853 73741 74032 57923 55181 52909 45581
12752 45581 49869 46173 53553 50699 38274 40644 34666 24031 19876 24215 25108 24833 18156 22383
12738 22383 18718 3644 7957 2715 -3429 -7887 -251 31085 38484 28829 29862 29430 56392 84217
12724 84217 93401 73898 58429 57801 50637 51160 48894 53142 50660 53114 46651 53386 62364 70917
12710 70917 69382 53430 58103 60694 55465 49929 51865 55117 57270 65952 70922 66977 67227 70643
12696G0643J640K388J0186O885j6284n054Q058p953k76o968m399j0859J0340J4566
12682G2913q633j465j3803j311j0586K432J4380k372l628J9399L656j659N510
12669G4833n035J1674K4935J1900K4965K7835K0986K4452J3498J6904J7464J2439
12657B76850J0708N631j4584o530k188j1480r623p835j6525n707m597m319k185
12644B07616P398J4141m401Q172J2220j046o746j0223r220J987K630Q362P001
12631B37891j2745o906j0728j6421J212J5351L111K2023J8802J9228L728l211
12619B71335j2478j456J4442J0187J4497J1581J865m858J0901M441J6497J4777
12607C51731Q205J350O602J8780K0219J9969o253q190M488J6183K1398R048l608
$$ plain form
12696 70643 72283 74671 84857 91742 75458 70404 78462 70509 70233 63265 58866 48007 58347 72913
12682 72913 64280 62815 49012 47701 37115 39547 53927 51555 47927 67326 70982 69323 74833
12669 74833 69798 81472 106407 118307 143272 171107 192093 216545 230043 246947 264411 276850
12657 276850 287558 293189 278605 272075 269887 258407 248784 240949 224424 218717 214120 209801 207616
12644 207616 215014 229155 224754 232926 245146 244100 237354 227131 217911 219898 222528 230890 237891
12631 237891 225146 218240 207512 191091 192303 207654 210765 232788 251590 270818 274546 271335
12619 271335 258857 257401 271843 282030 296527 308108 309973 305115 316016 320457 336954 351731
12607 351731 359936 361286 367888 386668 406887 426856 420603 412413 416901 433084 454482 463530 459922
12594D59922J2620J1499O03J6538J0825N153K4684K1782J1607J3149K6936L6834
12582F52152L5678K4365K8194L2996L4154L7840K7941L5539N1840O4217N9117
12571A084033P5307P7538O8752P1554Q1787R6831J16936J17754J13270J23217
12561B026979J36710J67085K07663K41507L07927L75264M62932N81917O97814
12552E205798Q14005R48850J063414J177165J281241J422422J667136K087521
12544A5667552K870851M168249O133100Q733787J1774732J4926657J7696318J9402986
12536A01374232J9323272J7258211J3335734Q031087J721542m909814j0993922
12529A45140342j5431480j7699936j8060805j6976032j4818150j1902218q790772
$$ plain form
12594 459922 472542 484041 484644 501182 512007 517160 541844 563626 575233 588382 615318 652152
12582 652152 687830 712195 740389 773385 807539 845379 873320 908859 960699 1024916 1084033
12571 1084033 1159340 1236878 1305630 1377184 1458971 1555802 1672738 1790492 1903762 2026979
12561 2026979 2163689 2330774 2538437 2779944 3087871 3463135 3926067 4507984 5205798
12552 5205798 6019803 6968653 8032067 9209232 10490473 11912895 13580031 15667552
12544 15667552 18538403 22706652 28839752 37573539 49348271 64274928 81971246 101374232
12536 101374232 120697504 137955715 151291449 159322536 161044078 156134264 145140342
12529 145140342 129708862 112008926 93948121 76972089 62153939 50251721 41460949
12522D1460949o070024m149861k956845k241323j825053j623072j480015j411723
12514A9703033j343367j245520j172247j068065r50592q33663p37532o43283n74317
12505A1134447n24579m90587m55891m21381l92046l45876l18051l06673k78467
12496G600896k55385k45298k36088k21078k01348k14344k22682k10941k07300
12487E586432j99509j87990j88882j79131j52370j47240j47209j53708j36750
12478D093643j15987j16601j19785j28182j27993j09814j05339r8183r5243p9582
12468B996934r7532r7269q8788q5692q3094p6683o4406m6764n1135n9243o5372
12457B180956n8139n3923o4541o4425l9946m0259m0328n2603n1783m8455k6250
$$ plain form
12522 41460949 35390925 31241064 28284219 26042896 24217843 22594771 21114756 19703033
12514 19703033 18359666 17114146 15941899 14873834 13923242 13089579 12352047 11708764 11134447
12505 11134447 10609868 10119281 9663390 9242009 8849963 8504087 8186036 7879363 7600896
12496 7600896 7345511 7100213 6864125 6643047 6441699 6227355 6004673 5793732 5586432
12487 5586432 5386923 5198933 5010051 4830920 4678550 4531310 4384101 4230393 4093643
12478 4093643 3977656 3861055 3741270 3613088 3485095 3375281 3269942 3171759 3076516 2996934
12468 2996934 2899402 2802133 2713345 2627653 2544559 2467876 2403470 2356706 2305571 2246328 2180956
12457 2180956 2122817 2068894 2004353 1939928 1899982 1859723 1819395 1766792 1715009 1666554 1640304
12446A640304k1198l4793m7722m1229l7904k8103m4495m7743m9089j9784j7441
12435A250803m5198m6997j2648j2256l3021j5740k8426j9286k5242j0003r895
12424I92091j3529j4878j8128l0413k1195j3679k2979j8834o757j4850j8987k1380
12412G76482l4348j9925o667o700j5688j7019L96p263k6659j6197k3427l2247
12400E70738k8654k1713k9598k8969k9126j5592k4721j4176N837m303j7265M76
12388C62934k439j1529j5391j0460o789j3195k425j725j3929j1583L218j4094
12376B62593j2959j4140m592q440k65R226R86o91k399P41o28q226L214J697j393
12361B24724K365n420l784O395J9934O594J598J5697o454k1009l895J8143J4096
$$ plain form
12446 1640304 1619106 1584313 1536591 1495362 1457458 1429355 1384860 1337117 1288028 1268244 1250803
12435 1250803 1205605 1158608 1145960 1133704 1100683 1084943 1056517 1037231 1011989 1001986 992091
12424 992091 978562 963684 945556 915143 893948 880269 857290 838456 831699 816849 797862 776482
12412 776482 742134 722209 715542 708842 693154 676135 676531 669268 642609 626412 602985 570738
12400 570738 542084 520371 490773 461804 432678 417086 392365 378189 384026 379723 362458 362934
12388 362934 360495 348966 333575 323115 316326 303131 300706 298981 285052 273469 276687 262593
12376 262593 249634 235494 230902 222462 222197 231423 232409 231718 229319 230060 229432 221206 224420 226117 224724
12361 224724 227089 221669 217885 224280 244214 250808 252406 268103 261649 240640 236745 254888 268984
12348B68984o625p732Q588q174k2325j1524j1316J089J8544m511j4284N910m472
12335B12152j0826j1K198k923o293L794J25j67j1418k282j5138j4708R315Q546
12321A72364l390n692n182p957J5032j0575j4788L141L216r271k603O091n823
12308A34563k0589k0100q24O835n510R889n427J625K0250J486k449L445n731j538
12294A15925N678l682J6933J1566O957M745m479j862k913J244m333k1881q157
12281A15741p204j340L525k2398j2738N218j312M893m242p129J7553P932k934
12268I5565M608k0098j9875p29k592q55J3690J2020K183k732M669j054K68n967
12254G9101j3395O210J2722Q36j9303j0915N829p36m120K319J496J973n793q871
$$ plain form
12348 268984 262359 254627 263215 255041 232716 221192 209876 210965 229509 224998 210714 216624 212152
12335 212152 201326 201315 203513 200590 194297 198091 198216 198049 186631 184349 169211 154503 163818 172364
12321 172364 168974 163282 158100 150143 165175 154600 139812 142953 146169 136898 134295 140386 134563
12308 134563 113974 93874 93050 99885 94375 104264 98837 100462 120712 122198 119749 123194 117463 115925
12294 115925 121603 117921 134854 146420 153377 158122 153643 151781 148868 150112 145779 123898 115741
12281 115741 108537 107197 110722 88324 75586 80804 79492 84385 80143 73014 90567 98499 95565
12268 95565 100173 80075 60200 59471 56879 56024 69714 81734 83917 81185 85854 84800 85068 79101
12254 79101 65706 71916 84638 85474 66171 55256 61085 60349 56229 58548 60044 62017 56224 47353
12240D7353q853Q195P140M191J914q435j6615j128L252K975R685M120r11j4319
12226C8564q835L114k264j056n693l288j0604K991J7761J5453p270j1279k3378
12213D216Q232J3117J2373o910j2173M575L567M786R435m847J4977R750o447J906
12199E6557j0508j6921k917j225k673K365j733o758j227j2654J6570J963j7886
12186B953l38M231R801n107J1385l255J779j876j6426P544Q309O7r891J4934J4908
12171C9018m946l008J0248R421O141L718Q458J4809K8144M3472O8264O4277O0182
12158C48198L8998J84j8764l8035m3354k3839J8654L7401N3991N6159L7812R124
12146D76529q402k8700l2138j4071j5954k125J0221J6798J1097j0734j2806j7076
$$ plain form
12240 47353 38500 46695 53835 58026 59940 51505 34890 33762 37014 39989 49674 53794 52883 38564
12226 38564 29729 32843 30579 29523 23830 20542 9938 12929 30690 46143 38873 27594 4216
12213 4216 12448 25565 37938 31028 18855 23430 26997 31783 41218 36371 51348 61098 54651 56557
12199 56557 46049 29128 26211 24986 22313 24678 22945 16187 14960 2306 18876 20839 2953
12186 2953 2615 6846 16647 11540 22925 19670 21449 19573 3147 10691 19000 19067 9176 24110 39018
12171 39018 34072 31064 41312 50733 56874 60592 69050 83859 112003 155475 223739 288016 348198
12158 348198 387196 387380 368616 330581 287227 263388 282042 319443 373434 429593 467405 476529
12146 476529 468127 439427 407289 393218 377264 375139 385360 402158 413255 402521 389715 372639
12134C72639k1301l4785l1787k8519k4483j1784j5400j5771j6006k8973j5317
12123A28513R473J0755R405J1843J3329o412R930M2095M3155O3214P1004Q9467
12111D95771R0630R2300R2347P8174M3815J1296m1296n4155o9017p8176j02945
12100E58744r9565q1906o4168m4664l3023l2000k2424j2981m699j732M29l678
12088A58333r386m732j5562k5406q029j1233j6308r369K887n67k663j3256O135
12075E0844J3315K388J1651N879m959o066r313n743N749L400l914q498r734J5336
12061F0335L359l055j5892J126j2226J0818L632o352L890n825j3316r41J2597
12048C8150P739J2064m506k855k237q765j0962N87J354q064K270L489J4647J4386
$$ plain form
12134 372639 351338 316553 284766 256247 231764 219980 204580 188809 172803 143830 128513
12123 128513 137986 148741 158146 169989 183318 176906 186836 228931 272086 335300 406304 495771
12111 495771 586401 678701 771048 849222 893037 904333 863037 808882 739865 661689 558744
12100 558744 459179 377273 313105 268441 235418 203418 180994 168013 163314 161582 162011 158333
12088 158333 148947 144215 128653 103247 95218 83985 67677 58308 61195 60628 57965 44709 50844
12075 50844 64159 66547 78198 84077 79118 73052 63739 57996 63745 67145 63231 54733 44999 60335
12061 60335 63694 60639 44747 45873 33647 44465 48097 41745 45635 39810 26494 25553 38150
12048 38150 45889 57953 53447 50592 48355 39590 28628 29215 30569 22505 24775 28264 42911 57297
12034E7297J2160P145j4310q776O551J4063Q176J994m631M58O856J1482M1290
12021A39755J5584O202J8065K4121L7356L7233K5017L9440P7946R6589J34279
12010F51587J83818K32655K87853L31531L64017L75030L33905K42149J51400M6646
12000C200591q2305j73305k68374l36085l42913l37856k94151k56363j86626j40420
11990G82193j01955o5311n0550m3527l0811l4573k6339k2023l0847m2706k8338
11979C05213k5643j9818k910J2019r813l2400j2007j1615k498p239j705r043k96
11966A82245o46m784o656j7253j8112j2131l767n383J063q82q111m129j0041P879
11952I9292J0866j111j7257q662p690M0Q637M210N868j3940j5888J084p066n55
$$ plain form
12034 57297 69457 76602 62292 53516 60067 74130 82306 84300 79669 80127 86983 98465 139755
12021 139755 155339 161541 179606 203727 241083 278316 303333 342773 420719 517308 651587
12010 651587 835405 1068060 1355913 1687444 2051461 2426491 2760396 3002545 3153945 3200591
12000 3200591 3118286 2944981 2676607 2340522 1997609 1659753 1365602 1109239 922613 782193
11990 782193 680238 614927 564377 520850 490039 455466 429127 407104 376257 333551 305213
11979 305213 279570 259752 256842 268861 259048 226648 214641 203026 200528 193289 191584 182541 182245
11966 182245 181599 176815 170159 152906 134794 122663 118896 113513 114576 113694 105583 101454 91413 99292
11952 99292 110158 109047 91790 83128 75438 75478 84115 88325 94193 80253 64365 65449 58383 57828
11938E7828j516O963J4242j885l513p577j6093j1987M852K43j2505j1571q30P316
11924B3967R887R468o03n895O747K15M790R933p396j1617Q396J370j2065k191
11910C5006K0868j3721J01k44k9156j4796l420J81P025M527J5964J2771N924o512
11896C4518J454j0171j0066j199q067M431O705N501J5474q108j1745K732j3509
11883G950Q7N346K690l297j3236n925J5098J7210P089J2817k767q572j7166N466
11869B2790l862L881R12l896k840o668M682j1498q394o64O436O383q130l357m9
11854d274R70p700k476J4988L346qJ5708O201k0550q227L435P815o156j0933P796
11839f5J0936j204M085j7070j651R670L311l420q38j554O239M575o848m702K68
$$ plain form
11938 57828 56312 63275 77517 75632 72119 64542 48449 36462 41314 41557 29052 17481 16651 23967
11924 23967 33854 43322 42719 36824 43571 43786 48576 58509 51113 39496 47892 49262 37197 35006
11910 35006 55874 42153 42254 42010 12854 -1942 -5362 -5181 1844 6371 22335 35106 41030 34518
11896 34518 35972 25801 15735 14536 6469 10900 17605 23106 38580 30472 18727 21459 7950
11883 7950 8037 13383 16073 12776 -460 -6385 8713 25923 33012 45829 43062 34490 17324 22790
11869 22790 18928 22809 23721 19825 16985 10317 14999 3501 -4893 -5557 879 7262 -868 -4225 -4274
11854 -4274 -3304 -11004 -13480 1508 4854 4846 20554 26755 6205 -2022 1413 9228 3072 -7861 -65
11839 -65 10871 9667 13752 -3318 -4969 4701 8012 4592 3754 2200 8439 13014 6166 1464 1732
11824A732N808j014J1012K277J016O296k185k3907l204R331J3935m359O311L859
11810B6908k033j7829j8827m972J343P952L169J2423k775n821j4394l375J6431
11797a800N404J2474p968j2151j337l064J84n704P027P368n182o47j4614j2512
11783c2522J541Q357R710J2116J1278J0o644N226Q353o168q281j5954o690m486
11769b4154m060O81K0625L145N616O526m816K177Q619O359O179o413j4629j0774
11755d919J723q168l859L705J7706J3460j1080j3448r709o027K66O671j409Q336
11741f752N174q630O452M044J153J699j6086j6783Q44M674P316O522L373K426
11727d574J1304Q689l394q514m234L030J1414n02K221n318q069k380L496l452
$$ plain form
11824 1732 7540 6526 17538 19815 20831 27127 24942 1035 -2169 7162 21097 16738 23049 26908
11810 26908 24875 7046 -11781 -16753 -15410 -7458 -4289 8134 5359 -462 -14856 -18231 -1800
11797 -1800 3604 16078 8110 -4041 -5378 -8442 -8258 -13962 -6935 433 -4749 -5396 -20010 -32522
11783 -32522 -30981 -22624 -12914 -798 10480 10490 3846 9072 17425 11257 2976 -12978 -19668 -24154
11769 -24154 -28214 -27533 -6908 -3763 1853 8379 3563 5740 14359 20718 26897 20484 5855 -4919
11755 -4919 -3196 -11364 -15223 -11518 6188 19648 8568 -4880 -14589 -20616 -20350 -13679 -15088 -6752
11741 -6752 -1578 -10208 -3756 288 1441 3140 -12946 -29729 -28885 -24211 -16895 -10373 -7000 -4574
11727 -4574 6730 15419 12025 3511 -723 2307 13721 13219 15440 10122 2053 -327 3169 -283
11713b83L09j1836k678q215j780J746J508n108J4924J8577j729j2503P90j783
11699h061j082K622l245P591N956K353J8162L456j9987j3579J471j344m876l581
11685a4144R483P16j0113J107J620n291M100J1874l082m51j126M832r9L016m737
11670b295p120r928j2837n454O340J4360Q87Q800O661N336P897L07n344k4358
11656a6748l004M382M548O975N676Q136j3815p554p57R842Q004N344J8k0099K78
11641h774Q598n679j287J955r128J661O213P495Q0j300k1703M721J1968j1162
11627a6342j0960J6844R098O991l102k894J6020J0268j6670j5252j929J0401k36
11614B237L190q99m479r646q179J827m446Q632r37n167j5908J6994J7844Q204
$$ plain form
11713 -283 26 -11810 -14488 -22703 -24483 -22737 -21229 -26337 -11413 7164 5435 -7068 -6278 -8061
11699 -8061 -9143 -6521 -9766 -2175 3781 6134 24296 27752 7765 -5814 -4343 -5687 -10563 -14144
11685 -14144 -4661 -3945 -14058 -12951 -11331 -16622 -12522 -648 -3730 -4181 -5307 -475 -574 2442 -2295
11670 -2295 -9415 -19343 -32180 -37634 -31294 -16934 -16047 -7247 -586 4750 12647 12954 7610 -16748
11656 -16748 -19752 -15370 -10822 -3847 1829 9965 -3850 -11404 -12161 -2319 5685 11029 11047 -9052 -8774
11641 -8774 -176 -5855 -7142 -5187 -14315 -12654 -6441 1054 1134 -166 -21869 -17148 -5180 -16342
11627 -16342 -27302 -10458 -1360 5631 2529 -365 15655 25923 9253 -5999 -7928 2473 2237
11614 2237 5427 4528 49 -9597 -17776 -15949 -20395 -11763 -12700 -17867 -33775 -16781 1063 9267
11600I267o772j067J429Q245N963l587m737j2961m235j3316P107J0944J2340M109
11586A2729J2571j4348j8623L457P816J3495Q204P415J0226k1223J225P141l301
11573B6784m886k767l755j6143j268J1332r915j1733R487j491j1214n60l641Q462
11559a1308k902q00p56J3824L823K87J8535J0366m65j3048r449P787J050q667
11545H277r722n576l582K68J5900k199j2682N75L022L32K2410K47k0768q99R667
11530E270O349p986q426k141j5522n329o229L739J0394J206K385J410P358M525
11516b997q364J337l72O603J072J6221L71n02j6729L050N124q686r298M490J0798
11501B118J0266p818m253k992P646P150n802j1520r99J272j3765m080L689K0924
$$ plain form
11600 9267 2495 1428 2857 11102 17065 13478 8741 -4220 -8455 -21771 -14664 -3720 8620 12729
11586 12729 25300 10952 -7671 -4214 3602 17097 25301 32716 42942 21719 22944 30085 26784
11573 26784 21898 19131 15376 -767 -2035 9297 -618 -12351 -2864 -4355 -15569 -16129 -19770 -11308
11559 -11308 -14210 -15010 -15766 -1942 1881 2168 20703 31069 30604 17556 8107 15894 16944 8277
11545 8277 -1445 -7021 -10603 -10335 5565 3366 -9316 -8741 -5719 -5387 17023 17270 -3498 -4397 5270
11530 5270 11619 3633 -4793 -6934 -22456 -27785 -34014 -30275 -19881 -18675 -16290 -14880 -7522 -2997
11516 -2997 -11361 -10024 -10396 -3793 -2721 13500 13871 13369 -3360 -310 4814 -3872 -13170 -8680 2118
11501 2118 12384 4566 313 -2679 4967 12117 6315 -5205 -6204 -4932 -18697 -22777 -19088 1836
11487A836N167J747k412k2600k766P485J4967R333R43L871Q156M455j156l415
11473B5611k543J1285J3438J5253j7572m2389j3069K446l332N527Q675p773m012
11460h455j293p615Q291J9349k17p834k341j4659r624K5731L5689o674j6673m305
11446I370k539k88Q024J6358P902m614L848J6841J5480M071r451q28q147j8810
11432C7217q331r739k205j5064L707N107k201j528n207K441m816m230m98M904
11418d43k555r94P913N713j0884j2598M814m509L139J1544J6505J106N239r160
11404A4830M603p653r675p237m410K023N765P045O198j1587j0170M823J3212j851
11390E916M336R852K692K379Q771Q31j6838k4849L877J3138M051L836m321j40
$$ plain form
11487 1836 7003 8750 6338 -16262 -19028 -11543 3424 12757 13700 17571 25727 30182 29026 25611
11473 25611 23068 34353 47791 63044 45472 3083 -9986 -7540 -10872 -5345 3330 -4443 -8455
11460 -8455 -9748 -17363 -9072 10277 10060 2226 -115 -14774 -24398 1333 37022 30348 13675 9370
11446 9370 6831 6543 14567 30925 38827 34213 38061 54902 70382 74453 65002 64174 56027 37217
11432 37217 28886 19147 16942 1878 5585 10692 8491 6963 1756 4197 -619 -4849 -5347 -443
11418 -443 -2998 -3992 3921 9634 -1250 -13848 -9034 -13543 -10404 1140 17645 18751 23990 14830
11404 14830 19433 11780 2105 -5132 -9542 -7519 -1754 5291 11489 -98 -10268 -5445 7767 5916
11390 5916 10252 20104 22796 25175 33946 34777 17939 -6910 -3033 10105 14156 17992 13671 13531
11376A3531j6794j2975J5957M656M4J4780k091j8710j1361J6303M176n0M646M60
11362A2572m891q917q908R041P270O815j1344m602R282J0389p306j0319L513Q40
11348C435r83R463j1296J2094J1135J3232Q045j3106j7908j5900p913J1540R224
11335A1062O613N174r468q785R379P602k334p817j4652p509J2760J1813o12m433
11321H793o67j4574J0867M050J287M068j0356o62j921m634J7735J1597k627j4920
11307H036j1803o479Q689J0720j460j7444p29j737J2755K0847L506q084j0573
11294F244p906J568M258j3603m825L295J50Q19K2721J4951q810j7147p793J3048
11280F970L908n875Q93m180k10L79J5905Q576P09q864j5969j5275O966R196L17
$$ plain form
11376 13531 -3263 -16238 -281 4375 4419 19199 17108 -1602 -12963 3340 7516 7466 12112 12572
11362 12572 7681 -1236 -10144 -1103 6167 12982 1638 -2964 6318 16707 9401 -918 2595 3435
11348 3435 2452 11915 619 12713 23848 37080 45125 32019 14111 -1789 -9702 1838 11062
11335 11062 17675 22849 13381 4596 13975 21577 19243 11426 -3226 -10735 2025 13838 13226 8793
11321 8793 8126 -6448 4419 8469 9756 13824 3468 2806 885 -3749 13986 25583 22956 8036
11307 8036 -3767 -10246 -1557 9163 7703 -9741 -10470 -12207 548 21395 24901 16817 6244
11294 6244 -1662 -94 4164 -9439 -14264 -10969 -10819 -10000 12721 27672 18862 1715 -6078 6970
11280 6970 10878 5003 5896 1716 1506 1885 17790 26366 27075 18211 2242 -13033 -6067 3129 3446
11265C446O217J0709K544J1092j0999p645K663j454r527n911J0089J1O294K275
11251A9804Q530O0Q704J4185M475o47j3507j444p609j3589l48K356K035J4569
11237C7574J1079K461o442J214M419K029l98q373k44j481n870O64r60m540J4228
11222D5360J226m554j4347q368K7669J7206j211L253L823m098j6201l721R565
11209E5602J230J9495J2776J3169q850j3130O71j1412m108m661m446K281o055
11196E2562o60J0352n33n654J350J1548J0639N890l788p722n953n34n885Q78O22
11181F3112N430j0326m452M106l944p718N613n412j2071M806P071N897j65K2606
11167G4553J3405L866n413M925r680j3532Q620m894k1607j6973K174p770l089
$$ plain form
11265 3446 9663 20372 22916 34008 23009 15364 18027 16573 7046 1135 11224 11235 17529 19804
11251 19804 28334 28394 37098 51283 55758 55111 41604 40160 32551 18962 18614 20970 23005 37574
11237 37574 48653 51114 44672 45886 50305 52334 51936 43563 43319 41838 35968 36632 35672 31132 45360
11222 45360 46586 42032 27685 19317 46986 64192 62981 66234 70057 65959 49758 46037 55602
11209 55602 56832 76327 89103 102272 93422 80292 80963 69551 65443 60782 56336 58617 52562
11196 52562 51902 62254 61721 56067 57417 68965 79604 85494 81706 73984 68031 67497 61612 62490 63112
11181 63112 68542 58216 53764 57870 53926 46208 51821 46409 34338 39144 46215 52112 51947 74553
11167 74553 87958 91824 86411 91336 81656 68124 76744 71850 50243 33270 35444 27674 24585
11154B4585j721n055j6558j901R712J5098J6310n517j0057j133k824K595l843
11141A9691k424L719J5319K817J1233n917m450j768M82n790M415J3131R02o233
11127D5127K093J157k10Q082o759j2545O886k446L859q47k0054n173J1849Q298
11113C9317N542q344o988j137p715j1482k572O565N604J169L607N049n624j0632
11099A2359j4756O034J3391P930M280K791j448j0136n213J949k895L155r206p385
11085H50m182O572J0871N151j1936M703N439l562o747n414o714q485K208p887
11071a9133R911K1076P362l822L523P691j6391j5632M204J322n744J1049m429
11058I87P059Q686l432K303O660m997j8701K317K3545O219j8041j4275M614P30
$$ plain form
11154 24585 22864 17809 1251 -650 9062 24160 40470 34953 24896 23763 20939 23534 19691
11141 19691 17267 20986 36305 39122 50355 44438 39988 38220 38702 32912 37327 50458 51360 45127
11127 45127 47220 48377 48167 56249 49490 36945 43831 41385 45244 44397 24343 19170 31019 39317
11113 39317 44859 36515 29527 28390 20675 9193 6621 13186 18790 19959 23566 28615 22991 12359
11099 12359 -2397 3637 17028 24958 29238 32029 30581 20445 15232 17181 14286 17441 8235 850
11085 850 -3332 3240 14111 19262 7326 12029 17468 13906 7159 1745 -4969 -13454 -11246 -19133
11071 -19133 -9222 11854 19216 15394 18917 26608 10217 -5415 -1211 111 -5633 5416 987
11058 987 8046 16732 13300 15603 22263 17266 -1435 882 24427 30646 12605 -1670 2944 3674
11044C674J97J0756k802k432q635J574J3268Q607m852L652k99j4635j6664n578
11030a4169R975O646j283N8L829J2795J3355j650N33n155j3302L84O414Q736q313
11015A8853j854k552q27o55k226R757O146q575L6l010P185J1687j5498q878j1209
11000a620j8747j240J3480P884L468K773L728j0461j3159J1186k246q824M7j915
10986a5646R079P406P7j404p565m248J4189J2789J0237n584j9744p792j1620J0201
10972i625j217P766K0139J4892j792r588m290J7339N300j2814p345L888J2290
10959C4943J4919j1793l422m617m664J7228R368q2q041m8Q257Q881j634p014Q273
10944F0554L8297K8712L7719L6713M2675R9323J60989K22877K88570L12607K90568
$$ plain form
11044 3674 3871 14627 11825 9393 758 2332 15600 24207 19355 23007 22708 8073 -8591 -14169
11030 -14169 -4194 2452 1169 1227 5056 17851 31206 29556 30089 24934 11632 12016 18430 27166 18853
11015 18853 16999 14447 13620 12965 10739 20496 26642 18067 18103 15093 22278 33965 18467 9589 -1620
11000 -1620 -20367 -21607 -8127 -243 3225 5998 9726 -735 -13894 -2708 -4954 -13778 -13731 -15646
10986 -15646 -6567 839 916 -488 -8053 -12301 1888 14677 24914 19330 -414 -8206 -19826 -9625
10972 -9625 -10842 -3076 17063 31955 30163 20575 16285 33624 38924 26110 18765 22653 34943
10959 34943 49862 38069 34647 30030 25366 42594 51962 51880 43839 43791 52048 60929 59295 52281 60554
10944 60554 98851 127563 165282 201995 244670 343993 504982 727859 1016429 1329036 1619604
10933A619604J80641M3938j30627l19924l79071k93786j89349j08208o3423m3098
10923C16697m5235m5081j8446j2549k1891n371j2813j5841j2674N95J6378N982
10911A49751P814r493j7031j2156l610o002O007n843K053j0507j0960q024K524
10898H4523J1895n712j4831m465O561J3528n671m619j5084j1803j5356K362J455
10885D2783q474J1543K192P540L973j6087m891Q575N498j89N052N868K995M713
10871G1091J5440L268k935r261n661P002o142k5845j638M710l190P25M976N81
10857E3121O589R281L3P043k2511r474r215j3283L32o456k905N098J477j5030
10843D100j821M33L293J3273Q337o005k916N473j724o89N339J0968K993p848J974
$$ plain form
10933 1619604 1800245 1844183 1713556 1393632 1014561 720775 531426 423218 359795 316697
10923 316697 271462 226381 207935 195386 173495 168124 155311 139470 126796 127391 143769 149751
10911 149751 157565 148072 131041 118885 115275 109273 115280 109437 111490 100983 90023 81999 84523
10898 84523 96418 90706 75875 71410 77971 91499 85828 81209 66125 54322 38966 41328 42783
10885 42783 34309 45852 48044 55584 59557 43470 38579 47154 52652 52463 57515 63383 66378 71091
10871 71091 86531 89799 86864 77603 71942 78944 72802 46957 45319 50029 46839 47564 52540 53121
10857 53121 59710 68991 69024 76067 53556 44082 34867 21584 21916 15460 12555 17653 19130 4100
10843 4100 2279 2712 6005 19278 27615 21610 18694 24167 22443 21754 27093 38061 41054 33206 35180
10828C5180p021L964j814Q98k854j4883p964k418m763K1687J7902P943j4152r396
10814B2309P44M056q033j1847m956k072r936j030M099J2776R916P482j118j4094
10800H296M762n760L872M536j585K632L525j8277q532j2301J508J8813K702j2846
10786h655n445K265Q868P387p778J136J2339J9595J2368O288l037K380J4437L8127
10772A00275L8951L0649J0431l996m11L483Q351n983j2432k9844l7561j3690j4370
10759G3853P019q239M270r624j0175K774J5745R049Q838R64j6065O198O797o352
10745H5052q826m072m258j32J4386j548n84j5449j2799o940j782R841M884J1931
10731F9704J5763q687j6131q605r344O317K083r980j4551j0368l238n466J815
$$ plain form
10828 35180 28159 32123 30309 31207 28353 13470 5506 3088 -1675 20012 37914 45857 31705 22309
10814 22309 23053 27109 19076 7229 2273 201 -9735 -10765 -6666 6110 16026 23508 22390 8296
10800 8296 13058 7298 11170 15706 14121 16753 20278 2001 -6531 -18832 -17324 1489 4191 -8655
10786 -8655 -14100 -11835 -2967 4420 -3358 -2222 10117 29712 42080 48368 45331 47711 62148 100275
10772 100275 139226 169875 180306 176310 175899 179382 187733 181750 169318 139474 101913 88223 73853
10759 73853 80872 72633 76903 67279 57104 59878 75623 84672 93510 94474 78409 84607 91404 85052
10745 85052 76226 72154 67896 67764 82150 80602 80018 64569 51770 44830 43048 52889 57773 69704
10731 69704 85467 76780 60649 52044 42700 49017 51100 41120 26569 16201 12963 7497 9312
10718I312O584J0478M437j477k3636j0456R94P296J4462J4346J6497R591J9129
10705G7557J549J1486J2907K3305P054p400k2667k4548o114J485N998J0830N75
10692I2017m402p360Q033M130j2783l738n947r929Q252R478N826k313K0540N074
10678A06878l907j3683j0675J0595J4849J1551k11j2335J0018P638j5443m105
10666A01170J2157m676j8492P756l07j098k808l802k3456j696J2637k460r000
10653F5925k336L552J0830K7942O727J5362K6652L6462N4779P3087N9911L7393
10641D16286L1523J9850J1975k703l6206m4112k6888q007M474j006q332o298j7166
10628C33390j0508J26K601L78R769J3036O636K806K255k2680l3227j9336L747
$$ plain form
10718 9312 15896 26374 30811 29334 5698 -4758 -3764 3532 17994 32340 48837 58428 77557
10705 77557 79106 90592 103499 126804 133858 126458 103791 79243 73129 74614 80612 91442 92017
10692 92017 87615 80255 88288 92418 79635 75897 69950 60021 68273 77751 83577 81264 101804 106878
10678 106878 102971 89288 78613 89208 104057 115608 115397 103062 113080 120718 105275 101170
10666 101170 113327 108651 90159 97915 97608 96510 93702 89900 66444 64748 77385 74925 65925
10653 65925 63589 67141 77971 105913 112640 128002 154654 191116 245895 318982 378893 416286
10641 416286 447809 467659 479634 476931 440725 396613 369725 361718 366192 365186 356854 350556 333390
10628 333390 322882 323008 325609 325987 335756 348792 355428 358234 360489 337809 304582 285246 288993
10615B88993J2218J6746p107k0364o136K552L944Q685k16M395O001j251J8381
10602C26841K0003J3771M521K3590J3985K3393K7373K5961K2309J2091l947j0771
10590D99120L760K5861K7080K2474K6429J8823K2463K0094Q798m859P467L879
10578F81389p252j4372j1925R565K2483K7394L5141L2770J6451K593J8405K2887
10566H35529O076L2782O9639Q0315P2692N4095M2696L2399K1307L8426M4654N4505
10554A385115P0449J21311J36110J38676J36182J33195J18843R6092P6972J05584
10544B518529J29594J64900K06283K18268K44142L07306M01377N13359O64656
10535E368414P76467Q48750R49016J008309R81418R73240J063953J333223J823139
$$ plain form
10615 288993 301211 317957 310850 290486 284350 286902 290846 299531 299315 303710 309711 308460 326841
10602 326841 346844 360615 365136 388726 402711 426104 453477 479438 501747 513838 509891 499120
10590 499120 502880 528741 555821 578295 604724 623547 646010 666104 674902 670043 677510 681389
10578 681389 674137 659765 647840 657405 679888 707282 742423 775193 791644 794237 812642 835529
10566 835529 841605 874387 944026 1024341 1097033 1151128 1193824 1226223 1247530 1285956 1330610 1385115
10554 1385115 1455564 1576875 1712985 1851661 1987843 2121038 2239881 2335973 2412945 2518529
10544 2518529 2648123 2813023 3019306 3237574 3481716 3789022 4190399 4703758 5368414
10535 5368414 6144881 6993631 7942647 8950956 9932374 10905614 11969567 13302790 15125929
10526A5125929K448537L217613M272655N922146Q709201J3555644K2225095L6459423
10518A11936243N3220660O2010593N7423175M5252889K2400902j0855317m9867582
10511B91521563p6100105o5108391m1387399k4937712j5841602j0732261p662630
10504D9751463n672476m409600l495264k778225k148932j674455j400249j217842
10496B6954420j183020j285818j402012j437273j322035j164844j037736r23499
10488A7198183q17185p31070o77317o37976n93692n72236n31716m95951m57442
10479A1683598m03855l28654k78701k72198k92724l11542l25621l51478l47105
10470H771720l53021l33076l03967k78504k55671k19524k01827k01144k03082
$$ plain form
10526 15125929 17574466 20792079 25064734 30986880 39696081 53251725 75476820 111936243
10518 111936243 165156903 227167496 284590671 329843560 352244462 341389145 291521563
10511 291521563 215421458 150313067 108925668 83987956 68146354 57414093 49751463
10504 49751463 44078987 39669387 36174123 33395898 31246966 29572511 28172262 26954420
10496 26954420 25771400 24485582 23083570 21646297 20324262 19159418 18121682 17198183
10488 17198183 16380998 15649928 14972611 14334635 13740943 13168707 12636991 12141040 11683598
10479 11683598 11279743 10951089 10672388 10400190 10107466 9795924 9470303 9118825 8771720
10470 8771720 8418699 8085623 7781656 7503152 7247481 7027957 6826130 6624986 6421904
10461F421904k15231k18048k09145k08989j94879j58436j41187j44891j43956
10452D787142j49839j45314j51974j36886j27336j26108r4302p9411r9627r0575
10442C585770p7028q0327q7539j01143r4215r0494r3100j01069q3310o5838o6562
10431B645145o2085n4470l6323o4527n4958m7563n1129m6786n6968o2488o7432
10420B040416o9237o2927n8496l9509n1529o5816n6001k6881j7700m2061m3259
10409A507000m4349m5526l5082k6048k1848k5960j3940l2811m0229k2685r296
10398A189226k5976k7713l2739l1797j5072R081R612J5538j0381k5872j7492k3370
10386A013045m6635o4559m4769m9171l4025k7400l0221l1385l3555k8705j8586
$$ plain form
10461 6421904 6206673 5988625 5779480 5570491 5375612 5217176 5075989 4931098 4787142
10452 4787142 4637303 4491989 4340015 4203129 4075793 3949685 3855383 3775972 3676345 3585770
10442 3585770 3508742 3428415 3340876 3239733 3145518 3055024 2961924 2860855 2777545 2711707 2645145
10431 2645145 2583060 2528590 2492267 2427740 2372782 2325219 2274090 2227304 2170336 2107848 2040416
10420 2040416 1971179 1908252 1849756 1810247 1758718 1692902 1636901 1610020 1592320 1550259 1507000
10409 1507000 1462651 1417125 1382043 1355995 1334147 1308187 1294247 1261436 1221207 1198522 1189226
10398 1189226 1163250 1135537 1102798 1071001 1055929 1065010 1074622 1090160 1079779 1053907 1036415 1013045
10386 1013045 966410 901851 857082 807911 773886 746486 716265 684880 651325 622620 604034
10375F04034j9465j3363l1747j8080p628k5796l2594k6844j4518q947m625j2656
10363C87771k898j2915k8059j0491l595j9121j7389o922j2577r625q783M048L250
10350B62694N723J6653J0891j244q910P890M949J4950N887k0630k4114j629n366
10337B67744o922k3469m775L18o20j0534j1564L398n47k010J2971l542N291P838
10323B33577J9400R903q131r707J5753K8314K4496K067j8187p719P327Q841r577
10310B96357p612j8155j1432n11m818j3583o371o433m792j1505r041J755Q647
10297B12506p476n695J0411Q282k58J9716L923j2489p777k970j344j9250o116
10284A91463k789k288l410j356L047r62m877o047J6407K7398K1274j24J624q967
$$ plain form
10375 604034 584569 571206 539459 521379 513751 487955 455361 428517 413999 405052 400427 387771
10363 387771 384873 371958 343899 333408 329813 310692 293303 286381 273804 264179 255396 259444 262694
10350 262694 268417 285070 295961 294717 285807 293697 298646 313596 319483 298853 274739 273110 267744
10337 267744 260822 237353 232578 232896 232276 221742 210178 213576 213029 211019 223990 220448 225739 233577
10323 233577 252977 262880 254749 245042 260795 289109 313605 315672 297485 289766 297093 305934 296357
10310 296357 288745 270590 259158 258647 253829 240246 233875 227442 222650 211145 202104 203859 212506
10297 212506 205030 199335 209746 218028 217770 237486 241409 228920 221143 218173 216829 197579 191463
10284 191463 188674 186386 182976 181620 184667 183705 178828 172781 189188 216586 237860 237736 239360 230393
10270B30393L491j6995j0283k24r83J67m734p588j4788k5664m126l853Q590Q309
10256A61712J6498R231m075j6872k5300n359O742K7277N384N134Q201O759n572
10243A89760k3759n931j454n138m713L326n232l780n126p548l124m152j8987o746
10229I7396O550k620j5603j5150R556K7474K3995j646m039r736k03N575n600M04
10215A16353O140O90j1795o68M813o424J7827k542n222J8773m024j6657p927n047
10201A04290J3236J6717j1597N068J0827j62J1062J1863R062J7908L0303K6020
10189B44597J8397J1183K2230L7492N5325M5698N3945N5718M4343N7295N0962
10178F97185N5826P6876J18582J66246K34328L59927N09277P95508J216702J692950
$$ plain form
10270 230393 233884 216889 206606 206382 205399 205566 200832 193244 178456 152792 148666 144813 153403 161712
10256 161712 178210 187441 183366 166494 141194 135835 142577 169854 175238 180372 188573 195332 189760
10243 189760 166001 160070 158616 153478 148765 152091 146859 143079 137953 130405 127281 123129 104142 97396
10229 97396 103946 101326 85723 70573 80129 107603 131598 129952 125913 116177 115974 121549 115949 116353
10215 116353 122493 123183 111388 110720 115533 109109 126936 124394 119172 137945 133921 117264 109337 104290
10201 104290 117526 134243 122646 127714 138541 138379 149441 161304 170366 188274 218577 244597
10189 244597 262994 274177 296407 333899 389224 434922 488867 544585 588928 646223 697185
10178 697185 753011 829887 948469 1114715 1349043 1708970 2218247 3013755 4230457 5923407
10168E923407K095281K167600J849037J160406J00526j126649k100480k341381
10160G727747j926174j337212q97904o19845m38630l19121k57425j86249j36558
10151A608629j07488r1500o6655n9622n7752q0164o8059o1167n1068n0009l6953
10140H78192k2645m3343n0571k8934k5336m3883l5847k2602r166k1991k9001k8568
10128E16305j9748j0506j6904o691p239r010j4999j7305k1399n591O46r037L684
10115C82206m478j2377o395n023j0538j9109j1429l480k973m192n349P019J963
10102C05845j637N197J2668L3486L9015M4137Q5365J31560K03866K85190L16375
10091A461067L00784K15908P1262j22334l09653l89859l05093j94859j25323p4719
$$ plain form
10168 5923407 8018688 10186288 12035325 13195731 13296257 12169608 10069128 7727747
10160 7727747 5801573 4464361 3566457 2946612 2507982 2188861 1931436 1745187 1608629
10151 1608629 1501141 1409641 1342986 1283364 1225612 1145448 1077389 1016222 965154 915145 878192
10140 878192 855547 812204 761633 732699 707363 663480 627633 605031 595865 573874 544873 516305
10128 516305 496557 486051 469147 462456 455217 446207 431208 413903 392504 386913 387559 378522 382206
10115 382206 377728 365351 358956 353933 343395 324286 312857 309377 306404 302212 296863 303882 305845
10102 305845 304208 309405 322073 355559 394574 438711 524076 655636 859502 1144692 1461067
10091 1461067 1761851 1977759 2049021 1926687 1617034 1227175 922082 727223 601900 527181
10081E27181n8536m7470k2676j8297k3625k1821l6922l1907j4547p070j0930J715
10069B35095k2410m596n55L52j066k1668k4403r538J8960O056n117j120N57m350
10055A66197k030q23J084j3544j831J1881J6700J204o564N737p022m305K0034
10042A86718O01j2035K924J884J0244J163J776J5214R176K2224K9601M5115O1545
10029C76150R6636J19454J23169R1631L8653J6631m7747q0198r9725j03268o8079
10018D63307k7162Q332L3533K6211K4125J8787J2534j9275k5000k3452l8755n5069
10006C98116m7355m3276l3046j9524j1515j8027j105j4600k9754k2766o092m8
9994A51008j8651j3561l359j425P344j216r039m107N015J1847k051j8366k4398
$$ plain form
10081 527181 468645 421175 398499 380202 356577 334756 297834 265927 251380 244310 233380 235095
10069 235095 212685 208089 207534 207886 206820 185152 160749 151211 170171 176227 171110 169990 170547 166197
10055 166197 164167 163344 164428 150884 149053 160934 177634 178838 172274 178011 170989 166684 186718
10042 186718 187319 175284 178208 180092 190336 191499 193275 208489 217665 239889 269490 314605 376150
10029 376150 472786 592240 715409 807040 845693 862324 814577 734379 634654 531386 463307
10018 463307 436145 444477 478010 504221 528346 547133 559667 540392 515392 491940 453185 398116
10006 398116 350761 307485 274439 254915 243400 225373 224268 209668 179914 157148 151056 151008
9994 151008 132357 118796 115437 114012 121356 120140 111101 106994 112009 123856 121805 103439 79041
9981G9041M288M202k862J0253J3436Q812J168Q118n488k1834p871j1246j8080
9968F1937O023N448N99M616p00j2846p199k878m392p844L038J4888n946n831N538
9953E4451J1778L490j0654J4232O852j3986j9354l832J663m396J367Q447J7497
9940F7555n313m330p820j1957n181L914J2684p60L031N145K086L318p136j2220
9926D3016k718R214o774p963k735P941j012o496p960j1928O123N842j404O501
9912B9647n570m102M672J3103J414J0469k431K198M299l544r875q78J582P726
9898D8710j922J024n781k992j1607n828K383J119M771M711R659J1472O631j1767
9884E0583j193k429j9126n30m382k748k866J0895J5949l839M80R249j073o893
$$ plain form
9981 79041 83329 87531 84669 94922 108358 117170 118338 126456 120968 99134 91263 80017 61937
9968 61937 67960 73408 74007 78623 77923 65077 57878 55000 50608 42764 45802 60690 54744 48913 54451
9953 54451 66229 69719 59065 73297 80149 66163 46809 42977 44640 40244 41611 50058 67555
9940 67555 62242 57912 50092 38135 32954 36868 49552 48792 51823 56968 59054 62372 55236 43016
9926 43016 40298 49512 42738 34775 32040 39981 38969 32473 24513 12585 18708 24550 23146 29647
9912 29647 24077 19975 24647 37750 39164 49633 47202 49400 53699 50155 40280 39402 40984 48710
9898 48710 46788 47812 42031 39039 27432 21604 23987 25106 29877 34588 44247 55719 62350 50583
9884 50583 49390 46961 27835 27305 22923 20175 17309 28204 44153 40314 40794 50043 48970 42077
9870D2077j2573o569J0339K734p125j4674R45J2313M232l851l972N351M369J478
9856C5074Q95m197N213n58p835J776J3037r001J89P683r66j2129p419m29k998
9841A8335k247O817p768J0640l647j237N639L378l203Q695N217k272o147r906
9827B2294o331m535J219j2257p884O574K6491J640j2588R298k285n864M213L379
9813B3364m650j2793K403k337m90Q499J269k5p587L021j093M013K070K994j0603
9798H055O089q831R72L50r092j0649M72k29N387N102M762N551n488j238Q915J3400
9782B3528p322j0325N742N457q758N536R132J369k714l858O405l116J506K5r459
9767A3148p982O051k917O684p345k919o345P681n112Q812R697N731j0875P485
$$ plain form
9870 42077 29504 22935 33274 36008 28883 14209 15154 27467 31699 27848 23876 29227 33596 35074
9856 35074 35969 31772 36985 36427 28592 30368 43405 34404 34593 42276 41310 29181 21762 21333 18335
9841 18335 16088 22905 15137 25777 22130 20893 26532 29910 26707 35402 40619 38347 32200 22294
9827 22294 15963 11428 12647 390 -7494 -920 25571 27211 14623 23921 21636 15772 19985 23364
9813 23364 18714 5921 8324 5987 5497 13996 15265 15240 7653 10674 9581 13594 15664 18658 8055
9798 8055 14144 5313 6285 6635 -2457 -13106 -12634 -12863 -7476 -2374 2388 7939 2451 1213 10128 23528
9782 23528 16206 5881 11623 17080 8322 13858 22990 24359 21645 17787 24192 21076 22582 22607 13148
9767 13148 5166 11217 8300 14984 7639 4720 -1625 6056 944 9756 19453 25184 14309 21794
9753B1794j00J5721L59p146o963k55K205R565J1650L548J2861J9673o203j7236
9739E9473R545k942l313j5675q909P558k879p960k589j2094o151O798M623p936
9725A7549q683P163J1782P89j0710r265N549j815j3922j1136Q518J5318R272k837
9711A7572j6418R985J010o579J2044m801R520O471m698j995q692r14K63k80p225
9696E263q74Q808K0844l292q193R21J917j436j5066Q129J1689J462j471j6373
9682A2328k439M953M600O253l869r927k67J083L446J589r364n955J5939P79j6432
9667B717o746m223L90j581J9850J087j2232M284O256q003M007Q402q093p813J0519
9652H821j224j8232l336O073P239J1355J3266O138o742M491j277j019J316o775
$$ plain form
9753 21794 21694 37415 37774 30628 23665 23410 25615 35180 46830 50378 63239 82912 76709 59473
9739 59473 69018 66076 62763 47088 38179 45737 42858 34898 32309 20215 14064 20862 25485 17549
9725 17549 8866 16029 27811 28600 17890 8625 14174 12359 -1563 -12699 -4181 11137 20409 17572
9711 17572 1154 11139 12149 5570 17614 12813 22333 28804 24106 22111 13419 12505 12768 12488 5263
9696 5263 4389 13197 34041 30749 22556 23477 25394 23958 8892 17021 28710 30172 28701 12328
9682 12328 9889 14842 19442 25695 21826 11899 11632 12715 16161 17750 8386 2431 18370 19149 2717
9667 2717 -4029 -8252 -7862 -9443 10407 11494 -738 3546 9802 1799 5806 14208 6115 -1698 8821
9652 8821 7597 -10635 -13971 -7898 -659 10696 23962 30100 23358 27849 26572 25553 26869 20094
9638B0094p182K056p791j657J6584Q679J3272j1597n130j7018J9696J6672M668
9625E1346j1215k1783n472p332p175n046J8186K171n086q185Q24m272O569J5748
9611A9278M507M610m736o02k844j1897o069O850k938K409K809m840l006o575M498
9596A454R724L122j2370r840P453K586K529J6997Q568p057n934q491O231K15k480
9581A2707j3620P743P280l706j20N348K338O641J678l743J1825m129j2284M657
9567B2615J2048P374M138j2648m901J423k233O275R101j4319j5576k4008J117
9554i594J9618R115j669o026M117o144j0858l036o152J1950J4599k194N243n220
9540A3749n045j7072N224K1995J2802P402m826j1999j1437q843n176R863j454
$$ plain form
9638 20094 12912 14968 7177 5520 22104 30783 44055 32458 27328 10310 30006 46678 51346
9625 51346 40131 18348 12876 5544 -1631 -6677 11509 13680 8594 409 1233 -3039 3530 19278
9611 19278 23785 28395 23659 23057 20213 8316 2247 9097 6159 8568 11377 6537 3531 -3044 1454
9596 1454 11178 14300 1930 -7910 -457 2129 4658 21655 30223 23166 17232 8741 14972 15187 12707
9581 12707 -913 6830 14110 10404 10284 15632 17970 24611 26289 22546 34371 30242 17958 22615
9567 22615 34663 42037 46175 33527 28626 30049 27816 34091 43192 28873 13297 -10711 -9594
9554 -9594 10024 19139 17470 11444 15561 9417 -1441 -4477 -10629 1321 15920 13726 18969 13749
9540 13749 8704 -8368 -3144 18851 31653 39055 34229 22230 10793 1950 -3226 6637 5183
9527E183R012n219K505P013J175K655m732p836J25J2986N028r507O196j0330k972
9512A1282N851r711q87n224K296J0966K33J2824q784j8335K711l33j3893J5214
9498D210J2049k515j332j1359J9N58K254j718j0474j332J2915J566P743J1466
9484B4050m985q422l100M12j044J3485o154r971J2552J9434J757N679j998o581
9470C5114j897Q697l036j7549k121J3670n336N468K823k514m015K588J775j2766
9456B0901j5658j351p300r250J2575K6345p804j4847o469j1004m136Q616O260
9443c122j756j3517M61J2697J5552J966k261J894l811j1563J722p526p85O655
9429c394P647J9986J7604P483r243p621j7025q694J5077P746Q963K336L650j083
$$ plain form
9527 5183 14195 8976 11481 18494 19669 22324 17592 9756 9881 22867 27895 18388 24584 14254 11282
9512 11282 17133 7422 6535 1311 3607 14573 14806 27630 18846 511 3222 2889 -11004 4210
9498 4210 16259 13744 12412 1053 1072 1630 3884 2166 -8308 -9640 3275 4841 12584 24050
9484 24050 19065 10643 7543 7955 6911 20396 14242 4271 16823 36257 38014 43693 41695 35114
9470 35114 33217 41914 38878 21329 19208 32878 27542 33010 35833 33319 29304 31892 33667 20901
9456 20901 5243 3892 -3408 -12658 -83 26262 18458 3611 -2858 -13862 -17998 -9382 -3122
9443 -3122 -4878 -18395 -17934 -5237 10315 12281 10020 11914 8103 -3460 -1738 -9264 -10049 -3394
9429 -3394 4253 24239 41843 49326 40083 32462 15437 6743 21820 29566 38529 40865 44515 43432
9415D3432m263L634o140k121j2636k1451J0534L733l038J523J153p999J1069J7555
9401C4985Q817j7467M773J0897M328M071j9494j3102K469O309P92o346j4078m361
9387B593J2168R045r205m237l623J2893J8113Q647j0288K635l04J670J398j3912
9373B7593o157O344k567q159l29l158L836J0442J001k979p222k196R278R53m348
9358B2332q218o411P75J0543N196Q493J2990K268R866p847o906k83l239P122q253
9343C8428N22J3578R39l864l192N521L630O73j2863j0441j004J0552Q542j4007
9329C7014o018j3000l88J6648l587M819K78N252P437q996N328J485M435K679l813
9314D9573j631n826j1821j0740j0252j784K620K594K995L847R032R233J898R44
$$ plain form
9415 43432 39169 42803 36663 34542 21906 455 10989 14722 11684 13207 14360 6361 17430 34985
9401 34985 43802 26335 31108 42005 46333 50404 30910 17808 20277 26586 27378 21032 6954 2593
9387 2593 14761 23806 14601 10364 6741 19634 37747 46394 36106 38741 38437 40107 41505 27593
9373 27593 21436 27780 25213 17054 16725 13567 17403 27845 28846 25867 18645 16449 25727 26680 22332
9358 22332 14114 7703 8478 19021 24217 32710 45700 47968 57834 49987 43081 42798 39559 46681 38428
9343 38428 38950 52528 53467 49603 46411 51932 55562 56235 43372 32931 31927 42479 51021 37014
9329 37014 30996 17996 17608 34256 30669 35488 35766 41018 48455 39459 44787 46272 50707 53386 49573
9314 49573 47942 42116 30295 19555 9303 7519 10139 12733 15728 19575 28607 37840 39738 40682
9300D0682j878m744j5524O265J3838L475k273L301l881j3471j1254l15P921o987
9286A5155j1797n773J8481R342O969M350M009R300k247N37K050J534j7754L936
9272C8092m676j4866r72o563J234o17J4001Q901k953J3118N315l083j1594n529
9258B9808M665M285O693R234N689r294p399M79j700P95j1688j76J4785n124L9
9243D1091J851m61q133J5283R614r768j9878N327J2118j3858j8163J353K3274
9230C9650P899N121L925N047Q061n218L54L787j749p09j2334j1602O514R399j0288
9215D7857j851k597m59N683N504p880r007J0594J4246J378r343r306P466j079
9201E1206j789l990K241j3126j2470J2077j916J0501J0937L189J443o812j3909
$$ plain form
9300 40682 38804 34060 18536 24801 38639 42114 39841 43142 39261 25790 14536 14221 22142 15155
9286 15155 3358 -2415 16066 25408 32377 36727 40736 50036 47789 48326 50376 51910 34156 38092
9272 38092 33416 18550 17578 11015 12249 11632 25633 34534 31581 44699 50014 46931 35337 29808
9258 29808 34473 38758 45451 54685 60374 51080 43681 44160 42460 43255 31567 31391 46176 41052 41091
9243 41091 42942 42481 34348 49631 59245 49477 29599 34926 47044 33186 15023 16376 39650
9230 39650 47549 52670 56595 61642 69703 64485 64839 68626 66877 66168 53834 42232 48746 58145 47857
9215 47857 46006 43409 42950 48633 54137 46257 37250 47844 62090 63468 54125 44819 52285 51206
9201 51206 49417 45427 47668 34542 22072 34149 32233 42734 53671 56860 58303 51491 37582
9188C7582l952l87P424J470J0088O233J5288l382J15m992r253K708L989P795L153
9173G3879j3934j820p890L712j6541j5899O185N481n933p096J8346J4986o101
9160D7375m199o355J8609J6743m719q937k0j2537j115L04P759J6244R723j0473
9146F8402j8635O799J0210k3505j2227J331j709J883N621O413R938R409o468m437
9132E3025k40J6697M479j9979j5300j32q467j0168J2463J3885O349J3412M658
9119G0682j2546K219J135J2101R885j4753o967K079J0363k645L267O795k514k464
9105G6637K708O629j4904r672L836J3098l96r217j296L131J503r042J878J2703
9091G7596O239j0302J0614L863m178k968j0555r613m904L777N601R012k923N230
$$ plain form
9188 37582 33630 33243 40667 42137 52225 58458 73746 70364 70479 65487 56234 58942 62931 70726 73879
9173 73879 59945 58125 50235 53947 37406 21507 27692 33173 27240 20144 38490 53476 47375
9160 47375 43176 36821 55430 72173 67454 58517 58497 45960 44845 45149 52908 69152 78875 68402
9146 68402 49767 56566 66776 43271 31044 32375 30666 32549 38170 44583 54521 63930 57462 53025
9132 53025 52785 69482 73961 53982 38682 38550 30083 19915 32378 46263 52612 66024 70682
9119 70682 58136 60355 61490 73591 83476 68723 61756 63835 74198 71553 74820 81615 79101 76637
9105 76637 79345 85974 71070 61398 65234 78332 77936 68719 67423 70554 72057 63015 64893 77596
9091 77596 83835 73533 84147 88010 83832 80864 70309 60696 55792 59569 65170 74182 71259 76489
9077G6489q869j082j566K685j6207K145O783j176Q525J6263M034P403j316j1878
9063H2233l785J2958n218q098o792n424J4674J2580N986m436M815J0423j7609
9050I2307o752j377l7J806L465N929j2700m874R524P420K0979J812j626K656O649
9035A25181j6626q666Q05k68j4953j852J1980J1430M703M419M804j78O951j2822
9021A14908N851J1242P075K93n700p328R46o193N543J3387q436o665q192M302
9007A21033Q623M138r87j1851q904K95K0738R090m826q337l276P896K944N548
8993A42124j7068j250J3395K1279N982L640j241j1748P356N46j734P098j2133
8980A56246j1485l942J2275L629j8956j39Q272p62l102M534J6403P457p396j2686
$$ plain form
9077 76489 67620 66538 64972 67657 51450 53595 60378 59202 67727 83990 88024 95427 94111 82233
9063 82233 78448 91406 86188 78090 71298 65874 80548 93128 99114 94678 99493 109916 92307
9050 92307 85555 84178 84141 85947 89412 95341 82641 77767 87291 94711 115690 117502 115876 118532 125181
9035 125181 108555 99889 100694 100426 85473 83621 95601 107031 111734 116153 120957 120779 127730 114908
9021 114908 120759 132001 139076 139369 133669 126341 127287 121094 126637 140024 131588 124923 116731 121033
9007 121033 129656 133794 132807 120956 112052 112347 133085 142175 137349 129012 125736 133632 136576 142124
8993 142124 125056 123806 137201 158480 164462 168102 166861 155113 162469 163015 161281 168379 156246
8980 156246 144761 140819 153094 156723 137767 137628 145900 145138 142036 146570 162973 170430 163034 150348
8966A50348R251J0483J4078n717p961M794o364L861R68j0766J3670O007K720l638
8952A81734r711m75J4168Q618P777R842m517p156j679M047k57J292O338K021l957
8937B08085m911J2861J363j697n532p08J3778J3678j421j7629j7173J1656J6211
8924B28561J7910L283j4601r350M679J1170O978J4306k130J2165J515p646Q514
8911B75354l736j2710M718m882j0701l760J2721J1547M833L743Q563J103J1494
8898B98287l979n122O255J2738J1348k100l085j72Q059L904M465R677K130J525
8884C43930K829N610Q373K835R851O860L191m520j2334n44R693J2616K278R711
8870D00379J6652R407J2130J7412J0336L446o676k201M398J2048L466K989k747
$$ plain form
8966 150348 159599 170082 184160 178443 170482 175276 168912 172773 173741 162975 176645 182652 185372 181734
8952 181734 172023 171548 185716 194334 202111 211953 207436 200280 198601 202648 202391 203683 210021 212042 208085
8937 208085 203174 216035 217398 215701 210169 209461 223239 236917 235496 217867 200694 212350 228561
8924 228561 246471 249754 235153 225803 230482 241652 248630 262936 260806 272971 274486 266840 275354
8911 275354 271618 258908 263626 258744 248043 244283 257004 268551 273384 277127 285690 286793 298287
8898 298287 294308 289186 295441 308179 319527 317427 314342 314170 322229 326133 330598 340275 342405 343930
8884 343930 346759 352369 360742 363577 373428 380288 383479 378959 366625 366081 375774 388390 390668 400379
8870 400379 417031 426438 438568 455980 466316 469762 463086 460885 465283 477331 480797 483786 481039
8857D81039J0073P712R411J5188L219O282K1830O978J2848M283J0038P295O469
8844F02665L348k440J2380J6346J0503J1752J0585n080J6911K9508K2681R693
8832G38852J532J3942M749o399J2180J4679J7915J3615J3294K4670J4430J771
8820H65230P727J1720P078J5250J6561K3249J9374J2685K8705J5215J6868L0120
8808A069782J6424J1834K1741K5423J4564K2347L0827J7238L0110L4948J4948
8797A310186J6189L7491M1807M1236M3236M7060L9916L0944K4859K8381L7176
8786A698481L5819M3671N0684M7962L3245L9085N1369N6297L9904M8147P5509
8775B220173O6289O1300O4803P2565O8834P2504P3930O8283Q8399Q6615Q7274
$$ plain form
8857 481039 491112 498824 508235 523423 526642 532924 554754 561732 574580 578863 588901 596196 602665
8844 602665 606013 603573 615953 632299 642802 654554 665139 660059 676970 706478 729159 738852
8832 738852 740384 754326 759075 752676 764856 779535 797450 811065 824359 849029 863459 865230
8820 865230 872957 884677 891755 907005 923566 946815 966189 978874 1007579 1022794 1039662 1069782
8808 1069782 1086206 1098040 1119781 1145204 1159768 1182115 1212942 1230180 1260290 1295238 1310186
8797 1310186 1326375 1363866 1405673 1446909 1490145 1537205 1577121 1608065 1632924 1661305 1698481
8786 1698481 1734300 1777971 1828655 1876617 1909862 1948947 2000316 2056613 2096517 2144664 2220173
8775 2220173 2286462 2347762 2412565 2485130 2553964 2626468 2700398 2768681 2857080 2943695 3030969
8764C030969R8134J10477J11942J16053J06375J27793J24741J31707J37669J35321
8754D231181J30551J65689J78063J80711J85469K08354K05518K11905K20150K44405
8744F161996K61398K81483K96879K84485L07436L30057L50813L60610L70901M02130
8734I408188M20821M38402M44947M60244N04027N02862N22140N34673N48184N68895
8724A4353383N53241N46137N44161N16959N02262M77064M46004M23993L88202
8715A8751406L16704K55217J88187J05822O1183J1251n8287j27836k01194k47167
8705A9055286k77668l15669l75960m05283m18250m40488m68324m68554m64663
8696A5420427m79169m65357m59311m55684m44746m37670m28248m00130l78016
$$ plain form
8764 3030969 3129103 3239580 3351522 3467575 3573950 3701743 3826484 3958191 4095860 4231181
8754 4231181 4361732 4527421 4705484 4886195 5071664 5280018 5485536 5697441 5917591 6161996
8744 6161996 6423394 6704877 7001756 7286241 7593677 7923734 8274547 8635157 9006058 9408188
8734 9408188 9829009 10267411 10712358 11172602 11676629 12179491 12701631 13236304 13784488 14353383
8724 14353383 14906624 15452761 15996922 16513881 17016143 17493207 17939211 18363204 18751406
8715 18751406 19068110 19323327 19511514 19617336 19678519 19689770 19631483 19503647 19302453 19055286
8705 19055286 18777618 18461949 18085989 17680706 17262456 16821968 16353644 15885090 15420427
8696 15420427 14941258 14475901 14016590 13560906 13116160 12678490 12250242 11850112 11472096
8687A1472096l77924l76225l50960l31013l44123l02406k90267k91848k73044
8678H534286k68068k60518k59014k47563k15468k24389k13803k00963k14223j87247
8668F243030j69238j74023j61183j57224j45578j44627j39609j29347j47865j52347
8658D721989j30573j10524r1656j20483j29969j10754r5587r5788p5860q2419
8648C678376r5588q1957q2639r0478p2947q6161p5502p1522o6117o4911o5232
8637B825322o1529n8316n8272o3619o0708m3891o3014o6607n1069m3938m8126
8626B206233n1659m1296n2414l5727l5307m5533k9094l4555m3622k7225m2883
8615A766918l1221k2754l3233k2619k6638k4209k4963m2819l2275l8792k5314
$$ plain form
8687 11472096 11094172 10717947 10366987 10035974 9691851 9389445 9099178 8807330 8534286
8678 8534286 8266218 8005700 7746686 7499123 7283655 7059266 6845463 6644500 6430277 6243030
8668 6243030 6073792 5899769 5738586 5581362 5435784 5291157 5151548 5022201 4874336 4721989
8658 4721989 4591416 4480892 4389236 4268753 4138784 4028030 3932443 3836655 3760795 3678376
8648 3678376 3582788 3500831 3418192 3327714 3254767 3168606 3093104 3021582 2955465 2890554 2825322
8637 2825322 2763793 2705477 2647205 2583586 2522878 2478987 2415973 2349366 2298297 2254359 2206233
8626 2206233 2154574 2113278 2060864 2025137 1989830 1944297 1915203 1880648 1837026 1809801 1766918
8615 1766918 1735697 1712943 1679710 1657091 1630453 1606244 1581281 1538462 1506187 1467395 1442081
8604A442081k4016l5293k3795j7871k8001k0455k3052k8164j5338r525o496j0986
8592A199089j8580l0060l2737k7061k4681k2993j0285j3849k6389n169n733j7165
8580I64387j3582k6491r550j7612k7661k1587j1118j5201j0343j1220j5532j8356
8568G66134l2291p122j7486r627m098N16q741j8048l406K292M624n081l2577j6547
8554F18542j6522j1128M057k232o635r976k0849k0240O979n083j3556n852l448
8541E14057j0780J601J1631l837j6779l034p872j4328j5153j6788J4283J3483
8529D66484o840j3764j7443L682j2804n767L797j0747j4339j2021j0393J743r044
8516C62544j059L291j4720m987J2588l069j1557l493o533j988M819o583n55q584
$$ plain form
8604 1442081 1418065 1382772 1358977 1341106 1313105 1292650 1269598 1241434 1226096 1216571 1210075 1199089
8592 1199089 1180509 1150449 1117712 1090651 1065970 1042977 1032692 1018843 992454 987285 981552 964387
8580 964387 950805 924314 914764 897152 869491 847904 836786 821585 811242 800022 784490 766134
8568 766134 733843 726721 709235 699608 695510 696026 687285 669237 665831 668123 672747 667666 635089 618542
8554 618542 602020 590892 594949 592717 586082 576106 555257 535017 541996 536913 523357 517505 514057
8541 514057 503277 504878 516509 512672 495893 492859 484987 470659 455506 438718 453001 466484
8529 466484 459644 445880 428437 432119 419315 413548 417345 406598 392259 380238 369845 371588 362544
8516 362544 361485 364776 350056 345069 357657 354588 343031 339538 333005 331017 335836 329253 328698 320114
8502C20114k765L964K476P896K0744K1222O208j5448j5584k9629m941j4812k2429
8489B77016P934m299k854P83L049n003R27l939p616N966O227l90j5041j358l386
8474B58016k799J7969M608n812j0722k673J1966k030j4558j842J1697n944k5084
8461B32792j0372O429o610k837N076M453j3184j3363J95O968J4779N541j7991
8448B11876p455Q07j078r35p675m785j1382j7232J0605J0603p31k557R893J1442
8434B01396M266p9m611K099r405o205n332J2050R544r401k03K342k5647j2429
8420A58385J3913J7193m612j3633o939n940K161j3784j2374o808j0060R999J4023
8407A41524K743j1243j2309R846J9991M541r727j7507L562k672j1973K755L416
$$ plain form
8502 320114 317349 321313 323789 331685 352429 373651 379859 364411 348827 319198 314257 299445 277016
8489 277016 284950 280651 277797 278580 281629 276626 277553 273614 265998 271964 278191 277801 262760 261402 258016
8474 258016 255217 273186 277794 271982 261260 258587 270553 268523 253965 252123 263820 257876 232792
8461 232792 222420 228849 222239 219402 224478 228931 215747 202384 202579 209547 224326 229867 211876
8448 211876 204421 205228 204150 203215 195540 190755 179373 162141 172746 183349 182618 180061 189954 201396
8434 201396 205662 205583 200972 203071 193666 187461 182129 194179 203723 194322 194119 196461 170814 158385
8420 158385 172298 189491 184879 171246 164307 158367 160528 146744 134370 127562 117502 127501 141524
8407 141524 144267 133024 120715 130561 150552 155093 145366 127859 131421 128749 116776 119531 122947
8394A22947J4461L233Q640j2518r74j843j280k469O766q394j0002q020m098l64
8380A06085Q554J02O498k214j3171j9166K2492J0173j609L631M22j1971J3694
8367A23520j4609j3951l106R189N789r533Q61R357j2719q756j441J7273L709j091
8353A04492j3838j468M881J3607j752RM28k352j0993J4408J6960j0065j1247L557
8339A06627K1348m832k3510j2426l957R01K391k32J6520Q840j7147j6888O256
8326H3891O586J5192l435r019O530J1516J2490R290K3279P143N876K0118L5462
8313B24919N9425O5235J11016J20908R9997Q8079O4798n114j04886j59472j39065
8302D25840r0330o5328m6704k6522j4391j5919j4143m051j900K443Q807Q70j8612
$$ plain form
8394 122947 137408 140641 149281 136763 135789 133946 132666 130197 136963 128569 118567 110547 106449 106085
8380 106085 114639 114741 121239 119025 105854 86688 109180 119353 117744 121375 121797 109826 123520
8367 123520 108911 94960 91854 101043 106832 97299 98160 107517 94798 86042 84601 101874 105583 104492
8353 104492 90654 89186 94067 107674 105922 105931 106359 104007 93014 107422 124382 114317 103070 106627
8339 106627 127975 123143 99633 87207 83250 84151 86542 86310 102830 111670 94523 77635 83891
8326 83891 90477 105669 102234 93215 99745 111261 123751 133041 156320 163463 169339 189457 224919
8313 224919 284344 349579 460595 581503 681500 769579 834377 829263 724377 564905 425840
8302 425840 335510 270182 223478 196956 182565 166646 152503 148452 146552 148995 157802 158672 140060
8289A40060j0900O280j3078k3965J2874J4089K492P013m285j1168J089Q819J8406
8276A47726J1061K898o637K4532M3493N4090Q3592J18553J24317R1828O5101K9737
8264G90291k8902j19118j42287j10112o1787m7001l8043k6656j6743r233j460
8253A88949q834q38k0943j7563o406P273R559j5310j9641j2224n995n249p590
8240H5188J3642N602j1255l738K400o723j6725k250q187J0526P827o338n044P2
8226F4997L770J0709O682Q969m232j5114q951j0217k885Q144P746K947q11p776
8212F3978j014o005M1l504N782N103o084M756N510o142k494m78L324R339J1065
8197H3177o092O31j4264j8372o456Q328M671m633J285o178J438O215J217r545
$$ plain form
8289 140060 129160 135440 122362 98397 111271 125360 127852 134865 130580 119412 120501 129320 147726
8276 147726 158787 161685 155048 179580 223073 277163 360755 479308 603625 695453 760554 790291
8264 790291 761389 642271 499984 389872 328085 281084 243041 216385 199642 190409 188949
8253 188949 180115 179277 158334 140771 134365 141638 151197 135887 116246 104022 98027 92778 85188
8240 85188 98830 104432 93177 89439 91839 85116 68391 66141 57954 68480 76307 69969 64925 64997
8226 64997 68767 79476 86158 95127 90895 75781 66830 56613 53728 61872 69618 72565 71754 63978
8212 63978 62964 56959 57000 53496 59278 64381 58297 63053 68563 62421 59927 59449 62773 72112 83177
8197 83177 77085 77716 63452 45080 38624 46952 51623 46990 48275 42097 43535 49750 50967 41422
8183D1422r324P364J0703J0593j5429m809j035P613J898m839L715k854p589j714
8169C5715L576R452P106q390p07O092M236j428J664r135k841j8381q343J2577
8155C1193Q76l586L683L07N676p375O459M335L33j2913M018K4093J3334j1161
8141E9272l1632n610M504k769N786K613j1865p249J0418J8297k196r04j4145j5034
8127I486l345L111K903n41J3294R08j893L331j0157j1455N443J980J494L167P956
8112B5682O886j874k388L385P772K908l813j3721o254N561j157L73J3460N348
8098D2168p516n469L106j1851O081p24J5342J0594j6557k3142r258J108J1962
8085A5844J1567n443j677K0877J1985m227l95J012J636k605J969j1844o111P084
$$ plain form
8183 41422 32098 39462 50165 60758 45329 40520 39485 47098 48996 44157 47872 45018 37429 35715
8169 35715 39291 48743 55849 47459 46752 52844 57080 55652 57316 48181 45340 26959 18616 31193
8155 31193 32069 28483 32166 32473 38149 30774 37233 41568 41901 28988 33006 57099 70433 59272
8141 59272 27640 22030 26534 23765 29551 32164 20299 13050 23468 41765 39569 38665 24520 9486
8127 9486 6141 9252 12155 11614 24908 25816 23923 27254 17097 5642 11085 13065 14559 17726 25682
8112 25682 32568 30694 28306 31691 39463 42371 38558 24837 18583 24144 22987 23360 36820 42168
8098 42168 34652 29183 32289 20438 26519 25795 41137 51731 35174 12032 2774 3882 15844
8085 15844 27411 21968 20291 41168 53153 48926 48531 49543 51179 48574 50543 38699 32588 39672
8071C9672P560J0084p141j8218r700l114N520r750Q375O863k602r470J3998O630
8057C8707o891o580Q8J3701J7694m580Q14N173N056j9185r052p310l379m32j1973
8042A1851j7939J6419J9490J1042J3215N170J857k512M353N297m681n028o905
8029E1629l685o442P159k98j4044j051p911k185K2992J6089r227j200J0416l061
8015E9181q944k2838m368j809j298N84m23J686o657l315J4697P72k447R047n900
8000B7968J986P444j0412K837K674n217r088q016k203J9353J5355j021K006P390
7986E1056j1854K590J788M188L999N735j63o564o747j0751m771m901j957l60k772
7971A8516J3623q710j809n292o381l7M017j895J943k885J3297l066n058P983J2882
$$ plain form
8071 39672 47232 57316 50175 31957 22257 19143 24663 14913 23288 30151 27549 18079 32077 38707
8057 38707 31816 25236 25324 39025 56719 52139 52953 58126 63182 43997 34945 27635 24256 23824 11851
8042 11851 -6088 10331 29821 40863 54078 59248 61105 58593 62946 68243 63562 58534 51629
8029 51629 47944 41502 48661 48363 34319 33268 25357 23172 46164 62253 53026 51826 62242 59181
8015 59181 50237 27399 23031 21222 19924 20508 20085 21771 15114 11799 26496 27268 24821 33868 27968
8000 27968 29954 37398 26986 29823 32497 27280 18192 10176 7973 27326 42681 41660 43666 51056
7986 51056 39202 41792 43580 47768 51767 57502 57339 50775 44028 33277 28506 23605 21648 21288 18516
7971 18516 32139 23429 21620 16328 9947 9910 13927 12032 13975 11090 24387 21321 16263 24246 37128
7956C7128K701j2508n999j1931J0186J2822J850Q868k177k4262j3137n824J5818
7943A3535R026k416L529m702k157j1530j0407J6179Q039K416L513m485n11M299
7929B4328J0395P471k222O979R680o749j6994M364N298r187P507J942p299k953
7915C2560P437P916J926q982O253P313j563n946j1320J4378j0620m847L106O471
7901D4082j3801o022R362J361n132N259K70K732l416K806O963O162j0886j635
7887C8105J0887k504j3518j243P784j848m398p924j2401j1730J977R06J3151O669
7873B3913p879K767L238k660j337J9889Q442j0799n321m932K76J653n432j422
7859B0396n264J1845j999k578P01M947k127n556l057N899J8935R036j1043j536
$$ plain form
7956 37128 39829 27321 21322 9391 19577 32399 34249 43117 40940 16678 3541 -2283 13535
7943 13535 22561 20145 23674 18972 16815 5285 -5122 11057 19096 21512 25025 20540 20029 24328
7929 24328 34723 42194 39972 46951 56631 49882 32888 37252 42550 33363 40870 42812 35513 32560
7915 32560 39997 47913 49839 40857 47110 54423 52860 46914 35594 49972 39352 34505 37611 44082
7901 44082 30281 24259 33621 34982 29850 35109 35379 38111 34695 37501 44464 50626 39740 38105
7887 38105 48992 46488 32970 31727 39511 37663 33265 25341 12940 1210 3187 4093 17244 23913
7873 23913 16034 18801 22039 19379 18042 37931 46373 35574 30253 25321 25597 27250 21818 20396
7859 20396 15132 26977 24978 22400 23101 28048 25921 20365 17308 23207 42142 51178 40135 38599
7845C8599j734j1919j6184L38M619r25M072j5185r378m38L756P558P512n762R18
7830E847O131N438j610M734J060j1378N11j227j1860l486J2152k412j0648j0385
7816a7133K1054O596R72l387k5618K599J9930J3881l663J1376j095p426J4249
7803C2335K713m737j0172j519n302O698p194o986r806J050j437K131J1995O671
7789A6440j772j8294k478J3982Q864N406j1581k462J4647O781k0901r977N958
7776D613N697j814M301M490J12Q17O279K571m900j3554J345k178k714j0993O249
7761C21J8840j5857p29M160L077Q192K856Q191j290o432r120J1678m459k3510
7747d082k897L702J5296R480k502j7685J0397J52o45N828K558q714Q11o981n277
$$ plain form
7845 38599 36865 24946 8762 9100 13719 12794 16866 1681 -7697 -8135 -4379 3179 10691 4929 5847
7830 5847 11978 17416 15806 20540 21600 10222 10733 9506 -2354 -5840 6312 3900 -6748 -17133
7816 -17133 3921 10517 11489 8102 -17516 -14917 5013 18894 15231 26607 25512 18086 32335
7803 32335 35048 30311 20139 18620 13318 20016 12822 5836 -3970 -2920 -4357 -2226 9769 16440
7789 16440 14668 -3626 -6104 7878 16742 22148 10567 8105 22752 29533 8632 -1345 4613
7776 4613 10310 8496 12797 17287 17399 18216 24495 27066 22166 8612 9957 7779 5065 -5928 321
7761 321 19161 3304 2575 6735 9812 18004 20860 29051 27761 21329 12209 23887 19428 -4082
7747 -4082 -6979 -3277 12019 21499 18997 1312 11709 11861 11216 17044 19602 10888 11699 4718 -559
7732e59K243q54n899J1819J3283r638m066O996j247l17M814q49n136j506j3973
7717d889Q117k951R610J0998m473N904j612j2570L185N095O651p863P89L177k654
7702A6514j0845k784j1p934r904j1803O137P785R124P567j5612m350O605P599
7688a912j1219m792O599M752k467J988j139k723N179J0934J3398q983q224R225
7674A0616l94P95O308K438M233o972j4065j1622N155O916K31N268j027l866P55
7659D769j5827j2150O053Q583O12o930N771K0177m681j4068m275K444N625J7163
7645A3266K44K537J0500l362o685r812j440J441P90p876N719K3152k489q686J748
7630A9047j3376l446o038O392N056k3977r870O178N710l50J7091J0584r967l877
$$ plain form
7732 -559 1684 830 -5069 6750 20033 10395 6329 13325 12078 11761 16575 15726 10590 9084 -4889
7717 -4889 3228 277 9887 20885 16412 22316 20704 8134 11319 16414 23065 15202 15991 19168 16514
7702 16514 5669 2885 2874 -5060 -14964 -26767 -20630 -12845 -3721 3846 -11766 -16116 -9511 -1912
7688 -1912 -13131 -17923 -11324 -6572 -9039 -7051 -8190 -10913 -5734 5200 18598 9615 1391 10616
7674 10616 10222 11017 17325 19763 23996 17024 2959 -8663 -3508 3408 3639 8907 7880 4014 4769
7659 4769 -11058 -23208 -17155 -8572 -7960 -14890 -9119 11058 6377 -7691 -11966 -9522 -3897 13266
7645 13266 13510 16047 26547 23185 16500 6688 5248 6689 7479 -397 5322 28474 25985 17299 19047
7630 19047 5671 2225 -3813 2579 7635 -16342 -26212 -20034 -14324 -14674 2417 13001 3034 -843
7616h43r369n068M651J2980P010N227Q046o92j5020m920j0128l746M608O396J5624
7601A4756N65q036n658k576j50K903k159r689o534P121L0332K5726k0392n021
7587B1188r310o566n623p856k538M407O779m500P003Q857j6058j347L655m900
7573f809n534M986L864J0p349J2017P317J176q073O173J1416j866P452K672n909
7558B1543r696j1203J138J5962j872j8225j1914p916N970J2122K2046k222j6747
7545a014j7222M584K498P303L297J1896j3776j9144n826J3149J278j2311J1066
7532a4222J4276L749Q792o199l735n236K139J4869J5644q063J0266m21j139o615
7518B4105j0680J83k794o480M336p140O683M48k1424P628R575m725P372N219j2470
$$ plain form
7616 -843 -10212 -15280 -10629 2351 9361 14588 22634 21942 6922 2002 -8126 -11872 -7264 -868 14756
7601 14756 15321 7285 1627 -949 -1099 1804 -355 -10044 -16578 -9457 20875 46601 26209 21188
7587 21188 11878 5312 -311 -8167 -10705 -6298 481 -4019 2984 11841 -4217 -5564 -1909 -6809
7573 -6809 -12343 -7357 -3493 -3483 -10832 1185 8502 9678 1605 7778 19194 17328 24780 27452 21543
7558 21543 11847 644 1782 17744 15872 -2353 -14267 -22183 -16213 -4091 17955 15733 -1014
7545 -1014 -18236 -13652 -11154 -3851 -554 11342 -2434 -21578 -27404 -14255 -12977 -25288 -14222
7532 -14222 54 3803 12595 6396 2661 -2575 -436 14433 30077 22014 32280 31859 30720 24105
7518 24105 13425 13608 10814 4334 8670 1530 8213 8661 -12763 -5135 4440 -285 7087 12306 -164
7503a64q384k701J2309J2875p861m270m536p605p858m231j186R593r30k95m695
7488a9939j217J5996J2362N020j6185n447J1524O351o572j1713M905J190j4114
7475a7839r382P334Q463k372J0182N494N14n362j0626k624M645O909L424L491
7461B251N09n480Q93l113j836R753P650M820n408J656N024r293K398K974M847
7446A7645n948n504Q918K005j900o955L51P562m063r251q271J0375J2743N803
7432B3510j8288j1633j870j702M892J1297J1028J215p419Q1p468P339j936j396
7418G650O312P240q870M17q570L335m198L863o755P660J2772o582m632K966N947
7403A8555j589k648j2408p440R414M631q283p973j0504j103J8776l384n919j082
$$ plain form
7503 -164 -8548 -11249 1060 13935 6074 1804 -2732 -10337 -18195 -22426 -23612 -14019 -14949 -15244 -19939
7488 -19939 -21156 -5160 7202 12222 -3963 -9410 2114 8465 1893 -9820 -4915 -3725 -17839
7475 -17839 -27221 -19887 -11424 -13796 -3614 1880 2394 -2968 -13594 -16218 -11573 -4664 -1240 2251
7461 2251 2760 -2720 -1827 -4940 -6776 2977 10627 15447 10039 11695 16719 7426 9824 12798 17645
7446 17645 11697 6193 15111 17116 15216 8261 8612 16174 12111 2860 -5411 4964 17707 23510
7432 23510 5222 -6411 -8281 -9983 -5091 6206 17234 18449 11030 11111 3643 10982 9046 7650
7418 7650 13962 21202 12332 12749 4179 7514 3316 7179 424 8084 20856 14274 9642 12608 18555
7403 18555 16966 14318 1910 -5530 3884 8515 232 -7741 -18245 -19348 -572 -3956 -9875 -10957
7389a0957K1990J7161m784j6823N50j3927o099O889J4475L275N021J580l886Q27
7375A5292j895J508r298j0944l539n055K147J2496o5p016n005J4692l137j6262
7361a6081j940M907O033O398M672N065j4342j1671K836K1606L545j5525P823N88
7347C914l997L880M370j8879j4681P842J7893Q591M380P12P561j5693l524J0607
7333A2976P406r764j5557j873Q182R020J0q28R541j2005j4063P876J2244m278
7319H887m631L890k13O922N039L118n826j4194j0352n89r609l752O385R260J5985
7304A0320j8132k221n0L183l601J1931J6339m987J711j956n436j4o518j8480m202
7289b2113Q421J4275N338P15o469l178O64n304R965o969P215J4369m437m833r838
$$ plain form
7389 -10957 11033 28194 23410 6587 7137 -6790 -12889 -6000 8475 11750 16771 18351 14465 15292
7375 15292 13397 14905 5607 -5337 -8876 -13931 -11784 712 647 -6369 -11374 3318 181 -16081
7361 -16081 -18021 -13114 -7081 -683 3989 9054 -5288 -16959 -14123 7483 11028 -4497 3326 3914
7347 3914 -83 3797 8167 -10712 -25393 -17551 342 8933 13313 14025 21586 5893 2369 12976
7333 12976 20382 10618 -4939 -6812 1370 10390 10400 9572 19113 7108 -6955 921 13165 8887
7319 8887 4256 8146 7933 14855 19894 23012 17186 2992 -7360 -7949 -17558 -21310 -14925 -5665 10320
7304 10320 -7812 -10033 -10083 -6900 -10501 1430 17769 12782 14493 12537 7101 7087 569 -17911 -22113
7289 -22113 -13692 583 5921 6636 167 -3011 -2347 -7651 2314 -4655 2560 16929 12492 7659 -2179
7274b179l299J090J0145j035q492k539L358M530k128k249o644k55J670p588R924
7259e691J6916R653j0501k644j0936j0520l627J1432J0898M456j1799m800K1450
7246A4287j1934m280M057q109M43R071M693q320m672J1541q856n240O447q818
7232i690l786M306m557n279K794M164P891j4006N857l6J3983N827j4380j2160
7218a9072O286N174P078J171l063Q576l06k854J9q898Q695J76N886N296L579p497
7202A0246j0168J533o00q870q765Q807Q149J435M510L335j0088N767J0063J127
7188A6481q193k30p182m327j2455J167J537O956K214J7546J1416N663O635j307
7174C5921n943j1144j2135j746R061P858o39j0903n916P895k421J075P570l623
$$ plain form
7274 -2179 -5478 -4388 5757 4722 -3770 -6309 -2951 1579 -549 -2798 -9442 -9697 -8027 -15615 -5691
7259 -5691 11225 20878 10377 7733 -3203 -13723 -17350 -5918 4980 9436 -2363 -7163 14287
7246 14287 2353 -1927 2130 -5979 -5536 3535 8228 -92 -4764 6777 -2079 -7319 -872 -9690
7232 -9690 -13476 -9170 -13727 -19006 -16212 -12048 -4157 -18163 -12306 -12342 1641 7468 -6912 -19072
7218 -19072 -12786 -7612 -534 637 -2426 6150 5844 2990 3009 -5889 2806 2982 8868 14164 17743 10246
7202 10246 78 1611 1011 -7859 -16624 -7817 332 1767 6277 9612 -476 5291 15354 16481
7188 16481 8288 8058 876 -3451 -15906 -14739 -13202 -6246 -4032 13514 24930 30593 37228 35921
7174 35921 29978 18834 6699 4953 14014 21872 21233 10330 4414 12309 9888 10963 18533 14910
7160A4910j986j2898J083j212l518P976J1981m262m27J832J871k979q13K082O267
7145A9907l115J504n431k0533M362J3544J3382M087o591l154j3813k075r221J1894
7131D747n016k466P693P949r167k0733L75K2278j533m849P420R43j559K105O948
7116A5135K471m977j1317Q898p834j5694q99L365m076q76J5752j661k1207K962
7102a9958L088K898k827N120N657Q700n098k85J5401J5695n318j2772q213L725
7088E813m717o087J73p215j9067J160J1496J1322K1154J2040k575j8553q957r256
7074a3269J407R878Q84o480l235J185J4007O462n306L139R62o170P219L432J757
7059A5872J2441N28q040k4257k2785n133J6355K1549K2254r693k0065m675O910
$$ plain form
7160 14910 12924 26 1109 -103 -3621 4355 16336 12074 11647 13479 15350 12371 11558 13640 19907
7145 19907 16792 18296 12865 -7668 -3306 10238 23620 27707 21116 17962 4149 2074 -7147 4747
7131 4747 -269 -2735 4958 12907 3740 -16993 -16618 5660 4127 -722 6698 7641 6082 8187 15135
7116 15135 17606 12629 1312 10210 2376 -13318 -14217 -10852 -14928 -15804 -52 -1713 -22920 -19958
7102 -19958 -16870 -13972 -16799 -11679 -6022 2678 -2420 -2705 12696 28391 23073 10301 2088 5813
7088 5813 1096 -4991 -4818 -12033 -31100 -29940 -18444 -7122 14032 26072 23497 4944 -4013 -13269
7074 -13269 -11862 -1984 -1100 -7580 -10815 -9630 4377 10839 5533 8672 9634 3464 10683 14115 15872
7059 15872 28313 28841 20801 -3456 -26241 -31374 -15019 6530 28784 19091 -974 -5649 1261
7046A261l466l739j0610q724J502j007L543l356j710Q456q10M34J3543Q147Q354
7031A1818j3092o42M59r550j146K904J5180k035N50p19o763j1069J2190Q781J4995
7016B1861r999j6530r657l12J4071K0498O49j2135j3430m718p233R808J5556J8601
7002B7030r089j0527o59K068q160j955l834q979j0514M147J5598L142j1659J1302
6988b089J5551N493o69j2391j990k707L079J0553R17j146j5568o621R85j1347
6974a7950N238J1315M744M931J979J2949j225j4930k940N143j4433j6379O291
6961a5267M516J2170K88K543J4431k0012k3270M184J2940M008M670j9329r175
6948b7303P068J3056k097j0042P119K968O312k495L25j2009O955j492j96O613
$$ plain form
7046 1261 -2205 -5944 -16554 -25278 -23776 -24783 -21240 -24596 -26306 -17850 -18660 -18226 -4683 3464 11818
7031 11818 -1274 -1916 -1457 -11007 -12153 -9249 5931 3896 4446 3727 -3036 -14105 -1915 6866 21861
7016 21861 11862 -4668 -14325 -14637 -566 19932 20581 8446 -4984 -9702 -16935 -7127 8429 27030
7002 27030 17941 7414 6755 8823 663 -1292 -5126 -14105 -24619 -20472 -4874 -1732 -13391 -2089
6988 -2089 13462 18955 18286 5895 3905 1198 4277 14830 15747 14601 -967 -7588 -6603 -17950
6974 -17950 -12712 -1397 3347 8278 10257 23206 21981 7051 4111 9254 -5179 -21558 -15267
6961 -15267 -10751 1419 1707 4250 18681 -1331 -24601 -20417 -7477 -3469 1201 -18128 -27303
6948 -27303 -20235 -7179 -9276 -19318 -12199 -9231 -2919 -5414 -5089 -17098 -10143 -11635 -11831 -5218
6934e218j3537J292N241n5k733J1886N778k378j8471j911O349Q345m339l746J2227
6919a270O834j1674j0124l281J174P416q174J659P528k956P972J7200j0197L25
6905B432m82j3548j5996n512J8385J6644J0129j726m382O73n440m049j5557l658
6891b2087m720j463R152O373Q116R396j1723r089o040l422L771J3418J8451R754
6877A9887P001P879M164j1625p446k1356L051N832J1022P785j5017j2599l968
6864e390J1690L26l523O865j1709l681N765M195J884L797n414j046M249Q478J213
6849A7699j5789j2539J46k714J6624P932R575j0106p401p250o171j8374l977J8921
6835a3424J3388j505l807J350K168N205j4277Q134P429M857K963k108J3340j33
$$ plain form
6934 -5218 -18755 -17463 -12222 -12277 -15010 -3124 2654 276 -18195 -20106 -13757 -5412 -9751 -13497 -1270
6919 -1270 5564 -6110 -16234 -19515 -18341 -10925 -19099 -17440 -9912 -12868 -4896 12304 2107 2432
6905 2432 1950 -11598 -27594 -33106 -14721 1923 12052 10326 5944 6617 1177 -2872 -18429 -22087
6891 -22087 -26807 -28270 -19118 -12745 -4629 4767 -6956 -16045 -22085 -25507 -21736 -8318 10133 19887
6877 19887 26888 34767 38931 27306 19860 -1496 1555 7387 18409 26194 11177 -1422 -5390
6864 -5390 6300 6626 3103 9968 -1741 -5422 343 4538 6422 10219 4805 3759 8008 16486 17699
6849 17699 1910 -10629 -10483 -13197 3427 11359 20934 10828 3427 -3823 -9994 -28368 -32345 -13424
6835 -13424 -36 -1541 -5348 -3998 -1830 3375 -10902 -2768 4661 9518 12481 10373 23713 23580
6821B3580r320K944j837m096Q838K074r894k455k941j0091N32N084R660Q837J426
6806B2341n100m869p007M212j590M439j112j3176k127n878P231K965l024J0183
6792G488N912p532m147j1521j3721k78N399j2401j583J2664J3210r65l167P068
6778c574M804n307P95j958m709m203O46Q983j0788P920J2374o297q345n762n178
6763b0599L535N750J1251k22m322r307n736j819J6394N296j0335N444L204K066
6749F00O75J8512L160j0661o022j1278r094O42J3626K631k571o087p738r148O84
6734b2069L122O3N861j89r218O557K2517J6693j0296j5637p247J188q764R42M350
6719a2127J4023J7009m537j368o14N512o31j4523k393M7J1772O157m927m621J1572
$$ plain form
6821 23580 14260 17204 15367 11271 20109 22183 12289 9834 6893 -3198 -2666 2418 12078 20915 22341
6806 22341 17241 12372 5365 9577 7987 12426 11314 -1862 -3989 -9867 -2636 329 -2695 7488
6792 7488 13400 5868 1721 -9800 -23521 -23799 -18400 -30801 -32384 -19720 -6510 -7475 -10642 -3574
6778 -3574 1230 -4077 -3282 -5240 -9949 -14152 -13506 -4523 -15311 -7391 4983 -1314 -9659 -15421 -20599
6763 -20599 -17064 -11314 -63 -285 -4607 -13914 -19650 -21469 -5075 221 -10114 -4670 -1466 600
6749 600 1275 19787 22947 12286 6264 -5014 -14108 -13466 160 2791 220 -5867 -13605 -22753 -22069
6734 -22069 -18947 -18884 -13023 -13212 -22430 -15873 6644 23337 13041 -2596 -9843 -8655 -17419 -16477 -12127
6719 -12127 1896 18905 14368 13000 12386 17898 17267 2744 351 398 12170 18327 13400 8779 20351
6704B0351p512q176j227n799K969q792J906q481O881N741J0203J6532j9188J130
6690F538M531Q87K34o980j4232k126r630j1397J8705M810O81m781n09r61L258
6675a0972o29O624K2105r222n891R057m390k1071m421L784J252K0572R115j213
6661A4700m757o217p501L756O531j3822p23R252J6074m785o873j9573L18Q194
6647e426J535r895j1884J3464N952J837M639J1374o242j9790k834P132J4550J5006
6633A9418m771j2783P210p292j3014K856J376l851P580J01q619L044L103k970
6619h612q964r515J4822m5o739Q993J7379n63r395j2969L366q261m099M727M192
6604a5683K774N853k217q8M438j1736j948n45l530p105k468J0184J7118J7649
$$ plain form
6704 20351 12839 4663 3436 -2363 606 -8186 -6280 -14761 -7880 -2139 8064 24596 5408 6538
6690 6538 11069 11956 12190 5210 -9022 -11148 -20778 -32175 -13470 -8660 -7979 -12760 -13269 -14230 -10972
6675 -10972 -11601 -4977 17128 7906 2015 11072 6682 -14389 -18810 -15026 -13774 6798 15913 14700
6661 14700 9943 3726 -3775 -19 6512 -7310 -8033 1219 17293 12508 5635 -13938 -13620 -5426
6647 -5426 -3891 -13786 -25670 -12206 -6254 -4417 222 11596 5354 -14436 -17270 -10138 4412 19418
6633 19418 14647 1864 9074 1782 -11232 -8376 -7000 -10851 -3271 -3170 -11789 -8745 -5642 -8612
6619 -8612 -17576 -27091 -12269 -12314 -19053 -10060 7319 6756 -2639 -15608 -12242 -20503 -24602 -19875 -15683
6604 -15683 -12909 -7056 -9273 -9361 -4923 -16659 -18607 -19152 -22682 -29787 -32255 -22071 -4953 12696
6590A2696Q730j1772j1986K226j2757j699N086l151P988J2167J730m227k146j1708
6576h823o880J696m694J300n67P011Q078J034M0k339j1286j1288O023J4955M617
6561a123J2063O06m225j6041l319J2311O830l095j820J3999J9527j5912k0386
6548e85q205P648R277l129j1086J0500L241M0j090N991m242j529L37l432M445
6533H181j005o581O34Q046Q90o198j2496L31p064J1236J2158m666p907r624j0576
6518b4641L288K9189K430j1993j021R220R574j2304j7252j251J3765J1443j3328
6505b881j3092j0164P799R204p59L226M336K757K21K085J757L054J682P15q088
6490A852j780k0552N254N416J5333M567K356n83k3295k7408R877k564M653M236
$$ plain form
6590 12696 21426 9654 -2332 -106 -12863 -14562 -9476 -12627 -4639 7528 9258 5031 2885 -8823
6576 -8823 -15703 -14007 -18701 -17401 -17968 -10957 -2879 -1845 -1805 -4144 -15430 -26718 -20695 -5740 -1123
6561 -1123 10940 11546 7321 -8720 -12039 272 7102 4007 2187 16186 35713 19801 -585
6548 -585 -8790 -1142 8135 5006 -6080 4420 7661 7701 6611 12602 8360 6831 7168 3736 8181
6533 8181 7176 595 1229 9275 10165 3967 -8529 -8198 -15262 -4026 8132 3466 -4441 -14065 -24641
6518 -24641 -21353 7836 10266 -1727 -2748 6472 16046 3742 -13510 -14761 -996 10447 -2881
6505 -2881 -15973 -26137 -18338 -9134 -9893 -6667 -2331 426 647 2732 4489 7543 9225 9940 1852
6490 1852 72 -20480 -15226 -9810 5523 10090 12446 11863 -11432 -38840 -28963 -31527 -26874 -22638
6476b2638N439M956l504j831M93n003J2587P883q452O344O078j659j619J0038
6462I112M569m464j977M021N389o160l604l513o579L078P126j6356k1798O339
6448b4817K1381K727j953n257M268P410r134n244P412j439k445K9m976r040K2756
6433A678J3671r158J355j4176r803K023J3088P782L323M218J1519J279n905p806
6419A3088j0019Q190R994M207j1814p424o941q187J5133R359M661K403o340o486
6405I824j1380q980O708R079M46N897L014q266p325k310j608K157Q998p412j8507
6390a9665j783q057N54J3789J2903L169j718j2970J2325O657j3568m192J1482
6377a074M735L931l532l146n228L980q765k122K756o561o59P73Q114J3236O838
$$ plain form
6476 -22638 -17199 -12243 -15747 -17578 -17085 -22088 -9501 -1618 -10070 -3726 2352 693 -926 9112
6462 9112 13681 9217 7240 11261 16650 10490 6886 3373 -3206 -128 6998 -9358 -31156 -24817
6448 -24817 -3436 -709 -2662 -7919 -3651 3759 -5375 -10619 -3207 -4646 -7091 -7062 -12038 -21078 1678
6433 1678 15349 6191 7546 -6630 -16433 -14410 -1322 6460 9783 14001 25520 26799 20894 13088
6419 13088 3069 11259 21253 25460 13646 6222 -719 -8906 6227 15586 20247 22650 16310 9824
6405 9824 -1556 -10536 -3828 5251 5697 11594 14608 6342 -983 -3293 -4901 -2744 6254 -1158 -19665
6390 -19665 -21448 -29505 -28951 -15162 -2259 910 -808 -13778 -1453 5204 -8364 -12556 -1074
6377 -1074 3661 7592 4060 914 -4314 -334 -9099 -11221 -8465 -15026 -15685 -14912 -6798 6438 13276
6362A3276j019m519p836l183r875m508J3407J3163o350r330q883J569N847n242
6348a3483j9769J2140O104J33j0441N730J5032r336q220P818O531m611O343R686
6334C657K753j4541M243o05J2396P836k872k1673o886L767p82J4050K105o636
6320c188J267k489P199N493L5q243N27N773M688J620j5959j3829L422j0856j1276
6305c5816J426J1345J622J7150o698p321K775J040N099P742n044N92m736J5772
6291D948K879l475j228q554K82k093K03L815K2526O710n820q025p723j794m99
6276B152j461k462j4850o628J0039M302q234o468J249N273J2016J323j1764Q554
6262f959K357m224j1325J790J1813M188l067n252r942j2596J4249J3182P688l824
$$ plain form
6362 13276 12257 7738 -98 -3281 -13156 -17664 -4257 8906 2556 -6774 -15657 -14088 -8241 -13483
6348 -13483 -33252 -21112 -15008 -14875 -25316 -19586 -4554 -13890 -22110 -14292 -7761 -12372 -6029 3657
6334 3657 6410 -8131 -3888 -4493 7903 15739 12867 -8806 -15692 -11925 -12707 1343 3448 -3188
6320 -3188 -1921 -4410 2789 8282 8317 74 601 6374 11062 12682 -3277 -17106 -13684 -24540 -35816
6305 -35816 -34390 -23045 -21423 -4273 -10971 -18292 -15517 -14477 -9378 -1636 -6680 -6088 -10824 4948
6291 4948 7827 4352 3124 -5430 -5148 -7241 -7038 -3223 19303 26013 20193 12168 4445 2651 2152
6276 2152 691 -1771 -16621 -23249 -13210 -8908 -17142 -23610 -22361 -17088 -5072 -3749 -15513 -6959
6262 -6959 -4602 -8826 -20151 -18361 -6548 -2360 -5427 -10679 -20621 -33217 -18968 -5786 1902 -1922
6248a922L913J2020j188n697j082J99K380L692Q197Q330j4735K360Q139O089o46
6233C0049m96m986k398j8326j7637J4629j2995Q088R932P19o815l159k672L69
6219e698O100N77k3208j3250J0278P152K664J2579N465j4754j3540j527O454K315
6205a8393q41J3187R952O456o799o919r63n14p458k1865m051J1719j664O926J1781
6190i446J544m33O980P338j685j789o193n658m769k363J2284J8387K820O552n057
6175A8512n364j125L817p236j0988j6253n387J3696J151p266J0673KM673N493
6161D398m12o263M240j270K290L429j637N559n933j8859m782k628J6604K602n92
6146c254J90J7285N844j4823q043M307M05m787L649K0958l511k7775r461l574
$$ plain form
6248 -1922 1991 14011 12823 7126 6044 6243 8623 12315 20512 28842 14107 16467 24606 30695 30049
6233 30049 29553 24567 22169 3843 -13794 835 -12160 -4072 5860 6579 -236 -3395 -6067 -5698
6219 -5698 402 979 -22229 -35479 -25201 -18049 -15385 -2806 2659 -12095 -25635 -27162 -20708 -18393
6205 -18393 -19234 -6047 3905 10361 3562 -3357 -4320 -4834 -12292 -34157 -38208 -26489 -28153 -21227 -9446
6190 -9446 -7902 -8335 -1355 5983 4298 2509 -3684 -9342 -14111 -16474 -4190 14197 17017 23569 18512
6175 18512 13148 12023 15840 8604 -2384 -18637 -24024 -10328 -9177 -16443 -5770 -5768 -1095 4398
6161 4398 3986 -2277 1963 693 2983 6412 4775 10334 4401 -14458 -19240 -21868 -5264 -2662 -3254
6146 -3254 -3064 14221 20065 5242 -2801 1506 1911 -2876 773 21731 18220 -9555 -19016 -22590
6132b2590J0512J4256K680m718M720R892k0267j5350R186R385r344p481J587k215
6118a9747r272m927J5011J9506q273M62N085P255n81q775l573M89l482q181l803
6103b2806p815M593J1871N900j1203j1841P540R428M958L252J3440J0738K855
6090B0910r313J108J4306j0802j6418j3095j797Q852O419m677j612j4399j6669
6077c7187J2187M597k440J1481J2894j4326k0227j218R860j466l763n980J1265
6064b4323M497J512J806L97R444K699J227j454M885M400j1284R790J328q520k0524
6049b4120O866K0634r437j3293K530l129M795Q590K91j0017P164P915r726M702
6035f235P633Q159P72q195O228m054m935l634o420m169j4465J272J1797Q43m293
$$ plain form
6132 -22590 -12078 2178 4858 140 4860 14752 -5515 -20865 -11679 -2294 -11638 -19119 -17532 -19747
6118 -19747 -29019 -33946 -18935 571 -7702 -7240 -2155 5100 4519 -4256 -7829 -7340 -10822 -19003 -22806
6103 -22806 -30621 -26028 -14157 -8257 -19460 -31301 -23761 -14333 -9375 -6123 7317 18055 20910
6090 20910 11597 12705 27011 16209 -209 -13304 -15101 -6249 170 -4507 -6119 -20518 -37187
6077 -37187 -25000 -20403 -22843 -11362 1532 -12794 -33021 -34239 -24379 -25845 -29608 -35588 -24323
6064 -24323 -19826 -18314 -16508 -16111 -6667 -3968 -2741 -4195 690 5090 -6194 3596 4924 -3596 -24120
6049 -24120 -17254 3380 -6057 -19350 -16820 -19949 -15154 -6564 -6273 -16290 -9126 -1211 -10937 -6235
6035 -6235 1398 9557 10329 2134 8362 4308 -627 -4261 -10681 -14850 -29315 -28043 -16246 -15403 -19696
6020a9696p39K874J6147J3431j6254p247k821q388J6122J2199o40j492j7532j6750
6006c0786O555J0154j1160K175R811M441O478O769P241K132j0121j6564q858R997
5992a1736R058p591J1573L453n96j2814o383K926J091j088j070O687m2j569k672
5977a0773L181J036o16k798N778R844Q420j046j1734j075n976R202J1695p070
5963H068q634L488m87k2404l688K441P625j1176J4065M880M884l256j1328l860
5949a9382k838L995K408Q706Q028R754l231J91l428j5881Q720P795r269P304n798
5934b926m49o249j961k051J3015r45q711J1201J8532K1162j6j8635m338O806k922
5919B1513r485j2517l63J3018l667j1522K003R977l098L746l288k0356j0669J5720
$$ plain form
6020 -19696 -20435 -17561 -1414 12017 -4237 -11484 -14305 -22693 -6571 5628 4988 3496 -14036 -30786
6006 -30786 -24231 -14077 -25237 -23062 -13251 -8810 -2332 4437 11678 13810 3689 -12875 -21733 -11736
5992 -11736 -2678 -10269 1304 4757 4161 -8653 -15036 -12110 -11019 -12107 -13177 -6490 -6532 -8101 -10773
5977 -10773 -7592 -6556 -7172 -9970 -4192 5652 14072 13026 1292 217 -5759 3443 15138 8068
5963 8068 -566 2922 2435 -19969 -23657 -21216 -13591 -24767 -10702 -5822 -938 -4194 -15522 -19382
5949 -19382 -22220 -18225 -15817 -7111 917 10671 7440 7631 4203 -11678 -2958 4837 -4432 2872 -2926
5934 -2926 -3375 -9624 -11585 -13636 -621 -1566 -10277 924 19456 40618 40602 21967 17629 24435 21513
5919 21513 12028 -489 -852 12166 8499 -3023 -1020 8957 5859 9605 6317 -14039 -24708 -8988
5905h988J6921N051N260n145P650r877j2179p842M248P98l972J049J227R287o21
5890B867j4858l866M372K1590j565p750M826p277j1347o431N256P912n128k470
5876a3869N792k168p113J2594K2225P880n5M560j747k8511l0275J743J1788l234
5862b0390J9786J6251J401O010L96j2853j7884J186j238k780j757j513k228N564
5848a0049j510j559M690J2271j563j045r856k089o657J766O006K1803M43j6175
5834c524N270J642j1680j170n785j543J174J8778R562p820m625p157m794q812
5820b0484j8782j527J1973J5145p668l751Q517J2583L995n05K119r209Q819o608
5806e383O80j0163j7212J0052K2057M273q611k501K572n115o809J4882R878l464
$$ plain form
5905 -8988 7933 12984 18244 13099 20749 10872 -1307 -9149 -4901 -4103 -8075 -7026 -5799 3488 2867
5890 2867 -11991 -15857 -11485 10105 8540 790 5616 -1661 -13008 -19439 -14183 -6271 -11399 -13869
5876 -13869 -8077 -10245 -17358 -4764 17461 25341 25286 29846 28099 -412 -30687 -28944 -17156 -20390
5862 -20390 -604 15647 17048 23058 23454 10601 -7283 -6097 -7335 -10115 -11872 -13385 -15613 -10049
5848 -10049 -11559 -13118 -8428 3843 2280 1235 -8621 -10710 -17367 -15601 -9595 12208 12651 -3524
5834 -3524 1746 3388 -8292 -9462 -15247 -16790 -15616 3162 12724 4904 279 -6878 -11672 -20484
5820 -20484 -39266 -40793 -28820 -13675 -21343 -25094 -16577 -3994 1 -504 1615 -7594 1225 -5383
5806 -5383 -4703 -14866 -32078 -22026 31 4304 -4307 -6808 -4236 -9351 -16160 -1278 8600 5136
5792E136q539J145O017m393p0n72n897O418P034m006j516K745k675l791K554J3034
5776A2624O776k8241n110M698N739o256j4244P727O884O279J9654j437j2785j923
5762C85p863o516Q505l19q370N171r85l662j254J0659O803N590q240J381J769
5747C054j3810j3459l516J4510j065M817M102J6397Q396j8509k937N64K457j4227
5733a3226k777Q854k259l991K0277L271k8400j4545M724J7459O225J611l196K589
5719c384J460J6747J92L462k132k0005P90P941L355K983j247m957p116m770O720
5704C9n735L362l369n985o502nN407l83Q763K200J022K57p419n125M616N735m879
5687h001q281o978Q293L719n150j3144j841J3848Q385R970O13o090n313j073M252
$$ plain form
5792 5136 -3403 -2258 3759 -634 -704 -1276 -7173 -755 6279 2273 757 3502 827 -2964 -410 12624
5776 12624 19400 -8841 -13951 -9253 -3514 -9770 -24014 -16287 -9403 -3124 16530 15093 2308 385
5762 385 -7478 -13994 -5489 -5808 -14178 -9007 -9992 -13654 -14908 -4249 2554 8144 -96 1285 3054
5747 3054 -10756 -24215 -27731 -13221 -14286 -9469 -5367 11030 19426 917 -2020 -1456 1001 -13226
5733 -13226 -16003 -7149 -9408 -13399 6878 10149 -18251 -32796 -28072 -10613 -4388 -2777 -5973 -3384
5719 -3384 -1924 14823 15015 18477 16345 -3660 -2870 5071 8426 11409 10162 5205 -1911 -6681 39
5704 39 -5696 -2334 -5703 -11688 -18190 -18195 -12788 -13171 -4408 -2208 -1186 -929 -8348 -13473 -8857 -3122 -8001
5687 -8001 -16282 -23260 -14967 -11248 -16398 -29542 -31383 -17535 -9150 820 1433 -4657 -9970 -11043 -6791
5672f791k540m243p262J303q114n124K13L648J2348K00q889P530R314P995O647
5657F235J2627n948j2649K30k182L497Q362m470j2520r140L628J7910J0979N32
5643A7091J344o920j8353n025r180N803R891J1209j8310o368j741N275J5494j1100
5629a0890M820O253K798l876L428l012j7078q174J8250P126j343L397L410j1777
5615f668o637j3008k911m305j67J0460J2808j278P977o18k008l379j311k235o588
5600a9868m970J1283j473Q465L09j2273p396k24J0857J1610Q508j119r343M533
5586a101q151o368R780O264J3490o025j2668j5998K000N017m380J699P750Q205
5572d86O226j2831o23k696L440J843j777Q41K951J475k349n341p282J685K4649
$$ plain form
5672 -6791 -9331 -13574 -20836 -19533 -27647 -32771 -32558 -28910 -16562 -16362 -25251 -17721 -8407 -412 6235
5657 6235 18862 12914 265 495 -1687 1810 10172 5702 -6818 -15958 -12330 5580 16559 17091
5643 17091 18435 11515 -6838 -11863 -21043 -15240 -5349 5860 -12450 -18818 -20559 -15284 210 -10890
5629 -10890 -6070 183 2981 -895 2533 -479 -17557 -25731 -7481 -355 -1698 1699 5109 -6668
5615 -6668 -13305 -26313 -29224 -33529 -33696 -23236 -10428 -11706 -3729 -4347 -6355 -9734 -11045 -13280 -19868
5600 -19868 -24838 -13555 -15028 -6563 -6254 -18527 -25923 -26147 -15290 -3680 4828 3709 -5634 -1101
5586 -1101 -9252 -15620 -5840 424 13914 7889 -4779 -20777 -18777 -13760 -18140 -16441 -8691 -486
5572 -486 5740 -7091 -7714 -10410 -6970 -5127 -6904 -6063 -3112 -1637 -3986 -9327 -16609 -14924 9725
5557I725L465q884j4959m446N531M152R322J2198j3835k452O111q606j7746J356
5543a9068J3356Q0n065J1532J6929j5076j0822n095n320J0058O594M789K056j5293
5529a0345k6494j998J1021K951N137j422J0451l82N269M628o515O806j177j2603
5515a4673J6N159Q351N153J1583k976P989m192j4855m009O771m992j4417L115
5501a1977O196j4223k271J475k355n44Q871J5850J0162n29j757j1395o585M540
5487d542O564o972n484k52r300q590L795P415N278Q319Q37j2239l682q52J3779
5472e926M767N646o897q056q930L329K0861p776l88j755J5499M973j2249M130
5458G228J4522Q223j5339j9237j2496r572J5603J2512j1093K393j079j0412L013
$$ plain form
5557 9725 13190 4306 -10653 -15099 -9568 -5416 3906 16104 2269 -183 5928 -2678 -20424 -19068
5543 -19068 -5712 -5632 -10697 835 17764 2688 -8134 -13229 -18549 -8491 -1897 2892 4948 -10345
5529 -10345 -36839 -38837 -27816 -24865 -19728 -21150 -10699 -11081 -5812 -1184 -7699 -893 -2070 -14673
5515 -14673 -14657 -9498 -1147 4006 15589 12613 20602 16410 1555 -2454 4317 -675 -15092 -11977
5501 -11977 -5781 -20004 -22275 -20800 -23155 -23699 -14828 1022 11184 10655 8898 -2497 -9082 -4542
5487 -4542 2022 -4950 -10434 -10686 -19986 -28576 -24781 -17366 -12088 -3769 -2932 -15171 -18853 -19705 -5926
5472 -5926 -1159 4487 -2410 -10466 -19396 -16067 4794 -2982 -3370 -5125 10374 15347 3098 7228
5458 7228 21750 29973 14634 -4603 -17099 -26671 -11068 1444 -9649 -7256 -8335 -18747 -15734
5445a5734P839K244J0953Q285K347j636O842o998p134r759p127K375Q707O341
5431G545k524p280q380M332K421N398N75j1158p241k670m435P309j0282o682P977
5416b5095Q15l045J4959J0763J283R789k167j455o576m225m416J0584J9030J366
5402B1610j5120j1110p062N48o052j0182j389J1588M069l962j265P436R040K992
5388A141k469K818N591j3036n101J1041J5154J3912r132p985K209R580N584j8758
5374A0549j9242K753k496M025O500R178l555Q633L373j9825p61Q12j5777j916
5360a7749O364j177j239K745K21o923p79N613Q921j0586N070Q470Q705K337O367
5345A6360q71q012R606q607r485n896M609J819J1768J0340P44j3165p820l896
$$ plain form
5445 -15734 -7895 -5651 5302 13587 15934 14298 21140 14142 7008 -2751 -9878 -7503 1204 7545
5431 7545 5021 -2259 -10639 -6307 -3886 1512 2087 -9071 -16312 -18982 -23417 -16108 -26390 -33072 -25095
5416 -25095 -24280 -27325 -12366 -1603 -320 9469 7302 5847 -729 -4954 -9370 1214 20244 21610
5402 21610 6490 -4620 -11682 -11134 -17186 -27368 -28757 -17169 -13100 -17062 -18327 -10891 -1851 1141
5388 1141 -1328 1490 7081 -5955 -11056 -15 15139 29051 19919 11934 14143 23723 29307 10549
5374 10549 -8693 -5940 -8436 -4411 2089 11267 7712 16345 19718 -107 -868 -56 -15833 -17749
5360 -17749 -11385 -12562 -13801 -11056 -10835 -17758 -18537 -12924 -4003 -14589 -9519 -1049 7656 9993 16360
5345 16360 15489 7477 17083 8476 -1009 -6905 -2296 -477 11291 21631 22375 9210 1390 -2506
5331b506M495R531m766o774q692L370L914l205K037O97L735J6020k305j2775j1039
5316h263K77p307J1637P1p334o051L181M417J0676P650j0116q577l007N431l276
5301a0591L602j1927j4363O546K6322J5233k598j8419n752n136r538R049J4289
5288c283r950j4166P04J4589L295M903j73J3190n668j2809p532l529P259J257
5274a1913R496J0026J2591j1568j5429J2376j3196q965R623o64k357o072P505
5261h547J2395O449n687j842p267P749l514j4602N458P162q243r120m980J089
5247b3500p258R571R319M421Q331N900K341Q86K416M738j2180k2718j2613N13
5233b9833J2686Q763R151j965J0845M908L089r533j3801M277J1188p463j2961
$$ plain form
5331 -2506 1989 11520 6754 -20 -8712 -5342 -1428 -4633 -2596 -1899 1836 17856 15551 2776 -8263
5316 -8263 -7986 -15293 -3656 -3585 -10919 -16970 -13789 -9372 1304 8954 -1162 -9739 -12746 -7315 -10591
5301 -10591 -6989 -18916 -33279 -26733 -411 14822 12224 -6195 -11947 -17083 -26621 -17572 -3283
5288 -3283 -13233 -27399 -26695 -12106 -8811 -3908 -4081 9109 3441 -9368 -16900 -20429 -13170 -11913
5274 -11913 -2417 7609 20200 8632 -6797 5579 -7617 -16582 -6959 -7623 -9980 -16052 -8547
5261 -8547 3848 10297 4610 2768 -4499 3250 -264 -14866 -9408 -2246 -10489 -19609 -24589 -23500
5247 -23500 -30758 -21187 -11868 -7447 884 6784 9125 10011 12427 17165 4985 -17733 -30346 -29833
5233 -29833 -17147 -8384 767 -1198 9647 14555 17644 8111 -5690 -1413 9775 2312 -10649
5220a0649P808K4046K910k8747j6193r298L554m318r36J7860K68r182K432o457
5206b6902M108J9350p82r060J3567J890J804J730K901p434j7943J4171J4744o149
5192E995Q16J2915j586o594k1180j3658q653K789J6725J8913m077J288l008o342
5178e657o349Q980J8184N51p442j0990n555l835J3732J1987J027j1985k297j956
5164a605N612J3051L009j9713m164o259p6O103M63k5311p039J1489P815j0492
5150b7117L667O301P030j451j1586n921J4790k425l18R525K5321k466r333l011
5136C006J284l75l750o160p252j282J6016l059k243J42j87j3550R42N754j4198
5121b4912J7484J2543k336J830M08P037l498L486n559r152j5159j4258R886K9494
$$ plain form
5220 -10649 -2841 21205 24115 -4632 -20825 -30123 -26569 -30887 -31823 -13963 -13695 -22877 -20445 -26902
5206 -26902 -22794 -3444 -4226 -13286 281 2171 3975 5705 8606 1172 -16771 -2600 12144 5995
5192 5995 6811 19726 18140 11546 -9634 -23292 -31945 -29156 -12431 6482 2405 3693 685 -5657
5178 -5657 -12006 -3026 15158 15709 8267 -2723 -8278 -12113 1619 13606 14633 2648 351 -1605
5164 -1605 4007 17058 20067 354 -3810 -10069 -10145 -4042 -3579 -28890 -35929 -24440 -16625 -27117
5150 -27117 -23450 -17149 -10119 -11570 -23156 -29077 -14287 -16712 -17030 -7505 17816 15350 6017 3006
5136 3006 4290 3915 165 -5995 -13247 -14529 1487 -1572 -3815 -3673 -3860 -17410 -16468 -10714 -24912
5121 -24912 -7428 5115 2779 4609 5017 12054 8556 12042 6483 -2669 -17828 -32086 -22200 7294
5107G294J1945K287j7143l72J1774o277j8626j1103M706N211J0969J0498j709
5094I454k091k975m490o671j363l823m154Q23O811k225K003R489m105O528k1723
5079a8512q370K0474J325j4904l197j479Q616n196l12Q927J70J3305O26O60p955
5064e822j3415j3837O523J5183o823L605m937K135L555J4605N218l410l669K927
5050A838p666q971K614K532J178O451K627q378j0530j1371j538J2325O250j054
5036a3693k967k649J718O376M004M777Q095L285K672j871j0464k0875q772K101
5022b8263O078R923l522q0N339n074j7621m047L949J2690n517r604o621J1553
5008c0817J9424J1397j321l092O521Q91n06o62l268l194N104m42o194M972J8721
$$ plain form
5107 7294 19239 21526 4383 4011 15785 9508 -9118 -20221 -15515 -10304 665 11163 9454
5094 9454 7363 4388 -102 -6773 -8136 -11959 -16113 -15290 -8479 -10704 -8701 788 -3317 3211 -18512
5079 -18512 -26882 -6408 -5083 -19987 -23184 -24663 -16047 -21243 -21555 -12628 -12458 847 1473 2133 -5822
5064 -5822 -19237 -33074 -26551 -11368 -18191 -14586 -19523 -17388 -13833 772 5990 2580 -1089 1838
5050 1838 -5828 -14799 -12185 -9653 -8475 -2024 603 -7775 -18305 -29676 -31214 -18889 -12639 -13693
5036 -13693 -16660 -19309 -17591 -11215 -7211 -2434 5661 8946 11618 9747 -717 -21592 -30364 -28263
5022 -28263 -22185 -12262 -15784 -15864 -10525 -15599 -33220 -37267 -33318 -20628 -26145 -35749 -42370 -30817
5008 -30817 -11393 4 -1317 -4409 2112 3003 2497 1835 -1433 -4627 477 35 -6159 -1187 17534
4993A7534m569k864M459r574o309R859r682j5793J2009O67l625J820m626K566
4979h128J4005j3035j0504J5377J0162k89N635p953m538l588j205M795L737K847
4965G318m688k972L17m70o644j2272j3229O707K4787p15k0827p735n613N937M643
4950b5456P212N537M09l564R343o963J8027J8829l494N875o052j6875l854R274
4936H248J38M108j0564j1549k2690l85P669N925q104K97M309O472J1034K175Q103
4921E186J81r633l277o664J1022J2110n418j4646j2802N428j228j0382l964p320
4907d1407M535J2082J3142J4085p572l531k227p052j1263k981J5577N470P658
4894c484M273j9338j045N56o907l302M685J2692M073J360o713p927n113J64K0912
$$ plain form
4993 17534 12965 10101 14560 4986 -1323 8536 -1146 -16939 -4930 -4263 -7888 -6068 -10694 -8128
4979 -8128 5877 -7158 -17662 -2285 7877 7588 13223 5270 732 -2856 -4061 734 4471 7318
4965 7318 2630 -342 -25 -495 -7139 -19411 -32640 -25933 -1146 -1861 -22688 -30423 -36036 -30099 -25456
4950 -25456 -18244 -12707 -12298 -15862 -6519 -13482 4545 23374 19880 25755 19703 2828 -1026 8248
4936 8248 8386 12494 1930 -9619 -32309 -32694 -25025 -19100 -27204 -26907 -22598 -16126 -5092 -2917 5186
4921 5186 5367 -4266 -7543 -14207 -3185 8925 3507 -11139 -23941 -18513 -19741 -30123 -34087 -41407
4907 -41407 -36872 -24790 -11648 2437 -5135 -8666 -10893 -17945 -29208 -32189 -16612 -11142 -3484
4894 -3484 789 -18549 -19594 -19038 -25945 -29247 -24562 -11870 -7797 -6437 -13150 -21077 -26190 -26026 -5114
4879e114P235O321J5026n114j0707k974p932L645J848j3516L362L177m222Q57
4865h108k078j258J4397m875q554J1189q092j9568q244J936O054J1996k586J820
4851a5971N084R202j116l013O509o988M05j0721q998M955J0998k632P125J3733
4837H572m133k372N179j80n451N182J4991m624j0368l003O594l98j2880n470L513
4822d848J0478k951L027O598k264j0585N762J2348K12q792p523P5j2717j7997
4808b9177J348L519M471J694K671M418N118n507j225N638O443m526J713J4478
4794A1076q432K247J1124j075l87m390r864k386o85j987l386q048Q767p658o864
4779b1948P585J2656J6897n801p348l219L726K615N183P555l960p542r271o445
$$ plain form
4879 -5114 2121 8442 23468 18354 7647 4673 -3259 386 2234 -11282 -7920 -4743 -8965 -8108
4865 -8108 -10186 -11444 2953 -1922 -10476 713 -7379 -26947 -35191 -33255 -27201 -15205 -17791 -15971
4851 -15971 -10887 -1685 -2801 -5814 695 -6293 -5888 -16609 -25607 -20652 -9654 -12286 -5161 8572
4837 8572 4439 2067 7246 7066 1615 6797 21788 17164 6796 3793 10387 9989 -2891 -8361 -4848
4822 -4848 5630 2679 5706 12304 10040 -545 5217 17565 17777 8985 1462 1537 -11180 -29177
4808 -29177 -27829 -24310 -19839 -18145 -15474 -11056 -5938 -11445 -12670 -7032 -589 -5115 -3402 11076
4794 11076 2644 4891 16015 14940 14553 10163 299 -2087 -2772 -4759 -8145 -16193 -7426 -15084 -21948
4779 -21948 -14363 -1707 15190 9389 2041 -1178 2548 5163 10346 17901 13941 6399 -2872 -9317
4765i317N387J0522q114j3643J5742L539O769n328K332j2211K622N580K577r32
4751E525l577J314Q718q625q552O988p629N174J5830m650K671J2237q716j1401
4737E307k57Q162p115K042m452M932j0707q766J5105M96j6795o939N775N457Q244
4722D89q06j328M906j703n212O105J355j577q834M587R438N823p201L920J1516
4707B1478j3148j9591q79J400J4239P067p985R226j470j9387j299M035o655J4562
4693A593J6914J1678j1920k264n671p891P08P597n757j332m979N021M218j8386
4679a0471m057P241j7116j3804K059K3481J7380n428O281k344o720O357j201o140
4665d482R003K434O720p649o911K979n912L140J977j860l120k127J1069J027j7498
$$ plain form
4765 -9317 -3930 6592 -1522 -15165 577 4116 10885 5557 7889 -4322 -1700 3880 6457 5525
4751 5525 1948 3262 11980 3355 -5197 1791 -5838 -664 15166 10516 13187 25424 16708 5307
4737 5307 5050 13212 6097 8139 3687 8619 -2088 -10854 4251 4747 -12048 -18987 -13212 -7755 489
4722 489 -317 -1645 3261 1558 -3654 2451 3806 2229 -6605 -2018 7420 13243 6042 9962 21478
4707 21478 8330 -11261 -12140 -10740 3499 10566 2581 11807 10337 -9050 -10349 -6314 -12969 1593
4693 1593 18507 30185 18265 16001 10330 2439 3147 10744 4987 3655 -1324 3697 7915 -10471
4679 -10471 -14528 -7287 -24403 -38207 -36148 -12667 4713 -715 5566 3222 -3498 2859 1658 -4482
4665 -4482 4521 6955 13675 6026 -885 2094 -3818 -678 1299 -561 -3681 -5808 5261 6288 -11210
4650a1210j3429K750J1852K0339J0139j1959q245Q220q701j2608K354N411M67
4637d620N616k545j5825N613R188O238O347P376J088O93j102n601o633J3313R41
4622B0087q032k820J5755R158j6258l884K052N163j8609k0833p40R465J0132J2360
4608A2996M24J570n092m395j1165j9778j0118M625J3867J2993q732Q358k592j189
4594h228J637J0491P689j2022o358n218j700L75R255J308K493P305r260j2916
4580a5149j2702M962K640K604k994Q395J5892J5873J0288r268m928j2911j1906
4567i204j9139P588p298M179O512J6678j8616L131k867m0J0995J3076L961m792
4553D164k0889k210J1752l220O882o077j0487K701L134j701m019k014j620K019
$$ plain form
4650 -11210 -24639 -21889 -10037 10302 20441 8482 237 8457 -244 -12852 -10498 -5087 -4620
4637 -4620 996 -1549 -17374 -11761 -2573 3665 10012 17388 18476 19169 18067 12466 5833 19146 20087
4622 20087 12055 9235 24990 34148 17890 14006 16058 21221 2612 -18221 -18961 -9496 636 12996
4608 12996 13420 14990 9898 5503 -5662 -25440 -35558 -30933 -17066 -4073 -12805 -4447 -7039 -8228
4594 -8228 -6591 3900 11589 -433 -6791 -12009 -13709 -13334 -4079 -2771 -278 7027 -2233 -15149
4580 -15149 -27851 -22889 -20249 -17645 -20639 -12244 3648 19521 29809 20541 15613 2702 -9204
4567 -9204 -28343 -20755 -28053 -23874 -17362 -684 -19300 -16169 -19036 -19076 -8081 4995 8956 4164
4553 4164 -16725 -18935 -7183 -10403 -3521 -9598 -20085 -17384 -14250 -15951 -19970 -21984 -23604 -21585
4539b1585O892Q561P448O666L19j2115m486K67m896o674k538J1352K987j2296
4525b0098n618n236R571m590m089L288R532P129K402m92K18K694P791J5446o88
4510A7260k062j748o786p769j5006l95R573m109k753J800O163o309m663N033R267
4495b504l657L638K192N742o107n814p204Q6P832O420J5241j4709o882O733k3959
4480b2952j2888O942p30J797K263O606K062Q991L964j3877j2617N513O353K1177
4466B604N559l708o273n431j2733j4465R852R293J3720K655l381j010q534n719
4452a7571O53M097k353L175J2265k021p121L86j363M267M7j4863q1O682j498M483
4436a0816p42o236O899M459P090P218k240J886r196l852m720j892P313o69O905
$$ plain form
4539 -21585 -14693 -6132 1316 7982 8301 -3814 -8300 -8033 -12929 -19603 -22141 -10789 -7802 -20098
4525 -20098 -25716 -30952 -21381 -25971 -30060 -26772 -17240 -10111 -7709 -8201 -7983 -5289 2502 17948 17260
4510 17260 15198 13450 6664 -1105 -16111 -16506 -6933 -11042 -13795 -11995 -5832 -12141 -16804 -11771 -2504
4495 -2504 -6161 -2523 -331 5411 -696 -6510 -13714 -13628 -5796 624 15865 1156 -5726 1007 -22952
4480 -22952 -35840 -28898 -29628 -27831 -25568 -18962 -16900 -7909 -3945 -17822 -30439 -24926 -18573 2604
4466 2604 8163 4455 -1818 -7249 -19982 -34447 -24595 -15302 -1582 1073 -2308 -3318 -11852 -17571
4452 -17571 -16918 -12821 -15174 -11999 266 -1755 -8876 -8490 -9853 -5586 -5539 -20402 -20483 -13801 -15299 -10816
4436 -10816 -11558 -17794 -10895 -6436 654 7872 5632 7518 -1678 -5530 -10250 -12142 -4829 -5498 1407
4421A407m651M402K583K474R27p224l477j1953o953K137N511R735O768l803m178
4406f295j35K297r98j2478p358Q7P532j419J5105j50m489l097O398K504n893q074
4390a6463Q924L514N111J637m51q993R655L932Q858L950m262m703r481M054L808
4375I090o119p556J49k712n98p102P889k932L513K5025J7295j6341j4857O964
4361A1708j317r435j4027j09L542L225o676n702M952j536m738J0470Q23j4632
4347b3452l789L796L856j0656k212K4146J2615P531k747j939m258k69m67M299
4333F454P286m478p422p606r219j511P60J1525R130j439J3556L687K823K918k183
4318B4281j2807q167N822n980N326N084j8363k3534J6229K2049J4288K952L643
$$ plain form
4421 1407 -3244 1158 3741 6215 7142 -82 -3559 -15512 -22465 -20328 -14817 -5082 1686 -2117 -6295
4406 -6295 -6430 -4133 -5131 -17609 -24967 -24880 -17348 -18767 -3662 -3812 -8301 -11398 -5000 -2496 -8389 -16463
4390 -16463 -7539 -4025 1086 2723 2272 -6721 2934 6866 15724 19674 15412 10709 1228 5282 9090
4375 9090 2971 -4585 -4436 -7148 -7746 -14848 -6959 -9891 -6378 18647 35942 19601 4744 11708
4361 11708 10391 956 -13071 -13180 -9638 -6413 -13089 -18791 -13839 -15375 -20113 -9643 -8820 -23452
4347 -23452 -27241 -23445 -19589 -30245 -32457 -8311 4304 11835 9088 7149 2891 2622 2155 6454
4333 6454 13740 9262 1840 -5766 -14985 -16496 -15736 -4211 4919 3480 17036 20723 23546 26464 24281
4318 24281 11474 3307 9129 3149 8475 13559 -4804 -28338 -12109 9940 24228 27180 30823
4305C0823q962k4811p096J6920J0727n018r653K234m044j2018m91n268K795L315
4291a0547K497n421j1708Q881j67L159J0746r328j0776n203J0776J1782O669O075
4277G435o17Q407M011k1302j0103j1212R127L4974J1416K187m198M5n073j1760
4263A3337j1001m558J1639K041q989N178L291k285p796o408p269K747K533n69
4249h109P281Q240n959p142M291L137N04l844J184l802m125J2824K6394k623j2662
4234A5589j6173J7321J258k506P31Q435L940q673j6329j3005K811N558l454M210
4220b87Q198J0456O165O701j2035j5099R5J2075M25J317k20j118l391K708j9281
4205c291m023J6465p736n64k845j779M96O870j57r851M26K873L954j485J669m717
$$ plain form
4305 30823 21861 -2950 -10046 6874 17601 12583 2930 5164 1120 -10898 -11389 -16657 -13862 -10547
4291 -10547 -8050 -13471 -25179 -16298 -16465 -13306 -2560 -11888 -22664 -27867 -17091 -5309 1360 7435
4277 7435 6818 15225 19236 -2066 -12169 -23381 -14254 20720 32136 34323 30125 30170 25097 13337
4263 13337 2336 -2222 9417 11458 2469 7647 10938 8653 857 -5551 -12820 -10073 -7540 -8109
4249 -8109 -828 7412 1453 -5689 -1398 1739 2243 -1601 -417 -4219 -8344 4480 30874 28251 15589
4234 15589 -584 16737 17995 15489 16220 24655 28595 19922 3593 -9412 -6601 -1043 -4497 -287
4220 -287 7911 18367 24532 31233 19198 4099 4194 16269 16694 18011 17791 16673 13282 15990 -3291
4205 -3291 -7314 9151 1415 851 -1994 -3773 -3277 3593 3436 -6415 -5989 -3116 838 -647 1022 -3695
4189c695R762J2544P697M516R56q883l963Q101j2395j1495n089K170J4277o347
4175H156m146M411R145q243j4897L988k660J2186M346l190j8688j2876J0699m20
4161a2189r086J4843J3684q538j4433K706l58P98M035J2452J0227j047J6219r244
4147B0069j9153j6970R098J8967j360P207M149j4012l980J075j983L571n917L878
4133D639N041j1407k987N67j226j0436n766N232K0480j044j2396lj495m215M319
$$ plain form
4189 -3695 6067 18611 26308 30824 31780 22897 18934 27035 14640 3145 -1944 226 14503 8156
4175 8156 4010 8421 17566 9323 -5574 -1586 -4246 7940 12286 9096 -9592 -22468 -11769 -12189
4161 -12189 -21275 -6432 7252 -1286 -15719 -13013 -13371 -12573 -8538 3914 14141 13094 29313 20069
4147 20069 916 -16054 -6956 12011 10651 17858 22007 7995 4015 5090 3107 6678 761 4639
4133 4639 9680 -1727 -4714 -4147 -5373 -15809 -21575 -16343 4137 3093 -9303 -9306 -10801 -15016 -10697
$$ [...]
##END NTUPLES=NMR SPECTRUM
##END=
