##TITLE=Analysis number 322227
Compound Code cc 49706
Book Reference 423/88
Project Code adrs
Chemist Name bruced
##JCAMPDX= 6.0         $$ Bruker NMR JCAMP-DX V2.0
##DATA TYPE= NMR SPECTRUM
##DATA CLASS= NTUPLES
##ORIGIN= Bruker BioSpin GmbH
##OWNER= nmr
$$ XWIN-NMR		Version 3.5
$$ Mon Sep 18 11:51:12 2006 GMT Daylight Time (UT+1h)  MAYBRIDGE\nmr@NMR_250MHZ
##.OBSERVE FREQUENCY= 250.131544655141
##.OBSERVE NUCLEUS= ^1H
##.ACQUISITION MODE= SIMULTANEOUS (DQD)
##.ACQUISITION SCHEME= undefined
##.AVERAGES= 16
##.DIGITISER RES= 18
##SPECTROMETER/DATA SYSTEM= dpx250
##.PULSE SEQUENCE= zg30
##.SOLVENT NAME= CDCl3
##.SHIFT REFERENCE= (INTERNAL, CDCl3, 0, 16.522)
##AUDIT TRAIL= $$ (NUMBER, WHEN, WHO, WHERE, WHAT)
$$ ##TITLE= Audit trail, XWIN-NMR		Version 3.5
$$ ##JCAMPDX= 5.01
$$ ##ORIGIN= Bruker BioSpin GmbH
$$ ##OWNER= nmr
$$ C:\u/data/dgb/nmr/ADRS/930/pdata/1/auditp.txt
$$ ##AUDIT TRAIL=  $$ (NUMBER, WHEN, WHO, WHERE, WHAT)
(   1,<2006-09-18 11:50:45.68 +100>,<MAYBRIDGE\nmr>,<NMR_250MHZ>,
      <created by zg, POWCHK disabled, PULCHK disabled
       configuration hash MD5:
       E2 DF 36 D8 04 B2 41 60 5A D7 A3 38 5A 4B D0 FE
       data hash MD5: 64K
       14 EE 2C DF 8E 8D DE 29 26 FC 29 BA 05 6B 7B 3F>)
(   2,<2006-09-18 11:51:00.71 +100>,<MAYBRIDGE\nmr>,<NMR_250MHZ>,
      <Start of raw data processing
       ef LB = 0.3 FT_mod = 6 PKNL = 1 SI = 32K 
       data hash MD5: 32K
       D4 E6 C8 50 E1 09 A0 2E 03 73 65 3B B5 68 46 98>)
(   3,<2006-09-18 11:51:02.48 +100>,<MAYBRIDGE\nmr>,<NMR_250MHZ>,
      <apk 
       data hash MD5: 32K
       FC 03 28 B5 B0 A6 D7 41 F2 59 68 29 5C E7 B1 64>)
(   4,<2006-09-18 11:51:03.23 +100>,<MAYBRIDGE\nmr>,<NMR_250MHZ>,
      <abs ABSG = 5 
       data hash MD5: 32K
       98 A7 F1 C0 29 F7 55 80 9C 1C 02 E0 95 CA C4 BB>)
$$ ##END=
$$ 
$$ hash MD5
$$ 09 EF F6 3F DC 46 9C EC 41 5E 87 49 59 52 75 29
##$RELAX= 
##$RELAX= 
##$RELAX= 
##$RELAX= 
##$RELAX= 
##$RELAX= 
##$RELAX= 
$$ Bruker specific parameters
$$ --------------------------
##$DU= <C:\u>
##$EXPNO= 930
##$NAME= <ADRS>
##$PROCNO= 1
##$TYPE= <nmr>
##$USER= <dgb>
##$AMP= (0..31)
100 100 100 100 100 100 100 100 100 100 100 100 100 100 100 100 100 100 
100 100 100 100 100 100 100 100 100 100 100 100 100 100 
##$AQSEQ= 0
##$AQ_mod= 3
##$AUNM= <au_zg>
##$AUTOPOS= <32 >
##$BF1= 250.13
##$BF2= 250.13
##$BF3= 250.13
##$BF4= 250.13
##$BF5= 500.13
##$BF6= 500.13
##$BF7= 500.13
##$BF8= 500.13
##$BYTORDA= 1
##$CFDGTYP= 0
##$CFRGTYP= 5
##$CHEMSTR= <none>
##$CNST= (0..31)
1 1 145 1 1 1 1 1 1 1 1 1 1 1 1 1 1 1 1 1 1 1 1 1 1 1 1 1 1 1 1 1 
##$CPDPRG= <>
##$CPDPRG1= <>
##$CPDPRG2= <>
##$CPDPRG3= <>
##$CPDPRG4= <mlev>
##$CPDPRG5= <mlev>
##$CPDPRG6= <mlev>
##$CPDPRG7= <mlev>
##$CPDPRG8= <mlev>
##$CPDPRGB= <>
##$CPDPRGT= <>
##$D= (0..31)
0 1 0 0 0 0 0 0 0 0.06 0 0 0 0 0 0 0.0002 0 0 0 0 0 0 0 0 0 0 0 0 0 0 
0 
##$DATE= 1158576644
##$DBL= (0..7)
120 120 120 120 120 120 120 120 
##$DBP= (0..7)
150 150 150 150 150 150 150 150 
##$DBP07= 0
##$DBPNAM0= <>
##$DBPNAM1= <>
$$ [...]
##$SUBNAM7= <"">
##$SUBNAM8= <"">
##$SUBNAM9= <"">
##$SW= 20.6930455092707
##$SWIBOX= (0..15)
0 0 3 0 0 0 0 0 0 0 0 0 0 0 0 0 
##$SW_h= 5175.983436853
##$TD= 65536
##$TD0= 1
##$TE= 295.16
##$TE2= 300
##$TE3= 300
##$TEG= 300
##$TL= (0..7)
0 120 120 120 120 120 120 120 
##$TP= (0..7)
150 150 150 150 150 150 150 150 
##$TP07= 0
##$TPNAME0= <>
##$TPNAME1= <>
##$TPNAME2= <>
##$TPNAME3= <>
##$TPNAME4= <>
##$TPNAME5= <>
##$TPNAME6= <>
##$TPNAME7= <>
##$TPOAL= (0..7)
0.5 0.5 0.5 0.5 0.5 0.5 0.5 0.5 
##$TPOFFS= (0..7)
0 0 0 0 0 0 0 0 
##$TUNHIN= 0
##$TUNHOUT= 0
##$TUNXOUT= 0
##$USERA1= <user>
##$USERA2= <user>
##$USERA3= <user>
##$USERA4= <user>
##$USERA5= <user>
##$V9= 5
##$VALIST= <valist>
##$VCLIST= <CCCCCCCCCCCCCCC>
##$VD= 0
##$VDLIST= <DDDDDDDDDDDDDDD>
##$VPLIST= <PPPPPPPPPPPPPPP>
##$VTLIST= <TTTTTTTTTTTTTTT>
##$WBST= 1024
##$WBSW= 4
##$XGAIN= (0..3)
0 0 0 0 
##$XL= 0
##$YL= 0
##$YMAX_a= 460025
##$YMIN_a= -558980
##$ZGOPTNS= <>
##$ZL1= 120
##$ZL2= 120
##$ZL3= 120
##$ZL4= 120
##$ABSF1= 16.522
##$ABSF2= -4.171173
##$ABSG= 5
##$ABSL= 3
##$ALPHA= 0
##$AQORDER= 0
##$ASSFAC= 0
##$ASSFACI= 0
##$ASSFACX= 0
##$ASSWID= 0
##$AUNMP= <proc_1d>
##$AZFE= 0.1
##$AZFW= 0.1
##$BCFW= 0
##$BC_mod= 0
##$BYTORDP= 0
##$COROFFS= 0
##$CY= 12.5
##$DATMOD= 1
##$DC= 0
##$DFILT= <>
##$DTYPP= 0
##$F1P= 14.0000005364418
##$F2P= -0.99999901652339
##$FCOR= 0.5
##$FTSIZE= 32768
##$FT_mod= 6
##$GAMMA= 0
##$GB= 0
##$INTBC= 1
##$INTSCL= 1
##$ISEN= 128
##$LB= 0.3
##$LEV0= 0
##$LPBIN= 0
##$MAXI= 10000
##$MC2= 0
##$MEAN= 0
##$ME_mod= 0
##$MI= 0
##$NCOEF= 0
##$NC_proc= -3
##$NLEV= 6
##$NOISF1= 0
##$NOISF2= 0
##$NSP= 0
##$NTH_PI= 0
##$NZP= 0
##$OFFSET= 16.522
##$PC= 1
##$PHC0= 145.2805
##$PHC1= 6.314397
##$PH_mod= 1
##$PKNL= yes
##$PPARMOD= 0
##$PSCAL= 4
##$PSIGN= 0
##$REVERSE= no
##$SF= 250.13
##$SI= 32768
##$SIGF1= 0
##$SIGF2= 0
##$SINO= 400
##$SIOLD= 32768
##$SREGLST= <1H.CDCl3>
##$SSB= 0
##$STSI= 32768
##$STSR= 0
##$SW_p= 5175.98343685301
##$SYMM= 0
##$S_DEV= 0
##$TDeff= 65536
##$TDoff= 0
##$TI= <Analysis number 999999
Compound Code 99
Book Reference 9
Project Code 9>
##$TILT= no
##$TM1= 0
##$TM2= 0
##$TOPLEV= 0
##$USERP1= <user>
##$USERP2= <user>
##$USERP3= <user>
##$USERP4= <user>
##$USERP5= <user>
##$WDW= 1
##$XDIM= 32768
##$YMAX_p= 324528690
##$YMIN_p= -238364
$$ End of Bruker specific parameters
$$ ---------------------------------
##NTUPLES= NMR SPECTRUM
##VAR_NAME=  FREQUENCY,     SPECTRUM/REAL,   SPECTRUM/IMAG
##SYMBOL=    X,             R,               I
##VAR_TYPE=  INDEPENDENT,   DEPENDENT,       DEPENDENT
##VAR_FORM=  AFFN,          ASDF,            ASDF
##VAR_DIM=   32768,         32768,           32768
##UNITS=     HZ,            ARBITRARY UNITS, ARBITRARY UNITS
##FACTOR=    0.157963299565203, 1,           1
##FIRST=     4132.6476996994, 0,             0
##LAST=      -1043.33573715361, 0,           0
##MIN=       -1043.33573715361, -238364,     0
##MAX=       4132.6476996994, 324528690,     0
$$ Real data points
##PAGE= N=1
##DATA TABLE= (X++(R..R)), XYDATA
$$ [...]
20683 26455 26244 19374 13134 12481 24844 20870 33680 27920 9376 -10408 -23505 -13802 8817
20670 8817 30230 25913 611 -334 6679 -2055 251 2744 10333 14076 24322 13887 8346 5409
20656 5409 -1143 -445 4714 11139 20915 41283 29891 -6029 -13435 -7277 3906 13331 -8794 -17855
20642 -17855 -7687 -15232 -3154 6037 24017 46682 49695 29383 19733 15921 11222 2451 -10583
20629 -10583 -10474 -7576 -14414 -21150 1587 3150 4868 -832 -8496 9376 25695 17992 8857 19673
20615 19673 27372 19151 9863 -3200 -3726 2516 -2785 404 7391 26541 32006 10312 3087 7106
20601 7106 14909 23460 14800 20957 28323 28841 24896 33164 19908 15431 8148 1560 -17934 -12801
20587 -12801 -709 20125 35417 39236 16742 -3370 -25551 -14723 14403 19238 14183 22249
20575 22249 19129 13412 5749 21980 39894 42634 47546 50783 42224 35161 21373 25964 24988 15579
20561 15579 14401 9319 6996 8116 -5490 -26720 -25089 -20511 -3137 1791 -9514 -11897 -3608
20548 -3608 4296 17505 22791 25850 32556 35268 21922 -11829 -32504 -8598 9994 -7469 -22583
20535 -22583 -35375 -36909 -18342 -16557 -6144 -22556 -24449 -25904 -30321 -23892 1023 17335 16411
20522 16411 8828 10592 15056 7210 12091 23802 33637 16836 3593 -8693 929 -11518 -21862
20509 -21862 -18788 -12396 -12099 -31721 -8707 19117 5095 15647 20025 7121 5269 3026 -7078
20496 -7078 -4133 5377 5258 9156 5407 15867 29240 27883 17001 -12817 -7469 11023 9917 14864
20482 14864 6118 12807 6841 -5466 -23347 -29330 -11151 -13907 -28503 -18122 -12072 -18117 -11710
20469 -11710 12501 11431 -9492 -12649 15680 31165 12407 17648 8322 -15459 -32700 -31088 -23743
20456 -23743 -6656 -20215 -30662 -19103 -15540 -13537 -2740 9575 26867 30747 5687 5869 13420
20443 13420 24718 21238 18084 9183 -2857 -30939 -29051 -26186 -24632 -2748 -8936 -24132 -37916
20430 -37916 -27279 -7610 -11720 -9493 14370 16993 14386 11397 16201 11809 -6459 -14117 -20083
20417 -20083 -34339 -5781 10679 11111 24607 41667 47656 39886 7458 -11116 -16204 -19675 -17724
20404 -17724 -12095 -24552 -26006 -8341 13493 -3986 -21907 -8833 -3733 3554 4267 -17245 -15154
20391 -15154 -10270 -14188 -14460 -11686 8442 13074 8266 -7929 -7490 16043 24079 23919 19511 6341
20377 6341 -3570 2080 2661 2244 15313 -6976 -20750 -24456 -4412 5035 10214 19542 14644 20001
20363 20001 27321 35751 35985 38496 16799 10607 6935 7638 -3666 -14897 -12361 -6883 5536 6706
20349 6706 4437 10599 -5331 7576 22033 7190 -9981 -3744 1809 4491 10256 6341 -5452
20336 -5452 -13739 -24338 -20641 -9929 -26585 -23048 -20085 -23609 -20571 -18755 -2079 4322 -11012
20323 -11012 -19867 -17485 -9487 6594 4000 2795 15966 7743 -12295 1365 16505 14033 7751
20310 7751 -14830 -15486 -8869 9656 38168 40784 29434 7992 19874 34673 7989 4764 2724
20297 2724 3051 2574 4447 -11072 -1021 -4046 -1686 10831 17166 19679 -4456 -30097 -26923 -22202
20283 -22202 -21977 -27568 -10512 8566 21421 23215 26050 18309 18566 20390 8831 8366 7823 5252
20269 5252 11124 6484 -2064 -5404 7517 3624 5311 19802 26870 8325 10428 21943 21886 36811
20255 36811 32516 22889 35337 36873 23111 16262 16294 16861 18861 19422 16760 22299 27809 24046 28191
20240 28191 13111 -10425 -8063 -1108 15634 36160 31695 21834 29724 21540 14215 6908 545
20227 545 9542 20447 10870 -4214 -6484 8083 29796 30839 18882 25091 21201 21428 8548 -1254
20213 -1254 6588 16344 -1547 1869 -8052 -9693 23988 25424 20734 2542 566 -12 11742 26828
20199 26828 32313 28137 25906 8988 -10134 -2040 2584 -2690 9853 26676 5129 -10740 -19639
20186 -19639 -9532 76 12392 17974 1607 2317 9980 11144 15574 18281 23124 22237 13846 21076
20172 21076 35496 35478 16057 -3244 7377 7019 6532 5610 -5930 10918 25380 28373 21436 9044
20158 9044 -14235 -27747 -17124 -7610 -24076 -51991 -44831 -2131 14538 9314 15457 26099 32745
20145 32745 7815 9542 23973 23459 910 -15210 -7325 11047 5945 853 2775 10202 14937
20132 14937 31726 52834 41824 9677 -10279 -3079 5375 9542 11145 13397 -5241 -11486 -24279
20119 -24279 -6795 4454 -7021 -15607 -3306 14102 28940 21605 19029 19655 14948 17947 31947
20106 31947 26208 14514 15641 -4604 -14025 15147 30286 49377 31891 5249 -12334 -9922
20094 -9922 -1869 3906 30869 34527 17893 413 6774 -4379 -28845 -17704 10956 11186 5364
20081 5364 -7132 -15966 -415 11181 31226 47265 56089 55009 28576 10281 25690 15664
20069 15664 31599 52085 46398 39966 20566 3908 -10780 -26614 -18111 -9512 -10667 4200 19255
20056 19255 24944 23662 32722 38617 43692 29882 20569 17300 -8732 -35677 -32295 -6258 10344
20043 10344 4738 1886 18491 16980 15608 3440 1237 12355 17158 25937 20105 23458 36770
20030 36770 24872 14368 25286 30971 30011 36148 36593 29941 51662 29344 15748 6732 -6641
20017 -6641 5862 26109 25654 23025 26604 35156 31296 37506 27531 23055 13038 17146 29288 31353
20003 31353 6339 22996 27568 35242 41926 49336 44909 32532 33324 37048 27725 19415 23574 35007
19989 35007 45429 52585 50475 36152 30206 22760 24231 28015 30876 34533 13202 13260 23820 39729
19975 39729 26153 17064 15969 26869 38256 36170 24930 12516 2288 630 3061 10172 26112
19962 26112 29923 9830 2899 2843 -3917 4175 6689 -4037 1894 28751 12575 -45 -5194 -15249
19948 -15249 -21695 -3161 21376 32581 21912 9698 6423 15274 16981 8900 -9063 -4228 14549
19935 14549 20965 18459 9214 2919 9276 12970 34954 46362 40500 34181 17280 5050 8029
19922 8029 40108 35971 32358 30575 4231 9140 26704 32996 33412 6960 -1723 6025 -5552 -7226
19908 -7226 8163 5151 16747 30592 33415 22546 35922 51011 40982 33366 31467 44160 62907
19895 62907 49945 29783 31333 31395 17094 19574 39693 41288 43102 44212 39443 23199 6152
19882 6152 -783 -7942 -3239 -4128 -4507 287 20341 21278 27809 36090 18201 10988 11472 21089 23521
19867 23521 21046 15867 13342 23084 28895 18069 10896 18127 39024 40690 42271 48613 43551 23713
19853 23713 34707 31732 27293 10109 16222 45550 53848 38197 25058 39186 51144 58108 63106
19840 63106 44087 41550 50310 35297 26530 19521 17259 7122 -3204 8880 30325 27301 15844
19827 15844 38356 28822 26069 23574 16330 18125 32893 30585 27035 20605 15219 8517 10666 20609
19813 20609 45860 60678 54315 56086 46574 55890 46703 36037 31473 9811 12366 20954 39289
19800 39289 36314 26607 14129 16950 29112 26780 14317 15804 20144 25165 41903 44064 36358
19787 36358 25503 33076 56128 74913 73278 76175 67485 44461 30227 40719 53503 48434 48926
19774 48926 60019 56631 52258 49051 52093 22059 9645 14016 22909 18212 22144 26547 18861 41900
19760 41900 67197 68166 49552 50767 61433 64615 54915 49817 59661 83101 97472 75123 65040
19747 65040 67983 61391 52126 54883 69581 77085 69332 64770 56999 60373 71303 59091 30856
19734 30856 13896 25508 36930 48466 56346 67806 61363 68077 64738 54666 58147 54105 65331
19721 65331 59199 54018 54037 36838 36730 42334 37581 5542 -16393 9169 21586 23943 26548 35402
19707 35402 25438 20825 15638 15556 13906 21755 47058 84643 81620 48324 30083 18585 16232 8841
19693 8841 18493 24887 27512 27954 45490 26716 25429 23124 2459 6700 21087 13996 7397 22309
19679 22309 16429 13834 37750 48818 54126 65026 47944 40361 31086 23191 45293 54025 41428
19666 41428 44940 41297 25087 17755 30314 45351 47927 48909 66549 68236 54634 44531 54056
19653 54056 68661 63353 61450 61802 68329 63704 36392 43865 61495 55000 47749 37098 21500
19640 21500 -2176 -6078 1482 24569 27640 16402 14865 12934 18624 17533 22779 36846 36376 22827
19626 22827 37641 54252 63086 59372 56641 70192 86665 101728 98013 85293 70779 57149
19614 57149 67991 61108 54108 38352 51541 61485 45403 39680 37132 56227 58340 70032 74547
19601 74547 80543 70963 84060 102041 96811 87852 92598 98425 101757 95932 85452 91227 82292 65113
19587 65113 68361 93995 108853 127637 136634 133065 99668 69993 66192 71679 87663 95278 102390
19574 102390 109686 114142 94422 86529 77289 85850 82443 65994 68419 68121 58200 66835 64581 55169
19560 55169 71735 78169 81050 79860 82924 101438 111001 116736 122142 122209 135388 156175 189344 196944
19546 196944 196631 227366 258051 268051 265767 273984 272116 281255 298335 332067 411293 512006
19534 512006 610647 721705 871484 1059789 1236387 1306731 1241705 1244291 1329583 1399605 1368357
19523 1368357 1366015 1430294 1483314 1356600 1180346 1071441 1030966 997487 946626 884102 857346
19512 857346 812636 752323 689353 585709 496039 447432 412610 407509 399865 403755 382878 357295
19500 357295 361699 391533 430846 478501 528885 578747 658290 696262 728794 772782 827124 853740
19488 853740 840328 848910 891014 952239 1012693 1137473 1329646 1566171 1768919 1891821 1984124
19477 1984124 2052085 2010993 1794962 1557744 1469285 1480296 1523615 1577175 1681252 1789866
19467 1789866 1806841 1599993 1360477 1177828 1055727 946902 834475 751831 689293 652685
19457 652685 607221 572194 525971 491022 489900 493026 502904 480926 483417 492004 509687 516407 510287
19444 510287 528809 529188 512381 504415 498683 493201 491324 504869 540422 569983 600581 646689 675046
19431 675046 674060 646942 624697 611777 575001 522952 495785 499709 528846 547288 572335 578487
19419 578487 601991 632322 634387 624582 582313 530785 543074 551646 578494 585151 574793 569920
19407 569920 547287 501868 455163 414492 390628 369813 339781 315844 325894 311081 292128
19396 292128 266999 254473 246587 224006 206199 201420 195646 193671 190174 170394 167371 187205 211679
19383 211679 206235 188089 198399 201790 208275 208083 204246 211062 221630 221768 211363 238329 243829
19370 243829 237981 250825 272058 305022 323891 322915 320193 315465 317179 291910 283920 284015 270514
19357 270514 252256 263696 283584 290439 298835 291817 255417 229921 214564 169922 149261 149078
19345 149078 143374 138030 117465 113090 121892 118834 100592 106410 120941 135309 136366 131211 113494
19332 113494 99819 100577 105213 116644 131259 135949 120879 116624 108688 89976 80478 82237 92867
19319 92867 112632 120113 98144 101184 126747 132665 132222 134505 131232 138603 161791 155085 138506
19306 138506 135893 138583 135635 140588 152364 136850 130551 116513 103450 87492 103317 120461
19294 120461 130879 127857 98413 92235 97271 107524 101460 99804 86337 77901 66484 52137 24989
19281 24989 25245 40934 49727 37811 17777 28156 56834 78938 93601 77640 61411 60777 64767
19268 64767 55434 58604 62217 73413 91300 101042 93414 79755 70710 84611 102058 96282 76316
19255 76316 70623 88204 107268 108381 108662 112575 111934 124475 119532 112280 121673 118505 115414 118330
19241 118330 126659 97218 89510 67212 44111 61482 75646 67222 56058 52428 39027 28825
19229 28825 17995 5319 21760 47391 46591 45889 53442 59278 78980 84006 75217 61056 48606
19216 48606 55365 70831 90038 88560 99006 123721 150830 156804 155974 148381 140227 143110 131416
19203 131416 119476 125754 109704 108165 102725 95865 107315 129174 139055 140909 144982 151303 152820
19190 152820 157032 147878 150356 149847 132899 123335 138133 135982 122036 121138 123283 124959 128923 136558
19176 136558 142165 157280 145072 151007 164114 168135 177109 179768 168883 158923 154242 152086 145552
19163 145552 154442 166369 164705 164524 170508 178854 181295 176121 193383 210205 215393 218426 210092 211005
19149 211005 213352 184463 196219 204901 210548 206014 197879 208113 214195 204180 204883 186994 175241
19136 175241 202508 222109 229294 212051 206800 200493 206908 209151 211477 224369 235957 246347 269216
19123 269216 282672 278599 286027 309836 305567 315715 336436 347611 351526 341169 344509 361613
19111 361613 370643 367839 363044 369230 385061 400784 410865 401730 376327 324706 295181 305199
19099 305199 290463 261438 248910 253500 242971 237579 236026 246330 252183 249004 261538 253662 249685
19086 249685 265819 278058 282280 277989 287360 286498 310979 354790 375313 372629 359128 388663 418617
19073 418617 409877 400844 402137 420829 449323 441408 457926 474489 480233 503631 508268 493842 489685
19060 489685 497038 500267 510716 511834 508165 510567 514272 502429 471324 446129 432471 412918 397724
19047 397724 392193 381115 368062 367555 351684 351084 357867 364238 380645 398157 404787 437560 451749
19034 451749 440557 452477 494172 524982 554945 570193 595644 627217 657074 697605 726034
19023 726034 733893 756010 796088 842741 893174 945185 972837 1009285 1063698 1140322 1240149 1334511
19011 1334511 1471426 1616987 1740160 1871312 2016464 2163191 2301603 2445530 2650079
19002 2650079 2888794 3160272 3494402 3890276 4340917 4930170 5691679 6792792 8430571
18993 8430571 10583431 13213848 16457369 20788455 26624925 33309413 39166484 43541911
18985 43541911 47862233 53518464 58077759 56856738 51990087 50175248 52731676 57659183
18977 57659183 64007810 72008836 79474928 80716400 73899529 64637631 55972676 47788189
18969 47788189 40093402 34127469 30612524 28997221 28340798 28110627 28318060 28553558 27648217
18960 27648217 24893946 21565131 18898464 17075050 15822770 14949131 14352473 13938441
18952 13938441 13697856 13581848 13652855 13953686 14555779 15592592 17178213 19396732 22165126
18943 22165126 25353767 29209492 33914866 38618004 42004931 44352501 47028447 50187085
18935 50187085 53687731 57965049 62217343 66210709 71780919 80366079 89159203 91391272
18927 91391272 87129885 84100802 84038743 83042203 79714093 76689527 73940738 66594430
18919 66594430 54262757 43027944 35420297 30604297 27510350 25491040 24153338 23223978
18911 23223978 22557893 22134556 21730636 20704297 18875143 16999734 15503882 14382050
18903 14382050 13505574 12804444 12219768 11702029 11218964 10787818 10399210 10030022 9659115
18894 9659115 9281437 8907182 8555976 8226734 7927339 7614063 7316194 7066288 6852597
18885 6852597 6637814 6424620 6238445 6068917 5901897 5720778 5531663 5370618 5239222
18876 5239222 5094144 4954234 4812595 4678819 4554820 4441244 4304881 4170938 4062231
18867 4062231 3954435 3844495 3765595 3682083 3599720 3524331 3423420 3318369 3218828 3123245
18857 3123245 3019538 2927895 2862728 2804498 2746315 2711003 2661377 2622117 2585435 2540125 2499813
18846 2499813 2457316 2394037 2288154 2192913 2127705 2067177 2054771 2037700 2008978 1995133 1955191
18835 1955191 1889374 1807214 1759230 1710216 1664473 1628658 1593241 1550251 1504904 1465362 1419740
18824 1419740 1379419 1337703 1320364 1288354 1254423 1240936 1210240 1196268 1191752 1172048 1128376
18813 1128376 1096342 1068208 1050855 1027365 988724 969813 968210 971008 962907 956856 933963 908750
18801 908750 880413 856495 857881 855430 837584 802860 795842 803396 816888 830099 856130 876691
18789 876691 865409 798132 727653 692185 673654 669422 654518 661735 644704 602815 537369 496004
18777 496004 463625 464821 462444 458370 440983 427927 448606 463989 495348 515797 523643 521738
18765 521738 499404 447520 452680 477842 509923 527254 528864 542549 551697 567979 544791 517598
18753 517598 535124 598682 666707 733452 803918 913530 1034209 1147256 1230714 1265048 1268673
18742 1268673 1254135 1198865 1111405 1004859 928377 843323 767572 731280 735130 755326 765193
18731 765193 772661 775095 769844 738889 663738 601894 569410 546817 530174 512616 488947 485235
18719 485235 477115 456103 471440 483571 467155 451520 468861 475539 507404 542712 583959 615474
18707 615474 660887 705804 748354 782859 788703 750421 748476 789945 864443 929896 991733 1043744
18695 1043744 1058054 959189 835407 792189 804133 835467 829626 810151 788106 758707 684830
18684 684830 624054 601101 609366 620713 605015 582997 593091 580468 586463 578137 565439 549186
18672 549186 524931 519891 514951 510480 510699 530164 506766 471048 458991 448657 437011 428911 413876
18659 413876 401719 367262 365148 369673 345090 327547 298482 275011 259605 253960 261724 247587
18647 247587 244753 237990 234607 228371 235684 248783 249937 270394 283561 297814 301094 305199 316306
18634 316306 340690 377599 395939 397040 418663 434924 433052 424468 439077 459251 496357 513063
18622 513063 525062 547990 573380 555646 518684 469660 425757 403999 379067 351219 334785
18611 334785 334180 348390 343589 357119 358278 357338 336801 329837 312788 310913 295615 285340 271655
18598 271655 259493 258014 275853 284238 287877 309486 315639 301562 289331 260497 247989 256345
18586 256345 298602 308174 328151 351018 360461 371687 391420 414037 418529 442687 459489 479578
18574 479578 490772 510990 501675 482871 497812 509384 523030 560990 592526 614122 623478 664988
18562 664988 748428 844589 947950 1090614 1262323 1408432 1453096 1482381 1540278 1540527 1439671
18551 1439671 1325318 1256571 1172990 1090023 1037048 1024368 1010524 997826 918061 830702 779485
18540 779485 728983 685887 647370 631879 611549 585885 566412 562768 563826 572161 589997 607756
18528 607756 607728 584722 597004 624629 637178 659710 704125 736036 781621 844258 930983 1033648
18516 1033648 1121937 1185309 1286756 1418448 1517643 1544073 1591028 1739009 1906087 2061875
18506 2061875 2213556 2322165 2310639 2163382 1960802 1805357 1691716 1549207 1439330 1364246
18496 1364246 1316637 1269460 1212003 1129271 1064337 999754 940029 900036 890846 878108 892776
18485 892776 927365 935817 934642 927606 933810 948687 974253 1000117 1033079 1049765 1081847 1127960
18473 1127960 1158541 1173408 1176400 1216555 1248507 1247129 1202907 1181230 1198337 1238944 1292152 1343829
18461 1343829 1400828 1440312 1479878 1489603 1459830 1360976 1263529 1220192 1209832 1183562 1133407
18450 1133407 1055240 985681 976650 963741 950358 927051 898445 891785 877158 872252 884221 914281
18438 914281 947873 989393 1057937 1126987 1179175 1245307 1303545 1324346 1360808 1412211 1461464
18427 1461464 1518832 1594449 1653576 1698511 1764379 1861161 1945681 2004434 2075486 2098641 2106040
18416 2106040 2120350 2162164 2240192 2339511 2435445 2535624 2654113 2824986 3112454 3515024
18406 3515024 4100973 4951742 6115369 7486100 8960860 10837775 13422802 16434848
18398 16434848 18840860 20642518 22905863 26609821 31615555 35627628 36785698 37410467
18390 37410467 39274809 42217390 43855364 40488479 34245253 27807788 22905718 20194485
18382 20194485 19127631 18902645 18968868 19283058 19912996 20177619 18681567 15826133 13439465
18373 13439465 11886865 10886810 10193336 9679036 9340584 9117740 8969071 8907900 8907887 8997885
18363 8997885 9209743 9586987 10248446 11310481 12764639 14441103 16391854 18947689 22005678
18354 22005678 24775388 26849522 29859272 34695492 40173426 45243033 51875780 61798424
18346 61798424 73107187 81094519 85322464 90005915 94164735 92590766 84901292 74975067
18338 74975067 65361105 58755860 55378366 54250135 54941950 55526752 52225717 45160608
18330 45160608 38144430 33135564 29423670 25847780 22742052 20460850 18748690 17414196
18322 17414196 16394015 15602173 14972570 14463801 14046082 13678719 13324581 13015156 12779236
18313 12779236 12621157 12607180 12803653 13264233 14125712 15549231 17589772 20017838 22423678
18304 22423678 24851515 27783014 30876290 32551673 32547780 33344819 36085678 40846892 46848628
18295 46848628 52694082 57117501 60745993 62039315 59099550 53871366 49635805 44513966
18287 44513966 36684508 29768061 25393510 22808503 21141442 19913683 19121514 18587576
18279 18587576 17642048 15808324 13908374 12499075 11492658 10728991 10143123 9677132 9293291
18270 9293291 8931339 8573606 8229697 7909037 7600892 7288381 7011851 6749817 6482033
18261 6482033 6235025 5988723 5742057 5531294 5336646 5151666 4976862 4813017 4627052
18252 4627052 4480087 4341356 4206489 4087236 3976700 3857332 3755712 3679463 3610638 3514471
18242 3514471 3402553 3353506 3299500 3250677 3179126 3084567 3022841 2971638 2885512 2814199 2736378
18231 2736378 2653624 2582001 2496102 2423519 2371501 2300534 2252483 2228045 2205016 2160193 2097888
18220 2097888 2022057 1967364 1921982 1866085 1826939 1766674 1702882 1643277 1574582 1536964 1502093
18209 1502093 1476458 1455831 1418488 1387766 1368431 1363362 1340804 1308047 1286707 1253957 1238589
18198 1238589 1249911 1267909 1263778 1245852 1230180 1237527 1253629 1275087 1305470 1358935 1401546 1420582
18186 1420582 1451726 1499351 1545381 1588007 1636711 1684432 1761392 1846263 1942000 2034380 2129829
18175 2129829 2200273 2294954 2456675 2690616 3047430 3569687 4318188 5421572 7017244
18166 7017244 9074490 11272879 13367604 15617830 18212282 20319071 20798273 20686131
18158 20686131 21822398 24138180 26677990 29383829 32688978 35233909 33961496 29189700
18150 29189700 24923358 22703975 21747594 21476711 21857520 22282962 21155362 17883537 14379773
18141 14379773 11831310 10142499 9007045 8181114 7591240 7170745 6866856 6664507 6532083
18132 6532083 6452464 6438044 6454666 6547071 6696919 6973447 7529408 8473369 9809957 11314896
18122 11314896 12788086 14326698 16093296 17667942 18093653 17612634 17842086 19825222
18114 19825222 23905119 29919492 36992994 44247552 51897684 59811099 65823333 65138473
18106 65138473 59166433 52997478 46742182 40263252 33352654 27169816 22839889 20286733
18098 20286733 18971827 18398522 18103630 17964724 18040216 18006904 17087398 15081646 12965416
18089 12965416 11361067 10257259 9496442 8917705 8464694 8107700 7793736 7535082 7296429
18080 7296429 7082971 6899717 6777766 6735631 6783742 6974362 7377007 8028107 8867051 9730976
18070 9730976 10550600 11517681 12628445 13284360 13116527 13019810 13594218 14527465 15500257
18061 15500257 16731830 18121674 18524377 16885381 14517177 12919567 12107655 11696650
18053 11696650 11616758 11706525 11433407 10225203 8567439 7213775 6295312 5649050 5188331
18044 5188331 4835768 4559219 4311717 4099832 3935779 3774583 3654141 3520376 3376095
18035 3376095 3254324 3142974 3034606 2914876 2789205 2699185 2618418 2528623 2437955 2332932
18025 2332932 2238930 2153637 2048623 1956639 1893626 1832430 1778174 1709588 1647792 1583469 1518265
18014 1518265 1468206 1437792 1397906 1359132 1342995 1326934 1279492 1245840 1225559 1211616 1181367
18003 1181367 1152995 1152824 1141756 1106159 1076075 1066851 1056327 1041055 1025874 1011248 982949 954465
17991 954465 925040 891156 871198 864044 846867 814678 780004 757365 731042 688662 651798 600524
17979 600524 538961 499242 484278 465825 468553 436242 412748 413055 409121 400894 401674 377365 350305
17966 350305 334484 319552 317005 322453 328845 313217 300446 295294 300263 288263 289928 293278 284924
17953 284924 271636 257097 249398 244566 269114 282157 274784 264081 256850 226435 198806 199098 219512
17940 219512 234907 228839 211171 216918 224499 217147 195672 181478 172214 157118 149302 154788 161633
17927 161633 141989 133082 125143 125345 140259 139874 146992 160050 133744 121453 133885 159732 151551
17914 151551 142712 143998 147389 146954 141205 141889 147225 161125 160456 145239 149807 147731 132678 122658
17900 122658 121843 132059 131435 155194 165622 150256 134501 137697 124102 121639 154544 185287 205952
17887 205952 217269 221879 220315 220309 237852 256681 278577 315918 356810 380064 401669 395144 363226
17874 363226 360246 353777 318796 270796 228416 198045 176994 190696 207649 199023 192922 203675
17862 203675 195158 210473 201510 206298 191683 182694 184332 174140 162343 151699 152312 154171 153936
17849 153936 134878 125512 136056 148641 145268 154032 166851 180621 203699 231815 269754 317168
17837 317168 344628 377640 414481 412592 396080 400173 418083 438243 446013 429908 396682 366671
17825 366671 354428 320771 305164 313521 315779 318488 324846 277514 227351 197960 183878 162939
17813 162939 148771 156792 174860 172850 147017 132219 123065 132840 132158 141002 157187 161474 184743
17800 184743 179059 137782 115137 114803 134497 127006 119774 121432 130656 109817 133730 179123 193237
17787 193237 192695 212558 211340 188162 180813 182704 197552 179408 164958 147504 142699 150244 153854
17774 153854 170455 195041 203332 174442 138334 121425 98689 94597 107009 102712 101020 97105
17762 97105 88872 65449 52115 57386 58595 52537 54656 48184 43746 44739 46526 41656 29239 11798
17748 11798 20180 36733 46278 48848 38441 23266 8049 -2315 -11917 -668 20929 17240 23030
17735 23030 16385 13046 4325 12145 -6393 3249 -7006 -3783 5021 11266 6335 -7671 -229 11228
17721 11228 16409 20439 16548 11090 22607 15674 -5658 7938 11832 6677 -3355 -5073 27606
17708 27606 47236 30351 3991 -12298 8254 17418 23995 34637 29977 11454 2858 9241 9972
17695 9972 899 11302 9962 -1488 1983 -20162 -30879 -33001 -45293 -29211 6702 8219 26678
17682 26678 19957 -1081 -13970 -15932 -14068 -25064 -27064 3968 15791 22448 24742 -1607 -22715
17669 -22715 -16287 -24039 -3181 474 8913 2386 -8304 -15821 -19367 -20783 3045 31878 51333
17656 51333 54584 60502 52508 60388 85751 91566 94649 95399 119461 136209 125151 109714 88119
17643 88119 91186 83911 80346 62194 55511 66064 54506 44007 42618 31009 24959 20410 4483
17630 4483 -4805 131 -1694 1185 -2650 768 -1851 3963 -8631 -5387 8059 20799 12737 2361
17616 2361 9799 20215 38483 54099 53674 68616 91398 119728 123559 135230 154780 163876 177259
17603 177259 189074 214106 217066 222645 241136 272226 253548 211967 191161 192628 187829 170463
17591 170463 145348 145288 142906 126811 109551 87037 80700 74314 80906 74399 54549 24963 3276
17578 3276 -8469 -8700 20385 23077 24734 25965 37202 41919 32257 35362 49576 33118 33633 24739
17564 24739 47385 68798 68005 70442 68520 78674 76861 63259 41979 27019 46110 90866 115877
17551 115877 99043 84574 76610 87208 69236 57382 50055 57600 50405 36608 37714 27239
17539 27239 25421 20105 18952 11137 -760 -4378 10378 4436 -1329 -9054 -20001 -13292 -12763 -2209
17525 -2209 22575 23046 27970 32116 7285 12889 21926 20865 13881 -4398 7517 3086 12544 16175
17511 16175 14677 3067 -14129 -17922 -23820 -33342 -22244 -10490 -2556 -1681 3560 11971 20803 1118
17497 1118 -14107 -3232 -15182 -20906 -31290 -33195 -27428 -28123 -29630 -28623 -18912 -17709 -25867 -21588
17483 -21588 -24500 -13126 -17166 -28529 -12010 -9536 -31315 -40781 -35051 -33504 -38055 -41080 -21474
17470 -21474 -21308 -11641 -1378 -9721 -11708 -15987 -439 7222 -237 -8057 -10285 -1077 8766 747
17456 747 -12723 -29515 -31511 -39077 -38149 -17424 -8679 16834 14548 34147 47362 51709 46099 57436
17442 57436 65263 72959 64569 36007 -4205 -9897 -3536 -13851 -22692 -16997 -662 4416 -6327
17429 -6327 -8623 3713 29562 23830 15690 12463 19809 14445 12097 4962 -4849 -2657 7139 15730
17415 15730 30234 16477 -2108 -2287 -17661 -15984 -9842 -22046 -27142 -619 7621 3258 -6827
17402 -6827 -6715 -15268 -18750 941 17980 6034 9057 12264 -4459 -14153 -1372 480 12977
17389 12977 25552 30540 25353 7737 8216 5126 6436 -1098 -4257 -4636 -3874 -8186 -1788 7821 17004
17374 17004 10422 4918 11312 16033 29213 24671 11423 -15780 -10205 4778 159 -24570 -19774
17361 -19774 -6042 11734 9568 793 11513 18397 5401 -15648 -27804 -30209 -28649 -19782 2072
17348 2072 71 -11630 -25151 -22881 -30491 -26571 -11428 3241 13045 1526 -19789 -27699 -9600
17335 -9600 934 -3699 -5160 -4352 18315 17143 8231 5771 29639 31624 12722 2396 -2373 -33080
17321 -33080 -27938 -15905 -9643 6973 6291 -2333 -6327 -22237 -30448 -1827 -1008 -14835 -20995 -17752
17307 -17752 -15553 -4014 -24701 -23122 -15562 -9607 9421 16213 2009 -9160 -6869 -11426 -3630
17294 -3630 -12794 -8942 2409 -4501 -1694 -6044 18215 22493 3002 -1070 4371 -10355 -9412 12730
17280 12730 16959 12112 15592 -3231 -11620 -21697 -13362 11111 15963 13345 13111 30105 30334 22396
17266 22396 37798 31580 18071 23362 15597 11096 11317 19828 24600 20590 16645 12451 14960 9617
17252 9617 -3142 -3995 -7204 -14769 -28089 -26316 -18511 -19568 -19228 -6139 -15084 -39011 -23664 -17267
17238 -17267 -33913 -32904 -15544 -14018 1032 10368 23639 13726 5104 -5581 1868 2400 4370
17225 4370 4384 2448 -2274 2428 3819 -8173 -5472 5663 295 -16130 -20920 -19428 -5235 -6518
17211 -6518 19046 42171 30046 4084 -6532 -7954 8692 12909 13308 23246 31592 12424 13457
17198 13457 16719 7984 12938 11585 20286 11846 1809 -14686 -15111 -23453 -30328 -27588 -27997 -13253
17184 -13253 -4580 -8673 -24439 -20775 -30606 -22978 -22886 7516 20090 5496 1815 -16037 -15336 -19269
17170 -19269 -34408 -34635 -14058 4251 12023 -2094 -9636 3117 476 -4606 -20251 -13392 13355
17157 13355 30492 23127 19891 30657 43183 46010 45133 33539 22812 10191 1213 -2468 2964
17144 2964 21320 25071 25337 33483 35990 24225 8181 -3550 -8260 12487 16886 17044 11966 -2668
17130 -2668 2884 1416 -14575 -11928 -25289 -28470 3844 13323 14547 15465 10455 9928 8546 -584
17116 -584 -19906 -6152 -2679 13742 18524 -3230 -9380 -17630 -23698 -11566 -1490 7802 7714 9794
17102 9794 18751 804 5923 32632 34465 29549 25796 14441 6305 5171 16844 20409 22041 33526
17088 33526 39435 37850 30036 16678 22500 23652 12768 1202 -11790 -7903 5200 -1880 -13906
17075 -13906 -7798 1783 -4233 10572 41181 49189 49185 32142 27371 30940 25745 46708 75256 69459
17061 69459 66569 78005 88733 73967 64884 56707 38086 25017 16981 -5788 -15340 4255 26796
17048 26796 32160 13293 21049 30748 11328 -9543 1545 21255 25773 8015 5725 -913 -15296
17035 -15296 -7265 -19937 -12738 1537 15599 15677 16043 14705 -2265 -16435 -13046 6538 27214
17022 27214 28291 22376 10666 -4107 -1674 -1373 -10794 -17813 -23135 -32842 -47286 -40211 -18770 -8231
17008 -8231 -6553 -12153 -20182 -9959 -10380 -2227 -3663 7137 2317 -3431 6912 12052 15093 14518
16994 14518 22401 36461 29531 22651 24329 12755 20694 24001 23014 17410 14689 -106 -8079 -20071
16980 -20071 -30278 -39780 -45348 -51970 -47467 -45274 -38418 -34481 -13363 7665 13185 13044 30074 47895
16966 47895 46801 45433 36137 23567 14832 11386 21039 11764 16885 5384 16673 40098 37119
16953 37119 34710 46981 43634 36509 29074 7744 3472 12753 9735 -4645 -5773 -5393 -25486 -29895
16939 -29895 -8445 3235 6926 12138 22058 17349 -1737 5301 36692 41310 25908 15183 9318
16926 9318 -4142 25694 30077 17450 11342 -2794 -124 11112 12459 -6480 -15024 6386 3894
16913 3894 22104 14922 -13369 -15676 -14314 3230 11471 7096 5599 12406 8348 15493 8546 -11566
16899 -11566 -10674 -2495 -3748 -17216 -16120 9336 16312 12351 4183 -6702 -6690 6172 3076 -3481
16885 -3481 2365 10750 7110 8712 -3044 -13062 17624 32071 16677 10334 7860 9582 -759
16872 -759 -8014 6103 24705 24273 -603 -9183 23178 28456 10059 -211 7480 8212 14556 10416
16858 10416 11084 1082 -5757 -12142 -12874 -7081 3604 4528 10344 38949 24846 14934 8411 10678
16844 10678 14102 -3119 -3086 -3771 -8135 9884 -4314 -10373 -9472 7855 13699 21619 -4642 -7680
16830 -7680 -4810 7219 18149 13533 7078 10536 2977 -4360 12070 12672 7692 14390 14982 8299
16816 8299 -1454 -2513 -9255 -6228 4086 -2129 1869 21409 21518 14407 28339 24664 38044 34251
16802 34251 14151 2741 1446 -13149 -10185 2487 17038 26700 25394 25647 24012 36955 26281
16789 26281 19396 14849 293 -2171 8686 19070 30678 42330 44925 38141 31219 15171 -5581
16776 -5581 -17827 -14201 -3509 15023 31599 34288 29015 18997 23736 20309 23925 23496 13111
16763 13111 11946 3579 4899 2240 -9061 -2187 7512 30625 30013 27344 6050 14010 12085 320
16749 320 -2100 -2669 9816 2732 7711 19756 30915 42557 18146 974 -9339 -5534 -20421
16736 -20421 -15985 -13972 -14435 -2418 12562 34158 42352 39103 11947 4770 26464 -822 -5930
16723 -5930 -1621 -674 28503 61965 77582 112663 136768 173702 209961 235502 268000 305148
16711 305148 351454 397874 442559 479064 504268 494793 469775 462718 475943 497890 494480 435354
16699 435354 373393 343367 305011 271414 246286 225010 206952 193325 166865 131599 106465
16688 106465 98112 97251 89305 67398 62379 52431 46581 56107 60578 52690 36402 37480 37549 29717
16674 29717 25837 28710 24480 26447 34587 50765 60482 54327 48310 54378 30676 17189 18311 34948
16660 34948 36279 26346 14464 21551 34972 30262 43710 44359 31799 21193 32512 45600 38937
16647 38937 38885 42260 51887 53814 43884 17364 -4778 -5882 7283 20482 23132 7772 8039 20959
16633 20959 20843 15086 42055 26069 13630 24136 25103 51775 69797 70364 45456 51552 47106
16620 47106 41188 34410 25752 26736 30735 45288 54910 47886 44786 34093 31915 29518 10652 16632
16606 16632 13419 -1906 -14864 -24362 -23777 -2009 18278 20890 17356 23912 21835 340 -966
16593 -966 20390 9063 228 -9828 -4768 9694 6338 9254 11020 -2271 -5525 -13457 -12559 115
16579 115 15719 13560 10679 2470 -11854 -707 2840 -10690 -7732 -5373 -2070 -1899 -15385 -15423
16565 -15423 -16150 -18431 -11150 -20684 -15668 900 16545 34018 22104 19198 17985 20356 25509 22747
16551 22747 26109 22816 17224 11129 20469 36856 52918 48630 34896 13411 -1746 -13347 -6697
16538 -6697 15758 35993 29776 42206 44298 41597 61953 58765 32541 27811 16451 17521 30116
16525 30116 27440 17562 21274 16134 34278 39430 24199 49224 80831 59798 24969 5448 -1724
16512 -1724 -3172 22066 28573 29636 36873 48102 45414 46526 47386 60962 73143 67567 50792 32534
16498 32534 28418 33387 35326 43466 46239 51604 51538 62671 48654 43552 47676 48429 34257 15847
16484 15847 11108 24061 40970 63601 77669 78803 92802 110003 101955 89002 75223 79604
16472 79604 86666 83420 75571 56649 53082 51427 63002 54431 30202 20829 22976 24395 10865
16459 10865 -416 -4237 -9909 -25634 -45291 -37565 -31131 -17828 -15595 -31647 -49113 -43016 -24880
16446 -24880 -27540 -35029 -31362 -35306 -34557 -9256 10520 1169 -2550 -3043 -5109 -12073 -13068 -11779 -7483
16431 -7483 11228 36714 41175 32506 35108 31506 32686 38564 23307 8914 7381 3041 22648
16418 22648 51533 36557 19671 37068 37184 29126 33227 43111 25307 39457 35019 34942 37366 46115
16404 46115 72264 87694 62859 62422 57569 43603 40029 43756 32833 43029 62881 75605 82209
16391 82209 45843 18086 26306 37968 50846 70099 60670 58765 61702 41827 32351 23644 30871
16378 30871 52462 62180 48909 64809 66019 72450 67590 68294 47426 48639 71947 60432 28240
16365 28240 25956 29146 22739 36649 57071 59601 47484 55792 43460 36594 29760 22625 21137
16352 21137 16162 12860 17361 22156 9448 15486 4116 16051 29479 21023 27538 30064 10886
16339 10886 -5914 -10348 7540 49356 66374 67598 58095 42531 37395 52298 48599 52853 74918
16326 74918 64602 33632 32864 41777 64311 102262 96632 84480 88085 86019 79186 76634 93096
16313 93096 106312 112748 111729 98161 94274 99176 105500 103178 105995 107132 102452 115034 122770 110300
16299 110300 122806 129399 144500 162454 178421 166764 151981 162521 196376 230621 239227 235755
16287 235755 230758 243907 252261 262745 268264 260495 265766 240938 221098 216032 206830 207654 168445
16274 168445 123482 110076 125256 128694 116528 88203 54209 33442 33244 56784 61246 65225
16262 65225 73432 69109 68584 64712 87135 98621 106191 103630 122492 128189 117335 119902 145270
16249 145270 157707 162038 159922 146985 144478 155290 161018 160829 155996 154955 149883 139270 126964
16236 126964 123807 147140 168272 169999 162324 169829 171796 170962 140326 144638 156539 170679 183503
16223 183503 188120 200863 200491 202392 211660 192257 188612 192576 212166 215497 197983 200843 217603
16210 217603 214987 226554 244046 244867 267246 267325 290213 294738 317498 346658 383859 415486 466130
16197 466130 482141 504674 519119 541232 574653 609075 678811 723617 758985 796309 877004
16186 877004 953263 1023629 1122437 1227391 1335124 1466876 1599052 1752427 1931911 2139323
16176 2139323 2314745 2485493 2703815 3014650 3414396 3914280 4503904 5157029 6053999
16167 6053999 7467357 9669456 12796911 16577961 20484698 24749809 30345423 37427778
16159 37427778 44387379 50197622 55665342 60981937 68696707 79591637 88039822 84497032
16151 84497032 78138542 75155685 75605776 80277067 85523182 80684953 66110001 54824180
16143 54824180 48089172 44460243 42333319 39046328 32961996 26911379 22569748 19557923
16135 19557923 17388390 15781494 14517319 13516255 12684253 11961923 11281459 10675702 10190540
16126 10190540 9796548 9430416 9024289 8610713 8236653 7899024 7646289 7418966 7121893
16117 7121893 6799154 6484341 6196935 5939860 5706755 5503161 5271983 5047337 4840616
16108 4840616 4668792 4535392 4384698 4235394 4102531 3976748 3856028 3748639 3636230
16099 3636230 3554522 3457454 3349964 3254842 3176098 3073688 2979392 2898890 2838233 2783355 2706265
16088 2706265 2608463 2518138 2455381 2407269 2349636 2274688 2211492 2151370 2085495 2015950 1971989
16077 1971989 1918391 1865939 1817407 1778324 1761851 1707717 1665735 1622904 1555245 1523042 1491517
16066 1491517 1460815 1420898 1395954 1360063 1323100 1294420 1262483 1201729 1170758 1143931 1129063
16055 1129063 1095657 1062756 1054734 1040137 1040321 1015361 974209 930684 918686 927889 929019 914704
16043 914704 886380 880357 884074 867807 854264 844835 840945 809782 783471 739228 716805 699943
16031 699943 665054 623051 577071 538716 518421 502951 457949 405412 355985 345732 308085
16020 308085 240443 223435 207706 163972 124792 115447 109563 98508 100286 84038 74305 68217
16008 68217 74310 61202 56139 69529 46832 52907 55314 67075 81427 77808 70073 66845 63480
15995 63480 53421 54656 46994 50363 64781 72634 74436 94735 99344 104253 102406 96737 103567 93783
15981 93783 80916 61146 43244 36010 37127 57017 86005 90564 110533 112418 113665 119948 108682
15968 108682 96984 90278 93982 107127 101164 95128 86009 91549 89011 80661 78356 93552 96138
15955 96138 94481 109178 108853 117948 113493 141514 140002 126866 113316 103547 94674 75727 60794
15942 60794 62990 78941 84553 69981 50892 45555 56148 52639 32524 7261 10533 17459 14116
15929 14116 27409 34648 54667 74456 60869 60568 68500 59739 50441 45475 50382 70325 103091
15916 103091 105561 89237 78694 71368 84008 111962 114295 94191 95723 76143 59245 80519
15904 80519 98350 79944 68417 51516 43600 47763 39906 40501 52442 52387 42883 41473 54391 47197
15890 47197 46292 59196 54075 66155 65074 67601 27573 6839 10949 10467 10215 13932 7830 12394
15876 12394 5074 -10240 -7508 14398 36611 34895 21134 18302 17508 2393 4145 20742 28255
15863 28255 27254 25749 44620 57166 52419 43539 50650 74222 86038 87251 106267 106714 109380
15850 109380 99434 79034 91663 92307 80312 68874 52305 36008 25401 17498 32365 51601
15838 51601 55873 33187 3673 -6176 -23169 -26739 -16864 -13409 -30895 -24589 -17396 -17271 -23336 -18866
15824 -18866 -29511 -21744 -16575 -21954 -15559 -4908 -6402 -18997 -27023 -29099 -45231 -29396 -17439
15811 -17439 -8912 -11321 -12186 -25846 -29331 -41498 -29658 -31072 -31232 -10535 -1933 -4541 -21133 -29198
15797 -29198 -16896 10495 4812 11926 8561 12850 17812 7502 -4383 -8736 -10917 -6188 -3903
15784 -3903 -10672 -21710 -28159 -22375 -6504 -3599 -19244 -27336 -13450 -26537 -15577 -10748 -6325
15771 -6325 -3907 -23601 -39043 -5499 -5738 -7382 -16660 -21696 -14947 5396 -6173 -23430 -24842
15758 -24842 -19290 -2696 -6928 -1695 -4228 -14122 -24127 -24247 -18908 -669 3657 -3911 2154 790
15744 790 -8478 -30495 -18099 -20230 -32725 -18605 -22685 -30283 -41748 -25215 -1015 31580 26358
15731 26358 20045 2329 -13451 -21871 -3586 -482 -19168 -7250 3018 11742 8460 -14779 -13690
15718 -13690 734 -23634 -47279 -34958 -21542 -24039 -13785 -17038 -18711 -13277 -19652 -10630 2173
15705 2173 1193 -2785 -7237 -14109 -14887 -12165 -32616 -43062 -47376 -57657 -59681 -37888 -33526 -15319
15691 -15319 8224 18822 21454 6093 -5921 -5697 -17633 -20101 -17986 -16905 -17835 -25225 -11312
15678 -11312 -7567 -17184 -20583 -23157 -34537 -26707 -30765 -26580 1258 4213 -9147 6519 9653
15665 9653 -6520 -15311 -17312 -19328 -5527 517 -7796 -2505 6533 -4961 -25026 -29111 -25034 -25940
15651 -25940 -21637 -29410 -40574 -41574 -42255 -28060 -28272 -33073 -28840 -8277 8081 16201 9281 18472
15637 18472 9731 1206 9205 21160 22536 21266 21108 628 -6777 2406 12047 22539 22264 12588
15623 12588 -27728 -25950 -21685 -23837 -25813 -23838 -8439 33066 48818 50035 44662 24177 13983
15610 13983 9387 30380 39778 32932 31542 44412 55128 85612 115703 139437 154078 184246
15598 184246 215162 249941 287387 298697 331437 362348 406128 442860 437177 418233 419692 424689
15586 424689 435250 411267 359016 294120 240024 219207 217060 227971 200765 154541 128145 106322
15574 106322 94891 119369 95204 67900 53159 54299 60329 68492 68355 60846 49364 55912 31160
15561 31160 30950 29358 34322 41535 41401 28973 9879 12160 27233 16035 7427 -8408 -749 8438
15547 8438 -3536 15448 36353 40964 23678 14625 13266 16356 -6367 -24306 -24914 -21965 -6969
15534 -6969 8090 -1807 -3456 10702 14443 6757 -377 8424 14670 14439 7579 4864 1654 984 -10950
15519 -10950 -32328 -31037 -30248 -17019 -6856 -8876 9008 25551 21740 4563 17184 15628 11806
15506 11806 7940 5016 -5176 -8272 9265 23038 21430 -2293 -18657 -8484 -1002 7300 6591
15493 6591 11744 28814 29115 9574 879 13189 17973 22390 24798 19269 10614 -13379 -10682 -2356
15479 -2356 -2817 -10007 -40791 -38009 -15995 3032 12270 29776 48008 35895 19446 3649 12312
15466 12312 12774 17379 1652 1172 -6706 -16944 -17882 -9352 -25510 -26199 -13333 -1479 -9158 -14767
15452 -14767 -25058 -16240 9396 29640 21337 17509 10384 10113 1846 -5979 -9619 -7789 -13418 -16151
15438 -16151 -16419 -17420 -10603 -7609 -10904 -22316 -39197 -49523 -67857 -42156 -1859 4091 9501
15425 9501 9539 18120 -1412 2310 20555 10405 -15419 -16419 -19369 -23062 -18243 -18270 -17512 -21511 -17306
15410 -17306 1798 12008 19949 23007 21582 15673 -3455 -20155 -14103 -8506 -762 16934 752
15397 752 -33068 -32183 -39114 -21306 15739 34063 27585 34396 46816 46828 38278 54141 90230 111764
15383 111764 130309 163778 173942 198786 226394 259897 260552 247906 229206 214365 209058 165682
15371 165682 125413 133829 120896 110876 73778 48846 51697 49964 44525 38104 19860 16524 17976
15358 17976 17814 12866 7863 3561 7236 34913 49333 37300 19919 34218 24630 920 -6489
15345 -6489 -16245 -28690 -9618 -2751 1656 14505 8369 -4373 -2834 8903 15283 21926 13694
15332 13694 -1034 11639 26651 17967 -1848 -223 16858 2910 -15336 -27295 -39481 -50370
15320 -50370 -51001 -44386 -21469 -9336 -17527 -20416 -12688 -8270 8644 15151 20659 -6855 -21414
15307 -21414 -8526 1485 -10046 -18848 -19502 -5943 -2745 3816 6413 16304 4223 -4897 -1606
15294 -1606 -1829 -17221 -4901 -3114 -8723 -15297 -5912 9198 11024 -482 -5056 -15270 -24231 -26518
15280 -26518 -22325 -18738 -3855 12988 17178 6985 -11959 -19722 -8996 -6478 1480 -2197 -12941
15267 -12941 -19764 -19666 -22667 -5384 16767 -5058 -5565 3654 -19847 4089 38400 30182 4204
15254 4204 -3639 -15256 -15478 -25166 -27080 -15681 -12549 -24792 -43074 -36944 -11684 4343 2298
15241 2298 12165 13139 7716 -6793 -7617 -7828 4578 23808 14683 11462 7401 6979 8158 -13180 -16896
15226 -16896 -5903 9866 15177 -9068 -9061 7799 19792 21337 11424 17281 843 -22024 -15514
15213 -15514 167 1512 -4389 12685 10897 17286 18473 291 -5981 -12895 -29746 -19943 -15469
15200 -15469 -24279 -30549 -34424 -25055 -14260 595 -3785 -9606 -19546 -8239 -6120 2214 -11389
15187 -11389 6936 28309 25558 7045 -8137 -16007 -17419 -19877 -22036 -21944 -19575 -25047 -9657 12835
15173 12835 32450 22250 12436 -1109 1679 3669 -2221 -19060 -18268 -11307 2232 687 -8680
15160 -8680 -10402 -9806 -483 12408 17759 5930 10881 22171 -2183 -14058 -9856 5713 16474
15147 16474 4585 -8507 -3674 6615 37081 27583 -12692 -17180 -22738 -27229 -37385 -36918 -28677
15134 -28677 -27906 -19621 -26591 -18976 -7121 -11694 -8616 -1106 -7081 -9098 -16817 -1506 1730 -1415
15120 -1415 -14918 -17795 -6458 1529 -3320 -7437 -8940 -14690 -6748 -845 8772 -4030 -24567 -33816
15106 -33816 -18407 -7844 6299 9997 2923 -12290 -1849 11015 -180 12820 15781 6818
15094 6818 -9338 -25585 -26878 -6627 187 -20699 -21527 -21296 -34674 -29608 2331 9015 -2577
15081 -2577 -7205 -3170 -4917 -2811 -10606 -25398 -16781 8340 -2445 -11293 1014 -210 5151 16565
15067 16565 13878 -1989 -8430 -11275 -3743 -5958 -4222 -1950 -18233 -19727 -14909 8247 -1278 -17675
15053 -17675 -21230 -26201 -13476 -5384 -2492 -23247 -4477 -5499 -20343 -18082 -7534 2918 -2266
15040 -2266 -15345 -19257 -20750 -4542 6644 22897 13830 -5607 -23611 -14576 -56 -4950 -20648
15027 -20648 -27231 -21827 -10450 -19655 1423 8292 26769 37328 41927 34291 20888 -2161 -8878
15014 -8878 -7669 -11231 -10827 -6176 -2667 5927 -733 -8272 16951 10016 10339 20728 12367 5937 3364
14999 3364 -8553 1695 5240 -10801 -36126 -25532 -4295 -9316 6590 3605 12170 5223 -7751
14986 -7751 -9828 2567 14983 11998 21309 40101 14713 2169 -8611 -6542 -1201 -13227 -40904
14973 -40904 -49363 -20082 -2217 2368 613 6894 19540 4611 1763 7437 -11764 -29713 -30966
14960 -30966 -35075 -43026 -11152 5736 1914 -38 11931 2900 -16261 -26860 -16226 -19190 -27324
14947 -27324 -12694 -20803 -16942 -245 8741 2910 255 -3727 -15876 -10302 20808 24813 17000
14934 17000 10921 393 11662 821 -19136 -27668 -21943 -28717 -41573 -35624 -13515 16208 28629
14921 28629 36243 33412 38346 21594 2560 7666 19176 21402 18267 17101 25476 22624 4952
14908 4952 301 5062 10661 -1881 -7278 -4664 6632 9915 -3326 11093 7359 421 3169 12484
14894 12484 1670 -22812 -37392 -37460 -22274 -16344 -18789 -32977 -44169 -52150 -37855 -16022 -6971
14881 -6971 1343 -17985 -31720 -32190 -26147 -31673 -14634 -9306 -11625 -7302 -6202 -6281 -15500 -9954 -2031
14866 -2031 -5729 -15283 -20803 -19776 -13355 -9994 -701 -8876 -16714 -15645 -13187 -10060 -3642 -787 -9918
14851 -9918 -13537 3490 -11778 -3307 7799 9686 10484 -2380 -18943 -24853 -8648 491 21890
14838 21890 20236 27019 49019 49777 38222 14275 1069 -13829 -7054 -10852 -5968 -516 -14530
14825 -14530 -3070 12836 22390 29206 21771 37889 28494 21946 50298 79678 107139 134119 184397
14812 184397 240297 321781 402359 473667 564108 641750 684601 762867 891299 1003276 1111144
14801 1111144 1280666 1453230 1433315 1274416 1206699 1209988 1220134 1275645 1407491 1481630 1283144
14790 1283144 1019215 847550 734402 689060 680992 678718 636467 541859 445739 366741 337050
14779 337050 319615 289671 262851 246673 244261 224085 204352 184233 157480 142613 138399 146568
14767 146568 144263 120670 115014 115888 95397 81055 86885 98659 104152 114618 120054 119710 126452
14754 126452 113579 107124 102510 92507 70877 88677 104018 117971 116814 98986 99387 95144 78666
14741 78666 63987 65246 57358 40071 30876 16935 17487 22450 31728 40567 46516 46469 56371 60010
14727 60010 60014 51347 43834 8666 2424 28291 9636 10832 14484 4082 21013 38595 30770 23781
14713 23781 40793 27375 30070 41336 38499 24761 19405 23971 36494 21146 -403 -18066
14701 -18066 -12282 -1375 1604 -3555 19042 63900 59749 66876 53063 36531 23412 10516 -5402
14688 -5402 1152 3714 -11147 -28062 -44233 -34601 -24548 -12541 3924 12251 -10744 -35890 -28531
14675 -28531 -28701 -32137 -19572 -12108 -3011 3115 5931 7216 4613 -2928 -33147 -41847 -44553 -33804
14661 -33804 -24215 -8970 -4613 -24975 -6134 22334 9851 -9396 -23505 -4876 -2839 -10783
14649 -10783 -11836 3328 -5756 -6906 -6538 -5192 -2501 -3220 -6266 -1636 -6818 -8302 -8706 -16850 -6175
14634 -6175 6012 16184 15912 -3386 454 8563 482 -3158 -15607 -12572 -1199 3811 -22282
14621 -22282 -30149 -29623 -8977 11392 -1083 -4126 -13373 -15164 -21674 -16299 -11632 -6962 -2105 3126
14607 3126 971 1398 -7020 -6517 -13457 -12223 -16725 -17009 -12513 -11267 -10199 -16360 -11845 -17795 -17545 -13870
14591 -13870 -7047 -9966 -28334 -14804 -21048 -22854 -7281 -15523 -18548 -11298 -21907 -35853 -16178
14578 -16178 -418 -10870 -32243 -24674 -8575 -183 15283 10888 17623 15290 9908 -2223 -22184
14565 -22184 -21636 -12288 -9121 1865 10946 5539 451 -13069 -20276 -10173 -7433 -9030 -22926 -6405
14551 -6405 2830 17821 -1073 -10612 -10852 -6086 -300 -19436 -23241 -17586 7205 8903 -2065 -8886
14537 -8886 -9722 -22981 -8083 -3940 -9852 -11504 -12305 -20231 -25249 -18085 10426 15446 -3756 -6983
14523 -6983 -5691 -14344 -13420 -12221 -11134 -2340 3001 6410 341 -1299 -5085 -12620 -15718 -14761 -4397
14508 -4397 7901 9757 5136 2670 -1225 15333 23339 3369 -690 -5402 -17487 -30726 -24650
14495 -24650 -11996 -8013 -16600 2698 11004 -8200 -3661 -5466 -3017 -10139 -3367 -9410 -17400 -7152
14481 -7152 -7143 -2813 3799 -6010 -10232 13545 26795 11235 -7552 -13195 -3713 27 11374 12345
14467 12345 9149 -356 -12036 -22937 -17504 -10850 -1122 8940 -3469 -11897 -14534 -5040 2546
14454 2546 13696 12110 9217 -4983 -12317 -12611 2186 -5942 -4293 -15947 -13800 -12344 209 -664
14440 -664 7427 6164 1381 123 -21472 -40345 -42910 -22880 21032 40140 24111 -866 -12373
14427 -12373 -16850 -17010 -20550 -11309 -14242 -18865 -17344 -14355 -14720 -14681 -22420 -7754 -10708 -20823 -11479
14412 -11479 3329 9725 -13774 -36176 -37541 -32130 -14045 -11090 -20531 -34287 -52151 -48099 -30835
14399 -30835 -23556 830 602 -19183 -19616 -35377 -10168 7784 4826 -12203 -14887 -3710 -10978
14386 -10978 -15847 -20886 -2811 2289 -18557 -26990 -12455 -4600 -13894 -15689 2044 1994 -7298 -4562
14372 -4562 -12014 -4609 2105 -14464 -19015 -20751 -33868 -36670 -29502 -20608 -12420 -13989 -27177 -12750
14358 -12750 -8782 2267 9116 12785 2406 -32537 -46072 -35034 -29801 -50763 -27831 -1798
14346 -1798 -22186 -30533 -24159 -19447 -7354 -14273 -27141 -17229 7168 -3474 -5321 3717 2771 -5560
14332 -5560 -6426 -16197 -1578 10001 8493 16720 11757 -5220 -25623 -43008 -39526 -17332 -4075
14319 -4075 -9696 -8756 -667 9233 -1805 14228 21111 600 -11567 -16307 -26522 -18080 11253
14306 11253 23798 16622 -9839 13219 31648 13578 -2216 -1540 10599 20803 25378 21765 16699
14293 16699 7880 -10854 -24151 -25271 -26167 -17319 -12269 -5116 2629 -1703 -14733 -24417 -30396 -32853
14279 -32853 -17450 8044 16573 11673 930 1282 8836 11011 13496 23580 13140 -9651 -11712
14266 -11712 -9216 -5959 -10687 -3617 -5073 -11951 -16354 -1335 13873 11040 17169 1916 -27063
14253 -27063 -10751 -2472 12223 11800 828 -4128 -4251 12068 25929 19651 25042 6141 -2648
14240 -2648 3001 -1642 9541 7436 5467 -7664 -27861 -30486 -27030 -21288 -15084 6705 14606 5059
14226 5059 2700 20900 19065 22923 36554 42378 29221 13253 -12399 -14808 2005 3152 540
14213 540 -10366 3038 5714 10337 9331 11498 10271 12672 11626 -3147 -2857 2334 -576 -1660
14199 -1660 -10756 -5480 -29496 -25601 -17149 -38489 -51816 -19328 -10976 -13383 2708 8865 9787 -1818
14185 -1818 -10161 -4163 -60 317 12220 6407 9913 8428 -11208 -3172 1947 -10977 -7170 -13334
14171 -13334 -17202 -16994 204 9347 630 -11258 -9460 -10208 -19178 -16991 -6894 -14307 -15124 -5540
14157 -5540 -4674 2733 -3970 -12267 -18603 -23145 -5792 -7728 -6968 -6380 -12654 -22099 -15680 592 -9698
14142 -9698 -2501 885 5182 -1874 -855 -4367 -16753 -22149 -9735 -8367 1263 7249 -4193 -11324
14128 -11324 -10443 -7208 8552 -9170 -13755 -16844 -38005 -34431 -16711 -22800 -31222 -17046 1709
14115 1709 -6093 -17136 -22686 -37696 -20931 12159 16358 28259 20411 2942 -14734 -37688 -29452
14102 -29452 -27353 -29587 -41506 -38354 -19437 4841 26 -2713 -18129 -11845 4476 7798 20050
14089 20050 22952 9110 -13018 -23019 -19010 -7091 12242 -21228 -38441 -48554 -44630 -41100
14077 -41100 -21490 -6327 -6028 5589 -3480 -14851 -24065 -9998 260 -14547 -678 -3190 -7212
14064 -7212 -7376 4303 -8558 -3728 -1700 -7866 -18181 -18935 -18797 -25585 -21330 -17490 -8837 -6050 -18921
14049 -18921 -25146 -17805 -9980 -14182 -2460 22705 24909 8547 3412 -18298 -21477 -24716 -4841
14036 -4841 383 -19698 -29810 -12420 -1934 -3045 -20846 -18134 -16563 -15899 -34637 -45863 -48253
14023 -48253 -40893 -37043 -29090 -23262 -15297 -11704 -4779 -7773 -3679 -780 -8068 -7746 -13552 4924
14009 4924 17741 -1627 -8194 -15657 -26039 -31689 -23271 -15385 -8475 4503 -12473 -25516 -7577
13996 -7577 748 448 -14758 -11762 -13957 -33108 -38865 -48653 -63193 -55856 -23083 -6247 -831 21222
13982 21222 27790 10413 -4653 18016 31857 32650 15088 -1845 9070 17651 44397 41144 25300
13969 25300 3838 -1330 -12083 131 8461 8132 13489 16137 4886 2536 2676 10551 2566 -17989
13955 -17989 -27001 -24948 -24729 -28398 -17817 -24239 -20338 -11120 -1271 -13557 -22075 -20278 -18724 2058
13941 2058 9713 -10005 -33740 -37419 -26733 2193 18618 24165 14464 -11541 -11355 -2369 9725
13928 9725 -1254 -14234 10728 5544 393 10479 8026 -4212 -12993 -11441 8224 1549 8470
13915 8470 19503 5410 -8188 -14193 -190 8125 30256 16627 4739 3526 -12443 -34207
13903 -34207 -33719 -27754 -16773 1738 9275 9854 -4082 -32550 -30110 -11638 -9414 -5137 -11651 -7733
13889 -7733 5321 7876 2250 1075 3177 -1111 -27329 -29672 -19856 -25672 -25039 -16046 -11924 -12538 -8691
13874 -8691 -7579 -6327 -9189 6140 29598 28878 13054 -7479 -9428 3805 6063 -7360 -7676 -1141
13860 -1141 -885 -21328 -23061 -17475 -25385 -24304 -8078 -1937 -15804 -20143 -27145 -6455 9948 7276
13846 7276 -1666 -7869 -9005 -22833 -22258 -14479 -23221 4164 10220 12818 4749 172 -1630 -2503 3012
13831 3012 14580 21816 16241 2470 -16639 -26863 -27353 -8256 918 -9520 -9706 -11866 -12470 -19367
13817 -19367 -22791 -18181 -18927 -16868 -9488 5485 15244 16890 12855 246 -5987 -15034 -8215 -4924
13803 -4924 -1627 984 3956 1920 -4904 25336 28342 20375 15644 11380 -1361 -18899 -30869 -37634
13789 -37634 -24347 -19215 -31064 -37528 -36659 -24552 -4556 -121 -5749 6403 5008 -13333 -10644
13776 -10644 -22671 -26468 -28542 -36040 -37257 -24775 -19652 -17291 -20173 -18054 -11929 -8431 7007 -3634
13762 -3634 -16546 -17564 -1628 -1397 -17597 -25823 -18583 14587 24615 -6066 -5405 734 -14058
13749 -14058 -16216 -23913 -4500 15519 3785 -24998 -13518 6047 -14785 -26207 -42071 -51444
13737 -51444 -35900 -14534 -18983 -15572 570 11979 15079 5439 9158 10310 10158 -6169 -9021
13724 -9021 -3320 1085 -3990 -14714 -20480 -18248 -14191 -8564 1818 12929 -678 -2229 -8499 -16321
13710 -16321 -21912 -28210 -7218 3438 13939 -913 -22131 -15670 -13220 -4956 -12273 -38419 -40168
13697 -40168 -14719 -5071 4178 -4014 -5312 -6666 -8672 -6037 -4910 -4978 -3776 15562 25409 17359
13683 17359 577 -6549 -14029 -6263 4523 -2061 -11539 5650 30680 18478 -1833 -8781 -21100
13670 -21100 -9344 3870 -14749 -32230 -35049 -21929 -21845 -28234 -32726 -17400 -4096 -3384 -2659 -7161
13656 -7161 -17713 -8563 8708 13620 24710 20728 13166 16336 21538 10884 -7241 2366 16706
13643 16706 16931 -15922 -26792 -12655 -4280 -8391 -6852 -18743 -37682 -36963 -32324 -32470 -15940 2234
13629 2234 15563 5199 -14318 -7671 -22081 -23777 -21210 -17003 3570 1736 14344 5179 14595
13616 14595 18600 25474 21324 9106 27347 25243 6655 -6357 -15609 -24159 -16682 -13298 -21906
13603 -21906 -8128 -481 -6298 20025 39953 24485 10780 -6329 -4911 -2319 -7479 -12762 -20895
13590 -20895 -20054 -14839 -20970 -10527 -15173 -35210 -24655 -16397 -33845 -39023 -40428 -32407 -27516 -31128
13576 -31128 -29667 -29000 -20561 468 -4144 -20174 -34655 -28241 -1380 15887 12419 -16913 -40184
13563 -40184 -42355 -39541 -36158 -14802 -10729 -7533 -1685 -13172 -18407 -10883 -12361 -18201 -10052 -1349
13549 -1349 -7686 -17251 -18901 -15707 -17530 -19357 -19283 -20388 -8319 14184 18138 13828 19692 9194
13535 9194 14873 77 -11476 -14604 -1080 -2625 -5491 12350 22672 5553 -19981 -29745 -27752
13522 -27752 -39009 -29885 -10609 4043 -10378 -31844 -35179 -12374 8419 9532 -8400 -21056
13510 -21056 -17838 1818 14901 19958 -302 -18008 -36759 -44029 -40006 -35437 -25551 -12668 -15867
13497 -15867 -20716 -16673 -10586 -14902 -23297 -28887 -14508 -3568 -14990 -29374 -21790 -17035 -23310
13484 -23310 -9057 -6490 -14712 -15065 2342 -5278 -6933 -1983 -15248 -20291 -38585 -52804 -45242
13471 -45242 -33613 -12799 -11786 -21386 -14318 -9244 -3548 1249 4160 110 -1762 -10129 -21593 -18995
13457 -18995 -21242 -21944 2523 5938 -10575 -33108 -52144 -47006 -39352 -14309 -463 2235 -3316
13444 -3316 9797 24217 -4497 -26660 -22083 -22500 -11321 1939 -10080 -8261 -1703 233 -10088
13431 -10088 -9349 -26614 -33949 -25294 -10665 443 -8044 -19182 -7966 18579 16247 4589 -12201
13418 -12201 -5154 -24352 -22826 -3720 9998 854 9624 28807 32695 28746 15965 13290 28148
13405 28148 -8880 -23138 -12999 -12902 -15903 -30509 -27304 -47 13625 11665 3577 -4116 -16908
13392 -16908 -14525 -3399 -22690 -30257 -23306 -18146 -21246 -36287 -29423 -9824 -8234 -9894 -13681
13379 -13681 2322 16620 4355 987 -8646 -32597 -44013 -39831 -28455 -23486 -13529 -10167 4892
13366 4892 21703 19026 31889 15244 5629 11057 18539 23144 16759 -2197 9979 36323 39488
13353 39488 19164 10061 22015 8855 -4727 -23206 -32249 -15192 -10712 -6664 -10010 -13928 5697
13340 5697 19298 7369 4226 -3625 -1394 -4440 -6313 -16273 -18673 -26965 -45563 -27552 -14119
13327 -14119 -14152 -20989 -9062 -4008 -13523 -19643 -9841 -5179 -3054 4246 15006 3891 -573 -4945
13313 -4945 -15021 -15953 -24654 -5192 25762 22208 4261 68 7240 7097 655 -6256 7337 -2400
13299 -2400 -19969 -24868 -11733 -2142 14764 7572 947 -4127 30 12848 7068 -9993 2675
13286 2675 16367 9862 -11632 -5372 -12366 -20277 -20441 -33222 -38052 -11175 8554 12560 13749 1685
13272 1685 5720 6533 18254 26301 19953 7638 13899 18162 15078 4914 191 -8292 -18574 -16149
13258 -16149 -6476 -17111 -17920 -16359 -12819 -1864 4755 12357 -10321 -18461 -3887 -8567 -6062 -3587
13244 -3587 -19618 -19876 -12742 -30032 -39814 -38997 -19958 -18221 -8698 -11077 -25244 -16487 -28701 -33921
13230 -33921 -28735 -19877 -22229 -12790 -21396 -5077 4937 -1957 -7242 556 1811 -4396 -6064 -26472
13216 -26472 -33831 -18679 -4527 -24245 -9885 -8319 -37375 -38453 -29837 -12501 6903 -328 -17785
13203 -17785 -10733 -20991 -28503 -24329 -25543 -24362 -26805 -14348 -925 26791 48487 23584 -9047
13190 -9047 -12292 17099 -203 -12164 178 -325 2151 -8492 -24200 -30681 -24518 -18521 -22353
13177 -22353 -33025 -20681 -19466 2256 -2202 -6960 -8952 -23287 -11542 2815 6678 15917 14348
13164 14348 8053 -5076 -1121 -14445 -17407 -5167 5147 12536 6308 -12786 -33762 -40878 -33507
13151 -33507 -22380 -11481 13907 10212 10360 6404 418 -8153 -8684 1569 769 104 4831 2255
13137 2255 127 -10314 -18307 -17063 -12122 -15843 -27746 -16198 -16935 -3320 -4441 7417 23921
13124 23921 29972 27491 21453 29072 19249 7461 12589 16353 18690 16742 -2187 -24363 -5972
13111 -5972 18212 31619 30147 21196 26187 34715 29528 25698 -5190 -24184 -31404 -44291 -35174
13098 -35174 -1646 -20563 -32181 -25531 -11686 -5412 779 -7568 -15303 -22597 -44959 -39542 -21565
13085 -21565 -351 18517 5714 -11477 7331 6989 7659 6020 4633 -949 -3454 -2116 10067
13072 10067 6194 -1785 -8743 -21414 -19332 -4612 -5641 -16854 -31642 -33164 -11715 -3183 2226
13059 2226 5868 155 -6808 -1898 3538 4265 -7192 -15414 -17968 -5662 -2635 -4181 -8376 -6069
13045 -6069 2731 11246 1969 11202 9360 20398 18447 8941 8770 -7054 -5028 -3264 -14307 -14663
13031 -14663 -20484 -13714 -13711 -27555 -37113 -25065 -1970 1204 -1908 15313 16603 17628 9813 -12838
13017 -12838 -19727 -16357 -7028 5065 6528 -388 -2915 1645 12733 15741 11425 18231 4734 -16311
13003 -16311 -19943 -11515 -21383 -25837 -20763 -14819 -281 9950 11965 9418 15034 36677 -110
12990 -110 -16352 -15182 -12060 -24287 -42112 -41041 -44095 -43363 -34478 -9726 91 -7575 8890 17622
12976 17622 4764 15697 8977 3606 -8503 -16128 -22970 -21730 -16897 -5762 2747 -12752 -23376
12963 -23376 -14373 -5761 2076 -10115 -19756 -3098 5798 -4054 -28762 -39230 -10589 4888 7431
12950 7431 8043 -3347 -9069 1964 1882 -6922 -2259 -4902 5910 13639 1371 -10209 -267 2459
12936 2459 -2138 11223 21621 20008 -12838 -36109 -53343 -48803 -30444 -21032 -20901 -18571 -11767
12923 -11767 5194 -7983 -28164 -23513 -2097 -5151 -14384 -8616 4136 -288 -5378 1481 2770
12910 2770 201 933 3421 23123 20306 -649 5460 10685 -5379 -23820 -15027 -6858 -3453 7655
12896 7655 29963 35688 35682 44359 47253 24804 9912 -2085 -14684 -16869 -6235 -5707 -5295 914
12882 914 1497 -9567 -5809 -2702 -8272 -14291 -22265 -20852 -3124 3626 7585 9487 297 1968 9960
12867 9960 17828 2245 5789 32726 25284 6850 -9316 -10783 -5769 -10902 -2559 5829 -6744
12854 -6744 7218 16048 -978 -14782 -16025 -12439 -8728 5362 8077 -9350 -11332 8942 4021
12841 4021 1603 -18528 -14036 -20806 -21627 -29646 -19204 -1638 -3657 -17395 -26645 -18582 -2740 4061
12827 4061 7488 -5922 -7015 -2430 7377 20988 14245 1115 1036 -9793 -15460 5326 12100 11577
12813 11577 8631 -3305 -12616 -1607 14567 2786 -28248 -42345 -12242 -496 4419 48
12801 48 -23083 -31950 -31602 -39206 -26348 -15658 -3432 4081 -1515 -14096 -12738 -5757 302 9579
12787 9579 -896 -12508 -4890 -4032 -10542 -7066 -5438 4111 -3212 2565 -8776 8586 13436 12856
12773 12856 8489 5429 -4073 13215 11482 5184 5934 9921 4825 5256 11353 -6972 -19869 -13358
12759 -13358 -24575 -27924 -17108 -9952 -13972 -15837 -7988 5752 -8309 -11625 2664 31236 24945
12746 24945 6098 -1480 -26352 -24436 -25857 -20854 -11092 -10646 -15321 -3794 14107 8458 -14712
12733 -14712 -13709 -22797 -27000 -10557 20181 4778 -8650 -12126 -20649 -20389 7989 8943 -487 10471
12719 10471 13433 -2655 -963 -2347 -15156 -11236 -1283 5922 3562 1482 -3977 -19520 -22023 -8059
12705 -8059 -2458 6440 8543 18608 8403 -12869 -16742 -2387 4341 161 -6763 -15655 -25489 -32445
12691 -32445 -27651 -29008 -27889 -29953 -20760 -9905 -11450 -19192 -39010 -38473 -32744 -45730 -42794 -27218
12677 -27218 -25582 -6727 -16687 -29980 -31965 -18059 -13578 -31556 -34494 -18811 10387 8256 5968
12664 5968 -11854 -19621 -2486 11849 9186 -12064 -328 7067 11385 89 -20006 -45975 -74159
12651 -74159 -59134 -34676 -23969 -34226 -31991 -27523 -21106 -6143 -12543 -8017 -9022 -7632 -5227
12638 -5227 -16427 -18123 -10892 4866 6305 11350 20071 22250 42350 62526 60155 60895 78261 80336
12624 80336 67762 36180 14728 25897 18058 18126 20696 15244 11634 -1178 4486 633 -20336
12611 -20336 -7759 -7027 -27822 -16334 -6806 6966 6026 9262 8309 6279 7946 8770 2746 -10559
12597 -10559 -2305 -5152 7095 16249 35838 32493 36320 63338 78377 95538 119363 124812 121720
12584 121720 103835 74488 47789 25026 15933 34041 31713 14884 -1653 -4392 -13755 -12928 2882
12571 2882 -4167 -34277 -24839 -5886 993 -5117 -20822 -26647 -47368 -41943 -31407 -28529 -15503
12558 -15503 -880 -9241 -13880 -19914 -6593 -3957 -2337 -8605 -1921 12406 15508 9342 4360 17692
12544 17692 17090 -6487 -8936 -5849 -13416 -11354 -13576 -19360 -24047 -43586 -53313 -37540 -5195 9833
12530 9833 5045 -5284 -1060 1901 11972 26931 12065 399 6168 16254 13564 12300 24392
12517 24392 8418 -417 11250 10268 -1506 -25884 -26032 1628 12007 14401 10672 -11843 -16005
12504 -16005 -19983 -21756 -24797 -29742 -20142 -6341 -14807 -17482 -5041 16531 16325 13677 12810 5032
12490 5032 10120 5562 -3655 5538 23935 21943 10761 14661 30715 45580 31161 14109 29618
12477 29618 28649 16499 -6599 -30004 -31865 -26218 -28701 -37306 -32306 -25690 -20831 -30254 -21788 -6067
12463 -6067 -1488 -14006 -22807 -21372 -4286 7207 1166 1920 4483 -12417 -3873 -627 -1980 -10083
12449 -10083 -19533 -1708 -1215 7807 -1259 -2057 -6665 -2388 -14535 -22731 -14755 -4594 13743 8363
12435 8363 -18647 -30236 -10737 5141 2321 775 11727 9188 -4922 15123 19418 24964 32763
12422 32763 35148 33060 27571 35539 45063 34659 26339 32059 16274 -4831 13605 25035 21315
12409 21315 8060 169 3660 -13748 -8440 -5843 -2200 7465 14116 23880 39409 25438 956
12396 956 -12468 3114 -1846 2739 29285 48278 48677 31765 22056 14632 4128 5752 21871
12383 21871 27840 12550 -6114 -4452 2044 13162 7302 7158 8130 -1546 18400 2785 -6178 -16314
12369 -16314 -10647 -377 3793 44 510 -11675 -15602 -17863 -29509 -14324 -11983 -22674 -38450
12356 -38450 -41295 -25855 -2780 -7227 -5246 8990 -5649 -8088 10118 13584 19891 7091 -10788
12343 -10788 -19543 -39823 -35307 -43738 -53393 -51062 -32943 -35826 -26314 -16089 -724 14541 8860
12330 8860 -6432 -16649 -21247 -10819 -10730 -2110 -1523 12101 13019 6770 -13295 -34359 -29544 -25119
12316 -25119 -35563 -42549 -27943 -35155 -37405 -42992 -38846 -35812 -40497 -7888 24793 17146 -679
12303 -679 -7631 -14583 -7554 11461 3761 -12559 -6146 -22059 -28045 -27796 -24027 -23718 -19672 -29107 -23637
12288 -23637 -6437 -31 -6199 8781 3909 -11130 -5481 -4623 -10308 -7904 987 2598 499 -3946
12274 -3946 4236 17173 9485 -10390 -10817 -4606 5902 1110 -4709 -10083 -23452 -11571 -10703 -11605
12260 -11605 -26201 -34597 -31237 -21590 -1791 7762 10360 10196 3855 5646 10523 15862 15637 35843
12246 35843 34864 4628 -10382 -10385 2944 -1090 2262 18283 8236 14692 28880 28730 9021 13624
12232 13624 -8143 -4329 4582 -2072 -9361 -3310 -8075 -16422 -21087 -28950 -17978 -9835 23971 46716
12218 46716 21681 28400 19727 -6614 -15262 -9694 -8761 -1730 -2818 -389 10378 22013 6358
12205 6358 -25446 -25876 -28884 -19881 322 -12115 -13898 4328 6020 -5414 1377 -2357 16219
12192 16219 32760 24223 14368 13534 20277 -11993 4913 20884 24385 22667 20651 1257 16415
12179 16415 38182 20479 8013 136 -12391 -6631 1508 11385 19492 3040 -9058 2209 8453
12166 8453 9157 21415 24005 -2179 -8285 5170 -2815 -7395 -12588 -12814 -9069 -15164 -7723 -3514
12152 -3514 2992 -1625 -9681 -5448 4838 -5284 -13737 -17194 -23656 -29633 -36196 -20450 -21791 -10606
12138 -10606 6805 1809 -10079 -8603 -1713 10359 9487 1232 -12534 -35237 -36807 -40395 -19371
12125 -19371 -10628 -2304 6296 11309 8041 13204 30332 19394 23305 22416 10491 2015 11812 19428
12111 19428 21165 12835 14220 15996 19231 18977 24019 12727 -3135 10989 5506 7665 966 394
12097 394 12136 8082 18970 24058 7038 15342 13855 2203 -11708 -13838 -1617 3178 -2815
12084 -2815 -2066 1282 1598 6301 -2400 6875 14351 14122 -7775 -29309 -20358 4894 12403 -4513
12070 -4513 12076 7675 -13752 -24980 -25327 -9556 -9217 -10273 -15877 -24940 -17708 4270 -9800 -14536
12056 -14536 -16198 -8581 -4412 -747 -311 10185 13809 -1720 -2894 14320 11321 -6051 -20523
12043 -20523 -18734 -25142 -18301 -363 -11526 -10612 -17186 -11043 -18579 -11423 -17620 -21495 -10757 -4494
12029 -4494 11668 3160 4488 10003 25513 35757 29276 -10757 -15355 8377 9005 16527 23386 13684
12015 13684 7598 7628 7085 -15480 -8571 -4249 17834 33821 42950 36475 22720 11888 4900 9964
12001 9964 19662 27094 50487 35965 12734 -904 6127 11331 -9240 -22814 -9514 11383 3297
11988 3297 4011 938 19607 35595 44734 21315 32342 41985 41488 29357 14826 11068 15837 33457
11974 33457 17465 7150 16979 30415 15565 18887 25359 17124 9060 6397 13865 7536 13598
11961 13598 22707 27601 30795 28064 17526 13384 15184 -2728 10466 22004 11522 3802 3864 1100
11947 1100 -7086 -8223 670 9346 9190 607 4298 9489 15345 9963 20282 16884 16100 20095 21575
11932 21575 16620 20330 28145 12394 15653 14800 29617 30901 41585 33260 24871 5942 -15715
11919 -15715 -31629 -43759 -24204 -15728 -10081 -4034 1052 -373 280 -13579 -28063 -28666 -7487
11906 -7487 16847 17418 17738 14575 19186 22452 14841 12479 -5076 -11021 -14978 -8719 2531 15608
11892 15608 12310 9203 15442 11253 4362 3293 6739 -75 3066 810 12072 20503 25958 26278
11878 26278 24243 24364 8506 -8465 -1399 -10793 -12078 11668 14875 23113 37967 32870 33175 21075
11864 21075 14609 -6098 -19013 -38971 -33429 -22171 -31850 -20361 1358 8694 20135 3189
11852 3189 -9525 1805 13804 12921 -1529 -6589 258 -3222 -18422 -14369 -5635 4048 7031 8960
11838 8960 19280 12341 18258 20328 8818 -610 2231 19419 29739 39746 34142 30896 26178
11825 26178 19387 3991 3047 4536 -7789 -11970 -200 38565 28199 -4066 -16997 -28080 -20513
11812 -20513 -5742 -12399 -23171 -27694 -32383 -6947 -16023 -12887 -9788 -4753 8089 12015 9881
11799 9881 5289 -1679 241 12990 29397 22586 -5854 -153 10953 -2173 -7969 699 -12077
11786 -12077 -22994 -36275 -30038 -24216 -19209 10929 -7340 -30774 -9340 -3168 -8933 -27105 -37627
11773 -37627 -16952 -12368 5765 -15203 -32119 -19650 -8489 -13180 -14422 -8007 4360 5082 12314
11760 12314 14776 857 -16027 -12524 4642 12007 16452 5927 -7160 -14825 -16363 -6875 -13727
11747 -13727 -4804 3447 -18169 -11180 -10153 -13316 -18662 -19559 -6254 5826 2830 3430 12002 3069
11733 3069 445 -273 9671 12132 -840 -17977 -15068 669 -2149 70 -10970 -11855 -18124 -12257
11719 -12257 -10801 -5007 16367 32062 17573 -13719 -13862 8086 5770 -6437 -6274 -2099 3775
11706 3775 12137 22224 41824 32210 4546 9761 15551 15743 5649 -9953 13191 23635 8039
11693 8039 -2602 -1803 4500 -13458 -10385 -9385 7778 15534 25966 27756 15111 5940 -25238
11680 -25238 -21061 -1833 21271 31471 18445 -11075 3165 24855 22602 15028 5007 -9302
11668 -9302 -23580 -30667 -25347 -21484 -8421 3644 5973 3992 18106 7347 4343 9506 17061
11655 17061 14157 -4128 952 -653 -22100 -36178 -22866 1347 5715 -8575 -21773 -15075 6171
11642 6171 18688 10283 16106 -3869 -11951 12969 17533 19548 23920 11725 9838 13834 25126
11629 25126 30823 20873 5278 -3342 -2960 -17128 -8947 -447 4314 20125 19941 5523 814 -4903
11615 -4903 2614 10590 -13349 -25730 -27260 -24785 -23988 -10964 4127 19331 923 -11393 -12083
11602 -12083 -21433 -26944 -31454 -34017 -33986 -29574 -23263 -17013 -7313 12520 26303 11798 12484 34466
11588 34466 44651 29725 30612 35860 29776 13834 235 735 -10037 -2035 3615 15015 24650
11575 24650 42611 32232 2096 952 2995 -7238 -11835 -22937 -31787 -11866 -3395 2013 7234
11562 7234 13521 6655 -1659 7244 21206 13930 15667 7608 5429 51 -11603 -11704 -15804 -26541
11548 -26541 -12971 -2071 -10936 2239 -12822 -36216 -20014 -18154 -16142 -17998 -9441 -5434 -15139
11535 -15139 -4761 1736 8492 24656 36537 27844 -4653 -16262 -18300 -7130 -4738 -5924 -3656
11522 -3656 14556 20360 9741 7170 7066 13495 15038 2276 534 -18605 -20260 -11863 -4977 5916
11508 5916 12386 4994 4001 -5631 -10524 -4971 15675 24671 21877 1095 -11510 -4810 9269 8829
11494 8829 10383 8003 15808 7435 -19063 -28747 -45218 -31338 -21170 -20665 -30186 -33990 -27031 -29623
11480 -29623 -13390 14735 4534 -3270 651 14063 19943 41998 50279 63319 54193 46729 20829
11467 20829 14166 22168 20468 26888 22356 22856 27067 37906 22899 1918 -444 22916 25469 10414
11453 10414 18604 23785 8869 -321 -2405 10152 10151 1684 15696 6070 5222 716 19603 39558
11439 39558 39460 59401 60608 51835 32332 28800 23308 15733 21105 27443 39056 40276 36387 20871
11425 20871 7214 20038 42626 31677 26416 17891 -5472 -365 8964 4652 11829 11693 12451 5262
11411 5262 7150 1711 8565 13605 -3097 -7648 -4985 -1160 19828 58242 71990 62439 56499 44997
11397 44997 44958 23997 30261 37505 34567 42390 49006 39562 12482 10391 27540 26328 16732 26098
11383 26098 32314 30187 29789 40592 28902 24069 23411 641 8161 21213 33982 30073 38374 28563
11369 28563 26710 26440 17356 13269 -2075 -27073 -9887 12378 17200 27705 44025 46646 34883
11356 34883 28408 11670 16297 18421 23846 28587 22875 16811 26359 29807 24960 16509 -1986 13169
11342 13169 15397 14141 19882 7022 -670 4237 24972 28256 5404 -3197 3588 6961 12120 18036
11328 18036 24050 22760 8 -17221 -9580 1962 -12769 925 13351 28302 29985 21762 34722
11315 34722 17412 -1345 1005 7455 7707 27210 36554 13866 -7554 -14947 -13033 -13163 -10975 3479
11301 3479 18253 30087 31413 23392 35842 48620 48909 40832 33260 35364 48794 54245 45612 58583
11287 58583 76203 61579 41007 33570 23159 9250 3831 21279 20127 23098 10849 13138 4780
11274 4780 8212 24980 43247 56580 31140 14576 10545 11241 25662 53227 41176 21206 24250
11261 24250 11205 -11153 -26315 -18556 -10327 -26455 -33024 -26771 -27512 -13513 -2013 11915 22588
11248 22588 13613 10294 30280 44159 40900 21429 -5283 17337 25990 8847 10482 11066 -638
11235 -638 5572 17070 5719 5957 18626 23510 14738 25708 28889 17430 9609 -7155 8389
11222 8389 32465 53427 36807 22982 23854 26782 36037 36312 25816 11803 -1218 -2767 -3727 -9142
11208 -9142 -19234 -41950 -29968 -16890 -4079 6717 5623 -11736 -13777 -6583 14141 8094 23522
11195 23522 32927 46873 53461 71583 68017 53773 43348 41999 29350 14977 -561 -6588 -7256
11182 -7256 -3278 -1374 -7385 11062 15987 -1122 -5168 2722 3350 -5997 -5301 -7064 -10012 -2171 -5955
11167 -5955 8471 12095 18081 32784 33247 31755 22904 2105 -12118 14525 28754 2741 -11649
11154 -11649 -3246 -2942 -10143 14334 27077 36376 51854 37272 33464 37517 40121 35171 26352 15659
11140 15659 -9201 759 -4372 -14388 1795 33934 43477 43854 29947 37831 35584 30610 21560
11127 21560 29005 22555 31646 30223 -5036 -28283 -17039 6266 2843 -2310 2091 8655 -6904
11114 -6904 -1112 15433 26993 22305 19904 21938 17969 22938 27852 30605 41479 31996 21907 23859
11100 23859 23851 11227 15773 13415 -4642 -9139 7576 9206 7661 3048 -8014 1996 8568 3498
11086 3498 -1019 13665 1296 1541 12113 5772 8222 15210 22185 33099 28804 9637 13539 9639
11072 9639 -4385 8815 -10882 -3180 17938 34816 36364 32848 24119 31570 19465 -3260 3102
11059 3102 11340 8866 2667 -14774 -4292 13750 22758 43879 50232 46484 25378 17629 18637
11046 18637 18337 19986 32256 29779 36451 43128 28617 14395 16337 29199 31023 41859 35339
11033 35339 26346 31406 57590 61544 44652 21526 20636 17698 8727 8981 18028 40716 43044 47895
11019 47895 22615 13107 4005 695 -2276 24817 29400 9967 -4674 14110 1949 -885 9273
11006 9273 18319 37584 39119 26812 22712 10105 -698 11558 11656 2470 8421 18632 25219 30755
10992 30755 36433 38490 23995 27610 29505 18903 30930 42968 38598 36296 40006 40221 39422 39823
10978 39823 62444 77111 44974 48065 61716 38244 20730 24191 21871 36825 67175 56649
10966 56649 47784 37216 43075 34185 36689 49511 26318 20932 21842 11314 28485 34923 39152
10953 39152 20302 29078 34717 22480 34963 35059 47137 28995 21659 37362 39848 47054 51055
10940 51055 52749 57173 57829 57152 70037 64424 50422 45296 46820 43339 34642 24829 32603 49877
10926 49877 33686 21526 38023 53746 39088 35566 41993 42622 69262 87101 87710 71795 60705
10913 60705 73596 64412 39554 22859 21849 22807 27391 21564 15058 14729 20190 18420 13783 22056
10899 22056 37728 41661 53492 63689 58803 49935 50137 46768 32122 25525 17265 19557 35619
10886 35619 44594 40240 55952 51786 38501 32262 34197 51549 47417 37178 49784 55554 62277
10873 62277 51386 44487 43854 34054 42762 55462 60800 48340 56595 59418 50652 24336 8823
10860 8823 33785 60053 66734 70699 62819 65483 73793 54998 36039 21465 29176 43327 49741
10847 49741 54162 66199 66317 55751 55046 50074 41790 41969 61918 65142 69446 85396 87923 77316
10833 77316 70010 54820 52016 62108 57786 34158 26647 39051 47538 57780 65876 66963 52073
10820 52073 48920 46927 47924 42841 39293 58833 59191 48234 49259 52863 42672 42602 44585 40582 45658
10805 45658 41941 44788 44521 49451 61332 58270 54918 65361 68975 52180 68595 66517 65216 61789
10791 61789 66842 80092 82208 73206 63311 52790 23155 13443 28745 29384 60245 74566 65884
10778 65884 75169 89302 85950 83709 83887 76339 66173 78252 93390 95805 98298 98471 98745 83053
10764 83053 80138 100242 116961 107275 104679 87810 62244 40581 28079 34942 54460 52255 54127
10751 54127 50034 53515 72704 78528 48695 36606 35179 35731 30557 30917 56855 55449 46102 40054
10737 40054 59008 75094 85830 91557 90443 97943 83784 74481 95238 98803 109857 108786 93486
10724 93486 86464 119035 135575 136948 140799 126119 115174 119062 152731 189084 189845 196710 206104
10711 206104 225131 282894 373995 497395 679353 880739 1067016 1278743 1509674 1708868
10701 1708868 1842318 1816783 1744582 1710298 1717195 1787980 1792557 1606120 1263616 951895 759283
10690 759283 646833 568803 514364 470970 435711 401138 370703 339431 303729 303227 290950 272273
10678 272273 258197 240708 226264 232580 230980 240754 227537 215307 220996 219754 219800 214889 204874
10665 204874 188042 177778 174705 181913 189631 193146 192939 183425 179972 180308 162362 156756 166964 181563
10651 181563 190550 189468 171160 157057 154795 149314 137129 148714 159213 148731 139578 166808
10639 166808 188015 192842 191106 202286 223954 245076 279229 295930 311645 333115 325424 304641
10627 304641 304679 314047 317910 309363 290465 265618 231704 221459 232215 231938 220930 215984 213335
10614 213335 233185 246405 243458 234091 222238 212784 178828 145398 97261 23265 -43888 -58665
10602 -58665 -57958 -101820 -145915 -196032 -226689 -238364 -216048 -176587 -154528 -125807 -112832 -108322
10590 -108322 -93485 -84398 -62319 -29832 -27806 -23113 -15381 462 -4942 -6747 3362 14532 17845
10577 17845 36637 43370 36348 20166 32778 43925 52049 61554 59358 43191 56755 86044 90267
10564 90267 89201 110290 125628 136090 133462 129875 132692 133151 150006 162394 177635 172214 175657
10551 175657 165678 164069 197521 226830 226760 214040 208222 215123 217752 214254 214428 193009 177468 174093
10537 174093 157820 138414 137149 137357 141014 143423 133882 139122 141135 132375 138207 149452 162692
10524 162692 165810 157580 173459 187543 196893 198210 206010 234650 243655 246618 232343 227392 227785
10511 227785 222276 237010 202888 185119 181748 196399 197252 184536 166805 159426 153753 145143 138656
10498 138656 137015 128945 119101 109878 102005 110274 105200 83524 68070 49686 43464 70708 97843
10485 97843 110961 122670 138925 122703 136864 164564 189508 223886 238807 236973 219624 222009
10473 222009 226742 228986 239187 256097 257240 251424 241725 230831 234589 257536 297727 313971 302738
10460 302738 295439 317421 331440 318924 321455 337884 350237 348239 357124 366746 389934 392941 395551
10447 395551 418471 440924 453041 478447 506310 531620 537534 546388 591160 645836 662942 679778
10435 679778 703586 737151 773064 847559 933833 999230 1065801 1118154 1153323 1187073 1172358
10424 1172358 1116960 1053376 1025220 1015093 965868 834422 697747 565738 484835 471087 478130
10413 478130 455980 427338 437610 507883 663948 819606 944631 1095157 1278410 1407091
10403 1407091 1337286 1243269 1220767 1272940 1269843 1094633 959873 898215 856305 828635 829427
10392 829427 836112 820580 822890 826613 824998 839207 864949 876259 863685 863413 871076 873399 872999
10379 872999 885554 896556 912377 907383 877780 861956 855236 879814 883328 881942 891212 905081
10367 905081 911914 927742 938638 920841 898564 883348 869877 886582 913512 933582 930198 937514
10355 937514 961996 976504 1010753 1057360 1110168 1184964 1244825 1294206 1363942 1463149 1541046
10344 1541046 1638253 1754133 1881669 1975508 2045506 2102191 2147004 2210999 2294704 2397548 2504170
10333 2504170 2594814 2673669 2781482 2932910 3115851 3332815 3561408 3805232 4139638 4583381
10323 4583381 5095697 5624298 6140952 6714517 7356794 7950931 8494161 9123863 9900429
10314 9900429 10920846 12196183 13667478 15226996 17090848 19621468 23003743 27469615
10306 27469615 33620077 42658447 56611586 78245313 109160568 146175490 182539299
10299 182539299 217400708 257489859 300575250 324528690 315491195 295712170 284794634
10292 284794634 286926404 299274422 302322608 269701038 211557638 160344492 125679691
10285 125679691 102860733 87095270 75635862 67062960 60465511 55254076 51045529
10278 51045529 47490097 44325083 41486892 39018586 36980779 35345714 33880338 32422006
10270 32422006 31055629 29869441 28771886 27760554 26764599 25631077 24413603 23286284
10262 23286284 22267113 21323452 20393492 19522760 18705633 17947067 17240075 16578767 15979171
10253 15979171 15414033 14870406 14366797 13938453 13551487 13168210 12800382 12465530 12122271
10244 12122271 11805388 11506776 11243827 10960403 10641530 10354912 10078131 9814121 9561761
10235 9561761 9319202 9084243 8876720 8690531 8504089 8338319 8188396 8128187 8187890 8376587
10225 8376587 8774506 9309392 9780899 10173572 10725857 11353683 11391195 10624262 10072797 9921276
10215 9921276 9907502 10013885 10327088 10530753 9843642 8482150 7374580 6629734 6120901
10206 6120901 5759695 5451144 5174862 4962783 4771616 4608392 4453790 4299725 4186012
10197 4186012 4080553 3976334 3876124 3784864 3695071 3619176 3539882 3490194 3460290 3419412 3383813
10186 3383813 3342525 3296018 3247121 3188927 3116581 3066428 2983218 2904564 2857270 2794274 2723908
10175 2723908 2626197 2538138 2425439 2275768 2125799 2005125 1895828 1789151 1627966 1466881
10165 1466881 1336729 1204439 1084223 972037 851014 724587 669101 651924 623177 601820
10155 601820 577540 567436 562227 550683 520531 493374 476205 443318 432320 435182 425364 405258
10143 405258 406927 428179 441372 458272 448047 431344 453026 470539 470500 469266 459297 444338 429283
10130 429283 433439 446668 427807 418469 435646 452163 464468 463765 455930 459687 455346 441587 431750
10117 431750 418754 426868 414934 406431 404349 402233 414955 403891 420599 431523 436637 439957 453366
10104 453366 447583 432507 430336 450341 469218 467541 459238 443740 418501 417918 390162 379497 386837
10091 386837 369124 354555 360975 345978 319693 302509 301908 320432 314181 320944 338644 356324
10079 356324 399654 430930 428890 412870 369219 320357 295890 276959 258649 258304 242543 247680
10067 247680 265673 280765 279636 295241 281249 273211 280536 293094 304970 315896 331433 324894
10055 324894 321748 321770 305468 307097 307209 299603 304450 300540 288568 280026 268728 266337 270660 278011
10041 278011 272091 264550 255579 239375 223248 217624 212716 232505 228859 221778 235192 207292 188966
10028 188966 199040 183838 168083 166333 157091 155315 144392 130775 113453 118135 136917 136079 154444
10015 154444 158544 149929 143116 151190 149084 132713 127852 129449 141271 166334 192078 192390 196191
10002 196191 218675 239646 255340 235452 243567 260972 290212 303715 335685 351549 359377 369320
9990 369320 391581 379696 368973 327570 263291 223012 197507 196194 185765 156246 89809 39131
9978 39131 7417 -25100 -13662 5676 7467 -11499 -32283 -2343 17556 44914 58836 51287
9966 51287 53156 48860 49686 23330 6360 19827 45433 42169 22478 6379 -7584 3600 26480
9953 26480 16455 8549 3163 -5398 -15006 -30636 -33307 -29892 -17035 901 8716 31261 33066
9940 33066 21273 13910 17985 27350 32274 30946 37244 33849 42939 41803 52970 51404 39764 29281
9926 29281 40556 49234 46426 24605 11072 27035 42490 52147 63329 71612 55492 66042 89420
9913 89420 94670 97230 104103 102453 92206 86751 86055 98404 94025 80670 71785 65366 96179 106225
9899 106225 117353 126163 132944 152190 203712 272374 373672 509579 693628 918522 1115951
9888 1115951 1300381 1514983 1729558 1809322 1741578 1650732 1614736 1643963 1728112 1697286 1439067
9877 1439067 1128853 870531 668304 538977 462801 422156 385720 354695 299303 270029 268117
9866 268117 254173 240670 235665 227415 234221 208848 191636 190880 166892 148502 143439 143959 148365
9853 148365 165443 169547 159494 151921 143636 134190 112663 103935 118521 106213 100462 107328 93457
9840 93457 95138 115571 102366 91444 76843 58186 59357 57062 45586 50487 40839 41860 36699
9827 36699 6642 -16621 -30860 -14404 -3986 26639 34012 36253 38561 25752 27455 33088 37704
9814 37704 66087 63686 45126 31440 47459 39332 31685 39549 35146 31097 30283 25016 16174 30471
9800 30471 51288 58826 79001 69072 70771 73392 60267 51635 26411 20679 39642 48909 48087 26126
9786 26126 18753 28436 35020 42728 47991 43981 58405 74196 80336 71555 54254 51547 71755 50012
9772 50012 39213 36009 42087 49974 27627 6834 -6282 -10624 -3085 9043 1406 20036 19125
9759 19125 24294 29476 23586 19042 2988 -8232 8280 21127 19211 16867 2918 8472 6907
9746 6907 10900 7999 9338 17949 18948 12944 -6580 -6393 5795 6209 2012 10960 13789 4456 -19262
9731 -19262 -33079 -27124 -12008 -8896 -9196 -10864 -7787 -20808 -6147 13262 13739 10762 -706 -6262
9717 -6262 -19588 -13235 -2201 780 9229 23191 17595 -782 -842 -2010 4564 -1603 739 27521
9703 27521 28688 16483 12608 16872 15100 -66 -15992 -5776 3830 7771 21401 9433 -12176
9690 -12176 -12697 5884 9936 6541 -1659 -9839 -5862 -13384 -15237 -1800 6765 5568 -1750 -9890
9676 -9890 -7187 -1650 -7621 2731 -5673 -18441 -843 15681 1098 7316 17358 16693 23709 12584
9662 12584 5921 -4589 -25816 -14035 2382 15615 9421 7363 283 14651 16015 14045 2402
9649 2402 -2431 -18231 -19457 -17858 -17356 11163 26975 19586 39459 54281 45218 10136 11184 17026
9635 17026 -7925 -11222 -9213 -4250 20919 11375 -13058 -21105 -18795 -22491 -29323 -17194 1719
9622 1719 10023 12543 2816 4204 7489 1507 -17381 -19196 -17615 -3224 -1136 -92 -667 13687
9608 13687 23602 25336 5953 -5048 -3700 4860 -5849 -13491 -13829 -9945 20572 21979 10134 -3473
9594 -3473 1892 10436 4547 -1249 15519 15752 19274 19133 -2996 758 12090 14056 4209 -5909
9580 -5909 -2634 4911 14932 6351 13245 9040 35111 40825 1643 -12598 -2799 -12348 -4444 -607
9566 -607 -6447 -3129 839 -8 -7558 625 -12635 -31389 -20410 8310 -2579 -5034 -7672 -25547
9552 -25547 -40266 -40605 -35750 -29398 -23409 -6543 -8011 -17291 -14750 -9050 -12981 -4938 -21289 -32199
9538 -32199 -46033 -33415 -16077 13442 32510 29956 24988 23320 28243 22930 6019 8235 6855
9525 6855 -10788 8409 9482 16752 16231 16129 13129 11434 -70 -1284 3490 -12581 -16118 -4418
9511 -4418 406 -11484 -12970 -1841 4243 9250 11676 -4445 -5977 5535 5305 4397 8345 20950
9497 20950 18914 5352 -9795 -12699 13208 25642 27792 11555 -782 -17039 -25648 -20013 -16633
9484 -16633 8511 15545 20551 17149 11076 9454 -6977 -1587 3843 -12598 -21193 -7031 3748
9471 3748 -7252 6439 17263 27286 7050 14618 5561 -10848 -9138 -7001 412 2236 28813
9458 28813 38847 27007 11398 6658 -5179 -2580 8973 -4559 -14633 -22771 -29722 -20973 -32481
9445 -32481 -26322 -6035 2877 -6204 -13461 -7615 -14503 5780 19301 11194 17742 7450 18524
9432 18524 30340 13367 -5112 -19915 -21767 -16662 -13202 -25482 -20705 -5416 -18924 -16778 -9407
9419 -9407 -176 -17368 -5248 16138 18424 28249 25083 20305 10609 12100 -11992 -15176 -25846 -18722
9405 -18722 6076 20589 2692 -12863 2079 16588 6919 6143 27205 16686 -1836 -15521
9393 -15521 -29250 -42070 -38278 -33122 -35597 -31366 -3895 -1431 5624 20236 13905 -19271 -16465
9380 -16465 8927 8393 3402 175 -6064 -13716 -18999 -4321 24573 57990 43706 19659 12290
9367 12290 27699 13992 -3774 7584 11047 17576 22199 21424 5336 7760 -7716 -6808 -9190 -229
9353 -229 -15938 -10991 -2205 11786 8055 18941 22709 9300 -10652 -4644 9070 19770 37728
9340 37728 49996 61547 40311 11396 -888 -7288 10193 42566 30237 9785 6389 13648
9328 13648 11766 14934 26376 30948 31980 18162 12248 5734 10781 5160 -1448 3927 -3665 -8941
9314 -8941 -13768 -5439 -6000 -21471 -23290 -6130 28820 31749 21890 5524 8076 17601 -1487 -11145
9300 -11145 -8480 -19982 -27493 -17795 -4570 13926 7278 19105 13599 -20792 -10866 10532 24133
9287 24133 7551 13645 15252 14429 3159 -9475 -2691 9145 9051 9887 12558 14694 21419 25808 33500
9272 33500 21656 26619 22233 14646 23007 23708 1353 -9211 4588 11808 17845 18263 25323 29801
9258 29801 32819 14689 9170 -1216 -15924 -12432 8241 4615 15792 42966 39516 25188 22046
9245 22046 26398 32310 16186 4445 11367 25591 44027 34152 43895 51418 35770 20285 9603
9232 9603 8953 31640 69092 66874 43960 35113 39747 29028 44823 66173 63901 53096 41236
9219 41236 34181 28023 17369 29294 34113 31737 45495 59426 69074 75281 65524 59304 46906
9206 46906 46984 60657 58546 48883 20961 12391 23057 27202 33946 46667 59827 72624 99743
9193 99743 97471 91785 81132 80433 69704 55145 62189 63651 58159 53978 62229 67083 78936 70513
9179 70513 65447 82908 77578 60445 65545 87484 77405 81520 75146 72098 69736 72633 59844
9166 59844 73345 60564 50826 68382 88519 97768 97540 100512 98731 97696 89229 74666 82627 108072
9152 108072 114533 118366 113912 108917 109612 108641 116894 111230 108983 111785 111559 110072 130784 147873 150465
9137 150465 155171 148000 159551 168716 166704 163069 185120 202504 212685 208470 205747 207997 222951
9124 222951 212407 194213 224156 253287 257932 252473 262614 270457 272788 282882 286831 284564 294283
9111 294283 307123 306912 314383 326567 356202 376496 387978 387839 398198 410702 426851 450594 459829
9098 459829 478537 514900 556876 562482 574517 595963 613392 630120 668311 721885 739530 764710
9086 764710 810901 844340 887390 929095 960081 1005329 1060262 1098305 1125281 1162781 1209842 1246025
9074 1246025 1285078 1322485 1350820 1385050 1412535 1455980 1518848 1554358 1575650 1606167 1628293
9063 1628293 1628774 1619413 1613365 1617187 1605564 1601016 1585943 1557647 1536702 1513396 1502465 1469250 1431551
9050 1431551 1381612 1350184 1307366 1271615 1232306 1173341 1145730 1122745 1085887 1058408 1027361
9039 1027361 982772 944105 915619 889759 844252 823907 802150 788752 776511 756405 736109
9028 736109 702613 670329 667948 654845 644998 619491 594887 576281 558690 537893 537748 529270 510822
9015 510822 502901 492034 460195 437085 425706 397643 389601 398370 396580 387428 379229 391147 383225
9002 383225 352486 346624 341266 336184 324494 319669 316883 299476 297540 302589 290038 283329 264753
8989 264753 239749 226011 221614 203439 200739 212212 202990 210663 220298 211821 201157 199660 180844
8976 180844 171349 177699 174035 151501 152652 153765 152670 146350 151444 152400 152900 148055 137851 135729
8962 135729 145171 140610 128473 124809 124451 118315 113649 118052 116981 123727 143568 133901 124186 143852
8948 143852 132283 133986 138097 131511 128438 129913 121171 103968 93711 106034 100027 112590 114031
8935 114031 105680 108096 98049 84464 84811 74868 76309 74557 66460 64063 81345 108923 87879
8922 87879 78673 68225 51995 40086 45462 69982 52344 58551 80349 86491 84439 55216 49449
8909 49449 61735 62587 41593 43312 68003 71257 69282 76013 80809 69834 43410 33427 44468
8896 44468 62359 58058 51716 42438 57963 65797 60481 42643 23916 24547 20827 30010 42633 53631
8882 53631 49943 42409 43716 59503 66327 64943 73939 74696 67141 49631 48570 52097 39242 44217
8868 44217 48162 43899 27346 15801 11976 26484 18166 41228 41657 23020 33878 45396 34814
8855 34814 32255 22871 15118 5762 500 13414 8954 13260 13647 -9925 -9470 -1722 17550 15176
8841 15176 17036 15170 17208 34257 34211 34236 32518 20932 14770 28100 31058 57540 65158 53182
8827 53182 40278 40570 23538 19878 15409 3133 -3365 7320 21316 26501 27325 27877 39903 37439
8813 37439 24170 25625 22652 21747 37159 34715 25133 27385 14665 -2557 1901 9312 10349 7830
8799 7830 4978 19153 26818 30257 32411 38472 46860 27684 -5625 -29059 -33363 -22409 -11719
8786 -11719 5091 17801 16725 17705 1513 -14844 -18983 -11754 6326 10793 -998 7464 11472
8773 11472 5672 20835 7564 14621 25995 8654 24510 39798 15918 8452 11276 1467 3033
8760 3033 -6945 -5169 10198 17566 23485 20301 19902 13776 15147 7378 -5186 -14203 -11284 5325
8746 5325 14988 14554 24289 21114 20437 21804 14472 1120 18322 25641 8741 1912 2722 -10814 1170
8731 1170 11337 19974 24946 23571 15829 7791 -2580 2091 20355 34743 41417 29502 27331 31625
8717 31625 39651 49348 54614 58516 47635 50797 39872 21089 17024 19893 21308 13249 37906 49054
8703 49054 43840 36311 42497 39038 34825 35597 46729 39113 32982 29834 16874 20774 17012 26797
8689 26797 38122 32850 18956 17394 29206 12292 15510 36585 31561 17709 28262 52269 60576
8676 60576 69090 80764 61401 31666 35107 52208 59929 62701 45300 46869 41505 48084 48516 50711
8662 50711 73159 82801 80923 78804 65080 63894 88669 74769 49981 56280 46971 44657 65467
8649 65467 74573 47842 37772 44850 46915 52545 72452 91100 95187 115875 101881 93952 96801
8636 96801 84356 83591 98722 108351 94344 89616 96650 96008 109798 122176 122364 120500 117590 108567
8622 108567 105699 99242 100675 86607 80277 59531 36879 32917 64918 79999 74013 58378 46240
8609 46240 52860 54605 50752 39399 27598 37060 36055 47959 43890 27559 28535 35027 34700 50879
8595 50879 55277 64352 71166 66806 51417 46117 33121 38093 50386 51673 37976 43648 35074 43452
8581 43452 37357 43249 45354 36773 35113 52513 49352 35695 36782 42242 40985 52987 44870 46586
8567 46586 66499 65832 67408 68269 49977 35759 30830 33024 39028 60337 64216 56216 50422 49992
8553 49992 46297 58405 66875 81175 87120 78290 83684 74551 78871 71112 68949 49106 23629 31155
8539 31155 40971 54818 49085 38268 28668 36799 32215 22535 20752 20452 21127 28533 22990 17062 18830
8524 18830 19946 41625 55579 43006 19618 9067 11913 14572 22277 36845 31340 25021 45060
8511 45060 43027 26113 17898 15882 17079 14284 11338 18799 30335 38130 47228 52863 40500 32785
8497 32785 46560 61799 66012 77064 83541 69244 64352 55252 49697 40163 35382 19386 7916
8484 7916 878 13434 25282 20456 20889 31350 14174 -3299 2715 12971 8375 -556 4734 7536
8470 7536 21711 27235 19850 890 -9857 4640 13705 27879 35461 33309 38561 41160 33655 42546
8456 42546 40098 33548 31327 7624 11728 22855 25394 21864 19236 32136 59050 60918 47929
8443 47929 38675 32644 9273 3693 2954 9616 21803 -2691 -7096 -2204 4353 8041 -2455 -12126
8429 -12126 -7356 -2022 -9924 4886 14585 9751 14187 15037 16477 36963 28085 14959 20569 26157
8415 26157 16380 26609 22805 31069 30797 20626 20156 25248 22306 21955 35064 34414 33613 29755 33805
8400 33805 35911 33186 30843 29036 34617 50781 37667 21396 20687 5133 -266 -2063 4932 29515
8386 29515 54230 33718 9473 3267 20649 23522 15181 10645 5412 -338 7772 4267 223 -1015
8372 -1015 2705 22656 32000 34366 39782 39585 19746 21803 28343 26861 14961 9464 5910 -10778
8358 -10778 -26183 -28159 -3281 2421 -358 12871 30380 28863 16027 21010 15443 17197 505
8345 505 -23261 -17722 -2549 6473 3679 -634 13033 20742 25852 40884 41635 36968 24617 10163
8331 10163 4166 9351 17495 14213 5920 -6107 -16304 -22570 -14249 -22700 -20326 -8942 11341 9477
8317 9477 -3234 15526 32579 36434 29382 8060 5411 9506 -7120 -19586 -15829 -18976 -10383
8304 -10383 -8751 -2329 20117 23482 16763 9009 16366 31104 22243 3691 18282 33941 19671
8291 19671 -1495 877 8429 17867 15470 2294 -4446 6865 35956 51276 39583 24191 23341
8278 23341 10474 4510 15626 3481 9298 -382 5101 42984 48504 31590 31604 25810 35723 38635
8264 38635 25511 2179 -11235 -8697 1535 -8347 -17952 10463 27053 34325 23390 18745 12957
8251 12957 13327 7801 7690 5583 19308 7348 7675 26119 17521 13352 15423 4995 -14370 -17159
8237 -17159 -10946 -16390 -1772 15932 34797 33499 26352 13615 12551 6206 4222 13622 25396
8224 25396 22506 14552 12376 14242 21589 46849 43089 18712 10870 8394 7056 11448 -2752 -13135
8210 -13135 -21479 11531 -544 -15924 -20667 -3968 -6850 -7426 -5083 337 15711 12446 -7898
8197 -7898 -10146 -8264 -7599 -4904 -23 -1320 -22142 -20539 -7179 209 -5167 -16959 -18291 -26219
8183 -26219 -40275 -36948 -40732 -32446 -15057 -5792 -13809 -2283 7864 9840 17789 22279 17569 19697
8169 19697 30354 31890 28873 25876 19424 14264 9058 -1206 10015 28974 21307 14459 27254
8156 27254 23380 25875 33948 29766 18198 13381 9579 -5799 10293 1004 -32500 -21635 -22406 -19581
8142 -19581 -319 -17197 -32022 -13230 -24002 -18315 -4116 -5690 4046 -9419 -22371 -15963 -826
8129 -826 15154 2376 4478 -5099 -8095 10144 9193 15993 24196 13222 -149 12007 22383 25514
8115 25514 46213 44837 19210 4104 -1785 -1534 4546 -23246 -13761 2115 -412 2754 13661
8102 13661 17441 24612 24868 21855 24572 35816 39124 24046 9863 8311 3941 -15431 -23228 -22368
8088 -22368 -558 16857 21013 6741 -3850 2889 9788 3297 25327 26932 8815 -2700 12370
8075 12370 20821 35815 39952 35725 50353 53245 34842 43422 44274 34384 24950 20718 33915 43221
8061 43221 48889 60056 48771 15369 -12178 -13479 220 19242 19850 34940 40360 41900 45260
8048 45260 48077 43057 47048 46508 48040 61121 57665 69654 61018 41800 29411 55578 75523
8035 75523 66059 76402 74362 70316 62777 68317 80960 72371 69678 82217 73055 79727 82568 69789
8021 69789 59183 55207 68564 68405 35563 24759 30008 40702 45557 76903 78885 49447 50060
8008 50060 56630 72118 88320 107019 119989 115919 97884 92537 117396 147818 165071 149616
7996 149616 150238 164503 153373 137935 127414 136454 160378 157022 159979 155044 154307 152874 149893 130608
7982 130608 126421 137153 137789 132244 138259 130917 123392 116985 125564 127056 119009 116354 118579 123348
7968 123348 125504 128621 128537 107114 95558 98901 115610 124328 138691 152372 163669 154344 125554
7955 125554 115287 133515 137162 133486 134555 147710 144655 145364 152381 151636 152583 156108 157079 142946
7941 142946 134197 109308 101412 101141 100902 99916 99216 85696 88543 104026 91375 76150 68858 86267
7927 86267 88210 85978 88297 81911 76059 92794 70192 45891 48430 67215 81700 75537 69912
7914 69912 69551 54185 48884 49801 50968 41589 42851 53084 57171 61541 47029 36445 21180 29373
7900 29373 26722 25743 25424 46579 68697 51504 41719 25775 19436 15621 47049 68096 51367
7887 51367 40754 43128 34014 30389 38712 42917 30942 39490 47455 55235 40338 37083 37001 38975
7873 38975 32577 34380 16644 3 -4393 -1487 7853 5419 5777 112 -3236 -7715 -3051 15441
7859 15441 9507 232 10608 5170 -897 -1719 -8354 14246 24443 30771 26380 1885 9680 -3340
7845 -3340 -4699 -12598 -17874 -19486 -10017 -13053 -12388 -7385 1315 -1134 -4889 14575 36928 40723 32952
7830 32952 25735 27513 25568 18548 17644 8780 7483 1006 -18911 -27259 -34248 -22378 -7963 4398
7816 4398 -4686 -11266 -18212 -10412 -663 8662 7691 5141 13840 11279 11449 10343 5406 -25887 -14646
7801 -14646 -15726 -18480 2445 -9284 -7932 9372 14892 23389 30447 31920 18668 481 -2615
7788 -2615 15702 5766 2113 17027 23519 23247 15996 8937 -736 5520 3027 -16150 -16387 -3362
7774 -3362 9245 16400 19998 5343 -17012 -25468 -38388 -37427 -21313 -1288 4565 2138 3342 10824
7760 10824 836 -7468 -3400 5492 -6709 -10930 -11022 -924 -3236 -18465 -20995 -18531 976 8465
7746 8465 7930 -3135 -2301 24451 38132 13899 648 -6277 -20443 4738 17259 4278 -5025
7733 -5025 -8818 -6848 -9783 -14206 -38482 -38269 -15876 -4704 -1578 -15163 -4058 865 -22679 -30070
7719 -30070 -17821 -9513 -7494 -1075 13037 15198 -7063 -8831 10454 14894 7355 14676 247
7706 247 -444 -10950 -22637 -35784 -23980 -24464 -17682 -20029 -8372 -8060 9648 8596 -13548 -29873
7692 -29873 -12488 555 11319 18853 17975 16868 12786 9977 10308 -6665 -12464 13411 7407 3782
7678 3782 15666 19313 -2495 -10510 1919 11994 3843 14065 30 -13428 -4551 3267 -8093
7665 -8093 -76 -2009 -27345 -16243 4918 6338 20132 16397 7106 8403 -4409 -862 4176 -5902
7651 -5902 -16071 -27306 -32156 -29907 -35179 -39769 -24865 -4009 -6727 -34829 -36828 -22331 -30970
7638 -30970 -30259 -19761 -23329 -12506 -9106 -27515 -7408 32357 46575 32372 29077 23415 19099
7625 19099 739 -14997 -18874 -12077 -1813 -15031 -15898 12683 2979 -16520 -28819 -18981 -6292
7612 -6292 -16522 -24590 -12596 -9789 9924 15293 7616 -3346 -10874 -7813 -21611 -19349 -10464 -11218
7598 -11218 -8842 -14127 -16172 -19819 -23481 -33259 -22391 -17631 -14036 -14726 -1269 4531 7638 19093
7584 19093 37953 38541 32414 19739 11043 -7526 -16938 -13469 -25194 -26698 -28133 -24737 -15422 -15716
7570 -15716 -15025 -22974 -17464 12687 17704 5829 -14154 -19652 -2707 -7972 -15681 -4258 14373
7557 14373 15977 6021 2541 -5518 -720 6260 -24908 -25464 -20243 -11983 -17473 -20899 -21266 -9605 -10661
7542 -10661 -8761 -2567 -9794 -10279 -3261 -7129 -4025 5458 -724 -6705 -18527 -16892 -9576 14027
7528 14027 20815 5556 -1597 -8909 -10222 -19211 -15072 -5800 -18504 -18559 -21469 -24301 -22664 -16067 -7387
7513 -7387 -12479 -22547 -33439 -43952 -60401 -49115 -28310 -11204 -7635 -4868 4404 2582 10052
7500 10052 7884 -3565 -6238 -997 8534 3015 -20484 -21960 -5150 3231 -8017 -1979 2097 -10485
7486 -10485 -48705 -50178 -24986 -6911 1100 -6502 -16810 -11711 1669 -3579 247 7021 -5333
7473 -5333 3838 14151 240 -7948 -14860 -40487 -29905 -15455 -7986 -9762 -2230 1188 -4564 -14425
7459 -14425 -16010 -16612 -11555 770 -12228 -2118 -10267 -10523 -1102 -6617 3544 2674 10898 25955
7445 25955 42595 47280 30147 22732 26575 17795 27410 34424 28791 6220 -3597 11592 10414 -17896
7431 -17896 -28862 -16479 -12597 -26827 -19025 -17103 -12245 -16354 -9581 14542 2909 -1743 -2229 -3695
7417 -3695 -4874 4078 2151 -8189 -12336 3390 12739 20561 3019 -12187 -16879 -15901 -7802 -7237
7403 -7237 -7954 7577 12008 -4187 -14560 4723 9132 -2889 -3907 -20600 -34688 -18673 2030
7390 2030 5443 10380 8869 -12383 -14060 1857 3659 3010 1489 -19468 -30095 -13478 -6317 -3068
7376 -3068 -4814 11318 13237 -3547 20086 22310 6210 2252 -2350 2504 7974 9191 2397 -6223
7362 -6223 -20430 -15978 -3871 4822 9294 1599 15311 2547 5706 19886 10994 8375 1603 -4487
7348 -4487 -22990 -22913 -13562 -21858 -50306 -49677 -27929 -10686 -2933 15954 20250 4301 -18796 -34857
7334 -34857 -25521 -20185 -8022 -11770 3180 19610 3538 -18885 -28756 -25546 -24099 -34357 -24095
7321 -24095 -5664 14792 8404 1669 12048 10820 -4458 -7495 4066 19714 -603 -25977 -37888
7308 -37888 -26234 -11957 -7621 -4016 -11378 -37283 -38072 -20827 -18653 -30457 -32399 -37186 -14024
7295 -14024 -6324 -22449 -19029 1617 8793 -7500 -21840 -31595 -33903 -35354 -16177 -852 -1686
7282 -1686 -15161 -9729 5671 -11503 -5910 12734 10776 -4628 -17076 -2421 10665 -4546 -17363
7269 -17363 -9036 15522 35548 3380 -22849 -16917 -17460 -20704 -32582 -39043 -27738 -19879 -23535
7256 -23535 -17396 -10436 -9360 4487 3697 10689 21924 12667 -11468 -2747 -1110 -9567 -5122 239
7242 239 10877 22793 33901 45963 36359 27183 10832 -5720 -5248 -5294 -8596 -7213 -9856 -14283
7228 -14283 -7025 -3614 -9231 -7118 -10637 -10942 -12382 12131 4377 4189 8937 7276 -6517 -18160
7214 -18160 -24975 -31600 -35168 -36363 -23797 -21383 -26002 -18873 -29410 -16017 4582 31770 35383
7201 35383 9665 14343 8597 9413 17924 27624 21406 5742 -4113 -15050 -11862 -829 -2585 2634
7187 2634 -4445 6582 1359 -4984 -7055 -3370 -10695 -6916 -17363 -30639 -35799 -24643 -14820 -28192
7173 -28192 -40499 -35086 -19966 -17145 -20180 -9816 -5486 -20044 -36421 -32043 -26137 -31602 -44625
7160 -44625 -53091 -56988 -50450 -39908 -32283 -29809 -16657 8475 21481 17612 13427 20950 14774 6853
7146 6853 -15949 -2859 7422 18074 21120 8071 -270 4811 -22106 -31023 -35175 -22267 -21549
7133 -21549 -16840 2143 14756 2711 -15380 -19273 -36038 -24110 -18421 -14371 8085 9171 7862
7120 7862 11067 4814 9683 27104 26675 25913 22085 10154 276 14816 18024 25082 40528 32610
7106 32610 21865 18969 22224 24705 26807 10791 -1770 -8283 -20480 -20119 -14537 5908 -15033
7093 -15033 -34347 -27393 -7778 -14989 -20156 -24475 -18514 -23925 -12042 -3594 -18535 -31372 -43816
7080 -43816 -39732 -31091 -19094 -21198 -24264 2596 15226 17218 -3047 -16683 -4023 12233 23386
7067 23386 26814 22909 9866 2684 13732 20239 -1997 -10453 -9134 -4538 -20774 -12553 2018
7054 2018 -650 1316 -4891 -12974 -10264 -9232 -11627 -2415 15495 12915 -257 1260 13649 18731
7040 18731 3136 -5900 -19691 -38016 -54738 -40543 -8214 -3296 6737 -7541 -10882 -763
7028 -763 -7499 -1612 -1589 11295 30243 29631 12513 -2378 7637 29571 32127 35284 27549 13615
7014 13615 -13322 -20002 -20032 1628 4569 -4099 -13741 -20969 -19586 -1986 -9223 -3709 6614 3243
7000 3243 -2460 -137 5336 2892 -10414 4556 6359 6948 11463 12526 6483 12899 13328 13040 9133
6985 9133 5337 -5425 8406 6802 6154 20205 23497 25788 2360 12319 25613 17229 17791 14536
6971 14536 13746 20954 21546 20549 -14153 -20597 -14052 -1723 6252 18991 16770 8777 5039 -14451
6957 -14451 -33491 -31299 -12414 11613 22279 -6736 -20310 -29951 -33703 -36231 -17601 8565 2749
6944 2749 -21000 -25800 -15037 -3840 -2641 12125 8637 -351 -8542 -18131 -26374 -23955 -30314 -12304
6930 -12304 -9087 -12071 4574 504 -19338 -20034 6649 26496 40782 45063 36099 26561 30167 10625
6916 10625 1964 8063 19869 6759 2261 11270 10113 13605 26978 28808 19968 23403 17947 -3555
6902 -3555 7999 25270 18060 17225 13132 11675 3738 -14658 1365 9122 1219 -676 -1236 9190
6888 9190 9999 -5198 -9539 -3198 -14666 -30647 -21684 15736 20231 8531 -905 -759 4533 24531
6874 24531 30247 18045 27909 15166 4523 3934 8136 6878 -16303 -22779 -14637 12213 9202 -4067
6860 -4067 -15090 -22971 -3588 14083 4804 4798 -1268 11346 21790 7921 -4211 -14622 -3053
6847 -3053 -1547 -14145 -25576 -29938 -13551 -4916 -7478 -5847 363 -510 17699 23821 11869 -3654
6833 -3654 9053 20296 27904 9110 12290 13196 -9741 -2372 -2168 1197 15532 11429 3518 6578
6819 6578 965 1112 12068 16743 -687 -4108 -6307 -17998 -26581 -32660 -19998 -3067 15918 16769
6805 16769 9387 8208 7086 -534 5149 -3267 -6048 7016 6696 -17035 -21424 -12618 -974 7249
6791 7249 28143 32719 25885 4474 -6572 -2411 -6238 -17599 -9157 277 6550 6850 15960 14076
6777 14076 26737 54578 69023 79894 84491 95927 97934 79423 73472 72625 56767 22327 31820
6764 31820 39154 51173 50647 32677 23591 32625 30877 20184 3216 -4274 9148 8879 -4395 -13398
6750 -13398 7517 21710 43353 34730 15387 8070 27090 8672 4652 12668 14677 -13917 -19544
6737 -19544 8456 18186 13600 10123 17522 13292 2508 9459 11174 -1159 756 -10510 -16404 988
6723 988 17708 18111 10311 3629 -2214 -13525 -23100 -22617 -13081 -20189 -7186 7893 -8124 -25242
6709 -25242 -25059 -16643 -12100 2406 13724 4257 -17388 -33723 -23708 -17654 -23462 -13327 -8049
6696 -8049 1199 -3030 -10330 4159 22847 7156 -730 3016 15950 7097 -27264 -30166 -2093
6683 -2093 8097 13195 16072 17032 19197 3147 -8615 -8925 11906 -15390 -25557 4614 309 2020
6669 2020 3314 -5965 11000 23338 7564 -4570 -22309 -18378 4196 27209 11086 3322 14159
6656 14159 21603 15591 7496 -11136 -29312 -31187 -10603 7271 14145 1641 -17761 -6846 -1608
6643 -1608 -592 7741 -350 -12822 -13717 -11436 12740 17801 -2941 -9275 7324 -4488 -9897 7048
6629 7048 19868 -1084 -6844 -1298 1931 -1976 4689 6682 9214 11956 16685 26514 7695 -17390
6615 -17390 -2247 -2010 1392 2970 9033 19533 23443 15110 17787 11866 3196 -20876 -19371 -974
6601 -974 14761 2022 5401 2319 10407 1062 -4764 11747 6311 -6153 -12184 -17750 -4449 -356
6587 -356 -802 4207 18565 26421 529 -2007 669 4118 -1239 -6786 -8037 -9745 235 9760 7512
6572 7512 2322 -2235 698 -815 -5883 -12673 -11896 -11242 -18071 -27498 -29164 -28254 -19646 -11411 -13986 -4692
6556 -4692 -4554 -3679 3040 12484 21048 30128 19396 18346 17132 -18413 -33215 -20703 -11093 -5785
6542 -5785 2999 24461 10172 -8270 -23000 -19242 -13094 2369 25299 16032 -4526 -12297 -7355
6529 -7355 -31134 -35522 -16711 2615 20221 22449 20794 7664 13395 9812 -8282 -6525 -3657
6516 -3657 1454 -8314 -17480 -24951 -19819 3905 14337 5308 -5331 5424 3593 -11634 676
6503 676 -5169 -20939 -33042 -26177 -21828 -17067 -7414 -10563 -19769 -15506 -15109 -7872 1249 -36772 -50839
6488 -50839 -30678 -15987 -12075 -704 15555 28819 13549 14751 21322 -10030 -16574 -23830 -12827
6475 -12827 -9125 -9421 269 22849 18287 10586 12389 18633 14448 9823 12936 6006 11175 4473 -1545
6460 -1545 1836 6338 8127 10827 -855 -3608 -9895 -11862 -21735 -22713 -19828 -6933 -8374 -16690 -38396
6445 -38396 -49175 -47151 -25024 -16374 -33502 -45986 -23649 -10255 -6473 -7314 -2942 37648 47944
6432 47944 41007 30113 5445 1175 -6474 -9378 -19134 -22211 -22841 -23089 -19572 -5005 -5045 -268 2396
6417 2396 -16212 -34300 -20571 -9439 -10479 -15149 -13660 -13951 -14269 -15468 -16573 -6788 4661 -7967
6403 -7967 -773 -16099 -16652 2625 3225 907 -9214 -29051 -37712 -32321 -19715 -21839 -23875 -8502
6389 -8502 781 -16578 -24963 -8209 3446 902 2996 19367 16220 7468 1916 18073 20131 17963
6375 17963 6189 -8868 -7578 -30265 -45952 -31857 -15814 -23817 -31607 -31314 -20211 -24631 -31656
6362 -31656 -32443 -96 7405 14184 21340 2105 -7503 -8438 -1344 1343 6230 -2610 -15852 -32866
6348 -32866 -45290 -28735 -1031 4253 -1395 -4851 7800 4973 -25225 -56761 -54514 -41766 -41247
6335 -41247 -39636 -46870 -41482 -47537 -45468 -27158 -23287 -30227 -20457 -63 4414 5341 4566 -2900 -11643
6320 -11643 -6016 14159 13926 9561 -12590 -16898 -21537 -26219 -30367 -24566 -15857 -6109 -13182 -11168
6306 -11168 -671 11454 13737 14392 12082 12857 10965 19104 6638 -4407 -6122 116 -727 -10514
6292 -10514 -23974 -14814 -8773 12529 11466 15038 8960 -474 -2831 -4743 -20525 -41567 -29191
6279 -29191 -10709 -12760 -8186 2926 -2958 2209 4632 19970 16342 25356 33394 18387 -2323
6266 -2323 -18233 -14536 -16568 -18800 -11169 4632 8653 10509 1455 1877 -13436 -4809 26415 19641
6252 19641 -11523 -4522 -6316 -12464 -3659 -7202 -18781 -41079 -48120 -41055 -42090 -19686 5887
6239 5887 12311 -8801 -28536 -10795 -11268 -15793 -29619 -10297 -1290 -26892 -39646 -28517 -32705
6226 -32705 -18476 -21754 -21114 -22686 -24762 -30483 -24821 -25576 -28087 -28376 -25739 -3830 -1801 -18171 -25133
6211 -25133 -19857 -22287 -9231 -7849 -9221 -10696 -18917 -12130 -17427 -22355 -18312 -28946 -11779 -4533
6197 -4533 14084 -3557 -4633 18285 34770 31365 32540 29400 14282 217 -3232 -308 6338
6184 6338 16199 20874 14703 6446 -7638 -12369 -1637 7368 -4910 -14346 -5909 -7479 -5124 -2657
6170 -2657 -14713 -12337 -13009 -5076 22257 35180 20833 25407 19912 3710 25459 42666 33974
6157 33974 6464 -11708 -4280 10195 6712 2622 12738 9968 -5821 -16367 -30371 -12541 137
6144 137 11515 10423 2142 15550 14778 21792 27547 30063 19907 7823 -7477 6647 20439 14415
6130 14415 11946 -4032 -8466 -22849 -19168 -31142 -27426 -14956 -1960 -4304 -7823 -25437 -30717
6117 -30717 -52629 -58659 -40944 -45189 -41272 -32174 -15559 -7343 15163 25568 29625 28632 -1276
6104 -1276 -3933 11696 16043 12184 11917 12953 16494 15442 22640 21620 21225 14475 17584 17611 24117 32667
6088 32667 28310 32069 21491 -16009 -37273 -47781 -41200 -15387 -7659 -11500 -5671 -6872 -16332
6075 -16332 -29784 -37776 -27031 -26501 -18572 -6442 -8156 -6301 15284 22408 21633 18561 23787 12582
6061 12582 -3746 -34200 -15938 11615 21075 7678 -3554 -10635 -29119 -38128 -42437 -32226 -28019
6048 -28019 -30721 -14869 -9361 -30558 -29789 -33160 -46100 -41660 -18350 -23446 -43519 -51409 -59028 -46830
6034 -46830 -47325 -54320 -35826 -21042 9091 12326 8629 13421 14673 18913 14538 -4014 4472 17788
6020 17788 19686 31604 23203 -1359 -17369 -12083 -9035 -14778 -7553 8899 15195 6512 16981
6007 16981 -4293 -27367 -35556 -11923 1841 18489 18574 14603 7722 23900 16564 24065 23891 16650
5993 16650 3388 -1591 -17897 -10782 -8235 -20936 -17509 -728 2704 -1625 -6875 -8261 -12055 -28416
5979 -28416 -38180 -22481 -1169 -2646 -17463 -5518 -9096 -17956 -12238 1748 -2195 -751 -1155 -12266
5965 -12266 -16236 -18032 -22864 -21589 -12171 -4829 -8810 -9249 -18813 -15887 7167 1973 2649 3470 -736
5950 -736 -405 24468 12443 5846 20314 24754 28625 10660 -5692 5091 -9106 -22479 -11844
5937 -11844 -19080 -33611 -30341 -23415 -16222 -24405 -31814 -42724 -50021 -42173 -28683 -31085 -31408 -24977
5923 -24977 -28119 -25395 -17214 -23676 -18067 -14482 -5691 -21062 -3998 6535 10846 9372 5678 -12246
5909 -12246 1429 -467 -2957 8300 -11392 -33178 -38153 -30974 -26924 -14794 -11284 -19673 -29403
5896 -29403 -12546 -15232 -14197 -19278 -27054 -37168 -24940 -29020 -27413 -39004 -37320 -31976 -19493
5883 -19493 -14556 9404 -6798 -16369 -23504 -30134 -21358 -23260 -26295 -27460 -35213 -41263 -32299 -27650
5869 -27650 -25269 -28346 -34818 -54025 -52262 -25989 -11325 -2595 -3455 -8634 -17809 -16553 -5098 5242
5855 5242 -2189 -9046 -5838 -7237 -13828 -22959 -18742 -2004 -10121 -25420 -26842 -9826 4830 9476
5841 9476 20318 16752 -7752 9373 27894 27397 29577 20197 13092 13252 15888 16398 25366 -369
5827 -369 -15867 -14968 -7772 -8422 -5547 17326 22025 2904 -21485 -32779 -43371 -40276 -16842 -5420
5813 -5420 -5104 11713 15064 4240 -600 5332 11090 16222 24279 41569 26778 2673 -17482 -29960
5799 -29960 -24164 -11924 -10572 -5272 -18775 -37938 -21869 -13466 -20533 -24310 -19546 -13315 -7822 -531
5785 -531 -8940 -483 25890 26083 6437 13550 1508 4243 -17924 -21683 -15813 -3106 -13483 -9473
5771 -9473 319 17355 28687 21010 4950 -4672 -21767 -14294 -12237 -11318 -474 9195 9833 -337
5757 -337 3088 -9324 -14104 -8955 16815 38851 47227 37488 11273 21384 23684 31308 44476 37382
5743 37382 23059 17705 10169 11243 -4872 -10732 -9345 -3163 -6938 -24046 -24466 -19253 9621 27649
5729 27649 27370 1692 -19405 -19776 -19218 -12103 -11650 -22181 -28255 -12009 -8362 7691 22775 17126
5715 17126 1830 10543 2537 -16513 -8110 489 -25853 -32165 -8878 -3684 -18596 -18606 -1940 -1175
5701 -1175 4389 -10222 140 14453 11620 10009 11477 19616 20821 16565 1639 939 -11577 -27660
5687 -27660 -19706 65 9038 18602 12170 6924 16320 4232 -14424 4294 5400 5020 1711 -2614
5673 -2614 -1680 3601 2666 -10490 -13449 -2447 793 -9131 4179 19494 25216 8364 -5706 -5256
5659 -5256 -12882 -29252 -38301 -28666 -13010 -1460 4909 5705 1130 -20240 -42288 -42608 -27042 -18017
5645 -18017 -13866 -18613 -25174 -13024 -2369 -8219 -22721 -3409 -2025 -6242 6519 -3384 -9695
5632 -9695 -6275 -13228 -8334 -4471 -6726 -10780 4204 25672 20882 5445 729 -18931 -18360 -19465
5618 -19465 -12569 -1027 10030 10572 14953 1901 -809 -8328 10407 13578 15051 13645 4219 30442
5604 30442 33162 35574 14917 25135 13229 4284 -5110 -15174 -4322 -8322 -9611 -10337 -6252 -9813
5590 -9813 -14356 -22287 -2991 -664 -13878 -524 6256 -3524 -15983 -17024 9499 12254 6467 1028
5576 1028 7185 -5993 -10476 -5033 5642 14243 12690 21314 25883 38289 19387 -4701 -14030 -9406
5562 -9406 -4327 -9121 2363 -4883 -9743 3702 -511 -10126 -36084 -54977 -50206 -31500 -15263
5549 -15263 -1842 -427 592 9336 -9999 -14906 1566 4850 -2380 -14815 -2385 -7482 6300
5536 6300 10110 6650 -1897 -8719 -23378 -35073 -43542 -16751 -6381 -22704 -25966 -22562 -19743 -18797
5522 -18797 -21577 -28608 -27819 -33361 -32324 -29556 -17178 4814 -4012 2269 -15189 -24689 -23586 -31567
5508 -31567 -25715 -24711 -19243 -17646 -12533 -22357 -36715 -32288 -25731 853 20892 9406 15501 23096
5494 23096 30954 28916 36171 23640 20477 15661 -1029 -7313 -3158 -5424 -3723 -580 -8976 -11535
5480 -11535 9300 20359 21159 -11403 -6580 -932 -5854 5869 6921 2889 -6172 -12034 -7964 -5975
5466 -5975 22250 30933 26312 20156 1959 2928 395 -4918 3996 15826 18895 903 -2614 14336
5452 14336 470 -29421 -39052 -26333 -15473 -10105 -3271 -2857 -13194 -19652 -12621 -9134 -27256
5439 -27256 -23307 -25278 -25732 -18465 -25723 -9850 -18553 -28770 -30899 -20429 -13829 -12021 -1541 2456
5425 2456 -11152 -12179 -2855 -20178 -27176 -30357 -27143 -19986 -10127 -2930 -1105 4976 22784 35151
5411 35151 16371 -1672 -8714 -9004 2703 530 -3929 -25402 -37406 -27899 -10421 5007 -4859
5398 -4859 -8893 -25538 -23768 -14544 2141 12812 14028 8224 8247 -14777 -21531 -27951 -39446 -26548
5384 -26548 -274 1226 -6365 -15728 -33602 -47508 -55949 -44085 -22503 -8937 -10167 3875 15807
5371 15807 18115 11954 8050 6071 2283 10785 35065 30532 19572 2922 1489 5313 12587 68
5357 68 3503 -1283 -7548 -2548 9807 5163 -4947 -5897 -21113 -35105 -21332 -11137 6499 -912
5343 -912 -511 3313 -131 -9942 -4133 744 4444 3802 -5040 -3845 -23839 -32869 -40282 -37063 -15655
5328 -15655 -1615 -8785 -14461 -1192 5216 -14142 -21348 -12614 351 3941 -12075 -18224 4220
5315 4220 26193 35502 26569 18309 28584 19037 8971 -42 6766 27717 32556 17151 -8281
5302 -8281 -20277 -18376 7272 14575 5660 15680 21446 23164 24312 37806 32044 17599 10293 10389
5288 10389 889 9931 34229 19228 -7213 -1820 4031 -110 -18039 -22469 -15145 -8576 -4125 -6855
5274 -6855 -13774 -13747 -16904 -2855 16235 13477 2277 -6177 -6458 -3072 -9850 -30051 -20436 1560
5260 1560 10170 -2706 -6417 -12961 -16652 -18999 -11830 -14219 -28931 -10419 6434 -12183 -10217 6536
5246 6536 12927 12058 15070 5501 3525 -992 -5543 -6344 -1169 -2038 -17462 -14819 -17740 -9063 -6766
5231 -6766 -5340 -15547 -18166 -6759 -13882 -14937 -12986 10952 28048 32756 39817 17523 15881 10593
5217 10593 137 -394 -5804 -17101 -30118 -16869 3625 3815 766 -10037 -19507 -20026 -13414 -11293
5203 -11293 -12816 -14757 -10796 -2033 -3135 360 -447 4821 12588 12770 18510 10418 16933 29221 23562
5188 23562 22175 14240 -16346 -20255 -15639 -9141 3890 11953 4976 -6957 -1258 17401 15994 8121
5174 8121 -13004 -31088 -14135 -10240 -25550 -36001 -17089 902 -896 -2175 -4920 -14663 -28666
5161 -28666 -17519 4934 13125 3490 -20842 -27776 -37090 -32614 -13940 -283 3070 -5720 -10917
5148 -10917 -28491 -35134 -15802 -18925 -28381 -41995 -59960 -35291 -8132 -137 10984 28620 14686
5135 14686 7740 -7619 -4230 3464 909 10693 11855 13954 18536 7707 -6805 -12013 -10777 -1789
5121 -1789 -5216 1385 -14191 -4076 14239 10915 -777 -5663 -23265 -26564 -12161 -11837 -9098 606
5107 606 4930 -6698 -7892 3939 2186 3995 -4420 -6416 -13997 -13576 -8241 -8362 -19240 -22897 -24220
5092 -24220 -30346 -39257 -41427 -40171 -32366 -24655 -19072 -19685 -26310 -27637 -22230 -14226 -11278 -6337 -9797
5077 -9797 12111 17232 4056 -13478 -14109 -8631 14661 13106 11218 10215 27795 16002 50
5064 50 19740 19454 12806 -9539 -19553 -9522 3589 5184 6919 -24450 -24543 -14593 -12009 -10606 1877
5049 1877 9453 -11748 -47244 -33215 -21052 -5955 -2844 25088 35289 21061 1768 -8192 -26985
5036 -26985 -53277 -32397 -6551 10157 10853 12917 13370 18182 6654 -6906 -4436 -1709 14833
5023 14833 23111 16008 4423 11719 -3542 -25477 -6145 23601 13072 6054 593 1167 -1208
5010 -1208 2229 13224 -734 -7595 5578 -7236 -24343 -2469 838 -4463 -2202 -359 -5112
4997 -5112 7400 1769 3379 2516 8669 -585 -4047 -7269 -8290 -17172 -13329 2285 -4863 7847
4983 7847 9075 -8774 -12891 8923 3981 -2814 4338 -6745 -5691 17164 26752 23742 16023 1487
4969 1487 -8356 -9433 -5447 -6430 -19262 -30871 -25700 -1912 6274 22261 31979 15610 12201 -11989
4955 -11989 -11617 2704 -2196 -25049 -30263 -34253 -27137 -19698 -16069 8888 6207 -10519 -10405 -5564
4941 -5564 9536 13998 30494 21089 -4543 -5670 -10599 -15554 -5939 -7957 -14611 -17206 -9205 -11017
4927 -11017 -4962 460 -1016 -6782 -25906 -28949 -19307 -34434 -38613 -15085 6491 3556 7620 8237
4913 8237 4375 186 -896 20005 26434 -3186 -5546 1736 -16550 -25325 -33135 -35537 -23677 -20980
4899 -20980 -1674 5649 10953 19481 13921 983 -1335 -2661 9444 24704 18087 3726 -591
4886 -591 -20284 -19098 8196 -10118 -18222 -22603 -19276 -12253 823 343 -23100 -28062 -7440 9994
4872 9994 18016 -1284 -9881 -7346 10972 7458 2819 14647 8175 -22525 -9436 -22602 -27421
4859 -27421 -15985 -14981 -22335 -25854 -14952 -12067 -14408 11982 8268 -3962 -21576 -30461 -33449
4846 -33449 -23455 -17174 -22637 -19751 -18853 -25129 -37982 -39078 -17898 -11114 -211 13298 20992 20504
4832 20504 18174 14827 30294 24618 6273 -16405 -6717 -3646 -126 5181 19111 12400 22973
4819 22973 11440 20212 27647 22380 10422 4720 8991 1285 -3748 10775 19723 9397 869 15018
4805 15018 17253 -1157 -25209 -29292 -4687 15997 26541 17182 947 -11360 78 216 -3376
4792 -3376 -7671 -8976 -27347 -20989 -18318 1604 2491 -7650 -5326 -4910 265 985 19492 9511 -7423
4777 -7423 -16064 -27744 -19887 -9307 10229 12651 1426 -5069 3773 15060 1073 -9961 -7559
4764 -7559 -7357 2683 -960 -25761 -17669 274 3860 10539 14764 10512 13957 14127 6334 -5330
4750 -5330 -20192 -30489 -26943 -12362 -9594 -15502 -25358 -21633 -23228 -14907 -20117 -29872 -25412 3145
4736 3145 4641 -2465 -14929 -6165 17111 23658 17571 8726 4191 13475 19357 23040 20864 9791
4722 9791 7085 -7578 -4384 -15246 -13599 -22118 -29135 -36686 -5578 6574 -6995 983 -11241
4709 -11241 -6361 8670 7680 -14426 -34425 -53773 -41083 -31826 -29052 -27518 -26001 -20122 -10652 9529
4695 9529 22835 20962 25317 20302 38025 45270 27473 -5682 -11390 828 -1439 -10207 -18133 -16303
4681 -16303 -7395 -18920 -9769 -7823 -1890 -7764 884 -422 -2506 7221 18909 20741 10224 -6259
4667 -6259 -19635 -21118 -32329 -39128 -32096 -26253 -1872 -1417 -16443 -35049 -36460 -17269 -13989 -3939
4653 -3939 -6130 -17688 -10898 12319 7924 -1365 401 -6175 104 4346 -20316 -29615 -27922 -14655
4639 -14655 -10338 -1421 23043 15867 11213 4976 -4632 4702 17162 754 -21208 -8711 3468
4626 3468 -19099 -25302 -17803 -8054 -8164 -10836 -6303 -3108 -9968 -5625 1359 -18579 -14457 -21785 -36853
4611 -36853 -41276 -46294 -43428 -28394 -23326 247 8825 12741 -3108 -10842 -20709 -17156 -8900 -13447
4597 -13447 -17476 -3539 -6403 -20425 -19157 -8483 5709 8557 13808 36107 32504 132 -2337
4584 -2337 -1271 -20545 -29843 -6613 8750 23760 11827 3418 16218 6837 19246 17884 22998
4571 22998 13922 2561 11331 -2754 -21417 -12684 -13407 -22773 -40676 -40489 -33088 -34193 -12729 377
4557 377 6392 16913 6897 -10654 -11992 -28000 -20163 6780 40885 34094 24995 13676 -7711
4544 -7711 -12903 -27083 -26192 -30829 -30934 -36200 -43619 -36595 -29093 -28212 -26211 -15093 -4909 -1723 -6853
4529 -6853 -1440 -8477 2330 -9273 -23943 -23636 -18472 -6324 15019 32486 40898 29183 32352
4516 32352 34015 28065 18890 19849 14661 3546 -14777 -27129 -29666 -7310 2204 3547 -76 -17793
4502 -17793 -34511 -27384 -2814 8503 13099 11614 9109 1041 -18204 10435 11472 -4662 -20396
4489 -20396 -39941 -26601 -13505 -15206 10947 34682 34184 16276 579 -7783 -7354 -1701 21601
4476 21601 19079 -2662 -1164 8915 11646 -9169 -12729 -6416 -6750 -6672 3769 23589 20762 10425
4462 10425 1136 7095 19350 2433 -17513 -11538 671 6622 -14671 -14228 1618 3865 17942
4449 17942 1562 -18301 -15800 -12990 -6773 4935 -10993 -8787 -5370 -10624 5265 36346 30218
4436 30218 8192 13086 23813 16037 6627 -9318 -27640 -25355 -30734 -29971 -17617 -12366 -8156 -14029
4422 -14029 -18121 -18484 -11546 -14754 -13061 -11868 -18176 -16474 -13943 -507 -14943 -13572 -10774 -11419 -13238
4407 -13238 -17134 -15722 -12091 25842 13763 25033 30380 16995 -9950 3954 11229 15992 3682
4394 3682 -4194 7410 21409 24712 16232 21901 34625 29722 16832 3518 -324 16347 14296
4381 14296 -130 -11687 -6543 7923 -2699 -21325 -14688 -26677 -26071 -16673 2241 7017 -6828
4368 -6828 -3849 -24543 -32524 1774 4880 -10455 -14286 2812 9767 2239 2351 -6001 -7440 -1078
4354 -1078 4057 17788 26979 12369 -3706 -23324 -31429 -2530 24706 -1865 -16522 -1391 16090
4341 16090 9254 22637 14378 10494 -1348 5906 14370 3131 -3081 -1642 -10698 -25368 -35317 -27176
4327 -27176 -9035 6227 16290 16961 33594 44735 44154 16960 -17011 -13521 -7890 -7667 10098
4314 10098 41712 40159 28796 20968 793 -9046 -18092 -11092 -12943 -18029 5305 3052 -3045 -9198
4300 -9198 -32916 -39178 -32437 -23302 -13151 -56 6466 -206 3393 16513 18820 1863 -15816
4287 -15816 -33810 -24296 -16363 -33988 -27415 -13412 -1774 13896 18403 1813 -20067 -27667 -14850
4274 -14850 6877 14944 10672 10404 8364 1023 -4331 3749 17892 7110 -13237 -11759 7234 4293
4260 4293 -10411 9789 25986 13974 9133 27481 22913 32619 48349 37827 23381 18596 28548
4247 28548 22890 -15010 -26745 -17029 -20332 -7740 11678 20318 10412 -2747 14395 1262 -27687
4234 -27687 -37485 -23177 -4802 12368 31108 32133 19922 7290 20401 25579 22901 22734 25952
4221 25952 22709 8249 1984 -3219 385 8122 20678 25660 11222 4535 -2901 -26653 -27013 -17940
4207 -17940 -1400 -7849 -18450 -23958 -16042 -10456 2966 11549 8185 -3583 -3068 10347 -4007
4194 -4007 -3882 -12247 -8887 -11116 -1965 20205 17581 17619 24487 22947 -79 9408 29632 23397 22648
4179 22648 13779 -302 -23757 -16941 5385 771 -4740 -3359 -4503 -21157 -28474 -13720 -4174
4166 -4174 5304 6113 15248 5719 -21680 -20051 10965 -135 -16513 -23638 -31042 -31106 -19380 7370
4152 7370 14211 7539 3599 -4368 -16843 -22030 -38039 -1828 19652 1761 968 -185 -7650 -12091
4138 -12091 -492 7837 15780 17911 4796 -921 -7627 229 -4113 -5860 -4388 -12708 -1290 9607
4124 9607 35591 32024 9464 -17545 14907 22060 14709 -11385 -18861 -17730 -1838 7503 17873
4111 17873 28307 14085 5999 8572 1435 241 -887 -6931 -11722 -6226 -4573 -10383 -12422 -14789
4097 -14789 550 13564 9531 2235 1498 -15930 -39061 -37123 -26947 -9314 -12314 -10630 -11461 -5853
4083 -5853 579 5957 -16122 -13037 11056 3086 -4141 -11458 5531 3392 11172 2419 10199 8935
4069 8935 -2669 -3159 11310 3578 7121 16605 23169 32770 18618 10132 14641 27048 24428 10895
4055 10895 14217 5827 2805 10768 -1545 2114 16131 25459 12457 13186 -2033 -14401 -14650 -23400
4041 -23400 -30702 -10793 3939 -1456 -14189 -17159 -15073 -5161 -5935 -15646 -25131 -10225 -916 -2391
4027 -2391 3326 1584 10306 1403 4428 18740 28582 18992 15039 1635 -14890 -25605 -21752 -2304
4013 -2304 20635 16030 4728 -6089 -14194 -14902 3929 13728 12290 4746 17223 15196 13478 30267
3999 30267 24653 16034 10973 11540 -710 -13685 -29026 -27296 -5280 487 -2675 -3707 5136 1885
3985 1885 -5680 1510 12430 6323 4038 13571 28791 38136 34857 20080 6519 -38 8136 6982
3971 6982 -1146 -8980 -27256 -33872 -35133 -7930 -14899 -17392 -12459 -35930 -22798 -34840 -32654 -44287
3957 -44287 -38144 -31543 -10713 -2871 -5681 -10289 -12590 5373 903 9703 10419 -5377 -7385 -39
3943 -39 4347 -12960 -13158 -8826 -12435 -10405 3233 13282 5079 3386 -2913 1319 25419 38378
3929 38378 33662 39966 10899 24272 37274 47523 29370 15531 13202 4515 1718 -14623 -14845
3916 -14845 -8347 -10441 -7737 -6722 -6424 -16393 -3591 9269 7906 -1970 -14760 -20867 -16490 -12026
3902 -12026 -12788 -19987 -1135 9484 12957 -3039 -9865 -2901 5337 9391 8290 5366 6602 5071
3888 5071 -690 -16562 -10226 16191 16720 6571 -13301 -2612 1953 -10117 -20523 -15711 -6038
3875 -6038 -19033 -25905 -20020 -19863 -39526 -35163 -26951 -14834 924 20382 4455 -38980 -36122
3862 -36122 -14009 -34579 -34483 -30805 -23595 -13333 -1725 4709 -3492 -8931 -16179 -33320 -48097 -53449
3848 -53449 -35712 -13208 2095 3112 -10414 -26378 -10439 12218 11242 18262 14597 -7163 -10440
3835 -10440 -11425 -20914 -7209 6530 20790 15550 -7946 -23773 -6034 -8699 -5222 11206 31948
3822 31948 35175 26125 17639 -1228 -8849 4075 1219 -6893 -18564 -6399 -12012 -19040 -5930
3809 -5930 6467 11905 -1405 9412 -1192 -15159 -15542 3414 19836 19248 -1295 -12790 -21964
3796 -21964 -18270 -18762 -19954 -15385 -21050 -16498 -1480 5011 -12024 -6904 -8309 -25540 -31282 -25245
3782 -25245 -27744 -24981 -16707 -9839 -15794 -12407 -3856 -2367 -579 -8446 -17411 -21821 -13861 -5841 10101
3767 10101 16284 4925 -1368 -11180 -9503 -3849 -2272 1075 -5958 -7013 298 14228 15462 3662
3753 3662 -11566 -6777 19397 11428 420 -6520 -1658 -1465 -4600 -9961 -14365 -17961 -20455 -25899
3739 -25899 -17861 -24304 -5144 4778 -2874 -3893 -10658 14461 13390 16998 18547 20852 15038 12082
3725 12082 -3877 -8925 -25665 -19199 -1108 -15293 -28054 -26983 -33354 -28608 -3394 22830 16830
3712 16830 22096 31931 18897 393 -12669 -8603 -160 9788 9563 -58 -11736 -3540 7786 11228
3698 11228 4124 -990 3555 5272 7604 812 -7121 -8784 -26612 -19900 15748 17236 4244 15117
3684 15117 29251 12666 -9236 -5855 -4552 11362 7940 -6758 -4319 -1185 197 -12016 -29302
3671 -29302 -38410 -29557 -21591 -2617 -14151 -24147 -21105 -18003 -4710 7120 24062 15765 4893
3658 4893 17870 20638 3105 3327 -6182 -19347 -25611 -30496 -17805 -6782 18 -1393 -1118 -11997
3644 -11997 -12632 -9272 5308 24220 19468 -1194 -7126 -4614 4711 9231 17107 11951 27978 42414
3630 42414 32812 26736 11405 -14274 -14705 -8494 4408 11787 19922 18425 5311 1450 26403 14311
3616 14311 -3487 -10551 -2267 18845 31908 9687 12248 22237 4644 -25339 -29113 -35134 -41342
3603 -41342 -27477 -28654 -40885 -26947 -6081 -3044 -2671 8012 21817 11280 -3990 -6689 -3790
3590 -3790 -8895 -23765 -22139 -8006 -6370 -2738 -3724 -8970 -9628 -9457 -18944 -9601 -11396 -10791 4829
3575 4829 12371 9480 15942 26502 36427 23899 -5424 -31437 -2857 23472 31858 29295 32311
3562 32311 37773 26545 641 -1677 1250 11452 4131 5620 13913 13330 5337 8955 4223 -7107
3548 -7107 -24617 -28601 -31865 -23061 -11277 -2662 11047 18356 1443 -3389 -10042 -5888 1921 6702
3534 6702 6423 -9591 -24102 -17313 -8110 547 -8539 -5990 5539 8433 -4321 -5151 1501 -12502
3520 -12502 -26590 -23720 -3434 -1389 1712 25036 6143 815 22421 18499 13148 16702 20206
3507 20206 26169 17276 35413 41421 56701 67163 49008 48889 38065 20149 19495 11488 17171 13824
3493 13824 -13596 -16176 -25428 -25431 -20668 -4418 -1339 5918 12691 -4570 -12063 251 751 2783 3948
3478 3948 11237 5611 21480 26758 22137 -1547 -8636 4703 21244 25114 5981 -10815 -19917
3465 -19917 -13780 2906 28399 44302 40634 11843 2297 -7161 -14290 -10570 -5898 -1352 -3980 -26105
3451 -26105 -11139 11703 785 520 3333 22868 6429 -21767 -17505 6696 19285 11144 11749
3438 11749 17894 19070 2337 -2200 564 8382 11097 7251 4967 -10595 -10772 3461 6954 7102
3424 7102 20560 15294 2718 -17289 -43872 -55113 -52441 -45685 -40019 -12558 4669 3190 11293
3411 11293 7607 -7454 -8244 5809 -5356 -2834 -15843 -13161 -2044 -5344 -13603 -7241 -9334 -10044
3397 -10044 -16840 -30454 -37091 -17304 -10263 -100 6977 9522 10205 20490 21164 11530 8763 21601
3383 21601 16592 8807 -3123 -21436 -11175 -13358 -19211 -6355 15165 19385 14122 25158 30041
3370 30041 20299 7600 -7564 -3448 3477 -15563 -23206 -6453 -2551 -2603 2561 4214 13150 6753
3356 6753 -2915 3035 25136 15598 -3879 6108 11766 -3345 -17009 -14435 -1680 1822 -250 8009
3342 8009 26310 42894 32135 15871 14077 14802 16205 -7836 -11113 -13862 -16623 -7346 -1353 -6728
3328 -6728 6667 18633 5993 13082 16916 19153 18956 17949 16696 7527 20809 36549 30156 27744
3314 27744 22840 25547 25247 19330 21839 10819 -4905 13383 16208 9976 -2483 -15180 -26350
3301 -26350 -30083 -41532 -35268 -31383 -32390 -26556 -27674 -17645 9098 6110 -7291 -1647 -12131
3288 -12131 15801 35535 27070 6933 8260 8425 1989 -6424 -3600 -18481 -15852 -11959 -15238 -15741
3274 -15741 -13327 -6062 -6897 -7157 1535 -4100 -5610 -18401 -14889 -2856 -4482 -18869 -42979 -64837
3260 -64837 -22347 20384 14413 9482 20717 22147 6151 -13085 -26707 -37095 -26993 -14145
3248 -14145 -21777 -21353 -28332 -24216 -6430 10358 20584 15139 -4699 -6717 -12481 -18761 -26922 -22368
3234 -22368 -2955 -341 -418 14106 12359 19430 16512 11194 -4389 -18486 -22755 -22288 -17637 -6698
3220 -6698 19098 16830 -18479 -21999 -9472 -4410 -3927 -11540 -4498 4795 19799 4099 -5126 -19173
3206 -19173 -14534 -10424 15477 32057 -2964 -29618 -34874 -27667 -35751 -10819 -1142 -25924 -23690
3193 -23690 -16825 -28348 -21481 -19824 -4116 -5250 -15414 -2648 15365 10237 2033 7306 -15330
3180 -15330 502 17217 21916 15769 17790 6202 -19364 -5918 1530 479 15164 20780 15566
3167 15566 22557 33608 29818 46227 45917 47078 42995 22755 4089 7575 13278 403 -7499 -1622
3153 -1622 -979 -12062 10501 33790 54284 30156 -4756 -18487 -31739 -33722 -14745 6780 3672
3140 3672 3900 -9273 -1763 751 -5066 -26468 -28575 -20935 -10350 1795 9447 9133 -4821 -8917
3126 -8917 17720 27693 19922 5660 -2370 -15775 3604 -11628 -3040 8763 -8231 -13934 -25613
3113 -25613 -28401 -26534 -11099 3553 -13239 -31576 -47116 -23689 -9942 -3457 -123 -261 -6386
3100 -6386 1789 6625 -7717 -1232 -11076 -13377 -4435 -9161 -14694 1567 19104 26853 16333 12929
3086 12929 10231 -4592 -10366 -11686 -19197 -23767 -22596 -26252 -38046 -32085 -29895 -31493 -51708 -56651
3072 -56651 -42325 -22353 1461 13960 2279 -14499 -858 -10583 -21487 -22119 -8047 1609 8277
3059 8277 7190 -3687 7132 11014 166 1841 5714 11959 22137 21883 40803 40314 52619 52188
3045 52188 53209 33092 20743 13376 2282 11600 8176 2497 19926 12750 6861 10809 14192 15519
3031 15519 16388 6310 485 -8251 7307 12328 13773 33937 51356 19364 2049 1939 -13484
3018 -13484 -2223 446 -1407 -13743 -21562 -24188 -8312 6408 3175 1222 -6977 1671 -5109 -15975
3004 -15975 -4897 -7515 -4645 -7665 6094 19743 9789 13437 -1324 11989 30687 19739 -11767
2991 -11767 -8752 3337 25445 48558 31464 12803 -8213 -4370 22797 30214 22654 11953 12622
2978 12622 13586 956 4938 17314 13925 4842 -6645 1595 -2825 -4691 -1148 1452 12141 24475
2964 24475 34489 35098 26520 17432 20155 17223 3699 -15508 -12895 4487 5017 -14137 -2726 872
2950 872 16947 3152 2346 1821 -22955 -19194 3423 20395 6254 11354 3882 -11673 -802 4212
2936 4212 4765 9953 21824 25597 22452 525 -7560 -6840 478 4600 11648 13067 13500 12259 32029
2921 32029 13114 2812 -4541 -3168 -8329 -5965 6824 19063 19623 14042 15950 19940 14011 5950
2907 5950 34424 23249 5185 -2707 -11132 2948 9185 3064 -15767 -8720 -860 -9545 -7169 -5157
2893 -5157 -12899 -18743 -11026 -11849 -13988 -202 31867 43252 30181 19614 10425 -542 -19540
2880 -19540 -25378 -20816 -11891 8886 21848 19397 7022 -3698 -9729 -13135 -12213 19017 11465 2921
2866 2921 4225 77 -3252 5949 14612 -777 -14713 -2231 -478 -13737 -21826 -25311 -5733 8250
2852 8250 5927 -20210 -34818 -38315 -23316 -8073 -25469 -31960 -39661 -38436 -10796 -5528 11613
2839 11613 17369 13936 -5495 -4940 6053 12621 8321 9260 26925 17882 1206 -15524 -34934 -25135
2825 -25135 -23558 -35188 -33415 -14236 -10799 -2061 -4896 -19385 -38349 -47360 -38066 -25496 -18151
2812 -18151 -24387 -21860 -17347 -18301 -10960 6133 15936 35015 33619 4052 -14781 -24069 -10067 -9789
2798 -9789 -1601 8396 20084 25869 12341 5108 -8980 2651 9837 2694 -2322 -3273 6836 16108
2784 16108 8273 -2869 -10367 -8727 -9247 -6738 -7493 5092 19017 30297 25252 31772 37334 21642
2770 21642 958 11209 33020 40037 18893 -2169 -19503 -35592 -49341 -52161 -30792 -127
2758 -127 31570 44608 23030 4903 4859 13495 20629 21760 4113 -11633 -18113 -8503 -7317 -7260 -4916
2743 -4916 22205 25438 5093 -844 3525 -5206 -5062 8701 10994 -5183 -24095 -11874 -7407 1887
2729 1887 16811 20470 12372 22535 15030 10226 3638 -4363 -1926 13826 13739 930 -22103 -20452
2715 -20452 -3388 1011 12139 29775 30987 25600 31874 26393 23765 20713 17374 12596 -1125 -11639
2701 -11639 -8032 -9366 -7757 -5249 -5019 23194 15510 -3951 -5416 -9989 -1091 3642 13290 9929
2687 9929 -11909 -23210 1425 16561 24770 17512 35789 38947 40513 27336 21634 11118 38
2674 38 -6421 -5656 -8426 -3450 8488 25897 21513 -5246 8509 22751 31838 41952 39909 36128
2660 36128 21721 9396 -16248 -12814 -8621 -5833 -11841 -3641 18119 31972 8856 -20757 -44150
2647 -44150 -24340 6507 13938 6602 25314 41145 30278 14870 18745 11770 2791 4189 12657
2634 12657 14121 6476 8056 -5931 -30708 -20892 -28856 -24474 -4008 10356 -7055 -855 14284
2621 14284 26845 7012 926 6327 17020 18490 27435 2309 2790 19468 20365 20863 29082 26549
2607 26549 24976 47231 41686 32743 29597 22924 11253 4553 34870 31214 27494 22223 -5548 -22699
2593 -22699 -29357 -23722 -3288 4638 1529 -5436 9470 2991 -14474 -26197 -23932 -19806 -33008
2580 -33008 -27236 -9588 1177 4622 2599 887 -2332 -11941 -4031 1246 -3249 -1874 -5578 -5358
2566 -5358 -221 17781 2999 -8619 -419 11764 10917 12717 17358 15985 24041 23267 17675 6952
2552 6952 -5658 6501 13120 778 -5125 -12147 -10354 1695 -1916 -15803 -10876 -8109 14523
2539 14523 24454 -1969 6081 16432 6777 14373 12450 3333 -13642 -26594 -1050 12803 5330
2526 5330 -3624 -10449 -19319 836 13231 20474 15503 5983 -7924 -13524 795 8634 15158 1232
2512 1232 -4595 -170 6264 -3539 15753 15760 11392 11230 9672 21693 20405 7742 7347 -2904 -10868
2497 -10868 -3525 4270 -9227 3525 8453 15244 24861 20845 9922 12429 -1578 -4997 -893 12527
2483 12527 30662 37386 26465 29569 20990 6988 3418 -6488 -16975 9279 6020 13888 38220
2470 38220 51541 33613 21248 11796 7477 11441 20357 25490 -9323 -25992 -16193 -6444 1479
2457 1479 13150 -1308 5104 3385 -10517 -13511 -7048 -5744 -24631 1890 18092 13923 10102
2444 10102 2670 13648 5897 -12592 -25353 -18911 -2691 -1292 -16936 -17638 -6836 -3545 -1632
2431 -1632 -17522 -22018 -28343 -8077 -488 -5414 -20547 -10753 66 -2204 -24955 -24027 -3004 -9407
2417 -9407 -15823 -24027 -27692 -25274 -14358 2229 -17815 -34340 -19217 -20098 -13954 9498 11991 -3514
2403 -3514 1686 703 -7017 -22300 -25179 -40986 -33913 5759 16633 13341 10340 1359 13522 7276
2389 7276 -17357 -19936 5189 27339 14820 10156 21194 36721 24442 4664 -19505 -34332
2377 -34332 -42660 -40853 3433 42885 42493 40410 36642 12212 -2900 -9867 -15641 -9465 1740 8321
2363 8321 17410 22523 20390 -306 -20258 -24396 -33970 -17855 4239 21991 20308 -8957 -6922
2350 -6922 -76 4573 16097 1100 6315 16508 8024 1221 9535 16377 10308 -15547 -24947 -7671
2336 -7671 3204 -7305 440 3648 6255 21540 32160 20368 -3919 149 4927 -11258 -5089
2323 -5089 11463 8126 12712 16693 11252 -9319 -23442 -34628 1106 21079 -2990 -8057 -21257
2310 -21257 -22965 -18128 -3194 -1225 1682 286 -16981 -13625 -3884 7700 -470 10617 6612 4205
2296 4205 -11594 -33638 -17355 752 -16281 -22804 -23463 -8922 -1576 5280 9513 14899 -1932
2283 -1932 -10051 -1143 -5221 -16936 -17631 -12733 6217 23385 19460 25826 32731 28185 25711 5993
2269 5993 -5156 -7108 -6637 -9506 -11570 -8138 1755 -1652 -12522 -27231 -26232 -32369 -24813 -16163 6192
2254 6192 29282 6574 -16029 -14070 7123 4509 16986 25040 26539 25418 39130 50366 38020
2241 38020 38330 24328 18845 15599 11188 -173 -5948 848 -3466 -4034 -29495 -38405 -11265 -2948
2227 -2948 -14550 -4508 -6170 -10168 -12142 -11619 -19799 -35542 -31095 -5850 5757 451 -7354 -18526
2213 -18526 -25272 -21474 -21819 -38225 -17934 2958 3935 8943 5923 4775 3377 -5244 -7233 13119
2199 13119 18428 17081 21947 21044 17417 4612 -3672 20469 21913 8314 -20340 -20352 -5275 -6737
2185 -6737 -6578 -18725 -14135 -31901 -30437 -29749 -31281 -32767 -24977 2586 2028 -12645 -25961 -19035
2171 -19035 -8526 11071 7212 -6955 -4097 -4348 -3201 -815 857 15605 2726 -21427 679
2158 679 23242 28987 20551 12121 -4527 -19144 -25643 -24917 -5396 26408 33248 10347 5372 13446
2144 13446 8701 13757 13930 -4305 -29719 -14878 -11426 -15299 -7104 14236 7252 -10038 -18657 -6924
2130 -6924 7101 11780 2988 12313 13658 8027 755 11437 15696 21568 22815 17487 -7543 -25814
2116 -25814 -33204 -22622 -16418 -21580 -3140 -312 -13223 -887 5752 11316 6233 10956 14450 4186
2102 4186 -3977 -4242 6307 3318 4117 -4833 -8459 11980 17396 16381 23093 14300 4352 28 -1375
2087 -1375 -2896 -20970 -34399 -26379 -3942 10511 26296 33063 32326 41241 34489 16363 5339
2074 5339 3019 -1328 -21566 -27602 -18909 -1441 11454 10389 5127 3697 6844 8438 17865 18763
2060 18763 -489 5083 14268 30736 29308 21815 21065 18980 11690 -1925 1398 -4364 -142 -3590
2046 -3590 568 17540 28129 21279 17223 16409 -4102 -12834 8845 19072 33403 15658 15613 21929
2032 21929 22444 -10094 -286 5014 -208 3071 3741 6496 23201 14049 15318 16373 26235 24769 10391
2017 10391 16827 6362 15008 22741 -1608 -3724 10647 15180 17279 15318 10621 9622 7538 12321
2003 12321 13324 14090 26864 43592 29379 4178 -7559 8219 11474 3570 -8770 -1748 9275
1990 9275 7381 -4822 -11273 -10515 8261 14093 22032 22266 14535 14266 15813 3284 -28495 -25476 -17145
1975 -17145 -5178 -203 -574 -15143 -11914 -3624 -9677 -17348 -11833 5410 -361 478 -13371 -14408
1961 -14408 -20778 -4837 28481 36772 22088 18049 36237 28264 23699 24486 9438 1345 -24242
1948 -24242 -33018 -46654 -50964 -24856 -12339 1198 10096 17944 27798 13827 237 4256 4378
1935 4378 7013 12581 6042 13104 21372 -2854 -21616 -17937 -16332 -7784 291 1682 -23746 -4800
1921 -4800 8448 3139 -9067 -12012 -24047 -19286 -3397 7618 5919 1083 2213 5608 18365
1908 18365 9925 6594 11486 -6470 -16554 -18226 -27305 -26397 -39739 -24166 -12602 -6158 1960 -10270
1894 -10270 -32451 -37969 -31759 -20520 -14702 -21534 -19701 -3915 2666 1273 13138 4413 3862 6388
1880 6388 -2090 3710 12246 22172 30700 30809 30173 8219 -2779 16195 16997 988 -14723 -22765
1866 -22765 -14365 1277 10340 12939 -2843 -12277 -3896 24594 34842 30777 4749 -462 2601
1853 2601 1218 -15865 -2074 961 9020 16042 18763 15708 18885 39675 20096 -5481 7087
1840 7087 9481 -873 6132 22243 20122 3356 -1663 -6339 5269 11417 17986 29480 38305 38921
1826 38921 19713 5760 11892 20957 19561 25568 29791 17515 4170 -5323 -3180 9522 6748
1813 6748 -6813 -15107 3159 14113 12542 13566 22155 22032 6006 2943 4440 8741 -21697 -32991
1799 -32991 -19336 -15100 -33744 -40543 -35584 -23983 -16856 -15873 -29274 -10757 -4753 -6819 -2170 4590
1785 4590 -6471 4306 8834 28562 20442 7826 10999 8022 6445 11702 -1513 -21146 -15725
1772 -15725 -13248 -3852 -3349 1108 -560 -3322 -11463 -22270 -23157 -23387 -23137 -23618 -17685 -14050 8281
1757 8281 27080 20766 1322 -19815 -9185 7582 7253 13115 -13201 -29454 -19679 -19437 -8400
1744 -8400 11886 11841 6321 4674 9855 15534 28062 2781 -22261 -12569 -10165 -21270 -15206 -8632
1730 -8632 -15143 -25102 -18729 -12875 -13660 -12400 10499 21254 1465 -8504 -12195 -23301 -39433 -38081
1716 -38081 -33738 -29318 -28699 -33589 -13378 -9209 -3887 2327 18087 39045 29246 8596 2696 -6857
1702 -6857 -32523 -29098 -12882 -4372 11639 -1272 7766 11320 -3345 -24823 -30327 -24386 -7520
1689 -7520 6753 -9107 -15546 -4024 9567 16152 21536 1580 -15067 -10671 -2750 5428 1227
1676 1227 -4965 -13460 -18748 -22124 -22220 -12026 -2898 4061 32641 23952 21221 45971 33987 26470
1662 26470 24390 6216 3764 -2955 12730 34675 33409 23687 16057 4321 4623 22827 14204 -14296
1648 -14296 -9877 1543 9348 15568 7703 -5727 -20511 -22622 -6210 9886 8978 -4793 1640
1635 1640 13488 6976 4997 12423 9050 -6 -13544 -23827 -23177 -5948 -14306 -15503 -10037 -12168
1621 -12168 -19492 -11009 -7888 2166 3323 13804 18161 26405 39341 25933 14759 6676 14617
1608 14617 13516 20487 21292 19744 3812 11709 36348 37358 20294 12941 9760 4374 -774 4336
1594 4336 -13337 -2313 10795 5704 -7989 -17732 -12007 1661 6191 196 6720 21941 19195
1581 19195 6734 -1172 186 2566 4222 6508 4509 -7297 -12620 3280 24793 19284 11303 4608
1567 4608 11819 11054 20124 22961 12839 13431 18441 22832 1313 -9542 -7226 8906 -6860 -22875
1553 -22875 -27702 -15408 -15880 -16050 -26486 -30212 -21759 -16326 -22437 -7873 -3635 3455 9369 17040
1539 17040 -215 -5177 -7208 -12121 -9305 -9330 -7890 7996 -2803 -19754 -21158 -2190 17691 10889
1525 10889 1938 -18426 -35363 -35021 -35403 -29458 -4799 1864 -11536 -21594 -30525 -27340 -14705 -92
1511 -92 -9305 -30704 -23511 -6977 -29419 -34637 -10368 9243 27074 19680 21785 12297 1102 10500
1497 10500 22841 25409 43006 33433 20011 23816 46223 49068 37195 14663 -16016 -28182 115
1484 115 672 6628 20291 5428 5855 16819 9563 -4152 6591 6905 6078 -1146 10082 20038 14467
1469 14467 893 6976 6664 10214 -4109 733 -121 10254 12143 2312 5865 10986 13852 16857
1455 16857 25925 5631 -16755 -22856 -21114 -25210 -25538 -16840 -3491 9653 26466 33472 34753 4600
1441 4600 -14434 -24827 -14610 -3807 -13140 -3160 -21467 -31585 -29115 -20974 -16070 -5556 22538
1428 22538 31182 6902 -17125 1256 14813 1757 -16430 -17722 5213 11015 -3757 -10060 -19326
1415 -19326 -737 13526 7966 9464 3935 -21373 -5388 -2180 17123 41623 37805 33847 8708
1402 8708 7083 18362 20665 16061 7294 -1134 -4220 2843 13478 -8767 -4761 14049 -7716 -24767
1388 -24767 -27811 -29374 -34251 -26638 -20179 -4115 -15493 -21824 -18629 -21074 -6597 3187 -4895 -8035
1374 -8035 16852 15076 2254 1477 -1099 8410 8615 -1742 2026 19583 19903 5739 -5270 19558
1360 19558 45113 44792 25743 13958 7110 -572 -9699 1322 5631 -3332 -8758 -10599 7503 18057
1346 18057 -710 -14891 -21201 -21144 -4070 -3928 -6430 -10818 1888 22362 27995 22127 37396 30625
1332 30625 -2449 46 -8413 -2573 -1469 -8670 -3742 -2531 1983 10610 20556 27858 17353 2855
1318 2855 16622 10476 14451 37191 66067 58474 39804 23845 28665 36349 40445 11006 3845
1305 3845 4390 5211 11096 1967 -6737 -3514 8379 21793 33881 24197 19887 16592 20280 23788 4383
1290 4383 -14085 -3532 12968 12766 8795 10361 4040 2181 -4069 -9615 -5914 -5402 2792 5810 -4881
1275 -4881 9508 27188 9924 -4145 -12370 -1085 13856 17840 14212 -11345 -16844 -9230 -25445
1262 -25445 -32424 -8338 1976 -1890 1316 8998 -4166 -1252 12498 -8918 -11205 6805 11585
1249 11585 14056 23961 9713 3066 -6825 -7553 5347 7362 -9680 -6498 -18553 -17745 -18670 -3241
1235 -3241 -299 -13492 -13653 -3033 3214 -3998 -16545 -4503 -1838 -16633 -5068 760 8949 11419
1221 11419 9506 23302 15170 17966 17125 15413 10961 18374 20716 8382 13634 3721 -9182 -10938
1207 -10938 -25155 -18888 2817 12079 21649 8830 -6163 8686 -1065 -16190 -27024 -26476 -33439
1194 -33439 -36487 -33602 -31244 -21742 -15518 -8473 20186 31989 21463 -4500 -26439 -44218 -21805
1181 -21805 -3393 -19092 -9179 7621 -3432 13222 38619 27021 9970 -4471 -6048 -3106
1169 -3106 -9367 -18833 -8862 -5616 -7196 2333 10531 14417 10513 6897 -113 -17696 -14918 -1914
1155 -1914 -17901 -21542 3028 -9875 -13346 4534 25855 20273 7244 1361 3970 12902 12839 26599
1141 26599 21068 7960 -634 9718 6081 2098 -14701 -11563 2683 7546 -14883 -21331 -15987
1128 -15987 -9916 -15627 -15089 -14682 -1229 6791 8355 -3943 -21718 -13404 1636 28081 19861 -1026
1114 -1026 -11890 7850 15806 -3150 -11774 4664 6374 300 -12293 1681 8537 16657 19439
1101 19439 8123 22787 35143 41101 20738 6367 24683 46248 52576 30413 9879 18984
1089 18984 30274 21410 15154 -560 -20992 -16148 9273 -5068 1614 17184 18718 14720 -3738
1076 -3738 12742 20671 -7330 -28391 -38694 -39092 -27705 -10962 13467 31171 19260 8439 9925
1063 9925 -1035 -23073 -30183 -22350 -8151 9101 8851 8191 7002 12622 -4127 -23085 -22571 -3911
1049 -3911 -2745 -28746 -32053 -25774 -26264 -14244 -5155 -13058 -5258 24943 15676 8472 13107 15458
1035 15458 9714 -5901 -13557 12680 35888 36871 35890 19254 14958 16072 17624 13925 6677 25284
1021 25284 16392 -10451 -23958 -4260 5442 3729 -20767 -27487 -2271 14571 19916 5641 1974
1008 1974 4117 -10367 -14837 -26693 -28156 -32098 -37768 -32188 -3510 7479 4936 -14364 -4032
995 -4032 4548 11549 267 -4020 -769 -15003 -25397 -23633 -14131 -6835 -5498 -15461 -19789 -18442
981 -18442 -5912 9250 -2293 5160 1455 -3638 -19394 -14475 -17242 -5259 8358 6936 13726
968 13726 4206 -17153 -32356 -20789 -238 1854 9502 23666 21615 21273 20426 21203 25610 -139
954 -139 -11521 -11372 -11018 -30320 -40367 -42590 -47857 -30022 -18416 -22051 -21811 -14996 -446 25334
940 25334 11143 -15531 -18809 -27085 -28719 -23787 -4831 5061 6948 14152 8657 3577 -6548 -15325
926 -15325 -2617 5178 -4232 9219 12536 6503 10407 18347 20405 16464 6996 8358 9261 4909 -15852
911 -15852 -17582 1970 19278 12480 11983 10478 16503 28111 20083 9896 23639 15624 15625 8075 -4290
896 -4290 -6665 -13409 6513 25023 32015 18118 15209 20162 7688 8022 11455 7936 -2415 12039
882 12039 20652 3794 4781 3223 7511 12562 5705 16985 8178 654 -10420 1254 10134 13462
868 13462 -3586 -11299 -11446 -34771 -35574 -14823 7616 13752 13195 4677 -1919 4805 7300 -1420 -15056
853 -15056 -1379 17511 25701 23947 26123 10876 2938 14274 11052 24079 16308 11947 -9528
840 -9528 -9533 4844 8062 -15274 1460 11516 -4974 -17 229 1770 -4804 1560 4665 -7736 -8234
825 -8234 8332 15421 13139 -573 -1007 -2432 2594 2427 8483 -2788 -16626 -1606 -6046 -2276
811 -2276 8189 2557 16623 24856 26070 -2658 -22225 -14244 -27625 -41028 -28151 -16806 -17115
798 -17115 -15911 -9833 -17642 -1230 -6088 7679 9366 13698 -2094 2918 21941 38942 40892 17145
784 17145 1669 -7167 -4107 -10853 -1007 7272 14939 4540 -10134 -37639 -35451 -15182 -4938
771 -4938 -1194 -2123 3477 3725 1448 6374 5103 33609 32111 8406 -5851 10938 16293 21665 14844
756 14844 -1778 12589 35479 40490 22872 18395 -3444 -10969 -16907 -2714 14853 16461 8718
743 8718 -6556 -6611 7624 31664 36062 33131 30836 25740 35003 37485 27071 8527 1083 -11476
729 -11476 -10157 -4385 6929 25252 28988 18612 6948 8103 21702 16559 12257 21217 27058 33817
715 33817 30685 17861 5634 4509 405 -2653 6908 26228 35291 7552 20042 35589 32916
702 32916 30116 34407 41343 20207 -1724 7302 9600 11513 17185 26278 29364 18921 25876 28613
688 28613 17840 14391 7273 -11124 -22922 -33945 -31621 -19444 -4049 20764 34162 9593 1619
675 1619 6872 -6741 -12395 -7792 -12756 -9662 -12388 -13547 -26876 -23432 -982 -10179 -14074 -18560
661 -18560 -23299 -18261 -14641 -21501 -12576 3506 9266 8241 6519 -5685 -11982 -11763 -4993 1424 -6212
646 -6212 -13044 -1216 9610 34646 46616 42968 27775 2169 -8470 -15147 -10739 -18607 -44095
633 -44095 -49977 -43619 -33424 -42955 -48150 -45033 -16012 -10051 -10139 -11539 2226 18281 7140 -14921
619 -14921 -27047 -38617 -18395 -6906 2565 2049 19385 20231 14145 16276 10674 -6622 -29439 -30584
605 -30584 -12673 8382 11586 771 -22431 -28078 -30620 -23295 -25538 -27054 -35622 -34640 -13739 -10712
591 -10712 -12123 15911 41224 35507 5503 -2698 2453 5257 11630 9772 12419 16125 7204 -8585
577 -8585 -7050 2721 14655 24061 7466 9365 20492 5543 -12078 4096 21409 18321 6841
564 6841 4588 4790 18592 19500 13570 -631 3860 -3740 -18701 10686 14188 19035 25081 26042 4049
549 4049 -12000 -5117 4293 2530 -5467 -13542 1508 1654 -7500 -15917 -12858 -514 -1312 3737 3177
534 3177 9043 27189 35077 45855 45937 36725 20739 7247 11809 17476 6909 11763 18283 15541
520 15541 -1881 3236 8116 19510 24132 14417 -3763 -15253 -11706 2656 -3557 -13367 12485
507 12485 16695 -1668 -10230 -839 -15658 -11524 -16815 -4538 34641 49683 40931 30209 13229
494 13229 17091 39989 39613 31562 14566 22128 6559 2799 17289 32996 21224 2942 -10735
481 -10735 -2011 13341 15201 12372 2899 5444 17460 10243 1303 -732 9487 6778 13540 7353
467 7353 -9479 -9884 -4811 -15084 -4593 408 -9154 -9409 4270 27598 30986 32693 35920 45925
453 45925 23026 -2062 -5894 12335 39803 33265 20815 17063 19742 15315 1911 21716 29712
440 29712 28977 34392 23546 11151 -46 -3119 -13278 -11206 -6102 8013 7779 7191 -12915 -20947
426 -20947 -13509 3812 22338 16569 -23118 -14188 -7146 2345 6365 10459 17379 10101 23157 30495
412 30495 10241 -8480 -13763 -11229 19693 35317 33364 26176 9277 -3244 -12090 -6856 -11712
399 -11712 -15784 -18631 -16359 1669 957 -16062 -17958 -17067 -19729 -18508 -17782 -11613 -10233 -13787 -18027
384 -18027 -3423 22829 30286 21518 23167 21009 26565 19620 6916 -7011 -27512 -9448 -1339
371 -1339 -18448 -30016 -20042 -16705 -28590 -27493 -24084 -29289 -39782 -33155 -26584 -20824 358 -2903
357 -2903 -15218 -19885 -4244 17121 21481 26348 30413 14968 26066 17133 53 -7484 -4729 -4119
343 -4119 -5760 18361 31057 39427 27414 11303 16065 22603 27707 15795 1948 -4717 -3330 -2550
329 -2550 12852 12605 7417 -9038 -22126 -33648 -9093 16462 1964 -17702 -13905 -30223 -21311
316 -21311 -12075 -3721 -3575 -3517 8112 17541 30294 13301 469 4544 3381 8401 20804 4338
302 4338 -1460 1171 9343 9014 -9129 -10957 -5568 -2530 2131 8975 21309 21720 17515 12273 -9719
287 -9719 -6164 -14769 -19181 -11060 3992 9741 17416 15827 11452 22371 8475 11928 6535 3717
273 3717 6872 21139 15075 16608 25047 22972 19821 18178 8203 -12714 -24970 -5585 25970 31038
259 31038 22234 22247 16229 20158 22189 16155 16929 18810 20777 16579 28143 15945 21823 32060 17982
244 17982 14268 6693 3974 4813 4654 3314 13285 18035 1917 10516 14561 16044 8564 9490 15025
229 15025 16954 20164 20129 17661 -3392 -6538 -2430 -716 18827 23494 41153 45374 28873 15293
215 15293 5267 -5405 -9634 -1338 5539 -4819 -15745 -4335 -5496 -7525 4433 -431 -15625
202 -15625 -9358 6653 2877 -9220 -13900 -7962 -5696 -12367 -16871 -2960 -3561 -20466 -6106 6172
188 6172 -236 -8802 -7746 -721 -4008 -4536 10666 -8004 -19787 -17791 -2555 14466 15152 16659
174 16659 10300 -1101 2979 8566 428 -6619 -2305 3450 18947 12351 20783 18555 -2952 -27736
160 -27736 -22757 -22875 -15340 -11670 1007 9280 5673 -8758 -3425 7625 1747 -5654 -5607 1017 5191
145 5191 10623 23287 27290 5596 -13874 -14256 12515 22272 17255 8811 12965 15220 -5123 1389
131 1389 23131 26080 3563 -8772 -8235 809 3605 23528 37148 37201 14348 -10315 -11350 -7857
117 -7857 9787 13979 -10573 -30761 -16670 -15634 -10128 -4858 726 2484 297 1497 4961 -7865
103 -7865 -5905 4586 11885 12611 21327 30308 31091 14835 17302 19941 12443 5141 1509 2526 8764
88 8764 10918 -3315 -6366 -2634 5109 -431 1006 7802 11131 21862 30956 22127 18856 9480 10269
73 10269 26309 21012 20948 26634 12256 7666 7353 -4945 -4348 2875 6808 -1385 -13165 -26705 -21647
58 -21647 -21543 -19451 -7808 -13102 -14577 -8493 4797 9559 194 -2423 -4473 -7445 383 10324 6879
43 6879 813 9071 9467 12249 17041 12544 7421 -2543 3708 13916 14289 10083 6737 10760 8107 3627
27 3627 -6856 -6521 2866 -2435 4133 8319 7888 251 10102 25920 21959 11660 11518 13543 10019
12 10019 14226 19668 14824 9407 14860 18802 5921 -10107 -11662 -7713 -13502 -6579
0 -6579
$$ Imaginary data points
##PAGE= N=2
##DATA TABLE= (X++(I..I)), XYDATA
32767 112349 121541 123702 129753 151188 146389 136719 133594 132600 133103 142223 151319 158764 162251 144006
32753 144006 155073 151380 147856 139718 148085 144767 132361 120853 124587 120925 134563 144306 147808
32740 147808 152553 157531 163248 167490 153559 143398 155160 151031 135685 128929 138094 153978 146361
32727 146361 158964 172706 188478 182749 166311 161931 169235 165382 170283 187122 204503 200949 192417
32714 192417 192567 193929 192356 190443 202735 201368 186636 189416 182329 170796 166712 171715 173967 174959
32700 174959 193246 198834 179199 179134 193033 199911 213269 216041 187397 177912 180645 182689 178744
32687 178744 176263 181959 189609 189830 211586 204399 191627 202587 212017 202531 195635 188217 185525 186155
32673 186155 199285 208185 212281 210362 209195 221851 220523 201336 192874 211257 219807 222486 213300
32660 213300 201653 206523 226280 237254 240588 226382 226669 220139 217569 234085 230647 217326 216265
32647 216265 221938 218243 225424 235692 218920 213094 214343 217044 221353 237344 234308 232033 234033
32634 234033 230552 224456 224066 232070 245741 250942 239844 238366 234546 225110 229407 231371 242931 250359
32620 250359 235904 239125 244427 241648 235165 239613 246665 243355 235514 247449 242812 241457 248555 253686
32606 253686 251675 255521 270456 280624 291210 301350 297077 281163 267568 270748 270840 282608 302925
32593 302925 305133 300976 299545 309147 309795 305034 300729 294153 275649 278390 287476 289016 301431 294453
32579 294453 288212 278866 276522 281055 276716 278692 285432 294370 285949 284500 289912 286185 281178 291071
32565 291071 298414 287304 277644 270592 275096 290736 294515 295547 302987 304283 294373 301108 303150 306173
32551 306173 309498 339313 358355 351709 339725 317409 317083 307973 301162 297184 306726 321219 321161 326415
32537 326415 325063 328056 325128 322948 321472 317698 310800 307754 322484 336737 338531 328878 309421
32524 309421 303999 311934 314449 315156 322256 336419 318798 301574 315595 320237 334808 333781 324169
32511 324169 328662 328066 324402 330431 332588 331006 352223 354302 343349 319200 328938 332961 330822 316525
32497 316525 317987 328311 333727 340975 344581 337590 344448 336512 326028 338932 349813 356161 348030
32484 348030 329521 314281 331950 341443 318396 316369 311653 324099 325502 328619 353869 366741
32472 366741 357188 339543 338626 340991 343537 347112 355045 355489 342321 353863 359991 350196 341677 359281
32458 359281 372506 377970 373460 377548 385469 371882 359428 354880 356542 365848 388504 376649 364056
32445 364056 359520 367819 360325 355823 353321 342892 336254 350649 357722 365819 359079 365711 374039 373337
32431 373337 382890 395133 395864 378915 361526 351256 367510 381197 374883 365718 366427 386095 388190
32418 388190 387048 385058 377762 385321 383800 374905 374137 372439 379941 387742 394301 373089 367534 397248
32404 397248 405180 393024 384698 378688 379824 379249 387379 394650 381127 379115 385672 388369 394516 384921
32390 384921 380083 392796 400456 402030 393389 392235 382665 398919 407441 404665 413692 400648 390876
32377 390876 383361 381993 390036 403217 409774 394260 392904 406138 406652 409634 413433 413971 416133 421644
32363 421644 420981 407173 402583 397560 380406 373409 390816 398983 373148 375939 407223 418489 411367
32350 411367 399479 398820 415155 405040 395761 402896 411458 412273 393407 405285 405881 394628 384249
32337 384249 383656 368393 367015 394833 407458 403172 396422 402566 407031 416620 412296 398333 387724
32324 387724 394000 391286 399476 404147 387261 383124 385737 402199 407134 406399 406937 389676 392210 403426
32310 403426 403465 408983 425634 430458 445268 432525 424129 410715 412326 418607 415240 400707 427314
32297 427314 437828 423101 415826 406803 401132 406100 413279 430381 436717 448391 445724 450489 434942
32284 434942 427758 426958 426845 426435 410285 392124 386516 385962 401814 416123 425565 429402 433957 433599
32270 433599 425060 425357 428771 426336 412023 401887 397273 401165 413406 429900 445070 446711 439216
32257 439216 431765 419805 398387 403658 439058 447771 434027 431166 424560 421425 429209 446242 452649
32244 452649 451553 437255 439280 435238 416129 426565 424302 411222 413351 431754 416190 416807 404035
32231 404035 391675 400288 411292 410503 405937 429155 440611 442380 450608 442762 418875 414433 413548
32218 413548 417989 414222 407792 409516 404268 405597 401318 409555 397382 370363 380040 390825 430617
32205 430617 448353 441095 430086 416868 421313 435579 422140 413805 424133 413160 414420 409025
32193 409025 414420 419455 419971 423988 431463 444392 436955 438169 435059 417897 431781 439081 429083 406213
32179 406213 386600 397642 403464 395070 417569 423362 419496 440269 422656 403184 408899 416007 395624
32166 395624 380464 375257 397355 399129 401296 408418 417207 418205 414224 420384 426811 424298 400920 396685
32152 396685 408823 421094 409990 407241 423335 444592 441012 432172 425333 422651 441313 447084 439687
32139 439687 416694 408963 414916 425025 419840 412509 422337 430591 421227 403581 411449 432729 449079
32126 449079 459976 468116 465749 457954 427543 423807 434261 421653 436420 430537 419361 430836
32114 430836 455475 459977 431588 437189 440599 440457 439538 434603 434368 440260 435987 424955 437312 438009
32100 438009 431967 435265 442798 432885 422643 407869 413701 404961 413261 430421 454713 461411 461626
32087 461626 448502 435372 430668 424807 434828 423698 415568 419182 414115 403711 401304 421693 412236
32074 412236 409694 410863 422587 452330 447713 434366 445468 459527 458880 442248 433067 427832 438246
$$ [...]
##END NTUPLES=NMR SPECTRUM
##END=
