##TITLE=Analysis number 322405
Compound Code cc 50104
Book Reference 505/13
Project Code adrs
Chemist Name robb
##JCAMPDX= 6.0         $$ Bruker NMR JCAMP-DX V2.0
##DATA TYPE= NMR SPECTRUM
##DATA CLASS= NTUPLES
##ORIGIN= Bruker BioSpin GmbH
##OWNER= nmr
$$ XWIN-NMR		Version 3.5
$$ Mon Sep 25 11:54:27 2006 GMT Daylight Time (UT+1h)  MAYBRIDGE\nmr@NMR_250MHZ
##.OBSERVE FREQUENCY= 250.131544655141
##.OBSERVE NUCLEUS= ^1H
##.ACQUISITION MODE= SIMULTANEOUS (DQD)
##.ACQUISITION SCHEME= undefined
##.AVERAGES= 16
##.DIGITISER RES= 18
##SPECTROMETER/DATA SYSTEM= dpx250
##.PULSE SEQUENCE= zg30
##.SOLVENT NAME= CDCl3
##.SHIFT REFERENCE= (INTERNAL, CDCl3, 0, 16.522)
##AUDIT TRAIL= $$ (NUMBER, WHEN, WHO, WHERE, WHAT)
$$ ##TITLE= Audit trail, XWIN-NMR		Version 3.5
$$ ##JCAMPDX= 5.01
$$ ##ORIGIN= Bruker BioSpin GmbH
$$ ##OWNER= nmr
$$ C:\u/data/dgb/nmr/ADRS/1280/pdata/1/auditp.txt
$$ ##AUDIT TRAIL=  $$ (NUMBER, WHEN, WHO, WHERE, WHAT)
(   1,<2006-09-25 11:53:58.98 +100>,<MAYBRIDGE\nmr>,<NMR_250MHZ>,
      <created by zg, POWCHK disabled, PULCHK disabled
       configuration hash MD5:
       E2 DF 36 D8 04 B2 41 60 5A D7 A3 38 5A 4B D0 FE
       data hash MD5: 64K
       EF CE 8D FC 4C 2F 17 17 DD 37 E8 9C F7 B4 0C BC>)
(   2,<2006-09-25 11:54:14.32 +100>,<MAYBRIDGE\nmr>,<NMR_250MHZ>,
      <Start of raw data processing
       ef LB = 0.3 FT_mod = 6 PKNL = 1 SI = 32K 
       data hash MD5: 32K
       43 C5 19 35 3E 9B 1F 8E 20 F0 E6 7F 18 E0 5E CB>)
(   3,<2006-09-25 11:54:16.39 +100>,<MAYBRIDGE\nmr>,<NMR_250MHZ>,
      <apk 
       data hash MD5: 32K
       DF 03 5B 68 59 2F AD 7B CB 2F 8A 34 2A 5C 1C 84>)
(   4,<2006-09-25 11:54:17.17 +100>,<MAYBRIDGE\nmr>,<NMR_250MHZ>,
      <abs ABSG = 5 
       data hash MD5: 32K
       52 20 CD 5B F4 ED BD DA 35 9A 03 7C 30 E0 33 8C>)
$$ ##END=
$$ 
$$ hash MD5
$$ 89 3A D3 9E 43 6D A6 76 7B 2B 0F BA 5A 1C 3A E7
##$RELAX= 
##$RELAX= 
##$RELAX= 
##$RELAX= 
##$RELAX= 
##$RELAX= 
##$RELAX= 
$$ Bruker specific parameters
$$ --------------------------
##$DU= <C:\u>
##$EXPNO= 1280
##$NAME= <ADRS>
##$PROCNO= 1
##$TYPE= <nmr>
##$USER= <dgb>
##$AMP= (0..31)
100 100 100 100 100 100 100 100 100 100 100 100 100 100 100 100 100 100 
100 100 100 100 100 100 100 100 100 100 100 100 100 100 
##$AQSEQ= 0
##$AQ_mod= 3
##$AUNM= <au_zg>
##$AUTOPOS= <31 >
##$BF1= 250.13
##$BF2= 250.13
##$BF3= 250.13
##$BF4= 250.13
##$BF5= 500.13
##$BF6= 500.13
##$BF7= 500.13
##$BF8= 500.13
##$BYTORDA= 1
##$CFDGTYP= 0
##$CFRGTYP= 5
##$CHEMSTR= <none>
##$CNST= (0..31)
1 1 145 1 1 1 1 1 1 1 1 1 1 1 1 1 1 1 1 1 1 1 1 1 1 1 1 1 1 1 1 1 
##$CPDPRG= <>
##$CPDPRG1= <>
##$CPDPRG2= <>
##$CPDPRG3= <>
##$CPDPRG4= <mlev>
##$CPDPRG5= <mlev>
##$CPDPRG6= <mlev>
##$CPDPRG7= <mlev>
##$CPDPRG8= <mlev>
##$CPDPRGB= <>
##$CPDPRGT= <>
##$D= (0..31)
0 1 0 0 0 0 0 0 0 0.06 0 0 0 0 0 0 0.0002 0 0 0 0 0 0 0 0 0 0 0 0 0 0 
0 
##$DATE= 1159181637
##$DBL= (0..7)
120 120 120 120 120 120 120 120 
##$DBP= (0..7)
150 150 150 150 150 150 150 150 
##$DBP07= 0
##$DBPNAM0= <>
##$DBPNAM1= <>
$$ [...]
##$SUBNAM7= <"">
##$SUBNAM8= <"">
##$SUBNAM9= <"">
##$SW= 20.6930455092707
##$SWIBOX= (0..15)
0 0 3 0 0 0 0 0 0 0 0 0 0 0 0 0 
##$SW_h= 5175.983436853
##$TD= 65536
##$TD0= 1
##$TE= 295.16
##$TE2= 300
##$TE3= 300
##$TEG= 300
##$TL= (0..7)
0 120 120 120 120 120 120 120 
##$TP= (0..7)
150 150 150 150 150 150 150 150 
##$TP07= 0
##$TPNAME0= <>
##$TPNAME1= <>
##$TPNAME2= <>
##$TPNAME3= <>
##$TPNAME4= <>
##$TPNAME5= <>
##$TPNAME6= <>
##$TPNAME7= <>
##$TPOAL= (0..7)
0.5 0.5 0.5 0.5 0.5 0.5 0.5 0.5 
##$TPOFFS= (0..7)
0 0 0 0 0 0 0 0 
##$TUNHIN= 0
##$TUNHOUT= 0
##$TUNXOUT= 0
##$USERA1= <user>
##$USERA2= <user>
##$USERA3= <user>
##$USERA4= <user>
##$USERA5= <user>
##$V9= 5
##$VALIST= <valist>
##$VCLIST= <CCCCCCCCCCCCCCC>
##$VD= 0
##$VDLIST= <DDDDDDDDDDDDDDD>
##$VPLIST= <PPPPPPPPPPPPPPP>
##$VTLIST= <TTTTTTTTTTTTTTT>
##$WBST= 1024
##$WBSW= 4
##$XGAIN= (0..3)
0 0 0 0 
##$XL= 0
##$YL= 0
##$YMAX_a= 351058
##$YMIN_a= -542816
##$ZGOPTNS= <>
##$ZL1= 120
##$ZL2= 120
##$ZL3= 120
##$ZL4= 120
##$ABSF1= 16.522
##$ABSF2= -4.171173
##$ABSG= 5
##$ABSL= 3
##$ALPHA= 0
##$AQORDER= 0
##$ASSFAC= 0
##$ASSFACI= 0
##$ASSFACX= 0
##$ASSWID= 0
##$AUNMP= <proc_1d>
##$AZFE= 0.1
##$AZFW= 0.1
##$BCFW= 0
##$BC_mod= 0
##$BYTORDP= 0
##$COROFFS= 0
##$CY= 12.5
##$DATMOD= 1
##$DC= 0
##$DFILT= <>
##$DTYPP= 0
##$F1P= 14.0000005364418
##$F2P= -0.99999901652339
##$FCOR= 0.5
##$FTSIZE= 32768
##$FT_mod= 6
##$GAMMA= 0
##$GB= 0
##$INTBC= 1
##$INTSCL= 1
##$ISEN= 128
##$LB= 0.3
##$LEV0= 0
##$LPBIN= 0
##$MAXI= 10000
##$MC2= 0
##$MEAN= 0
##$ME_mod= 0
##$MI= 0
##$NCOEF= 0
##$NC_proc= -5
##$NLEV= 6
##$NOISF1= 0
##$NOISF2= 0
##$NSP= 0
##$NTH_PI= 0
##$NZP= 0
##$OFFSET= 16.522
##$PC= 1
##$PHC0= 146.8706
##$PHC1= 5.206091
##$PH_mod= 1
##$PKNL= yes
##$PPARMOD= 0
##$PSCAL= 4
##$PSIGN= 0
##$REVERSE= no
##$SF= 250.13
##$SI= 32768
##$SIGF1= 0
##$SIGF2= 0
##$SINO= 400
##$SIOLD= 32768
##$SREGLST= <1H.CDCl3>
##$SSB= 0
##$STSI= 32768
##$STSR= 0
##$SW_p= 5175.98343685301
##$SYMM= 0
##$S_DEV= 0
##$TDeff= 65536
##$TDoff= 0
##$TI= <Analysis number 999999
Compound Code 99
Book Reference 9
Project Code 9>
##$TILT= no
##$TM1= 0
##$TM2= 0
##$TOPLEV= 0
##$USERP1= <user>
##$USERP2= <user>
##$USERP3= <user>
##$USERP4= <user>
##$USERP5= <user>
##$WDW= 1
##$XDIM= 32768
##$YMAX_p= 380395781
##$YMIN_p= -439281
$$ End of Bruker specific parameters
$$ ---------------------------------
##NTUPLES= NMR SPECTRUM
##VAR_NAME=  FREQUENCY,     SPECTRUM/REAL,   SPECTRUM/IMAG
##SYMBOL=    X,             R,               I
##VAR_TYPE=  INDEPENDENT,   DEPENDENT,       DEPENDENT
##VAR_FORM=  AFFN,          ASDF,            ASDF
##VAR_DIM=   32768,         32768,           32768
##UNITS=     HZ,            ARBITRARY UNITS, ARBITRARY UNITS
##FACTOR=    0.157963299565203, 1,           1
##FIRST=     4132.6476996994, 0,             0
##LAST=      -1043.33573715361, 0,           0
##MIN=       -1043.33573715361, -439281,     0
##MAX=       4132.6476996994, 380395781,     0
$$ Real data points
##PAGE= N=1
##DATA TABLE= (X++(R..R)), XYDATA
$$ [...]
32578 -4210 -87229 -166415 -259881 -285513 -232425 -220279 -126246 -89012 -24657 6128 56586 76960
32566 76960 42836 16468 56464 74620 106883 119036 -36722 -104401 -49690 89210 137279
32555 137279 150647 57574 -26107 46011 147015 120621 39868 18057 -19067 -34777 -20645
32544 -20645 -64612 -96644 -106085 -89931 -104388 -153400 -129581 -102850 -33301 -9236 21122 62236
32532 62236 2276 -171218 -193411 -95846 51785 63904 14395 -18360 26607 -13287 -39596
32521 -39596 -101659 -80285 4960 6182 -87363 -89750 -207652 -197794 -48642 91970 105492 16913
32509 16913 -17780 -89191 -115838 -22136 85829 -22290 -117367 -62621 59360 56968 -97325
32498 -97325 -77453 102949 130888 100680 148699 233776 273277 235892 137692 105807 -23835
32487 -23835 15725 6913 -60079 -78850 -39104 -12216 -98972 -86800 -49866 25391 -90910 -86468
32475 -86468 3158 49047 44204 54207 -3784 -39729 2499 50134 116481 145642 127041 60222
32463 60222 -15034 30671 19092 -87624 -67773 -113555 -100309 -56796 -37296 -129743 -148196
32452 -148196 -121229 -118123 -117391 -53314 -5047 -46627 -48509 -79059 -103242 -147490 -78509 18045
32440 18045 113310 161153 88741 69879 50086 19053 2488 -53614 -114537 -82074 -22688 -7451
32428 -7451 -53644 -37160 -41280 -30738 21388 55877 -70896 -78383 -109997 -154097 -108260 -104318
32416 -104318 -39132 -33594 -6701 66176 90822 108490 41882 -109992 -133352 -50815 30072
32405 30072 24264 -88611 -77283 27821 -49192 -202533 -194796 -86402 114894 259612 154098
32394 154098 32092 11452 65870 91809 118406 69712 116047 33083 5180 59394 141313
32383 141313 228660 257985 142337 41737 102501 150293 88719 66383 30272 51945 -5609
32372 -5609 -119943 -29457 27038 30646 83517 183330 213082 236316 21518 -89149 35413
32361 35413 14798 -112892 -137022 -98057 -102075 -24191 75125 55996 35173 35043 23847 -37788
32349 -37788 -39274 -118577 -90364 -115975 -180834 -254485 -230672 -199610 -183294 -154112 -49272 -59434
32337 -59434 -68440 33385 -48095 -162733 -174389 -86229 -26409 75645 111803 69277 33492
32326 33492 -59184 -127428 -154138 -81577 -14584 -54789 -79982 26837 -30717 -86367 13581
32315 13581 121875 191817 151299 98945 -84107 -10882 180048 236959 209785 94988 55890
32304 55890 145728 121551 43275 -7664 -58351 -55270 -55148 -124226 -66472 14390 25860 141397
32292 141397 169221 145607 169882 91411 -22433 -99385 -176835 13348 82952 37591 -54551
32281 -54551 -120949 -137535 -159545 -35532 -35602 -205380 -172275 -187281 -247256 -292602 -232027 -121358
32269 -121358 -85100 37630 -13396 -122798 -169545 -177790 -168527 -63474 -20816 -55292 -122803
32258 -122803 -139185 -3511 21740 2976 75583 132150 252987 263341 206217 62584 -6190
32247 -6190 -37541 -150601 -163710 -83491 -3835 54692 55250 81527 131729 4427 19433 20751
32235 20751 15811 -80374 -39639 -34608 -20497 -94539 -116708 -236132 -124031 53495 131640
32224 131640 114107 149453 161235 164247 117074 117389 110239 19076 25410 105377 98834 -7710
32212 -7710 30827 59714 126880 39167 35711 -18780 21549 119276 110632 -9218 -112502 -68693
32200 -68693 -115020 -144189 -55298 -102563 -57602 -35236 -53356 -89316 -147464 -180584 -191574 -159183
32188 -159183 -104060 26537 154976 144264 154417 271592 310549 295485 252404 185596 176154
32177 176154 134874 26205 12583 31743 -3492 -106695 -11480 -10158 57181 155761 85687
32166 85687 46152 -67821 -118826 29055 104958 98301 48532 -26336 -52080 -57032 -101373 -88746
32154 -88746 -3249 -58226 43093 13800 44325 164301 178919 129391 -51650 -75911 -77824
32143 -77824 -79505 -119374 -79443 -42863 53535 52229 -23562 -114478 -70552 94883 -14016 -128086
32131 -128086 -218446 -237470 -112902 -39483 -8458 34628 11487 36681 79676 48253 87903
32120 87903 58302 60279 40196 -47923 -188850 -151304 1392 38975 -9933 -28978 -12645
32109 -12645 57703 104066 87964 83696 -17899 -56310 -22295 -40693 -174114 -168322 -90609 61761
32097 61761 172250 175307 -38667 -120280 -51073 -66757 -64204 -84414 -149965 -168065 -118488 -13516
32085 -13516 40627 -89194 -162698 -187768 -164313 -177320 -119185 -99446 34419 88478 70001
32074 70001 -8451 -29283 20808 -9276 -281 46365 78286 22270 65640 48187 347 -48801
32062 -48801 -15466 31692 86118 20010 6724 -20211 -85398 -20840 -49881 -7247 -52275 -86839
32050 -86839 -16912 -23781 5817 4293 -813 -541 6420 35127 -62323 -61067 -30398 -478 9939
32037 9939 69530 63304 87330 23941 34596 7891 21005 106009 43230 73436 83176 89895
32025 89895 77771 136110 142824 7877 -54256 -40344 54932 31819 38018 24406 33762 238825
32013 238825 356176 265317 204961 100186 85296 79269 -87087 -133986 -23336 29656 -75120
32002 -75120 -123111 -124809 -135959 -22269 154680 154235 36916 -62656 -28723 -16372 -134411
31991 -134411 -290332 -254668 -220130 -201128 -103169 -4211 29724 107313 126282 110275 -1527
31980 -1527 -102165 -89755 -60887 -139900 -50528 31407 28091 27354 13609 57572 130137 69298
31968 69298 163774 73198 40565 46124 109927 122570 45179 -63364 -94151 -35111 -25394 -116535
31956 -116535 -116582 -42563 29780 35033 -1066 -25571 -80423 -168711 -146674 -83332 -34898 41993
31944 41993 -37261 -108479 -150251 -131642 -95587 -148495 -81761 -106463 -79022 -176633 -174373 -17981
31932 -17981 62706 120408 187146 240145 125953 114137 194949 202662 41681 -15416 76920
31921 76920 -60063 -178556 -100490 69390 37183 30274 131954 75840 30771 53577 -36895
31910 -36895 -61738 -61870 -60263 -59768 -47981 -56820 -38868 -15302 -6411 -34167 -246912 -439281 -405943
31897 -405943 -186255 -46258 -906 56640 128983 -5920 48011 57461 29508 25104 20189
31886 20189 -64804 -186215 -308576 -286033 -228295 -131077 15047 224888 273930 184663 -7195
31875 -7195 -61250 3410 -140607 -164997 -76953 51586 71632 28725 89269 145481 174377
31864 174377 206000 169805 171908 117998 68896 -1934 44180 76047 176676 145143 -75524
31853 -75524 -125099 -155727 -173233 -139019 -97913 -38270 106293 129116 49564 -18572 -70523
31842 -70523 -73226 -143526 -53124 75078 13588 -27748 44760 24932 25836 31703 8418 7023
31830 7023 -49471 4652 114765 31117 -24588 -23992 42253 71566 74454 100161 39381 109684
31818 109684 105279 -22642 -104824 -127497 -159388 -95930 -54310 33684 89251 49528 86012
31807 86012 131803 12866 5072 -4753 15173 -39501 46222 88049 46501 -28615 10453 12257
31795 12257 53860 -3010 -67029 -179309 -292154 -272753 -140252 -108591 -139507 -198522 -204373
31784 -204373 -121001 23658 153501 112432 23860 -52254 -133787 -135737 -108816 -102583 32620
31773 32620 18844 -56346 -91869 -151993 -166362 -168713 -229582 -138688 50861 170679 152339
31762 152339 110629 60597 93258 -57763 -116829 -105981 21792 -38569 -112638 -63564 -115028
31751 -115028 -197806 -256456 -283067 -165482 -103564 -92474 -83645 -113912 -44761 54730 152017
31740 152017 216096 145182 158548 162938 155305 65392 -35326 19535 4542 -12341 55944 52161
31728 52161 -48450 -96719 -21415 74024 108652 157154 163032 114444 129385 165987 89627 39436
31716 39436 -104190 -88931 -86142 -153773 -173736 -124766 -80587 -134692 -164169 -168780 -136609 -214415
31704 -214415 -207276 -31363 74944 104768 83618 104403 42520 -20462 -10229 2465 43118
31693 43118 51992 37771 80492 145624 150919 32616 15423 -24948 3086 -10790 -119655 -56434
31681 -56434 -59175 -36102 -13543 46489 -37600 -26439 -49961 -20307 -38511 20200 41218 28040
31669 28040 -36495 -60680 -34359 -1982 -18347 -33735 -38817 -25132 -85622 -172287 -238645 -175299
31657 -175299 -175889 -199499 -186630 -16897 68629 -72186 -139888 -150474 -64268 21947 -37270
31646 -37270 -61531 -20179 -26693 -95821 -92356 -69721 -116545 -126315 -196642 -207652 -83783 90796
31634 90796 104301 162306 210043 149360 199961 283436 261276 240167 320737 132979 -45204
31623 -45204 47785 68040 88989 88933 124623 157855 169141 112945 42698 51413 152563 164249
31611 164249 77731 51713 50351 77115 101871 163564 62480 -36643 80871 46408 33002
31600 33002 61485 -53538 -80420 -169024 -79219 -44337 26339 33118 -34265 -181116 -285761
31589 -285761 -185072 -7904 59112 76359 37957 65848 9210 -36801 -47992 -83872 27079
31578 27079 156166 178799 176307 76590 -13287 -36483 -75380 -88666 40758 66243 54772
31567 54772 38531 -69316 52928 133015 119484 125474 216310 103825 -96484 -72096 10083
31556 10083 -91700 -103377 -106155 -19096 -27765 -24183 52628 63943 72911 58527 18624 -54021
31544 -54021 2541 62052 103322 54926 3459 73762 82459 53682 138182 84712 97484 43426
31532 43426 103360 174565 160334 84380 82354 124048 153700 207000 209134 31195 -3524 30468
31520 30468 -67905 -107797 -69033 -51647 19186 5457 2369 -33254 -24544 -87697 -131868 18906
31508 18906 93441 42323 45931 63202 -64169 -185643 -116882 -81885 -22576 -57522 -42582
31497 -42582 4765 -5294 -66562 -22888 -44352 -78387 -51351 -65698 -7080 -39890 -111489 -155012
31485 -155012 -142351 -45972 -91332 -109553 -92062 -53928 -55887 -163821 -278805 -183206 -73419
31474 -73419 2112 49503 63301 96187 93981 85382 72150 73757 74285 19932 83906 130431 51325
31461 51325 -10177 -56914 -68511 -20537 32509 52090 67188 71128 -15861 -11098 -3667 -36168
31449 -36168 20624 -27572 26869 112428 89287 114461 89569 -9912 -19672 27860 -9305 3767
31437 3767 -134762 -70858 42134 138264 139792 43232 46929 -3685 -24365 78518 33874 -7733
31425 -7733 52845 112153 86814 70803 120517 30671 -97672 -108056 -36607 -17410 -13365 -79834
31413 -79834 -39210 -65062 -145059 -113572 -55220 79671 255981 258899 103067 27421 61826
31402 61826 -46442 -14299 -13875 46563 44330 -19874 -73365 -181317 -151548 -79007 -41800 -15220
31390 -15220 -39508 -77652 17203 65811 61788 35499 -42078 -102319 -48870 -31492 -15624 103959
31378 103959 151031 130281 74171 35017 -20292 107506 97210 22998 1124 21206 54595
31367 54595 -8724 -74728 -105499 -94274 -122208 -150281 -141566 -73585 -97357 -156095 -112972 -51039
31355 -51039 68088 143144 308448 222403 65491 72880 167574 206806 140077 16123 -108074
31344 -108074 -131801 -38107 -34499 -117492 -82147 -30006 106237 147206 188567 123475 48232
31333 48232 60431 -68174 -121986 -29770 -73532 -103739 -59763 -98765 -78317 -55206 -21411
31322 -21411 11852 93478 158313 100062 109071 58080 -48536 -114808 -29125 -44543 -171441
31311 -171441 -235893 -212366 -146399 -58652 -52310 8635 -14271 -59372 -56722 -60004 -74192 1018
31299 1018 4357 22825 71724 17426 -37208 21575 59959 -62062 -219336 -199412 -22395
31288 -22395 58043 32352 -35783 -74351 -180648 -249504 -186143 -47375 43213 -37252 -128954
31277 -128954 -151864 -42810 -47987 -99418 19907 123090 143886 198521 114379 139464 130595
31266 130595 104012 86629 26790 93021 65191 95889 106414 112555 67103 64787 85361 47250
31254 47250 -17215 -133497 -53620 93895 137415 7075 -59508 57688 61987 -80760 -110569
31243 -110569 82825 206610 81343 -39958 -78717 -68356 -10100 66745 60067 25794 -15725
31232 -15725 939 -153630 -113358 -38896 16044 112840 183285 157051 124611 173231 152961
31221 152961 176384 90660 66160 74711 96960 119306 86425 175673 226872 95080 -37513
31210 -37513 -24466 -33179 -158298 -205950 -150737 -140595 15772 80595 168858 227820 201536
31199 201536 77892 41436 48297 114886 32006 -26632 -109806 -127782 -188791 -174871 -71476
31188 -71476 42320 124640 108743 45911 -23531 -176154 -244485 -188515 -112907 -90145 39839
31177 39839 114362 103390 198032 152750 -415 -165208 -112290 -90042 -85082 -162102 -198841
31166 -198841 -182154 -224431 -190457 -126500 -166664 -92060 52464 -9443 -33397 301 -15486
31155 -15486 -21483 -53021 112615 168332 296576 305627 261460 134644 -34855 -124028 -105779
31144 -105779 76776 196703 91152 1249 48931 162179 106147 5556 -191911 -213842
31134 -213842 -263986 -182160 -189303 -261355 -163972 -36949 963 -12957 -1696 18309 -26702
31123 -26702 -115320 -191992 -215379 -126491 -145853 -73272 -29478 -11285 -63252 8180 66932 -45491
31111 -45491 -124112 -12066 63964 44996 -19103 -94 1639 -104879 -55571 28223 -1254
31100 -1254 -39164 -23942 52094 187772 167446 43392 11837 -62687 -84666 88653 99525
31089 99525 43785 -21406 28223 105097 197134 163706 160728 199740 204856 126600 27111 -40145
31077 -40145 592 -66559 -155095 -97787 -6862 66440 33872 -12925 -50419 -108433 -71248 -56492
31065 -56492 -179872 -139824 -46739 -27464 -63162 -71009 45311 57929 17932 31200 -58840
31054 -58840 -53281 50840 -24184 -71874 -53935 -91969 -94697 -39571 -40752 25601 62580 -8648
31042 -8648 5517 83657 171776 272049 184552 176563 139103 101723 -98374 -135767 -7603
31031 -7603 116246 200512 88588 7273 -48203 17079 4822 27510 -10040 56607 64765 -106164
31019 -106164 -131288 -117121 -172686 -132788 -137186 -192767 -295122 -158764 -122757 -172212 -97800
31008 -97800 -64507 -44604 -28816 75040 105252 105582 235747 218050 132225 54202 -16228 -32197
30996 -32197 -98307 -185339 -142233 -69282 -146028 -166303 -151089 -145515 -140354 -74756 -82453 -89231
30984 -89231 -54400 -48939 -135927 -8067 115835 107768 56353 49084 63423 -31147 -88170 13165
30972 13165 -4166 -138984 -77013 -2611 -40446 13133 39828 91851 89812 128972 56093 7283
30960 7283 -28410 -13385 38481 64741 98492 54997 116187 115902 119258 71759 84368 79899 204938
30947 204938 214452 101191 52924 76014 111444 108422 104714 57400 -61608 -59687 -55117 -42725
30935 -42725 -79165 -89506 57316 3595 -83511 37618 139381 243817 265482 69805 -88917
30924 -88917 -197136 -189750 -267693 -299271 -218395 -216107 -242538 -117786 -55540 -26344 -91903 -49517
30912 -49517 -2514 -69895 -125035 -73485 -44499 -57166 -125987 -133337 -1088 52892 71409 -71293
30900 -71293 -51663 -14634 53722 -56797 -125995 -78389 -89835 -57004 56368 -14547 -64091
30889 -64091 26352 130434 80618 109745 53772 4385 -63398 7946 69157 28743 -38321
30878 -38321 13107 84475 -71051 -166299 -96666 -73607 35896 27060 10398 39220 83054
30867 83054 59483 50273 -41818 -7964 41452 60002 187272 241628 198283 144596 141813 128971
30855 128971 106286 77816 76204 34202 -57802 -73023 4616 -14349 138457 93442 27446
30844 27446 -64394 -152503 -225275 -244514 -185710 -55549 95559 28675 -95828 -198197 -312062
30833 -312062 -246839 -188451 -76108 -29194 -16120 -108369 5979 90266 124753 172573 216134
30822 216134 140283 39178 -30864 -35716 -108456 -93434 2417 -167017 -118420 -17064 12746
30811 12746 3681 -83803 -186754 -144260 -30035 67451 38813 -25726 -64306 -129751 -115412
30800 -115412 40614 -3362 -113287 -85102 -60923 -17881 -6130 -37972 -62944 -47281 -110623
30789 -110623 -77868 -82414 -99429 -29732 -32831 17370 175020 119987 93234 -30738 -131721
30778 -131721 -127860 -155766 -139573 22642 185259 184305 175581 204963 287146 396164 389860 186854
30766 186854 -89476 -269365 -191199 -102392 7171 -22749 -21697 -46904 104094 282394 277330
30755 277330 139189 -86532 -149733 -168555 -172923 -5193 153330 26232 -45432 -140535 -106153
30744 -106153 15188 -17600 -41174 -19626 23033 -19347 44536 -5658 -168901 -289202 -195106
30733 -195106 1743 50746 35209 -23660 44691 116838 100095 14143 -72413 11564 64579
30722 64579 -16252 -141901 -79743 -5337 125228 195081 250484 261726 64256 11268 -35507
30711 -35507 -130712 -123968 -103196 -88556 -171332 -217551 -237625 -128312 -104544 -108752 -99551 -31341
30699 -31341 -120517 -305560 -303764 -163269 -77406 -25276 -89049 -125561 -59423 -59142 -38003 -65625
30687 -65625 -12584 -25945 -81573 -147714 -113276 -53295 -13499 65612 76890 -58293 -170019
30676 -170019 -127422 -48313 -35933 23140 28264 77652 13375 -23362 -77395 -94651 -154831 -115917
30664 -115917 32710 118430 105008 113085 177117 266761 228647 176138 146289 142681 101334 94860
30652 94860 76343 -65695 -113054 -72265 -14542 -40814 -77162 -37796 -43606 -62115 -110570 -115605
30640 -115605 -131752 -51931 43421 109441 151384 91007 -48036 -21944 1274 40701 93204
30629 93204 100789 136176 159285 59231 34371 -9392 -76207 -13675 -25878 -2392 19789 57721
30617 57721 112176 12995 -37739 -51849 -341 62633 97214 189969 204583 167268 63518
30606 63518 70630 84928 94358 37371 18339 60369 71582 -12605 -38821 -85410 -72885 -104953
30594 -104953 -32260 -21841 37182 121118 99689 57614 159946 124297 -72532 19988 80497
30583 80497 28642 -13328 41082 37068 45082 181334 235887 169572 119612 18943 -19287 36780
30571 36780 61110 -31617 -9354 -63022 -128983 -77377 -145418 -31232 -89583 -116967 -121888 -213094
30559 -213094 -210700 -243882 -61150 41520 34805 -22822 -115364 -138415 -127153 -175567 -56613
30548 -56613 60439 50579 -66335 -70294 37623 108358 108800 79241 -13957 13170 37133 -121461
30536 -121461 -85045 -74047 -132460 -155977 -150885 -76514 -72586 -171873 -198774 -136687 -176308 -32941
30524 -32941 10907 22279 56198 44113 83120 23358 -32057 -155612 -195403 -221470 -131151
30513 -131151 -149444 -199236 -200148 -202417 -209829 -189730 -132857 -92303 -76746 -134869 -199888 -135166
30501 -135166 -36821 -113713 -189664 -135981 -100481 -43056 -47618 -38849 -99051 -90568 24399 94203
30489 94203 66293 10223 68984 83861 -101651 -166120 -68362 -14395 64571 -78818 -104654
30478 -104654 -46455 -9342 -26107 -21794 -97688 99906 276596 181865 -9057 -38757 -56010
30467 -56010 1123 -61950 -36180 -94396 -110795 -50476 16040 18729 -82733 -96229 -26354 34010
30455 34010 159980 170741 230593 131317 40323 89679 196422 36703 -74689 -196417 -150040
30444 -150040 -65542 37185 69661 88633 84817 -8187 -145493 -249309 -145024 -24433 -14588
30433 -14588 -180051 -164059 19796 72845 140266 178272 69889 -63652 -98845 -11787 53275
30422 53275 -19884 -126298 -41167 -10902 68274 71354 79633 83261 205082 248688 108233 5541
30410 5541 -32070 -11587 13031 -113828 -140699 -53060 45104 75481 107370 15103 5280 -153173
30398 -153173 -199784 -101196 -26602 -17588 75196 -38928 -70824 -109345 -381382 -323571 -210330
30387 -210330 -167067 -101966 -96106 -194672 -113994 -25137 19682 -26255 68565 176858 36654
30376 36654 -2588 -85517 -64611 -77655 15715 135877 136299 79939 14002 -36171 -30846 -6692
30364 -6692 79218 175085 140713 17538 -46212 -110738 -83098 -30688 13636 90750 185225 139059
30352 139059 106199 156334 192285 222229 84415 123927 -6725 -130747 -66273 27740 63487
30341 63487 -47223 -99302 19139 34099 -49596 -19073 -10915 -76717 -149443 -68093 -66220 -78021
30329 -78021 -17482 -42188 41101 45499 48710 6946 -127746 -129826 -52854 -8275 87544 197837
30317 197837 179378 15575 25770 121077 -3326 -106661 -127934 -101077 -3436 68909 58493
30306 58493 13050 -56453 -81204 -13967 171732 269603 187706 82170 2863 -4651 -50321
30295 -50321 -25820 84363 144732 64359 15654 102600 114036 21186 -35046 -103881 -105173 3965
30283 3965 180885 226639 254981 236607 190985 119128 134952 117099 99078 94988 -38730 -112451
30271 -112451 -55538 -11341 115258 30223 -71807 -72822 -98278 -68292 -46913 -90027 -140585
30260 -140585 -29809 32771 -99347 -158308 -79154 117641 60503 16782 86588 170312 215148
30249 215148 261225 89756 68230 144385 88016 137599 107738 132925 139507 61928 102220
30238 102220 117752 29814 62264 69513 6646 -6687 47714 -2645 -48683 -7403 85115 180814
30226 180814 144211 23737 6684 50285 152101 212734 166065 111659 75947 70826 64299
30215 64299 -484 -19921 47360 97735 10605 1649 47694 122762 104399 171234 169248 84071
30203 84071 -23913 -10480 27003 50531 112789 154558 122589 135494 23668 -29288 -15435
30192 -15435 -98173 -85343 -183652 -225336 -170877 -105398 -72525 53717 43570 11588 60972
30181 60972 -51539 -118908 -138261 -32645 1126 -1234 178 -6518 69031 141248 62832 28805
30169 28805 65816 31308 8904 12941 -117846 -222947 -180651 -73980 -120659 4817 -42749
30158 -42749 -62569 -48924 -23057 -62168 -79672 -31632 63988 53830 -39607 -40289 -62486 -7168
30146 -7168 -45351 -58591 -50246 54949 13134 2082 -40196 44371 153605 135410 79550 57936
30134 57936 44318 60558 119039 122976 -21164 -34245 -46616 -118237 -28468 9137 55911 -18015
30122 -18015 109112 114656 55955 111333 104584 -7218 -77977 -159731 -46301 -79545 -148025
30111 -148025 -101197 -70556 30756 147726 149927 66435 -35054 -61398 -43195 -33357 7094
30100 7094 51087 131564 94405 -42048 -2048 132492 122693 32432 -8687 -73576 -82429 111682
30088 111682 168128 -90981 -220421 -102674 59070 78752 -60057 -28048 50664 56892 52876
30077 52876 42994 -17893 92070 145366 185596 244089 228976 180889 103168 115978 61115 31704
30065 31704 60639 29390 -2370 32708 -45327 -88117 -26790 -4694 73188 86533 184086 259058
30053 259058 268131 201431 74430 52947 23723 -5381 31057 93645 1689 -99652 -210039
30042 -210039 -89516 28093 28630 -89807 -167660 -174836 -84337 -4241 -1568 73940 -18046 -80938
30030 -80938 17915 53795 -78971 -155300 -171458 -146224 -39493 -4207 4634 26046 -719
30019 -719 -113353 -203302 -300715 -244184 -156414 -32975 51761 72252 68439 57197 -49649 51110
30007 51110 138603 127568 175897 200047 243652 153694 -8102 28821 43571 -97979 -19898
29996 -19898 -39450 7987 76685 77973 -11359 56260 -19030 -81641 -129974 -148769 -76767 -112309
29984 -112309 -166046 -129714 -36725 -35499 -62358 -33328 -101576 -161638 -137745 -111890 -100147 -30917
29972 -30917 -20540 -24066 77236 86604 72620 40697 -24178 92814 104828 154715 173881 78895
29960 78895 -8643 -35386 107602 158528 202946 131215 68432 144123 200921 122752 -41045
29949 -41045 -62986 -19873 -60300 -101499 -79957 -72526 -65106 -68540 -55748 -40078 -42041 25618
29937 25618 200695 145704 52334 -12128 -37047 78012 174220 276560 294005 243386 156527
29926 156527 -14228 -99724 -53526 -58836 -27035 -28784 23885 -17987 -7040 8855 -82892 -110872
29914 -110872 -49763 -99417 -91588 -24250 37267 46210 97626 68842 -22135 72228 91167 60762
29902 60762 -26248 -45291 13965 -19710 -47841 -103266 -101774 -56282 38449 159745 245302 220727
29890 220727 117763 34000 30793 -61851 -62348 27229 -119198 -164126 -138499 -210721 -58293
29879 -58293 69519 44477 -39698 38395 66374 98046 143516 148697 222542 204425 140935 -63474
29867 -63474 -64379 52 7625 99103 37844 59841 -59373 -50873 126992 107440 -86923 -271264
29855 -271264 -252699 -158396 -97123 -42364 -33957 -47532 -4954 19260 -7142 -7857 45429 28696
29843 28696 79017 11383 111205 82810 48120 66685 38815 -38244 59910 43047 5651 -31713
29831 -31713 -73746 -119068 22275 146441 26825 272 33287 -72879 -126361 -19384 83877
29820 83877 167395 50005 13143 -85535 -157732 -163097 -137549 -56953 -48014 -52141 -72479 -145678
29808 -145678 -156825 -85274 41861 1471 51507 32771 27199 13202 4985 5723 16511 -64739
29796 -64739 -78181 -142233 -41719 -126071 -155492 -113745 -109987 72055 107643 37277 -7754
29785 -7754 12336 -9278 -11398 -8747 68109 146939 177099 215454 21886 -107591 -40625 -39399
29773 -39399 -42848 -117203 -126592 -82070 -53670 -24687 -24437 -48756 -50124 -69141 -71947 -23725 -5049
29760 -5049 16433 87203 75893 77387 160342 233276 168858 168600 94295 -11131 -20971 -65402
29748 -65402 -177031 -71301 -97083 -134888 -80749 13767 46916 -10794 12400 74077 67569
29737 67569 53236 27498 55960 -860 -43336 -15246 58462 51956 114077 69746 -19884 -148066
29725 -148066 -112183 -67768 -14854 -9300 28673 91593 43235 -72735 -33514 -54284 -129624
29714 -129624 -29863 37831 31350 -66694 -58478 -142 -11547 60472 124924 165865 147954 12002
29702 12002 36010 232794 191156 153905 123357 62272 55299 -125671 -174084 -175216 -89001 -25886
29690 -25886 -138878 -183159 -115438 -2292 53373 -97855 -114124 -108767 -163996 -62145 64625
29679 64625 78091 -111853 -100938 11209 46095 108442 84057 71998 23642 -18269 -102377
29668 -102377 -143169 -105167 -70848 -135915 35787 122054 213727 248095 191264 2419 -107795
29657 -107795 -22283 26444 10585 -25435 -2543 28944 -24079 -65207 71925 114473 117464
29646 117464 28297 -24160 93754 79898 83620 54516 39963 -29466 -65630 -93370 -161990
29635 -161990 -114317 111200 232896 101212 42537 95443 60749 45304 139450 103803 -54552
29624 -54552 -93842 -37509 168471 224219 136721 89722 4502 8261 4017 19416 -17289 -29610
29612 -29610 -55358 45050 95130 109868 -43310 -73707 -125595 -31280 17569 90604 175758
29601 175758 259558 177093 149918 264241 187332 114559 61166 -22522 -99621 -64505 -76339
29590 -76339 33191 22169 -11937 34367 9551 -17105 -93983 -76757 -50952 171364 209734
29579 209734 103378 101764 207388 100613 32408 -39586 -30146 -32051 24765 -54593 -116398
29568 -116398 -99740 -48316 -24816 1097 51483 174410 193592 249772 284265 151032 -20628
29557 -20628 12237 72877 -68141 -71563 -53124 -50298 -78792 -194075 -176057 -18756 27339
29546 27339 -8078 -61254 -107646 -94780 -36609 13632 -1595 67519 99093 104330 53991 -6178
29534 -6178 -64575 -60048 -56949 -105145 -115571 -157072 -193014 -228137 -39663 -2521 17501 51435
29522 51435 92997 65302 11871 -79976 -88271 7707 -8341 -17924 67390 118761 60184 100544
29510 100544 29638 82498 123534 130988 91121 -18772 24132 95785 62818 11809 3770 55797
29498 55797 -76160 -98755 -113263 -91996 -90170 -98299 -75243 -97824 -119316 -102964 -103409 -53473
29486 -53473 -175174 -174966 -74351 24244 -40133 -74656 -54979 107780 107220 55119 10442 -15861
29474 -15861 112736 61714 -56649 -136094 -177239 -60591 91878 212581 93198 -27332
29464 -27332 -1785 41167 19723 -16286 -49191 -70778 9744 152375 126187 68066 -23847
29453 -23847 -107339 -235428 -281955 -132562 -4954 63315 88406 148727 167607 110719 126717
29442 126717 83956 -64812 -132008 -19320 6199 156129 280986 366351 268427 145119
29432 145119 32495 -77909 -55536 -85010 -143160 -137413 -193048 -205094 -227260 -143581 -93367
29421 -93367 -42656 -145929 -154910 -28156 -83634 -114813 -119077 -114968 -176802 -174804 -3151 9982
29409 9982 -86798 -85089 18039 57952 194122 79158 1992 11618 -36911 -63064 -138042 -132829
29397 -132829 -131232 -111822 -163775 -185264 -77106 -7494 -60948 -41231 -80329 -22618 -2178
29386 -2178 47288 588 -49840 -118128 -228227 -131646 -3881 -1735 60704 60714 4462 -70284
29374 -70284 -43938 61301 110832 92541 68993 -25938 24392 170288 201717 73623 -19203
29363 -19203 -13597 52829 11051 -108189 -241075 -183312 -53039 111897 150177 129313 43495
29352 43495 -113413 -184169 -89295 -63674 16248 29446 60053 18678 1486 -54585 -67804
29341 -67804 -24832 -1974 60335 76315 46575 25783 64661 64946 32128 37092 -7298 33097
29329 33097 -7100 -188721 -169006 10810 -28052 -152388 -126179 -52018 57639 155465 140987
29318 140987 127005 58679 49961 -4038 -70978 -1787 -7132 -92635 -105878 19991 -22459 29365
29306 29365 78784 -86202 -223739 -165216 -62193 3461 -121875 -65638 -53640 -79713 -86250
29295 -86250 -54378 -31017 -56521 -129541 -36806 67292 155335 167991 114869 17550 -9580
29284 -9580 173960 295047 220671 238559 228541 107749 22558 126754 108503 81693 158325
29273 158325 92668 73350 60800 -13216 -26302 13385 -48002 -91769 -5016 99652 125866
29262 125866 212621 255152 144898 72237 -2929 65798 48773 -712 -121627 -113855 -77453
29251 -77453 18989 605 -52622 37315 164242 287295 316861 218338 90301 76740 132058
29240 132058 130751 -49020 -108251 -49568 -85003 -25074 52805 58573 92093 51348 -69599
29229 -69599 -81354 -56976 123700 187760 236994 259999 264217 241867 83784 120334 150042
29218 150042 208852 207038 162282 262333 250818 147624 133020 170548 154884 101027 47199
29207 47199 45330 153751 128681 57419 163041 167469 79996 109396 27687 -61276 -25672 -23521
29195 -23521 -56764 -60606 15321 79219 92602 94384 -20174 -157214 -196253 -64926 -9736
29184 -9736 17845 -53043 -185078 -140377 27624 70972 4360 -20174 17076 97349 137173
29173 137173 178146 111154 54874 98918 78194 -22665 -143096 -219933 -6019 157958 172159
29162 172159 89225 84418 95975 82210 48577 101685 36946 -38739 -36265 29289 115128 36078
29150 36078 -118401 -96849 87772 116188 117949 15469 -21521 9387 60434 28622 -69657
29139 -69657 -22758 -42690 30616 171955 223909 243667 266132 358069 286554 153186 200076
29128 200076 371705 369662 242091 157259 83727 -17473 -50117 99063 195690 209155 124527
29117 124527 77033 9814 -111833 -77621 -47489 47614 -76393 -192433 -121227 9679 73205
29106 73205 25965 958 128245 282649 264584 34344 -138007 -173066 -148302 -67220 6277
29095 6277 68919 93754 -19961 -161866 -52946 73722 56005 -24026 -67512 -186186 -193941
29084 -193941 -181129 -89356 -5119 -20926 -52104 -85861 -49473 -94162 -104945 -36190 2609
29073 2609 -20418 -17991 -89816 -118633 -78582 -91676 -131126 -117836 -42436 -115122 -134331 -16362
29061 -16362 23047 -59975 -82658 -118252 -51474 20074 17427 22958 -23683 -129463 -107279 -58399
29049 -58399 1540 -11896 -22604 56532 23659 -8334 -126724 -243638 -315702 -328050 -184668
29038 -184668 -200771 -109639 -95906 -135578 -133657 1917 48508 43686 63335 -25133 4161 90948
29026 90948 52097 130888 285107 226474 110675 35086 -33934 -44177 43599 16032 -89811
29015 -89811 -50701 18212 -7986 87516 127666 143453 194386 159398 133045 98343 126680 143474
29003 143474 92867 48273 79075 34549 22922 63847 142473 75035 70744 153621 223065 154289
28991 154289 -8202 -42238 90059 105714 74743 91639 43292 -38936 -112653 -67664 -56398
28980 -56398 66984 117759 27831 -12528 -68205 -53968 -2180 -70653 -42556 34199 78170
28969 78170 104942 111224 94476 59508 37310 47556 128460 101281 62010 30499 -5762 -13587
28957 -13587 103713 146300 91734 -36359 -28238 97533 86326 41746 87415 175292 124893
28946 124893 46570 69360 88568 18664 -74578 -107283 -138460 -111791 -183270 -159025 23756
28935 23756 56772 61862 36320 -35018 -78814 28162 114695 20916 31902 11689 110 456
28923 456 27656 -14182 -84470 -91139 -6992 120009 136047 4634 -70260 -28882 78878 -5884
28911 -5884 -34 -42781 -139184 -176556 -82728 -70995 -37184 60672 101940 131457 133992 191658
28899 191658 178326 196021 78702 -97061 -155484 -78817 -97405 -79158 -98418 -60572 -44628
28888 -44628 -58823 35125 22179 49464 41103 -93195 -54464 25368 -43020 -168129 -128166
28877 -128166 -52072 -122629 7758 27346 40989 83091 167336 208849 150652 62361 65721
28866 65721 216152 186400 153102 152562 151520 187369 88512 -18292 -71955 -26762 138026 123964
28854 123964 64732 42316 78611 41522 85493 153280 151799 -11308 -22633 -6603 -38491
28843 -38491 -49609 -29904 -53600 -126794 -22464 72431 38442 -7947 -75474 -13953 95231
28832 95231 -12240 10655 1782 -100425 -106091 -81082 -127469 -126257 -63075 -79965 -63698 -42925
28820 -42925 -34734 106728 118255 46625 -25249 18818 47306 47200 43795 22427 13373 -6987
28808 -6987 -99420 -91082 21422 180434 144491 175668 187191 113924 48134 -48895 -120337 -203468
28796 -203468 -243087 -231261 -172145 -121222 -41968 -131450 -206016 -217866 -196652 -77822 -16655
28785 -16655 73780 64794 56975 57625 26210 88636 106630 53913 -13417 -67068 -145440 -258406
28773 -258406 -170901 -103833 -146491 -155031 -74763 -13704 -53215 -125803 73544 258676 202531
28762 202531 53070 18554 42791 -9802 54528 20372 -58681 -98602 -197502 -126389 38648
28751 38648 64842 181591 49936 30108 -29379 43439 15125 20983 -36704 -51643 -101084
28740 -101084 -68056 -27918 74233 94141 -42697 -54770 -38943 -50482 -8797 -50865 -123291
28729 -123291 -267077 -289285 -307828 -184860 -138571 -9625 59369 -11445 13338 115193 64907
28718 64907 -62803 -86939 44124 144868 36 -126827 -39803 83356 -46985 -172250
28708 -172250 -110661 -22973 1191 61681 17844 -13422 -15066 -73773 -76366 32401 27042 15624
28696 15624 -46865 -25296 -111534 -57648 119108 65981 58839 195809 121474 31186 2497
28685 2497 -80416 -142659 -81682 32197 50874 4278 -32984 46870 110497 48113 -43088 11515
28673 11515 111831 -24820 -83077 -134191 -107261 -73882 -80137 -141186 -122327 -22628 41603
28662 41603 120325 162319 154191 116941 84711 60507 32975 20012 78455 70480 115930 121079
28650 121079 149232 168759 28723 54391 63002 34383 5924 -103258 -162390 -119619 -3739
28639 -3739 10531 123897 111074 8381 76250 189496 177856 75327 -14917 -35814 11745
28628 11745 -25861 -98341 -88590 -162426 -228628 -207425 -256638 -103282 -83436 17627 -3714
28617 -3714 55154 14797 13011 188574 111402 46976 26357 84581 129015 70663 43458 104383
28605 104383 -8905 -6952 66639 173923 235984 165831 148379 172287 113520 88012 104480
28594 104480 78111 34678 89957 242016 188915 94199 32984 -60427 -97860 -47064 -34692
28583 -34692 6617 -20990 -92701 56004 122426 194288 180209 8655 -127840 -178560 -260956
28572 -260956 -198808 -23828 70956 136194 192098 251422 204934 166907 96218 100143 103162 204730
28560 204730 292140 287299 328784 306834 144586 7415 -5874 -49456 26122 90032 25470
28549 25470 -45918 -137115 -156151 -100253 -68457 -94329 -15928 46011 -47505 -105741 -75560 27450
28537 27450 46650 53134 -15477 -43696 -16182 -115170 -245204 -257891 -242609 -233900 -165857 -46539
28525 -46539 -138032 -220397 -139088 -24536 10295 -79725 -116183 -119094 -22679 18738 -8132 9162
28513 9162 78243 131233 154147 140470 91251 7700 4231 -5568 110362 14311 -119996 -128343
28501 -128343 -71407 -101069 -99728 -42881 68573 145328 130760 44518 94615 113493 137059
28490 137059 119943 62704 37288 110384 188413 175182 37324 106950 176853 149344 125752
28479 125752 209040 115791 -12726 6153 -69445 -78396 -67334 -78645 -132453 -26297 -26696 -84835
28467 -84835 -48768 212 -11304 -22703 -10730 -63168 -94393 17124 -5610 -147147 -209986
28456 -209986 -101215 -110224 -195771 -115293 63165 107166 59852 -83889 -87776 -35193 -71778
28445 -71778 5029 22438 70758 105438 97470 97458 163019 110813 164614 123020 45292 39407 5709
28432 5709 -60567 -205454 -215942 -119103 -51644 -58738 -3757 74145 184127 140104 147063 60530
28420 60530 -7295 69112 118371 41884 -87253 -64475 132887 239905 177523 44492 45789
28409 45789 -25182 -52635 -104836 -94057 -121379 -83872 3230 55455 68825 67403 71809 83971
28397 83971 44884 103941 109674 43735 124761 108999 110654 63534 94090 48663 24927 -74031
28385 -74031 -168650 -94954 17229 81891 24732 34419 36340 -55083 -26284 55480 51410 121034
28373 121034 137551 111608 188783 184260 54365 -111851 -61949 -91934 -24692 -88235 -91020
28362 -91020 -75919 -66619 -81851 -123435 -97928 -45170 -153287 -157717 -99104 -93305 -159040 -127400
28350 -127400 -33015 35504 -3781 -20640 52397 106739 47350 68788 107858 -28686 -49214
28339 -49214 -78325 46758 68787 85278 106967 52817 59056 113546 152232 7188 -19645
28328 -19645 -88492 -54074 -30324 65006 166664 193183 214026 227315 294682 279701 218619
28317 218619 114154 98588 123471 128243 162051 118118 169795 219089 170254 15339 106543
28306 106543 165435 151485 -24841 -114267 -72144 66714 119481 68069 125976 93595 -85951
28295 -85951 -155623 -140574 -69374 -101276 -56328 7354 -13919 -37417 1392 -50182 -128486 -28435
28283 -28435 23951 160851 196415 167173 138377 -4598 -105073 -185871 -183713 -64801 19452
28272 19452 -38464 -66122 15790 144348 119044 37652 38084 -7846 -117732 -165956 -174831 -125891
28260 -125891 -79796 -51887 20975 105182 184411 213346 208935 49542 -35315 -35090 31598 87365
28248 87365 117990 55695 -53224 -52219 -131335 -105442 -111679 -176978 -204510 -114315 3315 66482
28236 66482 27661 -99592 -115417 -148239 -119562 -144741 -140063 -204261 -187542 -201128 -136630 -116887
28224 -116887 -37301 -36774 -108770 -125168 -48919 -36188 -205654 -149772 -65486 7240 -62700 -125386
28212 -125386 4047 13562 -57411 17193 37065 -58742 -121862 -55862 -40740 -42754 -44847 -107304
28200 -107304 -130184 -104825 -38031 10846 -47259 -112999 -52997 -134196 -69535 77088 197264
28189 197264 188330 3076 -2906 37039 28012 19064 107035 67257 -60404 -160215 -146398 6060
28177 6060 169777 185247 87328 -13689 -115952 -70744 -17060 -41879 -89784 -99830 -111692
28166 -111692 -128067 -90320 49910 120300 86068 77834 -19885 -79656 -39969 -26972 28283
28155 28283 -48190 -47211 -139206 -82588 -92152 -66161 -53728 -149924 -120217 -58020 -26964 -36079
28143 -36079 -133227 -100635 70163 73652 94385 91255 34152 51478 152964 41695 103699
28132 103699 88473 -5648 17745 44029 44297 -13897 -36718 -7270 -23107 20197 100907 101876
28120 101876 88980 78190 96600 114571 142031 99773 19155 -6115 -41094 -36767 -117602 -109893
28108 -109893 11821 117673 178318 55933 82910 92269 33864 -21388 -68081 -45662 -40272
28097 -40272 -21007 34330 -6492 -71821 21940 64121 -47892 -97295 3401 21297 28856
28086 28856 45667 42668 118586 98582 84700 102029 127306 99347 232265 217853 33446
28075 33446 -102001 -55359 -77323 -14617 41558 8697 19911 53263 9525 -53939 -149414
28064 -149414 -212080 -196475 -44307 18976 -42976 -6608 58039 67444 14699 -38348 -73336
28053 -73336 -45752 3251 4695 -73640 6193 57865 37983 101113 72959 -29165 -57499 -45540
28041 -45540 -46348 11928 44345 70991 -25440 62279 278758 236118 135893 132607 103048 148781
28029 148781 167665 94227 118807 181114 184640 94754 3923 -4799 42636 -58874 -73297 -142048
28017 -142048 -158237 15164 113957 138322 50928 -8578 46602 60184 118014 101079 164080
28006 164080 56140 40702 20720 28118 505 16890 26722 18790 -46472 -94458 -4066 6876
27994 6876 28188 143547 224380 198081 136472 81658 167773 224870 217634 187955 93785 -70687
27982 -70687 -204359 -237761 -143806 -40840 -3243 -27954 -127806 -81476 -50306 -116406 -111298
27971 -111298 64829 160181 110747 -50058 -15164 -66838 -78849 -66282 -115143 -99882 20055
27960 20055 78259 -58248 -18491 27835 -6031 119703 161048 165517 172837 141371 120149 127122
27948 127122 -5649 -69718 -72763 -67318 109348 163897 151029 147818 54363 -19747 13125 188936
27936 188936 87414 -30156 -45500 -6754 -43537 -52519 25667 69456 126070 134893 48805
27925 48805 -74257 -183813 11507 94079 35720 37735 21523 60370 117385 64689 27547
27914 27547 138334 119710 -21684 -91983 -68394 -94079 -98031 -1395 13065 -36116 -293
27903 -293 22449 63657 75498 -28398 23559 146612 170205 61571 -43104 -46453 -25406
27892 -25406 -59869 -15671 72529 44044 -54255 -162222 -166296 -198517 -185337 -116283 -63824 646
27880 646 55372 30970 99087 111842 110451 116637 101669 132360 210042 187928 72103 57185
27868 57185 -6775 -2786 108781 102296 166462 135341 68446 64025 97601 147275 147791 47751
27856 47751 56773 47410 -41749 -40058 -28351 55815 65285 879 -85333 -87477 19667 95115
27844 95115 87790 69574 139126 94365 141289 231996 198868 232448 187069 91358 36037 -27451
27832 -27451 8564 24463 72447 152962 282055 352361 280950 130978 95109 -18737 -137754
27821 -137754 -204258 -125732 38803 97160 68195 100248 119738 -99547 -190783 -119568 -56231
27810 -56231 60250 85570 100327 44240 65569 13920 -14707 47697 82156 70355 105026
27799 105026 66746 -3398 52152 123113 9415 18962 126590 80587 14441 126236 107260
27788 107260 181347 189482 109509 13018 -18462 -13517 92473 36439 -23726 -20736 138068 153312
27776 153312 13379 -53299 -136378 -137888 32314 125319 31294 4509 46175 40421 68088
27765 68088 164044 156902 154605 78230 40329 -141141 -136089 -81746 -31086 -7368 117847 79950
27753 79950 -14133 115449 161664 210761 136279 25633 -84956 11812 80685 63949 -26885
27742 -26885 -25578 8722 1746 2670 -41873 -60176 -103629 -88114 -126708 -168598 -41445 83732
27730 83732 -5678 -130677 -86015 -8380 8727 -63324 -29765 12362 28445 -37945 -266
27719 -266 62469 -18825 -36683 -120403 -81025 -157107 -139279 -117696 -51882 -2289 -68913 -90804
27707 -90804 -25055 5693 -76745 -53194 3008 12428 -14959 38824 17203 -75713 -80560 -40630
27695 -40630 -44517 -93380 -169484 -287499 -273900 -261617 -147510 112421 199586 55189 67574
27684 67574 -22892 33751 114096 111273 -53626 -145753 -165223 -134389 -84570 -21682 9843 -14389
27672 -14389 -16478 -127276 -65248 -55559 -19564 -23087 -89643 -157923 -167415 -119808 -17026 -6596
27660 -6596 -26506 18550 -111133 -95763 -13446 -77993 -107925 -188786 -138221 -25295 193533
27649 193533 198552 122302 48771 -42252 -95490 -49278 -39950 -25938 -4702 98165 194408 187950
27637 187950 24127 -63260 -103595 -58982 -23765 37402 54846 112818 207537 176609 -41676
27626 -41676 -211751 -257268 -71682 47448 -38175 -68970 13276 141304 110517 156551 179198
27615 179198 107634 -23490 -101485 -60208 37460 -55522 -165400 -132064 -23938 102459 82185
27604 82185 -5880 -195217 -291143 -150363 -96051 -54797 22451 -17154 -110634 -113886 -111595 -66265
27592 -66265 -133055 -200055 -61928 61583 26815 -83131 -31009 -3608 48628 65251 45471
27581 45471 27106 98904 604 -124884 -75497 -35256 29837 35706 12231 -34694 -50187 26641
27569 26641 174567 89422 -101691 -101525 -26173 26512 148001 218041 82966 -46412 53302
27558 53302 135752 52522 -25262 -77082 -188184 -337489 -271594 -285923 -227467 -101652 -37854
27547 -37854 -66865 -57663 -7748 13719 -57607 -69854 -42717 -39252 -72276 -54219 -113339 -155675
27535 -155675 -99238 28980 77128 46550 -118804 -96036 -35977 -94326 -247919 -203505 -109639
27524 -109639 -101734 -180430 -110835 -47044 37826 23341 44103 124963 138215 137985 101301 87040
27512 87040 95808 95493 45397 33102 -48372 -135823 -32580 27254 -10810 103393 114712 159950
27500 159950 1144 -45119 -25553 -3528 44740 -33674 -40394 -115469 -87347 -52741 -40675
27489 -40675 -30929 14243 111432 136905 88481 68565 12704 -5772 -54060 -124442 -128586 -85480
27477 -85480 -35248 -62446 -60622 -147272 -102299 -48698 -122454 -143644 -141034 -78901 -11349 69350
27465 69350 34250 -17380 -59594 -22389 -115500 -13986 -20457 63800 134203 83241 -2041 -7199
27453 -7199 -4065 12243 52438 79971 118752 -12634 -52563 -60425 -113485 -120578 -84977 -42440
27441 -42440 -259 11275 6001 55021 83274 86535 179074 98201 47534 82016 80680 35988
27429 35988 68585 121909 116289 54803 -48858 -61008 -17293 95834 10508 -125112 5722
27418 5722 60331 9868 -31159 12294 -38614 -98495 -41761 -14687 -21642 -109085 -174006 -77186
27406 -77186 -83381 -149172 -55454 -1583 76325 108144 78766 59885 -37516 -79265 16713 3742
27394 3742 -137923 -77138 4315 47832 33353 -23880 -46281 33346 96654 177584 189476 174299
27382 174299 209761 121818 -35547 -36532 -4696 -7404 -61516 -78261 -3893 148294 150696 81944
27370 81944 100594 62607 106222 163243 167657 189803 281882 288521 108063 122700 152201 69743
27358 69743 2493 2420 40906 -21797 48611 117891 130240 -30579 -229958 -228227 -128215 -30663
27346 -30663 -47458 5022 7934 -6795 -71284 -76749 -115154 19089 122859 195004 175863 128705
27334 128705 141746 103297 93937 162986 196529 221931 181953 120864 141758 249603 225074
27323 225074 144259 18461 -144124 -195784 -138822 -40336 -20638 -34589 -12491 -18281 -25611
27312 -25611 -46979 30028 97883 104603 256656 205768 15510 -59056 -74573 14856 74078
27301 74078 67798 -7895 -104229 -210007 -334338 -220046 -141787 -102031 -80384 -50743 -137130
27290 -137130 -162881 -79524 22853 61460 79419 86743 -35478 -199408 -210689 -112074 -75495
27279 -75495 -97581 -99779 -136469 -161802 -162578 -13822 96970 35261 -32629 -13688 182 -7426
27267 -7426 -25681 -49077 20999 169638 154967 53893 90226 113690 74437 81010 53509 40761
27255 40761 -15973 -121710 -35062 45476 -45885 -234424 -178785 -116407 -86839 -132925 -110584
27244 -110584 -46803 20583 -14126 48591 43328 -40326 -221410 -175964 -58446 22670 -81322
27233 -81322 -70959 -67925 -16890 81912 64563 3613 59980 103549 81039 129245 126381 150918
27221 150918 100457 120542 242916 253486 95676 110670 178352 207086 96994 -53949 -203693
27210 -203693 -171230 -144458 -136407 -182912 -62349 -134955 -128901 -19596 131612 43683 -82464
27199 -82464 -64834 -16278 -120145 -185736 -163631 -68327 97494 277569 243237 77964 -12999
27188 -12999 -90896 -182099 -96155 -39177 -107209 -217142 -169872 -90012 -156504 -17854 98761
27177 98761 -566 -26884 -163029 -201948 -214348 -138337 -38568 -84368 -111298 -101219 8989
27166 8989 45024 74950 63953 40708 32002 42624 34133 -111416 -17664 93333 -19005 -116846
27154 -116846 -18595 107261 136687 99957 80172 75735 40807 -111510 -32822 9672 45800
27143 45800 -22883 -41724 151100 162796 113991 97997 169428 75742 -7623 -4496 -14617 -192800
27131 -192800 -173104 -156101 -60096 -96322 -20641 92744 119417 98628 66304 72489 71640 123576
27119 123576 186556 125601 15471 -8775 -2636 118917 243509 128373 -22608 -67039 -124685
27108 -124685 -104702 -106126 -227249 -352917 -329832 -118977 -33888 -58586 19816 41131 7808
27097 7808 80985 172241 143106 73416 -11073 10722 -11415 -54942 -33313 39615 -38888 -42122
27085 -42122 15076 -60824 -2275 46207 -21731 -98411 -62704 -99809 -117602 3654 84021
27074 84021 28517 79127 19834 -31119 -41543 -26591 86355 165241 163295 142955 102630 -9741
27062 -9741 12711 36259 72528 -46917 -125842 -77504 -6017 46600 90254 181983 121685 71387
27050 71387 63591 -31477 -64745 1456 54689 -1422 -35806 103231 300725 274610 148218
27039 148218 112487 109212 181821 222265 230258 220967 203273 93112 56895 -45525 -36131 -22978
27027 -22978 -63783 -143238 -80859 6240 -48467 15912 165873 149622 178769 206594 115619
27016 115619 34653 39697 19789 -94247 -113057 -8052 16987 -134190 -133045 -12441 4314
27005 4314 -74355 -36310 39358 -5171 -27356 66606 11759 -191990 -175468 -176708 -135603 -14494
26993 -14494 9734 23593 58228 145601 122119 -51454 -50928 90213 192221 88219 41623
26982 41623 -52398 -85750 -40091 -89895 -130825 -108777 -75256 -118819 -78593 3614 3527 -88061
26970 -88061 -66877 -113391 -139565 -64747 17166 112192 180297 118370 -77790 -75266 30482
26959 30482 -2558 5515 -8407 30695 -40551 -93605 26898 41935 -12418 37670 88622 2341
26947 2341 -12485 34749 56794 -62776 -104454 8101 65250 65977 42797 56281 -12356 -44050
26935 -44050 -12050 -65068 -92487 -90973 -9761 -134657 -177656 -90153 -57268 -19181 9485 45438
26923 45438 40583 92435 27294 -93678 -93408 -54075 -88803 -105202 -73013 -69522 -46898 -55934
26911 -55934 -16429 -27567 -75703 -150415 -174938 -174737 -81984 -33137 13453 94951 158397 169129
26899 169129 96377 139612 45833 -88361 -138293 -65882 -47153 -45776 -78683 -50821 21152
26888 21152 -14940 -60964 -43109 87183 95872 5284 25839 107698 91528 58637 76673 85889
26876 85889 65790 97759 69441 29328 130046 166222 53683 -23372 -81636 -87628 -106076
26865 -106076 7619 10672 5563 119318 147741 -10785 1696 82766 83236 -66289 -128126
26854 -128126 -60310 -43914 192874 277369 189648 149978 211645 218236 116954 127541 36205
26843 36205 -61145 -44614 74371 150278 62968 -12673 70648 43421 23965 -66101 -179951
26832 -179951 -125385 38114 -23388 -75452 -128454 -76180 2871 79374 108267 159542 -12082
26821 -12082 42448 88444 155524 96065 -30094 -231 96492 52315 97999 88268 67505 -16104
26809 -16104 13052 17035 -28956 -44344 20401 83506 5071 -197183 -132514 -52863 -52427 -91365
26797 -91365 92708 151429 125374 29468 -59404 -127743 -116631 -148540 -140127 -33955 61350
26786 61350 4217 8589 -53906 6878 97393 151550 172520 168707 123860 96350 167321 147083
26774 147083 133124 29037 -43072 25325 23752 -63482 -158609 -243742 -294465 -167093 -69990
26763 -69990 -53460 -59298 -110124 -98016 -130848 -211830 -174300 -28280 -150769 -339890 -303444
26752 -303444 -179065 48458 50561 31228 120208 47396 -93079 -41461 -64540 -170103 -125047
26741 -125047 -20728 101848 132629 87324 60404 -57301 -151056 -118927 -33520 26210 72647
26730 72647 12876 -81223 2378 17958 -53186 -111688 -82552 -67760 -57040 -13895 47507 94813
26718 94813 69600 96287 74225 -1566 -90274 34665 119383 60192 -85921 -141391 -178953
26707 -178953 -180219 -103819 -166960 -188293 -170689 -107972 -67740 -65986 -95304 -33154 -45997 -57271
26695 -57271 -49477 92065 165025 121610 101176 33446 70798 -37744 -5663 32224 75577
26684 75577 80097 40901 109230 90276 21151 -53287 -188440 -324881 -257483 -285112 -194446
26673 -194446 -90983 -61654 -139997 -221500 -295092 -339599 -376344 -322055 -320914 -248686 -164930
26662 -164930 -72124 -15176 41351 -36641 102574 167302 50084 -94442 -98369 2486 43388
26651 43388 48161 74047 24418 -137526 -145669 -47276 -64404 59695 30689 -126112 -226474
26640 -226474 -110612 -1707 132585 159405 91654 32014 -3278 -131057 -308525 -232247
26630 -232247 -88123 -57233 -150031 -163617 22195 -8453 -65365 5262 59156 148604 260979
26619 260979 287752 338196 359967 398937 366593 319260 246622 175787 96672 122389 126655 200067
26607 200067 279437 266373 198467 134985 39295 -94765 -117996 -219689 -139984 -65858 -46471
26596 -46471 85594 138715 46112 79779 135709 154016 129666 120915 135509 64232 -3166 -28252
26584 -28252 -19929 -37697 133182 222060 235378 192987 35585 17398 117243 132033 176932
26573 176932 164810 38597 -110983 -61696 -33852 19363 44405 85398 5192 -53603 -44771
26562 -44771 92558 68093 -10551 -48113 -31453 36285 107400 136898 123294 -12188 10905
26551 10905 -16476 18749 -18871 -70076 -187329 -156720 84097 118299 18030 54671 13474
26540 13474 -29646 -47621 -179522 -208830 -202736 -164794 -209197 -108551 -73163 -90285 -147189
26529 -147189 -211304 -102199 58754 24292 26833 33744 -26861 -20958 11823 9597 -10145 -18346
26517 -18346 49052 69439 165937 205965 154907 44640 -64362 -35901 -74304 -90968 21677
26506 21677 26688 51891 -19062 33920 17917 44806 60909 37102 -45400 -85344 -6183 -4513
26494 -4513 -19449 13840 12392 20346 -71628 -41889 29826 54290 86744 64669 175484 180885
26482 180885 33240 9936 -27530 14487 116907 74776 13650 1816 15214 86829 215626
26471 215626 246244 193692 123543 78907 20344 -121331 -189512 -185919 -158778 -148973 -170369 -95651
26459 -95651 -26459 45441 -13753 -59621 -73222 -137644 -257090 -272979 -151182 -73027 20338
26448 20338 -86407 -65897 -55160 -26897 48419 150312 151388 -45554 -197172 -337002 -247521
26437 -247521 -180172 -69518 42236 52131 73813 25849 -129378 -142457 -3963 47451 -1869
26426 -1869 23245 -20030 23200 38897 28593 -88695 -90303 29003 101221 -20460 -29561 30972
26414 30972 17819 -77675 -34280 2839 42165 80089 51265 25355 78584 234176 185191
26403 185191 70853 50479 5969 -80442 -171532 -79368 47709 -35368 -66005 -35942 -61759
26392 -61759 -90013 -19184 12007 -52249 -105857 -169753 -172452 -92911 -32505 -20205 -4269 109743
26380 109743 121800 -29384 -129700 -37313 81175 6844 -61518 -149831 -159117 -124006 -122112
26369 -122112 -78215 -78163 -78310 -28701 -15239 -26622 23617 24111 -87436 -89352 -62986 17449 90229
26356 90229 433 -31969 -2782 -5852 112865 94520 43864 46561 -33578 12685 24111 -54353
26344 -54353 17119 98049 69602 2614 74795 92044 20577 24802 -116439 -165058 -57145
26333 -57145 -23161 -67991 -124395 -154874 -167809 -118810 -75244 -35799 63708 44386 -11176 50776
26321 50776 41767 45708 28090 -113353 -23413 59422 -36536 -34611 73412 261179 320306 252283
26309 252283 129396 69572 38584 69655 120273 164893 112379 56611 -111680 -188604 -149678
26298 -149678 -133271 -94619 -119415 -142198 -17834 -59677 -57872 -54868 46862 9990 -74111
26287 -74111 -145958 -151023 -22571 25778 -168331 -27733 168558 191405 13039 -144107 -148139
26276 -148139 -117895 -23469 -127203 -114040 -98244 -111554 -88339 -98628 -167273 -121774 -115816
26265 -115816 -51206 -10934 -52089 -82888 -120614 -178881 -92373 85701 66627 46293 87154
26254 87154 -84967 -77611 -9596 62179 20064 -60869 -128353 -86185 -124771 -87808 -23881 -54159
26242 -54159 -60443 13881 -84091 -206051 -155821 -141196 -38807 -86359 -115562 -12434 110957
26231 110957 68536 -73752 -38565 95094 124419 97775 162959 153247 141196 11401 -61685
26220 -61685 -36903 -61706 -147803 -186219 -126138 1225 32790 -4336 -90602 -24674 -19272 -38873
26208 -38873 30585 87611 37183 -26577 -91377 -13240 46794 -22473 -64239 8051 29174 8787
26196 8787 69272 137109 150792 135012 133199 94824 452 -47861 -82598 -124443 -88923 22724
26184 22724 65659 58172 82416 22416 36546 -39866 -100202 -119268 -160053 -133211 87588 228668
26172 228668 203993 92540 -60632 -111346 -269629 -219806 -70241 -56491 -55917 -135063 -255315
26161 -255315 -175299 -48306 33860 -15422 36376 66906 29928 -24660 -10898 27334 134505
26150 134505 96659 76607 6223 -98183 -62450 -133132 -226243 -89074 50023 -26493 -10850
26139 -10850 145419 163762 238693 240583 135317 166399 145449 61946 23377 21417 -2203 -34330
26127 -34330 -92406 -40427 38094 134904 91301 -99616 -153377 -152048 -233433 -151512 -96921 10606
26115 10606 93161 40184 -148493 -290236 -286745 -135370 -154832 -143652 -180422 -283357 -254945
26104 -254945 -173059 -96124 -202567 -153879 -76055 13360 56035 38317 40714 163049 178448
26093 178448 75245 73125 23766 -5666 110845 53198 -3135 51070 100773 40052 21583
26082 21583 9606 49907 106069 28856 -49811 -41610 40633 194264 174931 9512 15353 -74133
26070 -74133 -50123 -16332 43025 57482 36461 41706 45397 -40397 -108612 -1864 9547 47708
26058 47708 20226 -44824 -51425 -82676 -121415 -185723 -216909 -165601 -112653 -44314 13530 -32552
26046 -32552 -65200 -96894 -144806 -276433 -186210 -102122 -175636 -262180 -300906 -259017 -94196
26035 -94196 -42123 -129103 -172954 -242460 -142546 -11327 9109 -77632 -63499 -44768 -36170 -110684
26023 -110684 -224409 -187499 -247764 -122384 11008 72626 81703 46294 -55748 -84512 -46493
26012 -46493 -13524 18963 32349 84484 98160 25429 -9199 -87611 10281 3520 -94067 -134867
26000 -134867 -84068 -102510 -129592 -182685 -157871 -160272 -269380 -307910 -294921 -262895 -51131
25989 -51131 9098 143885 260130 195622 84009 -107698 -46310 -54437 -35236 -72748 -66584
25978 -66584 -118833 -191165 -319758 -369088 -290396 -238933 -139492 -31968 -67419 -114841 -82451
25967 -82451 -76652 -96122 44604 99098 67952 91796 88323 15912 39765 92711 25911 72602
25955 72602 155068 97033 -8015 -4823 -54319 -60183 -18796 3580 -38184 -34164 103151 56036
25943 56036 68063 251123 264238 98241 -55856 -65369 -130954 -200900 -155465 -227243 -228752
25932 -228752 -197310 -95640 -14075 -63186 -70369 29190 75637 -35428 -6757 -12782 -9225 -103946
25920 -103946 -14418 146264 65005 -74537 -124681 -156256 -172902 -155664 -60711 39801 66192
25909 66192 112496 185034 186436 182531 71745 -625 -138957 -154071 -149095 -104811 -67988 19527
25897 19527 57898 21262 32826 37328 -15231 -41168 -44215 -22525 38857 135120 187559 82286
25885 82286 -59258 -43411 -11337 -17282 13952 -10622 -9342 -56165 -21666 18627 70617 67822
25873 67822 98739 40928 -58175 -141530 -107921 -8108 -20101 73268 83752 142954 166722 113771
25861 113771 188627 120122 48482 44631 91545 150003 29777 48937 63825 -22263 8134
25850 8134 93348 236192 225032 244295 233792 215892 142107 115834 17597 -37268 -22459 108409
25838 108409 89152 64396 156151 175911 133402 234325 254454 215467 215630 99435 22031
25827 22031 24552 99480 144794 10881 -81595 -38263 -12807 70595 87036 74074 88882 17690
25815 17690 -34565 9877 31007 34452 -4607 -95561 -157440 -115362 -68960 97637 202596
25804 202596 318766 201088 158335 143141 20231 -9514 -47765 -162775 -130307 -74509 -4546
25793 -4546 -30350 -40064 55616 101706 77586 77905 -17000 -89255 -101081 -9662 -49941 -131019
25781 -131019 -161949 -67549 20847 -47356 -20877 50109 -53587 -99020 -46749 59976 107887
25770 107887 73062 -19046 -46455 -52782 -58105 -180591 -186862 -106419 -79059 -38763 48093 -23610
25758 -23610 -27411 -9764 -50641 -12461 14390 118672 100066 10913 -42775 -38678 63558 97270
25746 97270 42069 114135 167631 158567 85512 99641 71297 85387 94760 93666 31191 -45368
25734 -45368 -17919 19770 -21407 -149194 -191557 -150419 -103674 -61977 -32384 -39648 -128421 -92379
25722 -92379 5883 53576 -58295 -54202 -59531 33025 -7283 -69573 14873 64485 43818 104656
25710 104656 -11021 -122213 -35079 100006 149110 109648 1494 -36878 -94291 -11626 53068
25699 53068 -58085 -72037 -23898 -91011 13569 -24640 -57582 41961 99983 98601 111484
25688 111484 200999 168959 200796 324443 352336 199690 180387 85287 36132 59724 76597
25677 76597 70382 11629 87535 59001 25670 -21245 -14951 -18541 54787 107342 19437 76447
25665 76447 100558 31033 71515 71858 40442 62362 216060 329696 125031 -77199 -162983
25654 -162983 -182983 -113828 -158525 -180508 -159940 -191258 -141966 -106913 -11101 121806 175859
25643 175859 179007 94268 -22178 1732 25257 -73868 17807 57907 41641 119898 53967
25632 53967 130540 238667 234943 196658 66353 -666 -57757 -36772 -57949 -71948 -62626 -57371
25620 -57371 -60498 -63450 -134618 -142227 -35921 -10400 -66140 -117564 -23109 -23314 1465 -53095
25608 -53095 -75465 -145751 -148756 -83085 -48007 -124884 -266574 -266805 -168492 -169432 -133473 -114895
25596 -114895 -127762 -118744 -64332 46935 -49335 -273753 -392731 -310932 -68597 81761 -8290
25585 -8290 -31725 16112 44994 73795 62025 96934 -1321 -33710 17125 146926 86585 22453
25573 22453 -62154 -86261 -33495 14938 106327 213251 120705 55241 143320 196148 184037
25562 184037 85446 129989 198989 300287 208480 -18278 -61216 -56463 -14825 -58056 -70473
25551 -70473 26235 39260 94953 112678 17108 12910 -90153 -227243 -243600 -170650 -156385
25540 -156385 -64322 -15786 10317 24911 13835 -20360 -110396 -56417 -98201 -193584 -242034
25529 -242034 -226676 -119528 -181196 -210708 -145708 -180302 -114484 -183446 -203375 -169484 -107304
25518 -107304 1522 89810 48717 -99999 -176803 -167153 -118252 -56801 22181 69479 -10955
25507 -10955 -122210 -36166 -15393 125209 86703 52347 26977 -18562 -1257 -107288 -106893
25496 -106893 -61492 -37445 -15554 15734 29120 5131 7857 36805 19746 -2290 33040 25105
25484 25105 46728 39285 -20365 57580 133136 69878 53887 153505 38124 -123178 -86543
25473 -86543 57191 142974 116090 53827 63070 127147 -11158 -26373 20289 7731 -10261
25462 -10261 -38809 -60927 -52345 -114852 -84178 -100849 -21607 80931 129293 164589 65927 -32448
25450 -32448 5816 73548 -11401 -48933 -67028 4907 62050 33972 55234 62764 6826 -94452
25438 -94452 -61977 -81823 -16154 118812 111658 104983 122642 90791 73751 24181 -32068 -108225
25426 -108225 -142254 -90380 -38981 -81954 -57452 -76614 -215523 -208002 -195933 -99243 16783
25415 16783 8940 -36545 -131367 -120531 -63551 -59703 -58167 -33809 20978 156913 134464 187054
25403 187054 105394 37506 -22643 -150984 -29948 48495 -32300 -31615 -25705 31387 -46084 -24697
25391 -24697 71140 88081 79218 101511 77412 4434 7729 -47729 18113 68098 47776 91816
25379 91816 149500 -54011 -216630 -126559 35782 46769 9657 20025 74537 95255 104037
25368 104037 91344 53260 106428 93671 -49881 -80631 -5485 6041 -12446 -34421 -26551
25357 -26551 78908 201285 142044 41497 34052 -102200 -197977 -189798 -116114 -167756 -64667
25346 -64667 -17637 67803 36565 -58752 -88636 -87413 -189691 -332001 -201401 -15219 61251
25335 61251 5141 76684 39282 -105705 -183134 -107885 -102346 -87913 -50593 -117062 -102650 -131694
25323 -131694 -135944 -178305 -210129 -181861 -66597 -50120 -50038 -241005 -242982 -182129 -149653 -48046
25311 -48046 -21627 -108897 -195683 -215049 -103582 -52896 10044 -5788 -42810 11956 86321
25300 86321 107206 120907 -23837 79418 142979 218238 238590 154055 142696 83111 -14811
25289 -14811 32387 56375 44946 32298 69632 101303 196372 200558 243393 171413 167226 231822
25277 231822 231141 176937 106476 -63226 -133303 -20693 66535 -35712 -77152 -122046 -179285
25266 -179285 -214758 -262288 -173312 -229627 -286413 -275281 -321319 -308795 -223064 -86413 -19214
25255 -19214 18701 1838 -47865 -174866 -174977 -138993 -92096 -50056 75706 79879 55439 31288
25243 31288 37077 19885 -71731 -126652 -226786 -161315 -106725 -151727 -199368 -124360 -19101
25232 -19101 -102485 -159089 -195327 -158184 -103356 -29549 273 -53551 -115866 -49107 -97232 -41076
25220 -41076 58502 133197 179727 205760 142073 125036 149883 152446 150706 50952 -51764 -51598
25208 -51598 28985 59281 99879 33170 50157 -32573 -54287 66555 37799 102214 139237
25197 139237 216001 81224 112138 152054 107538 16210 -9667 -2149 27385 11861 -13381
25186 -13381 -48712 -10558 6719 -6429 -2437 -15785 -188114 -165850 -98376 -64533 298 -2939
25174 -2939 63103 135690 125505 57330 107498 60671 107452 123837 179259 64145 36504 -25333
25162 -25333 -93913 -165407 -254072 -282095 -193334 -26699 -25877 -169922 -157645 -49578 5969
25151 5969 -5291 30954 99345 26000 -24161 19950 -11935 -52904 3038 74743 86432 158612
25139 158612 236243 314221 289620 285920 201627 105778 141467 156878 112044 74210 -25386 -9271
25127 -9271 49280 53410 63620 60081 80553 148355 294503 285205 131996 144462 40082 -85631
25115 -85631 -186878 -54052 62194 68273 -71159 -164840 -270425 -224825 -59248 7034 -1198
25104 -1198 -118036 61386 67720 -97763 -160755 -131063 -189507 -216836 -285620 -220241 -193387
25093 -193387 -171471 -114260 -107865 -144973 -82232 -58847 -28224 76215 62782 30726 -64602
25082 -64602 -70618 -69694 -152746 -216517 -229986 -145205 -132280 -16575 64908 50943 -42094 -58731
25070 -58731 972 -63794 -60501 -116392 -119938 19793 36040 -9085 -141529 -24037 142182
25059 142182 104853 4696 -23745 43554 120497 109162 82117 50964 -12679 -113163 -128211
25048 -128211 -106069 -81502 -120807 -123677 -88952 -89479 -111218 10742 77078 79409 92196 -4116
25036 -4116 88972 84186 80700 66509 7136 80520 113770 94189 -52039 -30126 32046 71147
25024 71147 115491 18204 -86722 -51308 -79636 -141506 -118566 -90759 -101559 -194392 -225472
25013 -225472 -205171 -103978 -200862 -344831 -295140 -233620 -216275 -182849 -228717 -45391 6328
25002 6328 2902 13614 63617 15215 13824 -31943 -92687 -170178 -150003 -106985 -125459 -138902
24990 -138902 -153762 -88092 -150750 -174767 -198489 -226315 -181754 -111476 -131272 -39090 -1051
24979 -1051 24610 106588 111363 174547 230644 134101 52492 47560 -34759 -32258 -20003 -14738 14483
24966 14483 -3035 65375 75756 106619 75880 -99049 -123785 -132924 -52888 -133175 -82410 10048
24954 10048 31109 33083 45258 53849 -44978 -87215 -99573 -46145 91690 125684 202682 178695
24942 178695 29607 34142 44588 149376 142629 121310 -25845 -107823 14120 45877 -60106
24931 -60106 -84893 -110003 -59414 26272 47466 -12404 97750 177449 178564 176032 236471 310186
24919 310186 223407 156745 119973 179555 103887 108628 253334 300696 167017 17015 -43873
24908 -43873 9514 84115 94628 139810 132848 106674 155682 200653 205423 203563 73038 12933
24896 12933 -55418 -146090 -158602 -39519 -7098 -7778 74007 78202 68703 -27256 -110385 -123656
24884 -123656 -100395 -57114 -114112 -98390 -54044 -78782 -4514 136361 220645 117432 13264
24873 13264 -40641 -60154 -101511 -166189 -135582 -220269 -141175 -102455 -43773 49368 -11326 5639
24861 5639 16149 55882 66424 40103 -12736 -101316 -162579 -53318 20182 -11246 -47316 11937
24849 11937 45174 -29751 -168815 -141776 -105303 20092 127281 93556 94094 88872 49642 2468
24837 2468 -58298 -39166 -19889 -135997 -204840 -27920 -74465 -81659 -21444 -15644 113545 136175
24825 136175 -8738 -67193 -119046 -168242 -113290 -214906 -220498 -189162 811 86508 85435
24814 85435 -6538 82262 102444 -41159 -106704 -57262 43869 101538 45046 26581 41626
24803 41626 -43927 -122213 -63585 -125353 -119286 -69447 19982 68991 46057 110658 151884 137305
24791 137305 263749 148965 -5290 -12787 -99584 -65705 -66132 -119372 -126192 -64982 -41566 -96249
24779 -96249 -108690 -156243 -109363 -61818 37142 50323 -14702 -164201 -158903 -160449 -203197 -200818
24767 -200818 -163136 32585 64231 81699 12743 -79070 -137774 -201952 -198785 -45574 -8991
24756 -8991 45962 49306 -4951 -93113 78726 169389 140898 179622 230018 327230 230607 154221
24744 154221 92298 -25711 -39411 -114994 -86434 1033 28307 -6220 -136369 -171786 -59685
24733 -59685 110791 169317 151726 78407 72562 5681 -1435 31371 39250 -17054 -102701 -181249
24721 -181249 -50363 29176 102903 28601 -39714 -93950 -66447 10361 37083 -8096 -57792
24710 -57792 -99623 34773 179872 156252 6700 -188023 -223675 -145664 -127857 -166478 -163473
24699 -163473 -75212 -45881 -95452 -35426 -11172 -49025 -103842 -74113 91061 180304 192486
24688 192486 196171 116794 122400 208565 315095 297367 210129 147537 117469 117151 89207 187271
24676 187271 161783 56083 86950 175597 220425 65470 -118754 -203926 -78050 -56106 10939
24665 10939 -99281 -186195 -151518 -127200 -75908 -105203 -257072 -213523 -277660 -324335 -171159
24654 -171159 -31497 -28920 -6423 -65278 -23523 -38558 -90266 -66441 -55211 -157306 -162595
24643 -162595 27697 97657 35634 -39534 -60890 -10045 69846 49763 114700 54954 9640
24632 9640 16819 -47901 -79867 -117781 -107355 -10657 89031 -48477 -201538 -158813 -163489 -115830
24620 -115830 -146835 -67793 45718 91983 1905 -147367 -207434 -177269 -113998 -66233 -49366
24609 -49366 818 -45685 -73674 90522 130603 91939 29294 -82450 -73757 -52131 -117111
24598 -117111 -68290 83382 109358 44497 8076 64567 132965 35210 -69820 -182192 -214194
24587 -214194 -233351 -255940 -234207 -209178 -212400 -192157 -239052 -195861 -60704 -13362 -68534
24576 -68534 3743 1285 -70169 -81978 -55898 -95205 -18790 -110558 -126845 -137427 -62040 -153966
24564 -153966 -208218 -86040 70299 89321 -39735 -115331 -148822 -189579 -14157 47158 -10673
24553 -10673 -79194 -134835 -211139 -185206 -117408 -100556 -44343 35413 70649 29567 -79677
24542 -79677 -117288 -25401 119473 96313 -66529 -87409 -156140 -143667 -157825 -94517 -128137
24531 -128137 -158191 -112513 -140522 -146376 -55694 59311 10200 15214 -47088 -67889 1005 34810
24519 34810 97944 -12660 -83913 -176077 -172179 -164509 -18720 -29532 -55565 29620 -8263 -22931
24507 -22931 3987 50553 143388 -53173 -69129 81705 201759 112438 82054 94156 161507
24496 161507 103524 -12044 -3763 -21054 -59520 13197 100144 111731 51804 127811 -9091
24485 -9091 -122514 -135862 -35350 -61308 -118159 -54253 2449 -17708 144228 214989 212496
24474 212496 79943 -169171 -140866 -40394 -47497 -90324 -44173 68912 51256 52480 -20577
24463 -20577 -15409 -66760 -62756 51587 118977 74103 49871 -49034 -82066 -95958 -122704 -65405
24451 -65405 -81283 -115536 -116104 -186875 -213138 -128544 -135703 -76916 -137474 -161627 -102401 -163184
24439 -163184 -131222 1664 -21072 -45332 -44394 -67213 -59430 9683 -37060 -87472 -102734 -175515
24427 -175515 -119753 -42164 -58121 -135524 -53055 5436 -46353 -85446 -101908 -73093 -12425
24416 -12425 30427 49005 39044 -18229 61404 17598 -2730 -13089 -111953 -195711 -222943 -241818
24404 -241818 -163178 -93076 50073 16789 -115290 8743 98284 72307 -25332 48406 87137
24393 87137 -28584 -20947 89374 158704 88030 21181 -110750 -241325 -351094 -209427 -69855
24382 -69855 29119 43325 146737 31861 -62018 58100 143444 111631 184747 233079 188824
24371 188824 160168 157107 182650 155566 114365 62770 -7940 -69869 -100940 -100501 -92396 -48787
24359 -48787 18560 46546 21910 57318 225721 239330 129640 87799 13850 102280 162857
24348 162857 6660 -151701 -113534 -69304 -157703 -123291 -53661 -140192 -217220 -127401 -123419
24337 -123419 -18462 -76937 -68646 -69554 -127340 -94053 -25693 -78085 -138118 66003 68794 84925
24325 84925 142451 59329 35289 125423 112948 90435 35370 -128328 -168722 20381 147482
24314 147482 35009 -19216 -11994 -2652 -42302 -23003 57766 120182 85796 52542 72375 43282
24302 43282 17663 -22408 59179 161122 91483 70640 61821 67301 137034 211530 102023 64092
24290 64092 70670 130138 116612 39870 -3737 27890 28549 5837 4604 -112935 -127204 -61573
24278 -61573 14436 34678 -23281 34361 58167 104708 165140 185603 141413 92044 11428 -43174
24266 -43174 25025 -45774 -9725 -21055 -3289 101476 208839 195374 124607 38511 -103921
24255 -103921 -209770 -163428 -186671 -99390 -183729 -243724 -100898 -27672 -14628 -27871 20579
24244 20579 -74932 -110477 -134198 -226020 -315060 -322225 -97773 -103485 -125441 -168739 -233410 -122263
24232 -122263 -103569 -123141 -92696 -107565 -116711 -145157 -109206 -53172 -133014 -218334 -170514 -115572
24220 -115572 -58928 -27771 -69943 -39355 32250 3792 29909 -152263 -56184 -163271 -281596
24209 -281596 -202356 -97105 -64752 -49171 -29185 -5996 -39797 -72051 3255 97897 122024
24198 122024 260815 258200 129868 22793 -119440 -148952 -138397 -74492 78276 94525 29768
24187 29768 4896 6755 26997 3796 89918 63471 84372 66735 13864 -19289 -59247 614
24175 614 33086 -49061 -76175 -27051 -62186 -15356 25315 54900 18962 -86011 -164358 -231358
24163 -231358 -285229 -154265 -70099 -83477 -22082 25207 98863 140397 162546 114665 146391
24152 146391 56085 78585 34971 79152 53336 26709 49921 71630 107613 54150 129433
24141 129433 177151 56173 15787 -32031 11789 70182 42953 39252 75306 37116 14873
24130 14873 -16558 -19928 25029 -38264 -42865 -66619 -179642 -100959 -44696 -795 99850 73524
24118 73524 -103290 -173233 -94624 -45672 39525 63903 -79228 -151586 -72376 -8215 11491
24107 11491 -123929 -143404 -142770 -36698 132463 84378 -95947 -123111 8054 43772 46013
24096 46013 75706 109750 25683 -74567 -144979 -227979 -110503 -83793 -39768 51661 66630
24085 66630 53260 91949 164792 245290 205380 -23663 -207517 -194489 -86355 68363 118847
24074 118847 89627 184520 160005 174373 317759 316454 254806 312750 316553 295654 302277 316251
24062 316251 363181 360109 209451 133527 161610 78058 125672 276960 221026 140259 130152
24051 130152 131134 87686 -45486 -88780 -13762 5143 15366 43063 3854 -52909 73738
24040 73738 77479 22296 10306 -45937 34138 82010 28059 -61299 -87466 -99352 -90801 -67245
24028 -67245 26124 21972 19126 -106397 -90760 -23949 11623 128984 160270 91011 40942 10570
24016 10570 42228 158175 92143 42477 14543 -21375 -47712 23234 -53717 -156001 -95166
24005 -95166 27744 73287 44617 86233 162930 307043 402888 332047 146898 49920 -23580
23994 -23580 -1986 93171 101536 117109 75500 34741 5703 -12155 18603 104082 25607 -84240
23982 -84240 -107050 -17551 66192 119170 263415 250522 183650 10397 -44609 129727 86705
23971 86705 -64834 -70063 -72662 -94442 -138929 -191141 -90730 -6109 45188 88186 74179 67018
23959 67018 69610 34049 -105088 -114502 -40447 8983 63736 46333 -29740 -81498 -78573 -32242
23947 -32242 -20943 -35792 -89978 -92912 28512 108165 -62161 -72126 -74766 37228 168092
23936 168092 53391 -98537 -91043 -25216 -22073 -61323 61564 94733 96297 7740 -2818
23925 -2818 -45909 -39562 -74090 46213 140427 40540 -23290 -222747 -164653 -25919 -47295
23914 -47295 -1774 -10758 -113813 -9304 30781 39880 25915 -94763 -190920 -167793 -221868
23903 -221868 -249499 -63388 -68308 -36112 24601 75782 145215 124486 -28894 -139306 -148159
23892 -148159 -104329 18416 40001 39440 31450 54715 185550 166091 119813 81533 118715 127028
23880 127028 4745 -130347 -85088 19728 76040 167528 292878 186221 87931 58279
23870 58279 32459 10103 -102902 -30299 90116 -10180 -58551 -93507 -119490 -81961 23906
23859 23906 28558 -30621 -87450 -88660 -91039 -33539 -33839 4442 91824 15170 -128797 -186046
23847 -186046 -139244 -34651 -75695 -147234 -162640 -153632 -136035 54547 132691 120150 50123
23836 50123 -50320 -81104 -128081 -164242 -138789 -135758 -118745 -65942 49711 83812 13708
23825 13708 -8039 -118450 -178737 -163419 -120355 1377 87959 89714 -13178 36826 47808
23814 47808 77760 56548 64887 -7798 -135692 -166648 -72617 -117858 -114059 -65199 -95276 -19082
23802 -19082 26207 -69119 -72234 15606 -108619 -183862 -164649 -178448 -255236 -257649 -277998 -116299
23790 -116299 -41464 -109565 -162782 -134438 -56213 81980 75375 -75137 -81211 6885 8684 -2611
23778 -2611 11713 38913 -42114 -37306 -80514 -73694 -84693 -145010 -174237 -83944 3154 -45801
23766 -45801 -94510 -39716 -42153 -47396 -89457 -55236 -57137 30614 -5518 -122609 -157332 -22121
23754 -22121 -21109 -8134 14321 36879 14405 -55596 -66523 32443 69233 -65927 -74204 18362
23742 18362 89729 104478 126242 142413 142899 33077 -45568 -128954 -11935 193499 271336
23731 271336 218410 170650 152345 172448 118723 55567 36931 -96283 -226878 -243906 -224744
23720 -224744 -12584 32796 -38572 -49305 88637 191340 205102 149159 158608 65143 68574
23709 68574 73054 54501 942 12311 -51579 -136012 -64531 -32601 -11417 -24204 -31898 51066
23697 51066 -12278 -64992 75923 114904 -15206 -72204 -77886 -170495 -155658 -156912 -87956 -14300
23685 -14300 -134117 -235039 -192973 -100761 -8687 -16793 -64969 -96036 -109026 -111670 -71071 -102911
23673 -102911 -24407 37919 36174 29715 46046 -10853 -133106 -152477 -185510 -164792 -176430 -127055
23661 -127055 -97065 -4230 -46534 -92819 -18758 12472 -24275 56090 88020 49537 75055
23650 75055 70020 158562 70305 -98247 -134239 -16212 -8729 -14617 -30976 2833 102235 147257
23638 147257 145583 46942 41749 -90660 -144714 -96875 -57035 66333 142936 152679 176425 232782
23626 232782 262123 145302 44822 131816 57172 -93874 -214078 -199948 -210262 -201418 -186237
23615 -186237 -177407 -144147 -40264 52031 47396 159638 160016 18779 -136403 -199235 -151940
23604 -151940 14450 37641 179165 243801 110939 -10647 7179 1005 -130961 -93046 26042
23593 26042 40128 -14369 4633 32786 59881 33124 -16261 -47704 -26468 -31934 -43833 -67538
23581 -67538 -52524 -100763 -155761 -186485 -170044 -223682 -147707 -60865 34435 35272 -12425 -17401
23569 -17401 -32049 -55191 -56017 92665 138904 140929 121993 245543 218175 154267 112093 79494
23557 79494 58393 73225 11788 -117327 -7598 19720 -30408 -21419 -10041 -23951 -36492
23546 -36492 -81372 -60344 -18210 -1947 -28813 -9607 103370 -17664 -117283 -75747 -34906
23535 -34906 141435 250803 194755 42777 62266 78169 36522 47654 -3548 23804 44040
23524 44040 -73349 -158884 18813 38161 104104 169547 75878 3356 134269 150482 105658
23513 105658 58235 36406 142970 122548 74185 62943 85274 152574 314407 360195 447030
23502 447030 574173 811793 1050188 1527948 1814878 1890306 1788980 1727298 1832261 1927628
23492 1927628 1744976 1331726 1008068 806107 824558 789788 662811 606954 590594 546992
23482 546992 572934 544717 508693 503703 424639 421351 516503 522658 492982 450295 385550 315216
23470 315216 220425 188467 221289 301223 231527 155764 151169 187379 210088 301149 264914 188545
23458 188545 168597 223626 198232 131681 127196 98773 105793 225999 194010 71685 49527
23447 49527 55936 181620 158853 93760 60164 29544 -23246 -46670 -150007 -164665 -116868
23436 -116868 -102108 -51238 3752 -55002 -146707 -50102 -11275 60083 16270 117979 234713
23425 234713 140292 31258 82086 83547 219276 279681 137144 -34876 -57939 -84398 -86720
23414 -86720 83049 110809 64753 43918 -82468 -143421 -53049 -61159 -25433 73487 196465
23403 196465 124647 -9362 43728 157468 166879 240058 207719 34712 -28415 91934 94712
23392 94712 4922 -15719 23261 93850 155170 254114 135310 10652 94950 137481 50623
23381 50623 106419 241425 187220 105846 118151 120777 164058 48030 42394 -43908 15246 51921
23369 51921 -89908 -19603 18016 83698 64945 83031 130332 47238 125004 208070 198504 185580
23357 185580 136811 78321 61046 106500 201942 168026 69570 51331 28054 -10650 23278
23346 23278 -48788 21556 1696 16990 121783 244404 165547 64076 -14777 49928 133142
23335 133142 121388 16497 -40692 -151129 -101535 27130 73943 49840 31908 131413 135320
23324 135320 117914 34848 11802 58624 130522 115809 71778 83831 -14180 -34590 -9947
23313 -9947 53314 -3379 -25001 -28066 7566 129891 61200 101022 188776 263253 285244 215412
23301 215412 129412 -39265 -169771 -233833 -184580 -155116 -195976 -146759 25727 43604 -51412
23290 -51412 16723 116076 69163 104646 113650 114648 74617 58168 124807 167040 156001 41413
23278 41413 -69250 -105801 -26494 -17451 -114963 -83972 -211375 -227430 30787 139487 95893
23267 95893 88865 26419 2207 127953 107790 33707 78267 120572 -33310 -110056 -13163
23256 -13163 -89490 -113678 -15961 94365 176385 54679 38992 185383 298154 246967 184430
23245 184430 209982 171340 223379 317999 201510 5365 -73557 -16076 101521 201770 190879
23234 190879 116532 42501 17801 88735 131121 126492 126981 122114 72365 37789 -52799 -155980
23222 -155980 -36479 25579 -51938 -55525 57460 137848 100638 110169 246000 210874 211906
23211 211906 139454 31227 -27765 -55575 -4847 -94704 -97659 -19760 99300 93445 91888 -32094
23199 -32094 -162613 -234848 -110641 -48331 156852 304184 317194 298048 292056 160384 126641
23188 126641 139917 108597 84244 107286 131778 123799 120910 175597 233223 369754 414417 496848
23176 496848 524805 530357 501752 382488 276652 186387 -17834 -78735 -64871 89279 196534
23165 196534 207711 223240 160679 148300 149247 153298 86158 48811 102928 200212 165836 171912
23153 171912 193284 231410 237963 138537 63455 60484 14668 -35819 -40602 51416 75882 20531
23141 20531 75297 -22973 -82763 -32326 112305 204831 226609 210489 221150 217472 263824 298552
23129 298552 260409 158895 317438 333804 251947 355458 269712 125827 80066 58756 79834
23118 79834 96369 146056 127880 101225 159794 189905 115188 149593 199086 207513 184894 245688
23106 245688 232900 255311 333455 279259 179599 -25012 -77122 -28238 68847 101745 104369
23095 104369 153468 169826 166645 212507 161436 100866 20969 62834 231756 283783 240269
23084 240269 180775 253912 192946 93037 91612 51701 53454 7875 71351 194808 259535 213777
23072 213777 166137 264836 356551 429455 453436 521887 378234 267301 355425 499599 657430
23061 657430 785113 781852 764350 931348 1004758 925265 1012933 1066126 956895 846341 811003
23050 811003 877166 944961 1053890 1130320 1069621 972037 904908 884644 927367 918114 1045989
23039 1045989 1040555 798885 634189 665101 796381 763377 805081 813710 822124 742037 680671
23028 680671 706192 713057 755142 750527 783740 797557 806553 816298 807808 768756 824730 898777
23016 898777 964622 962416 955794 990086 1051487 1030315 1007178 1083995 1199038 1299664 1552187
23005 1552187 1859390 2258044 2899224 3213096 3100361 2879174 2799108 2993371 3072868 2860495
22995 2860495 2461775 2074616 1865933 1681526 1596497 1597096 1670115 1701529 1583725 1480744
22985 1480744 1489827 1602562 1820786 1911349 1996548 2034063 1967852 1961271 1992832 1926248 2028168
22974 2028168 2126770 2168807 2268524 2389330 2533134 2445377 2492249 2692620 2670737 2714145 2813485
22963 2813485 2969121 3038478 3225892 3321203 3432242 3673261 3859614 4033039 4337562 4628404
22953 4628404 4759767 5134386 5614836 6275898 7195825 8098061 9046669 10341130 11979283
22944 11979283 14075262 16687334 20057639 24533325 30599685 38698491 49164894 62207035
22936 62207035 78552631 99004052 125463213 162242479 216633591 290860857 361764196
22929 361764196 380395781 341121809 312712842 328837654 357352708 340704006 262831351
22922 262831351 184187903 138596799 114402447 101348377 94603028 91729869 91185645
22915 91185645 91297517 91327289 91096946 90893658 90277104 88942013 86278163 82296580 77827872
22906 77827872 73195159 68474083 63574178 58665058 54194834 50217195 46818252 43783636
22898 43783636 40964842 38583517 36381048 34484648 32803463 31272378 29768113 28404715
22890 28404715 27073929 25839076 24724239 23682780 22818080 22038047 21229808 20525683 19871706
22881 19871706 19242199 18498452 17890791 17213609 16619310 15984828 15513286 14987296 14459718
22872 14459718 13878897 13290505 12814004 12441737 12030005 11676495 11432748 11169852 10983358
22863 10983358 10892668 10710836 10434856 10390898 10466885 10701356 11028634 10889562 10460620 10217111
22853 10217111 9929779 9729110 9521769 9015077 8312771 7762054 7363865 7042422 6815710
22844 6815710 6609557 6309161 6015608 5771036 5637770 5556152 5361479 5297029 5217451 4996311
22834 4996311 4801870 4711737 4646233 4554324 4464501 4423031 4312704 4144149 4033775 3857935
22824 3857935 3645833 3495154 3471956 3418218 3350545 3345093 3342447 3175855 3042697 3022438 3033830
22813 3033830 3084718 3041522 3018769 3030269 3033233 2940688 2806819 2763050 2653839 2510237 2466089
22802 2466089 2319134 2144275 2084146 2150319 2157681 2136599 1960144 1795777 1627875 1527173
22792 1527173 1438755 1343439 1302170 1279932 1150180 1064679 1087203 1059160 1053610 965911 857053
22781 857053 866178 915634 877693 808760 815978 825143 854042 789842 741124 938871 922772 822799
22769 822799 792783 811010 800610 762199 718103 740885 714041 748607 703210 719338 782801
22758 782801 663018 551534 547140 423642 475583 496601 467240 562723 659029 621992 595005
22747 595005 607351 601799 587202 565648 493891 463488 578069 678363 750591 575603 498255
22736 498255 483307 283075 170004 194135 229996 221017 213188 295006 306858 386949 453242
22725 453242 329930 365974 373580 390218 368771 318682 356075 389907 306695 276268 326477
22714 326477 438848 412628 404170 392639 385728 253939 140097 192095 218468 286851 150594
22703 150594 46778 94903 178960 277102 286059 367276 269526 209010 189095 223215 325311
22692 325311 273940 238754 225285 133306 92194 70254 117317 115527 84782 73571 154155 206026
22680 206026 290593 414618 416062 336596 275327 271591 140535 147037 196077 182050 155780 242558
22668 242558 231589 239002 241343 222850 238717 232971 370816 422119 430222 345409 281938 135884
22656 135884 -88852 -89682 -18085 4915 26384 109296 111252 165558 179872 153524 130542 169856
22644 169856 175951 149548 171126 170153 159010 142391 244146 284783 229810 135877 7133 -78060
22632 -78060 -49596 -43205 54291 58525 58788 37624 -116564 -207668 -179932 -146994 -55465 28849
22620 28849 79306 126038 157815 178279 172215 133107 154139 231279 142191 117678 95923 41186
22608 41186 33453 -72111 -85697 -29434 46503 18186 7484 111366 217241 161086 15352
22597 15352 25324 27332 70708 61971 103216 240955 255203 237687 249906 194179 104151 135903
22585 135903 179196 85707 78628 117319 74171 58743 20907 -23827 -94461 -49191 9484 63189
22573 63189 73551 10300 17042 37059 193906 350000 317820 226609 74476 74394 131013 126742
22561 126742 99584 88467 32717 11552 30933 78775 205819 107129 -62326 -74121 -78966
22550 -78966 -88703 -101101 -43574 13354 49487 95427 90715 98703 70263 85273 83366 68025
22538 68025 83667 199169 156692 52681 49016 77375 16961 27449 -37995 -16632 26860
22527 26860 84444 160190 196625 274000 182221 21392 23225 -5516 61968 50380 168572
22516 168572 309924 340897 342511 283495 71044 18042 37003 2024 -62078 -50226 -48955
22505 -48955 -150910 -159536 -133692 -145794 -183948 -190788 -119265 -96112 -27255 -4598 -28081 -51147
22493 -51147 32188 115775 127474 135919 204538 338116 433591 466844 294282 148958 125311
22482 125311 194447 254817 216966 183051 16086 -123348 -112113 4416 109996 60434 59495
22471 59495 69288 106097 28940 28008 15156 -88311 -84403 -177665 -202591 902 105219 170267
22459 170267 200645 76929 31210 -34594 -164666 -39991 145687 108721 85479 54475 19116
22448 19116 -92472 -185373 -253774 -114438 -1364 43851 89793 70683 83314 98405 -10866
22437 -10866 -48573 3059 9657 -62266 -18504 19763 -13008 -145925 -233965 -174001 7684
22426 7684 93277 62670 6757 93944 71326 8576 8008 8873 55879 151196 206397 306780
22414 306780 234621 63375 -15573 60090 121897 113394 179059 105109 53435 37572 60952
22403 60952 72898 -32569 -47779 -80870 19066 -17987 -2913 44564 122073 130858 132692 107814
22391 107814 102455 140833 145422 72628 -18094 -61288 -57343 -43535 -31385 47849 148412 73849
22379 73849 84012 34306 -16269 55191 217517 267519 213648 133393 170566 219626 175227
22368 175227 70059 3195 -52143 -98239 -3848 -46822 -77983 10305 170198 372549 492974
22357 492974 614254 754189 941727 1266933 1727227 2054124 1927606 1680916 1566025 1705252
22347 1705252 1812991 1635679 1202764 863617 659503 602830 561529 493188 433684 431590
22337 431590 475497 578471 534313 484659 392382 273975 314490 342741 411024 411718 366362
22326 366362 354030 339546 255126 154971 116999 137072 80206 36754 -13721 73463 165595
22315 165595 144877 64323 22784 52253 122103 235960 213149 318520 384387 381602 312131
22304 312131 290061 265178 215346 290242 288730 221778 279148 282480 198228 161810 120576 23144
22292 23144 160790 156329 189907 297087 258046 228673 224589 293520 353756 222531 190897
22281 190897 89117 74449 101830 44578 173060 283122 195427 212935 287145 363925 279868
22270 279868 80904 84856 95463 37984 8880 24155 22149 -120106 -103308 -122370 -162537
22259 -162537 -196851 -219459 -68621 14365 46001 -34972 -85298 -116550 -134910 -68575 -55626
22248 -55626 -107448 -26686 41463 39432 160584 76987 49410 -95835 -208132 -204590 -189860
22237 -189860 -150469 -64472 -124490 -35242 -76175 -129528 -69667 83637 105736 27147 -134411
22226 -134411 -35798 97538 12335 19966 10512 -39668 -104684 -109245 -138555 -147005 16521 -12080
22214 -12080 -9383 -1527 -87630 -69134 -77728 -95252 -123163 -193479 -156441 -158949 -120903 -112086 -117323
22201 -117323 -131592 -75707 -103117 -99655 -99286 -91958 -137254 -120216 -104261 11527 206656 333976
22189 333976 295423 179363 117348 171363 148075 199613 179301 264535 231507 79332 -51689
22178 -51689 -84841 -133002 -7096 1185 2947 67697 64322 124807 139544 -33509 -167282 -53280
22166 -53280 56535 37739 62162 -19930 -15642 -25651 39961 101974 65230 -5191 -15967 -15704
22154 -15704 -14029 74127 97382 5646 -71831 -76859 -10520 52471 127882 85474 119633 39961
22142 39961 -30126 15101 183 59406 50841 -35738 -22303 -54359 -98064 -1434 -16964 -64890
22130 -64890 -80649 -63147 -68426 25958 10494 -30728 -21990 -58977 -143856 -233539 -251843 -175162
22118 -175162 -131666 -38889 18371 94573 86131 102020 158358 163235 54806 -76209 -11437
22107 -11437 59540 40118 37411 -54062 -51180 -41941 -21017 14401 -2376 20699 31282 -76145
22095 -76145 -104662 -136267 -143263 -63679 25424 -31023 -20559 51367 149337 207150 225650 138209
22083 138209 42668 70553 69639 43762 -50583 -9481 58586 55866 100952 88143 52710 111556
22071 111556 182683 108311 -594 -4191 71202 151025 186061 82883 71231 72028 155655 57889
22059 57889 -113551 -38300 -12694 -59126 -55457 -110885 -210318 -48893 -20361 -142953 -128911
22048 -128911 -97010 -47096 6737 43558 74995 210725 265777 125244 -661 18208 1331
22037 1331 -23957 -54295 -66233 -65476 -33456 -193376 -210088 -100048 -56231 -45382 4743 85779
22025 85779 53037 -60467 -164620 -244004 -166383 -120635 -30350 -13302 -26389 11854 20727
22014 20727 -7101 125390 158327 127129 99618 12086 -51603 -14470 13437 21481 255567
22003 255567 307917 130942 86077 95233 88219 142227 38466 28091 49475 55758 -39414 -119851
21991 -119851 -132715 -132697 -73124 1402 3075 -1646 -37115 -19604 -29200 -42694 50443 41876 29542
21978 29542 81789 72301 95733 4560 -40165 -40656 -31515 56386 144468 266739 206056 95254
21966 95254 217925 141766 37540 -24577 -1497 14350 -20468 39753 -132613 -229495 -126382
21955 -126382 -64159 -12814 -47389 -48869 -93177 -36336 -67906 -100489 -187115 -281165 -249918 -152420
21943 -152420 -143641 -139928 -183756 -275896 -168897 -69750 97138 93289 -11834 -165394 -301734
21932 -301734 -250355 -91949 -42118 -116963 -96657 -49001 -101624 -134423 -119173 -61481 -37969
21921 -37969 -43345 -7202 -7809 -81070 -148289 -143002 -97143 -92965 -33890 -91471 -25700 21336 -78906
21908 -78906 -87188 -106313 -68011 -48343 -69093 -187538 -291008 -211977 -56208 -15604 -7425
21897 -7425 60629 7886 47458 26562 -136118 -185056 -186247 -131420 -166343 -152080 -178140 -255476
21885 -255476 -191933 -118937 -128614 -6541 78183 60230 73327 48673 92417 51456 -9925
21874 -9925 918 103154 118590 8707 -98802 -108286 -118059 -209063 -251062 -202503 -206701 -6919
21862 -6919 24380 48451 -26592 -103156 -98851 -64175 -87699 -100954 -102873 -80341 -21963 5728
21850 5728 8244 -120506 -59792 140718 134026 91368 71466 104350 169248 231309 286658 125556
21838 125556 -39766 690 69982 20186 -31404 -36377 -129686 -293152 -240203 -123941 -88346
21827 -88346 -113027 -108476 4584 81844 79925 -26148 78827 -15306 -121594 -19517 82945
21816 82945 87627 58938 47374 101415 108080 77224 29138 96961 60157 97884 123453 86316
21804 86316 -68988 6401 115827 125944 59523 -43900 -174731 -227567 -201328 -198362 -111968
21793 -111968 -7696 75477 27918 33142 97585 83067 -35547 -85503 -93969 -103825 -171667 -128117
21781 -128117 -106863 -96051 -88296 -161693 -195460 -191356 -128035 -67666 -60288 -5116 -35004 -11269
21769 -11269 -47393 -64609 34859 63631 51730 69202 78735 109113 -90210 -114356 -20591 78957
21757 78957 69807 -28872 36060 30297 -70869 -54007 32443 -13077 -47331 18756 -26771 -131040
21745 -131040 -95505 -89531 -72240 -36556 -41187 19698 -25755 -1009 128172 123554 131450 138295
21733 138295 184785 133113 45649 -57977 -83221 -55284 -35152 -7835 6686 -83059 -44050
21722 -44050 -33938 -147725 -33254 94182 167681 112971 50147 84189 -40785 -111468 -104141
21711 -104141 -20843 17303 -5818 5369 57175 60450 15190 -332 -43471 -124401 -33034 -48364
21699 -48364 -48610 -83852 -114451 -213937 -142243 -32408 -7770 -108923 -45251 21377 132658
21688 132658 69929 -111662 -147471 -30785 -9528 -5600 -150640 -239193 -188198 -42217 186961
21677 186961 193875 120852 181890 149704 107719 103029 97747 52545 21122 -60877 -55498 -41444
21665 -41444 79796 173242 86340 55742 145505 235654 209081 49911 -26325 -24313 8000
21654 8000 47160 23146 40004 -33292 -119038 -119089 -121723 -134388 -96994 -113235 -87324 -155351 -198475
21641 -198475 -82300 -59103 24324 102368 56523 -6873 -19912 -70183 -138188 -226442 -250181
21630 -250181 -279603 -271428 -221200 -169162 -132098 -165249 -232553 -193130 -141583 -13200 146071
21619 146071 294279 142448 82822 68669 -13507 -108160 -177741 -200852 -209115 -138008 -121642
21608 -121642 -74545 62081 125221 90261 17966 -36794 -107109 -147609 -113395 -38180 75813
21597 75813 113271 -15024 -98558 -100873 -191048 -260616 -180405 -5776 23279 -98306 -123755
21586 -123755 -12900 23265 17696 -29287 57831 137774 49503 4616 28104 -2937 -112623
21575 -112623 -168780 -147183 -43916 -99084 -143302 -119489 -186292 -193543 -123949 -156517 -240331
21564 -240331 -280094 -351554 -327420 -242006 -305199 -314696 -361330 -384921 -301957 -334374 -315233 -312568
21552 -312568 -227761 -125811 -105900 -27497 -3165 -72907 -221341 -244360 -146951 -37253 -129909
21541 -129909 -148276 -139069 -199979 -184474 -153137 -181735 -186163 -161929 -230677 -271234 -257913 -194826
21529 -194826 -74871 -98372 -136287 -170933 -215066 -233497 -128644 14095 -1 -6345 -98253
21518 -98253 -143634 -236833 -82084 -67075 16077 45185 70380 50534 -6690 58808 71938
21507 71938 110868 24262 -70364 -25071 -28985 -30665 -70621 -107283 -89398 -46217 -92229 -202084
21495 -202084 -137871 -161189 -82046 -76434 -42014 -6088 38644 -2540 -229364 -165682 -84672
21484 -84672 -59774 -30575 24274 -75259 -180684 -108765 -36506 -23631 -101669 -134934 -109517
21473 -109517 -34977 47032 174879 272869 254543 143265 140369 57952 32230 -20450 -26647
21462 -26647 7369 2863 6743 31213 5544 -33576 -63240 71265 121313 164381 132287 73216
21450 73216 50722 -29436 -92520 -117758 -108546 -73647 -54723 -93526 -51663 2839 -32965 -129437
21438 -129437 -129386 -136294 -114375 -42186 2771 73563 -16082 -67139 -151037 -156227 -85833 -80822 -74393
21425 -74393 2199 -60722 -29724 54768 39581 -48808 27829 85852 140951 71372 62491 59418
21413 59418 -51442 -144622 -173019 -121467 -146068 -116638 -106980 -152438 -64078 3158 75594 73586
21401 73586 -76066 -162182 -169614 -94245 -16356 -13861 68 -65120 -46695 -52680 -84787 -30803
21389 -30803 -95077 -29457 -10454 -154159 -254318 -125828 -115322 -205711 -105354 -172904 -178573
21378 -178573 5427 112784 80555 -63526 -13009 -40490 -115140 -84378 23257 64185 46094
21367 46094 11485 -155890 -171204 -172810 -172046 -83537 -144857 -63899 -100452 -200181 -279396 -206633
21355 -206633 -80959 -90705 -94735 -158662 -160725 -51235 -75300 -10910 62137 -12759 -98474 -44454
21343 -44454 -25451 -30194 178030 267716 141278 92322 37189 26447 65198 156369 147035 26380
21331 26380 -47148 -8188 125937 164374 236217 325924 334798 232668 121602 -43154 -195970
21320 -195970 -213287 -255134 -104716 -64991 -28723 -6281 -8497 -26061 -30001 30576 80775 80834
21308 80834 86532 -15102 -47895 -40039 33383 42584 21681 -7151 -1544 14073 -5679 77326
21296 77326 208896 170903 141715 137124 202144 225625 158080 5388 -35437 -79722 -16811
21285 -16811 48484 114384 113436 157346 139663 119201 76423 -63585 -77714 -49559 -48673 -30731
21273 -30731 -217 -105612 -227482 -72364 -16767 -41020 55157 -3279 -25115 -30476 -24466
21262 -24466 -58245 -88818 -58305 -54711 -109864 -143517 -206624 -211996 -63498 37687 17377 -45529
21250 -45529 -49265 -17802 -88503 -73229 -16357 -50653 27892 90574 153924 157590 33747 -32257
21238 -32257 -40298 41362 2024 69908 167734 184632 172160 126492 60407 -115838 -227752
21227 -227752 -213581 -123925 -110510 -130101 -77499 -96876 -101803 -34784 86679 24218 -132687
21216 -132687 -121983 -187108 -226054 -151393 -98688 -121454 67020 137129 137595 101585 154406 88612
21204 88612 254 -32751 -43126 16928 76180 -33356 -167061 -215758 -275182 -370958 -291385
21193 -291385 -228484 -144836 -144202 -142260 -142384 -27983 84897 165320 162119 5189 -68072 -84911
21181 -84911 -167290 -103257 -89554 -156752 -26574 54673 65642 36539 -35579 -97015 -123577
21170 -123577 -53293 -24951 -88560 32974 127092 71521 31729 111390 215080 122868 45928
21159 45928 -15296 -50280 9403 -149 -15977 -36240 -6568 43471 15365 -40385 32482 14223
21147 14223 -14350 73919 44544 -24850 -30547 -33333 -5394 -6723 -11202 -53147 81073 163391
21135 163391 40716 -42536 -74292 -58330 20483 14296 -164532 -155778 -148487 -136893 -81244 -125628
21123 -125628 -10401 192433 165592 40866 -92596 -122930 -182490 -255225 -248146 -101698 -54736
21112 -54736 -156783 -232596 -154739 -38693 -16025 -39548 -20230 74203 115441 120208 11957
21101 11957 -36777 -72761 -59156 -41840 -116196 -34033 32221 96820 54489 3826 50040 52526
21089 52526 46790 84494 151319 149025 174713 76407 54513 8223 -15057 158704 225613 124952
21077 124952 100117 31982 -103162 -101608 -60795 -15410 1220 28294 -12095 6981 10812 20529
21065 20529 34312 59448 10431 -127943 -217517 -18437 148886 104195 126082 170848 184487
21054 184487 78130 48209 18759 -17299 57273 123141 60184 12284 94050 95230 4043
21043 4043 -75319 -88420 24482 110724 120537 162820 145175 130021 248600 227303 127051
21032 127051 5604 12616 -21641 -158901 -168421 -109673 -195348 -120090 -103224 -194999 -193597 -310144
21020 -310144 -307423 -236332 -155138 -62630 21966 49701 11881 -124339 -191065 -148217 -110174
21009 -110174 -172594 -190084 -42558 40998 -46009 -42823 -101636 -108953 -115554 -325931 -290040 -142912
20997 -142912 -140116 -52058 -33993 -18160 67793 211489 138923 78285 176423 97388 26673
20986 26673 -7551 92866 93433 73247 32083 28202 -43133 -107375 -148138 -74254 -21510 22251
20974 22251 70457 94434 -616 34874 135488 95377 170017 94072 -35717 23444 19093
20963 19093 -1207 48572 15903 69551 144026 85120 1533 -93082 -127623 -94841 54549
20952 54549 36712 -28298 50416 96076 56493 -78270 -86454 11042 -46341 -78119 -193602
20941 -193602 -206841 11486 70429 31123 -150621 -172448 -77199 -26091 -4746 -60959 -69060
20930 -69060 -86810 7123 25739 24107 -43101 -97470 -66163 -118899 -105265 -118704 -75477 -76193
20918 -76193 -28708 -60261 -33745 28709 -24220 -66620 -44559 -22574 -8914 43079 76630 38661
20906 38661 -4120 -40249 -20726 33218 82657 61112 -16532 -45200 -86394 -181635 -183354 -32280
20894 -32280 5321 -10482 3650 7999 86770 61373 21598 -58500 -65469 -63364 60446 87868
20882 87868 178176 158886 71360 45833 57195 17268 26860 79221 195070 279476 187391 32573
20870 32573 -59202 43160 -29885 -78630 9314 72022 129307 218720 138338 120472 101874
20859 101874 3878 60685 118236 76938 179642 71239 103145 69964 -28742 -38737 77596
20848 77596 140262 70105 -632 -22611 20506 94322 2594 -36015 -21281 -84894 -35681 -13229
20836 -13229 -53633 8740 167707 119116 105925 28149 -60605 -136543 -58272 -66740 -123712 -49948
20824 -49948 22444 -41851 -154987 -186574 -165620 -215909 -226378 -212584 -108985 -77751 -100784
20813 -100784 -31735 40458 31425 -10401 -54453 -95346 -93810 -162601 -94207 -270 -11758 4322
20801 4322 18215 -9896 19099 10790 77253 30063 -43214 44662 105697 139848 140415 133381 146952
20788 146952 15870 -77150 -42156 95570 126411 52419 54906 124068 49115 61017 15513
20777 15513 -36069 -121488 -44100 79429 109609 165228 168758 173070 108282 74175 -62514 -78241
20765 -78241 64 -32135 -103681 -202761 -109948 -12374 -26315 -85407 -114957 17736 167731
20754 167731 58115 13418 49895 131597 126246 149951 206730 198020 77285 24054 -25075
20743 -25075 -28763 -121548 -103502 -134941 -55528 35931 17139 47144 53022 91843 108653 110638
20731 110638 118958 34929 79741 134199 46923 27028 108164 102012 40862 -16985 8305 -20420
20719 -20420 -28201 131684 71689 -70774 -97700 -36873 89092 77490 -79495 -183001 -141300
20708 -141300 -87755 21903 82425 87174 91574 120472 176212 164938 179293 132033 158622 162358
20696 162358 181943 148118 95241 47812 52794 124286 112057 105042 228254 252047 265369 167221
20684 167221 113787 223160 189802 50552 -10771 -132723 -88850 -80494 -23087 116611 119160
20673 119160 68731 -7498 65048 40579 54741 91534 96779 73185 51173 24698 25489 -11995
20661 -11995 -122257 -213560 -158310 -90763 258 34598 -61117 -74960 118873 227339 142600
20650 142600 100413 147031 23792 98300 155348 119515 106111 54845 59314 20701 15648 5130
20638 5130 -43792 -56311 -150482 -214179 -162811 4303 26398 77270 180651 275181 232753
20627 232753 129251 197553 155885 66298 -39403 -70944 -85735 -51558 -22656 41041 119245
20616 119245 -15301 -100104 -41025 -7102 42797 170848 228666 91376 31197 89710 70647
20605 70647 36518 -22721 -94471 -91666 -20593 46397 -2239 -160297 -158544 -107649 -48054 107987
20593 107987 124689 46818 -69945 -104054 -136181 -194316 -228579 -215575 -216035 -124233 -83132 -60010
20581 -60010 -58715 2846 -90370 -144511 -83622 -117723 -125480 -208211 -167358 -106009 -117147 -117490
20569 -117490 -133455 -142221 -226343 -185580 -139389 -111411 -71491 -48912 -53230 -93782 29972 62334
20557 62334 -25510 -153377 -150032 -25784 -16927 -47531 -66769 -57892 43277 78480 -10263 -47305
20545 -47305 89013 163648 101844 118736 94651 100037 146778 159134 184548 158245 96380 52289
20533 52289 34514 -17523 56119 56878 15962 16837 18708 57492 43324 -110782 -66458 86355
20521 86355 96761 185819 251193 103131 -48678 -39989 8857 15012 52582 95363 164393 52314
20509 52314 -26496 30629 140475 213487 196330 197037 99270 71019 135432 137872 132001 200057
20497 200057 167254 167443 223995 184156 33411 16643 62296 -72880 -187701 -202601 -188254
20486 -188254 -29216 -13362 53845 32447 -64410 -147286 -184584 -90825 -9941 -71004 -35983
20475 -35983 82626 132031 67824 47192 46225 90215 99962 79023 72704 48151 127642 132606
20463 132606 73562 -4997 34645 174162 135729 92818 94266 112387 90935 77927 55014
20452 55014 10079 42122 130933 137679 121418 29656 43362 19256 -102198 -90694 -194309
20441 -194309 -236816 -268658 -242128 -176837 -96775 2468 -30231 -31697 -48823 37078 90996 94914
20429 94914 148348 46497 22418 -20358 -119450 -171362 -204248 -280468 -348864 -142323 117941
20418 117941 149184 38785 19904 117843 134279 139900 66602 -47246 -89342 37446 1284
20407 1284 -14737 65868 53632 39507 85259 137380 168361 187541 146536 74212 -7337 21687
20395 21687 -47550 -69881 62056 316131 234593 79637 63608 153287 40673 46725 143713
20384 143713 54049 23233 67525 17068 35102 13539 -543 -87889 -171575 -214410 -150177
20373 -150177 5615 159486 100055 115578 134338 32891 91493 135922 127103 121043 62519
20362 62519 -18406 -137756 -145297 -191587 -163789 -111399 19680 22909 -34329 -174729 -235227
20351 -235227 -322172 -227811 -92037 -6127 -3157 -74759 -115453 69480 47982 -161146 -170654
20340 -170654 -130211 -188602 -57178 2643 55521 113835 49825 -24579 -20496 -65661 16919
20329 16919 25204 -123349 -89731 -110125 -72300 -91088 -21608 -95563 -100996 -8568 91391 -15369
20317 -15369 -92829 -100145 -97667 -115344 -58153 33624 -5421 8353 -34864 -22105 4001 26198
20305 26198 43366 164234 274239 178740 6023 -58325 69750 91828 134043 168061 222815
20294 222815 219006 61371 -32958 82092 70720 -30582 -50809 -60673 -26160 40753 150752
20283 150752 123694 133024 141073 111785 105453 76069 -5837 -29136 79132 109942 156238 3419
20271 3419 -79934 -1236 81596 109769 60743 -42024 -86332 -87529 -48012 34501 139822 210795
20259 210795 109216 189959 243974 169422 69020 -1554 44354 17384 7355 7972 -3807
20248 -3807 7604 20158 -60880 -79346 63541 218362 265768 286660 232777 234168 242840 228146
20236 228146 113515 -29870 982 -16084 -105407 -118075 -166285 -211491 -121025 -56767 -45442
20225 -45442 -1622 33711 52392 -3412 -88392 -124729 -180460 -187154 -110453 -37358 -23754 -39318
20213 -39318 -14529 -74286 -33814 74366 -41105 123717 165135 80079 -1662 76132 80977
20202 80977 14760 -20010 24078 95047 152112 155697 119441 4220 3925 40856 144926 247672
20190 247672 331183 276010 152570 37183 -15599 76618 104037 142636 243163 169917 202691
20179 202691 90698 92257 166754 162070 164566 163113 96444 56833 64972 42918 54851 128789
20167 128789 239447 195743 301353 392830 300430 310938 246129 199014 265970 256575 155779
20156 155779 171232 262336 251401 123812 211330 277602 255956 247933 113720 -39066 -11928
20145 -11928 190010 319411 466138 341202 140889 108742 126576 281025 374465 450102
20135 450102 470780 459664 484726 518466 547940 621513 734182 750898 599566 508915 547979
20124 547979 599707 660125 691250 705295 698256 624202 618185 579716 446711 434789 440837 496377
20112 496377 574157 484817 474527 504120 394949 410706 371763 395310 357314 384517 542788
20101 542788 714090 728223 686174 726732 599910 547767 554980 549451 502213 446060 463832
20090 463832 506339 528599 468259 480315 620671 566911 387950 380848 443844 475929 582464
20079 582464 550093 616781 510528 480400 491712 397891 307929 281981 294695 301790 301647 274414
20067 274414 227173 386670 466672 410889 289205 427590 315629 172322 252167 172601
20057 172601 101391 167360 235491 129625 38842 76780 66660 163768 285971 337388 316065
20046 316065 240897 205093 209424 227091 271136 262157 199989 175515 138298 129486 188223 169824
20034 169824 180858 208718 144791 120926 310953 421312 323802 193260 142547 161543 183953
20023 183953 99810 189567 221571 129326 205512 112670 114886 176674 168278 197832 250184 212160
20011 212160 75303 -45369 38523 169896 268491 194860 268107 326038 248951 302969 413404
20000 413404 302780 238502 191851 160943 377713 421166 328708 310929 402242 250881 210484
19989 210484 139854 39069 120155 168843 174322 128911 89878 139905 177990 181421 87687 26159
19977 26159 -6048 33237 159621 149558 126616 223157 268629 193089 120978 78750 35033
19966 35033 117795 143923 84247 -28357 -84129 -83138 90102 132711 94220 81085 139676 167982
19954 167982 158271 188946 130869 129255 330087 352909 252217 192579 170821 177320 227038 257289
19942 257289 306734 239212 161012 213409 258514 298331 419027 405340 318766 335302 281803
19931 281803 233926 272668 313682 254021 211062 32515 13363 140083 100425 33639 8056
19920 8056 45117 41764 118859 181988 59475 620 66080 96520 212869 265867 308809 317215
19908 317215 354986 342979 305345 271757 285251 239672 112140 127387 260093 181215 151216
19897 151216 145007 205128 219441 225626 235891 54628 157108 186884 182758 75020 64678
19886 64678 79209 127244 129177 128954 224927 257668 257261 153621 102009 65065 80628 123147
19874 123147 188509 188611 117338 132931 165002 60421 -35379 67136 141012 85555 106329
19863 106329 65383 50825 80977 182713 159136 145163 70007 167674 329566 389499 288830
19852 288830 227100 252126 278091 359026 366343 314728 295228 375678 410119 345056 296844 347250
19840 347250 397900 395956 362685 316934 307328 255466 163422 282055 271876 308741 278854 210852
19828 210852 333263 292600 177058 350677 472052 524290 579537 568551 542343 530566 435520
19817 435520 484573 390476 216065 290876 476277 475499 421619 392073 376139 395554 363438
19806 363438 394034 498753 471029 453070 426213 351723 376344 387373 359965 316055 371778
19795 371778 357740 355271 322136 284493 305155 348219 399624 468264 453993 402944 339813 220388
19783 220388 297706 472398 690589 701879 746700 782167 733167 755217 799682 874405 945041
19772 945041 1059119 1126367 990903 859733 868381 937522 961077 1084596 1145639 1120011 1117135
19761 1117135 1264668 1230759 1123268 1085487 934174 832232 813376 776156 715235 769799
19751 769799 837410 802705 691970 743132 750035 715630 756899 853030 862155 837648 763743 777949
19739 777949 836937 870638 772308 744500 917800 1027779 813862 748880 815096 784731 933863
19728 933863 1067027 1134828 1062693 1038332 1111689 1236048 1213184 1088574 1081016 1091231 1145195
19717 1145195 1235171 1263654 1343198 1394503 1339349 1406102 1480761 1461190 1430091 1308889 1110157
19706 1110157 1128138 1150474 1016918 1012245 1062927 1144492 1090479 1131320 1112031 1097984 1064641
19695 1064641 966133 1017329 1082378 1100888 1142555 1075477 1056908 1101126 1109881 1017689 969369
19684 969369 927355 1042289 1099496 1091496 1085747 1135302 1022469 1003992 1087233 1074183 1040335
19673 1040335 1029799 971897 1052120 1123129 1146339 1081372 984501 990882 1206183 1332857 1336896
19662 1336896 1304449 1186430 1142026 1339978 1473555 1446308 1509657 1610851 1568024 1492400
19652 1492400 1532877 1573912 1557737 1575155 1532859 1573379 1586626 1725537 1775937 1833532 1819336
19641 1819336 1820922 1747561 1788027 1793738 1865297 1944311 2084621 2113447 1993314 2059919 2216010
19630 2216010 2300528 2138908 2100429 2132363 2199171 2130276 2245563 2340176 2287591 2444964 2594807
19619 2594807 2722192 2754809 2789923 2875997 2968578 2992957 3020665 3071594 3088077 3230596 3428879
19608 3428879 3527614 3774733 3996210 4215673 4367095 4531436 4615138 4743663 4967086 5230397
19598 5230397 5409972 5667290 5868610 6229709 6630349 7028430 7481080 7845635 8186709
19589 8186709 8619522 9135844 9605848 10046545 10819073 11701752 12545134 13681269 15034763
19580 15034763 16622178 18599087 21064285 23911740 27377513 31574987 36111006 41210149
19572 41210149 47000472 53324667 60003242 66263773 71319696 74677192 76184790 76119325
19564 76119325 75231746 74551596 74597761 75977991 78812526 82992996 88131845 93510402 98176000
19555 98176000 101113963 101946251 101012239 99141635 96436391 92763378 88699481 84763057
19547 84763057 81862447 80337619 79925843 80331452 81258106 82430105 83942331 86107185
19539 86107185 89061803 92830043 97318184 102177328 106640653 110164090 112117438 112466345
19531 112466345 111173959 108313870 104972571 102275924 100874341 101108219 102702032 104964180
19523 104964180 106942672 107637646 106880416 105073428 102033560 97329931 91038048 83958874
19515 83958874 77122932 70984877 65747900 61517169 57947005 54944285 52342095 50161299
19507 50161299 48340136 46653639 44896152 43163715 41564174 40021139 38430663 36866569
19499 36866569 35351289 33835917 32398875 30932669 29442491 28112779 26934332 25925644
19491 25925644 24870121 23739490 22720530 21844988 21078897 20347809 19653416 18914795 18226616
19482 18226616 17493996 16805917 16345469 15927793 15399631 14868100 14277320 13727691 13217722
19473 13217722 12777494 12442001 12056752 11735403 11381606 11008888 10736867 10485242 10144043
19464 10144043 9772981 9552129 9407482 9141846 9063106 8960325 8724464 8404747 8099620
19455 8099620 7787981 7479275 7336568 7121833 6971719 6875285 6830514 6780921 6637303 6476148
19445 6476148 6324026 6190681 6040898 5780033 5663634 5437040 5187688 5053870 4995496 4905682
19435 4905682 4829738 4763831 4635893 4468630 4326451 4278092 4168160 4130529 4091523 4048241
19425 4048241 3858750 3691949 3638074 3646826 3538704 3413913 3297962 3383915 3321356 3193732
19415 3193732 3197995 3267767 3306785 3256010 3178002 3026906 2971694 2942204 3005566 2973988 2938754
19404 2938754 2816911 2623370 2698817 2712298 2718684 2714062 2703926 2486142 2435052 2502815 2630132
19393 2630132 2785050 2843185 2675033 2398651 2166442 2021452 2142269 2242831 2036750 1965995
19383 1965995 1961100 1961507 1980672 1913413 1865038 2006212 2013589 1947116 1975132 1998567 1790725 1624711
19371 1624711 1547617 1589639 1767172 1851551 1789401 1805767 1933691 2001432 1957438 1876612 1874376
19360 1874376 1920589 1771347 1724819 1752953 1869559 1856382 1670850 1461109 1443334 1510934
19350 1510934 1536192 1616059 1798772 1841687 1832898 1813090 1830372 1768998 1723455 1823622 1787046
19339 1787046 1851438 1853843 1776595 1802831 1788453 1770664 1849513 1880710 1837701 1669772 1626987
19328 1626987 1718569 1883747 1992907 1950012 1904094 1896277 1909747 1857349 1832596 1708066 1699302
19317 1699302 1704256 1631414 1594396 1760440 1807065 1753056 1586250 1617277 1829019 1902149 1811383
19306 1811383 1842875 1860554 1857583 1873976 1955279 2071882 2132139 2225427 2215436 2219371 2358689
19295 2358689 2579809 2654818 2701811 2762077 2900364 3281696 3626372 3768391 3942608 3938072
19285 3938072 3812819 3760738 3833664 4061595 4381313 4728638 5145568 5681566 6169257 6668310
19275 6668310 7159787 7739586 8433724 9254254 10603152 12620870 15247766 18609396 22899759
19266 22899759 28312438 35085226 43819649 55679087 72048805 91843395 108782589
19259 108782589 115241109 113911211 107577276 92781524 77103064 69473157 69108714 74395541
19251 74395541 85599719 102866292 121706068 132413146 131253924 124729425 110696271
19244 110696271 88998573 70684977 59664146 53070841 48735185 45890120 43955753
19237 43955753 42507374 41431592 40821209 40611131 40371770 40023378 39629867 38914706 37890830
19228 37890830 36630265 35465065 34131576 32831080 31873955 31356978 31479293 32319184 34049851
19219 34049851 36690719 40404965 45147815 51367137 59796014 71558105 88139779 109194952
19211 109194952 128576736 137411748 136468221 130219993 114770434 96341183 86171039
19204 86171039 84432615 89039646 99845039 117271868 137467921 150905829 151351898 144321608
19196 144321608 129911698 106245904 84613626 70854576 62496808 56910187 52897983
19189 52897983 50100877 48228495 46946590 46139592 45621068 45036238 44156184 42883779 41428423
19180 41428423 39605510 37580984 35514353 33441325 31440357 29523047 27831405 26308435
19172 26308435 25016252 23737034 22681289 21726597 20730471 19672352 18681739 17754819 16925953
19163 16925953 16200029 15597945 14983889 14377891 13980811 13614359 13208027 12734469 12283360
19154 12283360 11902349 11589366 11382620 11095080 10710862 10317153 9959643 9613645 9354944
19145 9354944 9077362 8875964 8751514 8442165 8174745 8067885 7840840 7688371 7421453
19136 7421453 7209637 7100340 6791037 6474429 6287248 6150915 6065481 6056953 5897412 5779852
19126 5779852 5622943 5391098 5149322 5056834 4883327 4690894 4589428 4525309 4348998 4244861
19116 4244861 4180004 4051477 3936480 3750106 3599248 3491945 3448043 3459867 3469411 3331261
19106 3331261 3182151 3094074 2941537 2806955 2682707 2621095 2692154 2705860 2688141 2694837 2671663
19095 2671663 2570978 2596845 2537956 2513476 2548873 2573110 2482362 2437728 2318750 2128174 1965866
19084 1965866 1948039 2035513 1984788 2040163 2056805 1880664 1824984 1766434 1669410 1596821 1585692
19073 1585692 1690726 1694812 1614676 1565864 1519329 1521668 1521243 1527899 1411605 1384665 1352469 1324593
19061 1324593 1312611 1289262 1285686 1312304 1355494 1322478 1209645 1322266 1376807 1236268 1219206
19050 1219206 1219131 1354861 1342657 1270894 1222211 1297406 1264917 1216657 1225721 1215986 1204157 1157722
19038 1157722 1199878 1291426 1177912 1081997 1173980 1352802 1443333 1466019 1286316 1232410 1203146
19027 1203146 1262138 1332966 1400977 1287097 1225510 1317721 1292520 1303561 1420275 1487354 1490199
19016 1490199 1463428 1438002 1400360 1458744 1409767 1444611 1486420 1522701 1580875 1684937 1707526
19005 1707526 1709306 1660812 1640547 1626272 1625723 1649119 1610637 1592176 1697170 1804489 1843335
18994 1843335 1818544 1739804 1627903 1749515 1899654 1953155 1961980 2027547 2112984 2148218 2217796
18983 2217796 2257766 2234466 2273950 2461631 2580846 2657144 2796320 2795812 2763229 2814659 2887248
18972 2887248 2931213 2943508 3140322 3299651 3442971 3617618 3804011 4019187 4229945 4418127
18962 4418127 4700308 5112587 5566020 6298665 7197706 8296420 9733290 11793059 14461831
18953 14461831 17735659 21512881 26234949 32885683 42452087 55523251 67843728 69606806
18945 69606806 55725143 41561819 34068977 30878271 30147756 31029727 33457571 37285129
18937 37285129 43463443 52986768 65685354 75679596 72871144 56930356 43427514 35561628
18929 35561628 30909968 27842702 25646074 24038380 22826121 21936391 21568342 21523044 21802271
18920 21802271 22109623 22214391 22172481 22093572 21993516 22047921 22099536 22266236 22694909 23624871
18910 23624871 25376977 27803132 30387516 32799752 35766643 40001558 46012497 54456459
18902 54456459 66464228 82832005 99755893 108511542 105331871 103856296 107531432 106707169
18894 106707169 95481766 84240088 80412284 84032500 94144615 107256383 114415370
18887 114415370 106867883 93811199 87351975 88518064 96044704 106329623 109961728 96735918
18879 96735918 76965085 63666985 55931360 51039563 47763739 45414855 43677937 42193863
18871 42193863 40921019 39857183 39001859 38294452 37456821 36441794 35437753 34427783
18863 34427783 33418224 32458857 31625533 31054286 30952743 31613362 33065170 35053206 37636805
18854 37636805 41041301 45682026 52525920 62768268 77350040 92000117 95401077 79546592
18846 79546592 61186252 50732449 45883875 44270193 44874411 47266005 51271870 57815862
18838 57815862 68210722 82363060 94408444 92935605 74584276 57370841 46818617
18831 46818617 40546145 36392999 33365549 31031814 29255827 28102759 27460738 27115261
18823 27115261 26766908 26350517 25781252 25278973 24548135 23762366 22771997 21584205 20471893
18814 20471893 19371875 18239019 17349078 16574703 15762677 15057476 14332057 13757500 13224231
18805 13224231 12743654 12308148 11741591 11298544 10889469 10353792 9855058 9556168 9244022
18796 9244022 8972600 8843254 8601436 8370394 8181724 7876598 7652068 7489586 7358571
18787 7358571 7220352 7144126 7097646 6997983 6984851 6787046 6491497 6392220 6452689 6525227 6563356
18776 6563356 6536096 6388380 6331770 6289329 6191671 6201598 6172525 6187907 6178321 6247978 6321508
18765 6321508 6404772 6572468 6917960 6956019 6885892 6786036 6728541 6920468 7026234 7199300
18755 7199300 7628261 8397643 9665007 11239981 13310567 15753352 18590922 22143266
18747 22143266 26508235 32672969 42063864 55080834 66434889 66383823 52237906 40272489
18739 40272489 34660906 32856962 33182756 34971754 38476895 44790608 55033785 67584925
18731 67584925 74207070 65365674 49587728 39342355 33586180 30044246 27740491 26109064
18723 26109064 24639142 23392551 22414847 21890945 21757493 21823095 21899528 21859146 21695980
18714 21695980 21389350 21187176 20989676 20852903 20757934 20733676 20998702 22004677 23446292
18705 23446292 25471203 28202677 31802214 36172410 41625550 49167665 60206504 76453955
18697 76453955 95490973 107624003 101483296 89681101 88889597 98590031 111050152 114116353
18689 114116353 102321384 93299919 95544270 106581403 118545902 119459961 105938889
18682 105938889 96991018 98938628 107587258 112859475 102450956 81964474 67542582
18675 67542582 59100195 53874657 50341181 48050098 46346807 45052399 43868916 42672528
18667 42672528 41712491 40645955 39555732 38495511 37119239 35521791 34024049 32802216
18659 32802216 31622507 30502769 29663932 29363071 29598160 30393731 31991582 34231083 37241966
18650 37241966 40972053 45616128 51794568 61246675 75803212 93778972 104702962 94603279
18642 94603279 72893266 59152763 53100875 51313706 52075671 55043851 60618984 70445873
18634 70445873 85375474 99814622 101265567 82216204 62580831 50985768 44343817
18627 44343817 39832488 36626987 34114948 32179714 30670158 29481226 28761262 28314523
18619 28314523 28017959 27704351 27268129 26532615 25478558 24307340 23122700 22069183 20884831
18610 20884831 19563991 18254254 17147329 16270595 15482844 14958094 14323320 13654753 13025903
18601 13025903 12564237 12138547 11597242 11027272 10509600 10120292 9703530 9190553 8869856
18592 8869856 8573901 8290257 8150473 7922440 7698186 7505238 7293864 7116256 6952654
18583 6952654 6703284 6561012 6447237 6269904 6105349 5971800 5836933 5727577 5584025
18574 5584025 5400206 5236365 5090419 5022413 4871847 4601058 4431989 4413761 4343885 4218646
18564 4218646 4093496 3969125 3917042 3893471 3725027 3518482 3493169 3520543 3516329 3318059
18554 3318059 3085255 2985604 2983549 2909195 2811232 2699413 2727316 2647979 2537454 2366030 2233003
18543 2233003 2254708 2260435 2204590 2065743 2029979 2096304 2129380 2065825 2109098 2127354 2007164
18532 2007164 1857488 1762531 1702537 1611573 1675889 1752973 1793743 1849503 1843290 1811892 1759253
18521 1759253 1752210 1762421 1819125 1705526 1712779 1760528 1813153 1969025 2057665 2036884 2092883
18510 2092883 2123035 2076466 2072703 2065969 2052684 2074609 2164223 2081744 1981803 1952385 1922914 1954459
18498 1954459 1801854 1649641 1597180 1451334 1326641 1326151 1328256 1271149 1178858 1175358 1235299
18487 1235299 1175524 1100038 1082593 1144619 1208914 1201091 1107923 1071790 934188 974660 982412
18476 982412 972304 1075115 1155946 997064 987598 1095213 1088573 1139294 1088061 946786 939399
18465 939399 903462 1068806 1192227 1210931 1242511 1325341 1347864 1454689 1486182 1386817 1338973
18454 1338973 1391737 1493720 1647277 1572751 1393814 1279398 1119551 1154363 1189251 1072834
18444 1072834 1035873 1070749 1088072 1045498 1015264 978871 1014852 1088964 1043453 1073276 1115313
18433 1115313 1021175 1005903 1182471 1225211 1166992 1144837 1167230 1109053 1092451 1112416 1152939
18422 1152939 1188055 1122120 1103972 976807 997319 1036513 1019889 1187749 1107886 877289 915494
18411 915494 1002827 949158 935579 875617 865250 882322 854052 873243 829793 818077 691805
18400 691805 801843 873581 802714 812739 781546 818471 746401 862403 990581 1006912 1004734
18389 1004734 1046971 1125724 1212586 1217961 1212655 1230606 1230312 1260642 1354811 1479494 1490005 1443831
18377 1443831 1426703 1383023 1414118 1343024 1419169 1556886 1562152 1538606 1491125 1490703 1345463
18366 1345463 1288396 1342402 1403307 1418042 1398048 1365727 1238800 1097569 1112643 1143784 1176982
18355 1176982 1162796 1101597 1050402 952446 958383 875413 922365 1109185 1331045 1507373 1405625
18344 1405625 1481555 1586858 1576928 1599559 1719232 1921941 2180428 2360271 2591959 2833894
18334 2833894 2873942 2937046 3192116 3360238 3261586 2860660 2673827 2602128 2504709 2543327
18324 2543327 2496601 2479971 2332175 2190717 2278652 2443918 2476138 2375984 2341700 2346350 2359571
18313 2359571 2254988 2261308 2230380 2116649 2032204 2106239 2212699 2228061 2324870 2442807 2404901
18302 2404901 2456784 2558240 2583200 2693033 2794867 2716202 2619975 2588294 2747447 2787978
18292 2787978 2928554 3129670 3255403 3305271 3523723 3625886 3832992 4102897 4370287 4496639
18282 4496639 4607571 4734628 4782749 5047651 5301090 5560568 5661198 5792410 6137768 6793372
18272 6793372 7434980 8269853 9418556 10717987 12439606 14769146 17842029 21658882
18264 21658882 26542443 33583809 43414146 55082241 64448013 65988410 64378009 68319928
18256 68319928 78081625 88940061 93403445 89174973 78599027 68230574 65326723 67464330
18248 67464330 67901430 60034575 48061429 39957475 35404141 32919846 31528102 30809725
18240 30809725 30365951 30023938 29667475 29291633 28980020 28623152 28154215 27594862 26793686
18231 26793686 26047825 25348402 24572083 23767313 23242835 22989947 23123909 23651437 24619888
18222 24619888 26166824 28390179 31526217 35641400 40926207 48144348 58019287 71105334
18214 71105334 85894662 98291925 106395894 115389904 123824929 131131082 140070845 146614688
18206 146614688 149750153 145654501 137517780 128591384 119736265 113045264 105318584 98078966
18198 98078966 87132891 73228296 63576199 58058237 54847110 52767655 51544933 50637575
18190 50637575 49833876 49038306 48012768 46727054 45224611 43652440 41884657 39974348
18182 39974348 38091112 36227268 34404528 32770474 31373666 30209325 29165109 28525293
18174 28525293 28326231 28590402 29253368 30442204 32297044 34804607 38143791 43252185
18166 43252185 50748850 59248566 64138332 62586879 61413700 65539597 73431952 80098582
18158 80098582 79830161 73931623 64567717 58358521 57571646 58920531 57003262 48706747
18150 48706747 40198394 34930370 31936098 30224719 29150402 28404858 27765906 27169268
18142 27169268 26625291 25980303 25310027 24658525 23838727 23049226 22275539 21314537 20379775
18133 20379775 19381209 18435264 17485951 16778198 16195046 15649262 14979023 14334456 13909004
18124 13909004 13639733 13437146 13209768 13029763 12871558 13073058 13397218 13759155 14456469
18115 14456469 15551561 17194560 19577338 22773575 26749721 31593544 37411447 45227333
18107 45227333 56990459 76268246 102868793 121935766 108488712 70820855 47166085
18100 47166085 35231177 28739522 24938856 22731587 21421495 20712400 20298461 20332405
18092 20332405 20640525 21168284 21793740 22173753 22233180 21937109 21186087 20312326 19211433
18083 19211433 18033305 16874152 15679711 14694784 13831291 13066890 12335200 11705867 11185822
18074 11185822 10730734 10207635 9800373 9490406 9199877 8955533 8732515 8365498 8020588
18065 8020588 7834681 7624913 7454404 7351819 7157594 6900870 6669941 6617020 6587350 6651406
18055 6651406 6535607 6384227 6198573 6080010 5790300 5572062 5451185 5323334 5392813 5344455
18045 5344455 5196138 5075304 5001159 4944375 4999347 5068004 5077701 5066609 4943398 4917310 4937629
18034 4937629 4968824 4983755 4943935 5028159 5002392 5127100 5157911 5239512 5369253 5387627 5423815
18023 5423815 5536590 5740566 5878461 6022295 6345955 6638069 6861713 7235828 7633609
18014 7633609 8144983 9086611 10019859 11074684 12449315 14132959 16166624 18879222 22401867
18005 22401867 27014947 32816802 40133639 49256231 61032019 77551852 100563487 127652716
17997 127652716 149640356 157637184 160171862 158247340 146700668 142548311 149742368 155722182
17989 155722182 149747632 139995493 124956986 99620316 79152767 67586535 61489240
17982 61489240 58133179 56069970 54692170 53748883 52878893 52107709 51227627 50056090 48721458
17973 48721458 47186471 45294831 43317503 41104088 38864028 36903138 35093972 33404531
17965 33404531 31952826 30625478 29485076 28676447 28035606 27524116 27254677 27344751 27768681
17956 27768681 28805608 30572307 32971779 36280911 40522564 46027660 53066309 62483840
17948 62483840 75603535 94324155 117410491 137291395 144952600 146770265 146112081 135859823
17940 135859823 130152154 135584051 141666482 137665178 129106289 117264401 95666887 76138206
17932 76138206 64796681 58796909 55496083 53273745 51827735 50784155 49800330 48826485
17924 48826485 48010505 47063777 45895257 44329774 42608173 40705924 38604574 36381335
17916 36381335 34291533 32212672 30425925 28730359 27148092 25612841 24263679 23006540
17908 23006540 21787104 20794707 19974183 19222822 18315120 17574565 16956462 16367018 15909780
17899 15909780 15347139 14873724 14669635 14269308 13765005 13401131 13072337 12726581 12395247
17890 12395247 12124824 11879175 11580793 11332645 11016976 10827776 10694106 10390287 10192121
17881 10192121 10134259 9945735 9809775 9679761 9460141 9233669 9232823 9072865 8891741 8850780
17871 8850780 8770166 8641669 8558121 8543568 8435899 8249206 7965191 7714725 7604548 7518838
17861 7518838 7444373 7393318 7443806 7386621 7151213 6976705 6984999 7071062 7092256 7133865 7063852
17850 7063852 7072104 7102172 7149028 7283703 7495713 7675537 7829750 8130879 8309304 8356312
17840 8356312 8548488 8763886 8891940 9218650 9741705 10170700 10767932 11408594 12149802
17831 12149802 12944791 14017770 15225515 16534348 18278055 20579554 23441852 26790388
17823 26790388 31116940 36650658 43857093 53264468 65029676 78404644 92293314 107430563
17815 107430563 126781013 153211347 185120625 213663788 226925098 224534517 216490271
17808 216490271 203426160 186821940 171708247 159660576 151508496 148638306 149665105
17801 149665105 151242461 148841852 139243298 125613212 113855837 105724420 100814564 98037311
17793 98037311 96871041 96923965 98040612 100474282 104357896 110216519 119016909 131665825
17785 131665825 146385086 155369943 150027003 134861979 123516259 119843164 121149383
17778 121149383 121781600 116462397 107625952 102464242 102663431 107821814 116588298 125338107
17770 125338107 128963736 128641153 131810991 141417850 155424409 165998374 163754628 151707992
17762 151707992 143313446 142850078 149149319 159190018 167832581 170290454 168137553 166966396
17754 166966396 168342815 169637821 168370508 165013889 161999236 161366340 161029069 156195155
17746 156195155 145973323 135326861 128279509 125773250 127590589 134343314 145639113
17739 145639113 156940842 158879640 146558642 131075865 122001271 118952612 117939309
17732 117939309 113172937 101701969 89275740 80022178 73624340 68847844 65233175 62529102
17724 62529102 60335236 58117084 55973289 54009901 52166760 50243821 48374378 46349188
17716 46349188 44353865 42306800 40334550 38523673 36821511 35116251 33537553 31982287
17708 31982287 30478190 29072971 27882331 26937272 25870347 24805730 23916999 23221779
17700 23221779 22541352 21782643 21067578 20436610 19824686 19279118 18677469 18165636 17684580
17691 17684580 17291345 16859416 16460262 16027735 15488204 15099774 14817395 14421910 14027822
17682 14027822 13646795 13199806 12863947 12529197 12029366 11443652 11025251 10707831 10418511
17673 10418511 10055403 9726835 9494582 9230338 8994883 8740487 8506869 8344689 8230214
17664 8230214 8060207 7843730 7559732 7287080 7048776 6829988 6607522 6460959 6308671
17655 6308671 6177423 6116123 5868058 5686904 5682192 5548073 5350810 5256868 5202248 5244911
17645 5244911 5044062 4982861 4928669 4950956 4935579 4904969 4790808 4623102 4569535 4368449
17635 4368449 4240452 4171259 4170859 4088427 3839792 3687266 3601322 3678587 3629299 3364156 3177805
17624 3177805 3022308 2991905 2890005 2729747 2647752 2666110 2597648 2476278 2412380 2431378
17614 2431378 2385802 2290884 2299087 2374674 2240319 2119091 2108056 2096029 2026254 1858610 1880562
17603 1880562 1856642 1761054 1662462 1567088 1506337 1510925 1443724 1390510 1450914 1659029 1680754
17592 1680754 1534145 1351737 1256033 1163468 1136780 1192048 1263750 1197439 1162376 1211110 1167176
17581 1167176 1146361 1167250 1203358 1152322 1096044 1143444 1131608 1167744 1203112 1236319 1256239
17570 1256239 1218026 1148200 1070013 1082109 1188367 1203406 1161725 1184515 1157157 1057988 1073696
17559 1073696 1072538 970573 853070 860844 968599 950980 913834 969703 879263 846797 840123
17548 840123 680396 532939 575679 708792 818686 926932 928496 933547 910425 801412 697280
17537 697280 649149 730355 718998 707724 803215 719507 613122 606837 567147 615772 824028
17526 824028 781346 690127 700352 622519 558596 559134 609849 685455 806417 808560 745447 695112
17514 695112 660904 691165 656152 652489 722998 805596 712928 734404 750192 630732 626649 627682
17502 627682 581167 538070 503233 500342 473420 440643 459451 512353 539880 550481 596677 584447
17490 584447 461897 396961 476050 513368 546417 682812 688348 763238 810202 740932 678691
17479 678691 713441 809723 1090665 1245163 1287276 1259884 1145918 1044760 979066 883951 792603
17468 792603 940606 959073 773906 602766 698254 806710 717282 671456 554579 560812 565613
17457 565613 434047 393162 441629 569395 617539 591829 603475 549965 490750 565396 638432
17446 638432 636308 635287 614486 742215 659025 646275 799423 899809 970159 956513 725242
17435 725242 614203 529162 491722 486918 573783 528234 498640 578367 589376 772500 904812
17424 904812 1028887 1078011 1185907 1219560 1094439 1026779 1050501 1095473 1164358 1104647 898928
17413 898928 730852 593229 447162 423212 420132 421721 424862 434256 467850 444214 429759 349876
17401 349876 392829 529822 474917 330686 217667 249850 291195 232487 219631 204238 190349
17390 190349 140427 103280 90694 146933 175399 177585 216276 253058 220909 220537 211964 231224
17378 231224 234467 347746 466372 498329 509493 417930 364302 358422 344913 204793 121617
17367 121617 209536 251017 220742 298748 396270 390231 371519 381232 348413 241691 160774 261438
17355 261438 350920 386294 365084 349068 396193 465272 444232 344009 271760 222068 214268
17344 214268 198418 232675 213042 226566 303521 360098 291691 395580 298761 221697 245906
17333 245906 284282 337561 318702 207231 128823 139588 261573 286444 230937 146116 160481
17322 160481 155507 31675 -37173 -68210 48989 126964 96074 96299 117151 237804 377549
17311 377549 402525 400590 322746 428327 365684 276122 322902 313546 261600 294753 311921 337366
17299 337366 323291 266224 240902 193381 285198 413663 389264 302516 322000 466340 546941
17288 546941 612739 675900 630398 577362 661102 754691 697909 771256 732272 822735 952888
17277 952888 824274 694196 882425 930654 1019355 1066593 1001981 938613 924785 939816 1032565
17266 1032565 999306 833174 731156 640156 592919 627932 699669 742200 806528 888993 935944
17255 935944 1048943 961244 898347 848915 841277 869329 854111 822214 744430 746787 712258 761597
17243 761597 776972 721431 810635 924869 948509 831610 736895 674236 591564 497346 607006
17232 607006 718955 821953 816617 833867 935849 1066103 1081248 1000692 1065161 1148457 1175835
17221 1175835 1258480 1290035 1139126 869691 733760 831399 1041723 1059553 1070051 923767
17211 923767 778378 730179 669094 608668 645777 822126 718193 668377 673946 669007 488766
17200 488766 344631 202909 327330 418469 502612 484924 413388 353952 283512 339595 450881
17189 450881 569275 610649 493347 353200 300752 310346 220634 84277 84353 102554 171409
17178 171409 208753 200997 143642 10657 -29285 88672 69630 191417 169279 143243 268653
17167 268653 299452 219938 270316 312970 350266 318226 278264 295177 330310 328731 244743 213792
17155 213792 62671 44568 125729 225199 132647 78715 23007 29949 10713 23274 91
17144 91 9689 -55038 -60680 4499 63929 49561 34158 59736 115586 89541 118348 118418 -18891
17131 -18891 34273 18229 89091 142112 58086 23488 89321 76164 111479 115523 14981 -14515
17119 -14515 155036 200056 303402 259602 224009 232274 259736 217792 128063 92987 46147
17108 46147 95333 131507 148898 146079 57858 -62861 62868 86674 14980 23553 120010 59715
17096 59715 67510 54276 27577 -80070 -84874 -61990 -61682 -59298 -216120 -187904 -7141 130699
17084 130699 189579 146158 137594 150320 29599 41165 11801 55040 87057 59868 -45287
17073 -45287 -62830 -47682 -8351 58146 7964 41362 65868 67177 33987 -959 -86115 -120606
17061 -120606 20696 97944 175841 143342 94638 181786 189803 75798 75099 70123 86203 65996
17049 65996 -81484 -102062 -39028 -60263 -16605 -8665 56767 130792 211592 200216 173187 218890
17037 218890 243350 144627 51788 105672 106084 42272 33604 -21963 -57063 -24850 -89119 -69922
17025 -69922 -91466 -92947 -120518 -145446 -63372 -32029 74303 161544 155661 25025 -110791
17014 -110791 -114524 57772 110015 114796 6090 -46329 -178143 -120927 -29135 -83836 -68010
17003 -68010 47983 -23156 -115218 -197022 -140766 -80013 -127425 -241706 -197399 -191092 -146468
16992 -146468 -68154 -71501 -26256 130512 72987 -2677 -29664 71475 172339 134624 -59647
16981 -59647 -120748 -21528 37536 58627 41561 -38687 -40299 -66703 -123463 -134747 -20958 84707
16969 84707 58384 103127 134414 58732 91210 112725 50734 -39681 58290 156608 80157 -46588
16957 -46588 -101754 -92032 -24639 23769 -23730 -114585 -1733 39744 79449 91581 -36832
16946 -36832 -33789 32147 104142 -56433 -102377 -4434 33301 85058 79461 75245 52446 -19673
16934 -19673 -48172 -113024 -61094 -108475 -88384 -17525 42689 6556 -25587 -53893 -118996 -35127
16922 -35127 -19738 61246 174983 219965 156471 25022 -20621 -53945 -57090 43891 11624
16911 11624 -75660 -69565 -134699 -171607 -30223 -56879 -54423 33369 68998 -6560 -17282 -50648
16899 -50648 20263 77655 24017 -101979 -109457 -60403 51093 138872 161852 164117 26050
16888 26050 -112396 -58296 -79507 -155720 -71141 -76036 -136007 -146832 -198366 -98148 61320
16877 61320 111971 8573 -53784 78808 105178 38260 56754 45832 126433 177106 154624
16866 154624 105989 95935 11341 -22693 -19330 48178 39264 -53069 -133088 -68849 15763 53346
16854 53346 19170 98070 125603 -29555 -50721 14828 6547 -3537 95286 144369 46554 -39653
16842 -39653 18344 67596 8814 -88307 -160472 -118296 -86465 13745 41603 -43057 -41418 -79826
16830 -79826 -117643 -180313 -147493 59026 152665 144360 -43872 -159638 -10916 184366 186263
16819 186263 150504 73445 10954 -58636 -11409 -35879 -151158 -162443 -74201 -105268 -24015
16808 -24015 30772 84171 60447 130213 54319 36209 56051 68601 18721 -109278 -57055
16797 -57055 91189 114882 49989 -95713 -180028 -118014 -131404 -157022 -162968 -89820 -55763
16786 -55763 -8291 -37716 -88197 -70390 -83221 -65172 -102089 -129307 -5901 86857 128777
16775 128777 65606 150499 221844 192077 80563 42997 101965 156897 287094 316708 341433
16764 341433 233509 117173 -34800 -66568 -59370 -78622 7675 -55872 -3563 70267 9167
16753 9167 -123575 -195058 -79363 -94483 25546 89013 11330 57869 24174 140586 200060
16742 200060 170360 253640 330911 263946 169703 61365 48349 130081 118441 71158 50877
16731 50877 100114 201925 173473 160396 227009 191105 143262 111975 100128 -60602 -80566
16720 -80566 -146695 -255666 -283412 -211207 -134728 -186068 -132490 -52560 -59733 -163445 -131256
16709 -131256 49829 1272 12196 -32722 -132584 -141034 -249625 -219032 -203435 -125076 -129906
16698 -129906 -116277 79091 21852 -39565 -110779 -138233 -53465 19466 -40538 -121358 -170077
16687 -170077 -107823 -144126 -154675 -171779 -181440 -89956 -18616 -125833 -196950 -116633 -152033
16676 -152033 -137510 -126099 -151002 -150568 -163944 -126806 -8372 99222 -6380 -153888 -84165
16665 -84165 122430 150177 118972 216824 161021 -1330 -90391 -67607 -43409 -151116 -46150
16654 -46150 -64730 -160690 -296213 -281622 -208439 -133727 -143846 -137586 -32670 -46075 -159116
16643 -159116 -123294 -41935 23376 -34043 -6779 -1929 -46358 112578 240552 133048 87532
16632 87532 63715 107765 95612 81619 109234 253625 232439 105456 60991 91379 155379
16621 155379 161680 109908 87900 91532 42281 61573 163674 184171 21871 -171113 -166088
16610 -166088 -134922 -314 57786 84857 23675 -80357 -110874 -29285 -66513 -155152 -121156
16599 -121156 50408 99613 70546 -22678 -48321 38976 82025 33686 -26228 -131177 -161126
16588 -161126 -35896 72903 -64351 -75380 -135945 -133314 -20215 145335 232247 144181 56044
16577 56044 56573 109797 28234 -4691 50897 8223 -52000 -40757 -55665 -57158 56378 139851
16565 139851 110437 49369 63171 93829 125337 172909 183906 127710 249700 85884 -38615
16554 -38615 47786 119923 99158 160562 132172 66780 47526 -6653 32809 -505 -101758
16543 -101758 -144847 -205165 -171118 -55390 -65991 -111161 34439 20246 20983 -32614 19560
16532 19560 120010 82503 45506 104305 109138 221718 291549 209020 249089 313610 257267
16521 257267 131423 110715 222949 234300 244842 112683 -16858 -74370 -91898 -142715 -221172
16510 -221172 -177243 -173215 -12195 36109 58212 55385 -60705 -76898 -51839 -60304 -49725 61864
16498 61864 35454 40731 -30689 -175321 -183897 -47585 -60835 -65858 60893 108598 -24582
16487 -24582 -35666 -9005 1341 56589 55102 46018 31061 108637 154107 151596 59486 -34541
16475 -34541 -78100 -131776 -240011 -136641 -4143 75761 -3012 29836 93267 -44944 -236822
16464 -236822 -169559 -71300 -150681 -107286 -63143 -47281 -27116 9127 -14168 -54030 -14793
16453 -14793 -117211 -183946 -124028 -32742 17884 -33431 -191169 -252930 -188377 -73991 50153
16442 50153 37203 -43418 -5514 -14993 -33086 -27288 21714 -34577 142167 228420 160409 96432
16430 96432 -25363 -53500 -42328 -77918 -73685 -1376 15791 -2129 7275 117000 165543 75246
16418 75246 80153 61368 -112023 -72974 67776 163755 199195 222922 152352 35663 -42790
16407 -42790 -75721 -50930 65746 195061 242549 149430 -12615 -185735 -113093 -29567 -53430
16396 -53430 -122902 -163468 -171281 -111337 -46034 -123230 -58318 -88118 -151512 -80190 -8184 47259
16384 47259 64914 91682 99805 -7199 33139 68815 90356 124406 184604 213696 191474 90639
16372 90639 106242 117201 184061 235681 269852 329813 222341 186309 183126 112920 37745 59540
16360 59540 73974 136205 218106 298296 259241 54436 -14052 78189 132945 163541 20874
16349 20874 -77238 17222 32950 -62519 -141883 -139600 -78003 -87713 -32041 -91458 -138518 -46471
16337 -46471 69091 180025 166326 203640 127900 -3493 79063 122887 153269 63357 -50807
16326 -50807 -178185 -148943 -108014 33358 89488 -2350 -172983 -126792 -45335 -21544 -50698
16315 -50698 -86482 -123219 -19455 -14318 -51627 -93992 -30989 -79027 -6006 28489 35782 30575
16303 30575 24901 -3868 113785 185934 161337 87436 107765 147280 85264 -35474 -236180
16292 -236180 -179181 -138451 6706 36123 5130 48177 124290 39710 4131 19802 22487
16281 22487 30437 -30807 116657 170911 176306 148315 87346 86108 99366 139834 9108 -116622
16269 -116622 -39858 142037 221923 203943 115814 19015 9879 15751 -11348 47787 -5819 138852
16257 138852 168465 102188 23087 -58979 -65403 -103904 -132993 -56277 -66257 36190 170673
16246 170673 144547 52940 -73056 -121247 -59865 -9235 99530 97655 30803 79489 65442
16235 65442 81826 168588 147345 84205 187243 368341 358130 182354 128710 279484 313653
16224 313653 210934 94054 -30989 -70438 -23553 -96417 -103497 17631 71923 -144125 -106446
16213 -106446 -112511 -88644 37170 -62468 -124424 -62348 9603 -16 -10315 37061 82377 77003
16201 77003 95481 105712 -92415 -157899 -241420 -236751 -149222 -145281 -81409 30854 -29211 -7285
16189 -7285 -61305 281 74211 -18405 -8060 -42014 -85343 -112981 -87468 -113755 -96597 35401
16177 35401 88506 -37162 49109 76913 109722 119703 148214 7400 -38021 -67257 -56923
16166 -56923 -19706 11014 96055 104318 54154 71047 138556 69015 -28835 225 -14045 -62201
16154 -62201 -74075 -163661 -177205 -182961 -193102 -159289 -101962 -1580 -52252 -37979 -34738 -36182
16142 -36182 37080 -24687 11397 37704 185796 246004 137719 175949 268383 270192 311133
16131 311133 298248 216465 93671 55533 96445 106719 -6683 -111799 -49900 97234 131830
16120 131830 182896 66949 3952 -72736 -95658 36994 3274 50662 76099 20079 -20223
16109 -20223 -58231 56556 90522 -2047 28620 33226 -8511 -22428 -54252 -66032 -24766 -55926
16097 -55926 -37606 27941 63809 87829 1350 86346 98271 72080 49637 57167 14600 251
16085 251 82103 88133 68263 130342 96775 76110 117192 166904 146586 15231 -8238 78996
16073 78996 85118 -36006 -55003 -4052 -33663 -6403 -145584 -188127 -72924 21629 106888
16062 106888 13183 -124846 -71168 13388 -42629 38390 13911 -18023 84045 181053 92182
16051 92182 13406 152819 246859 108760 -27572 -37968 -6040 -28544 2459 59048 46541
16040 46541 108972 -92052 -227606 -148779 -35609 24380 42799 122797 78093 -37251 -89622
16029 -89622 -68541 15097 41786 -82410 -122668 -49545 -131300 -106001 -105340 -16699 -83426 -155358
16017 -155358 -153284 -201245 -284636 -141255 97673 200385 127392 16214 51982 136074 120061
16006 120061 136450 162319 195109 177779 120849 50430 27468 46613 75227 15785 55227
15995 55227 53202 -10686 -113716 -90892 -5811 28077 48522 47769 3570 -89209 -70373 -13328
15983 -13328 -14516 56718 25677 -26722 70611 67729 73750 44357 -37335 -112210 -24474 38045
15971 38045 -54753 -4173 43523 134078 176679 233968 145222 57933 99977 84312 -12827 -29174
15959 -29174 20090 60855 53464 -156970 -223428 -120453 -123121 -96128 -67091 -117496 -205673 -136052
15947 -136052 -27046 19112 4922 91974 130990 100429 -17113 -84292 67609 51293 -121435
15936 -121435 -213478 1525 159712 191038 118933 -51190 -160505 -185841 -179304 -99529 32918
15925 32918 130809 124605 -12849 -66886 -29849 6038 130097 163709 89526 -6431 6124
15914 6124 47778 75385 47337 -64369 -63678 13704 -37996 57660 96561 10504 -67858 -120939
15902 -120939 -10338 -10691 -79542 -120 24168 52802 -36633 -38391 -5437 -95312 -89942 -140079
15890 -140079 -52923 -16930 72253 165886 124733 168950 102277 -13116 -872 -63510 14195
15879 14195 125860 183833 181036 200120 106851 67546 64001 -44111 26042 166613 176184 -4076
15867 -4076 -19852 145153 170058 54053 -16528 66853 253011 170910 15697 -53190 -76172
15856 -76172 17708 59594 -91802 -188727 -135770 40929 125014 72024 -119017 -111792 -22821
15845 -22821 94744 156301 42869 -8958 59391 131848 84069 -53876 3820 90602 77089
15834 77089 -84942 -193911 -234415 -205876 -159102 -326317 -311517 -91188 124666 39847 -30364
15823 -30364 4867 3505 84487 85214 190930 164323 123870 80302 157749 119964 99762 179284
15811 179284 312193 274155 93862 -10277 -29073 -83151 -63379 -6346 -10808 49109 159936
15800 159936 252412 152227 -11131 -9300 -50829 -52930 3327 10500 -66731 -1119 -88460 -110039
15788 -110039 1627 -76315 -89600 -125131 -13065 75148 46875 24261 80927 264260 214453
15777 214453 -17763 -194618 -162269 -134635 -110028 -64485 -94836 -211821 -274306 -265740 -226843
15766 -226843 -155776 -128037 -280 50873 6896 105836 111622 106693 63982 17776 -32864 -88975
15754 -88975 -104812 -99123 -23456 98989 198289 136233 43554 93380 172122 219862 219284 168917
15742 168917 144974 163442 96550 77773 131249 124577 43601 18388 -30595 -155120 -176555
15731 -176555 -187886 -170981 -187722 -91306 -70758 -127081 -155407 -129691 -9899 97376 102498
15720 102498 -24184 -42378 -47486 -102775 -211268 -244435 -176127 -47463 -70352 -136516 -47728
15709 -47728 16237 81712 56882 44822 75805 47310 94197 201760 206530 195095 118058 30777
15697 30777 -4639 76413 -51714 -57409 -77972 -63381 37985 46590 25202 -26879 -15972 -50707
15685 -50707 -82206 -9697 38922 128163 174198 220551 140194 114645 154699 73071 -16327 -148648
15673 -148648 -168156 -122603 533 76767 34507 -32680 -32264 -30305 -64772 -33165 20040 -6997
15661 -6997 -42887 -24304 2699 24922 51635 53490 125438 126013 124313 141961 39488 25123
15649 25123 65498 17655 49825 74362 46451 50146 48859 -8689 -72623 -141566 -118548 -66754
15637 -66754 -97447 -205983 -47665 86804 51732 -54386 -51816 -58979 64809 103559 137362
15626 137362 92399 -81232 -169696 -161117 -39183 102959 75622 -6597 10278 -69888 -38293
15615 -38293 -6737 -107759 -180255 -138250 -115378 -187425 -245304 -264381 -207522 -131370 -107384
15604 -107384 4664 -7198 -10118 -41014 -131194 -97844 -29146 -55740 -68685 28244 240322
15593 240322 220831 157443 77138 -93883 -121811 -82485 -6985 117987 130385 45683 8821
15582 8821 111844 77370 44216 -27923 -61176 -27707 20416 7051 67873 17912 -37997 6949
15570 6949 -24949 47922 68989 88663 1406 24074 87381 250262 278398 227612 156044 189870
15558 189870 133242 69920 135354 272524 369457 216420 80526 77361 85581 36781 2057
15547 2057 70101 82699 3600 70124 85516 110118 64771 108391 59878 66923 -1326 28932
15535 28932 78506 140022 50185 159877 169715 56517 110977 172257 133938 130872 2446
15524 2446 39882 121050 -3518 -71925 -196917 -278639 -70070 106792 170992 151572 120268
15513 120268 99537 36997 35000 73325 49396 72081 105804 155716 53343 -31398 -142468
15502 -142468 -212328 -196000 -127621 -30707 79086 140870 155706 101983 115049 77654 37026
15491 37026 -55688 -99463 -125381 2680 74616 90933 70268 100658 136623 162959 111147
15480 111147 82177 29181 -96073 -71053 23650 -10246 39498 272259 228901 169726 81815
15469 81815 10452 57295 111429 -5355 22582 121386 113561 31592 -113842 -96752 65019
15458 65019 60820 70337 80605 60379 50072 -57682 -59483 -136098 -106618 -69957 -34455 -16886
15446 -16886 89073 187055 303833 217594 -8091 -58529 4483 82370 17429 -83554 -170350
15435 -170350 -229744 -246879 -120914 59851 59937 -103306 -141205 -112429 67496 103503 53811
15424 53811 -41815 -158657 -172809 -93661 -48022 -91187 -160122 -175811 -114809 -75652 -51626
15413 -51626 -27079 -25018 -75832 6605 69755 169908 176695 154186 281499 290234 153922 60146
15401 60146 122663 110478 105394 52211 109540 159215 107130 6346 -89221 -19681 -87602 -53644
15389 -53644 -72880 -144580 -268850 -192916 -102974 -146138 -93522 -105849 -110178 -93978 -134733 -161115
15377 -161115 -129892 -39025 74237 136369 191206 82853 66502 -6625 -102744 -134661 44157
15366 44157 43153 -155492 -228066 -185931 -140593 -73624 -81192 -74915 -1170 11500 -81702 -69946
15354 -69946 -116802 -42651 107402 109670 54894 -14140 -8037 -18432 -95099 -78490 56410 122073
15342 122073 34851 -86124 -26194 15180 -8181 -105093 -95956 -80504 -139260 -86845 -88762 -94597
15330 -94597 -53557 -22957 141 69780 19383 44524 1791 -17318 68330 14922 38314 23366
15318 23366 -23632 30348 84805 79370 99238 97924 4917 9393 -50213 -119656 -53549 -27954
15306 -27954 -65928 -12203 57221 -5423 -35495 -21766 -62432 -70445 57307 119046 93009 75269
15294 75269 117789 104287 35144 104339 93095 168800 98944 163032 205727 310036 271708
15283 271708 220898 135995 127406 -14681 -20793 27301 76375 231323 237777 159711 121663 58241
15271 58241 17398 20148 -30704 -149326 -131418 -16264 -34471 9561 61555 75750 95851
15260 95851 81882 26672 -16048 28604 115412 169496 138068 56450 -51570 -92119 -87514 -144928
15248 -144928 -133801 -87383 -35670 -71697 -38565 -18379 -20227 -16994 111169 135025 220633 270285
15236 270285 249112 207886 125108 103041 71355 -71996 -55073 -3411 51241 -116648 -172206
15225 -172206 -15733 -3706 -28931 73363 57877 15002 -37367 -73183 -142881 -95514 31565
15214 31565 -4476 3240 -37985 -11619 -21840 -21728 -36518 13787 120575 150803 64072 -46749
15202 -46749 34712 19206 23737 183146 225203 120508 148342 246035 255685 146793 63476
15191 63476 44144 140756 4726 -51394 127101 282482 248635 293754 311077 221303 243908
15180 243908 210512 123013 -21754 -69999 -3330 14655 116637 92372 12281 -5781 882
15169 882 -21466 -82492 -28862 -15444 -96206 -59766 7006 16329 -43800 -83051 -115560 -94981
15157 -94981 -37949 25326 -10332 -111890 -140032 -129658 -125770 -142799 -162892 -57559 49354
15146 49354 51959 172375 122775 39330 99771 205225 117536 99819 4002 31520 43406
15135 43406 95632 20314 73601 101365 53185 25630 -13087 -81360 -40166 -48078 -63017 -75554
15123 -75554 -63717 -59273 -56408 -143435 -55141 49762 77678 113946 77559 -65318 -26203 -6998
15111 -6998 -191820 -306118 -186664 -188946 -184155 -184652 -158443 -95056 -61104 -60717 -49209 -49803 47842
15098 47842 82615 209530 154581 84405 34580 54854 52411 131520 130336 60417 43915 41046
15086 41046 -141850 -80429 -62045 -81973 -31691 -29835 79699 -17699 -172238 -178686 -98904
15075 -98904 -70796 -75699 27502 196627 166093 51907 65915 103668 81153 -8070 -58289
15064 -58289 -27978 36740 -153 -103236 -111885 10804 47125 102166 190929 106328 -28815
15053 -28815 -131724 -127040 19246 216348 222307 124423 -50570 -101477 -72705 -189822 -182673
15042 -182673 -156588 -41572 70583 11398 17091 -8988 31038 77800 100001 -18047 -72386
15031 -72386 -29150 -8385 29779 119987 187218 31121 -38492 -14214 18610 -31226 -7496
15020 -7496 18420 99282 118398 64987 -6309 62573 80299 20352 -94911 -13736 -51686 -161410
15008 -161410 -180940 -161836 -132156 -138694 -186485 -116604 -84895 -78528 7258 167758 137620 11028
14996 11028 14395 70031 16735 -4167 -36074 -100347 -205891 -139931 -88776 -35931 27881 107513
14984 107513 135095 184616 55293 6469 -16321 -121011 -123297 -30964 -143289 -303124 -234075
14973 -234075 -235402 -301690 -219386 -229820 -145565 7183 74393 160883 173981 128629 67039
14962 67039 6808 16516 -69749 9826 93570 90590 82446 -10017 -13992 141517 186346 60206
14950 60206 -52439 -65514 -88371 -153160 -135951 -62215 -11824 -2366 -35318 -39578 35858 126129
14938 126129 116742 52375 -44873 -92012 -112702 -92851 -63439 -3154 24751 1026 -170380
14927 -170380 -241139 -163840 -123783 -98897 -157418 -137012 8850 4665 40891 93463 18641
14916 18641 -24541 -50541 31839 15155 -46187 -60054 69813 83426 -67429 -176041 -99314
14905 -99314 -111208 -146382 -115440 5727 28943 -60777 -9644 43273 -3549 17909 -31944
14894 -31944 -79804 -37795 -7668 -32478 117158 118617 222939 158518 66011 80259 98105
14883 98105 106127 -8089 -25395 113799 112935 33268 70587 56670 38610 79067 76928 10025
14871 10025 85282 52287 107339 36188 -74009 54505 227152 210562 7176 -23277 41248
14860 41248 140936 142346 113026 36981 -33717 73966 31492 42006 -10393 -42272 14298 100735
14848 100735 73170 -9061 -41758 -65723 -62359 -44067 -22660 130319 197576 106494 11170
14837 11170 93079 38539 67026 97828 -17225 -35527 -70562 -73972 -8321 40950 -12037 -78521
14825 -78521 24118 87602 36294 122787 67015 -21561 -201989 -239596 -70172 142381 78054
14814 78054 -44325 -44188 -53502 -97179 -89639 -88602 -15004 -37247 -93765 -123573 -60039 43816
14802 43816 -102076 -99915 -79415 -87590 -80426 47566 196822 246143 151226 132602 246095
14791 246095 148194 14377 -80705 -214031 -122964 -170709 -205236 -76226 8210 -60806 -31277
14780 -31277 -47391 -51250 -9441 54457 71142 63681 -35226 -26849 47029 123446 121616 35997
14768 35997 2017 -19494 55067 -107238 -147699 -81569 -82887 24206 129062 108145 21248
14757 21248 5490 68366 51698 -95235 -54582 9581 3288 78631 99421 -580 -113948
14746 -113948 -47538 14611 -39928 47028 53471 199320 108298 11012 -81720 -50182 226601
14735 226601 235734 249088 174606 66971 59654 147565 195544 176721 130151 63851 21259 -69926
14723 -69926 -98009 9094 -24228 -91543 -14566 -123228 -246156 -192564 -229778 -191592 -158823
14712 -158823 -43087 -38168 -132359 -194686 -184930 -216014 -247457 -202164 -196404 -109687 36616 -68827
14700 -68827 -206912 -135818 105551 174335 172264 104793 100843 34671 57767 -9339 -106392 -162294
14688 -162294 -71630 -5193 78180 99755 27993 -43257 -65604 -86485 -15411 -25952 19292
14677 19292 119837 161712 185002 96054 -20438 -74453 38048 24755 16875 25257 83376
14666 83376 51416 61409 -6067 27820 -118023 -57507 -115053 -162082 -52122 -90454 -103252
14655 -103252 -69512 74547 151486 94446 114468 87049 92054 98926 -15571 -849 -10942
14644 -10942 -81343 -25368 -102867 -23197 51100 28624 7875 136318 -9291 -179957 -191133
14633 -191133 -149954 -110911 -147048 -90526 -6451 82918 31105 32956 55802 -68036 -189753
14622 -189753 -268220 -120249 -58499 -25521 50174 -3077 -74524 -9384 62995 6193 -12799
14611 -12799 -114690 -59623 101931 66593 -952 -49414 -85203 26047 79114 14130 -88114
14600 -88114 -249976 -264956 -207629 -179983 -145835 -106868 -119432 -71253 -9694 36444 -917
14589 -917 -27266 62935 108125 94886 39761 37588 53096 58525 92964 100996 107566 94320 115935
14576 115935 20546 52225 66296 78368 20891 -47902 -11256 -2571 43123 2991 -30691 -11492
14564 -11492 151333 346922 235340 30667 -82540 -110062 -73897 -35944 -55112 -21327 -18
14553 -18 -96339 -70210 -43294 58692 42506 -66047 -61930 6660 -70088 -47879 -116733 -223743
14541 -223743 -271280 -237057 -284441 -227349 -144574 -33301 20601 -34479 -110611 -109742 -146674 -77266
14529 -77266 -88363 -98370 -83110 -121760 -66430 -1114 -16036 7999 9524 150614 343889
14518 343889 312906 201553 219247 118256 80876 81074 134311 137177 106105 78738 82404 141208
14506 141208 198421 -12708 -130640 -75943 -7417 -75061 -2281 129655 28022 -11129 34487
14495 34487 32380 47207 67041 -15469 -39906 11197 41236 -9618 -75451 -566 70205 -6733
14483 -6733 -73078 -129074 -156767 -88691 28317 6575 -79219 -58928 -98266 -196578 -209642 -128707
14471 -128707 -103578 -131231 -82465 -127829 -191197 -126091 -56932 -166215 -114896 -26536 -62982
14460 -62982 -106118 -69254 -209636 -218522 48484 116076 120190 1196 23076 105837 244395
14449 244395 321514 313108 145946 87741 -27673 -45444 -56334 -173251 -241215 -246554 -94684
14438 -94684 -159730 -159506 -124242 -55075 -6374 5501 -72127 -83797 -35791 11775 140932 104631
14426 104631 16699 34949 -12128 -79765 33562 110293 123089 -59385 -51938 -48831 -69345
14415 -69345 14114 51557 -51281 -115717 -115222 -35385 -46570 -50271 -27915 -78194 -219410 -204095
14403 -204095 -120254 -52242 -52333 -49751 41341 100659 152958 76729 -11762 63356 134367 167566
14391 167566 110504 59697 -18650 37224 -60857 -175776 -208280 -193794 -174070 -161336 -150468
14380 -150468 -132308 -89052 46800 40935 115100 154120 197856 208213 132427 13202 35724
14369 35724 54897 38533 61914 83421 140848 174691 186088 75276 7143 23061 155540
14358 155540 154205 45561 56782 -2635 -23779 -60309 -74686 -26131 19947 21815 65393 -47212
14346 -47212 -82146 75427 139869 -7807 -42072 27357 77856 122725 18820 -88364 -78758
14335 -78758 -36619 36861 674 -100636 -22069 -9998 69037 91884 27592 -45368 -28263
14324 -28263 -34629 -93523 -80173 -75809 -114909 -116879 -134186 -114682 7026 52108 92801 102669
14312 102669 57480 -44095 540 94328 83959 -6610 -28991 12138 127875 116558 32185
14301 32185 112635 66904 27667 -21049 -23711 -32876 -53569 -6724 78908 746 -50522 -23129
14289 -23129 52509 28648 -118108 -34547 -72473 -97564 -103002 -105699 -115465 -48187 73909 168719
14277 168719 189403 108533 83555 158077 177831 82002 82970 110141 97015 23160 -161119 -177212
14265 -177212 -154810 -95812 -36115 -28651 -97240 -71890 -32492 31723 -45394 -33828 -37700 -55325
14253 -55325 -68852 -317 -13683 22489 305 -46214 18014 124715 268751 134736 43632
14242 43632 58652 91899 67934 -25096 -95793 -56716 -57575 -64527 -121205 -46739 -7913 4890
14230 4890 -34842 -79843 -51932 -64786 -170466 -208905 -106454 -125958 -117406 1721 96690
14219 96690 21492 -77162 -73869 -90250 -91270 -86267 -62145 64543 68502 73427 92546 133718
14207 133718 197203 31292 -91610 -112186 -73356 -23868 -22222 1000 -71238 -151264 -218445
14196 -218445 -86778 -73538 -161535 -77680 -7392 55811 31294 52368 -12274 -51043 31082
14185 31082 56508 -15059 56696 177327 164313 174643 227027 239044 155439 48555 -50314
14174 -50314 -30011 157981 171028 122933 68256 26273 -48984 22742 132929 110920 76126
14163 76126 150502 256650 416314 373200 354232 231851 225557 146855 234487 218170 120768
14152 120768 50511 42885 34071 -10890 30359 33048 -112074 -242289 -162190 -10560 95127
14141 95127 65806 12915 -27324 46948 55959 134123 133242 80135 47387 38637 7419 5282 2015
14128 2015 -46967 60249 139286 90796 50782 28589 34950 38185 60122 -84577 -113985 10797
14116 10797 47013 77284 108251 136018 122706 14296 -51393 -33500 20659 16212 2686 57529
14104 57529 -79579 -117054 -187850 -208582 -289222 -322744 -185956 -9553 -4088 84404 137113
14093 137113 178302 157740 123901 100315 81920 73450 154149 111980 80787 113208 -41384
14082 -41384 -153645 -67996 4157 15484 65089 63778 18114 -30218 70669 49084 59408
14071 59408 5846 -177070 -161081 -91387 -50751 -48193 54613 87120 -76202 -184662 -140876
14060 -140876 -195794 -68474 40301 9292 -1903 -84633 -93462 -130444 -38941 46933 69319
14049 69319 47247 -63233 -87256 34549 27051 -44684 44336 86194 161136 162657 92139 120623
14037 120623 94141 -42133 -94252 44861 64959 145650 119128 71822 141094 121094 4081
14026 4081 -74492 -125969 -142929 -62440 -1709 -10226 -57101 -44310 107237 49808 31245 136783
14014 136783 63790 32933 58417 45822 43682 -9092 -91239 -213096 -271737 -225047 -171402
14003 -171402 -153776 -70589 -110047 -118384 -76687 -123742 -145478 -146239 -82485 -19135 56773 69966
13991 69966 124458 75062 -18453 -16274 28146 6431 -93344 -192185 -156548 -49199 -10809 33108
13979 33108 57418 16371 -40394 -48709 -17224 34880 98246 100619 90703 45980 -107047 -91020
13967 -91020 -114998 -167845 -174614 -40559 17944 99671 176793 52419 -139071 -163507 58517
13956 58517 155494 138104 36998 75108 99295 80292 46483 -31821 -29274 35521 2793 50026
13944 50026 68910 -23676 -57574 -149227 -250222 -183975 -149556 -81273 -53801 -18109 79996
13933 79996 178712 114151 102314 123324 108881 88868 -25421 -104774 9748 -2490 -30416
13922 -30416 24023 16954 -17840 13197 -22580 -76223 -69163 -54457 -121981 -27008 51681 106031
13910 106031 132944 71406 -107903 -90453 51436 75804 19173 25187 52461 -11222 94932
13899 94932 183199 256522 276261 233605 206706 153578 73166 -201 -37333 -113709 -175356 -177873
13887 -177873 -94881 -89000 -37542 -132458 -104697 88674 84871 -36585 -42674 4372 -54322 50548
13875 50548 150539 37102 -27789 24389 29357 -71537 -5051 67544 -64054 -118554 42683
13864 42683 128528 11851 -94722 -48985 -70192 -139078 -117267 -71103 13337 80673 96787
13853 96787 105997 94597 85436 40124 -27570 68751 112759 95987 61742 -17406 -49516 -129811
13841 -129811 -121594 -34943 -72180 1588 -58590 -152793 -108412 -140869 -149570 -55370 34051 77500
13829 77500 72095 -40160 -139061 -151872 -61633 -2587 39091 -293 -39313 36988 127799 184156
$$ [...]
##END NTUPLES=NMR SPECTRUM
##END=
