##TITLE=Analysis number 322041
Compound Code cc 50201
Book Reference 464/46/10
Project Code adrs
Chemist Name chrisr
##JCAMPDX= 6.0         $$ Bruker NMR JCAMP-DX V2.0
##DATA TYPE= NMR SPECTRUM
##DATA CLASS= NTUPLES
##ORIGIN= Bruker BioSpin GmbH
##OWNER= nmr
$$ XWIN-NMR		Version 3.5
$$ Mon Sep 11 11:41:49 2006 GMT Daylight Time (UT+1h)  MAYBRIDGE\nmr@NMR_250MHZ
##.OBSERVE FREQUENCY= 250.131544655141
##.OBSERVE NUCLEUS= ^1H
##.ACQUISITION MODE= SIMULTANEOUS (DQD)
##.ACQUISITION SCHEME= undefined
##.AVERAGES= 16
##.DIGITISER RES= 18
##SPECTROMETER/DATA SYSTEM= dpx250
##.PULSE SEQUENCE= zg30
##.SOLVENT NAME= DMSO
##.SHIFT REFERENCE= (INTERNAL, DMSO, 0, 16.522)
##AUDIT TRAIL= $$ (NUMBER, WHEN, WHO, WHERE, WHAT)
$$ ##TITLE= Audit trail, XWIN-NMR		Version 3.5
$$ ##JCAMPDX= 5.01
$$ ##ORIGIN= Bruker BioSpin GmbH
$$ ##OWNER= nmr
$$ C:\u/data/dgb/nmr/ADRS/420/pdata/1/auditp.txt
$$ ##AUDIT TRAIL=  $$ (NUMBER, WHEN, WHO, WHERE, WHAT)
(   1,<2006-09-11 11:41:11.41 +100>,<MAYBRIDGE\nmr>,<NMR_250MHZ>,
      <created by zg, POWCHK disabled, PULCHK disabled
       configuration hash MD5:
       E2 DF 36 D8 04 B2 41 60 5A D7 A3 38 5A 4B D0 FE
       data hash MD5: 64K
       39 9A 2B 1A 12 18 C1 68 68 AF 53 EF 50 BB FA 0A>)
(   2,<2006-09-11 11:41:30.19 +100>,<MAYBRIDGE\nmr>,<NMR_250MHZ>,
      <Start of raw data processing
       ef LB = 0.3 FT_mod = 6 PKNL = 1 SI = 32K 
       data hash MD5: 32K
       3B 41 5A 9E 4A 56 39 4F 85 52 9A 64 7E 59 B2 91>)
(   3,<2006-09-11 11:41:34.80 +100>,<MAYBRIDGE\nmr>,<NMR_250MHZ>,
      <apk 
       data hash MD5: 32K
       2C 41 4D F1 FC BF EE C4 E5 B7 73 5B 06 42 03 25>)
(   4,<2006-09-11 11:41:35.68 +100>,<MAYBRIDGE\nmr>,<NMR_250MHZ>,
      <abs ABSG = 5 
       data hash MD5: 32K
       BC F8 53 BD D4 D5 AD A6 A3 87 FF CE 99 E4 C1 B2>)
$$ ##END=
$$ 
$$ hash MD5
$$ 7B FE 84 F1 70 62 FA 38 CF B1 1C 52 FF 7A 5C DD
##$RELAX= 
##$RELAX= 
##$RELAX= 
##$RELAX= 
##$RELAX= 
##$RELAX= 
##$RELAX= 
$$ Bruker specific parameters
$$ --------------------------
##$DU= <C:\u>
##$EXPNO= 420
##$NAME= <ADRS>
##$PROCNO= 1
##$TYPE= <nmr>
##$USER= <dgb>
##$AMP= (0..31)
100 100 100 100 100 100 100 100 100 100 100 100 100 100 100 100 100 100 
100 100 100 100 100 100 100 100 100 100 100 100 100 100 
##$AQSEQ= 0
##$AQ_mod= 3
##$AUNM= <au_zg>
##$AUTOPOS= <18 >
##$BF1= 250.13
##$BF2= 250.13
##$BF3= 250.13
##$BF4= 250.13
##$BF5= 500.13
##$BF6= 500.13
##$BF7= 500.13
##$BF8= 500.13
##$BYTORDA= 1
##$CFDGTYP= 0
##$CFRGTYP= 5
##$CHEMSTR= <none>
##$CNST= (0..31)
1 1 145 1 1 1 1 1 1 1 1 1 1 1 1 1 1 1 1 1 1 1 1 1 1 1 1 1 1 1 1 1 
##$CPDPRG= <>
##$CPDPRG1= <>
##$CPDPRG2= <>
##$CPDPRG3= <>
##$CPDPRG4= <mlev>
##$CPDPRG5= <mlev>
##$CPDPRG6= <mlev>
##$CPDPRG7= <mlev>
##$CPDPRG8= <mlev>
##$CPDPRGB= <>
##$CPDPRGT= <>
##$D= (0..31)
0 1 0 0 0 0 0 0 0 0.06 0 0 0 0 0 0 0.0002 0 0 0 0 0 0 0 0 0 0 0 0 0 0 
0 
##$DATE= 1157971269
##$DBL= (0..7)
120 120 120 120 120 120 120 120 
##$DBP= (0..7)
150 150 150 150 150 150 150 150 
##$DBP07= 0
##$DBPNAM0= <>
##$DBPNAM1= <>
$$ [...]
##$SUBNAM7= <"">
##$SUBNAM8= <"">
##$SUBNAM9= <"">
##$SW= 20.6930455092707
##$SWIBOX= (0..15)
0 0 3 0 0 0 0 0 0 0 0 0 0 0 0 0 
##$SW_h= 5175.983436853
##$TD= 65536
##$TD0= 1
##$TE= 296.16
##$TE2= 300
##$TE3= 300
##$TEG= 300
##$TL= (0..7)
0 120 120 120 120 120 120 120 
##$TP= (0..7)
150 150 150 150 150 150 150 150 
##$TP07= 0
##$TPNAME0= <>
##$TPNAME1= <>
##$TPNAME2= <>
##$TPNAME3= <>
##$TPNAME4= <>
##$TPNAME5= <>
##$TPNAME6= <>
##$TPNAME7= <>
##$TPOAL= (0..7)
0.5 0.5 0.5 0.5 0.5 0.5 0.5 0.5 
##$TPOFFS= (0..7)
0 0 0 0 0 0 0 0 
##$TUNHIN= 0
##$TUNHOUT= 0
##$TUNXOUT= 0
##$USERA1= <user>
##$USERA2= <user>
##$USERA3= <user>
##$USERA4= <user>
##$USERA5= <user>
##$V9= 5
##$VALIST= <valist>
##$VCLIST= <CCCCCCCCCCCCCCC>
##$VD= 0
##$VDLIST= <DDDDDDDDDDDDDDD>
##$VPLIST= <PPPPPPPPPPPPPPP>
##$VTLIST= <TTTTTTTTTTTTTTT>
##$WBST= 1024
##$WBSW= 4
##$XGAIN= (0..3)
0 0 0 0 
##$XL= 0
##$YL= 0
##$YMAX_a= 335212
##$YMIN_a= -500205
##$ZGOPTNS= <>
##$ZL1= 120
##$ZL2= 120
##$ZL3= 120
##$ZL4= 120
##$ABSF1= 16.522
##$ABSF2= -4.171173
##$ABSG= 5
##$ABSL= 3
##$ALPHA= 0
##$AQORDER= 0
##$ASSFAC= 0
##$ASSFACI= 0
##$ASSFACX= 0
##$ASSWID= 0
##$AUNMP= <proc_1d>
##$AZFE= 0.1
##$AZFW= 0.1
##$BCFW= 0
##$BC_mod= 0
##$BYTORDP= 0
##$COROFFS= 0
##$CY= 12.5
##$DATMOD= 1
##$DC= 0
##$DFILT= <>
##$DTYPP= 0
##$F1P= 14.0000005364418
##$F2P= -0.99999901652339
##$FCOR= 0.5
##$FTSIZE= 32768
##$FT_mod= 6
##$GAMMA= 0
##$GB= 0
##$INTBC= 1
##$INTSCL= 1
##$ISEN= 128
##$LB= 0.3
##$LEV0= 0
##$LPBIN= 0
##$MAXI= 10000
##$MC2= 0
##$MEAN= 0
##$ME_mod= 0
##$MI= 0
##$NCOEF= 0
##$NC_proc= -6
##$NLEV= 6
##$NOISF1= 0
##$NOISF2= 0
##$NSP= 0
##$NTH_PI= 0
##$NZP= 0
##$OFFSET= 16.522
##$PC= 1
##$PHC0= 132.2242
##$PHC1= 10.90394
##$PH_mod= 1
##$PKNL= yes
##$PPARMOD= 0
##$PSCAL= 4
##$PSIGN= 0
##$REVERSE= no
##$SF= 250.13
##$SI= 32768
##$SIGF1= 0
##$SIGF2= 0
##$SINO= 400
##$SIOLD= 32768
##$SREGLST= <1H.DMSO>
##$SSB= 0
##$STSI= 32768
##$STSR= 0
##$SW_p= 5175.98343685301
##$SYMM= 0
##$S_DEV= 0
##$TDeff= 65536
##$TDoff= 0
##$TI= <Analysis number 999999
Compound Code 99
Book Reference 9
Project Code 9>
##$TILT= no
##$TM1= 0
##$TM2= 0
##$TOPLEV= 0
##$USERP1= <user>
##$USERP2= <user>
##$USERP3= <user>
##$USERP4= <user>
##$USERP5= <user>
##$WDW= 1
##$XDIM= 32768
##$YMAX_p= 355537010
##$YMIN_p= -1002264
$$ End of Bruker specific parameters
$$ ---------------------------------
##NTUPLES= NMR SPECTRUM
##VAR_NAME=  FREQUENCY,     SPECTRUM/REAL,   SPECTRUM/IMAG
##SYMBOL=    X,             R,               I
##VAR_TYPE=  INDEPENDENT,   DEPENDENT,       DEPENDENT
##VAR_FORM=  AFFN,          ASDF,            ASDF
##VAR_DIM=   32768,         32768,           32768
##UNITS=     HZ,            ARBITRARY UNITS, ARBITRARY UNITS
##FACTOR=    0.157963299565203, 1,           1
##FIRST=     4132.6476996994, 0,             0
##LAST=      -1043.33573715361, 0,           0
##MIN=       -1043.33573715361, -1002264,    0
##MAX=       4132.6476996994, 355537010,     0
$$ Real data points
##PAGE= N=1
##DATA TABLE= (X++(R..R)), XYDATA
$$ [...]
$$ plain form
23476 -214100 -325076 -216221 58691 158955 -112488 -143554 -149421 -431459 -720255 -649285
23466 -649285 -565761 -293981 -282360 -401562 -391996 -222806 -189411 -331206 -412515 -124663 -37447
23455 -37447 -30397 78135 196070 315213 125877 -26526 27418 -44889 -69186 59754 75864
23444 75864 45376 27178 -48576 -259445 -418549 -279895 -439410 -512670 -626635 -404895
23434 -404895 -163651 -250001 -370073 -225517 -36420 -229390 -421023 -539468 -737936 -486775
23424 -486775 -416274 -419600 -220921 -97038 31409 -112538 -313230 -179795 -266415 -476759
23414 -476759 -322101 98152 509884 523721 406119 373876 67000 -23643 -150180 -350600
23404 -350600 -208940 -154881 -378063 -660472 -494897 -347733 -362485 -546694 -457594 -258924
$$ packed form
23476b14100j10976J08855K74912J00264k71443l1066n867k82038k88796P0970
23466f49285Q3524K71780J1621j19202R566J69190L3395j41795q1309K87852Q7216
23455c7447P050J08532J17935J19143j89336j52403N3944p2307k4297J28940J6110
23444G5864l0488j8198p5754k10869j59104J38654j59515p3260j13965K21740
23434d04895K41244q6350j20072J44556J89097j92970j91633j18445j98468K51161
23424d86775P0501l326J98679J23883J28447j43947k00692J33435q6620k10344
23414d76759J54658M20253M11732J3837j17602l2243l06876r0643j26537k00420
23404c50600J41660N4059k23182k82409J65575J47164j4752j84209Q9100J98670
$$ plain form
23394 -258924 -68805 199623 182814 39296 152291 -30423 -193049 -242216 -286815 -141670
23384 -141670 -238457 -64659 188075 177767 347387 167095 -111529 -364080 -452907 -256584
23374 -256584 63345 299011 264387 74943 -30443 -159423 -128875 -45038 -198483 -163846
23364 -163846 104696 190967 165989 134411 132020 147825 -24293 -108621 -54033 17752 33920
23353 33920 -66877 -135668 58732 34341 -183645 -220541 -211359 -130223 -179361 61569 79663
23342 79663 -28848 233997 330364 64408 -143866 -233926 -184574 -196449 -174181 -27039 -123778
23331 -123778 -11478 255653 196801 222752 358818 409214 310422 145695 -121693 -71991
23321 -71991 51278 -146784 -223218 -16230 134313 127303 312451 163484 192244 108928 109026
$$ packed form
23394b58924J90119K68428j6809j43518J12995j82714j62626m9167m4599J45145
23384a41670r6787J73798K52734j0308J69620j80292k78624k52551q8827J96323
23374b56584L19929K35666l4624j89444j05386j28980L0548Q3837j53445L4637
23364a63846K68542Q6271k4978l1578k391J5805j72118q4328N4588P1785J6168
23353C3920j00797o8791J94400k4391k17986l6896R182Q1136m9138K40930J8094
23342G9663j08511K62845R6367k65956k08274r0060M9352j1875K2268J47142r6739
23331a23778J12300K67131n8852K5951J36066N0396r8792j64727k67388M9702
23321g1991J23269j98062p6434K06988J50543p010J85148j48967K8760q3316R8
$$ plain form
23310 109026 300693 118093 291152 552543 394862 75255 -7040 21842 20991 -106952
23300 -106952 18717 276683 500205 303808 47480 3644 439361 693137 676783 483406
23290 483406 193802 -4839 50851 128633 -41331 -107052 -196814 -349121 -374167 -350937 -388424
23279 -388424 -350832 -184959 -199786 -218746 -63599 89220 -54757 -40811 37587 -96030
23269 -96030 64129 196577 14478 -19143 62012 -108857 -165818 18818 125419 112238
23259 112238 -7017 32005 355309 435505 222390 -95518 -298663 -189050 -379746 -352506
23249 -352506 -182044 -134329 -250151 -343975 -466387 -582302 -422544 -337169 -241425 -236200 -259589
23238 -259589 -249507 -432116 -354049 -298569 -391710 -504196 -445651 -109072 88773 94906 -124637
$$ packed form
23310A09026J91667j82600J73059K61391j57681l19607q2295K8882q51j27943
23300a06952J25669K57966K23522j96397k56328m3836M35717K53776j6354j93377
23290D83406k89604j98641N5690P7782j69964o5721q9762j52307k5046K3230l7487
23279c88424L7592J65873j4827j8960J55147J52819j43977J3946P8398j33617
23269i6030J60159J32448j82099l3621Q1155j70869n6961J84636J06601j3181
23259A12238j19255L9022L23304Q0196k13115l17908k03145J09613j90696K7240
23249c52506J70462M7715j15822r3824j22412j15915J59758Q5375R5744N225k3389
23238b59589J0082j82609P8067N5480r3141j12486N8545L36579J97845O133k19543
$$ plain form
23227 -124637 -131837 -333653 -387061 -276055 30885 5647 93579 -53085 -105974 -89724 -63531
23216 -63531 147770 236210 43229 -238820 -223691 -143454 -244225 -168729 154315 153345 159645
23205 159645 172548 10067 -41006 -105971 -212744 -157748 -109160 -359459 -287167 -38182 163660
23194 163660 338661 66075 46937 128497 154398 61094 -140570 -255509 -471014 -579910
23184 -579910 -539581 -619698 -408550 -359258 -412903 -306095 -94767 -188055 -238488 -56622 -10067
23173 -10067 -112053 -58094 -50463 -88096 -155076 -164340 -41222 -42440 -207082 -135750 -158944 -226009
23161 -226009 -282544 -109195 -19581 -26899 -13347 -90818 -72494 54173 -63539 14309 -71374
23150 -71374 -167261 -326541 -268307 -242068 -320805 -484849 -600917 -347024 -211385 -118781 -88388
$$ packed form
23227a24637p200k01816n3408J11006L06940k5238Q7932j46664n2889J6250K6193
23216f3531K11301Q8440j92981k82049J5129Q0237j00771P5496L23044r70O300
23205A59645J2903j62481n1073o4965j06773N4996M8588k50299P2292K48985K01842
23194A63660J75001k72586j9138Q1560K5901r3304k01664j14939k15505j08896
23184e79910M0329q0117K11148M9292n3645J06808K11328r3288n0433J81866M6555
23173a0067j01986N3959P631l7633o6980r264J23118j218j64642P1332k3194o7065
23161b26009n6535J73349Q9614p318J3552p7471J8324J26667j17712P7848q5683
23150g1374r5887j59280N8234K6239p8737j64044j16068K53893J35639R2604L0393
$$ plain form
23139 -88388 -37257 -10216 -137232 -392471 -468272 -306992 -202779 -143572 -216147 -381050 -476663
23128 -476663 -595533 -340193 -33620 -126250 -198353 -255434 -339842 -56792 162706 36578
23118 36578 -276146 -456891 -144164 -38173 -289140 -366185 -167816 -130442 -82551 -136480
23108 -136480 -122389 45961 308144 180811 -100123 -371033 -538378 -623774 -595995 -433167
23098 -433167 -114721 79662 -320882 -344566 -230395 -248121 -155600 30258 155732 14234
23088 14234 -69282 3497 52809 155888 155777 32524 209637 568951 770883 589746 505929
23077 505929 376949 341411 71359 125718 136735 254000 254191 276508 350057 259484 294338
23066 294338 252946 183718 151883 39571 79258 -27453 -156898 -121503 -209271 -83254 -218763
$$ packed form
23139h8388N1131K7041j27016k55239p5801J61280J04213N9207p2575j64903r5613
23128d76663j18870K55340L06573r2630p2103n7081q4408K83050K19498j26128
23118C6578l12724j80745L12727J05991k50967p7045J98369L7374M7891n3929
23108a36480J4091J68350K62183j27333k80934k70910j67345q5396K7779J62828
23098d33167L18446J94383m00544k3684J14171j7726R2521J85858J25474j41498
23088A4234q3516P2779M9312J03079j11j23253J77113L59314K01932j81137q3817
23077E05929j28980l5538k70052N4359J1017J17265J91K2317P3549r0573L4854
23066B94338m1392o9228l1835j12312L9687j06711j29445L5395q7768J26017j35509
$$ plain form
23055 -218763 -295203 -192593 -255169 -365919 -362834 -267926 -279072 -150626 -15516 54103 -109067
23044 -109067 -177416 -47909 34280 -88405 -82457 -94861 -117633 -148390 -73503 -53718 -133155
23033 -133155 -212757 -331030 -320618 -197184 13023 117207 -184964 -368403 -333634 -264994
23023 -264994 -223440 -324951 -202978 -38756 -125042 -249581 -358108 -425497 -412889 -389932
23013 -389932 -193848 -224960 -215834 -207106 -258244 -269367 -275000 -97684 88122 -46680 -92847
23002 -92847 -166166 -104408 -181172 -61985 -24613 11025 -17891 126528 170508 44798 233469
22991 233469 239305 -42557 -222134 -182319 -170421 -82635 -73757 -35933 9456 -139943 -48882
22980 -48882 15997 98920 -164176 -525373 -507979 -503506 -380951 -228027 68020 268261 299205
$$ packed form
23055b18763p6440J02610o2576j10750L085R4908j1146J28446J35110O9619j63170
23044a09067o8349J29507Q2189j22685N948j2404k2772l0757P4887J9785p9437
23033a33155p9602j18273J0412J23434K10207J04184l02171j83439L4769O8640
23023b64994M1554j01511J21973J64222q6286j24539j08527o7389J2608K2957
23013c89932J96084l1112R126Q728n1138j1123n633J77316J85806j34802m6167
23002i2847p3319O1758p6764J19187L7372L5638k8916J44419M3980j25710J88671
22991B33469N836k81862j79577L9815J1898Q7786Q878L7824M5389j49399R1061
22980d8882O4879Q2923k63096l61197J7394M473J22555J52924K96047K00241L0944
$$ plain form
22969 299205 114718 -54837 -138138 -192860 -240317 -119756 -63112 4603 -8792 62627 316847
22958 316847 352520 -19192 -102272 -66864 9255 86940 47374 102314 167235 331453 316395
22947 316395 145885 275748 251924 -13443 -205867 -57088 -68129 -167567 36951 125127
22937 125127 11173 -25869 -12536 -121908 -209238 -432724 -533795 -616213 -712217 -554038
22927 -554038 -199071 -106033 -320580 -310675 -139555 72955 214295 161161 -44423 -203415
22917 -203415 -46786 32520 -226782 -298816 -170829 -143659 -299575 -603168 -542146 -282638
22907 -282638 -183509 -441949 -114273 -89319 -227651 -219548 129104 330791 160922 67462
22897 67462 -104206 -162170 90982 378398 377095 118103 17918 67450 153965 69160 -105
$$ packed form
22969B99205j84487j69555q3301n4722m7457J20561N6644O7715j3395P1419K54220
22958C16847L5673l71712q3080L5408P6119P7685l9566N4940O4921J64218j5058
22947C16395j70510J29863k3824k65367j92424J48779j1041r9438K04518Q8176
22937A25127j13954l7042J3333j09372q7330k23486j01071q2418r6004J58179
22927e54038L54967R3038k14547R905J71120K12510J41340n3134k05584j58992
22917b03415J56629P9306k59302p2034J27987K7170j55916l03593O1022K59508
22907b82638R9129k58440L27676K4954j38332Q103L48652K01687j69869r3460
22897F7462j71668n7964K53152K87416j303k58992j00185M9532Q6515q4805o9265
$$ plain form
22886 -105 30682 148522 169226 96892 102914 42245 -210494 -146604 -40834 6354 -200952
22875 -200952 -330181 -482819 -751870 -665593 -503054 -461593 -217947 64922 98001 153810
22865 153810 46200 -138388 -29644 17412 -139904 -104731 -120090 -27681 172100 -17499
22855 -17499 -289964 -490968 -412699 -254458 48954 168831 139008 160546 197512 9185
22845 9185 -300529 -124299 248502 266762 -103840 -292322 -156265 -312165 -316341 -13030
22835 -13030 263378 350901 317053 149274 -97298 -78424 -19985 209626 241139 -66788 -246014
22824 -246014 -90739 100147 -50107 -124149 -253001 -364898 -415839 -440296 -334097 -127536
22814 -127536 104420 237157 41744 -319700 -449581 -229134 -318363 -88953 -24882 83315
$$ packed form
22886a05L0787J17840K0704p2334O022o0669k52739O3890J05770M7188k07306
22875b00952j29229j52638k69051Q6277J62539M1461K43646K82869L3079N5809
22865A53810j07610j84588J08744M7056j57316L5173j5359R2409J99781j89599
22855a7499k72465k01004P8269J58241L03412J19877k9823K1538L6966j88327
22845I185l09714J76230L72801J8260l70602j88482J36057j55900m176L03311
22835a3030K76408Q7523l3848j67779k46572J8874N8439K29611L1513l07927j79226
22824b46014J55275J90886j50254p4042j28852j11897n0941k4457J06199K06561
22814a27536K31956J32737j95413l61444j29881K20447q9229K29410O4071J08197
$$ plain form
22804 83315 -86681 -318994 -363487 -327833 -244205 -267161 -141047 -28080 -240881 -411465
22794 -411465 -498803 -340414 -339676 -522821 -526561 -453586 -720947 -694426 -500696 -299646 -125362
22783 -125362 -131080 -150483 -228142 98155 88143 -23386 39396 28621 28406 98143 35241 -113540
22771 -113540 -94129 34695 55201 -83462 -188784 -188266 -184793 -261233 -49534 -39728 -248658
22760 -248658 -104678 72655 -147894 -67075 110579 284981 248304 69928 160093 51581
22750 51581 105466 10185 -13411 198455 198058 210114 300688 211767 69380 -20287 -84423 5173
22738 5173 286091 380184 193225 13400 -245854 19903 83190 23042 51531 -74208 -245318
22727 -245318 -422421 -400701 127822 207159 153352 -84 280107 331514 39158 -104700
$$ packed form
22804H3315j69996k32313m4493L5654Q3628k2956J26114J12967k12801j70584
22794d11465q7338J58389P38j83145l740P2975k67361K6521J93730K01050J74284
22783a25362n718j9403p7659L26297j0012j11529O2782j0775k15O9737o2902j48781
22771a13540J9411J28824K0506j38663j05322N18L473p6440K11699R806k08930
22760b48658J43980J77333k20549Q0819J77654J74402l6677j78376R0165j08512
22750E1581N3885r5281k3596K11866l97J2056R0574q8921j42387q9667o4136Q9596
22738E173K80918R4093j86959j79825k59254K65757O3287o0148K8489j25739j71110
22727b45318j77103K1720N28523P9337n3807j53436K80191N1407k92356j43858
$$ plain form
22717 -104700 -199042 -172853 -416168 -322922 15337 192627 65251 101778 159761 153680 218123
22706 218123 116673 -67524 -79304 87773 -59603 -191932 -386056 -461742 -602136 -532804
22696 -532804 -351048 -494856 -342526 -71735 -21615 -155048 -43587 -184665 -237634 -318296
22686 -318296 -446153 -224262 -75485 -204717 -338519 -362772 -336906 -266179 -273048 -78957
22676 -78957 17609 75791 266008 231811 -90701 -70439 149049 66509 -76755 3091 170225
22665 170225 167659 104224 212297 304207 292519 -3006 7917 -14266 -174302 -136825 -26376
22654 -26376 -189126 -137483 -294242 -350442 -364177 -470201 -274928 7048 90878 15779 -19187
22643 -19187 10254 311382 328248 12393 -62937 7526 -68659 -73128 -109434 -209866 -336023
$$ packed form
22717a04700r4342K6189k43315R3246L38259J77290j27376L6527N7983o081O4443
22706B18123j01450j84197j1780J67077j47376j32329j94124p5686j40394O9332
22696e32804J81756j43808J52330K70791N0120j33433J11461j41078n2969q0662
22686c18296j27857K21891J48777j29232j33802k4253K5866P0727o869J94091
22676g8957R6566N8182J90217l4197l22512K0262K19488q2540j43264P9846J67134
22665A70225k566o3435J08073R1910j1688k95525J0923k2183j60036L7477J10449
22654b6376j62750N1643j56759n6200j3735j06024J95273K81976Q3830p5099l4966
22643a9187K9441L01128J6866l15855p5330P0463p6185m469l6306j00432j26157
$$ plain form
22632 -336023 -409102 -90258 -107988 -62428 -202789 -349274 -364780 -508458 -556013 -678903
22622 -678903 -697286 -725002 -449503 -252517 -210030 40868 5342 -107273 -481039 -542924
22612 -542924 -527597 -343714 -149629 -30872 50713 59183 7290 63727 141861 224615 161019
22601 161019 291788 202981 -68905 -116802 -47730 -196895 -213144 -290469 -132206 -299284
22591 -299284 -324309 -93873 220691 -57068 -258314 -116007 -165557 -71803 -95620 -16784
22581 -16784 -64643 -10035 -30528 -151283 -127376 21180 86519 227742 91073 49921 57292
22570 57292 90345 86605 10747 210491 253082 177179 227689 261446 420832 498544 299663
22559 299663 86715 344915 373876 374200 81095 -84556 -243227 -218404 -325283 -465908
$$ packed form
22632c36023p3079L18844j7730M5560j40361j46485j5506j43678m7555j22890
22622f78903j8383k7716K75499J96986M2487K50898l5526j12615l73766o1885
22612e42924J5327J83883J94085J18757Q1585Q470n1893N6437P8134Q2754o3596
22601A61019J30769q8807k71886m7897O9072j49165j6249p7325J58263j67078
22591b99284k5025K30436L14564k77759k01246J42307m9550R3754k3817P8836
22581a6784m7859N4608k0493j20755K3907J48556O5339J41223j36669m1152P371
22570E7292L3053l740p5858J99744M2591p5903N0510L3757J59386P7712j98881
22559B99663k12948K58200K8961L24k93105j65651j58671K4823j06879j40625
$$ plain form
22549 -465908 -467806 -266489 -151063 -238039 -125819 -60478 -32077 -70004 -160962 -114643 114410
22538 114410 103168 131815 92059 -168186 -476358 -421700 -193500 -219247 -359234 -130209
22528 -130209 108156 342327 292809 179687 86513 -187043 -175556 -99346 -72560 -41922 -242166
22517 -242166 -355390 -605583 -725601 -764528 -454987 -396200 -601713 -522215 -303526 -266851
22507 -266851 -185186 -62772 180601 277041 236627 252916 119686 -76655 27816 -2816
22497 -2816 -188837 102167 61848 49439 138196 77007 -60852 -179244 -180308 -67501 60014
22486 60014 95489 -17253 124039 172463 230778 187297 105390 -18295 -234693 -112999 -157432
22475 -157432 -149404 -130374 -234098 -292059 -329384 -402925 -205746 -25447 -181282 -341349 -337034
$$ packed form
22549d65908j898K01317J15426q6976J12220O5341K8401l7927r0958M6319K29053
22538A14410j1242K8647l9756k60245l08172N4658K28200k5747j39987K29025
22528a30209K38365K34171m9518j13122r3174k73556J1487P6210K6786L0638k00244
22517b42166j13224k50193j20018l8927L09541N8787k05513P9498K18689L6675
22507b66851Q1665J22414K43373R6440m0414J6289j33230j96341J04471l0632
22497b816j86021K91004m0319j2409Q8757o1189j37859j18392j064J12807J27515
22486F0014L5475j12742J41292M8424N8315m3481q1907j23685k16398J21694m4433
22475a57432Q028J9030j03724n7961l7325p3541J97179J80299j55835j60067M315
$$ plain form
22464 -337034 -192964 -350794 -342591 -143689 -122776 39326 -10330 -31106 86143 162643 161591
22453 161591 112448 153724 138675 131320 42929 -9060 -188733 -309884 -328941 -300243 -94663
22442 -94663 -141285 -259511 -135535 -69018 -111108 -149137 -136700 -49978 -112080 -49208 20601
22431 20601 10078 -63578 -79483 -175651 -189272 124255 68346 -238208 -317860 -162242 -118685
22420 -118685 -34873 169028 271265 -150511 -397438 -124376 -83245 -85884 -462291 -446380
22410 -446380 -282905 -302857 -183767 -185537 -257615 -406498 -465285 -407081 -272535 -62103 238536
22399 238536 113942 -1991 43288 135065 -13742 -28708 -52364 -40588 84526 180195 4638
22388 4638 -108269 -161101 -231325 -214832 -244637 -279694 -368247 -194189 -8960 -62454 -255057
$$ packed form
22464c37034J44070j57830Q203J98902K0913J62102m9656k0776J17249P6500j052
22453A61591m9143M1276j5049p355q8391n1989j79673j21151j9057K8698K05580
22442i4663m6622j18226J23976O6517m2090l8029J2437Q6722o2102O2872O9809
22431B0601j0523p3656j5905r6168j3621L13527n5909l06554p9652J55618M3557
22420a18685Q3812K03901J02237m21776k46927K73062M1131k639l76407J5911
22410d46380J63475j9952J19090j770p2078j48883n8787N8204J34546K10432L00639
22399B38536j24594j15933M5279R1777j48807j4966k3656J1776J25114R5669j75557
22388D638j12907n2832p0224J6493k9805l5057q8553J74058J85229n3494j92603
$$ plain form
22377 -255057 64855 382521 316375 37922 10881 132113 135180 73696 -16266 -258336 -235075
22366 -235075 -220470 -248811 -67712 64053 -146220 -213675 -76383 -100351 -105181 -126619 -133787
22355 -133787 -50924 428 -53654 -322569 -443200 -250000 -355493 -255589 -207208 7399
22345 7399 85161 158707 246065 150518 -12940 203494 41651 -32378 160285 245212 16435
22334 16435 -110501 163869 75768 -152930 -148223 -149214 -47469 169183 152849 15572 -96656
22323 -96656 -162544 -113034 -188925 17071 -18466 -61173 -119822 -171526 -224982 -312709 -198504
22312 -198504 -288875 -65035 -47648 -4073 144544 330124 423366 285885 316008 367395 358081
22301 358081 15760 -177488 -173688 51118 167393 -52329 4653 250684 366843 217392
$$ packed form
22377b55057L19912L17666o6146k78453k7041J21232L067o1484q9962k42070K3261
22366b35075J4605k8341J81099J31765k10273o7455J37292k3968m830k1438p168
22355a33787Q2863N1352n4082k68915j20631J93200j05493R9904M8381K14607
22345G399P7762P3546Q7358r5547j63458K16434j61843p4029J92663Q4927k28777
22334A6435j26936K74370q8101k28698M707r91J01745K16652j6334j37277j12228
22323i6656o5888M9510p5891K05996l5537m2707n8649n1704n3456q7727J14205
22312a98504r0371K23840J7387M3575J48617J85580R3242j37481L0123N1387r314
22301C58081l42321j93248L800K24806J16275k19722N6982K46031J16159j49451
$$ plain form
22291 217392 372814 252630 -102101 -112234 -134807 -213691 -186707 103329 295039 441613
22281 441613 353602 143144 -127505 -35051 -21453 23720 -49721 -21773 -98080 -10305 111765
22270 111765 207161 275956 276082 355254 183691 97489 274140 353747 223753 122689 41779
22259 41779 85045 -77602 -333922 -229215 -26001 -60241 -374320 -292537 -62356 268264
22249 268264 358061 332150 220692 98462 -12250 -259089 -267294 -161194 -202079 -167695 -336663
22238 -336663 -362293 -388077 -337464 -264499 -169046 -118159 13979 -65591 -367666 -598971 -423396
22227 -423396 -64938 61307 117354 405810 329521 356360 146997 86904 -127452 -174437
22217 -174437 -37307 -175946 -235858 -191097 -255940 -287411 -277973 -314346 -388503 -290503 -312173
$$ packed form
22291B17392J55422j20184l54731j0133k2573p8884K6984K90036J91710J46574
22281D41613q8011k10458k70649R2454J3598M5173p3441K7948p6307Q7775J22070
22270A11765R5396O8795J26P9172j71563q6202J76651P9607j29994j01064q0910
22259D1779M3266j62647k56320J04707K03214l4240l14079Q1783K30181L30620
22249B68264Q9797k5911j11458j22230j10712k46839q205J06100m0885L4384j68968
22238c36663k5630k5784N0613P2965R5453N0887J32138p9570l02075k31305J75575
22227d23396L58458J26245N6047K88456p6289K6839k09363o0093k14356m6985
22217a74437J37130j38639n9912M4761o4843l1471R438l6373p4157R8000k1670
$$ plain form
22206 -312173 -306873 -392568 -487095 -377847 -338743 -203925 -246261 -462232 -503153 -172959 -43367
22195 -43367 86225 46858 -277308 -295937 31314 -31507 -49183 -104752 -65317 164464 177566
22184 177566 70145 239617 375428 257349 221806 71727 -294292 -46189 -2014 -49512
22174 -49512 73928 189897 62974 -146826 86371 176535 144516 112622 217425 144194
22164 144194 146415 214758 57722 120304 8 -155702 -101527 -143945 -226675 -347864 -393657
22153 -393657 -239428 -129976 -218445 -185965 -220258 -222913 -98114 -49566 -113765 -238848 -392149
22142 -392149 -319192 -326789 -180359 -307083 -158835 -62007 -203827 -269184 -314366 -116400 -194458
22131 -194458 -327097 -238795 -238982 -139754 -218314 -196666 53940 321626 330306 -20935 -142190
$$ packed form
22206c12173N300q5695r4527J09248L9104J34818m2336k15971m0921L30194J29592
22195d3367J29592l9367l24166j8629L27251o2821j7676n5569L9435K29781J3102
22184A77566j07421J69472J35811j18079l5543j50079l66019K48103M4175m7498
22174d9512J23440J15969j26923k09800K33197R0164l2019l1894J04803p3231
22164A44194K221O8343j57036O2582j20296j55710N4175m2418q2730j21189m5793
22153c93657J54229J09452q8469L2480l4293k655J24799M8548o4199j25083j53301
22142c92149P2957p597J46430j26724J48248R6828j41820o5357m5182J97966p8058
22131a94458j32639Q8302j87R9228p8560K1648K50606K67686Q680l51241j21255
$$ plain form
22120 -142190 -4179 68183 45599 -78098 -47478 -151229 -56961 -228937 -386925 -276551
22110 -276551 -318229 -332845 -305866 -321523 -12282 143145 106811 -10676 239641 510397
22100 510397 424928 229804 324081 133248 24882 -149827 -366250 -339672 -551292 -552574
22090 -552574 -384058 -520825 -349822 -115987 64161 -14193 -49916 116443 27762 -119395
22080 -119395 17711 -147353 -111444 -177149 -215895 -285629 -177786 15997 38156 168533
22070 168533 137460 61045 82609 218249 39419 -147760 -192984 -465205 -411858 81407
22060 81407 120978 24062 113078 225895 -42547 -43280 -66414 -1017 29166 -24008 -64550 156663
22048 156663 26502 -18219 -61884 -18215 159255 371895 213975 174481 291288 327642
$$ packed form
22120a42190J38011P2362k2584j23697L0620j03751R4268j71976j57988J10374
22110b76551m1678j4616K6979j5657L09241J55427l6334j17487K50317K70756
22100E10397q5469j95124R4277j90833j08366j74709k16423K6578k11620j282
22090e52574J68516j36767J71003K33835J80148p8354l5723J66359q8681j47157
22080a19395J37106j65064L5909o5705l8746o9734J07843J93783K2159J30377
22070A68533l1073p6415K1564J35640j78830j87179m5224k72221N3347M93265
22060H1407L9571r6916Q9016J12817k68442p33k3134O5397L0183n3174m0542K21213
22048A56663j30161m4721m3665M3669J77470K12640j57920l9494J16807L6354
$$ plain form
22038 327642 199719 216639 -26254 -236796 -218767 -311918 -305229 -228083 -194684 -225172 -172796
22027 -172796 -177237 -334757 -243512 -200416 -248964 -191895 -63972 10501 70169 76613 -9965
22016 -9965 -6394 76670 -146104 -144808 -97411 -169453 -175198 -225576 -303354 -363028 -345087 -298564
22004 -298564 -6627 393330 375832 236828 34626 -242340 -223440 16621 148311 170176
21994 170176 132291 276364 215165 135457 -37922 -185644 -207179 -348022 -227138 -35810
21984 -35810 -195031 -102114 -167672 -167145 -173380 -216069 -129889 144121 230567 360886 361138 225109
21972 225109 239353 236375 314936 239971 132561 -31405 -37793 176262 211510 -107873 -283159
21961 -283159 9706 -53256 -127968 -45351 -94017 -195771 -75195 104082 168558 162093 70529
$$ packed form
22038C27642j27923J6920k42893k10542J8029r3151O689P7146L3399l0488N2376
22027a72796m441j57520R1245M3096m8548N7069J27923P4473N9668O444q6578
22016i965L571Q3064k22774J296M7397p2042n745n0378p7778n9674J7941M6523
22004b98564K91937L99957j7498j39004k02202k76966J8900K40061J31690K1865
21994A70176l7885J44073o1199p9708j73379j47722k1535j40843J20884J91328
21984c5810j59221R2917o5558N27o235m2689Q6180K74010Q6446J30319K52j36029
21972B25109J4244k978P8561p4965j07410j63966o388K14055L5248l19383j75286
21961b83159K92865o2962p4712Q2617m8666j01754J20576J79277O4476o465r1564
$$ plain form
21950 70529 141529 18175 -3212 12251 -15432 -152715 -313581 -230634 -274184 -93732 15042
21939 15042 -220081 -473388 -423335 -317215 -72687 84761 65759 85968 -125191 -139314
21929 -139314 107631 116501 192142 121514 82475 61751 208733 406621 375846 459023 228071
21918 228071 154476 106288 -70201 -120716 -187520 -193418 -215455 -423104 -324354 -49106 7733
21907 7733 -177341 -208987 -290239 -157646 -196115 -192499 -11949 122017 274699 382109 408786
21896 408786 247502 294611 413382 417408 219459 277235 336151 145324 4109 -252540
21886 -252540 -260759 -244386 -200929 -266929 -280274 -299697 -154125 -92398 -98463 -155282 -223438 -159144
21874 -159144 -101520 -84712 -11251 67630 -17673 136858 388870 416345 257958 122715 111727
$$ packed form
21950G0529P1000j23354k1387J5463k7683j37283j60866Q2947m3550J80452J08774
21939A5042k35123k53307N0053J06120K44528J57448j9002K0209k11159j4123
21929a39314K46945Q870P5641p0628l9039k0724J46982J97888l0775Q3177k30952
21918B28071p3595m8188j76489n0515o6804n898k2037k07649R8750K75248N6839
21907G733j85074l1646q1252J32593l8469L616J80550J33966J52682J07410K6677
21896D08786j61284M7109J18771M026j97949N7776N8916j90827j41215k56649
21886b52540q219J6373M3457o6000j3345j9423J45572O1727o065n6819o8156O4294
21874a59144N7624J6808P3461P8881q5303J54531K52012K7475j58387j35243j0988
$$ plain form
21863 111727 -29893 -179089 -181735 -291892 -294962 -83078 -271524 -161854 67259 96144
21853 96144 189638 99368 -175029 -201862 -155992 -270868 -446513 -493444 -79297 68096 -151761
21842 -151761 -119465 57584 25230 -15652 -275976 -362063 -86248 -42440 -307612 -500236
21832 -500236 -678926 -540217 -370430 -240051 -258224 -195410 -266633 -486891 -441916 -250530
21822 -250530 -59036 -106294 -226067 -169633 -188005 -231175 -162027 -11279 51772 188741 -4320
21811 -4320 -35307 -290637 -182902 9007 -1173 -108649 92246 77658 -171425 -176123 -198719
21800 -198719 -338259 -260460 -213993 -275762 -232950 48531 191042 146943 193920 245172 -4940
21789 -4940 -226613 -337799 -530046 -517063 -512118 -205716 137745 242117 151059 229553 98822
$$ packed form
21863A11727j41620j49196k646j10157l070K11884j88446J09670K29113K8885
21853I6144R3494r0270k74397k6833M5870j14876j75645m6931M14147J47393k19857
21842a51761L2296J77049l2354m0882k60324q6087K75815M3808k65172j92624
21832e00236j78690J38709J69787J30379j8173O2814p1223k20258M4975J91386
21822b50530J91494m7258j19773N6434j8372m3170O9148J50748O3051J36969j93061
21811d320l0987k55330J07735J91909j0180j07476K00895j4588k49083m698k2596
21800a98719j39540P7799M6467o1769M2812K81481J42511m4099M6977N1252k50112
21789d940k21673j11186j92247J2983M945L06402L43461J04372r1058P8494j30731
$$ plain form
21778 98822 -24398 -72469 184068 265283 157530 96819 30321 -25519 -342265 -573421 -403259
21767 -403259 -47102 -77076 -102664 -111444 -192736 22925 5003 15807 128960 -83873 -318290
21756 -318290 -228441 -268390 -298784 -238017 39334 235068 227370 177488 86299 96326 249704
21745 249704 57616 33610 -46743 -257416 -186581 -40130 86994 83251 215802 -51263
21735 -51263 -71033 -78432 -102084 -98027 -144855 -299806 -238601 -221636 -83336 94340 -39602
21724 -39602 -276171 -270068 -140821 -12120 -6558 57569 -28984 -110957 94551 -122832 -371581
21713 -371581 -299573 -49184 -53549 -70431 -4006 -203081 -138550 -113502 -304413 -427740 -422291
21702 -422291 -448348 -313768 -245165 -260593 -277432 -25015 -27629 -127680 -190762 -206246 -110967
$$ packed form
21778I8822j23220m8071K56537Q1215j07753o0711o6498n5840l16746k31156J70162
21767d03259L56157k9974k5588q780q1292K15661j7922J0804J13153k12833k34417
21756c18290Q9849l9949l0394O0767K77351J95734p698m9882r1189J0027J53378
21745B49704j92088k4006q0353k10673P0835J46451J27124l743J32551k67065
21735e1263j9770p399k3652M057m6828j54951O1205J6965J38300J77676j33942
21724c9602k36569O103J29247J28701N562O4127q6553q1973K05508k17383k48749
21713c71581P2008K50389m365j6882O6425j99075O4531K5048j90911j23327N449
21702d22291k6057J34580O8603j5428j6839K52417k614j00051o3082j5484R5279
$$ plain form
21691 -110967 149283 56 -55229 -125327 -74904 -57564 18647 -60348 -220170 -278850 -73531
21680 -73531 110640 202731 158233 271618 98457 132286 140800 111097 -32489 -174952 -138394
21669 -138394 -123219 21683 887 -132135 -295143 -176287 51119 -210420 -404635 -357967
21659 -357967 -316726 -227378 -355881 -235550 74234 112022 -146356 -204145 15689 19860 -144884
21648 -144884 -323822 -171301 -99519 -136405 -225837 -134687 136146 288116 116285 77848
21638 77848 48330 65303 41059 -91863 -88466 -149059 -85349 -226720 -212262 -190928 -389496
21627 -389496 -208937 -215666 -509921 -391088 -322556 -224213 -14665 -98266 27951 184686
21617 184686 248524 50134 -287029 -314025 -79906 -311461 -508828 -335794 73839 207291
$$ packed form
21691a10967K60250j49227n5285p0098N0423J7340P6211p8995j59822n8680K05319
21680g3531J84171R2091m4498J13385j73161L3829Q514k9703j43586j42463L6558
21669a38394J5175J44902k0796j33022j63008J18856K27406k61539j94215M6668
21659c57967M1241Q9348j28503J20331L09784L7788k58378n7789K19834M171j64744
21648a44884j78938J52521P1782l6886q9432R1150K70833J51970j71831l8437
21638G7848k9518J6973k4244j32922L397o0593O3710j41371J4458K1334j98568
21627c89496J80559o729k94255J18833O8532R8343K09548q3601J26217J56735
21617A84686O3838j98390l37163k6996K34119k31555j97367J73034M09633J33452
$$ plain form
21607 207291 -70800 -271221 -258636 -268371 -298246 -448043 -249963 -137273 -140255 -280313 -452481
21596 -452481 -135932 124897 241507 27654 -89258 199578 224837 254091 -4854 18934
21586 18934 257072 219491 285388 370624 200786 100643 -83199 -223523 -212064 -303235 -386330
21575 -386330 -652045 -644893 -346240 -254443 -247897 -170406 -38575 -79288 -166374 -19420 131149
21564 131149 252657 129516 156831 161286 50863 -56412 -161424 -102136 67332 -144587
21554 -144587 -539126 -549921 -161191 -33439 20044 -38 -86907 -14460 237422 137818 -31994
21543 -31994 56805 163746 245570 82732 48587 -118904 19825 79526 -70663 -447257
21533 -447257 -462738 -237327 -163133 -390416 -535530 -433042 -62729 339360 255422 30413
$$ packed form
21607B07291k78091k00421J2585r735k9875j49797J98080J12690k982j40058j72168
21596d52481L16549K60829J16610k13853j16912K88836K5259K9254k58945K3788
21586A8934K38138l7581O5897Q5236j69838j00143j83842j40324J1459r1171q3095
21575c86330k65715P152K98653R1797O546P7491J31831m0713q7086J46954J50569
21564A31149J21508j23141K7315M455j10423j07275j05012N9288J69468k11919
21554a44587l94539j0795L88730J27752N3483k0082q6869P2447K51882r9604j69812
21543c1994Q8799J06941Q1824j62838l4145j67491J38729N9701j50189l76594
21533d47257j5481K25411P4194k27283j45114J02488L70313M02089q3938k25009
$$ plain form
21523 30413 -16337 13589 -168822 -331389 -262071 -81018 293890 208396 152725 210966 277277
21512 277277 212879 360621 258588 65415 -16129 152404 -57298 -233306 -95602 -134566
21502 -134566 -295623 -212731 -159465 28828 230882 242496 239426 381727 462692 284543 215735
21491 215735 155639 88450 245294 264440 239258 265033 309464 100933 -64767 -90716 29364
21480 29364 -29406 -152886 -96009 178126 116224 2049 87023 111878 141097 60516 -212259
21469 -212259 -251177 -140810 -246707 -217404 -245400 -131018 -18569 -220634 -472847 -356455
21459 -356455 6348 73814 -230754 -288422 -101880 49224 -17001 -119908 -148996 17783
21449 17783 39562 -12831 -16277 7204 51238 64382 -27150 -149402 -84173 23149 57355
$$ packed form
21523C0413m6750K9926j82411j62567O9318J81053L74908q5494n5671N8241O6311
21512B77277o4398J47742j02033j93173q1544J68533k09702j76008J37704l8964
21502a34566j61057Q2892N3266J88293K02054J1614l070J42301Q0965j78149o8808
21491B15735o0096o7189J56844J9146k5182K5775M4431k08531j65700k5949J20080
21480B9364n8770j23480N6877K74135o1902j14175Q4974K4855K9219q0581k72775
21469b12259l8918J10367j05897K9303k7996J14382J12449k02065k52213J16392
21459c56455L62803O7466l04568n7668J86542J51104o6225j02907k9088J66779
21449A7783K1779n2393l446K3481M4034J3144r1532j22252O5229J07322L4206
$$ plain form
21438 57355 -69464 61240 -60817 -201319 -172990 -102682 -49076 -44776 -50480 -161915 -271501
21427 -271501 -285655 -333552 -306035 -302785 -387787 -474881 -423757 -163535 -4015 -52724 -240464
21416 -240464 -152320 61780 48392 50806 319712 276662 117141 29577 -19563 -39997 -200995
21405 -200995 -141720 -95940 38276 -122376 -199725 -60820 70925 8581 -10570 5109 42225
21394 42225 87857 -140653 -292560 -269504 -435383 -584968 -564657 -653572 -491285 -322483
21384 -322483 -228150 -81051 -192059 -396027 -480703 -346175 -75067 58568 -62677 -256719
21374 -256719 -185465 -250149 -215572 -150515 118402 218758 428617 615672 516382 371116
21364 371116 230401 622 -213048 -249497 -112165 171282 50734 -84985 -127244 -277332
$$ packed form
21438E7355j26819J30704j22057j40502K8329P0308N3606M300n704j11435j09586
21427b71501j4154m7897K7517L250q5002q7094N1124K60222J59520m8709j87740
21416b40464Q8144K14100j3388K414K68906m3050j59521q7564m9140k0434j60998
21405b00995N9275M5780J34216j60652p7349J38905J31745o2344j9151J5679L7116
21394D2225M5632k28510j51907K3056j65879j49585K0311q8915J62287J68802
21384c22483R4333J47099j11008k03968q4676J34528K71108J33635j21245j94042
21374b56719P1254o4684L4577O5057K68917J00356K09859J87055r9290j45266
21364C71116j40715k29779k13670l6449J37332K83447j20548j35719m2259j50088
$$ plain form
21354 -277332 -380182 -181337 -184111 -259223 -257594 -342000 -312035 -201637 -195526 -338326 -370254
21343 -370254 -295583 -89449 -21289 43720 -36730 6027 58148 -23803 38667 -169132 -110770
21332 -110770 38380 49954 14363 -68270 -124549 27827 220510 326491 395831 341272 395846
21321 395846 299224 6092 -78700 206598 228305 160201 -55097 -70126 29847 177848 184657
21310 184657 157484 206486 110327 -86446 -224030 -264575 -238701 -115740 179366 377043
21300 377043 336394 264513 -467 -25530 271020 395650 201059 -168491 -271192 -100936
21290 -100936 -180726 -113104 -156895 -372858 -261627 -228764 -620236 -576681 -429057 -325533
21280 -325533 -268744 -241199 -271770 -406791 -574251 -538199 -175698 -83882 -207079 -59513
$$ packed form
21354b77332j02850J98845k774p5112J629q4406K9965J10398O111j42800l1928
21343c70254P4671K06134O8160O5009q0450M2757N2121q1951O2470k07799N8362
21332a10770J49150J1574l5591q2633n6279J52376J92683J05981O9340n4559N4574
21321C95846r6622k93132q4792K85298K1707o8104k15298j5029R9973J48001O809
21310A84657k7173M9002r6159j96773j37584m0545K5874J22961K95106J97677
21300C77043m0649p1881k64980k5063K96550J24630j94591l69550j02701J70256
21290a00936p9790O7622m3791k15963J11231L2863l91472M3555J47624J03524
21280c25533N6789K7545l0571j35021j67460L6052L62501R1816j23197J47566
$$ plain form
21270 -59513 -15938 -156391 23544 -178221 -482338 -179719 111407 85650 154954 23989
21260 23989 -264990 -269644 -210229 3351 237957 265014 -2913 73298 229443 327829 417845
21249 417845 507747 449340 341338 388426 152009 153225 257555 -20587 -125646 100184
21239 100184 124370 -75098 -238931 -261846 -921 150097 -103920 -208636 3835 33191
21229 33191 -147088 -234782 -217773 -262928 -355237 -137126 48993 88288 -126454 4898 134700
21218 134700 15312 -55597 -32172 48599 47860 -148783 -171323 64586 168940 38306 112848
21207 112848 85383 395360 397853 101438 -111955 12028 -259993 -372230 -191349 -138556
21197 -138556 -34169 -133924 -364091 -369536 -342277 -131543 -165066 -170998 -72626 113093 52632
$$ packed form
21270e9513M3575j40453J79935k01765l04117L02619K91126k5757O9304j30965
21260B3989k88979m654N9415K13580K34606K7057k67927P6211J56145R8386R0016
21249D17845Q9902n8407j08002M7088k36417J216J04330k78142j05059K25830
21239A00184K4186j99468j63833k2915K60925J51018k54017j04716K12471K9356
21229C3191j80279q7694J7009m5155r2309K18111J86119L9295k14742J31352J29802
21218A34700j19388p0909K3425Q0771p39j96643k2540K35909J04354j30634P4542
21207A12848k7465L09977K493k96415k13393J23983k72021j12237J80881N2793
21197a38556J04387r9755k30167n445K7259K10734l3523n932R8372J85719o0461
$$ plain form
21186 52632 -81143 -148999 -83093 -231598 -243872 -39781 336314 245326 125709 -112791
21176 -112791 -138182 -129571 -315356 -298035 -176808 -37806 -134329 -35328 34621 139800 61466
21165 61466 -76195 -246919 -244463 -107179 -370195 -475606 -488074 -274799 -110058 -24072
21155 -24072 98932 154821 1930 -374352 -378301 -179948 -203869 -179547 -105015 -189584 -319928
21144 -319928 -166722 15894 77914 110306 223843 131016 118858 39990 5252 -237 25890
21133 25890 -133427 -261456 -228940 -307060 -150794 -72734 -170868 -423448 -283206 115290
21123 115290 244111 55158 -94859 -125732 -242067 -265020 -34754 -56168 -241853 -276501
21113 -276501 -231468 -153941 6387 32807 -105352 -411892 -618258 -616841 -501777 -557553 -418679
$$ packed form
21186E2632j33775o7856O5906j48505j2274K04091L76095r0988j19617k38500
21176a12791k5391Q611j85785J7321J21227J39002r6523R9001O9949J05179p8334
21165F1466j37661j70724K456J37284k63016j05411j2468K13275J64741Q5986
21155b4072J23004N5889j52891l76282l949J98353k3921K4322P4532q4569j30344
21144c19928J53206J82616O2020L2392J13537r2827j2158p8868l4738n489K6127
21133B5890j59317j28029L2516p8120J56266P8060r8134k52580J40242L98496
21123A15290J28821j88953j50017l0873j16335k2953K30266k1414j85685l4648
21113b76501M5033P7527J60328K6420j38159l06540k06366J417J15064n5776J38874
$$ plain form
21102 -418679 -203045 -274900 -393715 -303312 -18734 -161028 -22893 -9340 -71653 -115412
21092 -115412 -78575 -54396 39385 31841 -7950 -155033 -89876 -11505 88078 295222 252403
21081 252403 88728 17919 -119150 -331555 -789886 -526502 -141610 53520 104811 96437
21071 96437 23447 26161 -84314 -14329 -275436 -324268 -460670 -628172 -445849 -177140 -93279
21060 -93279 -4694 117502 -29733 -202912 -337706 -442833 -264818 -260150 -178518 -252011 -365872
21049 -365872 -391289 -269747 -168900 -272794 -89520 274975 92249 -218691 -333154 -508333
21039 -508333 -453088 -295894 -105085 -340463 -490509 -210623 -107083 -109962 -274350 -391571
21029 -391571 -349155 -223176 -187382 70860 120571 162261 -90224 -302275 -313418 -281900 -160491
$$ packed form
21102d18679K15634p1855j18815R0403K84578j42294J38135J3553o2313m3759
21092a15412L6837K4179R3781p544l9791j47083O5157P8371R9583K07144m2819
21081B52403j63675p0809j37069k12405m58331K63384L84892J95130N1291q374
21071I6437p2990K714j10475O9985k61107m8832j36402j67502J82323K68709Q3861
21060i3279Q8585J22196j47235j73179j34794j05127J78015M668Q1632p3493j13861
21049c65872k5417J21542J00847j03894J83274L64495j82726l10940j14463j75179
21039e08333N5245J57194J90809k35378j50046K79886J03540k879j64388j17221
21029c91571M2416J25979L5794K58242M9711M1690k52485k12051j1143L1518J21409
$$ plain form
21018 -160491 -88508 -84449 -150573 -350541 -474492 -544845 -430834 -178215 -64197 -99090 -319415
21007 -319415 -225455 -170040 -123233 -18956 -40484 45483 173872 482027 285815 -31333
20997 -31333 -27167 45621 82142 -255370 -309114 -344275 -232371 -119007 -153520 -96642 -50227
20986 -50227 -89860 -233891 -168761 -148528 -368331 -272111 -150091 -274097 -435527 -137242
20976 -137242 -111710 -307639 -62665 41269 32733 -26086 -4501 94351 354261 368207 207656
20965 207656 75022 153519 235757 134289 -3753 28073 185087 213246 116243 64966 69848
20954 69848 52728 -27841 7276 -16807 -89133 -18204 1753 63215 291736 80443 -214895
20943 -214895 -449358 -356829 -203215 -3210 -104349 -198021 -61039 106306 79623 -142999
$$ packed form
21018a60491P1983M059o6124j99968j23951p0353J14011K52619J14018l4893k20325
21007c19415R3960N5415M6807J04277k1528Q5967J28389L08155j96212l17148
20997c1333M166P2788L6521l37512n3744l5161J11904J13364l4513N6878M6415
20986e0227l9633j44031O5130K0233k19803R6220J22020j24006j61430K98285
20976a37242K5532j95929K44974J03934q536n8819K1585R8852K59910J3946j60551
20965B07656j32634P8497Q2238j01468j38042L1826J57014K8159r7003n1277M882
20954F9848j7120q0569L5117k4083p2326P0929J9957O1462K28521k11293k95338
20943b14895k34463R2529J53614K00005j01139r3672J36982J67345k6683k22622
$$ plain form
20933 -142999 -368194 -257765 -162755 -197389 -323968 -237940 -263642 -255359 -162240 -132626 -93342
20922 -93342 -120056 -183843 -356827 -518345 -469471 -366152 -267818 -92417 157714 -11122
20912 -11122 -286809 -472216 -560716 -647521 -492144 -268660 9158 90360 24264 -361666
20902 -361666 -620603 -396763 -163136 -59597 -83277 -109276 -19303 87095 -22247 -132732
20892 -132732 -234593 -89442 40324 -173163 -179714 -121699 -70092 -178897 -249852 -57369
20882 -57369 122313 179820 258228 382377 397563 51033 -63078 74109 45301 -52318 -69942
20871 -69942 -24975 -62288 -261133 -303771 -346812 -390898 -413852 -636080 -799025 -594421 -313819
20860 -313819 -168194 -145325 -75070 8420 1794 11536 18171 93023 218363 -96842 -48048
$$ packed form
20933a42999k25195J10429R5010l4634j26579Q6028k5702Q283R3119K9614L9284
20922i3342k6714o3787j72984j61518M8874J03319R8334J75401K50131j68836
20912a1122k75687j85407q8500q6805J55377K23484K77818Q1202o6096l85930
20902c61666k58937K23840K33627J03539k3680k5999Q9973J06398j09342j10485
20892a32732j01861J45151J29766k13487o551N8015N1607j08805p0955J92483
20882e7369J79682N7507P8408J24149J5186l46530j14111J37187k8808r7619j7624
20871f9942M4967l7313j98845m2638m3041m4086k2954k22228j62945K04604K80602
20860c13819J45625K2869P0255Q3490o626R742O635P4852J25340l15205M8794
$$ plain form
20849 -48048 248090 -20461 -224465 -270379 -304999 -271267 -250450 -399949 -415112 -329081 -294932
20838 -294932 -51864 191041 368509 599966 434549 319003 137095 39023 129547 161224
20828 161224 262675 94165 44526 -6284 -99882 -221322 -220984 -301672 -325853 -162418 101236
20817 101236 281680 44579 -23272 -73531 -46138 -175781 -147886 -150155 -145390 -46570 34018
20806 34018 134593 156382 -90774 -267055 -500757 -683378 -585727 -341378 -112208 -130750
20796 -130750 -217737 -101453 -247372 -236176 104898 83976 -36767 -85302 -56108 -19040 -130438
20785 -130438 169166 173597 216268 349263 415715 388185 198749 -29602 -52283 88208 203387
20774 203387 342117 331842 -75018 -94730 -132230 -211039 -232654 -174498 -46520 -172525 -45112
$$ packed form
20849d8048K96138k68551k04004m5914l4620L3732K0817j49499j5163Q6031L4149
20838b94932K43068K42905J77468K31457j65417j15546j81908r8072R0524L1677
20828A61224J01451j68510m9639n0810r3598j21440L38q0688k4181J63435K63654
20817A01236J80444k37101o7851n0259K7393j29643K7895k269M765R8820Q0588
20806C4018J00575K1789k47156j76281k33702j82621R7651K44349K29170j8542
20796a30750q6987J16284j45919J1196L41074k0922j20743m8535K9194L7068j11398
20785a30438K99604M431M2671J32995O6452k7530j89436k28351k2681J40491J15179
20774B03387J38730j0275m06860j9712l7500p8809k1615N8156J27978j26005J27413
$$ plain form
20763 -45112 106353 251063 172265 188596 6527 4983 15305 138502 249788 -50549 -176044
20752 -176044 -242689 -137476 -208936 -186231 -304711 -440549 -394253 -322771 -214878 -385301
20742 -385301 -380973 -542332 -573447 -181722 234443 265431 -34786 -190284 -305341 -95661
20732 -95661 -147804 -219086 -81927 21303 -188992 -283744 -192542 -81070 96963 -34106
20722 -34106 -311008 -299947 -131376 -84876 -246865 -327685 -334420 35169 205406 138664 88799
20711 88799 278043 165854 9582 14464 67443 103419 87461 -29738 146006 78021 133939
20700 133939 252150 324627 343842 167799 109484 169032 143869 60082 52940 200161 169615
20689 169615 309049 415599 314219 -32039 -223131 -226422 -210481 -197844 -206461 -214135 -65591
$$ packed form
20763d5112J51465J44710p8798J6331j82069j544J0322J23197J11286l00337j25495
20752a76044o6645J05213p1460K2705j18480j35838M6296P1482J07893j70423
20742c85301M328j61359l1115L91725M16165L0988l00217j55498j15057K09680
20732i5661n2143p1282J37159J03230k10295r4752R1202J11472J78033j31069
20722c4106k76902J1061J68571M6500j61989q0820o735L69589J70237o6742m9865
20711H8799J89244j12189j56272M882N2979L5976j5958j17199J75744o7985N5918
20700A33939J18211P2477J9215j76043n8315N9548k5163q3787p142J47221l0546
20689A69615J39434J06550j01380l46258j91092l291J5941J2637q617p674J48544
$$ plain form
20678 -65591 62838 -21895 -84544 62653 -56719 36027 -30556 -131326 65479 184267
20668 184267 -49660 -23206 -64817 67633 387088 425845 362293 310429 291170 285324 215858
20657 215858 308502 398443 441430 292826 321151 335961 299424 185286 215484 94470 -215072
20646 -215072 -325560 -533910 -535183 -201646 125324 171739 -155594 -352146 -29326 205028
20636 205028 273514 -75275 -230949 -139273 -129036 -299635 -415339 -202351 -18593 56557
20626 56557 114145 -178730 -584236 -349057 67141 4495 -50022 -284764 -505039 -655867
20616 -655867 -401204 -188106 -86511 73825 314926 615394 600383 331437 179816 170062
20606 170062 -112650 -255135 -125299 50134 57661 236425 346455 389342 159262 -77890
$$ packed form
20678f5591J28429q4733o2649J47197j19372R2746o6583j00770J96805J18788
20668A84267k33927K6454m1611J32450L19455L8757o3552n1864j9259n846o9466
20657B15858R2644Q9941M2987j48604K8325J4810l6537j14138L0198j21014l09542
20646b15072j10488k08350j273L33537L26970M6415l27333j96552L22820K34354
20636B05028O8486l48789j55674R1676J0237j70599j15704K12988J83758P5150
20626E6557N7588k92875m05506K35179M16198o2646n4517k34742k20275j50828
20616f55867K54663K13098J01595J60336K41101L00468j5011k68946j51621r754
20606A70062k82712j42485J29836J75433P527J78764J10030M2887k30080k37152
$$ plain form
20596 -77890 124531 78401 -159305 47964 77912 -115364 -155663 -71505 -199791 -237696 -308339
20585 -308339 -319082 -433207 -303250 -449141 -236839 82680 38385 49346 62688 -63703
20575 -63703 -222115 -116080 22473 299472 137350 -97524 -231277 -296454 -367415 -298505
20565 -298505 -127872 -288791 -358540 -141013 172718 216204 114497 40283 108518 -14277
20555 -14277 -273655 -309891 -310205 -198502 -187103 -266354 -402374 -345248 -230121 -316067 -206737
20544 -206737 16627 140741 227996 116465 -51178 -216133 -341550 -353510 -259324 -86150
20534 -86150 -100645 -127929 -130377 -123788 63347 80837 -146383 -124129 -67833 318619 224246
20523 224246 68790 13362 -328785 -224068 55320 -197188 -419252 -278962 -1108 183472
$$ packed form
20596g7890K02421m6130k37706K07269K9948j93276m0299Q4158j28286l7905p0643
20585c08339j0743j14125J29957j45891K12302L19519m4295J0961J3342j26391
20575f3703j58412J06035J38553K76999j62122k34874j33753o5177p0961O8910
20565b98505J70633j60919o9749K17527L13731M3486j01707p4214O8235j22795
20555a4277k59378l6236l14J11703J1399p9251j36020N7126J15127q5946J09330
20544b06737K23364J24114Q7255j11531j67643j64955j25417j1960R4186J73174
20534h6150j4495k7284k448O589J87135J7490k27220K2254N6296L86452r4373
20523B24246j55456n5428l42147J04717K79388k52508k22064J40290K77854J84580
$$ plain form
20513 183472 319998 282703 74309 122071 214481 132215 80586 150370 28601 -37318 117081
20502 117081 229189 190200 82486 285846 118900 138506 37487 -45476 -154693 -96067
20492 -96067 -99226 -61554 -24834 -93265 -76755 -165754 -180891 -119476 -187772 -408 245644
20481 245644 162720 30634 44640 169663 95857 -20227 -95538 43898 2900 -56618 134444
20470 134444 220016 6482 -7679 -50547 126304 117701 22966 610 -102571 -20602 -41786
20459 -41786 -202855 -78053 -50547 -150854 -104164 -103474 -119913 -68257 -60863 -53953 71161 226862
20447 226862 103353 -118459 -93369 -121071 -107288 -203959 -190875 104434 105609 -206529 -286415
20436 -286415 -331958 -161786 15208 -73705 -51643 -80639 -35525 -67294 28834 118513 234349
$$ packed form
20513A83472J36526l7295k08394M7762R2410q2266n1629O9784j21769o5919J54399
20502A17081J12108l8989j07714K03360j66946J9606j01019q2963j09217N8626
20492i6067l159L7672L6720o8431J6510q8999j5137O1415o8296J87364K46052
20481B45644q2924j32086J4006J25023p3806j16084p5311J39436m0998n9518J91062
20470A34444Q5572k13534j4161m2868J76851q603r4735k2356j03181Q1969k1184
20459d1786j61069J24802K7506j00307M6690O90j6439N1656P394O910J25114J55701
20447B26862j23509k21812K5090k7702J3783r6671J3084K95309J175l12138p9886
20436b86415m5543J70172J76994q8913K2062k8996M5114l1769R6128Q9679J15836
$$ plain form
20425 234349 254042 79306 -117225 48049 62600 74354 18932 -143428 -64892 179773
20415 179773 134490 40325 -82984 211479 431670 345038 215746 46715 10330 -192130
20405 -192130 -266305 -91941 247349 171619 -154186 53705 130529 132456 55344 239801 326678
20394 326678 341156 217486 421576 355384 197428 331837 360656 -3611 -395163 -276147
20384 -276147 40713 309009 416891 373135 161422 -65719 84420 134231 207228 204619
20374 204619 212909 354068 276443 227482 83696 -137798 -175778 -58614 -27668 -30067 2572
20363 2572 -10374 -53063 138769 314752 386763 218324 183580 170641 53147 33707 46542
20352 46542 -9365 251981 360878 341868 289883 -81943 -373851 -496888 -278982 -168127
$$ packed form
20425B34349J9693j74736j96531J65274J4551J1754n5422j62360P8536K44665
20415A79773m5283r4165j23309K94463K20191q6632j29292j69031l6385k02460
20405a92130p4175J74364L39290p5730l25805K07891P6824J927p7112J84457Q6877
20394C26678J4478j23670K04090o6192j57956J34409K8819l64267l91552J19016
20384b76147L16860K68296J07882m3756k11713k27141J50139M9811P2997k609
20374B04619Q290J41159p7625m8961j43786k21494l7980J17164L0946k399L2639
20363B572j2946m2689J91832J75983P2011j68439l4744j2939j17494j9440J2835
20352D6542n5907K61346J08897j9010n1985l71826k91908j23037K17906J10855
$$ plain form
20342 -168127 -21371 182806 376320 261118 73786 203037 454973 348596 -6807 -140097
20332 -140097 -171710 -218720 -122010 -15113 -24496 -97256 -132944 -149044 70605 355407 374943
20321 374943 205302 77939 50908 55556 275153 364005 298004 138905 240518 135247
20311 135247 -72394 8122 94 31037 80666 -45408 -284513 -497219 -565916 -567644 -321429
20300 -321429 -282764 -139808 19126 -366030 -397538 -212289 -404083 -529124 -315073 -277767
20290 -277767 -221067 -169581 160716 72342 22744 179281 208105 354775 370352 86351 -39457
20279 -39457 83207 -118878 -18189 59574 98784 -2479 -77172 -148485 -216753 -158997 -124576
20268 -124576 -39694 -70972 -140997 -127121 -129529 -71695 1415 -153100 -69627 119994 -58018
$$ packed form
20342a68127J46756K04177J93514j15202j87332J29251K51936j06377l55403j33290
20332a40097l1613m7010R6710J06897r383p2760l5688j6100K19649K84802J9536
20321C74943j69641j27363k7031M648K19597Q8852o6001j59099J01613j05271
20311A35247k07641Q0516q028L0943M9629j26074k39105k12706o8697j728K46215
20300c21429L8665J42956J58934l85156l1508J85249j91794j25041K14051L7306
20290b77767N6700N1486L30297q8374m9598J56537K8824J46670J5577k84001j25808
20279c9457J22664k02085J00689P7763L9210j01263p4693p1313o8268N7756L4421
20268a24576Q4882l1278p0025J3876k408N7834P3110j54515Q3473J89621j78012
$$ plain form
20257 -58018 -185715 190244 509908 269666 127047 66017 188354 140008 44586 -245977
20247 -245977 -357324 -173699 37065 -278532 -340718 -288031 -416148 -269054 -165219 -195399
20237 -195399 -195960 -284224 -329038 -115010 192663 322530 250488 237808 253921 224855 -214440
20226 -214440 -432936 -483424 -252633 -9397 39448 181551 246797 157395 135386 68243 -152658
20215 -152658 -46584 21176 25510 -22948 -122510 -228896 -132526 -169350 -295402 -149732 -21701
20204 -21701 -67351 -213469 -303955 -413124 -353209 -316775 -279284 -137940 -109634 -276597 -295664
20193 -295664 -212577 -252569 -300224 -267207 16981 125011 52457 3598 -78759 -22380 1726
20182 1726 70657 -152569 -185655 -200020 -251144 -179038 -79619 -105229 13760 113724 31075
$$ packed form
20257e8018j27697L75959L19664k40242j42619o1030J22337m8346r5422k90563
20247b45977j11347J83625K10764l15597o2186N2687j28117J47094J03835l0180
20237a95399n61q8264m4814K14028L07673J29867p2042j2680J6113k9066m39295
20226b14440k18496n0488K30791K43236M8845J42103O5246q9402k2009o7143k20901
20215a52658J06074O7760M334m8458r9562j06386R6370l6824j26052J45670J28031
20204b1701m5650j46118r0486j09169N9915L6434L7491J41344K8306j66963j9067
20193b95664Q3087l9992m7655L3017K84188J08030p2554m8859q2357N6379K4106
20182A726O8931k23226l3086j4365n1124P2106R9419k5610J18989R9964q2649
$$ plain form
20171 31075 -149779 -183071 98477 114065 248631 -10650 16902 39802 53581 -62145 -85225
20160 -85225 26066 258426 322271 333099 368640 533312 601492 1021309 987635 898456 1154130
20149 1154130 938497 1046537 1392592 1296517 1091392 1120256 1187655 1257591 1275141 1289590
20139 1289590 1328053 1410406 1435149 1369160 1182193 1158216 1268078 1000909 858170 1058976
20129 1058976 865124 599033 497103 584476 1067724 1209287 1211475 937605 873174 1068839
20119 1068839 1183105 1070291 973136 1020527 1125663 1150585 1041193 1038641 1187680 1281322
20109 1281322 1253033 1094575 936058 977079 1142074 1286987 1112466 1149884 1347985 1149444
20099 1149444 1275613 1238976 1417678 1311641 1201554 1048708 1047932 797670 571213 484578
$$ packed form
20171C1075j80854l3292K81548J5588J34566k59281K7552K2900J3779j15726k3080
20160h5225J11291K32360O3845J0828L5541J64672O8180M19817l3674q9179K55674
20149A154130k15633J08040L46055r6075k05125K8864O7399O9936J7550J4449
20139A289590L8463Q2353K4743o5989j86967k3977J09862k67169j42739K00806
20129A058976j93852k66091j01930Q7373M83248J41563K188k73870o4431J95665
20119A068839J14266j12814r7155M7391J05136K4922j09392k552J49039R3642
20109A281322k8289j58458j58517M1021J64995J44913j74521L7418J98101j98541
20099A149444J26169l6637J78702j06037j10087j52846p76k50262k26457q6635
$$ plain form
20089 484578 434392 535494 359956 31603 277702 302572 245537 248520 198681 219644 131365
20078 131365 195320 634712 522415 369785 244946 169530 259950 410259 337144 412291
20068 412291 500498 461650 226528 245483 264858 -36676 -184877 -49857 -31227 -11316 13353
20057 13353 -91099 138230 185900 58187 77139 77548 38952 68877 23425 1331 71152
20046 71152 188439 251662 73674 191845 184771 112454 353798 251749 225710 198266 112329
20035 112329 223820 392138 241340 253291 263459 221372 301814 259754 318949 235717 87417
20024 87417 22345 -10057 5505 -49321 -104663 31833 -6003 -47308 -206153 -161284 113233
20013 113233 51106 -99596 -93545 -4984 -505 -20321 -52579 105314 302043 481637 392550
$$ packed form
20089D84578n0186J01102j75538l28353K46099K4870n7035K983m9839K0963q8279
20078A31365O3955M39392j12297j52630j24839p5416R0420J50309p3115P5147
20068D12291Q8207l8848k35122J8955J9375l01534j48201J35020J8630J9911K4669
20057A3353j04452K29329M7670j27713J8952M09l8596K9925m5452k2094O9821
20046G1152J17287O3223j77988J18171p074p2317K41344j02049k6039k7444q5937
20035A12329J11491J68318j50798J1951J0168m2087Q0442m2060N9195q3232j48300
20024H7417o5072l2402J5562n4826n5342J36496l7836m1305j58845M4869K74517
20013A13233o2127j50702O051Q8561M479j9816l2258J57893J96729J79594q9087
$$ plain form
20002 392550 227845 62805 -55370 -108354 35060 136810 132766 6343 21842 8447
19992 8447 116880 421958 459622 297928 60752 202767 71225 -56988 -141968 -110915
19982 -110915 -17096 24686 195503 381229 396074 244463 232974 209062 209352 -65791 -58827
19971 -58827 113104 -1342 59410 458174 498955 493753 453819 266946 94396 81049 102794
19960 102794 268249 243304 135498 271399 356658 380543 264640 417662 336739 311369
19950 311369 307663 163966 202868 456569 503642 422829 361738 589947 591946 358082 299568
19939 299568 325804 109152 143323 219599 189563 376826 631204 523558 287462 27755
19929 27755 -46009 128045 442137 523214 458403 246825 318425 594156 676825 694428 336850
$$ packed form
20002C92550j64705j65040j18175n2984J43414J01750m044j26423J5499j3395
19992H447J08433L05078L7664j61694k37176J42015j31542j28213q4980L1053
19982a10915R3819M1782J70817J85726J4845j51611j1489k3912K90k75143O964
19971e8827J71931j14446O0752L98764M0781n202l9934j86873j72550j3347K1745
19960A02794J65455k4945j07806J35901Q5259K3885j15903J53022q0923k5370
19950C11369l706j43697L8902K53701M7073q0813o1091K28209J999k33864n8514
19939B99568K6236k16652L4171P6276l0036J87263K54378j07646k36096k59707
19929B7755p3764J74054L14092Q1077o4811k11578P1600K75731Q2669J7603l57578
$$ plain form
19918 336850 -49809 130775 327609 266839 191978 51124 -17079 246029 217619 -21971
19908 -21971 -66066 -187276 -297124 -172537 237901 223134 283096 176382 236887 255123 128455
19897 128455 -10627 -132893 -89506 165344 143393 339744 514378 582356 390974 320382
19887 320382 328304 370016 265470 407783 390195 179042 270811 204804 2596 -39724 149895
19876 149895 383090 212159 212979 199288 221473 447923 382645 301346 295204 525696 710574
19865 710574 709665 518761 422596 537077 404692 422419 756004 780755 604436 467868 374143
19854 374143 570219 412815 313845 486377 554878 358471 82045 118189 126630 -12059
19844 -12059 38169 241344 680117 813803 523525 517581 573413 527349 541673 767782 832755
$$ packed form
19918C36850l86659J80584J96834o0770p4861j40854o8203K63108k8410k39590
19908b1971m4095j21210j09848J24587M10438j4767N9962j06714O0505J8236j26668
19897A28455j39082j22266M3387K54850k1951J96351J74634O7978j91382p0592
19887C20382P922M1712j04546J42313j7588k11153R1769o6007k02208m2320J89619
19876A49895K33195j70931Q20j3691K2185K26450o5278q1299o142K30492J84878
19865G10574r09j90904r6165J14481j32385J7727L33585K4751j76319j36568r3725
19854C74143J96076j57404r8970J72532O8501j96407k76426L6144Q441j38689
19844a2059N0228K03175M38773J33686k90278n944N5832m6064J4324K26109O4973
$$ plain form
19833 832755 797569 697537 632703 651406 457535 302432 329172 396791 439346 405192 368035
19822 368035 322065 212081 218629 304036 366012 495903 585579 557675 482132 542111 795704
19811 795704 964760 836971 669846 722397 814284 658924 570439 525829 448674 320503
19801 320503 421634 513007 507655 469925 414867 455460 471719 387198 272581 288024 413264
19790 413264 398015 452773 518739 567399 436628 301203 369854 490480 492426 242840 111460
19779 111460 -104258 152524 475039 263218 388434 358962 206645 8675 -86383 84583
19769 84583 431994 588402 505573 628093 423908 242931 127322 59464 275147 490774
19759 490774 402266 213701 223523 54316 74873 290773 413288 410960 399039 316354 298185
$$ packed form
19833H32755l5186j00032o4834J8703j93871j55103K6740O7619M2555l4154l7157
19822C68035m5970j09984O548Q5407O1976J29891Q9676k7904p5543N9979K53593
19811G95704J69056j27789j67125N2551R1887j55360q8485m4610p7155j28171
19801C20503J01131R1373n352l7730n5058M0593J6259q4521j14617J5443J25240
19790D13264j5249N4758O5966M8660j30771j35425O8651J20626J946k49586j31380
19779A11460k15718K56782L22515k11821J25216k9472j52317j97970r5058J70966
19769H4583L47411J56408q2829J22520k04185j80977j15609o7858K15683K15627
19759D90774q8508j88565R822j69207K0557K15900J22515k328j1921q2685j8169
$$ plain form
19748 298185 430378 438300 236720 195425 314468 351006 504496 278965 56109 37056
19738 37056 -133498 -85472 -45906 224881 667418 783093 634432 643250 583449 572424 639807
19727 639807 735784 839151 796420 613881 677825 806896 685597 713247 833498 933432
19717 933432 1028957 839770 885462 1180852 1326932 1161353 1036330 1145167 1064076 1069236
19707 1069236 1049710 1004021 1016285 1019755 840216 905372 1212902 1370461 1441940 1405395 1609918
19696 1609918 1525414 1292085 1393415 1464768 1519145 1428517 1580199 1625112 1581967 1581448 1683051
19685 1683051 1789044 1619754 1575382 1465649 1511662 1668506 2034084 2249696 2168993 2129410
19675 2129410 2019276 1950911 1948229 1800066 1841948 1723973 1579053 1578811 1595658 1783163 1905934
$$ packed form
19748B98185J32193P922k01580m1295J19043L6538J53490k25531k22856j9053
19738C7056j70554M8026L9566K70787M42537J15675j48661Q818n9801j1025O7383
19727F39807R5977J03367m2731j82539O3944J29071j21299K7650J20251R9934
19717I33432R5525j89187M5692K95390J46080j65579j25023J08837q1091N160
19707A069236j9526m5689J2264L470j79539O5156L07530J57559P1479l6545K04523
19696A609918q4504k33329J01330P1353N4377r0628J51682M4913m3145n19J01603
19685A683051J05993j69290m4372j09733M6013J56844L65578K15612q0703l9583
19675B129410j10134o8365k682j48163M1882j17975j44920k42J6847J87505J22771
$$ plain form
19664 1905934 1671124 1459801 1447155 1516258 1668775 1889849 1860809 1936836 2077026 1900537
19654 1900537 1794108 2003262 1849692 1790971 1963197 1762881 1872761 2180363 2468652 2432580
19644 2432580 2550556 2485444 2437132 2360099 2431675 2776116 3007755 2842338 2639391 2858238
19634 2858238 3094432 3262737 3261447 3143517 3219861 3168787 3089695 3152925 3203308 3129615 3031734
19623 3031734 3223689 3479365 3648789 3927192 4207334 4293262 4295643 4421054 4831997 5292100
19613 5292100 5586234 5915345 5862124 5789363 5980974 6259904 6802235 7479382 8133174 8763776
19603 8763776 9096557 9376197 9854596 10681068 11413159 12134330 12986587 13816821 15079240
19594 15079240 17195688 19592324 22768343 27199398 33781971 43759492 58908719 77404656
$$ packed form
19664A905934k34810k11323j2646O9103J52517K21074k9040P6027J40190j76489
19654A900537j06429K09154j53570n8721J72226k00316J09880L07602K88289l6072
19644B432580J17976o5112m8312p7033P1576L44441K31639j65417k02947K18847
19634B858238K36194J68305j290j17930P6344n1074p9092O3230N0383p3693r7881
19623C031734J91955K55676J69424K78403K80142Q5928K381J25411M10943M60103
19613E292100K94134L29111n3221p2761J91611K78930N42331O77147O53792O30602
19603H763776L32781K79640M78399Q26472P32091P21171Q52257Q30234J262419
19594A5079240K116448K396636L176019M431055O582573R977521J5149227J8495937
$$ plain form
19586 77404656 93499820 104575451 115328398 129238238 147031383 165104852 179264693
19579 179264693 187333409 181557822 170562796 168845733 181328759 200058257 203009753
19572 203009753 190526612 182509418 184434724 193825126 204857097 213300997 214464964 197129996
19564 197129996 175093318 161803546 158313741 156605148 142281364 122877575 112776349
19557 112776349 114020635 124243330 136308729 144221433 150793488 161111580 176823082
19550 176823082 194602302 208985971 218407530 214205584 199935307 192761316 200336712
19543 200336712 218854927 226719951 213437838 200576874 198193136 204697766 214730721
19536 214730721 223123454 225970605 212226601 187829045 168902704 159957706 155961811
$$ packed form
19586G7404656J6095164J1075631J0752947J3909840J7793145J8073469J4159841
19579A79264693Q068716n775587j0995026j717063J2483026J8729498K951496
19572B03009753j2483141q017194J925306R390402J1031971Q443900J163967j7334968
19564A97129996k2036678j3289772l489805j708593j4323784j9403789j0101226
19557A12776349J244286J0222695J2065399P912704O572055J0318092J5711502
19550A76823082J7779220J4383669R421559m201946j4270277p173991P575396
19543B00336712J8518215P865024j3282113j2860964k383738O504630J0032955
19536B14730721Q392733K847151j3744004k4397556j8926341q944998l995895
$$ plain form
19529 155961811 141853039 116270896 93715978 78240482 67771209 60250323 54305373
19522 54305373 49473900 45702453 42868669 40289889 38072072 36524108 35116139 33930471
19514 33930471 32708486 31384022 30341392 29265311 28250687 27446314 26644451 25490549
19506 25490549 24438614 23775829 23211871 22444487 21699531 20913055 20172982 19660360 19077588
19497 19077588 18577217 17988799 17016808 16049011 15520814 15131224 14632886 14112797 13635978
19488 13635978 13160492 12398292 11955205 11453942 11385161 11239393 10905491 10483214 10104068
19479 10104068 9735663 9168863 9029789 8760553 8473923 8429211 8161454 7882330 7498421
19470 7498421 7087430 7087849 7218099 7348986 7413130 7387181 7370356 7422173 7386205 7484086 7385152
$$ packed form
19529A55961811j4108772k5582143k2554918j5475496j0469273p520886n944950
19522E4305373m831473l771447k833784k578780k217817j547964j407969j185668
19514C3930471j221985j324464j042630j076081j014624q04373q01863j153902
19506B5490549j051935o62785n63958p67384p44956p86476p40073n12622n82772
19497A9077588n00371n88418r71991r67797n28197l89590m98338n20089m76819
19488A3635978m75486p62200m43087n01263o8781j45768l33902m22277l79146
19479A0104068l68405n66800j39074k69236k86630m4712k67757k79124l83909
19470G498421m10991M19J30250J30887O4144k5949j6825N1817l5968R7881r8934
$$ plain form
19459 7385152 7109831 6965290 6919126 7085152 7085096 6899866 6578649 6205080 5907521 5740564
19449 5740564 5578925 5519648 5314192 5219188 5117547 4808928 4626671 4657890 4516976 4418128
19439 4418128 4220699 4052040 3926892 3510177 3235145 3345847 3319249 3172749 3275705 3549993
19429 3549993 3558980 3378749 3061287 2890823 2939167 2997829 2949564 2849675 2997993 2841740
19419 2841740 2505182 2508575 2325361 2402891 2433788 2462362 2591441 2505751 2296918 2155676
19409 2155676 1914327 1718446 1839313 1859840 1815482 2060200 1837398 1415075 1569331 1549965
19399 1549965 1510494 1374421 1503879 1681464 1575181 1396929 1194447 1107091 1322930 1428798
19389 1428798 1506811 1553786 1382598 1182475 1070821 1166300 1321576 1365128 1436060 1493637
$$ packed form
19459G385152k75321j44541m6164J66026n6j85230l21217l73569k97559j66957
19449E740564j61639n9277k05456r5004j01641l08619j82257L1219j40914r8848
19439D418128j97429j68659j25148m16715k75032J10702k6598j46500J02956K74288
19429C549993Q987j80231l17462j70464M8344N8662m8265r9889J48318j56253
19419B841740l36558L393j83214P7530L0897K8574J29079q5690k08833j41242
19409B155676k41349j95881J20867K0527m4358K44718k22802m22323J54256j9366
19399A549965l9471j36073J29458J77585j06283j78252k02482q7356K15839J05868
19389A428798P8013M6975j71188k00123j11654R5479J55276M3552P0932N7577
$$ plain form
19379 1493637 1402531 1257275 1257757 1338851 1472681 1575505 1661673 1531274 1505555 1441861 1343961
19368 1343961 1426208 1307822 1224240 1279629 1173894 1072224 1143875 1161859 1360758 1252284
19358 1252284 1261044 1259338 1136947 1090156 1027710 891781 1008366 962225 940036 846384 1057079
19347 1057079 1261305 1075311 783834 801648 840977 990205 1194111 1438070 1280067 1105962
19337 1105962 1291349 1351186 1349030 1277901 1161868 991926 970014 1022467 1278125 1373999 1053934
19326 1053934 917469 990490 924383 811777 727289 654539 685105 611758 663570 935258 1006770
19315 1006770 1092156 1066815 1356336 1672251 1550530 1434654 1558878 1655941 1452075 1264116
19305 1264116 1137931 1214907 1395893 1260171 1128255 807021 682747 725343 915811 1037460
$$ packed form
19379A493637r1106j45256M82Q1094J33830J02824Q6168j30399k5719o3694r7900
19368A343961Q2247j18386q3582N5389j05735j01670P1651J7984J98899j08474
19358A252284Q760j706j22391m6791o2446j35929J16585m6141k2189r3652K10695
19347A057079K04226j85994k91477J7814L9329J49228K03906K43959j58003j74105
19337A105962J85387N9837k156p1129j16033j69942k1912N2453K55658R5874l20065
19326A053934j36465P3021o6107j12606q4488p2750L0566p3347N1812K71688P1512
19315A006770Q5386k5341K89521L15915j21721j15876J24224R7063k03866j87959
19305A264116j26185P6976J80986j35722j31916l21234j24274M2596J90468J21649
$$ plain form
19295 1037460 1150712 1220699 1084002 1201731 1284058 1226905 1081747 1056530 1001969 953451
19285 953451 836245 1038553 1047087 1023631 1130274 1168425 1094300 1157239 1167655 1140465 1232083
19274 1232083 1316968 1305521 1097602 1023968 1098121 1052043 935242 1001784 1199303 1194491 1256171
19263 1256171 1312860 1466861 1481744 1499319 1634382 1402747 1473256 1691462 1808729 1761285
19253 1761285 1896510 1854204 1872308 1838624 1727851 1870740 1865583 2101130 2061302 1968619 1927818
19242 1927818 2052348 2211520 2069440 1841582 1772927 1842343 1827645 2108896 2211424 2037183
19232 2037183 1795168 1878555 2077847 1992875 1941385 1849811 1926389 2084151 2006940 1859122
19222 1859122 1985267 2366257 2473721 2419889 2272828 2491931 2668320 2710195 2781080 3008462
$$ packed form
19295A037460J13252O9987j36697J17729Q2327n7153j45158k5217n4561m8518
19285I53451j17206K02308Q534k3456J06643L8151p4125O2939J0416k7190R1618
19274A232083Q4885j1447k07919p3634P4153m6078j16801O6542J97519m812O1680
19263A256171N6689J54001J4883J7575J35063k31635P0509K18206J17267m7444
19253A761285J35225m2306J8104l3684j10773J42889n157K35547l9828r2683m0801
19242A927818J24530J59172j42080k27858o8655O9416j4698K81251J02528j74241
19232B037183k42015Q3387J99292q4972n1490r1574P6578J57762p7211j47818
19222A859122J26145L80990J07464n3832j47061K19103J76389M1875P0885K27382
$$ plain form
19212 3008462 2979227 3131823 3516896 3647359 3706154 3542184 3654693 4027471 4451864 4996128
19202 4996128 5453777 5505301 5715698 5822430 6251476 6912346 7680546 8201294 8807023 9474880
19192 9474880 10174712 10998191 12441661 14286521 16772059 20290959 25679839 34464332
19184 34464332 48560862 66710518 81477139 87431660 88917200 89194589 90483435 95039933
19176 95039933 103808506 106022051 92523989 78313363 73523516 78546513 89959240 98293532
19168 98293532 98716764 96482832 94191702 93447777 96285426 102663259 100128846 81568770
19160 81568770 62633602 49896102 41985808 36362841 32577110 30202650 28645484 27159267
19152 27159267 26197490 25883582 25547109 25385841 25658631 26054029 26641819 27562613 28802939
$$ packed form
19212C008462k9235J52596L85073J30463N8795j63970J12509L72778M24393N44264
19202D996128M57649N1524K10397J06732M29046O60870P68200N20748O05729O67857
19192I474880O99832Q23479J443470J844860K485538L518900N388880Q784493
19184C4464332J4096530J8149656J4766621N954521J485540K77389J288846M556498
19176I5039933Q768573K213545j3498062j4210626m789847N022997J1412727Q334292
19168I8293532M23232k233932k291130p43925K837649O377833k534413j8560076
19160H1568770j8935168j2737500p910294n622967l785731k374460j557166j486217
19152B7159267r61777l13908l36473j61268K72790L95398N87790R20794J240326
$$ plain form
19143 28802939 30572025 33542276 38014819 44898060 56079975 73957582 95591534 111147488
19135 111147488 118199434 123703961 132105277 147146931 171288644 198473045 204877097
19128 204877097 189540109 176454791 174679627 185090089 204102831 216532739 206952095
19121 206952095 188281654 177399207 179565090 194125466 209937131 204723413 182155077
19114 182155077 161235266 147530367 141044432 141281019 139398045 120294812 95810361
19107 95810361 78093680 66818584 59018295 53256591 48959996 45500104 42984049 41192816
19099 41192816 39858696 38552418 37470902 36746760 36221118 35935687 36034281 36689959 37471187
19090 37471187 38946170 41787505 47272628 56488488 72099821 93320887 111051997 117401157
$$ packed form
19143B8802939J769086K970251M472543O883241J1181915J7877607K1633952J5555954
19135A11147488P051946N504527Q401316J5041654K4141713K7184401O404052
19128B04877097j5336988j3085318j775164J0410462J9012742J2429908r580644
19121B06952095j8670441j0882447K165883J4560376J5811665n213718k2568336
19114A82155077k0919811j3704899o485935K36587j882974j9103233k4484451
19107I5810361j7716681j1275096p800289n761704m296595l459892k516055j791233
19099D1192816j334120j306278j081516p24142n25642k85431R8594O55678P81228
19090C7471187J474983K841335N485123R215860J5611333K1221066J7731110O349160
$$ plain form
19082 117401157 117928377 117750261 118757093 123430722 133694126 137612759 120786429 101450139
19074 101450139 94112469 98864530 111191428 121030533 121764999 118778995 115828801 114287400
19066 114287400 116948817 123346219 120826511 99767020 76814937 61128598 51068431
19059 51068431 44034532 38937076 35263845 32542982 30491892 28947066 27724048 26248649
19051 26248649 24693177 23697112 22913473 22123433 21287288 20376452 19637134 18996337 18204663
19042 18204663 17729968 17234374 16952749 16466064 15777109 15391911 15033742 14634535 14342898
19033 14342898 14076646 13719424 13387590 12926048 12746350 12482960 12358108 12290936 12316491 12517091
19023 12517091 12456718 12496296 12721221 13115924 13301836 13511328 14027357 14717468 14971367 15155921
$$ packed form
19082A17401157N27220j78116J006832M673629J0263404L918633j6826330j9336290
19074A01450139p337670M752061J2326898R839105P34466k986004k950194j541401
19066A14287400K661417O397402k519708k1059491k2952083j5686339j0060167
19059E1068431p033899n097456l673231k720863k051090j544826j223018j475399
19051B6248649j555472r96065p83639p90040q36145r10836p39318o40797p91674
19042A8204663m74695m95594k81625m86685o88955l85198l58169l99207k91637
19033A4342898k66252l57222l31834m61542j79698k63390j24852o7172K5555K00600
19023A2517091o0373L9578K24925L94703J85912K09492N16029O90111K53899J84554
$$ plain form
19013 15155921 15879575 16687363 17556724 18618952 19666337 21163327 23261556 26154049
19005 26154049 30026823 35264576 43488126 55628071 70196410 82402127 89925267 96265705
18997 96265705 103225236 113070238 128979415 152639415 177467702 189743360 191487169
18990 191487169 190451690 187964402 187431927 191993714 201972375 210395871 211927038 208919643
18982 208919643 194076018 172431927 154481088 141244133 132521756 129353408 129390191 121012280
18974 121012280 101585832 83218304 70591669 61869996 55698191 51125749 47708447
18967 47708447 45400467 43915615 42654405 42101635 41679792 41486145 41647607 42285978 43099812
18958 43099812 45162352 48803231 53896045 61799437 74846966 93219153 111689736 123354734
$$ packed form
19013A5155921P23654Q07788Q69361J062228J047385J496990K098229K892493
19005B6154049L872774N237753Q223550J2139945J4568339J2205717P523140O340438
18997I6265705O959531R845002J5909177K3660000K4828287J2275658J743809
18990A91487169j035479k487288n32475M561787R978661Q423496J531167l007395
18982B08919643j4843625k1644091j7950839j3236955q722377l168348L6783q377911
18974A21012280j9426448j8367528j2626635q721673o171805m572442l417302
18967D7708447k307980j484852j261210n52770m21843j93647J61462O38371Q13834
18958D3099812K062540L640879N092814P903392J3047529J8372187J8470583J1664998
$$ plain form
18950 123354734 130475846 138218311 148219722 163494693 187885167 219953993 243884492
18943 243884492 250186935 250725461 247926183 244655339 246364360 254239472 264157666 269705025
18935 269705025 273521475 265333634 236523188 206801446 185070316 170591495 162760570
18928 162760570 160749077 155525447 135808058 110592104 90802276 77066012 67309931
18921 67309931 59917494 54161975 49649560 46195712 43599332 41300516 39153745 37074138
18913 37074138 35122429 33257135 31639589 30305734 29076952 28046054 26780340 25758318
18905 25758318 25025164 23965796 22972404 22094731 21002792 20164492 19413350 19004662 18653928
18896 18653928 18085698 17575478 17010882 16522514 15987376 15433198 15127620 14685258 14235065
$$ packed form
18950A23354734P121112P742465J0001411J5274971K4390474L2068826K3930499
18943B43884492O302443N38526k799278l270844J709021P875112R918194N547359
18935B69705025L816450q187841k8810446k9721742k1731130j4478821p830925
18928A62760570k011493n223630j9717389k5215954j9789828j3736264r756081
18921F7309931p392437n755519m512415l453848k596380k298816k146771k079607
18913C7074138j951709j865294j617546j333855j228782j030898j265714j022022
18905B5758318p33154j059368r93392q77673j091939q38300p51142m08688l50734
18896A8653928n68230n10220n64596m88368n35138n54178l05578m42362m50193
$$ plain form
18887 14235065 13734647 13219693 12923006 12494480 11994446 12010801 11647023 11072333 10744545
18878 10744545 10798346 10311932 9632549 9288076 9028399 8952042 8813394 8396873 8011014 7892852
18868 7892852 7716363 7556111 7636437 7585059 7411007 7196762 7035120 6939611 6815652 6536269
18858 6536269 6551592 6527410 6446517 6353650 6251091 6180686 6143769 5999617 6030165 5807896 5632910
18847 5632910 5531003 5367474 5212364 5011817 5081182 5092911 4910125 4710324 4775703 5033942
18837 5033942 4899611 4825518 5021975 5132111 5206281 5367392 5441579 5206383 4912179 4498958
18827 4498958 4327068 4333575 4291252 4103592 4128848 4091964 4035706 3934093 3781903 3640356
18817 3640356 3582417 3603783 3464642 3333041 3442959 3609218 3565171 3602685 3387146 3159703
$$ packed form
18887A4235065n00418n14954k96687m28526n00034J6355l63778n74690l27788
18878A0744545N3801m86414o79383l44473k59677p6357j38648m16521l85859j18162
18868G892852j76489j60252Q0326n1378j74052k14245j61642r5509j23959k79383
18858F536269J5323k4182q0893r2867j02559p0405l6917j44152L0548k22269j74986
18847E632910j01907j63529j55110k00547O9365J1729j82786j99801O5379K58239
18837E033942j34331p4093J96457J10136P4170J61111P4187k35196k94204m13221
18827D498958j71890O507m2323j87660K5256l6884n6258j01613j52190j41547
18817C640356n7939K1366j39141j31601J09918J66259m4047L7514k15539k27443
$$ plain form
18807 3159703 3081906 3173289 3183369 3125415 2950578 3003783 2997169 3013101 2892746 2704148 2559093
18796 2559093 2783609 2686572 2674534 2528593 2481459 2358240 2438574 2692061 2913096 3068098
18786 3068098 2781761 2657484 2681315 2761388 2786555 2759277 2756196 2886417 2652847 2417691
18776 2417691 2361842 2378748 2414261 2562274 2849961 2935097 2503760 2216497 2195564 2334860
18766 2334860 2633161 2840849 2851943 2806919 2537778 2487946 2520620 2599993 2666035 2670507 2678403
18755 2678403 2607617 2431534 2357260 2629577 2873383 2684187 2634833 2926178 3043129 2897842
18745 2897842 2761343 2781603 2714672 2851217 2994973 2988150 3118608 3049295 2891284 2748768
18735 2748768 2730217 2781930 2925815 3085241 3207890 3174982 3009834 2965768 3177368 3459933
$$ packed form
18807C159703p7797R1383J0080n7954j74837N3205o614J5932j20355j88598j45055
18796B559093K24516r7037j2038j45941m7134j23219Q0334K53487K21035J55002
18786C068098k86337j24277K3831Q0073K5167k7278l081J30221k33570k35156
18776B417691n5849J6906L5513J48013K87687Q5136m31337k87263k0933J39296
18766B334860K98301K07688J1094m5024k69141m9832L2674P9373O6042M472P896
18755B678403p0786j76083p4274K72317K43806j89196m9354K91345J16951j45287
18745B897842j36499K0260o6931J36545J43756o823J30458o9313j58011j42516
18735B748768j8551N1713J43885J59426J22649l2908j65148m4066K11600K82565
$$ plain form
18725 3459933 3592766 3522742 3416049 3577638 3829721 4121997 4299135 4314570 4192027 4297420
18715 4297420 4618631 4856578 5137173 5475636 5783268 6157287 6204749 6334231 6495051 7076615
18705 7076615 7342734 7429675 7730611 8280246 9130776 9652544 10306443 11378482 12464498
18696 12464498 13634346 15278232 16935529 19090518 21439490 24193081 27696318 32663935
18688 32663935 40022798 50059544 64687509 84864196 107042964 129062068 151897975
18681 151897975 171171410 181795107 190218442 202948793 220594983 239269289 254504331
18674 254504331 270354050 279904528 277429744 275475287 280408577 294244796 314636101
18667 314636101 337311670 354278596 355537010 350494999 343279357 332032596 327262570
$$ packed form
18725C459933J32833p0024j06693J61589K52083K92276J77138J5435j22543J05393
18715D297420L21211K37947K80595L38463L07632L74019M7462J29482J60820N81564
18705G076615K66119Q6941L00936N49635Q50530N21768O53899J072039J086016
18696A2464498J169848J643886J657297K154989K348972K753591L503237M967617
18688C2663935P358863J0036746J4627965K0176687K2178768K2019104K2835907
18681A51897975J9273435J0623697Q423335J2730351J7646190J8674306J5235042
18674B54504331J5849719R550478k474784j954457M933290J3836219K0391305
18667C14636101K2675569J6966926J258414n042011p215642j1246761m770026
$$ plain form
18660 327262570 327167728 326981559 327632589 318595558 299620858 280226757 262762183 251123165
18652 251123165 246814937 245884281 234933437 214425906 196315226 174366395 147277231
18645 147277231 125028577 110777314 102645085 99347908 100454923 107483674 121145244
18638 121145244 139121014 156025248 170559866 183367524 190201082 192118000 194491815
18631 194491815 197633011 193828351 180646073 166426465 148816788 124631370 102251747
18624 102251747 85729837 74339643 65960473 59883307 55590906 52068729 49440238 47253454
18616 47253454 45644547 44440671 43359080 42081300 41151292 40484535 39812065 39135345 38419537
18607 38419537 37618874 36682789 35935085 35887773 36103424 36117396 36384020 36975295 37967935 39483032
$$ packed form
18660C27262570r4842j86169O51030r037031j8974700j9394101j7464574j1639018
18652B51123165m308228r30656j0950844k0507531j8110680k1948831k7089164
18645A47277231k2248654j4251263q132229l297177J107015P028751J3661570
18638A21145244J7975770J6904234J4534618J2807658O833558J916918K373815
18631A94491815L141196l804660j3182278j4219608j7609677k4185418k2379623
18624A02251747j6521910j1390194q379170o077166m292401l522177k628491k186784
18616D7253454j608907j203876j081591j277780r30008o66757o72470o76720p15808
18607C8419537q00663r36085p47704m7312K15651J3972K66624N91275R92640J515097
$$ plain form
18597 39483032 41639871 44694418 48608874 53988482 61673656 73508941 91409051 116301659
18589 116301659 146896435 183099906 224810979 263909815 293476770 318635867 338681616
18582 338681616 347950935 346976644 345297344 337821549 308272583 270803656 236158980 195825744
18574 195825744 156297559 126553534 105404037 89948620 78821768 70570103 64313552
18567 64313552 59415773 55730172 52751476 50330872 48132336 46317017 44800006 43475025
18559 43475025 42063162 40895023 40162772 39411826 38518499 37806171 37484097 37364252 37103504
18550 37103504 37260996 37769981 38223246 39034306 40516338 42688493 45900081 50630654 57904391
18541 57904391 68671230 84952296 107645700 133098724 155027972 174845790 191919460
$$ packed form
18597C9483032K156839L054547L914456N379608P685174J1835285J7900110K4892608
18589A16301659L0594776L6203471M1711073L9098836K9566955K5159097K0045749
18582C38681616R269319r74291j679300p475795k9548966l7468927l4644676m0333236
18574A95825744l9528185k9744025k1149497j5455417j1126852q251665o256551
18567F4313552m897779l685601k978696k420604k198536j815319j517011j324981
18559D3475025j411863j168139p32251p50946q93327p12328l22074j19845k60748
18550C7103504J57492N08985M53265Q11060J482032K172155L211588M730573P273737
18541E7904391J0766839J6281066K2693404K5453024K1929248J9817818J7073670
$$ plain form
18534 191919460 200855707 204705108 209440976 213187924 205035106 187925645 172200097 150024012
18526 150024012 120440081 95295011 77565840 65118661 55982012 49034434 43961585
18519 43961585 39757399 36502077 34216972 32165661 30455474 29049888 27872984 27123462
18511 27123462 26311787 25249782 24583447 24064251 23650531 23149428 22358967 21730716 21059572
18502 21059572 20430114 19597242 18924464 18337201 17570278 16870723 16194754 15561989 15075352
18493 15075352 14933692 14533136 14015078 13566224 13069777 12651929 12333429 11885952 11576132
18484 11576132 11388637 10952888 10609489 10138941 9716431 9513799 9250044 9194898 8993731
18475 8993731 8860538 9018612 9098514 9020360 8860299 8817601 8780874 8893206 9245583 9267489
$$ packed form
18534A91919460Q936247L849401M735868L746948q152818j7109461j5725548k2176085
18526A50024012k9583931k5145070j7729171j2447179r136649o947578n072849
18519D3961585m204186l255322k285105k051311j710187j405586j176904p49522
18511B7123462q11675j062005o66335n19196m13720n01103p90461o28251o71144
18502B1059572o29458q32872o72778n87263p66923o99555o75969o32765m86637
18493A5075352j41660m00556n18058m48854m96447m17848l18500m47477l09820
18484A1576132j87495m35749l43399m70548m22510k02632k63755n5146k01167
18475H993731j33193J58074P9902p8154j60061m2698l6727J12332L52377K1906
$$ plain form
18465 9267489 9293243 9281331 9407046 9347492 9333218 9307394 9172858 9089204 9104308 9236156 8982048
18454 8982048 8576862 7902964 7576186 7565545 7306748 6894735 6708804 6634396 6590731 6518112
18444 6518112 6576950 6586259 6449941 6412150 6531347 6775817 6843617 6809590 6921929 6945030 7080721
18433 7080721 7256591 7879297 8400544 8965864 9695235 10168774 10386453 10494731 10684844
18424 10684844 11370024 12242719 13103606 13826373 14124717 14330785 14437585 14885558 15501380
18415 15501380 16270559 16529674 16720175 16804009 16862759 16903897 16967865 17276343 17583916 17989080
18405 17989080 18813052 19696128 20638247 21599180 22808016 24465527 26730929 30081634 35203794
18396 35203794 41977783 52472886 68701140 89667488 109948550 123264052 131328547
$$ packed form
18465I267489K5754j1912J25715n9554j4274k5824j34536q3654J5104J31848k54108
18454H982048m05186o73898l26778j0641k58797m12013j85931p4408m3665p2619
18444F518112N8838R309j36318l7791J19197K44470O7800l4027J12339K3101J35691
18433G080721J75870O22706N21247N65320P29371M73539K17679J08278J90113
18424A0684844O85180Q72695Q60887P22767K98344K06068J06800M47973O15822
18415A5501380P69179K59115J90501Q3834N8750M1138O3968L08478L07573M05164
18405A7989080Q23972Q83076R42119R60933J208836J657511K265402L350705N122160
18396C5203794O773989J0495103J6228254K0966348K0281062J3315502Q064495
$$ plain form
18389 131328547 138979393 148891334 164736450 190768158 219941724 229248633 215301893
18382 215301893 198732013 187851772 184566110 191651350 209902069 224819805 217584481
18375 217584481 200016988 186971805 180770039 181622287 191331240 209833923 226473461
18368 226473461 222757878 203886721 185553026 171675903 162664745 159688444 159623936 148765805
18360 148765805 123620162 99370608 82393619 70978024 63234948 57497161 53358843
18353 53358843 50044163 47614566 46194351 45453277 44758307 44519586 44979891 46362271 49014317
18344 49014317 53987247 62410707 75072172 89466544 99765114 104935073 108863653 113834201
18336 113834201 121277493 134261079 151972779 162029510 154112663 141002150 131821883
$$ packed form
18389A31328547P650846R911941J5845116K6031708K9173566R306909j3946740
18382B15301893j6569880j0880241l285662P085240J8250719J4917736p235324
18375B17584481j7567493j3045183o201766Q52248R708953J8502683J6639538
18368B26473461l715583j8871157j8333695j3877123r011158k976301o4508j0858131
18360A48765805k5145643k4249554j6976989j1415595p743076n737787m138318
18353E3358843l314680k429597j420215p41074o94970k38721M60305J382380K652046
18344D9014317M972930Q423460J2661465J4394372J0298570N169959L928580M970548
18336A13834201P443292J2983586J7711700J0056731p916847j3110513r180267
$$ plain form
18329 131821883 127651046 129378559 138178228 149492646 151391126 143113378 134315739 129455085
18321 129455085 128121098 131437729 141400019 154537278 156172384 142646939 127590259
18314 127590259 116101936 108543804 104891263 104030664 99310203 84968305 69000569 57349519
18306 57349519 49262118 43365091 38988168 35842219 33251365 30990318 29270420 27875083
18298 27875083 26778448 25498432 24385806 23415275 22711896 22046109 21409899 20626634 19911791
18289 19911791 19198948 18574751 17910509 17625774 17129088 16749549 16467442 15911406 15276502
18280 15276502 14750959 14322275 13665587 13085332 12508924 12158684 11842867 11458375 11229012
18271 11229012 10981263 10526166 10371419 10137944 9831770 9443418 9247530 9249292 9364792 9400255
$$ packed form
18329A31821883m170837J727513Q799669J1314418J898480q277748q797639m860654
18321A29455085j333987L316631R962290J3137259J635106j3525445j5056680
18314A27590259j1488323p558132l652541q60599m720461j4341898j5967736j1651050
18306E7349519q087401n897027m376923l145949k590854k261047j719898j395337
18298B7875083j096635j280016j112626r70531p03379o65787o36210p83265p14843
18289A9911791p12843o24197o64242k84735m96686l79539k82107n56036o34904
18280A5276502n25543m28684o56688n80255n76408l50240l15817l84492k29363
18271A1229012k47749m55097j54747k33475l06174l88352j95888J762J15500L5463
$$ plain form
18261 9400255 9297600 9161535 9066953 9146487 9130318 8783164 8418497 8229297 8199198 8082634
18251 8082634 7779516 7630066 7682333 7752266 7959750 7910772 7381162 6944838 6711940 6671293
18241 6671293 6658610 6520676 6404523 6157653 5895622 5587805 5564791 5366738 5195175 4996150
18231 4996150 4943717 4792644 4440065 4182181 4049009 3994359 3882504 3736650 3636274 3515044
18221 3515044 3629588 3559373 3284973 3162449 3233243 3461423 3791975 3954113 4060488 4276149
18211 4276149 4244158 4129920 4302416 4374263 4251282 3996211 3729245 3339991 2886285 2729316
18201 2729316 2786926 2858011 2951726 2873370 2713041 2610323 2300201 2012931 2115774 2326001
18191 2326001 2410679 2227806 2382881 2294590 2114822 2037785 2239792 2339660 1955486 1665359
$$ packed form
18261I400255j02655j36065r4582P9534j6169l47154l64667j89200l0099j16564
18251H082634l03118j49450N2267O9933K07484m8978n29610m36324k32898m0647
18241F671293j2683j37934j16153k46870k62031l07817k3014j98053j71563j99025
18231D996150n2433j51073l52579k57884j33172n4650j11855j45854j00376j21230
18221C515044J14544p0215k74400j22524P0794K28180L30552J62138J06375K15661
18211D276149l1991j14238J72496P1847j22981k55071k66966l89254m53706j56969
18201B729316N7610P1085R3715p8356j60329j02718l10122k87270J02843K10227
18191B326001Q4678j82873J55075q8291j79768p7037K02007R9868l84174k90127
$$ plain form
18181 1665359 1578962 1744851 1599113 1598741 1705075 1686507 1808137 1711288 1611868 1496775 1661753
18170 1661753 1869898 1942486 2099319 2506936 2592217 3023547 3217625 3403550 3689672 4026476
18160 4026476 4319818 4538268 4526039 4409462 4154388 3903826 3914160 3921417 3519699 3228421
18150 3228421 3321685 3376607 3269081 3332812 3485694 3616237 3950652 3822957 3923199 3775922
18140 3775922 3522609 3129343 2854592 2927300 3099985 3017980 2975387 3015770 2861779 2918144
18130 2918144 3057074 2842340 2592949 2281437 2393414 2360100 2242555 2270976 2120261 2132318
18120 2132318 2179643 2268461 2705278 2985968 3096017 3093346 3246896 3528759 3616417 3542172
18110 3542172 3625761 3772443 4073904 3880404 3729831 3581017 3320329 2929146 2599196 2345394
$$ packed form
18181A665359q6397J65889j45738l72J06334j8568J21630r6849r9420j15093J64978
18170A661753K08145P2588J56833M07617Q5281M31330J94078J85925K86122L36804
18160D026476K93342K18450j2229j16577k55074k50562J0334P257m01718k91278
18150C228421R3264N4922j07526O3731J52882J30543L34415j27695J00242j47277
18140C775922k53313l93266k74751P2708J72685q2005m2593M0383j53991N6365
18130B918144J38930k14734k49391l11512J11977l3314j17545K8421j50715J2057
18120B132318M7325Q8818M36817K80690J10049k671J53550K81863Q7658p4245
18110C542172Q3589J46682L01461j93500j50573j48814k60688l91183l29950k53802
$$ plain form
18100 2345394 2116215 1903073 2098061 2146443 2080621 1859061 1552569 1680697 1729628 2027862
18090 2027862 1937074 1680500 1759320 1815291 1888843 1906510 1776914 1771368 2098684 2161833 2087677
18079 2087677 1994450 1920903 1856855 1854165 1932541 1935075 2063926 2220316 2302240 2447656 2626361
18068 2626361 2547635 2239644 2575036 3132983 3428321 3763966 4000370 4132982 4351327 4459767
18058 4459767 4494471 4567479 4514891 4733746 5041668 5401048 5707236 5889059 5969887 5960432
18048 5960432 6262809 6599876 7126947 7752402 8076522 7859391 7930006 8190986 8315495 8853599
18038 8853599 9530003 9759539 10037357 10551460 11189784 12091385 12923303 13933297 15518833
18029 15518833 17438333 19758485 22586486 26865719 33091406 42871888 58547549 79062807
$$ packed form
18100B345394k29179k13142J94988M8382o5822k21560l06492J28128M8931K98234
18090B027862r0788k56574P8820N5971P3552J7667j29596n546L27316O3149p4156
18079B087677r3227p3547o4048k690P8376K534J28851J56390Q1924J45416J78705
18068B626361p8726l07991L35392N57947K95338L35645K36404J32612K18345J08440
18058D459767L4704P3008n2588K18855L07922L59380L06188J81823Q0828r455
18048E960432L02377L37067N27071O25455L24120k17131P0615K60980J24509N38104
18038H853599O76404K29536K77818N14103O38324R01601Q31918J009994J585536
18029A5518833J919500K320152K828001M279233O225687R780482J5675661K0515258
$$ plain form
18021 79062807 97156274 107078036 114544185 125324600 143144817 168432877 192032577
18014 192032577 196970843 179837517 158929745 145438815 141173753 143842459 136744853
18007 136744853 111029790 85796390 69029654 58452383 51657121 47112620 44118113
18000 44118113 42508959 41517460 41151551 41825068 43643790 46548702 51168706 59050838
17992 59050838 71569823 88968919 106667116 118036077 125875281 135443738 150799520
17985 150799520 174221713 199144504 210518578 200777897 183623098 173002652 172961738
17978 172961738 185219082 199653642 198033198 185990178 174140791 168565558 170655250
17971 170655250 181772821 200275693 215486851 210835066 188459771 167476423 154931543
$$ packed form
18021G9062807J8093467R921762P466149J0780415J7820217K5288060K3599700
18014A92032577M938266j7133326k0907772j3490930m265062K668706p097606
18007A36744853k5715063k5233400j6766736j0577271o795262m544501k994507
18000D4118113j609154r91499l65909O73517J818722K904912M620004P882132
17992E9050838J2518985J7399096J7698197J1368961P839204R568457J5355782
17985A50799520K3422193K4922791J1374074r740681j7154799j0620446m0914
17978A72961738J2257344J4434560j620444j2043020j1849387n575233K089692
17971A70655250J1117571J8502872J5211158m651785k2375295k0983348j2544880
$$ plain form
17964 154931543 150908674 150286383 137558943 113122166 91832582 77240896 67339812
17957 67339812 60290069 55497258 52074869 49851457 48327392 47425927 47437148 48322174 50708260
17948 50708260 54879501 62669961 75815158 93863563 109845887 118002787 123516081 131795552
17940 131795552 146562313 168493139 189557212 194403824 177337702 156847271 143813715
17933 143813715 138871719 140505520 134415961 112003322 89569496 74558702 65313021
17926 65313021 59206565 55187081 52568718 51452012 51468328 52427525 54850487 59590174
17918 59590174 67858974 82025319 103191281 127175419 145883840 161314544 182294312
17911 182294312 213702352 255437079 294784505 318998086 322646695 311662156 306615911
$$ packed form
17964A54931543m022869o22291j2727440k4436777k1289584j4591686r901084
17957F7339812p049743m792811l422389k223412j524065r01465J1221Q85026K386086
17948E0708260M171241P790460J3145197J8048405J5982324Q156900N513294Q279471
17940A31795552J4766761K1930826K1064073M846612j7066122k0490431j3033556
17933A43813715m941996J633801o089559k2412639k2433826j5010794r245681
17926F5313021o106456m019484k618363j116706J6316R59197K422962M739687
17918E9590174Q268800J4166345K1165962K3984138J8708421J5430704K0979768
17911A82294312L1408040M1734727L9347426K4213581L648609j0984539n046245
$$ plain form
17904 306615911 314532250 328725261 329616571 294356863 244101798 207123560 186644384
17897 186644384 176255296 159346389 130906584 105629644 88344321 76632756 68251804
17890 68251804 62235622 57604840 53962311 50606799 47821592 45695288 43817071 41708826
17882 41708826 40217679 38881718 37717184 36909725 36254085 35813851 35601208 35197855 35217082
17873 35217082 35708070 36382925 37292387 38729340 40500564 43136604 47301560 54184849
17865 54184849 65614778 83541680 106425215 126620562 141107621 157812323 183417598
17858 183417598 220088653 258896900 286674667 297292863 288945696 280414117 284351407
17851 284351407 297446918 305599424 282802337 236562561 197671335 174456573 163269637
$$ packed form
17904C06615911P916339J4193011Q91310l5259708n0255065l6978238k0479176
17897A86644384j0389088j6908907k8439805k5276940j7285323j1711565q380952
17890F8251804o016182m630782l642529l355512k785207k126304j878217k108245
17882D1708826j491147j335961j164534q07459o55640m40234k12643m03353J9227
17873C5217082M90988O74855R09462J436953J771224K636040M164956O883289
17865E4184849J1429929J7926902K2883535K0195347J4487059J6704702K5605275
17858A83417598L6671055L8808247K7777767J0618196q347167q531579L937290
17851B84351407J3095511Q152506k2797087m6239776l8891226k3214762j1186936
$$ plain form
17844 163269637 151656063 127439699 101605190 82942680 70604956 62243997 55853370
17837 55853370 50900745 47139194 43921297 41053159 38700595 36941097 35147446 33380518
17829 33380518 31702665 30055199 28682724 27368718 26192324 25311258 24419839 23537186
17821 23537186 22872928 22359949 21868612 21237888 20461753 19824924 19162073 18458527 17969251
17812 17969251 17433370 16721331 16225009 15905425 15433908 14864798 14160904 13807732 13312461
17803 13312461 13100059 12799434 12599838 12326616 11879376 11271933 10800500 10628435 10303207
17794 10303207 9918101 9723902 9419112 9086127 8991706 8834294 8463891 8087006 8041726 7964237
17784 7964237 7626429 7195121 7091559 7128629 7003450 6868763 6542111 6098630 5768291 5699944
$$ packed form
17844A63269637j1613574k4216364k5834509j8662510j2337724q360959o390627
17837E5853370m952625l761551l217897k868138k352564j759498j793651j766928
17829C3380518j677853j647466j372475j314006j176394q81066q91419q82653
17821B3537186o64258n12979m91337o30724p76135o36829o62851p03546m89276
17812A7969251n35881p12039m96322l19584m71517n69110p03894l53172m95271
17803A3312461k12402l00625j99596k73222m47240o07443m71433j72065l25228
17794A0303207l85106j94199l04790l32985r4421j57412l70403l76885m5280p7489
17784G964237l37808m31308j03562L7070j25179j34687l26652m43481l30339o8347
$$ plain form
17774 5699944 5822091 5821891 5614277 5502938 5610267 5268719 5066736 4832768 4594216 4515304
17764 4515304 4414113 4363326 4139254 4112031 4414017 4324488 3977909 3987234 3963188 3694310
17754 3694310 3710564 3794518 3747578 3462464 3265598 3048119 2949905 3003133 2841901 2964995
17744 2964995 2966529 3032485 3002299 3396337 3578292 3468114 3346394 3346512 3458272 3528620 3711426
17733 3711426 3636539 3462121 3508220 3516293 3457460 3420045 3268528 3070621 2753595 2596763
17723 2596763 2658270 2753266 2924731 2983490 2873375 2848859 2379609 2049040 2289466 2592063
17713 2592063 2666776 2500371 2561035 2485154 2025389 1742538 1812251 1564469 1611328 1624702
17703 1624702 1467035 1368204 1504099 1384427 1400857 1496066 1200621 1034465 1000950 1052855
$$ packed form
17774E699944J22147k00k07614j11339J07329l41548k01983k33968k38552p8912
17764D515304j01191n0787k24072k7223L01986q9529l46579R325k4046k68878
17754C694310J6254Q3954m6940k85114j96866k17479r8214N3228j61232J23094
17744B964995J534O5956l0186L94038J81955j10178j21720J18J11760P0348J82806
17733C711426p4887j74418M6099Q073n8833l7415j51517j97907l17026j56832
17723B596763O1507R4996J71465N8759j10115k4516m69250l30569K40426L02597
17713B592063P4713j66405O0664p5881m59765k82851O9713k47782M6859J3374
17703A624702j57667r8831J35895j19672J6430R5209k95445j66156l3515N1905
$$ plain form
17693 1052855 1281570 1536766 1474207 1345731 1451007 1674551 1734169 1680747 1720693 1912045
17683 1912045 1935323 1828039 1648662 1842800 1869427 2005344 1943177 1963864 1926735 1784456
17673 1784456 1561926 1521886 1375298 1428040 1470643 1503063 1499714 1610601 1635869 1619104 1408623
17662 1408623 1411046 1231439 1125689 1100533 949382 763333 999601 903764 809322 656653
17652 656653 537531 482269 462415 561015 662761 652817 588546 710916 768014 664320 732285
17641 732285 706008 501119 432123 561053 198705 -5251 85329 124538 256476 225943
17631 225943 326842 150725 284858 483021 434617 242515 329524 282791 149890 78981
17621 78981 145817 475475 430865 183148 40038 83524 -12901 48287 -15539 84339 110896
$$ packed form
17693A052855K28715K55196o2559j28476J05276K23544N9618n3422L9946J91352
17683A912045K3278j07284j79377J94138K6627J35917o2167K0687l7129j42279
17673A784456k22530m0040j46588N2742M2603L2420l349J10887K5268j6765k10481
17662A408623K423j79607j05750k5156j51151j86049K36268r5837r4442j52669
17652F56653j19122n5262j9854R8600J01746r944o4271J22370N7098j03694O7965
17641G32285k6277k04889o8996J28930l62348k03956R0580L9209J31938l0533
17631B25943J00899j76117J34133J98163m8404j92102Q7009m6733j32901p0909
17621G8981O6836L29658m4610k47717j43110M3486r6425O1188o3826R9878K6557
$$ plain form
17610 110896 102079 -22884 -22910 -11105 129403 253543 363565 142220 -138814 -26846 131341
17599 131341 262685 388831 588942 513285 401014 358175 481434 319325 409644 256109
17589 256109 77395 201055 273918 318462 675322 746964 587466 380261 364002 596459
17579 596459 474001 273592 376248 400160 330974 450331 208534 143205 338448 165713
17569 165713 74915 -9267 149959 134371 -33031 -86731 -27853 196533 19624 73285 35537
17558 35537 -175150 -105843 83302 264830 331274 274707 275546 266017 -1777 -82937 51571
17547 51571 263519 155693 90640 38293 89333 170906 102209 103588 150641 30217 -34624
17536 -34624 -112857 32949 -120460 -195719 47995 -62554 -147093 -135223 -86709 -18556 -62996
$$ packed form
17610A10896q817j24963k6J1805J40508J24140J10022k21345k81034J11968J58187
17599A31341J31344J26146K00111p5657j12271m2839J23259j62109R0319j53535
17589B56109j78714J23660P2863M4544L56860P1642j59498k07205j6259K32457
17579E96459j22458k00409J02656K3912o9186J19357k41797o5329J95243j72735
17569A65713r0798q4182J59226j5588j67402n3700N8878K24386j76909N3661l7748
17558C5537k10687O9307J89145J81528O6444n6567Q39r529k67794q1160J34508
17547E1571K11948j07826o5053n2347N1040Q1573o8697J379M7053j20424o4841
17536c4624p8233J45806j53409p5259K43714j10549q4539J1870M8514O8153m4440
$$ plain form
17525 -62996 -242097 -309595 17827 156746 1050 -79894 22390 59918 140784 320316
17515 320316 418901 408419 463509 375158 120724 152619 228496 394496 492649 478637 429731
17504 429731 365765 386603 230423 141830 127784 62885 254803 366272 25486 -85038
17494 -85038 -127567 -213594 93854 420322 558717 528012 499888 648933 668509 536671 570107
17483 570107 762157 626450 410256 214026 388367 306921 236202 237865 336562 271875 327315
17472 327315 172607 254063 281166 650562 616262 717411 786612 525514 325469 475130
17462 475130 708987 655919 700392 685434 665087 809246 678354 628686 541564 617453 672009
17451 672009 571917 626813 757530 855978 869122 936099 1115390 1289508 1433108 1129638
$$ packed form
17525f2996j79101o7498L27422J38919j55696q0944J02284L7528Q0866J79532
17515C20316R8585j0482N5090q8351k54434L1895P5877J66000R8153j4012m8906
17504D29731o3966K0838j56180q8593j4046o4899J91918J11469l40786j10524
17494h5038m2529q6027L07448L26468J38395l0705k8124J49045J9576j31838L3436
17483E70107J92050j35707k16194j96230J74341q1446p0719J663R8697o4687N5440
17472C27315j54708Q1456K7103L69396l4300J01149O9201k61098k00045J49661
17462D75130K33857n3068M4473j4958k0347J44159j30892m9668q7122P5889N4556
17451F72009j00092N4896J30717R8448J3144O6977J79291J74118J43600l03470
$$ plain form
17441 1129638 955904 1010093 1136151 1000769 687390 412692 480869 686752 622750 640659
17431 640659 479967 408780 735373 643123 525527 522601 335368 187404 160010 340500
17421 340500 371692 243757 278239 335140 324028 482595 580893 618357 818259 865288 836703
17410 836703 904724 790546 933730 1101515 1198059 1366627 1268622 1154649 788880 384187
17400 384187 352683 326162 355274 338167 256103 151533 53114 20454 168417 323476 363674
17389 363674 408500 530642 708299 471076 333868 392874 662944 1014539 910505 675138
17379 675138 816539 952206 1275685 1590623 1772275 1911712 1756071 1695281 1589854 1658041
17369 1658041 1663639 1259442 1108174 887418 675088 909809 687847 488255 610383 737397
$$ packed form
17441A129638j73734N4189J26058j35382l13379k74698O8177K05883o4002J7909
17431F40659j60692p1187L26593r2250j17596k926j87233j47964k7394J80490
17421C40500L1192j27935L4482N6901j1112J58567R8298L7464J99902M7029k8585
17410H36703O8021j14178J43184J67785R6544J68568r8005j13973l65769m04693
17400C84187l1504k6521K9112j7107q2064j04570r8419l2660J47963J55059M0198
17389C63674M4826J22142J77657k37223j37208N9006K70070L51595j04034k35367
17379F75138J41401J35667L23479L14938J81652J39437j55641o0790j05427O8187
17369A658041N598m04197j51268k20756k12330K34721k21962j99592J22128J27014
$$ plain form
17359 737397 510841 564080 550677 455874 539047 483410 274857 184683 -29552 149597 124146
17348 124146 158439 215605 312845 252116 171209 114690 -13934 88414 395552 222628 261580
17337 261580 141060 156830 351966 486256 322551 236461 236536 267367 588599 634141 628435
17326 628435 866976 1102231 1155640 1291551 1447935 1424736 1423014 1344978 1448760 1406030 1190170
17315 1190170 1128811 1034627 770614 753701 777806 671987 780860 716699 569453 468978
17305 468978 359344 225028 277908 162070 -117637 -142644 130331 130425 -17704 -197927 -249020
17294 -249020 -423051 -229446 -48430 93235 139259 5968 161899 225254 211021 266562
17284 266562 93810 190788 252393 277367 173657 69167 219902 235934 153142 100194 67809
$$ packed form
17359G37397k26556N3239j3403r4803Q3173n5637k08553r0174k14235J79149k5451
17348A24146L4293N7166R7240o0729q0907n6519j28624J02348L07138j72924L8952
17337B61580j20520J5770J95136J34290j63705q6090P5L0831L21232M5542n706
17326F28435K38541K35255N3409J35911J56384k3199j722p8036J03782m2730k15860
17315A190170o1359r4184k64013j6913K4105j05819J08873o4161j47246j00475
17305D68978j09634j34316N2880j15838k79707k5007K72975R4j48129j80223n1093
17294b49020j74031J93605J81016J41665M6024j33291J55931O3355j4233N5541
17284B66562j72752R6978O1605K4974j03710j04490J50735J6032q2792n2948l2385
$$ plain form
17273 67809 316429 406846 121071 -39532 84176 243486 236766 243658 29920 69296 195146
17262 195146 -53299 -178429 -172643 -162346 -200135 -154120 -211787 -252769 -179837 -20933 234801
17251 234801 237406 71537 270677 204019 126544 315597 119082 156845 103996 -104830 -140564
17240 -140564 137448 109583 310045 142193 93961 183323 267165 136691 189152 179982 298735
17229 298735 90532 -325879 -135336 -133461 -343549 -297701 -71054 -113 -29425 -244730
17219 -244730 -110505 -65446 -26866 100800 31678 130322 207226 341204 249252 83352 -114292
17208 -114292 -130955 -100117 -101361 -234966 -368002 -258154 -74527 -2225 85079 -25286 -161950
17197 -161950 35517 103190 123619 15300 -31861 -114615 -127687 -165326 -243611 -336604 -177083
$$ packed form
17273F7809K48620R0417k85775j60603J23708J59310o720O892k13738L9376J25850
17262A95146k48445j25130N786J0297l7789M6015n7667m0982P2932J58904K55734
17251B34801K605j65869J99140o6658p7475J89053j96515L7763n2849k08826l5734
17240a40564K78012k7865K00462j67852m8232Q9362Q3842j30474N2461r170J18753
17229B98735k08203m16411J90543J875k10088M5848K26647P0941k9312k15305
17219b44730J34225M5059L8580J27666o9122R8644P6904J33978r1952j65900j97644
17208a14292j6663L0838j244j33605j33036J09848J83627P2302Q7304j10365j36664
17197a61950J97467O7673K0429j08319m7161q2754j3072l7639p8285r2993J59521
$$ plain form
17186 -177083 11678 106506 -42993 -148585 -32625 -43159 -120134 -108804 44175 223937
17176 223937 182059 126054 -61838 -153413 -287831 -382239 -371020 -217912 -220532 -200421 -132364
17165 -132364 -23723 98563 237818 451417 287839 25269 -182271 -351148 -180558 11918
17155 11918 -89721 -238762 -222087 -385486 -246043 49775 140832 63139 52625 57431 -48030
17144 -48030 -242548 -433466 -513381 -499721 -604567 -744529 -493394 -364121 -245436 -260277
17134 -260277 -223674 -233310 -98911 -125949 -162174 -25489 47316 287560 139868 -214988 -212223
17123 -212223 -89740 -90833 -102587 69886 220154 314808 337046 280769 19428 -119073 63577
17112 63577 279998 374515 368441 146770 -262090 -268298 -318305 -227510 3358 131179 212986
$$ packed form
17186a77083J88761R4828j49499j05592J15960j0534p6975J1330J52979J79762
17176B23937m1878n6005j87892r1575j34418r4408J1219J53108k620K0111O8057
17165a32364J08641J22286J39255K13599j63578k62570k07540j68877J70590J92476
17155A1918j01639j49041J6675j63399J39443K95818R1057p7693j0514M806j05461
17144d8030j94518j90918p9915J3660j04846j39962K51135J29273J18685j4841
17134b60277L6603r636J34399k7038l6225J36685P2805K40244j47692l54856K765
17123b12223J22483j093j1754J72473J50268R4654K2238n6277k61341j38501J82650
17112F3577K16421R4517o074k21671m08860o208n0007R0795K30868J27821Q1807
$$ plain form
17101 212986 68727 174583 225655 189659 128932 -74438 -357360 -344504 1878 179181
17091 179181 -103971 -183790 -182521 -63856 -108011 -317389 -293453 -3707 70411 -137949 -90197
17080 -90197 -224900 -300289 -238079 -181993 -205162 -430838 -452027 -180572 -54410 -95076 34967
17069 34967 -109725 -383356 -409102 -255636 -320095 -462452 -383053 -417554 -558019 -570584 -469738
17058 -469738 -148423 -25173 -132393 -44013 116837 198731 114979 113656 70049 -258175 -474725
17047 -474725 -214354 41384 168060 24904 57365 69466 -107946 -108461 -20769 -207547 -247328
17036 -247328 -104790 -166182 -241225 -11952 157844 133160 45611 -159537 -85571 161126
17026 161126 221897 177670 205467 229602 51977 -91337 -97636 -138767 -30947 -58840 20125
$$ packed form
17101B12986j44259J05856N1072l5996o0727k03370k82922J2856L46382J77303
17091A79181k83152p9819J269J18665m4155k09378K3936K89746P4118k08360M7752
17080i0197j34703p5389O2210N6086k3169k25676k1189K71455J26162m0666J30043
17069C4967j44692k73631k5746J53466o4459j42357P9399l4501j40465j2565J00846
17058d69738L21315J23250j07220Q8380J60850Q1894q3752j323m3607l28224k16550
17047d74725K60371K55738J26676j43156L2461J2101j77412n15Q7692j86778l9781
17036b47328J42538o1392p5043K29273J69796k4684q7549k05148P3966K46697
17026A61126O0771m4227K7797K4135j77625j43314o299m1131J07820k7893P8965
$$ plain form
17015 20125 156596 236016 277083 327671 206694 157964 330493 173651 185209 313693 350990
17004 350990 247743 202213 202793 283158 303303 373518 196681 109080 246507 264849 352750
16993 352750 321093 132143 176087 136222 -59651 -50143 105505 216259 274919 317474 237996
16982 237996 55445 -28023 61672 44292 -47139 -162633 -132382 23843 -44906 -142450 -154853
16971 -154853 -225991 -412663 -366548 22409 51201 -2480 -421 -78 191138 442455 474107
16960 474107 115286 -142172 -264281 -69101 281753 270565 -52704 -260385 93246 25359
16950 25359 152298 203043 -13000 -253479 -386982 -468935 -197840 51293 143253 181331
16940 181331 170083 220708 164374 43239 269021 220546 137417 119535 188538 68342 110905
$$ packed form
17015B0125J36471P9420M1067N0588j20977m8730J72529j56842J1558J28484L7297
17004C50990j03247m5530N80Q0365K0145P0215j76837q7601J37427J8342Q7901
16993C52750l1657j88950M3944l9865j95873R508J55648J10754N8660M2555p9478
16982B37996j82551q3468Q9695j7380r1431j15494L0251J56225o8749r7544j2403
16971a54853p1138j86672M6115L88957K8792n3681K059L43J91216K51317L1652
16960D74107l58821k57458j22109J95180L50854j1188l23269k07681L53631o7887
16950B5359J26939N0745k16043k40479j33503q1953K71095K49133R1960L8078
16940A81331j1248N0625n6334j21135K25782m8475q3129j7882O9003j20196M2563
$$ plain form
16929 110905 116293 173702 416212 374592 150917 107285 138561 323617 320887 382681 75954
16918 75954 -106024 -40716 -169437 -88256 -64217 -241147 -292374 -327214 -234454 30859 57014
16907 57014 -68430 -153415 -134770 -163660 -168097 -176667 -239070 -168323 -31619 -121498 -188491 -118176
16895 -118176 19392 67519 -31667 15848 -16522 -138411 -315579 -433975 -245934 -129961
16885 -129961 -55845 -208314 -291202 -602047 -399264 -289599 -241809 -376793 -503430 -515157
16875 -515157 -467716 -104324 118624 110802 289860 327968 234282 198577 357298 320241 160082
16864 160082 73995 78050 -71138 -163291 -164948 -69324 -36069 23808 235548 169318 204073
16853 204073 107358 -11975 -153809 -272923 -70928 69734 26322 201493 389516 182511
$$ packed form
16929A10905N388N7409K42510m1620k23675m3632L1276J85056k730O1794l06727
16918G5954j81978O5308j28721Q1181K4039j76930n1227l4840R2760K65313K6155
16907E7014j25444q4985J8645k8890m437q570o2403P0747J36704q9879o6993P0315
16895a18176J37568M8127r9186M7515l2370j21889j77168j18396J88041J15973
16885a29961P4116j52469q2888l10845K02783J09665M7790j34984j26637j1727
16875e15157M7441L63392K22948p822J79058L8108r3686l5705J58721l7057j60159
16864A60082q6087M055j49188r2153j657R5624L3255N9877K11740o6230L4755
16853B04073r6715j19333j41834j19114K01995J40662m3412J75171J88023k07005
$$ plain form
16843 182511 15156 -177027 -36327 96491 -155546 -196645 -182699 25309 -53617 -194375
16833 -194375 -14334 24709 -35961 109066 26521 41644 11142 -26760 -235398 -157331 -209747
16822 -209747 -118479 -28187 -60203 60452 35254 -134160 -191590 -261194 -391828 -325526 -226208
16811 -226208 62228 -64523 -146038 -11576 80272 82201 -206650 -453014 -459326 -340807 -195892
16800 -195892 -259845 -66533 211559 84082 -172057 -468522 -608618 -598227 -272383 6770
16790 6770 -76288 -71692 -52494 -228517 -225320 -122049 8734 112326 258529 281020 242138
16779 242138 83141 56015 175573 14258 66289 69095 -87519 -244170 -242537 -232799 -445876
16768 -445876 -464318 -170199 -120263 -151052 -308995 -42678 331368 295876 132270 -159062
$$ packed form
16843A82511j67355j92183J40700J32818k52037m1099J3946K08008p8926j40758
16833a94375J80041L9043o0670J45027q2545J5123l0502l7902k08638P8067n2416
16822b09747R1268R0292l2016J20655k5198j69414n7430o9604j30634O6302R9318
16811b26208K88436j26751q1515J34462R1848J929k88851k46364o312J18519J44915
16800a95892o3953J93312K78092j27477k56139k96465j40096J0391L25844K79153
16790F770q3058M596J9198j76023L197J03271J30783J03592J46203K2491l8882
16779B42138j58997k7126J19558j61315N2031K806j56614j56651J633R738k13077
16768d45876j8442K94119M9936l0789j57943K66317L74046l5492j63606k91332
$$ plain form
16758 -159062 -498596 -568749 -247113 -198100 -42896 58867 181188 30172 -23501 -58804
16748 -58804 -32119 26735 8665 -149201 -1575 1545 -169783 -137506 -84875 -30157 -99661
16737 -99661 -61558 -63305 -13671 188027 185389 181417 -86479 -156334 88660 125080 9400
16726 9400 174730 266037 132409 109286 -108814 -246226 -210142 -325265 -205705 -118798 -132135
16715 -132135 -168384 -194206 -335188 -272979 59141 -83668 -130623 -78479 -129801 174014 207424
16704 207424 13564 -225408 -325908 -222113 -153713 -11224 -80366 -128183 -163266 -190718
16694 -190718 -240406 -20366 -97423 -171905 -186590 -119256 -138457 -164568 88738 40275 -57018
16683 -57018 -79599 -64081 -105264 -50830 -98476 71587 51471 81195 -52786 39640 22574
$$ packed form
16758a59062l39534p0153L21636M9013J55204J01763J22321j51016n3673l5303
16748e8804K6685N8854j8070j57866J47626L120j71328L2277N2631N4718o9504
16737i9661L8103j747M9634K01698k638l972k67896o9855K44994L6420j15680
16726I400J65330R1307j33628k3123k18100j37412L6084j15123J19560Q6907j3337
16715a32135l6249k5822j40982O2209L32120j42809m6955N2144n1322L03815L3410
16704B07424j93860k38972j00500J03795O8400J42489o9142m7817l5083k7452
16694a90718m9688K20040p7057p4482j4685O7334j9201k6111K53306m8463r7293
16683e7018k2581J5518m1183N4434m7646J70063k0116K9724j33981R2426j7066
$$ plain form
16672 22574 -281383 -144311 -170965 -267174 -410892 -381503 -255032 -86905 -282131 -509045
16662 -509045 -249300 -278806 -148053 167141 173153 109923 -84357 -100274 -284413 -188859 135902
16651 135902 163540 -91944 -140933 106332 -1553 -120620 60533 82460 -5232 -180005
16641 -180005 -108710 -160747 -88526 -12531 113969 -109819 -117421 -40319 -217756 -344973 -333249
16630 -333249 9291 204258 63517 -146490 -33351 42944 109180 -111525 -319930 -390706
16620 -390706 -531907 -388145 -136902 -109125 -279322 -294905 -466474 -217885 55003 -73509
16610 -73509 -40944 56325 -175543 -398295 -301779 -384409 -203581 -284403 -256917 -7039 -7515
16599 -7515 -38270 97656 225777 338469 87145 112564 268581 347549 412274 184514 6749
$$ packed form
16672B2574l03957J37072k6654r6209j43718K9389J26471J68127j95226k26914
16662e09045K59745k9506J30753L15194O012o3230j94280j5917j84139R5554L24761
16651A35902K7638k55484m8989K47265j07885j19067J81153K1927q7692j74773
16641a80005P1295n2037P2221P5995J26500k23788p602P7102j77437j27217J1724
16630c33249L42540J94967j40741k10007J13139P6295O6236k20705k08405p0776
16620c90706j41201J43762K51243K7777j70197j5583j71569K48589K72888j28512
16610g3509L2565R7269k31868k22752R6516q2630J80828q0822K7486K49878m76
16599g515l0755J35926J28121J12692k51324K5419J56017P8968O4725k27760j77765
$$ plain form
16588 6749 -84925 -135083 38174 45726 131315 -14564 -138648 -240515 -225992 -30038 -16456
16577 -16456 -177685 -260661 -218260 -255317 -292473 65899 254471 316262 101928 -112075 -221280
16566 -221280 -264417 -192644 -10034 -10857 119890 -47604 51298 188387 168609 176382 218850
16555 218850 295664 228365 143526 282897 46184 -220067 -154194 -75515 122055 -12506
16545 -12506 -202469 -272816 -298215 -245239 -232988 -207605 -116640 -72751 18278 -13758 -39696
16534 -39696 -104988 -195255 -291165 -363384 -97168 114967 194549 46593 -75504 104271 290195
16523 290195 255125 -22164 -416145 -284794 -148808 -108872 44902 126369 82517 804
16513 804 53733 -57343 -301483 -203268 -109205 -157066 -286216 4387 70727 -21020 -237146
$$ packed form
16588F749r1674n0158J73257P552Q5589j45879j24084j01867J4523J95954J3582
16577a6456j61229q2976M2401l7057l7156L58372J88572O1791k14334k14003j09205
16566b21280m3137P1773J82610q23J30747j67494R8902J37089j9778P773M2468
16555B18850P6814o7299q4839J39371k36713k66251O5873P8679J97570j34561
16545a2506j89963p0347k5399N2976J2251K5383R0965M3889R1029l2036k5938
16534c9696o5292r0267r5910p2219K66216K12135P9582j47956j22097J79775J85924
16523B90195l5070k77289l93981J31351J35986L9936J53774Q1467m3852q1713
16513H04N2929j11076k44140R8215R4063m7861j29150K90603O6340r1747k16126
$$ plain form
16502 -237146 -322090 -24512 -187999 -312110 -319924 -272217 -87754 196045 129869 -148094
16492 -148094 -80836 142604 -38531 -96520 -10624 -60784 5357 80070 -69193 -183603 -99237
16481 -99237 -21706 -233702 -268992 -272450 -199227 -199002 -70918 -71797 -340091 -104455 123250 103820
16469 103820 13111 399681 713581 634915 300321 9345 -8462 -78914 -318224 -241688
16459 -241688 -67981 188125 -38703 -144700 -178259 -36594 -92239 -271265 -161146 -144058
16449 -144058 -32709 72993 46896 -108943 35017 162120 189251 175988 -1801 -153842
16439 -153842 5137 151898 290757 109257 -162819 -176104 -230158 -540034 -422563 -367418
16429 -367418 -313245 -192762 -40998 -2513 -208100 -237357 -242922 -175703 -19063 49303 144759
$$ packed form
16502b37146q4944K97578j63487j24111p814M7707J84463K83799o6176k77963
16492a48094O7258K23440j81135n7989Q5896n0160O6141P4713j49263j14410Q4366
16481i9237P7531k11996l5290l458P3223K25J28084q79k68294K35636K27705j9430
16469A03820r0709L86570L13900p8666l34594k90976j7807p0452k39310P6536
16459b41688J73707K56106k26828j05997l3559J41665n5645j79026J10119J7088
16449a44058J11349J05702k6097j55839J43960J27103K7131j3263j77789j52041
16439a53842J58979J46761J38859j81500k72076j3285n4054l09876J17471N5145
16429c67418N4173J20483J51764L8485k05587k9257n565O7219J56640O8366R5456
$$ plain form
16418 144759 54490 140608 311995 355152 189772 -139121 -130911 -62549 -106704 -219154 -338059
16407 -338059 -396130 -641839 -585567 -432578 -234964 -170661 -196032 -63822 -53156 93706
16397 93706 33990 -140420 -313747 -438643 -268331 -286140 -59613 149661 61398 -192220
16387 -192220 -144193 35845 112292 136180 158642 295916 255521 254691 263321 140121 -306834
16376 -306834 -370382 -156250 -156815 -113709 -162859 -58661 -452 -34053 -111713 -335071 -233083
16365 -233083 -205248 -78570 18057 -77790 -224908 -314717 13189 63676 105904 92502 51768
16354 51768 155771 131995 123319 95727 188953 231753 25984 -70935 -128134 -240505 -216550
16343 -216550 -83607 12999 -117225 -237469 -248766 -109074 -63201 -132646 -475129 -632652
$$ packed form
16418A44759r0269Q6118J71387M3157j65380l28893Q210O8362m4155j12450j18905
16407c38059n8071k45709N6272J52989J97614O4303k5371J32210J0666J46862
16397I3706n9716j74410j73327j24896J70312j7809K26527K09274q8263k53618
16387a92220M8027J80038P6447K3888K2462J37274m0395q30Q630j23200m46955
16376c06834o3548K14132n65M3106m9150J04198N8209l3601p7660k23358J01988
16365b33083K7835J26678R6627r5847j47118q9809L27906N0487M2228j3402m0734
16354E1768J04003k3776q676k7592R3226M2800k05769r6919n7199j12371K3955
16343b16550J32943R6606j30224j20244j1297J39692M5873o9445l42483j57523
$$ plain form
16333 -632652 -773423 -646012 -482812 -314526 -311101 -215852 -252538 -234112 -155412 -94965 -80826
16322 -80826 -153919 -214365 -377725 -408010 -309752 -170527 24781 -86458 -13550 202778 -86921
16311 -86921 -249155 -289373 -352345 -188900 -328042 -488715 -308771 -61089 101694 196744
16301 196744 -102315 -313220 -201484 -20544 4954 60613 77312 -13302 -199422 -253662
16291 -253662 -248507 -362610 -457528 -303895 -86738 89790 86381 66417 162109 223440 172148
16280 172148 120877 149807 270946 294962 61312 -111714 -270575 -115274 -49603 184121
16270 184121 105277 -186683 -132040 -18608 -21910 -23023 112759 -7409 -36788 60437 93554
16259 93554 148267 394196 520262 432920 141997 -4495 -131217 -101540 130468 54415
$$ packed form
16333f32652j40771J27411J63200J68286L425R5249l6686J8426P8700O0447J4139
16322h0826p3093o0446j63360l0285R8258J39225J95308j11239P2908K16328k89699
16311h6921j62234m0218o2972J63445j39142j60673J79944K47682J62783R5050
16301A96744k99059k10905J11736J80940K5498N5659J6699r0614j86120n4240
16291b53662N155j14103r4918J53633K17157J76528l409j9964R5692O1331n1292
16280A72148n1271K8930J21139K4016k33650j73026j58861J55301O5671K33724
16270A84121p8844k91960N4643J13432l302j113J35782j20168k9379R7225L3117
16259I3554N4713K45929J26066q7342k90923j46492j26722K9677K32008p6053
$$ plain form
16249 54415 68169 -28384 -136319 -188455 -338642 -510205 -387560 -178589 -62651 -335598
16239 -335598 -163106 -43264 21453 82996 142263 126795 12836 -48935 -61190 -336018 -583109
16228 -583109 -511310 -269516 -247181 -274740 -129114 -133129 -280319 -52992 -29213 57360 -23933
16217 -23933 -69902 -69473 -42704 20938 39055 -74286 -135380 -173250 -232744 -31404 150290
16206 150290 176925 104437 -179587 -198147 -189120 -322446 -194833 -109013 -140231 -263563 -213011
16195 -213011 -47114 -157470 -247145 -110901 95912 219554 -39911 -186353 -244848 -203239
16185 -203239 -301465 -266841 -163982 71839 147752 202879 -104499 -50636 -12820 -237230 -290593
16174 -290593 -375732 -273463 -201477 -171759 -284633 -297043 -329866 -325568 -89178 -78699 -235212
$$ packed form
16249E4415J3754r6553j07935n2136j50187j71563J22645K08971J15938k72947
16239c35598J72492J19842O4717O1543N9267j5468j13959o1771j2255k74828k47091
16228e83109P1799K41794K2335k7559J45626m015j47190K27327K3779Q6573q1293
16217b3933m5969M29K6769O3642J8117j13341o1094l7870n9494K01340J81694
16206A50290K6635p2488k84024j8560R027j33326J27613Q5820l1218j23332N0552
16195b13011J65897j10356q9675J36244K06813J23642k59465j46442n8495M1609
16185b03239r8226L4624J02859K35821P5913N5127l07378N3863L7816k24410n3363
16174b90593q5139J02269P1986K9718j12874j2410l2823M298K36390J0479j56513
$$ plain form
16163 -235212 -386782 -464195 -599906 -527678 -229399 -85387 154891 405069 123776 54501
16153 54501 -282328 -226224 115627 280417 274530 156623 -132558 -213360 -123764 -30615 137085
16142 137085 13213 -108024 -260589 -88809 39218 -202711 -286597 -338201 -257733 -70968
16132 -70968 -87567 -76959 -205938 -256023 -358124 -459008 -288961 -71490 -205587 -409321
16122 -409321 -298493 -204129 -360603 -324767 -77309 -221289 -312219 -224050 7435 -79145
16112 -79145 -280492 -144052 -18622 47409 256303 282772 119100 -131587 -322260 -377069
16102 -377069 -212009 -78747 -63762 -106274 2923 74563 21945 -53253 -181217 -256662 -60740
16091 -60740 -160632 -343419 -385324 -466137 -497712 -194800 13331 -19980 -137813 -309327 -255172
$$ packed form
16163b35212j51570p7413j35711P2228K98279J44012K40278K50178k81293o9275
16153E4501l36829N6104L41851J64790n887j17907k89181q0802Q9596R3149J67700
16142A37085j23872j21237j52565J71780J28027k41929q3886n1604Q0468J86765
16132g0968j6599J0608j28979n0085j02101j00884J70047K17471j34097k03734
16122d09321J10828R4364j56474L5836K47458j43980r0930Q8169K31485q6580
16112g9145k01347J36440J25430O6031K08894K6469j63672k50687j90673n4809
16102c77069J65060J33262J4985m2512J09197P1640n2618p5198j27964p5445J95922
16091f0740r9892j82787m1905q0813l1575L02912K08131l3311j17833j71514N4155
$$ plain form
16080 -255172 -225770 -187455 -59890 -98043 -41587 -17753 -8978 -67747 -15406 105864 302213
16069 302213 383089 164887 -7667 -237717 -434738 -240277 -95264 45975 70387 81853
16059 81853 190192 300177 438002 480581 314248 237336 531582 347784 120127 -44192
16049 -44192 4375 48120 -302496 -325684 -251825 -136139 131 180976 227742 179087 97567
16038 97567 55010 106700 118504 -6272 -122754 -192906 -121989 -93183 -27710 -23716 -110535
16027 -110535 -217000 -254652 -235122 -45777 291909 278435 107641 33854 76584 255873
16017 255873 284834 235566 170813 -5139 3106 -51124 -262988 144075 356342 182000 178437
16006 178437 61104 -169583 -392410 -149879 -28560 81597 306666 458615 400668 125430
$$ packed form
16080b55172K9402L8315J27565l8153N6456K3834Q775n8769N2341J21270J96349
16069C02213Q0876k18202j72554k30050j97021J94461J45013J41239K4412J1466
16059H1853J08339J09985J37825M2579j66333p6912K94246j83798k27657j64319
16049d4192M8567M3745l50616k3188P3859J15686J36270J80845M6766m8655q1520
16038I7567m2557N1690J1804j24776j16482p0152P0917K8806O5473L994q6819
16027a10535j06465l7652J9530J89345L37686j3474j70794p3787M2730J79289
16017B55873K8961m9268o4753j75952Q245n4230k11864M07063K12267j74342l563
16006A78437j17333k30687k22827K42531J21319J10157K25069J51949n7947k75238
$$ plain form
15996 125430 134975 35171 -68610 -73399 -198968 -287183 -285221 -229057 -134541 -77434 -95113 -272737
15984 -272737 -417322 -308656 -43286 -192771 -396287 -61631 134154 26332 -10552 11990
15974 11990 40059 149653 134637 86475 -14744 -262698 -210798 -216639 -49034 342215 575088
15963 575088 494238 181113 -177792 -195194 -9593 157497 93891 190072 19824 -977
15953 -977 79430 103751 194024 244389 78787 -42038 21356 -64593 -41930 45211 -375 -29140
15941 -29140 -93246 -318290 -311000 -186967 -127876 -160519 -262885 -319646 -132528 33460 30719
15930 30719 151965 268419 121116 -140763 -91964 -93554 73949 -91952 -147161 -148855 -227084
15919 -227084 -192638 -11349 1653 212079 365464 230808 52941 116101 16561 -20686
$$ packed form
15996A25430R545r9804j03781m789j25569q8215J962N6164R4516N7107j7679j77624
15984b72737j44585J08666K65370j49485k03516L34656J95785j07822l6884K2542
15974A1990K8069J09594j5016m8162j01219k47954N1900n841J67605L91249K32873
15963E75088q0850l13125l58905j7402J85601J67090o3606R6181j70248k0801
15953i77Q0407K4321R0273N0365j65602j20825O3394q5949K2663Q7141m5586k8765
15941b9140o4106k25044P290J24033N9091l2643j02366n6761J87118J65988k741
15930C0719J21246J16454j47303k61879M8799j590J67503j65901n5209j694p8229
15919b27084L4446J81289J3002K10426J53385j34656j77867O3160r9540l7247
$$ plain form
15909 -20686 -3186 -36480 -381302 -480693 -419054 -177360 58804 116602 215149 443668 508137
15898 508137 565973 461638 213889 62636 293354 547097 564501 576886 572500 444084
15888 444084 451950 194160 196755 207035 215061 101950 295528 185646 103486 95399 213985
15877 213985 217883 315418 411132 520695 258866 116030 193346 233878 -66159 -236904 -143961
15866 -143961 -6036 -168211 -375348 -477372 -175325 -263979 -230687 31094 17793 -251538
15856 -251538 -326304 -451870 -369646 -260696 -47831 90017 117410 33618 155803 191280
15846 191280 54200 44305 12164 21967 39696 71364 93838 -27275 -88877 -86366 -74681 -376675
15834 -376675 -362867 -153851 -36465 -115586 -264434 -342602 -300656 -343603 -378507 -310604 -344363
$$ packed form
15909b0686J7500l3294l44822r9391O1639K41694K36164N7798R8547K28519O4469
15898E08137N7836j04335k47749j51253K30718K53743J7404J2385m386j28416
15888D44084P866k57790K595J0280Q026j13111J93578j09882q2160q087J18586
15877B13985L898R7535R5714J09563k61829j42836P7316M0532l00037j70745R2943
15866a43961J37925j62175k07137j02024L02047q8654L3292K61781j3301k69331
15856b51538p4766j25566Q2224J08950K12865J37848K7393q3792J22185L5477
15846A91280j37080r895l2141R803J7729L1668K2474j21113o1602K511J1685l01994
15834c76675J3808K09016J17386p9121j48848p8168M1946m2947l4904O7903l3759
$$ plain form
15823 -344363 -249508 -312993 -265072 -199489 -256870 -110873 -184957 -94971 -177040 -101095 -45120
15812 -45120 -79484 194457 -61035 -289085 -338225 -188822 -248650 -72448 63298 -271351
15802 -271351 -252381 -139077 -60334 2793 -185607 -119499 12249 361967 572672 567178 147699
15791 147699 -48990 -84526 -277136 -233346 -96350 80767 226802 30287 -214032 -59341
15781 -59341 14378 65517 308786 465449 401484 302901 380623 386525 240803 173866 170449
15770 170449 236745 179027 279341 510151 559260 537389 435286 463062 806858 1030942
15760 1030942 1259113 1410994 1618768 1965728 2439990 3328207 5037741 7877233 12606378
15751 12606378 17368194 19250764 19236441 19218167 19287907 19618134 21072423 24204978 23270045
$$ packed form
15823c44363R4855o3485M7921O5583n7381J45997p4084Q9986q2069P5945N5975
15812d5120l4364K73941k55492k28050m9140J49403n9828J76202J35746l34649
15802b71351J8970J13304P8743O3127j88400O6108J31748L49718K10705n494m19479
15791A47699j96689l5536j92610M3790J36996J77117J46035j96515k44319J54691
15781e9341P3719N1139K43269J56663o3965r8583P7722N902j45722o6937l417
15770A70449O6296n7718J00314K30810M9109k1871j02103K7776L43796K24084
15760A030942K28171J51881K07774L46960M74262Q88217J709534K839492M729145
15751A2606378M761816J882570j4323j8274O9740L30227J454289L132555r34933
$$ plain form
15742 23270045 16884628 11170501 7844856 6041582 4943592 4124616 3504369 3119753
15734 3119753 2981046 2611571 2242475 2162971 2037601 1907032 1681394 1662169 1755729 1387510
15724 1387510 1175510 1101097 1233294 1221173 776728 691202 634176 798435 953451 917555
15714 917555 994262 758756 562932 743199 662333 575344 646516 890475 933421 852490 668409
15703 668409 661517 656992 598101 239720 302146 331685 234094 347104 461733 545883 321844
15692 321844 156363 115611 138969 78185 90071 198270 279808 108788 -72982 97943
15682 97943 199628 -2586 -76561 -205872 -17130 201264 156546 190610 466010 520482
15672 520482 404620 163406 270411 379514 224082 123943 -147025 -339089 -8774 380713
$$ packed form
15742B3270045o385417n714127l325645j803274j097990q18976o20247l84616
15734C119753j38707l69475l69096p9504j25370j30569k25638j9225R3560l68219
15724A387510k12000p4413J32197j2121m44445q5526n7026J64259J55016l5896
15714I17555P6707k35506j95824J80267q0866q6989P1172K43959M2946q0931j84081
15703F68409o892m525n8891l58381O2426K9539r7591J13010J14629Q4150k24039
15692C21844j65481m0752K3358o0784J1886J08199Q1538j71020j81770J70925
15682I7943J01685k02214p3975j29311J88742K18394m4718L4064K75400N4472
15672E20482j15862k41214J07005J09103j55432j00139k70968j92064L30315L89487
$$ plain form
15662 380713 669012 472676 183196 -6012 254810 367800 184031 228933 344147 370336
15652 370336 426892 250152 276238 343521 223470 148884 -96175 -156706 96895 319358
15642 319358 413303 170686 101994 74648 -77065 20157 166676 288992 225972 305221 358791
15631 358791 101949 -186358 -224843 23804 109450 102042 112734 18364 -233596 -178192 -83615
15620 -83615 47481 51340 -37074 -154873 -98294 -42463 -144208 107255 365033 171112 -128361
15609 -128361 -172748 -233853 -169624 -191175 182776 185530 168771 129081 137685 121635 180134 29338
15597 29338 76326 23868 -173158 -226682 -257330 -136848 -14748 100856 -56628 -188754
15587 -188754 -43350 -15325 -206191 -138591 -140788 -95281 104344 286626 283273 226490 89166
$$ packed form
15662C80713K88299j96336k89480j89208K60822J12990j83769M4902J15214K6189
15652C70336N6556j76740K6086O7283j20051p4586k45059o0531K53601K22463
15642C19358R3945k42617o8692k7346j51713R7222J46519J22316o3020P9249N3570
15631C58791k56842k88307l8485K48647Q5646p408J0692r4370k51960N5404R4577
15620h3615J31096L859q8414j17799N6579N5831j01745K51463K57778j93921k99473
15609a28361m4387o1105O4229k1551L73951K754j6759l9690Q604j6050N8499j50796
15597B9338M6988n2458j97026n3524l0648J20482J22100J15604j57484j32126
15587a88754J45404K8025j90866O7600k197M5507J99625J82282l353n6783j37324
$$ plain form
15576 89166 -119067 8640 150002 199222 244780 250070 -72648 -187435 -77135 -14804 -33
15565 -33 -69453 -63600 -131295 -161625 -65410 -31567 -135700 -71033 -139872 -157679 26986 115123
15553 115123 -146073 -272177 -77815 -107874 -184284 -171531 -247495 -319786 -194766 215306
15543 215306 299192 146283 66295 119636 -86110 -29423 102622 -28059 8113 77595 56985
15532 56985 -59539 -138213 154015 96554 154605 220218 3764 -91868 -98043 75248 232131
15521 232131 156921 12184 -114567 -279415 -367545 -352498 -258060 -158798 -45365 31537 152932
15510 152932 160845 -43847 -234561 -168214 -269251 -321417 -385328 -422435 -616046 -659691 -709258
15499 -709258 -716286 -681407 -457471 -328634 -270815 -134584 -181423 -284478 -284883 -355122 -383982
$$ packed form
15576H9166k08233J27707J41362M9220M5558N290l22718j14787J10300O2331J4771
15565c3o9420N853o7695l0330R6215L3843j04133O4667o8839j7807J84665Q8137
15553A15123k61196j26104J94362l0059p6410J2753p5964p2291J25020M10072
15543B15306Q3886j52909p9988N3341k05746N6687J32045j30681L6172O9482k0610
15532E6985j16524p8674K92228n7461N8051O5613k16454r5632o175J73291J56883
15521B32131p5210j44737j26751j64848q8130J5047R4438R9262J13433P6902J21395
15510A52932P913k04692j90714O6347j01037n2166o3911l7107j93611m3645m9567
15499g09258p028L4879K23936J28837N7819J36231m6839j03055m05p0239k8860
$$ plain form
15488 -383982 -227591 -209664 -232620 -21325 -44814 -6900 72035 98517 111091 40025 44003
15477 44003 -65030 -342719 -214525 -40816 49348 132266 172109 247910 161740 82256 88556
15466 88556 63279 -33257 -240643 -348110 -170947 -1776 94986 -85564 -381881 -395006
15456 -395006 -602692 -496647 -199778 -106793 -154324 -128726 -48138 -147829 -293433 -204866 -6
15445 -6 -87940 -138792 88247 108059 -216822 -262692 -387029 -224619 -88537 -98380 42585
15434 42585 119283 153610 41981 -243218 -305840 -185778 -263636 102778 158857 -151611 -116033
15423 -116033 -94527 -54042 -67725 50982 -185255 -199316 -197767 -273327 -258096 -217425 -214807
15412 -214807 -199175 -185718 -42314 107049 141495 220210 254684 143881 -53172 -228636
$$ packed form
15488c83982J56391J7927k2956K11295k3489L7914P8935K6482J2574p1066L978
15477D4003j09033k77689J28194J73709R0164Q2918L9843P5801q6170p9484O300
15466H8556k5277r6536k07386j07467J77163J69171R6762j80550k96317j3125
15456c95006k07686J06045K96869R2985m7531K5598Q0588r9691j45604Q8567K04860
15445fq7934n0852K27039J9812l24881m5870j24337J62410J36082r843J40965
15434D2585P6698L4327j11629k85199o2622J20062p7858L66414N6079l10468L5578
15423a16033K1506M0485j3683J18707k36237j4061J549p5560J5231M0671K618
15412b14807J5632J3457J43404J49363L4446P8715L4474j10803j97053j75464
$$ plain form
15402 -228636 -325260 -403172 -183709 -37630 31906 127508 46601 12754 52280 -33215 -192396
15391 -192396 -164945 29218 210030 313842 259656 329517 438989 324885 158142 100775
15381 100775 56775 36963 -4512 -75102 9575 -47142 -221821 -84006 182430 198721 287994
15370 287994 246094 -8062 -78416 89927 20139 30851 82282 68041 17719 10022 -43378
15359 -43378 -76434 -384249 -322462 -148085 -175278 -126303 -451824 -687093 -587047 -461253
15349 -461253 -440488 -134342 54912 13616 -71045 -116348 -65115 45212 -87268 -251829
15339 -251829 -192274 -401872 -356020 -266466 -126205 -186264 -233333 -63731 -139536 -359556 -226200
15328 -226200 -57313 -30259 17797 63457 127590 235427 236573 201267 167472 252823 168248
$$ packed form
15402b28636r6624p7912K19463J46079O9536R5602q0907l3847L9526q5495j59181
15391a92396K7451J94163J80812J03812n4186O9861J09472j14104j66743n7367
15381A00775m4000j9812m1475p0590Q4677n6717j74679J37815K66436J6291Q9273
15370B87994m1900k54156p0354J68343o9788J0712N1431j4241n0322p697n3400
15359d3378l3056l07815O1787J74377k7193M8975l25521k35269J00046J25794
15349d61253K0765L06146J89254m1296q4661m5303N1233J10327j32480j64561
15339b51829N9555k09598M5852Q9554J40261o0059m7069J69602p5805k20020J33356
15328b26200J68887K7054M8056M5660O4133J07837J146l5306l3795Q5351q4575
$$ plain form
15317 168248 9041 70842 -62998 -86026 -84107 -327196 -268811 -311993 -90742 -169131 -220366
15306 -220366 -112740 -131895 -193944 -186799 -242825 -523810 -466137 -300613 -398240 -350369 -104518
15295 -104518 204154 369664 162558 3144 -123410 -273379 -80349 -250685 -368125 -185707
15285 -185707 -78034 -403756 -313789 -188808 67142 524410 543640 464573 397949 299557
15275 299557 145770 35942 42213 253565 263829 87740 227499 371726 339717 102873
15265 102873 16835 47540 14339 191905 261586 181700 65930 99734 139663 65381 20454
15254 20454 -53848 -214585 -337155 -317308 -331099 -220550 -138088 -135022 5506 66243 49669
15243 49669 -94707 -221666 -251858 -313696 -158837 101895 42672 11667 -29572 -84475 87466
$$ packed form
15317A68248j59207O1801j33840k3028J919k43089N8385m3182K21251p8389n1235
15306b20366J07626j9155o2049P145n6026k80985N7673J65524r7627M7871K45851
15295a04518L08672J65510k07106j59414j26554j49969J93030j70336j17440J82418
15285a85707J07673l25722Q9967J24981K55950M57268J9230p9067o6624r8392
15275B99557j53787j09828O271K11352J0264j76089J39759J44227l2009k36844
15265A02873q6038L0705l3201J77566O9681p9886j15770L3804L9929p4282m4927
15254B0454p4302j60737j22570J9847j3791J10549Q2462L066J40528O0737j6574
15243D9669j44376j26959l0192o1838J54859K60732n9223l1005m1239n4903J71941
$$ plain form
15232 87466 378357 388134 397103 148295 -173082 -112504 23844 227138 296464 197876 106778
15221 106778 65439 -37107 -28301 -282926 -182964 168346 99415 -254163 -365438 -226288
15211 -226288 -76446 -144897 -287211 -230943 -406664 -349946 -239136 -62699 112083 371637
15201 371637 340323 225788 263723 132961 199290 41696 -76632 -134607 -227411 -244475 -385613
15190 -385613 -430472 -211005 54451 50806 -95819 -127687 -255326 -371729 -451758 -686754
15180 -686754 -578323 -329090 -114832 69576 -86203 -290169 -202689 42872 337347 414644
15170 414644 189996 38579 -224296 -312766 -205597 116651 199087 8281 99500 -15968
15160 -15968 -94052 -34283 -60478 74712 151216 -20047 -111330 -85588 -224988 -182435 -122774
$$ packed form
15232H7466K90891R777Q969k48808l21377O0578J36348K03294O9326r8588r1098
15221A06778m1339j02546Q806k54625R9962L51310o8931l53578j11275J39150
15211b26288J49842o8451j42314N6268j75721N6718J10810J76437J74782K59554
15201C71637l1314j14535L7935j30762O6329j57594j18328n7975r2804j7064j41138
15190c85613m4859K19467K65456l645j46625l1868j27639j16403q0029k34996
15180f86754J08431K49233K14258J84408j55779k03966Q7480K45561K94475P7297
15170D14644k24648j51417k62875q8470J07169L22248Q2436j90806R1219j15468
15160a5968p8084N9769k6195J35190P6504j71263r1283K5742j39400M2553N9661
$$ plain form
15149 -122774 -41401 -61701 -93336 -215911 -104546 40009 108931 207906 79212 -74239
15139 -74239 -168939 24685 157691 -11398 -369568 -311746 -336101 -313535 -278652 -11971 165186
15128 165186 281596 428399 246725 359452 583509 747491 709531 460534 358404 261077
15118 261077 179694 357829 456318 474963 364203 324221 115812 186698 320946 280068 75798
15107 75798 -20002 -82063 -89590 -262771 -317091 -156721 95069 108424 12648 5595 -5139
15096 -5139 48812 -33591 -306015 -309891 -168351 20446 159251 195685 240932 181943 318
15085 318 -3143 -12223 87393 54656 157684 72182 270026 181262 125843 -29825 -38976 -94611
15073 -94611 -17003 -148382 -177820 -168012 -201952 -313049 -135142 -278217 -536588 -495341 -372061
$$ packed form
15149a22774Q1373k0300l1635j22575J11365J44555O8922R8975j28694j53451
15139g4239r4700J93624J33006j69089l58170N7822k4355K2566L4883K66681J77157
15128A65186J16410J46803j81674J12727K24057J63982l7960k48997j02130r7327
15118B61077q1383J78135R8489J8645j10760l9982k08409P0886J34248m0878k04270
15107G5798r5800o2061p527j73181n4320J60370K51790J3355r5776p053j0734
15096e139N3951q2403k72424l876J41540J88797J38805L6434M5247n8989j81625
15085C18l461r080R9616l2737J03028q5502J97844q8764n5419j55668r151n5635
15073i4611P7608j31379k9438R808l3940j11097J77907j43075k58371M1247J23280
$$ plain form
15062 -372061 -307181 -189013 -296690 -385811 -373463 -534675 -612505 -537561 -373992 -230249
15052 -230249 -83885 132206 22288 79993 -147911 -29153 188195 224303 104192 -92051
15042 -92051 -173563 204811 130076 64419 -43963 -50111 -81358 -65405 150908 118327 134354
15031 134354 -36435 13290 88776 -42178 -99895 -151512 -92132 -226853 -233506 -51688 111136
15020 111136 -17326 -73694 -75811 -131086 927 335766 493728 265733 138112 123125
15010 123125 65810 197307 -79127 -261333 -338590 -428424 -335448 -209596 -202431 -50290 -38231
14999 -38231 -395092 -496771 -508247 -529459 -291448 -113338 -203321 -106812 -163142 -370725 -346021
14988 -346021 -240418 -170963 -165325 -203316 -395507 -435132 -442328 -467089 -489987 -498000 -274820
$$ packed form
15062c72061O4880J18168j07677q9121J2348j61212p7830P4944J63569J43743
15052b30249J46364K16091j09918N7705k27904J18758K17348L6108j20111j96243
15042i2051q1512L78374p4735o5657j08382o148l1247J5953K16313l2581J6027
15031A34354j70789M9725P5486j30954n7717n1617N9380j34721o653J81818J62824
15020A11136j28462n6368k117n5275J32013L34839J57962k27995j27621j4987
15010A23125n7315J31497k76434j82206p7257q9834R2976J25852P165J52141J2059
14999c8231l56861j01679j1476k1212K38011J78110q9983R6509n6330k07583K4704
14988c46021J05603O9455N638l7991j92191l9625p196k4761k2898q013K23180
$$ plain form
14977 -274820 -277904 -270354 32138 51034 -107604 63652 216952 56860 67447 98558 12857
14966 12857 106898 93331 -102601 -69841 166454 244815 -88628 -363569 -157374 221316
14956 221316 29899 -56906 75367 233462 255648 261297 268375 260613 456024 643945 412697
14945 412697 326115 168622 319306 179206 29210 255727 351065 92549 97562 179269
14935 179269 -114138 -129450 -269575 -123031 178428 113833 158149 470177 732090 680149
14925 680149 414448 337115 202435 205839 42701 -17385 -13486 -85708 26244 -21294 34664
14914 34664 -3945 -109553 -151290 -119978 -50917 -165258 -85714 167758 173182 283575 245951
14903 245951 38688 -194624 -223795 -88231 -160880 -304003 -300297 -182490 -201915 -224227 -224902
$$ packed form
14977b74820l084P550L02492J8896j58638J71256J53300j60092J0587L1111q5701
14966A2857R4041j3567j95932L2760K36295P8361l33443k74941K06195L78690
14956B21316j91417q6805J32273J58095K2186N649P078p762J95411J87921k31248
14945D12697q6582j57493J50684j40100j49996K26517R5338k58516N013Q1707
14935A79269k93407j5312j40125J46544L01459o4595M4316L12028K61913n1941
14925F80149k65701p7333j34680L404j63138o0086L899p2222J11952m7538N5958
14914C4664l8609j05608m1737L1312O9061j14341P9544K53472N424J10393l7624
14903B45951k07263k33312k9171J35564p2649j43123L706J17807j9425k2312o75
$$ plain form
14892 -224902 -331207 -381961 -227297 -248568 -365488 -393340 -316677 -211211 -141649 -162771 -243607
14881 -243607 -259231 -62246 -1927 93512 189655 180092 174068 328654 315247 7700 -241566
14870 -241566 2419 69632 65397 29508 156183 -34678 -169683 -126440 -120700 18876 66702
14859 66702 -136291 -317128 -226355 -199794 -58361 -53863 -92950 -152609 8774 110793 131522
14848 131522 53910 62580 -91306 -277156 -187755 -138249 -267184 -614701 -721807 -553545
14838 -553545 -450569 -439137 -377451 -254147 -241220 -169290 -90423 61466 128410 -86915 -27748
14827 -27748 94098 79728 -117711 -244812 -297928 -27817 109967 173747 237920 241220 152210
14816 152210 77333 -16032 -66376 135746 101883 -61768 -274931 -454420 -330906 -216131
$$ packed form
14892b24902j06305n0754J54664k1271j16920k7852P6663J05466O9562k1122q0836
14881b43607j5624J96985O0319R5439R6143r563o024J54586j3407l07547k49266
14870b41566K43985O7213m235l5889J26675j90861j35005M3243N740J39576M7826
14859F6702k02993j80837R0773K6561J41433M498l9087n9659J61383J02019K0729
14848A31522p7612Q670j53886j85850Q9401M9506j28935l47517j07106J68262
14838e53545J02976J1432O1686J23304J2927P1930P8867J51889O6944k15325N9167
14827b7748J21846j4370j97439j27101n3116K70111J37784O3780O4173L300q9010
14816A52210p4877r3365n0344K02122l3863j63651k13163j79489J23514J14775
$$ plain form
14806 -216131 -167258 -110330 -281963 -579650 -613728 -677809 -595697 -568556 -889610 -1002264 -862037
14795 -862037 -509556 -311895 -280039 -320615 -265480 -232409 -288060 -288104 -283035 -244325 -101282 -154501
14783 -154501 -277470 -273538 -393972 -235214 -274950 -366614 -248129 -242138 -313630 -383033 -307347
14772 -307347 -85693 183338 61568 -63239 -120033 -109169 133810 360458 388208 267751
14762 267751 10570 -42008 -108774 -372419 -531356 -352388 -270387 -45402 -104584 -276191
14752 -276191 -209566 -260642 -182755 -144797 -85714 -6383 -13909 -59087 -3523 177998 426434
14741 426434 151918 -94082 -224742 -50706 153268 -28290 -194438 4475 -18658 -197346
14731 -197346 -312531 -88751 -40908 -150405 -401124 -358099 -160940 90649 106431 158082
$$ packed form
14806b16131M8873N6928j71633k97687l4078o4081Q2112K7141l21054j12654J40227
14795h62037L52481J97661L1856m0576N5135L3071n5651m4N069L8710J43043n3219
14783a54501j22969L932j20434J58758l9736r1664J18485N991p1492o9403P5686
14772c07347K21654K69031j21770j24807n6794J0864K42979K26648K7750j20457
14762B67751k57181n2578o6766k63645j58937J78968Q2001K24985n9182j71607
14752b76191O6625n1076P7887L7958N9083P9331p526m5178N5564J81521K48436
14741D26434k74516k46000j30660J74036K03974j81558j66148J98913k3133j78688
14731a97346j15185K23780M7843j09497k50719M3025J97159K51589J5782N1651
$$ plain form
14721 158082 143797 -115531 -206902 -166558 -127336 -249829 -148297 -112004 -121625 -167100 -61842
14710 -61842 -128765 -292918 -456498 -449073 -234165 -70742 -216914 -281072 96710 214962
14700 214962 108839 -63570 -191855 -251238 -227029 -244688 -305703 -339570 -412664 -219431 -327079
14689 -327079 -202624 -129529 88501 209553 183606 200145 337457 332470 30787 -281067
14679 -281067 -217146 -164245 -128195 -240105 -370514 -259603 -187509 -352928 -448696 -423758 -343581
14668 -343581 -177076 65750 -82970 -110006 -62646 8366 -36219 -77320 -327723 -198828
14658 -198828 -106925 -170269 -123088 -105730 -179602 -137791 -331006 -439670 -461034 -577008 -575716
14647 -575716 -388053 -288228 -568787 -531884 -423676 -330870 -213142 -344014 -473841 -274538
$$ packed form
14721A58082j4285k59328r1371M0344L9222j22493J01532L6293r621m5475J05258
14710f1842o6923j64153j63580P425K14908J63423j46172o4158L77782J18252
14700B14962j06123j72409j28285n9383K4209j7659o1015l3867p3094J93233j07648
14689c27079J24455P3095K18030J21052k5947J6539J37312m987l01683l11854
14679b81067O3921N2901L6050j11910j30409J10911P2094j65419r5768K4938Q0177
14668c43581J66505K42826j48720k7036M7360P1012m4585m1101k50403J28895
14658a98828R1903o3344M7181J7358p3872M1811j93215j08664k1364j15974J292
14647e75716J87663R9825k80559L6903J08208R2806J17728j30872j29827J99303
$$ plain form
14637 -274538 -110973 -28890 -53363 -20101 -66079 -64345 -219802 -257320 -219400 -182679 -62378
14626 -62378 46135 26284 -62777 88029 -83400 -263117 -364287 -411254 -591134 -291852
14616 -291852 132620 -17838 98908 109858 185468 110842 -95638 -227616 -310933 -212398
14606 -212398 -97649 163867 204330 -43881 -52654 -50281 -156553 -403370 -499899 -561949 -610175
14595 -610175 -491261 -213560 -95488 -158539 -194090 -333956 -252760 -150931 -50444 -34834
14585 -34834 -255376 -361250 -165428 -35 -42098 -36481 -81921 76448 151237 218355 168008
14574 168008 207599 190044 153821 203444 93899 -27044 -205096 -248110 -161436 -267226 -144916
14563 -144916 -206616 -285876 -502185 -628471 -583651 -486311 -434948 -243682 21636 50693 -1193
$$ packed form
14637b74538J63565Q2083k4473L3262m5978J734j55457l7518L7920L6721J20301
14626f2378J08513j9851q9061J50806j71429j79717j01170m6967j79880K99282
14616b91852M24472j50458J16746J0950P5610p4626k06480j31978q3317R8535
14606b12398J14749K61516M0463k48211q773K373j06272k46817r6529o2050m8226
14595f10175J18914K77701J18072o3051l5551j39866Q1196J01829J00487J5610
14585c4834k20542j05874J95822J65393m2063N617m5440J58369P4789O7118n0347
14574A68008L9591j7555l6223M9623j09545j20943j78052m3014Q6674j05790J22310
14563a44916o1700p9260k16309j26286M4820R7340N1363J91266K65318K9057n1886
$$ plain form
14552 -1193 -1866 -230534 -209846 -253492 163874 321405 35040 46200 97060 125683 174873
14541 174873 101504 105499 161745 74514 389035 594960 450667 181586 96144 -91591 -356119
14530 -356119 -363151 -210042 -290883 -135052 -74651 17155 -63375 -217753 -96158 81805 114381
14519 114381 152013 -36530 -189071 -236487 -11800 124947 -87811 -75386 50833 180126
14509 180126 235645 156365 -64156 -213899 -266114 -20576 -38010 -208159 -323483 -215427
14499 -215427 61035 258382 350523 218257 -36568 114448 93694 8313 74480 117525
14489 117525 41509 44845 202242 113885 -60193 -351746 -230383 -94433 -131676 -263715
14479 -263715 -94968 -65338 -103258 -81238 88811 224918 58628 -264255 -263776 -43785 194420
$$ packed form
14552a193o73k28668K0688m3646M17366J57531k86365J1160N0860K8623M9190
14541A74873p3369L995N6246q7231L14521K05925j44293k69081q5442j87735k64528
14530c56119p032J53109q0841J55831O0401R1806q0530j54378J21595J77963L2576
14519A14381L7632j88543j52541m7416K24687J36747k12758J2425J26219J29293
14509A80126N5519p9280k20521j49743n2215K45538j7434j70149j15324J08056
14499b15427K76462J97347R2141j32266k54825J51016k0754q5381O6167M3045
14489A17525p6016L336J57397q8357j74078k91553J21363J35950l7243j32039
14479b63715J68747K9630l7920K2020J70049J36107j66290l22883M79K19991K38205
$$ plain form
14468 194420 268008 294777 144802 9545 -201596 -275014 -166301 157319 181582 142706
14458 142706 141949 168596 246687 202226 77149 -189976 -109226 -39952 -25909 129985 204214
14447 204214 377410 218312 129535 -98393 -257896 -368222 -317199 -161113 60714 247791
14437 247791 340582 118633 -45146 -245648 -171343 -59883 180130 484415 482923 220771
14427 220771 325506 111231 197036 155185 186483 82421 -108052 -273293 -157434 79728
14417 79728 125743 164952 103527 4736 -231533 -411514 -178941 -92175 -363354 -284583 -211728
14406 -211728 -174792 -59910 182110 207560 72925 -109559 -221787 -197664 -51778 -240951
14396 -240951 -202033 -314440 -3883 -15729 -60394 45419 155008 -64105 -155914 11457
$$ packed form
14468A94420P3588K6769j49975j35257k11141p3418J08713L23620K4263l8876
14458A42706p57K6647P8091m4461j25077k67125Q0750O9274J4043J55894P4229
14447B04214J73196j59098q8777k27928j59503j10326N1023J56086K21827J87077
14437B47791R2791k21949j63779k00502P4305J11460K40013L04285j492k62152
14427B20771J04735k14275Q5805m1851L1298j04062j90473j65241J15859K37162
14417G9728M6015L9209o1425r8791k36269j79981K32573Q6766k71179P8771P2855
14406b11728L6936J14882K42020K5450j34635j82484j12228K4123J45886j89173
14396b40951L8918j12407L10557j1846m4665J05813J09589k19113r1809J67371
$$ plain form
14386 11457 29400 -110785 -151269 34337 107292 19348 -127121 -44630 -23623 -98376 -49723
14375 -49723 -49152 -67940 -160048 -124848 -58968 -246769 12952 -42779 -230947 -264438 -74894
14364 -74894 -16746 17283 170086 164659 -55087 -247507 -43391 102525 -98348 -93303 -19187
14353 -19187 -254041 -194636 -45882 124336 -7622 -211485 -1058 87764 -93763 -310668
14343 -310668 -209525 107522 125345 115269 -253062 -429871 -566621 -496760 -531361 -465107
14333 -465107 -508445 -511680 -529735 -449543 -530014 -363975 -189991 -195188 -172245 -168810 -73634 114462
14321 114462 -8761 11534 11196 64853 33449 -70266 17128 43487 -365974 -532639 -474267
14310 -474267 -388162 -259827 -200429 -102825 19554 58276 9955 38033 -161960 -121522 -222905
$$ packed form
14386A1457J7943j40185m0484J85606P2955q7944j46469Q2491K1007p4753M8653
14375d9723N71j8788r2108L5200O5880j87801K59721n5731j88168l3491J89544
14364g4894N8148L4029J52803n427k19746j92420K04116J45916k00873N045P4116
14353a9187k34854N9405J48754J70218j31958k03863K10427Q8822j81527k16905
14343c10668J01143L17047J7823j0076l68331j76809j36750O9861l4601O6254
14333d65107m3338l235j8055Q0192q0471J66039J73984n197K2943L435R5176J88096
14321A14462j23223K0295l38N3657l1404j03715Q7394K6359m09461j66665N8372
14310d74267Q6105J28335N9398R7604J22379L8722m8321K8078j99993M0438j01383
$$ plain form
14299 -222905 -395118 -559195 -579028 -304103 -60909 -248305 -502490 -412083 -313585 -576451
14289 -576451 -749525 -623118 -475967 -171857 -253356 -165677 99200 119284 -13548 -173594
14279 -173594 -201075 38271 250645 136148 -165728 -93847 -170261 -124192 77823 -154353
14269 -154353 -370832 -487735 -502830 -354776 -151053 -20195 41772 336479 310415 195486
14259 195486 -11208 -192703 -347993 -521612 -448926 -290705 -190039 -6587 208325 282211
14249 282211 119073 115766 294419 299134 79190 -107112 -212593 -26155 -82808 -85348 45464
14238 45464 -128665 -102978 -104224 -146754 -224633 -223334 -485425 -659160 -467069 -365361 -242340
14227 -242340 -5434 79045 -11550 -86552 -286573 -356239 -324115 -334084 -290741 -260879 -88509
$$ packed form
14299b22905j72213j64077j9833K74925K43194j87396k54185R0407R8498k62866
14289e76451j73074J26407J47151L04110q1499Q7679K64877K0084j32832j60046
14279a73594k7481K39346K12374j14497l01876P1881p6414M6069K02015k32176
14269a54353k16479j16903j5095J48054K03723J30858O1967K94707k6064j14929
14259A95486k06694j81495j55290j73619P2686J58221J00666J83452K14912P3886
14249B82211j63138l307J78653M715k19944j86302j05481J86438n6653k540J30812
14238D5464j74129K5687j246m2530p7879J299k62091j73735J92091J01708J23021
14227b42340K36906Q4479r0595p5002k00021o9666L2124r969M3343K9862J72370
$$ plain form
14216 -88509 14708 -17310 -119995 -271567 -60686 43500 49727 53623 -78142 107971 112257
14205 112257 96243 88527 189175 456992 293035 164235 74908 -86072 -52624 75422
14195 75422 70418 -30228 -51331 -350488 -282343 -94299 -57051 161073 122153 -28937 -145249
14184 -145249 -165938 -464049 -294381 -153854 45067 -15476 -140016 -154173 -219662 -359037
14174 -359037 -447410 -341269 -255444 -213904 70511 42124 -141582 -78321 -158123 -176802 -351929
14163 -351929 -396886 -158250 -50806 124455 224824 257846 210282 115808 32269 190293
14153 190293 262805 150177 146814 276856 208565 14079 -80173 -332721 -496053 -472887 -434608
14142 -434608 -262764 -343746 -423306 -153619 -106998 -37157 73947 93984 -607 -32072 -184863
$$ packed form
14216h8509J03217l2018j02685j51572K10881J04186O227L896j31765J86113M286
14205A12257j6014p716J00648K67817j63957j28800q9327j60980L3448J28046
14195G5422n004j00646k1103k99157O8145J88044L7248K18124l8920j51090j16312
14184a45249k0689k98111J69668J40527J98921o0543j24540j4157o5489j39375
14174c59037q8373J06141Q5825M1540K84415k8387j83706O3261p9802j8679j75127
14163c51929m4957K38636J07444J75261J00369L3022m7564r4474q3539J58024
14153A90293P2512j12628l363J30042o8291j94486r4252k52548j63332K3166L8279
14142d34608J71844q0982p9560K69687M6621O9841J11104K0037r4591l1465j52791
$$ plain form
14131 -184863 -120025 46371 -118582 -205122 -288965 -193874 -11538 -27144 -50820 -66345 206319
14120 206319 236557 -21336 -141297 -221329 -135200 274197 292937 200048 414177 435869 314470
14109 314470 280534 374411 254441 205889 98103 -298492 -544747 -353601 -269839 -470566
14099 -470566 -188968 -237363 -167878 -182046 -35385 7368 -27499 -140977 -14666 -26322 -225096
14088 -225096 -40120 55443 -8664 87696 160420 20569 69055 190024 183397 356077 231687
14077 231687 211521 308635 92201 108868 87752 -57280 -106164 52437 118758 -154502 -265568
14066 -265568 -305334 -213148 -96946 -186276 -264324 -177224 -61985 -2648 41906 133739 188410
14055 188410 -87692 -230834 569 -94565 68832 97269 106115 -94961 21868 78935
$$ packed form
14131a84863O4838J66396j64953q6540q3843R5091J82336j5606k3676j5525K72664
14120B06319L0238k57893j19961q0032Q6129M09397J8740r2889K14129K1692j21399
14109C14470l3936R3877j19970m8552j07786l96595k46255J91146Q3762k00727
14099d70566K81598m8395O9485j4168J46661M2753l4867j13478J26311j1656j98774
14088b25096J84976R5563o4107R6360P2724j39851M8486J20969o627J72680j24390
14077B31687k0166R7114k16434J6667k1116j45032m8884J58601O6321k73260j11066
14066b65568l9766R2186J16202q9330p8048Q7100J15239N9337M4554R1833N4671
14055A88410k76102j43142K31403r5134J63397K8437Q846k01076J16829N7067
$$ plain form
14045 78935 -63872 -112468 -168914 -96570 38838 133181 201322 142964 58924 69901 -12724
14034 -12724 -62607 -135885 109887 29781 -23497 -231585 -350554 -154402 -86626 -188015 -158471
14023 -158471 -60851 -115136 -310773 -533630 -636456 -507027 -420096 -150543 -31167 230817
14013 230817 264477 211990 180328 98283 242236 281002 287733 319173 409521 263140 570057
14002 570057 475841 488766 424034 219521 4938 -28040 56751 219138 118764 -289128
13992 -289128 -397420 -220315 -62825 -93887 47112 215225 218181 472277 435532 98283
13982 98283 86901 25440 -119512 -99607 83012 263728 173969 238894 193769 -33985 -319903
13971 -319903 -390828 -188786 62073 -13605 -168113 -180959 -98421 -47910 -124537 -6633 406910
$$ packed form
14045G8935j42807m8596n6446P2344J35408R4343O8141n8358q4040J0977q2625
14034a2724m9883p3278K45772q0106n3278k08088j18969J96152O7776j01389K9544
14023a58471R7620n4285j95637k22857j02826J29429Q6931K69553J19376K61984
14013B30817L3660n2487l1662q2045J43953L8766O731L1440R0348j46381L06917
14002E70057r4216J2925o4732k04513k14583l2978Q4791J62387j00374m07892
13992b89128j08292J77105J57490l1062J40999J68113K956K54096l6745l37249
13982I8283j1382o1461j44952J9905J82619J80716q9759O4925m5125k27754k85918
13971c19903p0925K02042K50859p5678j54508j2846Q2538N0511p6627J17904M13543
$$ plain form
13960 406910 586076 326817 151632 273904 138757 -20661 106654 -23959 5521 41517
13950 41517 120747 243063 212830 -119604 -146595 110754 260319 279026 441251 440821 451581
13939 451581 412183 360625 245787 125153 13962 -99458 -69821 -22372 -75418 -137217 -125128
13928 -125128 -163205 -208986 -124496 -202393 -207741 -300048 -205437 -101311 161575 120621 8885
13917 8885 92796 26589 70865 16683 43549 149671 215477 -135601 -302481 -195412 -255568
13906 -255568 -194151 7251 65862 111364 241437 32367 -217302 -191982 17413 -108517
13896 -108517 -190120 -126156 -77694 205989 458267 490398 335593 -95551 -280674 8480
13886 8480 160358 -211664 -388395 -139103 1529 -244762 -436116 -200219 -99736 -181454
$$ packed form
13960D06910J79166k59259j75185J22272j35147j59418J27315j30613K9480L5996
13950D1517P9230J22316l0233l32434k6991K57349J49565J8707J62225m30J0760
13939D51581l9398n1558j14838j20634j11191j13420K9637M7449n3046o1799J2089
13928a25128l8077m5781Q4490p7897n348r2307R4611J04126K62886m0954j11736
13917H885Q3911o6207M4276n4182K6866J06122O5806l51078j66880J07069o0156
13906b55568O1417K01402N8611M5502J30073k09070k49669K5320K09395j25930
13896a08517q1603O3964M8462K83683K52278L2131j54805m31144j85123K89154
13886H480J51878l72022j76731K49292J40632k46291j91354K35897J00483q1718
$$ plain form
13876 -181454 -326199 -264440 -145190 71268 154887 222230 215811 202109 164809 350021 297084
13865 297084 50677 39915 123383 286733 229841 -15099 102611 379252 346701 210446
13855 210446 -25094 -279800 -9690 280241 298168 153764 233358 174102 -127436 -210913
13845 -210913 -493138 -457541 -383270 -405336 -216270 -159017 -75798 -28146 75827 171316 35160
13834 35160 186925 -104958 -178642 -86709 -256293 -335290 -265241 -78835 -10139 507 26498
13823 26498 169386 197236 189113 -28288 -3187 7570 126905 75997 11466 131032 372092
13812 372092 420033 544916 293657 109027 -171531 -361023 -457866 -404890 -239711 -108794
13802 -108794 85092 218689 330972 327145 55035 -147923 106182 86835 -75731 -60840
$$ packed form
13876a81454j44745O1759J19250K16458Q3619O7343o419j3702l7300J85212n2937
13865B97084k46407j0762Q3468J63350n6892k44940J17710K76641l2551j36255
13855B10446k35540k54706K70110K89931J7927j44404P9594n9256l01538q3477
13845b10913k82225L5597P4271k2066J89066N7253Q3219M7652J03973R5489j36156
13834C5160J51765k91883p3684R1933j69584p8997P0049J86406O8696J0646K5991
13823B6498J42888K7850q123k17401K5101J0757J19335n0908o4531J19566K41060
13812C72092M7941J24883k51259j84630k80558j89492r6843N2976J65179J30917
13802a08794J93886J33597J12283l827k72110k02958K54105j9347j62566J4891
$$ plain form
13792 -60840 180443 249525 -133793 -303466 -275512 -230629 -243296 -392093 -192868 -69597
13782 -69597 -194369 -212741 -53996 198218 225371 201963 232681 311873 327969 182300 -68047
13771 -68047 -334325 -528050 -349517 -72192 164620 272853 179519 -37997 -98848 2321
13761 2321 216191 333182 80688 -68206 78542 66196 50030 84399 128221 67937 22097
13750 22097 120065 237653 14481 74841 179555 292614 298162 333531 232251 114173 -189766
13739 -189766 -150418 -19679 8134 -48292 -118888 -145913 -176529 -19602 241221 132688 -155897
13728 -155897 -69852 -74787 -77767 -83074 -166000 -286332 -229334 -224349 -14651 147478 65734 -89459
13716 -89459 -197764 -160359 -218960 -352878 -244295 -73477 70979 128944 -15255 -182918
$$ packed form
13792f0840K41283O9082l83318j69673K7954M4883j2667j48797J99225J23271
13782f9597j24772j8372J58745K52214K7153k3408L0718P9192J6096j45669k50347
13771f8047k66278j93725J78533K77325K36812J08233r3334k17516o0851J01169
13761B321K13870J16991k52494j48894J46748j2346j6166L4369M3822o0284m5840
13750B2097R7968J17588k23172O0360J04714J13059N548L5369j01280j18078l03939
13739a89766L9348J30739K7813n6426p0596k7025l0616J56927K60823j08533k88585
13728a55897Q6045m935k980n307q2926j20332N6998M985K09698J62129q1744j55193
13716h9459j08305L7405n8601j33918J08583J70818J44456N7965j44199j67663
$$ plain form
13706 -182918 -249796 -78190 -46006 -196150 -12425 12086 191554 408326 352572 172274
13696 172274 72581 110675 34668 2093 62926 19580 63692 61606 -23474 -218099 -110530
13685 -110530 26278 122062 43053 117210 78751 -24261 68370 238808 328226 332757 203063
13674 203063 90815 -82098 -238991 -278200 -132798 61158 237388 212900 100727 206351
13664 206351 150911 136272 180985 216093 191712 298832 348829 401324 183926 24407 -29723
13653 -29723 386639 611024 388831 192585 224319 210756 209780 310300 171876 47538 -19252
$$ packed form
13706a82918o6878J71606L2184j50144J83725K4511J79468K16772n5754j80298
13696A72274r9693L8094p6007l2575O0833m3346M4112k086q5080j94625J07569
13685a10530J36808R5784p9009P4157l8459j03012R2631J70438Q9418M531j29694
13674B03063j12248j72913j56893l9209J45402J93956J76230k4488j12173J05624
13664B06351n5440j4639M4713L5108k4381J07120M9997N2495k17398j59519n4130
13653b9723M16362K24385k22193j96246L1734j3563r76J00520j38424j24338o6790
$$ [...]
##END NTUPLES=NMR SPECTRUM
##END=
