##TITLE=Analysis number 321980
Compound Code cc 50206
Book Reference 464/62/5
Project Code adrs
Chemist Name chrisr
##JCAMPDX= 6.0         $$ Bruker NMR JCAMP-DX V2.0
##DATA TYPE= NMR SPECTRUM
##DATA CLASS= NTUPLES
##ORIGIN= Bruker BioSpin GmbH
##OWNER= nmr
$$ XWIN-NMR		Version 3.5
$$ Thu Sep  7 09:28:19 2006 GMT Daylight Time (UT+1h)  MAYBRIDGE\nmr@NMR_250MHZ
##.OBSERVE FREQUENCY= 250.131544655141
##.OBSERVE NUCLEUS= ^1H
##.ACQUISITION MODE= SIMULTANEOUS (DQD)
##.ACQUISITION SCHEME= undefined
##.AVERAGES= 16
##.DIGITISER RES= 18
##SPECTROMETER/DATA SYSTEM= dpx250
##.PULSE SEQUENCE= zg30
##.SOLVENT NAME= CDCl3
##.SHIFT REFERENCE= (INTERNAL, CDCl3, 0, 16.522)
##AUDIT TRAIL= $$ (NUMBER, WHEN, WHO, WHERE, WHAT)
$$ ##TITLE= Audit trail, XWIN-NMR		Version 3.5
$$ ##JCAMPDX= 5.01
$$ ##ORIGIN= Bruker BioSpin GmbH
$$ ##OWNER= nmr
$$ C:\u/data/dgb/nmr/ADRS/280/pdata/1/auditp.txt
$$ ##AUDIT TRAIL=  $$ (NUMBER, WHEN, WHO, WHERE, WHAT)
(   1,<2006-09-07 09:27:56.06 +100>,<MAYBRIDGE\nmr>,<NMR_250MHZ>,
      <created by zg, POWCHK disabled, PULCHK disabled
       configuration hash MD5:
       E2 DF 36 D8 04 B2 41 60 5A D7 A3 38 5A 4B D0 FE
       data hash MD5: 64K
       99 29 B6 83 B6 0B 99 7D DD 1B 8E 32 91 22 AA 6A>)
(   2,<2006-09-07 09:28:09.99 +100>,<MAYBRIDGE\nmr>,<NMR_250MHZ>,
      <Start of raw data processing
       ef LB = 0.3 FT_mod = 6 PKNL = 1 SI = 32K 
       data hash MD5: 32K
       08 8D C8 D8 31 FA B0 06 F0 33 D0 3E EA F8 B4 A6>)
(   3,<2006-09-07 09:28:11.74 +100>,<MAYBRIDGE\nmr>,<NMR_250MHZ>,
      <apk 
       data hash MD5: 32K
       91 21 70 D2 3F 4F 6E 87 2C 81 9E C2 F8 27 7F C0>)
(   4,<2006-09-07 09:28:12.48 +100>,<MAYBRIDGE\nmr>,<NMR_250MHZ>,
      <abs ABSG = 5 
       data hash MD5: 32K
       70 7F 75 20 35 7E 0C 76 45 73 45 F9 38 5A 02 C4>)
$$ ##END=
$$ 
$$ hash MD5
$$ 8C 0F 3E 4F 39 F5 33 2F 94 ED 0C 57 9A F6 AC D4
##$RELAX= 
##$RELAX= 
##$RELAX= 
##$RELAX= 
##$RELAX= 
##$RELAX= 
##$RELAX= 
$$ Bruker specific parameters
$$ --------------------------
##$DU= <C:\u>
##$EXPNO= 280
##$NAME= <ADRS>
##$PROCNO= 1
##$TYPE= <nmr>
##$USER= <dgb>
##$AMP= (0..31)
100 100 100 100 100 100 100 100 100 100 100 100 100 100 100 100 100 100 
100 100 100 100 100 100 100 100 100 100 100 100 100 100 
##$AQSEQ= 0
##$AQ_mod= 3
##$AUNM= <au_zg>
##$AUTOPOS= <33 >
##$BF1= 250.13
##$BF2= 250.13
##$BF3= 250.13
##$BF4= 250.13
##$BF5= 500.13
##$BF6= 500.13
##$BF7= 500.13
##$BF8= 500.13
##$BYTORDA= 1
##$CFDGTYP= 0
##$CFRGTYP= 5
##$CHEMSTR= <none>
##$CNST= (0..31)
1 1 145 1 1 1 1 1 1 1 1 1 1 1 1 1 1 1 1 1 1 1 1 1 1 1 1 1 1 1 1 1 
##$CPDPRG= <>
##$CPDPRG1= <>
##$CPDPRG2= <>
##$CPDPRG3= <>
##$CPDPRG4= <mlev>
##$CPDPRG5= <mlev>
##$CPDPRG6= <mlev>
##$CPDPRG7= <mlev>
##$CPDPRG8= <mlev>
##$CPDPRGB= <>
##$CPDPRGT= <>
##$D= (0..31)
0 1 0 0 0 0 0 0 0 0.06 0 0 0 0 0 0 0.0002 0 0 0 0 0 0 0 0 0 0 0 0 0 0 
0 
##$DATE= 1157617674
##$DBL= (0..7)
120 120 120 120 120 120 120 120 
##$DBP= (0..7)
150 150 150 150 150 150 150 150 
##$DBP07= 0
##$DBPNAM0= <>
##$DBPNAM1= <>
$$ [...]
##$SUBNAM7= <"">
##$SUBNAM8= <"">
##$SUBNAM9= <"">
##$SW= 20.6930455092707
##$SWIBOX= (0..15)
0 0 3 0 0 0 0 0 0 0 0 0 0 0 0 0 
##$SW_h= 5175.983436853
##$TD= 65536
##$TD0= 1
##$TE= 295.16
##$TE2= 300
##$TE3= 300
##$TEG= 300
##$TL= (0..7)
0 120 120 120 120 120 120 120 
##$TP= (0..7)
150 150 150 150 150 150 150 150 
##$TP07= 0
##$TPNAME0= <>
##$TPNAME1= <>
##$TPNAME2= <>
##$TPNAME3= <>
##$TPNAME4= <>
##$TPNAME5= <>
##$TPNAME6= <>
##$TPNAME7= <>
##$TPOAL= (0..7)
0.5 0.5 0.5 0.5 0.5 0.5 0.5 0.5 
##$TPOFFS= (0..7)
0 0 0 0 0 0 0 0 
##$TUNHIN= 0
##$TUNHOUT= 0
##$TUNXOUT= 0
##$USERA1= <user>
##$USERA2= <user>
##$USERA3= <user>
##$USERA4= <user>
##$USERA5= <user>
##$V9= 5
##$VALIST= <valist>
##$VCLIST= <CCCCCCCCCCCCCCC>
##$VD= 0
##$VDLIST= <DDDDDDDDDDDDDDD>
##$VPLIST= <PPPPPPPPPPPPPPP>
##$VTLIST= <TTTTTTTTTTTTTTT>
##$WBST= 1024
##$WBSW= 4
##$XGAIN= (0..3)
0 0 0 0 
##$XL= 0
##$YL= 0
##$YMAX_a= 329589
##$YMIN_a= -553296
##$ZGOPTNS= <>
##$ZL1= 120
##$ZL2= 120
##$ZL3= 120
##$ZL4= 120
##$ABSF1= 16.522
##$ABSF2= -4.171173
##$ABSG= 5
##$ABSL= 3
##$ALPHA= 0
##$AQORDER= 0
##$ASSFAC= 0
##$ASSFACI= 0
##$ASSFACX= 0
##$ASSWID= 0
##$AUNMP= <proc_1d>
##$AZFE= 0.1
##$AZFW= 0.1
##$BCFW= 0
##$BC_mod= 0
##$BYTORDP= 0
##$COROFFS= 0
##$CY= 12.5
##$DATMOD= 1
##$DC= 0
##$DFILT= <>
##$DTYPP= 0
##$F1P= 14.0000005364418
##$F2P= -0.99999901652339
##$FCOR= 0.5
##$FTSIZE= 32768
##$FT_mod= 6
##$GAMMA= 0
##$GB= 0
##$INTBC= 1
##$INTSCL= 1
##$ISEN= 128
##$LB= 0.3
##$LEV0= 0
##$LPBIN= 0
##$MAXI= 10000
##$MC2= 0
##$MEAN= 0
##$ME_mod= 0
##$MI= 0
##$NCOEF= 0
##$NC_proc= -5
##$NLEV= 6
##$NOISF1= 0
##$NOISF2= 0
##$NSP= 0
##$NTH_PI= 0
##$NZP= 0
##$OFFSET= 16.522
##$PC= 1
##$PHC0= 148.3653
##$PHC1= 15.79169
##$PH_mod= 1
##$PKNL= yes
##$PPARMOD= 0
##$PSCAL= 4
##$PSIGN= 0
##$REVERSE= no
##$SF= 250.13
##$SI= 32768
##$SIGF1= 0
##$SIGF2= 0
##$SINO= 400
##$SIOLD= 32768
##$SREGLST= <1H.CDCl3>
##$SSB= 0
##$STSI= 32768
##$STSR= 0
##$SW_p= 5175.98343685301
##$SYMM= 0
##$S_DEV= 0
##$TDeff= 65536
##$TDoff= 0
##$TI= <Analysis number 999999
Compound Code 99
Book Reference 9
Project Code 9>
##$TILT= no
##$TM1= 0
##$TM2= 0
##$TOPLEV= 0
##$USERP1= <user>
##$USERP2= <user>
##$USERP3= <user>
##$USERP4= <user>
##$USERP5= <user>
##$WDW= 1
##$XDIM= 32768
##$YMAX_p= 347793337
##$YMIN_p= -927411
$$ End of Bruker specific parameters
$$ ---------------------------------
##NTUPLES= NMR SPECTRUM
##VAR_NAME=  FREQUENCY,     SPECTRUM/REAL,   SPECTRUM/IMAG
##SYMBOL=    X,             R,               I
##VAR_TYPE=  INDEPENDENT,   DEPENDENT,       DEPENDENT
##VAR_FORM=  AFFN,          ASDF,            ASDF
##VAR_DIM=   32768,         32768,           32768
##UNITS=     HZ,            ARBITRARY UNITS, ARBITRARY UNITS
##FACTOR=    0.157963299565203, 1,           1
##FIRST=     4132.6476996994, 0,             0
##LAST=      -1043.33573715361, 0,           0
##MIN=       -1043.33573715361, -927411,     0
##MAX=       4132.6476996994, 347793337,     0
$$ Real data points
##PAGE= N=1
##DATA TABLE= (X++(R..R)), XYDATA
$$ [...]
22526a0580q6765j65190J15918J87279j04419r9936n12J11602j34385L3672j21606
$$ -10580 -97345 -262535 -146617 40662 -63757 -163693 -164205 -52603 -186988 -153316 -274922
22515b74922P9096n472K05436J7495l6585j6036j40938K7822L05130r5021k31751
$$ -274922 -195826 -201298 4138 21633 -14952 -30988 -171926 -144104 161026 66005 -165746
22504a65746Q4559j25052j73292J82601N5887J1867J36864j5168J16007J1311
$$ -165746 -81187 -206239 -379531 -196930 -141043 -129176 7688 -7480 108527 119838
22494A19838J14535P4672j28220j334j33660k15007l4949J32437K2432j56952
$$ 119838 234373 309045 180825 179491 45831 -169176 -204125 -71688 -49256 -206208
22484b06208J85692n8521j38946j0678L05421L5157j435j14346j33823J8690j48723
$$ -206208 -20516 -79037 -217983 -228661 76760 111917 110482 -3864 -137687 -118997 -267720
22473b67720J3888K38409J20654J47278O0193n119j4700j25441k10501l766J37614
$$ -267720 -253832 -15423 105231 252509 312702 307583 292883 167442 -43059 -46825 90789
22462I0789J8750j06597J54543K50396O3654l12001k08265j19693L5620J5328
$$ 90789 109539 2942 157485 407881 471535 159534 -48731 -168424 -132804 -117476
22452a17476j64485K8293J40441N2097J34931q3805j37854R2554R4331J31437
$$ -117476 -281961 -253668 -113227 -61130 73801 -10004 -147858 -55304 39027 170464
22442A70464k9677M3855P1908J00565j35582j06372o1733J25912q6241O6885P3323
$$ 170464 140787 184642 256550 357115 221533 115161 53428 179340 93099 159984 233307
22431B33307Q302J9652j49886j18121K04225j7829j45360l3207K14634J75274
$$ 233307 241609 261261 111375 -6746 197479 179650 34290 1083 215717 390991
22421C90991k83141k05302p1706J59097K00254L39112J7037k25220l1575m5043
$$ 390991 107850 -97452 -169158 -10061 190193 529305 546342 321122 289547 244504
22411B44504l9063p9880j43677J4090J54459j23590O657j9290Q4601j57221j22746
$$ 244504 205441 125561 -18116 -4026 150433 26843 33500 14210 98811 -58410 -181156
22400a81156O9771m1415j8164O689Q8482J04980q0633Q247n613n8788Q7122O2129
$$ -181156 -111385 -152800 -170964 -164275 -75793 29187 -51446 -43199 -48812 -107600 -20478 41651
22388D1651j75745m6898J15475R305J87677J2741J30724j00770j49616p3180l5141
$$ 41651 -134094 -180992 -65517 -56212 131465 144206 274930 174160 24544 -48636 -83777
22377h3777R1778J37194J68006p3310j98178j26494N0834k22423j6199N0757J13159
$$ -83777 8001 145195 313201 239891 41713 -84781 -33947 -256370 -272569 -221812 -108653
22366a08653K36503J02798n8850p6555K4374j68709m66040l3427K83554K14510
$$ -108653 127850 230648 171798 95243 119617 -49092 -515132 -548559 -265005 -50495
22356e0495q5590r5540O5024K67783m7859Q490n1961k08784k0246n2703L8794
$$ -50495 -136085 -231625 -166601 101182 53323 61813 9852 -198932 -219178 -271881 -233087
22345b33087K19257O4881p6508Q2664J04078o6799k8571l5095J3047L01545n4736
$$ -233087 -13830 51051 -25457 57207 161285 94486 65915 30820 43867 345412 290676
22334B90676j91871k1144j93653j9684L3126R5009J73227R0119p77q6085J65327
$$ 290676 98805 77661 -115992 -135676 -102550 -7541 165686 255805 255028 168943 334270
22323C34270j54588j05270j16893r0833L0996m6932j01031k2446j66485l21226
$$ 334270 179682 74412 -42481 -133314 -102318 -149250 -250281 -272727 -439212 -760438
22313g60438N1154J77541J47380P4487N4573r1922j4137K9780J22877J7189j60682
$$ -760438 -709284 -531743 -384363 -309876 -255303 -347225 -361362 -331582 -208705 -191516 -352198
22302c52198n1239L10805J77452r3209q9706o1697k1767J84072M7650k13560j05772
$$ -352198 -403437 -92632 84820 -8389 -98095 -159792 -181559 2513 50163 -163397 -269169
22291b69169O7752R0938K41608K85565j24864m9256j21798k99950P1803O0691
$$ -269169 -201417 -110479 131129 416694 291830 242574 120776 -179174 -107371 -46680
22281d6680P2116j06510j59404K83934n4585L7126K44183j86385j29946q9617
$$ -46680 25436 -81074 -240478 43456 -11129 25997 270180 83795 -46151 -135768
22271a35768k13232K5419K23057N6187o5608K21669J31666L5814k53170K2596
$$ -135768 -349000 -323581 -100524 -44337 -109945 111724 243390 279204 26034 48630
22261D8630K58625j44241k00808j03274R8218J39892j30576k57109L6730J39221
$$ 48630 307255 163014 -37794 -141068 -42850 97042 -33534 -290643 -253913 -114692
22251a14692Q9362j30956j94711j60205J7165p2188L68248J27739P3915R905j83780
$$ -114692 -25330 -156286 -350997 -511202 -494037 -566225 -197977 -70238 3677 13582 -170198
22240a70198k04822j30197K08548j00834q3228J03977J60704J26074R9106j47803
$$ -170198 -375020 -505217 -296669 -397503 -480731 -376754 -216050 -89976 9130 -138673
22230a38673k77469J01188J55302N4486K9859j41877k0176J20696M7448j21074
$$ -138673 -416142 -314954 -159652 -105166 -75307 -217184 -237360 -116664 -69216 -190290
22220a90290j22924k9163m3749j4237J4807J05571J34790K14630N9786R1700l5971
$$ -190290 -313214 -342377 -386126 -400363 -385556 -279985 -145195 69435 129221 220921 184950
22209A84950l17367J46774Q279J29239L39361j28134k14667k47097j09161K18112
$$ 184950 -132417 14357 22636 151875 491236 363102 148435 -98662 -207823 10289
22199A0289J03266j2070q1240l76212J26876J92383k700q3417M9680K21061O5689
$$ 10289 113555 101485 20245 -355967 -229091 -36708 -39408 -122825 -73145 147916 213605
22188B13605j55843k12449K4632J96472k09686k80330L5177K26103Q5848L4956
$$ 213605 57762 -154687 -130055 66417 -143269 -423599 -388422 -162319 -76471 -41515
22178d1515J99976l4050j49856k0784M3080o9106J85484N6397q6088p1073l7343
$$ -41515 158461 124411 -25445 -46229 -3149 -72255 113229 169626 83538 12465 -24878
22167b4878r4513p0603n3171J82278J41519j50163J32699J56800L345l24860j79054
$$ -24878 -119391 -189994 -243165 -60887 80632 -69531 63168 219968 223313 -101547 -280601
22156b80601o6990P9493p2631r3146J17015N8364J14598l646j64943Q3529O9775
$$ -280601 -347591 -268098 -340729 -433875 -316860 -258496 -143898 -147544 -312487 -228958 -159183
22145a59183m7023J5483J53606R2199j4590j02500r5979K4330q9827J97494Q0637
$$ -159183 -206206 -190723 -37117 55082 40492 -62008 -157987 -133657 -223484 -25990 54647
22134E4647r7802k99447r6593J54538K6425K49581K79076j58500o570j22011k45549
$$ 54647 -43155 -342602 -439195 -284657 -258232 -8651 270425 111925 105355 -16656 -262205
22123b62205O0476J36020P9497l00847R0603K16768K49236m3123j99340j03613
$$ -262205 -201729 -65709 13788 -287059 -196456 20312 269548 226425 27085 -76528
22113g6528j65955J73278J12833N8903j29535O3777J58115R2547P133o4877N3036
$$ -76528 -242483 -69205 43628 102531 -27004 36773 194888 287435 294568 229691 282727
22102B82727m7282Q6193L2934q500k68927j53179Q5964l6463k9219n341J1738
$$ 282727 235445 321638 354572 346072 77145 -76034 9930 -26533 -55752 -61093 -49355
22091d9355J30519J92484l0609M0913k65096q5270J37936j27868q2882J9377k0443
$$ -49355 81164 273648 243039 283952 18856 -66414 71522 -56346 -139228 -119851 -140294
22080a40294j00560j99244K34345K36318o6621m4713J38881J26869k4322l453
$$ -140294 -240854 -440098 -205753 30565 -36056 -80769 58112 184981 160659 157206
22070A57206n9763o4475m5391j27859j47409j58582J94311K59068K25015q3586
$$ 157206 97443 32968 -12423 -140282 -287691 -446273 -251962 7106 232121 148535
22060A48535j67233j02429J84865J18713j19222j5735m02031o7837J77360r3578
$$ 148535 -18698 -121127 63738 182451 63229 47494 -354537 -422374 -245014 -338592
22050c38592j837o0908j74911n3502l9150J74896R4364L2249q9606n429K540J95655
$$ -338592 -340429 -401337 -576248 -629750 -668900 -494004 -399640 -367391 -456997 -462426 -459886 -264231
22038b64231J74843J61410Q606k36610J51558J1090J69577N7188l27617j66373
$$ -264231 -89388 72022 80628 -155982 -4424 6666 176243 233431 -94186 -260559
22028b60559p210K7032L6739n8588M8078K08929j8899Q2972J81207O255j61228
$$ -260559 -267769 -240737 -203998 -262586 -214508 -5579 -24478 58494 239701 245956 84728
22017H4728o2325l779j70062k71145J39208J7155K52801K98874j64088k61015
$$ 84728 22403 18624 -151438 -422583 -283375 -266220 -13419 285455 121367 -139648
22007a39648J85752l3904j99949j6578o8329L8122P9887j7444L19065M1662J0772
$$ -139648 46104 12200 -187749 -204327 -272656 -234534 -154647 -172091 146974 188636 199408
21996A99408J27600L3521p3368j40088j01449j09756J80084N744J2626l690k13745
$$ 199408 327008 360529 287161 147073 45624 -64132 115952 121696 134322 130632 -83113
21985h3113j75552k87903k6084J05442M6941n0432j28805K3433J03262J19539
$$ -83113 -258665 -546568 -572652 -467210 -420269 -470701 -599506 -576073 -472811 -353272
21975c53272J96831N971r4152J34267R9528J53870q8806m7335j34464j32019j0758
$$ -353272 -156441 -150470 -244622 -110355 -10827 143043 54237 6902 -127562 -259581 -270339
21964b70339l3781l4227j6599o259j05276J0394l319p712Q1928O9472N428K9935
$$ -270339 -304120 -338347 -354946 -361205 -466481 -456087 -459406 -467118 -385190 -315718 -310290 -280355
21952b80355j34417j77417O0844K86647K59998Q7923J2430l2954M9689k63782
$$ -280355 -414772 -592189 -531345 -244698 15300 103223 115653 82699 132388 -131394
21942a31394l1865j5797p6653K0281J36457O212J20358r3054j11129l036j0078
$$ -131394 -163259 -179056 -255709 -235428 -98971 -92759 27599 -65455 -176584 -179620 -189698
21931a89698n7111O8471n3348R3263J11416N5063J31092L19197j41919l06621
$$ -189698 -246809 -178338 -231686 -138423 -27007 28056 159148 478345 336426 29805
21921B9805l74905l0644N3643M421K63925R6558j0208j6196j40433j68877M4124
$$ 29805 -345100 -375744 -322101 -317680 -53755 42803 32595 16399 -124034 -292911 -248787
21910b48787J35760n6779J1602J18228J08731j00051j52467k15940J02672P9163
$$ -248787 -113027 -169806 -158204 -39976 68755 -31296 -183763 -399703 -297031 -217868
21900b17868j11354j14524K34596o366L4923J16156J91954L2587p3033J47736
$$ -217868 -329222 -443746 -209150 -215516 -180593 -64437 127517 160104 87071 234807
21890B34807m348j43259j05321K0366M28501K21902r9075l91511m47589J33687
$$ 234807 230459 87200 -18121 2245 430746 652648 553573 162062 -285527 -151840
21880a51840J88507m673j08911J21828J36481m1746J6160J25933j86720p0578
$$ -151840 36667 31994 -76917 44911 181392 139646 155806 281739 95019 24441
21870B4441j4446j28964k61003J03793R967M430J16788M0510j01349K19171r6356
$$ 24441 9995 -118969 -379972 -276179 -266212 -261782 -144994 -104484 -205833 13338 -83018
21859h3018j16242o9274O0869k16884o8055L27933K53030o0105j54701N5073O4399
$$ -83018 -199260 -268534 -207665 -424549 -492604 -164671 88359 28254 -126447 -71374 -6975
21848f975R6377K5419R2740J36907j98987k07344k25108J44359j26559j16339
$$ -6975 89402 114821 207561 344468 145481 -61863 -286971 -142612 -269171 -385510
21838c85510Q4151K2480K61625J90700j5544l38992o330M8927q1652o6698J18672
$$ -385510 -301359 -278879 -17254 173446 157902 -181090 -187420 -138493 -220145 -286843 -168171
21827a68171j00384K34172N3549k52086j65925L4316L08402j3601j78630k78004
$$ -168171 -268555 -34383 19166 -232920 -398845 -364529 -56127 -69728 -248358 -526362
21817e26362O5211J92741p6148J16005l8666k27234Q0798J40504m0170L33258
$$ -526362 -461151 -268410 -344558 -228553 -267219 -494453 -413655 -273151 -313321 19937
21807A9937J38607j30150L3332J73394k6944m30254n6432J05652J6112q1780R490
$$ 19937 158544 28394 61726 235120 208176 -222078 -278510 -172858 -156746 -238526 -229036
21796b29036j9272N7271J62279J30910K656R3968l278l30833k02020n2502J18634
$$ -229036 -248308 -191037 -28758 102152 104808 198776 195498 -135335 -337355 -389857 -271223
21785b71223K93100O881O4065j89651m8137J56696l2210j76819j00254j50749
$$ -271223 21877 28758 92823 -96828 -144965 11731 -20479 -197298 -297552 -448301
21775d48301j20830Q0180J71782K64859K71474J19050N2376k01979j48167j51871
$$ -448301 -569131 -488951 -317169 -52310 219164 338214 390590 188611 40444 -111427
21765a11427n798J84649J85751n1637k30447j36070J52524l8534j2974r948j2227
$$ -111427 -117225 67424 253175 201538 -28909 -164979 -12455 -50989 -63963 -73911 -86138
21754h6138m17340K03035N1957j41879K56185J93099R9698J096k75460l29715
$$ -86138 -503478 -300443 -248486 -390365 -134180 58919 158617 159713 -115747 -445462
21744d45462J2750J74675j68314K4510K59084J43868K1467j279O8580J08053j34666
$$ -445462 -432712 -258037 -426351 -401841 -142757 1111 22578 21299 89879 197932 63266
21733F3266r7558J99174J87757j63324n1461k23062m03580j55171M40315P7250
$$ 63266 -34292 164882 352639 189315 137854 -85208 -488788 -643959 -203644 -126394
21723a26394O2623J39830l4046q3327n1696K4324p871K52702p5387j83926j70496
$$ -126394 -63771 76059 42013 -41314 -93010 -68686 -76557 176145 100758 -83168 -253664
21712b53664k11874Q3974N8179K15423Q8323O1578k40060J02296K04211l070k0966
$$ -253664 -465538 -381564 -323385 -107962 -19639 41939 -198121 -95825 108386 105316 84350
21701H4350n1981n2273p1349J1182M944l7677K35917O5677j35185K6385p3776
$$ 84350 32369 -19904 -91253 -80071 -75127 -112804 123113 188790 53605 79990 6214
21690F214K48593K13732k24699j63240J1428J14193q1768j75959k08580J20113
$$ 6214 254807 468539 243840 80600 92028 206221 124453 -51506 -260086 -139973
21680a39973J57371k6077j2334k190K57764o4304N9519J77977J028k21899j2149
$$ -139973 17398 -8679 -21013 -23203 234561 170257 229776 407753 408781 186882 174733
21669A74733k3295K24049N8218k14507m97229n8132p5327m4611k6364K27496K73960
$$ 174733 151438 375487 433705 219198 -278031 -336163 -411490 -456101 -482465 -254969 18991
21658A8991R3400K7035k09355j60962J9665J34526J85856J14714J4388j24907
$$ 18991 112391 139426 -69929 -230891 -211226 -76700 109156 223870 238258 113351
21648A13351m8227N7051r0696J61993K04169k8930j30042j75407K3028o4491j01786
$$ 113351 65124 122175 31479 193472 397641 368711 238669 63262 86290 21799 -79987
21637g9987P0619K01956l5503r3598j01642l16569M6953L25697J22883p4738j40119
$$ -79987 -9368 192588 157085 63487 -38155 -354724 -307771 17926 140809 66071 -74048
21626g4048o4558j73968p5511K96331J68967q9830j00910P1149K23314j2788j68326
$$ -74048 -138606 -312574 -388085 -91754 77213 -12617 -113527 -42378 180936 168148 -178
21615a78k9201K11650P8956Q0289k2016o9680k50362j35893P4620K69356j07992
$$ -178 -29379 182271 261227 341516 319500 249820 -542 -136435 -61815 207541 99549
21604I9549j40007J05046J39760J02957Q5737j05493l5242j32513q7827R4277
$$ 99549 -40458 64588 204348 307305 393042 287549 252307 119794 31967 126244
21594A26244o59j67521j01680p6854j44613l7255R8785K64108J93973J25661K9011
$$ 126244 125585 -41936 -143616 -220470 -365083 -402338 -303553 -39445 154528 280189 309200
21583C09200j38478l64215p5433O9056P1612J66644k0665J38471J47998k7488
$$ 309200 170722 -193493 -268926 -199870 -128258 38386 17721 156192 304190 276702
21573B76702j37551m3417j35618j26778j32572r709p8158L43543M1740j10889
$$ 276702 139151 95734 -39884 -166662 -299234 -308943 -387101 -43558 -1818 -112707
21563a12707K3222J41579q3168k2125P4771J84710J30928j67460j10545j55913
$$ -112707 -89485 52094 -31074 -53199 21572 206282 337210 169750 59205 -96708
21553i6708O4786J96736P8780K74587p3838n12525m7963J69443K36703m126o5591
$$ -96708 -31922 164814 243594 518181 444343 -68182 -116145 53298 290001 285875 220284
21542B20284k23610J69676K14241n4871m0526L660O9448M005l6911R1284j38504
$$ 220284 -3326 166350 380591 325720 285194 288854 358302 362307 325396 416680 278176
21531B78176j02946j79061k63492q0522P4089J88782J54453j15224j55387n0194
$$ 278176 175230 -3831 -267323 -347845 -273756 -84974 69479 -45745 -201132 -251326
21521b51326K11662P4125j1707R5664j03093j76663j4404j24799j54825J2726
$$ -251326 -39664 34461 22754 118418 15325 -161338 -175742 -300541 -455366 -442640
21511d42640o5207K44112K43518j2238N0312k2490k53386K9583J34297L13668
$$ -442640 -507847 -263735 -20217 -32455 17857 -4633 -258019 -228436 -94139 219529
21501B19529k52529j37991J3082l281K41025j5991j20428o8628k16358j83805
$$ 219529 -33000 -170991 -157909 -161190 79835 63844 -56584 -125212 -341570 -525375
21491e25375J45154M5706L58141k73937k85134J28601Q3862o2068K40376M23412
$$ -525375 -380221 -334515 23626 -250311 -535445 -406844 -322982 -385050 -144674 278738
21481B78738N7104J6161p2617k48934p4527k98276M558P2545M1136J8910L304
$$ 278738 335842 352003 279386 30452 -44075 -342351 -337793 -265248 -224112 -205202 -201898
21470b01898j10502K10969K1285k7828n9090j3213q9252O447P3224J66101n257
$$ -201898 -312400 -101431 -80146 -107974 -167064 -180277 -269529 -263082 -189858 -23757 -29014
21459b9014j57763N3621k235O2048l0446J05345J61638M8096j26825m01724j06721
$$ -29014 -186777 -133156 -135391 -73343 -103789 1556 163194 211290 84465 -317259 -423980
21448d23980L19968k4766k5200J16838L5713J77105R9510Q6654j45552k49807
$$ -423980 -104012 -128778 -153978 -37140 -1427 175678 275188 361842 216290 -33517
21438c3517k11289k9682K12881L56281N4880j4043m30309j500j4859k3685J0767
$$ -33517 -244806 -274488 -61607 294674 349554 335511 -94798 -96298 -111157 -134842 -124075
21427a24075O7668J27631J465o6987o1710j20695j16789r363l1364N1362J26285
$$ -124075 -56407 71224 72689 5702 -56008 -176703 -293492 -302855 -334219 -282857 -156572
21416a56572L28884L1474k35434j12590k33758q3594Q6193J03733k00270j47082
$$ -156572 172312 203786 -31648 -144238 -377996 -461590 -375397 -271664 -471934 -619016
21406f19016O7567K39562o186j39984J46458J55949N4077k23576j79627L21756
$$ -619016 -551449 -311887 -318073 -458057 -311599 -155650 -101573 -325149 -504776 -183020
21396a83020J59591k14551J22604J75803j89859J48525J85461j94676M7415N6669
$$ -183020 -23429 -237980 -115376 60427 -129432 19093 204554 9878 57293 113962
21386A13962n3064k02853p5249n8535j17285K32826P8232J96781J36971j07315
$$ 113962 60898 -141955 -217204 -275739 -393024 -160198 -81966 114815 251786 144471
21376A44471k33144L3676j5284k70349j52489L4946L07145N5937O6553J22124
$$ 144471 -88673 -54997 -70281 -340630 -493119 -458173 -151028 -95091 -28538 93586
21366I3586Q9912j15513j35959Q4225K07680j32292N3361K1900j39011j10043
$$ 93586 183498 67985 -67974 16251 223931 91639 145000 166900 27889 -82154
21356h2154k51630k81823J52062L28340Q1132o3667R6063J28442j09537k39487
$$ -82154 -333784 -615607 -463545 -135205 -54073 -117740 -21677 106765 -2772 -242259
21346b42259j6402J7629j39380J74643J27527j43072l03494J55878K98430J38830
$$ -242259 -258661 -241032 -380412 -205769 -78242 -221314 -524808 -368930 -70500 68330
21336F8330N088j51598j08661L05397m7074q8906m7022J6734J20728K7241k09720
$$ 68330 73418 -78180 -186841 118556 71482 -17424 -64446 -47712 73016 100257 -109463
21325a09463l8218L2559j8997P3639K15974Q7282r1109k88795n798L5020n2310
$$ -109463 -147681 -115122 -134119 -60480 155494 242776 151667 -137128 -142926 -107906 -160216
21314a60216o0887J02882J40728n56K48876j84911k09267l5263k3991k5878J91616
$$ -160216 -221103 -118221 22507 21951 270827 85916 -123351 -158614 -182605 -208483 -16867
21303a6867j8289L3590J19700J45786l4253J39065j54242J05284J65407m3957
$$ -16867 -35156 -1566 118134 263920 229667 368732 214490 319774 485181 441224
21293D41224N9808j92482r6213l352J42127j65205l43357l5711M5436Q85J1598
$$ 441224 501032 308550 212337 208985 351112 185907 -157450 -193161 -147725 -146840 -135242
21282a35242L01668j83408j16921K76589J33410J32N7114j59189m2442J9799l8341
$$ -135242 166426 -16982 -133903 142686 276096 276228 333342 174153 131711 151510 113169
21271A13169p368P3006l02937k3610K99110P3716J14309O7630j95097n6314j92943
$$ 113169 105801 178807 -124130 -147740 151370 225086 339395 407025 211928 155614 -37329
21260c7329J32105Q5344k25305k87297j51091j49098N2065j1240L9587J09478
$$ -37329 94776 180120 -45185 -332482 -483573 -632671 -580606 -591846 -552259 -442781
21250d42781K01841J32261j13066J39770K23654L8796j2990m5951j06349L5265
$$ -442781 -240940 -108679 -221745 -81975 141679 180475 167485 121534 15185 50450
21240E0450J37955m4616k26668J00107K09328j61542j4553J22559j86808q0896
$$ 50450 188405 143789 -82879 17228 226556 65014 50461 173020 -13788 -94684
21230i4684J80375J66095j43813r529O8073L048k44158n6168Q2716j2644j126
$$ -94684 85691 251786 107973 98444 166517 169565 -74593 -130761 -48045 -60689 -61815
21219f1815j09870J33413K00038k14627k53480J02097J95320K08655K43317r147
$$ -61815 -171685 -38272 161766 -52861 -306341 -204244 -8924 199731 443048 433901
21209D33901k43273k3226k92155N8786J25687j69525K9461R2039M0992J38014
$$ 433901 190628 167402 -124753 -65967 59720 -109805 -80344 11695 52687 190701
21199A90701O9909k5691k82787j98963M3767j20945r5839J42167K31276j86773
$$ 190701 260610 234919 -47868 -246831 -203064 -324009 -419848 -277681 -46405 -233178
21189b33178P5774J39770J71350J35816l6159j07916n4977j25306N9007O5587
$$ -233178 -157404 -17634 153716 289532 253373 145457 90480 -34826 24181 89768
21179H9768K52138j47596j92989N0939J04740n7823j54001P1348n2811P6944n9118
$$ 89768 341906 194310 1321 52260 157000 99177 -54824 16524 -36287 40657 -18461
21168a8461K2059N4000l73529j38121J64448J18141J24620q4013N5373r9275k13824
$$ -18461 3598 57598 -315931 -454052 -289604 -171463 -46843 -130856 -75483 -174758 -388582
21157c88582J08760J02829R2485Q7608j60215j16867Q8631q5746J8656j03683
$$ -388582 -279822 -176993 -84508 3100 -157115 -273982 -185351 -271097 -252441 -356124
21147c56124J46193M9401J31191J53226n6185j80349j21377K9156J8742k2271
$$ -356124 -209931 -160530 -29339 123887 67702 -112647 -234024 -204868 -186126 -208397
21137b08397K66703J18727L158j02238j36830q0966O6546K47019J08570N599K26322
$$ -208397 58306 177033 180191 77953 -58877 -139843 -73297 173722 282292 287891 514213
21126E14213j57093j41678l58414k87926J64838J3141O6858L0143O6520j87232
$$ 514213 357120 215442 -142972 -430898 -266060 -252919 -186061 -155918 -89398 -276630
21116b76630j4129k8912q8571p4403J89957J10110k6233K7287m6342j74071J19666
$$ -276630 -290759 -319671 -408242 -482645 -292688 -182578 -208811 -181524 -227866 -401937 -282271
21105b82271J47840j29585J41241J48679J65O423l5286J04889Q6502J19268O9114
$$ -282271 -134431 -264016 -122775 25904 26069 32492 -2794 102095 188597 307865 376979
21094C76979k9206N0262q9528M1801q1300J2334j86103j48450J98655o8660J03272
$$ 376979 347773 398035 308507 350308 269008 281342 95239 -53211 145444 76784 180056
21083A80056k00710r2568K00783n3253K2481k8111L4285K15909j6400q3093J41800
$$ 180056 -20654 -113222 87561 34308 56789 28678 62963 278872 262472 179379 321179
21072C21179J37369j2673p3081j81864J0317k36745k25193k19675M0415L81451
$$ 321179 458548 445875 372794 190930 201247 -35498 -260691 -480366 -439951 -58500
21062e8500O2062L2332P2397o9545M9338N21o1785o7417j19237l30780r0061L72758
$$ -58500 3562 35894 108291 38746 88084 88605 26820 -40597 -159834 -490614 -580675 -207917
21050b07917K33630O5917m4208L261l8477m1490n0506J3984Q2333M1685l1463
$$ -207917 25713 91630 47422 50683 12206 -29284 -79790 -65806 16527 58212 26749
21039B6749K659O9988P0878k14122j06149L757J45518J28292k75546j62816n1038
$$ 26749 29408 99396 170274 -43848 -149997 -146240 -722 127570 -147976 -310792 -361830
21028c61830J2725n9783J96624K55028o6769j8443J12617k6856Q9973j34010M5051
$$ -361830 -349105 -408888 -212264 42764 -24005 -42448 70169 43313 133286 -724 44327
21017D4327Q7924J3529O4301k28483l8529j45050P6562J91276j05725K632o181
$$ 44327 132251 145780 210081 -18402 -56931 -201981 -125419 65857 -39868 -37236 -43417
21006d3417J36544n8006j90992k28525J755J39828j17341q573Q1725o963k7708
$$ -43417 93127 35121 -155871 -384396 -382641 -242813 -360154 -368727 -287002 -293965 -321673
20995c21673l6971o9536M3290J29928K52518k8427j53700J53093l8631R4996j25782
$$ -321673 -358644 -428180 -384890 -254962 -2444 -30871 -184571 -31478 -70109 24887 -100895
20984a00895N2759J20056J87883J33881K1091l907p1212r3805j20395L46176M8612
$$ -100895 -48136 71920 259803 393684 414775 410868 339656 245851 125456 471632 520244
20973E20244j79898k34995l48634J8845J78328n6314k35713n3411R8428K43087
$$ 520244 340346 105351 -243283 -224438 -46110 -102424 -338137 -391548 -293120 -50033
20963e0033K4995o672O5360N9602J14412k7350o0166M135L3594N4161o7568j78746
$$ -50033 -25038 -31710 33650 93252 207664 180314 120148 124283 157877 212038 144470 -34276
20951c4276r8158J06505j24861k6504J53386n5724J33659k5376J49417J073k02321
$$ -34276 -132434 -25929 -150790 -177294 -23908 -79632 54027 28651 178068 179141 -23180
20940b3180J6025m5794k02798J14113K18043j48815j25825J15930j80376j31313
$$ -23180 -7155 -52949 -255747 -141634 76409 -72406 -198231 -82301 -262677 -393990
20930c93990M1453J98634J43909J30695K22214j91675j37962P7491o0926J74113
$$ -393990 -352537 -153903 -9994 120701 342915 151240 13278 90769 29843 203956
20920B03956k1602k87952J0887q1603k09870N2235J6220J55003K07350k0109L7895
$$ 203956 182354 -105598 -94711 -176314 -386184 -333949 -317729 -162726 44624 24515 62410
20909F2410J66366Q6775n6852j05041l0041J6721k81084j8971J95288M9713O7213
$$ 62410 228776 315551 258699 153658 123617 140338 -140746 -159717 35571 85284 152497
20898A52497l071j19135j77198L0887N8509l88852k28444k6946J24385L8447L32493
$$ 152497 149426 30291 -146907 -116020 -57511 -446363 -674807 -701753 -577368 -538921 -206428
20887b06428P2544n3903K59094q7249o8116M5637J12020K4769l2210M6326j23731
$$ -206428 -133884 -187787 71307 -15942 -84058 -38421 73599 98368 66158 112484 -11247
20876a1247k15782J21124j9675N3762j7520J33989J35634k01189O5193N3097J8789
$$ -11247 -227029 -105905 -125580 -71818 -89338 44651 180285 -20904 44289 97386 116175
20865A16175j0699O4453j09642j51711j00555k9422K98972M0520q19j64261j8597
$$ 116175 105476 169929 60287 -91424 -191979 -221401 77571 118091 117272 -46989 -65586
20854f5586M3324j88243k38358K38404j6035j29038J89337R6822j4440J60558
$$ -65586 -22262 -210505 -448863 -210459 -226494 -355532 -166195 -69373 -83813 76745
20844G6745l7508L6430R3394J02402j28129n975J88350O5799l59937m62294j03644
$$ 76745 39237 75667 169061 271463 143334 137359 325709 391508 31571 -430723 -534367
20833e34367J67217J05186Q6427J06211r7482M8527M5920o0593p7933K44767j65161
$$ -534367 -367150 -261964 -175537 -69326 -166808 -118281 -72361 -132954 -210887 33880 -131281
20822a31281k2678J88030M3521j38431n7565L09138k4008l28739Q3426P3762k2300
$$ -131281 -153959 34071 77592 -60839 -118404 190734 166726 -162013 -78587 -4825 -27125
20811b7125j08185j42558L11757J53451K68302K10881O5426k78054q9399K9751
$$ -27125 -135310 -277868 33889 187340 455642 666523 731949 453895 364496 394247
20801C94247k36254k5772M5245p8897m662l8484m7692J6741L02Q5148Q9556j22373
$$ 394247 157993 132221 177466 98569 93907 55423 7731 24472 24774 109922 199478 77105
20789G7105j14328J01613k18488k41427O2494K77291n2140j68072j2366J0590
$$ 77105 -37223 64390 -154098 -395525 -333031 -55740 -107880 -275952 -288318 -277728
20779b77728k0686j0105J22528K64274J21700K33352j0390q2067r8675l57061
$$ -277728 -298414 -308519 -185991 78283 199983 433335 422945 340878 242203 -114858
20769a14858j33491K37553K80411n6451j82781k9443J8189L1342k28223J00947
$$ -114858 -248349 -10796 269615 213164 30383 940 19129 50471 -177752 -76805
20759g6805M388k58201J14382J47138J73175k9475j85183J1673K64863K8817P0564
$$ -76805 -72417 -330618 -216236 -69098 104077 74602 -110581 -98908 165955 194772 265336
20748B65336j07554j56263j44698M3376J91200J97320l7862q3999L3078M8818
$$ 265336 157782 1519 -143179 -99803 91397 288717 250855 166856 199934 248752
20738B48752k25107l50708j4803o8268J04259J14364n952R5347k3842m162k41317
$$ 248752 23645 -327063 -341866 -410134 -305875 -191511 -197463 -102116 -125958 -130120 -371437
20727c71437o90J65249Q1501N0118R789p9161o5480N9957M2163j05918J27416
$$ -371437 -372127 -206878 -125377 -75259 -65470 -144631 -210111 -150154 -107991 -213909 -86493
20716h6493j33597j35990J45071K209K96171J70811k1177j8048K9273l28857j35081
$$ -86493 -220090 -356080 -211009 -208800 87371 258182 237005 218957 248230 -80627 -215708
20705b15708m800k698j65840P5124L20637J31886j39814j63934M4010K6913J03004
$$ -215708 -220508 -223206 -389046 -313922 6715 138601 -1213 -165147 -121137 -94224 8780
20694H780J82715l5228j5774K13821Q3852P7229K3744p9968k92514j99643j09681
$$ 8780 191495 156267 140493 354314 438166 515395 539139 459171 166657 -32986 -142667
20683a42667J19899K28359j86110k51330j6115m7275j8820L51324J90921k45967
$$ -142667 -22768 205591 19481 -231849 -247964 -295239 -314059 37265 228186 -17781
20673a7781j43452o0568K70691R4603j63786J32340J18186K1780O3914j21531
$$ -17781 -161233 -221801 48890 143493 -20293 112047 230233 252013 315927 194396
20663A94396k20883K91400K33230j24363k44387j70337k87520q9293K13111K85138
$$ 194396 -26487 264913 498143 373780 129393 -40944 -328464 -417757 -204646 80492
20653H0492K6784j0835J93889j75153l94914J35838N5603J46177k9575p2449J85113
$$ 80492 107276 96441 290330 115177 -279737 -143899 -88296 57881 28306 -44143 140970
20642A40970j58711n3947m499J4540n7773q4047J62058J48725k6247Q7937j02782
$$ 140970 -17741 -71688 -76187 -61647 -119420 -203467 -41409 107316 81069 169006 66224
20631F6224k80459J9013P2278K30594J6493j63712j509o3887K01692N9086J09871
$$ 66224 -214235 -195222 -122944 107650 124143 -39569 -41078 -104965 96727 155813 265684
20620B65684j10518l0084K14865N520K1226l5294j77661l51242j24839j06309
$$ 265684 155166 125082 339947 345467 366693 331399 153738 -197504 -322343 -428652
20610d28652M4653J67584K65514J00378j09153j14533J71263J24865j32784p9102
$$ -428652 -383999 -216415 49099 149477 40324 -74209 97054 221919 89135 10033
20600A0033O2841p3211O0425j41651l03394j6789L34679K1712J0147J27421P6014
$$ 10033 72874 -337 60088 -81563 -384957 -401746 -67067 -45355 -35208 92213 168227
20589A68227k45120j30399L06353K20614L3075j42185k2409j27535k1951o252
$$ 168227 -76893 -207292 99061 319675 352750 210565 188156 60621 38670 32418
20579C2418J60706O8221J15618j47144l25662j44052J50727K29753j18846j95046
$$ 32418 193124 261345 376963 229819 -95843 -239895 -89168 140585 21739 -173307
20569a73307l6541K51658l8512r6262J26559j5520M1175Q4796K239J05417r6378
$$ -173307 -209848 41810 3298 -92964 33595 18075 59250 144046 146285 251702 155324
20558A55324j02092R2430k9947J86181j47063l0821J75654R9944j99380j53772
$$ 155324 53232 145662 115715 301896 154833 124012 299666 399610 200230 46458
20548D6458j04144L1051M5829M2554K7540p8206J15781j16455k45178r0897k8500
$$ 46458 -57686 -26635 19194 61748 89288 11082 126863 10408 -234770 -325667 -354167
20537c54167J40461J14752K14041J92961j64271j3002k34927k08656J54668R9554
$$ -354167 -213706 -98954 115087 308048 143777 130775 -104152 -312808 -158140 -58586
20527e8586P9017N746J6884K7997j86741j19708J42017Q0527K9458o7212q9822
$$ -58586 20431 26177 43061 71058 -115683 -235391 -93374 -12847 16611 -50601 -140423
20516a40423j94768j74348R9827J10657q2308K9367K63545O0755J47255J08977
$$ -140423 -335191 -509539 -409712 -299055 -381363 -351996 -88451 -27696 119559 228536
20506B28536j85537J0596m24p9985j16227J04483j60902j69215j67108L5103Q1322
$$ 228536 42999 53595 53171 -26814 -143041 -38558 -199460 -368675 -535783 -500680 -419358
20495d19358J68222r6780K13248K02915J2040k1850l18193j31109K60465J95117
$$ -419358 -251136 -347916 -134668 68247 80287 58437 -259756 -390865 -130400 64717
20485F4717J85339L0693J75253p0537j55526k91130N6406L87446j44203j06349
$$ 64717 250056 280749 456002 385465 229939 -61191 -4785 382661 238458 132109
20475A32109O6126k17186k01937J27163j1875N8673R145J35851n8885l75221M7668
$$ 132109 198235 -18951 -220888 -93725 -105600 -46927 -37782 98069 39184 -336037 -288369
20464b88369K1018j78956M4340K22462J16809Q1143L8380M4086k09871k79858
$$ -288369 -267351 -446307 -401967 -179505 -62696 18447 56827 100913 -108958 -388816
20454c88816j16407J9236K61481J47469J87888J09753k3697r9125o5661j94500
$$ -388816 -505223 -485987 -224506 -77037 110851 220604 196907 97782 32121 -162379
20444a62379j79295K9473L23915j50336j9225j77530R1401J69313n1862l24188
$$ -162379 -341674 -312201 11714 -138622 -157847 -335377 -243976 -74663 -126525 -450713
20434d50713M2505J61919j57873N2938J51109o576o6564K47375K50600K9668k49493
$$ -450713 -408208 -246289 -404162 -351224 -200115 -206691 -273255 -25880 224720 254388 4895
20423D895Q0187K63596J35670k47484m15064k31422J39435J44449J43487n2675
$$ 4895 85082 348678 484348 236864 -178200 -409622 -270187 -125738 17749 -34926
20413c4926j10609p2747j4547r6600J26121L56261J06514m092Q839J2925O3509
$$ -34926 -145535 -218282 -232829 -329429 -203308 152953 259467 255375 264214 277139 340648
20402C40648o9093j83817K1557k8881n0754r8372j62k16340j47906L26927L95631
$$ 340648 271555 87738 109295 80414 29660 -68712 -68874 -285214 -433120 -106193 289438
20391B89438j89583K014q3994j07942J18246r7054N3026J32544j31399J20874
$$ 289438 99855 101869 17875 -90067 28179 -68875 -15849 116695 -14704 106170
20381A06170J40647o7719J39908O4270j59707j00463j06053J86797K02432j28271
$$ 106170 246817 179098 319006 383276 223569 123106 17053 203850 406282 278011
20371B78011j14428m9711k98547l8330j32379L7583K25271J23824P6824P5712
$$ 278011 163583 113872 -184675 -223005 -355384 -317801 -92530 31294 108118 183830
20361A83830R0528P9595j71970k05088r3912o7501K3166K52446n3577j57024O0989
$$ 183830 274358 353953 181983 -23105 -117017 -184518 -161352 91094 37517 -119507 -58518
20350e8518L3062p0899J6393J13951K09022J07629K657j79015m0417R2520n7138
$$ -58518 -25456 -96355 -79962 33989 243011 350640 353297 174282 133865 226385 169247
20339A69247K02138M154o4245p5872o1998j81425l41150p6682J71756J70530p9224
$$ 169247 371385 375539 311294 235422 173424 -8001 -349151 -425833 -254077 -83547 -162771
20328a62771n0658K04244p8000j2160J58274j35313k32625L1730j43471K7003
$$ -162771 -213429 -9185 -87185 -99345 58929 -76384 -309009 -277279 -420750 -393747
20318c93747K3778N5495K20630M9402q9997o0608M1351J33217j17286j03440Q0886
$$ -393747 -369969 -314474 -93844 -44442 -134439 -195047 -153696 -20479 -137765 -241205 -160319
20307a60319K33091N3606l9444L819Q0370k23182O5995O1391m3864Q0155l7738
$$ -160319 72772 126378 86934 90753 171123 -52059 13936 75327 31463 111618 73880
20296G3880J08054j56542j1600J09265o0185j16364j77301N6338R346p8921l1720
$$ 73880 181934 25392 13792 123057 62872 -53492 -230793 -174455 -165109 -244030 -275750
20285b75750P0799n1543q3668P5720J15372Q5895N9601j15105k68795q0471J08550
$$ -275750 -204951 -256494 -340162 -264442 -149070 -63175 -3574 -118679 -387474 -467945 -359395
20274c59395L47763J62586k40490j77054k6398M53153N1129J2258O2266J16091
$$ -359395 -11632 150954 -89536 -266590 -292988 160165 211294 223552 285818 401909
20264D01909k09354q2346R2257q9569n6809k4451Q4332M9207j9701J04739J8439
$$ 401909 192555 110209 202466 112897 56088 31637 115969 165176 145475 250214 268653
20253B68653J83172l05384k65908P9778J00349j06271j90852k71228q4245J34828
$$ 268653 451825 146441 -119467 -39689 60660 -45611 -236463 -507691 -591936 -457108
20243d57108J11848J30475K32503K4757K17589K15160j47160j02249N0358m5207
$$ -457108 -345260 -214785 17718 42475 260064 475224 328064 225815 276173 230966
20233B30966m7573J4868j7041K3558l54154k31265K55534L11402k19918j28630
$$ 230966 183393 198261 181220 204778 -149376 -380641 -125107 186295 -33623 -162253
20223a62253l9748L1933J86393O5740J06883p083J40620j17629j70639j58715
$$ -162253 -202001 -170068 16325 82065 188948 181865 322485 204856 34217 -124498
20213a24498J54683J41235k00900k85001J36069k4841J02714r951j40210M2811
$$ -124498 30185 171420 -29480 -314481 -178412 -203253 -100539 -110490 -250700 -207889
20203b07889K33490L8463o3504r9529N6235j44564J5745j64268L1632m718K96814
$$ -207889 25601 64064 560 -98969 -42734 -187298 -171553 -335821 -304189 -308907 -12093
20192a2093J73813L22453J85022k08266J18470j6246k21854R0921K24136J27554
$$ -12093 161720 484173 669195 460929 579399 563153 341299 432220 656356 783910
20182G83910j24930j61395K5109k42685p872J97635L1873J38392J03287Q5671
$$ 783910 658980 497585 522694 280009 272137 469772 501645 640037 743324 828995
20172H28995M556k80279j34460k0635R5534o7965O4199j1939k74868n0004J92858
$$ 828995 833551 553272 418812 398177 493711 425746 489945 478006 203138 153134 345992
20161C45992J18088q6339K09452L39264J36494r4935j02880m5457j14754l9998
$$ 345992 464080 377741 587193 926457 1062951 968016 865136 819679 704925 664927
20151F64927M0233J02582q9459P1263J1772j73480n4524J52407N8611j75149j91447
$$ 664927 705160 807742 718283 789546 801318 627838 573314 725721 784332 609183 417736
20140D17736p2131k21659K61577L03690r2451k41296J1628K25016j49623m29036
$$ 417736 345605 123946 385523 689213 596762 355466 367094 592110 442487 13451
20130A3451j89004J93180n1854r348L25326J34641j5320o8666j40198k39502M0172
$$ 13451 -175553 17627 -34227 -43575 281751 416392 401072 332406 192208 -47294 -7122
20119g122J0449P2057K06812Q3770q4436n7125o8906J7965l7153j33488l0896
$$ -7122 3327 75384 282196 365966 281530 224405 155499 173464 136311 2823 -28073
20108b8073j0588J65555m6258Q0852j00014j06190J81178K49586J13072j03359
$$ -28073 -38661 126894 80636 161488 61474 -44716 136462 386048 499120 395761
20098C95761r830r058L0690k4425r1887j18165j76007K71973j26811j03384J11269
$$ 395761 385931 376873 407563 383138 291251 173086 -2921 269052 142241 38857 150126
20087A50126q5964l803P4879j93723N93R6762M9710K37715q7215k0524j21998
$$ 150126 64162 60359 135238 -58485 -57892 38870 88580 326295 239080 218556 96558
20076I6558M8580m8120P8696J39805J36072j46954p1851l38195k66066K4681Q2177
$$ 96558 145138 97018 175714 315519 451591 304637 232786 -105409 -371475 -346794 -264617
20065b64617J10136J7985K22020N4223n8136k6954j04664k29948q2078K76129
$$ -264617 -154481 -136496 85524 139747 81611 54657 -50007 -279955 -362033 -85904
20055h5904N5138p988p356J55365j29483J63647J24549p840l4336p0196O5260
$$ -85904 -30766 -38754 -46110 109255 -20228 143419 267968 260128 225792 155596 220856
20044B20856Q0721K03999K78079J7467l15617k49663j82009J27168j75664n4210
$$ 220856 301577 505576 783655 801122 485505 235842 53833 181001 5337 -48873
20034d8873J2238k89984O9995L8495j19379J67572O1864m1407j60287r979j66121
$$ -48873 -36635 -326619 -256624 -218129 -337508 -169936 -108072 -149479 -309766 -319745 -485866
20023d85866M2554N4855O9792K3545j19549O2514K01247K65393l85504q7133K42287
$$ -485866 -443312 -388457 -318665 -295120 -414669 -352155 -150908 114485 -271019 -358152 -115865
20012a15865l3194P8736q8992M9343r4626Q2549Q3833k0287l0543J40306M2918
$$ -115865 -149059 -70323 -159315 -109972 -204598 -122049 -38216 -58503 -89046 51260 94178
20001I4178j21889J58143q5773j7710j30061K7227N1466n9639j2163J09529m0415
$$ 94178 -27711 130432 44659 26949 -103112 -75885 -24419 -84058 -96221 13308 -27107
19990b7107J55541q6958m6055k1940k40231k02766j28819M291M06627K63771J11779
$$ -27107 128434 41476 -4579 -26519 -266750 -469516 -598335 -594044 -187417 76354 188133
19979A88133n5139j92903K1047J47622l6644j08293M5238J2376j23007K31922
$$ 188133 132994 -59909 -38862 108760 72116 -36177 9061 21437 -101570 130352
19969A30352O6329L59995O9769m36454l22808O2019K53531o899j71875J80349
$$ 130352 196681 556676 626445 189991 -132817 -70798 182733 175834 3959 184308
19959A84308P825r7604j79887k103K5641L5553j3110j84255k3581j56097K88066
$$ 184308 192133 94529 -85358 -87461 -61820 -26267 -39377 -223632 -247213 -403310 -115244
19948a15244K49226J31458m7649j71289j87744p190K09882L73092j2639j67979
$$ -115244 133982 265440 217791 46502 -141242 -148432 61450 434542 421903 253924
19938B53924m28796j56005J0223K03584J89711j8316k24587j56654K03242l3015
$$ 253924 -174872 -330877 -320654 -117070 72641 54325 -170262 -326916 -123674 -156689
19928a56689l9513R1124j42468K08277J72885O830n778j49990p8567k09815K8289
$$ -156689 -196202 -105078 -247546 -39269 133616 140446 134668 -15322 -93889 -303704 -275415
19917b75415J89223K6530j56649J37354K14281k9874j33053j37281J27652J10098
$$ -275415 -86192 -59662 -216311 -78957 135324 105450 -27603 -164884 -37232 72866
19907G2866j83606J62978M26186J65930j72614k56563j60858n5774j90845m450
$$ 72866 -110740 52238 478424 644354 471740 215177 54319 -1455 -192300 -196750
19897a96750M2173J2245q402L2788L12474K68066j26480j48538J43053j34598
$$ -196750 -154577 -142332 -150734 -117946 194528 462594 336114 187576 330629 196031
19887A96031q3329k59359P2732K0908J16669L42656j6328k3836P161j23081r8699
$$ 196031 112702 -146657 -73925 -53017 63652 406308 389980 366144 373305 250224 151525
19876A51525j06313j54681J30765J67384m0228m1702j18581J06736L028K2098
$$ 151525 45212 -109469 21296 188680 148452 106750 -11831 94905 97933 120031
19866A20031j34062J32549R969j57244k44261m5841L9127j30027J79513L86289
$$ 120031 -14031 118518 128487 -28757 -273018 -318859 -279732 -409759 -230246 156043
19856A56043K21040M3190k3679m29510j68085O2580K97983K3546j91636o5161
$$ 156043 377083 420273 396594 -32916 -201001 -138421 159562 183108 -8528 -73689
19846g3689K99576J66336L02914n9609j78933J43678k8381j03523k25474j46782
$$ -73689 225887 392223 695137 635528 456595 600273 571892 468369 242895 96113
19836I6113M6506k4614O9045M520J73572Q107j35938p3958q3043K60392J96840
$$ 96113 142619 118005 187050 191570 365142 373249 237311 163353 80310 340702 537542
19825E37542j0552L1674q4418j72969O596j10929J90661j41465N6107k2266k26985
$$ 537542 526990 558664 474246 301277 307873 196944 387605 246140 302247 279981 52996
19814E2996p653Q8925P8855O8730q2195j6805J35738J2063k68470O4465J46472
$$ 52996 45343 134268 213123 281853 199658 182853 318591 330654 62184 126649 273121
19803B73121l8245j62699J9171K95517M5651l26550k16494K16722O6043J01953
$$ 273121 234876 72177 91348 386865 432516 105966 -110528 106194 172237 274190
19793B74190J6323J38380j72200l48255K25457K12144J02536j8099J5918j73677
$$ 274190 290513 428893 256693 -91562 133895 346039 448575 430476 446394 272717
19783B72717p7169J17557j24025J01688O4078q749l5774j91244j94286j1780J61279
$$ 272717 195548 313105 189080 290768 354846 346097 310323 119079 -75207 -86987 74292
19772G4292l2292L1710L0477J26635R209J73807j0241l7900J02974M9707J3923
$$ 74292 42000 73710 104187 230822 240031 413838 403597 365697 468671 518378 532301
19761E32301J32100J57377j67363j42549j88570j1326k5168M9037r7079l01239
$$ 532301 664401 821778 654415 511866 323296 311970 286802 335839 238760 -62479
19751f2479q7402J09208K38772J72772J5323j50491K0038R5056Q6089k9491o8683
$$ -62479 -149881 -40673 198099 370871 386194 235703 255741 350797 436886 407395 338712
19740C38712K4567K17356M2542j8251J10148q374M7240l6615j75756n623N3703
$$ 338712 363279 580635 623177 604926 715074 706700 753940 717325 541569 535946 589649
19729E89649j86415K44649J68332k71045J08532K9468j78735K1736K95572K75949
$$ 589649 403234 647883 816215 545170 653702 683170 504435 526171 821743 1097692
19719A097692L5053n9258P5995N5117j52330k53683l44999M365K94544n2483j97174
$$ 1097692 1132745 1073487 1149482 1204599 1052269 798586 453587 457952 752496 700013 502839
19708E02839j11435p3909p7398J60229M1066K33216K96644R6379r0159j00377
$$ 502839 391404 317495 240097 400326 441392 674608 971252 1067631 977472 877095
19698H77095K73952n1794j17660j5800L3507j25555q4694j30732o0370J83443
$$ 877095 1151047 1099253 981593 965793 999300 873745 789051 658319 597949 781392
19688G81392K25055j71308k9611J46442J72463J64137J13146k12717k18165Q5622
$$ 781392 1006447 835139 805528 951970 1124433 1288570 1401716 1188999 970834 1056456
19678A056456J5302k5991P2135L3481Q4916J10918J1894N1868p5068m5755K25593
$$ 1056456 1071758 1045767 1117902 1151383 1236299 1347217 1359111 1410979 1335911 1290156 1515749
19667A515749j14014j29476J47575R9207l6126p9044K25029M40535K9628K7135
$$ 1515749 1401735 1272259 1419834 1519041 1482915 1403871 1628900 2069435 2099063 2126198
19657B126198J55159J11378K97755j88700j41629n2421K13143M10454J52193K39758
$$ 2126198 2281357 2392735 2690490 2501790 2360161 2307740 2520883 2931337 3083530 3323288
19647C323288M30037L40823M03750L43818k94624J75571L97809M55839L16210
$$ 3323288 3753325 4094148 4497898 4841716 4547092 4722663 5120472 5576311 5892521
19638E892521N555J9841K70300M30139P11014P37106J056743J288300J902764
$$ 5892521 5898076 5917917 6188217 6618356 7329370 8066476 9123219 10411519 12314283
19629A2314283K335803L042441M746251P514032J1432852J4511323J5170307J4350982
$$ 12314283 14650086 17692527 22438778 29952810 41385662 55896985 71067292 85418274
19621H5418274J2979642P401714Q17259L04732J845258K267359k466580r675509
$$ 85418274 98397916 105799630 106616889 106921621 108766879 111034238 108567658 98892149
19613I8892149q015799J22534O773582R503749J0307205R294556K756376l303123
$$ 98892149 90876350 90998884 97772466 107276215 117583420 126877976 129634352 126331229
19605A26331229l338436j117443j635307q556166j6780741j6541742j1450573
$$ 126331229 122992793 121875350 120240043 111683877 94903136 78361394 66910821
19598F6910821o917347l413977k82619K721306O492664J0618385J3499316J3573502
$$ 66910821 59993474 56579497 56296878 59018184 65510848 76129233 89628549 103202051
19590A03202051J2943248J0045141L047849j203784p0707J813627L18249p425476
$$ 103202051 116145299 126190440 129238289 128034505 127963798 129777425 130095674 122670198
19582A22670198j1490182o046314K182856P742718R558123J0226379O789924j241843
$$ 122670198 111180016 105133702 107316558 115059276 124617399 134843778 141633702 140391859
19574A40391859m753635l191369j810221m633345j4020736j9634149j6824795
$$ 140391859 135638224 132446855 130636634 126003289 111982553 92348404 75523609
19567G5523609j1682966p853485n565502m413723l617302k687560k647311k459329
$$ 75523609 63840643 55987158 50421656 46007933 42390631 39703071 37055760 34596431
19559C4596431j945582j691948j256756j488250j286017q88247j007851o62894
$$ 34596431 32650849 30958901 29702145 28213895 26927878 26039631 25031780 24368886
19551B4368886n67539o59909p12117q13896q44766o41861n15728k58800l67687
$$ 24368886 23801347 23141438 22429321 21615425 20770659 20128798 19613070 19354270 18986583
19542A8986583q36243n04103o40227n47629l77840n66012n46750m30998m05479
$$ 18986583 18150340 17646237 17006010 16458381 16080541 15514529 14967779 14536781 14131302
19533A4131302l00199j86484j90604n82790p98032m80343l42920m37165m35529
$$ 14131302 13831103 13644619 13454015 12871225 12073193 11592850 11249930 10812765 10377236
19524A0377236k24514m79251m88232k72622j69253J4454k49757l44983j96082
$$ 10377236 10152722 9673471 9185239 8912617 8743364 8757818 8508061 8163078 7966996
19515G966996k22538k73594q4564k74805l43926k96288r6167J16519k80298k60788
$$ 7966996 7744458 7470864 7386300 7111495 6767569 6471281 6375114 6491633 6211335 5950547
19505E950547r9005p3911k00331j00693J20390k26606k09726j99488k27793j08974
$$ 5950547 5851542 5777631 5577300 5476607 5596997 5370391 5160665 4961177 4733384 4624410
19495D624410j19348j1325J31024n876l70678k46579j4478j6176K50320j90223
$$ 4624410 4505062 4493737 4624761 4618885 4248207 4001628 3987150 3970974 4221294 4031071
19485D031071l17633k42731j34295j4726J26607n3473j92232k61295k02904j10818
$$ 4031071 3713438 3470707 3336412 3321686 3448293 3394820 3202588 2941293 2738389 2627571
19475B627571J07205K08195j52839l31308k21203p085R7704m5419M4103K35033
$$ 2627571 2734776 2942971 2790132 2458824 2237621 2230536 2328240 2282821 2326924 2561957
19465B561957j34412j4613N2619L737J17603k05631k53124J6541M6385j57075
$$ 2561957 2427545 2412932 2465551 2469288 2586891 2381260 2128136 2144677 2191062 2033987
19455B033987j62111K9198l07756m33260p0702K9219p8408J49590l5754K9113
$$ 2033987 1871876 1901074 1593318 1160058 1089356 1118575 1040167 1189757 1154003 1183116
19445A183116L4040O9916K98424Q388m14633j88916l6672j33636p7031N4746j35517
$$ 1183116 1217156 1287072 1585496 1593884 1179251 990335 953663 820027 742996 797742 662225
19434F62225j85523J06329J23936j47217J3130K11463L15548q1227n3770m6421
$$ 662225 476702 583031 706967 559750 572880 784343 1099891 1018664 964894 918473
19424I18473J7024J84573J020n3155l4196k61656l0904j19002K08031q4401l43035
$$ 918473 935497 1120070 1121090 1067935 1033739 772083 741179 622177 830208 745807 402772
19413D02772k85897J4239J16809K36558j24946k28928J01100J16522J83948j43021
$$ 402772 116875 131114 247923 484481 359535 130607 231707 348229 532177 389156
19403C89156q9198K74596j05469j06835K32036K93316R0148n7248j61529l14729
$$ 389156 299958 574554 469085 362250 594286 887602 977750 920502 758973 444244
19393D44244j53867Q7505J8669Q2542o5672j32428J48151J95128j84241M1032
$$ 444244 290377 377882 396551 479093 413421 280993 429144 624272 440031 481063
19383D81063O7044r2090q6120J10290l5355K4652L0902p0672o9795l16396N8099
$$ 481063 548107 456017 369897 480187 444832 469484 500386 429714 359919 43523 101622
19372A01622k1088k30675J30584J68953o5210R637K19311K95782J61610j85113
$$ 101622 80534 -150141 -19557 149396 84186 93823 313134 608916 770526 585413
19362E85413m4621J89166j57836l66607j26153J93569J00567p665K09479K21719
$$ 585413 540792 729958 572122 205515 79362 272931 373498 365833 575312 797031
19352G97031k55597l51873J6164J11047J76281J60574K34192P2792k52452L7762
$$ 797031 541434 189561 205725 316772 493053 653627 887819 960611 708159 745921
19342G45921L10318j77214q7908j07271J06711R3190k85836o0225L0141n0204
$$ 745921 1056239 879025 791117 683846 790557 883747 597911 537686 567827 517623
19332E17623r9768j25110K64613K76224l4826k01941k92095j36558K6777L02094
$$ 517623 417855 292745 557358 833582 798756 596815 304720 168162 194939 497033
19322D97033q5107j96435J83320M8283l7030p7913j78784k88521K11600K52423
$$ 497033 411926 215491 398811 447094 410064 332151 153367 -135154 76446 328869
19312C28869K43340o3378j43822j18707n9732j5751J32378m1412J46038n8951
$$ 328869 572209 508831 365009 246302 186570 170819 303197 261785 407823 348872
19302C48872J2348K53773J37904n163P3400L8304k42291k59928r466j3889j09402
$$ 348872 361220 614993 752897 747734 821134 859438 617147 357219 347753 333864 224462
19291B24462o5859j8852K8115P7884j28677p1068K53247M33463q2063j33107j2153
$$ 224462 158603 139751 167866 245750 117073 46005 299252 732715 650652 517545 505392
19280E05392q1894j97643j04491L5952n7085O2393L5385j18872R5536J25813j33717
$$ 505392 423498 225855 121364 157316 100231 162624 198009 79137 174673 300486 166769
19269A66769J05877R5490N2567k11165J65531K9136k56991k10062J09517O0590
$$ 166769 272646 368136 420703 209538 375069 404205 147214 -62848 46669 107259
19259A07259M2211o2902M8709j9147r5580k4863Q9998J17327N0484k7747K2024
$$ 107259 149470 86568 135277 116130 20550 -4313 85685 203012 253496 225749 247773
19248B47773k0612p7228r4562p3133Q8103K00096N3139l8828k82831Q8709P4867
$$ 247773 227161 149933 55371 -17762 70341 270437 323576 284748 1917 90626 165493
19237A65493k00906o1381q809L37004L28863N2293m3794l45531m10822j29605
$$ 165493 -35413 -96794 -105603 231401 560264 612557 568763 223232 -187590 -317195
19227c17195J15909n3200J85433M7404J7657O3339m1930j63893j54487K97009
$$ -317195 -201286 -254486 -69053 -21649 -3992 59347 17417 -146476 -300963 -3954
19217c954o136l9591k47117j35734j74349k2679K20291J90597M0863o8901J66401
$$ -3954 -10090 -49681 -296798 -432532 -606881 -629560 -409269 -218672 -177809 -246710 -80309
19206h0309K43314j67043p6108J58783J1257q6764j75698J43323M3580J18837
$$ -80309 163005 -4038 -80146 78637 89894 3130 -172568 -29245 14335 133172
19196A33172J06489j81555P398J23171k18099l1218M3808j65076R0364J91545
$$ 133172 239661 58106 65504 188675 -29424 -60642 -16834 -181910 -91546 99999
19186I9999K541j20443P031l3896J78155l8190j55573K3890j28362q9512n136
$$ 99999 102540 -17903 -10872 -44768 133387 95197 -60376 -36486 -164848 -254360 -259496
19175b59496k85062K56010L94123K13928J35409q0969l4542J04689k41443m89107
$$ -259496 -544558 -288548 105575 319503 454912 373943 339401 444090 202647 -286460
19165b86460k12632J42423Q6748q8762p550M4968p4764O5973K31172M9559K0350
$$ -286460 -499092 -356669 -269921 -358683 -366233 -321265 -396029 -330056 -98884 -49325 -28975
19154b8975J21012N4063j49209J14623K07846p0460j27011K4494m7685k03739
$$ -28975 92037 146100 -3109 111514 319360 248900 121889 146383 98698 -105041
19144a05041k7804J63143J1924k68966m9348O2913j3120J18954J28776l9801P346
$$ -105041 -132845 30298 42222 -226744 -276092 -213179 -226299 -107345 21431 -18370 -11024
19133a1024M1257Q8691j33933k8779J54128O5525j12483j18298N754J45560j52817
$$ -11024 30233 118924 -15009 -43788 110340 175865 63382 -54916 -49162 96398 -56419
19122e6419Q1458q347K2506o4057m0659k1934Q5821j1441j19001k1955O9870J08039
$$ -56419 25039 16692 39198 -24859 -65518 -87452 -1631 -13072 -132073 -154028 -84158 23881
19110B3881J26858k09059l20018m5217J72418k2112K29999J4690k08541j9818
$$ 23881 150739 -58320 -378338 -423555 -251137 -273249 -43250 -28560 -237101 -256919
19100b56919J60624J67752K18656P0792k43376l4906k4103j73573Q3851O9495
$$ -256919 -96295 71457 290113 360905 117529 82623 58520 -115053 -31202 38293
19090C8293J70944R2756j18441j74244k43665j55483L26403J49094j76320P1642
$$ 38293 209237 301993 183552 9308 -234357 -389840 -63437 85657 -90663 -19021
19080a9021J20452L629j67255N1432N4222J56626r0752J61821j49848j02246O9101
$$ -19021 101431 105060 -62195 -10763 43459 200085 109333 271154 121306 19060 88161
19069H8161r9841J85902K06381O1603l5700l1399N3713j53177k47744M381J70270
$$ 88161 -11680 174222 380603 442206 406506 375107 428820 275643 27899 32280 202550
19058B02550k9295k81704j63688K17905K60431J62741l2737j18825K1838O7087
$$ 202550 173255 -108449 -272137 -54232 206199 368940 336203 217378 239216 306303
19048C06303P7548m5305Q1288j10103P2611K71377J91413K5189k429J01171j57145
$$ 306303 383851 338546 419834 309731 382342 653719 845132 870321 867892 969063 811918
19037H11918O8258m6219J36122J9357j39049k9982Q7869R1400j25692j05622Q6331
$$ 811918 880176 833957 970079 989436 850387 820405 908274 999674 873982 768360 854691
19026H54691m1153l73347l40633o4829O9782J69170J2299K84982L47094M5636
$$ 854691 813538 440191 99558 34729 104511 273681 285980 570962 918056 963692
19016I63692k17894L7335J43974J35329K04721k0738k1528p7512k6136j39668
$$ 963692 745798 783133 927107 1062436 1267157 1246419 1224891 1147379 1121243 981575
19006I81575j27171j74268k64128L36451L01244P3233O2982j35481Q2730j63348
$$ 981575 854404 680136 416008 752459 1053703 1126936 1189918 1054437 1137167 973819
18996I73819j03860j00260k15597J23509l1746N8441J02126o3894j74308k06014
$$ 973819 869959 769699 554102 677611 645865 704306 806432 742538 568230 362216
18986C62216M1546J18850n9682k01306o8865N8192J69729J89509O4917j50150
$$ 362216 403762 522612 462930 261624 192759 250951 420680 610189 675106 524956
18976E24956n4104n4792J46702K62347l6686k11924l207L1114n004R8554J88675
$$ 524956 470852 416060 562762 825109 788423 576499 573292 604406 599402 697956 886631
18965H86631j41012k84665l02975k6205P7367n3431J6594J59673J68074k3966
$$ 886631 745619 460954 157979 131774 209141 155710 172304 331977 500051 476085
18955D76085k5929M417K18727J7219L20555j29967m8802R9426m6110k28446k35655
$$ 476085 450156 454573 673300 690519 1011074 881107 832305 931731 885621 657175 421520
18944D21520j61045J15989J18830J07906r7800j85875n1500J71767K14712J13636
$$ 421520 260475 376464 495294 603200 505400 319525 268025 439792 654504 768140
18934G68140K15971N7947j27102M7421J22046k4474o7912K88182l8297k09271
$$ 768140 984111 1042058 914956 962377 1084423 1059949 992037 1280219 1241922 1032651
18924A032651j70127J92625L22550J05165L7599N2967j42109R326j13351q1239
$$ 1032651 862524 1055149 1377699 1482864 1520463 1573430 1431321 1440647 1327296 1246057
18914A246057K31986J13832Q2473J26010K72772K29382J45111R2425K7756j84640
$$ 1246057 1478043 1591875 1674348 1800358 2073130 2302512 2447623 2540048 2567804 2383164
18904B383164j95039L2685M22172J06583m1477M14460M21593K58850L28665P26518
$$ 2383164 2188125 2220810 2642982 2749565 2708088 3122548 3544141 3802991 4131656 4858174
18894D858174J089973J604428K513411M316414P108035J1887944J5525217J4190017
$$ 4858174 5948147 7552575 10065986 14382400 21490435 33378379 48903596 63093613
18886F3093613J1718310Q234480n618559j8042941j5294487q985609m138377j255974
$$ 63093613 74811923 83046403 77427844 59384903 44090416 35104807 30966430 29710456
18878B9710456J647046N421910J0187430J3129982J2210541J0073338N549611
$$ 29710456 31357502 36779412 46966842 60096824 72307365 82380703 87930314
18871H7930314r238451j9579856j5462379r195204n529941l813158k651561k352932
$$ 87930314 78691863 59112007 43649628 34454424 28924483 25111325 22459764 20106832
18863B0106832j298587p90666r46275q26143o20129n04087k39048m73477J04711
$$ 20106832 18808245 18017579 17071304 16245161 15625032 15120945 14881897 14408420 14513131
18854A4513131P4k1448K82586M77334M53370R19389J129510J711804L085074N343046
$$ 14513131 14513205 14491757 14774343 15251677 15705047 16624436 17753946 19465750 22550824 27893870
18844B7893870R675029J5368102J7754726J5530316J4254561R341627n657578
$$ 27893870 37568899 52937001 70691727 86222043 100476604 109818231 104160653
18837A04160653r737809N80765P541722R354038J0380321L391120r076684o346542
$$ 104160653 94422844 95003609 102545331 111899369 122279690 125670810 116594126 110247584
18829A10247584K278039N102056O834367K614401j0515106j1338038r52387N024715
$$ 110247584 112525623 117627679 124462046 127076447 116561341 105223303 104270916 109295631
18821A09295631O083051M885052o243552k1432892k0975078j3762390q504638
$$ 109295631 115378682 120263734 114020182 92587290 71612212 57849822 49345184
18814D9345184n864360m125801l156150k673389k278974j644641j296156j023815
$$ 49345184 43480824 39355023 36198873 33525484 31246510 29601869 28305713 27281898
18806B7281898q96185q88058p47953o12828k95101m55362j48219p7700k17067
$$ 27281898 26385713 25497655 24749702 24136874 23841773 23386411 23238192 23160492 22943425
18797B2943425L71109R46091J227402K190989M319915P743054J3295343J7477892
$$ 22943425 23314534 24260625 25488027 27679016 31998931 39741985 53037328 70515220
18789G0515220J6289133J3366145R953648n482525k1743861j9319345j1858375
$$ 70515220 86804353 100170498 110124146 104641621 82897760 63578415 51720040
18782E1720040o010823j948701J230557N956629J1882612J5235287J3726891J1268003
$$ 51720040 45709217 43760516 44991073 50947702 62830314 78065601 91792492 103060495
18774A03060495O488629r723017k3022742j9465363j1960388p245203m512307
$$ 103060495 109549124 99826107 76803365 57338002 45377614 38132411 33620104
18767C3620104l023649k329684k190022j868678j389726j083228j301877j508866
$$ 33620104 30596455 28266771 26076749 24208071 22818345 21735117 20433240 18924374
18759A8924374j223082q25534l87389k02330o98383q24859n33769l19486n37802
$$ 18924374 17701292 16875758 16488369 16286039 15587656 14762797 14229028 13909542 13371740
18750A3371740m17544m47777l94201n16125l91862J14029k3148l49918m71222
$$ 13371740 12954196 12506419 12112218 11596093 11204231 11318260 11295112 10945194 10473972
18741A0473972m99869k91520k54464l01993l05819l87853k96119J9636l77412
$$ 10473972 9974103 9682583 9428119 9126126 8820307 8432454 8136335 8155971 7778559
18732G778559l54627J00635M1100L0332R4066L1434m93945k96245l79948k63768
$$ 7778559 7423932 7524567 7565667 7595999 7690065 7721499 7227554 6931309 6551361 6287593
18722F287593k11700l07240k18742j35969k69883n321j05306j00518j70669k89513
$$ 6287593 6075893 5768653 5549911 5413942 5144059 5138738 5033432 4932914 4762245 4472732
18712D472732k17128l9526p9607Q196j220l88541j46478J4333k98554j01819n176
$$ 4472732 4255604 4216078 4136471 4144667 4143447 3754906 3608428 3622761 3324207 3222388 3217212
18701C217212J38773j08530j76895r0741L8592k45169j82803L5199N9711l18220
$$ 3217212 3355985 3247455 3070560 2979819 3018411 2773242 2590439 2625638 2685349 2367129
18691B367129j8884J85267O5829r4129p77j41435j98987l9830M6532q6501K9104
$$ 2367129 2348245 2533512 2599341 2505212 2504435 2363000 2164013 2124183 2170715 2084214 2113318
18680B113318J61420L79969R5347j71162j07149R0736J05088m50136n29427j38815
$$ 2113318 2274738 2654707 2750054 2578892 2471743 2562479 2667567 2217431 1688004 1549189
18670A549189j07374L3341N8956j70578k66910j50187O369J83725Q7466j10522
$$ 1549189 1441815 1475156 1534112 1363534 1096624 946437 952806 1136531 1223997 1113475
18660A113475j84408R0256q9434O2163o2122M9537K3653Q4599j95123j23210K61682
$$ 1113475 929067 1019323 929889 992052 929930 979467 1003120 1087719 892596 769386 1031068
18649A031068j36621k85280k32014J05569K25795J33126O5419k27547J79353R3086
$$ 1031068 894447 609167 377153 482722 708517 841643 907062 679515 858868 951954
18639I51954J61569p7188j17179K48257J23269l40987k91735k03614N7076L3494
$$ 951954 1113523 1036335 919156 1167413 1290682 949695 657960 454346 511422 544916
18629E44916p6345r0114M545K39856R6515j38620j42262p2151J38131J87637k45653
$$ 544916 468571 378457 383002 622858 719373 580753 438491 366340 504471 692108 446455
18618D46455r5423K92983M1276P5314J28966J32064K2374k95271j41081k96928
$$ 446455 351032 644015 685291 760605 889571 1021635 1044009 748738 607657 310729
18608C10729K43155O5537q2279J09575n3383P6795K56359r1078j76868o3640k15557
$$ 310729 553884 619421 537142 646717 593334 670129 926488 835410 658542 594902 379345
18597C79345j67005j17879L7115j76907M2824J36782J32786O5149p2446M3329
$$ 379345 212340 94461 131576 -45331 -2507 134275 267061 332210 259764 303093
18587C03093M0326J47814j93286k73400q8607m7649j0352M15070L04887k33201
$$ 303093 343419 491233 297947 24547 -64060 -111709 -122061 293009 597896 364695
18577C64695l69119J28677L90381K1662L0393j92655j2494j17057K4508L1097
$$ 364695 -4424 124253 514634 536296 566689 374034 361540 244483 268991 300088
18567C00088k35136J32313K12108J28531l9947k7176K4248O7959k74583j73094
$$ 300088 64952 197265 409373 537904 497957 470781 495029 562988 288405 115311
18557A15311O050r0588J64420j42008j2793O9895O2603K4856O4147L1142j1868
$$ 115311 121361 30773 195193 53185 40392 110287 172890 197746 261893 293035 281167
18546B81167j54226O6146m2925j31072j88757J49404K6241o0186R4347N8060J46241
$$ 281167 126941 193087 150162 19090 -169667 -20263 5978 -54208 40139 98199 244440
18535B44440L36565J22462p2180l28608k52958k77812q2160K27163K95265k32315
$$ 244440 581005 703467 631287 302679 49721 -228091 -310251 -83088 212177 -20138
18525b0138l55548J17833K66063K45907M6863l8087N6468j32934k92021J42720
$$ -20138 -375686 -257853 8210 254117 300980 262893 319361 186427 -105594 37126
18515C7126J11490Q7850K22760j36668j63692j04703l1578J49364K3626o404o939
$$ 37126 148616 236466 459226 322558 158866 54163 22585 171949 195575 189171 182232
18504A82232O9524R1863J42367p6198j90283n9508K49401J46662n3354j40416
$$ 182232 251756 343619 485986 409788 219505 159997 409398 556060 502706 362290
18494C62290j74974o801k04426n2688K2880K9875J98758J05255K32040j01804
$$ 362290 187316 180515 -23911 -76599 -53719 -23844 174914 280169 512209 410405
18484D10405R39j2735p5903p0762j18183k05208J18490J67920j96794J4474M998
$$ 410405 411344 398609 322706 251944 133761 -71447 47043 214963 18169 32643 37641
18473C7641J07082J63233j21494j65788K55156J46443P0259j14946j52715j29380
$$ 37641 144723 307956 186462 20674 275830 422273 492532 377586 224871 95491
18463I5491J18326N1954p3473Q0772J51091j90601k16510R6724j74018R1760O7238
$$ 95491 213817 265771 192298 273070 424161 233560 17050 113774 -60244 31516 98754
18452I8754j53169O4813K41028J75362P8988l02290j30261J35807m8381j78145
$$ 98754 -54415 10398 251426 426788 505776 203486 73225 209032 160651 -17494
18442a7494p2829J34298n1131M6181J90974n8248j67875j67389P5412K7205j84508
$$ -17494 -90323 43975 -7156 39025 229999 171751 3876 -163513 -88101 -60896 -245404
18431b45404J9767K63912K11988J43345j60688O6679J39134j88343q2094R0097
$$ -245404 -225637 38275 250263 393608 232920 299599 438733 250390 168296 258393
18421B58393j1007J2702j2241O8251K66939j67296J31243j59899n716k54648l60272
$$ 258393 247386 260088 247847 316098 583037 415741 546984 387085 381369 126721 -233551
18410b33551L8279K66572q5738j4941Q7098J70694J04489J45379J6873k2666m0179
$$ -233551 -195272 71300 -14438 -29379 57719 228413 332902 478281 495154 472488 432309
18399D32309j28348m045j05532k7058j77671N1052K00746k8385p7927J59456J49722
$$ 432309 303961 299916 194384 167326 -10345 40707 241453 213068 135141 294597 444319
18388D44319J28089j73640j05819q5237p9999K3202R7121J19241L2318N5232J26504
$$ 444319 572408 398768 292949 207712 127713 150915 248036 367277 399595 454827 581331
18377E81331j31473k53376O693K06257J43604j01087o47L03611J72330q6699k74501
$$ 581331 449858 196482 203175 409432 553036 451949 451302 754913 927243 840544 566043
18366E66043Q5777J00306O061k12110p7630J62036l021J4614j8869j20132Q8653
$$ 566043 651820 752126 758187 546077 468447 630483 627462 642076 623207 503075 591728
18355E91728K13408J73113L0238p4353j11323J2353J34809K3010m0899j29610
$$ 591728 805136 978249 1008487 934134 822811 835164 969973 992983 952084 822474
18345H22474m422k4720N5821K33113k42873k10435P2438q7334n40974k61050J06602
$$ 822474 818052 793332 849153 1082266 839393 628958 701396 614062 73088 -187962 -81360
18334h1360K92065K17808k30485k02580m4636K86452M24642K43258L1675R2441
$$ -81360 210705 428513 198028 -4552 -49188 237264 661906 905164 936839 1029280
18324A029280N6202J07817K5205J49778N7450k3169O1620R2586N4272k04032J11238
$$ 1029280 1085482 1193299 1218504 1368282 1425732 1402563 1464183 1556769 1611041 1407009 1518247
18313A518247O6677P3544K2353J29584J85490J95993J68519L13821L59307N3988
$$ 1518247 1584924 1658468 1680821 1810405 1995895 2191888 2360407 2674228 3033535 3087523
18303C087523J63326l9244l28776j67701J20008K56367o9208r571L92191L95717
$$ 3087523 3250849 3211605 2882829 2715128 2835136 3091503 3022295 3012724 3404915 3800632
18293C800632L38969k5232l83579l94311l57601j45239N1845J12799L02116M13245
$$ 3800632 4139601 4114369 3730790 3336479 2978878 2833639 2885484 2998283 3300399 3713644
18283C713644L05154L66768M32120N96231Q42098J274716J955826K838527M704044
$$ 3713644 4018798 4385566 4817686 5413917 6256015 7530731 9486557 12325084 17029128
18274A7029128Q014529J2686098J6540865J6872479J8218456J8845486O852482
$$ 17029128 25043657 37729755 54270620 71143099 89361555 108207041 115059523
18267A15059523n845007m954978o000243j6793420k0346508j4404655q786178
$$ 115059523 109214516 104259538 98259295 81465875 61119367 46714712 37928534
18260C7928534n545357l791942l024542k183850j890630j448050q85040q47549
$$ 37928534 32383177 28591235 25566693 23382843 21492213 20044163 19159123 18311574
18252A8311574q24697r41357j234999j024933n63213k66374m57450o73907m17487
$$ 18311574 17486877 16545520 15310521 14285588 13722375 13456001 12998551 12324644 11907157
18243A1907157m13285k17817k8732q5532r32r4295K41456M90049N35600O09863
$$ 11907157 11493872 11276055 11247323 11161791 11160859 11066564 11308020 11798069 12333669 12943532
18233A2943532P08715Q45195J208021J552688J913838K569531L775887N841035
$$ 12943532 13652247 14497442 15705463 17258151 19171989 21741520 25517407 31358442
18225C1358442R942206J6223683K2731805K7043235L3649258M1249180L3441331
$$ 31358442 41300648 57524331 80256136 107299371 140948629 182197809 215639140
18218B15639140J8235373J8667087Q090316k2488704l2214794k8545810l4553813
$$ 215639140 233874513 252541600 260631916 238143212 205928418 177382608 142828795
18211A42828795l2123392k2672694j5086013j0533890p666331n786489m242380
$$ 142828795 110705403 88032709 72946696 62412806 54746475 48959986 44717606
18204D4717606l323905k992307k472930j829203j466282j547506j447084j126134
$$ 44717606 41393701 38401394 35928464 34099261 32632979 31085473 29638389 28512255
18196B8512255q00190n52896n39346m57393j101277j023483q34692n93164m87759
$$ 28512255 27712065 27159169 26619823 26162430 25061153 24037670 23202978 22609814 22122055
18187B2122055q9999L23860K16969K22903M3640l02093l03242J0182J84222M64057
$$ 22122055 22032056 22355916 22572885 22795788 22839428 22537335 22234093 22244275 22428497 22892554
18177B2892554R45908J365988K328066L922718O367707J1416566J8639092K3427717
$$ 22892554 23838462 25204450 27532516 31455234 37822941 49239507 67878599 91306316
18169I1306316K4618916K8112702K6669500N809087j0056962q607554j7386091
$$ 91306316 115925232 144037934 170707434 176516521 166459559 157852005 140465914
18162A40465914l0763388k6198251j6995911j0739847p533537n806175m326856
$$ 140465914 109702526 83504275 66508364 55768517 48234980 42428805 38101949
18155C8101949l466038l248759k622263j809471j505376j313118j269779j205903
$$ 38101949 34635911 31387152 28764889 26955418 25450042 24136924 22867145 21661242
18147B1661242j045899m78348o98206n96686o96319n75638m30227n17967m72019
$$ 21661242 20615343 20136995 19438789 18842103 18145784 17570146 17139919 16621952 16149933
18138A6149933k24281R4059n8996j27399N9498j04447l66262j54925k57819n69133
$$ 16149933 15925652 16019711 15960715 15833316 15892814 15788367 15422105 15267180 15009361 14440228
18128A4440228m17369k04838k4322n9897l12220K3470N09894Q1393L52852M30739
$$ 14440228 14022859 13818021 13793699 13733802 13421582 13445052 13954946 14036339 14389191 14819930
18118A4819930P26296Q17858R30812J291380K133178L392701N064152Q692896
$$ 14819930 15546226 16364084 17294896 18586276 20719454 24112155 29176307 37869203
18110C7869203J6591379L2295850M9627626N1243419M1794507L8851282O736840
$$ 37869203 54460582 86756432 136384058 187627477 229421984 268273266 275010106
18103B75010106o2596345o9533764m2176353k3202006j3371634q763573o903129
$$ 275010106 212413761 142879997 100703644 77501638 64130004 55366431 48463302
18096D8463302n562741m756187l888094k804420k573318k110260j953030j539254
$$ 48463302 42900561 38144374 34256280 31451860 28878542 26768282 24815252 23275998
18088B3275998j112806j276791j110839q88882r13051o81846n22042k77035l49771
$$ 23275998 22163192 20886401 19775562 18886680 17973629 17291783 16769741 16492706 16142935
18079A6142935n47134k68977m89737l84203l22483l99363l18608m85750m05782
$$ 16142935 15595801 15326824 14837087 14452884 14130401 13731038 13412430 12926680 12520898
18070A2520898l40832j96348k19154j23526j04349n4380j54953N4827Q647j39052
$$ 12520898 12180066 11983718 11764564 11641038 11536689 11482309 11327356 11382183 11390830 11251778
18060A1251778k48587n49398m86541l73161j73827k21219j75935j26345L12245
$$ 11251778 11003191 10453793 9967252 9594091 9420264 9199045 9023110 8896765 9209010
18051I209010K21169O9361K10747M2632k75502m75364n71581n07160n96736l37707
$$ 9209010 9430179 9499540 9710287 9752919 9477417 9002053 8430472 7923312 7326576 6988869
18041F988869j62632n9855j8590Q7754O6244O5597m0056O7571k28299k57274k33789
$$ 6988869 6826237 6766382 6747792 6835546 6901790 6967387 6927331 6994902 6766603 6509329 6275540
18030F275540n59246m45577l65804l89769j75529Q5817j99370j78200k6701k5182
$$ 6275540 5716294 5270717 4904913 4515144 4339615 4425432 4226062 4047862 4021161 3995979
18020C995979l0529l99110k85510j57275n622j2037J10357K20574o1595l6090
$$ 3995979 3965450 3566340 3280830 3123555 3117933 3105896 3216253 3436827 3375232 3339142
18010C339142q8999J24818q2200j10600n5937o2028M2082j9346j48130j16193
$$ 3339142 3250143 3374961 3292761 3182161 3126224 3064196 3106278 3086932 2938802 2822609
18000B822609p510k42149o5915p7882k64213k25780k79748J483M12J21597L15430
$$ 2822609 2815099 2572950 2507035 2429153 2164940 1939160 1659412 1660895 1661307 1782904 2098334
17989B098334K36844J17786r3441l22044j28465K11023J13086p1704N6391k25594
$$ 2098334 2335178 2452964 2359523 2037479 1909014 2120037 2233123 2161419 2217810 1992216
17979A992216m10793j51106k11196J66510o1842M2810p5211p9236K68965R7976
$$ 1992216 1581423 1430317 1219121 1385631 1323789 1366599 1291388 1212152 1481117 1579093
17969A579093n0350k3628j5502J15770J0174L8094J13820k8829n2799l1595j33168
$$ 1579093 1528743 1505115 1489613 1605383 1615557 1653651 1767471 1738642 1685843 1654248 1521080
17958A521080q9385N5029J27097p9002r4713k6459K218k10077j77774Q1751L30801
$$ 1521080 1431695 1486724 1613821 1534819 1440106 1413647 1415865 1205788 1028014 1109765 1440566
17947A440566j54269K32686j09367l1760j13961j32352J419j56325k47159j63557
$$ 1440566 1286297 1518983 1409616 1377856 1263895 1131543 1132962 976637 729478 565921
17937E65921J243j09590L6132N7823J89385J38229M0956r4317j11657J56510j99245
$$ 565921 567164 457574 493706 551529 740914 879143 920099 825782 714125 870635 671390
17926F71390k12136l2025M5725j5406n5755K30771J21595r9725p0372J5906O5220
$$ 671390 459254 427229 472954 457548 401793 632564 754159 654434 584062 599968 665188
17915F65188j08979q2242J11837q1796r2727R6660J55203j32288k05044j02314
$$ 665188 556209 473967 585804 504008 411281 507941 663144 530856 325812 223498
17905B23498R9062K64670K14919L38217n2923J46266J78886j08010P3180O2170
$$ 223498 322560 587230 802149 1140366 1087443 1233709 1412595 1304585 1377765 1439935
17895A439935j99744o0628J92771r526Q0407r1589K4562J9576J75226J19298j76332
$$ 1439935 1240191 1179563 1372334 1362808 1443215 1351626 1376188 1395764 1570990 1690288 1513956
17884A513956J58054J53462J1399j5808j59127j52313q8763K3453j7940N3645
$$ 1513956 1672010 1825472 1836871 1821063 1661936 1509623 1420860 1444313 1426373 1480018
17874A480018n9590k4044O8435k29097j02012J76307J15392j03266p0557k2225
$$ 1480018 1420428 1396384 1464819 1235722 1133710 1310017 1425409 1322143 1251586 1229361
17864A229361n2501m1157L79421J19568j90012r607j08067R7762N4131N6946O0544
$$ 1229361 1176860 1135703 1515124 1634692 1444680 1435073 1327006 1424768 1478899 1535845 1596389
17853A596389j94154p3791j55058j35762q7861j19489o6035J91637L76424N7404
$$ 1596389 1402235 1328444 1173386 1037624 949763 830274 764239 955876 1332300 1389704
17843A389704J02487Q0801j1309P1180P6532n860k5752n735p0901L8687l8610
$$ 1389704 1492191 1572992 1561683 1632863 1709395 1703535 1677783 1672048 1601147 1639834 1601224
17832A601224M0180K34727Q6945j33188m4156n3620p763J0655j07583j69454N0317
$$ 1601224 1641404 1876131 1963076 1829888 1785732 1732112 1724349 1735004 1627421 1457967 1508284
17821A508284L48630J98077j78345Q9058K70068k00683r6720M6685J74539L59397
$$ 1508284 1856914 2054991 1876646 1965704 2235772 2035089 1938369 1985054 2159593 2518990
17811B518990R0459j16335J38797J04032K97813M05K09174L01110K01852R6945
$$ 2518990 2609449 2493114 2631911 2735943 3033756 3034161 3243335 3544445 3746297 3843242
17801C843242K90757J67685K48483M92951L12215Q82222J072602J223165J608830
$$ 3843242 4133999 4301684 4550167 5043118 5355333 6237555 7310157 8533322 10142152
17792A0142152K430619L984901O220036J0875355J6172973J7735037J5783515
$$ 10142152 12572771 16557672 22777708 33653063 49826036 67561073 83344588
17785H3344588J5087132Q602424l900138k887420M094804O225973O566325j073100
$$ 83344588 98431720 107034144 103134006 100246586 104341390 110567363 117133688 116060588
17777A16060588j9987086k4464994j6952338j0237284o172212l981607l296153
$$ 116060588 96073502 71608508 54656170 44418886 38246674 34265067 30968914
17770C0968914k805217j843328j464346j165107j031627j89779K79899N78849
$$ 30968914 28163697 26320369 24856023 23690916 22659289 22469510 22749409 23328258
17762B3328258P84496J307731K130765L702141P364658J2614514J6349777J5787089
$$ 23328258 24112754 25420485 27551250 31253391 38618049 51232563 67582340 83369429
17754H3369429J4405695J3188739L346363m808568Q83987N898920P490217O377183
$$ 83369429 97775124 110963863 114310226 109501658 110385645 116284565 123774782 130151965
17746A30151965o438704j9862087j4367334j884891P618441J0686788J0562779
$$ 130151965 123713261 103851174 89483840 87598949 95217390 105904178 116466957
17739A16466957J0282697J627156q497606l597560K586625M234887M357695o639035
$$ 116466957 126749654 128376810 119879204 116281644 118868269 123103156 127460851 120821816
17731A20821816k1540534k1021491j3960781q525064n641076m008369k917056
$$ 120821816 99281282 78259791 64299010 55773946 50132870 46124501 43207445
17724D3207445k186457j887852j181230r55848p09284k73182J60723O04720J446308
$$ 43207445 41020988 39133136 37951906 36996058 36286774 36013592 36174315 36779035 38225343
17715C8225343K443242L656374O261288J1330807J8829579K5462510K8706906
$$ 38225343 40668585 44324959 50586247 61917054 80746633 106209143 134916049
17708A34916049K9068396K4418417J1868976P43545m113674K726905J1969402
$$ 134916049 163984445 188402862 200271838 201015383 196901709 199628614 211598016
17701B11598016J1192893l345796j7120636k8792593k9467473j5023940j26991
$$ 211598016 222790909 219445113 202324477 173531884 144064411 129040471 128913480
17694A28913480P812639Q857348R415747O373661o380066q041332J939560O947639
$$ 128913480 136726119 145583467 154999214 161372875 154992809 146951477 148891037 155838676
17686A55838676P717689N155552j1968077k9307960k5991653j6910829j0432457
$$ 155838676 163556365 168711917 156743840 127435880 101444227 84533398 74100941
17679G4100941o844725n044729l850413l474079k898990k414748k149086j872332
$$ 74100941 67256216 62211487 58361074 54886995 51988005 49573257 47424171 45551839
17671D5551839j600372j393412j076722j005199r03912o33574o89193n08211l39886
$$ 45551839 43951467 42558055 41481333 40476134 39572222 38938648 38249455 37741244 37401358
17662C7401358K23376Q99412J941319L725167O962146J1258669J3147781J1533185
$$ 37401358 37624734 38524146 40465465 44190632 51152778 62411447 75559228 87092413
17654H7092413J0802232P074606m749360o683263J624677P320644Q349191R087550
$$ 87092413 97894645 104969251 100219891 93536628 95161305 102481949 110831140 119918690
17646A19918690L515172p399495m338809Q430521J9439426K6371021L0773962
$$ 119918690 123433862 116034367 111695558 120126079 139565505 165936526 196710488
17639A96710488K5989719J3375870J2858111J5249043J7782457K4054843K6206561
$$ 196710488 222700207 236076077 248934188 264183231 281965688 306020531 332227092
17632C32227092J5566245j6990708m4542735m2040575k5337856j2357690n901843
$$ 332227092 347793337 330802629 286259894 244219319 218881463 206523773 200621930
17625B00621930j3846612k1970996j3412795j659438M171354O312927O054925
$$ 200621930 186775318 164804322 151391527 149732089 153903443 160216370 166271295
17618A66271295l086600j1718307n888238J452241M717860O602626K137893p287336
$$ 166271295 163184695 151466388 145578150 147030391 151748251 158350877 160488770 153201434
17610A53201434l467992P876965J2744234J3304196J1243880l036914j7152847
$$ 153201434 149733442 157610407 170354641 183658837 194902717 191865803 174712956
17603A74712956j0391942r33424K526734L755043m131979k1976352k5692371j7612132
$$ 174712956 164321014 163387590 165914324 169669367 165537388 143561036 117868665 100256533
17595A00256533j0542956o475255m064324j741845O08119M446257J0582345J6336412
$$ 100256533 89713577 83238322 79173998 77432153 78040272 82486529 93068874 109405286
17587A09405286J7582753J7489700J9629347J5379521Q364530J2394560J6508308
$$ 109405286 126988039 144477739 164107086 179486607 187851137 200245697 216754005
17580B16754005J7778692J0741326j2413071k5714230j8313620p565557P91053
$$ 216754005 234532697 245274023 232860952 207146722 188833102 181267545 182058598
17573A82058598j603822j4929971j7256877j0455013q061749r704751n764569
$$ 182058598 180454776 165524805 148267928 137812915 129751166 120046415 114281846
17566A14281846N86496M227910N842616P147457M372855L670096J1741561J6822739
$$ 114281846 114868342 119096252 124938868 132086325 136459180 140129276 151870837 168693576
17558A68693576J6714272J5926809L273761j6395772j2416785L082071J3989770
$$ 168693576 185407848 201334657 204608418 188212646 175795861 178877932 192867702
17551A92867702K1782730K6514579J5502296K611038R899311J0500216n865460
$$ 192867702 214650432 241165011 256667307 259278345 269177656 279677872 273812412
17544B73812412r484368o697985k2299260l8159190k9537648j3618279J745222
$$ 273812412 264328044 257630059 235330799 197171609 167633961 154015682 155760904
17537A55760904J5695260K5865946L1508085L5414785L2659300J4431969q339219
$$ 155760904 171456164 197322110 228830195 264244980 296904280 311336249 302997030
17530C02997030j6246971k0519739l6617529m3050977l1780764j7921780o742797
$$ 302997030 286750059 266230320 229612791 186561814 154781050 136859270 130116473
17523A30116473J632051O694770Q342725J0340698P477888n628647j2567454j1343903
$$ 130116473 131748524 138443294 146786019 157126717 164604605 158975958 146408504 135064601
17515A35064601j4713398j8119820j4534089r776765p001488n075374l771087
$$ 135064601 120351203 102231383 87697294 77920529 70919041 65843667 62072580
17508F2072580l119546k773708k534609k134367j716534j839176k035797j855295
$$ 62072580 58953034 56179326 53644717 51510350 49793816 47954640 45918843 44063548
17500D4063548j614977j486282j333007j443207j171126r64781j124636r14327
$$ 44063548 42448571 40962289 39629282 38186075 37014949 36050168 34925532 34011205
17492C4011205r07362j010113r76567p35855p53440j123099r88924q88202m69169
$$ 34011205 33103843 32093730 31117163 30381308 29627868 28504769 27515845 26627643 26158474
17483B6158474m58369n60063n77376p43927n19526p43263o58969m73674l94820
$$ 26158474 25700105 25140042 24562666 23818739 23299213 22555950 21896981 21423307 21028487
17474B1028487n80613o22117m64184l50373n43002r01793p24847o29349l36217
$$ 21028487 20447874 19825757 19361573 19011200 18468198 17566405 16841558 16212209 15875992
17465A5875992k40463l76450l16762m02574m10039j72887j54818m17233m64904
$$ 15875992 15635529 15259079 14942317 14539743 14129704 13956817 13801999 13384766 12919862
17456A2919862k84762j30042j91193r1496m77714k84858k23956j43808j35936
$$ 12919862 12635100 12505058 12313865 12222369 11744655 11459797 11235841 11092033 10956097
17447A0956097l78303k29518k11229p3820N3291N5588j66612o2551K23549j82283
$$ 10956097 10577794 10348276 10137047 10063227 10116518 10172106 10005494 9942943 10166492 9984209
17437I984209n01987o73710l64418k47736m21385l35723j37097j25677j4410K4133
$$ 9984209 9482222 8808512 8444094 8196358 7774973 7439250 7302153 7176476 7162066 7186199
17427G186199k37789k20950j74371k12341o6242q4416p061l63470k83345k16126
$$ 7186199 6948410 6727460 6553089 6340748 6274506 6190090 6183029 5819559 5536214 5320088
17417E320088k25584n4050j62580O8173K64832o4479j02004j97359j35007K2466
$$ 5320088 5094504 5040454 4877874 4946047 5210879 5146400 5044396 4847037 4712030 4734496
17407D734496r5719j13324p0489J1982r601k52891k96447r5986M6910J20084o6110
$$ 4734496 4638777 4525453 4454964 4466946 4457345 4204454 3908007 3812021 3858931 3979015 3912905
17396C912905j13711k04717P076m1665j13545k72412p1931P3939O8604J80837
$$ 3912905 3799194 3594477 3601553 3559888 3446343 3173931 3102000 3175939 3244543 3425380
17386C425380m5390k62917p5956p5664m5243j81897O5783J28588N216K8019O9857
$$ 3425380 3379990 3117073 3041117 2965453 2920210 2738313 2804096 2932684 2937900 2965919 3035776
17375C035776j09083j43352k42564j63946k09039j94314Q6140j1816n0352j37332
$$ 3035776 2926693 2783341 2540777 2376831 2167792 1973478 2059618 2047802 1997450 1860118
17365A860118k59559k28167p7398K42603J32546o1408r3174j513J9974L2871o2870
$$ 1860118 1600559 1372392 1294994 1537597 1670143 1608735 1515561 1514048 1534022 1566893 1504023
17354A504023J00466k05979j16725P1045J04901p9082j57932N6264J30996p5985
$$ 1504023 1604489 1398510 1281785 1352830 1457731 1378649 1220717 1276981 1407977 1331992
17344A331992q7518K2749O2801j10632k01484j31338m0619K76092J95247M6587
$$ 1331992 1244474 1267223 1330024 1219392 1017908 886570 845951 1122043 1317290 1363877
17334A363877N2590J0490k02022R2177L4302J2617p621M2491j82904q5172J73189
$$ 1363877 1416467 1426957 1224935 1317112 1351414 1364031 1356410 1398901 1215997 1130825 1304014
17323A304014j19027r2911k20359j17939j54705N0002K45405J47844m0015q9663
$$ 1304014 1184987 1092076 871717 753778 599073 649075 894480 1042324 1002309 912646
17313I12646M11514J18798P3968J0936j45594k82319k08098k1915J25759J00802
$$ 912646 1324160 1442958 1516926 1527862 1382268 1099949 891851 869936 995695 1096497
17303A096497k09457k27333l3239J1257M0804J71453J83828P3424p6050P0849
$$ 1096497 887040 659707 626468 637725 678529 849982 1033810 1107234 1031184 1102033
17293A102033p6931k41495j18564j8673J2806j74465m4596J66574N5550o4619
$$ 1102033 1025102 783607 665043 646370 659176 484711 440115 606689 662239 597620
17283E97620j93154j80453K94466R9707K23512J26012k88448j80983J46110J74536
$$ 597620 404466 224013 518479 618186 841698 967710 679262 498279 644389 818925
17273H18925K5539J410m5452J31913J66382J91966k13905O6155j13045k76995
$$ 818925 844464 845874 800422 932335 1098717 1290683 1076778 1142933 1029888 752893
17263G52893J37566J83706M1647J40170j39539J32080P5542j35141R076j32001
$$ 752893 890459 1074165 1115812 1255982 1116443 1248523 1324065 1188924 1198000 1065999
17253A065999J18008O2378J9215l73529k05194O9385r387K213q9416l29780j22129
$$ 1065999 1184007 1246385 1265600 892071 686877 756262 746875 749088 659672 329892 207763
17242B07763J33994L31443J14253j86391l18909j06290m0578K28045J06555k07336
$$ 207763 341757 673200 787453 601062 282153 175863 135285 363330 469885 262549
17232B62549k02067P5457L09610L22631J20929J39182J27886J9380L0541j19610
$$ 262549 60482 135939 445549 768180 889109 1028291 1156177 1175557 1206098 1086488
17222A086488l0519n8292j32208j53958o05P2340k90J16252K25075o0360l0627
$$ 1086488 1055969 997677 865469 711511 710906 783246 782956 899208 1124283 1063923 1033296
17211A033296L8842r1755r9683J10786J2356n1227q9064j22387K40620k2420l70868
$$ 1033296 1072138 980383 880700 991486 1003842 952615 863551 741164 981784 959364 588496
17200E88496k97437M3293J17197p3605N0322n0265j87092p9566p7414j9287K94468
$$ 588496 291059 334352 451549 377944 428266 378001 190909 111343 33929 14642 309110
17189C09110R9376k690K58692K14756k22865m9173L48121J7090O0439J07651K76098
$$ 309110 408486 405796 664488 879244 656379 607206 955327 972417 1032856 1140507 1416605
17178A416605K37877J22530L4122k35093j51936O3157j8892j1525j01999K2220
$$ 1416605 1654482 1777012 1811134 1576041 1424105 1487262 1468370 1456845 1354846 1377066
17168A377066j03632k97557k04466Q3999P9764K73871L25416l33215k54387j63274
$$ 1377066 1273434 975877 771411 855410 935174 1209045 1534461 1201246 946859 783585
17158G83585r832j40417N2811R0099K3717J12889o3799l61950k07285Q0958K1613
$$ 783585 773753 633336 686147 776246 799963 912852 849053 487103 279818 360776 382389
17147C82389L2419R1851J70184k45550j44347j75273J21463K20675K6691m7370
$$ 382389 414808 506659 676843 431293 286946 111673 233136 453811 480502 433132
17137D33132j36569R925K7277J26931J44128Q9939N3477k44635q5814J42355L1399
$$ 433132 296563 306488 333765 460696 604824 694763 748240 503605 417791 560146 591545
17126E91545J54255J55477J24226k25561k21972q3453J23858K05279K80916p771
$$ 591545 745800 901277 1025503 799942 577970 494517 618375 823654 1104570 1096799
17116A096799p2101j34413l7612R0755K61237J32821m1566j85026P8291K63524
$$ 1096799 1024698 890285 852673 943428 1204665 1337486 1295920 1110894 1189185 1452709
17106A452709J702O5503J14874L56457K193L30454o776k94589j51749J51328k31298
$$ 1452709 1454411 1519914 1634788 1991245 1993438 2323892 2317116 2022527 1870778 2022106 1790808
17095A790808j37729K8205L6719j79004n7722j57959L6573j00093q1606l0682
$$ 1790808 1653079 1681284 1718003 1538999 1481277 1323318 1359891 1259798 1178192 1147510
17085A147510K0627l8340q588N1181j37882n3414r1608P2890p4657k0913n4549
$$ 1147510 1168137 1129797 1121209 1172390 1034508 981094 889486 962376 887719 866806 812257
17074H12257j75747k40970o9577p7600j49445M5373L79819R5551N0206O8805J06363
$$ 812257 636510 395540 325963 248363 98918 144291 524110 619661 669867 738672 845035
17063H45035L8796M4644k77385k28805j32720k37899J53553K58854o2018q0686
$$ 845035 883831 928475 651090 422285 289565 51666 205219 464073 402055 321369
17053C21369K28223L87549L66729L13126J24132J89512J8824M3786N7322j16808
$$ 321369 549592 937141 1303870 1616996 1741128 1930640 1949464 1993250 2050572 1933764
17043A933764K0150l742k98197j32754n6270J01004j2723k21313k6133J2354m6327
$$ 1933764 1953914 1950172 1651975 1519221 1462951 1563955 1551232 1329919 1303786 1316140 1269813
17032A269813P1743n6816M7057k0385J08858K07998j4876p9042n4686k04510k33259
$$ 1269813 1341556 1284740 1331797 1311412 1420270 1628268 1613392 1534350 1479664 1275154 1041895
17021A041895k34945j01631P4510N5833Q2804J96899M71653K02710J30283m2356
$$ 1041895 806950 705319 779829 835662 918466 1115365 1587018 1789728 1920011 1877655
17011A877655k332r4622N7087k02382k85890k20093Q4145L4446l65000k13100
$$ 1877655 1875323 1780701 1837788 1635406 1349516 1129423 1213568 1248014 883014 669914
17001F69914J47399l7544J30795M32513j7298k32515j43733k31110j31942o6117
$$ 669914 817313 779769 910564 1343077 1325779 1093264 949531 718421 586479 520362
16991E20362m4244k30055k46063L1388J0782r8330o7122Q3768j1489m1162J78599
$$ 520362 476118 246063 0 31388 42170 -56160 -123282 -39514 -51003 -92165 86434
16980H6434P0928j3877r5040J43139l6222J6975L21040o5971k77268j29596o9794
$$ 86434 157362 143485 48445 191584 155362 172337 493377 427406 150138 20542 -49252
16969d9252k24272J7782L89836J65868J7115j69507k01134K09063J79563R6403
$$ -49252 -273524 -255742 134094 299962 317077 147570 -53564 155499 335062 431465
16959D31465J71458L4377j04563k64593j62489n928j18107J17152J82223j1617
$$ 431465 602923 637300 532737 268144 105655 99727 -18380 98772 280995 269378
16949B69378L7970q7823j96711k27839N9323P6512L7769l7814Q6947J14912k5165
$$ 269378 307348 219525 22814 -205025 -145702 -69190 -31421 -69235 17712 132624 107459
16938A07459O665j6161k5755J59905q2278k55222J01652N3695M8390J01388N5184
$$ 107459 114124 97963 72208 232113 149835 -105387 -3735 49960 98350 199738 254922
16927B54922L5472J29325m3523j5940p3204O1708Q8184P7446q5437j57724l18345
$$ 254922 290394 419719 376196 360256 287052 348760 436944 514390 428953 271229 -47116
16916d7116l6014J17198K164K18143l6466j36883j35565R7866q2239J7510J08970
$$ -47116 -83130 34068 36232 254375 217909 81026 -54539 43327 -38912 -21402 87568
16905H7568j84794j53571J76178L04794R0794J49219j31271k99758q253K09804
$$ 87568 -97226 -250797 -74619 230175 320969 470188 338917 39159 30906 240710
16895B40710J37191P3024j83271q0876R5377k6339j79446n9005j46229j23346
$$ 240710 377901 450925 267654 186778 282155 255816 76370 17365 -128864 -252210
16885b52210P330K57695L64778J21502k64512M7964J48231k73128j68878J09394
$$ -252210 -244880 12815 377593 499095 234583 282547 430778 157650 -11228 98166
16875I8166K08382j22436m3544O355K682M9463K0816P2435r8154J03438j78819
$$ 98166 306548 184112 140568 146923 149605 199068 219884 292319 194165 297603 118784
16864A18784j84856o865P6913Q8886j24378J78607q6048k09948J32319O3992K96399
$$ 118784 -66072 -72937 3976 92862 -31516 147091 61043 -148905 -16586 47406 343805
16853C43805Q840k23053j73209M5804l9749j97850J25040J06624J04265J25884
$$ 343805 352645 129592 -43617 2187 -37562 -235412 -110372 -3748 100517 226401
16843B26401j25717l28182n3906M1116N4276p6269J42522K94138l94j06772j9637
$$ 226401 100684 -227498 -281404 -240288 -186012 -262281 -119759 174379 173985 67213 47576
16832D7576L5283j01617L9574R2870O6427p8981k9398P3878P2587N3433J44747
$$ 47576 82859 -18758 20816 113686 180113 101132 71734 145612 218199 271632 416379
16821D16379k56120j40598L3655R802Q7692n4935L2923O5409j34718l11477J104
$$ 416379 160259 19661 53316 63118 150810 95875 128798 194207 59489 -251988 -250884
16810b50884P2825j19149J7505J13804O4430J11320j75057J04347J47891k04099
$$ -250884 -178059 -297208 -279703 -165899 -101469 9851 -165206 -60859 87032 -117067
16800a17067N7110l0943j74106J49860O5101j59102J67938J69160P217m19952
$$ -117067 -59957 -90900 -265006 -115146 -50045 -209147 -41209 127951 135168 -284784
16790b84784j98755P3736K00768k080K0781j83277P818K27916K17364P6071M919
$$ -284784 -483539 -409803 -209035 -211115 -190334 -373611 -365793 -137877 79487 155558 160477
16779A60477L0599j36005j51632J78342K97450K8319l4548k42993j09024J51431
$$ 160477 191076 55071 -96561 81781 379231 407550 373002 130009 20985 172416
16769A72416K69385j7255k89459J6242j23986M4362j99275p6301K19662J97056
$$ 172416 441801 424546 135087 151329 27343 71705 -127570 -203871 15791 212847
16759B12847o710r5486k69859k4597K51120J3719k8714K97371n5555l3103J0171
$$ 212847 206137 110651 -159208 -183805 67315 81034 52320 349691 294136 261033 271204
16748B71204k45127l4635O9610j12030m2480k43680N6268K33931j9691n597J46136
$$ 271204 26077 -8558 61052 -50978 -93458 -337138 -280870 -46939 -66630 -72227 73909
16737G3909j64512j48767R3272L3832j26787j1486N0228J03969n0644M2436K18092
$$ 73909 -90603 -239370 -146098 -112266 -239053 -250539 -200311 -96342 -146986 -104550 113542
16726A13542R2661k52974p8857L0810p9250j17668p2065O4971K24021N7378R8565
$$ 113542 206203 -46771 -125628 -94818 -174068 -291736 -363801 -298830 -74809 -17431 81134
16715H1134k732m0867n3237K87479J7133l48514n9946J59788R7821j9764j35062
$$ 81134 78402 37535 -15702 271777 288910 -59604 -119550 40238 138059 118295 -16767
16704a6767l12008l2646K3046J2149J29222j01151K84168p5154p580O6110j84234
$$ -16767 -328775 -361421 -338375 -326226 -197004 -298155 -13987 -89141 -96721 -30611 -214845
16693b14845k6159J36077O3205M669j35013Q8249K33091O5355j36370M4367R519
$$ -214845 -241004 -104927 -41722 -37053 -172066 -83817 149274 214629 78259 122626 132145
16682A32145j72742n7994k33498m1709N0238n6941J27896J60327q078J95312L78132
$$ 132145 -40597 -98591 -332089 -373798 -323560 -380501 -252605 -92278 -100356 94956 473088
16671D73088j35955l29760j3475N7258N1085J19006r0458j52296j98552J62773
$$ 473088 337133 7373 -6102 51156 102241 221247 130789 -21507 -220059 -57286
16661e7286M9341j01631J67468L9963J04076R8855Q1758J513j96074k74351j5460
$$ -57286 -7945 -109576 57892 97855 201931 300786 382544 384057 187983 -86368 -101828
16650a01828J96364l1459j08762K34039J62719M6570k15404j14259j04981j11378
$$ -101828 94536 63077 -45685 188354 351073 397643 182239 67980 -37001 -148379
16640a48379k97177J52663K50537K22744J15459l2120l0846r247k300j68414j19245
$$ -148379 -445556 -292893 -42356 180388 295847 263727 232881 223634 221334 52920 -66325
16629f6325J42921J65444j53227l44323J1159M1809L7161l6208j79173k321K7146
$$ -66325 76596 242040 88813 -255510 -244351 -202542 -165381 -201589 -380762 -383083 -355937
16618c55937J51101R945J15887l4042N5840J44714P3582J79793j32748k12403
$$ -355937 -204836 -194891 -79004 -113046 -57206 87508 161090 340883 208135 -4268
16608d268j26855k30143K05102J59334R6454k8776L04923K48034k99303j05107
$$ -4268 -131123 -361266 -156164 3170 99624 70848 375771 623805 324502 219395
16598B19395r4029k09277O7709p4231l4467Q1489L7604j02516p4773j56437r3459
$$ 219395 125366 -83911 -16202 -90433 -124900 -43411 -5807 -108323 -183096 -339533 -432992
16587d32992L06571P3173j4433K8679Q2952k004j13506j12815J18186K28003L79483
$$ -432992 -126421 -53248 -67681 -39002 43950 41946 -71560 -184375 -66189 161814 541297
16576E41297k40792k04552j80494M9066L76977j42613k76200J6340K0288j83379
$$ 541297 300505 95953 -84541 -35475 341502 198889 -77311 -60971 -40683 -224062
16566b24062J0843Q2817K16658J44523j76107j23299n2528j27877K84097K12666
$$ -224062 -213219 -130402 86256 230779 54672 -68627 -121155 -249032 35065 247731
16556B47731k64154j02772K24579K0167j79438j14514j66039m0946K03430N7043
$$ 247731 -16423 -119195 105384 125551 -53887 -168401 -334440 -375386 -171956 -114913
16546a14913o0573K1117K27059L6598J36369m4933k13568p1056J692N3291k28979
$$ -114913 -175486 -154369 72690 109288 245657 200724 -12844 -83900 -82208 -28917 -257896
16535b57896k4702J26040K7973j1313J4624J11481l329k1225P110k97K14053L3744
$$ -257896 -282598 -156558 -128585 -139898 -125274 -13793 -17122 -38347 -31237 -31534 182519 216263
16523B16263q7574R2522K8127R7895K8178m6207Q9519Q1611k45237k61966j0374
$$ 216263 128689 221211 249338 347233 375411 329204 418723 500334 255097 -6869 -17243
16512a7243J08366R6781m2522K3061R734j36991j64731J38474P5811j9921K084
$$ -17243 91123 187904 145382 168443 178177 41186 -123545 14929 90740 70819 72903
16501G2903K0801K51789J59333p4851J72371N1363k19548l47481M5101N8151l007
$$ 72903 93704 345493 504826 429975 602346 653709 434161 86680 131781 189932 186925
16490A86925p1349k30964j08676J38280j47452j64045P6519J4816r5982O4008
$$ 186925 115576 -115388 -224064 -85784 -233236 -397281 -320762 -305946 -401928 -337920
16480c37920M1525O2262n9862j97693j6621L04921O9922m8649J62500P0282J9095
$$ -337920 -296395 -234133 -293995 -491688 -508309 -203388 -133466 -182115 -19615 50667 69762
16469F9762O0127J8719j57211j9448P8965O704n819J62203J07507R0632l9332
$$ 69762 129889 148608 -8603 -28051 50914 57618 51799 214002 321509 412141 372809
16458C72809j09892O789J86392N9149l59759N031j994J96711J00751Q8254J4817
$$ 372809 262917 269706 456098 515247 155488 160519 158525 355236 455987 544241 559058
16447E59058n6210j83167j01284R951l25647m4988J84456K03834j82139j57451
$$ 559058 502848 319681 218397 228348 -97299 -142287 42169 246003 63864 -93587
16437i3587K05065l613j5142O9039J4782k67389J40875k4280K90080j46185j60221
$$ -93587 111478 107865 92723 161762 176544 -90845 50030 25750 315830 169645 9424
16426I424m6217J43024j31368N2791K4860n9045j98465k23388l2491J68947L39811
$$ 9424 -36793 106231 -25137 27654 52514 -6531 -204996 -428384 -460875 -291928 47883
16415D7883K08256j92389J8589J58813m2355l88958N0022K79760j2648q6366M9822
$$ 47883 256139 63750 82339 241152 198797 -190161 -140139 139621 126973 40607 90429
16404I0429P848j9698j98616l8716J24209J89262j8958r5573j14982n755j35233
$$ 90429 98277 78579 -120037 -158753 -34544 154718 135760 40187 -74795 -80550 -215783
16393b15783m3211l5113K9466J54212J72813K8569J7673P1043N672l5547l9497
$$ -215783 -258994 -294107 -264641 -110429 62384 90953 108626 179669 185341 149794 110297
16382A10297K11695k8360j05299q2444j71842J49322P6067J6732n6370j38355
$$ 110297 321992 293632 188333 105889 -65953 83369 159436 176168 119798 -18557
16372a8557j72416J32589r9571j71805J3262J23233j18663K15756J19045j5694
$$ -18557 -190973 -58384 -157955 -329760 -316498 -193265 -311928 -96172 22873 7179
16362G179n9793q2204R8254m0344j01484p7655l7103r6360J10520J27091R0695
$$ 7179 -52614 -134818 -36564 -76908 -178392 -256047 -293150 -389510 -278990 -151899 -61204
16351f1204P820m7932J16510j1525o2386l2217K09326j16564p2649J52255N8555
$$ -61204 -53384 -101316 15194 3669 -58717 -90934 118392 1828 -70821 81434 139989
16340A39989q2670m3241j49721o8346J63129M2127J7237m03974L1440r9353J62741
$$ 139989 57319 14078 -135643 -203989 -40860 1267 18504 -385470 -354030 -453383 -290642
16329b90642k3821l8752N726P4300K72440r8676J37138n9035k3970J70252K0181
$$ -290642 -314463 -353215 -347489 -273189 -749 -99425 37713 -21322 -45292 124960 145141
16318A45141p9805M4098o3403n6789J6896K76719N6711j04081J23007M8379k88539
$$ 145141 65336 109434 46031 -10758 6138 282857 339568 235487 358494 406873 118334
16307A18334J8529o5404j80013k5072N8p0063J58890J99279k5261o3553M9202
$$ 118334 136863 71459 -108554 -133626 -133568 -203631 -44741 154538 129277 65724 114926
16296A14926K39644q0481j20209k31252Q987J74842k9817j1401j15331R7813O0195
$$ 114926 354570 274089 153880 -77372 -68385 106457 76640 65239 -50092 47721 107916
16285A07916j62716j56134k33946M0618N3349J0216P9761J04926r5258j31168
$$ 107916 -54800 -210934 -444880 -404262 -350913 -340697 -260936 -156010 -251268 -382436
16275c82436j37475J10177N4360q2583L74257M43803m1471k62590J713L22664
$$ -382436 -519911 -409734 -355374 -437957 -63700 380103 338632 76042 77755 400419
16265D00419l6812j38037n006L0184p7838Q1686O0073j04756l26975k68872J11783
$$ 400419 363607 225570 220564 250748 172910 254596 314669 209913 -117062 -385934 -274151
16254b74151M02378n6730k57987j99646K10052K43511n9903j06170j11960k19646
$$ -274151 128227 71497 -186490 -386136 -176084 67427 7524 -98646 -210606 -430252
16244d30252J95954o1484L3744P0450Q7173J01016j01131K13771K71529J4394
$$ -430252 -234298 -295782 -262038 -191588 -104415 -3399 -104530 109241 380770 395164
16234C95164N7115N9476o2578n7702Q7938j36506k00118j5277j91491k19081n6850
$$ 395164 452279 511755 449177 391475 479413 342907 142789 127512 -63979 -283060 -339910
16223c39910m30O2946O3589P9324j01539q204L25773J02072j34763n0946m6223
$$ -339910 -340340 -277394 -213805 -134481 -236020 -244224 81549 183621 48858 -2088 -48311
16212d8311J23304K87043J34842k07192O809m0837k01353r691j86621j79777L17591
$$ -48311 74993 362036 496878 289686 296495 255658 54305 44614 -142007 -321784 -4193
16201d193r7710j77633J11158J72134P911P940J94734P1456j44225j66672O665
$$ -4193 -101903 -279536 -168378 3756 11667 19607 214341 285797 141572 -25100 -18435
16190a8435J91816l6057n2200j3887M5715j30773M0486p5630o8808O1032j42508
$$ -18435 173381 137324 85124 71237 116952 -13821 26665 -48965 -117773 -56741 -199249
16179a99249J05788r001j36858j14252Q9009K07897K73933j9255q1888J70872
$$ -199249 -93461 -102462 -239320 -353572 -264563 -56666 217267 198012 116124 286996
16169B86996r4435J8870M5252k83327k14370m1412J93830K24652k08031k14998
$$ 286996 192561 211431 256683 -26644 -241014 -282426 -88596 136056 -71975 -286973
16159b86973j28152j17529P4513J49357J84796L06094r0158j09775l120P3510
$$ -286973 -415125 -532654 -458141 -308784 -123988 182106 91948 -17827 -20947 52563
16149E2563p007Q4098O6844m3377j62289J33979r6638p1876m7200m0263j41431
$$ 52563 45556 129654 196498 153121 -9168 124811 28173 -43703 -90903 -131166 -272597
16138b72597q2029N6888R8933K57361P3417j39509r2706o9714k02026J43720p3125
$$ -272597 -354626 -297738 -198805 58556 131973 -7536 -100242 -169956 -371982 -228262 -301387
16127c01387k22358L7312J65302P503j7861K20654J98530N1519k1565r1205M7179
$$ -301387 -523745 -486433 -321131 -313628 -331489 -110835 87695 139214 117649 26444 73623
16116G3623j0421l11P2408p6888J10857K56872o5537j11207j11934l03749k21308
$$ 73623 63202 62891 135299 58411 169268 426140 360603 249396 137462 -166287 -387595
16105c87595Q0089r4437q9750K50010L32275o3571O2668J41550k22897q0820m2800
$$ -387595 -307506 -401943 -491693 -241683 90592 27021 89689 231239 8342 -72478 -115278
16094a15278K6807Q4469j75367j00792M0039P5779J34259R2597r8003K63999J00611
$$ -115278 -88471 -4002 -179369 -280161 -240122 -164343 -30084 62513 -35490 228509 329120
16083C29120j50262l4590K15256O8968k45329j27219R0930k6252j2593l30483
$$ 329120 178858 144268 359524 428492 183163 55944 146874 120622 108029 -222454
16073b22454k0898R8788R6806q917M6806M1024J68559N9300k80434k1043J84030
$$ -222454 -243352 -144564 -47758 -56675 -9869 31155 199714 259014 -21420 -42463 141567
16062A41567J73416l1892j75438j32984q03K6219L43572m1735j49678n8672K36815
$$ 141567 314983 283091 107653 -25331 -26134 85 343657 301922 152244 93572 330387
16051C30387J33195j24480L7420j31024j8823j67124j11747J39061J81632m2603
$$ 330387 463582 339102 376522 245498 226675 59551 -52196 86865 268497 225894
16041B25894k17364l20553j6239M08796J82672R804l03052j96174m0714m1317
$$ 225894 8530 -312023 -328262 80534 263206 273010 -30042 -226216 -266930 -308247
16031c08247P0686L05581L76395J53289j14534k90841r6401N3762R3985J28056
$$ -308247 -237561 68020 444415 597704 483170 192329 95928 149690 243675 371731
16021C71731J08843J99451j75357k31733j10500k3625p2227J13264J05263O8219
$$ 371731 480574 680025 504668 272935 162435 138810 66583 179847 285110 353329
16011C53329k07144j04049J01011j6271q7928J67491N5163j36486J19108j50753
$$ 353329 146185 42136 143147 126876 38948 206439 261602 125116 244224 93471
16001I3471j85167R1702J98788K14999P0526m9044m0088j87341m9288r0046l02048
$$ 93471 -91696 6 198794 413793 484319 435275 395187 207846 158558 68512 -233536
15990b33536M1356K23846J31307P5592N9478j04473o5253j67078l74126l2824
$$ -233536 -192180 31666 162973 238565 298043 193570 128317 -38761 -412887 -445711
15980d45711R5710J88229J55518J30123J2582M0044j42447N043J20871J06190
$$ -445711 -350001 -161772 -6254 123869 136451 176495 34048 39091 159962 266152
15970B66152R5597J11994k93801l33693M7732J53575J79264P917r4030q2331J6118
$$ 266152 361749 473743 179942 -153751 -106019 47556 226820 234737 140707 58376 74494
15959G4494j75146l3073N8901j01382l0787O8036j1414n7132J3665Q3612K2739
$$ 74494 -100652 -133725 -74824 -176206 -206993 -138957 -150371 -207503 -193838 -110226 -87487
15948h7487J66381J11107L2559O9417J15204J6691j12613o4999J7558O4058j94247
$$ -87487 78894 190001 222560 291977 407181 423872 311259 246260 263818 327876 133629
15937A33629o7529K05729J22199K8211r0921j49565k75242O4286N176P8539N1847
$$ 133629 66100 271829 394028 422239 331318 181753 -93489 -29203 -24027 54512 106359
15926A06359n4053k6102p7785j03155R8509k05449J78359j2343L653n791l0359
$$ 106359 52306 26204 -51581 -154736 -56227 -261676 -83317 -95660 -92007 -97798 -128157
15915a28157R0744J09298j08614j28027J21703K42971J562M8742j40632j66358
$$ -128157 -37413 71885 -36729 -164756 -43053 199918 201480 250222 109590 -56768
15905e6768j9812q9177J62688p1286j10217J16552J01448j16645j27450J78301
$$ -56768 -76580 -165757 -3069 -74355 -184572 -68020 33428 -83217 -210667 -32366
15895c2366J06633K77891L2460j93059j14653J61940P6186j91182j26765o1378
$$ -32366 74267 352158 384618 191559 76906 238846 315032 123850 -2915 -64293
15885f4293m3479J30979K37135n926j99240q274N8639n2847j02932J9409L3793
$$ -64293 -107772 23207 260342 254416 55176 46902 105541 52694 -50238 -30829 2964
15874B964p1391J22862J90763J31278K4479Q1919k71003j47962l23224j45089
$$ 2964 -68427 54435 245198 376476 400955 482874 211871 63909 -259315 -404404
15864d04404n505m5924P8469K84290J25987N3127K3376Q2436O7070R1392J13974
$$ -404404 -409909 -455833 -377364 -93074 32913 86040 109416 191852 258922 350314 464288
15853D64288P9706m1777N3204N6071j28723k25751o8782R7829P6252q0275j48076
$$ 464288 543994 502217 555421 611492 482769 257018 188236 286065 362317 282042 133966
15842A33966k6699J7576j23048M1952j16763k09870k77006L5725J15208L77508
$$ 133966 107267 124843 1795 43747 -73016 -282886 -559892 -524167 -408959 -31451
15832c1451K29684p6739r7111L21744l5822n7785q3298n6183L387j57060J21990
$$ -31451 198233 121494 24383 346127 310305 252520 169222 113039 116426 -40634 81356
15821H1356o8323j47221N9753J9277j47053J2423j02572l05257J85882K12659
$$ 81356 13033 -134188 -74435 -55158 -202211 -189788 -292360 -597617 -411735 -199076
15811a99076o0634j70323K7275L05178J72594n3898m8438l27545r9776M3463k3923
$$ -199076 -259710 -430033 -402758 -97580 75014 21116 -27322 -354867 -454643 -411180 -435103
15800d35103L1081M3287J29751r898L49676n9379j77996j07979l2302K4139m1552
$$ -435103 -404022 -360735 -230984 -240882 108794 49415 -128581 -236560 -268862 -244723 -286275
15789b86275J03619K38059J87884O5462j44720K5031j18634p2918p6496L9090
$$ -286275 -182656 55403 243287 308749 164029 189060 70426 -2492 -78988 -39898
15779c9898J93426k83992O7916J41410O7744j22894j28094M1189K35521Q4027
$$ -39898 153528 -130464 -62548 78862 146606 23712 -104382 -63193 172328 256355
15769B56355K1623K8792J21147n7225p9679k77145k80287J04730L9296K89645
$$ 256355 277978 306770 427917 370692 291013 13868 -266419 -161689 -122393 167252
15759A67252K85427K1529j99330j71426N9798M2989P5025k89652j78553K77177
$$ 167252 452679 474208 274878 103452 163250 206239 281264 -8388 -186941 90236
15749I0236J52243n764p5511k61297j10223k0383l3933J92243J39421K9473L9970
$$ 90236 242479 236715 161204 -100093 -210316 -230699 -264632 -72389 67032 96505 136475
15738A36475j60386L7904J32314n2478j25793L2815L37421K28298L5080l58786
$$ 136475 -23911 13993 146307 93829 -31964 851 338272 566570 601650 242864
15728B42864j49426k15643k60992R5358K8854J48078L7585Q7298Q2458J6224Q9787
$$ 242864 93438 -122205 -383197 -287839 -258985 -110907 -73322 13976 96434 112658 202445
15717B02445N5497o2639O5801k17967k7395o1381J45047N973k27260P702L58152
$$ 202445 257942 195303 261104 43137 15742 -45639 99408 105381 -121879 -114177 243975
15706B43975p505n425k1762r3183k05320j47363p0933n7015R404m7554j2545o807
$$ 243975 236470 231045 209283 116100 -89220 -236583 -307516 -364531 -355127 -402681 -415226 -422033
15694d22033J90151J94251o8130m0859J88652O5986J46677k45886j22866j58343
$$ -422033 -231882 -37631 -105761 -146620 42032 108018 254695 8809 -114057 -272400
15684b72400j11917k08488K14573M12564J57676O388j15892l8818n2365m0454
$$ -272400 -384317 -592805 -378232 34332 192008 198396 82504 43686 -8679 -49133
15674d9133Q849J53011J20917n7330k01904O046j58239m9161l8689k6156J76039
$$ -49133 -40284 112727 233644 176314 -25590 -19544 -177783 -226944 -265633 -291789 -115750
15663a15750J48128M8994k78388j29666j17231K56158J67996N6359l1235J11569
$$ -115750 32378 81372 -197016 -326682 -443913 -187755 -19759 36600 5365 116934
15653A16934Q6120L4594k25359P1336R4386j7779J97163l7844j52205o9320J6317
$$ 116934 203054 237648 12289 83625 178011 160232 357395 319551 167346 98026 114343
15642A14343j57378j61244R929r2283M3132L6454J30993Q2385j11399N7808K77209
$$ 114343 -43035 -204279 -194350 -286633 -243501 -207047 -76054 6331 -105068 -47260 229949
15631B29949M3508k50943Q9364R8960J3966j09590L6714j92167j92379j63278
$$ 229949 273457 22514 111878 210838 224804 115214 151928 -40239 -232618 -395896
15621c95896R1097Q339J69804J81604p2297j80757n0714O6000k5306J81581q994
$$ -395896 -304799 -296460 -126656 54948 -17349 -198106 -248820 -182820 -208126 -26545 -35539
15610c5539J6180K43206n8948K9363p5179m4807n412o703k9405o7939l7524K16356
$$ -35539 -19359 223847 164899 194262 119083 74276 68864 62161 32756 -35183 -72707 143649
15598A43649J15404J72254j19426j34143j22857m3484m9078N5222k917L9344P2024
$$ 143649 259053 431307 311881 177738 54881 11397 -37681 17541 14624 53968 125992
15587A25992P8727q0012K0428J44656J070K9246j57852j55855r0795k92435j16327
$$ 125992 204719 124707 145135 289791 290861 320107 162255 6400 -84395 -376830 -493157
15576d93157L05420J52674K98972p6367j44609M5313o5518n2106j12685l0363
$$ -493157 -187737 -35063 263909 187542 42933 88246 22728 -29378 -142063 -172426
15566a72426K2500q9842J48471J16713J24543l3966q6091k27253l38948P173K30512
$$ -172426 -149926 -239768 -91297 25416 149959 115993 29902 -197351 -536299 -529126 -298614
15555b98614K76359J12182N8445j12747j84863l06647j49992N01997J29040j07685
$$ -298614 -22255 89927 148372 35625 -149238 -455885 -605877 -103880 25160 -82525
15545h2525k44428K79932O4084J16060K1272l0152j45671r3482M1423O8512O0766
$$ -82525 -326953 -47021 17063 133123 154395 124243 -21428 -114910 -73487 -4975 55791
15534E5791J63002l21335J27602L6889j21500M7278n820j1067m0033n6991j27656
$$ 55791 218793 -102542 25060 61949 -59551 -12273 -18093 -29160 -69193 -126184 -253840
15523b53840R2596J19181l0608J29475L04033J95801j74387n6775M0315j25649
$$ -253840 -161244 -42063 -72671 56804 360837 556638 382251 325476 365791 240142
15513B40142k01104J43784j3676n4697k72734q219j47987N2931L66064Q9710j2
$$ 240142 39038 182822 169146 114449 -158285 -166504 -314491 -261560 104504 194214 194202
15502A94202O9457P4067O578l5234N0614O4181k37612k66909j02109N2562q0342
$$ 194202 263659 337726 344304 309070 359684 423865 186253 -80656 -182765 -130203 -210545
15491b10545l87912j48841J08296J61686K13560P2121J16186K04558R1259J46180
$$ -210545 -598457 -747298 -639002 -477316 -263756 -191635 -75449 129109 220368 366548
15481C66548M7383n3959n446k18322k81927K5924K72456J331j57880J39022J4058
$$ 366548 413931 359972 354526 136204 -145723 -119799 152657 153988 -3892 135130 149188
15470A49188j84778j04387J49939K48330j45735k7778O1197L0627p4800r1884
$$ 149188 -35590 -139977 9962 258292 112557 84779 145976 176603 101803 9919
15460I919k45500j69606l1760J29309P0305J37981p8116k44961J10180P259N3282
$$ 9919 -235581 -405187 -436947 -307638 -237333 -99352 -177468 -422429 -312249 -304990 -251708
15449b51708J50627j1338R8235P8110l7990J86028J11146j81267j60992M9798
$$ -251708 -101081 -112419 -14184 63926 25936 211964 323110 141843 -19149 30649
15439C0649J74528K45277j2352m1217j64198j93483J85358k53805j40310J25454
$$ 30649 205177 450454 438102 396885 232687 39204 224562 -29243 -169553 -44099
15429d4099L6504l1440k37657R1799J93671K2208p6177k59438K5487J33470K47271
$$ -44099 -7595 -39035 -276692 -184893 8778 30986 -45191 -304629 -279142 -145672 101599
15418A01599J90044k19773k16403K35048o4665p2544L6778l15937j20109Q5212
$$ 101599 291643 71870 -144533 90515 25850 -46694 -9916 -325853 -445962 -360750
15408c60750J57990k3307p8073j64399K84318J82744O0602m1105K77022J80465
$$ -360750 -202760 -226067 -304140 -468539 -184221 -1477 59125 18020 295042 475507
15398D75507j47063k61827k27262j2177j7721j55778j27104J48775k07629k90096
$$ 475507 328444 66617 -160645 -172822 -190543 -346321 -473425 -324650 -532279 -822375
15388h22375J68288L34160K48327P4270O9567J11459j76119j33996r0042k4234
$$ -822375 -654087 -319927 -71600 2670 72237 183696 7577 -126419 -216461 -240695
15378b40695R8576L0643K2908K06886L28983j57700p8205j40039k98029j44649
$$ -240695 -142119 -111476 -88568 118318 447301 289601 211396 71357 -226672 -371321
15368c71321n7789K11900J01315M0527K14588Q7907p8037r3259P9327o4492k03056
$$ -371321 -429110 -217210 -115895 -75368 139220 227127 149090 55831 135158 70666 -132390
15357a32390N4067J25522j73156k9640K46293N5215K1665j00603j0442O8171j10291
$$ -132390 -78323 47199 -125957 -155597 90696 145911 167576 66973 56531 124702 14411
15346A4411j2045J8669J16245J09218m6442l72537j33520J58242K65623Q9756
$$ 14411 2366 21035 137280 246498 200056 -172481 -306001 -147759 117864 207620
15336B07620k10087o2317j91853p2072k21775K32304K58018n3107J4098m1921
$$ 207620 -2467 -64784 -256637 -328709 -550484 -318180 -60162 -113269 -99171 -141092
15326a41092q7168p1265K27843j5637j30994j89247J9565L71104J18286q2399
$$ -141092 -228260 -299525 -71682 -87319 -218313 -407560 -387995 -16891 101395 18996
15316A8996R9994j13070o0039J14094J82458m675j52449Q3410R0120n7962j71555
$$ 18996 118990 5920 -54119 59975 242433 237758 85309 168719 258839 200877 29322
15305B9322k40645j72815o9929J83850K66637O7939M5704O0891M5058n0665J70670
$$ 29322 -211323 -384138 -454067 -270217 -3580 64359 110063 170954 216012 165347 336017
15294C36017P0422p6396j93336O4197k09320o0121j65129j14690J28965K98248
$$ 336017 406439 330043 136707 200904 -8416 -68537 -233666 -348356 -219391 78857
15284G8857M4907q3796K27767l4639j33659k07299j54286K04507J83705j6166
$$ 78857 123764 39968 267735 233096 99437 -107862 -262148 -57641 126064 109898
15274A09898j08718r5399m8620O0698J53246k1174J91879p7466l95084K1976M3263
$$ 109898 1180 -94219 -142839 -82141 71105 49931 241810 164344 -230740 -208764 -165501
15263a65501l6683l7243J11296J83026R8857J9080K5559M3473M3509K18710j48673
$$ -165501 -202184 -239427 -128131 54895 153752 172832 198391 241864 285373 504083 355410
15252C55410j88488j01479j36300N04m9680m5539k0540p9114K32576J48174l656
$$ 355410 166922 65443 -70857 -70353 -120033 -165572 -186112 -265226 -32650 115524 111868
15241A11868n6696l1118l26958N5584K81676o7837k67024M7785K53016J65959
$$ 111868 55172 24054 -302904 -247320 34356 -33481 -300505 -252720 296 166255
15231A66255p7642j9142l190J01962J14502Q3962j05170n6696q7020j06775J08449
$$ 166255 88613 69471 66281 168243 282745 366707 261537 204841 117821 11046 119495
15220A19495K56229J52619l30834l43675q3709L1039J85974J77525j19155j9503
$$ 119495 375724 528343 197509 -146166 -229875 -198836 -12862 164663 45508 26005
15210B6005r6213j43425m1707K36281j9086Q9059J47810K72544j4427N1868j98828
$$ 26005 -70208 -213633 -255340 -19059 -38145 50914 198724 471268 456841 508709 309881
15199C09881j17342P8997m5438j02716k1517j42087p5212q81J30083N5044J5281
$$ 309881 192539 271536 226098 123382 101865 -40222 -115434 -116315 13768 68812 84093
15188H4093L751j09742j40716k40109J29659K02948R0162r6188k51003J32670
$$ 84093 87844 -21898 -162614 -402723 -273064 -70116 20046 -76142 -327145 -194475
15178a94475K6779r0378P6730K91925J596R9268k22908j46873j15335J69743m5274
$$ -194475 -167696 -258074 -181344 110581 112177 211445 -11463 -158336 -273671 -103928 -149202
15167a49202j79449O4416K08696J06680J00836Q2141j70299q227j91247N8044
$$ -149202 -328651 -264235 -55539 51141 151977 234118 63819 55592 -135655 -77611
15157g7611L91192Q1047k11751k19805p9820j25399j4327n1744l09221J28235
$$ -77611 313581 394628 182877 -36928 -116748 -242147 -256474 -308218 -617439 -489204
15147d89204K13131j2981p1607O4301M4236Q0545K6541q8161j95303l4980J16818
$$ -489204 -276073 -289054 -360661 -296360 -252124 -171579 -145038 -233199 -428502 -463482 -346664
15136c46664J79525J16143K49741p2710j36450n2655j14831j04079O9639K1864
$$ -346664 -167139 -50996 198745 126035 -10415 -63070 -177901 -281980 -212341 -190477
15126a90477M2728N8379L2532J5530j01446J70196J98335p1177J4984j15045j23627
$$ -190477 -147749 -89370 -56838 -41308 -142754 27442 225777 154600 169584 54539 -69088
15115f9088K9634L3895r7295p651J52583J55893O794Q4987j76129k42312j50160
$$ -69088 -39454 -5559 -102854 -110505 42078 197971 204765 289752 113623 -128689 -278849
15104b78849O7050K7602r6921J86142L16953j46493J6866R0452P7240j5697O9695
$$ -278849 -211799 -184197 -281118 -94976 221977 75484 92350 182802 260042 244345 314040
15093C14040n9450l7031K2979M7718j19715O0078j98965j16467m9954L8219K15833
$$ 314040 254590 217559 240538 288256 168541 228619 29654 -86813 -136767 -98548 117285
15082A17285n1297j81664o4837K42616Q6880k9417k1559j09299j23500L4918K76689
$$ 117285 65988 -115676 -180513 62103 148983 119566 98007 -11292 -134792 -99874 176815
15071A76815J55900R1399l03777l65845K22375J26335p0534M2702J86816J38995
$$ 176815 332715 424114 120337 -245508 -23133 103202 32668 75370 262186 401181
15061D01181j39055j42866L0276K7023k88946k68779J4265j368P1977R1972p8423
$$ 401181 262126 119260 149536 176559 -112387 -381166 -366901 -368269 -296292 -204320 -282743
15050b82743J66560J51082j15366j24376N7334R086o4446n6293L28976L4914N8875
$$ -282743 -116183 34899 -80467 -204843 -147509 -138423 -202869 -259162 69814 104728 163603
15039A63603j09542k22931k38476j11313M41693K52024j45682j3187O3230P0121
$$ 163603 54061 -168870 -407346 -518659 -76966 175058 29376 16189 79419 149540
15029A49540K28968r9995j2247k94831r602O4857J39403j66265p817R2n7936m2352
$$ 149540 378508 278513 266266 -28565 -38167 26690 166093 -172 -7989 -7897 -65833 -108185
15017a08185K15531J37252L5202n2726r7267k43061R532m8185J34501K90822J08812
$$ -108185 107346 244598 279800 227074 129807 -113254 -103722 -151907 -17406 273416 382228
15006C82228J90991m2853N3861J5937k18670j02767m0604q8947k71621j81531
$$ 382228 573219 530366 584227 600164 381494 278727 238123 149176 -122445 -303976
14996c03976q123M6595J9577M04243K20774k46352L3565p481M8883k599k90320
$$ -303976 -312099 -265504 -245927 158316 379090 132738 166303 158822 207705 205106 -85214
14985h5214o2560O2017M2917K5216j6272R5141l6876j95345j63027j36412M8246
$$ -85214 -147774 -85757 -42840 -17624 -33896 61245 24369 -170976 -334003 -470415 -422169
14974d22169J25734K34248L02324L0935r9566k65605j54581j20098J55751J06081
$$ -422169 -296435 -62187 240137 271072 171506 -94099 -248680 -368778 -213027 -106946
14964a06946j35588j53537K24442J95462k8380k0573Q6798J8063k81296l6564
$$ -106946 -242534 -396071 -171629 23833 -4547 -25120 61678 79741 -201555 -238119
14954b38119J64784L9192J13764P1446K9843j76336j01025L9152J2779j51192
$$ -238119 -73335 -34143 79621 151067 180910 4574 -96451 -57299 -44520 -195712
14944a95712j73605J62344J60282j68196J95547o3777o1497K5497j00162j8617
$$ -195712 -369317 -206973 -46691 -214887 -19340 -83117 -144614 -119117 -219279 -237896
14934b37896R9541P722o3713J26757K4038m0065K9920K2797k9823l7540L48735
$$ -237896 -138355 -130633 -194346 -67589 -43551 -83616 -53696 -30899 -60722 -98262 250473
14923B50473j1353l42671J2835J86049J30193R606j98061j55066n0401p800N8020
$$ 250473 239120 -103551 -90716 95333 225526 235132 37071 -117995 -168396 -176196 -118176
14912a18176M9748j02977k30022K55889Q3445k9798j7686n1279J36853J40194
$$ -118176 -68428 -171405 -401427 -145538 -62093 -91891 -109577 -160856 -24003 116191
14902A16191l038L4111N2273K2966m8911o5859o3091J25816M3202l1095k10686
$$ 116191 113153 147264 199537 222503 173592 107733 44642 170458 213660 182565 -28121
14891b8121j79728K16304J7509j95149n8257n3785j77665q4550K94404K16577
$$ -28121 -207849 8455 25964 -169185 -227442 -281227 -458892 -543442 -249038 -32461
14881c2461j49556K3618L83836l513P6935l7846j13333k20409j33841k9858K04504
$$ -32461 -182017 -158399 225437 221924 298859 261013 147680 -72729 -206570 -236428 -31924
14870c1924M6044J286J86495P7809k36669o0825J714K6873R2592q7425m8812j45955
$$ -31924 14120 15406 201901 279710 43041 -17784 -16070 10803 103395 15970 -32842 -178797
14858a78797L0318O6213J46044J58899R4135L3750k87o8064k35002q8179J8047
$$ -178797 -148479 -82266 63778 222677 316812 350562 350275 282211 47209 -40970 -22923
14847b2923r177N8286k61106J14672K69530n638l831k3749J53024k82494k64084
$$ -22923 -32100 26186 -234920 -120248 149282 143644 139813 116064 269088 -13406 -277490
14836b77490k75144p8801K64174L00510K25945K1933r1835q6824J52745j7329
$$ -277490 -552634 -631435 -367261 -66751 159194 181127 89292 2468 155213 137884
14826A37884K12802k34703k27767L59115P6503k75623J08971R6048j92925l2356
$$ 137884 350686 115983 -111784 247331 323834 48211 157182 253230 60305 27949
14816B7949j98624l2866L74402J41596k26655k19736J17663K3568J9746j52905
$$ 27949 -170675 -203541 170861 312457 85802 -133934 -16271 7297 27043 -125862
14806a25862j11347K81183J26696j08943J4652j55343j7811K5267K8956r0928
$$ -125862 -237209 43974 170670 61727 76379 -78964 -96775 -71508 -42552 -133480
14796a33480J7739M946o1335j06478j40413j43103J35817K87433j8577p6920J02795
$$ -133480 -115741 -110795 -172130 -278608 -419021 -562124 -426307 -138874 -157451 -234371 -131576
14785a31576K51792j12604R3248k9651J93987M477k05248M3407j71533L4824l4244
$$ -131576 120216 7612 100860 71209 265196 269673 64425 107832 -63701 -28877 -63121
14774f3121J3455L0940K1196O0439k8172Q9547j21981k27980Q6560K911o5327
$$ -63121 -49666 -18726 2470 62909 34737 124284 2303 -225677 -139117 -136206 -201533
14763b01533j84990j6179J78000K02133J87556j4739M4805J08234Q0919j75011
$$ -201533 -386523 -402702 -224702 -22569 164987 150248 195053 303287 384206 209195
14753B09195j62421O0823j30014q3504j14585N2859K22414K84993j48608J17073
$$ 209195 46774 107597 -22417 -105921 -220506 -167647 54767 339760 191152 308225
14743C08225q9624L4196j48655l11209q5334M7506K7751K00090J81233J09808
$$ 308225 218601 252797 104142 -207067 -292401 -244895 -217144 -17054 164179 273987
14733B73987j81233k731J07752L71353L68789L71095M70929j0177m6012j34053
$$ 273987 92754 90023 197775 569128 937917 1309012 1779941 1769764 1723752 1589699
14723A589699m81589l98320j77919j184N3538k0378r7449k70246j82786l0530
$$ 1589699 1108110 709790 531871 530687 584225 563847 466398 196152 13366 -17164
14713a7164k2866m1034J02674J26180l0856k40273Q3281K14615k53826K9848R8786
$$ -17164 -40030 -81064 21610 147790 116934 -123339 -40058 174557 -79269 -49421 49365
14702D9365R1968Q3007K06990j02486n7029O9197J12600o3165j1730o947j06595
$$ 49365 141333 224340 431330 328844 271815 341012 453612 390447 378717 371770 265175
14691B65175k43632p2955J62972j30366k12956J31602Q9427J13168N5824j99868
$$ 265175 21543 -51412 111560 -18806 -231762 -100160 -10733 102435 158259 -41609
14681d1609k80533L1992R8892j3241L448j1330j23157K47736P0109L9927j41878
$$ -41609 -322142 -290150 -191258 -204499 -201051 -212381 -335538 -87802 -17693 22234 -119644
14670a19644J86253J80742Q0467j80226k14402k31515k42679J19039L5602P3357
$$ -119644 66609 247351 327818 147592 -66810 -298325 -541004 -421965 -386363 -313006
14660c13006J03187J16507N6131J61483j26486O2189k9114j46465o7902L53732
$$ -313006 -209819 -93312 -37181 124302 -2184 60005 30891 -115574 -183476 170256
14650A70256J16846J55166l278o6152j64119k07869q8905J6631O2295K2420j4916
$$ 170256 287102 442268 438990 372838 208719 850 -88055 -71424 -9129 13291 -1625
14639a625j09309Q3566q0952J52313J4018J40335j6972J2962q5818r3541j15628
$$ -1625 -110934 -27368 -108320 43993 58011 198346 181374 194336 108518 14977 -100651
14628a00651Q0669K08950j24282j31630K1273J52043Q4690n2155l17038J40417
$$ -100651 -19982 188968 64686 -66944 -45671 106372 191062 138907 -178131 -37714
14618c7714K17896K1277j35944j65960j20912Q2j69059J77519p074j04727L2881
$$ -37714 180182 201459 65515 -100445 -221357 -221275 -390334 -212815 -219889 -324616 -291735
14607b91735K68881j18200j36223k14324K791J98654J16927P0934J20665q0655
$$ -291735 -22854 -141054 -277277 -491601 -488810 -290156 -173229 -102295 18370 -62285
14597f2285N0518J82385O320J15753k25762k61434J39511K16393l4852j37459
$$ -62285 -11767 170618 176938 292691 66929 -194505 -54994 161399 126547 -10912
14587a0912j62978M8358M4218o2977j16767l2045N21382J81866j19086n2985r4971
$$ -10912 -173890 -125532 -81314 -144291 -261058 -293103 228279 410145 291059 238074 143103
14576A43103l03239j5647K42030J5308k66422J08267M9618m338Q9420k9320m8331
$$ 143103 -160136 -175783 66247 81555 -184867 -76600 -26982 -31320 58100 28780 -19551
14565a9551r6650K3789K10835L5122k8252M315j87342k9354L7631q8653j42491
$$ -19551 -116201 -92412 118423 153545 125293 129608 -57734 -87088 -49457 -138110 -280601
14554b80601L07483M2225j02935l57059J34594K08187O3305l0435k37654q4434
$$ -280601 26882 69107 -33828 -390887 -256293 -48106 15199 -15236 -252890 -337324
14544c37324J77367J16915J28913q0127p3212K36463L3845j54903P209O8129j30982
$$ -337324 -159957 -43042 85871 5744 -67468 168995 202840 47937 55146 123275 -7707
14533g707l8119K52503J43942j20598k52956m5789K19985j03713l4774M1510P9140
$$ -7707 -45826 206677 350619 230021 -22935 -68724 151261 47548 12774 54284 133424
14522A33424K20849k20790l20750j29461q8704J38385L09903l5472j6067j62769
$$ 133424 354273 133483 -187267 -316728 -405432 -267047 42856 7384 -8683 -171452
14512a71452N2387J89801J26801m4049j15370j56856q3009L234K43485j28739
$$ -171452 -119065 70736 197537 153488 38118 -118738 -201747 -198513 44972 -83767
14502h3767k64576l7005K57786j26115l054J26532K22140J7282J1246j86423N8615
$$ -83767 -348343 -385348 -127562 -253677 -256731 -130199 91941 109223 120469 -65954 -7339
14491g339K48667o463j97828p420J42217O3900N4205Q950j90960j40531J08973
$$ -7339 241328 234865 37037 29617 171834 235734 289939 298889 107929 -32602 76371
14480G6371K38654j51668n2368J37706O4205J11278l16870n9018l2064J30200
$$ 76371 315025 163357 110989 248695 312900 424178 107308 48290 16226 146426
14470A46426o5810j30393m7020j3962j36969K09114K15986L9313J11374Q8240
$$ 146426 80616 -49777 -96797 -110759 -247728 -38614 177372 216685 328059 416299
14460D16299J9799l6519J974j80070q2850k04458n1856M8352J79891K95267J19075
$$ 416299 436098 399579 401553 221483 138633 -65825 -117681 -69329 110562 405829 524904
14449E24904j59332j70353l80764P4550L23964R3204q9771j06070j50773j55464
$$ 524904 365572 195219 -185545 -110995 212969 306173 216402 110332 -40441 -195905
14439a95905q1993L16575J85075l41494k32176J6273M948M9081K55546p9417j69788
$$ -195905 -277898 38677 223752 -117742 -349918 -333645 -328697 -279616 -24070 -103487 -273275
14428b73275O4443K40447O7041q9191k9784k92532j05086j6050L47439J60832
$$ -273275 -208832 31615 98656 9465 -20319 -312851 -417937 -433987 -86548 74284
14418G4284M1132K52027j49287k50984j56318j00301k6664L40703L8356l41600
$$ 74284 115416 367443 218156 -32828 -189146 -289447 -316111 24592 62948 -278652
14408b78652j72360K8203L24606J52662M1777J12552j40522k57311j95190N871
$$ -278652 -451012 -422809 -98203 54459 96236 208788 68266 -189045 -384235 -378364
14398c78364o691K5375p1210N7764L41724k0208m5945J95155k4849m3725J37964
$$ -378364 -385055 -359680 -430890 -373126 -31402 -51610 -97555 97600 72751 29026 166990
14387A66990K13699k25183m65622j35683J60142J37883m9619M8962J8528K3127
$$ 166990 380689 155506 -310116 -445799 -285657 -147774 -197393 -148431 -129903 -106776
14377a06776N4977m9697j00320J41560R2210p7752j24474Q2939q6846o4078O1311
$$ -106776 -51799 -101496 -201816 -60256 31954 -45798 -170272 -87333 -174179 -238257 -176946
14366a76946m045J08022m5800j24461l1274J97659J39898M9203N0008k77874k20810
$$ -176946 -180991 -72969 -118769 -243230 -274504 -76845 63053 112256 162264 -115610 -336420
14355c36420L8949p155J71945K02992K94495R5035j66741o9852k91922R8018l6651
$$ -336420 -297471 -304626 -132681 70311 364806 459841 293100 223248 -68674 29344 -7307
14344g307j26789j00511R0310L12287j13053N9566K07596j76199j92515M8967
$$ -7307 -134096 -234607 -144297 167990 54937 114503 322099 145900 -46615 2352
14334B352J74456j35002j16973L08697P5137j59689j51423m0586k00431j82924
$$ 2352 176808 41806 -75167 233530 308667 148978 -2445 -43031 -243462 -426386
14324d26386M4610J32151N2067J93520K80771Q6202m165j18423j32853J25242
$$ -426386 -381776 -249625 -197558 -4038 276733 362935 358770 240347 107494 232736
14314B32736J05476J84267j26314j64117k91209P2780J15057K6685m307k18946
$$ 232736 338212 522479 396165 232048 -59161 13619 128676 155361 151054 -67892
14304f7892k09525k6413K05798K30796K3585J32300K20295l37761m34057M0845
$$ -67892 -277417 -303830 -98032 132764 156349 288649 508944 171183 -262874 -222029
14294b22029J31282o6875l2574N6994p3562j55239J79360q863m7842p695K56468
$$ -222029 -90747 -157622 -190196 -133202 -206764 -362003 -182643 -191506 -239348 -247043 9425
14283I425k14504k04983j7048J19794Q4885L04829J80553j75030k13508j65409
$$ 9425 -205079 -410062 -427110 -307316 -222431 82398 262951 87921 -125587 -290996
14273b90996o2508j23719l3500K81204J83771J1553L4112J46852Q7720n6227j60676
$$ -290996 -353504 -477223 -510723 -229519 -45748 -34195 -83 146769 234489 178262 17586
14262A7586J41780N5379l31068l7689J46271p3744J8819N6580Q1208K85195k35479
$$ 17586 159366 214745 -116323 -154012 -7741 -81485 -62666 -6086 75122 360317 124838
14251A24838k28162K3966J90146L9355r55R9561r4611q881L7171K29490q1845
$$ 124838 -103324 -79358 110788 150143 149188 248749 154138 145257 182428 411918 330073
14240C30073j2896K3111k00675j42729Q3830j56779j12825P9187J80214l9147
$$ 330073 317177 340288 139613 -3116 80714 -76065 -188890 -109703 70511 31364
14230C1364K35825N8810O399Q6464N1491j7745k77473k05858n1441L6823K7516
$$ 31364 267189 325999 332398 418862 470353 452608 175135 -30723 -82164 -45341 -17825
14219a7825o6727P9151K10556K21035R6776j01656o6820m1619j34364j67353j61373
$$ -17825 -84552 -5401 205155 426190 522966 421310 354490 312871 178507 11154 -150219
14208a50219j83800l4972R5621L10559K20387J24672r6132j84313j20194m9479
$$ -150219 -334019 -368991 -273370 37189 257576 382248 286116 101803 -18391 -67870
14198f7870j2646K340n5877j72808j46171R6627K76212O9102K14359j57543l00389
$$ -67870 -80516 -78176 -134053 -306861 -453032 -356405 -80193 -11091 203268 45725 -254664
14187b54664N4793K67391K21736q5940k86079j98158J16149L04050k11546j88372
$$ -254664 -199871 67520 289256 203316 -82763 -280921 -164772 139278 -72268 -260640
14177b60640k1473j67953r7616K44949K81515J79143J18839n5685j92308p4122
$$ -260640 -282113 -450066 -547682 -302733 -21218 157925 276764 221079 28771 -45351
14167d5351j9560P3702J65730J71249J57819k21504k29559j23505j60439l3178
$$ -45351 -64911 8791 174521 345770 503589 282085 52526 -70979 -231418 -264596
14157b64596J84504L51269j93422l1656j584n7929j88379l5083J03028m2333J82107
$$ -264596 -80092 271177 77755 46099 44515 -13414 -201793 -236876 -133848 -176181 5926
14146E926J53701j51037j84187j60791q5157L46777J15162o4525o1764N7265q2011
$$ 5926 159627 8590 -175597 -336388 -421545 -74768 40394 -24131 -85895 -28630 -110641
14135a10641P7417K99688p0604l37513q601K50361k95505l42117L6828K87557
$$ -110641 -33224 266464 195860 -141653 -150254 100107 -195398 -537515 -500687 -213130
14125b13130K79610J46457L01247n7302l03279m47726j0266L09106Q3358M1211
$$ -213130 66480 212937 514184 456882 153603 -294123 -304389 4717 88075 129286
14115A29286j07781p8780J4007J82598l1404k78487n4744O7026J1547M6394j20966
$$ 129286 21505 -57275 -43268 139330 107926 -170561 -225305 -158279 -146732 -100338 -221304
14104b21304J00249r0372j38720J16107J64394M8558O7760j11825N2160k02321
$$ -221304 -121055 -211427 -350147 -234040 -69646 -21088 46672 -65153 -12993 -215314
14094b15314p1715J93055L59239k05009o8103R5970Q192j28453Q9589R603j69538
$$ -215314 -287029 -93974 265265 60256 -7847 88123 96315 -32138 57451 67054 -102484
14083a02484n5865O329J36172J15396j4864n5863J89934O5687j21382N6232j56563
$$ -102484 -158349 -152020 -15848 99548 84684 28821 218755 284442 163060 219292 62729
14072F2729r9186P8214n1273j71464q2257J0694J64030K98462K7761P1875P4974
$$ 62729 -36457 41757 -9516 -180980 -263237 -252543 -88513 209949 237710 309585 384559
14061C84559J5778j05801k92017j11764R0767K6716M3251K31179k67944j78407
$$ 384559 400337 294536 2519 -109245 -18478 8238 51489 282668 14724 -163683
14051a63683k7594l164j43806O2227L8946P5566K2521Q8315J09673r8869k07838
$$ -163683 -191277 -194441 -338247 -276020 -237074 -161508 -138987 -50672 59001 -39868 -247706
14040b47706R124M3227j08807P6469J21383j06001j50267J960J66703J18872l4445
$$ -247706 -238582 -195355 -304162 -227693 -106310 -212311 -362578 -360618 -193915 -75043 -109488
14029a09488J55067O981j22130j34094k67935Q1041J81846J26837J7559J94759
$$ -109488 45579 52560 -69570 -203664 -471599 -390558 -208712 -81875 -64316 130443
14019A30443p132p8046r3134j18746M3826p3215M1721K14787n4655j45992j33025
$$ 130443 123311 45265 -47869 -166615 -122789 -196004 -154283 60504 5849 -140143 -273168
14008b73168K6047J96216N4011M6023K39794j0333j37731r1510L4751J34673q3069
$$ -273168 -247121 -50905 3106 49129 288923 278590 140859 49349 84100 218773 135704
13997A35704j7526l4648j25759J06882J48314K8760p3445O6834p920k27200m3299
$$ 135704 118178 83530 -42229 64653 212967 241727 168282 235116 227196 -4 -43303
13986d3303K48825l3986j90391K8828J28077k57036o4554J45207J06188N8073
$$ -43303 205522 171536 -18855 9973 138050 -118986 -183540 -38333 67855 125928
13976A25928k4524R7726K5875j66230l6264k75413Q3895o823k3148N4809L9884
$$ 125928 101404 199130 225005 58775 22511 -252902 -169007 -175830 -198978 -144169 -104285
13965a04285K06806L29997k20461l49806j51143l4783M5888J82163K61651K04360
$$ -104285 102521 432518 212057 -137749 -288892 -323675 -277787 -95624 166027 370387
13955C70387j28126k02352r1156k33572Q5552R3443J03488j55532k23579q7750
$$ 370387 242261 39909 -51247 -284819 -199267 -105824 -2336 -157868 -381447 -469197
13945d69197J78343L1557k3572J18543R4099j94955n2218q9122J03796J83694
$$ -469197 -290854 -259297 -282869 -164326 -70227 -265182 -317400 -406522 -302726 -119032
13935a19032J94485K92325O1406N5392J67070j15601l34849k73623M3207J62704
$$ -119032 75453 367778 429184 484576 651646 536045 201196 -72427 -29220 133484
13925A33484Q1007N2877R7183R8824m4839j77011m4446q2827k77922j85427L96841
$$ 133484 214491 267368 364551 463375 418536 241525 197079 114252 -163670 -349097 47744
13914D7744K83403o9121p6034j41774R8817N73N2547l895r4041m8758R8471r8260
$$ 47744 331147 262026 185992 44218 143035 143608 196155 192260 98219 49461 147932 49672
13902D9672N8590j62560M9727J25383m5016r274p2933j38708k43696R9564J39004
$$ 49672 108262 -54298 -4571 120812 75796 66522 -6411 -145119 -388815 -289251 -150247
13891a50247J50464l3386l8317q6533k44020n1864L01457K43789J14534J24074
$$ -150247 217 -33169 -71486 -158019 -402039 -453903 -152446 91343 205877 329951
13881C29951J35375j64084r2720j53040j73178j35978n0428J47343K90616J12556
$$ 329951 465326 301242 208522 55482 -117696 -253674 -304102 -156759 133857 246413
13871B46413r0401q0901k3293p2933J48466K58328J93034k5914j25220j59526
$$ 246413 156012 75111 51818 -21115 127351 385679 578713 552799 427579 268053
13861B68053o177j50217j0762l3207M9649p9048q2408j62863o2410L33069j88966
$$ 268053 261876 111659 100897 67690 117339 38291 -44117 -206980 -269390 63679 -125287
13850a25287k21194n4060n9756p5386J77068K43617J18669P4644p4456p3486j33876
$$ -125287 -346481 -400541 -460297 -535683 -358615 -114998 3671 78315 3859 -69627 -203503
13839b03503R7458O303R991J43158J3726K6476J68357j07384k24106j15843J47599
$$ -203503 -106045 -99742 -89751 53407 67133 93609 261966 154582 -69524 -185367 -37768
13828c7768j03071j6483J20248J93086Q7831r5603j07266j89282q4518j96384
$$ -37768 -140839 -157322 -37074 156012 243843 148240 40974 -148308 -232826 -429210
13818d29210k7915K15172J40875J30142M0059j6459p7984q1568K4607R430K7897
$$ -429210 -457125 -241953 -101078 29064 69123 52664 -25320 -106888 -82281 -72851 -44954
13807d4954N6717j4458R8459K47251j08153K22288J9989j99632j42100L8436l2923
$$ -44954 11763 -2695 95764 343015 234862 457150 477139 277507 135407 173843 140920
13796A40920j9215l03709K5968J1189N7553K54471J32514j50947j42055j05772
$$ 140920 121705 -182004 -156036 -144847 -87294 167177 299691 148744 6689 -99083
13786i9083j85515J1869K6710n8169P2067P9184M9139j7467P3112J38626K30140
$$ -99083 -284598 -272729 -246019 -304188 -232121 -152937 -103798 -121265 -48153 90473 320613
13775C20613K95281n5659j13132j42828j55365o909J40361k13454K6467j10410
$$ 320613 615894 560235 447103 304275 148910 142001 282362 68908 95375 -15035
13765a5035j69927j21819l45429k1339K15011L30235K51488q7064k37791j56072
$$ -15035 -184962 -306781 -652210 -673549 -458538 -128303 123185 36121 -201670 -357742
13755c57742o9574K21905J92162J40892R1212J81851J31450j44257k43429k22890
$$ -357742 -427316 -205411 -13249 127643 218855 400706 532156 387899 144470 -78420
13745g8420L6764K6189j08658M8711L98102L28401k00326j34578K10783j39342
$$ -78420 -41656 -15467 -124125 -75414 322688 651089 450763 316185 526968 387626
13735C87626l20274p5138k6210j03445k39913l0977n7664J41709O1702J03992
$$ 387626 67352 -7786 -33996 -137441 -377354 -408331 -465995 -324286 -262584 -158592
13725a58592j73513K1026K35681J81073Q7210p5329k45024j76768J42200J28830
$$ -158592 -332105 -311079 -75398 105675 192885 117556 -127468 -304236 -162036 -33206
13715c3206j8242j66246J01560L82M7375Q0986J4545L9499L0253n2063j88779
$$ -33206 -51448 -217694 -116134 -115752 -68377 12609 27154 66653 96906 44843 -143936
13704a43936o963K3959r9874J03633J92299N4684j61446j81759j50323m2039O6210
$$ -143936 -150899 -126940 -226814 -123181 69118 123802 -37644 -219403 -369726 -411765 -345555
13693c45555J91967O3077j13119j3749L5747P6952K04652K2486n3666n8612M1284
$$ -345555 -153588 -90511 -203630 -217379 -181632 -104680 99972 122458 68792 10180 51464
13682E1464k1703J31467L5094K6356k21541k08819k05626N6883L2995k08201n8192
$$ 51464 29761 161228 196322 222678 1137 -207682 -413308 -356425 -323430 -531631 -589823
13671e89823L84505K20969p3771J06105j14239K74521r05j48507Q0941k9557J32472
$$ -589823 -205318 15651 -58120 47985 -66254 208267 207362 58855 139796 110239 242711
13660B42711k6667p3986j00916j03265k31135j00460K42538J86682m6170r3756
$$ 242711 216044 142058 41142 -62123 -293258 -393718 -151180 35502 -10668 -104424
13650a04424Q9288O6017j58639L9021j1274j46327J43594J40178o348k29365K202
$$ -104424 -15136 50881 -107758 -68737 -80011 -226338 -82744 57434 51086 -178279 -176077
13639a76077J6222R5588J04633q0431j24453N9598J79032j35090l12233j8726
$$ -176077 -159855 -64267 40366 -40065 -164518 -104920 74112 -60978 -373211 -391937
13629c91937L58539K6023p1490k48936Q83K39732M88j62418P4973K46766n8575
$$ -391937 -33398 -7375 -78865 -327801 -326918 -87186 -86698 -249116 -174143 72623 14048
13618A4048L5888o0011K14207j03394k94190K3316r7820N4915O5064J6149p4388
$$ 14048 49936 -10075 204132 100738 -193452 -170136 -267956 -213041 -147977 -131828 -206216
13607b06216m0894j5797J46821N7019j41365R4088K9619J89410k2605M9135L6329
$$ -206216 -247110 -262907 -116086 -59067 -200432 -106344 -76725 112685 90080 139215 175544
13596A75544M2105k27628l5240n7047P3209m9919k70379j35161J47722J60345
$$ 175544 217649 -9979 -45219 -102266 -29057 -78976 -349355 -484516 -336794 -176449
13586a76449P0549K12400j20083k01327R1662J10994Q2397N0362l884k15152l5549
$$ -176449 -105900 106500 -13583 -214910 -123248 -12254 70143 120505 116621 -98531 -134080
13575a34080J56764j25088o334K74469J1834k77829k22101J1848J25712J09342
$$ -134080 22684 -102404 -108738 165731 177565 -100264 -322365 -310517 -184805 -75463
13565g5463P2277O8612K3901l5156n6721O619J37334K7168O672R4733j71187q3337
$$ -75463 -3186 65426 89327 54171 -2550 4069 141403 168571 175243 269976 98789 15452
13553A5452Q4505k8410j04922K41949R2582k46537L7846j39683J33195L2879j79703
$$ 15452 99957 71547 -33375 208574 301156 54619 92465 -47218 85977 118856 -60847
13542f0847M0500r573n0180L52506K43541j23703j37486k9437o3581N3832k60333
$$ -60847 -20347 -29920 -80100 272406 515947 392244 254758 225321 161740 215572 -44761
13531d4761k03284j9639k6518K15446L89426o1470j62343j11956Q3429r4674O9195
$$ -44761 -248045 -267684 -294202 -78756 310670 249200 86857 -25099 58330 -36344 32851
13520C2851J61263P1232k51078j41390M8364N2973m2393j99808l0398k365m298
$$ 32851 194114 265346 14268 -127122 -78758 -25785 -68178 -267986 -298384 -300749 -305047
13509c05047N0264L4444j70631N4876Q4819Q5619K78957J36591k55559p0834m4265
$$ -305047 -254783 -220339 -390970 -336094 -251275 -165656 113301 249892 -5667 -76501 -120766
13498a20766k46112R7329K5253j72782R6974K88664K3699p1265p6898o2977Q5427
$$ -120766 -366878 -269549 -244296 -417078 -320104 -31440 -7741 -79006 -155904 -218881 -133454
13487a33454J50487L3731p9606k04135K6508P7491L482J07914N0583l9657K42566
$$ -133454 17033 50764 -28842 -232977 -206469 -128978 -125496 -17582 33001 -6656 235910
13476B35910Q5124j79743j93798r0744k28986j9765J48379K00188q6771p3227
$$ 235910 321034 141291 -52507 -143251 -372237 -392002 -243623 -43435 -130206 -203433
13466b03433n4610L261J34853N4943N8104J00276J33247j21224j59506J45484
$$ -203433 -258043 -254782 -119929 -64986 -6882 93394 226641 105417 -54089 91395
13456I1395o0830l16553j23188K10459J37498j42493k4290O2828J9798L521m5659
$$ 91395 30565 -285988 -409176 -198717 -61219 -203712 -228002 -165174 -145376 -141855 -187514
13445a87514K74468K02758p4632j94995j2631j00474l752j72522J77807J54411
$$ -187514 86954 289712 215080 20085 7454 -93020 -96772 -269294 -91487 62924
13435F2924K6327j38447J84521m81j77440Q3636R0903J31456R540K32779J14955
$$ 62924 89251 -49196 135325 134844 -42596 41040 131943 263399 272939 505718 620673
13424F20673j53949j85451p3429q5122j3734K01495l3246j02122k36372l44544
$$ 620673 466724 281273 207844 122722 108988 310483 277237 175115 -61257 -405801
13414d05801n3772r6256P6977J91224k3884m4856J80724k4220n86J73021Q3547
$$ -405801 -459573 -555829 -478852 -287628 -311512 -356368 -175644 -199864 -200450 -27429 56118
13403E6118j39683M8697k3829l5262O2975M16059j76520p3749N9854j37940k54644
$$ 56118 -83565 -34868 -58697 -93959 -30984 385075 208555 134806 194660 56720 -197924
13392a97924Q8644M00145j47311j8870j27609r5787N6788Q3468k946j68704p5106
$$ -197924 -109280 290865 143554 124684 -2925 -98712 -41924 41544 38598 -130106 -205212
13381b05212J18864j11237P4054j07104p2008J97173J15724J18846k8121j01292
$$ -205212 -86348 -197585 -123531 -230635 -302643 -105470 10254 129100 100979 -313
13371c13J9522j08408k21243J9162J5559n6698Q5051J29179J96256L70718L4152
$$ -313 19209 -89199 -310442 -291280 -275721 -332419 -247368 -118189 78067 448785 482937
13360D82937j21407j24526j04153k2614N1577J16218r9049l4445k5234J65785
$$ 482937 361530 237004 132851 110237 161814 278032 178983 144538 119304 285089
13350B85089M779j35106M0873M4186j69390k31298R4678j7847r9294Q6027j6263
$$ 285089 289868 154762 195635 239821 70431 -160867 -66189 -84036 -183330 -97303 -113566
13339a13566O843N7441J16186J4303j99341k22965P4067N3424J80952J40899O4578
$$ -113566 -106723 -49282 66904 81207 -118134 -341099 -267032 -213608 -32656 108243 172821
13328A72821j80562N3325j03721j57160J63527Q6565l3335j14875j44223J23231
$$ 172821 -7741 45584 -58137 -215297 -51770 34795 1460 -113415 -257638 -134407
13318a34407J18520P8685j97225P7837L72722j22937j39651J33215m1119n9095
$$ -134407 -15887 62798 -134427 -56590 316132 193195 53544 186759 145640 86545
13308H6545r1502o7136J13661J18263l19368j39697M1795R5342K08282L7099N3845
$$ 86545 -4957 -72093 41568 159831 -159537 -299234 -257439 -162097 46185 83284 137129
13297A37129m4528j79075r3752n6842k16276P3882L14615J16550o4723J21795
$$ 137129 92601 -86474 -180226 -237068 -453344 -379462 -64847 51703 -13020 108775
13287A08775K39517n7191k62997j803J39241j11542j24373j11307J54825j63878
$$ 108775 348292 291101 28104 26301 165542 54000 -70373 -181680 -26855 -190733
13277a90733j69732l3459r4635K5316J03647j471J88102J7303K22817J05659j41601
$$ -190733 -360465 -393924 -488559 -463243 -359596 -361067 -172965 -155662 67155 172814 31213
13266C1213j32889l4054p110j30248J91426K04178Q5018j03018j23537M8649j54429
$$ 31213 -101676 -135730 -142840 -273088 -81662 122516 207534 104516 -19021 29628 -124801
13255a24801J40719J97459J21828o148n6463j26893q1113J47219L0336j29244
$$ -124801 15918 213377 335205 329057 272594 145701 64588 211807 242143 112899
13245A12899N0488k59890j32252j9225K26273J00074l1399l3080Q2418k05647
$$ 112899 163387 -96503 -228755 -247980 -21707 78367 46968 13888 96306 -109341
13235a09341J55058O2208p5845k86706L392m5926L5612J48737O8070j65656p0773
$$ -109341 45717 107925 32080 -254626 -251234 -297160 -261548 -112811 -44741 -210397 -281170
13224b81170m3707m1811K43477J49492k0400k14q6561R2429l943m3504l8777n0210
$$ -281170 -324877 -366688 -123211 26281 5881 5667 -80894 11535 7592 -35912 -74689 -124899
13212a24899r4991K93053J78153O7909k51608j33869K1748J73351J07501j3237
$$ -124899 -219890 73163 251316 319225 67617 -66252 -44504 128847 236348 223111
13202B23111p7791j99632j56753J17526J58326n400j20464o7714j91881J62459
$$ 223111 145320 -54312 -211065 -93539 64787 59387 -61077 -128791 -320672 -158213
13192a58213K85197k9057j2814j17631n0663r7160n3993j32784O441J17658J14501
$$ -158213 126984 97927 85113 -32518 -83181 -180341 -234334 -367118 -360677 -243019 -128518
13181a28518j0800r9470q2709K18243n7115P5272L1255J512J25309k33496J38711
$$ -128518 -139318 -238788 -321497 -103254 -160369 -85097 -53842 -52330 72979 -160517 -21806
13170b1806J76441k61364k40296q6671J54200J89619j51879K42169J55122J8256
$$ -21806 154635 -106729 -347025 -433696 -279496 -89877 -241756 413 155535 173791
13160A73791j76463k6324j7302R4724L2504J18826M7603j31644j59814M1831L2992
$$ 173791 -2672 -28996 -46298 48426 80930 199756 247359 115715 -44099 -2268 30724
13149C0724k4656J28078J68010L7501j10129j36604o4947k30630M44J26288K24048
$$ 30724 6068 134146 302156 339657 229528 92924 27977 -202653 -202209 -75921 148127
13138A48127j05272k18508J09519K11315K59112j24172p9300L5327N2136L2068
$$ 148127 42855 -175653 -66134 145181 404293 280121 200821 236148 288284 320352
13128C20352J9597J31500j12277j60638j35642J99683R8917m1256m07609k57391
$$ 320352 339949 471449 359172 198534 62892 262575 361492 320236 -87373 -344764
13118c44764j41316J04049J82208O4380L5485J22489q989k18500K7149j40472
$$ -344764 -486080 -382031 -199823 -135443 -99958 22531 13542 -204958 -177809 -318281
13108c18281l8452J72698J26386K13006j61617k9463J77842K5570k04950n9242
$$ -318281 -356733 -184035 -57649 155357 -6260 -35723 142119 167689 -37261 -96503
13098i6503K20300L1920j51298n5645J88424j24637j392K00311r4030K0402r1893
$$ -96503 123797 155717 4419 -51226 137198 12561 11169 211480 117450 137852 45959
13087D5959j19649j03966J95466J35963j70750l9568J74873K14004q9709j37641
$$ 45959 -73690 -177656 17810 153773 -16977 -56545 118328 332332 242623 104982
13077A04982k10620l3474N2093P5218J8084L8097N6380J3572j2868j81596l6746
$$ 104982 -105638 -139112 -87019 -11801 6283 44380 100760 114332 101464 -80132 -116878
13066a16878j53906k27370k7218L38014K57023P8485N6631P8541Q6091k11832
$$ -116878 -270784 -498154 -525372 -187358 69665 148150 204781 283322 369413 157581
13056A57581m9383J829k28776J95894l2253j52820J60319k08263r4827L4816K34092
$$ 157581 108198 110027 -118749 77145 44892 -107928 52391 -155872 -250699 -215883 18209
13045A8209J1666j9416K3353o488R133j4894n7314l19438j2866J29692Q0958N5139
$$ 18209 29875 10459 33812 27324 36457 21563 -35751 -355189 -368055 -238363 -157405 -102266
13033a02266M026k1985j4079j8223O0223P2286K26074j72945j29430L0176L05103
$$ -102266 -98240 -120225 -134304 -152527 -92304 -20018 206056 33111 -96319 -66143 238960
13022B38960J68591j04892r2074n6522j85699N2404K40830p8039j82547K6538
$$ 238960 407551 302659 210585 154063 -31636 20768 261598 183559 1012 27550
13012B7550K44757k1666j70107k02355j81100J4545j59953j58918p6787P9795
$$ 27550 272307 250641 80534 -121821 -302921 -288376 -448329 -607247 -684034 -604239
13002f04239J28720L17616J07268k73695L3056K60062K66421j527j67705K6414
$$ -604239 -475519 -157903 -50635 -324330 -291274 -31212 235209 233682 65977 92391
12992I2391j29116M6544r0757K8028R5804q1666j74821J6484P6377j61245J65013
$$ 92391 -36725 9819 -80938 -52910 42894 -38772 -213593 -197109 -120732 -281977 -116964
12981a16964K71403j52663N6535Q0908Q0710r3392j58445J70489j43549j63504
$$ -116964 154439 1776 58311 139219 219929 126537 -31908 138581 -4968 -168472
12971a68472J25012P0498j84783n9639j60714J37512P4430q6342j66000L7769
$$ -168472 -43460 27038 -157745 -217384 -378098 -240586 -166156 -252498 -418498 -380729
12961c80729J9186p392J49574K68832J78100m7200k94622m46036n98L18143J58775
$$ -380729 -361543 -368935 -219361 49471 227571 180371 -114251 -560287 -560885 -242742 -83967
12950h3967J48283O3357j32730l7952L11813N8327l5625j08784k3014k17281j03729
$$ -83967 64316 127673 -5057 -43009 268804 327131 291506 182722 159708 -57573 -161302
12939a61302N3412N1908J30656L8966j15443j6660m9697k37512J6733K33030L50266
$$ -161302 -107890 -55982 74674 113640 -1803 -18463 -68160 -305672 -288939 -55909 294357
12928B94357L9005n8858j01136q4507j23321j33647J48657J39242n5110J73060
$$ 294357 333362 274504 173368 88861 -34460 -168107 -19450 119792 64682 237742
12918B37742Q7999j82888j81705J6991L3239m6914N6343R1768j98444q9247K16200
$$ 237742 325741 142853 -38852 -21861 11378 -35536 20807 112575 -85869 -175116 41084
12907D1084K464j26364l6862O7572o4070j00429L21109L5435j29579K0514Q8955
$$ 41084 43548 -82816 -119678 -52106 -116176 -216605 104504 139939 10360 30874 119829
12896A19829M0439j05435j25182k14277K0712K19978J32041q9470j17106K73230
$$ 119829 160268 54833 -70349 -284626 -263914 -43936 88105 -1365 -118471 154759
12886A54759N7396N143m8983k20322k39741k51974P9585J11807J28769J36320
$$ 154759 212155 217298 168315 -52007 -291748 -543722 -464137 -352330 -223561 -87241
12876h7241l8072j48368j81979J71869K97250J06781r1458j43288j28063K9249
$$ -87241 -125313 -273681 -455660 -283791 13459 120240 28782 -114506 -242569 -213320
12866b13320j36074J5800J48588k7464O8694m5917k14006N8851k79567M08518
$$ -213320 -349394 -333594 -185006 -212470 -143776 -189693 -403699 -344848 -624415 -215897
12856b15897L30455J41664j36611O1344j81909k32949j60901Q2807K03862P4817
$$ -215897 114558 256222 119611 180955 -954 -233903 -394804 -311997 -108135 -33318
12846c3318k86384j46003K50525M9155J58358N6574j36083l22456J63427O589
$$ -33318 -319702 -465705 -215180 -166025 -7667 48907 -87176 -409632 -246205 -239616
12836b39616L9069J23582K19755R1739J6423j21358m5631m6017q7079j118m2598
$$ -239616 -200547 -76965 142790 234529 250952 129594 83963 37946 -49133 -50251 -92849
12825i2849m0632R2322J25977n5033j84192m233J59249L37235O0700l14126j53803
$$ -92849 -133481 -41159 84818 29785 -154407 -158640 609 337844 398544 84418 -69385
12814f9385j17709j48655K43956J15595l39898J11576J26954K08887R8572k46009
$$ -69385 -187094 -335749 -91793 23802 -316096 -204520 -77566 131321 229893 -16116
12804a6116k02577R8682Q4306J81540j32680k65059N9409J2820J01349K20434
$$ -16116 -218693 -120011 -35705 145835 13155 -251904 -192495 -179675 -78326 142108
12794A42108P8134J26718Q9520j75847l54974L34709Q4143j23324J57003j4198
$$ 142108 220242 346960 436480 260633 -94341 240368 324511 201187 358190 343992
12784C43992R0723p9052O3294j15609p2716j60638r2501M2288l6247M912L33919
$$ 343992 434715 355663 418957 303348 230632 69994 -22507 19781 -16466 -11554 322365
12773C22365N33925j61767j66799j34365l12387j04336j63669M884O5539j40120
$$ 322365 856290 694523 527724 393359 80972 -23364 -187033 -182149 -116610 -256730
12763b56730k1255m7065j12464J50524K09227Q2678J6889l087j3509J36480p561
$$ -256730 -277985 -325050 -437514 -286990 -77763 4915 21804 18717 5208 141688 134127
12752A34127l2766p1038K664N1020J24562l5283N3612J46328P0580k54793l37811
$$ 134127 101361 30323 32987 84007 208569 173286 226898 373226 443806 189013 -148798
12741a48798l4855k4597r8819O7513l5599R2298j74789K5002k25561m0870O183
$$ -148798 -183653 -208250 -307069 -239556 -275155 -182857 -357646 -332644 -558205 -599075 -592892
12730e92892Q0742J32642K9414n2236n8162J76573K9990J90949J31788r2486j05110
$$ -592892 -512150 -379508 -350094 -402330 -460492 -283919 -253929 -62980 68808 -23678 -128788
12719a28788N5100J17755r945q34J71966O5477Q6891n5620r2254k58233k22872
$$ -128788 -73688 44067 34122 33288 205254 270731 357622 302002 209748 -48485 -271357
12708b71357J11624l3827J13071l0700k43949j25144j7794k1299J02405K30288
$$ -271357 -159733 -193560 -80489 -111189 -355138 -480282 -498076 -519375 -416970 -186682
12698a86682J3456J35763K40617O3528k41484L6935N1819K63022j00849r9275
$$ -186682 -173226 -37463 203154 266682 25198 62133 113952 376974 276125 176850
12688A76850j20579k13452J49927M3803K0998J7168P1212k04283O378K1527J76213
$$ 176850 56271 -157181 -7254 36549 57547 74715 145927 -58356 -51978 -30451 145762
12677A45762Q6570o2372j68262q3498R9608R0918o5423M0295M8428P0411K50663
$$ 145762 232332 169960 1698 -81800 17808 108726 43303 83598 132026 202437 453100
12666D53100J9922l05092k37088j35930J00198J50082J4979J6060L44721r9535
$$ 453100 473022 167930 -69158 -205088 -104890 45192 60171 76231 420952 321417
12656C21417j68388k44584j13923Q6227q9514R4628J39766O1546k03205J16171
$$ 321417 153029 -91555 -205478 -119251 -208765 -114137 25629 87175 -116030 141
12646A41K17741j83333j18915O0673j4604J28608J08433r1222N2884p931p663
$$ 141 217882 34549 -84366 -23693 -38297 90311 198744 107522 160406 152475 144812
12635A44812J40500m5885r1099q3809k820M9212j60715l7756J05150j08718M9816
$$ 144812 285312 239427 148328 64519 61699 110911 -49804 -87560 17590 -91128 -41312
12624d1312M3442J47498P9402p0233q1973m3702J07206j9434r1680j34484k28609
$$ -41312 2130 149628 229030 158797 76824 33122 140328 120894 29214 -105270 -333879
12613c33879R1657R8552l357L50289j09396o3411j72352o4599J25391k73023j02659
$$ -333879 -242222 -143670 -147027 203262 93866 30455 -141897 -206496 -81105 -354128 -456787
12602d56787J95261J92273L1640j13995q4370m6124p782l4136O7603J54548J62790
$$ -456787 -261526 -69253 -37613 -151608 -235978 -282102 -289884 -324020 -256417 -101869 60921
12591F0921N2029k40770j04975J45572J78586Q2316K23520P2994j40897j52727
$$ 60921 112950 -127820 -232795 -87223 91363 173679 397199 470193 329296 176569
12581A76569K45501J09910k74630k21835J7723l4745k59080P9725O2313N2934
$$ 176569 422070 531980 257350 35515 53238 18493 -240587 -160862 -98549 -45615
12571d5615r117Q4836J3531J62837k8600k26897j13704Q2946N6248K45402M9769
$$ -45615 -54732 30104 43635 206472 177872 -49025 -162729 -79783 -23535 221867 271636
12560B71636l9975n9659k08895Q7800n190k08877K3897J93491O9531N9945j74348
$$ 271636 231661 172002 -36893 50907 45717 -163160 -139263 54228 123759 183704 9356
$$ [...]
##END NTUPLES=NMR SPECTRUM
##END=
