##TITLE=Analysis number 321722
Compound Code cc 50214
Book Reference 464/54/1
Project Code adrs
Chemist Name chrisr
##JCAMPDX= 6.0         $$ Bruker NMR JCAMP-DX V2.0
##DATA TYPE= NMR SPECTRUM
##DATA CLASS= NTUPLES
##ORIGIN= Bruker BioSpin GmbH
##OWNER= nmr
$$ XWIN-NMR		Version 3.5
$$ Wed Aug 23 11:47:55 2006 GMT Daylight Time (UT+1h)  MAYBRIDGE\nmr@NMR_250MHZ
##.OBSERVE FREQUENCY= 250.131544655141
##.OBSERVE NUCLEUS= ^1H
##.ACQUISITION MODE= SIMULTANEOUS (DQD)
##.ACQUISITION SCHEME= undefined
##.AVERAGES= 16
##.DIGITISER RES= 18
##SPECTROMETER/DATA SYSTEM= dpx250
##.PULSE SEQUENCE= zg30
##.SOLVENT NAME= DMSO
##.SHIFT REFERENCE= (INTERNAL, DMSO, 0, 16.522)
##AUDIT TRAIL= $$ (NUMBER, WHEN, WHO, WHERE, WHAT)
$$ ##TITLE= Audit trail, XWIN-NMR		Version 3.5
$$ ##JCAMPDX= 5.01
$$ ##ORIGIN= Bruker BioSpin GmbH
$$ ##OWNER= nmr
$$ C:\u/data/dgb/nmr/ADRS/1430/pdata/1/auditp.txt
$$ ##AUDIT TRAIL=  $$ (NUMBER, WHEN, WHO, WHERE, WHAT)
(   1,<2006-08-23 11:47:28.53 +100>,<MAYBRIDGE\nmr>,<NMR_250MHZ>,
      <created by zg, POWCHK disabled, PULCHK disabled
       configuration hash MD5:
       E2 DF 36 D8 04 B2 41 60 5A D7 A3 38 5A 4B D0 FE
       data hash MD5: 64K
       40 A4 E9 23 CC CF 8C FE C3 80 FC 7A 92 22 EA 81>)
(   2,<2006-08-23 11:47:43.50 +100>,<MAYBRIDGE\nmr>,<NMR_250MHZ>,
      <Start of raw data processing
       ef LB = 0.3 FT_mod = 6 PKNL = 1 SI = 32K 
       data hash MD5: 32K
       00 D2 A7 AA D0 90 10 9A FA 04 2D 37 0D 9D 57 4E>)
(   3,<2006-08-23 11:47:45.23 +100>,<MAYBRIDGE\nmr>,<NMR_250MHZ>,
      <apk 
       data hash MD5: 32K
       68 03 88 9E EC 1D 57 C2 A9 7C 53 E6 29 A4 12 2B>)
(   4,<2006-08-23 11:47:46.06 +100>,<MAYBRIDGE\nmr>,<NMR_250MHZ>,
      <abs ABSG = 5 
       data hash MD5: 32K
       80 C3 FC 5F 29 E8 C5 29 82 DB C4 4A 10 E8 6F 2D>)
$$ ##END=
$$ 
$$ hash MD5
$$ 5E 12 27 2E 05 EB 6C 0C 24 7F BB 3B 16 C8 77 C2
##$RELAX= 
##$RELAX= 
##$RELAX= 
##$RELAX= 
##$RELAX= 
##$RELAX= 
##$RELAX= 
$$ Bruker specific parameters
$$ --------------------------
##$DU= <C:\u>
##$EXPNO= 1430
##$NAME= <ADRS>
##$PROCNO= 1
##$TYPE= <nmr>
##$USER= <dgb>
##$AMP= (0..31)
100 100 100 100 100 100 100 100 100 100 100 100 100 100 100 100 100 100 
100 100 100 100 100 100 100 100 100 100 100 100 100 100 
##$AQSEQ= 0
##$AQ_mod= 3
##$AUNM= <au_zg>
##$AUTOPOS= <23 >
##$BF1= 250.13
##$BF2= 250.13
##$BF3= 250.13
##$BF4= 250.13
##$BF5= 500.13
##$BF6= 500.13
##$BF7= 500.13
##$BF8= 500.13
##$BYTORDA= 1
##$CFDGTYP= 0
##$CFRGTYP= 5
##$CHEMSTR= <none>
##$CNST= (0..31)
1 1 145 1 1 1 1 1 1 1 1 1 1 1 1 1 1 1 1 1 1 1 1 1 1 1 1 1 1 1 1 1 
##$CPDPRG= <>
##$CPDPRG1= <>
##$CPDPRG2= <>
##$CPDPRG3= <>
##$CPDPRG4= <mlev>
##$CPDPRG5= <mlev>
##$CPDPRG6= <mlev>
##$CPDPRG7= <mlev>
##$CPDPRG8= <mlev>
##$CPDPRGB= <>
##$CPDPRGT= <>
##$D= (0..31)
0 1 0 0 0 0 0 0 0 0.06 0 0 0 0 0 0 0.0002 0 0 0 0 0 0 0 0 0 0 0 0 0 0 
0 
##$DATE= 1156330047
##$DBL= (0..7)
120 120 120 120 120 120 120 120 
##$DBP= (0..7)
150 150 150 150 150 150 150 150 
##$DBP07= 0
##$DBPNAM0= <>
##$DBPNAM1= <>
$$ [...]
##$SUBNAM7= <"">
##$SUBNAM8= <"">
##$SUBNAM9= <"">
##$SW= 20.6930455092707
##$SWIBOX= (0..15)
0 0 3 0 0 0 0 0 0 0 0 0 0 0 0 0 
##$SW_h= 5175.983436853
##$TD= 65536
##$TD0= 1
##$TE= 296.16
##$TE2= 300
##$TE3= 300
##$TEG= 300
##$TL= (0..7)
0 120 120 120 120 120 120 120 
##$TP= (0..7)
150 150 150 150 150 150 150 150 
##$TP07= 0
##$TPNAME0= <>
##$TPNAME1= <>
##$TPNAME2= <>
##$TPNAME3= <>
##$TPNAME4= <>
##$TPNAME5= <>
##$TPNAME6= <>
##$TPNAME7= <>
##$TPOAL= (0..7)
0.5 0.5 0.5 0.5 0.5 0.5 0.5 0.5 
##$TPOFFS= (0..7)
0 0 0 0 0 0 0 0 
##$TUNHIN= 0
##$TUNHOUT= 0
##$TUNXOUT= 0
##$USERA1= <user>
##$USERA2= <user>
##$USERA3= <user>
##$USERA4= <user>
##$USERA5= <user>
##$V9= 5
##$VALIST= <valist>
##$VCLIST= <CCCCCCCCCCCCCCC>
##$VD= 0
##$VDLIST= <DDDDDDDDDDDDDDD>
##$VPLIST= <PPPPPPPPPPPPPPP>
##$VTLIST= <TTTTTTTTTTTTTTT>
##$WBST= 1024
##$WBSW= 4
##$XGAIN= (0..3)
0 0 0 0 
##$XL= 0
##$YL= 0
##$YMAX_a= 231234
##$YMIN_a= -591363
##$ZGOPTNS= <>
##$ZL1= 120
##$ZL2= 120
##$ZL3= 120
##$ZL4= 120
##$ABSF1= 16.522
##$ABSF2= -4.171173
##$ABSG= 5
##$ABSL= 3
##$ALPHA= 0
##$AQORDER= 0
##$ASSFAC= 0
##$ASSFACI= 0
##$ASSFACX= 0
##$ASSWID= 0
##$AUNMP= <proc_1d>
##$AZFE= 0.1
##$AZFW= 0.1
##$BCFW= 0
##$BC_mod= 0
##$BYTORDP= 0
##$COROFFS= 0
##$CY= 12.5
##$DATMOD= 1
##$DC= 0
##$DFILT= <>
##$DTYPP= 0
##$F1P= 14.0000005364418
##$F2P= -0.99999901652339
##$FCOR= 0.5
##$FTSIZE= 32768
##$FT_mod= 6
##$GAMMA= 0
##$GB= 0
##$INTBC= 1
##$INTSCL= 1
##$ISEN= 128
##$LB= 0.3
##$LEV0= 0
##$LPBIN= 0
##$MAXI= 10000
##$MC2= 0
##$MEAN= 0
##$ME_mod= 0
##$MI= 0
##$NCOEF= 0
##$NC_proc= -6
##$NLEV= 6
##$NOISF1= 0
##$NOISF2= 0
##$NSP= 0
##$NTH_PI= 0
##$NZP= 0
##$OFFSET= 16.522
##$PC= 1
##$PHC0= 138.1071
##$PHC1= 3.665537
##$PH_mod= 1
##$PKNL= yes
##$PPARMOD= 0
##$PSCAL= 4
##$PSIGN= 0
##$REVERSE= no
##$SF= 250.13
##$SI= 32768
##$SIGF1= 0
##$SIGF2= 0
##$SINO= 400
##$SIOLD= 32768
##$SREGLST= <1H.DMSO>
##$SSB= 0
##$STSI= 32768
##$STSR= 0
##$SW_p= 5175.98343685301
##$SYMM= 0
##$S_DEV= 0
##$TDeff= 65536
##$TDoff= 0
##$TI= <Analysis number 999999
Compound Code 99
Book Reference 9
Project Code 9>
##$TILT= no
##$TM1= 0
##$TM2= 0
##$TOPLEV= 0
##$USERP1= <user>
##$USERP2= <user>
##$USERP3= <user>
##$USERP4= <user>
##$USERP5= <user>
##$WDW= 1
##$XDIM= 32768
##$YMAX_p= 450483593
##$YMIN_p= -846946
$$ End of Bruker specific parameters
$$ ---------------------------------
##NTUPLES= NMR SPECTRUM
##VAR_NAME=  FREQUENCY,     SPECTRUM/REAL,   SPECTRUM/IMAG
##SYMBOL=    X,             R,               I
##VAR_TYPE=  INDEPENDENT,   DEPENDENT,       DEPENDENT
##VAR_FORM=  AFFN,          ASDF,            ASDF
##VAR_DIM=   32768,         32768,           32768
##UNITS=     HZ,            ARBITRARY UNITS, ARBITRARY UNITS
##FACTOR=    0.157963299565203, 1,           1
##FIRST=     4132.6476996994, 0,             0
##LAST=      -1043.33573715361, 0,           0
##MIN=       -1043.33573715361, -846946,     0
##MAX=       4132.6476996994, 450483593,     0
$$ Real data points
##PAGE= N=1
##DATA TABLE= (X++(R..R)), XYDATA
$$ [...]
23468 -247319 -309506 -281668 84302 122926 70365 -191543 -188263 -185343 -145157 -225393 -458595
23457 -458595 -449463 -299239 -240340 -130148 -164691 -44601 34039 -18265 -79046 -254042 -225187
23446 -225187 -153796 -80565 -48051 147563 116175 -133858 -236353 -365223 -120308 160408
23436 160408 258248 261975 346722 233965 43119 84587 -42323 -303582 -212046 8175 232314
23425 232314 230938 119292 -47289 -79974 -212440 -393879 -400879 -307199 -245831 -107109 35465
23414 35465 -47516 -119526 -230179 -167876 -210788 -24676 -45658 -126722 -229086 -242029 -221672
23403 -221672 -226764 -163314 -225794 -140443 -157911 -108201 -212342 -259977 -135364 -225401 -253259
23392 -253259 -281047 -475597 -542303 -426031 -291477 -229367 -159071 -214772 -167598 94158 -175911
23381 -175911 -332074 -100360 204477 289158 182685 -43019 -99563 -198060 -20205 0
23371 0 -152124 -211191 -338747 -270493 -305523 -328517 -217644 -216577 -274359 -214787 53007 122393
23359 122393 160252 34786 21041 224278 209468 221168 334110 400648 -9254 -215832
23349 -215832 -440963 -398380 -312440 -98324 179842 148408 180428 13971 -160803 -126047
23339 -126047 -116133 13425 239716 457191 498395 261791 191400 109497 -34740 -170472
23329 -170472 -94720 -66072 -209973 -276552 -159988 -2237 12147 -39556 -85996 -29489 26998
23318 26998 -117680 -215693 -248490 -141200 103677 311910 245610 293569 249171 42324 -35069
23307 -35069 -192334 -302925 -285383 -181963 46191 -64519 -203455 -112717 -85368 -131623
23297 -131623 -101536 -50018 -15008 -146694 -207567 -178548 -213279 -168905 -253753 -75132 78205
23286 78205 132517 199386 304986 208835 74561 -91506 -143877 -218025 64162 240119 115067
23275 115067 -27271 -174326 -483287 -251268 -7080 113230 -15504 -110093 6278 345191
23265 345191 340515 -131512 -365777 -73101 86512 61624 32866 38796 -60062 -106089 -213652
23254 -213652 -28874 64311 91534 11078 -82593 -30376 -70425 -70782 -64178 -181146 -206844 -77815
23242 -77815 56478 20149 16208 -203240 -284682 -143524 -146388 -203820 -2716 90857 37468
23231 37468 105294 -21916 -425906 -377509 -81260 75531 -134713 -397954 -542388 -447437
23221 -447437 -496946 -350245 -304855 -326517 -189977 -111747 -8018 -216558 -191447 -97112 -339111
23210 -339111 -487469 -408527 -324095 -288100 -264664 -124708 76023 9602 32327 -46572 -311344
23199 -311344 -577724 -278489 -100741 -225390 -312165 -329311 -111872 -57581 36871 196586
23189 196586 254818 -57479 -158521 -189534 -63855 56012 35658 -46165 67720 193954
23179 193954 -81733 -218712 -156519 -146161 -197744 -117003 -229487 -218270 -204463 -263648 -260610
23168 -260610 -235537 -232110 -47484 282392 160908 159194 90184 -77155 69802 284508 275756
23157 275756 103331 -65584 -61467 -108389 -34252 -4138 -101554 -104878 68368 78672 -148511
23146 -148511 -59827 73494 -178780 -30491 41431 -149896 -349482 -276543 -65202 -98987
23136 -98987 -245235 -436254 -254924 5761 49719 -794 -100374 -112324 57534 26025 -124207
23125 -124207 -322444 -493493 -460224 -439186 -469440 -285087 -297515 -192660 42901 52671 -160027
23114 -160027 -303728 -205918 -242543 -317028 -241264 2154 -49156 -278932 -410165 -233738
23104 -233738 -349448 -289013 -113966 -63254 80286 28921 -33893 -47139 13166 -28831 8057
23093 8057 -126643 -241167 -120011 29005 55814 -42692 -89720 -130932 -136907 127960 157264
23082 157264 42283 -55450 -253274 -180116 -32277 -48629 -119085 -133280 -167246 -63282 -93677
23071 -93677 -37427 91960 78227 88429 -79822 -14541 53489 15395 -85280 -59607 -35020
23060 -35020 -68212 -3246 161674 314750 342979 261839 165488 324824 123108 -141894 -324509
23049 -324509 67820 167586 -8528 -46677 -248267 -152396 -110301 232966 369830 264404
23039 264404 91199 48633 -65332 -90927 -23386 110033 141847 202785 185500 263872 426361
23028 426361 420291 117780 47025 52901 164864 162485 128545 102186 13007 -108992 -196891
23017 -196891 -146110 -119012 -57695 -120721 -300343 -218780 -118600 -117042 -41316 63572 31356
23006 31356 12548 -181492 -318402 -317325 -124982 -52400 -271712 -426555 -187317 -166029 -244478
22995 -244478 -293001 -269469 -89467 -11481 -19855 5390 5806 309634 472167 497127 226625
22984 226625 31333 113774 49813 -47902 -176520 -58743 -158139 -53723 126976 3140
22974 3140 -3137 108064 30180 -54504 -21464 -139505 -235580 -248317 -291183 -292545 -360656 -119436
22962 -119436 179032 -31191 -136995 -24049 31963 -25588 -66116 -132804 -192488 -210340 -106792
22951 -106792 -138789 -193018 -245409 -164590 -81527 43820 -74350 19136 113893 114710 86803
22940 86803 75031 -467 166099 134831 189941 43089 -9354 96214 49216 75711 43194
22929 43194 -167277 -196963 6958 150483 18740 -117983 2273 96227 48548 62797
22919 62797 -142565 -214762 -234585 -236265 -221744 -208953 91563 158396 26519 -105144 -114696
22908 -114696 -64876 119535 222564 83476 111224 101501 99964 -93789 -134405 -39899 -73561
22897 -73561 -104981 13261 94079 16105 -22987 -144340 -278506 -270596 -334525 -97567 -18231
22886 -18231 -185501 -255067 -42596 49362 76835 2463 -167440 -149655 -4946 -82017 -172012
22875 -172012 -249869 -322629 -290584 -186176 -127144 -187166 -190126 -132480 -99178 25142 114621
22864 114621 36480 -35198 -250763 -143952 -29455 -84780 -164245 -283299 -376166 -212301
22854 -212301 51631 273247 116185 -183423 -335100 -308925 -122345 -6640 -114285 -125640
22844 -125640 -40669 -212880 -168847 -34947 -6479 -216467 -219967 -277209 -48656 -91213 58047
22833 58047 -45042 -290840 -290690 -78113 -68367 26782 15393 76341 131005 -134381 -235208
22822 -235208 -118132 -105241 -193553 1787 65103 23107 -58298 -31024 23602 49818 -222209
22811 -222209 -204429 -222979 -47821 -102352 -115201 -264268 -229544 -10449 76945 139362 247071
22800 247071 66390 -101227 -362660 -265392 33537 136640 132158 332271 227353 108663
22790 108663 -6235 58424 -33919 -208649 -317380 -245751 -54357 109482 30210 -125372
22780 -125372 -179026 -19397 84844 153148 378662 439424 289248 118385 -58679 -84056
22770 -84056 -102519 -29179 -26225 153347 251739 147387 112665 -166565 -161748 -207542 -305881
22759 -305881 -369868 -251986 -134287 -124304 -77424 -53404 142652 221468 173784 -23331 -138713
22748 -138713 -64841 -57067 -198785 -128615 -226677 -153486 -89955 -70255 -236251 -136150 -105860
22737 -105860 -116575 -53704 158094 39553 128950 210985 213019 -5891 7335 111507 28440
22726 28440 -24870 -110621 -125237 -6074 60527 -43141 -54691 23347 -114341 -145715 -39330
22715 -39330 127656 201252 169102 265714 190643 88749 -1885 154273 30495 -39373 -5797
22704 -5797 -50698 93874 14601 -106638 -102086 -2566 87074 134711 127213 79571 -40469 137528
22692 137528 135843 7060 -143392 -92850 -7804 113719 362929 428122 150371 36122
22682 36122 33140 -15644 9442 86423 106822 100757 -2371 78213 214192 245320 73890
22671 73890 148956 198389 107903 -43832 85996 -137227 -334694 -268411 139496 191683 -199759
22660 -199759 -158876 -166124 -227437 -419000 -435308 -389865 -252680 -197845 -391967 -527660 -531444
22649 -531444 -416332 -233855 -108544 -7700 -80785 -203288 -101523 -38834 -200887 -304668
22639 -304668 -18726 30593 90422 -60755 -375731 -495079 -356872 -359548 -36751 116743
22629 116743 107159 58002 -38484 -90421 -179491 -197118 -272112 -380431 -390593 -433368 -244090
22618 -244090 -46943 -18213 -116288 -76555 85123 64045 -18462 -68443 -190417 -256178 -173459
22607 -173459 33461 -45837 -21370 -6447 86631 -48217 -114708 -81958 -39790 154185 191472
22596 191472 158184 -224463 -357365 -413364 -240058 42125 186256 368556 159960 -105919
22586 -105919 -160434 -158123 -309730 -559920 -421373 -417015 -413008 -363512 -314366 -495897 -438846
22575 -438846 -308431 -170257 -66883 -161998 -345118 -299489 -132041 -83157 52531 125098
22565 125098 48407 -39195 -30907 -145603 -342333 -507410 -496000 -224696 -138280 -179738 -76137
22554 -76137 -136652 -171870 -4290 -101017 -242069 -251642 -156313 7081 3910 151361 390010
22543 390010 432350 449262 626970 428079 294481 -16870 -57899 -70282 7032 269472
22533 269472 378730 280091 119503 137410 209182 232163 223496 223143 328791 144178 -47030
22522 -47030 156858 264896 142855 145311 215630 48357 -109699 -34292 36910 -121717 -201924
22511 -201924 -67220 43414 9093 127223 81717 53325 -26956 -44311 -16709 -21912 -57792
22500 -57792 51033 123575 7314 -170547 -225927 -231180 -273481 -155622 -1254 70176 23033
22489 23033 -49888 109388 321933 -20760 -87290 -84265 -8034 120545 293267 109013 17669
22478 17669 201144 147581 25454 -128213 -135748 -242691 -258014 -179938 -116263 -62739 99771
22467 99771 -79050 -138728 50107 26198 -28809 16088 11169 -25500 -171357 -130800 2942
22456 2942 -295038 -607686 -545673 -367464 -255075 -368056 -307076 -292135 -205867 -161682 -342994
22445 -342994 -249646 -141148 -175548 -142626 7403 9937 -297996 -388354 -235682 -250838 -172090
22434 -172090 -132874 -196471 -164999 117985 118254 160596 -33643 -184010 -146797 -9152 74027
22423 74027 -38252 -147052 63333 125033 200776 116282 84543 45050 -58059 48841 173912
22412 173912 79826 -34284 -119499 22222 41026 72978 180177 75170 -97567 -164369
22402 -164369 -210457 -230586 -257130 -203022 -404567 -456717 -371050 -223826 -197149 -98029 -65383
22391 -65383 -159552 -221208 -122496 -27931 108451 154806 -94817 -139074 -8889 70291 143146
22380 143146 109337 170200 126804 -55055 -109403 -40194 80447 120692 246282 392628 224505
22369 224505 -84562 -195912 -183266 -260381 -275502 -302033 -130144 -39992 -222136 -360342
22359 -360342 -276812 -405076 -313199 -91594 -211126 -200677 -125556 28465 32666 -62063 -85022
22348 -85022 -8833 122119 26519 -122202 -303783 -125231 140976 75328 22696 45907 74937
22337 74937 4253 -74329 -82244 -128603 -444808 -382509 -147375 -8348 101681 33757 -98475
22326 -98475 -303302 -208155 -91970 -118849 -216488 -130186 86221 168049 14301 -89860 -315115
22315 -315115 -368448 -33471 145739 -141540 -283695 -87784 -8615 105462 38399 230146
22305 230146 142732 -12471 218286 143356 148271 267299 261061 213665 64063 120306 222978
22294 222978 -28396 -315271 -227468 -80530 217262 229486 143483 264008 65932 -143062
22284 -143062 -165460 -92097 -33559 -87304 -222740 -352718 -229396 73131 180858 57623
22274 57623 127575 173629 51067 -194634 -416273 -280729 -45737 23424 -8643 -83905 -76592
22263 -76592 -122591 115348 319541 354356 448788 265130 35665 -67465 -175434 -374413
22253 -374413 -335356 -128345 -169379 -29762 -150170 -150307 1921 -59378 -198866 -262813 -284173
22242 -284173 -106416 217567 218649 58888 -163500 128130 170065 -72350 32606 -16380
22232 -16380 -192492 23326 135205 32413 209426 375801 403094 104979 -101218 -202337
22222 -202337 -17893 145665 265428 120239 -180335 -148173 104042 63106 -200319 -449598
22212 -449598 -408507 -356015 -192503 -300706 -342816 -337287 -187881 -155806 -312209 -249889 -49846
22201 -49846 -113429 -83217 -325683 -271634 -281648 -330439 -357157 -153530 277546 271193 185035
22190 185035 -51955 -287288 -459367 -266570 -50517 -64668 -83220 -47774 53456 -120651
22180 -120651 -146972 -206477 -350289 -389712 -161431 -134250 -218876 -289241 -218973 -163496 -173737
22169 -173737 -281628 -324604 -374755 -104154 207299 341684 123168 -25628 -117940 -111000
22159 -111000 -118797 -220411 -219734 -49921 149500 53422 -74491 -67505 23972 71217 -134168
22148 -134168 -170793 -8146 37014 -138133 -166490 60268 88563 -62048 -132525 14916
22138 14916 -70236 -159926 -256090 -103045 -28266 140548 13654 27105 19716 95755 231884
22127 231884 150097 66277 -157012 -132078 -47605 -31435 -52089 -177573 -166811 -188284 -136246
22116 -136246 -276389 -266317 -231248 -85646 40691 44083 -173347 -216025 -57642 -54710 -183482
22105 -183482 -117129 -92611 -9693 16417 -164418 35571 38274 -114738 -118646 -144953 -306710
22094 -306710 -168526 90275 379360 616475 677427 489931 272231 105242 78111 -77761
22084 -77761 -253011 -293843 -287214 -287873 -153580 13747 79196 216289 248961 343094 214701
22073 214701 -78242 98000 32757 -24527 -135058 80068 249793 325033 354061 425868
22063 425868 468233 294133 -28059 -187846 -117892 19050 265322 185580 105192 81870
22053 81870 -14394 -87328 -107088 -134455 -217831 -197496 -78464 -53258 -126743 -20806 45362
22042 45362 15889 -89825 -145891 -187822 3497 205364 154931 -102404 -269686 -328525 -177370
22031 -177370 -181637 -48518 152362 255339 209209 41302 -104485 -102785 59647 57768 -147922
22020 -147922 -313154 -183755 -188106 -37200 16295 -39149 -57479 -86740 -130544 -35523 -2294
22009 -2294 -7603 -133072 -154677 -67966 -34045 -120617 -183779 -169597 126259 265537 243025
21998 243025 289273 336572 101888 -179223 -365467 -150871 197019 303339 59259 -104278
21988 -104278 16794 165696 124131 206572 182774 137540 97406 63495 -76046 -25874 -146061
21977 -146061 -155569 32054 144590 183257 66343 -51071 -33863 6889 -206497 -214022 -15561
21966 -15561 141173 211229 133164 -221545 -211295 -53119 -265290 -331431 -156176 -29727
21956 -29727 100522 157419 172292 233927 81301 -105852 -336164 -282771 -183592 33188 122343
21945 122343 35249 -79516 28712 43736 -220578 -294167 -90820 -123513 -178135 4113
21935 4113 12583 14291 -48643 -79576 -194885 -340238 -306238 -443555 -403017 -214525 -49343
21924 -49343 78457 -60203 14613 39784 43412 -93982 -293600 -310379 -328419 -321846 -188199
21913 -188199 -132741 -128039 -122283 -111016 -113380 -30416 -57286 -4427 -182869 -405530 -345517 -394304
21901 -394304 -160539 134349 300074 240294 30853 -43352 -239888 -92150 108955 229336
21891 229336 -1803 -173972 -33845 195191 34992 -100546 -98653 -154775 -176120 -170631 -303487
21880 -303487 -427465 -467907 -301216 -241638 -349041 -217978 -47275 28344 -88195 -45283
21870 -45283 -138878 -335634 -365523 -289577 -359944 -276765 -180651 -10700 -27028 -76689 -65794
21859 -65794 -159654 -18634 199628 133793 -2329 -15578 20517 137894 342846 345049 132046
21848 132046 153617 185221 -14189 9418 77234 104657 17828 45059 13796 -60709 -43454
21837 -43454 -60570 -220861 -8710 258236 35915 -58380 -55433 24843 201676 336800 361447
21826 361447 456204 484165 461430 313727 64581 -186577 -198715 124160 -80015 -192812
21816 -192812 -221379 -302258 -151902 32826 310946 198590 30242 144353 227483 78148
21806 78148 60812 -154673 -327291 -387692 -227272 -43345 -95870 -282892 -400043 -223385
21796 -223385 -75685 -167271 -104715 51751 2189 -1370 -39446 64938 -93757 -174539 -140541
21785 -140541 -26337 19580 23708 -71005 -240965 -191238 -19271 88664 -52195 -113167 -373434
21774 -373434 -515505 -423625 -314109 -215915 -156598 -334300 -283157 -67946 -261028 -239280
21764 -239280 -61019 30384 -98183 -129623 162173 146072 761 -19285 -63296 38356
21754 38356 -156036 -224837 -159933 -102390 -42202 146974 -66325 -240435 -257483 -150263 -202750
21743 -202750 -236744 -430512 -396738 -84072 -16851 17811 15283 151086 278635 119172 -165207
21732 -165207 -180288 -207942 -255869 -148113 97314 229645 176928 30160 64730 -8995 -28261
21721 -28261 -118509 -159505 -237842 -404837 -443837 -321365 -344347 -296289 -302820 -426933 -461106
21710 -461106 -448025 -301386 -64227 -38912 -68911 -3190 -13904 -148044 -226612 -205977 -121277
21699 -121277 -40921 38761 21775 -106028 -137467 -82083 -65217 -230667 -291112 -117028 -68217
21688 -68217 249482 446826 404845 153815 -205983 -129168 -116451 -327582 -327393 -420182 -418322
21677 -418322 -197531 -201909 -180267 -236161 -217583 -332650 -167294 -145925 -323567 -270004 -217685
21666 -217685 -316212 -401927 -584141 -635605 -504100 -410287 -271860 -43505 -104227 -76085 -24349
21655 -24349 6114 -46063 -225503 -263222 -81590 -204897 -312589 -263560 -317459 -239544 -87833
21644 -87833 -143790 -190829 -48492 21612 -94100 -138300 101037 240457 216463 132411 81198
21633 81198 -63739 -270955 -88845 121329 64977 -5742 -91773 -208906 -33270 41106
21623 41106 55784 27508 -150158 -13061 175499 173808 -161331 -420137 -403645 -252865 -57468
21612 -57468 28127 54761 -17065 26278 -98711 -259462 -112144 71229 118244 118807 -92014
21601 -92014 -217781 -139606 -133147 -4951 61992 -146397 -185923 -188310 76257 -190972 -405386
21590 -405386 -313641 -168862 -141776 -86461 -36868 -3438 -81253 -146161 -75615 -283213 -340894
21579 -340894 -395760 -306477 -242386 -230722 -100007 -63460 -169615 -164911 -38677 243810 247814
21568 247814 88960 -13425 -135295 -115122 -71910 -4101 -10894 58720 103195 227610 61560
21557 61560 -98166 -163091 -151462 -86175 -159571 -57575 -52413 -136949 -93819 -182982 -185422 -153876
21545 -153876 -101962 -51136 -3004 -7366 -147208 -177081 -199043 -207444 -271467 -291184 -269710 -312458
21533 -312458 -343667 -313549 -125307 -70946 -260890 -324584 -302140 -341780 -373330 -236216 169489
21522 169489 186907 3161 -241040 -452079 -406194 -315704 -246179 -266372 -273580 -75960 182475
21511 182475 13963 -69127 81411 211186 198104 -26500 -285559 -314062 -30895 107209
21501 107209 -12995 -315890 -390117 -461099 -442866 -502522 -304479 -159354 -232066 -83333
21491 -83333 1009 80328 -26590 -42854 161705 261567 66929 -147266 -106851 -109065 -235793
21480 -235793 -161746 -134089 -223672 -394621 -213103 -151155 -178359 -238427 79610 241116 -73686
21469 -73686 -236068 -98194 -88567 -214684 -141780 65288 86303 2143 -281699 -111502 120564
21458 120564 73606 36732 16502 74703 93896 189096 279898 122252 -122558 -324733 -303818
21447 -303818 -60738 -70195 -47372 -235519 -12056 31541 -240178 -456634 -301177 -65295
21437 -65295 65613 176542 63332 -206001 -344581 -309978 -107369 95672 47918 -40163
21427 -40163 -138610 -121769 -241903 -201640 42677 83810 136272 146952 -41155 -274113 -171691
21416 -171691 46749 -53227 -21919 89264 -93572 -231460 -118405 -79275 -75464 184928
21406 184928 168505 27671 62531 147049 45073 -25886 -217322 -207983 -68058 -99626 58153
21395 58153 16695 4356 -103977 65871 102144 -225162 -292586 -273669 -80379 4987 -96631
21384 -96631 -49529 -89253 -312682 -368131 -288022 -212166 -155756 -107353 -99644 -77551 -49282 -73652
21372 -73652 -166741 -378327 -314662 -162847 -1786 209074 250107 33824 69912 -48349
21362 -48349 -242427 -400316 -327024 -16339 345513 107858 -209803 -364025 -400937 -375512
21352 -375512 -192144 -42346 -165539 -215221 -238626 -156340 -58879 -172684 -294038 -200302
21342 -200302 57905 295638 430336 585488 567514 441657 368367 310229 272633 279135 129611
21331 129611 33579 -178044 -282330 -197970 -206622 -374111 -390481 -303447 -111929 172594 285120
21320 285120 78698 -106354 -38554 2231 70249 19838 -230038 -274353 -177721 -128051 -81563
21309 -81563 -91531 -33275 -39770 -36007 -99116 -180611 -71946 -49487 -129755 -33778 -156082 -306590
21297 -306590 -49741 149592 26446 43514 -71459 120632 317000 338368 205281 -6353
21287 -6353 -62940 257811 259564 220032 138715 90442 21375 -128152 -124323 -55180 -40145 -160918
21275 -160918 -170356 -42993 -61419 -122882 12575 -110756 -333747 -232715 -169172 -193463 -126310
21264 -126310 -13980 -88814 -216151 -234813 -143021 94482 229838 59504 71085 153376
21254 153376 -28543 -105640 -24389 -36181 -106 -52889 -33280 -46685 -12130 64898 65269 314825
21242 314825 255621 -78808 -47352 -151515 -335765 -399323 -403391 -207049 56575 231022
21232 231022 247315 124283 169361 13362 -140043 -113543 -129077 -109164 24724 -37770 -92148
21221 -92148 -157559 -296555 -233133 -22357 170383 206127 63178 73091 -100955 62649 194507
21210 194507 -90647 -446065 -470283 -357454 -113653 -148508 -254637 -128028 70587 30960
21200 30960 108845 128989 152473 268668 320441 112820 47487 145815 -79713 -231448 -126865
21189 -126865 -231587 -227736 -227810 -110109 -92567 -80905 91323 140791 77662 42472 47885 157886
21177 157886 46238 168377 172310 -93974 -117445 -17943 18561 87489 110002 98584 129682
21166 129682 245594 221994 175343 144376 312879 241361 222192 54937 -1001 5576 105921
21155 105921 75059 80069 24775 33594 105684 50431 310 25884 -155813 -255419 95936
21144 95936 124380 210650 3820 -158514 -94409 -130932 -305243 -149544 -87983 165564 156361
21133 156361 -25276 -82791 -193486 -59824 -122110 -135247 -122286 -74788 176319 147308 -90452
21122 -90452 -145361 -152333 -108214 105177 146519 -75861 -119994 -60338 -57283 15956 16105 40557
21110 40557 22103 117956 137739 114601 219814 260440 7555 187062 169927 -60443 -42555
21099 -42555 40354 69376 324077 276323 288079 198039 -85415 -163972 -158689 -4406 71470
21088 71470 210033 183455 214673 85722 -91400 -50244 -68287 -40184 117296 304317 290469
21077 290469 124668 159178 136167 41477 -249940 -373275 -215208 -250893 -309839 -15971
21067 -15971 3687 21545 85647 234905 295669 195159 201739 70155 -66311 -221459 -57845
21056 -57845 286740 304896 326393 396152 228033 -11851 -103969 -105321 -19741 225376 175735
21045 175735 122710 134021 34225 -134200 -217340 -141530 -128372 -76923 58754 -37923 10753
21034 10753 -11623 -24007 -67014 -54107 -46826 -56567 -197385 -249366 -173547 -156480 -89915 -199247
21022 -199247 28054 164720 101618 -101635 -250325 -268632 -34374 94287 123758 24828
21012 24828 -19626 -13409 199530 152167 94934 224250 199307 -135740 -257489 -59175 198318
21001 198318 -16350 -346245 -303692 -120764 -45790 -63599 -255723 -411736 -439281 -280315
20991 -280315 -320044 -250440 -118197 -136193 -88595 16696 138909 132730 72484 -5190 39748
20980 39748 262129 -13704 -298142 -146265 -222774 -174890 91738 238352 88702 -150408
20970 -150408 -17224 -69996 -135883 -56357 31031 -161050 -181046 -6002 45991 -123904 25831
20959 25831 -89078 -99657 -215038 -163215 -213447 -218246 -240380 -187738 -103928 -66933 -110279
20948 -110279 -131747 38496 331750 -60686 -222289 -175918 -185526 -167456 -48061 -47523 80951
20937 80951 84115 -33491 119474 267131 200240 94789 71876 -24132 10217 15719 -21274
20926 -21274 -75244 -138519 -349748 -337250 -125590 23487 -78404 109257 406865 359382
20916 359382 216095 202225 19222 -172498 -97463 -60584 -103590 -46027 -8579 150010 152493
20905 152493 171180 308002 209601 -111218 -8726 11639 -8945 -12539 -132193 -128528 -145375
20894 -145375 -207537 -74118 61420 302037 334871 256609 201106 190678 220712 147585 212179
20883 212179 73825 8648 -160057 -285363 -388726 -213360 -47889 111513 243569 197544
20873 197544 53597 33557 -34270 -53806 -38650 198089 269033 125250 -15353 112918
20863 112918 262127 414130 357709 247897 119888 168322 125731 -139714 -167070 -77466
20853 -77466 -259237 -290852 -200080 -77352 40754 -11285 -58509 14367 -163687 -167431 27063
20842 27063 86932 -141582 -135388 -253894 -164033 -69728 -42815 -272808 -400860 -341556 -321526
20831 -321526 -171121 -112510 -11748 -148818 -200092 -137581 -63130 2867 79373 155192 103865
20820 103865 93980 180957 -121910 38597 39950 102734 38590 263094 473313 465980 495080
20809 495080 314919 209964 185912 280284 387947 333452 81677 83670 96406 4380 63746
20798 63746 184999 17131 -24017 -172051 -132685 -60149 -109753 -155856 -105868 23872 20385
20787 20385 98040 77965 -161356 -216344 -177179 -202376 -150034 -144656 -156967 -59763 -127655 -281626
20775 -281626 -391209 -383419 -330248 -212853 -167016 21471 195094 173237 364734 416647 284004
20764 284004 62957 96201 37043 -97133 36291 71465 -133534 -260516 -91153 51091
20754 51091 97505 -61927 -168117 -227095 -261573 -234337 -179564 -127602 -136021 -20431 -159784
20743 -159784 -280988 -71343 -174004 -276988 -44520 30268 -53924 -35599 66624 -7908
20733 -7908 -115608 -92878 163303 110214 -66034 -115983 -167957 -247697 -385482 -470026 -290341
20722 -290341 -178900 -450370 -448469 -308012 -271099 -148535 -100940 -125916 -121746 -32220 -42290
20711 -42290 55596 11736 165410 286939 291085 160934 226863 219094 153118 225787 63922
20700 63922 -68484 -147933 -244386 -195652 -50418 63190 288239 215092 345540 356818 297757
20689 297757 44442 27051 57845 48904 93436 230980 215508 56995 3966 90029 179731
20678 179731 229706 249934 216189 -8554 46010 59080 44509 -146014 -174500 -180829 -33152
20667 -33152 -35181 -84200 -41148 -65255 1410 52887 121209 259902 111483 -96466 19468
20656 19468 63821 -156924 -10025 81523 142079 286408 374270 326361 135599 245254 309070
20645 309070 171324 140909 321633 266031 196245 115465 -52228 -99243 -135119 -143899 -82572
20634 -82572 -52811 -6954 17407 64620 68949 46788 84446 151762 73902 -16503 -136073 -55083
20622 -55083 -239202 -215107 -49601 9536 -31873 92912 44673 10380 64356 98404 -47139
20611 -47139 -27369 75550 212550 120836 183714 150015 -41980 67380 166893 152764 337337
20600 337337 440887 850340 1324544 1627625 2089624 2216652 2073236 1939277 1991530 1810435
20590 1810435 1476936 1542655 1256153 895273 672627 687230 597171 396511 330862 342400
20580 342400 220489 49684 -54213 25929 189377 209925 235046 174107 137863 192821 305217
20569 305217 377680 115614 -16448 -193979 -247055 -202642 -53164 163478 174770 -75727
20559 -75727 -98503 -97915 -115684 -80183 -71159 118060 216028 285955 213227 -14063 -204946 -292639
20547 -292639 -137797 64707 129382 69640 78638 119455 187942 216516 250688 98966 149772
20536 149772 156191 311211 193812 73228 93653 77841 164501 248097 397060 538537 679505
20525 679505 513726 453318 358432 421859 593003 579236 429652 220187 196439 222234 101410
20514 101410 245893 502852 527144 194061 29472 6794 296604 315718 68274 -56887
20504 -56887 -115424 -261349 -255422 -218497 -72735 -182915 -191704 -205843 -467690 -481704 -199770
20493 -199770 -104244 -7898 96100 -74860 -138146 -63539 -54116 -81319 152216 321476 266795
20482 266795 305097 140253 -213382 -337120 -17629 -110379 -205657 -1542 -102322 10681
20472 10681 92115 139507 149209 95314 141770 126725 149244 123708 7572 -262557 -157586
20461 -157586 -70759 -78175 162776 149840 185847 2791 -59807 -73193 116175 125456 368798
20450 368798 403308 374482 252738 266463 218606 38529 175960 152431 -11390 -117123
20440 -117123 -142140 -84412 94188 54010 73507 15224 74853 134521 422776 281504 122051
20429 122051 -84681 -322877 -425955 -301633 -124221 -93420 -245924 6232 18056 -51514
20419 -51514 -118209 -39229 101089 -167639 -253397 -6813 -25581 -209010 -314645 -243150 -318333
20408 -318333 -416378 -95180 127134 279483 85499 96671 214196 364262 226469 -132155
20398 -132155 -140799 -81703 -44265 92485 237929 132872 -18595 58420 156577 446709 443457
20387 443457 437972 143804 -170981 -266280 -161173 146916 171396 -67216 -75053 -80046 -220427
20376 -220427 81285 373723 272009 30528 -130214 -29721 81302 17864 -99083 -68077
20366 -68077 26995 171033 375088 246102 185757 99590 102320 -26328 -131252 -297946 -289992
20355 -289992 -211158 -52098 164988 -31957 31992 178954 14805 -134681 -11160 -49340
20345 -49340 11962 -67173 -171094 -204473 -117604 -174904 -167202 59718 211401 268015 241157
20334 241157 219639 193527 -82028 -213125 -272384 -267077 -288699 -259639 -120882 -102900 -210727
20323 -210727 -228516 -238201 -174159 -45968 -176572 -255356 -53595 122737 53996 36434 55910
20312 55910 -104003 -108468 -133838 -2745 89043 127580 290312 208217 81558 26002 52475
20301 52475 -19497 2304 150368 165679 277083 280682 190234 123079 -171459 -177517 113331
20290 113331 267097 164959 191152 208871 24787 -2935 -2060 89452 -29147 -13743 178048
20279 178048 45967 122875 379569 254753 297680 304280 402488 124059 196802 298309 224444
20268 224444 213775 149250 216041 426503 447379 297011 263438 157105 229776 334770 258145
20257 258145 272372 220558 61789 28984 -7625 5693 174452 172043 -96532 -48510 -105336
20246 -105336 -176609 -182904 -203745 -300812 -398098 -299747 -143256 -267446 -265319 -109061 -69105
20235 -69105 -108500 -103413 -76305 -207992 -236631 -116585 -270209 -34739 -126149 -235192 -161143
20224 -161143 33249 74051 164221 156152 133936 -12480 -61246 -52984 -285785 -475959 -451384
20213 -451384 -156318 25931 107621 75064 99161 -3177 -102829 -94941 -201411 -180339 -217516
20202 -217516 -78952 40127 57976 14409 -209137 -319464 -314418 -198799 14665 -177541
20192 -177541 -36776 139381 346861 242912 -101464 -254856 -278845 -267600 -267624 -367758 -224603
20181 -224603 -65550 -104479 -116049 -202675 -303304 -277942 -288799 -347182 -168443 75485 97006
20170 97006 156339 238287 190714 284117 296969 189581 23270 127054 131487 254531 287948
20159 287948 208299 284657 444953 596103 554135 614586 830148 939738 785917 549129
20149 549129 594812 837333 833034 972353 1215538 1170747 967082 1071110 1215039 1133938
20139 1133938 1148248 1140979 1092048 989954 1035917 1129546 1365479 1371448 1301146 1146522 1006371
20128 1006371 958318 841386 828982 805571 891011 891252 848476 703226 701850 690091 767087
20117 767087 889382 1046086 1305871 1540728 1684167 1785312 1665575 1598892 1581637 1468337
20107 1468337 1322156 1237815 1203458 1204151 1289727 1438924 1475729 1396644 1191670 1109678 1169922
20096 1169922 1003384 1007872 1208934 1024769 838633 735065 602000 405759 250012 252088
20086 252088 515952 490008 561032 411174 174940 -79482 -118008 -87726 -73517 123735
20076 123735 313700 259421 217344 340964 308710 77686 -1919 -68335 -122580 -106455 -144908
20065 -144908 -17157 182761 371518 252359 279630 318766 280702 144694 219915 253945
20055 253945 294758 259972 -21312 -168167 26819 251253 342568 99082 -181795 -105312
20045 -105312 142177 231807 98702 193722 408402 278422 86891 30598 -61371 -48347
20035 -48347 46362 122688 200973 71383 127720 335725 282765 202270 19309 53929 -125276
20024 -125276 -205344 -273999 -301665 -244695 -89772 78742 136677 -23233 -57594 172077 187250
20013 187250 46348 -286080 -396021 -242034 -152308 -370441 -267995 19101 -46428 -73435
20003 -73435 -91564 19631 29534 -6781 -71602 55337 108852 156238 173579 159014 -110602
19992 -110602 -82194 -17148 -102464 40358 416858 383049 63016 56016 82856 -42983 -254170
19981 -254170 -383901 -186068 24134 59657 27134 -19793 -33533 -58255 163013 258919 197463
19970 197463 5671 -125621 -49724 34119 -23685 -45047 40549 99750 284411 348293 405792
19959 405792 419536 279932 305615 275107 166103 152267 179353 171436 203651 261928 110022
19948 110022 27231 -153460 -256869 -138433 -98033 -92777 -105957 -117748 118555 257549 136396
19937 136396 -2265 -52036 -76925 -218313 -382462 -516839 -230407 160582 261804 135643
19927 135643 -32181 19994 124083 -38001 53920 -17968 -42478 252787 234433 10838
19917 10838 -154348 37753 235044 243729 312662 215829 83722 47957 14219 -220138 -156229
19906 -156229 -128282 136661 281310 279458 288475 294040 299769 94808 31972 -93856 -32973
19895 -32973 114030 252798 267707 434988 326310 151138 29031 17800 76816 131537
19885 131537 2338 88863 186917 198428 126605 279799 593189 559412 619820 569183 448311
19874 448311 170744 223391 193892 218502 15536 110658 357498 405497 294496 207527 189899
19863 189899 138193 205740 276249 110641 -58612 140553 125049 82754 121366 165375 262907
19852 262907 224369 68211 156431 158657 103720 352531 590586 483833 347365 277547 251436
19841 251436 293162 342946 278168 243782 470898 427147 407899 409880 281407 247252 296365
19830 296365 389505 370097 352517 350404 332978 353167 515800 584760 656273 754560 662935
19819 662935 462831 295169 403658 331577 278458 320646 379444 270863 -65170 48988
19809 48988 278601 306856 250873 428438 510747 520023 383028 432743 553538 660932 738302
19798 738302 865985 870785 707192 542048 486779 478152 532606 521552 330635 246970 152492
19787 152492 244942 327957 418500 384268 234231 332296 267875 234743 286303 285187 213763
19776 213763 132885 341191 603304 432138 387226 579114 617444 434419 472773 367215
19766 367215 300776 353387 320691 257415 272450 395488 510935 492267 265862 183043 111442
19755 111442 -16613 36491 156736 201348 358127 314810 406555 456927 323311 236459 371958
19744 371958 451233 432028 448598 590216 500574 221442 155772 448146 798238 713723 481583
19733 481583 687499 745211 682543 613324 674382 736038 715712 474879 505664 465771 577766
19722 577766 527245 552362 507469 666842 861240 649599 294878 64009 154365 419872
19712 419872 640772 828715 905720 738141 460812 487070 636155 678841 705854 613293
19702 613293 572270 489632 417193 511893 518084 599355 736883 786348 896333 824970 831754
19691 831754 776685 758189 688675 761661 750136 712303 893195 1090291 1208925 1177311 1087619
19680 1087619 1170522 1131434 1137234 1143814 1106656 1169753 1225970 1178322 1325104 1366998 1288801
19669 1288801 1269332 1316779 1373061 1227982 1203674 1156600 1036528 816462 983857 933091
19659 933091 866681 907328 1197037 1400904 1197561 1210456 1218013 1223435 1149767 1100407 1162797
19648 1162797 1235043 1334009 1419090 1447562 1386755 1417373 1171575 1116860 1198995 1296420 1513006
19637 1513006 1489610 1499701 1777555 1855514 1796581 1918860 1978509 2055329 2116059 2264733 2315382
19626 2315382 2436963 2695055 2774527 3013171 3141236 3243290 3553632 3863086 3852741 3911399
19616 3911399 3977431 4174175 4330670 4582192 4810868 5062262 5350647 5763893 6353271 6888829
19606 6888829 7483414 7834268 8139904 8460465 8935081 9537905 10460753 10997677 11866225
19597 11866225 12796484 13866859 15169546 17064611 19417452 22283444 26022654 31365124
19589 31365124 39492456 52912388 73572217 96299492 111777907 122993473 138210175
19582 138210175 160341074 179947662 181814296 173756482 169225922 169914911 170310366 166339573
19574 166339573 168069254 177651837 182855463 184091922 190730734 206222779 219993651 214768457
19566 214768457 199620600 188775371 182695665 174061501 155516656 134950987 120780306
19559 120780306 113190788 110577398 114069596 126798476 145089245 157990991 164929637
19552 164929637 175671079 195063755 215944027 219471112 209102773 201475837 200443889
19545 200443889 200396511 194754467 191856908 198667917 203632367 203726755 207809218 220459520
19537 220459520 234528776 231716900 215259989 201111057 192238710 182309941 162545679
19530 162545679 137773575 117704757 103472581 92283838 82279442 73616004 66343795
19523 66343795 60504965 55936793 52007504 48525759 45759889 43579156 41664084 39864818
19515 39864818 38380517 37038607 35913002 34917576 33701431 32386759 31332705 30353840
19507 30353840 29260427 28095581 27082636 26195683 25373851 24607056 23960609 23619272 23100228
19498 23100228 22289669 21479289 20700942 20159200 19590117 19019948 18373500 17624123 17103374
19489 17103374 16547315 15817799 15200684 14720735 14192230 13751436 13440908 13189648 12827859
19480 12827859 12221706 11627908 11417096 11140059 10729068 10425481 10347318 10105607 9710511
19471 9710511 9783440 9810633 9570553 9308501 8956504 8652956 8581191 8487611 8433884 8098799
19461 8098799 7797475 7527104 7186055 7226696 7217596 7281269 7154551 7059861 6894963 6700392
19451 6700392 6627401 6458892 6181331 5850569 5512514 5453778 5537732 5561140 5454123 5404757
19441 5404757 5456787 5160728 4954668 4752729 4514284 4413168 4408549 4277932 4021115 4004688
19431 4004688 4022539 4052725 4041748 3857653 3699915 3354423 3237292 3418447 3560618 3391691
19421 3391691 3322098 3294943 3400757 3341585 3048939 3064594 3046742 3271875 3067825 2857402
19411 2857402 2708340 2738742 2678493 2720407 2754054 2546871 2668473 2816146 2591718 2388662
19401 2388662 2188527 2032905 2261248 2387147 2478557 2502363 2610865 2658960 2519405 2225560
19391 2225560 1785404 1597464 1583220 1697172 1685462 1672401 1507217 1334630 1344996 1436470
19381 1436470 1548695 1485249 1385646 1191533 1511060 1624463 1597026 1705547 1742056 1463691
19371 1463691 1341886 1479314 1226277 1112094 1270970 1345958 1314544 1251304 1152321 1139626
19361 1139626 1162884 1155865 1218026 945486 718351 787517 827410 734509 944379 1134412 1241042
19350 1241042 1059646 948558 961078 989525 1127033 1052741 870760 681918 777328 957224
19340 957224 991618 882196 898213 879151 774295 642961 905740 1072436 954911 938778
19330 938778 764694 933988 1163645 1142954 891936 743060 768069 786658 607542 552704
19320 552704 570514 689788 678705 497210 545220 598379 678596 529891 584855 484495 361252
19309 361252 521361 449120 353859 356977 387040 682290 700200 627376 569672 474478 321138
19298 321138 136560 156324 367839 256586 390178 617154 577947 525317 639544 759849
19288 759849 703258 542192 431191 129675 262825 395483 294076 195087 173472 353826
19278 353826 561924 568144 602853 572781 581302 491037 465049 614588 610665 534116 635759
19267 635759 743379 414996 91551 200255 394789 559458 686197 625145 620070 831946
19257 831946 749804 791052 1017255 901012 859521 956384 764029 710263 853346 895588 805951
19246 805951 550913 382627 367701 306421 517675 833005 810741 616813 484785 423463
19236 423463 501053 397973 215849 64700 -41565 72018 367402 729504 581519 569489
19226 569489 468959 341149 445322 474495 505841 515785 468100 405198 557164 565557 563692
19215 563692 639721 434677 514515 606940 661871 781281 972674 873682 723333 645902 688099
19204 688099 737204 729705 871803 703894 579308 503608 571693 637904 537134 580771 712888
19193 712888 748220 784404 851555 973524 1045458 1496284 1696560 1560270 1595762 1710993
19183 1710993 1485248 1112586 920085 1002533 1158853 1007170 1118656 1255714 1443264 1447267
19173 1447267 1385227 1575748 1608734 1257447 929280 784670 968265 1136850 1233845 1020292
19163 1020292 960872 992612 864573 975714 963823 679048 709525 855005 998517 954920
19153 954920 902035 980396 800593 871917 1132039 1289527 1200027 1024054 1211058 1336979
19143 1336979 1634844 1851895 1964680 2028444 2006270 2218883 2450884 2617565 2667613 2567516
19133 2567516 2817115 2988328 2997131 2846864 2706406 2791567 2948507 3049255 2955926 3000371
19123 3000371 3177650 3016587 2708737 2629712 2795843 2753571 2576920 2562791 2433318 2175164
19113 2175164 2074433 1802531 1526640 1580720 1694144 1772158 1860631 1589273 1454966 1831113
19103 1831113 1890022 1913004 1959679 1926412 2043328 1828253 1804937 2031179 1944549 1666984
19093 1666984 1869409 2073509 2393276 2801191 2988058 2984542 2953224 2922649 3061104 3109592
19083 3109592 2925584 2774404 2726374 2920498 3184184 3418783 3697874 3757010 3821060 3878884
19073 3878884 4067690 4091545 4190070 4564488 4688086 4436255 4223871 4339861 4461097 4546356
19063 4546356 4677313 4897788 4962936 5051730 5303141 5602978 5939636 6627142 7199401 7507684
19053 7507684 8046559 8870644 9849021 11411285 13543207 16668436 21330444 29024198 42866614
19044 42866614 64750812 86587016 96130409 99030506 102707374 106728616 101893890 86459378
19036 86459378 73445847 66471365 63780419 64597108 71857632 88313809 106092191 112427375
19028 112427375 112731362 114197643 116402886 110050591 92754227 77244587 66897274 59401176
19020 59401176 52437304 46493236 41649109 37762948 34855954 32619446 30893759 29668198
19012 29668198 28849448 28477962 28461133 28528767 28404640 28651658 29369652 30468499 31749095
19003 31749095 34025607 37921597 44141378 55241716 74788958 102059138 122449991
18996 122449991 130237123 136926393 147670857 160545071 168028094 174787514 179158346 178285414
18988 178285414 179449439 186609362 198254192 204867728 202202332 193915171 188525375 188480819
18980 188480819 191236355 191447205 192829089 191135312 182552356 174678126 169467962 162062998
18972 162062998 142496674 119261230 102831060 91416296 81931046 73455491 66119898
18965 66119898 60210968 55460325 51485173 48283059 45630828 43391191 41599928 40082800
18957 40082800 38922367 38023754 37524831 37186458 37130148 37680964 39023077 41684500 46314295
18948 46314295 54334928 69442740 94492574 120290044 130955633 133406341 136716752
18941 136716752 140898871 135522118 116222015 99368779 90062124 86062235 86102406 93382709
18933 93382709 111006924 130878335 138014806 137187305 137223563 138189701 130703086 110222569
18925 110222569 91079591 78262128 68854718 60369678 52892676 46964332 42309616 38425701
18917 38425701 35166252 32646387 30656302 29100127 27510081 26158541 25154481 23827587
18909 23827587 22443583 21499147 20487433 19128826 18379973 17934265 17417643 16930247 16568310
18900 16568310 16070512 15426219 14522813 13966324 13592689 13212803 12782874 12461896 12071823
18891 12071823 11573911 11196260 10613078 10210888 9922877 9613131 9530570 9502241 9366410 8996985
18881 8996985 8712605 8431895 8005081 7837537 7892971 7642341 7548007 7326227 7036813 6831067
18871 6831067 6836259 6754419 6653804 6361283 6067558 5894495 5701641 5680783 5703917 5879718
18861 5879718 5913424 5735962 5424779 5326387 5195420 5004506 4859352 4727873 4455984 4504888
18851 4504888 4519834 4268907 4001451 3896132 3803980 3714060 3661127 3861483 3637768 3359588
18841 3359588 2986125 3022129 3208630 3096673 2919129 2891661 2763421 2562000 2561136 2766758
18831 2766758 2760500 2784243 2742396 2726697 2615729 2583294 2668086 2707052 2587555 2453406 2594295
18820 2594295 2601758 2587500 2476336 2393966 2334938 2286789 2279588 2139115 1839266 1845661 1842783
18809 1842783 1875149 1862783 1805881 1637103 1665185 1679106 1679152 1604639 1542002 1627487 1545466 1492735
18797 1492735 1519579 1670625 1791075 2209133 2486339 2824508 2978365 3107371 3225665 3255827
18787 3255827 3359912 3328843 2860020 2263740 1928605 1790848 1815412 1815546 1634151 1630043 1685340
18776 1685340 1594522 1575009 1585063 1546952 1494157 1372492 1435674 1416353 1339147 1255650 1165910
18765 1165910 1145315 1126115 803378 569828 816549 934245 983019 960775 926491 1002820
18755 1002820 862374 646187 788026 882518 916875 1147599 1133483 890597 899400 1055106
18745 1055106 1193329 1563916 2117126 2823208 3508445 3717030 3869011 4199016 4254437 3910590
18735 3910590 3589469 3259214 2928953 2870213 2568166 2348244 2098475 1884537 1588838 1257839
18725 1257839 1032544 996081 1154514 893034 752232 771166 774953 951638 1133827 920400
18715 920400 903313 879247 1075230 898227 726728 518071 696393 776423 723869 736956
18705 736956 710487 675583 719432 530243 427915 458216 610299 814441 1011371 961657
18695 961657 1042417 1032370 1077498 1240236 1435929 1584134 1837832 2159522 2218174 1992272
18685 1992272 1821405 1654433 1551010 1643314 1527387 1277446 1258443 1091839 1072664 1036602
18675 1036602 949213 965668 1240679 1568670 1878127 2136920 2342069 2339102 2443456 2465483
18665 2465483 2500802 2725003 2844072 2465381 2121945 2316131 2583234 2758531 3149820 3755436
18655 3755436 4072748 4301599 4568923 4439463 4182560 3917828 3466021 3116719 3068273 3191172
18645 3191172 3110455 3079827 3162280 3200312 3170650 3192123 3184268 2965341 2846298 2649578 2253039
18634 2253039 2115052 1956392 1689079 1458657 1330237 1138216 1074347 1158514 1159652 841109
18624 841109 803115 947168 1207638 1341428 1386442 1144087 1102721 901912 708773 550600
18614 550600 704331 742346 616262 690875 773047 969094 1110129 807327 424985 500174
18604 500174 751249 549542 358038 371914 471225 216119 293319 454492 604942 589955
18594 589955 420211 293842 343298 323781 383432 315353 235348 207812 401448 581598 624548
18583 624548 440410 464783 469921 578178 609916 574156 594186 646730 526905 461963 467212
18572 467212 589323 493564 185881 214509 160071 -46000 -75044 52723 236117 440425
18562 440425 525345 596089 489655 359315 267571 142073 173911 385325 388047 295778 348180
18551 348180 434518 395116 228937 261754 499793 323117 68938 136637 72186 7659 260091
18540 260091 382813 434302 423483 436922 356814 324652 444575 430122 229475 141795 265082
18529 265082 369640 646559 779956 734271 683261 714756 887665 784687 677125 851321
18519 851321 866542 859493 707899 533297 571575 666706 648470 846245 981847 869663 816529
18508 816529 1004981 894223 762580 730243 724137 480920 347519 516404 651662 603666
18498 603666 422602 402858 404196 332372 -49424 -291072 -16469 293667 516707 436156
18488 436156 218801 242535 281470 265373 393506 389119 518167 751173 907226 858792 793686
18477 793686 555454 589277 896674 1091483 1172346 1137641 1054510 1148680 1224239 1287265 1085646
18466 1085646 999139 1206860 1448336 1437722 1130610 968966 1217305 1376785 1345067 1249093
18456 1249093 1310805 1230273 1039754 984759 931941 769889 749460 777273 933288 733466
18446 733466 600212 731330 764639 714131 863282 853302 811670 882398 674756 777327 639161
18435 639161 591645 525973 599806 700689 659290 712770 969261 948698 1065561 1430587 1614451
18424 1614451 1702414 1607283 1700426 1805108 1797413 1790794 1817842 1761236 1700604 1652673 1561077
18413 1561077 1632090 1729313 2023559 2338971 2066846 1835650 1838743 1674855 1186694 1108608
18403 1108608 1188961 997420 1150884 1164555 1043404 887893 984858 1083303 1051611 898978
18393 898978 1097131 1295247 1275278 1104599 1178936 1236373 1326752 1412562 1605301 1491431
18383 1491431 1538013 1728345 1750960 1750588 1475180 1319543 1310770 1326941 1352179 1459402 1649795
18372 1649795 1571882 1500375 1340651 1303279 1354103 1281630 1023714 957330 844278 1004487
18362 1004487 920143 794045 929469 918227 857817 970251 816847 763128 694952 650890
18352 650890 687891 595721 403762 309659 290806 456095 812471 1081795 1033200 974031 915862
18341 915862 1117882 1433702 1440251 1342776 1427989 1498306 1522975 1248684 1147504 1255024 1335458
18330 1335458 1384832 1638761 1860862 1952432 2044858 2006428 2108358 2202371 2264369 2253689 2249873
18319 2249873 2147311 2310268 2244847 2322989 2577375 2635297 2534238 2548452 2593536 2704098
18309 2704098 2569151 2341859 2238512 2361320 2461902 2505386 2421682 2373753 2260422 1983736
18299 1983736 1580595 1327533 1375236 1427094 1340686 1246933 1158546 1050981 1068102 1144837 1227153
18288 1227153 1110777 1012447 944125 1200343 1147222 1096712 1211080 1173991 1313546 1494652
18278 1494652 1700382 1974416 2245853 2703636 2983031 3173825 3239955 2950636 2875935 2891234
18268 2891234 2994557 2728916 2445230 2154023 1924152 1856953 1965364 2017143 2046848 2097204
18258 2097204 2181094 2066291 2108235 1940192 2086642 2064565 2118701 2151043 1796424 1605525
18248 1605525 1653882 1520641 1614190 1888094 1677632 1462302 1404186 1313542 1182243 1150836
18238 1150836 1054836 990627 1088079 1101878 1168081 1184593 1129024 1546910 1746708 2232915 2407529
18227 2407529 2403706 2499654 2787095 2902495 2843793 2852017 2624457 2551459 2524387 2081400 1794649
18216 1794649 1853757 1803650 1531700 1474448 1355360 1288517 1137139 972781 925992 899569
18206 899569 775577 629492 820232 812388 628092 864135 974223 877241 869736 1099595
18196 1099595 1015879 857167 907572 840570 673389 701489 921876 803964 813093 893409 925285
18185 925285 753582 910491 709658 843701 1099507 1094275 930659 829007 931874 1339465
18175 1339465 1736460 2014936 2061990 1828922 1581793 1530027 1413600 1444743 1210037 977103
18165 977103 784350 692989 873540 1073605 1141489 1115317 1016367 916835 857725 836164 894590
18154 894590 832634 866128 867241 832461 891403 936570 948348 1177217 1313720 1206179 1064619
18143 1064619 938853 766026 639993 619364 932055 1193522 1435057 1485977 1836997 2039019
18133 2039019 2226901 2355168 2306958 2417906 2467968 2609298 2490964 2576076 2499474 2463065
18123 2463065 2164706 1971433 1917195 1772338 1681351 1505540 1435519 1362784 1404984 1368829
18113 1368829 1184698 991282 977606 897033 971406 977715 1049364 1172009 1319892 1328060 1210368
18102 1210368 1154906 1220561 1450874 1337022 1226967 1203866 887978 812394 815943 902017 993789
18091 993789 949619 959021 1215484 1391045 1673071 1991413 1982529 1853430 2059272 2489740
18081 2489740 2747934 2858440 2583951 2507652 2405453 2488270 2476167 2302675 2170659 2004588
18071 2004588 1999510 2096393 1850035 1844402 1815059 1627904 1441215 1328986 1411226 1354627 1361216
18060 1361216 1448780 1393272 1321246 1113154 1044368 995369 1027687 1016055 1079944 1197980 1357725
18049 1357725 1330912 1354300 1220743 1326914 1457678 1193049 1099426 1387105 1406261 1444886
18039 1444886 1484833 1349436 1433401 1548613 1654386 1639717 1365837 1095146 1049269 1036145
18029 1036145 1002502 1424556 1840570 1959207 1993509 2065714 2246503 2460910 2591444 2640472
18019 2640472 2616516 3008750 3361308 3253048 2992854 2851276 2703877 2402515 2142326 1968592
18009 1968592 1873410 1805754 1858960 1804331 1621212 1717996 2007932 2066200 1919702 1925860 1937092
17998 1937092 2080300 2148034 2123580 2218272 2290417 2431718 2724160 2793347 2773339 2943118
17988 2943118 3420531 3719502 3938319 3951508 3912137 3954247 4176476 3992895 3832340 3747659
17978 3747659 3643292 3869625 3906261 3776822 3928080 4289284 4523309 4647459 4665774 4523679
17968 4523679 4436221 4604914 4627445 4578212 4515997 4460911 4355149 4093056 4103724 4140485 3843832
17957 3843832 3761843 3773588 3892526 4191488 4496852 4861515 5041820 5145310 5607398 6469683
17947 6469683 7023214 7316307 7461435 7557988 7692719 7856134 7714114 7562016 7241361 7162971
17937 7162971 7240130 7023236 6587497 6085704 5893443 5889995 5612109 5316692 5374046 5580967
17927 5580967 5857426 6064055 6266950 6603936 6856640 7199319 7442009 7732299 8245954
17918 8245954 8940063 9612385 10125897 10799497 11765304 12610307 13291514 14130023 15329255
17909 15329255 16742157 18796154 21560564 25523806 31319249 41096471 58115215 84537360
17901 84537360 110074155 122587083 131048097 144831887 166488343 186260092 190368919
17894 190368919 181417650 173022352 168925435 164544755 147854354 121804686 101365917
17887 101365917 87765005 77425270 68166773 60606068 54726457 50374770 47168013 44911449
17879 44911449 43488783 42661869 42771599 43893048 46343882 50687650 58250728 72148089
17871 72148089 94836454 119593233 133194635 141121763 152746769 171747532 192326308
17864 192326308 200214764 194103377 186735197 184328972 184359745 177272207 163541244 161974014
17856 161974014 174030460 182192994 180780069 181383333 190246949 205038003 211594510 204476574
17848 204476574 192276052 183729740 178257734 168411350 147005327 123569133 106542526
17841 106542526 94404230 84296112 75338129 68170533 62512533 58256728 55143315 52728924
17833 52728924 51296271 50526647 50304039 51087542 53273934 57623377 65928878 81902452
17825 81902452 106368523 125876588 133442057 139906960 152607161 171475828 184023891
17818 184023891 181999742 172028021 164722238 160738397 154444780 136277679 113373046 96542806
17810 96542806 85106818 75613362 67045908 59892365 54107963 49575215 45951183 42992176
17802 42992176 40477436 38426714 36715456 35477086 34546108 33573220 32617751 31935340 31684207
17793 31684207 31455848 31339748 31748527 32660141 34122183 36430629 40189435 46375362 56720533
17784 56720533 74426182 100618167 130139731 156420290 177793851 190719208 195811512
17777 195811512 192878476 181139521 163765546 140714523 118627759 101525030 88257389
17770 88257389 77031029 67448344 59831244 53767023 49000072 45506109 42958935 40764275
17762 40764275 38823038 37130446 35680489 34201118 32781635 31567581 30462482 29311220
17754 29311220 28055065 27343158 26953262 26847848 26817838 26895308 27065616 27581677 28233536
17745 28233536 29061807 30034989 31147808 32812938 34799703 37507237 41347314 46734695
17737 46734695 54657442 66465250 84935711 115036222 162531799 223842051 284808064
17730 284808064 337608768 376203513 396256453 400211622 384819828 353878395 310519972
17723 310519972 260942375 218337613 185285720 158338203 135610109 116779606 101435026
17716 101435026 89521184 80330427 72897061 66889775 61935996 57771476 54245366 51075869
17708 51075869 48217534 45409900 42996915 40992222 38931720 37284804 36099360 35187846
17700 35187846 34353497 33506058 33196825 33093446 33050812 33120512 33363090 33650708 33895580 34187423
17690 34187423 34822859 36027943 37587405 40478313 45171104 52435931 64449447 85005883
17682 85005883 115596124 150286137 181781073 207603584 223227811 229490275 226065967
17675 226065967 212132996 191878726 164524377 137577349 116604712 100347495 86643281
17668 86643281 74664094 64870458 57235782 51311589 46535508 42814747 39637786 36809377
17660 36809377 34640059 32783126 31106466 29588889 28223428 26936522 25755821 24834301
17652 24834301 24012291 23198086 22509002 22347174 21998400 21600565 21268688 21151630 20863125
17643 20863125 20502372 20043383 19383820 18900975 18383602 17914928 17507762 17361053 17260434
17634 17260434 17262078 17286321 17339215 17394801 17708472 18310783 18692194 18992418 19510455 20250284
17624 20250284 20914835 21960042 23606045 25172585 27409885 30546834 35496978 43215151
17616 43215151 55389135 75837394 105052496 132163921 150021562 169541722 201701993
17609 201701993 249020162 290913463 303843750 301464268 305996233 321245094 332146931
17602 332146931 315501251 279907471 250859925 232267206 216389038 191845343 159806229
17595 159806229 133652927 115312622 101354446 89262430 79119266 70992275 64473275
17588 64473275 59018741 54825252 51125323 48033208 45513015 43444607 41453182 39600095
17580 39600095 37899540 36294079 35296813 34458476 33688484 33324355 32833384 32537045 32392960
17571 32392960 32705166 33372286 34327030 35787940 37916586 41036570 46205376 54494259
17563 54494259 68640253 92372176 120499741 140472416 155584538 178595977 217135052
17556 217135052 262828029 286857383 287132440 286561257 296534663 311125428 307524334 278447285
17548 278447285 246963949 225669100 210782132 192557519 164577989 136538604 115961184
17541 115961184 101335420 89523686 79101476 70328493 63133149 57840221 53472672
17534 53472672 49623882 46227228 43178969 40687273 38420229 36273935 34218724 32290170
17526 32290170 30662890 29432082 28187716 26997546 25588544 24301198 23345366 22573065
17518 22573065 21672274 20913317 20110002 19507996 19265926 18650423 17875373 17239779 16719228
17509 16719228 16240363 15805680 15260657 14683780 13959790 13458551 13227724 13205714 12987581
17500 12987581 12696106 12180607 11889633 11684423 11476696 11100775 10673920 10489978 10215207
17491 10215207 10081127 9723628 9483714 9090882 8911277 8921780 8938279 8686785 8595608 8285107
17481 8285107 8079241 7803539 7572991 7360947 7052243 6947610 7158257 7141559 7102222 7083101
17471 7083101 6844685 6539847 6293707 6145334 5983655 5719782 5416847 5377335 5071715 4953755
17461 4953755 4959469 5060592 4962172 4828418 4918075 4909012 4873264 4864063 4718693 4569558 4478590
17450 4478590 4303651 4059031 4129677 4183806 4130054 4139471 4321765 4069105 3853860 3780399
17440 3780399 3578435 3451881 3306089 3166592 2916721 2787405 2767700 2887006 3073741 3169416
17430 3169416 2874802 2906398 2908848 2643082 2627105 2779751 2877527 2858227 2935518 2792420 2534813
17419 2534813 2493405 2315382 2039525 2048329 2168483 2290245 2312958 2297431 2222779 2210141 2222906
17408 2222906 2364319 2327222 2061837 1826270 1751003 1880301 2043657 2016972 2090534 2170747
17398 2170747 1947526 1845852 1987860 2186529 2109145 1899234 1813369 1766313 1847106 1893234
17388 1893234 1838915 1938708 1953224 1956994 1821648 1650326 1561094 1428984 1361286 1536116 1646740
17377 1646740 1603128 1782458 1958814 1878337 1854022 1966557 2207582 2500084 2426251 2211030
17367 2211030 2079076 2137194 2109971 1930456 1804491 1643915 1326130 1209958 1196591 1186466
17357 1186466 1329978 1442008 1445795 1404740 1420512 1346370 1315727 1344927 1365926 1146087 937763
17346 937763 977294 1015593 1255850 1485342 1590156 1670793 1890176 2044106 2133443 2279521
17336 2279521 2467990 2510777 2706633 2795606 2573949 2357298 2299977 2412004 2535130 2233114
17326 2233114 2030231 1918640 1794076 1841024 1940327 1820025 1738423 1730006 1807672 1833622 1604423
17315 1604423 1556841 1492037 1479790 1183340 961765 1093844 1154032 1062005 1271819 1340069
17305 1340069 1061829 1101772 1337949 1390925 1321031 1185582 1256791 1365309 1350212 1465604
17295 1465604 1513962 1634319 1721534 1929052 1868477 1579200 1630586 1706262 1860027 1922454
17285 1922454 1926520 1986871 2018978 1937237 1822690 1841262 2082991 2243204 2408468 2312839 2140073
17274 2140073 2088747 2107945 2044522 2082590 2177539 2052325 1934900 2095564 2212487 2066249
17264 2066249 2032326 1879522 1797515 1616353 1637595 1813867 1885793 1650028 1478821 1665636
17254 1665636 1949851 2075153 1992498 1874406 1836708 1768454 1609025 1525067 1590691 1634999
17244 1634999 1622465 1475636 1274269 1244594 1186902 1368770 1416277 1293103 1239608 1269843
17234 1269843 1199735 1195098 1250712 1527552 1804237 2081723 2312358 2419882 2627458 2638499
17224 2638499 2482133 2405156 2383233 2189603 2055897 2128731 2016787 1834436 1618227 1394380
17214 1394380 1240830 1086497 1118273 1447028 1608567 1519613 1477262 1506456 1484281 1459032
17204 1459032 1377435 1235263 1369802 1410243 1272606 993091 887401 995310 1014801 1051439
17194 1051439 901067 691620 753908 810493 744231 858177 806543 707279 819493 836614
17184 836614 919998 1012645 1133126 1113252 1288559 1602102 1564947 1474809 1520428 1471644 1473890
17173 1473890 1635523 1385215 1204805 1119299 876178 886054 936388 942167 890817 970873 1077348
17162 1077348 949590 974124 987471 746561 470799 403697 450163 629859 896916 814249
17152 814249 529239 454313 548532 615809 301239 321321 413108 330132 498339 663989 611743
17141 611743 411590 417349 664395 1001372 990925 1144607 1147615 1000718 1055891 1139983 1122690
17130 1122690 1097825 1198787 1035347 985579 899214 681799 839362 1026653 833684 610396
17120 610396 655198 613856 655521 796278 925393 1000307 835936 440791 238525 381193
17110 381193 707101 804609 827300 916147 880752 807364 741756 673772 826372 912115 925055
17099 925055 889704 784636 864914 878184 966389 1112962 1076035 942441 908123 1066378 1126832
17088 1126832 1210791 1072825 1149632 1325681 1451017 1600062 1741463 1980775 1979107 2252443
17078 2252443 2438123 2410810 2534317 2490904 2375291 2427982 2485888 2304116 2284547 2308442
17068 2308442 2275352 2344276 2465601 2306434 2211648 2155285 2184106 2283075 2597814 2870007
17058 2870007 2767048 2721080 2874246 2867235 2911541 2832673 2756777 2786499 2892241 3118361 3011452
17047 3011452 3120127 3373767 3642729 3596429 3580914 3796521 3887540 3825884 3652672 3471324
17037 3471324 3256572 2977760 2829447 2763846 2760346 2876463 2920942 2906751 2930890 3216695
17027 3216695 3560714 3754985 3879988 3889344 3914328 3874911 3887492 3811919 3475675 3256063
17017 3256063 2948808 2813216 2966831 2950362 2740109 2706206 2683827 2693107 2595290 2560879 2538288
17006 2538288 2494949 2566031 2461304 2273428 2322153 2579735 2715790 2490361 2398848 2366600
16996 2366600 2492885 2563590 2600926 2661440 2703626 2815588 2891411 2987575 3012313 2908063 2730561
16985 2730561 2807678 2754180 2448730 2454328 2499291 2453581 2555081 2459397 2363163 2447359 2560334
16974 2560334 2397159 2393858 2292168 2129464 1967481 1953325 2129368 2201186 2099492 1978161
16964 1978161 1823946 1743581 1587582 1499712 1401458 1432086 1295684 1425164 1684791 1525827
16954 1525827 1339880 1405434 1548094 1568395 1684768 1521691 1533299 1442693 1396495 1551266
16944 1551266 1771667 1840100 1805809 1964653 2201330 2059189 2013888 1831459 1625839 1538505
16934 1538505 1553341 1571550 1433171 1401207 1437436 1684279 1970226 2216491 2131666 2164918
16924 2164918 2111228 2150465 1906121 1896630 2076883 1861453 1621847 1447181 1419034 1568796
16914 1568796 1606945 1484592 1485302 1611898 1416747 1196918 1320771 1309038 1280526 1496411
16904 1496411 1597122 1430793 1470703 1503580 1573569 1729766 1508509 1472545 1491118 1434596
16894 1434596 1477764 1465406 1174619 1133250 1247884 1330186 1397562 1325945 1237605 1262666 1282354
16883 1282354 1493251 1460854 1295899 1372417 1420181 1182824 980108 964959 965582 1141248 1271725
16872 1271725 1268150 1293192 1397843 1365022 1301543 1303468 1451623 1469212 1554655 1709522 1913697
16861 1913697 1957760 1933611 1885749 1849247 1808000 1759555 1655790 1601440 1784699 1851391 1766097
16850 1766097 1691818 1900599 2003251 1734805 1599166 1702383 1733977 1848206 1783419 1766433
16840 1766433 1864338 2068976 2062013 1990563 1982208 2277062 2278984 2224022 2383363 2330936 2400312
16829 2400312 2405120 2586866 2761475 2802926 3075577 3196315 3293405 3503753 3756864 4095232
16819 4095232 4263668 4355725 4354293 4536989 4579826 4655105 4614221 4711494 4943932 5160268 5416198
16808 5416198 5611445 5992543 6395234 6754607 7144906 7364726 7744745 8102057 8243258
16799 8243258 8275442 8498205 8786081 9111930 9684792 10273248 10814240 11504685 12330973 13241991
16789 13241991 14012985 15017841 16513487 18164507 20407070 23540118 27634901 33785863
16781 33785863 44025319 60483579 81885581 100595859 112204426 122242153 136259564
16774 136259564 154659890 170549820 176490487 174368812 172222617 174498082 179175710 181359593
16766 181359593 182617853 187019962 189704205 190464950 194089051 203401544 215231970 219762125
16758 219762125 212969695 201853636 193309837 186589116 175465193 154116361 130071938
16751 130071938 111566990 98268787 87247392 77860974 69846950 63141536 57994127
16744 57994127 53746683 50297328 47693629 45847347 44557494 43370202 42443235 41744986
16736 41744986 41249612 41402068 42581909 44475800 47383542 52266740 60812082 75346151
16728 75346151 94499651 110365646 119529091 128064569 140594037 156432722 167593297
16721 167593297 169150474 165348482 163336663 164758404 168074800 170277095 174306405 181208984
16713 181208984 183700348 183556651 187065808 196826587 207285093 208068560 198946423 187912208
16705 187912208 179967257 172897215 160850174 140565618 119263483 102681307 90360383
16698 90360383 80051697 70889844 63366617 57368840 52232789 48191041 45009604 42282177
16690 42282177 39886035 37814152 35895337 34144521 32522574 31040642 29742421 28570923
16682 28570923 27337301 26315114 25373775 24333407 23229127 22514781 21882035 21058035 20349328
16673 20349328 19425666 18637889 18150160 17790870 17487014 17122593 16568128 16048190 15465961
16664 15465961 14783353 14335434 13971642 13776668 13773323 13358724 13063098 12595430 12276797 11900771
16654 11900771 11528190 11126331 10856834 10854556 10673095 10424131 10465945 10535860 10239455 9859974
16644 9859974 9608884 9336914 9212196 9161949 8851464 8607241 8615388 8536616 8335728 8215580
16634 8215580 8359023 8431443 8159025 7756819 7640381 7483375 7494317 7388862 7226639 7126233
16624 7126233 7111096 6975218 6826276 6608487 6488929 6411293 6213159 6235355 6213201 6195404
16614 6195404 6256686 6311861 6343789 6170423 5976240 6117223 6213885 6282324 6389395 6309656
16604 6309656 6241567 6498116 6568807 6625735 6542662 6523332 6483662 6678227 6749484 6687788 6723689
16593 6723689 6877774 7046634 7100028 7187032 7481994 7852158 7929700 8076088 8233654 8349914
16583 8349914 8508380 8798232 9279402 9887073 10572049 11019436 11594541 12240145 13279351
16574 13279351 14553365 15788729 16864678 18258644 20018434 22363556 25355616 29184262
16566 29184262 34600889 42869653 55861016 75958238 102889001 131881011 159613069
16559 159613069 182337020 195470705 202124267 202509006 197439449 187022761 172448341
16552 172448341 163201005 164607839 179357986 210392044 256442982 308400896 356167336
16545 356167336 393837533 416933116 424712144 417071120 393994991 358995166 316742150
16538 316742150 277641466 250202150 236263054 236394041 248416837 263276672 275461892
16531 275461892 284390905 287587256 284687279 271512560 249362481 222990570 193608658
16524 193608658 166665616 144999158 127467224 112556574 100007076 89514815 81184799
16517 81184799 74615337 69405058 64719168 60893548 57557311 54525065 51565727 48970385
16509 48970385 46840390 44576026 42583622 41013145 39494363 37991361 36896113 35947491
16501 35947491 34967018 34166094 33823383 33709093 33683819 33624000 33266758 33294078 33362180 33778209
16491 33778209 34502053 35599076 37291178 39649021 43150337 48403495 56838646 70675888
16483 70675888 92695860 120527522 142692932 155742401 168128315 186328005 208450124
16476 208450124 223429223 223684436 215689512 209314360 206659211 202762881 190720578 176948685
16468 176948685 173389580 176425855 176606894 174369295 174895466 180751755 188034521 188552270
16460 188552270 180451109 170167295 162353229 155919629 145227455 127558814 109652420
16453 109652420 96434168 86460368 77927375 70560495 64447279 59680481 55919546 52799815
16445 52799815 50335948 48315324 46948366 45912559 45370925 45180009 45366677 46175732 48231763
16436 48231763 51712575 57561075 68065716 86054069 110478589 131489576 143145239
16429 143145239 153446287 168325530 187267404 200659046 200908195 193610115 187401475
16422 187401475 184368139 181249637 172910611 162602186 161331146 167690868 170692507 168952465
16414 168952465 169652796 175933469 184363022 185365498 177357890 166875200 158587094 151709516
16406 151709516 142278429 125805651 107302855 92698572 81980986 73230691 65681166
16399 65681166 59211253 53800480 49485144 45972552 43036258 40552774 38296498 36226504
16391 36226504 34278271 32515738 30928963 29390132 28127139 26755798 25584832 24623111
16383 24623111 23579690 22526050 21698714 20908643 20030230 19274129 18562874 17973231 17273052
16374 17273052 16691808 16118218 15625220 15190763 14965803 14509061 13963289 13575384 12970453
16365 12970453 12552397 12326791 12126240 11854972 11820860 11633296 11209164 10756239 10328071
16356 10328071 10011315 9826918 9488742 9327683 9261443 9046915 8740385 8364283 8192472
16347 8192472 8141921 7876682 7632640 7548018 7504287 7465819 7415614 7098499 6735700 6485899
16337 6485899 6507798 6858282 6763314 6469097 6308511 6032677 5845089 5709127 5545137 5583795
16327 5583795 5596980 5270466 5134471 4915472 4724051 4506502 4271236 4214951 4330672 4026445
16317 4026445 4070659 4357532 4320293 4290648 4314385 4051272 3847453 3668753 3682178 3708848
16307 3708848 3955536 4030183 3908546 3707413 3511055 3550044 3397178 2993741 2823743 2794050
16297 2794050 2841781 2775323 2543986 2643663 2783817 2907332 2772122 2704135 2899142 2911242
16287 2911242 2721205 2533117 2317315 2205202 1982929 1976426 2213854 2358586 2382388 2381549
16277 2381549 2528902 2530509 2428568 2460670 2517651 2423310 2610384 2657094 2536635 2492435 2593440
16266 2593440 2550517 2454895 2413937 2313688 2285453 2292850 2235800 2093692 2159604 2403661 2535192
16255 2535192 2401974 2244665 2003433 1965889 2066441 1882245 1719580 1601844 1609728 1390707
16245 1390707 1251285 1445218 1477848 1379964 1406948 1250953 1363701 1388405 1160494 968488
16235 968488 1017467 1021966 976476 1086127 1198448 1164374 1019753 782075 865052 1021124 1232749
16224 1232749 1464998 1502630 1495582 1530655 1554808 1347125 1228021 1414668 1645392 1611353
16214 1611353 1702065 1734121 1735281 1762634 1831637 1831193 1734662 1514284 1516257 1416914 1464434 1395814
16202 1395814 1160195 1190214 1362800 1517519 1273192 870645 521384 525744 966239 1096631
16192 1096631 1180596 1077685 861647 838077 820397 685341 578663 606922 779715 670473
16182 670473 601355 553614 687084 807870 899902 971838 1053896 921842 568449 526460 898290
16171 898290 919227 826012 893418 987656 849889 804576 783143 983093 817999 650693 569548
16160 569548 593212 496274 498692 645222 695719 583943 577646 566238 655748 593068 459376
16149 459376 466873 329708 348532 545425 622993 531794 427109 350086 494344 778326 1019651
16138 1019651 1020728 1048008 1266660 1447021 1411442 1431086 1414248 1533133 1628700 1712476 1722722
16127 1722722 1556650 1611980 1600135 1714215 1741760 1654188 1557068 1525151 1438026 1261418 1116132
16116 1116132 1112949 1075094 955206 875201 927336 841502 829017 1027227 808770 731034 757626
16105 757626 872250 799928 603774 503093 439103 394315 343283 372737 234190 324943 418505
16094 418505 413809 524123 460900 584697 649873 741427 781241 715053 661089 919974 830847
16083 830847 694158 697216 687107 835603 1007561 1175680 1045962 697757 542288 580831
16073 580831 736409 805639 752093 600941 627495 572403 704034 584893 370273 412116
16063 412116 491243 448144 529562 717419 901251 1160241 1395790 1486230 1442634 1397357 1501485
16052 1501485 1392636 1501790 1565421 1467296 1292999 1203322 1407038 1652967 2053678 2216645
16042 2216645 2262839 2161735 2280696 2539357 2347115 2060750 1795467 1787368 1755601 1617140
16032 1617140 1569777 1752532 1903662 2025406 2072401 1939441 1965215 1970007 1682235 1428490
16022 1428490 1266988 1330873 1369038 1554965 1378401 1173710 912567 863632 732752 863156
16012 863156 1029558 980529 999966 920672 915444 803224 566902 588982 532289 522335 749109
16001 749109 728680 626886 705418 598088 374454 295902 375466 265599 233281 243031 336274
15990 336274 200089 237298 178137 204199 299022 342717 555594 703813 560803 626345 834095
15979 834095 901194 850555 736561 672602 349033 256805 381388 604274 713839 716770 671460
15968 671460 840659 1022482 1162852 1066192 950634 1174650 1286475 1407357 1552875 1654607
15958 1654607 1716091 1553849 1469039 1420101 1467196 1456164 1239564 1121570 946483 878802
15948 878802 720764 729496 926540 851740 880784 823201 730504 1018009 932156 855903 928578
15937 928578 938083 660806 259567 344717 410675 431143 285826 408828 211408 64554
15927 64554 293696 286319 237605 426637 375096 192005 317029 441362 719357 964746
15917 964746 902080 729644 470080 549119 778533 860787 914244 782893 760910 712368 811709
15906 811709 792287 934564 938693 647634 735150 839582 1000814 1009870 892988 855878 855487
15895 855487 710967 640010 770181 868015 679748 604275 685525 752533 719177 829516 724284
15884 724284 548972 497242 397425 480053 551371 484022 567287 517409 327329 113287 121740
15873 121740 195731 34115 -139416 -183711 173662 268850 153063 155439 338950 344343 353867
15862 353867 161956 151484 112589 295944 443115 448884 233753 50644 -41243 -10317 246838
15851 246838 415291 493427 360687 228175 144795 79225 -141609 -198912 -87229 202494
15841 202494 276163 328686 533470 572433 396277 124299 -8807 -119382 -147736 -88094
15831 -88094 -113824 -11986 -24530 -46630 -30285 -150131 -374943 -299853 -354281 -276670 128626
15820 128626 150861 108970 -4423 -99768 -240384 -523225 -376826 -233729 4371 184277
15810 184277 201871 854 -261466 -210784 10414 210605 133781 40352 181542 202332
15800 202332 160623 106276 65290 50950 183633 278355 366066 208375 28973 55503 -41392
15789 -41392 -124183 13778 -24850 1629 -8436 40906 -76673 -187201 -155182 23238 258815
15778 258815 170945 -31130 -123978 -220200 -236604 -50304 30396 62995 -84551 -4767 100330
15767 100330 -199041 -195959 -21703 183490 397052 499388 291745 26997 -134337 -239121
15757 -239121 -287752 -153503 83840 124581 160114 374308 246632 -14487 106176 122031
15747 122031 -38524 -74266 200483 206619 244318 426515 678594 672630 496210 386219 344205
15736 344205 299566 207187 182504 202570 -14162 27142 131215 167943 278177 72194 75017
15725 75017 69782 43312 225133 361052 268062 200066 253660 268879 146475 -63616 -148428
15714 -148428 -60784 66256 181888 342148 383276 416564 366942 289537 90727 106752 13464
15703 13464 -738 -29434 3320 41239 255896 406439 176105 244194 82533 188243 225511
15692 225511 -121725 -280879 -201514 9526 357491 237330 105812 189105 290296 258352
15682 258352 253641 256926 137868 49115 -125650 -184308 -184631 -85201 8334 -67349 23799 215987
15670 215987 355455 470091 432490 374339 339399 165007 145841 161996 73409 -216916 -215388
15659 -215388 15248 87691 58335 2105 -54698 -3852 256389 457982 458354 356489 474690
15648 474690 640973 461476 322072 545680 575636 444644 311686 586774 669957 465996
15638 465996 357807 208290 145687 208005 353109 448686 515328 672555 485683 300970
15628 300970 267563 504591 446872 389409 519206 230301 146497 304426 275035 158795
15618 158795 115555 226368 516341 273159 144460 183114 290147 334328 358777 302920
15608 302920 116397 158690 191167 -43311 -241427 27178 337242 403510 503064 442828
15598 442828 405308 470608 429226 399729 341970 346464 237456 210208 500058 606494 486193
15587 486193 389395 326755 121177 19239 -59171 -36662 152109 252513 206547 223334 211592
15576 211592 40900 64087 186410 364496 253178 -62429 -259274 -221646 46828 200081
15566 200081 377946 304634 346289 328969 433943 515594 186185 -106882 -131530 90068
15556 90068 291073 271288 232131 86245 -190581 -192035 -81200 115071 425951 435006 550130
15545 550130 379589 150123 112174 108004 -40245 -49712 -15002 -235007 -145524 -56280 -2703
15534 -2703 75822 277458 520941 242589 144924 101779 138909 359264 386107 273905 620108
15523 620108 523170 349723 478998 411174 586198 646508 556841 531302 454420 419902 272968
15512 272968 345617 416077 283419 414872 458018 429046 152311 102088 11734 120226 242346
15501 242346 460428 692479 650166 345507 297783 224845 445903 372148 367482 336894 391666
15490 391666 399951 269509 74514 287722 246320 272803 385233 511597 381440 200667
15480 200667 301142 497604 380447 356134 296245 159298 135372 311159 176617 65005
15470 65005 126971 129564 121212 154208 198017 216917 202778 290387 270275 296725 393462 410512
15458 410512 353677 483904 612331 468224 544854 517173 427632 492675 468478 367969 256779
15447 256779 131359 204567 200954 289461 344741 181983 -3869 -150512 -197626 64304 280059
15436 280059 286275 228802 313468 230493 67642 11226 217068 180504 111150 -51543 -34772
15425 -34772 251715 390866 338612 306520 194706 236714 498434 597083 317359 224273 222185
15414 222185 469125 536704 536738 475758 433031 533373 392038 346794 606247 625850 408345
15403 408345 269272 209894 98000 204504 430920 458810 262763 410709 556758 604227
15393 604227 504262 383459 725980 924211 999429 816078 500476 422520 259935 226595
15383 226595 265001 242239 270715 422140 551943 456444 404308 421477 665563 481502 522481
15372 522481 531024 508905 321192 133003 147537 219302 209031 -27257 -163402 -39412 161566
15361 161566 222101 408381 581717 844222 1079370 1045209 632863 315764 442708 578960
15351 578960 663936 522811 395785 406626 532984 444763 494140 413183 246662 525985
15341 525985 478229 409974 290196 197347 124168 111353 116883 130417 68306 210662 300020
15330 300020 389395 683046 991955 854414 524033 505233 606216 674532 650545 642423 735047
15319 735047 868457 867379 883094 700603 494785 587038 791420 682200 642439 836022
15309 836022 1045925 1222613 956707 874442 1022478 813123 552832 522940 507463 520518
15299 520518 492295 588174 685195 741415 731162 727567 894535 816644 867565 783974 676209
15288 676209 901882 985120 1072609 1138847 919496 880836 707693 689348 627012 960098 1004531
15277 1004531 869876 917265 969690 919096 801602 825948 893189 867242 931879 1049282 1056404
15266 1056404 1015650 894177 948138 1145758 1152647 1155257 1087207 1139957 1338256 1459060 1196492
15255 1196492 1106630 1149342 1247008 1169673 950509 914694 867969 912142 905664 933834 1088611
15244 1088611 1245189 1193525 1109901 1153223 1063515 1001107 1150714 1251353 1378571 1192354
15234 1192354 1016507 868907 1125695 1313241 1394970 1348349 1369658 1449887 1152989 1116104
15224 1116104 1286857 1111359 915729 1086699 1090579 1124177 1282132 1384824 1505324 1404944
15214 1404944 1294610 1285308 1325062 1558397 1575729 1550049 1325098 1299363 1504864 1435944 1290463
15203 1290463 1270508 1320886 1610109 1779299 1799357 1736711 1672252 1788309 1699636 1780065 1846081
15192 1846081 1707028 1847286 1904626 1871214 1863490 1878202 1874102 1841519 1800825 1764249 1615538
15181 1615538 1858777 2041941 1890057 1723350 1509920 1409614 1447245 1582884 1557701 1641784
15171 1641784 1580979 1655395 1629739 1649497 1690609 1768881 1693722 1861089 1855193 1842204 1917327
15160 1917327 1996704 2110962 2147021 2100620 2074773 2128667 1965383 2013639 2265406 2357258 2284817
15149 2284817 2215747 2308857 2391177 2479201 2521672 2337903 2200561 2212997 2127022 2140363 2074829
15138 2074829 1992331 2054092 2116588 2003385 2153705 2273296 2298591 2349125 2180406 2119742
15128 2119742 2217472 2249352 2569920 2830124 2824937 2551026 2420048 2428535 2607175 2540727 2359464
15117 2359464 2413979 2669520 2746023 2898835 2998266 2799877 2645594 2725949 2783697 2975868
15107 2975868 3199121 3271080 3305374 3069947 2965292 3035908 3040724 3107839 3315895 3364956 3157017
15096 3157017 3046611 2920481 2991409 3120567 3200944 3192574 3112440 3155611 3298117 3403199
15086 3403199 3517215 3634055 3793541 3896119 3773021 3683277 3608257 3557961 3431882 3440438
15076 3440438 3468801 3624646 3743976 3788658 3903345 4065140 3922041 3660274 3643913 3875419
15066 3875419 4031594 3982039 3824389 3843182 4143159 4211741 4277671 4390153 4524414 4509548
15056 4509548 4375969 4403788 4707169 4880762 4954865 4884632 4861173 4933646 5218481 5447096
15046 5447096 5522616 5570432 5561595 5555941 5636079 5597507 5507721 5606651 5779001 6012098 6025348
15035 6025348 5931202 6173778 6412879 6434493 6464729 6583648 6599808 6591494 6752340 6860329
15025 6860329 6944850 7064362 7128366 7120405 7247794 7309178 7410844 7592261 7699392 7954354
15015 7954354 8102947 8388646 8414368 8453292 8734213 8985239 9001202 8812712 8825467 8867084
15005 8867084 8903031 9200395 9505868 9711003 9802347 10141122 10471391 10762708 10882813 10937963
14995 10937963 10946418 11283200 11393705 11511202 11777190 12131882 12232746 12456938 12712752 12912033
14985 12912033 13018849 13388792 13647831 13813304 14062053 14196434 14348734 14691740 14837060
14976 14837060 15061737 15298712 15723203 16361656 16692307 16928723 17239832 17660866 18176843
14967 18176843 18809256 19095072 19570754 20004918 20574823 20944873 21291558 21755678 22450201
14958 22450201 23155134 23663735 24220938 24999060 25986386 26705588 27278207 28176788 28931019
14949 28931019 29702552 30811757 31620815 32460533 33442714 34531219 35649485 36891632 38151686
14940 38151686 39571389 40894897 42261950 43772996 45567003 47417769 48960348 50840605
14932 50840605 52835866 54960502 57051297 59507060 62272047 65035597 67729719 70691532
14924 70691532 73920756 77469231 81292512 85293492 89530949 94185124 99039517 104315581
14916 104315581 110067155 116168492 122913345 130142007 137977420 146316930 155189741 164680557
14908 164680557 175056336 186189316 198136966 211074439 224784260 239326321 254652183
14901 254652183 270617522 287371892 304661859 322376577 340312387 357865599 374763817
14894 374763817 391147892 406427791 419759750 431203730 440202632 446320065 449691129
14887 449691129 450483593 448681230 443973199 436741752 427414890 416430613 404061788 390763757
14879 390763757 376744298 362082567 347293440 332440818 317907287 303800831 289947087
14872 289947087 276444904 263557436 251388867 239950835 228913712 218371676 208577441
14865 208577441 199330137 190379469 182157558 174556056 167048729 159888530 153134135 146834510
14857 146834510 140897172 135333014 130217796 125398218 120756286 116452805 112143111 108107828
14849 108107828 104188018 100745580 97346183 94125788 91007956 87958061 85269480 82564241
14841 82564241 80052585 77620728 75317510 73184468 70927431 68785199 66936734 65210544
14833 65210544 63383950 61697043 60099727 58359265 56706296 55190972 53807092 52311289
14825 52311289 50815493 49566208 48405126 47106924 45966132 44939688 44084594 42998654
14817 42998654 41927517 41014687 40012767 38864471 38029083 37210053 36326799 35399845 34696271
14808 34696271 34017474 33192094 32294053 31595585 30951066 30182052 29564035 28964050 28138187
14799 28138187 27629397 27062912 26463858 25863597 25384964 24948722 24415682 23925434 23392986
14790 23392986 22815409 22421512 22307807 21902768 21218394 20867405 20503705 20282291 20185702
14781 20185702 19761687 19182166 18793220 18268994 17928581 17649017 17418089 17114803 16721828
14772 16721828 16646121 16517860 16278464 15905325 15516175 14998814 14532475 14234248 14084888
14763 14084888 14094943 13753094 13500215 13401298 13281144 13109713 12982420 12827462 12617165 12437184
14753 12437184 12268223 12105602 12107740 11878442 11321531 11137970 11307465 11282836 11179146 11009740
14743 11009740 10919339 10943322 11129546 11274835 11352716 11444350 11456368 11459788 11258823 10993459
14733 10993459 10654338 10156806 9794594 9247468 9053147 8924746 8779756 8549586 8139103
14724 8139103 7907556 7754869 7693609 7479044 7488395 7264321 6933797 6940838 6751675 6730383
14714 6730383 6790488 6883337 6850222 6809534 6602228 6452230 6348110 6283343 6283785 6057408 5679126
14703 5679126 5490533 5423681 5464995 5432506 5171129 5044240 5010321 4677690 4611325 4580678
14693 4580678 4511811 4649794 4603101 4526317 4474564 4391030 4180731 3997998 4194385 4198083 4049762
14682 4049762 4104860 4189316 4107079 4062061 3964173 3797543 3703968 3659082 3737917 3847292 3872587
14671 3872587 3984851 3716946 3509812 3265760 3099663 3230871 3348632 3495047 3487912 3628457
14661 3628457 3457021 3194322 3098840 3019205 2935239 2830334 2923139 2882711 2763596 2771269 2650758
14650 2650758 2592075 2643626 2663004 2650527 2763022 2708541 2880421 3171636 3204944 3251125 3083482
14639 3083482 2813570 2758889 2832808 2536068 2336039 2400121 2405695 2480059 2391730 2298568 2460330
14628 2460330 2554366 2623854 2550828 2389250 2170630 2088135 2068980 2137098 2274238 2185862 1968755
14617 1968755 2126953 2302956 2406548 2366462 2235532 2347425 2362372 2058901 2024770 2095276
14607 2095276 2162151 2169212 2045334 1951857 1787142 1740130 1881590 2185007 2148805 2097098 2060738
14596 2060738 1806071 1975306 1850328 1703490 1794691 1811390 1829123 1826731 1841489 1667523
14586 1667523 1590498 1587609 1567196 1369271 1375945 1265266 1313209 1337714 1496318 1753944 1600887
14575 1600887 1496805 1280644 1321984 1199721 1195781 1259943 1210924 1195759 1206259 1051553 1098249
14564 1098249 1061336 957687 1108924 1156746 1142351 1154953 1193056 1275659 1246542 1320082 1289550
14553 1289550 955905 947168 1178798 1206391 1092219 964287 977428 1070702 1106114 1031775 860677
14542 860677 776235 825347 920097 888354 962732 984383 1035762 1048093 907839 755735 609447
14531 609447 874784 940463 1017722 881665 962993 824083 692959 527276 498050 601964
14521 601964 824099 773985 735305 814832 778776 614458 540157 534981 450292 514428 543638
14510 543638 580918 580970 775299 569977 424086 589160 620884 623965 684869 385911 337115
14499 337115 638913 756357 659250 685140 622208 503381 605559 660832 580190 829419
14489 829419 1171992 1169657 975027 761304 638795 356951 461618 548934 345287 302468
14479 302468 562170 878021 839211 687725 531792 582464 629463 545550 376323 498199
14469 498199 735170 689058 466143 543894 544519 543284 494943 464985 530295 498757 547369 667787
14457 667787 632323 694860 781056 748422 774489 693630 702573 926103 928150 875188 684560
14446 684560 555551 611678 623311 548515 782261 645188 482833 462395 415006 314512
14436 314512 244123 245408 97353 180000 257394 320806 464545 365014 176167 161910 132929
14425 132929 97378 471746 635884 456396 510636 266926 348482 414904 179207 50184
14415 50184 88365 -120165 -78165 285328 516511 447817 399470 424924 350843 191987 336497
14404 336497 505257 587754 535187 535271 654187 550067 415838 524687 618213 633863 630185
14393 630185 508537 364586 533582 514378 425793 367418 630006 668751 488142 251040
14383 251040 164744 108265 488054 581868 703777 712293 765092 687379 558739 468900 692698
14372 692698 487134 400701 386681 418246 256851 245004 140486 42797 191669 332666
14362 332666 340660 365902 396827 485179 520963 287491 227674 354299 308793 330303 466997
14351 466997 669982 819265 658208 578516 318579 174109 223822 273750 220539 22144
14341 22144 251259 367533 482989 389889 405927 353446 420348 480207 431179 353561 84418
14330 84418 41292 75646 56509 42719 57320 153997 38909 -109882 173232 221974 191979
14319 191979 358392 436429 249164 241697 357565 270979 333597 466791 212120 174800 277638
14308 277638 340502 277930 257944 381053 542920 480149 141337 86799 330833 404967 330028
14297 330028 381956 482995 485618 394522 346136 420247 353092 202361 175626 171292 -9100
14286 -9100 -57988 94202 38642 -86245 -7636 70423 -13528 98848 225286 147597 252101
14275 252101 217432 291553 291485 235431 201377 149794 332917 553486 479531 581655 618413
14264 618413 651671 376954 70897 106424 202297 281472 270176 376897 317485 228332 280840
14253 280840 263482 149997 120083 170425 191996 201957 179786 171242 101738 -170290 -212045
14242 -212045 -298688 -275797 -166426 45503 8077 -176687 -293744 -347162 -152563 -29805
14232 -29805 -56968 95328 334925 209672 76884 227429 305878 437546 299279 302853
14222 302853 274547 91282 -11261 -93977 -204915 -319475 -240021 -115847 -93962 -65597
14212 -65597 87724 200231 319559 128427 65031 27225 -38539 -162807 16524 337846
14202 337846 340190 352795 252187 111403 25875 -81057 -16658 12780 221161 240296 288121
14191 288121 300496 432019 395789 296498 254118 325619 334963 395689 246616 -37950 -17011
14180 -17011 23689 253329 399385 606139 577824 366141 -7416 -140848 -103595 7114
14170 7114 156230 223097 232494 148291 29409 9283 162053 100491 212782 353843 305674
14159 305674 332753 384087 214405 401770 318095 153769 66471 130119 109038 245192 88831
14148 88831 -50730 -112157 -128441 -117441 -56365 9178 18911 2631 -56866 -11452 110504
14137 110504 69994 -155454 -202876 74846 324452 412761 248456 -19591 -17717 -117682 -148892
14126 -148892 -5490 107158 98956 271532 306651 353230 178007 -152313 -259015 -135300
14116 -135300 45353 256419 157791 232071 233410 180660 83211 54235 62148 150873 109840
14105 109840 -27515 -79897 -41238 -37555 -88251 -360295 -436633 -404295 -362131 -246206 -136491
14094 -136491 -157465 -199043 -239564 -128148 -87573 -204515 -298267 -304586 -206578 -165318 -155293
14083 -155293 -99265 -203947 -202259 -356993 -143720 -91618 -49020 -15275 -105048 -38527 79330
14072 79330 263828 363837 200912 -157221 -192409 -204519 -43121 52289 -98853 -18076
14062 -18076 -107337 -343846 -97385 165291 129996 136416 78338 64332 82279 51290 52176 -121784
14050 -121784 -141311 -106953 73367 234757 251205 458455 545433 338181 65324 66429 43752
14039 43752 173709 259836 -94475 -182306 3140 86835 -125808 -193430 -40090 -58806 -31354
14028 -31354 59644 88708 17898 -296101 -290386 -135418 -178123 -331595 -121327 102307 95037
14017 95037 7965 -136333 71523 346842 364350 211469 106308 -35583 -249373 -388681
14007 -388681 -261365 -292892 -321910 -251675 -133359 -74658 23048 159685 132520 64612 87365
13996 87365 267655 156440 6686 51633 216594 233525 73386 -73349 44596 105632
13986 105632 210865 268485 370639 319713 282182 132722 214247 413508 251053 61393
13976 61393 9313 -176302 -163067 118854 139323 -191776 -120997 22525 101378 -71498 -5450
13965 -5450 -119776 -55764 116409 51277 -147896 -218463 -39802 101328 149254 131125 34824
13954 34824 12103 5985 30838 -122010 -105125 -91391 -58245 -68493 9843 197293 150191
13943 150191 72929 -42380 -32902 21589 33465 -29745 176095 141470 147355 144284 220204 426453
13931 426453 450754 222693 -27116 64433 61978 19001 -10960 87569 63253 -88803 -124034
13920 -124034 -59272 237575 356748 192800 25968 -41878 97874 84443 84359 124683 -39580
13909 -39580 -103024 6259 138321 258273 334022 205014 122735 16540 19964 49230 -92941
13898 -92941 -340600 -235504 -114168 -28818 165603 248983 130511 -22161 101681 196662
13888 196662 204366 65524 -91094 -75488 -167500 -283709 -56914 89133 -28453 -120046
13878 -120046 -258219 -114386 -3512 -160001 -72458 96589 -34946 -67565 44112 106683
13868 106683 57418 227702 451679 419736 48691 -217778 -210882 -176031 -80476 -97911 -48587
13857 -48587 79279 118568 128797 359768 278425 -124312 -281736 -473186 -115155 -7372
13847 -7372 -11883 51255 -82614 -39950 31350 89048 100318 52939 142574 142124 92524 211670
13835 211670 439943 417534 188656 288985 340646 80404 -35238 -251891 -367807 -426089
13825 -426089 -97917 -14991 -190617 -174067 -164295 -164832 -127027 -126801 -166031 -60076 -113725 -170213
13813 -170213 -92008 17881 -130589 -482876 -680870 -376660 -95437 -180225 -431807 -417391
13803 -417391 -288989 -4889 104061 110332 80958 92062 230592 294491 262063 300928 -11185
13792 -11185 -138541 51852 -150561 -465358 -255082 -6139 323221 219175 -121237 -306051
13782 -306051 -163019 -124914 -175922 -131880 61717 127907 289737 115738 -78994 -122476
13772 -122476 -188727 -125504 95842 -35653 122340 188033 108589 121358 -4496 -120262
13762 -120262 -253710 -132749 186327 245917 84377 -63050 -153256 -248426 -288984 -282114 -230529
13751 -230529 -124540 45333 7842 -313559 -347454 -172492 -198361 -130462 -186635 -83359
13741 -83359 -166481 -198672 -362899 -444179 -359360 -258800 -101019 17 58626 175285 241691
13730 241691 336598 411623 565562 564092 196432 106552 1202 129009 11298 -193138
13720 -193138 -21089 29662 70376 -36674 -51685 305950 322182 290537 139773 15184
13710 15184 110543 157140 -37866 74584 89796 175416 216127 91161 85692 261201 231275
13699 231275 -42076 -188461 -128678 -58455 -2010 28444 -159059 -87448 -168445 -153369 260381
13688 260381 182418 -151554 -158327 -231197 -301920 -167481 2275 31501 -11130 -59300 20822
13677 20822 -57493 -144509 -134654 -11756 163760 258868 127225 1253 -15405 -108850 -147965
13666 -147965 -258843 -237833 -157883 -48010 73201 25968 150083 231197 356926 186439
13656 186439 -15821 -33139 -108986 -287019 -264168 -299964 -315160 -205844 235032 531329
13646 531329 602767 472583 347364 258625 45728 25622 87655 13587 124702 114959 24053
13635 24053 -181515 -30239 32377 -186062 -20545 87791 -52395 91292 332205 425662
13625 425662 420503 129768 40584 133652 207114 224567 255020 132764 162655 284548 180408
13614 180408 44002 -151878 -240229 -135124 -180143 -296861 -188782 -213366 -55527 69898
13604 69898 57244 54164 -102605 -311809 -336108 -299954 -145410 -200665 -285138 -159119 16384
13593 16384 33167 38489 -226005 -443030 -482148 -248343 -69583 38496 97458 69026 -66884
13582 -66884 -116707 -71559 -121128 80388 264956 109042 12007 -74549 -31804 -68058 -65553
13571 -65553 -159219 -222740 -150290 -200212 -323807 -209475 -196600 -223379 -332384 -376491 -230212
13560 -230212 -132019 -43497 39815 33814 41479 68735 182602 219270 70370 60752 156648 83985
13548 83985 63679 148952 136030 101211 79842 28513 -202373 -82982 60811 -29437 102437
13537 102437 288572 243140 185606 166235 200461 15039 -82227 -27763 -47764 -128695 -187191
13526 -187191 -221763 -55386 57135 -51256 -319798 -241846 36275 127683 223957 224201 104981
13515 104981 207744 -55107 -118097 -172908 -233663 -80325 -218834 -281862 -306508 -130104
13505 -130104 273653 201721 113599 148456 71389 -14104 -144788 -94697 113048 104714 112655
13494 112655 113489 -100817 -121511 43358 298252 75799 -173370 -219875 -500828 -332203
13484 -332203 -125805 -201886 -335155 -441516 -309705 -157197 -131787 -152185 -1822 43930
13474 43930 13935 141669 135221 -15457 -156904 -114802 -74200 -30118 2337 39946 -116807
13463 -116807 -347028 -150483 -98669 231497 130493 -118206 95550 213826 -57540 832
13453 832 109037 164811 186866 83616 -53719 49719 19989 -33732 37920 17464 -26435
13442 -26435 -19052 -130666 -313500 -604938 -517669 -172908 19034 129186 121569 193309 188519
13431 188519 -51783 -27208 -94135 -246251 -255626 -127494 -161835 -221261 -192556 -350093 -543408
13420 -543408 -331700 -189632 30622 34623 -177611 -206855 -301994 -261981 -147822 -215118 -249110
13409 -249110 -57466 48596 37709 -77510 -55643 -49873 -54584 -106695 -89646 -107589 -27274
13398 -27274 -71865 -24063 79128 23104 93026 231455 139020 -76099 -58245 -79033 -190383
13387 -190383 -179983 189867 68533 89093 177067 124831 -6657 191467 216198 135268 23756
13376 23756 -67628 -60316 -7056 4455 206242 368548 315466 81312 -179858 -187465 -88757
13365 -88757 -263303 -367219 -482552 -209176 145130 264358 406271 404392 202712 242465
13355 242465 222142 211777 56816 60934 -3991 -83658 45083 -41973 11829 45162 -397
13344 -397 -308823 -386674 -217369 -394782 -181087 -111142 -151811 -39358 -22897 -144138 -287556
13333 -287556 -231467 -146221 -223234 -333843 -67431 -162353 -195183 -153678 -292998 -252995 44365
13322 44365 -27791 -66300 48147 128927 -63292 -87890 236537 365258 437203 286114 205990
13311 205990 320670 258865 118233 5722 17174 -41292 -87075 -227651 -201816 -23141
13301 -23141 75994 99175 -148152 -176216 -22618 42089 21871 70295 -66552 -95441 -43824
13290 -43824 -160159 -331031 -154253 -132801 -210146 -224752 -173348 -285020 -319302 -225630 71240
13279 71240 95278 -165890 -366357 -249646 111497 -90996 -272777 -220338 -306762 -395266
13269 -395266 -267928 -286179 -319023 -230668 -162164 -29813 34301 35640 -62868 -241281 -277815
13258 -277815 -200461 -117679 -57243 -238463 -101443 187665 87564 77802 108398 1468 -210451
13247 -210451 -217582 -206375 -297124 -184813 -144090 -315935 -450779 -215679 -165176 -201482 -77175
13236 -77175 -97118 -87235 -138909 -231357 -213805 -280182 -236142 -176356 -175778 -27263 -13057 95309
13224 95309 41563 -210174 -208282 -24630 -21031 22236 38681 199293 94865 -74648 -238946
13213 -238946 -463195 -262813 -90590 107668 54783 -21377 -65279 -3246 -208594 -361201
13203 -361201 -405388 -340317 -84979 -191091 -187346 -41046 14844 -183078 -157585 -53060 62469
13192 62469 -29276 -105526 -81736 -56556 -59338 -77590 -102473 -233882 -448930 -359846 -350813 -189289
13180 -189289 -132162 -204630 -345067 -393302 -383195 -316583 -162436 -252178 -360760 -290720 -115658
13169 -115658 -3293 17255 -159412 -276404 -338049 -283617 -183287 42715 -70513 -117795
13159 -117795 -72401 -25820 -91828 -120042 2797 40596 140417 190662 71302 64900 -18825
13148 -18825 -22969 63806 -66559 -242841 -276145 -358712 -354808 -266751 -193292 51239 125909
13137 125909 -84395 -264686 -351410 -427093 -358662 -155709 19435 46305 -71793 36606
13127 36606 261832 168849 -53541 -58964 -201670 -475568 -284102 -138245 -34959 -170534
13117 -170534 -203221 -250163 -345726 -408925 -351726 -271251 -63117 130870 -50738 -79741 12162
13106 12162 22373 -11210 44340 129186 216943 246304 349635 315083 315494 355303 115840 36585
13094 36585 -7281 -183513 -249091 -39867 -37552 6366 -61936 6061 182849 175436 317613
13083 317613 434389 302450 143621 118379 42930 59266 207350 214000 27122 -136207
13073 -136207 226411 422113 676436 962244 1249461 1328478 1190261 1122912 856387 488135
13063 488135 286639 474167 518213 477012 411911 656945 651933 653048 611576 512754 272328
13052 272328 245385 265283 104063 11670 -99487 -343856 -406143 -245201 -189737 -149666 -128818
13041 -128818 -172579 -217250 -104162 -8069 235302 337061 169669 83001 167123 354380
13031 354380 371211 407854 675265 1359801 2167844 2901984 3156814 3120745 3168745 3068288
13021 3068288 2861392 2583653 2269274 1749749 1383560 1158413 888739 803435 666318 570667
13011 570667 510111 440789 459682 345472 365073 401460 285284 6125 -119250 -216411 -53121
13000 -53121 98285 75592 -10273 55861 68003 -4634 75325 271693 316387 325359 455419
12989 455419 512483 553573 406930 547744 895714 1429527 1839773 2084612 2343381 2648380
12979 2648380 3179159 3335558 3416913 3258012 2818565 2256525 1555395 1109975 783744 687943
12969 687943 623584 458966 378496 359112 392775 349968 482552 566284 497060 725323 768887
12958 768887 721212 711739 633031 519096 277461 101399 25907 47671 -55464 50 1652
12947 1652 187780 280545 288465 387065 474521 263295 222167 314033 530120 598793 911037
12936 911037 1225104 1284270 1160129 1040109 1200066 1283695 1199669 955729 787632 767272
12926 767272 815782 926847 889500 574186 146826 -173621 -187575 -2628 18719 87677
12916 87677 138929 319049 360411 394761 161852 95891 211619 261336 260718 444160 280403
12905 280403 282698 185817 220887 335293 485530 509168 264604 129866 69032 -2289 -43737
12894 -43737 -13791 17201 58637 59735 -34776 123567 245686 342475 512705 550880 399451
12883 399451 238121 -54272 -58580 28580 -11826 -5070 36134 97816 -37670 -158067 -261269
12872 -261269 -381019 -235987 -194879 -169022 144890 313861 530265 407630 280634 215691
12862 215691 352991 353078 342420 328441 270840 311444 334043 174584 176275 11860 -47000 -12549
12850 -12549 166051 210321 240635 443538 456399 240659 132317 137912 391951 373886 216772
12839 216772 -267451 -288382 -101587 -174194 -329516 -419631 -292819 -277931 -383796 -367784
12829 -367784 -199248 -279692 -75285 49298 -33805 -233944 -203375 -170332 -90371 -132175 -73583
12818 -73583 40207 50847 -148018 -300527 -97746 149423 99561 144803 228819 266486 349559
12807 349559 351709 297278 34016 -134162 -196831 -338249 -266387 -212564 -120936 68036 -98269
12796 -98269 58198 216719 148117 161270 126896 147098 12856 -172470 -62381 26112 -23268
12785 -23268 -84658 -45837 -116454 -97209 -82886 -7639 -118043 -246245 -205899 -140569 -3354
12774 -3354 -62190 -52115 -101467 -248592 -280076 -54508 87964 -128942 -318116 -331544 -192706
12763 -192706 -268354 25960 104416 15040 78846 -27038 -221570 -268943 -24819 112919
12753 112919 166594 -36352 -125882 -232071 -419120 -428898 -196899 -209633 -44870 114900
12743 114900 -99353 -231050 -167332 -272692 -373447 -343030 -235622 -184760 -108113 -81885
12733 -81885 -98566 -380506 -414401 -240785 -181832 -233690 -251364 -166650 -93242 -168318 -125744
12722 -125744 -193663 -159857 -73870 -67802 -139792 62403 194620 112654 34362 -118761 -115402
12711 -115402 1844 188093 108690 53242 -23721 -25913 -59132 -56741 -71950 17929 115537
12700 115537 170929 166359 129328 -210350 -322286 -473286 -352967 -130860 -271823 -115184
12690 -115184 -146918 -54 50391 -53712 -75026 54402 -39582 -392497 -441026 -262942
12680 -262942 41451 150725 73425 -166456 -296303 -231984 -285076 -438024 -247173 29588
12670 29588 -112956 -180509 55802 124031 47077 -39786 -98873 -52957 -143266 -105211 -75011
12659 -75011 96729 153955 -74798 -62049 -122166 -317046 -294367 -325139 -169319 -114356 -102425
12648 -102425 -247415 -259640 -277616 -250719 -289207 -325432 -362073 -384995 -219456 -217069 -385972
12637 -385972 -355730 -397511 -108435 36311 11594 -148672 -38933 145214 190041 95021
12627 95021 30178 -81819 -33046 -33435 -173196 -218148 -290695 -248554 208 -59547 -233581
12616 -233581 -324772 -364630 -542879 -411059 -139855 -225586 -210868 57925 103963 152571 37104
12605 37104 47009 101596 137163 216893 11090 171735 317810 325943 282846 99375 -27138
12594 -27138 -145728 -274491 -273603 26862 135587 192399 180837 5752 -95266 -155458 -198700
12583 -198700 -279128 -257273 -221313 -36929 148550 336587 123417 294876 238746 251512
12573 251512 155691 85838 -5330 -85795 -287352 -237534 123298 245705 221870 107374 96731
12562 96731 -24862 23075 69254 57207 169951 349 -84161 -131105 -76408 -32579 59144
12551 59144 87198 42387 3572 -73847 -35622 38224 115385 264773 296908 134869 37545
12540 37545 1409 -187046 -288982 -223047 -310474 -141888 -160265 -171725 -164295 -39738 -88346
12529 -88346 49117 225849 280909 215453 36414 -88506 72363 214435 137119 98248
12519 98248 42530 17957 -112525 -47623 -56889 84541 276625 105485 96330 200576 177887
12508 177887 60686 137585 66836 247652 268388 287423 225452 164946 133563 68115 97992
12497 97992 -63358 -144883 -74739 -70707 -134165 -119209 -243368 -263669 -100966 -172137 -136485
12486 -136485 -167266 -263700 -82893 -33967 -220521 -26987 -61420 -104229 -117199 -133100 -175297
12475 -175297 -178031 -120302 106268 79387 18146 -58870 -66986 3844 17940 -12801 -16940 -46255
12463 -46255 11052 46188 -33141 -120207 -76957 -19366 -39787 -25131 108158 187010 80435
12452 80435 22037 588 34576 78908 222180 -44279 -52892 28101 -45346 -94908 -2664
12441 -2664 191187 417404 360547 228600 216508 224622 459091 470491 287145 88405 215377
12430 215377 308028 99951 -57685 -63169 -151116 -104275 105663 157747 34630 31001 196517
12419 196517 118976 131648 92690 -217817 -125606 -3318 15414 -66300 -237872 -356237 -379929
12408 -379929 -204309 31181 455688 571534 366716 48326 -42868 -12467 -195348 -457571
12398 -457571 -409502 -273285 -295198 -181722 -56063 23689 -72997 -201084 -83289 159863
12388 159863 51123 226522 357542 245316 -4328 -98533 45050 60748 75358 10058
12378 10058 -268969 -329610 -283628 -119478 -217498 -234816 -371799 -204158 25717 171743
12368 171743 295141 119779 26008 247013 225252 193641 -133604 -237686 -17988 145834
12358 145834 -25332 31933 101195 -143155 -251370 27748 146450 154391 159107 269331 250544
12347 250544 355960 395810 276129 330109 388455 269214 199830 180726 351999 384061 267363
12336 267363 267257 339255 469673 335185 -241797 -126637 275451 189105 236926 519481 444334
12325 444334 359512 140987 74691 139991 104788 275002 571171 547893 204376 87177
12315 87177 -108001 17355 228962 93996 -34617 -268246 -139078 -89108 -200960 -170313
12305 -170313 10658 65740 30685 103481 77488 7145 150224 204475 185089 67182 -159369
12294 -159369 -374165 -505314 -377290 -37736 -121462 -223026 -42081 169298 312695 129801
12284 129801 41351 179367 84628 49739 -32386 -154248 -195594 -249160 11091 309970 160696
12273 160696 58498 -163932 -207941 -32126 -61340 -32698 171182 328734 231024 139236
12263 139236 234949 317155 455863 464909 418963 241347 63500 -21823 73584 80949 46103
12252 46103 88373 268029 286475 259098 314413 352077 280048 245449 268602 401611 228354
12241 228354 164951 30292 -59015 -126414 -197968 -324287 -356210 -234625 -44113 198398
12231 198398 298017 112052 124293 18802 -83136 87633 305425 278144 332664 222264
12221 222264 149600 68847 -132717 -92218 65491 224164 386504 352418 366050 526761
12211 526761 222059 700 -97289 -79075 11681 -40203 132590 216344 76797 15794 195672
12200 195672 130889 2972 -214042 -119093 152095 396572 262372 226412 311597 326587
12190 326587 315802 294955 322455 181307 24338 -106592 -86810 126247 457265 574451
12180 574451 312450 320533 499848 547087 597976 576531 394816 65595 22642 9594 98743
12169 98743 399389 475210 355999 494795 670298 761718 821930 766757 760978 700128 451637
12158 451637 380799 366536 522171 458693 369138 267078 161911 119210 161919 413020 659626
12147 659626 690258 556753 382247 281636 72362 11488 278970 529008 372195 298916
12137 298916 284493 322554 358827 476855 505634 360838 434917 725812 799793 691063 614445
12126 614445 525537 530458 564201 400793 366980 627690 590117 542832 551861 632931 455700
12115 455700 353226 478146 392618 168536 253188 465664 628347 674271 639511 630638 529689
12104 529689 432443 458195 409193 620271 568276 431665 206821 180822 235587 348276 516705
12093 516705 603322 446897 430716 586568 540801 656373 646406 613415 494966 356243 353320
12082 353320 231542 290218 169466 138446 427339 534850 524300 391866 361311 313124
12072 313124 440068 601397 799943 945391 950397 845016 1110956 1103744 832847 796673
12062 796673 659449 641618 752261 544896 517411 552073 666983 900855 893441 828540 918710
12051 918710 923100 765976 723970 922051 1261523 1452309 1409452 1428939 1606711 1521280 1360343
12040 1360343 1294165 1401269 1446838 1308680 1428371 1451591 1421060 1203809 1086472 1009495
12030 1009495 981252 1042462 1259833 1390378 1233056 1227740 1419140 1464745 1874063 1960669
12020 1960669 1817560 1546842 1362748 1280331 1138967 1262118 1317249 1333110 1241331 1343366
12010 1343366 1490848 1701337 1740972 1798315 1973062 1931373 1682549 1730410 1714212 1519826
12000 1519826 1562623 1953308 2137927 2264287 2281143 2137356 2233210 2386901 2507272 2425735
11990 2425735 2512030 2474187 2456946 2570272 2803776 3022128 2980600 3347724 3529628 3685095
11980 3685095 3840032 3824295 3955703 4084539 4267019 4474099 4554415 4538373 4746979 5045287
11970 5045287 5185482 5242729 5454644 5460548 5321787 5388119 5782904 6178540 6457171 6888251
11960 6888251 7410342 7956059 8316237 8882291 9439008 9825567 10389377 11115146 11958134
11951 11958134 12684941 13724493 14762665 15970897 17061817 18377431 20029922 21937531
11943 21937531 24133460 26511732 29522532 33116571 37445881 42804682 49213511 57052163
11935 57052163 66818759 79387919 95556997 116854076 145491022 182867198 228761722
11928 228761722 278775588 324300007 358886657 381483203 393178422 392687866 377032622
11921 377032622 347513889 310554980 273553212 239683556 209690597 183027687 160055886
11914 160055886 140346463 123801154 110044819 98476902 88884850 80525584 73561861
11907 73561861 67508863 62211505 57707174 53581220 49886688 46677516 43739075 41090826
11899 41090826 38710511 36293101 34189867 32305493 30507346 28974539 27703821 26565548
11891 26565548 25589971 24645343 23724674 22815399 22158902 21276197 20283264 19711288 19083843
11882 19083843 18295116 17517227 16806170 16119358 15389640 14915788 14478234 14156544 13734020
11873 13734020 13159700 12637018 12116075 11929462 11664749 11326427 10805879 10322290 9882685
11864 9882685 9561906 9637449 9369936 9095160 8901238 8700840 8348493 8047842 7917943 7948107
11854 7948107 7877424 7530933 7063649 6981260 6803062 6684683 6682312 6569926 6477544 6260813
11844 6260813 5864730 5697127 5678477 5474955 5126731 4927558 4741153 4733012 4608605 4609043
11834 4609043 4442654 4351373 4272118 4122860 4172923 3945650 3854417 3656097 3694767 3684585
11824 3684585 3640747 3662602 3366493 3235685 3296646 3380148 3210615 2927759 2563182 2584788
11814 2584788 2528671 2503135 2433856 2455678 2234366 2076132 2140175 2048090 2008175 2032546 2064096
11803 2064096 1907995 1914797 1913150 2083176 2109391 2089917 2053140 1941481 1773940 1511844 1725513
11792 1725513 1899842 1759064 1717278 1915354 1767686 1673311 1594934 1389361 1199351 1115902
11782 1115902 1236784 1396880 1238040 1190988 1264483 1292279 1230603 1174364 1180328 1067808 1026690
11771 1026690 956728 788147 724678 766085 715908 924714 1085647 977171 792776 769620
11761 769620 823519 806627 704698 782578 990512 991559 891070 822296 599101 487197 547468
11750 547468 669794 609986 587506 466772 532532 536121 481468 345343 337146 442587 363751
11739 363751 247544 233787 382397 439898 264581 122420 169724 310596 189061 99156
11729 99156 200828 307586 152888 -20527 127639 180219 231120 337835 375418 318006
11719 318006 2327 -48461 53360 167578 139640 316827 366762 149825 -13600 -35608
11709 -35608 10574 88022 53953 3471 48599 232309 351927 284646 136790 197658 368959
11698 368959 419071 200333 81692 132209 73479 154226 372353 432343 367091 104091 200591
11687 200591 325983 120092 -22132 -12048 79697 3340 -208505 -24789 185342 326793
11677 326793 432578 458747 191126 94802 419221 389098 203353 105766 71285 101029 -60659
11666 -60659 56340 -47925 -202202 -158919 150451 164926 72354 160264 364367 347538 381212
11655 381212 254705 98278 -124858 -40861 -10121 -132483 -220163 -146464 27673 226853
11645 226853 187408 267307 266981 231529 344267 401876 389774 342790 237507 330160 279939
11634 279939 183620 215310 183977 196233 295771 149818 91955 90039 14428 -100863 -131881
11623 -131881 -136814 -115661 25944 109278 170146 289775 216028 187813 202656 53516 -247220
11612 -247220 -287503 -79544 186442 175771 126585 23558 -354271 -489559 -528153 -445467
11602 -445467 -449537 -318743 -412011 -312238 -46218 348594 413050 91184 3031 -81418 -24703
11591 -24703 -66704 -202348 -60314 137368 44292 -67007 -12485 -158671 -347450 -348655 -340360
11580 -340360 -343830 -122104 -59169 81750 134918 42589 48799 77092 -84604 -67193 13161
11569 13161 -220614 -350580 -366247 -413948 -187658 -342174 -220984 -99624 -343184 -437100
11559 -437100 -229460 -140283 -139563 25614 172349 42061 -220799 -156639 -7710 32615 52673
11548 52673 -65056 -134447 -230181 -334700 -390640 -423836 -411528 -428857 -320008 -199509 -109715
11537 -109715 -1499 52810 -17731 -361837 -255608 -137796 -200889 -199311 -141585 -225096 -327468
11526 -327468 -257153 -147656 -178036 -354725 -355407 -211616 -169200 -191001 -292829 -380091 -330308
11515 -330308 -245902 -280560 -431092 -247815 16868 -5606 -53738 -207474 -41378 -5052
11505 -5052 -96110 -431049 -728257 -687079 -413339 -272800 -368267 -59122 220549 184410 61603
11494 61603 -82451 2729 118548 55518 25013 78701 -91146 -418642 -534411 -343361
11484 -343361 -156477 47821 136312 89802 39243 -101860 -34096 -108958 -281892 -415710
11474 -415710 -376416 -269538 -64436 83314 486382 419757 223063 57149 24938 6262
11464 6262 -62716 -103963 -137993 -185901 -235125 -338882 -334432 -238984 -75362 35136 -30227
11453 -30227 -130772 -208931 -234069 -261594 -251822 -165749 -331482 -266721 -246952 -212988 -219549 -289529
11441 -289529 -6001 328816 526014 344229 31103 -291875 -346307 -144325 -45903 -136437
11431 -136437 -377583 -387652 -357560 -379586 -220706 -135945 -141331 -273779 -473204 -352143 -320579
11420 -320579 -455996 -398016 -297158 -77561 91155 146759 333337 432665 254134 131637
11410 131637 220004 273567 184446 -25133 -326320 -258667 -54071 -43693 -132039 -156455 -329701
11399 -329701 -430839 -177207 36412 111369 -59917 -226000 -160122 -303835 -366488 -440991
11389 -440991 -425774 -381078 -365206 -324366 -385900 -222281 -135476 -219381 -221493 -211346 28365
11378 28365 -56154 -161317 -350288 -323513 269 23274 -104905 -259713 -278188 -384967
11368 -384967 -374457 -219471 -183340 -257515 -251138 -49725 350100 391508 137457 -79645 -165171
11357 -165171 -224501 -136394 136812 352599 236717 -61336 -229655 -184372 -198254 -160525
11347 -160525 -14049 107453 1555 -81455 -50184 -41234 23074 -22986 -153807 -55385 -184313
11336 -184313 -184268 -10864 12119 50329 -22409 31880 22489 -25734 -67575 -118070 -181843 -261987
11324 -261987 -116283 -141916 16252 16575 -192059 -188448 350 26742 137228 78431 97302
11313 97302 155419 385205 438245 544760 486243 323528 147037 137565 283032 29850 -66322
11302 -66322 -44465 -144687 -193840 -266787 -265806 -300388 -185874 1880 53593 -229315 -336883
11291 -336883 -343723 -274549 -182616 185716 201172 140724 253647 242496 124264 -4380 125558
11280 125558 148548 400544 484866 408455 307769 147685 69471 -70293 -143319 -276973
11270 -276973 -343082 -189978 -75111 -36294 1932 -38988 -96251 -282840 -177111 -28073
11260 -28073 -137635 -174912 17258 -42284 -236293 -474667 -269383 -33883 -163285 -405667
11250 -405667 -256865 -14745 267911 177737 2119 -143852 -171 91145 199919 8226
11240 8226 -399833 -509579 -261735 56567 196388 373545 401290 113045 -191141 -199140
11230 -199140 -34128 -132085 -172861 -185874 -59433 46718 151278 199870 92547 36377
11220 36377 54016 63600 68364 -106671 -166201 -122337 -21655 -39616 -110515 -40855 107788
11209 107788 -9535 -273580 -425866 -380658 -87790 28012 -35088 51854 78798 26206
11199 26206 -15230 10746 -5078 186192 187428 155374 271389 109749 6678 -166621 -230672
11188 -230672 -139936 41738 51287 61294 76600 -110618 -92712 5982 198067 109718 -141987
11177 -141987 -232672 -238741 -319379 -330040 -245099 -324914 -318192 8944 112114 -159811 -397364
11166 -397364 -186702 -47866 148798 129344 -14661 -24890 66333 217124 152852 17590
11156 17590 -89024 -80234 -265781 -232631 160665 195972 221716 235348 258889 -69236 47568
11145 47568 264971 279156 269397 173711 -6508 -321245 -227211 -95746 -21956 85546 65011
11134 65011 64083 56477 312695 295524 215972 290990 263402 104591 -112180 -95011 -38889 72803
11122 72803 22590 34941 -16694 -164618 -129839 -201602 -344769 -310989 -345528 -188971 -55114
11111 -55114 -70407 -177071 -142661 103641 111983 -73449 -51602 108709 190798 411761 712629
11100 712629 751178 464851 173936 102333 111399 -65258 -226930 -172835 8285 5618 -159697
11089 -159697 -203632 -73223 -39841 83906 7654 -60831 133275 166347 113292 151209 61623
11078 61623 -19425 62854 351025 175426 36996 97410 16425 7083 94209 -87679 -232929
11067 -232929 -196777 -163483 -175575 -223490 -157608 -74380 -7425 -113542 -82750 97625 202835
11056 202835 53285 -192261 -157645 -98253 40742 212703 238101 168453 38559 101358
11046 101358 179844 401928 393776 310600 316332 321376 330297 289039 329409 532141 731756 616210
11034 616210 379929 282644 359367 562518 863007 980197 974019 905068 861164 928641 976034
11023 976034 1178380 1061015 1010894 1097463 1362329 1606205 1608913 1627336 1656656 1787855 1924333
11012 1924333 1955197 1910171 1803138 1464779 1228273 1172297 1452368 1705958 1434748 1199613
11002 1199613 1233915 1364587 1288093 1125943 939798 842280 853404 837915 730698 824257
10992 824257 1020349 1055719 960705 728432 529139 482051 447120 390146 310456 155056 -51074
10981 -51074 97429 331968 517186 387322 225835 283921 284495 241321 282580 430936 447175
10970 447175 251257 172897 193691 118193 69699 14440 -118712 60128 253964 176798 284118
10959 284118 591729 610128 414827 223231 177088 209727 170907 -158393 -307408 -317793
10949 -317793 -279977 -298121 -196944 -60293 -107673 -117129 -103386 -30006 73829 -147892 -186423
10938 -186423 -166768 -52003 -93603 94574 57695 6908 -57104 -66841 90835 32067 -120804
10927 -120804 -286814 -394618 -139170 -78090 -171318 -260102 -4867 141476 55603 31859
10917 31859 188389 297897 158335 76891 -58359 -6320 104103 119521 10384 -38806
10907 -38806 141083 218247 366619 382454 289388 339712 204989 -36089 -78851 48117 288113
10896 288113 476698 292443 176112 166203 259367 305905 271537 231284 148254 147809 312744
10885 312744 307370 166810 133573 149752 228506 320235 258965 157071 118584 -26383 -87433
10874 -87433 -94381 -153511 -146921 -120866 74374 223815 244120 211596 250520 254134 193478 167171
10862 167171 261139 227839 159112 84649 212979 176557 96643 222609 186276 44543 63894
10851 63894 109263 124263 221525 267820 307215 216848 561646 748210 590068 397000 351826
10840 351826 574062 602233 588010 685756 654801 467226 365555 336789 419229 383054 531123
10829 531123 505520 686340 811100 901256 708442 531564 516633 456603 436853 373503 202190
10818 202190 116979 117980 491758 424657 339448 429711 297241 318838 443680 539594 662394
10807 662394 778610 616820 549606 391522 405844 584175 354900 124093 400138 559906
10797 559906 505151 416586 595423 484569 444453 269481 1022 164941 220618 394423
10787 394423 349632 190305 -12243 22516 -64770 151692 290505 350829 461135 344487
10777 344487 192520 -51305 -23798 41926 171149 280657 473925 606404 495116 429883
10767 429883 356997 189877 52444 38558 132198 102413 196619 404666 368390 226240 213895
10756 213895 271787 430403 244103 198621 223878 73690 249884 302156 173806 201766
10746 201766 500299 692944 730540 524357 337196 394094 433704 427657 369792 258704 409240
10735 409240 627467 657680 583330 714532 891104 1008484 1067124 865665 744514 690655
10725 690655 555670 462439 491587 610503 720374 601489 567790 667674 686272 774298 919698
10714 919698 1049145 912792 782428 651272 716803 707896 706227 541794 695622 849216
10704 849216 928259 867380 747361 643987 771674 886330 1054630 986925 846729 958335
10694 958335 1066719 1123615 1195917 1081146 930447 962078 1056603 1150736 1258143 1175754 1084790
10683 1084790 921925 897601 1096987 1408814 1467816 1400793 1417731 1604462 1550041 1388779
10673 1388779 1381405 1313136 1286633 1255386 1365326 1407389 1308619 1161735 1159077 1100693 1415625
10662 1415625 1509164 1449520 1707792 1787147 1975696 1689806 1774472 1938977 1953715 1852128
10652 1852128 1815780 1827076 1911466 2078082 2153505 2162350 2433188 2633787 2642332 2607309 2664082
10641 2664082 2652954 2921102 3143829 3182936 3498430 3394951 3455498 3577466 3810236 4246982
10631 4246982 4414297 4711373 4976901 5316991 5688393 6234036 6876474 7587963 8221552
10622 8221552 8714923 9535232 10627051 11995745 13889470 16074361 19005032 23051282
10614 23051282 28564469 35816676 44692698 54295342 63314484 70906712 77125844 82042006
10606 82042006 85479882 87854471 89926236 93489956 100600540 111858477 127286664 144252471
10598 144252471 158886573 169929009 178218681 183430651 184697613 182174465 178645599 177926914
10590 177926914 183015985 194828156 212314411 231081215 245715123 254410707 258132547
10583 258132547 257693036 251315457 238746517 224004090 212324846 206162017 205578778 208877293
10575 208877293 213263181 215321240 213837990 209653172 203121612 192926763 179274824 164752569
10567 164752569 152304003 143127592 137158379 133557898 130685208 127250445 122668035 116913092
10559 116913092 109894361 101362928 91933306 82478057 73776913 66215507 59861172 54163678
10551 54163678 49121436 45006476 41585648 38641183 35966824 33458086 31437498 29840828
10543 29840828 28333564 26823512 25648972 24543582 23376473 22565766 21485734 20451895
10535 20451895 19665982 18999850 18271458 17403871 16819373 16590027 16130602 15497106 14909177
10526 14909177 14552409 14104651 13768415 13547822 13211587 12740787 12067913 11643375 11422795
10517 11422795 11037841 10707397 10577493 10437303 9984403 9605741 9124853 8905707 8742324
10508 8742324 8653744 8592309 8398893 8259312 7722565 7347663 7191156 7220855 7029691 6882683
10498 6882683 6668554 6432048 6205973 6094194 6097051 5719685 5395384 5407104 5242715 5081762
10488 5081762 4949514 4853012 4653342 4748862 4717047 4390921 4060199 3945501 3918230 3929245
10478 3929245 3881725 3710951 3264487 3234595 3278167 3133627 3053406 3024189 3089901 3309159
10468 3309159 3281486 3204750 3212057 2930910 2582526 2617837 2720523 2495377 2444588 2564055
10458 2564055 2591924 2421922 2427988 2530832 2351546 2131407 2266571 2320482 2231123 2252939
10448 2252939 2183714 2000356 2153938 2174889 2002619 1904237 1912743 1933866 1853207 1664749 1640789
10437 1640789 1575595 1629155 1724238 1595954 1604127 1633758 1456162 1401842 1345446 1225230 961104
10426 961104 729533 972339 1136305 1104843 1211202 1235761 1034164 786485 950042 1045989
10416 1045989 1109013 873072 512777 443302 505540 823880 877181 757406 862812 830730
10406 830730 810196 793647 691100 717335 700408 660179 390642 349025 327020 114682 131768
10395 131768 290482 368370 519613 557725 478327 419866 246324 85505 131429 228203 39846
10384 39846 31197 81573 32292 45449 -49827 64564 131082 -11237 -15508 62859 -148964
10373 -148964 -79112 112681 -66447 -234759 -58695 210041 347328 201503 260400 109079
10363 109079 -22840 265682 360961 176898 112549 51553 -81635 -187782 14289 -77645
10353 -77645 37193 89377 186294 228785 274779 106479 -119255 32204 307209 232158 221196
10342 221196 -36400 -201220 -282503 -87620 347682 412890 454330 352492 301319 341290
10332 341290 201992 -35382 6483 -36366 254061 502278 569230 655932 551446 282028
10322 282028 146760 131378 211223 368049 303971 254971 184514 115984 192391 72952 72292
10311 72292 74460 131195 -45290 -213343 -89542 -40383 98457 125488 46941 132388 104488
10300 104488 172356 49506 83735 159889 -90846 -226304 -137812 -109679 -130468 -69930 85723
10289 85723 295660 395960 202358 94612 -34027 -149446 -126803 -12676 20177 -48407
10279 -48407 -57188 -79695 -5273 49038 -55746 -242071 -201931 -94519 -143814 153644 207355
10268 207355 34954 80582 39902 25928 -25164 -44367 40124 177572 135168 -90055 -223844
10257 -223844 -281884 -115617 250054 38265 -104202 -51778 -210055 -360995 -347293 -358594
10247 -358594 -395111 -269582 -192519 -31434 53169 -23133 -84254 -238890 -365288 -361593 -420803
10236 -420803 -522204 -167502 -271588 -334204 -445248 -463638 -581906 -441666 -144930 34286
10226 34286 117749 62069 3375 18236 -46212 32162 125042 154414 50533 -168328 -317868
10215 -317868 -279693 -126520 -56024 92344 176645 45434 -215352 -485337 -431159 -178652
10205 -178652 -92574 -176143 -327398 -280249 -231511 -207429 -323922 -249316 -398643 -521224 -417106
10194 -417106 -288862 -293828 -190075 -347881 -244108 -162726 -137012 26457 189439 -86564
10184 -86564 -226938 -36018 155455 272820 301136 476558 706173 534026 246572 393751
10174 393751 522483 485401 498391 374863 556174 330426 254991 362656 298528 215557
10164 215557 367260 391653 427560 677279 937800 884200 914956 1166025 1151397 1267362
10154 1267362 1297865 1198315 1338312 1358554 1300913 1262216 1471663 1728127 1629691 1540896 1313919
10143 1313919 1283395 1251273 1407388 1415945 1425386 1457042 1432497 1215817 1090315 863905 659471
10132 659471 658602 725557 624651 509255 617987 731981 725649 747316 750517 571664 552914
10121 552914 407328 269428 150959 160416 250161 137502 137525 128252 123597 219743 434718 394447
10109 394447 302216 337165 430273 402540 381041 231415 -55606 110593 292977 408009
10099 408009 435873 399643 366157 175880 -27227 -104035 24179 155761 131149 110412 360637
10088 360637 574538 727419 1020326 1252788 1478315 1658575 1588148 1534444 1604273 1312283
10078 1312283 1096017 927035 813387 722283 739573 748394 780941 825078 773138 724275 565256
10067 565256 586522 726337 443692 131116 227428 494164 550698 459444 309854 279739
10057 279739 347081 339931 418343 370580 603766 1046350 1548153 2407683 3086789 3395540
10047 3395540 3524187 3745708 3810733 3549655 2891159 2215142 1962894 1578052 1298302 1285341
10037 1285341 1113916 830243 889346 985922 1005969 818091 687435 619503 457949 489946
10027 489946 609588 605068 487899 341117 113391 51193 56246 -38795 -12593 75871 145896
10016 145896 196999 101518 154439 -54173 -123340 -38961 -113009 -20070 -92697 -95282 -37033
10005 -37033 -169562 -93326 8139 -79391 14768 83903 41159 -11885 47466 88859 -77837
9994 -77837 27928 29212 39759 -92448 -309160 -471043 -166024 75133 141001 18952 -160689
9983 -160689 -158979 -75445 2286 -61762 -139776 -130023 -127293 -369374 -486147 -327039 -333685 -426157
9971 -426157 -530049 -616970 -394540 -73411 64329 141809 180238 107925 15687 19348 -14858
9960 -14858 -218741 -270243 -142523 -201436 -286897 -304122 -322977 -184787 -116468 -49295 66971
9949 66971 7309 -129156 -384426 -447036 -563200 -490925 -529885 -737163 -584631 -463733 -477789
9938 -477789 -349293 -114693 -13353 -113630 -212311 -278346 -174970 -50210 -24032 -145913
9928 -145913 -178728 2225 207950 373671 403867 447462 390871 157078 -96955 -163868 -265403
9917 -265403 -230655 19073 153495 -12575 -87263 11350 107426 189977 69814 -75436 -288009
9906 -288009 -242486 -107032 -142618 -110679 -114643 -177811 -180744 -65606 124059 135971 133887 14540
9894 14540 1041 4581 -49352 -56542 131928 96975 -26908 -151166 -260849 -160017 188079
9883 188079 155264 177382 199440 158404 279322 228087 178747 68000 90365 191658 212441
9872 212441 93581 113893 122564 90757 72710 -98076 -231561 -261826 -480313 -411998 -90307
9861 -90307 159093 259788 134514 -184586 -323107 -282805 42679 50103 29656 86751 292951
9850 292951 66693 9114 200484 72306 103361 109696 24136 94521 134746 216576 273304
9839 273304 291754 535158 408043 491651 487193 441685 382163 127218 199821 470855 288983
9828 288983 206325 34103 139218 307028 122586 -79229 -39107 -10347 93769 21723
9818 21723 5477 41936 248487 275314 84297 -7954 112507 29194 115537 261979 222692
9807 222692 121793 112994 213020 238794 144593 155895 222553 134245 -5381 50541 137266
9796 137266 85946 355149 544983 619384 570913 497725 442752 366250 325688 472993 512660
9785 512660 596761 845394 930088 941311 1248842 1578687 2325194 3385649 5502674 8480268
9775 8480268 11251919 12848169 13586043 14037329 14195222 13216557 11028313 8812166 7227463
9766 7227463 5950882 4776929 3843312 3113545 2945052 2924241 2444482 1992310 1579318
9757 1579318 1453306 1342167 1178186 989088 812632 692895 711840 664044 743158 649481
9747 649481 622344 413766 193257 235812 281952 392981 208774 370326 341355 414872 588353
9736 588353 672812 519720 439628 428493 374188 248467 213186 224352 286734 306914 311844
9725 311844 332453 319735 244336 188452 57322 46359 105678 278928 212936 72334 -6396
9714 -6396 24485 195402 274050 211732 208634 409897 324965 27924 48770 174907 173098 164245
9702 164245 416693 442416 221261 3652 20301 -136736 -114235 -36527 -29712 163040 187232
9691 187232 859 -55543 61411 120409 123442 80828 68992 112280 272058 -4057 161722
9680 161722 252613 401016 169419 7142 104691 191636 96217 -19210 -119836 -142401 -139567
9669 -139567 -90914 -82666 -49928 33018 -120643 -268368 -349708 -216398 -29827 218487 166763
9658 166763 159481 411320 398023 329437 246758 89742 312834 354863 360222 469032 534327
9647 534327 493651 213481 90094 93070 2036 -102233 123644 320834 345846 215557 98164
9636 98164 123787 37382 -65766 -186060 -241094 -43586 346594 401541 203735 27609 -114295
9625 -114295 -266046 -285265 -226290 216613 309256 64564 183675 271468 271752 301961 37976
9614 37976 -235142 -34587 436661 405235 192783 236460 356039 239461 99224 64285
9604 64285 218278 121935 -99459 -4368 169194 47562 -153213 -57191 174023 177419 150377
9593 150377 -47316 -112387 108732 181772 -4550 -1984 152391 118517 -49990 60909 -34800
9582 -34800 -79860 -86542 -169961 -145221 69675 145222 248123 143541 1557 -139330 -195804
9571 -195804 -4211 -54438 -225966 -302854 -186962 16085 -70146 -101960 118840 2712
9561 2712 -51875 -267487 -332829 -263211 -214495 -205822 -76066 -54873 154963 130936 -81573
9550 -81573 -140906 -15471 -94651 -267547 -358866 -212728 -25389 152287 244484 56663 29734
9539 29734 52620 10293 -52377 -212712 -118044 -163533 -128513 24570 95894 169035 211924
9528 211924 142621 -194950 -248824 -204522 -70931 -99507 -192553 -220472 -251034 -239596 -299478
9517 -299478 -378884 -161942 -87650 -436019 -446947 -338572 -43751 161942 152016 -68384 2692
9506 2692 9469 12896 -38271 -60909 22777 -61025 30305 -47237 -258935 -294907 -346569 -289541
9494 -289541 -198758 -144956 -110450 -20163 7510 201788 421227 283597 441059 527378 712730
9483 712730 675260 445296 375778 518089 563644 581675 634870 450116 417195 360939 337107
9472 337107 321078 179352 142104 70427 -26489 -11875 -89734 -34857 81644 65041 59463
9461 59463 121206 -45040 -186968 -130918 -149737 -209039 -59563 203198 270373 230901 128829
9450 128829 -37600 -120441 -123825 -221976 -135580 -137807 141718 69085 -193479 -234128 -262530
9439 -262530 -339991 -313585 -208129 -131508 -206468 -259897 -193435 -99327 -87251 -447645 -735023
9428 -735023 -561030 -396163 -207992 -57607 -154689 -36635 -132911 -280517 102342 217349
9418 217349 21806 -127951 -182284 -142770 -52743 101835 118650 -64024 74393 -1924 -92873
9407 -92873 2118 175904 347141 227858 188574 257589 241414 162858 -49902 -16612 176130
9396 176130 279466 234513 -189693 -262152 -246658 -206084 -189929 -212100 -105076 -55043 98776
9385 98776 200256 16627 -220000 -397312 -483900 -326708 -309782 -406072 -334598 -278920 -260430
9374 -260430 -162523 -250108 -371626 -360839 -398127 -303384 -338909 -166956 38635 -163310 -366658
9363 -366658 -360082 -303924 -300557 -183760 74871 149051 -116434 -261949 -489271 -672405 -656257
9352 -656257 -640367 -372142 -256248 -27476 -192013 -399832 26497 269647 269931 270657 205621
9341 205621 299920 194401 87439 -25495 -46529 -151519 -300625 -268368 -239800 -379837
9331 -379837 -379819 -178163 -57889 -206780 -327269 -49064 127738 174728 175359 -20646 -86556
9320 -86556 107927 125160 49614 -123292 19699 155507 61917 -106004 -71304 -187230 -274910
9309 -274910 -102016 116217 296340 80410 19084 63804 208129 113163 -41691 -129749
9299 -129749 34870 43214 23819 -10276 -16540 86662 221086 153181 -41613 -137959 -108261
9288 -108261 -135443 -158033 -21627 137147 132325 263989 90841 -64034 -230548 -248002 -167610
9277 -167610 -322460 -448714 -146798 246469 129456 131750 178852 173411 157435 -141674 -337744
9266 -337744 -559369 -648111 -415885 -76685 142935 99839 17544 168091 200640 38399
9256 38399 120865 90037 -23726 -21903 -116565 -75403 43065 -17820 -126078 -204853 -87799
9245 -87799 -54030 35248 30007 -124602 45958 114706 14787 -5641 -92968 -207678 36658
9234 36658 204364 -73566 -164729 -279451 -453155 -720222 -738739 -744699 -556988 -213973 135514
9223 135514 46668 -236974 -67798 56923 38571 -28108 -94274 -149101 -335565 -539901 -487078
9212 -487078 -321810 -113903 -138502 -145904 -335038 -288526 -248680 -246523 -246648 -219783 -285263 -218088
9200 -218088 57697 242907 137036 122450 78252 -43753 -49075 -97859 -134096 -105262 -39069
9189 -39069 -118191 -171723 -258314 -360059 -415617 -529533 -454048 -321311 -58433 125200 -100747
9178 -100747 -132130 -18533 176398 331585 184304 -175274 -183344 -187280 -387035 -429922 -351246
9167 -351246 -304805 -275997 -274773 -246456 106013 322410 258878 -78436 62407 193116 67726
9156 67726 53189 -117574 -65960 67146 -61668 -264896 -244282 -154516 -460544 -745244 -460350
9145 -460350 -234474 -133773 4159 100469 -208039 -331230 -250597 -235714 -268550 -252578 -187191
9134 -187191 -139556 -321391 -530493 -560479 -472702 -348889 -117445 -59090 -154073 -259887 -462189
9123 -462189 -351840 -239425 -57272 140200 306313 197445 172726 203545 186888 216425
9113 216425 240428 280866 248460 -64105 -112997 63925 108557 18773 -61087 -267538 -344511
9102 -344511 -294324 24670 238322 223473 219076 69069 -82526 120007 285730 218998 -20657
9091 -20657 -183834 -276902 -538628 -425447 -238315 -147215 -123152 -29096 187326 62125 -215909
9080 -215909 -387152 -152179 -55531 71910 63572 -60567 -36204 -137766 -357916 -197999
9070 -197999 8625 149511 231136 197076 121980 224747 161945 239757 119969 -31727 -52013
9059 -52013 -167362 -228745 -337235 -208194 104539 293473 156285 149268 281789 454603
9049 454603 381227 266422 54548 111084 136490 96062 17382 -52023 -13761 -5073 -63911
9038 -63911 -65882 112649 134465 67234 -38463 -35361 12059 119455 143222 -13902 -20857 -125842
9026 -125842 -171761 17924 35756 326685 263287 257958 191711 121575 -58219 -170876 -191925
9015 -191925 -149713 -116232 -243755 -409363 -237766 -308025 -352556 -394404 -360200 -281933 -342721
9004 -342721 -250649 -278366 -83005 -87222 104225 127598 204574 203595 -6769 -173259 -201755
8993 -201755 -111890 50165 -48743 -172898 -73034 246772 361778 136678 -27363 -40680
8983 -40680 -5705 84038 -110776 -263970 -302939 -230557 96237 177354 298 -17794 212062
8972 212062 259597 200622 149003 -40801 -195260 -181859 -51350 125210 21052 -93981
8962 -93981 -217560 -69931 220907 63953 -181831 -83889 -146006 -216603 -271045 -265234 -243673
8951 -243673 -57688 29734 58654 184550 412560 215622 160770 6293 -128731 -172740
8941 -172740 -266280 -181604 -244944 -269370 -104794 93814 53903 79401 182975 199376 218309
8930 218309 273638 164253 -92876 -15227 129465 250336 346733 501373 378438 199872
8920 199872 -1457 -55278 13446 244773 332053 248060 206274 81508 -222480 -428988 -351742
8909 -351742 -475964 -429972 -270044 -218200 -46093 111847 147395 184267 107776 -203384 -357031
8898 -357031 -272356 -15628 -11861 -175213 -318218 -461613 -367749 -132491 -40682 241189 123777
8887 123777 -255539 -291913 -130467 59627 190840 -8247 19397 -1018 -208706 -7429
8877 -7429 77887 23298 -266392 -332925 -349872 -479556 -575262 -378842 -314974 -386453 -451681
8866 -451681 -386779 -273719 -200208 -92644 -32633 -131510 -354767 -373151 -413617 -253077 -144371
8855 -144371 7739 -27258 -187312 -153222 5368 39371 -151081 -54789 222665 226012 252879
8844 252879 482857 711074 417035 213443 45355 -33264 -136214 -166284 -31538 137462
8834 137462 247376 626651 960757 837336 536790 470576 526212 831097 864365 653712
8824 653712 434483 443102 327019 254142 322632 308756 284706 193196 199673 170518 57246
8813 57246 140215 278751 298894 334005 314636 259206 -22507 20925 -76453 61123 137695
8802 137695 64223 -159076 -58948 12308 124083 171424 143477 170213 118892 60180 68834
8791 68834 111758 161265 79444 121070 144970 -4831 2435 148832 300936 463602 536578
8780 536578 393512 185920 307236 584543 395582 363564 333213 98779 187571 151898
8770 151898 247802 330592 450211 281105 278212 350183 172729 92530 -6579 -74421 -141125
8759 -141125 -204087 -217579 -113974 -74364 97149 152351 -136476 -164955 -141188 -75920 -168840
8748 -168840 -55157 215071 191098 235039 179736 137150 122836 186696 171005 192923 282508
8737 282508 124538 252856 246245 43277 -207243 -40855 73430 100455 50052 -132769
8727 -132769 -241849 -56588 194970 80558 -77922 76822 104847 141748 147718 5601
8717 5601 -264941 -250580 149489 371669 478823 414803 474582 482288 271649 273158 302930
8706 302930 201591 45730 -127024 -314896 -276861 35877 206154 161989 95988 259975
8696 259975 306068 368010 383058 398562 303796 288027 384271 460753 196299 57221 204572
8685 204572 89011 4224 35578 -123179 -3051 -35270 99037 105915 -185561 -146793 -6981
8674 -6981 6822 12314 -32275 59999 113744 306339 368564 317418 496984 526195 458206 396863
8662 396863 194692 87595 4963 238125 522324 598559 650579 639204 285952 100630
8652 100630 13492 -12742 -242638 -177445 203306 353976 405709 528789 526533 456129 495382
8641 495382 388727 300945 291723 242279 329594 219135 197945 463025 525724 542125 551666
8630 551666 455277 344633 445924 459002 270665 344765 425318 537304 905820 1270200
8620 1270200 1224428 1009417 804522 583519 530988 557750 789300 824424 819166 871762 846339
8609 846339 785396 730620 555676 519314 646416 873639 978493 1013165 1081289 1332358 1391761
8598 1391761 1446396 1557399 1841111 1896044 1670237 1533413 1368789 1419226 1627556 1718297
8588 1718297 1605769 1376146 1479074 1554854 1502853 1487459 1149869 1045675 1033281 1079605
8578 1079605 1072080 999347 996226 986987 974287 1206511 1319882 1137062 923944 783900 862048
8567 862048 985297 968699 826839 718775 628964 609074 487167 546378 512366 568563 803356
8556 803356 873121 692638 595962 663810 557971 339854 120873 190405 423247 393249 383370
8545 383370 283084 97263 89814 211039 184578 297417 37387 1659 37961 286553 274850
8534 274850 298157 468527 420659 645478 1121247 1644150 2584485 3450497 3685791 3720516
8524 3720516 3857261 3744269 3308614 2634591 1972124 1662631 1324061 828926 682884 717609
8514 717609 726305 807232 808647 788263 880931 1175664 1095087 850238 666939 508628 412371
8503 412371 224499 172797 192083 63417 171302 423868 662874 826961 882433 868379
8493 868379 905736 1092186 1244958 1233280 1252368 1465416 1829996 2042736 2410644 3385135
8483 3385135 5193054 6595330 7121829 7221932 7295163 7289358 6723925 5395943 4140650
8474 4140650 3439279 3031562 2548237 2153991 1712464 1596092 1587582 1636960 1511215 1442772
8464 1442772 1217507 1245326 1342223 1441134 1489291 1163429 996416 1143818 1278930 1313853
8454 1313853 1315508 1252062 1020669 954959 707207 654474 895494 1096780 1087142 1216316 1368020
8443 1368020 1422633 1463515 1695656 1823480 2393385 3385573 4040465 4163605 4333862 4243431
8433 4243431 4111442 3816816 3321919 2774301 2519771 2289065 1924462 1591511 1611353 1616660
8423 1616660 1380396 1332361 1363861 1176187 955472 943526 1024281 1151202 1111313 880566
8413 880566 468661 545840 509276 617148 826538 861706 758481 570746 679695 848057
8403 848057 736392 430156 244852 519605 503188 321653 398509 426665 496958 570397 398640
8392 398640 333133 331118 325099 159778 72816 -106846 73589 256616 377992 463282 183585
8381 183585 -16740 -93324 105488 350181 340612 402038 305065 92350 208463 261629 207882
8370 207882 285015 147298 60421 115306 232345 82628 162574 189015 124949 -88570 -37079
8359 -37079 130315 111427 221365 129914 108739 21910 -129406 89606 137448 115341 24144
8348 24144 120260 161936 -149518 -264681 -94957 42439 57004 -68307 -54751 -57515 -57881
8337 -57881 51573 193563 255658 118090 128801 65259 69606 27986 69456 202652 260945
8326 260945 236662 127990 64102 89055 301691 341619 180728 -139930 -290368 -34039
8316 -34039 375552 436126 312278 205974 350191 399306 278808 268040 336435 83721 -25374
8305 -25374 -142482 -236135 -483253 -393645 -335469 -179471 138962 68458 122045 332724 433878
8294 433878 426348 512171 534767 302298 -5444 -116135 78244 269437 341332 304733 221829
8283 221829 177392 323813 320338 235633 4855 -205044 -130023 123685 208963 -273468 -353262
8272 -353262 -69861 19797 91631 -1101 -81782 -81094 84900 176554 107762 248360 191619
8261 191619 270339 483781 500985 261883 133779 181609 314545 357139 202538 155729 -31457
8250 -31457 -87829 147046 228283 58336 -72362 -56522 -140718 -67844 -78735 -340923 -344285
8239 -344285 -178220 41624 57750 -138455 -35269 156599 336341 372990 505778 430323
8229 430323 204487 293188 259983 59176 62354 105866 252407 250324 123490 252798 368702
8218 368702 273077 -51984 -101328 62073 204823 142639 137308 134525 87228 260570 315317
8207 315317 92446 -191293 -201611 -161637 -305704 -331908 -274817 -164811 -44165 -161514
8197 -161514 -138569 -134650 2247 158906 23474 -139559 -287888 -450467 -296727 -157706
8187 -157706 -4623 -11040 -150702 -303461 -240722 -197411 82870 35786 -139307 -195669 158465
8176 158465 447889 288806 162999 172095 143666 157580 119481 2477 -44940 -82218 5573
8165 5573 44898 -65346 90686 116458 -82614 -222705 -289247 -246499 -348267 -226724 15348
8154 15348 26422 24331 -128446 -329688 -547629 -562764 -315292 -45959 27864 15765 129984
8143 129984 216399 214851 83356 100895 83861 239345 278469 243860 274438 169621 245547
8132 245547 387129 246736 36856 -199854 -483493 -278773 50795 149734 116217 150022
8122 150022 198084 5596 -9194 160729 141312 -23591 -90985 -253880 -86895 34082
8112 34082 -104920 -220505 -360764 -167415 -104350 -196314 -174496 -67086 -8401 -168304 -465835
8101 -465835 -173309 144852 386041 428504 394470 402921 255950 117491 176127 214658 162934
8090 162934 37162 -256837 -356090 -411212 -434913 -201024 2717 77281 139446 38592 56112
8079 56112 56853 -73697 -142254 -227343 -207913 -242936 -84212 -51842 -86378 14227 164306
8068 164306 63775 183257 70646 -109504 -263804 -194879 -59061 -14636 13035 -102973
8058 -102973 -148115 -10726 106584 232861 253018 295448 119048 -112512 -213700 -204868 -11323
8047 -11323 36586 -44462 -62981 -275648 -98785 -10666 318535 401847 250929 190342 38220
8036 38220 9325 73972 15068 -149031 6042 340587 209934 32858 124057 112504 69538
8025 69538 168542 197364 272449 371581 282840 236812 214312 76189 244126 189348 405355
8014 405355 631624 604037 405184 322241 351918 112188 179599 387000 403736 493850 466473
8003 466473 458262 450828 357894 357877 256028 180538 230773 302850 359499 242754 304907 377549
7991 377549 391515 457029 471429 510182 580197 788229 1051367 1574496 1536143 1472480 1289491
7980 1289491 1243983 1321650 1554108 1392162 1252750 1095249 856165 832934 945481 880579
7970 880579 731060 810602 606131 507896 699772 806193 607799 420773 201896 206814
7960 206814 203213 313656 365753 340019 268713 53524 81626 193527 252953 370569 391482
7949 391482 378493 271797 413299 392374 495794 667160 671217 649254 716908 1200971 1426926
7938 1426926 1581187 1427618 1139559 746141 721791 958034 869638 759209 673065 511131
7928 511131 501326 570623 611869 498543 285036 194188 247430 309119 400138 300885 394040
7917 394040 397269 230073 584132 531772 325742 338922 284802 362716 521656 551430 355487
7906 355487 324966 292489 282329 331913 179720 94180 39319 -20510 -91879 2332 -84463
7895 -84463 -31966 119324 363692 460475 467551 431783 448662 366076 446844 405784 313298 298294
7883 298294 137042 -58513 -48578 -56614 5094 104643 147132 149595 275066 193087 278180 161945
7871 161945 36225 -1283 -246009 -276260 -268112 -300418 -78457 143790 -26958 -107309 -143040
7860 -143040 -253545 -437710 -457604 -441498 -280180 -6963 -43948 27233 5035 218882 154036
7849 154036 -45363 -131505 -159573 -286271 -99229 -40284 167613 279672 254360 159490 83493
7838 83493 121372 44384 70987 39674 -151139 23749 -35778 -97425 8915 17751 -78907
7827 -78907 -169639 -193115 -63853 247982 154975 81702 -72911 -125200 -107611 -63748 63856
7816 63856 296374 231259 -73672 -178085 -284929 -394260 -449733 -157635 -13494 58740
7806 58740 238143 190224 113959 29947 -85637 81573 -91348 -196891 -145545 112060 129490
7795 129490 128185 132042 149007 235515 236350 19996 43 386100 382792 176602 248622 261324
7783 261324 743 -324021 -81006 76817 193410 56350 -188007 -245228 -163730 -78323
7773 -78323 -8343 -46400 -32998 -73642 -78158 -82635 -57528 107775 111120 122881 -144658 -310949
7761 -310949 -212670 -257841 34548 118208 -64802 -171384 69246 106591 28028 81541 -41867
7750 -41867 -227388 -435380 -391717 -195699 4351 -3402 55535 -18144 -38637 47058 -154948
7739 -154948 -64757 -131618 -200323 3381 -8697 -13438 101703 197514 347893 342477 291275
7728 291275 182310 207377 247045 135357 -140146 -326997 -420996 -251505 -260992 -192517 32725
7717 32725 91433 44234 -82528 -201958 -46202 112516 -15422 -125559 -73596 -103754 -372383
7706 -372383 -151688 -28778 -19193 -8664 74835 199573 94123 118251 157049 104924 -35387
7695 -35387 -12822 -27707 -120564 -185401 -36142 -66310 57242 84086 61577 -11251 195159
7684 195159 330589 77784 -142254 -22733 -15813 45685 -47325 -215439 -155423 -116665 -70602
7673 -70602 -157351 -331569 -42088 -166946 -276963 -255789 4755 80940 -58039 -72891 -165035
7662 -165035 -649635 -846946 -670336 -426696 -257455 -183106 -165787 -170482 -320016 -331544 -456881
7651 -456881 -187186 -190762 -227337 -176575 -190651 -364319 -437513 -456370 -413286 -466594 -455337
7640 -455337 -482701 -469036 -276758 75084 264251 205080 174063 243679 -124263 -360229 -140686
7629 -140686 -191393 -392778 -496851 -253139 -208140 -200757 -154559 4851 -128586 -243337 -102379
7618 -102379 -51418 -156738 -263209 97146 25102 -109804 -40442 -86716 -103849 -97820 -216365
7607 -216365 -404608 -521556 -259230 89646 24655 -33248 -174289 -150162 -39335 89303
7597 89303 -34556 -214087 -50871 158284 84015 232813 227571 128184 -31696 9279 -34549
7586 -34549 -43275 -155470 -291355 -300654 -250699 -88608 -157162 -94357 -52397 110878 -27178
7575 -27178 -211772 -136903 -92999 -283766 -304360 -77491 3910 -74608 -96878 -120955 -154263
7564 -154263 -99704 67056 -45825 -148709 -146992 -155391 -253149 -105959 -125114 -143562 -58189
7553 -58189 -107228 -154672 -167968 -229901 -136258 -108652 -154299 -300881 -286856 -77619 -196566
7542 -196566 -285790 -160341 172211 212098 -32486 -86727 -120355 -52362 -213628 -340316 -424657
7531 -424657 -409463 -390068 -196162 -45971 54188 -183008 -365936 -419152 -352273 -420626 -505784
7520 -505784 -426533 -156492 -31707 -103031 -324824 -451800 -402622 -259027 -264898 -103110 126897
7509 126897 -145225 -197656 -95123 -85730 -95373 -161564 -184471 -184657 -164626 -114192 191068 183757
7497 183757 87012 -173020 -268048 -218599 -194728 -345405 -489380 -514316 -447329 -279570 -166732
7486 -166732 -186737 -126198 -249828 -290883 -248587 -287487 -152293 -186173 -342433 -157750 -76211
7475 -76211 -78832 -95354 -77357 -179280 22329 228718 207052 131352 -44494 -168120 -120680
7464 -120680 -121054 -203127 -66627 -178506 -193684 -344406 -465417 -279594 -74722 163032 5967
7453 5967 98578 288477 260732 292210 366520 284682 -12696 -161802 -100404 -194449 -209836
7442 -209836 -128347 -36970 -11712 -17710 -4115 29738 67857 -56592 -148460 -203084 -245399 -274500
7430 -274500 -242374 -288167 -296541 -451753 -291538 -39371 -10024 -81721 -99428 -207064 -204180
7419 -204180 -96287 -150665 39793 227436 283835 199981 152955 103254 -128450 -240416 -125575
7408 -125575 -87087 -135457 -260221 -125431 -12703 -77905 -108430 -30680 -134349 -194438 -163930
7397 -163930 -281462 -418582 -332918 -227079 -204952 -144290 -370730 -361104 -117436 -98801 76069
7386 76069 139216 148865 7756 -190492 -326423 -286746 -360578 -399394 -113137 82815 -10813
7375 -10813 48984 -53130 -81803 -242224 -104204 73770 43516 -215420 -267528 -63975 97463
7364 97463 129404 166391 13112 -25920 157241 -4662 -141449 -324955 -348037 -230986 -389370
7353 -389370 -247558 -299013 -117575 -45314 36209 175509 121231 94288 -58709 -85191 -7622
7342 -7622 -90394 -74774 -191297 -105740 -24415 196248 182575 -88620 -28428 -67876 -177888
7331 -177888 -159014 -132573 -1776 -131643 -262943 -401254 -409802 -521605 -640025 -583248 -574812
7320 -574812 -546347 -394647 -252647 -400303 -342877 -269225 -251590 -342727 -439858 -340657 -148462
7309 -148462 54229 -8320 -28894 -138487 -95953 -194907 -305268 -318111 -247339 -194859 -175944
7298 -175944 -140897 -46039 108839 2009 -139742 -141225 -42444 45305 24433 1691 160010
7287 160010 -91744 -184454 -99968 -129474 -258790 -280050 -379181 -509215 -264344 -140588 -142859
7276 -142859 -52501 30780 -8281 -105085 -293440 -337373 -325068 -358739 -255487 -253726 -209025
7265 -209025 -65364 -111835 -1615 -96834 120611 317761 259669 245676 158406 37054 -1692
7254 -1692 -9520 -50619 -3118 36067 -192876 -158994 -16472 118042 120620 41055 258487 334561
7242 334561 114221 47480 -49315 -111234 62036 182739 43959 -138687 -153945 -203648 -98543
7231 -98543 -58440 45813 78648 261811 291622 237705 148434 -53012 43288 -6666 -106942
7220 -106942 -64777 -125394 -361026 -350257 -142327 -107931 -2463 15016 -30811 211175 232851
7209 232851 224654 64020 15067 -34371 -108094 -38374 13357 10632 -76518 -276623 -500728
7198 -500728 -336375 -201849 -74404 -374 201716 10846 8712 -69412 -244620 -161958 -70074
7187 -70074 -109876 -374006 -374616 -283170 -295489 -165752 71618 199192 193401 -84335 -275504
7176 -275504 -276290 -407099 -559415 -444392 -173002 -163862 -201015 -166207 -263442 -97118 -124386
7165 -124386 -454951 -561926 -581926 -503063 -500682 -484581 -239923 -197733 -268567 -184890 -272022
7154 -272022 -47840 94385 45523 73434 -28358 12139 -159139 -475993 -362815 -225429
7144 -225429 -26841 79498 -13157 -67568 -250347 -179143 -246491 -367557 -86837 52761
7134 52761 -111324 -266290 -373632 -274237 -83259 -35605 14836 -60647 -183208 -111561 23357
7123 23357 6373 -159572 -254381 -258454 -163169 7644 97691 -27786 15361 90972 94831 99470
7111 99470 358 -231194 -87166 87848 57249 87797 153088 197962 412192 349799 141424
7100 141424 172474 106152 -117438 -340782 -294809 -308517 -160134 -332155 -467415 -160452
7090 -160452 -240963 -274561 -14218 145936 116466 115395 114669 -178177 -155407 17091 -132639
7079 -132639 -256042 -251183 -23565 29378 -84846 -17234 -118052 -165473 -242855 -116781 -96403
7068 -96403 -112359 18923 82826 116546 -206326 -204394 -274098 -291464 -203822 -32197 45398
7057 45398 14734 -238177 -316314 -194770 -205047 -132136 -151230 -220231 -100693 -102103 -166059
7046 -166059 -62949 138139 150394 -31124 -39267 -14461 85716 177844 -72372 -151888 -13226
7035 -13226 51446 -11030 -76268 -213485 -66181 77124 -72642 -157743 -195361 -149289 -151240
7024 -151240 18791 -23445 -128007 -87409 100150 118523 90477 38180 80662 93970 45167
7013 45167 -188387 -267275 -114121 110468 67107 65215 5967 -48298 54694 16901 -8052
7002 -8052 -24421 -237652 -366924 -324994 -206515 -283606 -324135 -141972 104168 131234 162933
6991 162933 87393 101263 -51350 -59617 155470 211358 115418 4999 14727 -51167 -106542
6980 -106542 -214151 -192048 -186058 -227031 -308147 -344753 5011 213979 127817 -4391 -51313
6969 -51313 -184698 -225982 -273577 -209042 -133093 -97863 8769 -79448 -172199 -124537 -311211
6958 -311211 -294128 -388494 -480151 -261779 -354510 -426691 -158858 15873 73121 3463 68478
6947 68478 347243 518951 266591 348005 309913 52585 101459 162867 -10445 -144131 -118778
6936 -118778 -194331 -112054 -171126 -98698 -47659 168609 60064 103103 29185 -4799 -26444
6925 -26444 -103894 -33024 16097 18344 -115437 -94873 -125343 -151455 -211020 -55415 -85511 35509
6913 35509 230631 88132 -112398 -146177 -138369 -55212 36733 9577 -49366 12481 5261 -108020
6901 -108020 -6576 -236183 -291340 -120206 43538 153319 149568 -21171 -187602 -188880 -178210
6890 -178210 -223358 -119564 -102725 -130294 -37471 54887 117896 70976 311161 221298 121531
6879 121531 222614 321859 1636 -101688 -15989 83792 223397 237133 197288 233722 66245
6868 66245 137699 265654 466871 436598 263338 187953 29705 -17973 47059 -12299 -84098
6857 -84098 -16254 87486 227139 129172 60685 67870 -128829 39110 -18327 -178165 -222547
6846 -222547 -325766 -360651 -287979 -94309 -100993 -313507 -425710 -433277 -388316 -163506 93602
6835 93602 4356 -119185 -96617 -118242 -7445 -31536 -28043 238184 322189 194033 18720
6824 18720 3423 20508 74474 70377 20292 -121538 -132918 -215030 -417179 -176377 109688
6813 109688 97400 165725 153027 200027 -54614 -125102 -19359 11524 108901 175869 10360
6802 10360 -36206 -52859 -113239 -150458 -458532 -355117 -88616 -11251 176462 228296 124121
6791 124121 -36562 -178969 -151258 -291614 -192828 -77383 79283 216086 97222 -155492
6781 -155492 -171772 -199537 -134762 -139473 -61789 151020 359706 297230 131520 -75141 55018
6770 55018 207648 214548 64550 21307 192267 122281 -51064 -80003 -77420 -11217 -109438
6759 -109438 158288 201683 77274 -1306 -91784 -67077 -140385 -235657 -18297 232369 324384
6748 324384 246011 243620 111736 69961 98133 14350 -192823 -248627 -351859 -386161 -138334
6737 -138334 -90915 -215513 -226901 -84244 36569 108182 182363 134862 55755 130246 31212
6726 31212 46973 -81500 -144789 -42732 33134 15375 -128449 -135765 -85594 -136938 -246411
6715 -246411 -122312 124762 -25881 -397612 -346336 -244200 -164501 -181973 -38170 115026
6705 115026 81429 34610 177285 236158 259508 330356 204797 -14841 -236202 -154108 -33298
6694 -33298 84747 89177 -66315 -321549 -66852 133737 27926 -44615 -25795 -117054 -35347
6683 -35347 254469 423014 291176 39172 -7837 59897 -13228 -193283 -65739 34421
6673 34421 90892 -42510 -98730 -200011 -155275 60977 24 33387 -61701 -110450 9407
6662 9407 51784 60768 35591 -44982 -49668 -138843 -172213 -217039 -240854 -72178 -152213 -248038
6650 -248038 -309808 -336060 -50920 -149575 -213128 -147757 -131304 -28826 -187000 -143954 98605
6639 98605 314554 287971 409027 411942 398049 468140 226557 176811 333925 131026 104391
6628 104391 264817 379466 376708 92260 -41379 -158908 -22840 11562 -19694 114562
6618 114562 64909 -4875 -16359 62676 -215374 -370436 -237514 -321023 -348425 -291834 -301208
6607 -301208 -155950 -32623 -30939 -56088 -39333 -19948 73937 232141 255011 80456 -233550
6596 -233550 -450627 -486949 -307988 -179154 -229250 -211506 -71481 -118772 -88119 -93129 -192755
6585 -192755 -195333 -344935 -240938 -71354 -225 212740 269052 300258 284715 113781 -100752
6574 -100752 -211860 -348046 -426739 -185232 -342065 -328948 -112319 -164175 -160442 -154414 -137575
6563 -137575 -316883 -354683 -181944 -119034 -63840 20638 3902 194457 24956 -59649 -46636
6552 -46636 -97728 48695 156639 241247 364125 430335 418587 285915 146605 201086 94204
6541 94204 18861 52011 17988 12193 22898 118526 141531 112943 40557 -19666 33148 12136
6529 12136 209381 300798 135967 173650 269538 217528 196679 39862 -26119 -51579 -120401
6518 -120401 -207896 -177579 -260263 -336521 -329089 -213627 -168576 -155585 -79423 -241596 -232223 -255567
6506 -255567 -222654 -84888 -61756 -226746 -280204 -150159 -6865 -61574 -8158 -40279 593
6495 593 107174 35951 13068 -112401 -355500 -380676 -341057 -379911 -400720 -36025 -48788
6484 -48788 -106302 -154868 -151373 -168433 -232989 -225607 7137 84169 45607 -310226 -314843 -66861
6472 -66861 -40228 -2684 -22682 -177729 -157553 30937 198207 286658 332253 119548 41325
6461 41325 268604 335398 395839 343533 221845 221052 199742 240651 299001 289990 -48 -192814
6449 -192814 -473597 -585047 -643390 -553382 -489132 -526729 -496175 -256424 -408569 -569536 -376131
6438 -376131 -233825 -263076 -415586 -399233 -309928 -507079 -539581 -396398 -186748 -170044 -140344
6427 -140344 -22396 -97344 -154783 -384462 -380601 -337428 -155020 -185228 -286538 -333754 -338575
6416 -338575 -368196 -326648 -92693 194895 213985 -159777 -240084 -12029 -38939 19468 104767
6405 104767 -30938 -42720 221595 298171 177942 10303 -124819 -59361 -70717 95369
6395 95369 384246 165858 -123538 -216221 -230818 -150896 -281731 -349011 -166141 -3959 -85003
6384 -85003 -143198 -222433 -405834 -355466 -223348 -48060 91053 227779 202567 -71980 -280279
6373 -280279 -283847 -243121 -253380 -165855 -62737 38603 -25996 38031 290322 169913 -160299
6362 -160299 -457899 -404227 -337045 -163885 -192707 -293409 -250321 -195301 -315964 -141224 103631
6351 103631 -34523 -103906 -227007 -256957 -198318 -257046 -264427 -511033 -517965 -267572 -175052
6340 -175052 -45762 134134 213727 88624 104063 131639 50408 56916 -85487 -128063 16412
6329 16412 177625 170095 38541 143923 76030 21700 21126 22544 -14911 -209445 -319867 165699
6317 165699 307509 243671 202976 326817 321981 231804 24241 173951 438751 332122 181930
6306 181930 226441 286957 254137 105613 113244 146272 122868 -52896 -84465 -92959 -225357
6295 -225357 -358670 -506360 -384656 -204051 -307177 -449697 -509688 -263875 -183487 -18073
6285 -18073 -136555 -211225 27636 49544 -146706 -119795 88216 86424 122490 329344 412434
6274 412434 400337 254377 194396 155696 130013 7629 -51080 231542 210372 214092 138273
6263 138273 -76058 -178488 -345899 -297158 -289929 -335925 -89195 97381 -36407 -146419
6253 -146419 -320213 -489926 -485646 -322613 655 50346 -17354 156304 -26063 -258806
6243 -258806 -498679 -422539 -176922 250210 520524 467269 465168 294624 157714 -49632
6233 -49632 -346452 -513435 -286597 -183737 -149302 -93441 210310 135489 21946 -43148 -351
6222 -351 35217 96854 -28047 69047 -65114 -105307 -209921 -244825 -148723 -74653 -20380 13087
6210 13087 -56024 -148904 -247719 -90741 -9844 8574 14003 -143895 -227071 88885 92309 74757
6198 74757 -71954 26232 303684 189706 48621 183814 245177 254282 378766 383766 155409
6187 155409 -149574 -97598 -63147 -178716 -462985 -370490 -320651 -187651 -55589 -125397 -99768
6176 -99768 -78999 -35040 -185705 -267867 -286345 -323789 17452 301728 184885 128538 66284
6165 66284 13391 169304 467382 342507 125867 30145 18732 50757 -27873 -197329 41452
6154 41452 172329 -61682 -211807 -296054 -336721 -369735 -280077 -129405 -129244 27223 158454
6143 158454 283451 12815 -330930 -477992 -121886 258054 272507 145723 -30581 -211147
6133 -211147 -46176 136909 -52114 -172367 91943 49674 91331 339170 153440 66480
6123 66480 -138243 -292286 -197996 -31402 -44595 -95773 1830 66572 -100795 152663 336320
6112 336320 277912 291157 35998 -189089 -367035 -252551 -192959 -136959 67302 55802 -109744
6101 -109744 -29122 -192366 -195376 -58875 388 66083 138198 121550 -20091 -74501 127737
6090 127737 360100 265723 163142 274651 295211 163460 -98014 -137379 -222434 -328861
6080 -328861 -149093 946 201682 102883 90917 143784 121848 111370 -148081 -272190 -166569
6069 -166569 -114162 -71230 170910 351142 270528 267384 123144 35007 -258680 -274622 -163104
6058 -163104 -63993 -105111 -8827 -4468 -2097 -64378 -97167 48079 91487 -17843 -47088 -145453
6046 -145453 -91700 32189 287895 230545 54960 -52308 -169353 -264297 -122298 178797
6036 178797 51587 -164660 -186813 -88392 190027 386402 407860 313332 406652 310315 79399
6025 79399 -41871 195069 27499 -227391 -353016 -255355 -290242 -114215 64912 17110
6015 17110 -170796 -185734 -191034 -300806 -202578 1003 -11983 -108432 -130527 -141996 -96146
6004 -96146 -321571 -163924 146784 72150 6592 -57426 -103765 -147331 -209652 -319676 -136870
5993 -136870 216834 109250 -43439 -82358 -132883 -284509 -296877 -166987 -323146 -342219
5983 -342219 -290098 -127259 -252642 -241301 -157634 -177090 -74196 -149621 -237863 -322548 -450606
5972 -450606 -521574 -348043 -333463 -305146 -196649 -102127 -30303 95409 30600 -64955 -261749
5961 -261749 -248469 -202893 -228721 -307287 -517383 -380856 -258982 -261581 -167833 -50259 31561
5950 31561 -34148 51654 83210 -38402 -64423 130312 448860 577534 490050 465812 303495
5939 303495 42620 -86045 -89674 -103957 -279149 -352967 -138821 -117330 -131986 -51076 -104238
5928 -104238 64621 331247 332981 406551 624580 689212 394684 273156 179455 172615 274721
5917 274721 108868 -275624 -313837 -11861 -66271 -173755 -46173 38206 63536 -64555
5907 -64555 -317792 -347658 -277543 -187243 -192208 -193997 -71861 3694 -193727 -185218 -224641 -166641
5895 -166641 -245738 -330025 -377774 -480920 -305100 -73349 41342 230111 178201 164254 80459
5884 80459 2088 -182121 -240270 -212293 -196195 -149434 -171757 -290474 -237252 -184236 134877
5873 134877 371922 375363 353639 480835 441060 284033 265325 -89236 -175056 -191757 -172061
$$ [...]
##END NTUPLES=NMR SPECTRUM
##END=
