##TITLE=Analysis number 321631
Compound Code cc 50301
Book Reference 438/184
Project Code adrs
Chemist Name antons
##JCAMPDX= 6.0         $$ Bruker NMR JCAMP-DX V2.0
##DATA TYPE= NMR SPECTRUM
##DATA CLASS= NTUPLES
##ORIGIN= Bruker BioSpin GmbH
##OWNER= nmr
$$ XWIN-NMR		Version 3.5
$$ Fri Aug 18 14:03:23 2006 GMT Daylight Time (UT+1h)  MAYBRIDGE\nmr@NMR_250MHZ
##.OBSERVE FREQUENCY= 250.131544655141
##.OBSERVE NUCLEUS= ^1H
##.ACQUISITION MODE= SIMULTANEOUS (DQD)
##.ACQUISITION SCHEME= undefined
##.AVERAGES= 16
##.DIGITISER RES= 18
##SPECTROMETER/DATA SYSTEM= dpx250
##.PULSE SEQUENCE= zg30
##.SOLVENT NAME= DMSO
##.SHIFT REFERENCE= (INTERNAL, DMSO, 0, 16.522)
##AUDIT TRAIL= $$ (NUMBER, WHEN, WHO, WHERE, WHAT)
$$ ##TITLE= Audit trail, XWIN-NMR		Version 3.5
$$ ##JCAMPDX= 5.01
$$ ##ORIGIN= Bruker BioSpin GmbH
$$ ##OWNER= nmr
$$ C:\u/data/dgb/nmr/ADRS/1190/pdata/1/auditp.txt
$$ ##AUDIT TRAIL=  $$ (NUMBER, WHEN, WHO, WHERE, WHAT)
(   1,<2006-08-18 14:03:03.33 +100>,<MAYBRIDGE\nmr>,<NMR_250MHZ>,
      <created by zg, POWCHK disabled, PULCHK disabled
       configuration hash MD5:
       E2 DF 36 D8 04 B2 41 60 5A D7 A3 38 5A 4B D0 FE
       data hash MD5: 64K
       04 BF 50 13 E0 ED 46 70 3C A0 2D A8 A8 34 C5 F0>)
(   2,<2006-08-18 14:03:15.66 +100>,<MAYBRIDGE\nmr>,<NMR_250MHZ>,
      <Start of raw data processing
       ef LB = 0.3 FT_mod = 6 PKNL = 1 SI = 32K 
       data hash MD5: 32K
       EB AF F0 B7 98 2F 06 3B 32 AB E1 B2 88 C8 8E 42>)
(   3,<2006-08-18 14:03:17.35 +100>,<MAYBRIDGE\nmr>,<NMR_250MHZ>,
      <apk 
       data hash MD5: 32K
       90 62 59 96 9D 58 AA C9 17 CD 6C 5B F1 E7 0C DD>)
(   4,<2006-08-18 14:03:18.10 +100>,<MAYBRIDGE\nmr>,<NMR_250MHZ>,
      <abs ABSG = 5 
       data hash MD5: 32K
       EC 4A 15 C3 76 DC 89 4F E4 24 3C 2A 8F EA 5A 2C>)
$$ ##END=
$$ 
$$ hash MD5
$$ 03 C1 98 44 97 E3 8D 92 93 48 07 84 2A BD 9E 74
##$RELAX= 
##$RELAX= 
##$RELAX= 
##$RELAX= 
##$RELAX= 
##$RELAX= 
##$RELAX= 
$$ Bruker specific parameters
$$ --------------------------
##$DU= <C:\u>
##$EXPNO= 1190
##$NAME= <ADRS>
##$PROCNO= 1
##$TYPE= <nmr>
##$USER= <dgb>
##$AMP= (0..31)
100 100 100 100 100 100 100 100 100 100 100 100 100 100 100 100 100 100 
100 100 100 100 100 100 100 100 100 100 100 100 100 100 
##$AQSEQ= 0
##$AQ_mod= 3
##$AUNM= <au_zg>
##$AUTOPOS= <40 >
##$BF1= 250.13
##$BF2= 250.13
##$BF3= 250.13
##$BF4= 250.13
##$BF5= 500.13
##$BF6= 500.13
##$BF7= 500.13
##$BF8= 500.13
##$BYTORDA= 1
##$CFDGTYP= 0
##$CFRGTYP= 5
##$CHEMSTR= <none>
##$CNST= (0..31)
1 1 145 1 1 1 1 1 1 1 1 1 1 1 1 1 1 1 1 1 1 1 1 1 1 1 1 1 1 1 1 1 
##$CPDPRG= <>
##$CPDPRG1= <>
##$CPDPRG2= <>
##$CPDPRG3= <>
##$CPDPRG4= <mlev>
##$CPDPRG5= <mlev>
##$CPDPRG6= <mlev>
##$CPDPRG7= <mlev>
##$CPDPRG8= <mlev>
##$CPDPRGB= <>
##$CPDPRGT= <>
##$D= (0..31)
0 1 0 0 0 0 0 0 0 0.06 0 0 0 0 0 0 0.0002 0 0 0 0 0 0 0 0 0 0 0 0 0 0 
0 
##$DATE= 1155906182
##$DBL= (0..7)
120 120 120 120 120 120 120 120 
##$DBP= (0..7)
150 150 150 150 150 150 150 150 
##$DBP07= 0
##$DBPNAM0= <>
##$DBPNAM1= <>
$$ [...]
##$SUBNAM7= <"">
##$SUBNAM8= <"">
##$SUBNAM9= <"">
##$SW= 20.6930455092707
##$SWIBOX= (0..15)
0 0 3 0 0 0 0 0 0 0 0 0 0 0 0 0 
##$SW_h= 5175.983436853
##$TD= 65536
##$TD0= 1
##$TE= 296.16
##$TE2= 300
##$TE3= 300
##$TEG= 300
##$TL= (0..7)
0 120 120 120 120 120 120 120 
##$TP= (0..7)
150 150 150 150 150 150 150 150 
##$TP07= 0
##$TPNAME0= <>
##$TPNAME1= <>
##$TPNAME2= <>
##$TPNAME3= <>
##$TPNAME4= <>
##$TPNAME5= <>
##$TPNAME6= <>
##$TPNAME7= <>
##$TPOAL= (0..7)
0.5 0.5 0.5 0.5 0.5 0.5 0.5 0.5 
##$TPOFFS= (0..7)
0 0 0 0 0 0 0 0 
##$TUNHIN= 0
##$TUNHOUT= 0
##$TUNXOUT= 0
##$USERA1= <user>
##$USERA2= <user>
##$USERA3= <user>
##$USERA4= <user>
##$USERA5= <user>
##$V9= 5
##$VALIST= <valist>
##$VCLIST= <CCCCCCCCCCCCCCC>
##$VD= 0
##$VDLIST= <DDDDDDDDDDDDDDD>
##$VPLIST= <PPPPPPPPPPPPPPP>
##$VTLIST= <TTTTTTTTTTTTTTT>
##$WBST= 1024
##$WBSW= 4
##$XGAIN= (0..3)
0 0 0 0 
##$XL= 0
##$YL= 0
##$YMAX_a= 593112
##$YMIN_a= -583307
##$ZGOPTNS= <>
##$ZL1= 120
##$ZL2= 120
##$ZL3= 120
##$ZL4= 120
##$ABSF1= 16.522
##$ABSF2= -4.171173
##$ABSG= 5
##$ABSL= 3
##$ALPHA= 0
##$AQORDER= 0
##$ASSFAC= 0
##$ASSFACI= 0
##$ASSFACX= 0
##$ASSWID= 0
##$AUNMP= <proc_1d>
##$AZFE= 0.1
##$AZFW= 0.1
##$BCFW= 0
##$BC_mod= 0
##$BYTORDP= 0
##$COROFFS= 0
##$CY= 12.5
##$DATMOD= 1
##$DC= 0
##$DFILT= <>
##$DTYPP= 0
##$F1P= 14.0000005364418
##$F2P= -0.99999901652339
##$FCOR= 0.5
##$FTSIZE= 32768
##$FT_mod= 6
##$GAMMA= 0
##$GB= 0
##$INTBC= 1
##$INTSCL= 1
##$ISEN= 128
##$LB= 0.3
##$LEV0= 0
##$LPBIN= 0
##$MAXI= 10000
##$MC2= 0
##$MEAN= 0
##$ME_mod= 0
##$MI= 0
##$NCOEF= 0
##$NC_proc= -5
##$NLEV= 6
##$NOISF1= 0
##$NOISF2= 0
##$NSP= 0
##$NTH_PI= 0
##$NZP= 0
##$OFFSET= 16.522
##$PC= 1
##$PHC0= 137.3104
##$PHC1= 6.497625
##$PH_mod= 1
##$PKNL= yes
##$PPARMOD= 0
##$PSCAL= 4
##$PSIGN= 0
##$REVERSE= no
##$SF= 250.13
##$SI= 32768
##$SIGF1= 0
##$SIGF2= 0
##$SINO= 400
##$SIOLD= 32768
##$SREGLST= <1H.DMSO>
##$SSB= 0
##$STSI= 32768
##$STSR= 0
##$SW_p= 5175.98343685301
##$SYMM= 0
##$S_DEV= 0
##$TDeff= 65536
##$TDoff= 0
##$TI= <Analysis number 999999
Compound Code 99
Book Reference 9
Project Code 9>
##$TILT= no
##$TM1= 0
##$TM2= 0
##$TOPLEV= 0
##$USERP1= <user>
##$USERP2= <user>
##$USERP3= <user>
##$USERP4= <user>
##$USERP5= <user>
##$WDW= 1
##$XDIM= 32768
##$YMAX_p= 377467346
##$YMIN_p= -216888
$$ End of Bruker specific parameters
$$ ---------------------------------
##NTUPLES= NMR SPECTRUM
##VAR_NAME=  FREQUENCY,     SPECTRUM/REAL,   SPECTRUM/IMAG
##SYMBOL=    X,             R,               I
##VAR_TYPE=  INDEPENDENT,   DEPENDENT,       DEPENDENT
##VAR_FORM=  AFFN,          ASDF,            ASDF
##VAR_DIM=   32768,         32768,           32768
##UNITS=     HZ,            ARBITRARY UNITS, ARBITRARY UNITS
##FACTOR=    0.157963299565203, 1,           1
##FIRST=     4132.6476996994, 0,             0
##LAST=      -1043.33573715361, 0,           0
##MIN=       -1043.33573715361, -216888,     0
##MAX=       4132.6476996994, 377467346,     0
$$ Real data points
##PAGE= N=1
##DATA TABLE= (X++(R..R)), XYDATA
$$ [...]
17737A311894l4212o489L420j2735M4521R1421L064J0204N6670l0878J4074j9374
$$ 1311894 1277682 1271193 1274613 1261878 1306399 1397820 1400884 1411088 1467758 1436880 1450954 1431580
17725A431580L7627O9358J8957K2365j3365j9911O288N5656O1667P5696O4985
$$ 1431580 1469207 1538565 1557522 1579887 1566522 1546611 1552899 1608555 1670222 1745918 1810903
17714A810903O6993O9302O1693Q9675Q2615Q9216P2076Q1888P5735Q2654J35773
$$ 1810903 1877896 1947198 2008891 2098566 2181181 2270397 2342473 2424361 2500096 2582750 2718523
17703B718523J30405J45391J87735K01590J76643K34411L05529L32601L98458
$$ 2718523 2848928 2994319 3182054 3383644 3560287 3794698 4100227 4432828 4831286
17694D831286M21393M12658N64238O58213P63903R05258J102979J218542J422267
$$ 4831286 5252679 5665337 6229575 6887788 7651691 8556949 9659928 10878470 12300737
17685A2300737J687255K136534K732154L662496N132414P414013J0852236J5277648
$$ 12300737 13987992 16124526 18856680 22519176 27651590 35065603 45917839 61195487
17677F1195487J9061000J9381001J5855866J2345416J0175457O954967L076103
$$ 61195487 80256487 99637488 115493354 127838770 138014227 144969194 148045297
17670A48045297J887451L911322M794100J873236k171425n116691q693742j3254604
$$ 148045297 149932748 153844070 158638170 160511406 158339981 153223290 144529548 131274944
17662A31274944j5971655j5076702j2267054r776109q240737p026360n679243
$$ 131274944 115303289 100226587 87959533 78183424 69942687 62916327 57237084
17655E7237084m347100l253303k135592j030871m9185J134438K791078N201248
$$ 57237084 52889984 49636681 47501089 46470218 46421033 47555471 50346549 55547797
17647E5547797Q647468J2997090J6757357J7295431J4244229J1014971Q935264
$$ 55547797 64195265 77192355 93949712 111245143 125489372 136504343 145439607
17640A45439607N980982K452360J466689L619700M590203J645817k514063n402392
$$ 145439607 151420589 153872949 155339638 158959338 163549541 165195358 162681295 157278903
17632A57278903q832849j3564254j6616323j5799495j2931481j0509064r116152
$$ 157278903 148446054 134881800 118265477 102465982 89534501 79025437 69909285
17625F9909285q075638o840341n707769m701731l823744l277456k758693k411631
$$ 69909285 61833647 54993306 49285537 44583806 40760062 37482606 34723913 32312282
17617C2312282k170709j825397j685775j587257j383098j205756j150386j013858
$$ 32312282 30141573 28316176 26630401 25043144 23660046 22454290 21303904 20290046
17609B0290046q74515p90085p47176o89318o71690o34872n81531n86485n33113
$$ 20290046 19415531 18625446 17878270 17188952 16517262 15882390 15300859 14714374 14181261
17600A4181261n01399m44126m33192m14980m18355l64353l45388l31593l17157
$$ 14181261 13679862 13235736 12802544 12387564 11969209 11604856 11259468 10927875 10610718
17591A0610718l61614l74613l10927k85404k86583k54463k13006k56854k00280
$$ 10610718 10249104 9874491 9563564 9278160 8991577 8737114 8524108 8267254 8066974
17582H066974k14968k09200k12342j99971k02551j86892j21969j28149j88859
$$ 8066974 7852006 7642806 7430464 7230493 7027942 6841050 6719081 6590932 6402073
17573F402073k43983j66232j38463j49235j48530j25419j28954j53944j61395
$$ 6402073 6158090 5991858 5853395 5704160 5555630 5430211 5301257 5147313 4985918
17564D985918k05990j86385q9772q3031r8289j54236j51491p7966n6714p7974
$$ 4985918 4779928 4593543 4503771 4420740 4322451 4168215 4016724 3938758 3882044 3804070
17554C804070j19905j23342q1618r0029m5244M2179j1581q1569r8981q5593o8198
$$ 3804070 3684165 3560823 3479205 3389176 3343932 3386111 3374530 3292961 3193980 3108387 3040189
17543C040189m8155m6126r3350p3102j7309J5176l8510r4474n2675j01815n5733
$$ 3040189 2992034 2945908 2852558 2779456 2762147 2777323 2738813 2644339 2591664 2489849 2434116
17532B434116j2870o7173o1752l2527l8521m4567j0606j32413o0592k793r127
$$ 2434116 2421246 2354073 2292321 2259794 2221273 2176706 2166100 2033687 1973095 1970302 1961175
17521A961175k2488l5669o2403K5273q097p8573k0160j8565j3503k0849l6536
$$ 1961175 1938687 1903018 1840615 1865888 1857791 1779218 1759058 1740493 1726990 1706141 1669605
17510A669605K7456J2650J7219l2957p8741m0051N6049L704o714j2289k1051p7844
$$ 1669605 1697061 1709711 1726930 1693973 1615232 1575181 1631230 1634934 1628220 1615931 1594880 1517036
17498A517036n8865Q983Q838L3195M697l2397k1908k2633M742P900k2664j04330
$$ 1517036 1458171 1467154 1475992 1509187 1513884 1481487 1459579 1436946 1441688 1449588 1426924 1322594
17486A322594j9434J4159l6198j0452l0171k6182j7022o0076l2799j265K5874
$$ 1322594 1303160 1317319 1281121 1270669 1240498 1214316 1197294 1137218 1104419 1103154 1129028
17475A129028l6054l2816n7063N133J4882M973P3577J99L360M1164N6912J18226
$$ 1129028 1092974 1060158 1003095 1008228 1023110 1028083 1101660 1101859 1105219 1146383 1203295 1321521
17463A321521R4095P7365O0504J16746J27585J06994O1241M4343q266q4512n3020
$$ 1321521 1415616 1492981 1553485 1670231 1797816 1904810 1966051 2010394 2002128 1917616 1864596
17452A864596J0814j3790k9647k5623p8094j12896q0678o6229q2482j27608j68737
$$ 1864596 1875410 1861620 1831973 1806350 1728256 1615360 1534682 1468453 1385971 1258363 1089626
17441A089626j04208r4174l2680J0036o1943p5119j00013k064q347l9619m5886
$$ 1089626 985418 891244 858564 868600 806657 731538 631525 629461 621114 581495 535609
17430E35609L781m053m6381j7510J09025L2550l8185q4670m4609j8010l3775j5271
$$ 535609 539390 535337 488956 471446 580471 613021 574836 490166 445557 427547 393772 378501
17418C78501n0042M446R60o4066R160J7629k866m2055K7616J3637K4153j9597
$$ 378501 328459 332905 333865 269799 278959 296588 293722 251667 279283 292920 317073 297476
17406B97476n5424l9334K202j8375J811j9905O4764j4652m987L8399N7523J250
$$ 297476 242052 202718 204920 186545 188356 168451 233215 218563 213576 251975 309498 310748
17394C10748Q946o9358n3908K5684L6342O924j2816k1089M8555j1357p4489L404
$$ 310748 319694 250336 196428 222112 258454 265378 252562 231473 280028 268671 194182 197586
17382A97586P7736K5333m6829k0888M017j7805k1986k4056r633J5621Q034L477
$$ 197586 275322 300655 253826 232938 236955 219150 197164 173108 163475 179096 187130 190607
17370A90607K1349o2484o114L0994K0399q328m2236j9250K91O441L9725l8092
$$ 190607 211956 149472 143358 174352 194751 186423 144187 124937 125228 131669 171394 133302
17358A33302k0167K4577q480p2099m0350M2551K8251j6971K1642j4724j1631L825
$$ 133302 113135 137712 129232 57133 16783 59334 87585 70614 92256 77532 65901 69726
17346F9726L873o944N7958P521m8535o3969J8136Q0180j451j3366L048L406J4450
$$ 69726 73599 66655 124613 132134 83599 19630 37766 117946 116495 103129 106177 109583 124033
17333A24033j7143k5434J6160j8485j2761J8629j7833p889o506k6015K0590J904
$$ 124033 106890 81456 97616 79131 66370 84999 67166 59277 52771 26756 47346 49250
17321D9250K5027M5148N756m6856Q163O811k1744n627l5621K3043K0228q161k9973
$$ 49250 74277 119425 125181 78325 86488 93299 71555 65928 30307 53350 73578 65417 35444
17308C5444K4519L4608L087j7180p5810O564J8541K1434k5809L993K2246k1406
$$ 35444 59963 94571 97658 80478 4668 11232 29773 51207 25398 29391 51637 30231
17296C0231n617j1142r8984m3643l2821J9615L3960M5405L0038m0420k9361O0860
$$ 30231 24614 13472 -85512 -129155 -161976 -142361 -108401 -62996 -32958 -73378 -102739 -41879
17284d1879N284O8082N6540L0996j8358o3775k1236k6725M7335K2088j4624n114
$$ -41879 -36595 31487 88027 119023 100665 36890 15654 -11071 36264 58352 43728 38614
17272C8614L946L2069N979l3394m3171R016J6420K6738m76k5864j5860j9197K1539
$$ 38614 42560 74629 80608 47214 4043 13059 29479 56217 55741 29877 14017 -5180 16359
17259A6359k4241k7347j8119J0123J7092m1379n6544J929N054M2399R4170j3551
$$ 16359 -7882 -35229 -53348 -43225 -26133 -67512 -124056 -122127 -117073 -74674 19496 5945
17247E945m4658P187J1613J2775j2888J05L1564K015J7358m9901m3256J5938K3297
$$ 5945 -38713 -31526 -19913 -7138 -20026 -19921 11643 13658 31016 -18885 -62141 -46203 -22906
17234b2906l0350m5452m2037K048K5019k205J7234O833R0792J1089n3939J0263
$$ -22906 -53256 -98708 -140745 -138697 -113678 -115883 -98649 -91816 -1024 10065 -43874 -33611
17222c3611J3614r771l9083K8880k3804m1729K0063L3503O1991j8610m7735N5550
$$ -33611 -19997 -29768 -68851 -39971 -63775 -105504 -85441 -51938 10053 -8557 -56292 -742
17210g42P594o5100q3731J629q49l434J07802N3691J1246J2153k1348K1806o49
$$ -742 6852 -58248 -141979 -140350 -141199 -144633 -36831 16860 28106 40259 18911 40717 40068
17197D0068l0132j6026m088J2634o67J9236k1217l1986J2003N007J9189j0684
$$ 40068 9936 -6090 -10178 2456 1789 21025 -192 -32178 -20175 -15168 4021 -6663
17185f663R476o5458k1264O3310K4296p075K3813N749M244Q938k3732l7275l7743
$$ -6663 2813 -62645 -83909 -20599 3697 -3378 20435 26184 30428 39366 15634 -21641 -59384
17172e9384k7383K0641n113k3135P2723L4666j9156l6436L2800M9165l2031Q500
$$ -59384 -86767 -66126 -71239 -94374 -21651 13015 -6141 -42577 -9777 39388 7357 15857
17160A5857n5429j5766p357N2801R4355J6355j0k4488J7715L5028m960O7862M4248
$$ 15857 -39572 -55338 -62695 -9894 84461 100816 100806 76318 94033 129061 124101 191963 236211
17147B36211k9969M2297K055K3819O1873N8446k778K6330L8726M9361M8265P0704
$$ 236211 206242 248539 250594 274413 336286 394732 391954 418284 457010 506371 554636 625340
17135F25340K3259r01M4627N7748K5112k4732r715o8779r7006q0775n3743o4954
$$ 625340 648599 647698 692325 750073 775185 750453 740738 671959 574953 494178 440435 375481
17123C75481k365l8746j7289m0789p5374l3716J7569p776J097O3311R0366M7730
$$ 375481 373116 334370 317081 276292 200918 167202 184771 176995 178092 241403 331769 379499
17111C79499K9081k3439K0330N0332J12312P9311l5297k5201M36O1605J00170
$$ 379499 408580 385141 405471 455803 568115 647426 612129 586928 587364 648969 749139
17100G49139k7295k5274j8530j8969p8904m1806k9265l0143k9563m7043n8505
$$ 749139 721844 696570 678040 659071 580167 538361 509096 478953 449390 402347 343842
17089C43842k2517o4500q506l8377m6180k2636K4304K5660o1542m6421L9737J6016
$$ 343842 321325 256825 248319 209942 163762 141126 165430 191090 129548 83127 122864 138880
17077A38880m1427j3164m3775l6935p380O7397M5673K5041n0371m9149q997o261
$$ 138880 97453 84289 40514 3579 -3801 63596 109269 134310 83939 34790 25793 19532
17065A9532j4967m638j2573l5550N9406j0406L570K4013n4287j1361M0194K1596
$$ 19532 4565 -73 -12646 -48196 11210 804 4374 28387 -25900 -37261 2933 24529
17053B4529p490L690l4617k4224J2861N2520J6492k8360l9184k918K6671L5660
$$ 24529 17039 20729 -13888 -38112 -25251 27269 43761 15401 -23783 -26701 -30 35630
17041C5630j0950P661K4468R141J0391m2277j3939N681j7481l0317Q718Q763J2993
$$ 35630 24680 32341 56809 65950 76341 34064 20125 25806 8325 -21992 -13274 -4511 8482
17028H482J4704l6560k1707m7550j0328L9285L4698M4919J9376l7886J3329m705
$$ 8482 23186 -13374 -35081 -82631 -92959 -53674 -18976 25943 45319 7433 20762 16057
17016A6057K6161L521n5360k6560k3284n87q143J2250P749m208J2403n7987j947
$$ 16057 42218 45739 -9621 -36181 -59465 -60052 -68195 -55945 -48196 -52404 -40001 -97988 -99935
17003i9935o179k5379K822O019p669L1021K7657k2750N7919M9005n4028J6408
$$ -99935 -106114 -131493 -128671 -122652 -130321 -99300 -71643 -94393 -36474 12531 -41497 -25089
16991b5089K612J8134K8277N305m7687J4459J8134m127m4575K0203K389o2707
$$ -25089 -22477 -4343 23934 29239 -18448 -3989 14145 10018 -34557 -14354 -11965 -74672
16979g4672O954L1738L5394j7595j0277Q26P662M8443N5093r547m5377J427j9398
$$ -74672 -67718 -35980 -586 -18181 -28458 -27632 -19970 28473 83566 74019 28642 30069 10671
16966A0671J5421M0342J6838k2359k5829k7065j6120j1190k5572n5361k3309J3927
$$ 10671 26092 66434 83272 60913 35084 8019 -8101 -19291 -44863 -100224 -123533 -109606
16954a09606n8186K0527L6314K7064K5637l0479M693J1567J334k1963K4028L2417
$$ -109606 -167792 -147265 -110951 -83887 -58250 -88729 -84036 -72469 -71135 -93098 -69070 -36653
16942c6653J595m4275n09j002P4665J8513j6617j1577k1722n4474K8343N4045
$$ -36653 -35058 -79333 -79842 -80844 -6179 12334 -4283 -15860 -37582 -92056 -63713 -9668
16930i668k0999Q064O718j1462m0398j7224L1501k1163j4266K3601J4125j8655
$$ -9668 -30667 -22603 -15885 -27347 -67745 -84969 -53468 -74631 -88897 -65296 -51171 -69826
16918f9826M4414M7096J7125K1324l5192k9672J0934N196j4022k3515L0600m1268
$$ -69826 -25412 21684 38809 60133 24941 -4731 6203 11399 -2623 -26138 4462 -36806
16906c6806o1196j2144L711L831M6613n869p468j4037k0484m0075M186J3712L3342
$$ -36806 -98002 -110146 -106435 -102604 -55991 -61860 -69328 -83365 -103849 -143924 -139738 -126026 -92684
16893i2684M2514J2517M981l3032J0807k6073m4926j7205J8485K7718k9747K1652
$$ -92684 -50170 -37653 -32672 -65704 -54897 -80970 -125896 -143101 -124616 -96898 -126645 -104993
16881a04993N5673L9628j1621l4885m9616R853l0352J3119L1176M4867L3866R436
$$ -104993 -49320 -9692 -21313 -56198 -105814 -95961 -126313 -113194 -82018 -37151 -3285 6151
16869F151m292M2139M6283k9671j9628n3378n2321k1369J6694L3493R328n0304
$$ 6151 1859 43998 90281 60610 40982 -12396 -64717 -86086 -69392 -35899 -26571 -76875
16857g6875j5975l0262K0069J7150J8210j7346J098K0775M2916M6148n8956N802
$$ -76875 -92850 -123112 -103043 -85893 -67683 -85029 -83931 -63156 -20240 25908 -33048 -27246
16845b7246O4451J0931m6800m8406k5421N2474J7619J2104J8868j3578k3533m8024
$$ -27246 37205 48136 1336 -47070 -72491 -20017 -2398 9706 28574 14996 -8537 -56561
16833e6561k1749q545l2912N2370O0779k203L3688N4229l4140o5565n2645o2066
$$ -56561 -78310 -86855 -119767 -67397 -6618 -8821 24867 79096 44956 -20609 -73254 -135320
16821a35320J373K9836J7662L3720o956L2255J9462L4561O683j7806L278N0189
$$ -135320 -133947 -104111 -86449 -52729 -59685 -27430 -7968 26593 33276 15470 18748 68937
16809F8937M5252n401n0269l5871k2384q685k7639J41J0645J4351R907L2315k9623
$$ 68937 114189 108788 58519 22648 264 -8421 -36060 -35919 -25274 -10923 -1016 31299 1676
16796A676k9690l5292j5447J9811k1683M0393M3995l5973L8295j2315k0316k3858
$$ 1676 -28014 -63306 -78753 -58942 -80625 -40232 3763 -32210 6085 -6230 -26546 -50404
16784e0404j0476K4977j083m1096M5163j6464k644L960K3048l629J2742K510j1062
$$ -50404 -60880 -35903 -36986 -78082 -32919 -49383 -52027 -48067 -25019 -28648 -15906 -13396 -24458
16771b4458k958N5791j0970q373j6527m0908m3778K776N506J0702O60k0735j2556
$$ -24458 -27416 28375 17405 9032 -7495 -48403 -92181 -89405 -83899 -73197 -72537 -93272 -105828
16758a05828J4922P091Q555M1639k6484j3476j2365r167J382O8732K0454j7797
$$ -105828 -90906 -83815 -75260 -33621 -60105 -73581 -85946 -95113 -93731 -24999 -4545 -22342
16746b2342j1065k2643N4732N6551l5473l3588q2243j6396l790l202M6597L4333
$$ -22342 -33407 -56050 -1318 55233 19760 -13828 -96071 -112467 -116257 -119459 -72862 -38529
16734c8529L2103l1624j6335K6012m5348K0229M4004O022l1016n1356k540N7633
$$ -38529 -6426 -38050 -54385 -28373 -73721 -53492 -9488 -3466 -34482 -85838 -88378 -30745
16722c0745K8045l5262J3049k0574M5588K5987m0614m0755l5072N7564O3838r030
$$ -30745 -2700 -37962 -24913 -45487 101 26088 -14526 -55281 -90353 -32789 31049 22019
16710B2019J058j1596R338M919J6762m6276P479L247n400M1165n265o2519m4900
$$ 22019 23077 11481 20819 25738 42500 -3776 3703 6950 1550 42715 37450 -25069 -69969
16697f9969j4010M0475L9662J5456j106k2904m6595m6320p967M5090M3034L784
$$ -69969 -83979 -43504 -3842 11614 10508 -12396 -58991 -105311 -113278 -68188 -25154 -21370
16685b1370l7751K6718K1562O919j9146N6819M980n5235q209k5069l217L9821
$$ -21370 -59121 -32403 -10841 -3922 -23068 33751 38731 -16504 -24713 -49782 -52999 -13178
16673a3178J3870j1570J591M2350J9283L158j3280q1889q3027k0596L3720O2021
$$ -13178 692 -10878 -9287 33063 52346 55504 42224 -39665 -122692 -143288 -109568 -47547
16661d7547q028m2384L9795L9546j0228p0501j4421k8156L8024l5m213L2182K7453
$$ -47547 -55575 -97959 -58164 -18618 -28846 -99347 -113768 -141924 -103900 -103935 -108148 -75966 -48513
16648d8513j2994J1432k0905O8L4348l5818n2876M4123L3090n0711J5614N3543
$$ -48513 -61507 -50075 -70980 -70912 -36564 -72382 -125258 -81135 -48045 -98756 -83142 -29599
16636b9599k3073P439j1485o848K6842L9539l6498j29730J5384O9023L2771r070
$$ -29599 -52672 -45233 -56718 -63566 -36724 2815 -33683 -163413 -148029 -79006 -46235 -55305
16624e5305p8225r614L1918J9851N0613k0828m4806k5302r661K5124j9245L8225
$$ -55305 -133530 -143144 -111226 -91375 -40762 -61590 -106396 -131698 -141359 -116235 -135480 -97255
16612i7255J2015K6472L5133j6079K5645r230k3656j7064j6060k010k9699j2243
$$ -97255 -85240 -58768 -23635 -39714 -14069 -23299 -46955 -64019 -80079 -82089 -111788 -124031
16600a24031j0217j1490K3432L3296N3248O3435j6622l6065K7688j8101o6575
$$ -124031 -134248 -145738 -122306 -89010 -35762 27673 11051 -25014 2674 -15427 -82002
16589h2002O0920K5665k0584k9064n2613o849J5806m0464L3797J8740L8011J9171
$$ -82002 -21082 4583 -16001 -45065 -97678 -104527 -88721 -129185 -95388 -76648 -38637 -19466
16577a9466j4692m5411j3982J0619K8298L1794k1323J9474k4552k5115L9592o871
$$ -19466 -34158 -79569 -93551 -82932 -54634 -22840 -44163 -24689 -49241 -74356 -34764 -41635
16565d1635p226j9138j7128O0654J3853J808m7278p0218k0811N548k7558K6467
$$ -41635 -48861 -67999 -85127 -24473 -10620 -8812 -56090 -126308 -147119 -141571 -169129 -142662
16553a42662O776l43N0118j9114k7000K35P9458O9149j866j8770j5464j9465l0089
$$ -142662 -135886 -136229 -86111 -105225 -132225 -131990 -52532 16617 14751 -4019 -19483 -38948 -69037
16540f9037j0115r173l5278l4802M9421M4040J5591J6187q477j6907L6783J7765
$$ -69037 -79152 -88325 -123603 -158405 -108984 -64944 -49353 -33166 -41643 -58550 -21767 -4002
16528d002L371k5652N254M805K9930J3042l5018j3597l4958J1721p7913m4840
$$ -4002 -631 -26283 -21029 -16224 13706 26748 -8270 -21867 -56825 -45104 -123017 -167857
16516a67857n560K5518J5495k509j0243L1403M1789J3471j6787K2516j6538Q338
$$ -167857 -173417 -147899 -132404 -134913 -145156 -113753 -71964 -58493 -75280 -52764 -69302 -60964
16504f0964q361l3826O7561J1414k2954k7014j2121J3469Q37J9128l5922r942
$$ -60964 -69325 -103151 -35590 -24176 -47130 -74144 -86265 -72796 -71959 -52831 -88753 -98695
16492i8695N7132M9889j9586k7224j3523K7059k649o031m981q1983l8297N632
$$ -98695 -41563 8326 -11260 -38484 -52007 -24948 -27597 -33628 -38609 -120592 -158889 -153257
16480a53257O7869L5348K404K5415p017j7803j4910m3972j3202L2031j0680k4602
$$ -153257 -85388 -50040 -47636 -22221 -29238 -47041 -61951 -105923 -119125 -87094 -97774 -122376
16468a22376K6405r58J7761O274K161m7459J6028J8012M81N4118O5458o1298o6978
$$ -122376 -95971 -96929 -79168 -72894 -70733 -118192 -102164 -84152 -83671 -29553 35905 -25393 -92371
16455i2371k9560j4554o132l1001R058M607L4335L5325K3704m727j2223j2022
$$ -92371 -121931 -136485 -142617 -173618 -164560 -159953 -125618 -90293 -66589 -71316 -83539 -95561
16443i5561k8854o247J6879N8761N8824j9421l3798O7697M7696l0951m7995p119
$$ -95561 -124415 -130662 -113783 -55022 3802 -15619 -49417 18280 65976 35025 -12970 -20089
16431b0089k309J6861k4114o4223l369O707L4821o095m043m8314M0857M0354j8807
$$ -20089 -22398 -5537 -29651 -93874 -97243 -90536 -55715 -61810 -65853 -114167 -73310 -32956 -51763
16418e1763j7640J3471P05o330P5330k549o3517L289p399K603L6117J199O811
$$ -51763 -69403 -55932 -55227 -61557 13773 11224 -52293 -49004 -56403 -53800 -17683 -16484 -9673
16405i673K1680L5689j9353k827M536l8619m5899o4041n0921k1409L8408J5276
$$ -9673 12007 47696 28343 25516 30052 -8567 -54466 -118507 -169428 -190837 -152429 -137153
16393a37153P639N9017K6947K1621N9861l981j5839k2359p1771l9622L0199m5879
$$ -137153 -129514 -70497 -43550 -21929 37932 33951 18112 -4247 -76018 -115640 -85441 -131320
16381a31320p001K1468K7827L35K8009N9077K4668o8325j010k0163n8306k5494
$$ -131320 -138321 -116853 -89026 -88691 -60682 -1605 23063 -45262 -46272 -66435 -124741 -150235
16369a50235L6720M7154k3339J309j9858K4662N4712M6119r196p324l6917j79
$$ -150235 -113515 -66361 -89700 -88391 -108249 -83587 -28875 17244 8048 724 -36193 -36372
16357c6372O832k2548n774J4036J7478N754J5386L989l1750L119M4462m5596M2351
$$ -36372 -29540 -52088 -57862 -43826 -26348 -20594 -5208 -1219 -32969 -29850 14612 -30984 11367
16344A1367O4298J599m0056O47l6921o22j0998j4981q9919j011J3062N069K9431
$$ 11367 75665 77264 37208 37855 934 312 -10686 -25667 -115586 -116597 -103535 -98466 -69035
16331f9035j605N366L1025l918l5748O495L4696M594j7361M2351O897p0420l7733
$$ -69035 -70640 -65274 -34249 -38167 -73915 -67420 -32724 -28130 -45491 -3140 3757 -66663 -104396
16318a04396p933K0776N7603K5300k5044J16L8881k2935m7581P3083M0864r932
$$ -104396 -112329 -91553 -33950 -8650 -33694 -33578 5303 -17632 -65213 7870 48734 38802
16306C8802l1522o6321l9062p240M5496Q591j6758q792Q591K8609k3884l9866
$$ 38802 7280 -59041 -98103 -105343 -59847 -51256 -68014 -76806 -68215 -39606 -63490 -103356
16294a03356R269K2407j1144l1876J6656k2556k8411J8886Q578k6519M1800P9606
$$ -103356 -94087 -71680 -82824 -114700 -98044 -120600 -149011 -130125 -121547 -148066 -106266 -26660
16282b6660K408p781r0444J2705J4666o5543k5559n963K7334N2925O844k5640
$$ -26660 -24252 -32033 -122477 -109772 -95106 -160649 -186208 -192171 -164837 -111912 -105068 -130708
16270a30708L661M8020L6567K6601j3024k0292o3474J5916M9882J8966l739N329
$$ -130708 -127047 -79027 -42460 -15859 -28883 -49175 -112649 -96733 -46851 -27885 -31624 -26295
16258b6295N7325M4790k9254n1584J531J427K7167o154m1095M3098k4948k4538
$$ -26295 31030 75820 46566 -5018 -3487 -2060 25107 18953 -22142 20956 -3992 -28530
16246b8530m8700j0831O029P35L3951m566k2709l561O108j1640J0536N7058m6330
$$ -28530 -77230 -88061 -82032 -81297 -47346 -51912 -74621 -78182 -72074 -83714 -73178 -16120 -62450
16233f2450n8942L3205K9108N7134K6410k4563N823J1737m1980M864L0560j6232
$$ -62450 -121392 -88187 -59079 -1945 24465 -98 5725 17462 -24518 -19654 10906 -5326
16221e326n4221k1262l606J3396k5417o340l5350o199L7374k488M579N7353O468
$$ -5326 -59547 -80809 -84415 -71019 -96436 -102776 -138126 -144325 -106951 -109439 -104860 -47507 -41039
16208d1039j4405k4174P7525J0491l8299M078k3906p060L7847j5163l412O4084
$$ -41039 -55444 -79618 -2093 8398 -29901 -25823 -49729 -56789 -18942 -34105 -37517 26567
16196B6567m6332Q632M7992K011n9107J6217J9369j8198L7184m6493p3034o127
$$ 26567 -19765 -11133 36859 38870 -20237 -4020 15349 -2849 34335 -12158 -85192 -91319
16184i1319K6890q280L4256L7385p820K214j460k7955l239L5733P727k1629n4224
$$ -91319 -64429 -72709 -38453 -1068 -8888 -6674 -8134 -36089 -39328 -3595 4132 -17497 -71721
16171g1721J3182l8600P910K3358J319M5008O7552Q278q6013j9155j1470L1661
$$ -71721 -58539 -97139 -89229 -65871 -64552 -19544 48008 56286 -29727 -48882 -60352 -28691
16159b8691o113q2361o546j003O0732j0196k2119o348K6886k7080O788L8833M377
$$ -28691 -34804 -117165 -123711 -124714 -63982 -74178 -96297 -102645 -75759 -102839 -96051 -57218 -52841
16146e2841l0844j4863R523j51l591n6212N4363j0731j9134j148K4149J8161J7822
$$ -52841 -83685 -98548 -89025 -89176 -92767 -148979 -94616 -105347 -124481 -125629 -101480 -83319 -65497
16133f5497L8605J6283J0387n653K5811o1244n6694l171j6393j2091J1045K8335
$$ -65497 -26892 -10609 -222 -5875 19936 -41308 -98002 -101173 -117566 -129657 -118612 -90277
16121i0277k5835J9721N1731j9469m2052L4012O6049J8670m5861n9780k776n283
$$ -90277 -116112 -96391 -44660 -64129 -106181 -72169 -6120 12550 -33311 -93091 -95867 -101150
16109a01150k71L2893Q3408R376m8706o7809l7681L0906M0796k2902Q136j4234
$$ -101150 -101421 -68528 14880 24256 -24450 -92259 -129940 -99034 -58238 -81140 -73004 -87238
16097h7238o586Q18P5555M2345j0672p436o5996n2450O7633M9251m8980m8284
$$ -87238 -93824 -93006 -17451 24894 14222 6786 -59210 -111660 -44027 5224 -43756 -92040
16085i2040j9416L183L3884L4218k2124k6553K1378j9725K7765O8927Q61n8261
$$ -92040 -111456 -108273 -74389 -40171 -62295 -88848 -67470 -87195 -59430 9497 10358 -47903
16073d7903l3114o088l7486o799L8593N0693k7608p3394J570K4335j8840j4499
$$ -47903 -81017 -87105 -124591 -131390 -92797 -42104 -69712 -143106 -141536 -117201 -136041 -150540
16061a50540M4080N2676J697J3909K1934j4731K8584l1628o9169k2282Q5589N1037
$$ -150540 -106460 -53784 -52087 -38178 -16244 -30975 -2391 -34019 -103188 -125470 -39881 11156
16049A1156J5492J9465q509k8942j68k5557o2753K0228r467m3647O1275J6368
$$ 11156 26648 46113 37604 8662 8494 -17063 -79816 -59588 -69055 -112702 -51427 -35059
16037c5059m9548n398k295m883N330N0155M9266L204K2713J0736o0674l9385K1648
$$ -35059 -84607 -90005 -92300 -97183 -91853 -41698 7568 10772 33485 44221 -16453 -55838 -34190
16024c4190J6420k1583J4494q352k384l1795q1222n1976N7805K5817M996R856
$$ -34190 -17770 -39353 -24859 -33211 -35595 -67390 -148612 -200588 -142783 -116966 -111970 -102114
16012a02114K8308K0449n6520N019O215J3279M328N4921O7013K742l9379l9314
$$ -102114 -73806 -53357 -109877 -104858 -98643 -85364 -81036 -26115 40898 43640 4261 -35053
16000c5053l1734K864k8672M8227M2412l6655k5334L2347K3600J609l3198p1157
$$ -35053 -66787 -63923 -92595 -44368 -1956 -38611 -63945 -31598 -7998 -6389 -39587 -110744
15988a10744n8312L4291K1358J2581k975J0474j394L3189m1016K334K0956K4774
$$ -110744 -169056 -134765 -113407 -100826 -103801 -93327 -94721 -61532 -102548 -100214 -79258 -54484
15976e4484k4669o869J336Q425j8800j0478n958M6169m8197l4090P8387Q931J0822
$$ -54484 -79153 -86022 -84686 -76261 -95061 -105539 -111497 -65328 -113525 -147615 -69228 -60297 -49475
15963d9475O7341K549q067K4606l3922n2510J6456K2093j3417k1326J9218n5543
$$ -49475 17866 20415 12348 36954 3032 -49478 -33022 -10929 -24346 -45672 -26454 -81997
15951h1997j4258K8125K3735J1415M439j0687n3000k0584J5452O806K5079O3260
$$ -81997 -96255 -68130 -44395 -32980 -28541 -39228 -92228 -112812 -97360 -90554 -65475 -2215
15939b215k4150k0438j3212M113m212r274k676Q1619K5378k9436n0586j3908k4025
$$ -2215 -26365 -46803 -60015 -55902 -60114 -69388 -72064 9555 34933 5497 -45089 -58997 -83022
15926h3022l5456O5010R4657m9539J1203M4936k2779k7716j4869k9846K3579k949
$$ -83022 -118478 -53468 41189 -8350 2853 47789 25010 -2706 -17575 -47421 -23842 -26791
15914b6791l954R755k8300m1239k1980j4396J3275O4364L7891m7538l6009l389
$$ -26791 -30745 -20990 -49290 -90529 -112509 -126905 -113630 -49266 -11375 -58913 -94922 -98311
15902i8311J7088M0435k4979M3356M752l8837l0498l3716k6274O9783L5784j1044
$$ -98311 -81223 -40788 -65767 -22411 -17659 -56496 -86994 -120710 -146984 -77201 -41417 -52461
15890e2461J5855m802M5942K7029K3523J6285n088n9780l0083o2651k8009K0670
$$ -52461 -36606 -41408 4534 31563 55086 71371 66283 6503 -23580 -86231 -114240 -93570
15878i3570M6646k160o569M890N7304j0747L1457K2705L9116j9064l4360m6701
$$ -93570 -46924 -49084 -55653 -50763 6541 -4206 27251 49956 89072 70008 35648 -11053
15866a1053m1691j4387M5335k1873o6248L2632K9267j678j4852l1737N8542k6501
$$ -11053 -52744 -67131 -21796 -43669 -109917 -77285 -48018 -49696 -64548 -96285 -37743 -64244
15854f4244j6086l435j977k6199o337M3532J4330k2768l6080j109k764m1905M1767
$$ -64244 -80330 -83765 -85742 -111941 -118278 -74746 -60416 -83184 -119264 -120373 -123137 -165042 -123275
15841a23275O8381M4350l6738k7626L4759R450o0681k5431M8153L0199k2157K7059
$$ -123275 -54894 -10544 -47282 -74908 -40149 -30699 -91380 -116811 -68658 -38459 -60616 -33557
15829c3557P983O233j716L8270m8941k5798j0265j0448R321K0163O8359P556k8733
$$ -33557 -25574 -19341 -21057 17213 -31728 -57526 -67791 -78239 -68918 -48755 19604 27160 -1573
15816a573P1293o545o7532l311k705p458J5078k7927m9268j8609K9351k62l3014
$$ -1573 69720 63175 -4357 -7668 -10373 -17831 -2753 -30680 -79948 -98557 -69206 -69468 -102482
15803a02482j4737q678M3662k1665n1232K4362Q3484k0588k9230M6982K7836k0697
$$ -102482 -117219 -125897 -82235 -103900 -155132 -130770 -47286 -67874 -97104 -50122 -22286 -42983
15791d2983l000l6208n768N4953K5220K7170J6490m6671M1278o795o9854l2013
$$ -42983 -45983 -82191 -87959 -33006 -7786 19384 35874 -10797 30481 23686 -46168 -78181
15779g8181m34L344P66J3520J0969R038O079k8792Q470K5539M5169J4559r413
$$ -78181 -78615 -75271 -74505 -60985 -50016 -40978 -34899 -63691 -55221 -29682 15487 30046 20633
15766B0633l4486j4148K5768l9405l750j4914m2754l7297r74M6704K9212K2328
$$ 20633 -13853 -28001 -2233 -41638 -45388 -60302 -103056 -140353 -141327 -94623 -65411 -43083
15754d3083j4757n8253M4233O5914j7587l3250J3833L2843j174j0663k7659l0816
$$ -43083 -57840 -116093 -71860 -5946 -23533 -56783 -42950 -10107 -11281 -21944 -49603 -80419
15742h0419k4533k2361K4013N8512m234k4547j0595j3766k5655j7542J01697N0935
$$ -80419 -104952 -127313 -103300 -44788 -49022 -73569 -84164 -97930 -123585 -141127 -39430 11505
15730A1505L32L3006j1777q72m1075k448k5693k126K8306J5157L7859N8613o4587
$$ 11505 11837 44843 33066 32194 -8881 -11329 -37022 -39148 -10842 4315 42174 100787 36200
15717C6200r1407l4471J2153Q143j1118J120K3540K552k1368o1045J7085K1686
$$ 36200 -55207 -89678 -77525 -69382 -80500 -79380 -55840 -53288 -74656 -135701 -118616 -96930
15705i6930J3479l3254j4856N8932M8474N1228K0341l7452p5819n6654N9020N8120
$$ -96930 -83451 -116705 -131561 -72629 -24155 27073 47414 9962 -65857 -122511 -63491 -5371
15693e371k6310L2305j4595n9155l535O2820M511m645j8954q625n039M1672O4526
$$ -5371 -31681 624 -13971 -73126 -76661 -13841 -9330 -13975 -32929 -41554 -46593 -4921 59605
15680E9605l5931k2728m5136j4815j1634M0224K7814j9752j2815M5197N6816k9819
$$ 59605 23674 946 -44190 -59005 -70639 -30415 -2601 -22353 -35168 10029 66845 37026
15668C7026M2464o3428p3449m1455k0859J3670J4131N5796j4448Q907k7784k2816
$$ 37026 79490 16062 -57387 -98842 -119701 -106031 -91900 -36104 -50552 -41645 -69429 -92245
15656i2245L652L7827M0687R124j0711l3616o530K0279j5515m7527K1571K5919
$$ -92245 -88593 -50766 -10079 -955 -11666 -45282 -51812 -31533 -47048 -94575 -73004 -47085
15644d7085J5845J3386M425K840M302p96J304l3472j4474j6736M2903l1483J6357
$$ -47085 -31240 -17854 -13429 -10589 -6287 -7083 -5779 -39251 -53725 -70461 -27558 -59041 -42684
15631d2684L5200n6213L4121P8748m5250m0773M7336j3959j9739J2819j3177q083
$$ -42684 -7484 -63697 -29576 49172 3922 -36851 10485 -3474 -23213 -10394 -23571 -31654
15619c1654k7356K6806k7692N4720k5868l6345P7446l1363o8239l837M4353J3054
$$ -31654 -59010 -32204 -59896 -5176 -31044 -67389 10057 -21306 -89545 -93382 -49029 -35975
15607c5975l5361L7969M0062o431m9018k1004J4581j5520L6318K1441r293m3600
$$ -35975 -71336 -33367 6695 264 -48754 -69758 -55177 -70697 -34379 -12938 -22231 -65831
15595f5831m5531q023N495j3559L011O4000K619J9170k9556k0138P5294N7270
$$ -65831 -111362 -119385 -113890 -127449 -124438 -60438 -57819 -38649 -68205 -88343 -13049 44221
15583D4221L890j7884j02420m8446J5667M3459j3437K9462l3214k1969k245j2640
$$ 44221 48111 30227 -72193 -120639 -104972 -61513 -74950 -45488 -78702 -100671 -102916 -115556
15571a15556j2240O0548M849o9991p972P2464N9947K3552K6668O032k9853j5827
$$ -115556 -127796 -67248 -62399 -132390 -140362 -67898 -7951 15601 42269 48301 18448 2621
15559B621k0256J2754j5805O1969o1755o3512K8713P31K2894R385j552P737N228
$$ 2621 -17635 -4881 -20686 41283 -20472 -83984 -55271 -54540 -31646 -22261 -23813 -16076 -10848
15546a0848k5517l6380R194O215K5191l605j5773l0321j4109n010l0277j3159
$$ -10848 -36365 -72745 -63551 -57336 -32145 -35750 -51523 -81844 -95953 -100963 -131240 -144399
15534a44399j3531J4843M9061k6029m9519M1579K5352o0006m3336N3527O4063
$$ -144399 -157930 -143087 -94026 -120055 -169574 -127995 -102643 -162649 -205985 -152458 -88395
15523h8395j2338N482K518n0058q885K5850r825N2924Q567J838l229J7450k0872
$$ -88395 -100733 -95251 -92733 -142791 -151676 -125826 -135651 -82727 -74160 -72322 -75551 -58101 -78973
15510g8973l6106J4466o964M0626M7019n3906N754k1419j2801K2453K4977K9352
$$ -78973 -115079 -100613 -107577 -66951 -19932 -73838 -68084 -89503 -102304 -79851 -54874 -25522
15498b5522M280K405j0498j0258P669p584K8399O467k7603o4249J277r572j4026
$$ -25522 -21242 -18837 -29335 -39593 -31924 -39508 -11109 -4642 -32245 -96494 -95217 -104789 -118815
15485a18815k0166m6962q695O339M2498p821M2018K2483Q523M6654q78J9799j1448
$$ -118815 -138981 -185943 -194638 -188299 -145801 -153622 -111604 -89121 -80598 -33944 -34822 -15023 -26471
15472b6471m9355k9876R550k933N3788Q448l1649k9331n6864L3431N9408k349
$$ -26471 -75826 -105702 -96152 -99085 -45297 -36849 -68498 -97829 -154693 -121262 -61854 -64203
15460f4203k2410n0577j4705Q6372K2446J2130J6736m1300l3622L0319L333j3839
$$ -64203 -86613 -137190 -151895 -65523 -43077 -30947 -14211 -55511 -89133 -58814 -55481 -69320
15448f9320L5274M7491l4784m2948k7270l4981M2116K7169j1672l028M842j7644
$$ -69320 -34046 13445 -21339 -64287 -91557 -126538 -84422 -57253 -68925 -71953 -67111 -84755
15436h4755r837R1988J7023l8008l3328j708k3704m2285R355N9394Q326J6250
$$ -84755 -94592 -2604 14419 -23589 -56917 -58625 -82329 -124614 -115259 -55865 -47539 -31289
15424c1289N260l7455r405k038M2709P795o7096K5146M6095L3675O596k7096N6812
$$ -31289 -26029 -63484 -72889 -74927 -32218 -24423 -91519 -66373 -20278 13397 19993 -7103 49709
15411D9709m4828p4221O366M583K2165m1822n5980l386J956P9854J2559L5345
$$ 49709 4881 -69340 -62974 -58391 -36226 -78048 -134028 -137414 -135458 -55604 -43045 -7700
15399g700J8054M814k5713o8754q3674R38M3024N4809K8187j9698j2801M3599
$$ -7700 10354 15168 -10545 -79299 -162973 -162035 -119011 -64202 -36015 -55713 -68514 -24915
15387b4915l4827M330K390m449L2033N7158J7016l1936J310o962j7879J4326j1297
$$ -24915 -59742 -55412 -53022 -57471 -25438 31720 48736 16800 18110 11148 -6731 7595 -3702
15374c702K2203j505m0650j154j9068O0000M40l9767l0379k0037j3917O140L8592
$$ -3702 18501 16996 -23654 -24808 -43876 16124 16564 -23203 -53582 -73619 -87536 -81396 -42804
15361d2804M8976j9285k4804n1910j1288K1481K7857K1266l6986O269R944K7144
$$ -42804 6172 -13113 -37917 -89827 -101115 -79634 -51777 -30511 -67497 -61228 -51284 -24140
15349b4140K7017l135l9405j0363Q687K3548K6025M1995L988o1848o5089m9125
$$ -24140 2877 -258 -39663 -50026 -41339 -17791 8234 50229 54217 -7631 -72720 -121845
15337a21845m2733K6498j1117j224Q436K6039k7149J0824M9900k4027J5843O1952
$$ -121845 -164578 -138080 -149197 -150421 -141985 -115946 -143095 -132271 -82371 -106398 -90555 -28603
15325b8603M6957j9738l7025O1226O2556L2376p799l0247r427l0898n2409l2112
$$ -28603 18354 -1384 -38409 22817 85373 117749 109950 79703 70276 39378 -13031 -45143
15313d5143l6847j6650J8775K8385J1214M9155j695k9277J6676O645l2962L4686
$$ -45143 -81990 -98640 -79865 -51480 -40266 8889 7194 -22083 -5407 1238 -31724 2962
15301B962j5196k9977j3579K3944j0066k7641K4074O6690L5765n8142j02482k1395
$$ 2962 -12234 -42211 -55790 -31846 -41912 -69553 -45479 21211 56976 -1166 -103648 -125043
15289a25043P0221L4329J3934k6743k0370J5898K656k4216K5230K4980O041K4592
$$ -125043 -54822 -20493 -6559 -33302 -53672 -37774 -35118 -59334 -34104 -9124 -3083 21509
15277B1509k4386j6555M8823M1503l5374n5452n0253n1541O355O3605k8582J3913
$$ 21509 -2877 -19432 29391 70894 35520 -19932 -70185 -121726 -115371 -51766 -80348 -66435
15265f6435K3287K880K3439j5109l5077j0412l4072l9593L5877K9141K252j0892
$$ -66435 -43148 -40268 -16829 -31938 -67015 -77427 -111499 -151092 -115215 -86074 -83822 -94714
15253i4714Q974M3078K0501m5637l3262K3569O2886Q8873p7689q9133K9501J5863
$$ -94714 -85740 -42662 -22161 -67798 -101060 -77491 -14605 74268 -3421 -92554 -63053 -47190
15241d7190j0824J7818M843J0273l5018P329j8423p149q561O3978M2131J839J1473
$$ -47190 -58014 -40196 -35353 -25080 -60098 -52769 -71192 -78341 -86902 -22924 19207 21046 32519
15228C2519o3570j1361o042k7893K006k4586P289J4132N9174M3545l7619J1781
$$ 32519 -31051 -42412 -48454 -76347 -74341 -98927 -91638 -77506 -18332 25213 -12406 -625
15216f25L821m5498l9061l9369J6027J549K0657P558J542L2873R895K482j7411
$$ -625 3196 -42302 -81363 -120732 -104705 -103156 -82499 -74941 -73399 -40526 -30631 -28149 -45560
15203d5560K3620J7645m6813o0668K547M0447N1826K4240N501k6446j8811m3127
$$ -45560 -21940 -4295 -51108 -111776 -109229 -68782 -16956 7284 12785 -13661 -32472 -75599
15191g5599j7370j8494J7401O6079M1636m1529n1685k4139K4713J9117L877m109
$$ -75599 -92969 -111463 -94062 -27983 13653 -27876 -79561 -103700 -78987 -59870 -55993 -60102
15179f0102J4141Q481j7338r030N517k1567l7190m822L3024K6155K3851j563L0097
$$ -60102 -45961 -37480 -54818 -63848 -58331 -79898 -117088 -121910 -88886 -62731 -38880 -40443 -10346
15166a0346O8625k8513l4659L978p4N206M9025O0822j4372k6829j4425m3825m2484
$$ -10346 58279 29766 -4893 -915 -989 4217 53242 114064 99692 72863 58438 14613 -27871
15153b7871m9481Q304O1083K6784L48k3286r825O333n289j6440J7701J2269m8959
$$ -27871 -77352 -69048 -7965 18819 19167 -4119 -13944 -7611 -12900 -29340 -11639 630 -48329
15140d8329l6288j5100L3877k2198l0007K2737N1953N6230M9136J7940o563j1224
$$ -48329 -84617 -99717 -65840 -88038 -118045 -95308 -43355 12875 62011 79951 73388 62164
15128F2164n6565m3648J8025K7635j7444m6K6809m272j8524q503l8067o070j5508
$$ 62164 5599 -38049 -20024 7611 -9833 -9879 16930 12658 -5866 -14369 -52436 -58506 -74014
15115g4014N382m245l544L3253j6091r284J0354J2161L0876l8761L1091K6175
$$ -74014 -68632 -72877 -76421 -43168 -59259 -68543 -58189 -46028 -15152 -53913 -22822 3353
15103C353m8099R668N3415M3021m441N326K241l3762m6929l1460J1903l9035p7458
$$ 3353 -44746 -35078 18337 61358 56917 62243 64484 30722 -16207 -47667 -35764 -74799 -152257
15090a52257m0744L7364L2783K6398M2585J6671r49j7619j9092k4980K8182R977
$$ -152257 -193001 -155637 -122854 -96456 -53871 -37200 -38149 -55768 -74860 -99840 -71658 -61681
15078f1681p738k5454o485M4466r980p278J295r846j0272K7084M7880m0824l7309
$$ -61681 -69419 -94873 -101358 -56892 -66872 -74150 -72855 -82701 -92973 -65889 -18009 -58833 -96142
15065i6142K2249K0131K2514M7478m7280K0097N5735j5807J6561l019k4964k3883
$$ -96142 -73893 -53762 -31248 16230 -31050 -10953 44782 28975 45536 42517 17553 -6330
15053f330L9070O0460l0225n7101K5734o2340k0570O9605R950m3979L2117k1163
$$ -6330 32740 93200 62975 5874 31608 -30732 -51302 18303 28253 -15726 16391 -4772
15041d772m3423k3979j613M2692l7455k1166L9195R471L164r608m3734j3500M6257
$$ -4772 -48195 -72174 -73787 -31095 -68550 -89716 -50521 -41050 -37886 -47494 -91228 -104728 -58471
15028e8471N1057p876M153L4812k5608l2786j9551J2656K1055M2562k0613j0975
$$ -58471 -7414 -15290 -11137 23675 -1933 -34719 -54270 -41614 -20559 22003 1390 -9585
15016i585n3081J8460R62L5634K6901J31l3919l7822J4849J7710k9382j2367j1123
$$ -9585 -62666 -44206 -43244 -7610 19291 19422 -14497 -52319 -37470 -19760 -49142 -61509 -72632
15003g2632L6957M2199k6792L094l7052m1542L7916N1382J7456J3584k6577k082
$$ -72632 -35675 6524 -20268 -17174 -54226 -95768 -57852 -6470 10986 24570 -2007 -4089
14991d089k401J5222l4781K5591K6451n1232k2085l0978L9510N3959O4256l8930
$$ -4089 -6490 8732 -26049 -458 25993 -25239 -47324 -78302 -38792 15167 79423 40493
14979D0493n2450L0125J0759O713n5410m6499k617J6836m3106K2337j4039J3109
$$ 40493 -11957 18168 28927 35640 -19770 -66269 -68886 -52050 -95156 -72819 -86858 -73749
14967g3749l9128j7733k804K5319N962M6497K8129J357L2108j3724j8820k2475
$$ -73749 -112877 -130610 -133414 -108095 -102133 -55636 -27507 -26150 5958 -7766 -26586 -49061
14955d9061L0006L5334o1944j8961O783l1866L944K7966M829J1622M4097J9927
$$ -49061 -19055 16279 -45665 -64626 -57843 -89709 -85765 -57799 -52970 -41348 2749 22676
14943B2676j7369l2692p0355k0791P8947J6117l5184O2722l0215n825l4210J2441
$$ 22676 5307 -27385 -97740 -118531 -39584 -23467 -58651 4071 -26144 -31969 -66179 -53738
14931e3738J5094J1562J1160j0073M946R905K466k0141N3072K8035j8634p3829
$$ -53738 -38644 -27082 -15922 -25995 -21049 -11144 -8678 -28819 24253 52288 33654 -40175
14919d0175J0557R286l1711j2562M6030L6539O850j6655r678r312k9683O170N232
$$ -40175 -29618 -20332 -52043 -64605 -18575 17964 24814 8159 -1519 -10831 -40514 -34344 -29112
14906b9112m6792r890j0021M5710N6924j2004k3939J1287j7605j3003K0213q33
$$ -29112 -75904 -85794 -95815 -50105 6819 -5185 -29124 -17837 -35442 -48445 -28232 -29065
14894b9065k2274K373j8464P906l0511l3040P909N1015M0133M1319j5458l3830
$$ -29065 -51339 -48966 -67430 -59524 -90035 -123075 -115166 -64151 -24018 17301 1843 -31987
14882c1987l0508O6272M175j3623q9506l2944Q0937N4043m2984j3675K6263j3756
$$ -31987 -62495 3777 7952 -5671 -95177 -128121 -47184 6859 -36125 -49800 -23537 -37293
14870c7293J3299K4183j9475o1005k4976J3382N0099N540M055K6858O684n614
$$ -37293 -23994 189 -19286 -80291 -105267 -91885 -41786 -36246 -32191 -5333 1351 -4263
14858d263j376k4031k4776N5604K0023J4371j6891k3670o0711o662M8716l6332
$$ -4263 -5639 -29670 -54446 1158 21181 35552 18661 -5009 -65720 -72382 -23666 -59998
14846e9998L3298k1064J463J8788l8494k3666k9189J7381P4358K7242j1037J2350
$$ -59998 -26700 -47764 -46301 -27513 -66007 -89673 -118862 -101481 -27123 119 -10918 1432
14834A432J6833j7338m2242k8246L3700N198N4344N0231p657l4698p817l6779
$$ 1432 18265 927 -41315 -69561 -35861 -30663 23681 73912 66255 31557 23740 -13039
14822a3039M3108K6332J3191p546j753l7646K2154K9890n4255m1880j3325P114
$$ -13039 30069 56401 69592 62046 60293 22647 44801 74691 20436 -21444 -34769 -27655
14810b7655K9247L449l8636J1073O846j6154M1956K1843r522L340n603n1464Q857
$$ -27655 1592 5041 -33595 -22522 -15676 -31830 10126 31969 22447 25787 20184 -31280 -22423
14797b2423L6305J0641n2372K1366L4387j2219L227l4996J4381k8648j835J8679
$$ -22423 13882 24523 -27849 -6483 27904 15685 18912 -16084 -1703 -30351 -32186 -13507
14785a3507M0664k0385j9906k038j1876p282k1276l312K989J0410l0174m0524
$$ -13507 27157 6772 -13134 -15172 -27048 -34330 -55606 -58918 -55929 -45519 -75693 -116217
14773a16217J7846N2069K2995k0686k9571l9314r091j0333K5797q065K0713J8801
$$ -116217 -98371 -46302 -23307 -43993 -73564 -112878 -121969 -132302 -106505 -114570 -93857 -75056
14761g5056K4344J8497j9962j7560J1807K823k0920p292L1266l042Q667N4814
$$ -75056 -50712 -32215 -52177 -69737 -57930 -55107 -76027 -83319 -52053 -55095 -46428 8386
14749H386q556m8040L2697k1431l3851L434N3335J5365J7625p3423q6980L9584
$$ 8386 -170 -48210 -15513 -36944 -70795 -67361 -14026 1339 18964 -54459 -141439 -101855
14737a01855K7106l0455L1907O1561k9899m9216P174j4799K6641O4105L1591M4021
$$ -101855 -74749 -105204 -73297 -11736 -41635 -90851 -83677 -98476 -71835 -7730 23861 67882
14725F7882M8267o2117o3958k9766n1662M7637L2941j2741L4971k6785l5396p902
$$ 67882 116149 54032 -9926 -39692 -91354 -43717 -10776 -23517 11454 -15331 -50727 -58629
14713e8629k202j3544n0138L7239M3305O0535j446m3276l1122K4702j1463N6766
$$ -58629 -60831 -74375 -124513 -87274 -43969 16566 15120 -28156 -59278 -34576 -46039 10727
14701A0727M8510j0137m0387l0385J2636l1493k0595K0455O520o8036m1363K5027
$$ 10727 59237 49100 8713 -21672 -9036 -40529 -61124 -40669 -34149 -102185 -143548 -118521
14689a18521r948O185L4830K7660K6515R077N9280L9186n0135q799L2891L4066
$$ -118521 -128469 -122284 -87454 -59794 -33279 -24202 35078 74264 24129 15330 48221 82287
14677H2287K6425n0166p3514k2345K693k0122N13j4840n263J6314J2983R688M2235
$$ 82287 108712 58546 -14968 -37313 -34620 -54742 -54229 -69069 -74332 -58018 -45035 -35347 6888
14664F888M6093k3366J7038J6236k6526o6426m5979k3657P3204Q1279o602m0364
$$ 6888 52981 29615 46653 62889 36363 -30063 -76042 -99699 -26495 54784 48182 7818
14652G818m3255L432J7728k73l014k3239N559m2967m7607L3279O8353J2701m7518
$$ 7818 -35437 -32005 -14277 -14550 -17564 -40803 -35244 -78211 -125818 -92539 -24186 -11485 -59003
14639e9003m853K4667o29o259l1013m0556k6017q855K5570L8182J2330J6767j7687
$$ -59003 -63856 -39189 -39818 -46077 -77090 -117646 -143663 -152518 -126948 -88766 -76436 -59669 -77356
14626g7356N892m9312l2901J6981M6381j6454k1644J7573L7283P874R6972N641
$$ -77356 -71464 -120776 -153677 -136696 -90315 -106769 -128413 -110840 -73557 -65683 31289 36930
14614C6930J2228q886n1022l6221M8900j4161n5617m3422l0893K0074N1223K6569
$$ 36930 49158 40272 -10750 -46971 1929 -12232 -67849 -111271 -142164 -122090 -70867 -44298
14602d4298m455l3375o881L5296k3009L0805Q286m4517K4672Q1784l189l1793
$$ -44298 -48753 -82128 -89009 -53713 -76722 -45917 -37631 -82148 -57476 24308 21119 -10674
14590a0674k0689N619k3220l0799L7966N1234k9701m8924j5102L4640L0774j9336
$$ -10674 -31363 -25744 -48964 -79763 -41797 9437 -20264 -69188 -84290 -49650 -18876 -38212
14578c8212k9260k4368k0770r674J9158J4053O1932M0910j7026m3662o4409J3346
$$ -38212 -67472 -91840 -112610 -122284 -103126 -89073 -27141 13769 -3257 -46919 -111328 -97982
14566i7982j2743q84K5477P5475J4722J1440L5190n4268l6740J043m9408k0701
$$ -97982 -110725 -111609 -86132 -10657 4065 15505 50695 -3573 -40313 -39270 -88678 -109379
14554a09379M9504Q228P654K3595l9939K0000n516M127N2262o855k0489l0646
$$ -109379 -59875 -51647 -43993 -20398 -60337 -40337 -45853 -41726 10536 3681 -16808 -47454
14542d7454K3351Q2700K0095m5837q104J1710k1460m9701m8830k4463J7953J8557
$$ -47454 -24103 58597 78692 32855 24751 36461 15001 -34700 -83530 -107993 -90040 -71483
14530g1483K2007K5957M7556L2784M932j5337J4107l6595L371m684K1665N2214
$$ -71483 -49476 -23519 24037 56821 61753 46416 60523 23928 27299 22615 44280 96494
14518I6494K1425o5845m1998k6168k4222k7456L7806J8477o531k1027k6937l9137
$$ 96494 117919 52074 10076 -16092 -40314 -67770 -29964 -11487 -18018 -39045 -65982 -105119
14506a05119j7830m2601R0789L8584K2616J1437o5041j5718M3835P3225R473j9713
$$ -105119 -122949 -165550 -74761 -36177 -13561 -2124 -67165 -82883 -39048 34177 43650 23937
14494B3937Q432J1020j6404J9586Q478q5589p1070M9943R3709M9972K3548J094
$$ 23937 32369 43389 26985 46571 55049 -30540 -101610 -51667 42042 92014 115562 116656
14482A16656q4831j16089N666M4476l859K3415j951j1591J1254J3021m8678k0396
$$ 116656 31825 -84264 -78598 -34122 -37981 -14566 -16517 -28108 -16854 -3833 -52511 -72907
14470g2907k0660L8395L0240K2957j2121O750J4397J0553J0853k921M447J3504
$$ -72907 -93567 -55172 -24932 -1975 -14096 -7346 7051 17604 28457 25536 29983 43487
14458D3487k622k6718l5100n0176K840L7662L354o353l0038J0843O6123m08J8283
$$ 43487 40865 14147 -20953 -71129 -68289 -30627 -27273 -33626 -63664 -52821 13302 12894 31177
14445C1177L8188J0785l3297m9847k7933l3979P1376M0123R392m6182j5114M09
$$ 31177 69365 80150 46853 -2994 -30927 -64906 6470 46593 55985 9803 -5311 -4902
14433d902J8752J5574m0562j5088L2646m8891o7550J8192M6154k5517L6815K4822
$$ -4902 13850 29424 -11138 -26226 6420 -42471 -110021 -91829 -45675 -71192 -34377 -9555
14421i555k0433K2657k2507K7115l6655j0031M4398j3714m1468J2415M3526j5064
$$ -9555 -29988 -7331 -29838 -2723 -39378 -49409 -5011 -18725 -60193 -47778 -4252 -19316
14409a9316O4886L0287j7594q5901j4174j1401K2644j9737M5224M5858j8545L5309
$$ -19316 45570 75857 58263 -27638 -41812 -53213 -30569 -50306 -5082 40776 22231 57540
14397E7540m4952p2915q203l3332K3549N8758p04J0022K7917J275o0679l8840
$$ 57540 12588 -60327 -68530 -101862 -78313 -19555 -20259 -10237 17680 18955 -41724 -80564
14385h0564J2542L6589K2923J4603j7450J8219n687p704R603m2021O234n14j276
$$ -80564 -68022 -31433 -8510 6093 -11357 6862 1175 -6529 3074 -38947 -32713 -33227 -34503
14372c4503K3631k9830J360L7004L7592M4216Q214l6232l3960P632p337J8449
$$ -34503 -10872 -40702 -39342 -2338 35254 79470 87684 51452 17492 25124 17787 36236
14360C6236n651l1717J2136l2036l904J5226K2831k2802J8002k2966R592J5740
$$ 36236 30585 -1132 11004 -21032 -24936 -9710 13121 -9681 8321 -14645 -5053 10687
14348A0687k2985q593k1603n7216P556J569M1687L8923O2846L020n1529K0234
$$ 10687 -12298 -20891 -42494 -99710 -92154 -90585 -48898 -9975 52871 55891 4362 24596
14336B4596k3314p668j9922J4870P4537l3520l4242K8989R878P624o3361m3091
$$ 24596 1282 -6386 -26308 -11438 63099 29579 -4663 24326 34204 41828 -21533 -64624
14324f4624l1205L9550m3L1546J862M0119j3737k2242J3251L6248k5039o643O114
$$ -64624 -95829 -56279 -56322 -24776 -22914 17205 3468 -18774 -5523 30725 5686 -957 5157
14311E157l1339k1669N4132L7746j8905K785k369m0836k5181k2261K5736N652
$$ 5157 -26182 -47851 6281 44027 25122 27907 25538 -15298 -40479 -62740 -37004 -31352
14299c1352k3972O7558N3321m6206p2048k3333L1735M4600M3930J0780j0119k7770
$$ -31352 -55324 12234 65555 19349 -52699 -76032 -44297 303 44233 55013 44894 17124
14287A7124p2705M1681M0319K5490j3929k705l3203K7313J0527L415N9518M2786
$$ 17124 -55581 -13900 26419 51909 37980 35275 2072 29385 39912 43327 102845 145631
14275A45631l1437j4491n0860k090J1559k9078k7410J0344O375J4056P048J7185
$$ 145631 114194 99703 48843 46753 58312 29234 1824 12168 18543 32599 39647 56832
14263E6832J0942n4264J0931j0206m8943J4521L504j9497J9462L684n2926k67
$$ 56832 67774 13510 24441 14235 -34708 -20187 -16683 -36180 -16718 -13034 -65960 -66227
14251f6227N4372N6680m4840p923P704k2932n3810K2849J9191l466m4071j2793
$$ -66227 -11855 44825 -15 -7938 -234 -23166 -76976 -54127 -34936 -38402 -82473 -95266
14239i5266k1573O677R7628J7798k1138j2537k7677O0795K8325L5799l027n3537
$$ -95266 -116839 -110162 -12534 5264 -15874 -28411 -56088 4707 33032 68831 65804 12267
14227A2267j5092l7792j3321P0727J3801K3509l4935j5586J1k1262J7952l0322
$$ 12267 -2825 -40617 -53938 16789 30590 54099 19164 3578 3589 -17673 279 -30043
14215c0043k6430M2396O098j2203Q1431P3488l9233n1113j3972k0084l6721p85
$$ -30043 -56473 -14077 -7979 -20182 61249 134737 95504 44391 30419 10335 -26386 -27171
14203b7171K9024R590q928j801p591j0337J0594p747N662J3213m8288l4922J6786
$$ -27171 1853 11443 2515 714 -6877 -17214 -6620 -14367 -8705 4508 -43780 -78702 -61916
14190f1916J0794K1191J2229O8719J2100l4485k3103o636k95J7300m4309j1159
$$ -61916 -51122 -29931 -17702 51017 63117 28632 5529 -1107 -1402 15898 -28411 -39570
14178c9570K3450l352J8353L705k669K3405K228j7596L932O3507N080m3380P934
$$ -39570 -16120 -19472 -1119 2586 -83 23322 25550 7954 11886 75393 80473 37093 45027
14165D5027o1274l2447M1684l1866n0795M835N3480Q625o1601m0721O5672J1976
$$ 45027 -16247 -48694 -7010 -38876 -89671 -84836 -31356 -22731 -84332 -125053 -59381 -47405
14153d7405L0476j1417J3927J3374J1316k2908p499j8323K9805K8648q549k8419
$$ -47405 -16929 -28346 -14419 -1045 10271 -12637 -20136 -38459 -8654 19994 11445 -16974
14141a6974P479n0477l086K1688L2271l5332M5671J08164M424l4939k6585k9216
$$ -16974 -9495 -59972 -63058 -41370 -9099 -44431 1240 109404 113828 78889 52304 23088
14129B3088J2377K1107n1191l3466O044R2089N2937j5814K3837L3095k8289l0719
$$ 23088 35465 56572 5381 -28085 -22041 70048 122985 107171 131008 164103 135814 105095
14117A05095k0084n2352j6302j1938k1432n768J4909j4916j3687L540J0104L7797
$$ 105095 85011 32659 16357 4419 -17013 -22781 -7872 -22788 -36475 -32935 -22831 14966
14105A4966L3037R399L854l7094p201K7076k5672P730M7438O6702j0544m9180
$$ 14966 48003 57402 61256 24162 16961 44037 18365 26095 73533 140235 129691 80511
14093H0511J9408l3019q2302p307o287J3146l884l3487m7528K4042N7152l0152
$$ 80511 99919 66900 -15402 -22709 -28996 -15850 -19734 -53221 -100749 -76707 -19555 -49707
14081d9707K0486J9339o1351n068J05971L6350J0842o6550p0964j6248o514k3677
$$ -49707 -29221 -9882 -71233 -76301 29670 66020 76862 10312 -60652 -76900 -83414 -107091
14069a07091M8099L0421k3671j7494J1170K4471N9025K2719j4696L0859L1669
$$ -107091 -58992 -28571 -52242 -69736 -58566 -34095 24930 47649 32953 63812 95481
14058I5481k2917m4749l6193j1331M0651m9999J6452P7053L0236K9060k9481o8359
$$ 95481 72564 27815 -8378 -19709 20942 -29057 -12605 64448 94684 123744 94263 25904
14046B5904l296K6804k2202k0626M5113L8527J4967n128n8068o2966j5359K3609
$$ 25904 22608 49412 27210 6584 51697 90224 105191 100063 41995 -20971 -36330 -12721
14034a2721N1085J208k1589m1002J8916K1007O501k9321L0505l343r262O8128
$$ -12721 38364 39572 17983 -23019 -4103 16904 23405 -5916 24589 21246 11984 80112
14022H0112K8503j3264j1554l6661j3162k5073k9717L9679L0908r33L2631K1340
$$ 80112 108615 95351 83797 47136 33974 8901 -20816 18863 49771 48838 81469 102809
14010A02809J4836M7105p1116q2864K1958k1018N4071M4474O315J5730j8321M1419
$$ 102809 117645 164750 93634 10770 32728 11710 65781 110255 116570 132300 113979 155398
13998A55398J2044j7002m2701l8093K5624m1520q293J3003n3667l8309k2564j4509
$$ 155398 167442 150440 107739 69646 95270 53750 45457 58460 4793 -33516 -56080 -70589
13986g0589O7448N394l675L5336r642l7884Q852k9801J9888L9674R512J5411k782
$$ -70589 -3141 2253 -1422 33914 24272 -13612 -4760 -34561 -14673 25001 34513 49924 47142
13973D7142R631k9247J2684N048J6682k4325k8483m9368M7483Q820q638K507J4776
$$ 47142 56773 27526 40210 45258 61940 37615 9132 -40236 7247 16067 7429 9936 24712
13960B4712J323N821q992l5243J5086M3753M3426l368o3399n4249Q939J795m7078
$$ 24712 26035 31856 22864 -12379 2707 46460 89886 86518 23119 -31130 -22191 -20396 -67474
13947f7474Q797K9599Q3993J7637l2642n3008o7138J200O5781J09784r239n8574
$$ -67474 -58677 -29078 54915 72552 39910 -13098 -80236 -79036 -13255 96529 87290 28716
13935B8716k1004J352N6870M5567j6940m6218J6250K0848k7469l6315M2813K6876
$$ 28716 7712 9064 65934 111501 94561 48343 64593 85441 57972 21657 64470 91346
13923I1346m4281N306N019J1741K0627k923m600k9209q624J084k6527j1889n0363
$$ 91346 47065 52371 57390 69131 89758 86835 82235 53026 44402 45486 18959 7070 -43293
13910d3293j4023J9068k833j722J6319L6979Q0250L2254r6155K0435J22366M2398
$$ -43293 -57316 -38248 -41081 -42803 -26484 10495 90745 122999 26844 47279 169645 212043
13898B12043j03964n0312j1986J3350J8098M1241j1417n7750j1379L7190L8703
$$ 212043 108079 57767 45781 59131 77229 118470 107053 49303 37924 75114 113817
13887A13817r259J7j902M7276j5357l9731k9593l1720m8517K6433K0957M8183
$$ 113817 104558 104575 102673 149949 134592 94861 65268 33548 -14969 11464 32421 80604
13875H0604q532k5395p2311l80J8875l3288k9534N1564L0403L0089L2345l981
$$ 80604 72072 46677 -25634 -26014 -7139 -40427 -69961 -18397 12006 42095 74440 70459
13863G0459l9104o0242o018M0312N3035R2585j9099j05696k0400l4820O4269N8081
$$ 70459 31355 -28887 -34905 5407 58442 151027 131928 26232 5832 -28988 35281 93362
13851I3362p585q8373j5630P1184M9172m6515j8605L310o677N1934l592J2022
$$ 93362 85777 -2596 -18226 52958 102130 55615 37010 40320 33643 85577 81985 94007
13839I4007K2259l2748n5745O0326O176m4381j064R190n898j6278k1940J0530
$$ 94007 116266 83518 27773 88099 94275 49894 48830 58020 52122 35844 13904 24434
13827B4434K7855n3821J9574j2411k5256K2530O2200L5068L170k7650J5644k0216
$$ 24434 52289 -1532 18042 5631 -19625 2905 65105 100173 103343 75693 91337 71121
13815G1121j1316l7991K9175j5457k1469P287K647P1077N5535l2313l0190K6254
$$ 71121 59805 21814 50989 35532 14063 21350 23997 95074 150609 118296 88106 114360
13803A14360n825l6075K905j840K0705j5431k6505L2078K5202k7815P484j53l4301
$$ 114360 108535 72460 75365 73525 94230 78799 52294 84372 109574 81759 89243 89090 54789
13790E4789k4348l80M8125L0535p772R097o4280r856N9082l2918j9652J9490j556
$$ 54789 30441 30061 78186 108721 100949 110046 45766 35910 94992 62074 42422 61912 60356
13777F0356J2379l0797k4628Q810K259L4246q19N777L5969k9446m7875M572K0720
$$ 60356 72735 41938 17310 26120 28379 62625 61806 67583 103552 74106 26231 30803 51523
13764E1523K8320k0006m5878j675m4108q504P696J0610L6398N2699M388J039k7623
$$ 51523 79843 59837 13959 12284 -31824 -40328 -32632 -22022 14376 67075 71463 72502 44879
13751D4879j2723r062L2685K7872l6877J1056J2751K8586J98R665k7514p2051
$$ 44879 32156 23094 55779 83651 46774 57830 70581 99167 99365 109030 81516 9465
13739I465L4261M3527K8381K4253p811L167K4534l4977k6777O0k6497K2478O2357
$$ 9465 43726 87253 115634 139887 132076 135243 159777 124800 98023 98083 71586 94064 156421
13726A56421m9324k0448J0593l2323J0752J01650J1742m9049l1827m5570m9258
$$ 156421 107097 86649 97242 64919 75671 177321 189063 140014 108187 62617 13359
13715A3359K8841N1012N280R918j8223k2836p37M5065k487J822K525j120k9904
$$ 13359 42200 93212 98492 108410 90187 67351 66614 111679 109192 111014 113539 112419 82515
13702H2515J0268J4389M4265J3053p4785l8122J2176P5734K0335l3502L3027K3926
$$ 82515 92783 107172 151437 164490 89705 51583 63759 139493 159828 126326 159353 183279
13690A83279j9219j3517N039l2701K3358k2415j490m6K2288n322O857K1679L820
$$ 183279 164060 150543 155582 122881 146239 123824 122334 122288 144576 139254 146111 167790 171610
13677A71610j7738q235m4091p1363R687L7530L4419J8650k0103k8580J0618R652
$$ 171610 153872 145637 101546 30183 39870 77400 111819 130469 110366 81786 92404 102056
13665A02056p222j4899j5646K5400N5q181M3130K7772o529M1264n3115m0666p559
$$ 102056 94834 79935 64289 89689 89744 81563 124693 152465 145936 187200 134085 93419 85860
13652H5860Q657k264j7731j9969N4122N9859j3208k171N562J7776R559k905m991
$$ 85860 94517 92253 74522 54553 108675 168534 155326 153155 158717 176493 186052 183147 178156
13639A78156J2138P156R065m3438k6116n8715k2627L6462J6415L672q646L4810
$$ 178156 190294 197450 206515 163077 136961 78246 55619 92081 108496 112168 103522 138332
13627A38332K9757J9026o490J2520k0361l5860o592L1591j8371K9920J4018P95
$$ 138332 168089 187115 180625 193145 172784 136924 130332 161923 143552 173472 187490 188285
13615A88285K156k7042l0641J1301J7342n3068J2014L3882J1968l0191n0162j9183
$$ 188285 190441 163399 132758 144059 161401 108333 120347 154229 166197 136006 85844 66661
13603F6661K6971Q3537k395j4810J8777k906j1415O538j8979m6005L157o941J0242
$$ 66661 93632 177169 174774 159964 178741 175835 164420 170958 151979 105974 109131 102190 112432
13590A12432J7109M877m8489L4004L1416N2854j780k8949r167J3115J7479K4875
$$ 112432 129541 134418 85929 119933 151349 204203 202423 173474 164307 177422 194901 219776
13578B19776M7039O534P997k9796l8388l0830j3155m6819r0964q139K099Q5967
$$ 219776 266815 273349 281346 251550 213162 182332 169177 122358 31394 23255 25354 111321
13566A11321N4672N1905k9098n5671l0916m3368l120M3830J2320K953J4374j8186
$$ 111321 165993 217898 188800 133129 102213 58845 55725 99555 111875 114828 129202 111016
13554A11016j8152j2702J593M7802M9746k9577J4118Q171j8818l8310K4454N3777
$$ 111016 92864 80162 81755 129557 179303 149726 163844 172015 153197 114887 139341 193118
13542A93118k294o5537k1278K966j0712J2056K6860P7740N4237j786j01410l1625
$$ 193118 190824 125287 104009 106975 96263 108319 135179 212919 267156 265370 163960 132335
13530A32335j5147L1386j088n0441J5548O4157j977k1596j5565j7465L4635M8353
$$ 132335 117188 148574 147486 97045 112593 176750 174773 153177 137612 120147 154782 203135
13518B03135p274n1257L0166K0064O839L2204J1281q354L5006n3309l6664L8613
$$ 203135 195861 144604 174770 194834 201673 233877 245158 236804 271810 218501 181837 220450
13506B20450p79k8471j4758m6076K0916J7271o2952J0400J0302k8363K7140k1108
$$ 220450 219671 191200 176442 130366 151282 168553 105601 116001 126303 97940 125080 103972
13494A03972J2751L7165M831l770J892j8178p608j3325P441K0447L0521j1010
$$ 103972 116723 153888 158719 154949 156841 138663 131055 117730 125171 145618 176139 165129
13482A65129l1637l7619J0984j3498k2864k490K63O7752k8687j6321Q705J2486
$$ 165129 133492 95873 106857 93359 70495 68005 68268 136020 107333 91012 99717 112203
13470A12203j363J9923J1981j6362j900k9229L4784l1730J9801K5019M896J6822
$$ 112203 110840 130763 142744 126382 124482 95253 130037 98307 118108 143127 148023 164845
13458A64845L0920J4537j0951j28l1440J3440M3296k4570j508K54M5211k5249
$$ 164845 195765 210302 199351 199223 167783 181223 224519 199949 198441 198695 243906 218657
13446B18657m9556j1455p4m9818m1119O284M3500M4183j8628p185k016j4078l6353
$$ 218657 169101 157646 157572 107754 66635 72919 116419 160602 141974 134789 132773 118695 82342
13433H2342j884L9095M2664q299J497J8355p449J7144R86p1860k5015J2865M3169
$$ 82342 80458 119553 162217 153918 155415 173770 166321 183465 184451 112591 87576 100441 143610
13420A43610j0919n263J0430l3064l4130L7346O6580J6473o386k3806j9577O523
$$ 143610 132691 127428 137858 104794 70664 108010 174590 191063 184677 160871 141294 147817
13408A47817K485j5539j1563N0047L4389L7267K7893k0439m569j9430j15664j0827
$$ 147817 150302 134763 123200 173247 207636 244903 272796 252357 247788 228358 112694 101867
13396A01867J1829L918l443P504K0315J1544j3757l1508r453J250K2441m163j4261
$$ 101867 113696 117614 114171 121675 141990 153534 139777 108269 98816 100066 122507 118344 104083
13383A04083q358L7954K9216Q604j4283L575o12J2277J4534k9953k4973l008j1076
$$ 104083 95725 133679 162895 171499 157216 160791 160179 172456 186990 157037 132064 129056 117980
13370A17980j8275p2193J2384j474K3051O3728M777l2467O216R455M2891J5737
$$ 117980 99705 27512 39896 38422 61473 125201 129978 97511 103727 113182 156073 171810
13358A71810k2015L1406j0453P970K1701J9381l5254L1400j3435k7273K113m897
$$ 171810 149795 181201 170748 178718 200419 219800 184546 215946 202511 175238 177351 172454
13346A72454j7696J5836L1279O6188K081l2200l8438m2039r817L309j9934J4032
$$ 172454 154758 170594 201873 268061 270142 237942 199504 157465 147648 150957 131023 145055
13334A45055M3969k8679O994L0853n5878j57m5363n8923O393N3948n926O0415
$$ 145055 189024 160345 167339 198192 142314 142157 96794 37871 44264 98212 92286 152701
13322A52701M2171K9562L7611j4446m3243m9685N881k669K0432j8657L9838j2548
$$ 152701 194872 224434 262045 247599 204356 154671 160552 157883 178315 159658 199496 186948
13310A86948Q4539M3260k4036n8564r567k5782l1274o627M3626J861J4568n8262
$$ 186948 271487 314747 290711 232147 222580 196798 165524 158897 202523 204384 218952 160690
13298A60690n0624j8502L2040L092j033j8859k9756l3587N0585N7298k1354L2212
$$ 160690 110066 91564 123604 126696 125663 106804 77048 43461 94046 151344 129990 162202
13286A62202J5728m6717K1411P5962l872j0550q041q2350J8646K7774l2846J5095
$$ 162202 177930 131213 152624 228586 224714 214164 206123 123773 142419 170193 137347 152442
13274A52442K9162M0713o520j4352m6339j7932j7165K729O2831L1266j772K0250
$$ 152442 181604 222317 215797 201445 155106 137174 120009 122738 185569 216835 215063 235313
13262B35313j1932j9341k9677k4045l7507M8547N9616K0420j4118k452N83j7985
$$ 235313 223381 204040 174363 150318 112811 161358 220974 241394 227276 224824 225407 207422
13250B07422J2497k5281j0301P042N6980J8022p0490k5151K018N0411L1609l3963
$$ 207422 219919 194638 184337 191379 248359 266381 195891 170740 172758 223169 254778 220815
13238B20815j5302L0951p42j9162Q407k7390k1150O959P1586r438j3882K5220
$$ 220815 205513 236464 235722 216560 224967 197577 176427 183386 254972 245534 231652 256872
13226B56872j5441m0865K0584p612l884M380J5097Q700R449j9782m8032N311L1333
$$ 256872 241431 200566 221150 213538 209654 214034 229131 237831 247280 227498 179466 184777 216110
13213B16110r931J0686l2603R051L2966o991L8794k1067l8392l9237N819N7261
$$ 216110 206179 216865 184262 193313 226279 219288 258082 237015 198623 159386 165205 222466
13201B22466K4183m5075r282M0508l0182j5J9136n3309n919q376l6944q1688J0664
$$ 222466 246649 201574 192292 232800 202618 202603 221739 168430 162511 154135 117191 35503 46167
13188D6167K8581K1148L5873N8489O566l6310k9005k628L2956R5811M3876l2896
$$ 46167 74748 95896 131769 190258 196824 160514 131509 128881 161837 257648 301524 268628
13176B68628L119J2984r247k5767k6924l920k1028M808K5060J8736J2861j9075
$$ 268628 271747 284731 275484 249717 222793 218873 197845 202653 227713 246449 259310 240235
13164B40235o637K954l8902j4405j1439K4016j481k683N3896J5571o0057j4368
$$ 240235 233598 236552 197650 183245 171806 195822 194341 191658 245554 261125 201068 186700
13152A86700L6411o292n7082j0296K4468j7317l2774Q4152J2405n2698k697L6015
$$ 186700 223111 216819 159737 149441 173909 156592 123818 207970 220375 167677 164980 200995
13140B00995q0281l6806O7084R8861N1512j8911L215l722j3241p259j1383J476
$$ 200995 120714 83908 150992 249853 301365 282454 285669 281947 268706 261447 250064 251540
13128B51540M1987m0940K5898n1226m2432m929L0484Q2558o772j6305l0419K9378
$$ 251540 293527 252587 278485 227259 184827 179898 210382 292940 286168 269863 239444 268822
13116B68822N4773m8160l4661o3880L7868N2828M1172n122q7295j4209p830O861
$$ 268822 323595 275435 240774 176894 214762 267590 308762 303640 216345 202136 194306 201167
13104B01167k8766l437N0576K9230J6854n804O8270N6227n6320q1171o1885N3091
$$ 201167 172401 168964 219540 248770 265624 259820 328090 384317 327997 246826 184941 238032
13092B38032N8787r844l2693j7268O6947O5252l1911l040K2212m5474j4883m0931
$$ 238032 296819 286975 254282 237014 303961 369213 337302 334262 356474 311000 296117 255186
13080B55186n742O996O8712l58j0366R9770k9721O5305R0803J6674L576K8778
$$ 255186 249444 256440 325152 324794 314428 414198 384477 449782 540585 557259 560835 589613
13068E89613M4658k0120p3479j7548k4042o2567k0736k1548m1375o682k9477j7517
$$ 589613 634271 614151 540672 523124 499082 436515 415779 394231 352856 346174 316697 299180
13056B99180M8730J2955q680m2967n2704M1648O656J7141K7430N0074R302m5762
$$ 299180 347910 360865 352185 309218 256514 298162 304818 321959 349389 399463 408765 363003
13044C63003j2642J9877l1855j0638k407L5785O9202O2086j1909m3967J078N8052
$$ 363003 350361 370238 338383 327745 325338 361123 430325 492411 480502 436535 437613 495665
13032D95665K4942K4890j6824n079L3558L5028M2252J5944k754p7539q0644K7453
$$ 495665 520607 545497 528673 523594 557152 592180 634432 650376 647622 570083 489439 516892
13020E16892j1974k2390j7489j1855k603m6655l271k5178J1600J0087k3890Q896
$$ 516892 504918 482528 465039 453184 450581 403926 400655 375477 387077 397164 373274 382170
13008C82170M0835L8257k3262L832j4276k2368J6407L3247J8480K2390j396l3074
$$ 382170 423005 461262 438000 441832 427556 405188 421595 454842 473322 495712 494316 461242
12996D61242J1693l3623l5702J2924J0654q770m4551Q56M7549M476k5668r25j3409
$$ 461242 472935 439312 403610 416534 427188 418418 373867 374723 422272 426748 401080 400155 386746
12983C86746j5626K0572j5717q695J9343o895j0823r829r11P1833j7052K091J3606
$$ 386746 371120 391692 375975 367280 386623 379728 368905 359076 358165 429998 412946 415037 428643
12970D28643n3806k0714K1313O6598j3123k2565l4958L2818P509r045n243l5090
$$ 428643 374837 354123 375436 442034 428911 406346 371388 404206 411715 402670 397427 362337
12958C62337o0070k5026N1190K7848j0268l1524J4570K1838M5532l359n960K6410
$$ 362337 302267 277241 328431 356279 346011 314487 329057 350895 396427 393068 387108 413518
12946D13518M0433j0602k335l366N985j3372k1503K3118j3267L1712K8386l2756
$$ 413518 453951 443349 441014 437648 443633 430261 408758 431876 418609 450321 478707 445951
12934D45951m3613J4074J4454k5554p709j2735L7860M355n1208k0800K7682L8658
$$ 445951 402338 416412 430866 405312 397603 384868 422728 427083 375875 355075 382757 421415
12922D21415J3763m3056j0586J132j0080L1832N1539j1320m8825J9944J5717J4249
$$ 421415 435178 392122 381536 382668 372588 404420 455959 444639 395814 415758 431475 445724
12910D45724L8228P172P0025K5466k3980l5190k5069k6205k3572m876L0958J0228
$$ 445724 483952 491124 561149 586615 562635 527445 502376 476171 452599 447723 478681 488909
12898D88909K307N172r244j5216o3331K69L0019L8096J0608J8481l6360l6205
$$ 488909 491216 496388 487144 471928 408597 408866 438885 476981 487589 506070 469710 433505
12886D33505J9915M2602k5131J4890O7943j7410l8952r904m568L5622M1712k0390
$$ 433505 453420 496022 470891 485781 553724 536314 497362 487458 482890 518512 560224 539834
12874E39834J3551n2623k7046k0888P3853Q568O43N131R232j2843p1520j0884
$$ 539834 553385 500762 473716 452828 526681 535249 535892 541023 550255 537412 465892 455008
12862D55008j2875J04786K640J2656O4269n1966l5814k5952j2586o337q523o089
$$ 455008 442133 546919 549559 562215 626484 574518 538704 512752 500166 493829 485306 479217
12850D79217j572Q677J8510m6685o911K5344O2989J0059m5578j9489l2452J456
$$ 479217 477645 486322 504832 458147 451236 476580 539569 549628 504050 484561 452109 453565
12838D53565J3849L0820L8211J5654k1486m7594j9945L2941m849j6909K1863j7165
$$ 453565 467414 498234 536445 552099 530613 483019 463074 496015 491166 474257 496120 478955
12826D78955J3802K9483K0060l0623k6836k822L0446N881n349M3494Q111M1646
$$ 478955 492757 522240 542300 511677 484841 482019 512465 518346 512997 556491 564602 606248
12814F06248p590m3150q461M8670Q219k6472K1806L3502K1648k5407k3500r76
$$ 606248 598658 555508 547047 595717 603936 577464 599270 632772 654420 629013 605513 604537
12802F04537K2377l2051q092k143m7477j2042k4098J5084n793O2606N0034L8050
$$ 604537 626914 594863 586771 584628 537151 525109 501011 516095 510302 572908 622942 660992
12790F60992n50k3974l4256o409K1577J0994J0339K1710J7061O532l1145j3890
$$ 660992 660442 636468 602212 595803 617380 628374 638713 660423 677484 684016 652871 638981
12778F38981P753J3119R091j2805j2158m703n904N2847J0208j7561q093l3109
$$ 638981 646734 659853 668944 656139 643981 639278 633374 686221 696429 678868 670775 637666
12766F37666k6644M0515P08M8459M8134o6903k0001L1322M718m3123l9768p824
$$ 637666 611022 651537 652245 700704 748838 681935 661934 693256 697974 654851 615083 607259
12754F07259K6253N3611L8615k0638m3443l9376M1535J3620p87m7414k4608J7702
$$ 607259 633512 687123 725738 705100 661657 622281 663816 677436 676649 629235 604627 622329
12742F22329M1833J7273k593k7915j1205K6562L2565J0131r99Q978m522m8059
$$ 622329 664162 681435 678842 650927 639722 666284 698849 708980 707981 716959 712437 664378
12730F64378p185K8406k3912L305K3914Q782L0889L0705K0106k1557n2003M838
$$ 664378 657193 685599 661687 664992 688906 697688 728577 759282 779388 757831 705828 710666
12718G10666Q1551Q0665M3658l8286M5902p530o211l4581L2215N756M6022L4891
$$ 710666 792217 872882 916540 878254 924156 916626 910415 875834 908049 913805 959827 994718
12706I94718L0640l08l2375J0087L6614P670N0239M2254R2055J18418K2288J5355
$$ 994718 1025358 1025050 992675 1002762 1039376 1047046 1097285 1139539 1231594 1350012 1372300 1387655
12694A387655J01027R2900O2848N6459M9781O0116L5109M0580O4652K4249o7497
$$ 1387655 1488682 1581582 1644430 1700889 1750670 1810786 1845895 1886475 1951127 1975376 1907879
12683A907879k5716Q0434M9186J6953l4727m5002k448O186K2809L5121M1707J8252
$$ 1907879 1882163 1962597 2011783 2028736 1994009 1949007 1946559 1952745 1975554 2010675 2052382 2070634
12671B070634k2549o291K0158M0096J8253Q2223O5404J527N7721P1744M4218l9
$$ 2070634 2048085 2041794 2061952 2102048 2120301 2202524 2267928 2269455 2327176 2398920 2443138 2443099
12659B443099j0677O5609P3333N4791L8352O5256R5373J5342N9711p342o7145
$$ 2443099 2432422 2498031 2571364 2626155 2664507 2729763 2825136 2840478 2900189 2892847 2825702
12648B825702k5702K2663K9028J0193m1460n1495o4288q3984k0934l3243K288
$$ 2825702 2800000 2822663 2851691 2861884 2820424 2768929 2704641 2620657 2599723 2566480 2568768
12637B568768l0529q2390n3038N088j6003Q871J1132K2576L0829N4546k5971m4778
$$ 2568768 2538239 2455849 2402811 2407899 2391896 2400767 2411899 2434475 2465304 2519850 2493879 2449101
12625B449101k2512Q187L8713j7946q4267o815l3860j8611j5338j1256Q260m4053
$$ 2449101 2426589 2434776 2473489 2455543 2371276 2364461 2330601 2311990 2296652 2285396 2293656 2249603
12613B249603r4892j29929r1079k4126k4929k1693k4540m6221r0652j08630j0338
$$ 2249603 2154711 2024782 1933703 1909577 1884648 1862955 1838415 1792194 1701542 1592912 1582574
12602A582574k5887J4135K0457l6377n7125o4094m3470K4359K4195j9329k9066
$$ 1582574 1556687 1570822 1591279 1554902 1497777 1433683 1390213 1414572 1438767 1419438 1390372
12591A390372p230j082J8645J6957o5566m5114J1967p098j7797Q130o6555M14
$$ 1390372 1383142 1382060 1400705 1417662 1352096 1306982 1318949 1311851 1294054 1302184 1235629 1236043
12579A236043O0401p5583k2873M4390J3859m7506j8333j1172l2848k5250K5957
$$ 1236043 1296444 1220861 1197988 1242378 1256237 1208731 1190398 1179226 1146378 1121128 1147085
12568A147085l463L7620L3030k0177m775K879M9P207M8818m7354K1730J62O864
$$ 1147085 1143622 1181242 1214272 1194095 1189320 1192199 1192248 1199455 1248273 1200919 1222649 1222811 1229675
12555A229675M5482J9512l2920j9775R349J8010j3052k2401l1676K1582J1205
$$ 1229675 1275157 1294669 1261749 1241974 1251323 1269333 1256281 1233880 1202204 1223786 1234991
12544A234991L699M2403j6194l2352J746M7364j9525k6468l4009k163J6147M5528
$$ 1234991 1238690 1281093 1264899 1232547 1234293 1281657 1262132 1235664 1201655 1199492 1215639 1261167
12532A261167o1499l062P329K1386R133K0551O427J5015J5085N184O5432N5548
$$ 1261167 1199668 1196606 1203935 1225321 1234454 1255005 1261432 1276447 1291532 1296716 1362148 1417696
12520A417696l108K989L6732m1263j5408J9959P0540L2588K9757L9304J5559o4823
$$ 1417696 1414588 1417577 1454309 1413046 1397638 1417597 1488137 1520725 1550482 1589786 1605345 1540522
12508A540522k0097J1466L6946L4366l8970J1809M0733j9818k5472L536J9810
$$ 1540522 1520425 1531891 1568837 1603203 1564233 1576042 1616775 1596957 1571485 1575021 1594831
12497A594831P1073J6439J6822o844j5449L7024N1442L4709l5423J2591Q434J5296
$$ 1594831 1665904 1682343 1699165 1692321 1676872 1713896 1765338 1800047 1764624 1777215 1785649 1800945
12485A800945J0628Q770P3322K6540m9212k4756k9645N7548M4545l2970J1984
$$ 1800945 1811573 1820343 1893665 1920205 1870993 1846237 1816592 1874140 1918685 1885715 1897699
12474A897699Q0230L6634p1051j4538k9030N5562K1061K0694j7956j0060P027
$$ 1897699 1977929 2014563 1943512 1928974 1899944 1955506 1976567 1997261 1979305 1969245 1976272
12463A976272L5840K5825m197j5823L1145k9187M6231M6456L3058L2527m1116
$$ 1976272 2012112 2037937 2033740 2017917 2049062 2019875 2066106 2112562 2145620 2178147 2137031
12452B137031R685J7482k6869K5819L1856J3512n8894k478L9295o715l0611K1793
$$ 2137031 2146716 2164198 2137329 2163148 2195004 2208516 2149622 2147144 2186439 2179724 2149113 2170906
12440B170906K8153Q489l7317o908k2997J0425k5552j7600M7962O5231L8129M202
$$ 2170906 2199059 2207548 2170231 2163323 2140326 2150751 2125199 2107599 2155561 2220792 2258921 2263123
12428B263123J7790j433l3534k5883j263L8643j6795o8364M5798J7723L6044N5063
$$ 2263123 2280913 2279480 2245946 2220063 2218800 2257443 2240648 2172284 2218082 2235805 2271849 2326912
12416B326912M337k5875p8578l8015L3712O6068J6410q132l1030L1415N0695J114
$$ 2326912 2331249 2305374 2226796 2188781 2222493 2288561 2304971 2296839 2265809 2297224 2347919 2349033
12404B349033M9513N0842J443L9792L8801J2239j2184n513Q1458l44M318k815
$$ 2349033 2398546 2449388 2450831 2490623 2529424 2541663 2529479 2523966 2605424 2605080 2609398 2606583
12392B606583m2598K9048K7410J0438j5232K9969J0467Q8881R085M1780M7166
$$ 2606583 2563985 2593033 2620443 2630881 2615649 2645618 2656085 2744966 2754051 2795831 2842997
12381B842997J3027N2119P9589L3778O0833L0901j3518J0973J1382L4863N9187
$$ 2842997 2856024 2908143 2987732 3021510 3082343 3113244 3099726 3110699 3122081 3156944 3216131
12370C216131N14K3817P2765O457P237L6850P1422K85O7054P9408J0497O943J38299
$$ 3216131 3216645 3240462 3313227 3319684 3326921 3363771 3435193 3435478 3502532 3581940 3592437 3599380 3737679
12357C737679J37620L7653K7744M3280O0193J05813J16290M7307R2717R9069M5570
$$ 3737679 3875299 3912952 3940696 3983976 4044169 4149982 4266272 4313579 4406296 4505365 4550935
12346D550935Q2125J16794J15590R3806N1186P2487J30038P8899R0306Q3548R6003
$$ 4550935 4633060 4749854 4865444 4959250 5010436 5082923 5212961 5291860 5382166 5465714 5561717
12335E561717J44924P8783J27095J15603J43840J04485J01660J26410J22216J21834
$$ 5561717 5706641 5785424 5912519 6028122 6171962 6276447 6378107 6504517 6626733 6748567
12325F748567J11286J41094J82435K05674P2789J03872J25233J75943K06146J45924
$$ 6748567 6859853 7000947 7183382 7389056 7461845 7565717 7690950 7866893 8073039 8218963
12315H218963J69579J93056J90667K39604K22561K40265K30647J94161K33766
$$ 8218963 8388542 8581598 8772265 9011869 9234430 9474695 9705342 9899503 10133269
12306A0133269K62633L30703K93431K81305K98447L22569L45733L94154L49589
$$ 10133269 10395902 10726605 11020036 11301341 11599788 11922357 12268090 12662244 13011833
12297A3011833M31366N29960N08957M45274N39347O56082P00801P46787Q28209
$$ 13011833 13443199 13973159 14482116 14927390 15466737 16122819 16823620 17570407 18398616
12288A8398616Q31090R25854J039627J162313J285944J421949J660828J869684
$$ 18398616 19229706 20155560 21195187 22357500 23643444 25065393 26726221 28595905
12280B8595905J985305K257006K520063K852529L257969L629318M128909M654289
$$ 28595905 30581210 32838216 35358279 38210808 41468777 45098095 49227004 53881293
12272E3881293N281200O049040O976909Q031686R201137J0612876J2104184J3709311
$$ 53881293 59162493 65211533 72188442 80220128 89421265 100034141 112138325 125847636
12264A25847636J5279359J6512918J7223673J7215102J6402705J4617503J2042028
$$ 125847636 141126995 157639913 174863586 192078688 208481393 223098896 235140924
12257B35140924R051466N907483K765754J24103j957423l446648m369463m743166
$$ 235140924 244192390 250099873 252865627 252989730 251032307 247585659 243216196 238473030
12249B38473030m637556m202493l493966k562872j581714m85205O43412J821798
$$ 238473030 233835474 229632981 226139015 223576143 221994429 221509224 222152636 223974434
12241B23974434L062239M294213N569613O756322P839066Q729364R461880R831317
$$ 223974434 227036673 231330886 236900499 243656821 251495887 260225251 269687131 279518448
12233B79518448J0051310J0088221R808707R439016Q909140Q307568P670029P053687
$$ 279518448 289569758 299657979 309466686 318905702 327814842 336122410 343792439 350846126
12225C50846126O405806N640137M810414L986343K974387J942466Q61667l34035
$$ 350846126 357251932 362892069 367702483 371688826 374663213 376605679 377467346 377133311
12217C77133311j630551k927991m136562n345041o282033p016236p505475p725238
$$ 377133311 375502760 372574769 368438207 363093166 356811133 349794897 342289422 334564184
12209C34564184p505350p088601o533485n787215m959673m055893l141030k206068
$$ 334564184 327058834 319970233 313436748 307649533 302689860 298633967 295492937 293286869
12201B93286869j275828m79175K76817Q94536J411276J699700J580945J154552
$$ 293286869 292011041 291531866 291808683 292703219 294114495 295814195 297395140 298549692
12193B98549692L17342r71559k684593m610084o652012q588637j0427811j1746155
$$ 298549692 298867034 297895475 295210882 290600798 283948786 275360149 264932338 253186183
12185B53186183j2661497j3208415j3281693j3045964j2575716j1835599j1070480
$$ 253186183 240524686 227316271 214034578 200988614 188412898 176577299 165506819
12178A65506819j0244712r403495q616485p978174p346084o764362o138698n657737
$$ 165506819 155262107 145858612 137242127 129263953 121917869 115153507 109014809 103357072
12170A03357072n230870m932698m508854m126053l863243l586878l275420l012028
$$ 103357072 98126202 93193504 88684650 84558597 80695354 77108476 73833056 70821028
12162G0821028k887210k698722k494900k299297k198406k023866j908925j782101
$$ 70821028 67933818 65235096 62740196 60440899 58242493 56218627 54309702 52527601
12154E2527601j703667j589519j479765j408293j465591j350682j245785j120133
$$ 52527601 50823934 49234415 47754650 46346357 44880766 43530084 42284299 41164166
12146D1164166j126105j130986j055247r62077r37279r26938q89803q51441p83371
$$ 41164166 40038061 38907075 37851828 36889751 35952472 35025534 34135731 33284290 32500919
12137C2500919p76003p33135p06383p10046o27502o21121o16875o02041n90257
$$ 32500919 31724916 30991781 30285398 29575352 28947850 28326729 27709854 27107813 26517556
12128B6517556n47543m95369n55828m83330m59297n15301m87992m41847m66349
$$ 26517556 25970013 25474644 24918816 24435486 23976189 23460888 22972896 22531049 22064700
12119B2064700m26385l87774m09810l63993l64870l62857l37190k88002l53433
$$ 22064700 21638315 21250541 20840731 20476738 20111868 19749011 19411821 19123819 18770386
12110A8770386l27190k58607k89735l36125k72731l04295k85597k37492l62633
$$ 18770386 18443196 18184589 17894854 17558729 17285998 16981703 16696106 16458614 16095981
12101A6095981k22178j88009k39409j91723k09126j68367k01296j93409j56353
$$ 16095981 15873803 15685794 15446385 15254662 15045536 14877169 14675873 14482464 14326111
12092A4326111j78838k79001k11568j09377j54787j14561j48041j46947j65337
$$ 14326111 14147273 13868272 13656704 13547327 13392540 13277979 13129938 12982991 12817654
12083A2817654k11261j38531j00646j20495j51030j41598j22291j80897j10029
$$ 12817654 12606393 12467862 12367216 12246721 12095691 11954093 11831802 11650905 11540876
12074A1540876r3580p7884o3318j19570j28560n9959r2746j12868j34135j17291
$$ 11540876 11447296 11369412 11306094 11186524 11057964 10998005 10905259 10792391 10658256 10540965
12064A0540965l4034j50940j57011r7701j04202l7591p6912j08036j22925j03488
$$ 10540965 10506931 10355991 10198980 10101279 9997077 9959486 9882574 9774538 9651613 9548125
12054I548125o6726j46743r4780q1156j11851j55185j19743m2577l6140m1319
$$ 9548125 9481399 9334656 9239876 9158720 9046869 8891684 8771941 8729364 8693224 8651905
12044H651905j20024j73310m7056p9858q7080p3202j01496l8692n021l6734j22804
$$ 8651905 8531881 8358571 8311515 8231657 8144577 8071375 7969879 7931187 7926166 7889432 7766628
12033G766628r7419j32565j41045j14017p4326n7542q0669m8123j58841o0774
$$ 7766628 7669209 7536644 7395599 7281582 7207256 7149714 7069045 7020922 6862081 6801307
12023F801307m7260j04382o0853r0458k7738j1537J4052q0019n6164n1069p0245
$$ 6801307 6754047 6649665 6588812 6498354 6470616 6459079 6473131 6393112 6336948 6285879 6215634
12012F215634m1530J5957l1955j03556n7667j05519q3806k6034m9513n799N6929
$$ 6215634 6174104 6190061 6158106 6054550 5996883 5891364 5807558 5781524 5732011 5726212 5783141
12001E783141k9388n1510l6386n5091o4613p3495k4780m3965l3368k5379j851
$$ 5783141 5753753 5702243 5665857 5610766 5546153 5472658 5447878 5403913 5370545 5345166 5343315
11990E343315j7267r3715j6852K1258l147j12526p5222j6351J2035p9726m4559
$$ 5343315 5326048 5232333 5215481 5236739 5233592 5121066 5045844 5029493 5041528 4961802 4917243
11979D917243J1438m5392M3165L7050k1652n8033p6204l0610K7086p931J5658
$$ 4917243 4928681 4883289 4926454 4963504 4941852 4883819 4807615 4777005 4804091 4796160 4811818
11968D811818Q543M6971m9615n799j2161k6062l2633j7308j3584j9038l0908N8753
$$ 4811818 4820361 4867332 4817717 4811918 4799757 4773695 4741062 4723754 4710170 4691132 4660224 4718977
11956D718977R576r8182m3057l6675m0441K6709k1776K7946L9939m968p628n4165
$$ 4718977 4728553 4630371 4587314 4550639 4510198 4536907 4515131 4543077 4583016 4578048 4570420 4516255
11944D516255j0236J9449n020J3342p554l8458p74J9729k1019j6539q3M1084k5311
$$ 4516255 4506019 4525468 4520448 4533790 4526236 4487778 4487004 4506733 4485714 4469175 4469092 4510176 4484865
11931D484865m7659n8980k9883j7993k0011N581J1699K4499J527n4M8733J9723
$$ 4484865 4437206 4378226 4348343 4330350 4310339 4315920 4327619 4352118 4353645 4353591 4402324 4422047
11919D422047m4545m5686o9068l6277J8620r093j4108K8206o346p2158n4575j9198
$$ 4422047 4377502 4331816 4262748 4226471 4245091 4235998 4221890 4250096 4243750 4171592 4117017 4097819
11907D097819m880K7234J7276n300J6024l8912m0474j6286j5188O000o1586n5383
$$ 4097819 4092939 4120173 4137449 4132149 4148173 4109261 4068787 4052501 4037313 4043313 3981727 3926344
11895C926344l9217j6772R5121L8702q9371n7796o568O709J6091k7704m3675k7717
$$ 3926344 3887127 3870355 3965476 4004178 3914807 3857011 3850443 3857152 3873243 3845539 3801864 3774147
11883C774147o4802R457K8156K5781m2403j6035L8267n1971q9324L281J4587l7129
$$ 3774147 3709345 3718802 3746958 3772739 3730336 3714301 3752568 3700597 3611273 3614554 3629141 3592012
11871C592012o196j1054O097P7463l3199O483O8154l2328k4580k8758n9704K8266
$$ 3592012 3585816 3574762 3580859 3658322 3625123 3631606 3699760 3667432 3642852 3614094 3554390 3582656
11859C582656L3553J1864K7303n2172p7954r0936n6615l2222j9838L9439R0751
$$ 3582656 3616209 3628073 3655376 3603204 3525250 3434314 3377699 3345477 3325639 3365078 3455829
11848C455829J2955j9156J4207j3385K3161K0359j4149M0545j4874J5222N1568
$$ 3455829 3468784 3449628 3463835 3450450 3473611 3493970 3479821 3520366 3505492 3520714 3572282
11837C572282L0616l1988J9329J7743M6827l015j9510m228P9318R0065J25294
$$ 3572282 3602898 3570910 3590239 3607982 3654809 3651794 3632284 3628056 3707374 3797439 3922733
11826C922733Q4339M3718O9248L1737K8428L4574O4417K7786l4565j7529k8852
$$ 3922733 4007072 4050790 4120038 4151775 4180203 4214777 4279194 4306980 4272415 4254886 4226034
11815D226034k0472J1840n1287n019N5502j9422k6001M3770m9711m0550K4974
$$ 4226034 4205562 4217402 4166115 4161096 4216598 4197176 4171175 4214945 4165234 4124684 4149658
11804D149658J0061L3365j781m4487k9467P3989Q2398M3682K1910J9153K9663
$$ 4149658 4159719 4193084 4191303 4146816 4117349 4191338 4273736 4317418 4339328 4358481 4388144
11793D388144K7983M3005P5340J23461K7917k7846l558J5475J5373m3174m6709
$$ 4388144 4416127 4459132 4534472 4657933 4685850 4658004 4654446 4669921 4685294 4642120 4595411
11782D595411k1319p3001L1555P8587K012j44965o3791n2789J5930m0095p0328
$$ 4595411 4574092 4501091 4532646 4611233 4613245 4468280 4404489 4351700 4367630 4327535 4257207
11771D257207j7511K5801L41q5854m0609J0961O472k2203q905j2473m7235m7797
$$ 4257207 4239696 4265497 4265838 4179984 4139375 4150336 4156808 4134605 4125700 4113227 4065992 4018195
11759D018195o3109j6986j9912k4827n4707M546L814p5544r303o2606p9743q0636
$$ 4018195 3955086 3938100 3918188 3893361 3838654 3843200 3847014 3771470 3762167 3699561 3619818 3539182
11747C539182j48018j34766l6876j4069n5711m6406l3213J4971o897p2242r3334
$$ 3539182 3391164 3256398 3219522 3205453 3149742 3103336 3070123 3085094 3078197 3005955 2912621
11736B912621j04628o5656n8709J32N8964o3604p8987o2449K376M1334K1684n8285
$$ 2912621 2807993 2742337 2683628 2683760 2742724 2679120 2600133 2537684 2540060 2581394 2603078 2544793
11724B544793l9889J0015j6671r094K2594n0963k0748q2281k4841L8844P2159
$$ 2544793 2504904 2514919 2498248 2489154 2511748 2460785 2440037 2357756 2332915 2371759 2443918
11713B443918L0687k909m4776q4384J7271J5004k7307l9449k2059o2704n6076
$$ 2443918 2474605 2471696 2426920 2342536 2359807 2374811 2347504 2308055 2285996 2223292 2167216
11702B167216J9471L7089K015m4311o3763M2132L5296k6655m6862o2404J0773
$$ 2167216 2186687 2223776 2225791 2181480 2117717 2159849 2195145 2168490 2121628 2059224 2069997
11691B069997n16q346l625l8803j5049M0217q821m1672O538L0927J8639m0653
$$ 2069997 2069481 2061135 2057510 2018707 2003658 2043875 2035054 1993382 1999920 2030847 2049486 2008833
11679B008833q812m2132k5354M8583l5035m41m1974j9746k86k0924j8692L3890
$$ 2008833 2000021 1957889 1932535 1981118 1946083 1945642 1903668 1883922 1883636 1862712 1844020 1877910
11667A877910m896j9120L6030K870k2905m8681j8079k223N3311M9069l3941j0796
$$ 1877910 1873014 1853894 1889924 1892794 1869889 1821208 1803129 1800906 1854217 1903286 1869345 1858549
11655A858549j261o934J6924l5745l2679J2855L4254j9706m3998l8537m0399L5976
$$ 1858549 1857288 1850354 1867278 1831533 1798854 1811709 1845963 1826257 1782259 1743722 1703323 1739299
11643A739299O6268R132L2783j4425J7544O6214J9855m717J29891O7717Q6169
$$ 1739299 1805567 1814699 1847482 1833057 1850601 1916815 1936670 1931953 2061844 2129561 2215730
11632B215730P8947J96973K47108K35657K16563J51901J15716r328n6494j17786
$$ 2215730 2294677 2491650 2738758 2974415 3190978 3342879 3458595 3449267 3392773 3274987
11622C274987j61373j24632j39125j32829j47515j28575n6781r7379j26423j07191
$$ 3274987 3113614 2988982 2849857 2717028 2569513 2440938 2384157 2286778 2160355 2053164
11612B053164o4398n8732j9119p31o6783r9789R46J1741j1622L9073J6794k7482
$$ 2053164 1988766 1930034 1910915 1910184 1843401 1743612 1744558 1756299 1744677 1783750 1800544 1773062
11600A773062l9378j3000K5843R2429K0960k708L9101P4388Q4094J77360J68239
$$ 1773062 1733684 1720684 1746527 1838956 1859916 1857208 1896309 1970697 2054791 2232151 2400390
11589B400390J72273K40604L05746K31743J17870j1107j07583j62797j75913j83336
$$ 2400390 2572663 2813267 3119013 3350756 3468626 3457519 3349936 3187139 3011226 2827890
11579B827890j77763k07113j04069j25640r6042r6970p1661m4018j2459l0937
$$ 2827890 2650127 2443014 2338945 2213305 2117263 2020293 1948632 1904614 1892155 1861218
11569A861218n1128m2151o5003o7955l9328r140J72m5557L1056p8278o7650k7048
$$ 1861218 1810090 1767939 1702936 1634981 1595653 1586513 1586685 1541128 1572184 1493906 1426256 1399208
11557A399208k4407N644l959L5440l0908n37m028L8653O981l8850K061L3855m4654
$$ 1399208 1374801 1380445 1376486 1411926 1381018 1380481 1376453 1415106 1422087 1383237 1385298 1419153 1374499
11544A374499q5771k305K7878j4733j3107k8937l9286l1379j5231m643J1370r0645
$$ 1374499 1288728 1286423 1314301 1299568 1286461 1257524 1218238 1186859 1171628 1166985 1178355 1087710
11532A087710j716P0549J8044K2733p121n3005m1116L8926o388j7197M5719l7176
$$ 1087710 1085994 1156543 1174587 1197320 1190199 1137194 1096078 1135004 1128616 1111419 1157138 1119962
11520A119962k1634j1377m7146L9337P425r057L5545p672o4402p8076l183P0766
$$ 1119962 1098328 1086951 1039805 1079142 1086567 1077510 1113055 1105383 1040981 962905 959722 1030488
11508A030488l115K0167L711J8267Q669l5976j9762M3703K6678O1980k3296m4454
$$ 1030488 1027373 1047540 1051251 1069518 1078187 1042211 1022449 1066152 1092830 1154810 1131514 1087060
11496A087060n6760m1571p5246M4318O691M470k0227k6111J9143J9386k1034M042
$$ 1087060 1030300 988729 913483 957801 964492 968962 948735 922624 941767 961153 940119 944161
11484I44161k9326l6688J6260M6321J8643k3810j4944K7053o069m1426m6320L0982
$$ 944161 914835 878147 894407 940728 959371 935561 920617 947670 941601 900175 853855 884837
11472H84837K0474N099k5821m1728j0169J0784Q4057L4458j08059o6132J6067
$$ 884837 905311 910410 884589 842861 832692 843476 927533 961991 853932 787800 803867
11461H03867l690r531M4696K3095q373j9780k7360k166J1344M1670J772J9802
$$ 803867 800177 790646 835342 858437 850064 830284 802924 800758 812102 853772 855544 875346
11449H75346k3871j7865P726L27J2433N0105N1489L3650j8507n5307q8895k177
$$ 875346 851475 833610 841336 841663 854096 904201 955690 989340 970833 915526 826631 824454
11437H24454r784l1086K0997J7404k7916J5592N0071J8319k1112m0097j6421l513
$$ 824454 814670 783584 804581 821985 794069 809661 859732 878051 856939 816842 800421 796908
11425G96908r077R558J947j374L823K0014J2944k5551k3950O029J848M1806Q773
$$ 796908 787831 797389 799336 797962 801785 821799 834743 809192 785242 791271 793119 834925 843698
11412H43698j7576l707O859J02256N9765k8839o0348k2478n7470o628m218k1163
$$ 843698 826122 822415 829274 931530 991295 962456 902108 879630 822160 815532 811314 790151
11400G90151L5570J13665K9874k3595j8776r881P827o1973k6333J5809M6622Q26
$$ 790151 825721 939386 969260 945665 926889 917008 924835 862862 836529 852338 898960 899786
11388H99786n303J1440M5891j3409l920L90m973m4953K8476J9348J1480M512k2534
$$ 899786 894483 905923 951814 938405 934485 934875 929902 884949 913425 932773 944253 948765 926231
11375I26231Q097J2491m7419R927K1214N58p283L1743m5190K510r039r5858j3173
$$ 926231 934328 946819 899400 909327 930541 931099 923816 955559 910369 912879 903840 807982 794809
11362G94809N3664O3439O7479m0713j1944j102o928j8961j2517l1836j7759J9183
$$ 794809 848473 911912 979391 938678 926734 925632 918704 899743 887226 855390 837631 856814
11350H56814M1179k0336l3418l3275J8003r341L1296m2088n5329k2580J3799j3812
$$ 856814 897993 877657 844239 810964 828967 819626 850922 808834 753505 730925 744724 730912
11338G30912n6910m287M5915k8837j8140L9854J4651k068j5937m6632k6472J9556
$$ 730912 674002 669715 715630 686793 668653 708507 723158 721090 705153 658521 632049 651605
11326F51605j1717k8926L938k6200k6607L7464P1065N7616P2304j3927p9019r7929
$$ 651605 639888 610962 614900 588700 562093 599557 670622 728238 800542 786615 707596 609667
11314F09667l7259k0051J4735K2752J0784J9654j2769L569n6575L6083N4829K9612
$$ 609667 572408 552357 567092 589844 600628 620282 607513 611082 554507 590590 645419 675031
11302F75031L7782k4435n957q6920l3494N2596l4566k5123k0042Q002R921k0501
$$ 675031 712813 688378 682421 595501 562007 614603 580037 554914 534872 542874 552795 532294
11290E32294l6475n854J1410m0241n4752K5711P0904n6302n0498K9523L9026j4026
$$ 532294 495819 489965 501375 461134 406382 432093 502997 446695 396197 425720 464746 450720
11278D50720r866N5416K2558o3775M1029j5777l9248k9891l5032O4931k0666J2647
$$ 450720 440854 496270 518828 455053 496082 480305 441057 411166 376134 441065 420399 433046
11266D33046M0000R5727M9049m9264o1811j0820j1169L4691J3250m9321k6361
$$ 433046 473046 568773 617822 568558 506747 495927 484758 519449 532699 483378 457017
11255D57017N0710K5188K6343O7980n1628q4875k4428j5602k8190J3388K1083
$$ 457017 507727 532915 559258 627238 575610 490735 466307 450705 422515 435903 456986
11244D56986k3485K3068L673L1222L8270m2764m2393l685q272l937n850l2000
$$ 456986 433501 456569 460242 491464 529734 486970 444577 440892 432620 428683 422833 390833
11232C90833q75R1529M4687K1285j5421k7508m280l9081k9539J5524m3683j2166
$$ 390833 389958 481487 526174 547459 532038 504530 500250 461169 431630 447154 403471 391305
11220C91305M2916N2970L931m733l8664o4990K4184j947J5600J8802L628L726
$$ 391305 434221 487191 491122 486389 447725 382735 406919 404972 420572 439374 443002 446728
11208D46728J1692k7240o1777K2123n497K0247j4426Q363k051j2542m677R144
$$ 446728 458420 431180 369403 391526 386029 406276 391850 400213 398162 385620 380943 390087
11196C90087M1794N011q6641J4973K1845K553L5783l9939j8965j7194j6915J9278
$$ 390087 431881 436892 350251 365224 387069 389622 425405 385466 366501 349307 332392 351670
11184C51670L8038N1287J4047q4381m0518L4583K1608r474o273K6968k0475o8905
$$ 351670 389708 440995 455042 370661 330143 364726 386334 376860 370587 397555 377080 308175
11172C08175k6975j4734L9008L2766P766K3979k5665l0381k3611J5024M2625L8021
$$ 308175 281200 266466 305474 338240 346006 369985 344320 313939 290328 305352 347977 385998
11160C85998J7451O222L5468K2951n7655k6013J276J8648j9273N055l518o9909
$$ 385998 403449 409671 445139 468090 410435 384422 385698 404346 385073 390128 386610 316701
11148C16701J1179K9034J0466q509n3645p2835O828J07627K2457o3772R386Q3418
$$ 316701 327880 356914 367380 358871 305226 232391 239219 346846 369303 305531 314917 398335
11136C98335J2551R626k7412k3161k2810n2566k9243M4054L8606j3758m9279J1053
$$ 398335 410886 420512 393100 369939 347129 294563 265320 309374 347980 334222 284943 295996
11124B95996P0792l207p896k0157J2923M5067L5748o1476m9524j5200k6802j9584
$$ 295996 366788 363581 355685 335528 348451 393518 429266 367790 318266 303066 276264 256680
11112B56680Q815N9157m4501L5884k2472p772l2932n5476R475k2206k09O2975
$$ 256680 265495 324652 280151 316035 293563 285791 252859 197383 206858 184652 184443 247418
11100B47418M2043M1697J1530n5406R378L4948K1291n4323R21J0017l5494k2607
$$ 247418 289461 331158 342688 287282 296660 331608 352899 298576 299497 309514 274020 251413
11088B51413o75R281N8667k0508k5315L6469M8086l1191k8523n2264m4769l6766
$$ 251413 250738 260019 318686 298178 272863 309332 357418 326227 297704 245440 200671 163905
11076A63905k6907L470J07942O3743K2166p4830L6983j1309L5911l1753p1452
$$ 163905 136998 140468 248410 312153 334319 259489 296472 285163 321074 289321 217869
11065B17869K1137K2518J205q471k4781j0175N1275Q2596j0337r213N669m2707
$$ 217869 239006 261524 262729 254258 229477 219302 270577 353173 342836 333623 339292 296585
11053B96585n096K8062j5953k9719l3631J6340O1188n7860l8679o850J205N7351
$$ 296585 291489 319551 303598 273879 240248 256588 317776 259916 221237 214387 215592 272943
11041B72943L5791m5968k37q505o037M2395M2467P7370M9235K8543n0764J0972
$$ 272943 308734 262766 262529 254024 247987 290382 332849 410219 459454 487997 437233 448205
11029D48205j2432L4107L7963M3584k2683L2302N5727k793J4404N833k1293M3628
$$ 448205 435773 469880 507843 551427 528744 561046 616773 613980 628384 634217 612924 656552
11017F56552o7325k3114o13K7909K7147K8005m8293o1179O685J7983J0174n6905
$$ 656552 589227 566113 565500 593409 620556 648561 600268 539089 545774 563757 573931 517026
11005E17026l3110J6922L4739K9630m668P194j5040l456l6588k2182o6359j06416
$$ 517026 483916 500838 535577 565207 560539 567733 552693 549237 512649 490467 424108 317692
10993C17692m6290L5735L7857J4946k8946m328L3116l9122m6694O5004M2392J9376
$$ 317692 271402 307137 344994 359940 330994 326666 359782 320660 273966 338970 381362 400738
10981D00738l3361m7320J8353N3874j4649k144K5913J590J0943k169p6713o3703
$$ 400738 367377 320057 338410 392284 377635 375491 401404 402994 413937 411768 335055 271352
10969B71352n731J5349j7234k691N293o4060o182J3812N5329L9183j7180m1722
$$ 271352 265621 280970 263736 261045 266338 202278 196096 209908 265237 304420 287240 245518
10957B45518J5207M7355p2806l2996J4103m610K882M955j0460j0781j1744j8887
$$ 245518 260725 308080 235274 202278 216381 211771 214653 219608 209148 198367 186623 167736
10945A67736J8338J9786l2166N325M1026J4505j130K1420j4413j1807o178Q712
$$ 167736 186074 205860 173694 179019 220045 234550 233420 254840 240427 228620 222442 231154
10933B31154j4892k7522r256K5012J3906m7962n4417j9286K3007J2807J0907r955
$$ 231154 216262 188740 179484 204496 218402 170440 116023 96737 119744 132551 143458 133503
10921A33503M0648N7548J7634k6130j1379R065N7975N286j5075l3162J6783K850
$$ 133503 174151 231699 249333 223203 211824 220889 278864 284150 269075 235913 252696 255546
10909B55546j5538K7840N4968l5001m3425K4128J3284j9102n1684j4184m1177
$$ 255546 240008 267848 322816 287815 244390 268518 281802 262700 211016 196832 155655
10898A55655n8178j936L6032j6058J2244N886r0548l3696M3228P8363J0356L3575
$$ 155655 97477 95541 131573 115515 127759 133645 43097 9401 52629 130992 141348 174923
10886A74923N4953n0745n2680L4701L2673J2817j4261N651N0402l1073O306K9231
$$ 174923 229876 179131 126451 161152 193825 206642 192381 198032 248434 217361 223667 252898
10874B52898J0384j4109m2376j0293l5974N2654J00773j8757n1322m9866j4541
$$ 252898 263282 249173 206797 196504 160530 213184 313957 295200 243878 194012 179471
10863A79471M5107k7753k0790J8578M8538j9715R88K351N152j0356o5897q970
$$ 179471 224578 196825 176035 194613 243151 223436 224424 226775 231927 221571 155674 146704
10851A46704L5696L140k5046J6220O9537M4398l1658m1535N9317K6118K188N471
$$ 146704 182400 185540 160494 176714 246251 290649 258991 217456 276773 302891 305079 310550
10839C10550l6524k5268j6298m963K3377j416l3485j4555k172k2158l2676M435
$$ 310550 274026 248758 232460 227497 250874 249458 215973 201418 199246 177088 144412 148847
10827A48847K0810O1793L1710j1777L4661K1718K7353J9086j4157k7077J385k3338
$$ 148847 169657 231450 263160 251383 286044 307762 335115 354201 340044 312967 314352 291014
10815B91014n661j5014l7669p005J8780J4522r1384l6904L8725K6085q170n347
$$ 291014 285353 270339 232670 225665 244445 258967 167583 130679 169404 195489 187319 181972
10803A81972p309L7709k2380o5576l3401L0813j7530J6734L353j4075L9289L3078
$$ 181972 174663 212372 189992 124416 91015 121828 104298 121032 124385 110310 149599 182677
10791A82677J587l826J567K412J0903L7999Q706o2568j8028J7101M2646N3173
$$ 182677 184264 180438 182005 184417 195320 233319 242025 179457 161429 178530 221176 274349
10779B74349O072n2024q5591q4066k5135L8400K9372M7617k218j460L556P282
$$ 274349 280421 228397 142806 58740 33605 72005 101377 148994 146776 145316 148872 156154
10767A56154N3419Q851o493n9847n1818k0425J2180M979q594J7709j6351K7049
$$ 156154 209573 218424 211931 152084 100266 79841 92021 97000 88406 106115 89764 116813
10755A16813l4262m382K3264L1676N160L3552K4628r9627m5407R325O3142M4847
$$ 116813 82551 78169 101433 133109 138269 171821 196449 96822 51415 60740 123882 168729
10743A68729K5010j7718m5648l1465N350j9115l172n639L4432L4363n2830P171
$$ 168729 193739 176021 130373 98908 104258 85143 81971 76332 110764 145127 92297 99468
10731I9468n1248j0697q006j4193L8758l8229l6363M0342P2427L9244J0413K1036
$$ 99468 48220 37523 29517 15324 54082 15853 -20510 19832 92259 131503 141916 162952
10719A62952k2299j8903L320N1039L5323q020k3041k5086K6064P726N1224L7583
$$ 162952 140653 121750 125070 176109 211432 203412 180371 155285 181349 189075 240299 277882
10707B77882O952j5661q262k8876K4712K592l321J5799J1020k1422l867L0865
$$ 277882 284834 269173 260911 232035 256747 259339 256018 271817 282837 261415 257548 288413
10695B88413P7490P0618M1513p7130p9408k8019j0031L4368L9287n393j3557j4659
$$ 288413 365903 436521 478034 400904 321496 293477 283446 317814 357101 351708 338151 323492
10683C23492m693M7804J4921J6476o250P39K8604M0893K317m7422k2567n4397
$$ 323492 318799 366603 381524 398000 391750 392489 421093 461986 464303 416881 394314 339917
10671C39917J5563Q1343L7153R431k9406L5339M3128m1458n8614m7401m1065J9632
$$ 339917 355480 436823 473976 483407 454001 489340 532468 491010 432396 384995 343930 363562
10659C63562L7931L2853J2262N2830J2892j779R384k3247j1004O191L7992N8436
$$ 363562 401493 434346 446608 499438 512330 510551 519935 496688 485684 491875 529867 588303
10647E88303m158j0053j7207K9769M7163N3606L7616l4529M6976K6687J2595j4547
$$ 588303 584145 574092 556885 586654 633817 687423 725039 690510 737486 764173 776768 762221
10635G62221O419K7561R4668P4153N3729Q1117P6849N6426J41900J86537J42654
$$ 762221 768640 796201 890869 965022 1018751 1099868 1176717 1233143 1375043 1561580 1704234
10624A704234J42056J77998K82618K13579K02432K56918L68179N53188P78654
$$ 1704234 1846290 2024288 2306906 2520485 2722917 2979835 3348014 3901202 4679856
10615D679856J006861J286142J615132K064801K325306K313177K099745J780165
$$ 4679856 5686717 6972859 8587991 10652792 12978098 15291275 17391020 19171185
10607A9171185J457645J060830P39488O91444R56005J580551K454441L363869
$$ 19171185 20628830 21689660 22429148 23120592 24076597 25657148 28111589 31475458
10599C1475458L990208L970258L337012K548429J673926O60545k64170o06366
$$ 31475458 35465666 39435924 42772936 45321365 46995291 47655836 47391666 46785300
10591D6785300j15410J051888K433329L631197M332120M095495K938285J692474
$$ 46785300 46669890 47721778 50155107 53786304 58118424 62213919 65152204 66844678
10583F6844678K94981j327881k765899l307965k849525j752169n84268L77045
$$ 66844678 67139659 65811778 63045879 59737914 56888389 55136220 54551952 54928997
10575E4928997Q60664O82212J3216o98069j514598k498178l298436l554215l160305
$$ 54928997 55789661 56471873 56485089 55787020 54272422 51774244 48475808 44921593 41761288
10566D1761288k426624j773248j257202r14041r23995j083515j323098j624930
$$ 41761288 39334664 37561416 36304214 35390173 34466178 33382663 32059565 30434635
10558C0434635k033316k380493k350322k233799k029458j792214j579912j345053
$$ 30434635 28401319 26020826 23670504 21436705 19407247 17615033 16035121 14690068
10550A4690068j194238r88976q55284p73638o68271n50995m58442n14923m69961
$$ 14690068 13495830 12506854 11651570 10877932 10209661 9658666 9200224 8685301 8215340
10541H215340l87486k60215l13998k40307k73915l04326k89089k12111j86671
$$ 8215340 7827854 7567639 7253641 7013334 6739419 6435093 6146004 5933893 5747222
10532E747222j57031j95541k10511k28448k12639j32970j18725j26524j16403
$$ 5747222 5590191 5394650 5184139 4955691 4743052 4610082 4491357 4364833 4248430
10523D248430r6446q9317j05456j39713j20717p2480j24362p5671p2810r4978
$$ 4248430 4151984 4062667 3957211 3817498 3696781 3624301 3499939 3424268 3351458 3256480
10513C256480o0758l7671j08571j43919j11990r6766m0606p5784r7443l963n3810
$$ 3256480 3195722 3158051 3049480 2905561 2793571 2696805 2656199 2580415 2482972 2479009 2425199
10502B425199j4644m6521l1699q5348o8762q1104o1289m5035j03288n4222K1205
$$ 2425199 2410555 2364034 2332335 2246987 2178225 2097121 2035832 1990797 1887509 1833287 1854492
10491A854492m7056l9361o5330m0284m2290n362l8340l8775l4474n3817m1797
$$ 1854492 1807436 1768075 1702745 1662461 1620171 1614809 1576469 1537694 1503220 1449403 1407606
10480A407606l035k7940o496n9612o3172l9579J715P120J4248k7530p4562m2837
$$ 1407606 1404571 1376631 1370135 1310523 1247351 1207772 1209487 1216607 1230855 1203325 1128763 1085926
10468A085926q447k0293l6885o0856m652J2206o834M0289r840l7427J7617j1183
$$ 1085926 1077479 1057186 1020301 959445 954793 966999 960165 1000454 990614 953187 970804 959621
10456I59621o6543P889R831n9659k4324N998J6859m3025n2258R455J299j8104
$$ 959621 893078 900967 910798 851139 826815 832813 849672 806647 754389 763844 765143 747039
10444G47039N0978J0738o1006j4584J2185m5210n1247J97O5064M5922l8443K9623
$$ 747039 798017 808755 747749 733165 745350 700140 648893 649090 714154 760076 721633 751256
10432G51256J1063k1243p2848n4066J6044j1311O3297l3634j29030j1141J4144
$$ 751256 762319 741076 668228 614162 630206 618895 682192 648558 519528 508387 522531
10421E22531O3346K0533o048L4523j7933j1962k1968j7339K0875K8719j3308J6782
$$ 522531 585877 606410 600362 634885 616952 604990 583022 565683 586558 615277 601969 618751
10409F18751K1257n2532o7499o4959n571j3910j4642L4751k3526n9537K8129J9049
$$ 618751 640008 587476 519977 455018 449447 435537 420895 455646 432120 372583 400712 419761
10397D19761J812o0326q7283n2392K2671M3759M7846j9784k5715O7360L8768n2590
$$ 419761 421573 361247 273964 221572 244243 288002 335848 316064 290349 357709 396477 343887
10385C43887l7941O3j26m0344m9927k1797K185Q0008N1756N246L4976l4184p4945
$$ 343887 305946 306009 305883 265539 215612 193815 196000 276008 327764 333010 367986 333802 258857
10372B58857q3033o9303N990K5832M6670m118j2876k1372J1735l9449l5970L0127
$$ 258857 175824 106521 112511 138343 185013 180895 168019 146647 158382 118933 82963 113090
10360A13090P0332M9242K766m4944k4610j9140M8856N5268l6491o8917j1775k8214
$$ 113090 183422 232664 235430 190486 165876 146736 195592 250860 214369 145452 133677 105463
10348A05463N2598J3J384O604K6074L5179l427k2080l5718o7403Q378K1294l797
$$ 105463 158061 158074 159458 166062 192136 227315 223888 201808 166090 98687 107065 128359 124562
10335A24562J1004L8238K9414Q992J7680o3211m3314k0317l5229K9545K2331l962
$$ 124562 135566 173804 203218 212210 229890 166679 123365 103048 67819 97364 119695 115733
10323A15733l4002p0120L753j4099N0030N9059j8479n0234j3431Q320l3632J3716
$$ 115733 81731 11611 15364 1265 51295 110354 91875 41641 28210 36530 2898 16614
10311A6614O7458K3601k2454O3948K1875K8550K5642m6456m6610n5283n551R6569
$$ 16614 84072 107673 85219 149167 171042 199592 225234 178778 132168 76885 71334 167903
10299A67903K9892L4050j0022l2806m0482o8693j4671k8403K6234O5047N0329
$$ 167903 197795 231845 221823 189017 148535 79842 65171 36768 63002 128049 178378
10288A78378M3438K7283k6540n7994l3876L320J9409Q938n3283J9025O3744k8393
$$ 178378 221816 249099 222559 164565 130689 134009 153418 162356 109073 128098 191842 163449
10276A63449m3766k2835l2245l241p901r448k7240N6137k2295M956j8538j1827
$$ 163449 119683 96848 64603 61362 53461 44013 16773 72910 50615 55571 37033 25206
10264B5206J1605P365n0059J4731M222l567K1591M7836o63L844O1610n164n6816
$$ 25206 36811 44176 -5883 8848 13070 9503 31094 78930 78267 82111 143721 138557 81741
10251H1741J520N9714L6606m2223l9171m6357M9709Q9176j1327Q949n96r9981
$$ 81741 83261 142975 179581 137358 98187 51830 101539 190715 179388 188337 187741 87760
10239H7760p5810k6795k5188K0489M4360K0531J2883L395k4080m5875N8905r390
$$ 87760 11950 -14845 -40033 -19544 24816 45347 58230 61625 37545 -8330 50575 41185
10227D1185m2644N3858L4786j047p472L4803L9367m9531J0097K2570K9239j5164
$$ 41185 -1459 52399 87185 86138 78666 113469 152836 103305 113402 135972 165211 150047
10215A50047j9212k3515l6512j6996J4650j7057L2114J3824J247k1999K3977J512
$$ 150047 130835 107320 70808 53812 68462 51405 83519 97343 98590 76591 100568 102080
10203A02080k2145J3297j5359J1302K5593R584o2313j7986j8211J9936N808K2542
$$ 102080 79935 93232 77873 89175 114768 124352 62039 44053 25842 45778 51586 74128
10191G4128m3744q0236K5927O7939r748J405j0186L5370N380l0233l1584k8580
$$ 74128 30384 -49852 -23925 44014 34266 35671 25485 60855 66235 36002 4418 -24162
10179b4162N3477O1853J9291J8443k4254O0279L7761l1866M3415K0204m2631K9010
$$ -24162 29315 91168 110459 128902 104648 164927 202688 170822 214237 234441 191810 220820
10167B20820J3415m0774K4659N0856o5210o391K8310K7424M717Q0307R991j2072
$$ 220820 234235 193461 218120 268976 203766 197375 225685 253109 257826 338133 348124 336052
10155C36052n811n317j9736N1261J8086k7051N204K0465J0302J7952M12k5615
$$ 336052 330241 324924 305188 356449 374535 347484 352688 373153 383455 401407 401819 376204
10143C76204m7679r555O6548P8654l2148m4047n9382k0555j0561N0712K985J099
$$ 376204 328525 318970 385518 464172 432024 387977 328595 308040 297479 348191 351176 352275
10131C52275r358k1438M301j6231n7149k9819r5619J0144p131K6179K560L2769
$$ 352275 342917 321479 325780 309549 252400 222581 126962 137106 129975 156154 158714 191483
10119A91483N0722O2658R208n9094o5163R274l6028k9583M5211J3973m2431k3140
$$ 191483 242205 304863 314071 254977 189814 199088 163060 133477 178688 192661 150230 127090
10107A27090J545j2513j4252M1622j7134k883J1546j8058l8481N031M004M3179
$$ 127090 128635 116122 101870 143492 126358 123475 135021 116963 78482 83513 87517 130696
10095A30696J503r5547k7010L9887P968j061J4457o5937n55N5490M3329L392k1679
$$ 130696 132199 36652 9642 49529 57497 56436 70893 4956 4401 59891 103220 106612 84933
10082H4933m4429L2318Q0965M3691k7473p9966j9849L1840J07574L975n4412j505
$$ 84933 40504 72822 153787 197478 170005 90039 70190 102030 209604 213579 159167 157662
10070A57662o5431k3058j4519O235P302M5701K4253N4031J9321k685m5520l2579
$$ 157662 92231 69173 54654 60889 68191 113892 138145 192176 211497 208812 163292 130713
10058A30713k0641L0906L1859o8752k5882j8028j220M2883K2701K1938K7282J8150
$$ 130713 110072 140978 172837 104085 78203 60175 58955 101838 124539 146477 173759 191909
10046A91909m9026k0869K2088J851j8795m3024n2916l7650j3341N0250P4094J511
$$ 191909 142883 122014 144102 145953 127158 84134 31218 -6432 -19773 30477 104571 106082
10034A06082p7741j8685J7464N019M599M5828O1910K2191J2082L8416P364p238
$$ 106082 28341 9656 27120 32139 36738 82566 144476 166667 178749 217165 224529 217291
10022B17291o4902j01674P066K6120p980L3990j4267q890M0031L9653p577m8000
$$ 217291 152389 50715 57781 83901 75921 109911 95644 86754 126785 166438 158861 110861
10010A10861n9429j3399r599K7678K5196j4992m5300K949o992L0395J1146K7203
$$ 110861 51432 38033 28434 56112 81308 66316 21016 23965 16973 47368 58514 85717
9998H5717K8749m7766k9834J1159M782L0335M3694k9837l5678J6116J2182K4989
$$ 85717 114466 66700 36866 48025 52807 83142 126836 96999 61321 77437 89619 114608
9986A14608L9791m4498k3604p788L1430L9044J6471J1189m8219l7925o6627l461
$$ 114608 154399 109901 86297 78509 109939 148983 165454 176643 128424 90499 23872 20411
9974B0411q534M041O906j7076K2378M4998j8941L0297K7006J2380r883K9912p67
$$ 20411 11877 15918 22824 5748 28126 73124 54183 84480 111486 123866 113983 143895 143128
9961A43128r616n139k9723L1793M8861O6214J7862j22933k8465J8129j5267p893
$$ 143128 133512 128373 98650 130443 179304 245518 263380 140447 111982 130111 114844 106951
9949A06951J4977L842l0676k7441J7499J8924Q241J1711K0132j9851o7818M2561
$$ 106951 121928 125770 95094 67653 85152 104076 112317 124028 144160 124309 56491 99052
9937I9052j1419j9282j4774K7135J0240M0617L2084k7773j9551m1274L5445o065
$$ 99052 87633 68351 53577 80712 90952 131569 163653 135880 116329 75055 110500 104435
9925A04435Q493K3497L4310m6123k216L6572M6132k1594l493l0117k0176l343
$$ 104435 112928 136425 170735 124612 122396 158968 205100 183506 180013 149896 129720 126377
9913A26377M0045n554q523M6729M5679J1336o7261j14096j2733L9660N1004J8527
$$ 126377 166422 160868 152345 199074 244753 256089 188828 74732 61999 101659 152663 171190
9901A71190J7069L091O630K533l5276o979J8685j0872J6760l679n5430l3598P647
$$ 171190 188259 191350 197980 200513 165237 158258 176943 166071 182831 179152 123722 90124 97771
9888I7771M0085J4983O36P7852M3453N957m4361p1912R758Q2701J1954m1608m7576
$$ 97771 137856 152839 153475 231327 274780 280737 236376 164464 174222 256923 268877 227269 179693
9875A79693n707P853K7819o611K3190m268q4047m627p86j80K294M6674K4388N2421
$$ 179693 173986 181839 209658 203047 226237 221969 137922 133295 132509 132329 134623 181297 205685 258106
9861B58106L606j9033J4266o1003q3058j4405J0938P7704K2479j2677M6065M5719
$$ 258106 261712 242679 256945 195942 112884 98479 109417 187121 209600 196923 242988 288707
9849B88707J4810k6125j1329l0397L402M52M54L5420r795j1249J0589O513n1141
$$ 288707 303517 277392 266063 235666 239068 239520 239974 275394 265599 254350 264939 271452 220311
9836B20311L6154K6604j694l4610O107k8308l7290n8802j6136M0318Q5917Q0748
$$ 220311 256465 283069 281375 246765 252872 224564 187274 128472 112336 152654 238571 319319
9824C19319m8378k6691k623j2382m5362J4400k50o859M8336K9495L1647o0021
$$ 319319 270941 244250 241627 229245 183883 198283 198033 191174 239510 269005 300652 240631
9812B40631q1675J4679K7383K1815N6087L3861r737K8062k1660m7336j3989L4910
$$ 240631 158956 173635 201018 222833 278920 312781 303044 331106 309446 262110 248121 283031
9800B83031P048k4094m0164K2178j9346j8174K1705j4722M307o246j7232L1307
$$ 283031 290079 265985 225821 247999 228653 210479 232184 217462 221769 215523 198291 229598
9788B29598R8201K9861n8920k9209k7336k6650J7227j913j4472n0798n7154K9575
$$ 229598 327799 357660 298740 269531 242195 215545 232772 230859 216387 165589 108435 138010
9776A38010L6697Q8143Q3906k120n8280P233L2573l7550J1412j064J1270L1418
$$ 138010 174707 262850 346756 344636 286356 293589 326162 288612 300024 298960 310230 341648
9764C41648l3219k881N673K5165l3865j5226M2247L1226k6162k6120m0663n6890
$$ 341648 308429 305548 311221 336386 302521 287295 329542 360768 334606 308486 267823 210933
9752B10933J9558j8447M7179L4176m9025O156L0083J3551M78n0357j772L5233
$$ 210933 230491 212044 259223 293399 244374 250530 280613 294164 294642 244285 242513 277746
9740B77746J2647k4801l01m382J7859R345m3906j9497k7179J877K4775L1317L0351
$$ 277746 290393 265592 265291 260909 278768 288113 244207 224710 197531 199408 224183 255500 285851
9727B85851k3257L693M5021M0476m5791l1810j3589O1073O9290n3353p0967O388
$$ 285851 262594 266287 311308 351784 305993 274183 260594 321667 390957 337604 266637 273025
9715B73025M0274K0928M3312k2879n5070J9238l2498j7701K5449n785L7344L4741
$$ 273025 313299 334227 377539 354660 299590 318828 286330 268629 294078 288293 325637 360378
9703C60378m9300k442j2557m9004l0732N4469k931J11M682N905j1374N0401M2345
$$ 360378 311078 308636 296079 247075 216343 270812 267881 267992 272674 278579 267205 317606 359951
9690C59951j0560N8542m1013n9790j5744m751j7268J3923M9541J2988L0136N0049
$$ 359951 349391 407933 366920 307130 291386 286635 269367 283290 332831 345819 375955 426004
9678D26004m3978r1332l2353K6424m2199j2169j4812k1712N3011O4795N4745l6621
$$ 426004 382026 290694 258341 284765 242566 230397 215585 193873 246884 311679 366424 329803
9666C29803K5331o051o3624Q0m7379l1209k78L6958p151O7921O3929O935j8220
$$ 329803 355134 349083 285459 285539 238160 206951 206673 243631 236480 304401 368330 375265 357045
9653C57045l7721J4903L4541K3003l8759K357k3367J9040l5865N7379K3582K748
$$ 357045 319324 334227 368768 391771 353012 355369 332002 351042 315177 372556 396138 398886
9641C98886j3770k3724J6977K0171j3232K385M555M1482k5760o5190R114L5199
$$ 398886 385116 361392 378369 398540 385308 387693 392248 433730 407970 342780 351894 387093
9629C87093j4501N2960l946L90k875k5908J8078J8213L5371L132J0080l0481K7594
$$ 387093 372592 425552 421606 421996 419121 393213 411291 429504 464875 468007 478087 447606 475200
9616D75200o438m0296l5102O7365L9147j7388k5763K8356P6244J611k9108m2548
$$ 475200 468762 428466 393364 460729 499876 482488 456725 485081 561325 562936 533828 491280
9604D91280M978L280M7921J2188J1938K1712M1589L6416L5405l8306R987L5691
$$ 491280 496258 499538 547459 559647 571585 593297 634886 671302 706707 668401 678388 714079
9592G14079M4419J1444J9677K3885J372j7307j382j662K0689M8171Q542m1529
$$ 714079 758498 769942 789619 813504 814876 797569 796187 794525 815214 863385 871927 830398
9580H30398l0800K5370M7592j9767J2036l9000j5103l9648n5064M1564Q1320K2229
$$ 830398 799598 824968 872560 852793 864829 825829 810726 771078 716014 757578 838898 861127
9568H61127l2940k533M167L9418r87k8553K225M0976q196j4475K4498O7160M0188
$$ 861127 828187 825654 829821 869239 868252 839699 841924 882900 874704 860229 884727 951887 992075
9555I92075O014M9162L8853j6825N3457L3847P3438K3537j11517J58n336l9352
$$ 992075 998089 1047251 1086104 1069279 1122736 1156583 1230021 1253558 1142041 1142199 1136863 1097511
9543A097511N837k1059K1661J2634m4973o0068l0961l7650k3785M8869L9907J5308
$$ 1097511 1103348 1082289 1103950 1116584 1071611 1011543 980582 942932 919147 968016 1007923 1023231
9531A023231J0258j4618r013M8112P2839J3990j6702K0039L2195L5314j6250k7816
$$ 1023231 1033489 1018871 1009858 1057970 1130809 1144799 1128097 1148136 1180331 1215645 1199395 1171579
9519A171579N8475M3433L5040M6731l0939M400o880r887j4702j6629K5421O858
$$ 1171579 1230054 1273487 1308527 1355258 1324319 1328719 1321839 1311952 1297250 1280621 1306042 1312900
9507A312900k4147l1303L3458K9461K1625j0515r595J8423n1651n3214M3752K4497
$$ 1312900 1288753 1257450 1290908 1320369 1341994 1331479 1321884 1340307 1288656 1235442 1279194 1303691
9495A303691L9385J0193K3386L0537l0835K8895K3287j0367r875k7464m969O0037
$$ 1303691 1343076 1353269 1376655 1407192 1376357 1405252 1428539 1418172 1408297 1380833 1375864 1435901
9483A435901J1258j326Q3134L249K885L8198J5401M7048J6169L9245M7104k9018
$$ 1435901 1447159 1445833 1528967 1532216 1535101 1573299 1588700 1635748 1651917 1691162 1738266 1709248
9471A709248n1346l1093K9611O2077K7653m4093k8525K2856j2419l9107K1371
$$ 1709248 1657902 1626809 1656420 1718497 1746150 1702057 1673532 1696388 1683969 1644862 1666233
9460A666233N6848N1226N0539k1557N9883L5802J2191K6878k4818K3416q453p1169
$$ 1666233 1723081 1774307 1824846 1803289 1863172 1898974 1911165 1938043 1913225 1936641 1928188 1857019
9448A857019l1903l1283Q1847J43182M6508k1499m3618K0009j4830N9815k0179
$$ 1857019 1825116 1793833 1875680 2018862 2065370 2043871 2000253 2020262 2005432 2065247 2045068
9437B045068l2548O0818K3583m9598o1879l5668K7581K0932j6744l5360M9804
$$ 2045068 2012520 2073338 2096921 2047323 1985444 1949776 1977357 1998289 1981545 1946185 1995989
9426A995989J4492M717j638k5493j9652l0277N3104R5960k7610m0932K4062k848
$$ 1995989 2010481 2015198 2013560 1988067 1968415 1938138 1991242 2087202 2059592 2018660 2042722 2039874
9414B039874q594k221k5614l8021n773O6597K6901l5941o3727J1307l0243m3777
$$ 2039874 2031280 2029059 2003445 1965424 1959651 2026248 2053149 2017208 1953481 1964788 1934545 1890768
9402A890768J0327j8057K6340J6008m0958j7362P18k5915m4037J807K821l4419
$$ 1890768 1901095 1883038 1909378 1925386 1884428 1867066 1867784 1841869 1797832 1799639 1802460 1768041
9390A768041j7368j3364l2417j5355q348k6410n013J2540m2121j2923k5115L1995
$$ 1768041 1750673 1737309 1704892 1689537 1681189 1654779 1649766 1662306 1620185 1607262 1582147 1614142
9378A614142j3978l7308j4132k9935k2629K9812j3573L18K4857K2675K4799L7653
$$ 1614142 1600164 1562856 1548724 1518789 1496160 1525972 1512399 1512717 1537574 1560249 1585048 1622701
9366A622701l52n7023m4873J165k2088r6383p823m419j3772K0656N7437j4401
$$ 1622701 1622349 1565326 1520453 1521618 1499530 1403147 1395324 1390905 1377133 1397789 1455226 1440825
9354A440825k0365O1873l1221n1481m5414j0754O105N2421M2241J1124M232r986
$$ 1440825 1420460 1482333 1451112 1399631 1354217 1343463 1349568 1401989 1444230 1455354 1459586 1449600
9342A449600m210l601j5795L1294m1003k3458K735P3019j9842k7354K8208m639
$$ 1449600 1445390 1441789 1425994 1457288 1416285 1392827 1395562 1468581 1448739 1421385 1449593 1444954
9330A444954L4880q683K9660K657m884l2975L7653K8786l7671r048L6146K5180
$$ 1444954 1479834 1471151 1500811 1503468 1498584 1465609 1503262 1532048 1494377 1485329 1521475 1546655
9318A546655J6581R9933j0152k4042k1151l8296m1665M0538R3789k6279l136M9178
$$ 1546655 1563236 1663169 1653017 1628975 1607824 1569528 1527863 1568401 1662190 1635911 1632775 1681953
9306A681953N1657M204J3634L3088j3387l2024K2003L7008Q959J2789J960M9019
$$ 1681953 1733610 1737814 1751448 1784536 1771149 1739125 1761128 1798136 1807095 1819884 1821844 1870863
9294A870863l7383O1551R3242R6041j1551m0285j3298J1088K363L4088O6905l451
$$ 1870863 1833480 1895031 1988273 2084314 2072763 2032478 2019180 2030268 2032631 2066719 2133624 2130173
9282B130173j1766J2539K9034M5474P7403M8269K3015M5733M3976J3887N9442
$$ 2130173 2118407 2130946 2159980 2205454 2282857 2331126 2354141 2399874 2443850 2457737 2517179
9271B517179O0051J2488k253J0939M7006M8799L7753K6300P0532J59268P7271
$$ 2517179 2577230 2589718 2587465 2598404 2645410 2694209 2731962 2758262 2828794 2988062 3065333
9260C065333N4147J18313P2818N5189R6045J60310J31298J29791J89978K47885
$$ 3065333 3119480 3237793 3310611 3365800 3461845 3622155 3753453 3883244 4073222 4321107
9250D321107K74019K75159K69513L38198L94705M45948M27602M64387N23663M87952
$$ 4321107 4595126 4870285 5139798 5477996 5872701 6318649 6746251 7210638 7734301 8222253
9240H222253M66171L70773K64000K30678K02555J41488J51786J68514J66913J99592
$$ 8222253 8688424 9059197 9323197 9553875 9756430 9897918 10049704 10218218 10385131 10584723
9230A0584723K85723L62685M65245N74672O14449P26444P70121Q24987Q67595
$$ 10584723 10870446 11233131 11698376 12273048 12887497 13613941 14384062 15209049 16076644
9221A6076644Q57198P97221P27943P04242P19593Q05307Q92546J004579J071905
$$ 16076644 16933842 17731063 18459006 19163248 19882841 20688148 21580694 22585273 23657178
9212B3657178J196993J234362J288737J395458J344720J207928J134637R83344
$$ 23657178 24854171 26088533 27377270 28772728 30117448 31325376 32460013 33443357
9204C3443357Q94910O86617N97699N26414M94646M87424N58241N38729O43294
$$ 33443357 34338267 35024884 35622583 36148997 36643643 37131067 37689308 38228037 38871331
9195C8871331Q09157R23051J048683J110467J159023J267885J312084J293695
$$ 38871331 39680488 40603539 41652222 42762689 43921712 45189597 46501681 47795376
9187D7795376J201576J202846J285270J312525J408281J492039J558098J735016
$$ 47795376 48996952 50199798 51485068 52797593 54205874 55697913 57256011 58991027
9179E8991027J852540J889667J896321J822328J717612J699618J687987J637080
$$ 58991027 60843567 62733234 64629555 66451883 68169495 69869113 71557100 73194180
9171G3194180J546523J561108J531125J478561J397789J309547J304819J320317
$$ 73194180 74740703 76301811 77832936 79311497 80709286 82018833 83323652 84643969
9163H4643969J350794J371265J390420J537551J500888J536103J510792J379630
$$ 84643969 85994763 87366028 88756448 90293999 91794887 93330990 94841782 96221412
9155I6221412J338384J260240J121080J039633R39747Q00680P07760O60348O38395
$$ 96221412 97559796 98820036 99941116 100980749 101920496 102721176 103428936 104089284 104727679
9146A04727679N59542O33534P36682R02691J029651J364299J763583K201084K553235
$$ 104727679 105287221 105920755 106657437 107560128 108589779 109954078 111717661 113918745 116471980
9137A16471980K812612L090003L209798L122405K969567K786672K565810K385311
$$ 116471980 119284592 122374595 125584393 128706798 131676365 134463037 137028847 139414158
9129A39414158K292443K247216K266605K118426J999945J846325J625769J442742
$$ 139414158 141706601 143953817 146220422 148338848 150338793 152185118 153810887 155253629
9121A55253629J235309J221506J335271J584499K013771K507771L137075L735977
$$ 155253629 156488938 157710444 159045715 160630214 162643985 165151756 168288831 172024808
9113A72024808M381717N096101N610775O101168O510976O740970O918359O908289
$$ 172024808 176406525 181502626 187113401 193214569 199725545 206466515 213384874 220293163
9105B20293163O815469O740258O648867O341714N872310N307350M609816L832735
$$ 220293163 227108632 233848890 240497757 246839471 252711781 258019131 262628947 266461682
9097B66461682L089429K249399J566131R25380L71954j07639m66766q32249j100617
$$ 266461682 269551111 271800510 273366641 274292021 274663975 274556336 274089570 273257321 272156704
9088B72156704j265148j319823j375304j330224j128269q85476n43521k00260
$$ 272156704 270891556 269571733 268196429 266866205 265737936 264852460 264308939 264108679
9080B64108679M9980M46953O90317P47016Q63974J036638J146758J166885J325321
$$ 264108679 264158659 264605612 265295929 266042945 266906919 267943557 269090315 270257200 271582521
9071B71582521J425774J454258J460220J451946J367432J137807Q82858P01664
$$ 271582521 273008295 274462553 275922773 277374719 278742151 279879958 280762816 281464480
9063B81464480M48899K66078J18845J04567p357l9689j48913k51784l79056m86479
$$ 281464480 281913379 282179457 282298302 282402869 282395512 282355823 282206910 281955126 281576070 281089591
9053B81089591p39266j037947j283562j515941j663701j853649j950878j969825
$$ 281089591 280350325 279312378 278028816 276512875 274849174 272995525 271044647 269074822
9045B69074822j870011j615022j288435r13366m75022P4465M60368Q13967J165377
$$ 269074822 267204811 265589789 264301354 263387988 262912966 262987431 263447799 264261766 265427143
9036B65427143J427440J524206J486773J344926J058055N75767r7153q68667j690815
$$ 265427143 266854583 268378789 269865562 271210488 272268543 272844310 272747157 271878490 270187675
9027B70187675k554736l305400l905451m425714m738938m915342m937959m954405
$$ 270187675 267632939 264327539 260422088 255996374 251257436 246342094 241404135 236449730
9019B36449730m883276m801583m631225m401431m144818l857266l539610l222033
$$ 236449730 231566454 226764871 222133646 217732215 213587397 209730131 206190521 202968488
9011B02968488k909832k666456k535648k334321k180504k090597k048544k048766
$$ 202968488 200058656 197392200 194856552 192522231 190341727 188251130 186202586 184153820
9003A84153820k050568k019637k014433k024038k061586k157305k335506k372563
$$ 184153820 182103252 180083615 178069182 176045144 173983558 171826253 169490747 167118184
8995A67118184k487834k705567k923395l140152l385952l620450l784860l889956
$$ 167118184 164630350 161924783 159001388 155861236 152475284 148854834 145069974 141180018
8987A41180018m053281m140826m103381m103897m020334l866605l642445l473225
$$ 141180018 137126737 132985911 128882530 124778633 120758299 116891694 113249249 109776024
8979A09776024l371834l164411k939729k735734k550394k363842k196511k021777
$$ 109776024 106404190 103239779 100300050 97564316 95013922 92650080 90453569 88431792
8971H8431792j829656j628149j527418j529903j508138j452456j522200j621075
$$ 88431792 86602136 84973987 83446569 81916666 80408528 78956072 77433872 75812797
8963G5812797j775700j836239j879632j902395j968883j984053k020397k027772
$$ 75812797 74037097 72200858 70321226 68418831 66449948 64465895 62445498 60417726
8955F0417726k015170j961989k006966j929254j857834j788392j809571j784264
$$ 60417726 58402556 56440567 54433601 52504347 50646513 48858121 47048550 45264286
8947D5264286j699267j614658j625455j562503j473872j451285j361874j352703
$$ 45264286 43565019 41950361 40324906 38762403 37288531 35837246 34475372 33122669
8939C3122669j235201j132210j195573j086429j064683r13382q44799q07597p47496
$$ 33122669 31887468 30755258 29559685 28473256 27408573 26495191 25650392 24842795 24095299
8930B4095299p23816p16094o54995o14898n78419n28629m77797n03752n16793
$$ 24095299 23371483 22655389 22000394 21385496 20807077 20278448 19800651 19296899 18780106
8921A8780106m72687m68933m00124l48295m16731m35423l34831l43392k90215
$$ 18780106 18307419 17838486 17438362 17090067 16673336 16237913 15903082 15559690 15269475
8912A5269475l00376l23942k87399k38240k52767l08407k84026l34057l00363
$$ 15269475 14969099 14645157 14357758 14119518 13866751 13558344 13274318 12940261 12639898
8903A2639898k67944k03420j93887k16447k06797k35244j86904k42483k77183
$$ 12639898 12371954 12168534 11974647 11758200 11551403 11316159 11129255 10886772 10609589
8894A0609589k31525k36953j58689j68217k00052k15744j68011q5262j53162j46362
$$ 10609589 10378064 10141111 9982422 9814205 9614153 9398409 9230398 9145136 8991974 8845612
8884H845612j53078j55194r5776j45591j61282j80789j12865p2997j28987j44505
$$ 8845612 8692534 8537340 8441564 8295973 8134691 7953902 7841037 7768040 7639053 7494548
8874G494548j02942r0330j09753j37678r0954o2305j21921j36935o7754j41217
$$ 7494548 7391606 7301276 7191523 7053845 6962891 6900586 6778665 6641730 6573976 6432759
8864F432759j26172r8801j13840r8761q3171j18718j28025j25982l8213o8222
$$ 6432759 6306587 6207786 6093946 5995185 5912014 5793296 5665271 5539289 5501076 5432854
8854E432854n9749j11138j36990j14252q2490m9208p4618j31813j07238l5398
$$ 5432854 5373105 5261967 5124977 5010725 4928235 4879027 4804409 4672596 4565358 4529960
8844D529960j6340k7862j62596q5372k7640q7752r1024k6299q2421n5351p1847
$$ 4529960 4513620 4485758 4323162 4237790 4210150 4122398 4031374 4005075 3922654 3867303 3795456
8833C795456o7838N660m2017n6122k3944M2652q8957q3323m9713j3247j39854
$$ 3795456 3727618 3733278 3691261 3635139 3611195 3653847 3564890 3481567 3431854 3418607 3278753
8822C278753o3551J2968l9133m2104j5240l1458k6928k1298P533l0608n0007L008
$$ 3278753 3215202 3228170 3189037 3146933 3131693 3100235 3073307 3052009 3059542 3028934 2978927 2981935
8810B981935o1945m8838j9427o0078k0770l5426l061l2713j05640k0668k6054
$$ 2981935 2919990 2871152 2851725 2791647 2770877 2735451 2732390 2699677 2594037 2573369 2547315
8799B547315o1916m7978R351N917l6203l4343k8116r2396J585J8422J0547m2422
$$ 2547315 2485399 2437421 2446772 2452689 2416486 2382143 2354027 2261631 2263216 2281638 2292185 2249763
8787B249763P249j7303k9969m5793j8084L6681K3610j865j5868l9794l0090q436
$$ 2249763 2257012 2239709 2209740 2163947 2145863 2182544 2206154 2204289 2188421 2148627 2118537 2110101
8775B110101j1455M2050J9282n6917q9241m3398K6965L9006J9086l732k3312L43
$$ 2110101 2098646 2140696 2159978 2103061 2013820 1970422 1997387 2036393 2055479 2051747 2028435 2028778
8763B028778R918r001R8j3722m5136J1475m523r161l8251j3740j7823m4580l9784
$$ 2028778 2038696 2029695 2029793 2016071 1970935 1982410 1977887 1968726 1930475 1916735 1898912 1854332 1814548
8750A814548J1859J9220j3970k3223k8740L5700K1381j6540k2308J7135j791L7429
$$ 1814548 1826407 1845627 1831657 1808434 1779694 1815394 1836775 1820235 1797927 1815062 1813271 1850700
8738A850700k1251o958J4197n1667J0364j892j1581O58j181l8146q0881p0082
$$ 1850700 1829449 1822491 1836688 1785021 1795385 1793493 1781912 1782570 1781389 1743243 1662362 1592280
8726A592280k7484m5086o8687N5424Q955k5358l9549j8772o063J278k1916j7176
$$ 1592280 1564796 1519710 1451023 1506447 1515402 1490044 1450495 1431723 1425660 1426938 1405022 1387846
8714A387846n551K7299M2553L6538J2282k666p494J5104P6034N7473O3309K2980
$$ 1387846 1382295 1409594 1452147 1488685 1500967 1498301 1490807 1505911 1581945 1639418 1702727 1725707
8702A725707j6817m0879l1636k0850k4126R41O3795j7118l4312j0728l5483K535
$$ 1725707 1708890 1668011 1636375 1615525 1591399 1592340 1656135 1639017 1604705 1593977 1558494 1561029
8690A561029k8395p4479k4035l2155j3976p8J6491j3722Q239J01247L1922p6649
$$ 1561029 1532634 1458155 1434120 1401965 1387989 1387911 1404402 1390680 1398919 1500166 1532088 1455439
8678A455439K1618l973N7137L7967K6489P632j8755Q2193M3025L4827k85N434
$$ 1455439 1477057 1473084 1530221 1568188 1594677 1602309 1583554 1665747 1708772 1743599 1743314 1748748
8666A748748J4888K1645J6161J8115j6320n3970M4157M38n9341m8397M3758R936
$$ 1748748 1763636 1785281 1801442 1819557 1803237 1749267 1793424 1793862 1734521 1686124 1729882 1739818
8654A739818N430M2070L688m0722l7232k9919n8824k791L529r900J8854N3275
$$ 1739818 1745248 1787318 1791006 1750284 1713052 1683133 1624309 1621518 1625047 1615147 1634001 1687276
8642A687276N632J2684j3400K1032L341O407j4908P4197M9255m381J6710r342
$$ 1687276 1692908 1705592 1692192 1713224 1716565 1722972 1708064 1782261 1831516 1827135 1843845 1834503
8630A834503O2509J5704j1875l1166m4493j2616r077q9231n6028m5874l8962k100
$$ 1834503 1897012 1912716 1900841 1869675 1825182 1812566 1803489 1714258 1658230 1612356 1573394 1571294
8618A571294K2857P896J1636k7586M396o64M122m3340j3491m3128J561o145o2751
$$ 1571294 1594151 1602047 1613683 1586097 1590493 1589829 1593951 1550611 1537120 1493992 1495553 1489408 1426657
8605A426657J5421q869q634l3457L2951K5584j4372J2744L9599P726J0287J7907
$$ 1426657 1442078 1433209 1424575 1391118 1424069 1449653 1435281 1448025 1487624 1495350 1505637 1523544
8593A523544o1218j6134j0333m5951o5749n0567k9451J0227m084n4011n5292j6773
$$ 1523544 1462326 1446192 1435859 1389908 1324159 1273592 1244141 1254368 1250284 1196273 1140981 1124208
8581A124208N986j2230m9594n4540k2406k9717k9804m3928o0703j2758N840j2094
$$ 1124208 1130194 1117964 1068370 1013830 991424 961707 931903 887975 827272 814514 820354 808260
8569H08260o2916Q28J433k6776K6695O4386N997j3610M829j7784m5068J7525J8903
$$ 808260 745344 746172 747605 720829 747524 811910 817907 804297 809126 791342 746274 763799 782702
8556G82702j0607n0375J0000R197j9822o4265n4741K4355l133o4839m3805m056
$$ 782702 772095 721720 731720 740917 721095 656830 602089 626444 623311 558472 514667 510611
8544E10611K6723Q294r9133n3878L8434N7626p846l2545p003J2048o0344K9428
$$ 510611 537334 545628 446495 392617 431051 488677 480831 448286 441283 453331 392987 422415
8532D22415J2444m279J5926q955j8787m2584n7556L2648M0278L6239M3288k4417
$$ 422415 434859 430580 446506 437551 418764 376180 318624 351272 391550 427789 471077 446660
8520D46660o578J2961p7229j5912l7899R323N0304L1638m7647o7249K6249M6591
$$ 446660 440082 453043 375814 359902 322003 331326 381630 413268 365621 298372 324621 371212
8508C71212j0718q8956k6961L9889L8376J7940l6091k2815J3623o0655k7615O2027
$$ 371212 360494 271538 244577 284466 322842 340782 304691 281876 295499 234844 207229 269256
8496B69256M5495K3322m0610l8937N6040K9363o7271m6439j1226J4318R288L9264
$$ 269256 314751 338073 297463 258526 314566 343929 276658 230219 218993 233311 242599 281863
8484B81863p059K3620j8561l8090J8914N4216L3099M744n6057l2724K5944o545
$$ 281863 274804 298424 279863 241773 260687 314903 348002 352746 296689 263965 289909 283364
8472B83364K8964N806k0128j3595m3298k2172n8779J0124L4070o895J5063R349
$$ 283364 312328 318134 298006 284411 241113 218941 160162 170286 204356 197461 212524 221873
8460B21873o219j3333R151Q5607K1358k7770k5417O4125Q894j8851m1859n9436
$$ 221873 215654 202321 211472 297079 318437 290667 265250 329375 338269 319418 277559 218123
8448B18123J4667n266k5308k2834j2487J7042N1580j9256j759O4152j619n2415
$$ 218123 232790 227524 202216 179382 166895 183937 235517 216261 214502 278654 277035 224620
8436B24620m4314J2393J8560L0416N1149J6637j724n5474q0835k3389N3453M1516
$$ 224620 180306 192699 211259 241675 292824 309461 307737 252263 171428 148039 201492 243008
8424B43008L0058l9267K7217M3095q1925r7728l858M6931L6060K1727k8108l5540
$$ 243008 273066 233799 261016 304111 222186 124458 120600 167531 203591 225318 197210 161670
8412A61670p1225L7225K2941L60Q576k0191P722L8761M5190L811j9423m2573n1481
$$ 161670 90445 127670 150611 150971 159547 139356 147078 185839 231029 234840 215417 172844 121363
8399A21363k1696j0231K2821L1402K6793j4050n9726K7638q009j7373K0042J7492
$$ 121363 99667 89436 112257 143659 170452 156402 96676 124314 116305 98932 118974 136466
8387A36466M383j9589J67K8511k0213j339q831j0701m315k2080k7081j1812L7526
$$ 136466 140849 121260 121427 149938 129725 128386 119555 108854 104539 82459 55378 43566 81092
8374H1092j0482O054o371M6758j5256p318l9391L7872m46Q1722m5292n1104j2226
$$ 81092 70610 76664 70293 117051 101795 94477 55086 92958 92512 174234 128942 77838 65612
8361F5612L1762L4744K6288o510L8723j386o7280l2841k8229J6985q696m203K5412
$$ 65612 97374 132118 158406 151896 190619 189233 121953 89112 60883 77868 69172 64969 90381
8348I0381N0107l453j8682L4031k7342l5971J5643N1484K8905Q380L2267l9525
$$ 90381 140488 137035 118353 152384 125042 89071 104714 156198 185103 193483 225750 186225
8336A86225p1143J404J7921J9368J2069j0513j2960J904j7378L8837p206Q038
$$ 186225 115082 116486 134407 153775 165844 155331 142371 144275 126897 165734 158528 166566
8324A66566K4414J5866k3585o4768K2664j8303m29j5527j807J5118N2447j689
$$ 166566 190980 206846 183261 118493 141157 122854 122425 106898 105091 120209 172656 170967
8312A70967n1991o2581m7126Q3918L8558k892p7959q4588J8976J4600k3683J5736
$$ 170967 118976 56395 9269 93187 131745 128853 50894 -33694 -14718 -118 -23801 -8065
8300h065K6534N6424R768l4967J8494k8162q772L6613K863j9496K7258N3269l714
$$ -8065 18469 74893 84661 49694 68188 40026 31254 67867 70730 51234 78492 131761 128047
8287A28047k5568k470J0368O292J7821J8719K4496j9387k90J3226k2613J0375
$$ 128047 102479 100009 110377 116669 134490 153209 177705 158318 158028 171254 148641 159016
8275A59016k7468k8535k1906j5095J5455j9586j844P840J8973L0179P591J8584
$$ 159016 131548 103013 81107 66012 81467 61881 60037 67877 86850 117029 124620 143204
8263A43204j9608J749j0053j8030M3823L362m2010j8289n0703l3009k930J0290
$$ 143204 123596 125345 115292 97262 141085 144447 102437 84148 33445 436 -2494 7796
8251G796J042k5905M1140K1086l1056m8420R190J4138J4575J735j6468l7961K3833
$$ 7796 8838 -17067 24073 45159 14103 -34317 -25127 -10989 3586 5321 -11147 -49108 -25275
8238b5275K4792K1660k2114O602P8364m7356l4627K7793K6637J324L3414j6348
$$ -25275 -483 21177 -937 5665 84029 36673 2046 29839 56476 57800 91214 74866
8226G4866j9698l6629j9839K1416Q8480O5807P803j3978l1630p4829j0067m0760
$$ 74866 55168 18539 -1300 20116 108596 174403 182206 168228 136598 61769 51702 10942
8214A0942j840K1230Q700J3381k7476J3528N482k2840K3269m1660m507j6077l6790
$$ 10942 9102 30332 39032 52413 24937 38465 43947 21107 44376 2716 -1791 -17868 -54658
8201e4658j61J3620K0962j3934J8492n95L8704J1701k902J575j1528k1816r100
$$ -54658 -54819 -41199 -20237 -34171 -15679 -16274 22430 34131 31229 32804 21276 -540 -9640
8188i640m166Q3379P5972o3021q2188k4197O8694j5912j0187J4502L0426m0804
$$ -9640 -13806 69573 145545 82524 336 -23861 44833 28921 18734 33236 63662 22858
8176B2858q964L367J7908M1625l2175r389M6120J4758K8155n138o1322p045m8957
$$ 22858 13894 17261 35169 76794 44619 35230 81350 96108 124263 119125 57803 50758 1801
8163A801L5409N1195K7400P0743N23r2092M4727N7962K988j439J4763R2080Q9889
$$ 1801 37210 88405 115805 186548 187071 94979 139706 197668 200656 199217 213980 306060 395949
8150C95949O3478J44905J65909J16249J16751N0189k9771k8086j752r5557j18391
$$ 395949 459427 604332 770241 886490 1003241 1053430 1023659 995573 993821 898264 779873
8139G79873j01056q8416n9703o9343o0214o0634L4176l7074o7723k8259k8539
$$ 779873 678817 590401 530698 461355 401141 340507 374683 337609 269886 241627 213088
8128B13088m6094L8545N4701J3522m4285j2151J5419n524m0855K806l0709n5609
$$ 213088 166994 205539 260240 273762 229477 217326 232745 227221 186366 189172 158463 102854
8116A02854p454O7160P133k730k4497K8471P2489R1530J35757P5001J33070J50527
$$ 102854 95400 162560 169693 166963 142466 170937 243426 334956 470713 545714 678784 829311
8104H29311J33858N1514O480k3060m8135m6904j26508j81847r0580m1439j7815
$$ 829311 963169 1014683 1021163 998103 949968 903064 776556 594709 504129 462690 444875
8093D44875n6259O689k9529j4538n6390K5165J7122j3209q5116p5743J7616O6033
$$ 444875 388616 395305 365776 351238 294848 320013 337135 323926 238810 163067 180683 246716
8081B46716m5711J602j2768n3797k3016j9186M3476o795q207L5970j5103m774
$$ 246716 201005 202607 189839 136042 113026 93840 137316 130521 122314 158284 143181 138407
8069A38407j8981j2549K305l9934q790k8390K196J2831L1838j8320L222l099R645
$$ 138407 119426 106877 109182 69248 60458 32068 34264 47095 78933 60613 63835 60736 70381
8056G0381k162J3628p955M0430l4786M7074Q137n1553k8978J2222l0243k4247
$$ 70381 68219 81847 73892 114322 79536 126610 134747 83194 54216 66438 36195 11948
8044A1948L4226k2500K0713K8135O587L436k4960J2421K3035J8026N931o6878
$$ 11948 46174 23674 44387 72522 79109 82545 57585 70006 93041 111067 116998 50120
8032E0120K562N8863N869l8385j8158L8002n853n9042l4563q074K7999J6628m27
$$ 50120 52682 111545 117414 79029 60871 98873 93020 33978 -585 -8659 19340 35968 35541
8019C5541L4020J7129p507O15P488J8555l0087r152J1176N7731m510J804J9034
$$ 35541 69561 86690 79183 79798 87286 105841 75754 66602 77778 135509 130999 132803 151837
8006A51837j3507j3496p317m7742j3924L4379K3956l1220K6212M4129j9038J4780
$$ 151837 138330 124834 117517 69775 55851 90230 114186 82966 109178 153307 134269 149049
7994A49049j0826L939J7885K653M485j9111n5363j4597J6683l2328J2879J3951
$$ 149049 138223 142162 160047 162700 167185 148074 92711 78114 94797 62469 75348 89299
7982H9299P1705Q585J1465j8474r781l435K2353L5373J3492j953k6897o1696j4997
$$ 89299 161004 169589 181054 162580 152799 149364 171717 207090 220582 218629 191732 130036 115039
7969A15039k307K8708J6979O130P235J8312K2023p318k6938k8689P119Q2975J1223
$$ 115039 112732 141440 158419 164549 171784 190096 212119 204801 177863 149174 156293 239268 250491
7956B50491r789n0603j262K6632L7537N1271N2163J0111M8195N6810K189O6676
$$ 250491 240702 190099 188837 215469 253006 304277 356440 366551 414746 471556 473745 540421
7944E40421Q8565N4273M6794N1246J02190J85589K98581M48686P37228J111180
$$ 540421 628986 683259 730053 781299 883489 1069078 1367659 1816345 2553573 3664753
7934C664753J475149J382422Q42462M39023K56983j52748p60235j121968j026667
$$ 3664753 5139902 6522324 7364786 7803809 8060792 7908044 7147809 6025841 4999174
7925D999174p08081n38899n74635n00690l56283l25965k28133j29865j38599j45935
$$ 4999174 4291093 3752194 3177559 2676869 2320586 1994621 1766488 1636623 1498024 1352089
7915A352089r5017n3828p0740o0994l1436j2324l1829o7780j7770m6008K3798
$$ 1352089 1257072 1203244 1132504 1071510 1040074 1027750 995921 928141 910371 864363 888161
7904H88161Q6648N2711J3828m5099J6658R3531O2071J23368K55845M19181O33484
$$ 888161 974809 1027520 1041348 996249 1012907 1106438 1168509 1291877 1547722 1966903 2600387
7893B600387Q63032J236594J305642Q92741N38525K54697q7174n82675r79927
$$ 2600387 3463419 4700013 6005655 6898396 7436921 7691618 7604444 7021769 6041842
7884F041842r85236p25021n67500n08262m75535m07009l10438k17678j35663q4839
$$ 6041842 5056606 4331585 3764085 3255823 2780288 2373279 2062841 1845163 1709500 1624661
7874A624661j06675j35484j62625r3716m0933l0623l8307r3273n1786l1983m622
$$ 1624661 1517986 1382502 1219877 1126161 1085228 1054605 1016298 923025 871239 839256 834634
7863H34634o3533l1047m304r0928m9011n0135l8976r871M0214l7144n7333P823
$$ 834634 771101 740054 735750 644822 595811 545676 506700 496829 537043 499899 442566 450389
7851D50389j0769m4098o3400J024K0530j7411j6802j3725J6072J2373m2922n34
$$ 450389 439620 395522 332122 333146 353676 336265 319463 305738 321810 334183 291261 290727
7839B90727l1376l2982l6206L4574m948o6107k4707N1275J2439l2315l2226J96
$$ 290727 259351 226369 190163 224737 219789 153682 128975 180250 192689 160374 128148 128344
7827A28344L0503N7299l4634n5290l161K1746J1367K5792L4250O089m8610l0301
$$ 128344 158847 216146 181512 126222 123061 144807 156174 181966 216216 222305 173695 143394
7815A43394l6787n8846J1634j759J6382J20k6707j9874J5561L4477O7503O6148
$$ 143394 106607 47761 59395 57636 74018 74138 47431 27557 43118 77595 145098 211246
7803B11246j6214r1094n1504L9382O3828L1881l6324P624k6763l2375j9498L672
$$ 211246 195032 103938 52434 91816 155644 187525 151201 158825 132062 99687 80189 83861
7791H3861O0421r010k953L4065j6620M635o4345l9513K7670k4628n5335M1595
$$ 83861 144282 135272 132319 166384 149764 154399 90054 50541 78211 53583 -1752 39843
7779C9843P1097M3951J0535j2739o8843p5401L3870L1753O6905Q061k8041m5202
$$ 39843 110940 154891 165426 152687 83844 8443 42313 74066 140971 149032 120991 75789
7767G5789l4037J1958k265j573L1951m60R605l2156K6905l3170J7354o78K4103
$$ 75789 41752 53710 51445 49872 81823 81363 90968 58812 85717 52547 69901 69223 93326
7754I3326j6577N315m444L678m0010j1933L4695J9549J3287L3416l6085n2922
$$ 93326 76749 82064 77620 81298 41288 29355 64050 83599 96886 130302 94217 41295
7742D1295k3117l223L0428k1382k9387o0123p9275r08L7243M3898K9379K9376
$$ 41295 18178 14955 45383 24001 -5386 -65509 -144784 -145692 -108449 -64551 -35172 -5796
7730e796m7801K5n586m0817P128O5374K1547m7323j6367K3136k3820J1437j103
$$ -5796 -53597 -53572 -59158 -99975 -92847 -27473 -5926 -53249 -69616 -46480 -70300 -58863 -59966
7717e9966L8215M0411j841P982R630j7876l085J9709l9495m3931K2232O4591O589
$$ -59966 -21751 18660 16819 24801 34431 16555 13470 33179 -6316 -50247 -28015 36576 43165
7704D3165j413j8210q4303j0475j2451K6525p945L357K587K094K0394L7699K4114
$$ 43165 41752 23542 -60761 -71236 -83687 -57162 -65107 -61750 -59163 -57069 -36675 1024 25138
7691B5138n450m7008n0049K9231K0246K1007j5890L6384K5899P850j593N8716
$$ 25138 19688 -27320 -77369 -48138 -27892 -6885 -22775 13609 39508 47358 45765 104481
7679A04481M8749o0848p6780n187o038n19j8993K8995j3210k7984L8219J5067
$$ 104481 153230 92382 15602 10415 4377 3858 -15135 13860 650 -27334 10885 25952
7667B5952j3927K4114L5819j8098j5165j0317l4011l3113k7112K9425L0849j809
$$ 25952 12025 36139 71958 53860 38695 28378 -5633 -38746 -65858 -36433 -5584 -7393
7655g393K0467K2488L604J6736j4491m4019J4050j0598J885j2327k8861n6249
$$ -7393 13074 35562 39166 55902 41411 -2608 11442 844 2729 -9598 -38459 -94708
7643i4708J0713P0697L3522J8820o617m2695K0407j043j0759l7210j1769K1250
$$ -94708 -83995 -13298 20224 39044 32427 -10268 10139 9096 -1663 -38873 -50642 -29392
7631b9392R2854M4540o1867m3005m3454K916j1565k8662Q162L7037j7442p263
$$ -29392 63462 108002 46135 3130 -40324 -37408 -48973 -77635 -69473 -32436 -49878 -57141
7619e7141k4482K8232L9435N0459J9734n7623k4247m1997J3530K5942L973L6045
$$ -57141 -81623 -53391 -13956 36503 56237 -1386 -25633 -67630 -54100 -28158 -24185 11860
7607A1860k2012j0810k2728L6929K4268O744l5874k9423n676p925J5229J207j6579
$$ 11860 -10152 -20962 -43690 -6761 17507 24251 -11623 -41046 -46722 -54647 -39418 -38211 -54790
7594e4790O336j9429j8378J7657M7626J079l6963k9960p600N2487L6310R332j184
$$ -54790 -48454 -67883 -86261 -68604 -20978 -19899 -56862 -86822 -94422 -41935 -5625 3707 2523
7581B523m6763o8941K1679J7065l9044J7558L8453Q2923K726p0060k8951j5455
$$ 2523 -44240 -113181 -91502 -74437 -113481 -95923 -57470 25453 28179 -41881 -70832 -86287
7569h6287K0856N3381p394J4078m5490K4419N8479J5635n1918o6620m5057O0410
$$ -86287 -65431 -12050 -19444 -5366 -50856 -26437 32042 47677 -4241 -70861 -115918 -55508
7557e5508O3216J5834J7071l1431m6000l1833O118J8881l6935j8993j3412O8282
$$ -55508 7708 23542 40613 9182 -36818 -68651 -62533 -43652 -80587 -99580 -112992 -44710
7545d4710k6228m9174L6165R585L7752L2454J0579j2552J6429o258K7175K9208
$$ -44710 -70938 -120112 -83947 -74362 -36610 -4156 6423 -6129 10300 4042 31217 60425
7533F0425l6996k0975K1044K5883M5278J7869l5958l6434m5568J4986K1043l0264
$$ 60425 23429 2454 23498 49381 94659 112528 76570 40136 -5432 9554 30597 333
7521C33M235M2366O912m1740o7359K395j1376o471r537k3323K3212J6834N1882
$$ 333 4568 46934 53846 12106 -55253 -52858 -64234 -70705 -80242 -103565 -80353 -63519 -11637
7508a1637O7830K1887j0127m8333n197l6191j5604O3220K5769j2250m1978l8700
$$ -11637 56193 78080 67953 19620 14423 -21768 -37372 25848 51617 39367 -2611 -41311
7496d1311j3800K1631M2183L0839k4808P754J0390j592J0461K590l9818J4132
$$ -41311 -55111 -33480 8703 39542 14734 22488 32878 31286 41747 44337 4519 18651
7484A8651N1702k0045N2519k5564o121l8124m0361p3184n9050l3429K7734N0645
$$ 18651 70353 50308 102827 77263 71142 33018 -7343 -80527 -139577 -173006 -145272 -94627
7472i4627Q2837M4069R607k2602l7910j9261J8026P2132K3409l3168n869m0183
$$ -94627 -11790 32279 41886 19284 -18626 -37887 -19861 52271 75680 42512 36643 -3540
7460c540K1825N2860l1772m5202k5878O1882N4783m4604k3794m743K4996J0196
$$ -3540 18285 71145 39373 -5829 -31707 30175 84958 40354 16560 11817 36813 47009
7448D7009l5550o3696j6580L5226M2592P376R085P893J3999J2448k4565n5328
$$ 47009 11459 -52237 -68817 -33591 9001 16377 25462 33355 47354 59802 35237 -20091
7436b0091j5670R837J4490O3512J9638n9807J0650n0069n1900j8130j3911O9908
$$ -20091 -35761 -25924 -11434 52078 71716 11909 22559 -27510 -79410 -97540 -111451 -41543
7424d1543j5170K573n365p071N117O645l9033l2761L9807N7080N3964L3318j0015
$$ -41543 -56713 -54140 -59505 -66576 -61459 -54814 -93847 -126608 -86801 -29721 24243 57561 47546
7411D7546j3158L3759k8676r757m0325k1784k6543m394j155K9120N3296k3751
$$ 47546 34388 68147 39471 29714 -10611 -32395 -58938 -63332 -64487 -35367 17929 -5822
7399e822J7030l6645k3729J7561j8805l2975M345o557L075o536K0174K3032L3496
$$ -5822 11208 -25437 -49166 -31605 -50410 -83385 -79040 -85597 -82522 -89058 -68884 -45852 -12356
7386a2356j8441k9279m0237N379J3882J7907O3489K3045j3471k7554j3765k9821
$$ -12356 -30797 -60076 -100313 -94934 -81052 -63145 344 23389 9918 -17636 -31401 -61222
7374f1222j6928K2424J00932Q763j5513n4142J5832N5326K2561q1497n1652L2483
$$ -61222 -78150 -55726 45206 53969 38456 -15686 146 55472 78033 -3464 -55116 -22633
7362b2633j2619N144L6723L1431L5458n1692l0191m1922j4847P0968J8673O014
$$ -22633 -35252 -30108 6615 38046 73504 21812 -8379 -50301 -65148 5820 24493 30507
7350C0507O642l5850K0711J6646j4823L1962M1421m1503o0158m8968l2136o54
$$ 30507 37149 1299 22010 38656 23833 55795 97216 55713 -4445 -53413 -85549 -86203
7338h6203j1856K5010M0679M7282k643k3648l2513m1981p708J6343N2928J4281
$$ -86203 -98059 -73049 -32370 14912 12269 -11379 -43892 -85873 -93581 -77238 -24310 -10029
7326a0029M5133J9098K7468m2605o431l5266o5948O021K6042L4686j4437j0401
$$ -10029 35104 54202 81670 39065 32634 -2632 -68580 -62559 -36517 -1831 -16268 -26669
7314b6669j8628K1356J8140j3296K0775k7873J9462m3593j3343N2829K8848n885
$$ -26669 -45297 -23941 -5801 -19097 1678 -26195 -6733 -50326 -63669 -10840 18008 12123
7302A2123m6742l2704k7838j2449K1448J641O166J155N4384L5255M0070j4718
$$ 12123 -34619 -67323 -95161 -107610 -86162 -84521 -78355 -77200 -22816 12439 52509 37791
7290C7791n3800o0504j5676o480l5003J7483j6200N2488M4611n966n5045J1194
$$ 37791 -16009 -76513 -92189 -98669 -133672 -116189 -132389 -79901 -35290 -41256 -96301 -85107
7278h5107l5197M059J02690M1113k2639n8646M1404j0821J8545L8761K5278l3426
$$ -85107 -120304 -116245 -13555 27558 4919 -53727 -12323 -23144 -4599 34162 59440 26014
7266B6014j00854o9016M746N1619P9268r229l063j3139q638K3679J6646l1005
$$ 26014 -74840 -143856 -139110 -87491 -8223 -17452 -20515 -33654 -42292 -18613 -1967 -32972
7254c2972k2746M420m1114q0099L0779K3219N2381O5460p665M497k1922m2578
$$ -32972 -55718 -51298 -92412 -172511 -141732 -118513 -66132 -672 -8337 -3840 -25762 -68340
7242f8340R793k9937k5213K4902K1592j1221K1179L0359J2674k9277k0861j5192
$$ -68340 -58547 -88484 -113697 -88795 -67203 -78424 -57245 -26886 -14212 -43489 -64350 -79542
7230g9542j6731L739k8870L2629K5632M6763K0970l6762n7048K0292K3537j1269
$$ -79542 -96273 -92534 -121404 -88775 -63143 -16380 4590 -32172 -89220 -68928 -45391 -56660
7218e6660J6243L8694j9390J2409j6668J1255n939k2516K9166L24K0635k4665
$$ -56660 -40417 -1723 -21113 -8704 -25372 -14117 -20056 -42572 -13406 -13082 7553 -17112
7206a7112o0861n4625O986L9553M7540N6708K9915l4931o472p028k4535J2250
$$ -17112 -77973 -132598 -125612 -86059 -38519 18189 48104 13173 6701 -327 -24862 -12612
7194a2612K4361j6866m4044l434K8759o656k7880M2713L814O180l9300k0986K3556
$$ -12612 11749 -5117 -49161 -52595 -23836 -30492 -58372 -15659 -11845 -5665 -44965 -65951 -42395
7181d2395Q524L015K5521J5675n275K0540j0163k6694o0015q091n40k272k1966
$$ -42395 -33871 -30856 -5335 10340 5065 25605 15442 -11252 -71267 -79358 -79898 -82170 -104136
7168a04136N2587L8601j7360O106J2872Q856k8459Q724K3710J6435j3623q4189
$$ -104136 -51549 -12948 -30308 -24202 -11330 -2474 -30933 -22209 1501 17936 4313 -79876
7156g9876J0000o953j3859L9182N3231M2409l7124k4510r623M9183J2834n0208
$$ -79876 -69876 -76829 -90688 -51506 1725 44134 7010 -17500 -27123 22060 34894 -15314
7144a5314k2272O636j2380J7312J0579j6656k2678j5553K0968J7348K0831m1272
$$ -15314 -37586 -30950 -43330 -26018 -15439 -32095 -54773 -70326 -49358 -32010 -11179 -52451
7132e2451J4630J9307k290J2625j9917k0361l3804L7966P214N1714J5065m6113
$$ -52451 -37821 -18514 -20804 -8179 -28096 -48457 -82261 -44295 -37081 14633 29698 -16415
7120a6415l9610k5392K2746l182L1066K1949n484N767m8286n7717n9802O1701
$$ -16415 -56025 -81417 -58671 -61853 -30787 -8838 -14322 -8555 -56841 -114558 -174360 -112659
7108a12659O7079P61J3781m3873O935l713M7861L6906R639m4122o5920K7778j407
$$ -112659 -45580 -44819 -31038 -74911 -67976 -71689 -23828 13078 22717 -21405 -87325 -59547 -60954
7095f0954p020m81M8913k4579R969K0528P0343n5136j0940q008k4176J1898K4764
$$ -60954 -67974 -68455 -19542 -44121 -34152 -13624 56719 1583 -9357 -17365 -41541 -29643 -4879
7082d879j3641n9514l6799L9843O3269k5067J3025K8814o1889L671P0588J4473
$$ -4879 -18520 -78034 -114833 -74990 -11721 -36788 -23763 5051 -56838 -53167 17421 31894
7070C1894m3951k0959L1735M6300l1695J3561k6804L2858j8540m3236o0322K8713
$$ 31894 -12057 -33016 -1281 45019 13324 26885 81 32939 14399 -28837 -89159 -60446
7058f0446N6243P788K0504l1392k2730l6720Q798k0300N5469M9275J7613m7285
$$ -60446 -4203 3585 24089 -7303 -30033 -66753 -57955 -78255 -22786 26489 44102 -3183
7046c183k8751L087j8100j0487j6743j7358n585k5796J8327M8324P650K3200M601
$$ -3183 -31934 -28847 -46947 -57434 -74177 -91535 -97120 -122916 -104589 -56265 -48615 -25415 -20814
7033b0814o0976k7870K4975L7979P9409j7727l2224J6954k9816n0812j2391j6287
$$ -20814 -81790 -109660 -84685 -46706 32703 14976 -17248 -294 -30110 -80922 -93313 -109600
7021a09600j1675M8260M8388m186M3606O354k3189K0319J3613J309K789p9669
$$ -109600 -121275 -73015 -24627 -28813 14793 21147 -2042 18277 31890 33199 35988 -43681
7009d3681o9231k6312K3603N267P681n779J5526n057l4932r569n2124J3588N9079
$$ -43681 -112912 -139224 -115621 -110354 -102673 -108452 -92926 -97983 -132915 -142484 -194608 -181020 -121941
6996a21941J4598L2627M1504J1479K0245k828l0170K186n109J196k6566J3600
$$ -121941 -107343 -74716 -33212 -21733 -1488 -4316 -34486 -32300 -37409 -36213 -62779 -49179
6984d9179r519M2662l0751k7873N1441k2993j5663k6859K4522m2480K61O6195
$$ -49179 -58698 -16036 -46787 -74660 -23219 -46212 -61875 -88734 -64212 -106692 -106431 -40236
6972d0236J3768m5687j4998K7089Q1437K2690k2035J564l4539l1423J1203K0930
$$ -40236 -26468 -72155 -87153 -60064 21373 44063 22028 23592 -10947 -42370 -31167 -10237
6960a0237j4754m7865j3332L7946L6127L6971r186m4030m5898R047q332j342K7111
$$ -10237 -24991 -72856 -86188 -48242 -12115 24856 15670 -28360 -74258 -65211 -73543 -74885 -47774
6947d7774L9609n405m9264J6722L3616L033l1935J5454p916L4230L7626j6945
$$ -47774 -8165 -13570 -62834 -46112 -12496 -9463 -41398 -25944 -33860 370 37996 21051
6935B1051L5673K930p0059R667O101l2760n4061J795J3855l1189q8347J5523K2102
$$ 21051 56724 59654 -10405 -738 5363 -27397 -81458 -79663 -65808 -96997 -185344 -169821 -147719
6922a47719N2166N4446L9135m936K9430N669k3039J2916M4524m0267n3795O631
$$ -147719 -95553 -41107 -1972 -6908 22522 28191 5152 18068 62592 22325 -31470 -24839
$$ [...]
##END NTUPLES=NMR SPECTRUM
##END=
