##TITLE=Analysis number 321674
Compound Code cc 50409
Book Reference 461/62
Project Code adrs
Chemist Name toml
##JCAMPDX= 6.0         $$ Bruker NMR JCAMP-DX V2.0
##DATA TYPE= NMR SPECTRUM
##DATA CLASS= NTUPLES
##ORIGIN= Bruker BioSpin GmbH
##OWNER= nmr
$$ XWIN-NMR		Version 3.5
$$ Tue Aug 22 10:03:32 2006 GMT Daylight Time (UT+1h)  MAYBRIDGE\nmr@NMR_250MHZ
##.OBSERVE FREQUENCY= 250.131544655141
##.OBSERVE NUCLEUS= ^1H
##.ACQUISITION MODE= SIMULTANEOUS (DQD)
##.ACQUISITION SCHEME= undefined
##.AVERAGES= 16
##.DIGITISER RES= 18
##SPECTROMETER/DATA SYSTEM= dpx250
##.PULSE SEQUENCE= zg30
##.SOLVENT NAME= CDCl3
##.SHIFT REFERENCE= (INTERNAL, CDCl3, 0, 16.4625)
##AUDIT TRAIL= $$ (NUMBER, WHEN, WHO, WHERE, WHAT)
$$ ##TITLE= Audit trail, XWIN-NMR		Version 3.5
$$ ##JCAMPDX= 5.01
$$ ##ORIGIN= Bruker BioSpin GmbH
$$ ##OWNER= nmr
$$ C:\u/data/dgb/nmr/ADRS/1320/pdata/1/auditp.txt
$$ ##AUDIT TRAIL=  $$ (NUMBER, WHEN, WHO, WHERE, WHAT)
(   1,<2006-08-22 10:03:10.96 +100>,<MAYBRIDGE\nmr>,<NMR_250MHZ>,
      <created by zg, POWCHK disabled, PULCHK disabled
       configuration hash MD5:
       E2 DF 36 D8 04 B2 41 60 5A D7 A3 38 5A 4B D0 FE
       data hash MD5: 64K
       6F B2 D8 D7 65 53 E0 69 2A EC 21 CC 83 4B 27 B9>)
(   2,<2006-08-22 10:03:23.02 +100>,<MAYBRIDGE\nmr>,<NMR_250MHZ>,
      <Start of raw data processing
       ef LB = 0.3 FT_mod = 6 PKNL = 1 SI = 32K 
       data hash MD5: 32K
       7B 68 43 00 91 6E 16 69 04 96 5E A3 4F FA C4 7C>)
(   3,<2006-08-22 10:03:24.77 +100>,<MAYBRIDGE\nmr>,<NMR_250MHZ>,
      <apk 
       data hash MD5: 32K
       3A 0E E2 43 CA 84 A7 FB E7 FD 30 96 32 36 4C 15>)
(   4,<2006-08-22 10:03:25.52 +100>,<MAYBRIDGE\nmr>,<NMR_250MHZ>,
      <abs ABSG = 5 
       data hash MD5: 32K
       B4 00 04 F0 C2 0E 33 EC 54 D7 8B AC 4A 57 AF 3C>)
$$ ##END=
$$ 
$$ hash MD5
$$ 2D 80 65 0C DF 99 A2 38 2C AC 5D 91 65 25 6D C8
##$RELAX= 
##$RELAX= 
##$RELAX= 
##$RELAX= 
##$RELAX= 
##$RELAX= 
##$RELAX= 
$$ Bruker specific parameters
$$ --------------------------
##$DU= <C:\u>
##$EXPNO= 1320
##$NAME= <ADRS>
##$PROCNO= 1
##$TYPE= <nmr>
##$USER= <dgb>
##$AMP= (0..31)
100 100 100 100 100 100 100 100 100 100 100 100 100 100 100 100 100 100 
100 100 100 100 100 100 100 100 100 100 100 100 100 100 
##$AQSEQ= 0
##$AQ_mod= 3
##$AUNM= <au_zg>
##$AUTOPOS= <8 >
##$BF1= 250.13
##$BF2= 250.13
##$BF3= 250.13
##$BF4= 250.13
##$BF5= 500.13
##$BF6= 500.13
##$BF7= 500.13
##$BF8= 500.13
##$BYTORDA= 1
##$CFDGTYP= 0
##$CFRGTYP= 5
##$CHEMSTR= <none>
##$CNST= (0..31)
1 1 145 1 1 1 1 1 1 1 1 1 1 1 1 1 1 1 1 1 1 1 1 1 1 1 1 1 1 1 1 1 
##$CPDPRG= <>
##$CPDPRG1= <>
##$CPDPRG2= <>
##$CPDPRG3= <>
##$CPDPRG4= <mlev>
##$CPDPRG5= <mlev>
##$CPDPRG6= <mlev>
##$CPDPRG7= <mlev>
##$CPDPRG8= <mlev>
##$CPDPRGB= <>
##$CPDPRGT= <>
##$D= (0..31)
0 1 0 0 0 0 0 0 0 0.06 0 0 0 0 0 0 0.0002 0 0 0 0 0 0 0 0 0 0 0 0 0 0 
0 
##$DATE= 1156237389
##$DBL= (0..7)
120 120 120 120 120 120 120 120 
##$DBP= (0..7)
150 150 150 150 150 150 150 150 
##$DBP07= 0
##$DBPNAM0= <>
##$DBPNAM1= <>
$$ [...]
##$SUBNAM7= <"">
##$SUBNAM8= <"">
##$SUBNAM9= <"">
##$SW= 20.6930455092707
##$SWIBOX= (0..15)
0 0 3 0 0 0 0 0 0 0 0 0 0 0 0 0 
##$SW_h= 5175.983436853
##$TD= 65536
##$TD0= 1
##$TE= 295.16
##$TE2= 300
##$TE3= 300
##$TEG= 300
##$TL= (0..7)
0 120 120 120 120 120 120 120 
##$TP= (0..7)
150 150 150 150 150 150 150 150 
##$TP07= 0
##$TPNAME0= <>
##$TPNAME1= <>
##$TPNAME2= <>
##$TPNAME3= <>
##$TPNAME4= <>
##$TPNAME5= <>
##$TPNAME6= <>
##$TPNAME7= <>
##$TPOAL= (0..7)
0.5 0.5 0.5 0.5 0.5 0.5 0.5 0.5 
##$TPOFFS= (0..7)
0 0 0 0 0 0 0 0 
##$TUNHIN= 0
##$TUNHOUT= 0
##$TUNXOUT= 0
##$USERA1= <user>
##$USERA2= <user>
##$USERA3= <user>
##$USERA4= <user>
##$USERA5= <user>
##$V9= 5
##$VALIST= <valist>
##$VCLIST= <CCCCCCCCCCCCCCC>
##$VD= 0
##$VDLIST= <DDDDDDDDDDDDDDD>
##$VPLIST= <PPPPPPPPPPPPPPP>
##$VTLIST= <TTTTTTTTTTTTTTT>
##$WBST= 1024
##$WBSW= 4
##$XGAIN= (0..3)
0 0 0 0 
##$XL= 0
##$YL= 0
##$YMAX_a= 543015
##$YMIN_a= -732047
##$ZGOPTNS= <>
##$ZL1= 120
##$ZL2= 120
##$ZL3= 120
##$ZL4= 120
##$ABSF1= 16.4625
##$ABSF2= -4.230673
##$ABSG= 5
##$ABSL= 3
##$ALPHA= 0
##$AQORDER= 0
##$ASSFAC= 0
##$ASSFACI= 0
##$ASSFACX= 0
##$ASSWID= 0
##$AUNMP= <proc_1d>
##$AZFE= 0.1
##$AZFW= 0.1
##$BCFW= 0
##$BC_mod= 0
##$BYTORDP= 0
##$COROFFS= 0
##$CY= 12.5
##$DATMOD= 1
##$DC= 0
##$DFILT= <>
##$DTYPP= 0
##$F1P= 14.0000005364418
##$F2P= -0.99999901652339
##$FCOR= 0.5
##$FTSIZE= 32768
##$FT_mod= 6
##$GAMMA= 0
##$GB= 0
##$INTBC= 1
##$INTSCL= 1
##$ISEN= 128
##$LB= 0.3
##$LEV0= 0
##$LPBIN= 0
##$MAXI= 10000
##$MC2= 0
##$MEAN= 0
##$ME_mod= 0
##$MI= 0
##$NCOEF= 0
##$NC_proc= -4
##$NLEV= 6
##$NOISF1= 0
##$NOISF2= 0
##$NSP= 0
##$NTH_PI= 0
##$NZP= 0
##$OFFSET= 16.4625
##$PC= 1
##$PHC0= 148.4478
##$PHC1= 8.117957
##$PH_mod= 1
##$PKNL= yes
##$PPARMOD= 0
##$PSCAL= 4
##$PSIGN= 0
##$REVERSE= no
##$SF= 250.130014881766
##$SI= 32768
##$SIGF1= 0
##$SIGF2= 0
##$SINO= 400
##$SIOLD= 32768
##$SREGLST= <1H.CDCl3>
##$SSB= 0
##$STSI= 32768
##$STSR= 0
##$SW_p= 5175.98343685301
##$SYMM= 0
##$S_DEV= 0
##$TDeff= 65536
##$TDoff= 0
##$TI= <Analysis number 999999
Compound Code 99
Book Reference 9
Project Code 9>
##$TILT= no
##$TM1= 0
##$TM2= 0
##$TOPLEV= 0
##$USERP1= <user>
##$USERP2= <user>
##$USERP3= <user>
##$USERP4= <user>
##$USERP5= <user>
##$WDW= 1
##$XDIM= 32768
##$YMAX_p= 315690286
##$YMIN_p= -118894
$$ End of Bruker specific parameters
$$ ---------------------------------
##NTUPLES= NMR SPECTRUM
##VAR_NAME=  FREQUENCY,     SPECTRUM/REAL,   SPECTRUM/IMAG
##SYMBOL=    X,             R,               I
##VAR_TYPE=  INDEPENDENT,   DEPENDENT,       DEPENDENT
##VAR_FORM=  AFFN,          ASDF,            ASDF
##VAR_DIM=   32768,         32768,           32768
##UNITS=     HZ,            ARBITRARY UNITS, ARBITRARY UNITS
##FACTOR=    0.157963299565203, 1,           1
##FIRST=     4117.76527457404, 0,            0
##LAST=      -1058.21816227897, 0,           0
##MIN=       -1058.21816227897, -118894,     0
##MAX=       4117.76527457404, 315690286,    0
$$ Real data points
##PAGE= N=1
##DATA TABLE= (X++(R..R)), XYDATA
$$ [...]
19289 38063407 50842265 64873905 77234963 86186938 91747665 95385009 98180102 98676340
19281 98676340 94999043 86643973 75363899 64244444 55040831 47780246 41824592 36824398
19273 36824398 32666035 29346011 26738074 24682102 23045691 21783323 20888517 20360069
19265 20360069 20152978 20273767 20765979 21691643 23177902 25467352 28986207 34381769 42512808
19256 42512808 53901439 67648633 80943731 91150127 97743361 101768165 104882795
19249 104882795 106493216 104402523 97366209 86147448 73834133 63010597 54261133
19242 54261133 47139788 41130093 35994938 31716404 28251864 25419076 23116749 21230153
19234 21230153 19661241 18330423 17210022 16223323 15373915 14649828 14016252 13429318 12865062
19225 12865062 12294150 11741796 11216640 10753122 10339672 9903520 9519508 9189463 8910741
19216 8910741 8649096 8378528 8127798 7880017 7648670 7409479 7140936 6831242 6505008
19207 6505008 6203848 5927639 5694409 5479197 5254375 5044904 4808123 4612059 4458868
19198 4458868 4318909 4186860 4056757 3910626 3790381 3663331 3512524 3388062 3304034 3223953
19188 3223953 3131626 3026328 2927844 2859904 2833361 2778413 2700498 2610382 2561536 2507742 2449676
19177 2449676 2404845 2338628 2276324 2214816 2141887 2047515 1950767 1882646 1830027 1758292 1694601
19166 1694601 1646740 1591614 1551750 1462549 1382532 1297199 1216014 1147682 1078199 1020605 972439
19155 972439 950160 949928 921975 912372 860622 852518 856175 866940 858870 831618 804000 778089 755420
19142 755420 736237 704695 703446 699242 667716 599789 552144 512587 490479 465706 413229 379334
19130 379334 347575 297218 265200 263255 245031 210379 217319 220150 225625 219080 212546 216203 204341
19117 204341 208252 243076 244185 253607 264132 284426 250085 228236 225299 238010 252394 237131
19105 237131 247522 255387 229433 226623 233332 225094 196817 136635 71943 65556 47515 19189
19093 19189 -40967 -60071 -29615 -1447 5161 10665 -10664 -6568 26862 54026 73937 70476
19081 70476 79567 82998 82953 80481 117832 144043 149958 154179 186309 177214 183582 163806 155345 135043
19067 135043 104739 65660 47656 30768 -20617 -53093 -80103 -82862 -118894 -113421 -92169 -63057
19055 -63057 -49660 -55347 -66942 -66407 -59390 -44435 -16779 -16092 -18094 -11027 28890 37199 25192
19042 25192 37382 37727 20777 10541 21947 37218 2414 -8278 6543 -11286 -1329 -607 7106
19029 7106 3009 14646 16126 6922 26581 11506 -23956 -18979 -13219 22547 32088 17897 15654
19016 15654 20560 40789 21020 5805 27144 38204 29730 23674 17164 22789 17086 20418 13223
19003 13223 10391 16732 33382 34786 -8149 -33173 -32500 -43379 -38039 -17581 21649 37841 30361
18990 30361 13272 -8144 -837 18446 7657 122 -8640 -3189 -2473 -16493 -14577 1856 2062
18977 2062 -15367 -38841 -28653 -2847 21424 212 -32742 -28031 -21768 -17562 -29516 -37042 -44617
18964 -44617 -21372 2956 4403 -14520 -19048 -12161 -5082 2841 3224 -5510 20315 10902 -14593
18951 -14593 -21504 -27926 -10846 1524 -5455 -27952 -25989 -24589 2591 6040 -14660 -24731 -53717
18938 -53717 -57515 -28472 -31032 -24199 -12229 1459 1259 3179 -19396 -29463 -22601 -27183 -25427
18925 -25427 -22053 -31071 -21661 -2984 -2223 -2419 24732 47439 51483 32493 30603 1932 -24381
18912 -24381 -5144 -16710 -13591 -23008 -29705 -50867 -69042 -62853 -35750 -17364 -24590 -6446 -20621
18899 -20621 -5120 31522 -3232 -22985 -27298 -7353 -7997 -18521 -40758 -37239 -52390 -34466
18887 -34466 -23339 -16296 -20251 -18235 -38899 -40490 -34328 -23142 -19535 -11509 -35139 -22669 7350
18874 7350 1005 -4412 27926 45777 29141 2564 -7947 -7411 -6712 -19797 -23391 -51387 -36539
18861 -36539 -27247 -21872 -15669 -53611 -70841 -56205 -44353 -43743 -48251 -30974 -13068 -12665 -26576
18848 -26576 -50520 -26183 -22034 -27481 -44410 -63478 -31059 -41571 -34827 -26681 -36476 -48973 -23700
18835 -23700 -25683 -12992 -15471 -13281 -30328 -31701 -19359 -21948 -20415 -27441 -44322 -19033 -14627
18822 -14627 -40852 -56941 -58810 -53834 -59270 -57377 -40620 -28972 -23564 5687 -1644 5016 14571
18809 14571 -18942 -45431 -13779 933 -4290 -3752 1425 20221 40442 18513 -23193 -32287 -69509
18796 -69509 -39156 -12499 -26971 -30044 -48357 -41804 -55803 -54353 -31679 -20393 -17687 -37970
18784 -37970 -26277 14665 12422 -3519 12758 21994 9838 -15875 -23144 -475 -16519 -968
18772 -968 18162 5789 -1357 11914 38638 82327 135598 188878 210199 179226 123509 88306
18760 88306 91937 87435 70493 61026 36975 50437 69790 62492 39606 -1763 14667 43796
18748 43796 51647 43188 13251 17008 37062 52736 55047 57028 62524 98674 133946 161017 166914
18735 166914 185059 256461 324746 351715 404289 465589 487546 483178 453496 435585 386177 343186
18723 343186 304618 266242 248387 193721 153602 113354 75106 82417 106288 95133 59774 40330
18711 40330 62175 76822 82526 93932 104745 130729 185278 195240 202152 224748 269314 342715
18699 342715 418689 443709 501399 547301 561205 545978 567298 555759 510161 450359 387240
18688 387240 330238 279122 231119 185693 167550 174047 138829 91614 81328 82794 75933 63680
18676 63680 75345 98093 96553 75801 37169 30448 33990 29729 36033 18472 14316 14101 -259
18663 -259 26655 36851 26234 13252 9649 -12306 -27614 -19604 -38344 -53723 -70686 -53714
18651 -53714 -37702 -29441 -35670 -24145 -17891 -22838 -19315 -18580 -20704 -7839 6635 9604 24878
18638 24878 21139 -12281 -52731 -69986 -56629 -44718 -16841 -13680 -16866 -29576 -26418 -13271
18626 -13271 -19081 -33319 -37534 -37790 -22958 8661 605 -13267 -4621 -17834 -24926 -38793 -38234
18613 -38234 -41932 -44860 -38625 -39011 -62003 -84900 -82960 -85533 -73468 -63232 -42580 -25584 -36728
18600 -36728 -52722 -37814 -34520 -59060 -47625 -41881 -90579 -93912 -39056 -7596 -9941 -21862
18588 -21862 5435 -15046 -41602 -46977 -26737 -32112 -4942 14593 -7464 -23593 2014 6747
18576 6747 -2252 293 29604 28651 29130 23627 20308 17289 8654 11583 -7876 -22483 -13400 -2403
18562 -2403 15253 11710 -7093 -7230 5428 19789 33391 14870 -4484 -16844 -45314 -55184 -49144
18549 -49144 -46378 -46438 -46965 -6648 -3334 10201 16003 5097 -17963 -17432 -10969 -35838 -52430 -27962
18535 -27962 -34606 -47866 -51076 -44806 -22780 -30215 -31942 -34707 -50040 -41807 -5737 4302 1853
18522 1853 -8529 5259 -11263 -31077 -31096 -43189 -38667 -14437 -4288 -12013 -17170 -23651 -15321
18509 -15321 -23366 -35471 -48029 -30004 -31512 -32131 -32764 -37589 -40745 -59212 -57759 -33545 -37016 -24550
18495 -24550 5553 3847 13687 -7302 -60996 -83310 -84674 -91210 -98988 -65618 -30377 -6620 -20381
18482 -20381 -17366 57 8894 -14451 -12822 -19717 -11314 -29301 -45774 -58226 -51764 -37550 -46922
18469 -46922 -43503 -6711 -11780 -21861 -27908 -12154 2378 -39864 -60817 -41067 -15298 -3948
18457 -3948 5339 -15849 -38756 -55780 -48512 -22133 -36272 -30924 -43017 -56557 -34680 4695
18445 4695 -635 -21027 -36340 -35443 -31084 -12432 -13510 -21968 -14567 -1564 9037 -14928 -33138
18432 -33138 -28377 -20616 -12826 -5547 -4080 -32051 -34383 -49150 -62090 -63812 -53839 -27416 -15169
18419 -15169 -40733 -53354 -30569 -11412 -15842 -14784 8988 23896 -15439 -46427 -50252 -33422
18407 -33422 -8730 5161 -8415 -35588 -50911 -55526 -61235 -31909 -26989 -43457 -72821 -76055
18395 -76055 -49998 -18928 -10288 -12576 16643 -11943 -25989 -31385 -42988 -54423 -29246 -52539
18383 -52539 -49946 -59726 -52792 -33096 -46349 -67706 -64865 -61342 -45927 -55298 -38969 -29848 -20128
18370 -20128 -8388 6487 6333 2567 -33467 -65079 -55258 -54203 -16304 15930 24491 26669 3145
18357 3145 -23234 -3018 11262 23303 22177 30043 40408 22599 407 6302 1767 11804 33775
18344 33775 36492 18217 3619 32733 16565 1347 -1009 25383 11874 -10283 5716 9752
18332 9752 12299 3247 4445 9066 -257 -7293 -8578 -12896 -15763 -18430 7240 10076 -2959 -26086
18318 -26086 -27745 -7122 14080 16654 36842 21929 -64 17323 -4249 -18222 -8007 1770
18306 1770 -12700 8389 10550 19900 11254 14614 -6101 -18579 3943 58214 54322 25622 4565
18293 4565 3524 16763 -12982 -34540 -16834 66 -7674 -36525 -33483 -617 19244 32937
18281 32937 33241 16489 -22755 -30249 -34789 -48030 -43058 -43534 -44995 -58263 -59151 -20375 -10111 -17194
18267 -17194 -2379 -2611 -17228 -17492 -5358 13256 27452 45093 12943 -8548 -28465 -34679 -43731
18254 -43731 -51495 -29543 -12681 -12772 -15461 4087 -6515 -13122 2080 757 8712 1775 10243 21728
18240 21728 32636 27765 43286 63785 79794 79917 93644 109863 130185 144223 156327 151387
18228 151387 158081 146545 124158 120885 123568 147210 165825 150260 111410 92309 80529 65795
18216 65795 86027 106861 111179 118716 111591 131152 174567 194516 198698 175483 168633 163765 162787
18203 162787 159899 196111 241709 260262 235643 205935 193439 184552 195509 203076 164051 126098
18191 126098 117377 101845 102182 81471 56230 65928 86493 68516 48266 41793 45399 50337 42041
18178 42041 23098 37390 42271 83360 100837 89637 63792 74626 72721 20359 25647 35617
18166 35617 14133 17232 29139 70987 75959 66371 60262 54726 49594 53924 41087 73218 99361
18153 99361 141402 134315 112087 110435 89869 85546 103983 110016 121524 124134 135580 118873 117605
18140 117605 129267 145212 177479 172067 173810 182727 174804 170379 172651 171348 223738 278145 297608
18127 297608 314522 350582 395678 439333 493914 535844 603567 661003 758279 875935 987009
18116 987009 1184889 1437924 1791034 2220345 2776390 3618504 4979828 7299625 11522264
18107 11522264 18439352 25245898 27927237 27639064 22723312 17233466 13774357 11766110
18099 11766110 10189848 8563113 7139494 6029929 5174802 4553232 3999316 3523638 3144443
18090 3144443 2850991 2605833 2390230 2259727 2143670 2024180 1915722 1787413 1691029 1606680
18080 1606680 1532473 1464676 1405365 1317815 1236145 1188157 1115459 1055771 1007069 951240 919724
18069 919724 888962 881082 856438 824641 793046 779063 728104 699178 666498 625284 608004 622517
18057 622517 621737 582090 531102 526139 520801 481618 444574 409446 404535 418997 419234 412120 400695
18044 400695 400055 415240 396007 370284 338635 315389 307954 314796 296246 301763 311225 319587 302954
18031 302954 280268 269600 261288 261808 283773 289499 261871 243537 242656 238404 242345 239118 234185
18018 234185 213030 198414 212401 188835 160109 150034 158665 149254 152423 145121 159659 166521
18006 166521 166772 161080 121485 134499 157255 142941 115167 95859 86681 106376 100973 109772 86193
17993 86193 64047 65548 76658 55374 54110 42545 27699 30896 39398 51127 46696 24073 16434
17980 16434 -30281 -36861 -15123 -3588 -5969 2065 20756 19822 4892 1770 -728 15236 28611
17967 28611 25950 45500 70822 49691 48833 14155 -2595 53462 51535 39161 25180 22842 6794
17954 6794 1020 19754 28602 5554 3307 6827 23198 2399 4732 31427 33277 18537 37724
17941 37724 64933 72562 62180 39006 20032 9567 24502 34957 37611 27633 2882 6546
17929 6546 -10911 -23969 -13339 24516 75010 90142 81594 45411 34987 25518 -2363 -18629
17917 -18629 -14264 -17511 -56029 -43075 -14352 -12800 59 -11084 6801 17989 -17483 -44258
17905 -44258 -24948 15842 21685 -7005 -31226 -7561 -10017 -15407 -22183 -17234 -16233 -21105 -37912
17892 -37912 -43671 -33116 -34001 -22519 473 1331 37395 65384 60331 29720 43251 31492 29533
17879 29533 31061 32102 19616 15894 7451 -21341 -11692 -782 7104 25718 4733 -7467 -21326
17866 -21326 -8662 23037 15221 -8033 -43335 -44178 -42529 -16806 -30544 -31203 -30845 -25462 -6946
17853 -6946 12896 -22092 -15135 -8100 -34663 -12896 -10580 -6670 4246 -14030 -15627 8980 21472
17840 21472 -8084 -3544 12845 6205 -13304 -14494 -15084 20472 37418 51607 50412 21691 12854
17827 12854 13492 34052 10592 -15676 -25859 -24392 3688 29547 21061 22463 32808 9210 8194
17814 8194 -23212 -51286 -72403 -49312 -42112 -7733 5952 -837 147 -8546 -15990 -20035 -22306
17801 -22306 -27414 -25442 -7559 -14721 -36070 -32195 -8474 8878 273 -10689 -7135 -20778 -27843
17788 -27843 -35053 -49233 -44605 -33078 -51548 -76785 -63638 -50292 -40441 -33139 -33288 -33076 -47646
17775 -47646 -31039 -10262 -4342 13560 20617 -5691 -21614 -83 6326 717 11632 4903 4488
17762 4488 -3097 19631 45008 21349 -36735 -53816 -25245 -4095 9577 23777 2827 -19449
17750 -19449 -67651 -104704 -114559 -57036 -26075 -34896 -43947 -66436 -40735 -17407 -6337 20472
17738 20472 24757 10060 -14173 -23990 -17225 -21212 -21121 -4164 -7380 -22479 -42137 -42079 -24212 -20172
17724 -20172 3887 25378 -13463 -46704 -50131 -1068 30660 47160 35123 40241 46911 -1114
17712 -1114 -39319 -69987 -77880 -65019 -60788 -55447 -39493 -40640 -37091 2953 4090 -19792 -12349
17699 -12349 -6564 -36152 -54563 -67274 -67635 -45572 -55182 -27518 -32915 -29773 -30240 -38322 -41033 -41687
17685 -41687 -36238 -39498 -41448 -52213 -47997 -28351 -7017 -20694 -11965 -8372 -21381 -39248 -50520
17672 -50520 -42368 -43831 -30004 -15318 -4567 -23059 -34323 -54373 -69709 -36334 -3830 5456
17660 5456 -12084 -27961 -21548 -12914 526 -7432 -34300 -43076 -8353 7494 -25231 -3623 -2893
17647 -2893 -7369 -13111 -31381 -56241 -49558 -28036 -40722 -68320 -46192 -23606 -30524 -27532 -21017
17634 -21017 -9432 -6604 -5712 2461 3106 12549 19819 32643 27640 2322 15640 6205 -37537 -37167
17620 -37167 -27305 -11991 3068 3959 -24051 -38910 -13923 -5431 -15481 -40147 -26152 -18434 -29656
17607 -29656 -24076 4608 4337 23447 -9682 -3165 -6188 -14526 -23496 -25961 -7999 -5416 1009 -9386
17593 -9386 -27175 -12875 -23475 -48872 -40687 -14660 -3299 13132 12135 3730 4722 16134 -1881
17580 -1881 -8203 5450 -11521 -20519 -17883 -30105 -15807 -21310 -11641 -7015 -14873 -9332 97 791
17566 791 794 3391 -621 -11923 -22811 -28731 -36892 -27303 -23651 -46814 -45629 -40527 -53442 -31192
17552 -31192 -8726 11820 28714 41062 59754 51681 22534 14595 -31091 -68804 -69686 -48006
17540 -48006 -38439 -45275 -62801 -51211 -38816 -26776 -6333 15995 25979 -2587 -13382 -2101
17528 -2101 25503 19177 -15856 -39891 -27597 -43034 -28244 -7186 6161 27938 32584 -11622
17516 -11622 -42775 -46808 -50853 -44535 -34594 -18009 -1191 -16211 -29824 1394 25314 32920 34381
17503 34381 13687 1185 5375 12188 8210 -7314 -1928 23366 42808 23748 18975 15451 39045
17490 39045 40778 28502 -6928 -2439 12976 7818 19238 20810 35027 49240 47861 24806 22418
17477 22418 17975 -4259 436 44233 61512 53268 33785 46522 87072 120163 110298 76160
17465 76160 24089 11842 22284 57214 97233 87655 71339 56007 55133 78037 67222 66327 61573
17452 61573 58572 47931 68888 54812 34714 26493 21949 47101 62545 61909 72186 127176 130061
17439 130061 123635 145321 161923 106655 73024 58797 67745 66379 75679 76063 47829 38102 36566
17426 36566 45715 48320 66940 52001 28875 43640 25972 29196 51338 47800 54058 85732 103645
17413 103645 104769 105729 81277 51124 17514 1382 573 -5200 2991 40199 82447 93003 73159
17400 73159 57942 29271 18592 23382 63092 45776 10623 14268 12115 -25576 -32820 -21235
17388 -21235 -34703 -28912 -13190 -3990 6915 -4001 -335 76 -18165 1251 -3543 -18680 -22518
17375 -22518 -24257 -10316 33953 53966 46030 47116 20296 26913 39212 22996 15932 3619 27576
17362 27576 53298 55391 53545 52929 83906 81600 55632 67546 52904 36222 38843 24439 24147
17349 24147 39978 51067 39564 52908 61677 55075 40234 19497 -1192 2738 28112 31143
17337 31143 42428 36731 27559 59725 52122 20595 46245 123728 135189 108210 76088 87613
17325 87613 124180 137555 139373 148160 216526 289983 314604 310835 324536 355628 355148 367011 396291
17312 396291 396937 392545 402870 406378 401607 383636 362844 323711 324400 310118 258564 212757 187396
17299 187396 169563 157327 189710 177381 164369 176169 180532 189575 210527 226759 257931 261345
17287 261345 271036 320200 359885 339472 318550 351752 381248 432750 439518 435482 441172 428221
17275 428221 423850 402991 390652 403955 381550 334582 288936 232935 209870 204178 200643 181637
17263 181637 164340 162395 164827 131447 102546 116821 109181 70565 46705 51537 88333 95285
17251 95285 75487 64699 49856 39922 68318 70993 60149 64255 53847 34701 7690 2123
17239 2123 31150 52351 45790 48417 57971 29287 26077 61048 109107 113518 132786 152086 147273
17226 147273 139336 109649 89956 77464 65763 68245 89901 75199 74007 76486 60185 56431
17214 56431 84068 74156 56315 68578 95195 80056 50109 66317 96224 117827 104414 132562
17202 132562 148034 129797 113550 96979 101286 131056 152155 155174 153115 190522 215186 210063
17190 210063 235902 245769 237442 224154 257062 303991 340163 370752 397220 417641 448971 488841
17178 488841 520040 537678 545138 544928 553978 553538 544853 557864 566095 556810 541096 509289 458730
17165 458730 425928 423730 423435 408212 380259 332276 304072 304866 291587 267976 261313 239321 209752
17152 209752 212233 209831 177137 154870 168682 173901 164928 158244 141735 131396 133401 147431 149690
17139 149690 159093 137816 135856 98923 77022 71674 56780 68311 48058 58414 62957 71762
17127 71762 70112 70811 76456 87496 98408 95427 77014 39711 45134 68651 78730 76686 76277
17114 76277 117380 135056 111845 92269 114837 131420 99220 84142 104042 104837 119070 116492
17102 116492 98513 67184 58775 70721 103446 128689 130568 131859 118907 98569 100653 119748
17090 119748 122116 94056 38934 55176 84511 71650 56617 63404 51081 47256 42018 70783
17078 70783 90610 92932 80921 63582 39396 61397 79491 61056 73650 103922 136743 157360
17066 157360 167341 143626 133020 139205 160341 168794 134519 124810 139780 137384 140893 105203 108870
17053 108870 159102 181720 175715 179493 189077 182974 185574 176600 183269 193177 202181 184255 186623
17040 186623 196477 197088 187039 178441 176149 173433 195012 203214 183345 157168 147464 143807 160513
17027 160513 178275 206951 202825 210879 223700 226831 218884 196398 204233 217133 225714 250073 261427
17014 261427 247173 246876 232449 232582 268183 293775 294541 266838 272560 273864 286868 320598 353669
17001 353669 353337 359058 388972 427375 460253 492489 538007 558368 547793 555808 560355 533629
16989 533629 498195 487295 468274 469714 491361 501499 480183 442786 381087 335469 333630 318410
16977 318410 272647 265327 256170 225239 238963 235939 252955 281083 299242 322701 337801 370490
16965 370490 392590 426117 449522 481782 458340 420604 388764 408072 443559 460808 436068
16954 436068 408326 447025 457960 434994 422520 410430 386829 348678 313769 262934 204483
16943 204483 170240 185150 183001 197491 216218 203785 215177 220484 240547 256255 257824 287984
16931 287984 351211 379001 363554 408193 437840 409008 435368 494187 509841 497811 514882
16920 514882 532451 554633 560065 563775 554715 554452 552288 537164 525470 517989 527366 541756 540556
16907 540556 539500 520175 525562 540636 526755 545124 574132 603011 615779 645700 660722 651005
16895 651005 664665 691777 737903 757051 778995 782839 764678 766205 796059 819253 825327 808166
16883 808166 781884 768311 751552 749079 737164 758803 777480 779833 786259 808308 836727 831246
16871 831246 829858 863222 894989 909501 926910 952643 990207 1021707 1021178 998327 1021613 1026980
16859 1026980 1067510 1076139 1079965 1053631 1030823 1012225 1007285 1012044 1013734 1039027 1046503 1051652 1060120
16846 1060120 1041126 1066404 1088527 1098636 1089728 1116298 1153794 1184649 1228915 1275744 1313366
16835 1313366 1360622 1427768 1493122 1584626 1671007 1797864 1950696 2094879 2261792 2448851
16825 2448851 2673440 2925619 3196016 3488534 3860687 4300388 4775720 5327946 5990455
16816 5990455 6825722 7845179 9200312 11079721 13638814 17028865 21438006 26836607
16808 26836607 33015695 39722605 46520898 52766304 57922360 61770173 64522645 66738988
16800 66738988 68880858 71127717 73458980 75587665 77009986 77007363 75179456 71485786
16792 71485786 66383337 60576017 54621347 48823861 43471404 38810421 34980546 31954713
16784 31954713 29620801 27891000 26739476 26158480 26227706 27083101 28833633 31624923 35465088
16775 35465088 40207263 45629725 51433154 57080127 61995607 65801753 68493036 70484635
16767 70484635 72255937 74113402 76088002 78046160 79598850 80068504 78812526 75627052
16759 75627052 70769270 64829937 58461002 52070529 46014332 40571474 35889741 32018757
16751 32018757 28797968 26095556 23827064 21916750 20328436 18962956 17758736 16708723
16743 16708723 15757703 14956203 14216748 13537649 12918006 12382969 11880470 11434302 11044615
16734 11044615 10686227 10349771 10029153 9718178 9417876 9182562 8982335 8775064 8595367
16725 8595367 8437778 8331491 8191996 8040697 7937168 7834173 7754289 7695180 7655353 7612154
16715 7612154 7594059 7573726 7575852 7609504 7659563 7707798 7810066 7950989 8090858 8264669 8506589
16704 8506589 8754830 9055681 9395144 9786085 10257851 10824316 11449015 12164479 12980241
16695 12980241 13894652 14967072 16191675 17657213 19347885 21308632 23573809 26206022
16687 26206022 29219322 32633929 36477201 40700437 45307015 50245779 55448658 60892020
16679 60892020 66430583 71926072 77191426 82173870 86762646 90849401 94350533 97163645
16671 97163645 99220578 100485245 100948497 100605182 99505592 97729728 95282866 92254664
16663 92254664 88684051 84678702 80363170 75858751 71261568 66661109 62166040 57833806
16655 57833806 53673620 49777168 46154150 42822609 39758169 36981714 34483973 32220251
16647 32220251 30176752 28313821 26599203 25029074 23631032 22373833 21242977 20195386
16639 20195386 19198657 18260560 17417671 16663218 15960057 15287137 14631170 14020650 13462783
16630 13462783 12957333 12447569 11970534 11528458 11116058 10724386 10348394 9982520 9641827
16621 9641827 9306371 8995171 8711022 8417582 8108479 7824395 7581120 7352825 7107022
16612 7107022 6882458 6661667 6448615 6280722 6091713 5889326 5674170 5501413 5350109
16603 5350109 5218105 5098526 4960571 4853007 4748663 4625592 4535136 4478217 4383644 4279221
16593 4279221 4170116 4102282 4031526 3920219 3837551 3768323 3720746 3641349 3539616 3405016
16583 3405016 3284332 3209372 3128218 3061059 2965398 2874380 2787467 2671931 2584450 2519967 2442638
16572 2442638 2341472 2315874 2270561 2221126 2154531 2099439 2031393 1997496 1964627 1934086 1894080
16561 1894080 1843813 1803247 1759910 1679944 1583208 1535132 1529558 1478401 1428060 1378510 1305639
16550 1305639 1265116 1231945 1171284 1111226 1066108 1052019 1042874 1039925 1004920 971649 934174 901727
16538 901727 911118 939230 968262 982048 967054 955488 943680 931348 905823 899936 946411 950435
16526 950435 915792 892154 870159 851948 847015 851469 811036 768966 750664 757735 750985 725988
16514 725988 713300 694677 692259 666635 654303 636987 626918 610612 572282 542583 531460 539055
16502 539055 548700 565828 545685 540315 531449 495579 480028 480377 478120 476907 473558 453269 420797
16489 420797 397640 397020 373866 353994 332072 318878 277131 238146 240378 250702 224984 180268
16477 180268 154444 150002 171412 159269 141747 117396 111502 125911 157312 173575 142592 131235
16465 131235 151989 153954 162491 176882 183465 196149 227836 251162 256075 232313 220031 218296
16453 218296 229846 248202 260630 228696 197771 172584 150383 167693 170274 180086 183264 198026
16441 198026 185208 183259 184916 206526 208533 213238 212422 221305 221152 228828 201244 169818 174195 165682
16427 165682 158776 161741 169282 181072 162156 142673 140374 141240 131827 150114 180981 188865 168293
16414 168293 152080 152594 161400 160044 148896 144696 135132 116858 100450 107999 105879 105672 124169
16401 124169 111538 101203 110340 115152 105226 88833 73390 91477 78187 25666 31514 72185
16389 72185 98757 119367 103740 62559 57879 86321 114264 106687 76663 62856 65430 61072
16377 61072 92959 84406 73968 50983 3632 22091 67375 84435 92262 108133 117335 97256
16365 97256 94212 104634 116444 87261 78151 87363 81771 79628 88856 101393 91038 74069 57475
16352 57475 51747 50035 43969 41714 37951 60895 68003 73333 73898 61180 48301 33702 13479
16339 13479 30981 33687 42223 64485 73124 77723 60295 24082 20604 35226 11485 1216 -14497
16326 -14497 5956 35645 18079 460 30668 34659 21293 57679 64178 81103 88948 55272
16314 55272 48180 58693 61320 44596 61083 82366 73859 57855 54492 52262 51857 56790 51162
16301 51162 50853 46976 59420 49942 53349 50150 39510 59672 109063 127770 165024 199662 218353
16288 218353 214006 216737 259750 296607 338966 367310 381223 386987 376854 383466 405236 413224
16276 413224 414225 405593 363723 355841 343006 306405 270624 278314 245693 203414 185018 166632
16264 166632 145710 144737 145508 146416 125879 131267 168757 192734 227833 252874 294042 310640 330544
16251 330544 345599 363614 381235 388189 382246 396803 401369 389185 405184 419021 399342 359129
16239 359129 335233 316919 293194 271629 241368 224867 192057 178499 181581 171785 168357 146399
16227 146399 147655 111514 59348 33331 75440 88334 72839 30553 39020 53226 72139 73743
16215 73743 71302 52843 34312 32970 34826 67167 72302 62161 63646 45320 21684 26140 62906
16202 62906 98485 101027 88977 43380 17069 14634 -6866 -9078 -6771 20195 29166 16456 24795
16189 24795 52017 60858 48966 50241 55880 43177 48387 53583 88044 106406 132813 148887 169940
16176 169940 186747 186516 217963 249058 248020 263576 302067 311872 322877 377865 398372 418359
16164 418359 463690 483600 479876 494707 469276 475325 486399 499210 492432 458190 450295 463510
16152 463510 421764 403494 396869 363725 322095 299329 285080 263571 235359 207728 184023 167034
16140 167034 160658 161501 145855 106819 74227 67416 75443 82643 74633 89894 108770 106256 106092
16127 106092 87385 88885 75991 72020 94595 77819 83734 79703 68962 64469 62142 52354 47606
16114 47606 33950 31298 23412 7139 -13038 -9442 -2364 -4839 14963 -5347 -13333 -5382 -6897
16101 -6897 -8477 9751 12252 31166 24977 11642 9711 19707 34498 7353 -16347 -25362 -7940
16088 -7940 17371 40936 17802 1613 -20818 -36826 -24575 18652 -2708 -28815 -30655 -19256
16076 -19256 -26795 -24182 -33580 -11762 25322 34031 20922 -8722 -29251 -38484 -51348 -15982 19403
16063 19403 6901 -21386 -31071 -17278 -11538 -27847 -32353 -7497 -12999 -29348 -33470 -4391 -18981
16050 -18981 -31411 -45217 -48383 -17082 -3462 3086 -8129 -17230 -5256 34147 35376 10650
16038 10650 3418 -26321 -43845 -34686 -27904 -18660 2579 -2460 -26742 -36542 -52266 -70679 -66104
16025 -66104 -39197 -17891 -19547 -23443 -14481 -11009 13493 33076 47993 53256 29745 -15725 -37147
16012 -37147 -33541 10517 -9744 -1066 -3466 9785 53264 41156 -7504 -7759 49 2632 -5116
15999 -5116 -37662 -41829 -38933 -32604 -46205 -67584 -73209 -66710 -53062 -44134 -40059 -2808 -17405
15986 -17405 -54568 -66318 -33800 -6262 -2309 -21754 -60956 -71225 -74958 -45829 -30487 -39666
15974 -39666 -54550 -69874 -84687 -84384 -67878 -45155 -50648 -62497 -59884 -43322 -24302 -23812 -25273
15961 -25273 -27836 -45100 -19687 -23292 -41076 -58758 -50385 -71060 -62476 -31523 3444 12867 -3715
15948 -3715 -18385 -32115 -55282 -51762 -48762 -36722 -20405 -23337 -1070 23194 4602 -45047
15936 -45047 -31977 -21177 -31625 -70746 -86335 -53421 -42584 -35070 -24364 -55325 -64817 -40714
15924 -40714 -31154 -45453 -70314 -62841 -60255 -56698 -64779 -57022 -66525 -3814 34599 34823 2205
15911 2205 -39830 -77506 -78297 -72466 -49749 -41473 -35557 -40056 -48192 -60589 -63167 -62973 -63589 -61518
15897 -61518 -69506 -65873 -51711 -45378 -46298 -58836 -41479 -19825 -821 -10289 -24491 -1301 35151
15884 35151 2090 -31653 -23233 -26464 -31279 -42185 -25014 -14574 -2602 4570 -18843 -39485
15872 -39485 -73298 -79454 -86300 -101242 -92643 -63936 -55020 -52377 -18752 -19279 -27309 -40415 -57168
15859 -57168 -64879 -73617 -98168 -67120 -55286 -31581 -31016 -57011 -66986 -60092 -41733 -26118 5350
15846 5350 -5609 -10004 -3166 -19225 -20970 -15037 -26956 -61588 -41776 -16405 -26591 -21194 -13166
15833 -13166 -26462 -36304 -33956 -19737 8988 -1727 -24280 -37293 -34548 -43706 -57963 -54250 -41114
15820 -41114 -38833 -32766 -29841 -7866 5356 -14619 -39126 -46816 -34590 -37411 -46643 -48510 -39032
15807 -39032 -53413 -77196 -96162 -101981 -74446 -59437 -40316 -33724 -57512 -99735 -75296 -47430
15795 -47430 -38422 -24201 -33056 -29677 -11882 -11052 -13184 -3662 -3633 -8777 -28709 -44400 -18400 10555
15781 10555 -17884 -66724 -93452 -77414 -67553 -94411 -60934 -47287 -54896 -63470 -71450 -64038 -62772
15768 -62772 -15939 787 -20626 -28983 -40494 -50243 -25852 -24636 -21411 -42179 -70487 -78279 -67475
15755 -67475 -56680 -33890 -14959 -61197 -97871 -70062 -52217 -52327 -35728 -36440 -39658 -34493 -13519
15742 -13519 -148 -20561 -30969 -26053 -29236 -28854 -25418 -22324 -37790 -47289 -36888 -9696 -30975
15729 -30975 -17506 10655 5000 23764 16745 4185 -19623 -28197 -31330 -42043 -33725 -30748 -35708
15716 -35708 -57859 -46675 -49313 -59450 -43156 -30833 -25961 -35177 -43888 -35046 -27110 -57671 -66162
15703 -66162 -88335 -92580 -93501 -71172 -78859 -70520 -51111 -64076 -96692 -108667 -108272 -75891 -63778
15690 -63778 -57140 -56603 -46926 -50586 -63276 -52117 -44919 -17185 -33091 -58168 -29321 -22998 -23951
15677 -23951 -28955 -31777 -30760 -32844 -32512 -24887 -31108 -36670 -53418 -57330 -48055 -35675 -15002 -30128
15663 -30128 -43450 -61066 -53401 -21328 -21843 -49487 -54485 -50348 -65644 -83086 -83597 -69063 -43107
15650 -43107 -31229 -53485 -82801 -91154 -84289 -77298 -70689 -60544 -33309 -30839 -36564 -57520 -35548
15637 -35548 -28993 -31503 -38380 -57201 -70363 -76934 -48592 -40064 -54820 -76395 -78306 -73281 -48389
15624 -48389 -39492 -10752 23932 27410 17298 -4442 -23856 -31399 -37348 -71529 -69257 -54461 -59753
15611 -59753 -18575 558 -29171 -53202 -69658 -64177 -45521 -68848 -63064 -52305 -26632 -26824
15599 -26824 -6614 -4896 -33434 -51347 -60104 -27862 -57728 -65587 -43498 -32108 -6421 -19526
15587 -19526 -26355 -17667 -4024 4569 -25747 -53796 -60738 -48129 -56964 -67709 -44854 -24192 -27356
15574 -27356 -27560 -19142 -13310 3847 -10241 -977 24820 -5290 -43353 -51910 -38439 -29337 -17306
15561 -17306 -15275 -23427 -22651 -10953 694 -17140 -37685 -61165 -65448 -36212 -18073 11012 30817
15548 30817 8007 -23839 -56206 -51146 -61296 -53037 -60753 -74864 -82460 -53604 -36856 -14286
15536 -14286 3173 -4470 -26684 -58262 -37810 -12351 -27858 -18480 15774 16313 3295 2053 -12226
15523 -12226 -23064 -53465 -49808 -48471 -54616 -23174 -31124 -44759 -50749 -53251 -34325 -6797 25645
15510 25645 -4396 -37978 -41941 -20132 -15416 -37982 -23439 -21731 -43825 -49968 -43166 -28147 -34189
15497 -34189 -26661 -38705 -28419 -30408 -30250 -22836 -40273 -32534 -32079 -17165 -2234 -15392 -43447
15484 -43447 -38311 -14492 -44239 -40910 -41340 -49384 -64985 -59048 -35097 -32035 -43682 -35432 -24928
15471 -24928 -33428 -28370 -43843 -83847 -86999 -73652 -50997 -30971 -19880 -22035 -16321 -17137 -42774
15458 -42774 -64786 -47424 -41253 -38333 -9555 16182 6107 10416 -1928 -5669 -19473 -31483
15446 -31483 -43270 -28250 -24715 -34797 -28342 -20298 -22811 -19491 -11025 5992 -21504 -52905 -75167
15433 -75167 -56778 -26996 -20837 -23830 -27472 -38510 -33553 4296 25680 21578 873 1721 -6220
15420 -6220 -13969 -24140 -28070 -40787 -20540 -33939 -29439 -20047 -35187 -40105 -65078 -75843 -47643
15407 -47643 -28198 -4476 26055 63381 57091 31254 -1823 5728 38378 26484 -2612 -16587
15395 -16587 -56632 -37642 9531 -10391 -32607 -52007 -56036 -39663 -40722 -49548 -43764 -24383
15383 -24383 -14048 -36539 -36595 -21156 -51227 -77700 -66709 -36315 -23839 -39518 -64102 -92733
15371 -92733 -79592 -57483 -55087 -72521 -63328 -59468 -68107 -73744 -82254 -82575 -84102 -79582 -69928 -81807
15357 -81807 -88814 -50323 5486 14623 -24526 -30886 -16954 -65884 -89001 -83298 -69663 -44724
15345 -44724 -52372 -44328 -53491 -66544 -75879 -86183 -81705 -79668 -81434 -61736 -54190 -40230 -2007
15332 -2007 -6132 -19527 -26330 -47692 -59292 -58042 -49140 -27151 -63143 -79457 -49823 -60741 -69214
15319 -69214 -62107 -53688 -40502 -30804 -31958 1480 15200 6716 -34719 -60659 -65701 -63324 -55236
15306 -55236 -63800 -66611 -55589 -39326 -12856 -7764 -15059 -36939 -40624 -18774 -22566 -27091 -1523
15293 -1523 -10465 -28558 -45782 -53236 -54306 -35510 -32391 -66044 -74343 -60083 -69242 -97711 -95949
15280 -95949 -76745 -52224 -29284 -362 2852 -10598 -7767 -10208 -10499 -24881 -26715 -4690 -15531
15267 -15531 -32411 -33040 -35518 -22423 -11444 -23201 -13566 6230 1333 -2974 -19170 -41691 -26350
15254 -26350 -36937 -44972 -54904 -40287 -49810 -51494 -29795 -47671 -55958 -86900 -97406 -81079 -66646
15241 -66646 -59507 -38561 -17517 -25223 -35439 -28653 -12682 -3973 -19099 -36867 -37470 -32911 -34382
15228 -34382 -48982 -38547 -31265 -6085 -4748 -6502 -11911 -27916 -22001 -24253 7886 6335 -11935
15215 -11935 -8021 -1035 -14562 -29100 -36747 -40543 -52515 -87284 -117777 -90889 -91019 -100697 -117173
15202 -117173 -114105 -88707 -76672 -57048 -18434 -1009 -11694 -21222 -18089 -28278 -48391 -45552
15190 -45552 -38283 -16286 -17349 -39405 -42150 -15827 -9120 -16389 -26774 -28652 -33252 -35219 -16934
15177 -16934 -9695 -23190 -26466 -27558 -28527 -42158 -58252 -52505 -77123 -105775 -98131 -52210 -26722
15164 -26722 -39817 -74452 -59517 -37574 -24015 -23578 3531 -8366 -13717 -34717 -71109 -78016
15152 -78016 -62180 -21642 -14607 -30852 -35953 -42387 -57165 -25800 -7123 -27380 -51889 -49367
15140 -49367 -33105 -28298 -33936 -35493 -58139 -47830 -20917 -15174 -5827 -22064 -46472 -59275 -54764
15127 -54764 -43326 -2684 -16000 7405 46911 39800 25947 -13789 -29514 -44716 -44278 -18089
15115 -18089 -1181 -1143 -11392 -20814 8432 3727 -10427 -28504 -62027 -54229 -3528 12844 6957
15102 6957 -26704 -58110 -57051 -46740 -50878 -57574 -84951 -95601 -74931 -68474 -46730 -30213 -35468
15089 -35468 -47115 -85139 -62027 -31687 -30619 -40868 -50844 -31312 -19304 -33408 -48595 -32051
15077 -32051 -17691 -41745 -38326 -24827 -44520 -47931 -54579 -69737 -87126 -101754 -92787 -62258
15065 -62258 -64701 -45657 -19721 -17738 -9101 -19795 -45318 -40168 -46122 -26229 -34552 -36645 -48422
15052 -48422 -34018 -11620 8373 25803 3788 -4179 -4852 -12537 -4845 7149 8530 9106 14180
15039 14180 1759 1179 6187 3299 -11679 -13754 -40558 -37179 -40326 -50600 -53798 -47125 -47860 -42079
15025 -42079 -25194 -17636 25498 29638 -19975 -53537 -42338 -22844 -22642 -34253 -36309 -52804 -49275
15012 -49275 -41596 -16027 -29222 -18818 -15589 -28349 -32918 -55781 -35574 4638 4826 -3586 -15240
14999 -15240 -5155 -17493 -13350 8523 -10266 -25091 -38707 -68429 -73804 -71851 -62688 -33639
14987 -33639 -14493 -49964 -42140 -12058 -24024 -37257 -23020 -18683 -36597 -9811 13724 12219
14975 12219 4461 5409 -48557 -54211 -29395 -4200 5881 11827 33716 41999 31684 -7327 -38144
14962 -38144 -11597 8033 17135 -10930 -15484 -31844 -15583 -3842 10989 37650 38244 35341 63281
14949 63281 69983 89959 161326 238767 288383 320835 362027 402738 422041 424889 399726 398845
14937 398845 410433 376171 312166 225442 178317 163442 150753 149469 153012 114310 68689 70475
14925 70475 50974 32226 21443 38608 55448 80683 114516 90526 61492 45149 29229 8283
14913 8283 5142 3088 3953 18098 11897 5582 -8393 22422 45914 8812 -18246 -23733 -17533
14900 -17533 17649 30697 10922 18919 21339 -6752 1250 9870 14740 -3825 -11723 -13319 -3374
14887 -3374 30511 33901 -7264 -5015 -3670 -16651 -9384 -37159 -32801 -11270 -29711 -33343 7810
14874 7810 -3860 -27078 -35037 -36416 -6421 5546 -11075 -1000 537 -9185 5210 -14564 -12902
14861 -12902 -14125 -8052 8532 10503 9575 -9291 -49475 -88114 -77733 -48896 -26631 -15779 20
14848 20 5361 28946 39836 17066 23449 -17928 -57356 -43033 -34578 -27465 -2730 10629 4202
14835 4202 -2139 3223 -7201 -4741 -7781 -16116 -14745 1600 -3891 -29743 -40428 -340 -9759
14822 -9759 -24800 -20357 -16356 -13044 -30803 -46477 -50193 -47303 -44902 -49298 -50570 -20255 -13025 -1979
14808 -1979 -2569 -539 7869 1121 16890 11500 5986 1962 -11207 558 28991 31096 -3121 3177
14794 3177 18160 19275 4761 -9734 -18325 -33663 -46947 -34307 -9743 23848 42665 20160
14782 20160 -24742 -25295 7511 9154 -708 -5163 -6104 -11930 -7962 1732 -17355 1716 34438 25875
14768 25875 9947 -5726 -2624 -4990 -9170 -9942 -23234 -26052 -30579 -33735 -11759 7458 8068 6945
14754 6945 -13561 -17438 -53261 -46560 -62124 -78506 -66868 -27513 -9817 -24766 -37517 -25084
14742 -25084 502 16030 31510 24632 11158 25214 4826 15297 9938 7692 22411 33699
14730 33699 37605 33907 64577 64587 27541 6413 26489 56309 79055 52819 45900 25124 -2284
14717 -2284 -21722 -23356 -19111 7401 24710 -3364 -19566 -12681 2891 13685 54960 70184
14705 70184 46224 25005 17436 5208 38200 50055 61317 40325 4636 -4993 -3298 583
14693 583 4919 21830 26831 39667 56013 75629 83513 58115 13942 -7822 32904 64952 48704
14680 48704 18358 -7904 -6020 27927 32955 46622 1130 -15731 3760 -5605 -16410 -20171
14668 -20171 -26577 3555 23922 44246 48215 29685 15940 12340 4646 21993 29928 17148 28032
14655 28032 54568 48880 44969 40292 59232 55680 59374 70081 75702 60912 28976 -10229 -12985
14642 -12985 -419 38468 58080 64915 24239 25881 74688 53820 32842 42244 36180 25071
14630 25071 29940 42569 50252 54508 61463 40367 45070 66996 111309 108008 92491 96878 89199
14617 89199 86392 69026 54414 41924 36424 61527 61358 56835 89580 87831 83809 97439 86578
14604 86578 57060 36645 45855 59035 75543 91017 95224 78689 76288 67356 65271 68837 73955
14591 73955 96873 123177 113671 111154 116965 113614 84677 79390 106665 140051 133772 116042 110077
14578 110077 106216 86571 93437 129637 153608 150703 133824 139620 119279 81413 59344 72052
14566 72052 106261 117130 120048 120429 117814 120613 103396 99477 105584 66626 60008 76173 65444
14553 65444 50149 81863 92173 79938 66089 68184 99047 92313 69409 105798 113354 119471
14541 119471 113851 110860 103640 124073 133461 153410 145599 148633 163412 153396 130919 108722 119030
14528 119030 112587 114769 128259 159340 165213 175518 175985 178903 202222 212479 236063 244427 298946
14515 298946 365725 403222 473551 557598 642106 724567 794979 866542 910180 883261 867788
14504 867788 852429 792461 709865 647410 556224 458123 401423 352151 315807 329292 321844 284573
14492 284573 270612 286476 283597 260307 260156 242369 205614 202283 227427 229155 203963 213512 226356
14479 226356 248027 263370 242521 241971 216222 212573 218357 238900 268930 268720 263690 249063 238893
14466 238893 240486 237712 232846 226423 211196 198717 190420 194889 209197 206756 226266 227032 203700
14453 203700 202555 205607 203849 210648 229169 238359 243537 231201 223234 211295 187505 206414 218352
14440 218352 233400 221254 218274 214567 224025 221094 218208 214382 235370 239198 256568 259459 266472
14427 266472 262815 251428 242276 244345 263619 259298 267277 286790 305076 264648 226724 212894
14415 212894 225701 249955 257858 254103 235866 240739 287062 315148 325739 312381 296548 286046
14403 286046 268261 248361 279012 282070 257866 261243 278074 278628 316439 312641 304314 321295 324034
14390 324034 325356 322576 314529 325287 325308 338770 350757 313872 301187 301539 308717 327160 333524
14377 333524 350625 350780 360899 393383 404398 396926 374959 359126 363653 377365 369898 375373 366247
14364 366247 386269 399399 419447 451791 465781 462867 468194 473348 466526 479906 506485 538853
14352 538853 514636 520987 559967 611657 623397 682169 742032 760065 747506 786960 863478 914357
14340 914357 944426 966284 997646 1042886 1077231 1092188 1131718 1176696 1220506 1215446 1214028 1227657
14328 1227657 1249687 1250283 1232133 1189665 1186688 1184051 1146112 1114037 1055082 1008456 986822 940717
14316 940717 902405 873337 847025 831585 845592 837570 816293 780084 741126 725654 729994 699170
14304 699170 678503 663599 639048 616392 607206 595072 598330 606666 620871 603456 572862 565888
14292 565888 581900 596130 599363 596331 562591 541571 510196 525859 542464 549984 567053 565665
14280 565665 565942 591615 595450 571126 571278 559156 542653 534746 552207 554475 545601 548941 541411
14267 541411 535484 516289 508410 500358 494671 521511 540131 527326 497165 477952 470078 471221 501630
14254 501630 529971 544058 537411 530404 543127 544641 572960 542401 502915 510820 525407 535455
14242 535455 547952 555107 543952 569864 576501 546889 518549 512534 548699 584318 597867 589164
14230 589164 569651 569894 571082 590401 618730 624371 608753 585207 581527 604184 601929 575611 560358
14217 560358 535559 518585 535414 580678 597762 606813 600716 597649 565917 544174 547112 570700
14205 570700 610432 630572 637574 629377 603619 617925 629869 607057 607775 628127 613992 621078
14193 621078 647143 636655 644610 653848 653456 674459 690256 719541 736497 722453 690357 659788
14181 659788 668094 662947 666898 707140 722310 690268 660634 651020 683297 712084 714617 694797
14169 694797 693050 713779 741500 728329 729854 729281 700173 703461 723806 757702 773592 765697 794451
14156 794451 794833 786021 801337 814225 808440 794691 803648 823551 850806 883376 900460 861990
14144 861990 864786 863787 867452 870442 903560 944384 941358 974686 989084 1006775 1022225 1008574 996122
14131 996122 975371 989616 992847 952955 947271 957877 970300 1004570 1026124 1016523 993936 997135
14119 997135 1017217 1018928 1018869 1016881 1046177 1051712 1048233 1072053 1091449 1077811 1070610 1047703 1071435
14106 1071435 1088425 1068935 1058425 1081783 1118428 1163741 1183063 1192969 1176347 1218153 1266507
14095 1266507 1268615 1244018 1247914 1238181 1258183 1275416 1321276 1352657 1376382 1417752 1423814 1400785
14083 1400785 1409514 1440472 1453060 1451096 1474967 1474309 1481537 1482618 1468967 1453399 1426617 1414286
14071 1414286 1407199 1416923 1401067 1420030 1434659 1411745 1382699 1374083 1347419 1323938 1303449 1304917
14059 1304917 1321093 1309775 1295810 1312833 1329391 1318273 1345029 1340184 1353039 1378323 1391118
14048 1391118 1391711 1408120 1413113 1397320 1434417 1457570 1488668 1503656 1545936 1592615 1607692 1602802
14036 1602802 1637113 1650240 1673593 1693262 1694756 1674949 1676192 1680973 1749192 1798806 1816104 1825812
14024 1825812 1862181 1911152 1936903 2005526 2069371 2134135 2171417 2236328 2292650 2358238 2417556
14013 2417556 2480983 2557232 2614598 2672905 2736256 2786762 2837593 2865075 2895345 2935761 2949634
14002 2949634 2967407 2990666 3032545 3062099 3089816 3101481 3121640 3137412 3171919 3222159 3245615
13991 3245615 3266269 3286247 3319789 3353742 3378826 3412808 3442560 3495490 3509099 3530520 3573450
13980 3573450 3642975 3695639 3731536 3787162 3863362 3908945 3942282 3978991 4013086 4082120 4167519
13969 4167519 4228628 4304064 4377703 4451859 4515890 4593271 4682840 4749413 4842372 4944232 5058955
13958 5058955 5166147 5265262 5371766 5468059 5571448 5705556 5860855 5995118 6150585 6338619
13948 6338619 6512832 6690556 6860278 7054577 7246610 7467516 7673192 7900399 8125050
13939 8125050 8375727 8611344 8883279 9202652 9538117 9867414 10179525 10496949 10864010
13930 10864010 11272149 11695258 12158353 12644974 13158967 13723724 14346728 14981728 15634514
13921 15634514 16354170 17107026 17949557 18854395 19844559 20931972 22101896 23377569 24731658
13912 24731658 26196087 27833425 29617888 31565326 33722951 36092406 38684776 41570132
13904 41570132 44779644 48263272 52120761 56347463 60990825 66096117 71708217 77797473
13896 77797473 84392867 91508053 99019133 106877805 114953555 123097709 131095435 138740889
13888 138740889 145853972 152135324 157391867 161472928 164212784 165515706 165426966 163982114
13880 163982114 161248034 157363166 152525535 146895043 140687155 134088231 127301721 120520298
13872 120520298 113823614 107307878 101065887 95134860 89564393 84330905 79427500 74863108
13864 74863108 70641711 66703281 63080612 59746489 56618664 53733855 51073779 48584580
13856 48584580 46249257 44048513 42019212 40148063 38413034 36784215 35245353 33739080
13848 33739080 32330360 31032310 29823960 28644058 27569204 26555899 25572562 24630960
13840 24630960 23758775 22911276 22092368 21322621 20579038 19867740 19178074 18517439 17916143
13831 17916143 17332030 16756744 16224675 15716430 15236826 14807493 14383646 13952933 13558315
13822 13558315 13182524 12812475 12422348 12064634 11731013 11444508 11171108 10871381 10559196
13813 10559196 10306723 10053745 9785458 9546811 9321836 9098969 8886843 8673896 8456127
13804 8456127 8253408 8048341 7864549 7684730 7464660 7246105 7036263 6826434 6643507
13795 6643507 6470627 6336920 6196587 6029817 5871158 5716297 5574288 5418116 5252391
13786 5252391 5134470 5030328 4922525 4785616 4660781 4525230 4390185 4239881 4134379
13777 4134379 4031417 3935173 3815617 3704584 3611116 3512147 3409729 3273729 3165958 3072197
13767 3072197 2949157 2861687 2769410 2678525 2583623 2477361 2386083 2286297 2244550 2201696 2143965
13756 2143965 2050117 1979837 1918627 1880599 1843071 1796369 1764386 1748088 1736615 1712027 1684188
13745 1684188 1645040 1627716 1596539 1584306 1549221 1550978 1542177 1529479 1535554 1522498 1483676 1473494
13733 1473494 1494183 1501428 1500881 1493816 1477863 1447266 1416090 1361801 1361908 1367097 1337726 1326315 1307726
13720 1307726 1280084 1254037 1217888 1201509 1196312 1156725 1135014 1143635 1111064 1079576 1062492 1022654
13708 1022654 984178 965403 929901 921629 906581 889858 865856 828125 786394 734494 698865
13697 698865 645542 613519 587194 547449 530056 514840 456159 440797 439909 463490 463428 453658 429286
13684 429286 444372 451228 463196 456528 444749 439585 451515 455997 433249 424447 439203 431384 418341
13671 418341 452860 460378 445799 452097 473598 464772 471259 484804 497565 515572 466250 449160
13659 449160 443319 450558 453136 453647 478300 476521 453332 438169 451764 443701 440559 446711 440519
13646 440519 432218 430126 432148 443263 468020 426375 421079 432264 438485 437898 434670 444568 451698
13633 451698 425293 393353 369706 382816 403335 373511 358410 361090 367443 361322 337334 340384
13621 340384 325044 320657 327341 327897 323320 310413 272740 264621 283072 276863 252652 273392 253206
13608 253206 233332 231964 254300 272083 272531 273096 264198 260637 258569 246272 241422 210527 206269
13595 206269 249036 261139 252541 263595 287219 277599 242620 240785 236409 233846 237964 190697 155284
13582 155284 179683 209131 243647 237290 217178 215670 219643 203818 175864 183448 191395 198206 222842
13569 222842 230940 239691 238355 212452 204446 209993 226575 245113 217874 213105 205364 187072 197995
13556 197995 199051 211140 221307 225706 213454 200851 168029 153625 183501 193392 188495 184380
13544 184380 160101 147490 163871 156679 161452 160506 176158 162943 148246 144636 131865 118548
13532 118548 146304 165367 147532 120692 111316 113603 158521 156829 158552 163902 163965 166348 170979
13519 170979 191394 211878 184747 175855 188311 215051 225947 208760 184372 182032 210117 197568
13507 197568 206905 231975 228886 216863 193596 173406 176694 162991 181450 161761 186800 205411
13495 205411 192357 182538 167211 161730 173746 193475 185003 179397 180343 167452 155508 146622 132876
13482 132876 156929 181528 183497 202402 215421 199464 176571 158168 158191 166111 183255 205443
13470 205443 242791 242454 238842 230948 238889 207999 211582 225105 248886 288105 284357 273663 296504
13457 296504 307041 320338 310346 314415 324671 350363 373749 400833 435473 441894 470110 509084
13445 509084 529826 573206 601771 621889 660094 733092 775182 821288 879498 910985 920074 942452
13433 942452 988794 1033342 1042200 1039158 1032723 1034769 1034853 988032 975999 943481 897858 812517 759943
13420 759943 742015 736730 691662 667164 641431 602142 552766 564740 537119 484052 447957 417406
13408 417406 409381 422324 416747 400415 366330 346524 363892 372777 373124 349785 328565 324196 303653
13395 303653 285564 291003 294349 275057 255121 216523 215849 222974 263375 276556 251865 237686
13383 237686 241539 218373 222371 241504 219711 185292 175296 180480 177301 190197 197050 171528 166071
13370 166071 170574 162826 173751 195525 212732 229110 215098 209002 193969 203006 200747 206701 209308
13357 209308 223703 211278 203755 213472 200227 174220 146182 128303 121744 136154 156426 178359
13345 178359 188210 148952 155299 148063 147665 147745 173085 184794 153765 132733 132214 123878 157772 173610
13331 173610 185369 172142 153067 147420 143948 146428 134499 147258 153451 154474 162839 145996 131785
13318 131785 121998 137033 136819 148757 146932 144200 165959 178589 167795 171957 181125 169938 161655
13305 161655 170540 175400 188330 205948 199857 190912 198033 179291 163513 165177 186550 187825 166728
13292 166728 163288 138362 141344 162670 149325 146023 120813 121268 143330 189289 212604 199689
13280 199689 186235 158179 156520 169287 160626 127445 127001 137618 126422 143545 183027 207499
13268 207499 173518 148603 165171 202601 212264 205871 178205 164852 146181 146975 153736 182983
13256 182983 193258 189497 162613 153605 148714 138555 136269 125537 104304 92360 103060 125156
13244 125156 122545 143613 147493 152319 164196 156121 131162 137897 156417 168665 176062 174426 213541
13231 213541 211014 185878 181330 165064 159002 183656 198958 192511 176267 150402 129476 127373
13219 127373 134609 110803 107750 104670 124026 122764 143918 146233 150161 139447 111687 135682 145521
13206 145521 152216 169153 210260 203597 171648 156764 177506 204150 185270 178842 182523 181345
13194 181345 144027 162107 167454 188311 172298 161350 194705 217523 224555 185770 162315 159685
13182 159685 164896 172086 167820 161546 166829 185935 210558 213154 208602 210252 213442 223306 246184
13169 246184 244786 251857 280063 322747 391703 399732 367952 380841 375143 329256 286961 291533
13157 291533 289659 278945 287937 270894 227957 225216 247994 239754 228028 211595 211943 199749 176561
13144 176561 189717 212542 213299 229894 254583 274387 237509 214524 236095 224194 232181 250515
13132 250515 241466 206863 195886 214312 212988 229104 256110 283938 300124 385877 475730 560446
13120 560446 649735 711769 736330 724304 633932 547541 478143 446314 410160 371750 379427 376221
13108 376221 359799 342172 312333 292784 285799 303062 312292 324525 319959 329114 336845 316055
13096 316055 313285 295171 291897 263863 274825 313931 324018 339636 322285 295808 316702 318555
13084 318555 312009 347850 360298 364552 376930 416857 476210 552134 647588 730506 808740 857475
13072 857475 838106 747214 660915 578437 526323 508972 500905 485948 446691 432180 405788 363823
13060 363823 361075 389443 385055 351823 345584 336398 339193 327798 344981 349378 373156 364147 356279
13047 356279 335542 329367 337616 345627 334927 344389 361519 348062 332812 346862 364211 378207
13035 378207 372430 372317 378912 408171 457083 482974 490618 502533 487571 470393 438807 428009
13023 428009 443044 398196 390062 377969 371194 383083 377912 383765 359338 320464 311909 318885 325225
13010 325225 355349 383550 366471 350778 335306 335453 363658 386515 397891 408700 421592 401316
12998 401316 357948 377025 381452 379643 405919 398377 380926 382236 371206 358831 357829 358930 379863
12985 379863 388393 381239 378943 391814 414878 434052 434176 407966 374285 360148 365739 351738 339083
12972 339083 373068 388374 388945 379144 359980 356049 366764 389832 430873 411453 380901 376995
12960 376995 390956 402588 417646 432817 451285 459628 453805 467233 470069 477531 470586 472736 484302
12947 484302 476292 465658 487187 510368 498162 470716 457907 450944 441023 423962 452414 461423
12935 461423 461739 469716 494099 496176 502096 503275 508169 522508 494406 469820 472422 464591 469978
12922 469978 486836 486570 501439 501697 505544 491192 502288 489451 481991 493417 491325 510208 509884
12909 509884 511118 514186 511287 510740 526036 509467 490946 522260 560329 569619 580866 581780 577629
12896 577629 556895 541150 580301 587310 609632 625098 606951 596698 592376 616951 658814 658425
12884 658425 650632 640407 625482 606599 613074 603491 597099 623199 642952 630209 628092 639097
12872 639097 640888 654491 676823 700349 701043 670642 638105 616648 636951 672562 696867 705993
12860 705993 704531 698139 712173 709684 709214 711937 704277 698149 726690 751856 749716 750702 775966 780704
12846 780704 776707 775002 749059 743609 744910 773102 783304 764695 778203 779789 784828 817789 822429
12833 822429 834571 850419 831428 827293 828051 827406 818004 844092 875361 859417 866016 868835 874335
12820 874335 902945 928252 912491 882979 894269 906074 912289 926167 928090 922794 920695 923359
12808 923359 918617 909561 919238 950656 981564 992757 992334 1014845 993179 953479 953303 1000902 1034641
12795 1034641 1071061 1109412 1096372 1081265 1079344 1105434 1070281 1045284 1067422 1084599 1109484
12784 1109484 1136819 1137051 1134958 1151847 1172310 1163272 1159044 1146073 1163779 1205236 1230779 1233391
12772 1233391 1227244 1228579 1247069 1245798 1237498 1274561 1276989 1286812 1287723 1295616 1316341 1319999 1333385
12759 1333385 1360337 1347715 1323044 1341253 1360154 1371921 1371160 1392909 1416835 1454799 1463193 1449349
12747 1449349 1457757 1457337 1465231 1465074 1479575 1466430 1519158 1572904 1594258 1590816 1577779 1563530 1607671
12734 1607671 1622640 1622419 1641127 1675927 1669871 1670699 1682862 1700457 1715174 1708486 1705947 1723541 1743899
12721 1743899 1732371 1725539 1751668 1786927 1793019 1824390 1848858 1873090 1920649 1898311 1885720 1883073
12709 1883073 1890956 1888957 1934779 1968888 1967681 1977299 1979182 2012504 2036944 2070830 2083902 2099959
12697 2099959 2127916 2136576 2146537 2171055 2186920 2207319 2202806 2181760 2197089 2201369 2219986 2252843
12685 2252843 2300857 2339817 2377978 2391168 2403260 2416478 2412026 2450164 2487934 2513238 2524384
12674 2524384 2541779 2550629 2549593 2583278 2611824 2618318 2628598 2652456 2667957 2708591 2750567 2747611
12662 2747611 2756807 2805015 2846932 2884439 2919710 2950270 2989563 3015139 3032785 3051670 3050211 3038169
12650 3038169 3060688 3105165 3149240 3194662 3247239 3267038 3253453 3275411 3335884 3380977 3427827
12639 3427827 3447732 3464148 3485716 3512349 3554831 3580400 3616100 3650492 3660223 3696088 3722267
12628 3722267 3747446 3793549 3844201 3893504 3937518 3951428 3997350 4041069 4049346 4117061 4170840
12617 4170840 4188598 4233151 4298387 4337381 4380197 4388127 4394237 4437371 4450177 4478596 4522086 4580020
12605 4580020 4643743 4685705 4740108 4831497 4878206 4913578 4973548 5012678 5039686 5068017 5108503
12594 5108503 5157658 5211966 5285353 5363926 5388529 5413499 5465537 5515358 5565212 5635208 5684642
12583 5684642 5718196 5789356 5883565 5948566 6004632 6069148 6105729 6159397 6207601 6275682 6339609
12572 6339609 6397957 6452149 6527666 6607956 6696935 6760350 6817735 6881004 6923119 6963339 7043415
12561 7043415 7099017 7177875 7280000 7369420 7405479 7421664 7505176 7650348 7711378 7746720 7807798
12550 7807798 7894072 7972565 8023488 8094496 8166122 8237249 8310275 8372658 8446738 8526797 8571529
12539 8571529 8632259 8724043 8790590 8846222 8926204 9008311 9110657 9194879 9228991 9252482 9345740
12528 9345740 9430748 9495169 9596238 9694685 9788670 9858538 9959801 10024552 10068837 10114411 10187205
12517 10187205 10233650 10316372 10410421 10456479 10503495 10567392 10608354 10627573 10716254 10788357 10854224
12506 10854224 10895510 10946009 10999008 11060740 11132792 11186555 11229270 11234788 11300719 11356415 11411006
12495 11411006 11429126 11456934 11526831 11579029 11613853 11694981 11751013 11756079 11796301 11861002 11910323
12484 11910323 11945880 12000347 12058093 12090783 12133756 12184017 12210362 12238804 12259292 12255904 12272867
12473 12272867 12289953 12294586 12292757 12248869 12218934 12190126 12156340 12144326 12136227 12141230 12130168 12098365
12461 12098365 12074032 12022811 11972092 11949717 11930118 11914941 11916282 11912386 11883405 11848544 11792006
12450 11792006 11771043 11763583 11738330 11684608 11672547 11658310 11648605 11660879 11676444 11706900 11748902
12439 11748902 11801365 11832348 11835239 11845975 11872355 11861995 11786624 11676887 11582816 11479189 11330715
12428 11330715 11208331 11119746 10991800 10884317 10838535 10771774 10679380 10579548 10482954 10395881
12418 10395881 10324492 10250875 10137565 10074063 10006601 9902177 9793247 9704319 9609170 9552749
12408 9552749 9473343 9389210 9333990 9281392 9196650 9149540 9120485 9035465 8963413 8929828 8902507
12397 8902507 8861108 8805673 8743927 8684922 8648371 8608456 8507834 8442130 8379709 8302080 8202581
12386 8202581 8091878 7996497 7929615 7861177 7774820 7683967 7576154 7498567 7407730 7313294 7274067
12375 7274067 7236375 7174515 7116958 7056780 6991067 6933695 6869158 6801370 6699328 6679818 6625413
12364 6625413 6547030 6484183 6434711 6382128 6342783 6265678 6199999 6145799 6100664 6048112 5998163
12353 5998163 5946712 5897608 5844724 5798114 5759085 5714698 5653785 5591541 5575803 5519201 5453061
12342 5453061 5405901 5357738 5328095 5294431 5227129 5169878 5146276 5107544 5075288 5038565 4993223
12331 4993223 4951857 4902886 4843441 4795815 4776488 4760965 4729033 4702097 4655692 4598887 4590808
12320 4590808 4546945 4511991 4494904 4473940 4428753 4404524 4369795 4332706 4294566 4269719 4239906
12309 4239906 4218340 4166807 4114826 4101574 4073185 4048678 4016377 3994230 3968565 3912119 3889137
12298 3889137 3878984 3877533 3860906 3842451 3823008 3818123 3794336 3774316 3732496 3678637 3642318 3626067
12286 3626067 3634625 3604758 3579525 3545193 3534242 3517144 3485203 3439887 3423684 3402133 3390826
12275 3390826 3362127 3368599 3357505 3325708 3293915 3258053 3226815 3239958 3252173 3252426 3215784 3170650
12263 3170650 3168177 3170973 3129305 3122128 3107168 3097700 3089800 3099907 3099953 3085284 3076634 3058303 3063454
12250 3063454 3078779 3094482 3094811 3103439 3098680 3073420 3076427 3071070 3040749 3026655 3034959 3008880 2978096
12237 2978096 2964905 2926604 2938264 2962161 2998502 2996448 2975461 2971196 2985251 2980823 2991216 2974950
12225 2974950 2973343 2956277 2930627 2912266 2899106 2870011 2862356 2859720 2844038 2828608 2812870 2778056
12213 2778056 2754108 2748754 2734164 2711890 2700991 2703430 2713597 2694730 2727518 2754122 2734393 2747856
12201 2747856 2733190 2687298 2693136 2691681 2687353 2661777 2656748 2692955 2703318 2676066 2654867 2706031
12189 2706031 2763798 2790994 2786446 2779660 2780782 2783154 2782917 2768150 2754059 2738469 2680808 2605133
12177 2605133 2564483 2509845 2476576 2450486 2468559 2475243 2461059 2439748 2423467 2413569 2446441 2474267
12165 2474267 2465810 2505576 2543176 2539473 2543740 2549047 2581882 2586635 2537839 2533806 2539640 2561266 2585100
12152 2585100 2597854 2614833 2634530 2641244 2669380 2693903 2729693 2752350 2780413 2812122 2841529
12141 2841529 2850247 2879814 2903896 2922081 2906853 2930247 2936824 2942616 2954411 2960565 2989937 3046991
12129 3046991 3099542 3153814 3196722 3260099 3353158 3427574 3479957 3559799 3665347 3760751 3869075
12118 3869075 3953216 4063716 4185912 4274464 4342839 4430083 4550281 4676454 4791222 4871379
12108 4871379 4986568 5130162 5244420 5326338 5371726 5395407 5426660 5475477 5529504 5562470 5620452
12097 5620452 5666566 5738895 5815397 5891793 5991678 6097459 6217055 6332766 6459510 6556748
12087 6556748 6630524 6690127 6725239 6716015 6723617 6766268 6818071 6911397 7036867 7166299 7283449
12076 7283449 7428361 7626756 7910406 8211807 8516690 8869466 9275244 9704480 10168270
12067 10168270 10675060 11168485 11691816 12254957 12823928 13448248 14118915 14845382 15646486
12058 15646486 16500278 17392637 18325637 19302083 20292258 21285885 22318619 23394980 24541544
12049 24541544 25840769 27371526 29202915 31418972 34098969 37323615 41237960 46016122
12041 46016122 51790570 58567245 66143434 74080739 81746227 88306694 93065360 95627177
12033 95627177 96066386 94812398 92592808 90085975 87718867 85782351 84392582 83578496
12025 83578496 83345425 83653836 84405439 85497640 86836736 88332047 89826646 91272142
12017 91272142 92713618 94260223 95988140 97994973 100307924 102910289 105686888 108468658
12009 108468658 111072324 113391791 115455576 117350813 119363335 121784426 124942118 129222857
12001 129222857 135009408 142782114 152927539 165860324 181647974 199651351 218396398
11994 218396398 235596485 248572556 255344481 255214947 249031470 238618779 226089167
11987 226089167 213125183 200726110 189506637 179771724 171541156 164775508 159365147
11980 159365147 155001774 151348457 148121875 144999281 141815568 138549894 135215772 131937162
11972 131937162 128837464 126042622 123587408 121411443 119396903 117473182 115491612 113467956
11964 113467956 111405308 109435216 107689592 106293201 105357103 104984555 105315522 106513454
11956 106513454 108722746 111967955 116068282 120472772 124379853 126892379 127328222 125322250
11948 125322250 121100902 115192089 108304589 101048959 93918627 87218573 81115030 75654695
11940 75654695 70810721 66606344 62937720 59715383 56872824 54381250 52155743 50091642
11932 50091642 48171613 46386629 44672602 43018871 41410165 39818703 38282566 36841110
11924 36841110 35463179 34150650 32891892 31661509 30458960 29281498 28148355 27037336
11916 27037336 25963786 24942265 23979951 23080740 22240186 21489477 20790949 20100879 19469165
11907 19469165 18899875 18369006 17846056 17349137 16893885 16465389 16070482 15709565 15391152
11898 15391152 15070427 14753537 14448105 14146249 13821893 13510429 13226124 12906466 12617229
11889 12617229 12328646 12062966 11803495 11573767 11369063 11178434 10982009 10741530 10529143
11880 10529143 10326677 10087671 9848815 9625007 9359713 9100910 8816535 8504727 8171145
11871 8171145 7870072 7585890 7316084 7078870 6861077 6634231 6439038 6291761 6142516
11862 6142516 6008885 5871777 5750647 5659119 5570935 5477467 5364121 5282665 5206679 5150958
11852 5150958 5133628 5163526 5285114 5520688 5983589 6747377 7567197 7971336 7933680 7352856
11842 7352856 6545712 5893897 5458811 5139397 4809294 4522988 4273981 4081964 3907715
11833 3907715 3759076 3641407 3572138 3507909 3449004 3336828 3204460 3064795 2968280 2896135
11823 2896135 2838256 2768487 2724756 2646495 2570652 2517008 2493591 2460212 2404731 2378595 2356330
11812 2356330 2320400 2265340 2231028 2178487 2092493 2039149 1961409 1860266 1817222 1770159 1708073
11801 1708073 1652454 1594783 1573622 1562218 1561384 1565299 1523509 1513777 1500606 1493445 1474815 1471711
11789 1471711 1446288 1433427 1435123 1435554 1431464 1417020 1409964 1414656 1434270 1440974 1417962 1371831 1370727
11776 1370727 1358829 1342408 1314834 1290007 1302904 1280614 1271055 1249076 1271334 1279755 1240329 1239401
11764 1239401 1227295 1190682 1154314 1131377 1097809 1057434 1028069 1004522 994458 1007198 1015838
11753 1015838 1038447 1053111 1032313 1029736 1032944 1005943 980143 969567 959124 946995 970999 965631
11741 965631 971631 979243 972415 961980 940363 954650 998739 1003253 970593 957297 952439 952825 932657
11728 932657 929645 929323 907579 917130 931324 905746 884132 896828 889966 833759 795138 781721
11716 781721 797146 822070 830119 848441 832163 812110 780027 765772 762757 751628 764994 765204
11704 765204 757905 763188 758440 731397 716385 717006 707234 729718 746701 717604 690390 688821 674410
11691 674410 661285 657155 637820 654200 665412 662700 647586 640873 658734 672992 672040 674675 638947
11678 638947 630496 627141 627923 637016 637109 647909 628106 610944 621496 622327 610654 621265 611717 597853
11664 597853 583372 599009 605786 615097 636084 611117 595011 599829 577923 582100 570574 542588
11652 542588 578311 584260 606972 634985 622205 565346 552551 596978 606709 614260 609324 597362
11640 597362 574015 599943 588250 590209 583289 541911 533062 539861 546549 570573 587891 599235
11628 599235 572515 571484 578822 594461 613294 600985 571481 560763 548585 522593 505469 508003
11616 508003 530423 557543 575177 578352 575698 562124 564482 564764 568033 567644 571000 588097 594239
11603 594239 577377 587021 626566 640816 630861 628012 633718 659402 662378 667768 686514 712320 762471
11590 762471 823851 858089 859061 876920 890782 910263 939721 922864 904020 908111 898044 898174
11578 898174 876378 884882 928935 939863 899581 879869 861076 844712 843442 867403 878189 871543
11566 871543 880227 910572 919983 967823 998677 991114 1015534 1037030 1074857 1059927 1067335 1104287
11554 1104287 1126112 1134998 1167305 1186906 1215950 1304627 1380358 1467547 1559295 1612937 1674703
11543 1674703 1744086 1765357 1724027 1678373 1621587 1554651 1481880 1410682 1353795 1282926 1254018
11532 1254018 1213964 1154032 1107058 1074007 1057686 1023331 1011615 1016410 1013801 999286 970427 942127
11520 942127 940342 966467 981972 955515 931099 933280 966874 972968 950074 970018 981298 970874
11508 970874 972164 973158 965846 961966 987580 1024308 1058394 1083363 1041353 1026788 1023694 976897 903802
11495 903802 860171 835389 818537 774351 734853 714961 714500 697084 656540 656255 677799 637417
11483 637417 594202 595056 597024 586888 577350 560182 547479 568314 578230 574516 548758 519500 506340
11470 506340 505544 530493 524034 482343 459813 456112 457101 449231 431350 457468 450085 456832 465404
11457 465404 449125 432488 428045 428748 413407 403184 386702 396288 399621 395537 414128 405197 412609
11444 412609 413644 377944 350174 333280 324102 355673 387517 385248 396401 406697 382900 358413
11432 358413 357355 364541 382608 394532 374714 370045 347437 334233 337179 326180 310550 303794
11420 303794 303616 294598 275201 274828 294651 292567 298719 324453 300598 270559 253989 258591 290986
11407 290986 302504 292877 292718 291423 290468 292384 289370 273694 302486 329284 341290 320818 293928
11394 293928 259702 269640 297535 294667 281885 290229 300498 332795 309617 289096 286441 288785
11382 288785 283983 288642 279970 278990 303970 306644 294685 289005 280364 277326 308859 283800 259830
11369 259830 250461 261425 273543 272833 290482 280983 255676 294495 317014 282751 229759 233345
11357 233345 243277 227447 235187 252751 232299 238297 259507 296218 303782 300474 306644 313836 296597
11344 296597 273798 256985 241688 232459 247776 267398 288372 284245 269913 271369 282743 277143
11332 277143 274335 264467 242959 237357 234685 229094 245587 258877 216377 222858 224622 223222 234469
11319 234469 225265 253424 274465 262134 250014 230445 224528 221661 228317 254871 288260 285277
11307 285277 261497 240839 242690 242554 235364 241372 247977 271778 277116 253878 221190 236909 230986
11294 230986 226632 226054 229216 236491 271198 259766 230384 227653 231111 225657 228836 221133 233577
11281 233577 248165 254072 253707 246637 272720 253784 232454 229733 218577 206006 208306 196342 209879
11268 209879 228926 221191 209539 223563 239664 237053 230738 240607 207858 199385 195309 193019 198165
11255 198165 198125 206842 213062 236440 243521 217100 223676 232566 274616 274849 248106 191680 153795
11242 153795 134919 142015 162975 176625 207379 240655 250331 244482 230563 241735 225226 211850
11230 211850 209446 217957 199976 167074 162615 142094 144461 165783 167217 165288 179400 203169 226571
11217 226571 236073 249179 229902 226315 235180 246418 229066 205786 181320 194021 195889 192664
11205 192664 190275 175827 183519 202315 194736 182765 191947 198049 164561 158614 183945 185853 182041
11192 182041 154620 168760 200791 222615 224292 203570 181189 170869 178716 200951 213263 216801
11180 216801 217921 198138 170646 190389 202486 225595 254545 257535 244368 241586 242719 233129
11168 233129 248566 217947 212044 208658 197768 189203 200926 202836 199656 206311 226942 224372 195725
11155 195725 170087 161582 179932 177075 175293 203364 204835 168206 164532 170391 167883 180036 201552
11142 201552 213761 209468 203225 183720 174784 188020 189340 194592 211547 195962 204104 190823 163690
11129 163690 156229 147374 143740 140757 167125 176717 176654 188614 169333 142183 143695 188224 195770
11116 195770 173444 145509 163827 198374 209799 200128 171148 179084 200380 198963 180346 179685
11104 179685 197518 196100 173118 169459 164429 145337 165950 190559 196951 171792 170927 165254 160215
11091 160215 169942 177765 172332 156234 161983 175316 180636 202949 209705 203260 196740 186922 165935
11078 165935 149809 133791 138164 155232 145569 141514 127370 125759 130158 124566 113269 128963 138566
11065 138566 150210 163992 179073 144955 123469 130460 141846 122510 124946 131677 136705 136185 127747
11052 127747 145757 161447 168745 124329 120518 151773 171334 165273 151059 155617 161498 163458 182112
11039 182112 193316 175178 155440 134277 140729 152121 169008 166581 189551 191238 168452 133189
11027 133189 129077 134229 116870 116608 143049 147987 152835 143144 146360 131561 123299 120989 130875 154515
11013 154515 174890 186379 184344 179637 173520 149826 148959 165976 183828 187051 176196 186163 164862
11000 164862 134084 141642 176671 203849 196300 191844 160847 181364 195153 200544 152155 147576
10988 147576 171684 133508 110717 123326 137126 127709 133383 138060 135869 131770 106982 101125 112760
10975 112760 136584 125289 128887 119102 112462 126313 147691 186081 181809 164138 127212 113762
10963 113762 151047 161226 166874 177663 192096 200897 191957 176313 181121 188736 186462 181288 159906
10950 159906 151699 160054 167318 174062 173782 186703 196162 168340 163701 166599 164919 170257 144852 142249
10936 142249 152529 164878 160412 154756 161616 162972 140991 158234 183278 180773 157271 154041 146398
10923 146398 149339 159267 149972 167900 151016 157255 117200 90181 98090 142315 137063 130370 145683
10910 145683 171400 198979 181209 144824 171800 192866 178738 158986 128753 91709 103300
10899 103300 123178 129532 123009 124055 133451 123089 133360 137651 124282 94304 87383 114706 118926
10886 118926 125408 126102 129260 118537 107464 131550 134010 110106 121051 138692 117517 80897
10874 80897 107256 136654 128004 112046 115787 109814 136893 146528 154746 146682 158738 159496 159821 154414
10860 154414 127781 84889 100361 137416 144552 176968 188767 172070 154003 136200 138326 110536
10848 110536 140408 155868 157702 146458 141067 167565 169729 175989 195928 187890 147149 159747
10836 159747 131675 122548 90175 91806 112047 111416 110909 82077 81339 126424 144938 133695 116396
10823 116396 130520 135506 97264 103827 116713 105927 107340 93259 82852 98860 94676 88582
10811 88582 125531 150602 125405 117321 105560 79960 81293 88820 113531 92961 116214 113695
10799 113695 131367 147397 156304 146879 138051 141256 136648 110973 106743 111931 122700 136553 147580
10786 147580 157518 168523 162336 116841 80200 70596 77344 96396 105363 106325 99783 99729 112739 143004
10772 143004 162255 152819 134882 124533 141394 134829 116471 119403 141119 156785 132861 126166
10760 126166 132903 134162 139035 151982 124330 122755 126937 133996 140705 132175 132117 128938 131899 113826
10746 113826 98904 114672 115849 96832 97708 104646 121586 133552 139812 144594 126361 103864 104964
10733 104964 122252 143971 161260 183180 193232 187509 171057 160203 142267 122226 95650 101462
10721 101462 97780 105200 120070 106526 105249 88366 102213 126292 127016 114988 123460 141498 124708
10708 124708 134153 128068 120230 101558 93539 101327 84660 73981 76528 88985 107057 104636 125285
10695 125285 133815 124022 114823 107406 125053 149452 121663 86458 56413 47494 69513 88768
10683 88768 103635 116613 131416 113195 91502 84113 127585 139038 134684 125193 143797 143604 118776
10670 118776 110894 116869 98121 120424 148350 149917 128231 112674 120548 124826 107101 129091
10658 129091 124573 145080 130753 81104 62725 83351 107719 118531 132730 138355 155837 168209
10646 168209 145631 136865 139995 151066 151633 130259 81646 81967 95148 102485 116091 89260 110804
10633 110804 107476 123973 111665 85785 87300 72423 71324 90176 107920 108335 76417 77106 85669
10620 85669 92616 96489 109914 104918 121370 119035 116341 115292 133389 112656 73762 74275 60847
10607 60847 58209 53782 65520 51693 41549 76103 86404 78641 60571 74528 80648 76914 71684
10594 71684 85192 67182 56417 69707 86152 119247 105577 76699 45761 59050 77288 60439
10582 60439 36508 34276 61177 72317 80031 106702 89966 69994 71432 79330 103742 115040
10570 115040 138290 156171 156660 154986 119566 106245 103264 93401 73021 66855 119354 138593 149590
10557 149590 131131 91190 64804 64680 60432 73975 89950 94100 104604 104532 113678 106691 113836
10544 113836 95500 78509 69871 90201 107767 114464 114401 89223 48950 49887 86999 114502 125949
10531 125949 137985 136341 115891 98529 124356 122088 105114 101857 93668 84449 99975 109616 133662
10518 133662 143449 134159 110221 108416 120377 138424 146960 151263 167205 134790 101530 69164
10506 69164 60246 77056 93583 84488 71691 80271 76963 72130 90374 109259 116509 90443 93980
10493 93980 70649 94724 115597 99108 88525 91425 92145 87567 103323 96283 101856 104309 132298
10480 132298 128815 110128 79318 82716 107609 133701 135172 150259 159821 153007 125005 96723
10468 96723 82466 79116 100109 137478 119432 86652 83787 81562 85841 74546 67346 80874 63420
10455 63420 50796 59826 68245 102892 108267 88312 66660 84283 123057 134309 142036 126207
10443 126207 101413 80147 90749 101340 109954 106834 109449 123630 127951 110182 108381 109704 101506
10430 101506 88469 73973 88213 87130 96436 82506 67380 75687 83388 92339 121117 120211 135798
10417 135798 148052 132547 112490 105606 135007 157684 152873 148547 146762 163409 170035 152671
10405 152671 166106 150639 131008 150027 145148 132329 131289 127513 138284 126791 127591 156621
10393 156621 132586 133885 76744 65184 91036 104455 117742 95587 97114 120797 118476 90736
10381 90736 95650 108747 101958 112485 140122 147221 137516 126355 107933 101568 110904 130582 162701
10368 162701 172693 181079 188843 143754 120599 104340 114502 134319 150241 159828 166680 148991
10356 148991 137251 143561 131217 136556 134590 109099 79868 95854 100741 107286 124154 126347 119053
10343 119053 99263 115625 115247 122522 111648 115008 125141 108721 120029 116504 98172 88028
10331 88028 82650 114366 113621 106122 115910 118449 117237 94034 101623 106453 113313 133467 171182 177619
10317 177619 168137 170380 156405 139710 149758 139064 135117 117997 113611 99124 88095 86921
10305 86921 92324 96905 87457 86359 87368 91981 83296 94781 104886 132445 135340 127893 118623 126669
10291 126669 119410 100992 84740 79451 102151 131810 142820 133915 159110 147701 96463 98144
10279 98144 131960 110377 105885 124019 143171 144624 135788 126230 111969 106375 126381 105719 88036
10266 88036 101455 106010 77140 48215 59785 83482 89003 98565 106751 106918 116493 119718 129297
10253 129297 121066 122187 139632 140697 105784 80361 80279 83877 80642 59275 52480 68783 69548 83362
10239 83362 114200 132377 102808 66752 100437 134938 136490 136875 137808 97414 104392 123456 104618
10226 104618 93629 87651 92169 92193 103016 115178 104054 128175 150188 158176 187044 207464 194209
10213 194209 230091 286900 314524 316141 305241 292341 265294 269388 268091 271058 284697 281475
10201 281475 251225 231246 233945 210501 201657 182001 175925 162768 146500 143498 160352 157674
10189 157674 159599 149988 145595 156021 165316 196305 215317 221253 251995 243660 265906 280429 295428
10176 295428 300391 356496 410533 457247 544561 626036 696720 755904 822669 867094 895029 922740
10164 922740 931632 890759 837913 809332 746323 668133 622713 570337 529009 481162 478090 472973
10152 472973 433623 419860 421149 397792 360563 351470 347938 340952 342801 317386 307217 322809
10140 322809 357610 385064 385151 383097 408113 458555 512597 562682 608046 676926 776295 881296
10128 881296 949788 1044050 1176964 1298517 1344865 1419902 1508334 1547683 1506355 1432493 1320151
10117 1320151 1185866 1063721 956743 868324 798056 735751 666540 621249 596801 566342 536091
10106 536091 500276 506064 492330 467968 443226 431835 433886 425481 394102 377108 353363 371028
10094 371028 402106 440510 436144 439164 478313 517342 546712 594359 643143 701821 785526 899874
10082 899874 1042290 1130933 1159572 1171033 1140241 1086845 1016888 937592 859088 779221 734181
10071 734181 662787 602972 567414 548064 499946 482930 480835 477276 464292 442509 406250 408991
10059 408991 392839 381318 388990 406788 363896 344177 345524 331746 321921 328405 333775 340411 371774
10046 371774 400488 391506 385351 400042 417054 447948 482656 513255 531436 554070 568717 557277
10034 557277 539399 526959 512141 497489 496361 481354 485969 443330 383514 357038 345343 330713
10022 330713 324564 331358 349538 347785 379026 438682 480406 558458 785492 1151115 1543995
10011 1543995 1713187 1717894 1507754 1236018 1072379 990273 920957 813309 744112 688548
10001 688548 634708 598707 561151 514449 460322 411281 397822 439929 476592 466428 429213
9990 429213 424671 456221 445474 428918 421084 434611 454917 476720 454618 449193 447708 451635 443866
9977 443866 450445 457680 466898 487099 497052 496953 522408 562120 627661 677230 751725 882477 1043568
9964 1043568 1280946 1632950 2023103 2287494 2324342 2136115 1819928 1563110 1422576 1297878
9954 1297878 1182899 1078008 993347 908267 869399 849880 822798 829424 844419 852874 850782 846126
9942 846126 864769 886425 882376 883488 857403 820665 780916 739553 728785 763547 733220 657609
9930 657609 628713 648208 678277 677383 690590 716337 719445 751677 799370 805119 813454 829396 834908
9917 834908 814594 809101 820670 830594 833040 800530 760545 732643 740848 745323 752567 771980 792940
9904 792940 814343 875588 900673 917513 991669 1052390 1059296 1034324 978866 904376 837065 743922
9892 743922 666614 630016 590225 563043 540100 547561 544817 577308 584502 609404 625633 644166
9880 644166 688330 735705 794099 805021 803451 821970 837289 843033 799480 777021 769770 718404
9868 718404 703125 667603 659969 692512 747183 776704 813898 854527 933421 995068 1044957 1040154
9856 1040154 1053019 1113404 1168310 1195725 1205704 1219500 1256586 1258238 1254888 1241165 1237501 1244867
9844 1244867 1264274 1302545 1324929 1343373 1395602 1473754 1578597 1693990 1820096 1956073 2072585
9833 2072585 2194518 2305945 2364135 2383103 2476467 2604738 2742806 2916917 3105308 3315387
9823 3315387 3512986 3702331 3932095 4171316 4440794 4755557 5135498 5659237 6319015 6999582
9813 6999582 7520025 7746167 7642831 7273954 6861468 6545843 6311894 6104580 5918347 5739473
9803 5739473 5573251 5489274 5486817 5533979 5659970 5914849 6299640 6829659 7490658 8278815
9793 8278815 9136539 9995307 10772071 11340586 11708428 11905508 11957629 11881217 11683960 11411820
9783 11411820 11109081 10803008 10519912 10267969 10071024 9900046 9803484 9782016 9799620 9875284
9773 9875284 10014301 10242170 10563005 10993623 11531611 12182241 12936457 13762017 14747452 15876052
9763 15876052 17233405 18881168 20893947 23457385 26712712 30918666 36429351 43611576
9755 43611576 52923650 64634384 78599972 93517990 106685310 115276268 117751991 114468852
9747 114468852 107468557 99237632 91396461 84555178 78845365 74408947 71406054 69976422
9739 69976422 70240379 72255819 75996547 81260592 87677633 94829192 102086847 108917355
9731 108917355 114978534 120154081 124367432 127649748 129981823 131264208 131386410 130364084
9723 130364084 128335743 125562844 122464465 119599749 117481532 116513974 117212746 120261071
9715 120261071 126721913 137833347 155044667 179560139 211647544 248968875 284261321
9708 284261321 308356246 315690286 305777549 283695191 257410704 232149345 209756385
9701 209756385 190567094 174588923 161973477 152632159 146306870 142606363 141044209 141090051
9693 141090051 142219871 144015166 146154174 148280357 150012949 151064036 151309044 150683412
9685 150683412 149121179 146398246 142123089 136153674 128821956 120798690 112878919 105653457
9677 105653457 99447838 94427410 90683037 88348912 87602665 88626268 91722207 97126567
9669 97126567 104945870 114705932 124901625 132964171 136484659 134360023 127243611 117192912
9661 117192912 106417180 96224117 86999906 78728280 71431493 65123978 59747843 55157825
9653 55157825 51230370 47855426 44932268 42370713 40103905 38049580 36187187 34467917
9645 34467917 32909022 31497429 30224426 29108466 28150711 27321348 26573722 25895315 25334934
9636 25334934 24824463 24361299 23972580 23665333 23475585 23392553 23384927 23405279 23357989 23183299
9626 23183299 22874939 22370042 21626263 20733026 19772571 18804600 17871409 16986822 16167129
9617 16167129 15417261 14754038 14150777 13656399 13200023 12830281 12511445 12237416 11974656
9608 11974656 11757902 11567196 11404848 11235675 11079718 10933104 10796939 10606219 10384534
9599 10384534 10137654 9854878 9554440 9240238 8909597 8618788 8334324 8039366 7765836
9590 7765836 7465771 7119590 6796262 6486165 6182429 5865477 5541034 5272456 5039865 4851534
9580 4851534 4715884 4580317 4462161 4368088 4282790 4177944 4069619 3964490 3866627 3755406
9570 3755406 3634306 3484802 3360575 3258883 3157624 3052164 2932936 2824755 2731600 2636556
9560 2636556 2524484 2443507 2397444 2339101 2267693 2189691 2138869 2109784 2081791 2073611 2055391
9549 2055391 2010276 1973172 1914191 1867333 1810040 1738063 1688081 1655762 1601797 1527866 1463167
9538 1463167 1424471 1359454 1335528 1324338 1313552 1320247 1326029 1336980 1346731 1341052 1331348 1336041 1344084
9525 1344084 1308380 1293154 1254484 1190918 1092528 982711 855557 750955 682695 642359 638517
9514 638517 634810 661785 687566 691565 679625 716634 740582 765485 798308 784928 743394 720603
9502 720603 711895 704833 680422 660946 646872 638817 620463 627725 631768 619148 617520 592642 590786
9489 590786 632859 642859 656631 673180 673165 679470 665586 661496 649722 649674 629809 574497 542261
9476 542261 535699 488622 430583 443938 476281 464717 438650 458261 476163 480608 494944 513084
9464 513084 528624 506358 499671 507164 511905 521874 506325 459423 422309 426885 443246 448815 485918
9451 485918 515449 529208 534438 493281 466079 455144 438565 439712 463007 440327 433242 455819
9439 455819 446531 434379 431351 426206 429955 417657 418163 409618 399144 391065 367975 357465 362228
9426 362228 353894 352273 361145 367250 391938 382320 346006 301272 325788 351606 358489 338492 333830
9413 333830 340647 323984 338812 352963 340416 328417 314429 311446 326662 326344 320975 317504 313284
9400 313284 317685 302269 291598 319025 332775 301176 287938 292603 280610 277254 293705 294156 276758
9387 276758 258536 253198 267592 302331 318587 339094 351708 375149 390272 394167 432992 474515
9375 474515 499562 517254 499748 516192 536638 537621 512524 477572 448449 428956 421511 411371
9363 411371 404850 410895 408473 387748 374523 376658 374374 328991 310437 321352 314970 315634 336136
9350 336136 357412 339708 323356 326155 350788 373191 386279 387385 410925 444711 455215 460360
9338 460360 486730 505462 536709 614889 730697 873073 975809 1104559 1202682 1267573 1288286
9327 1288286 1281834 1208540 1120262 1045289 965934 866983 808857 774847 719338 692259 647643 598918
9315 598918 574955 537840 522603 508940 459159 435321 436580 427377 409689 421510 437829 440584
9303 440584 456514 479566 470224 450634 471100 472253 507054 517168 597320 665427 736408 837705
9291 837705 993574 1149453 1279436 1419303 1512657 1584222 1586682 1531274 1471843 1389758 1286221
9280 1286221 1175280 1078892 1016067 939246 887589 805952 733180 705066 667638 622334 576646
9269 576646 521161 525237 517500 507003 492866 499355 495631 496274 475688 467092 464839 447996 450258
9256 450258 436289 416342 445989 478981 514900 524323 560735 628901 696647 784627 875925 909340
9244 909340 919753 973708 987636 983577 971028 955949 943567 888245 818484 742840 690421 631534
9232 631534 573297 557089 511138 485849 469755 451210 453287 426341 410247 420512 417559 396481
9220 396481 384616 353947 349379 343387 349281 325320 295370 286281 295596 289408 277979 289870 312523
9207 312523 336088 331793 367114 376766 378423 381106 346073 333156 357604 381046 371635 361671 357628
9194 357628 381427 383586 374230 333787 284396 252531 267194 265352 268256 259654 249654 247258 254074
9181 254074 228224 195505 172634 159852 176077 200545 206225 193514 188250 204118 211386 176824
9169 176824 165273 176116 191786 205975 224235 227433 221487 221805 215455 202198 172881 156571 176195
9156 176195 178092 176690 140042 115746 135864 173121 165589 140373 155819 174533 152013 150324
9144 150324 173966 178542 164135 161523 160735 157140 163032 168939 181934 189062 168364 151307 160705
9131 160705 166374 156173 127674 128392 114908 127272 146990 166141 178866 184474 158023 145209
9119 145209 163870 164195 148200 145843 144101 122428 128624 136220 158721 169953 155973 128097 118481
9106 118481 127760 110124 120449 137765 174770 202852 207802 190085 138021 119111 131229 128990
9094 128990 134974 125204 110464 138385 164598 161713 152370 152941 146283 134893 119573 110910 140504
9081 140504 168380 173780 185143 200325 166333 180027 181535 179328 180096 156178 117358 119342 141505
9068 141505 169595 176366 137074 138359 156009 165214 158630 158317 123319 105760 92119 96402 79107
9055 79107 62946 78463 86547 87783 68045 99976 107409 109147 120855 141819 145166 125845 105187
9042 105187 121060 136779 121087 95873 77952 96925 123774 105064 95999 102953 70902 75147
9030 75147 104224 132393 144481 145294 134310 141307 125338 95325 92964 87655 85823 85614 84264 106227
9016 106227 116370 93357 87580 80193 64374 70943 71267 67049 86912 129026 137946 117436 78016
9003 78016 58409 54555 54095 69939 72086 110063 117100 108480 81326 80455 85453 98200 100182 101842
8989 101842 84773 61951 30600 39462 75611 86672 59833 65056 71906 48227 56109 94234
8977 94234 111361 117792 96721 108891 84704 78156 109909 117069 114887 90831 84240 96479 124056
8964 124056 117236 118376 102155 109290 97052 79056 90013 76837 82329 80716 64365 63316 79405
8951 79405 79356 80865 57983 60986 99051 124049 116558 106011 76184 72531 72298 80238 85067 90688
8937 90688 124039 152656 140190 113407 91017 77583 76180 57604 74639 74146 91150 91055 97952
8924 97952 109922 97269 116403 125003 122825 110917 92504 79358 62717 52186 49867 60089
8912 60089 69485 85771 80813 64521 83148 119810 102466 66023 46617 70914 59131 56437
8900 56437 71108 82152 92828 75912 64934 48104 81990 126186 130142 103641 92815 66814
8888 66814 35052 49410 62630 43443 25992 47401 83401 92255 110743 103364 97094 106436 101365
8875 101365 121234 112488 126751 111437 95119 113255 119876 114523 98250 95407 121125 133699
8863 133699 103427 85900 94801 61583 41772 59803 64191 77347 70704 85983 73261 68951
8851 68951 84916 107483 112722 115543 70854 54907 65286 56494 58755 83189 105740 104422 99632
8838 99632 74078 72019 96381 95870 98879 81329 81573 88383 83754 92917 108461 101726 72524 45184
8824 45184 41797 57404 75824 86721 72971 53579 69650 98496 126954 98338 76221 92731
8812 92731 110502 125861 101044 82763 84416 104860 76908 66264 84279 111808 125969 106715
8800 106715 98068 99918 103589 87805 45296 32561 75565 113551 125598 120937 129298 120597 122505
8787 122505 112576 90653 86538 93527 80996 67647 57257 75326 80748 47303 52639 60689 67294
8774 67294 57833 46317 26876 16252 14258 46541 85288 93365 93287 104848 62078 52080 86693
8761 86693 109753 105403 78289 64889 62488 50255 33670 68747 88063 75432 60546 53124
8749 53124 72337 58557 44495 37824 52425 64671 64273 94893 134387 139487 135863 106570 79435
8736 79435 59216 60104 78685 101618 75453 72570 71436 79544 68485 61635 53484 83506 96149
8723 96149 79630 101885 144553 125984 140072 159156 175840 174727 168352 133408 120736 125487
8711 125487 120108 121942 149676 122736 101678 81553 103273 91914 71172 68788 74199 94505
8699 94505 128472 125587 124728 118686 116853 103711 77421 92782 94781 101101 133852 131042 114383
8686 114383 99119 112162 120664 124685 130773 101349 96486 105034 142915 139890 113110 103727 115419
8673 115419 143544 143265 141487 129313 86711 99221 127684 150301 151690 145952 130916 116049 126029
8660 126029 133969 143898 149299 149075 117900 111310 114138 114410 128631 116670 104192 119897 119613 118651
8646 118651 90148 79424 118310 156476 166598 160679 152397 172090 166561 179174 168845 156187
8634 156187 145924 161411 162868 170513 172447 168305 156635 193376 222228 213425 195711 209476 235398
8621 235398 248119 273163 290186 318207 399789 497702 614486 720404 766562 726160 621371
8610 621371 528654 474469 423847 382120 334419 296037 315850 309261 290674 265585 248579 216691
8598 216691 238577 277603 283301 301858 309798 330773 310051 311686 327400 324774 336757 351811
8586 351811 344167 354178 397496 406496 425064 449768 496449 545738 557397 596464 644590 679723
8574 679723 745904 861548 1017074 1257500 1600107 1855009 1914232 1846161 1647993 1441712
8564 1441712 1296208 1184243 1066043 954326 825897 741097 688642 624239 579180 559963
8554 559963 531684 501226 477777 458511 420927 386464 368417 351465 354506 359521 364894 347072
8542 347072 331913 312833 282228 263607 260229 232652 224291 234601 253123 251025 252428 271890
8530 271890 298305 347803 426744 514832 609344 715470 785945 796877 772160 687279 597087
8519 597087 520936 481636 459073 412633 357413 328579 307264 284298 279375 270709 268380 241075
8507 241075 226231 246549 249892 237997 217240 214188 213009 215924 236478 239175 209884 201972 185824
8494 185824 177090 191280 190411 174815 171837 182093 179479 169666 182996 193587 205964 212787 205258
8481 205258 192319 195029 181615 159104 130761 140613 158057 128141 109819 115450 119267 116800 68292
8468 68292 58761 73716 89327 96964 115528 101463 120854 129870 100106 104934 102343 115034 118983
8455 118983 118069 138855 154295 115357 81634 80585 108360 110703 94938 53692 55702 56993 60309
8442 60309 91170 79976 70076 76108 71625 68585 91281 63007 52750 76436 98878 81027 83162
8429 83162 103478 98085 75893 48998 88386 86648 98217 95517 101042 129586 128585 111797 82726
8416 82726 105421 124305 88390 69196 103282 103565 95417 85410 92277 103082 122145 123714 117521
8403 117521 146525 121509 96724 71051 73604 57642 35020 14179 28238 55686 58046 37866
8391 37866 39113 54141 67425 61033 44666 46101 43641 39158 40477 48729 65285 93766 82365
8378 82365 58727 50424 47366 62915 74506 69912 64677 46522 50187 71233 80306 85949 101111
8365 101111 88503 80349 90960 127544 93461 71630 76203 66340 75785 63467 50138 39411
8353 39411 35509 45346 46189 32328 64920 74649 58708 37925 43241 44294 59506 60630 39711
8340 39711 47976 42211 39475 42366 12268 4209 1488 15634 56650 96281 76694 47673 20831
8327 20831 42191 69943 61876 21145 12142 34151 45432 48408 37512 30580 55699 67964 42002
8314 42002 39656 58226 28357 -4851 -3583 11538 38837 34212 39959 28510 10362 12595 36856
8301 36856 61352 65075 55023 48974 57171 37252 25645 31516 32731 33793 28094 33539 33819 40618
8287 40618 23202 58 11427 18128 31400 51044 41007 32840 40191 45335 15418 -978 10112
8274 10112 -4671 8136 42722 65396 87035 73623 48486 55353 66738 64413 63479 70603 80240
8261 80240 78525 62723 32827 10786 13906 31070 18183 8725 52154 66229 65653 54325 32716
8248 32716 30480 33477 29891 17124 8591 37965 36127 27457 -16038 -24921 -8494 27445 47338
8235 47338 44878 40313 39632 46283 36304 42218 55898 49470 46312 58094 48269 35847 35904 66255
8221 66255 67704 65444 51693 18124 25993 32073 44184 66411 42232 15416 38160 32562 24247
8208 24247 -1370 16676 32350 43052 56756 39523 49645 83684 84758 60760 63562 46202
8196 46202 14518 1738 18825 21366 22252 42598 58707 40735 12558 8786 29324 23932 14830
8183 14830 -8034 -7791 -3736 10423 10096 27703 37488 58510 53301 14300 -13185 -9383 831
8170 831 19280 33032 20437 32175 13725 34974 42013 47405 62430 65118 74012 88997 71989
8157 71989 91538 83893 49755 10597 -34600 -7678 20710 38795 44367 40548 42011 31808 51131
8144 51131 75846 78187 77325 71545 82007 111675 106126 89878 69435 45402 58365 62807 73850
8131 73850 46547 8126 16410 21686 3526 -13331 -6465 2772 11999 7631 -18522 -4176 14780
8118 14780 57080 94652 107150 90217 75874 56651 73143 101171 120240 132862 150293 150549
8106 150549 158046 146900 171452 180854 200777 218748 230494 207667 157533 122262 135915 129362
8094 129362 111669 129444 106296 106278 100868 85285 74534 62648 86317 95000 76778 55157 62673
8081 62673 86584 105819 79583 79310 104546 89102 92483 101193 132301 146772 150166 154882 176462
8068 176462 184917 198457 228388 242415 272811 335325 355679 351818 340904 325279 259737 235226
8056 235226 232841 235673 217925 218012 214311 173434 135115 159652 181412 182627 205889 201513 195546
8043 195546 201972 237216 238370 238406 222569 232364 212361 172661 184220 175871 170441 189999 179679
8030 179679 150268 148911 122813 107751 80091 82432 82628 100552 120605 145953 177135 217360
8018 217360 183382 163352 179608 181888 171081 154928 151915 167049 174641 147151 149219 170648
8006 170648 183592 163980 161538 193919 199261 209272 237953 233452 224196 234302 242416 226410 204640
7993 204640 186890 181034 186616 192995 189716 183012 178203 186257 192338 179532 203185 211881 209444 201690
7979 201690 189654 191423 221823 258582 254685 241214 235059 205579 200083 214099 209018 208914 202499
7966 202499 193549 184242 184819 171373 143212 130507 144815 140397 146336 133386 143994 139238 156873
7953 156873 149141 148671 148583 107736 88312 109326 124454 112348 98173 129015 158136 184144 186089
7940 186089 186003 184951 193233 188365 191457 193711 206003 210633 201248 193229 199757 190835 195134 208408
7926 208408 185185 166095 202177 234739 228181 187776 166918 171274 176328 159716 165108 166153 160618
7913 160618 169474 187725 167788 170943 192952 188922 190149 181368 156421 142443 151462 151050 140521
7900 140521 154086 159188 155089 154295 171900 164753 146204 128995 110422 111687 113764 118263 104876
7887 104876 117841 121620 97834 85774 79710 61750 53281 52055 77753 82968 72697 92462 90465
7874 90465 118209 110112 75869 68927 49338 46151 46529 76123 83617 74592 44463 47065 60627
7861 60627 72096 83955 80888 61659 68186 78515 72312 55266 70143 58175 43952 35180 37954
7848 37954 56701 54794 65440 30747 11422 30354 68680 95207 92104 54737 42822 63161
7836 63161 67923 34629 32140 43082 69207 94828 114642 97665 92194 111288 86515 60685
7824 60685 72604 87228 95805 74745 53798 49754 43881 71776 87310 81012 78509 61196 49546
7811 49546 54094 49742 43626 37519 27987 41414 60102 34709 14572 37712 20897 5874 -3871
7798 -3871 -1353 19132 15240 -4350 5913 47107 40371 29490 53801 8416 -41278 -17248 16695
7785 16695 18962 20875 15952 18608 17355 15068 39693 45030 35434 60456 34462 38457 55875 58979
7771 58979 23895 5138 3963 34759 46115 18589 -3742 -7813 -2408 8300 4897 -1073 -7435
7758 -7435 -5390 16262 1685 -2917 634 5931 -6454 -13407 -6677 -6581 9524 29897 17068 22504
7744 22504 43296 37346 30641 35529 44402 79109 72604 62013 54157 7641 -5359 30250 35803
7731 35803 26314 15618 4804 13733 21193 4794 -507 34517 26920 -12173 -29142 -55234 -61212
7718 -61212 -46956 -63621 -61546 -19427 17018 -6979 11263 24594 24729 15858 6214 -13404 -1884
7705 -1884 1534 12366 14489 2466 21029 43908 26408 18638 14063 14940 23651 5338 23085
7692 23085 21987 30426 12757 9995 2522 9466 -975 -45218 -85089 -75697 -47579 -37055 -26375
7679 -26375 8262 24464 5660 -6712 -22721 -17896 729 16078 29797 12125 8114 17722
7667 17722 -3252 2010 10407 14715 -2503 -9717 -1820 -20770 -26712 7338 1452 -23586 -41141
7654 -41141 -51382 -28794 -34093 -21911 -7960 23197 17681 -15913 -27149 -8429 15960 13277
7642 13277 -5555 -9861 -12105 3538 -13713 -38967 -35179 -25994 -21767 -8119 10723 10634 20875
7629 20875 30018 20793 8729 -28892 -1704 7627 -7693 17484 31214 -2420 -3079 7285 -6064
7616 -6064 -9913 30922 40330 -2050 -9093 9655 689 505 -15318 -16455 13125 6247 7712 -4606
7602 -4606 -25876 -19783 -10454 -13765 -28837 -28072 -17334 -32631 -15612 -20766 -14385 1616 12523
7589 12523 15767 -1766 -44969 -69358 -59258 -50369 -37535 -26977 -32399 -19097 -19237 -6378 9581
7576 9581 2299 4317 19020 15014 -6095 -6350 36896 18162 -6741 14729 -2570 1596 3978
7563 3978 -14829 -1912 -1380 -6533 20 3385 11448 20974 10468 5387 -8152 -14871 -33511 -37855
7549 -37855 -33176 -19076 -10520 -6722 3271 4646 8205 41326 6606 -37159 -35434 -14805 -9756
7536 -9756 -14866 -474 9717 3870 35312 12752 4747 7854 -16160 -33418 -1759 11049 35510
7523 35510 23206 -12843 -6048 -17773 -30033 -13289 -36975 -29167 -6578 5215 8926 23009
7511 23009 25836 15940 4599 -19752 -13803 -31247 -26443 1659 2657 -13361 -29089 -1554 11320
7498 11320 -21670 -14871 -4719 11352 1110 10867 34581 68694 45429 20929 1295 -3662
7486 -3662 -8889 -20052 -33274 -32838 -15165 6204 2713 9733 -6987 -34694 -37736 -12597 -23683
7473 -23683 -10057 12607 16195 21855 29873 13127 26472 18642 5391 521 -17388 -40750 -59191
7460 -59191 -37589 -11872 -616 14528 26375 29973 -5093 -11915 -8067 -7171 -8732 24983 32577
7447 32577 14140 55345 85052 94037 99834 90009 65594 42585 22845 19892 10680 -9988 -46885
7434 -46885 -42208 -18267 -54872 -62728 -7587 24098 21193 36292 55761 32046 21223 33589
7422 33589 23022 26701 22100 17519 23125 6221 -21545 -28285 -47857 -74040 -84994 -53547 -8298
7409 -8298 -3687 16638 5595 -24497 -22143 -17152 -14489 10486 43143 68486 48584 41371 31610
7396 31610 37173 32547 9532 -16189 -24136 -40797 -57869 -59335 -48955 -8389 25793 23516 -16702
7383 -16702 -50761 -40572 -11449 -12883 624 -1664 -26811 -26588 -29823 -56874 -53122 -37610 -31278
7370 -31278 -30369 -2512 26728 7133 -15851 -46667 -16059 -5319 -26900 -10725 14490 19366
7358 19366 5676 -13239 -35081 -40466 -2849 39505 41074 22682 14682 4348 12959 -5486 -352
7345 -352 -13172 -3950 6206 -21474 -26068 -53120 -55506 -46422 -32093 -12568 1713 7737 20963
7332 20963 29215 17080 -26964 -24793 4247 13297 8594 7038 -5136 -14617 -17989 6838 38069
7319 38069 56417 32812 33680 49798 20828 18545 23303 40456 28120 -22128 -36032 -23736 -8413
7306 -8413 -20886 -21167 -12023 -13453 -27774 -41914 -25688 11755 37568 17951 -5131 6684 26262
7293 26262 14180 -13079 5135 7645 1905 -17037 -12553 -36183 -25923 -8441 -24859 -18723 -6647
7280 -6647 -12952 -13613 12511 31089 46357 27554 12243 -18686 -39443 -35692 -24433 -7932 -18352
7267 -18352 -10890 5388 10130 -8415 -22848 -22397 -31261 -32101 5451 23050 16594 -10203 -9242 -12945
7253 -12945 -38053 -27349 -10393 32068 44091 44308 16990 11385 10479 21435 -5253 -37773 -36183
7240 -36183 -44059 -56005 -37537 5112 34151 36908 8081 24875 11951 -4801 -21813 -10307
7228 -10307 3408 14691 19289 -1422 39738 59253 26669 11882 11875 12777 23676 -5416 -34010
7215 -34010 -40588 -23803 -20172 -14472 4675 7747 -14851 -10906 -11705 -10877 -36086 -47879 -31044 -27590
7201 -27590 -12336 6484 23343 27890 26191 18020 -25226 -21942 -2004 -12052 2225 20206 46163
7188 46163 33208 25697 16568 25470 19475 8652 -11679 -28899 -16184 11639 -1837 -30453 -20158
7175 -20158 -9316 -29209 -52213 -79246 -52305 -24065 10044 28741 23129 -17792 -51539 -53950
7163 -53950 -52288 -28072 -17911 -3268 9625 6564 -3889 -15395 -3918 15983 3285 -12553
7151 -12553 -15968 -5525 -3033 -5337 -3777 9673 5978 -6574 -1299 -11115 -7491 -2998 -15396 -15799
7137 -15799 -13003 647 14399 13016 23258 26951 18900 -4126 -17967 -59801 -72280 -60108 -44349
7124 -44349 -29382 -38090 -35365 -34589 -36025 -6046 -11036 1568 -1081 -25016 -28557 -29774 -10506 -6680
7110 -6680 -21912 -21295 -16915 -18847 -5119 -5223 -49019 -45576 -41317 -32780 -9071 19214 21354 25073
7096 25073 -11087 -38812 -32054 3154 15511 34387 34938 19567 3812 -2455 -2834 -284 -23775
7083 -23775 -16117 21895 16401 10952 19402 24715 1768 -3576 19480 16074 -7140 -44498 -72316
7070 -72316 -62121 -26249 5182 -38 -15800 -18153 -36517 -56805 -35515 -16285 -16854 -44228 -42936
7057 -42936 -18152 -15597 -3638 -1036 -22757 -39115 -40451 4886 9256 -5495 -21608 -25527 -222
7044 -222 -18147 -23612 -23212 -1289 -3037 -16189 11564 15140 14794 -11260 -7028 3334 -5683 -17622
7030 -17622 2196 -4351 -19320 -34364 -59468 -64770 -60322 -36829 -5284 10129 36744 37498 28334
7017 28334 4758 -5159 7935 12587 13953 8910 9331 10078 -6683 1264 -3032 12470 19756 18623
7003 18623 17296 17485 7702 -7752 -985 -18088 -20307 24367 29792 12664 17417 21408 -3878 -13370
6989 -13370 -19032 -47045 -54607 -49269 -30173 -2848 21708 2093 -25738 -3490 21920 43208
6977 43208 29147 45699 36715 22224 12921 -4017 -26145 -31110 -20598 -16830 -14046 -13816 -4684
6964 -4684 -6935 -4014 -28670 -43323 -65968 -41910 -17547 -28040 -6431 10258 22097 -3598
6952 -3598 6001 10424 7858 -2628 -15878 -7055 -16319 -4585 -10722 -30477 -46196 -71915 -64735
6939 -64735 -56404 -75356 -83401 -64870 1587 10475 15600 28524 29831 7906 -8671 -1412 -10075
6926 -10075 8706 3123 -13042 -6017 3157 -8933 -21114 -21646 -14187 -7191 -18448 -6240 14604
6913 14604 19869 26228 25011 17940 5574 -1550 22583 27277 15703 -20270 -13038 -18472 -3619
6900 -3619 -4721 -22577 -32507 -22205 -14282 -29905 -12400 -1033 -41536 -36386 -15649 -5214 -1383
6887 -1383 -2890 -28639 -39413 -19691 10835 16873 -15420 -28403 -9239 -1126 -4039 7066 20928
6874 20928 53607 25931 30565 10308 -15991 -13244 -22212 -12475 8575 5253 -11551 -22746 -42551
6861 -42551 -28497 -16772 -7513 7113 191 -19282 -31795 -23626 -16531 3121 735 -5168 -7174
6848 -7174 9034 12806 27461 18734 4777 897 -17743 -25381 -29981 -14614 -31540 -41282 -24221
6835 -24221 -11146 -8849 -9076 5810 -2634 -11464 -4840 30418 37231 19151 5414 1946 -16858
6822 -16858 -29997 -19577 -14316 -33900 -36745 -4905 8116 -12800 -5093 -6185 -16997 1926 23076
6809 23076 -5192 -24118 -31277 -5950 26638 34303 42219 11934 -12473 -30584 -36234 -7705 12181
6796 12181 354 -2298 11807 7514 3962 -13582 -21176 -26259 -17730 -6611 15615 19667 1002
6783 1002 17080 38498 27223 33752 64794 41786 6958 -1461 -32259 -50434 -40446 -10477 6258
6770 6258 2685 26880 31722 18587 21559 22270 32954 23100 -15960 -38224 -38944 -46097 -11977 6381
6756 6381 18790 16834 -5762 -41457 -32123 -5528 -2045 -14818 -19034 -9530 -27609 -23095 -28001
6743 -28001 -11976 3546 22944 7359 -19582 -7324 22160 16048 8791 -14900 9095 16393
6731 16393 3889 -8407 9583 16694 23589 7871 11113 14315 41344 67010 74621 73738 62212
6718 62212 50399 21655 23825 30686 46297 52783 47564 47475 64848 78802 83009 137234 166447
6705 166447 207813 260240 363175 454463 543775 639363 648244 599421 526215 445090 358150 301706
6693 301706 260242 216996 184876 151707 90287 60959 62461 65651 77734 59517 55669 51453
6681 51453 21445 19915 18863 -9855 -5449 18346 10152 8665 7133 10996 20386 8374 26527
6668 26527 52057 42318 23461 1368 -9090 -3476 4268 15101 16750 29857 38213 20149 6782
6655 6782 27135 65749 54022 26162 20182 -1651 2415 -16340 3468 20728 26357 16844 15762
6642 15762 22593 28323 14090 13447 11964 -4696 331 -4172 -11692 12113 7925 -5989 -5971 12894
6628 12894 -3775 -2738 11614 7651 21802 35682 21154 355 9068 10594 -133 -16155 -9852
6615 -9852 11097 -8003 -24196 1624 25535 -31942 -65788 -35484 14257 29177 33352 59001
6603 59001 50542 43201 -3443 -51227 -71900 -53217 -40531 -46157 -28781 -2015 25491 27432 16728
6590 16728 -3582 13532 11356 12712 6701 -20913 -34548 -22734 -16533 31452 41552 14560 1920
6577 1920 -3977 19527 34661 26029 4014 -15377 -24692 -28671 -26965 -36036 -11020 -5078 -22551
6564 -22551 -26854 -10595 -12271 -1605 -13398 -23330 -14310 15062 30243 632 1809 -6322 -17848
6551 -17848 7812 15478 17127 15980 -3007 17103 38887 21552 -4710 -9173 14840 28492 18755
6538 18755 488 -10065 -7441 -10142 8334 16542 19432 19671 23766 25805 33382 48029 52030 38626
6524 38626 17362 4642 -6878 -15870 2902 19377 37937 34848 13806 11799 39276 57032
6512 57032 77861 87593 78462 47349 37286 33806 -17512 -41069 -51948 -47591 -29081 -16579 -31524
6499 -31524 -20409 -25835 -19382 -27010 -25006 -45396 -74872 -49811 -7208 -3873 -30768 -38530 -33599
6486 -33599 -46507 -30971 -25177 -24008 -29316 -6821 1170 -5595 -2566 20838 12508 -2250 -1379 23772
6472 23772 25208 3368 1482 9302 -10609 -22286 10937 3265 -7376 2800 -6025 3158 -15047
6459 -15047 -19310 -42114 -65587 -29590 -19115 -45293 -46824 -58077 -50230 -46805 -13160 4384 7368
6446 7368 -10432 -17925 -6666 -22150 -28667 -33818 -34356 -19887 9747 8021 2325 16546 7732 13338
6432 13338 20173 1043 -26683 -35487 -13670 -5007 17116 37511 40655 33419 37276 44313 50732
6419 50732 30915 3241 -27017 -39104 -10431 5030 22572 16467 -17712 -60737 -84646 -59160
6407 -59160 -58458 -42519 -26500 -18925 -12131 -19193 -18347 -2017 11855 28466 8305 13164 13124 -13625
6393 -13625 -19835 -2431 -12275 -23936 -18494 -35021 -37465 -16240 -24890 -33133 -20743 -226 14129
6380 14129 34375 22268 10232 5047 -3568 -21982 -24216 -24321 -25616 -17043 -17322 150 1885 7909
6366 7909 33436 8055 8477 2796 -44654 -60937 -37834 -28571 -15894 -25709 -49143 -26592 8048
6353 8048 24937 -1873 -1184 -4458 -2731 17638 903 27240 49840 59717 37298 18607 7820
6340 7820 11114 8443 8888 421 -20573 1801 7927 2630 -16475 -22301 4737 23233 22905 7202
6326 7202 4817 -13171 -7713 -6250 -11656 -28374 -24353 -7150 18330 22894 18689 10894 5041 5636
6312 5636 23846 25916 4469 18541 36354 35743 55861 40678 -20254 -36626 -12991 -13395 -22143
6299 -22143 -52373 -52591 -41837 -35231 -50223 -33600 -9575 -34779 -36144 -44539 -29708 -11429 -12759
6286 -12759 -11278 -41367 -56548 -55535 -58415 -32688 -16829 -50599 -26096 -8526 -26477 -48699
6274 -48699 -49493 -41961 -40872 -56515 -78910 -71797 -54460 -26821 -7053 173 45118 49500 38019
6261 38019 35428 50771 17368 -23190 -31781 -55278 -59010 -33707 -3696 -5323 -20940 -13147 2899
6248 2899 12969 14994 9317 -8307 12532 -12118 -13855 -24866 -28203 -39597 -28537 -8952 -3104
6235 -3104 -18733 -40583 -33201 -35444 -34080 -22634 -25663 -46584 -33105 -26755 -34535 -16690 -1977
6222 -1977 -784 219 7130 18842 4589 4473 2140 1852 9970 20963 26320 5074 -37756 -33399
6208 -33399 -28942 -27128 677 14800 -2098 -20103 -23699 -20708 -8274 -16709 -7954 -21815 -14989
6195 -14989 9481 16471 -739 -2709 -12838 -2294 -4312 6388 10076 3721 18829 23445 26283
6182 26283 1946 -23310 -46700 -78011 -61903 -46118 -45320 -33271 -8057 -15575 -41726 -71770
6170 -71770 -87653 -87806 -72840 -77113 -65204 -30616 -13943 -22808 -42711 -48347 -59801 -53826 -53784 -28884
6156 -28884 -10386 9489 637 -984 21512 18363 1249 -7081 -8805 13651 22813 -9561 -28077
6143 -28077 -20054 -31738 -37495 -17197 -13399 -13269 -38155 -43819 -22477 1941 15671 40615 32502
6130 32502 20649 2252 191 -9628 -15142 -238 16022 17196 21799 -4774 -27098 -21420 7366
6117 7366 17258 -4776 12201 53359 48016 29153 10751 952 -12559 -12625 -34909 -53952 -28102
6104 -28102 584 -32152 -68810 -72211 -52480 -50248 -25505 177 8815 -6868 -5349 3640 -23794
6091 -23794 -50792 -41833 -49556 -44383 -11960 7755 5926 -22338 -48736 -17586 -19185 -29830 -30706
6078 -30706 -31887 -34552 -31123 -947 -8172 -30228 -41090 -27597 -18398 -13780 -3506 -19544 -20687
6065 -20687 -24195 -54374 -38337 -39566 -46566 -42798 -42757 -48415 -51940 -32052 -39696 -23245 -29654 -37562
6051 -37562 -17133 -12272 17513 18531 14590 3806 -9950 -17848 -42492 -35896 -22640 -32296 -28733
6038 -28733 -35644 -20006 14278 -7664 -27115 -40920 -59631 -92298 -73129 -57921 -43887 -35238
6026 -35238 -12612 -12802 32179 19704 39554 40810 5081 -27387 -59450 -38090 5530 24798
6014 24798 17524 4088 5189 7517 1257 8670 9998 7610 3176 -18609 -11473 16862 13377 -1240
6000 -1240 1025 -847 12156 28005 14868 9996 -18266 -22465 -34771 -44799 -2007 21941 5591
5987 5591 -15255 -70967 -85332 -58558 -42068 -35896 -21785 4266 8657 -11178 -28111 -18991 6973
5974 6973 20496 12700 -5419 -6829 -22767 -25956 -17200 -23171 -37679 -36234 -7203 -5813 -6628 419
5960 419 -5477 -1357 -7685 -15874 -13947 -29506 -30755 -34622 -32569 12147 4515 -7169 -4028 -46677
5946 -46677 -48391 -42038 -9388 -11186 -27832 -7257 9857 9116 12661 -3662 -5422 -21429 -32059
5933 -32059 -22646 -15790 21668 24551 325 -19575 -21831 -1590 8744 -4808 -20190 -20979 -25096
5920 -25096 -34445 -42325 -53418 -44784 -7717 9690 -6245 -32644 -6800 16041 -171 781 -13093
5907 -13093 -27536 -28176 -36496 -52495 -28064 -25267 -37143 -20618 660 26931 35121 36581 14161
5894 14161 8011 -2834 -29614 -8419 12291 -5703 -16215 -35157 -45935 -39810 -46466 -43195 -27188
5881 -27188 -23833 -55976 -66754 -21083 35928 44936 47927 19058 -14519 -1583 -3740 -26125 -41156
5868 -41156 -45399 -47880 -37169 -24827 -35953 -28609 -9755 -8151 -24454 -25544 -5459 188 21522
5855 21522 63455 29027 2042 1581 -24817 -20822 -23269 -46481 -39880 -34045 -38644 -20505 -6336
5842 -6336 -8870 -3104 18820 32012 13705 4650 -20263 -55125 -61190 -40682 -26677 -17154 -3511
5829 -3511 -39591 -35871 -19511 -52046 -28886 -3656 -23586 -66969 -60755 -67183 -54528 -25985 -48895
5816 -48895 -48367 -19313 -8945 3809 20513 1718 -36057 -46387 -17430 -21359 -25996 -33400 -47584
5803 -47584 -35320 -18123 -52756 -45716 -12675 7681 -18010 -24597 -12480 -2907 9024 25319
5791 25319 839 -23671 -21007 -18065 -5713 23365 43422 30203 19865 16046 11581 -13323 -16427
5778 -16427 -1372 6432 14003 18764 -1725 -20949 -25059 -17574 697 6679 44118 61054 1781
5765 1781 -3806 7988 -3520 8680 -22849 -21052 -32735 -14960 27396 49704 42576 17251 -30178
5752 -30178 -36319 -22075 -13943 -7677 -25795 -27361 -3824 19085 26631 -2092 -5312 3214 11749
5739 11749 13980 -7693 -20779 -46702 -39489 -33878 -45322 -23067 -26861 -15291 -5381 -18522 612
5726 612 11830 13342 -3289 -28679 -41496 -28242 -22580 -38068 -51425 -53405 -19431 -2782 -25400
5713 -25400 -53184 -52054 -52894 -61474 -60568 -60007 -29232 -3371 -1628 2805 3682 -7741 -37193 -889
5699 -889 13367 -14470 -19536 -56657 -95789 -70403 -32228 -37155 -16851 -914 -7848 -15362 -20254
5686 -20254 -29752 -63425 -32607 -4371 24031 11417 15675 15731 19628 -5918 -19392 -17458 -34077
5673 -34077 -23330 -1034 -8933 -42733 -26399 -32741 -25248 -24116 -7305 -1680 -4326 -24814 -8119
5660 -8119 -2028 20129 12458 -4707 -6646 -19290 -34547 -35022 -31220 -46323 -34496 -11260 19290
5647 19290 28176 -16970 -22847 -18172 -16659 -14375 243 10882 16647 9535 -7339 -20474 -8041
5634 -8041 11749 7130 10210 19342 22908 17754 -14477 -33786 -23942 -19143 -18292 3548 -2255 -21213
5620 -21213 -17984 18487 33146 26261 11125 16059 2239 -383 10783 11513 11851 -7200 906 -11763
5606 -11763 -29914 -22420 -12514 -1126 -11863 -1530 17559 -6933 -24716 -28783 -35786 -39895 -25809
5593 -25809 7369 19917 22377 8604 -16097 -13499 -25389 -8100 7783 -35 -1482 -7761 7419
5580 7419 24583 -10503 -43392 -40012 -58188 -69778 -45271 -47261 -53057 -54538 -30883 -11251 -19693
5567 -19693 -39623 -48012 -48481 -37899 -25326 -40912 -32018 -26303 -34354 -11561 5113 2404 -15955
5554 -15955 -50697 -45469 -39868 -28286 -27821 -23753 -12531 688 35 16585 19881 3953 -15805
5541 -15805 -28991 -36237 -33276 -24892 -40454 -42061 -15405 4527 14720 35427 18986 -7388 -12184
5528 -12184 -22939 -4191 3507 -10219 -12880 14942 6735 20773 8840 -7148 -44665 -40052 -36208
5515 -36208 -58496 -66155 -40556 -48457 -59330 -64114 -46918 -37773 -55922 -37805 -28087 -19316 -41186
5502 -41186 -53394 -52179 -30606 -23363 -16253 -13779 -38011 -56144 -37873 -17354 -20155 -31178 -35097
5489 -35097 -13221 -5629 -3476 4228 6500 1305 -23123 -31987 -30407 -29163 -45299 -31396 -21844 -49207
5475 -49207 -55939 -40153 -18620 -23966 -19586 -13521 -11318 1065 -1945 -13993 -34120 -25977 -28407
5462 -28407 -3583 -5291 -14789 -6607 -6537 -4794 14590 -12290 -7625 13941 5070 2818 -7401 -30636
5448 -30636 -34401 -13442 -10869 -27677 -46833 -49473 -78603 -69618 -37396 -19603 -25382 -1375 28071
5435 28071 8426 19839 7574 9967 9880 12038 13239 -4151 11252 15395 -671 -2579 -4303 -6756
5421 -6756 -33248 -60746 -49186 -27768 -13476 -16426 -15993 -13540 -8117 2641 12653 41431 46593
5408 46593 32876 5617 -14645 -26983 -9577 4803 -11773 -1497 -13452 -26469 -28729 17075
5396 17075 35100 35925 16706 29822 17999 25635 16388 -13641 -46158 -37284 -26835 -67714 -68822
5383 -68822 -41564 -25397 -10342 10321 15104 -14424 -29072 -36231 -19920 5276 879 -1775 16012
5370 16012 18761 -7203 -28477 -16822 -429 -14196 13614 22429 -10961 -35425 -28898 -26510 -31950
5357 -31950 -28590 -14259 -10104 34194 39908 5009 -8271 -7188 -10484 -21652 -28281 -35840 -27000
5344 -27000 -24378 -27609 -31527 -21992 -37160 -67036 -66696 -67545 -80262 -61318 -30746 -36532 -51057 -21902
5330 -21902 -19437 -20093 -21905 -46308 -19625 35593 52281 40165 35923 -1665 -18759 -23894 -5169
5317 -5169 4956 1976 -12541 -14074 -28170 -19471 -14804 -36726 -67584 -58148 -53242 -52869 -53605 -42546
5303 -42546 -14589 8209 11225 15326 6657 11787 7060 15374 17600 17472 -30114 -28452 -11943 -23825
5289 -23825 -15590 22759 14030 -10772 -4985 -28042 -37248 -43589 -30255 -37979 -40847 -33942 15619
5276 15619 41799 38449 3343 -17429 -33141 -22521 -7720 4163 40611 45544 34854 13257
5264 13257 -2695 -26183 -53187 -42860 -17263 -10055 -7438 -30225 -11142 -23492 -22096 -7036
5252 -7036 7581 3913 6173 -168 -10903 -28312 -31874 -58605 -43711 -4688 33091 18556 13105
5239 13105 27619 23363 7958 -13168 -25133 -60384 -44303 -34570 -68868 -81622 -76025 -65937
5227 -65937 -48623 -32323 -1107 -3331 -4065 -2633 803 -3108 -10846 -25430 -46017 -81948 -82139 -55305
5213 -55305 -42158 -29492 -37132 -29891 -30437 -12311 -6939 -15861 -8371 -35415 -30966 -5712 -3741 -27721
5199 -27721 -36940 -4570 -3437 -14325 -36531 -43134 -7111 5286 -13647 -30546 -29947 -35468 -26440
5186 -26440 -16623 -3632 -24080 -32485 -32859 -13138 -15709 -19941 -12284 -550 23079 11370 13443
5173 13443 6468 -3357 -2550 5869 3037 5264 -16607 -26271 -28321 -10720 -1681 1590 -38878 -43499
5159 -43499 -21802 2091 -140 2279 2336 -28160 -34095 -19558 28838 42373 51562 13762 -19570
5146 -19570 236 25473 27736 26360 19153 5515 17019 29328 21135 -10634 -54061 -48283 -41365
5133 -41365 -64981 -85376 -49085 -25094 -7176 -5187 -5556 -3519 -23600 -22110 -1110 29339 38338
5120 38338 1115 858 -465 -3472 -4414 471 15468 12412 1255 5784 264 -8019 -5646 -10058
5106 -10058 -59613 -56547 -43860 -23556 -26186 -18858 -5985 -39157 -72455 -69916 -70113 -41713 -40912
5093 -40912 -61246 -54950 -31242 7576 31586 31529 19079 -27915 -45917 -37005 -50448 -42983 -28091
5080 -28091 -17223 10842 25932 32071 6186 -391 21260 17171 28343 33862 26005 15853 210
5067 210 23679 18259 39055 53990 43608 30478 28813 18907 -905 -21454 -19067 7570 16584
5054 16584 9479 25261 10022 21543 -6958 -24577 -10327 315 16143 34785 37355 13582
5042 13582 -6630 -10283 -26731 -34423 -1263 4180 191 -2428 6953 12578 39708 44369 42948 5218
5028 5218 -23344 -30523 -16166 -27306 -9632 -1681 -16591 -1949 27129 10253 17021 19232 34408
5015 34408 27040 -20180 -7232 -7195 -18179 -31338 -13494 6128 41860 44047 18300 22352 15413
5002 15413 15974 -6211 10350 7951 -7743 -16774 -37103 -56833 -38203 -23249 -19429 -5661 -9510
4989 -9510 -35825 -42858 -16928 -22151 -37941 -27066 -10885 -13966 15482 14422 -3137 -17286 -20249
4976 -20249 -11557 6029 14057 13822 2496 -9894 -16199 -16786 -16201 -18738 -31889 -35815 -31676 -48000
4962 -48000 -78452 -77520 -62079 -72040 -71656 -50776 -41573 -65045 -51787 -31464 -37780 -29022 -6867
4949 -6867 20511 34351 11411 -30222 -42968 -34726 -34976 -6645 -29861 -52976 -31628 -8998 7856
4936 7856 4763 35 -39448 -45977 -31420 -35193 -34306 -17047 -27542 -44403 -39422 -68369 -59209 -48013
4922 -48013 -50483 -36109 -378 -11313 -12659 -7778 -9355 -3613 -3261 -203 -12388 -33201 -47142
4909 -47142 -41117 -58418 -57560 -43521 -60914 -51378 -46082 -19963 10888 22584 11267 19511 -8075
4896 -8075 -32491 -11901 -2112 541 21833 14593 24330 11980 4961 -11084 -30120 -41840 -53265
4883 -53265 -54358 -57949 -64959 -24443 26731 47346 14874 -12740 -1435 9844 -34966 -61737
4871 -61737 -28760 -5740 -30161 -41982 -50419 -51895 -25174 -38796 -34338 -11124 12078 -3064
4859 -3064 -7207 18622 20724 19627 -4276 -32987 -60571 -60110 -15389 -6567 -17663 -11038 -16480 -30174
4845 -30174 -33939 -15380 2489 -9426 -33512 -45603 -54173 -33770 -26417 -40827 -23491 -11614
4833 -11614 -15786 -16310 6894 -53 -23084 -38264 -36650 -11242 -3130 14002 16376 20764 17006 -880
4819 -880 -43638 -67326 -63037 -53657 -45875 -23316 21870 51325 30439 14123 -1890 -33676 -51278
4806 -51278 -71801 -73698 -40885 5688 20236 13235 -2579 -20818 -27307 -26210 -27606 -21894 -32178
4793 -32178 -14651 -2460 -13070 -21615 34466 78674 83145 92669 63151 32283 11560 14506 -6837
4780 -6837 3646 614 -25625 -12680 1538 23491 39546 30563 6291 -13246 7330 -2280 -15350
4767 -15350 -14237 -39088 -59802 -11927 6257 -22402 -30236 -36779 -39417 -45266 -40612 -21179 -4697
4754 -4697 14586 9509 1454 -29264 -39742 -23935 -956 -3644 -27639 -18052 -32427 -10225 12951
4741 12951 -3656 -23524 -38226 -24401 -12288 -6744 6608 28031 29887 17371 7916 16862 29221
4728 29221 36203 -5027 -25584 -25305 -33820 -18785 -5505 15172 1180 -19401 -45239 -47133 -36509
4715 -36509 -34715 1618 -14753 -17930 1844 -22140 -39268 -18386 -1616 -6184 -29146 -57659
4703 -57659 -48123 -25794 -39126 -53802 -38236 -11248 42989 28680 -5019 -2332 -11381 -29920
4691 -29920 -18370 -13361 -15479 -13494 -7838 -18897 -22665 -14603 -21717 -25274 -13950 -3607 -30750
4678 -30750 -38959 -11478 359 714 -15027 -11034 19674 26484 17264 13665 13751 -11099 -49460 -68120
4664 -68120 -57929 -23222 -14279 4509 3016 -13567 -29561 -27862 -50758 -55919 -14880 -2694 -6042
4651 -6042 -7193 9795 -24937 -43595 -57207 -65175 -64840 -49864 -32351 -18017 7656 14416 10959
4638 10959 16586 36355 47815 35265 14882 809 6026 4993 -6123 1612 7116 1734 -15180
4625 -15180 -22996 -9751 1604 -4292 -2721 10896 3684 4313 20788 -424 -32094 -45458 -21227
4612 -21227 -23285 -20700 -5454 -18203 -8230 -23345 -13178 -15531 -15397 -46361 -62371 -18478 -22553
4599 -22553 -15195 -9988 -1989 -4154 -24212 -25812 -30892 -23651 -7388 -18095 -5865 -44 -12632
4586 -12632 -25173 -10103 -14527 -19265 14913 5935 5862 -3624 4291 16557 16007 3716 -2249 -5157
4572 -5157 13747 35121 41083 5819 470 -9926 -21780 -14627 -27687 -23445 -30837 -22588 -36065
4559 -36065 -56227 -43013 -29090 -12569 -2438 11057 -21272 -33025 -30907 -36668 -22579 -19462
4547 -19462 -30914 -42335 -44673 -26557 -11900 17784 26971 24189 29665 29587 21773 18344 2378 -1246
4533 -1246 2558 -12349 -38395 -29590 -9471 11681 -1165 -2324 23687 31376 -15021 -24419 -7490
4520 -7490 561 -15192 -13143 1058 -10942 -12869 -1212 5826 29650 28124 15582 4487 3728
4507 3728 -2219 -15435 -12673 -17370 16941 29040 11352 9659 18029 24870 17215 17532 35521 30473
4493 30473 -4917 -9885 -28393 -29180 -25398 -6696 -8367 -22319 -22715 -8854 -12138 -19013 -10935 -14280
4479 -14280 5226 21704 20664 22688 19874 -14606 -30498 -30802 -20457 -30317 -17934 -2540 -5898
4466 -5898 3487 -9901 -8391 -24986 -6722 -4568 -5105 11523 13506 15249 22073 -3084 -11594 -23042
4452 -23042 -44882 -47347 -18387 -12264 -2435 15906 -8338 -24617 -36324 -40782 -42975 -43113 -9863
4439 -9863 -11097 -29252 -31399 -13067 26584 29511 52752 64988 32064 -3541 -5911 -4173 -25743
4426 -25743 -18819 7324 36668 15868 6812 15345 25997 5868 2575 11234 -23836 -40395 -36297
4413 -36297 -20041 -8603 -2820 -922 18840 26409 11294 -35835 -56082 -34306 -47832 -38466 -24087
4400 -24087 -25727 -44192 -28111 8133 14559 3342 6668 10049 -5495 -13230 -3911 -1221 12733
4387 12733 5160 -17259 -29256 -29894 -8903 -19671 -35641 -37373 -26729 -20055 -3934 25523 15612
4374 15612 1326 -828 -2593 -2328 -20514 -32426 -39206 4593 23562 -117 -11390 -14143 -19073
4361 -19073 -12315 7467 1929 5479 10393 -11366 -5238 18945 17321 -35980 -32817 -14795 -1968
4348 -1968 13361 -3447 6729 12930 33030 46492 10204 -16735 6443 25030 25146 11656 -26223
4335 -26223 -21942 -8396 -7355 -13652 -12460 -14574 -20648 -15774 20738 21147 15872 12484 -17494 -37777
4321 -37777 -36016 -16748 -11204 7148 16690 8764 -26536 -51146 -42370 -33164 -29432 -21490 -23012 8447
4307 8447 24307 42275 30282 14059 4047 5169 -24898 -30129 -17329 9499 888 -3331 -2699
4294 -2699 9636 26120 9397 -983 10675 12807 3440 6637 -9157 -7202 6706 3190 -21796
4281 -21796 -10919 3692 11852 25162 37816 16975 19303 35364 34482 48194 46936 22911 15425
4268 15425 20388 2654 -8255 15935 -553 -13513 3046 20810 14248 13889 28849 8946 5995
4255 5995 13605 16457 -564 -20602 -11084 -185 -4421 21134 52073 31050 -6052 -34 39015
4242 39015 46958 59022 51654 16296 27668 10697 -11629 -5243 47974 45451 35816 35357 34048
4229 34048 2504 -35849 -49127 -43279 -42865 -23739 -20770 -38884 -34367 -57026 -51458 -16080 -14624
4216 -14624 -38387 -34583 12148 45108 34417 18850 -6969 -19346 -12631 8017 9884 -940
4204 -940 11459 18342 5882 -1240 5541 2325 -18766 -26162 -18100 -20472 -39502 -51613 -17486 6647
4190 6647 -5111 -18607 -7559 -9543 -34559 -39136 285 15734 43895 61495 53840 33721 7253
4177 7253 -13585 11290 21471 -8747 -26169 -3411 -5215 -27822 -24337 22919 31892 5014 -13528
4164 -13528 -11906 -6680 10294 2769 -14042 4315 5269 -10845 -28369 -19104 2517 11080 -4662
4151 -4662 -17432 -658 23070 32057 23689 9351 -1113 -10021 -3012 -8820 -26291 -34550 -40083
4138 -40083 -25546 -16756 -35873 -34796 -12379 -18043 -21072 -4711 20988 27252 12723 -13679 -34718
4125 -34718 -38993 -27748 9041 5405 465 6583 -5770 -18288 15089 21378 11162 21225 42969
4112 42969 61004 41427 16693 12193 15822 11716 16657 -777 -3951 -19922 -24020 -23129 -21162 -14474
4098 -14474 11709 29469 26462 14500 329 -7641 -5655 -547 -20685 -20921 -11816 -18693 -6473
4085 -6473 -39499 -65198 -82526 -53789 -6062 -1327 -24209 -38595 -37576 -34388 -27252 -7328 -10077
4072 -10077 -7774 -13849 5764 7840 3716 -2572 -15158 -30672 -34452 -11603 11317 7566 -8554
4059 -8554 -3688 -7312 -14861 -22411 -51200 -31102 3962 6450 -1430 3978 -4493 -25623 -26587 -6356
4045 -6356 17181 23937 37773 37016 6415 6674 4918 -1947 1587 35123 54249 62821 60054 24781
4031 24781 19658 36826 51502 49738 20373 25014 34491 45891 41888 38823 32410 12171 -9039
4018 -9039 -13834 29162 70207 62659 47512 6517 -10699 -37241 -35474 -30845 -13848 -9797 -4368
4005 -4368 1359 7379 3650 4570 18631 39533 31092 4852 6350 3059 -4919 -3829 -22908 -36403
3991 -36403 -28631 -11741 -27233 -44662 -57384 -38155 7411 16046 4537 -35861 -26668 -18150 -21513
3978 -21513 -26643 -38847 -32661 9370 -8683 -19881 -4740 -20597 -9621 6711 9796 14953 -9174
3965 -9174 -31942 -22232 -31117 -31594 -32938 -31776 -21432 -26637 -38037 -2182 6794 -16032 -20999 -25926
3951 -25926 -41018 -32474 -26380 -31586 -20042 -26258 -29624 -31007 -28709 -3668 1227 91 -19175 -31124
3937 -31124 -32742 -11123 1670 18528 5840 -1302 11976 6326 -3497 -11324 13467 31299 31208
3924 31208 28655 2698 -103 -12310 -49047 -43961 -23488 420 22340 16431 -692 -9157 -1792
3911 -1792 9726 35764 17576 9008 -8348 -26359 -42292 -52038 -19259 4039 -22629 -20152 -9582
3898 -9582 -5342 -2598 204 -11437 -11894 -13036 14788 -8674 -43896 -57199 -57040 -31143 -46299 -59087
3884 -59087 -49872 -31765 4972 38452 19721 16754 -701 -13259 -5220 9607 -9481 -39489
3872 -39489 -40923 -29010 -5980 14356 24499 1802 -3446 -5434 -2714 -29388 -26656 -34006 -17673
3859 -17673 2966 -2721 -3413 9787 15393 37107 48881 40257 35343 5052 -2679 26605 16908
3846 16908 11325 23306 31841 14958 21767 17542 -21451 -37919 -54459 -33260 -23274 -39592 -32395
3833 -32395 -18992 12819 26429 35497 24235 29015 27426 6715 14703 37266 38492 15208 12542
3820 12542 23572 43378 18974 8577 -13637 -8915 -25063 -31597 -32911 -44471 -31286 -24413 -1031
3807 -1031 2301 6105 -6036 -1494 -17820 -19262 -38626 -45606 -32508 -9719 -9433 233 14945 17386
3793 17386 3288 1996 -5051 9689 832 16165 25941 15483 21837 13009 9836 -4483 1864
3780 1864 -2941 -18000 -58509 -68540 -49420 -52374 -70724 -67271 -26766 3185 -5440 -23581 -5124
3767 -5124 -1337 26807 -6647 -43331 -24090 29437 45781 26180 15160 -2365 -8054 -18178
3755 -18178 -15752 3749 -4690 -18185 -31289 -16201 -10929 3129 22820 14469 30598 30541 4271
3742 4271 -16167 -10055 -7454 10306 17077 -11487 -18076 -6461 7824 -2748 8216 19640 12242
3729 12242 -10862 -15854 -203 -2293 46128 51122 21635 11099 30692 27180 22326 10939 25612
3716 25612 35253 29077 23161 6242 -17743 -2535 -4580 -5877 -2371 14865 44802 29027 13158
3703 13158 -2814 -15501 -29167 -34401 -19070 -23903 -24995 -12843 -40259 -63377 -60864 -35457 -25921
3690 -25921 -26020 -32962 -54836 -52092 -28819 -3320 4452 23251 -1374 -38006 -41063 -33381 934
3677 934 17891 19509 16375 7593 -2207 -4330 -19661 -23458 -30608 -22493 2202 -8826 -37875 -31921
3663 -31921 -28923 -44920 -56828 -45943 -41080 -36490 -10035 14149 28150 10226 -24980 -15485 11550
3650 11550 9296 34521 31670 -9034 -827 312 -26048 -26467 -32320 -25806 -13314 -1169 4050 -20960
3636 -20960 -41226 -52225 -25072 6903 882 1043 2393 3361 12097 -7431 -10888 -13961 -34466 -37650
3622 -37650 -18893 -2757 23908 -3182 -23342 -11911 3567 19236 97 -16512 -28544 -6909
3610 -6909 -12633 -55816 -73033 -32854 2699 -3660 -6714 5268 25391 31761 272 -25722 -13081
3597 -13081 4281 7662 10610 561 -963 26905 27060 2740 -10906 -9757 1717 6371 18912
3584 18912 12377 11864 2049 -31018 -47599 -40640 -8762 26099 19944 -7575 -38701 -51233 -46793
3571 -46793 -68945 -48774 -32568 -8488 7064 13807 -4377 2888 42693 59296 52196 54578 42530
3558 42530 53123 35128 4801 -22128 -20692 -28127 -22187 -6882 -8396 -14798 20754 15098 -23771
3545 -23771 -13105 -5377 -20798 -35229 -51830 -54826 -60050 -54456 -42702 -23599 -22757 -25893 -17510
3532 -17510 -16498 -16476 -26642 -31335 -20475 -19133 -17194 -10906 -10388 1716 17617 29683 25763 12355
3518 12355 7302 1049 -39905 -52422 -30868 -32894 -22084 -20649 -8459 -10808 -7939 10356 69796
3505 69796 79620 63457 56128 54163 52605 36958 11206 19890 29093 37794 5424 -16073 -8331
3492 -8331 -14074 -25573 -41402 -72784 -40053 -1379 3361 6146 10656 21932 13188 -14509 -49514
3479 -49514 -48299 -13496 7561 13314 2716 -11942 -11817 2660 2929 -10137 -44632 -56860 -25107
3466 -25107 -534 -2228 -13056 -5053 -16269 -12812 -1452 5232 978 -4217 -17264 -14825 -19435
3453 -19435 -17747 -10727 26577 58026 50304 39108 22387 -28857 -43142 -45910 -16512 -13212 -26728
3440 -26728 -28198 -19271 -4468 -3365 7259 -5568 -17088 -10926 -1289 -7903 -25804 -8434 -24116
3427 -24116 -34103 -28389 14476 17139 -19759 -7913 -10612 -29139 -61833 -78240 -63721 -33213 -14309
3414 -14309 8105 8320 -4129 9246 -2960 -1273 6273 16708 21974 8685 18601 13933 -17392
3401 -17392 -19375 -26229 -13267 3106 11089 22858 -20227 -45462 -14458 -5016 -6758 -994 11960
3388 11960 -6411 -16853 -25861 -18303 1044 -11006 -4089 22923 5924 -17684 -14491 -20037 -1040
3375 -1040 647 8794 -2024 -31878 -29778 -10316 -8708 4372 18971 6300 -4490 -28083 -38278
3362 -38278 -9913 23186 18478 5606 -1575 -15784 -36011 -33734 -13747 -12 -8147 -32175 -23596
3349 -23596 -18609 -26430 -39427 -68856 -63562 -69811 -35509 -20870 -24634 -12598 -3507 -24188 -18086
3336 -18086 -1695 256 -11804 -10838 15079 1464 -3368 10750 -7615 -25745 -21873 3592 33852
3323 33852 20718 -17011 -15475 5832 13818 -4703 -1548 -21378 -15244 -13485 -21235 -4402 28889
3310 28889 1424 -9450 -25937 -18557 -16074 -1626 2533 -29407 -19620 6274 -928 -36997 -68043
3297 -68043 -66678 -26396 -15495 -9665 -26142 -45340 -56652 -52931 -41482 -40804 -18379 -25986 -14449
3284 -14449 3536 14694 -2956 -4500 -7712 6910 14634 -2715 -8518 -30156 -18094 -10730 -5770
3271 -5770 -11619 3255 -252 -30049 -13611 2723 12432 13444 30132 56898 70340 53199 31095
3258 31095 -2448 -4061 23759 9777 20574 23126 17894 7300 18659 22472 13176 -15566 -11893
3245 -11893 19025 18521 -14581 -17923 -8529 -5425 -38848 -53239 -46014 -15953 -18792 -10747 -2837 -7046
3231 -7046 14166 -1283 -17079 -49691 -37977 -20280 -4943 -20580 -30391 -25889 -10801 -20623 -15991
3218 -15991 1357 -2905 -25379 -30591 -32503 -19380 -5603 14671 20836 10784 -2407 -18004 -12206
3205 -12206 -27219 -18466 -27244 -21102 3732 -8481 -4003 -10302 -24622 -13930 -15590 -28780 -24770
3192 -24770 -23955 -30906 -17954 -4449 -14502 -6166 10316 15764 7709 22748 -8317 -53722 -37990
3179 -37990 -67567 -70700 -12552 -19397 -48315 -59817 -31744 -10911 -3220 -3241 21308 38341 11914
3166 11914 -26240 -33887 -34292 -8059 -6330 -25731 -24313 200 32162 11960 -1453 -12654 -24771
3153 -24771 -2923 4564 -98 -26972 -53232 -37793 3643 3392 -3563 1794 -5451 -12787 -3868 468
3139 468 3494 -15449 -7075 -9686 -24055 -13638 -24097 -9786 -3566 5997 810 2746 25274 22713
3125 22713 4709 -3182 -6842 11019 5535 1392 18280 20781 20816 24720 56596 48792 17534 -4058
3111 -4058 2083 -18798 -29500 -16375 -2493 -6568 8515 21483 16938 -2928 -5660 13826 18085
3098 18085 -4471 -11131 -17882 -8695 -10793 -5685 10271 -21123 -21232 -31168 -17601 -22901 -2612 -1112
3084 -1112 -8303 -20769 -21270 -13134 -17324 -3945 5341 -4040 -5698 3131 -7439 -2070 3449 3126 -7942
3069 -7942 -23226 -5239 33913 60126 71794 55490 32621 -10702 -12403 -7403 -1255 21977 -7829
3056 -7829 -23823 -38227 -37362 -17300 5814 -13353 -22452 -18846 -4517 -20540 -20722 -18164 -10508 10613
3042 10613 18887 18938 5817 -22523 -26830 10695 37354 29992 13793 14875 14390 27216 23600 12769
3028 12769 3500 14747 34350 56149 28736 -4397 -30109 -58209 -58529 -31278 -49276 -40548 -16152
3015 -16152 -1795 -9606 -2980 -274 -12152 -27629 -51267 -46666 -55620 -47627 -36823 -24394 -15500
3002 -15500 2836 26050 6713 12939 22629 12765 -2405 6718 23245 15903 3937 -42929 -64924
2989 -64924 -57438 -56107 -52585 -29693 -8221 -9291 -19207 -26778 -10919 -17241 -28369 -17241 -17268 -33733
2975 -33733 -28877 -25196 -359 5630 -3185 -20225 -30902 -26347 -5358 -29382 -43999 -29600 -33573
2962 -33573 -36984 -25365 16937 327 -15527 -4859 9288 23859 16808 21212 21119 8416 3830
2949 3830 -14159 -28009 -29970 -34806 -23760 -31883 -30544 -12437 16817 24534 39254 38012 17647
2936 17647 -1413 -32335 -43156 -18636 -17110 618 18433 -14920 -31081 -25821 140 22891
2924 22891 23424 2207 -9894 -19015 -44745 -43505 -20281 7678 13042 2249 -1904 -6767 15254
2911 15254 13246 -21788 -19925 -15589 -21393 -16011 8170 21909 3225 887 2140 -21566 -16907
2898 -16907 -7559 -19166 -5548 14235 17458 25000 3377 18437 4007 -614 2568 13763 16724
2885 16724 -9524 -47553 -51703 -53597 -34712 -31901 -34476 -29643 -15170 -13088 -13135 -28483 -17199 -10626
2871 -10626 1373 12384 12254 4818 -10029 -33957 -20073 -27964 -33966 -18285 -13882 -14285 -14907 -34282
2857 -34282 -44353 -22754 941 10362 2799 5511 21629 30015 13518 23462 10615 -1139 -7174
2844 -7174 1636 13970 37548 54669 63509 35932 12420 37039 35641 48737 83070 80408 58460
2831 58460 24261 -7117 2689 1701 -2739 -6638 -11523 -33033 -50179 -43460 -37309 -34201 -13830 -19445
2817 -19445 6217 19770 8775 -5333 -6486 6512 999 -5406 31045 69055 72719 67047 48092
2804 48092 36913 -902 -2621 14382 4437 -42866 -35008 2437 23839 18576 18180 -8102 -25731
2791 -25731 -15156 -17889 -4084 -9930 899 9788 -4578 -25467 -37609 -28371 -13523 -24377 -41580
2778 -41580 -71166 -68027 -34305 -14895 -22791 -19190 -8007 -16972 8859 18059 19291 25411 35658
2765 35658 31242 27097 42320 41596 23088 -3490 -21619 -20670 -12127 -17354 -32571 -4075 5907 12814
2751 12814 15676 -1638 -6103 6927 39845 32871 -19009 -51361 -24065 -10105 1782 1771 -19040
2738 -19040 -36590 -10426 -4127 -30916 -36895 -31217 -22851 -23250 -24750 -23731 -4728 9483 -5685
2725 -5685 -6167 -9812 3084 16523 -1621 -24554 -19101 -22453 13926 29530 13875 24391 29221
2712 29221 8431 -25569 -15441 -18063 -11030 -10127 -27065 -27388 -9160 -120 -11576 -4739 -28024
2699 -28024 -41608 -11009 2795 14151 14440 15349 4924 -6582 -23054 -17606 -17447 -3066 6411
2686 6411 -5302 -25583 -35780 -23837 -9471 -1110 6798 8001 8278 7133 3854 12175 19704 -921
2672 -921 -9639 9557 32821 26598 -3836 -11191 -9894 -25092 -36083 -47152 -70519 -29551 3079
2659 3079 2984 -8057 -34493 -7116 2094 3610 1874 12420 9340 -20638 17351 26503 9510 -16387
2645 -16387 -18810 -7766 -10584 -9997 3913 -6740 18640 60638 57268 65079 77686 49434 6988
2632 6988 -4455 9985 4317 8848 -13486 -25019 13719 1167 -8398 6315 -6989 -9470 -3449
2619 -3449 -2009 -2195 24659 4777 -12332 -21144 -20734 2680 23898 12897 13941 19394 60842 57209
2605 57209 27844 -2220 -21444 -41743 -45705 -30226 -6148 20796 48924 51483 29577 15757
2593 15757 -15731 -31811 -33062 -3513 23805 -5659 -16074 1253 3091 24587 41786 49523
2581 49523 30881 4324 -35307 -13257 4845 25777 29364 34554 42312 31448 17899 2676
2569 2676 7270 4637 -14512 -11979 6584 -728 26302 24884 23221 3776 -32369 -45095 -19887
2556 -19887 -25584 -14781 -1581 876 4538 20456 44550 36470 29514 39901 39822 20107 -16975
2543 -16975 -20302 -26735 -10366 27144 22786 38809 39386 8825 17792 -3877 -31346 -11204 10790
2530 10790 25573 50706 33231 24267 20572 -1307 -37102 -47735 -25909 -7633 12345 15012
2518 15012 15261 24789 28836 12931 14631 13906 3510 -10775 -34650 8134 20611 21010 -4589 3998
2504 3998 12065 9052 15833 38545 14686 37121 36555 40555 11014 2822 2831 21653 38143 33586
2490 33586 10036 10403 17065 34876 34921 26384 4939 -12784 -29379 -39543 -38283 8271 21650
2477 21650 786 9804 32879 31577 16374 9111 -16906 -11748 2326 7668 23920 19468 26908
2464 26908 16040 -11378 -58850 -72538 -52939 -27133 -3544 -14101 30588 20696 10486 14844
2452 14844 25743 48886 56972 41933 21625 321 -2027 8410 41877 37291 6197 -26837
2440 -26837 -16803 602 9129 -6179 -15787 -4093 2300 22958 24705 53729 50561 35054 36368
2427 36368 39446 27686 31949 30894 35076 52252 52787 43620 -820 -7854 15485 -3135 -8639 -10208
2413 -10208 -20454 -9643 16642 26769 43057 43698 -1173 -14677 8796 20289 15124 16074 19863
2400 19863 8444 24762 35082 31513 7678 -6409 -22638 -40828 -70995 -63535 -33794 -13188
2388 -13188 -8363 -32176 -48477 -44767 -41518 -47892 -36166 9422 22210 16248 -1697 -33433 -19349
2375 -19349 -725 2669 23004 37447 14349 -561 -3798 -9279 -16119 -9137 -22760 -19996 4259
2362 4259 -8325 -14820 -97 12953 26779 5731 -7316 -4331 -191 -36987 -45025 -25089 -16526
2349 -16526 -11702 -33234 -42249 -1165 3874 -26074 -33262 -23974 -1250 -8045 -17704 13000 13301 14247
2335 14247 29773 10592 -15067 -17951 -8081 4803 7625 6294 13250 12675 -3711 2195 -7495 -24600
2321 -24600 -27498 -30563 -18979 8532 27493 15023 4101 -929 -16885 3647 3242 -7894 -21161
2308 -21161 3115 43714 33742 18113 18214 34357 43217 29061 8002 41363 93247 65660 44247
2295 44247 38176 20307 21191 8903 6042 6135 -24603 -43829 -60025 -44104 -33003 -33053 -25594 -23558
2281 -23558 -18008 -12514 7353 8864 -285 -12074 -661 6826 19936 38229 42096 49124 40622
2268 40622 29079 28492 27746 6612 -7538 -17696 -33532 -13123 23159 24789 13222 9835 733
2255 733 -16322 -29558 -14696 26942 48009 46263 9836 4324 -4216 -16338 -17583 -20143 -14278
2242 -14278 -5011 44303 31316 36742 55595 -264 -16443 -4704 22308 13685 -4268 -22730
2230 -22730 -33660 -11925 12319 -6500 5785 -2507 -13813 -31464 -46767 -29601 9483 15952
2218 15952 2352 -8876 1668 12645 35201 30950 48001 42710 27420 17061 35903 41665
2206 41665 25088 47005 59079 31969 12814 11176 20052 18488 6714 6045 10363 10182 -1940
2193 -1940 -7412 -26322 730 -17973 -9715 -2359 -3413 2592 10903 8516 6147 28423 21547 -6445
2179 -6445 -31742 -43644 -33229 -16310 -25898 -44729 -22390 -6661 -8090 1753 11236 1646 8892
2166 8892 6852 -14341 -51 34328 37065 33235 28087 21844 10706 -25187 -30818 -8666 -21275
2153 -21275 10411 9290 21349 31428 9241 -29496 -43343 -38483 -47886 -59430 -53865 -35040 -24427
2140 -24427 -23069 -7171 -9478 -20595 -20219 -32501 -20914 -2046 -6198 -16299 5532 -16846 -39149
2127 -39149 -40219 -42106 -57769 -47678 -48711 -21008 -521 1634 -2945 -11539 -25673 -28695 -26656
2114 -26656 -9837 7521 41219 30608 33632 9420 -605 17192 27456 16835 -9193 -18914
2102 -18914 14626 -12169 -64939 -28723 -6720 -27414 -17082 -24348 6071 17213 1416 8489
2090 8489 12884 46671 70954 82036 79642 91034 61332 44288 32554 4357 24472 27714 3689
2077 3689 13845 13283 27103 26693 8953 8633 1049 11849 6780 10274 13460 19613 4427 -6266
2063 -6266 4113 -22925 -36116 -14272 -29634 -11062 -2996 11459 32182 10956 25556 41200
2051 41200 33745 -3241 12264 -4031 -27743 -49967 -13053 10669 -716 894 3665 -4154 -16242
2038 -16242 -20203 -2502 14227 17249 -4536 4174 4158 6821 13544 -3150 -25405 -15699 15627 7445
2024 7445 19224 6322 -18009 -43826 -25227 -43274 -55983 -24865 2049 11750 25716 44832
2012 44832 36415 23399 23288 18116 14411 8972 6913 -12075 1662 -2147 3705 -7008 -23055 -39291
1998 -39291 -53824 -36773 -20007 -19592 -16083 -8158 -14312 -40714 -24768 8239 15702 41169 46063
1985 46063 12787 18460 7897 -3068 -5557 -8472 -8509 11691 39414 43713 49306 23243 39242
1972 39242 57123 48108 41007 35406 34421 4423 -2419 -8241 -13988 -2480 -22730 -35554 -38545 -28478
1958 -28478 -19719 -20365 -25596 -22795 11425 10167 5940 21670 44257 37439 23733 32406 23200 2021
1944 2021 -8666 -8965 5849 18705 21455 18710 19253 10737 6138 40242 70839 50529 5820 -3242
1930 -3242 3846 19889 -571 4932 14102 1083 9754 13098 14652 6301 5435 27785 25915 6857
1916 6857 1579 18402 19338 14731 4356 -9056 13357 29517 39467 53087 10730 21242 66368
1903 66368 54848 57718 47070 -12337 -50357 -39535 -21790 4796 13005 30766 39285 27258
1891 27258 17328 19570 2122 -18892 -47555 -55328 -63720 -59449 -50059 -31481 1612 6394 -12922
1878 -12922 -30209 -24267 2437 16140 -1715 -28484 542 15188 -22612 -32735 -25462 -30261
1866 -30261 -24178 -21897 -17965 -41121 -26835 -23731 -19137 -32643 -30881 -43381 -30535 -12088 -12763
1853 -12763 -15661 -11686 -22893 -18931 -4994 8349 4631 998 -4912 -1735 20275 21331 -4990
1840 -4990 -26393 -159 15583 -20301 -32001 -29956 -36668 -36923 -19260 -29809 -45765 -42512 -51088
1827 -51088 -54198 -39065 -18548 -9883 -24297 -21069 -10276 -1659 -2132 -26631 -1890 26666 20381
1814 20381 22330 29209 20456 29895 31137 15523 22667 27702 16325 10416 8695 -4850 -26495 -7985
1800 -7985 441 -9252 9616 20307 4403 -6417 -2297 7104 6592 14235 7925 -2086 -7769 24436
1786 24436 47663 28413 8894 11987 -6732 12030 13242 -8347 -32637 -37446 -6054 19377
1774 19377 37673 56502 33396 12395 19814 21293 26701 -7510 -30958 -40392 -23451 4262 12799
1761 12799 18154 14291 7962 28603 47247 47686 41070 52726 60068 44134 16922 -301 -6203
1748 -6203 10453 32106 45057 21631 34244 45021 26216 -3398 6657 28304 30994 38483
1736 38483 61615 60541 57290 49710 56762 57464 39931 41658 42196 54667 46837 15746 2854 13800
1722 13800 7440 3519 35424 87694 71351 24916 -22304 -659 13167 16670 10560 -4037 -18309
1709 -18309 -8157 -33315 -47481 -26195 -31993 -46602 -48302 -48503 -40600 -40915 -51441 -74587 -67427
1696 -67427 -43843 -34616 -25475 -14352 719 -7402 -9054 3863 -10774 867 -15770 -27250 -15982
1683 -15982 16620 44214 30636 17731 13341 -4175 3900 2002 16429 16662 20608 27306 22321
1670 22321 10979 29025 32727 18997 17415 13480 -26488 -42812 -22902 -11518 -10634 -15379 -5486
1657 -5486 16758 41308 60526 59983 41831 34916 20928 1488 -1534 5844 16190 8096 -320
1644 -320 11674 14168 21079 2145 4722 19392 -3421 -41666 -29833 2202 14631 5885 8792
1631 8792 29443 24202 -7956 -1617 -13758 -1427 7643 -25196 -34581 -21815 -240 -1318 7985
1618 7985 2149 -9178 -28300 -27205 -16669 -27237 -28834 -25978 11925 18180 19862 17205 13741 24777
1604 24777 923 -20651 -35735 -19846 -11397 -36883 -21904 13028 34412 32275 6110 12771
1592 12771 23801 47761 45805 20928 -3954 -36419 -50235 -46441 -39001 -15348 20630 9748
1580 9748 22948 19718 35482 22432 7634 19089 29839 17748 -6286 -19970 -40244 -39903 -11821
1567 -11821 -8564 -31340 -28868 -16597 -8262 -7963 -18602 -14004 -22868 -15902 6493 11265 5550 30542
1553 30542 35364 51977 53025 41045 28281 36626 25367 -2436 -10572 -41815 -47868 -23468 16604
1540 16604 32329 12643 13737 16847 -1579 -31510 -63321 -58289 -48781 -16442 -24216 -53936 -40782
1527 -40782 -13701 -18025 -24994 -33784 -17540 -15577 -24280 11053 14248 13069 -3220 -7631 -18655
1514 -18655 -41480 -44943 -15554 -28510 -26589 7979 44427 47682 41327 34282 37406 24687 23411
1501 23411 28106 31662 24517 43313 25900 27931 30452 33142 24818 25208 32235 31537 35703 52360
1487 52360 24780 5258 13529 31276 23726 13638 -6141 -6499 12731 -11597 157 12843 -388
1474 -388 2090 21933 46275 61122 35774 22717 27650 30111 35056 26564 -17183 -18179 15563 11087
1460 11087 -10408 -3330 -14148 -4398 19288 19322 6376 -5751 602 23908 22884 26122 28103 41206
1446 41206 48275 44569 21558 33214 14955 -18767 1342 36461 30455 22504 5486 11758 5547
1433 5547 1577 -371 736 19409 66184 67280 31717 14077 20486 48726 78129 63668 50893
1420 50893 44185 40612 18278 29915 24383 21836 27823 20438 13807 -9503 -19890 2552 -1809
1407 -1809 -25111 -23068 2681 -14432 -19640 38133 37923 29037 24017 39365 42268 34638 8372 12375
1393 12375 14199 17202 14894 29292 32903 26298 16235 21876 27406 32406 21617 457 3463 2221
1379 2221 -3096 -21545 5717 12478 33542 45228 47708 31066 38798 31772 27739 32475 17371
1366 17371 13758 34659 33541 7189 27714 20285 -6445 -15159 -29811 -39196 -36907 -22216 -12338
1353 -12338 -6849 -7339 -1427 5558 -7222 -27855 -26277 -30151 -14156 13922 13395 -12906 -35138 -46853
1339 -46853 -29559 -13405 -23419 -12380 14732 10610 8247 8472 20788 44599 45429 41934 21668
1326 21668 10649 20487 12008 23292 4796 -724 -12158 16535 43095 45821 42500 30032 14144
1313 14144 18226 11608 -4363 11157 34574 20964 -3068 -18675 -23025 -28000 -30173 -3608 5009
1300 5009 3000 27247 16745 20454 30280 1358 -15884 -30866 -23160 -25915 -577 22650 40581
1287 40581 31877 31509 10127 2970 2254 8101 21786 6904 16518 21414 35197 48680 49711 21727
1273 21727 9470 9170 9493 6071 11827 7480 -11626 -26831 -23341 -26553 -45619 -24550 3032 -2715
1259 -2715 19268 18330 2689 17855 36543 15828 -1854 1469 -951 2251 27148 28741 45498
1246 45498 48399 35117 30098 29801 7187 -7836 -32588 -14554 1570 19758 23837 22892 26780
1233 26780 34279 44659 31822 17541 6409 20306 28205 30835 30526 8309 15711 45727 23455
1220 23455 2107 6635 -6294 -17231 25865 60706 43082 37754 40152 39947 35818 23704 13069
1207 13069 24863 41494 69249 38780 6289 -2055 7781 7404 -1319 5823 28484 27761 31829 21512
1193 21512 21347 24799 24269 7162 11863 28106 14194 12859 38524 61751 35621 -2315 -24117
1180 -24117 -20239 7641 35405 47566 -6851 -22735 -8614 18921 24092 25086 52295 51066 36005
1167 36005 11437 -11698 27068 53427 60635 55858 53729 54680 35163 25674 35949 31209 70875
1154 70875 68621 53530 67015 82499 50836 35042 20847 5673 946 -21411 -11401 40933
1142 40933 60959 57127 24182 12261 24824 1014 4219 17860 -2218 -19877 925 -22173
1130 -22173 -80930 -72069 -58553 -49484 -37449 -17428 -11709 9997 -7345 9163 16469 -15000 -5356
1117 -5356 8580 -14261 -26003 -5472 3636 -22031 -23068 10420 6010 6127 -7117 -13627 12158
1104 12158 31419 39770 28331 -343 -3203 38380 49235 32609 28558 37525 57591 38922 8180
1091 8180 12252 34724 19425 17316 11886 18047 44562 39128 28571 48695 40587 29245 19119
1078 19119 42869 52159 39057 32376 25400 19184 1685 14088 37732 32738 19995 -1787 1864
1065 1864 12151 1233 4105 14941 11986 22301 24430 32596 38021 23994 15315 18412 -2683
1052 -2683 -3570 -4873 5826 18108 28883 30330 26328 34783 24118 5568 -13175 -19871 -11630 -16007
1038 -16007 5167 17151 11184 23282 31655 44758 30453 14031 11750 -4438 3848 24840 -6672
1025 -6672 -19238 -23000 -31343 -17409 -28154 -25943 4553 15194 4269 9715 32598 32809 22369
1012 22369 11761 1094 3193 940 8274 12344 -7444 -5608 2382 18084 6796 -8008 -8080 -777
998 -777 -10647 -2539 3580 17855 57937 59608 40720 13713 14341 17305 23060 10788 -7514 17618
984 17618 35566 16755 38351 62571 74532 46882 38157 11269 17339 43953 21865 30823 43077
971 43077 65173 65905 43006 45063 26083 10215 -7326 6305 13247 -17509 -25917 -23055 -28413
958 -28413 11118 59354 58547 33564 -2729 -16979 -5986 857 16538 12774 27149 42312 52860
945 52860 61445 56445 36773 23824 15000 -13876 -30661 -39224 -24431 1039 13997 22616 36129
932 36129 63228 84937 58081 41318 33955 13981 2671 -1212 -12397 -27447 -41545 -39666 -13513
919 -13513 5444 -12579 -32686 -18040 -3224 11157 -12547 -22559 -14350 24699 56848 31663
907 31663 2774 11000 29847 29901 31581 31373 20087 -1282 -17232 -18824 -8092 -8270 -23970 -40261
893 -40261 -34613 -19770 -4584 9231 -8411 -24354 -31527 -8427 -8667 -2366 -5460 8980 23453
880 23453 18630 26358 22617 32347 42704 41144 7246 9567 8551 3205 -675 -3683 -2813 -5942 -5940
865 -5940 56 6837 -8163 4360 -27236 -17660 -6916 -15367 96 1168 738 21669 4973 -18298
851 -18298 -27638 -15338 3248 4903 5132 4032 4704 -17586 -31146 -34713 -15253 -9363 -17812 -9442
837 -9442 21173 34073 25902 26283 1049 278 25393 65494 59382 32834 26028 21067 -2921 -7801
823 -7801 -10825 9023 39304 28025 41186 61916 53656 19460 -19069 -22427 -9333 19185 18649
810 18649 7193 -7855 -24750 -16474 8331 26366 29919 30422 9171 -9512 -10082 -1489 -1641 9685
796 9685 31255 22729 27372 31444 37201 33561 15117 -14827 1657 15228 17210 15903 10462 15235
782 15235 24675 4205 -17383 -35212 -29939 -6718 -6351 -12134 1607 3909 19957 5511 -5800
769 -5800 -12733 -15265 -24521 -8068 2708 2013 -5110 -16782 -16088 1147 2247 -6114 -3561 -294 -3741
754 -3741 -16229 6372 31341 35694 35709 24982 21406 17247 -2454 -12552 -12909 -20676 665 15021
740 15021 -5811 -29880 -44689 -49092 -46523 -42253 -11305 -6207 19558 -13724 -35391 -14382 14310
727 14310 27206 32659 22122 -3085 -11350 -5776 -23751 -18963 -23612 -36207 -31505 -28738 -22719 -2991
713 -2991 36412 53233 30706 114 2213 10767 16195 31278 24552 24929 -1631 -9745 16803 24201
699 24201 13934 5216 13600 4382 -97 8833 13032 242 22352 52608 40531 3309 7824
686 7824 21117 30887 22175 19616 -4028 14961 51314 29942 5367 21083 23667 33436 51606
673 51606 39612 34874 34014 22621 21857 29023 4961 -9492 -11465 -22230 -6275 22274 1326
660 1326 -11410 -16739 6419 40524 46691 7671 1686 14303 21167 52139 51609 48943 22259 28050
646 28050 47192 20743 32219 27720 27055 -7742 -52644 -74199 -32237 13359 35917 31525 17188
633 17188 4420 -7083 -2057 1487 -28115 -26250 -11019 7240 26792 32721 23648 7788 -23448
620 -23448 -25329 -19961 -870 -13705 -14682 -7320 8374 -3714 -22818 945 20916 19527 22017
607 22017 10852 10128 11741 20634 25207 25127 -7730 -8685 19669 40933 59714 58027 62921 50337
593 50337 18573 -11851 4550 8085 24884 24028 26856 19831 16807 17367 -9677 -1114 12029 25206
579 25206 9884 1598 16508 20542 9566 12193 2722 -4475 -22321 -37056 -18523 -4525 -8751
566 -8751 11183 -1295 2864 -13155 -17184 32215 45226 3729 -27787 -21978 -15310 19012 24959
553 24959 -11911 -46119 -48341 -28201 -14950 -22786 -17268 -12425 -7948 2295 -2362 1314 10536 2054
539 2054 15526 48349 42692 41147 40417 12667 -25706 -21841 -23688 -11134 -5272 -4445 1907 -4763
525 -4763 -3454 18954 16833 -16844 -25632 -19680 -34421 -19480 7536 -1973 -4697 13384 30472
512 30472 16835 22829 1240 -13840 -8286 -1610 1025 7634 11189 15482 26195 9151 8932 5296
498 5296 22870 31842 19149 1389 -5234 -7259 6881 13387 7761 16396 -5528 -9404 -9368 22355
484 22355 14973 5341 793 13443 -5396 2904 16745 31852 21729 706 -13507 3587 25143
471 25143 12211 7911 14738 19026 34219 29627 18537 8247 15420 36308 33706 37165 15936
458 15936 -12570 -1567 7798 19970 9147 21976 28498 14499 9618 28054 39988 38127 21229
445 21229 -6532 -16920 -19435 -45120 -43968 -33344 -39294 -26303 -2766 -11157 -22072 -11679 -30983
432 -30983 -20249 -3261 -2860 6213 23314 14875 3208 14303 28142 29313 36947 17053 -19986
419 -19986 -10707 8452 18573 24616 10134 -3020 -1465 4356 -4663 4100 17551 5240 -27086
406 -27086 -41193 -44191 -24424 -15304 -13630 4756 51763 50357 22565 5170 21675 22040 19588
393 19588 24043 14810 -10544 -32666 -48995 -28758 -11029 -7454 2965 -5447 -22162 -10590 -10325
380 -10325 7438 18796 -3844 -9827 -15365 -29252 -23138 -16125 -10648 9546 9174 -1977 7174 20734
366 20734 45804 27417 29263 61026 44280 33459 28145 31370 52341 65310 45207 3238 -9148
353 -9148 -6121 -1181 6685 15130 20954 33682 21373 -764 -19534 -26767 -6703 -16179 -15872 13711
339 13711 29412 20110 -4839 -12145 -25610 -21421 -4342 540 9880 8829 6357 -7804 -4195 12945
325 12945 21219 25521 19540 28938 24140 8900 13634 40650 56587 40847 17753 5253 -15328
312 -15328 4940 20703 5704 -12521 4 5250 -7194 -141 -5506 10001 10952 -7549 -15541
299 -15541 -6937 -2226 -15728 -17463 -4586 -5449 10312 21194 28211 49280 28815 10155 14699
286 14699 3826 22766 25402 46324 30975 5304 6923 26406 14325 -9958 2354 -286 -10506
273 -10506 -1854 -5425 -7148 -26705 -16902 20334 14161 17011 15169 9992 -7759 -18010 7319 30252
259 30252 21288 18887 17660 -1525 -14091 -55 14422 15555 6284 22602 35251 27286 26086
246 26086 56780 52869 -4870 5209 51194 52442 30711 31739 39771 24266 20692 26586 29645
233 29645 29571 29739 30889 8956 -6712 -17309 -1597 9587 18080 22281 18313 22218 8845 3211
219 3211 17896 20619 13707 8156 10139 27421 20645 17115 21250 22966 38595 54138 37582 5789
205 5789 -19279 -7213 3446 -9696 -39441 -34711 -17427 -3306 4467 7940 -2988 -7045 1618
192 1618 9904 -16239 13526 23233 20672 28150 28583 19688 1618 11040 -11200 -13775 -10619 -19735
178 -19735 -28907 -24635 -20329 -20110 -13804 -1316 -8197 -7659 8647 17360 12233 3706 2351 7195 20496
163 20496 6516 13707 20509 6550 8790 1005 -11260 -8534 12246 22560 17504 13969 13905 25462
149 25462 33530 21687 1797 -13119 -12133 3426 22231 7263 -17271 -28842 -17175 -5653 10021
136 10021 -1079 5726 7624 21439 39031 52509 54059 40756 6067 -10396 13599 17709 18602
123 18602 17531 25185 15794 -15407 -23999 -20220 -3757 10639 27606 28386 26825 34443 30157 31385
109 31385 13731 4047 396 -13051 -16568 -2753 -14511 -23896 -20037 -17668 -29372 -34962 -17243
96 -17243 -3411 -16770 -23449 2318 14069 27358 281 -27237 -26073 -14923 -4938 -8131 -18827
83 -18827 -23201 -36615 -50714 -31357 3466 23645 30645 27345 33929 21272 4115 3522 26843
70 26843 23520 3460 -4665 17438 16887 20877 25949 20742 25613 35383 41366 30034 5165 -2554
56 -2554 -1849 19984 20309 18371 12759 24350 18651 8751 -1597 -6588 -13785 -14535 -1393 14564 20273
41 20273 7655 -12053 -10838 7423 23498 27786 9709 11189 33581 40841 30305 16568 4981
28 4981 10772 -2509 -11097 -1276 -3359 6411 13999 3215 22743 7261 1346 -10724 1272 2203
14 2203 20031 5464 -5473 7672 29391 9165 -4126 744 25971 20577 17132 19207 28395
1 28395 11965
0 11965
$$ Imaginary data points
##PAGE= N=2
##DATA TABLE= (X++(I..I)), XYDATA
32767 227398 226785 216465 215219 233445 258062 254414 255924 262327 261789 261531 262862 252502 238888 261032
32753 261032 272803 270273 279999 262044 234810 231947 249492 272943 273270 272072 291722 286730 284827
32740 284827 283367 290062 306938 330501 337068 320249 295166 314554 340887 338015 317035 301454
32728 301454 302935 307311 295025 294497 336940 366556 364227 339377 331095 340386 326960 317977 318557
32715 318557 294043 292097 302868 332006 350620 347879 331054 343665 351556 369464 359963 357180
32703 357180 352595 354961 377354 395419 403034 384803 379189 377835 382871 387077 383302 382209 395227
32690 395227 416521 418286 418831 425312 427028 427999 435134 432845 439814 444335 419713 411231 410835 421591
32676 421591 428089 442159 451976 445257 444943 453753 450097 454022 440686 447511 449736 455533 448418 456389
32662 456389 464008 482752 479366 466194 479449 478389 480360 492958 489007 482967 489511 508349 518650
32649 518650 515056 508529 520707 520654 503670 512862 524082 545989 569290 578662 580789 584812 553568
32636 553568 547509 547726 547381 535402 531222 547131 553618 545460 533548 520105 525120 520648 519014 534603
32622 534603 549594 557699 562992 577328 564279 548765 553211 570082 570250 581571 590572 589196 561008
32609 561008 566710 568636 573641 571205 566799 566681 585932 618116 620499 630146 626272 612751 617992 626448
32595 626448 650413 666374 663993 639046 620620 617949 615520 626020 632974 642262 636559 625510 617541
32582 617541 607406 612741 632335 630297 637358 626748 627348 648853 660627 656977 649406 644722 630378
32569 630378 629391 639313 640014 624855 631067 629435 648320 662324 650227 679349 685721 683388 682980 688960
32555 688960 693521 682510 697057 712447 728795 723366 718324 719879 719560 700765 696940 712084 704054
32542 704054 678822 692242 694934 704332 705538 706486 703981 681311 678055 708244 721716 750859 775786
32529 775786 762184 732504 723673 715157 716063 740128 734820 738700 762907 768155 761500 759795 736659
32516 736659 712822 735372 791036 788089 752305 745644 736881 745228 758255 750089 740721 737499 749448
32503 749448 757523 754729 750520 767142 792473 784027 771517 776382 778891 780638 788525 783228 784166 786961
32489 786961 781636 808669 816768 800642 785454 776669 777708 783793 772114 795222 810760 783028
32477 783028 760773 782013 824632 833655 809371 778828 773692 815212 836517 849574 832831 802391
32465 802391 813488 830037 777595 762401 765390 805471 819476 801433 808567 832851 829027 832264
32453 832264 800687 803446 813313 831336 818428 786495 811286 869796 883310 850854 826465 809117
32441 809117 806721 825404 836267 844803 849698 835391 825254 830435 830633 824709 852940 849613 827396
32428 827396 808913 826527 837329 852734 867337 897966 921684 901555 879307 880751 873986 867212
32416 867212 861345 866241 870887 857855 847797 857685 862682 867354 886228 890342 862436 862969 860079
32403 860079 881352 882211 864405 848255 859446 891508 883381 862253 867661 887423 897599 928963
32391 928963 903922 902942 921955 927632 930414 915331 914447 912179 893718 907321 896372 898406 928248
32378 928248 921806 929199 964328 972339 942691 939582 930308 921317 924336 946768 949273 949100 940278 929153
32364 929153 907516 900471 893950 891503 917639 944198 960238 945106 941772 959263 955702 948523 947220
32351 947220 955439 943885 931444 927493 912019 910097 938375 931396 947666 959345 963775 979785
32339 979785 1004771 1009667 983072 993281 956242 928735 930412 955225 965670 952603 941233 964797
32327 964797 958542 923554 908042 882229 914314 937829 951545 987811 995252 960156 920357 937432
32315 937432 929562 910833 927846 934870 929366 925506 936086 973855 977527 953871 946519 947126 971472
32302 971472 966811 967236 944707 928877 939862 947309 939929 932444 935854 958151 971238 953913 973250
32289 973250 984022 974793 986956 1001435 999039 972228 997395 1026602 1012711 998415 964591 964183
32277 964183 965785 959214 983089 984717 973488 969804 983303 990160 986116 962902 967442 987513 983337
32264 983337 968444 977431 968876 951615 925608 948654 974091 989575 992060 984126 947048 956968
32252 956968 975673 981249 970918 961791 955344 949113 970669 997782 993131 979426 976930 978849 965792
32239 965792 971452 961421 953781 938574 950345 953318 960035 967880 965149 976741 1001932 997036 970802
32226 970802 959020 972413 984904 980269 978391 967670 961960 966608 995979 1002874 1026930 1017201 1023516
32213 1023516 1014873 1000353 988679 995948 1001698 1040002 1035711 1033101 1005663 985839 986277 1001398 1006414
32200 1006414 1002159 975135 947983 996491 1027122 1006023 988941 990765 987331 985423 985533 998325
32188 998325 998036 993916 993915 991045 965682 969620 966735 970056 976962 980204 999237 1012228 1011821 998104
32174 998104 1005959 1011306 1005915 1015698 1006717 995784 1016622 1027954 1016782 996064 992725 1010017 1019380
32161 1019380 1017150 1004282 980395 986688 985565 962554 983141 1011157 1008889 999227 1011615 1021066
32149 1021066 1006889 998890 999755 990842 972757 984694 1003579 1015926 1040699 1054352 1025304 988498
32137 988498 969007 967207 997380 1010044 1011152 1026679 1025262 1010961 990544 989041 1015781 1003861
32125 1003861 1002211 1001741 1012771 989377 975871 959717 977099 1001707 1027242 1021022 1011074 1015506
32113 1015506 997469 1019350 1058044 1069944 1060979 1029512 1020962 1010318 1007834 1003087 991134 1007956
$$ [...]
##END NTUPLES=NMR SPECTRUM
##END=
