##TITLE=Analysis number 322414
Compound Code cc 50601
Book Reference 486/56
Project Code adrs
Chemist Name simons
##JCAMPDX= 6.0         $$ Bruker NMR JCAMP-DX V2.0
##DATA TYPE= NMR SPECTRUM
##DATA CLASS= NTUPLES
##ORIGIN= Bruker BioSpin GmbH
##OWNER= nmr
$$ XWIN-NMR		Version 3.5
$$ Mon Sep 25 14:26:01 2006 GMT Daylight Time (UT+1h)  MAYBRIDGE\nmr@NMR_250MHZ
##.OBSERVE FREQUENCY= 250.131544655141
##.OBSERVE NUCLEUS= ^1H
##.ACQUISITION MODE= SIMULTANEOUS (DQD)
##.ACQUISITION SCHEME= undefined
##.AVERAGES= 16
##.DIGITISER RES= 18
##SPECTROMETER/DATA SYSTEM= dpx250
##.PULSE SEQUENCE= zg30
##.SOLVENT NAME= DMSO
##.SHIFT REFERENCE= (INTERNAL, DMSO, 0, 16.522)
##AUDIT TRAIL= $$ (NUMBER, WHEN, WHO, WHERE, WHAT)
$$ ##TITLE= Audit trail, XWIN-NMR		Version 3.5
$$ ##JCAMPDX= 5.01
$$ ##ORIGIN= Bruker BioSpin GmbH
$$ ##OWNER= nmr
$$ C:\u/data/dgb/nmr/ADRS/1330/pdata/1/auditp.txt
$$ ##AUDIT TRAIL=  $$ (NUMBER, WHEN, WHO, WHERE, WHAT)
(   1,<2006-09-25 14:25:30.71 +100>,<MAYBRIDGE\nmr>,<NMR_250MHZ>,
      <created by zg, POWCHK disabled, PULCHK disabled
       configuration hash MD5:
       E2 DF 36 D8 04 B2 41 60 5A D7 A3 38 5A 4B D0 FE
       data hash MD5: 64K
       DF 72 AE 90 CE B6 F5 20 B5 BB 2D 85 8F 3A 3D C3>)
(   2,<2006-09-25 14:25:44.32 +100>,<MAYBRIDGE\nmr>,<NMR_250MHZ>,
      <Start of raw data processing
       ef LB = 0.3 FT_mod = 6 PKNL = 1 SI = 32K 
       data hash MD5: 32K
       DF EF 3D 69 DB F7 8B A0 CF DC 94 8D EA A1 91 4F>)
(   3,<2006-09-25 14:25:45.93 +100>,<MAYBRIDGE\nmr>,<NMR_250MHZ>,
      <apk 
       data hash MD5: 32K
       94 87 A9 1C 17 CD FA 69 66 A3 49 CB C9 46 8C 31>)
(   4,<2006-09-25 14:25:46.76 +100>,<MAYBRIDGE\nmr>,<NMR_250MHZ>,
      <abs ABSG = 5 
       data hash MD5: 32K
       5D 6B 84 1D 87 A9 F5 A0 45 DF C2 79 C6 A5 82 09>)
$$ ##END=
$$ 
$$ hash MD5
$$ C7 A5 CC 99 D2 A2 6E B9 53 37 FA 6B E7 B7 F1 9F
##$RELAX= 
##$RELAX= 
##$RELAX= 
##$RELAX= 
##$RELAX= 
##$RELAX= 
##$RELAX= 
$$ Bruker specific parameters
$$ --------------------------
##$DU= <C:\u>
##$EXPNO= 1330
##$NAME= <ADRS>
##$PROCNO= 1
##$TYPE= <nmr>
##$USER= <dgb>
##$AMP= (0..31)
100 100 100 100 100 100 100 100 100 100 100 100 100 100 100 100 100 100 
100 100 100 100 100 100 100 100 100 100 100 100 100 100 
##$AQSEQ= 0
##$AQ_mod= 3
##$AUNM= <au_zg>
##$AUTOPOS= <33 >
##$BF1= 250.13
##$BF2= 250.13
##$BF3= 250.13
##$BF4= 250.13
##$BF5= 500.13
##$BF6= 500.13
##$BF7= 500.13
##$BF8= 500.13
##$BYTORDA= 1
##$CFDGTYP= 0
##$CFRGTYP= 5
##$CHEMSTR= <none>
##$CNST= (0..31)
1 1 145 1 1 1 1 1 1 1 1 1 1 1 1 1 1 1 1 1 1 1 1 1 1 1 1 1 1 1 1 1 
##$CPDPRG= <>
##$CPDPRG1= <>
##$CPDPRG2= <>
##$CPDPRG3= <>
##$CPDPRG4= <mlev>
##$CPDPRG5= <mlev>
##$CPDPRG6= <mlev>
##$CPDPRG7= <mlev>
##$CPDPRG8= <mlev>
##$CPDPRGB= <>
##$CPDPRGT= <>
##$D= (0..31)
0 1 0 0 0 0 0 0 0 0.06 0 0 0 0 0 0 0.0002 0 0 0 0 0 0 0 0 0 0 0 0 0 0 
0 
##$DATE= 1159190729
##$DBL= (0..7)
120 120 120 120 120 120 120 120 
##$DBP= (0..7)
150 150 150 150 150 150 150 150 
##$DBP07= 0
##$DBPNAM0= <>
##$DBPNAM1= <>
$$ [...]
##$SUBNAM7= <"">
##$SUBNAM8= <"">
##$SUBNAM9= <"">
##$SW= 20.6930455092707
##$SWIBOX= (0..15)
0 0 3 0 0 0 0 0 0 0 0 0 0 0 0 0 
##$SW_h= 5175.983436853
##$TD= 65536
##$TD0= 1
##$TE= 295.16
##$TE2= 300
##$TE3= 300
##$TEG= 300
##$TL= (0..7)
0 120 120 120 120 120 120 120 
##$TP= (0..7)
150 150 150 150 150 150 150 150 
##$TP07= 0
##$TPNAME0= <>
##$TPNAME1= <>
##$TPNAME2= <>
##$TPNAME3= <>
##$TPNAME4= <>
##$TPNAME5= <>
##$TPNAME6= <>
##$TPNAME7= <>
##$TPOAL= (0..7)
0.5 0.5 0.5 0.5 0.5 0.5 0.5 0.5 
##$TPOFFS= (0..7)
0 0 0 0 0 0 0 0 
##$TUNHIN= 0
##$TUNHOUT= 0
##$TUNXOUT= 0
##$USERA1= <user>
##$USERA2= <user>
##$USERA3= <user>
##$USERA4= <user>
##$USERA5= <user>
##$V9= 5
##$VALIST= <valist>
##$VCLIST= <CCCCCCCCCCCCCCC>
##$VD= 0
##$VDLIST= <DDDDDDDDDDDDDDD>
##$VPLIST= <PPPPPPPPPPPPPPP>
##$VTLIST= <TTTTTTTTTTTTTTT>
##$WBST= 1024
##$WBSW= 4
##$XGAIN= (0..3)
0 0 0 0 
##$XL= 0
##$YL= 0
##$YMAX_a= 381578
##$YMIN_a= -386324
##$ZGOPTNS= <>
##$ZL1= 120
##$ZL2= 120
##$ZL3= 120
##$ZL4= 120
##$ABSF1= 16.522
##$ABSF2= -4.171173
##$ABSG= 5
##$ABSL= 3
##$ALPHA= 0
##$AQORDER= 0
##$ASSFAC= 0
##$ASSFACI= 0
##$ASSFACX= 0
##$ASSWID= 0
##$AUNMP= <proc_1d>
##$AZFE= 0.1
##$AZFW= 0.1
##$BCFW= 0
##$BC_mod= 0
##$BYTORDP= 0
##$COROFFS= 0
##$CY= 12.5
##$DATMOD= 1
##$DC= 0
##$DFILT= <>
##$DTYPP= 0
##$F1P= 14.0000005364418
##$F2P= -0.99999901652339
##$FCOR= 0.5
##$FTSIZE= 32768
##$FT_mod= 6
##$GAMMA= 0
##$GB= 0
##$INTBC= 1
##$INTSCL= 1
##$ISEN= 128
##$LB= 0.3
##$LEV0= 0
##$LPBIN= 0
##$MAXI= 10000
##$MC2= 0
##$MEAN= 0
##$ME_mod= 0
##$MI= 0
##$NCOEF= 0
##$NC_proc= -4
##$NLEV= 6
##$NOISF1= 0
##$NOISF2= 0
##$NSP= 0
##$NTH_PI= 0
##$NZP= 0
##$OFFSET= 16.522
##$PC= 1
##$PHC0= 137.1923
##$PHC1= 8.107846
##$PH_mod= 1
##$PKNL= yes
##$PPARMOD= 0
##$PSCAL= 4
##$PSIGN= 0
##$REVERSE= no
##$SF= 250.13
##$SI= 32768
##$SIGF1= 0
##$SIGF2= 0
##$SINO= 400
##$SIOLD= 32768
##$SREGLST= <1H.DMSO>
##$SSB= 0
##$STSI= 32768
##$STSR= 0
##$SW_p= 5175.98343685301
##$SYMM= 0
##$S_DEV= 0
##$TDeff= 65536
##$TDoff= 0
##$TI= <Analysis number 999999
Compound Code 99
Book Reference 9
Project Code 9>
##$TILT= no
##$TM1= 0
##$TM2= 0
##$TOPLEV= 0
##$USERP1= <user>
##$USERP2= <user>
##$USERP3= <user>
##$USERP4= <user>
##$USERP5= <user>
##$WDW= 1
##$XDIM= 32768
##$YMAX_p= 522879654
##$YMIN_p= -113630
$$ End of Bruker specific parameters
$$ ---------------------------------
##NTUPLES= NMR SPECTRUM
##VAR_NAME=  FREQUENCY,     SPECTRUM/REAL,   SPECTRUM/IMAG
##SYMBOL=    X,             R,               I
##VAR_TYPE=  INDEPENDENT,   DEPENDENT,       DEPENDENT
##VAR_FORM=  AFFN,          ASDF,            ASDF
##VAR_DIM=   32768,         32768,           32768
##UNITS=     HZ,            ARBITRARY UNITS, ARBITRARY UNITS
##FACTOR=    0.157963299565203, 1,           1
##FIRST=     4132.6476996994, 0,             0
##LAST=      -1043.33573715361, 0,           0
##MIN=       -1043.33573715361, -113630,     0
##MAX=       4132.6476996994, 522879654,     0
$$ Real data points
##PAGE= N=1
##DATA TABLE= (X++(R..R)), XYDATA
$$ [...]
$$ plain form
14593 36913 30398 31448 30191 18834 10990 -24191 -37443 -48275 -41142 -48569 -47719 -21883 15974
14580 15974 45544 44451 -2261 -14894 -25070 -39651 -41065 -25546 -27678 -23993 -11874 -22302
14568 -22302 -30452 -14551 3894 1423 11123 -7409 -28997 -26644 6098 12586 19682 44975 39639
14555 39639 40972 44320 45597 45249 26796 8219 4646 -25777 -26431 -36280 -54699 -13989 16099
14542 16099 20825 2296 8294 -6336 -28344 -21972 -3224 21996 6739 -9430 -23227 -27487
14530 -27487 -15486 11277 -13341 -31886 -39038 -19143 -33611 -30112 -23606 -27843 -11122 24306
14518 24306 16193 -5684 -18479 -6791 -5424 -16025 21644 14592 -10901 -30129 -27218 -128
14506 -128 8710 5786 6214 23420 9235 -1260 -15033 -25870 -18964 7853 19898 2528 -23876
$$ packed form
14593C6913o515J050j257j1357p844l5181j3252j0832P133p427Q50K5836L7857
14580A5974K9570j093m6712j2633j0176j4581j414J5519k132L685J2119j0428
14568b2302q150J5901J8445k471R700j8532k1588K353L2742O488P096K5293n336
14555C9639J333L348J277l48j8453j8577l573l0423o54r849j8419M0710L0088
14542A6099M726j8529N998j4630k2008O372J8748K5220j5257j6169j3797m260
14530b7487J2001K6763k4618j8545p152J9895j4468L499O506m237J6721L5428
14518B4306q113k1877j2795J1688J367j0601L7669p052k5493j9228K911K7090
14506a28Q838k924M28J7206j4185j0495j3773j0837O906K6817J2045j7370k6404
$$ plain form
14493 -23876 -17696 -33012 -50212 -40078 -21458 -10552 -21823 -14552 -9292 -20468 -42405 -38989
14481 -38989 -7743 -16165 -35517 -19565 -16962 -41758 -28937 -14540 14288 21953 39404 43249
14469 43249 34089 15058 -815 -13880 3069 28698 12445 -9066 -5581 1137 5750 9134 -2532
14456 -2532 -10925 -7914 -4239 4727 20555 1347 1338 -8627 3893 -15151 -28055 -24898 -21902 -15432
14442 -15432 7035 10073 31173 23739 16608 39402 21250 -18768 -23842 -27838 -8890 25070 -14093
14429 -14093 -35274 -6177 12239 3686 -24957 -32105 -23598 2808 8727 7048 13609 -14570 -10006
14416 -10006 9671 17764 19533 -1626 -32329 -17474 -5707 -25970 -36881 -45154 -65077 -54954
14404 -54954 -30430 -24150 -32442 -6484 -9516 20063 33592 33581 22330 10369 -10679 -12970 -3518
$$ packed form
14493b3876O180j5316j7200J0134J8620J0906j1271P271N260j1176k1937L416
14481c8989L1246q422j9352J5952K603k4796J2821J4397K8828P665J7451L845
14469D3249r160j9031j5873j3065J6949K5629j6253k1511L485O718M613L384j1666
14456b532q393L011L675Q966J5828j9208rr965J2520j9044j2904L157K996O470
14442a5432K2467L038K1100p434p131K2794j8152m0018n074l996J8948L3960l9163
14429a4093k1181K9097J8416q553k8643p148Q507K6406N919j679O561k8179M564
14416a0006J9677Q093J769k1159l0703J4855J1767k0263j0911q273j9923J0123
14404e4954K4524O280q292K5958l032K9579J3529j1j1251j1961k1048k291R452
$$ plain form
14391 -3518 15511 1288 -7542 -10071 -17162 -15072 -7865 -980 16184 27406 36899 17299 -17812
14378 -17812 -26136 -18672 -26243 -29171 -27810 -30739 -54054 -57466 -56841 -38972 -15548 8271 25316
14365 25316 42880 55650 40791 9894 -16119 -15058 -15054 -27397 -8082 4593 27636 31917 15566
14352 15566 -17761 -8849 -1450 7574 2466 -4086 -8499 -1542 12105 -15555 -34550 -10012 -13165
14339 -13165 -7627 -10362 -11474 -6573 9992 24553 32181 34077 19948 14991 28970 22617 12238
14326 12238 461 -13880 -15255 8410 14049 -15181 -32778 -32179 -3306 -3221 -17726 -2620 -6625
14313 -6625 -19178 11678 23330 -6551 -19261 -17851 -23427 92 2589 -19885 -16407 -26724 -42559
14300 -42559 -18605 5273 13098 32531 40739 20241 12172 12348 1186 10719 28402 51539 25226
$$ packed form
14391c518J9029j4223q830k529p091K090P207O885J7164J1222R493j9600l5111
14378a7812q324P464p571k928J361k929k3315l412O25J7869K3424K3819J7045
14365B5316J7564J2770j4859l0897k6013J061Mj2343J9315J2675K3043M281j6351
14352A5566l3327Q912P399R024n108o552m413O957J3647k7660j8995K4538l153
14339a3165N538k735j112M901J6565J4561P628J896j4129m957J3979o353j0379
14326A2238j1777j4341j375K3665N639k9230j7597N99K8873Q5j4505J5106m005
14313f625j2553L0856J1652k9881j2710J410n576K3519K497k2474L478j0317j5835
14300d2559K3954K3878P825J9433Q208k0498q069J76j1162R533J7683K3137k6313
$$ plain form
14287 25226 -13628 -36130 -47326 -33728 -6320 -4057 -12992 -23105 -36685 -53363 -38873 -21422
14275 -21422 -6506 2374 3921 2113 -2947 -10588 -11599 -23488 -43140 -14564 11855 21495 -22605
14262 -22605 -22939 26119 30769 31395 23817 3202 1750 3777 -1365 -4946 16788 18127 12127 5987
14248 5987 11151 35689 32768 3010 719 25867 17672 13649 20437 -6412 -2276 14695 -8558
14235 -8558 -33070 -39609 -20837 3053 11620 27101 -7951 -46924 -25364 -31663 -12767 -3050 2690
14222 2690 9728 19474 53665 46215 19485 -18740 507 29121 -323 -18607 5302 9072 3433
14209 3433 -4947 1272 -9972 -19409 -5692 -3601 -5626 -5547 8809 15715 24345 28957 4608 -17558
14195 -17558 -24894 -38726 -57306 -35471 -14536 -5971 -31766 -25804 -14833 -15713 9612 17731 13271
$$ packed form
14287B5226l8854k2502j1196J3598K7408K263q935j0113j3580j6678J4490J7451
14275b1422J4916Q880J547j808n060p641j011j1889j9652K8576K6419R640m4100
14262b2605l34M9058M650O26p578k0615j452K027n142l581K1734J339o000o140
14248E987N164K4538k921k9758k291K5148q195m023O788k6849M136J6971k3253
14235h558k4512o539J8772K3890Q567J5481l5052l8973K1560o299J8896R717N740
14222B690P038R746L4191p450k6730l8225J9247K8614k9444j8284K3909L770n639
14209C433q380O219j1244r437J3717K091k025P9J4356O906Q630M612k4349k2166
14195a7558p336j3832j8580K1835K0935Q565k5795N962J0971q80K5325Q119m460
$$ plain form
14182 13271 11279 7320 -5520 -16844 -12222 459 2119 -9171 -25828 33449 69565 53429
14170 53429 35554 36156 40019 59698 81365 50715 27395 4660 -10928 15108 9387 -14599
14158 -14599 -22990 -19732 1349 26890 30782 20821 37031 55323 32444 13900 14956 16286 27322
14145 27322 40940 -6900 -22234 5979 23682 9381 12447 18557 10061 -14917 -19368 -10910 -27016
14132 -27016 -21523 -5725 -6243 -14307 5105 6106 -1731 -23064 -35202 -26705 -13355 -9849 6636
14119 6636 37576 50465 34163 -2253 -12582 7339 36365 34520 23548 4824 9439 6760
14107 6760 -7394 7899 20572 14955 38171 52804 2845 -1180 3816 24960 29918 39525 45393
14094 45393 19099 -1403 -31001 -32407 -25453 -15345 17940 20820 26865 36791 11561 28528 35111
$$ packed form
14182A3271j992l959j2840j1324M622J2681J660j1290j6657N9277L6116j6136
14170E3429j7875O02L863J9679K1667l0650k3320k2735j5588K6036n721k3986
14158a4599q391L258K1081K5541L892r961J6210J8292k2879j8544J056J330J1036
14145B7322J3618m7840j5334K8213J7703j4301L066O110q496k4978m451Q458j6106
14132b7016N493J5798n18q064J9412J001p837k1333j2138Q497J3350L506J6485
14119F636L0940J2889j6302l6416j0329J9921K9026j845j0972j8724M615k679
14107F760j4154J5293J2673n617K3216J4633m9959m025M996K1144M958R607N868
14094D5393k6294k0502k9598j406O954J0108L3285K880O045R926k5230J6967O583
$$ plain form
14081 35111 28906 37673 13860 -9849 -17398 -3855 17865 16940 26539 24896 20155 -11592 -16617
14068 -16617 -13512 -13857 -26785 -19124 -193 -450 -13834 -9471 -12972 9591 33681 5496 -5886
14055 -5886 -2957 -4847 9595 10775 5264 -20981 -7115 -1192 3482 13179 10302 -9036 -21698
14042 -21698 -37900 -33066 -477 -708 8234 14533 1189 -2349 -16661 -11130 -8693 -17910 5500
14029 5500 18585 22303 -409 -17586 15559 33569 10518 28314 16536 7324 12867 22240 16593
14016 16593 18967 21596 22459 17341 194 -14562 -34685 -34690 -30530 -17303 7665 37393 30205 25436
14002 25436 14598 13052 14189 14179 1055 5696 -10279 -3161 7741 16877 55221 54045 32110
13989 32110 27222 25616 -1811 -16840 -54683 -34052 -801 23930 35138 39188 41990 43020 38623
$$ packed form
14081C5111o205Q767k3813k3709p549J3543K1720r25R599j643m741l1747n025
14068a6617L105l45j2928P661J8931k57j3384M363l501K2563K4090k8185j1382
14055e886K929j890J4442J180n511k6245J3866N923M674R697k877j9338j2662
14042b1698j6202M834L2589k31Q942O299j3344l538j4312N531K437r217K3410
14029E500J3085L718k2712j7177L3145J8010k3051J7796j1778r212N543R373n647
14016A6593K374K629Q63n118j7147j4756k0123nM160J3227K4968K9728p188m769
14002B5436j0838j546J137j0j3124M641j5975P118J0902R136L8344j176k1935
13989C2110m888j606k7427j5029l7843K0631L3251K4731J1208M050K802J030m397
$$ plain form
13976 38623 29055 45862 40961 41240 32643 43025 7552 3764 9331 777 -11511 -25528 -20348
13963 -20348 -27062 -32153 -19282 10134 18240 18999 28878 19791 1770 -1815 1505 32766 38387 19276
13949 19276 2735 17853 42118 41868 48144 39070 26411 25143 4753 5282 32509 14202 14549
13936 14549 38974 38697 34452 15432 18482 1782 -14759 -18178 -20716 -42200 -27829 2991 16410
13923 16410 39969 42350 50763 34856 16818 26552 35195 29354 11612 12976 -4442 5662 9478
13910 9478 5099 4675 774 12777 31864 31104 38747 31383 15975 2761 -1422 11568 24017 17315
13896 17315 18804 33057 30243 4456 14114 16638 16871 25484 37501 41639 52669 19880 35897
13883 35897 50399 45416 39000 30853 -5680 -31956 -12792 -19788 -27768 -41224 -27698 23188 53699
$$ packed form
13976C8623r568J6807m901K79q597J0382l5473l788N567q554j2288j4017N180
13963b0348o714n091J2871K9416Q106P59R879r087j8021l585L320L1261N621j9111
13949A9276j6541J5118K4265k50O276r074j2659j268k0390N29K7227j8307L47
13936A4549K4425k77m245j9020L050j6700j6541l419k538k1484J4371L0820J3419
13923A6410K3559K381Q413j5907j8038R734Q643n841j7742J364j7418J0104L816
13910I478m379m24l901J2003J9087p60P643p364j5408j3214m183J2990J2449o702
13896A7315J489J4253k814k5787R658K524K33Q613J2017M138J1030l2789J6017
13883C5897J4502m983o416q147l6533k6276J9164o996p980j3456J3526N0886L0511
$$ plain form
13870 53699 37911 29824 8587 24998 22422 33790 36491 22847 2650 25824 26150 1592 -46599
13857 -46599 -42500 5960 -4794 -24182 -22106 10459 14695 16148 26022 40201 28384 11744 -7080
13844 -7080 -32437 -29442 -22571 -7871 -5117 23198 33083 15542 -3087 -9413 10917 29425 47724
13831 47724 35098 23288 25571 23759 23380 31604 20725 36308 29810 48629 43011 30667 45260
13818 45260 59102 48667 64924 53924 29937 33443 56307 66700 49321 43043 27988 22263
13806 22263 15233 20623 22393 27845 21905 25261 39628 32217 33773 38196 27317 15510 -8049
13793 -8049 -31976 2946 54762 59312 42640 44214 46939 34861 20267 29039 12452 17531 21255
13780 21255 19454 18303 40085 40151 35466 26209 37293 48408 71820 71880 45071 29755 5292 -7811
$$ packed form
13870E3699j5788q087k1237J6411k576J1368K701j3644k0197K3174L26k4558m8191
13857d6599M099M8460j0754j9388K076L2565M236J453R874J4179j1817j6640j8824
13844g080k5357K995O871J4700K754K8315R885j7541j8629o326K0330J8508J8299
13831D7724j2626j1810K283j812l79Q224j0879J5583o498J8819n618j2344J4593
13818D5260J3842j0435J6257j1000k3987L506K2864J0393j7379o278j5055n725
13806B2263p030N390J770N452n940L356J4367p411J556M423j0879j1807k3559
13793h049k3927L4922N1816M550j6672J574K725j2078j4594Q772j6587N079L724
13780B1255j801j151K1782O6m685r257J1084J1115K3412O0k6809j5316k4463j3103
$$ plain form
13766 -7811 -2332 26577 29827 14943 11316 13019 784 23749 25957 24462 27343 45876 71305
13753 71305 73597 43311 17744 17390 22982 33697 22733 -10766 -2287 217 8983 28975 30808
13740 30808 33647 21089 15991 34019 38019 50062 30961 -10261 -25551 -15893 1797 24826
13728 24826 24310 10359 13873 25807 22568 47800 57612 46848 48510 36382 30197 38645 59654
13715 59654 42520 28020 4383 -20527 3044 30850 39820 35730 45664 57180 49558 18487
13703 18487 21622 32973 32821 31255 41257 42760 3185 488 14672 4701 9018 2851 -1698 -7398
13689 -7398 5171 27341 51185 39713 35832 24015 8240 1511 11146 18288 39303 44721 39128
13676 39128 38923 6174 7287 8241 5102 12817 8950 26644 37178 22200 25903 32056 23243 32476
$$ packed form
13766g811N479K8909L250j4884l627J703j2235K2965K208j495K881J8533K5429
13753G1305K292l0286k5567l54N592J0715j0964l3499Q479K504Q766J9992J833
13740C0808K839j2558n098J8028M000J2043j9101m1222j5290R658J7690K3029
13728B4826n16j3951L514J1934l239K5232R812j0764J662j2128o185Q448K1009
13715E9654j7134j4500k3637k4910K3571K7806Q970m090R934J1516p622l1071
13703A8487L135J1351j52j566J0002J503l9575k697J4184r971M317o167m549n700
13689g398J2569K2170K3844j1472l881j1817j5775o729R635P142K1015N418n593
13676C9128k05l2749J113R54l139P715l867J7694J0534j4978L703O153q813R233
$$ plain form
13662 32476 63845 98875 120693 97093 90780 69655 34975 24570 24653 19780 21100 34289 77406
13649 77406 77687 66611 51051 61763 63746 52060 15910 -10961 7721 34055 20718 16780
13637 16780 14208 16289 28340 24937 18274 7561 13544 47661 57773 38264 9493 2722 20485
13624 20485 19233 38533 23097 8328 28452 69476 81152 79903 46449 73235 69164 50413
13612 50413 59189 49240 38554 21782 46909 29871 22293 43889 16926 2392 27014 10857
13600 10857 -14094 -5663 -13600 -3100 40118 54437 46932 16611 3063 4859 24799 22382 38625
13587 38625 39984 36421 60881 66396 39967 57624 73725 58922 38354 23012 13931 -13570
13575 -13570 -13278 1704 2048 5396 5162 45967 54126 19189 40220 20256 24568 30531 54520 75797
$$ packed form
13662C2476L1369L5030K1818k3600o313k1125l4680j0405Q3m873J320J3189M3117
13649G7406K81j1076j5560J0712J983j1686l6150k6871J8682K6334j3337l938
13637A6780k572K081J2051l403o663j0713N983L4117J0112j9509k8771o771J7763
13624B0485j252J9300j5436j4769K0124M1024J1676j249l3454K6786m071j8751
13612E0413Q776r949j0686j6772K5127j7038p578K1596k6963j4534K4622j6157
13600A0857k4951Q431p937J0500M3218J4319p505l0321j3548J796J9940k417J6243
13587C8625J359l563K4460N515k6429J7657J6101j4803k0568j5342r081k7501
13575a3570K92J4982L44L348k34M0805Q159l4937K1031j9964M312N963K3989K1277
$$ plain form
13561 75797 89191 66543 57597 62190 50669 44665 28349 4969 21831 33076 36299 40426 14394
13548 14394 9875 29022 38938 28579 1572 8521 20945 15111 24489 25238 -7785 16966 64432
13535 64432 70412 81412 89841 73393 54003 50644 57200 38742 36298 5662 9409 6961 -5252
13522 -5252 23015 49651 38450 16551 11390 35817 30493 -13867 -21753 -11844 -12322 6367 40901
13509 40901 29210 9390 -3547 10066 13212 -11626 2837 32301 35874 26532 37930 51748
13497 51748 42694 -7259 -39074 -15670 -243 -30852 -57204 -48964 -13837 16688 -4084 2736
13485 2736 42941 48149 44156 67432 73983 53608 45003 51853 63379 68621 52591 36801 46624
13472 46624 38178 -11137 -33789 -15257 29495 52449 51789 47831 37699 32957 28888 11805 11953
$$ packed form
13561G5797J3394k2648q946M593j1521o004j6316k3380J6862J1245L223M127k6032
13548A4394m519J9147R916j0359k7007O949J2424n834R378P49l3023K4751M7466
13535F4432N980J1000Q429j6448j9390l359O556j8458k444l0636L747k448j2213
13522e252K8267K6636j1201k1899n161K4427n324m4360p886R909m78J8689L4534
13509D0901j1691j9820j2937J3613L146k4838J4463K9464L573r342J1398J3818
13497E1748r054m9953l1815K3404J5427l0609k6352Q240L5127L0525k0772O820
13485B736M0205N208l993K3276O551k0375q605O850J1526N242j6030j5790R823
13472D6624q446m9315k2652J8532M4752K2954o60l958j0132m742m069j7083J48
$$ plain form
13459 11953 9584 16138 62590 77023 56216 37870 63817 66032 74801 70858 34224 11092 24664
13446 24664 31433 41992 70066 58962 66818 70410 34211 23279 9283 4137 38262 63333
13434 63333 71315 52503 76243 68888 37117 30968 35835 44328 71233 50352 44554 32905 17663
13421 17663 7503 5471 3414 18461 43541 30432 42391 67343 76315 56146 37751 11847
13409 11847 2859 50528 81213 62773 32430 11830 46615 56511 73744 87929 56333 82764
13397 82764 55591 25334 30360 15969 24803 43864 13065 -8990 8934 21343 40932 44959
13385 44959 54090 54679 37471 36888 24487 14880 12132 21199 48901 37043 24290 9698 49016
13372 49016 84524 64608 56143 56446 76861 79934 80191 85227 75853 48237 74053 98871 109602
$$ packed form
13459A1953k369O554M6452J4433k0807j8346K5947K215Q769l943l6634k3132J3572
13446B4664O769J0559K8074j1104P856L592l6199j0932j3996n146L4125K5071
13434F3333P982j8812K3740p355l1771o149M867Q493K6905k0881n798j1649j5242
13421A7663j0160k032k057J5047K5080j3109J1959K4952Q972k0169j8395k5904
13409A1847q988M7669L0685j8440l0343k0600L4785R896J7233J4185l1596K6431
13397H2764k7173l0257N026j4391Q834J9061l0799k2055J7924J2409J9589M027
13385D4959R131N89j7208n83j2401r607k748R067K7702j1858j2753j4592L9318
13372D9016L5508j9916q465L03K0415L073K57N036r374k7616K5816K4818J0731
$$ plain form
13359 109602 89153 69737 73614 73380 86277 90552 89217 82403 79522 85807 96908 93401 68976
13346 68976 53477 57731 54713 71751 82823 95647 89159 79734 54347 63376 84376 110792 95125
13333 95125 56517 28183 35848 44395 49499 70291 78738 57033 54825 60523 62533 63911 78942
13320 78942 47561 20334 7596 6659 32776 62801 87981 96892 93334 90347 86121 81793 64688
13307 64688 46829 46597 49902 59913 55795 66330 61934 60707 44353 56358 48890 39528 23675
13294 23675 35504 33949 32618 69120 61074 51796 49070 48337 43947 45551 43453 36206 41993 38702
13280 38702 35780 52658 42968 35504 22699 13510 16095 39990 40374 40849 43090 47439 47257 52278
13266 52278 29563 4446 -6326 14240 34520 50588 45863 51082 62022 67054 61644 44042
$$ packed form
13359A09602k0449j9416L877k34J2897M275j335o814k881O285J1101l507k4425
13346F8976j5499M254l018J7038J1072J2824o488r425k5387R029K1000K6416j5667
13333I5125l8608k8334P665Q547N104K0792Q447k1705k208N698K010J378J5031
13320G8942l1381k7227j2738r37K6117L0025K5180Q911l558k987m226m328j7105
13307F4688j7859k32L305J0011m118J0535m396j227j6354J2005p468r362j5853
13294B3675J1829j555j331L6502q046r278k726p33m390J604k098p247N787l291
13280C8702k922J6878r690p464j2805r189K585K3895L84M75K241M349j82N021
13266E2278k2715k5117j0772K0566K0280J6068m725N219J0940N032n410j7602
$$ plain form
13254 44042 49959 49251 48420 35367 49781 72273 57692 75689 99642 72113 60707 61451 67556
13241 67556 67645 67054 56020 56587 50292 9794 17326 40544 52423 56665 53452 57225 47636 41465
13227 41465 55401 72131 79897 88616 91826 109744 102136 88840 64531 34998 10472 37121
13215 37121 71435 92756 111949 104035 89782 80753 85897 94113 115679 103094 78063 83169 66842
13202 66842 88386 100872 104154 88672 51147 35548 55023 75480 50752 27067 34838 77708
13190 77708 101955 140967 145405 121354 101224 75401 50693 54614 52548 42782 35516 31113 47128
13177 47128 81420 63055 37576 52982 72334 57894 68226 76226 68573 94352 67162 38508
13165 38508 48698 75244 84159 76285 51477 56015 95400 86858 70301 55858 57789 50252 37874
$$ packed form
13254D4042N917p08q31j3053J4414K2492j4581J7997K3953k7529j1406P44O105
13241F7556Q9n91j1034N67o295m0498P532K3218J1879M242l213L773r589o171
13227D1465J3936J6730P766Q719L210J7918p608j3296k4309k9533k4526K6649
13215C7121L4314K1321J9193p914j4253r029N144Q216K1566j2585k5031N106j6327
13202F6842K1544J2486L282j5482l7525j5599J9475K0457k4728k3685P771M2870
13190G7708K4247L9012M438k4051k0130k5823k4708L921k066r766p266m403J6015
13177D7128L4292j8365k5479J5406J9352j4440J0332Q000p653K5779k7190k8654
13165C8508J0190K6546Q915p874k4808M538L9385q542j6557j4443J931p537j2378
$$ plain form
13152 37874 -89 9266 32808 50361 47592 45373 66324 76143 52805 32581 36591 56716 69785
13139 69785 70755 64440 62428 72205 73432 78701 78219 78281 97875 81003 77504 91286 115667 101847
13125 101847 77693 39784 25382 50838 83895 126275 98269 89474 89769 98921 96866 104447 110866
13112 110866 131966 138596 138385 147349 150533 135243 106165 62760 60755 71975 81617 86023 79143
13099 79143 49023 44628 66702 67623 108683 117111 103708 100168 112015 112331 110397 113614 100750
13086 100750 96344 95486 112119 97721 87884 96831 112759 104467 112650 106784 111384 104829 89298
13073 89298 93020 71929 40012 43572 47702 54776 56376 70129 51187 51795 52711 60184 34234 31448
13059 31448 71052 75099 74401 86821 81860 70404 53453 49298 80560 91666 109838 125603 125598
$$ packed form
13152C7874l7963R355K3542J7553k769k219K0951R819k3338k0224M010K0125J3069
13139F9785R70o315k012R777J227N269m82O2J9594j6872l499J3782K4381j3820
13125A01847k4154l7909j4402K5456L3057M2380k8006q795K95R152k055P581O419
13112A10866K1100O630k11Q964L184j5290k9078m3405k005J1220R642M406o880
13099G9143l0120m395K2074R21M1060Q428j3403l540J1847L16j934L217j2864
13086A00750m406q58J6633j4398r837Q947J5928q292Q183n866M600o555j5531
13073H9298L722k1091l1917L560M130P074J600J3753j8942O08R16P473k5950k786
13059C1448L9604M047o98J2420m961j1456j6951m155L1262J1106J8172J5765n
$$ plain form
13046 125598 116461 57923 37805 52787 70474 75313 59182 42031 47175 51982 39832 46278
13034 46278 61263 58821 56250 54387 64607 91012 96553 99567 97862 93408 65017 58404 52346
13021 52346 33514 47721 81370 117988 131893 127947 116578 111005 107284 97719 99900 100875 89695
13008 89695 82474 91265 89513 93841 76950 68235 78131 92819 83341 94436 100954 120613 117283
12995 117283 86829 50303 53484 76783 108921 105627 86472 67382 102188 115883 92570 60321
12983 60321 98069 106460 93496 96415 109078 107039 126331 134903 167763 187117 137664 105906
12971 105906 94935 94611 103537 126514 108977 95227 85714 100890 87123 62696 73561 101668
12959 101668 117216 149650 148838 158224 152399 177705 164699 119526 113519 137200 136634 128799 133388
$$ packed form
13046A25598r137n8538k0118J4982J7687M839j6131j7151N144M807j2150O446
13034D6278J4985k442k571j863J0220K6405N541L014j705m454k8391o613o058
13021E2346j8832J4207L3649L6618J3905l946j1369n573l721r565K181R75j1180
13008H9695p221Q791j752M328j6891q715R896J4688r478J1095O518J9659l330
12995A17283l0454l6526L181K3299L2138l294j9155j9090L4806J3695k3313l2249
12983F0321L7748Q391j2964K919J2663k039J9292Q572L2860J9354m9453l1758
12971A05906j0971l24Q926K2977j7537j3750r513J5176j3767k4427J0865K8107
12959A01668J5548L2434q12R386n825K5306j3006m5173o007K3681n66p835M589
$$ plain form
12946 133388 122925 114615 110982 101861 108761 109082 134566 145113 147647 133113 119257 138104 153175
12933 153175 158102 149904 156540 137973 146321 128934 129841 143374 125609 103498 105903 118647 132301
12920 132301 138775 167400 196323 192695 162850 128129 121506 105850 120538 142739 150541 125935
12908 125935 136130 145157 151530 146163 121117 117000 109133 101392 97664 90483 87212 90344 86396 87123
12894 87123 118758 122565 98214 110610 127770 129040 121863 130529 131197 128221 148325 151213 147868
12881 147868 104123 88580 126670 139474 129569 130706 148567 148978 149759 147125 162570 178691 178576
12868 178576 180162 193750 205750 192171 157856 122164 126597 164374 141619 145757 182454 179079
12856 179079 179875 163869 142848 145641 158014 169697 194741 194796 196178 224210 220062 191502 165287
$$ packed form
12946A33388j0463q310l633r121O900L21K5484J0547K534j4534j3856J8847J5071
12933A53175M927q198O636j8567Q348j7387R07J3533j7765k2111K405J2744J3654
12920A32301O474K8625K8923l628k9845l4721o623j5656J4688K2201P802k4606
12908A25935J0195R027O373n367k5046m117p867p741l728p181l271L132l948P27
12894H7123L1635L807k4351J2396J7160J270p177Q666O68k976K0104K888l345
12881A47868m3745j5543L8090J2804r905J137J7861M11P81k634J5445J6121j15
12868A78576J586J3588J2000j3579l4315l5692M433L7777k2755M138L6697l375
12856A79079P96j6006k1021K793J2373J1683K5044N5J382K8032m148k8560k6215
$$ plain form
12843 165287 149987 192922 204715 181408 169571 176535 211686 212403 187404 183418 195969 197274
12831 197274 193336 164943 118881 140239 180204 183921 158750 151805 147264 152919 187217 176730
12819 176730 161530 182671 183155 168288 171381 182202 183801 201469 181348 158912 166807 175924 181489
12806 181489 170925 167171 186178 216657 219109 185524 150057 173538 183894 211881 238071 224264
12794 224264 227745 220114 209552 210049 209089 198699 189316 223239 250998 236795 203913 184099 201139
12781 201139 220703 226943 204488 199203 224126 225577 206097 222747 240210 211100 189568 198638
12769 198638 222819 253566 241618 231304 234462 221193 206574 221030 234902 215317 224802 238972
12757 238972 247888 246105 259973 289240 266769 250808 258090 247907 225430 228795 260859 269421
$$ packed form
12843A65287j5300M2935J1793k3307j1837O964L5151P17k4999l986J2551J305
12831A97274l938k8393m6062K1358L9965L717k5171o945m541N655L4298j0487
12819A76730j5200K1141M84j4867L093J0821J599J7668k0121k2436P895R117N565
12806A81489j0564l754J9007L0479K452l3585l5467K3481J0356K7987K6190j3807
12794B24264L481p631j0562M97r60j0390r383L3923K7759j4203l2882j9814J7040
12781B01139J9564O240k2455n285K4923J451j9480J6650J7463k9110k1532R070
12769A98638K4181L0747j1948j0314L158j3269j4619J4456J3872j9585R485J4170
12757B38972Q916j783J3868K9267k2471j5961P282j0183k2477L365L2064Q562
$$ plain form
12745 269421 242333 235419 210079 212270 233651 243407 237651 253116 271895 278721 282201 272932 287958
12732 287958 298972 253575 238756 237855 227656 238517 259922 253352 256298 260027 257329 254678 219824
12719 219824 208073 225683 234472 230301 231956 227312 255163 250951 259618 291614 277855 254763 262432
12706 262432 261709 263022 259467 255176 269738 272979 287161 297896 288433 302811 327424 329183 345428
12693 345428 357865 369056 381705 401206 428985 424215 394402 398045 398855 410843 403939 406317 410040
12680 410040 433653 446253 439619 427585 441617 436755 460932 466440 473919 477945 486134 511836 514093
12667 514093 518763 512478 532623 544718 525261 528562 518198 510720 520045 541902 576831 588583
12655 588583 587931 571074 577454 589033 631207 660616 655641 620835 625330 636946 645393 629181 630947
$$ packed form
12745B69421k7088o914k5340K191K1381R756n756J5465J8779O826L480r269J5026
12732B87958J1014m5397j4819r01j0199J0861K1405o570K946L729k698k651l4854
12719B19824j1751J7610Q789m171J655m644K7851m212Q667L1996j3759k3092P669
12706B62432p23J313l555m291J4562L241J4182J0735r463J4378K4613J759J6245
12693C45428J2437J1191J2649J9501K7779m770k9813L643Q10J1988o904K378L723
12680D10040K3613J2600o634j2034J4032m862K4177N508P479M026Q189K5702K257
12667E14093M670o285K0145J2095j9457L301j0364p478R325K1857L4929J1752
12655E88583o52j6857O380J1579M2174K9409m975l4806M495J1616Q447j6212J766
$$ plain form
12642 630947 644419 632688 632877 650664 645858 634712 623589 596270 607278 636341 659154 637293
12630 637293 624448 647855 663120 641637 636160 649685 650094 643435 630344 624210 653596 683161
12618 683161 665290 652335 686896 732197 729302 713715 702350 689973 651931 645703 656518 632348
12606 632348 587568 581785 607290 629037 623390 591326 563837 561632 555101 550767 548846 553556 539732
12593 539732 530434 552420 546444 519515 513824 523760 542085 557485 579990 584381 579651 565531 525443
12580 525443 483315 492362 520171 521900 524774 492470 479792 489479 500328 488362 485615 501916
12568 501916 499121 478563 457121 472054 468202 449994 446866 466261 458869 473469 484946 482731
12556 482731 480829 484044 503938 491736 496184 472262 457535 486968 516704 523631 514384 501336
$$ packed form
12642F30947J3472j1731J89J7787m806j1146j1123k7319J1008K9063K2813k1861
12630F37293j2845K3407J5265k1483n477J3525M09o659j3091o134K9386K9565
12618F83161j7871j2955L4561M5301k895j5587j1365j2377l8042o228J0815k4170
12606F32348m4780n783K5505K1747n647l2064k7489k205o531m334j921M710j3824
12593E39732r298K1986n976k6929n691R936J8325J5400K2505M391m730j4120m0088
12580E25443m2128R047K7809J729K874l2304j2678R687J0849j1966k747J6301
12568E01916k795k0558k1442J4933l852j8208l128J9395p392J4600J1477k215
12556D82731j902L215J9894j2202M448k3922j4727K9433K9736O927r247j3048
$$ plain form
12544 501336 497768 522769 510853 510082 527095 511783 515968 518550 517515 541929 543091 533554 545190
12531 545190 542887 571778 613457 637875 605526 594486 593039 594703 586830 574537 598251 593493
12519 593493 618013 653902 653033 662324 643456 648719 672738 694624 718281 714025 720562 713310 698809
12506 698809 690178 716230 702926 714155 728631 739625 761391 777801 778013 769755 762492 764652 773279
12493 773279 777914 787825 791777 814254 842879 848568 879925 875852 868802 838350 809711 823376 832464
12480 832464 821971 817395 825953 830907 836836 842364 856624 870607 884186 874932 858801 868790 860673
12467 860673 888757 901504 886635 890168 909661 914782 900675 903069 923870 944949 960230 950280
12455 950280 952848 955804 924295 907726 934490 914767 893802 895126 916835 903647 901632 896337
$$ packed form
12544E01336l568K5001j1916p71J7013j5312M185K582j035K4414J162r537J1636
12531E45190k303K8891M1679K4418l2349j1040j447J664p873j2293K3714m758
12519E93493K4520L5889q69R291j8868N263K4019K1886K3657m256O537p252j4501
12506F98809q631K6052j3304J1229J4476J0994K1766J6410K12q258p263K160Q627
12493G73279M635R911L952K2477K8625N689L1357m073p050l0452k8639J3665R088
12480H32464j0493m576Q558M954N929N528J4260J3983J3579r254j6131R989q117
12467H60673K8084J2747j4869L533J9493N121j4107K394K0801K1079J5281r950
12455I50280K568K956l1509j6569K6764j9723k0965J324K1709j3188k015n295
$$ plain form
12443 896337 909115 909177 913335 902214 887088 886618 877400 899081 915620 914339 898344 896512 914069
12430 914069 921390 918337 924206 934815 913175 893172 891710 873491 870715 830386 829251 856599 847261
12417 847261 846913 857467 880269 909234 895456 919405 947267 932833 918946 940826 994276 1011827
12405 1011827 1001751 1006602 1020052 1007483 990779 996911 1015652 1010846 974182 955808 966098 972188
12393 972188 987434 1002376 1022223 1041462 1034934 1009590 1013092 1032354 1052321 1056909 1050240 1064582
12381 1064582 1081771 1097428 1111248 1128168 1143707 1157242 1159449 1178010 1178619 1170415 1177623 1160409
12369 1160409 1164170 1198621 1222591 1223901 1219341 1231948 1254883 1275525 1297848 1336530 1329859 1322095
12357 1322095 1318237 1302145 1309021 1329038 1360645 1406646 1427815 1449749 1462832 1487165 1500438 1524371
$$ packed form
12443H96337J2778O2M158j1121j5126m70r218K1681J6539j281j5995j832J7557
12430I14069P321l053N869J0609k1640k0003j462j8219k776m0329j135K7348r338
12417H47261l48J0554K2802K8965j3778K3949K7862j4434j3887K1880N3450J7551
12405A011827j0076M851J3450j2569j6704O132J8741m806l6664j8374J0290O090
12393I72188J5246J4942J9847J9239o528k5344L502J9262J9967M588o669J4342
12381A064582J7189J5657J3820J6920J5539J3535K207J8561O09q204P208j7214
12369A160409L761L4451K3970J310m560J2607K2935K0642K2323L8682o671p764
12357A322095l858j6092O876K0017L1607M6001K1169K1934J3083K4333J3273K3933
$$ plain form
12345 1524371 1517108 1511075 1530033 1549839 1587152 1590697 1591906 1601817 1640809 1694194 1701331 1720669
12333 1720669 1724519 1749956 1756771 1756690 1792850 1821354 1841990 1845225 1883408 1904274 1908211 1925573 2011529
12320 2011529 2043605 2070498 2115409 2117444 2123476 2159898 2185091 2207343 2233871 2297193 2352100 2348665
12308 2348665 2344299 2359290 2422423 2465627 2521971 2584312 2612543 2660470 2732860 2787262 2837179
12297 2837179 2839294 2868997 2960451 3061360 3127383 3194586 3271758 3343624 3414386 3507073 3610184
12286 3610184 3697764 3774477 3856951 3960669 4084526 4259525 4423317 4552917 4727810 4965289
12276 4965289 5180547 5383365 5587564 5833462 6118411 6431244 6821921 7236419 7686588
12267 7686588 8173863 8689626 9263356 9940199 10712349 11529986 12454916 13482604 14571575
$$ packed form
12345A524371p263o033J8958J9806L7313L545J209R911L8992N3385P137J9338
12333A720669L850K5437O815q1L6160K8504K0636L235L8183K0866L937J7362Q5956
12320B011529L2076K6893M4911K035O032L6422K5193K2252K6528O3322N4907l435
12308B348665m366J4991O3133M3204N6344O2341K8231M7927P2390N4402M9917
12297B837179K115K9703R1454J00909O6023O7203P7172P1866P0762R2687J03111
12286C610184Q7580P6713Q2474J03718J23857J74999J63792J29600J74893K37479
12276D965289K15258K02818K04199K45898K84949L12833L90677M14498M50169
12267G686588M87275N15763N73730O76843P72150Q17637R24930J027688J088971
$$ plain form
12258 14571575 15751852 17021788 18370784 19734309 21114108 22493343 23801660 24975780
12250 24975780 26049144 26951355 27657120 28229440 28645420 28979976 29223288 29377019 29531554
12241 29531554 29742538 29964189 30267814 30705496 31256532 32034398 33005722 34158572 35500726
12232 35500726 37090707 38863421 40857231 43027757 45328315 47702134 50077049 52342535
12224 52342535 54403162 56096747 57315150 58023538 58233577 58109959 57774845 57343947 56879822
12215 56879822 56409958 55972866 55650324 55425718 55257138 55242512 55364819 55611359 56009537
12206 56009537 56571055 57218418 57931320 58641370 59295264 59823724 60078711 60004716 59594116
12197 59594116 58942665 58174765 57438492 56894075 56599157 56626172 57017864 57710643 58631028
$$ packed form
12258A4571575J180277J269936J348996J363525J379799J379235J308317J174120
12250B4975780J073364R02211P05765N72320M15980L34556K43312J53731J54535
12241B9531554K10984K21651L03625M37682N51036P77866R71324J152850J342154
12232C5500726J589981J772714J993810K170526K300558K373819K374915K265486
12224E2342535K060627J693585J218403P08388K10039j23618l35114m30898m64125
12215E6879822m69864m37092l22542k24606j68580j4626J22307K46540L98178
12206E6009537N61518O47363P12902P10050O53894N28460K54987p3995m10600
12197E9594116o51451p67900p36273n44417k94918K7015L91692O92779R20385
$$ plain form
12188 58631028 59691187 60866976 62035155 63106956 63952431 64449210 64509838 64174828 63467268
12179 63467268 62447122 61147644 59602278 57858207 55949188 53901993 51771837 49602262
12171 49602262 47432093 45332459 43304550 41390437 39588498 37908971 36336527 34875710
12163 34875710 33495911 32198295 30984489 29831520 28735754 27686766 26718471 25782182
12155 25782182 24874842 24037198 23233852 22489201 21765382 21097437 20489554 19887385 19328420
12146 19328420 18802779 18313572 17846945 17394588 16937267 16515311 16122783 15750695 15424293
12137 15424293 15076070 14739600 14414630 14104673 13842565 13571467 13354379 13144971 12938408
12128 12938408 12746267 12578294 12414750 12293275 12144339 12028120 11939211 11840816 11768835 11703209
$$ packed form
12188E8631028J060159J175789J168179J071801Q45475M96779O0628l35010p07560
12179F3467268j020146j299478j545366j744071j909019k047195k130156k169575
12171D9602262k170169k099634k027909j914113j801939j679527j572444j460817
12163C4875710j379799j297616j213806j152969j095766j048988r68295r36289
12155B5782182r07340q37644q03346p44651p23819o67945o07883o02169n58965
12146A9328420n25641m89207m66627m52357m57321m21956l92528l72088l26402
12137A5424293l48223l36470l24970l09957k62108k71098k17088k09408k06563
12128A2938408j92141j67973j63544j21475j48936j16219q8909r8395p1981o5626
$$ plain form
12118 11703209 11661472 11609222 11595063 11625965 11665577 11684979 11751546 11826234 11920131 12031561 12194682
12107 12194682 12374498 12561423 12751131 12975249 13300033 13650937 14027297 14449072 14929574
12098 14929574 15481650 16094223 16769281 17526152 18407286 19389772 20450565 21649579 22958415
12089 22958415 24362156 25941035 27644161 29428970 31320186 33312822 35370798 37517413
12081 37517413 39641222 41750321 43773891 45646610 47326140 48820622 50139393 51284611
12073 51284611 52241536 53042755 53663602 54072893 54299818 54331201 54184008 53986037 53827808
12064 53827808 53761711 53814779 54008180 54370316 54940562 55656879 56500638 57387236 58258693 59042018
12054 59042018 59630496 59984063 60148826 60151100 60043589 59908181 59758994 59692017 59771637 60006701
$$ packed form
12118A1703209m1737n2250j4159L0902L9612J9402O6567P4688R3897J11430J63121
12107A2194682J79816J86925J89708K24118L24784L50904L76360M21775M80502
12098A4929574N52076O12573O75058P56871Q81134R82486J060793J199014J308836
12089B2958415J403741J578879J703126J784809J891216J992636K057976K146615
12081C7517413K123809K109099K023570J872719J679530J494482J318771J145218
12073E1284611R56925Q01219O20847M09291K26925L1383j47193j97971j58229
12064E3827808o6097N3068J93401L62136N70246P16317Q43759Q86598Q71457P83325
12054E9042018N88478L53567J64763K274j07511j35408j49187o6977P9620K35064
$$ plain form
12044 60006701 60405741 60938246 61555715 62254861 62985668 63690915 64371819 64946231 65415869
12035 65415869 65772519 65922301 65857981 65527550 64883205 63906931 62621401 61070300 59343267
12026 59343267 57554418 55800001 54143887 52653813 51344204 50260113 49351043 48607932
12018 48607932 47977065 47478553 47108813 46778087 46488013 46207050 45927480 45593285 45216409
12009 45216409 44755632 44242178 43698252 43048512 42304155 41502525 40613876 39615469 38505525
12000 38505525 37318809 36086618 34841646 33620937 32421801 31241877 30136877 29129480
11992 29129480 28164022 27256832 26413759 25609102 24832379 24113225 23434158 22792906 22189443
11983 22189443 21613433 21069466 20599948 20117289 19607763 19168023 18769229 18373298 17999125
$$ packed form
12044F0006701L99040N32505O17469O99146P30807P05247O80904N74412M69638
12035F5415869L56650J49782o4320l30431o44345r76274j285530j551101j727033
12026E9343267j788849j754417j656114j490074j309609j084091r09070p43111
12018D8607932o30867m98512l69740l30726k90074k80963k79570l34195l76876
12009D5216409m60777n13454n43926o49740p44357q01630q88649r98407j109944
12000C8505525j186716j232191j244972j220709j199136j179924j105000j007397
11992B9129480r65458r07190q43073q04657p76723p19154o79067o41252o03463
11983B2189443n76010n43967m69518m82659n09526m39740l98794l95931l74173
$$ plain form
11974 17999125 17651952 17310859 16977420 16671786 16364309 16071580 15807145 15566696 15328996
11965 15328996 15084968 14868980 14676058 14497040 14301780 14103471 13928596 13765007 13596561
11956 13596561 13448554 13283466 13138361 12991072 12856591 12743937 12632399 12522855 12385387
11947 12385387 12247721 12132165 12036821 11952571 11835626 11757448 11690285 11611838 11521105 11454734
11937 11454734 11378284 11282851 11191687 11136687 11071827 10997543 10918064 10836528 10789231 10693153 10601783
11926 10601783 10529209 10459865 10415123 10338042 10261852 10201016 10131410 10060825 10007552 9941736 9861151
11915 9861151 9820282 9773139 9694113 9606238 9524291 9489696 9468589 9398033 9303881 9238395 9167265
11904 9167265 9089861 9046656 8955154 8879890 8818944 8751117 8698691 8615576 8548842 8465489 8381513
$$ packed form
11974A7999125l47173l41093l33439l05634l07477k92729k64435k40449k37700
11965A5328996k44028k15988j92922j79018j95260j98309j74875j63589j68446
11956A3596561j48007j65088j45105j47289j34481j12654j11538j09544j37468
11947A2385387j37666j15556r5344q4250j16945p8178o7163p8447r0733o6371
11937A1454734p6450r5433r1164n5000o4860p4284p9479q1536m7297r6078r1370
11926A0601783p2574o9344m4742p7081p6190o0836o9606p0585n3273o5816q0585
11915I861151m0869m7143p9026q7875q1947l4595k1107p0556r4152o5486p1130
11904I167265p7404m3205r1502p5264o0946o7827n2426q3115o6734q3353q3976
$$ plain form
11893 8381513 8322481 8273066 8216967 8140610 8074129 8001901 7922996 7863024 7788638 7721289 7642190
11882 7642190 7563727 7483625 7408573 7332989 7246819 7177299 7104865 7045817 6987407 6928134 6860820
11871 6860820 6793891 6684704 6616341 6590089 6523412 6457868 6407816 6326911 6254116 6200932 6138416
11860 6138416 6050720 5978927 5916770 5884421 5850042 5800667 5720013 5672614 5643706 5599702 5571263
11849 5571263 5526239 5456453 5422958 5389678 5368092 5355251 5302347 5265006 5232564 5177617 5116019
11838 5116019 5053349 4969689 4881853 4799781 4712036 4671893 4631632 4592036 4539521 4464789 4411861
11827 4411861 4361837 4301496 4267988 4237340 4202691 4163119 4120174 4085240 4047418 3988170 3956453
11816 3956453 3939510 3928075 3884648 3852867 3836660 3790971 3747919 3726783 3712135 3698874 3707351
$$ packed form
11893H381513n9032m9415n6099p6357o6481p2228p8905n9972p4386o7349p9099
11882G642190p8463q0102p5052p5584q6170o9520p2434n9048n8410n9273o7314
11871F860820o6929j09187o8363k6252o6677o5544n0052q0905p2795n3184o2516
11860F138416q7696p1793o2157l2349l4379m9375q0654m7399k8908m4004k8439
11849E571263m5024o9786l3495l3280k1586j2841n2904l7341l2442n4947o1598
11838E116019o2670q3660q7836q2072q7745m0143m0261l9596n2515p4732n2928
11827D411861n0024o0341l3508l0648l4649l9572m2945l4934l7822n9248l1717
11816C956453j6943j1435m3427l1781j6207m5689m3052k1136j4648j3261Q477
$$ plain form
11805 3707351 3687009 3661625 3625552 3592546 3541521 3506675 3472587 3434240 3410174 3390714 3331740
11794 3331740 3291496 3266608 3203228 3167156 3180217 3152154 3109397 3089497 3053293 3016439 2993138
11783 2993138 2963009 2961961 2979817 2947596 2893545 2856918 2848288 2823566 2780328 2762749 2744482 2736940
11771 2736940 2671350 2646267 2667799 2661789 2639426 2603392 2601743 2588590 2550629 2527678 2479468 2441498
11759 2441498 2422001 2391657 2381650 2362792 2335677 2303727 2285936 2265070 2263613 2238394 2192949
11748 2192949 2185404 2157680 2114012 2105849 2082127 2075350 2063494 2030180 2019109 1983292 1938504 1944728
11736 1944728 1971031 1954555 1918919 1903256 1869101 1851152 1839003 1807800 1797064 1820448 1787103
11725 1787103 1732881 1705754 1691429 1659220 1634516 1609000 1584511 1535468 1513211 1494623 1486294
$$ packed form
11805C707351k0342k5384l6073l3006n1025l4846l4088l8347k4066j9460n8974
11794C331740m0244k4888o3380l6072J3061k8063m2757j9900l6204l6854k3301
11783B993138l0129j048J7856l2221n4051l6627q630k4722m3238j7579j8267p542
11771B736940o5590k5083K1532o010k2363l6034j649j3153l7961k2951m8210l7970
11759B441498j9497l0344j0007j8858k7115l1950j7791k0866j457k5219m5445
11748B192949p545k7724m3668q163k3722o777j1856l3314j1071l5817m4788O224
11736A944728K6303j6476l5636j5663l4155j7949j2149l1203j0736K3384l3345
11725A787103n4222k7127j4325l2209k4704k5516k4489m9043k2257j8588q329
$$ plain form
11714 1486294 1505772 1500190 1486911 1466625 1467097 1472247 1480382 1479470 1430844 1380507 1353553 1337873 1332181
11701 1332181 1345354 1329143 1323429 1322210 1309278 1292219 1271392 1262378 1239863 1237742 1234796 1216787
11689 1216787 1252930 1249090 1223337 1230797 1243922 1223298 1230247 1237587 1219339 1178547 1161368 1156640
11677 1156640 1161557 1146543 1139473 1121846 1120872 1131331 1120172 1108958 1122113 1093106 1087932 1088486 1079504
11664 1079504 1098019 1065780 1051517 1077016 1076633 1035655 998693 991413 1017192 1024894 1033369 1032669 1010591
11651 1010591 1003118 995876 1025394 1038560 1021022 1042364 1048242 1024767 1012303 1006040 1001633 977084
11639 977084 989128 1028443 1020872 987209 973583 970588 976596 950343 940728 966210 972078 969404 1007467
11626 1007467 1036663 1042043 1020774 1004714 999972 990625 997779 989592 974604 977035 971503 976269 1001139
$$ packed form
11714A486294J9478n582j3279k0286M72N150Q135r12m8626n0337k6954j5680n692
11701A332181J3173j6211n714j219j2932j7059k0827r014k2515k121k946j8009
11689A216787L6143l840k5753P460J3125k0624O949P340j8248m0792j7179m728
11677A156640M917j5014p070j7627r74J0459j1159j1214J3155k9007n174N54q982
11664A079504J8515l2239j4263K5499l83m0978l6962p280K5779P702Q475p00k2078
11651A010591p473p242K9518J3166j7538K1342N878k3475j2464o263m407k4549
11639I77084J2044L9315p571l3663j3626k995O008k6253r615K5482N868k674L8063
11626A007467K9196N380k1269j6060m742r347P154q187j4988K431n532M766K4870
$$ plain form
11613 1001139 1008888 995191 1004830 984458 964785 982156 1004995 1032034 1047592 1007627 972063 979797
11601 979797 977712 996853 1011405 1005020 1020177 1011094 983449 978312 976478 957994 947739 920034
11589 920034 913159 904053 881529 857182 842410 853716 860668 845358 830858 838710 835736 801182
11577 801182 819472 822600 801284 780897 772681 775332 785833 786119 793577 813215 803267 763641 748394
11564 748394 745705 777315 768113 740337 722880 699670 705763 691406 659458 657473 641639 651218
11552 651218 646325 632702 618162 616029 596077 554675 524844 531601 546489 543161 528459 537034
11540 537034 553487 565021 547913 530002 528576 534012 538557 547239 535494 493076 458700 461800
11528 461800 472126 451348 446516 438407 446912 442021 460198 447158 421550 403403 430895 432647
$$ packed form
11613A001139P749j3697R639k0372j9673J7371K2839K7039J5558l9965l5564P734
11601I79797k085J9141J4552o385J5157r083k7645n137j834j8484j0255k7705
11589I20034o875r106k2524k4347j4772J1306O952j5310j4500P852k974l4554
11577H01182J8290L128k1316k0387q216K651J0501K86P458J9638r948l9626j5247
11564G48394k689L1610r202k7776j7457k3210O093j4357l1948j985j5834R579
11552F51218m893j3623j4540k133j9952m1402k9831O757J4888l328j4702Q575
11540E37034J6453J1534j7108j7911j426N436M545Q682j1745m2418l4376L100
11528D61800J0326k0778m832q109Q505m891J8177j3040k5608j8147K7492J752
$$ plain form
11516 432647 426987 454593 463741 447570 441443 448632 444502 422691 426530 433970 451398 471185 509266
11503 509266 528092 483852 440420 419939 392723 392051 405574 427749 446067 448983 429771 418528
11491 418528 410127 415523 421530 428587 436037 415139 384328 380673 368094 346537 350576 375394 402327
11478 402327 438367 422101 416150 406785 393278 399798 416824 396739 363168 336089 332628 341635
11466 341635 358852 385944 386278 378077 373883 366259 352718 346185 343406 313798 298638 305515 334208
11453 334208 346746 339952 343355 348785 366757 360437 350398 326376 316651 306842 305372 327593 338209
11440 338209 340272 321112 309323 305599 305513 305150 298821 282954 271078 273135 283219 291643 284017 266177
11426 266177 287405 278471 276994 270818 269049 278877 256151 243630 220531 244437 293685 307545
$$ packed form
11516D32647n660K7606R148j6171o127P189m130k1811L839P440J7428J9787L8081
11503E09266J8826m4240m3432k0481k7216o72J3523K2175J8318K916j9212j1243
11491D18528q401N396O007P057P450k0898l0811l655j2579k1557M039K4818K6933
11478D02327L6040j6266n951r365j3507O520J7026k0085l3571k7079l461R007
11466C41635J7217K7092L34q201m194p624j3541o533k779k9608j5160O877K8693
11453C34208J2538o794L403N430J7972o320j0039k4022r725r809j470K2221J0616
11440C38209K063j9160j1789l724q6l63o329j5867j1876K057J0084Q424p626j7840
11426B66177K1228q934j477o176j769R828k2726j2521k3099K3906M9248J3860
$$ plain form
11414 307545 289257 280272 290344 274858 254776 246299 228025 206056 219537 220314 221990 265441
11402 265441 281419 248524 245929 226138 224081 223446 229161 239016 238773 240667 251889 236459 239090
11389 239090 250048 241266 215119 227979 253476 263506 258131 231598 226471 212879 190462 189949
11377 189949 207076 224140 235873 222774 208370 207863 194633 178405 196737 209427 228008 219821
11365 219821 201469 188456 182810 206730 204274 192410 166858 165666 183214 160111 135307 159238
11353 159238 189692 209850 216127 190238 176900 188328 172285 168285 176921 164364 156083 175256
11341 175256 178312 161199 153511 167469 168662 183955 187072 194197 207987 183579 161061 168610 183877
11328 183877 202608 217097 210717 206190 190510 165095 149151 162392 203805 168895 136614 127032
$$ packed form
11414C07545j8288q985J0072j5486k0082q477j8274k1969J3481P77J676M3451
11402B65441J5978l2895k595j9791k057o35N715R855k43J894J1222j5430K631
11389B39090J0958q782k6147J2860K5497J0030n375k6533n127j3592k2417n13
11377A89949J7127J7064J1733j3099j4404n07j3230j6228J8332J2690J8581q187
11365B19821j8352j3013n646K3920k456j1864k5552j192J7548k3103k4804K3931
11353A59238L0454K0158O277k5889j3338J1428j6043m000Q636j2557q281J9173
11341A75256L056j7113p688J3958J193J5293L117P125J3790k4408k2518P549J5267
11328A83877J8731J4489o380m527j5680k5415j5944J3241M1413l4910l2281r582
$$ plain form
11316 127032 120504 148826 153434 157993 163716 162307 173001 155709 147973 147207 136188 136901 148793
11303 148793 163878 191278 213857 199605 183890 165812 129307 132924 151273 151786 174217 183681
11291 183681 162939 152079 152933 146532 128414 121085 133446 124481 119743 134507 124425 147586 152139
11278 152139 134399 123456 102846 121567 129439 126156 111573 98231 112995 127233 124319 123314
11266 123314 109073 107100 133182 134794 122894 116570 98688 101623 111143 84026 81715 104650 102827
11253 102827 121996 129173 156888 147191 133398 113722 110189 140457 164636 158029 166912 162949 145614
11240 145614 126294 140714 155569 149952 133240 116944 130917 149217 154857 137956 124737 120283
11228 120283 131377 127320 122071 97401 97389 132722 142476 139949 132234 131213 127078 121180 140372 158437
$$ packed form
11316A27032o528K8322M608M559N723j409J0694j7292p736p66j1019P13J1892
11303A48793J5085K7400K2579j4252j5715j8078l6505L617J8349N13K2431R464
11291A83681k0742j0860Q54o401j8118p329J2361q965m738J4764j0082K3161M553
11278A52139j7740j0943k0610J8721P872l283j4583j3342J4764J4238k914j005
11266A23314j4241j973K6082J612j1900o324j7882K935R520k7117k311K2935j823
11253A02827J9169P177K7715r697j3793j9676l533L0268K4179o607Q883l963j7335
11240A45614j9320J4420J4855n617j6712j6296J3973J8300N640j6901j3219m454
11228A20283J1094m057n249k4670j2L5333R754k527p715j021m135n898J9192J8065
$$ plain form
11214 158437 155843 129013 114761 105335 95703 91610 109454 134513 137114 124159 101157 82386
11202 82386 68610 94307 92278 79682 57554 68388 104614 129194 119306 104878 106238 98765
11190 98765 88193 91748 77482 65032 76561 75939 87928 107566 79721 71981 60530 81288
11178 81288 109428 108661 90544 71045 64401 76797 114338 139979 134618 148467 158805 123410
11166 123410 82048 104197 96105 89879 76014 59865 62425 68063 91347 95026 64159 46782
11154 46782 48331 55881 53690 54232 48262 50355 73143 89321 104931 94523 79801 81502 101029
11141 101029 93010 91037 81093 79463 76879 89005 71105 92180 87625 91274 96724 98552 82909
11128 82909 69584 92015 74809 56827 41412 46224 52276 31018 41386 70092 63561 45587
$$ packed form
11214A58437k594k6830j4252r426r632m093J7844K5059K601j2955k3002j8771
11202H2386j3776K5697k029j2596k2128J0834L6226K4580r888j4428J360p473
11190I8765j0572L555j4266j2450J1529o22J1989J9638k7845p740j1451K0758
11178H1288K8140p67j8117j9499o644J2396L7541K5641n361J3849J0338l5395
11166A23410m1362K2149q092o226j3865j6149K560N638K3284L679l0867j7377
11154D6782J549P550k191N42n970K093K2788J6178J5610j0408j4722J701J9527
11141A01029q019j973r944j630k584J2126j7900K1075m555L649N450J828j5643
11128H2909j3325K2431j7206j7982j5415M812O052k1258J0368K8706o531j7974
$$ plain form
11116 45587 42924 50035 49678 69151 113243 119485 103774 103909 100380 100168 117277 126354 120292 124049
11102 124049 109261 92867 87742 88924 91553 107213 102386 109722 94229 74210 51890 47494 60369
11089 60369 74015 80751 76290 55536 56251 52024 63333 89070 94124 93235 79252 82001 79379 85718
11075 85718 94429 79108 65956 47659 42973 49787 33001 53746 41381 53208 56070 57422 63104
11062 63104 92937 120291 99116 89988 98315 77280 54474 55751 66765 75542 68360 70497 68707
11049 68707 87109 86483 65728 50205 22631 19646 38634 50692 56448 69425 97608 110070
11037 110070 106571 112470 108777 96509 126010 120988 112229 103140 129744 147448 154780 166501 155408
11024 155408 163398 187290 205737 182082 156792 128758 131328 152427 165709 181852 207876 231571
$$ packed form
11116D5587k663P111l57J9473M4092O242j5711J35l529k12J7109R077o062L757
11102A24049j4788j6394n125J182K629J5660m827P336j5493k0019k2320m396J2875
11089F0369J3646O736m461k0754P15m227J1309K5737N054q89j3983K749k622O339
11075H5718Q711j5321j3152j8297m686O814j6786K0745j2365J1827K862J352N682
11062F3104K9833K7354k1175r128Q327k1035k2806J277J1014Q777p182K137j790
11049F8707J8402o26k0755j5523k7574k985J8988J2058N756J2977K8183J2462
11037A10070l499N899l693j2268K9501n022q759r089K6604J7704P332J1721j1093
11024A55408P990K3892J8447k3655k5290k8034K570K1099J3282J6143K6024K3695
$$ plain form
11012 231571 217968 193211 168328 190709 192655 179838 157590 161758 160934 173769 172600 160529
11000 160529 141851 77786 51308 69392 97584 97450 104778 107460 80174 74912 83122 74899 81387
10987 81387 78095 81033 102240 125136 133479 100019 80135 107192 101776 94522 105358 89485 78706
10974 78706 70456 98235 120637 128251 140882 120783 96013 76915 69176 82413 98185 96926
10962 96926 108115 120967 105395 96265 112710 102368 85451 69613 67611 60505 68047 85407
10950 85407 78639 45919 51148 67513 78974 80147 62280 34188 13782 25832 70615 97860
10938 97860 79973 80362 63050 47952 39947 59126 83429 67164 61022 69883 58891 54164 74282
10925 74282 60061 38784 50733 66107 67841 46931 67819 78899 83381 83523 37158 39163 51816
$$ packed form
11012B31571j3603k4757k4883K2381J946j2817k2248M168q24J2835j169j2071
11000A60529j8678o4065k6478J8084K8192j34P328K682k7286n262Q210q223O488
10987H1387l292K938K1207K2896Q343l3460j9884K7057n416p254J0836j5873j0779
10974G8706q250K7779K2402P614J2631k0099k4770j9098p739J3237J5772j259
10962I6926J1189J2852j5572r130J6445j0342j6917j5838k002p106P542J7360
10950H5407o768l2720N229J6365J1461J173j7867k8092k0406J2050M4783K7245
10938I7860j7887L89j7312j5098q005J9179K4303j6265o142Q861j0992m727K0118
10925G4282j4221k1277J1949J5374J734k0910K0888J1080M482J42m6365K005J2653
$$ plain form
10912 51816 64050 61829 75229 85340 53988 65431 90796 79123 72211 52054 51289 32445
10900 32445 24782 43796 51475 39483 61970 80487 79480 94190 106997 84477 39401 24763
10888 24763 49995 68140 66175 35381 2447 10040 34663 41147 73236 68959 28169 31982 77109
10875 77109 80200 60335 28556 52838 76549 81239 64651 74352 92209 96959 110793 104679 92812
10862 92812 64708 34933 39904 55288 60953 73293 68497 81524 93271 100158 75779 44966
10850 44966 37408 54020 66998 53881 26429 16082 44674 46037 44787 47739 63030 82988
10838 82988 70491 65473 100361 84865 90340 82413 65784 57409 51970 44946 58042 82997 94000
10825 94000 89039 75817 82601 90936 76935 61469 47639 20048 35131 44801 34219 13689
$$ packed form
10912E1816J2234k221J3400J0111l1352J1443K5365j1673o912k0157p65j8844
10900C2445p663J9014P679j1992K2487J8517j007J4710J2807k2520m5076j4638
10888B4763K5232J8145j965l0794l2934P593K4623O484L2089m277m0790L813M5127
10875G7109L091j9865l1779K4282K3711M690j6588R701J7857M750J3834o114j1867
10862I2812k8104k9775M971J5384N665J2340m796J3027J1747O887k4379l0813
10850D4966p558J6612J2978j3117k7452j0347K8592J363j250K952J5291J9958
10838H2988j2497n018L4888j5496N475p927j6629q375n439p024J3096K4955J1003
10825I4000m961j3222O784Q335j4001j5466j3830k7591J5083R670j0582k0530
$$ plain form
10813 13689 12288 39447 46330 52785 46677 48108 50833 39210 55930 89881 107303 108519 96044
10800 96044 106603 110426 113010 111878 87992 68572 66998 48896 46140 38720 32898 36745 50144
10787 50144 72668 72059 90496 96671 102802 101073 86152 82463 89999 103202 103320 92789 91238 98909
10773 98909 89878 66101 55988 57023 33625 56772 62760 63849 40453 33224 53494 63629 62910
10760 62910 67790 81686 86054 67041 49207 16914 7459 -7755 -169 30226 54706 61940 79812
10747 79812 74037 95471 116416 108781 76334 74004 51935 53251 71347 56016 39835 67434
10735 67434 87276 91001 122526 137624 136495 99711 76831 93078 84693 81603 89081 77367 60041
10722 60041 44364 32118 28563 61434 90597 97333 95510 77637 76230 96068 113485 103719 106738
$$ packed form
10813A3689j401K7159O883O455o108J431K725j1623J6720L3951J7422J216j2475
10800I6044J0559L823K584j132k3886j9420j574j8102k756p420n822L847J3399
10787E0144K2524o09J8437O175O131j729j4921l689P536J3203J18j0531j551P671
10773I8909r031k3777j0113J035k3398K3147N988J089k3396p229K0270J0135p19
10760F2910M880J3896M368j9013j7834l2293r455j5214P586L0395K4480P234J7872
10747G9812n775K1434K0945p635l2447k330k2069J316J8096j5331j6181K7599
10735F7434J9842L725L1525J5098j129l6784k2880J6247q385l090P478j1714j7326
10722F0041j5677j2246l555L2871K9163O736j823j7873j407J9838J7417r766L019
$$ plain form
10709 106738 100686 103735 126958 118630 109976 114813 107630 113855 131103 125563 135677 125923 145477
10696 145477 159796 178232 175349 183936 190779 204961 194030 179179 174687 185720 178653 151991
10684 151991 128248 105110 118909 135097 155043 172398 181677 178092 156691 157613 184452 193399
10672 193399 223235 203255 215936 225945 244388 261121 238679 234500 219456 210637 209210 221208
10660 221208 232421 242291 254303 252563 223467 228084 252366 271527 296781 312296 300511 280409
10648 280409 293760 322730 320037 292818 312776 309586 322037 340913 339498 342776 341444 380501
10636 380501 386351 368870 373204 391724 420354 456775 501085 537580 573736 597929 647816 720791
10624 720791 802149 901384 977513 1084390 1216271 1349772 1547428 1764168 2012363 2330875
$$ packed form
10709A06738o052L049K3223q328q654M837p183O225J7248n540J0114r754J9554
10696A45477J4319J8436k883Q587O843J4182j0931j4851m492J1033p067k6662
10684A51991k3743k3138J3799J6188J9946J7355R279l585k1401R22K6839Q947
10672A93399K9836j9980J2681J0009J8443J6733k2442m179j5044q819j427J1998
10660B21208J1213R870J2012j740k9096M617K4282J9161K5254J5515j1785k0102
10648B80409J3351K8970k693k7219J9958l190J2451J8876j415L278j332L9057
10636C80501N850j7481M334J8520K8630L6421M4310L6495L6156K4193M9887P2975
10624G20791Q1358R9235P6129J06877J31881J33501J97656K16740K48195L18512
$$ plain form
10614 2330875 2728687 3186630 3696689 4242037 4892959 5659532 6520704 7380518 8099063
10605 8099063 8533410 8716773 8838139 9074583 9510572 10121489 10937309 11958133 13274278
10596 13274278 14845028 16454274 17598216 17854062 17414041 16845544 16555712 16609959 17030697
10587 17030697 17804562 18916906 20365087 22117905 23767684 24516644 23860476 22250676
10579 22250676 20494578 19143283 18301037 17882530 17856650 18182344 18785544 19597844 20223063
10570 20223063 20185484 19223856 17705321 16166685 14901247 13990547 13317384 12887916 12670719
10561 12670719 12623052 12637123 12526245 12121865 11400650 10456540 9492316 8644096 7944477 7369672
10551 7369672 6865506 6459309 6159339 5917429 5712214 5501533 5307649 5110733 4919457
$$ packed form
10614B330875L97812M57943N10059N45348O50922P66573Q61172Q59814P18545
10605H099063M34347J83363J21366K36444M35989O10917Q15820J020824J316145
10596A3274278J570750J609246J143942K55846m40021n68497k89832N4247M20738
10587A7030697P73865J112344J448181J752818J649779P48960o56168j609800
10579B2250676j756098j351295q42246m18507k5880L25694O03200Q12300O25219
10570B0223063l7579r61628j518535j538636j265438r10700o73163m29468k17197
10561A2670719m7667J4071j10878m04380p21215r44110r64224q48220o99619n74805
10551G369672n04166m06197k99970k41910k05215k10681j93884j96916j91276
$$ plain form
10542 4919457 4737181 4530498 4307687 4079174 3874561 3737552 3606792 3468786 3330231
10533 3330231 3189843 3051656 2930024 2798679 2698246 2628925 2530198 2420519 2326429 2240203
10523 2240203 2160487 2090260 2036083 1981078 1947463 1869458 1802305 1736968 1693684 1637097 1580190
10512 1580190 1540196 1509634 1464977 1404492 1331860 1294661 1294571 1287083 1255942 1233533 1217873 1187122
10500 1187122 1145059 1127176 1126899 1075068 1011782 977598 940974 929313 924669 922500 896300 877027
10488 877027 908928 898245 867882 840462 809492 801477 764460 715436 698811 688757 663177 643874
10476 643874 613773 622390 645754 646685 616531 579908 567281 552904 540212 536538 548401 556769
10464 556769 544441 531022 501505 471586 472463 483240 494000 486802 518545 523036 511573 486998
$$ packed form
10542D919457j82276k06683k22811k28513k04613j37009j30760j38006j38555
10533C330231j40388j38187j21632j31345j00433o9321r8727j09679r4090q6226
10523B240203p9716p0227n4177n5005l3615p8005o7153o5337m3284n6587n6907
10512A580190l9994l0562m4657o0485p2632l7199r0p488l1141k2409j5660l0751
10500A187122m2063j7883k77n1831o3286l4184l6624j1661m644k169k6200j9273
10488H77027L1901j0683l0363k7420l0970q015l7017m9024j6625j0054k5580j9303
10476F43874l0101Q617K3364R31l0154l6623j2627j4377j2692l674J1863Q368
10464E56769j2328j3419k9517k9919Q77J0777J0760p198L1743M491j1463k4575
$$ plain form
10452 486998 449486 441210 450206 482715 450099 433947 431133 421308 413774 391485 375925 362084
10440 362084 359021 373155 369363 337056 319370 305861 305655 304723 323165 324053 305302 298539 287061
10427 287061 279415 286181 284774 277848 287198 283561 290716 306471 272785 244298 227856 249298 260540
10414 260540 251246 260796 276984 270350 252740 235079 227682 226234 203969 179310 171754 166518 161396
10401 161396 160585 157489 124582 128788 133692 117199 99715 114165 134092 144636 145475 136613 115058
10388 115058 111428 137722 146039 175942 163879 126816 106382 96788 98122 85150 96184 78621
10376 78621 76974 79799 85126 79132 63981 80527 75507 79895 92647 72255 72514 68565 97751
10363 97751 114950 109690 123186 133444 123181 97647 101451 110580 113373 126483 103989 88536
$$ packed form
10452D86998l7512q276Q996L2509l2616j6152k814r825p534k2289j5560j3841
10440C62084l063J4134l792l2307j7686j3509k06r32J8442Q88j8751o763j1478
10427B87061p646O766j407o926R350l637P155J5755l3686k8487j6442K1442J1242
10414B60540r294R550J6188o634j7610j7661p397j448k2265k4659p556n236n122
10401A61396q11l096l2907M206M904j6493j7484J4450J9927J0544Q39q862k1555
10388A15058l630K6294Q317K9903j2063l7063k0434r594J334j2972J1034j7563
10376G8621j647K825N327n994j5151J6546n020M388J2752k0392K59l949K9186
10363I7751J7199n260J3496J0258j0263k5534L804R129K793J3110k2494j5453
$$ plain form
10351 88536 78400 90742 92901 61064 44306 38262 90524 110542 101605 76419 64427 50376
10339 50376 53153 43474 54363 84863 97903 81672 71583 76682 55004 35855 19927 32265
10327 32265 31436 27197 35370 34914 37736 50856 48519 29111 27506 47904 69444 62443 34187 59216
10313 59216 74494 58565 22126 8976 11968 28321 -10022 -5991 20204 18205 -829 3799
10301 3799 13307 31862 39813 60571 44850 50986 38501 40232 50663 44392 22315 25049 56077
10288 56077 87855 105349 89796 76217 77069 81552 72753 75682 58700 40220 10096 -5128 -3462
10275 -3462 -21851 -39861 -63442 -63805 -38382 -46781 -54517 -60881 -51169 -31107 -6589 10547 35676
10262 35676 56629 66330 52824 52750 70869 78946 75047 62105 31480 2650 -10707 -45480 -46854
$$ packed form
10351H8536j0136J2342K159l1837j6758o044N2262K0018q937k5186j1992j4051
10339E0376K777r679J0889L0500J3040j6231j0089N099k1678j9149j5928J2338
10327C2265q29m239Q173m56K822J3120k337j9408j605K0398K1540p001k8256K5029
10313E9216J5278j5929l6439j3150K992J6353l8343M031K6195j999j9034M628
10301C799R508J8555P951K0758j5721O136j2485J731J0431o271k2077K734L1028
10288E6077L1778J7494j5553j3579Q52M483q799K929j6982j8480l0124j5224J666
10275c462j8389j8010k3581l63K5423q399p736o364R712K0062K4518J7136K5129
10262C5676K0953R701j3506p4J8119Q077l899j2942l0625k8830j3357l4773j374
$$ plain form
10249 -46854 -12238 1444 11364 16127 32736 39681 16063 -7116 -16820 -6691 17001 50661
10237 50661 33635 -5368 2120 -370 22454 40967 7196 2302 67528 81999 54831 43657
10225 43657 40638 21210 3447 27501 41756 31434 -5777 -40138 -34699 -3758 -15329 -12161
10213 -12161 -6846 -2561 -7027 -19721 -38874 -26955 5255 -25438 -36901 -23112 20935 36879
10201 36879 26088 26189 36480 44278 35701 19813 15362 -1971 22462 39736 47644 49188 42206
10188 42206 43661 77146 87807 54872 37630 30835 20417 22736 47027 77100 56569 9420
10176 9420 21466 34671 59250 81707 71170 62733 68594 59204 17716 18049 20535 31119 46564
10163 46564 75255 101130 101925 117194 82359 60729 73949 106631 121164 124036 100494 90192
$$ packed form
10249d6854L4616J3682R920M763J6609O945k3618k3179r704J0129K3692L3660
10237E0661j7026l9003P488k490K2824J8513l3771m894O5226J4471k7168j1174
10225D3657l019j9428j7763K4054J4255j0322l7211l4361N439L0941j1571L168
10213a2161N315M285m466j2694j9153J1919L2210l0693j1463J3789M4047J5944
10201C6879j0791J01J0291P798q577j5888m451j7333K4433J7274P908J544o982
10188D2206J455L3485J0661l2935j7242o795j0418K319K4291L0073k0531m7149
10176I420J2046J3205K4579K2457j0537q437N861r390m1488L33K486J0584J5445
10163D6564K8691K5875P95J5269l4835k1630J3220L2682J4533K872k3542j0302
$$ plain form
10151 90192 67380 70640 96250 102653 103626 122628 141617 139209 157320 163961 154375 114355 86222
10138 86222 87435 108435 107816 123525 104403 95183 75131 77954 96219 97081 87224 63953 57195
10125 57195 65322 91209 86130 88312 121558 108107 81735 43731 26279 27593 51398 54600 59959
10112 59959 45079 31140 62577 66278 62106 55586 65236 79091 91129 93707 63076 50753 54831
10099 54831 70551 77803 74020 59651 41910 46924 44168 26908 22565 28876 30104 21638 13089
10086 13089 -2378 -14570 7085 5473 -4552 -11419 -16574 -6186 -7990 -9728 6290 6782 11378
10073 11378 37122 48420 32689 21320 14300 -6187 -28154 -25937 -10627 -10573 -1318 14592 28242
10060 28242 -15088 -50000 -19708 -6301 -8767 -20541 -21853 22484 24764 3954 14657 4489
$$ packed form
10151I0192k2812L260K5610O403R73J9002J8989k408J8111O641r586m0020k8133
10138H6222J213K1000o19J5709j9122r220k0052K823J8265Q62r857k3271o758
10125E7195Q127K5887n079K182L3246j3451k6372l8004j7452J314K3805L202N359
10112E9959j4880j3939L1437L701m172o520R650J3855J2038K578l0631j2323M078
10099E4831J5720P252l783j4369j7741N014k756j7260m343O311J228q466q549
10086A3089j5467j2192K1655j612j0025o867n155J0388j804j738J6018M92M596
10073A1378K5744J1298j5731j1369p020k0487k1967K217J5310N4R255J5910J3650
10060B8242m3330l4912L0292J3407k466j1774j312M4337K280k0810J0703j0168
$$ plain form
10048 4489 16892 -3746 11636 50633 73987 56741 40516 40997 49497 50465 88643 75462 56191
10035 56191 42500 14015 -7387 6887 35337 37500 58482 85189 65264 39732 33037 23157
10023 23157 12609 27245 50276 72915 82082 34889 10390 -19024 -4890 33288 27333 10301
10011 10301 -12248 -2094 -1377 8736 23949 21791 30570 15454 949 -3956 14335 33911 33052
9998 33052 32154 27083 10397 9688 4663 -11544 -5062 44374 45448 38823 52300 63018 72125 47536
9984 47536 25724 -11003 -42432 -26159 -19823 -10508 25121 45951 9458 -5582 -2632 -8039 -15279
9971 -15279 -6929 3062 19084 29222 24954 4223 -11279 7909 26509 5226 -8641 -24622
9959 -24622 -4432 18962 29543 27285 25381 30983 28464 412 1336 30323 40803 18411 -12694
$$ packed form
10048D489J2403k0638J5382L8997K3354j7246j6225M81Q500R68L8178j3181j9271
10035E6191j3691k8485k1402J4274K8450K163K0982K6707j9925k5532o695r880
10023B3157j0548J4636K3031K2639R167m7193k4499k9414J4134L8178n955j7032
10011A0301k2549J0154P17J0113J5213k158Q779j5116j4505m905J8291J9576q59
9998C3052q98n071j6686p09n025j6207O482M9436J074o625J3477J0718R107k4589
9984D7536k1812l6727l1429J6273O336R315L5629K0830l6493j5040K950n407p240
9971a5279Q350R991J6022J0138m268k0731j5502J9188J8600k1283j3867j5981
9959b4622K0190K3394J0581k258j904N602k519k8052R24K8987J0480k2392l1105
$$ plain form
9946 -12694 -16551 4455 31586 18731 12347 9627 17685 1807 20361 29539 15228 5614 1843
9933 1843 12459 24634 34648 7170 -8480 6565 10679 14928 2242 -5936 21722 57263 78074
9920 78074 84041 100303 89449 81540 53087 39014 18984 15825 20713 47084 52390 55022 53557
9907 53557 50061 70647 60413 53807 53939 52042 62300 51292 47014 51121 36558 -4936 1910
9894 1910 5468 14643 57818 72034 35477 29646 48893 25577 20833 23340 28634 8406 -11174
9881 -11174 2579 12965 6199 9751 -20388 -19081 13915 49172 48087 19875 12777 -35177 -33431
9868 -33431 -17503 -17081 -32253 -3323 27222 39644 38418 20569 20467 27644 6087 -19347 -25690
9855 -25690 -8254 -1994 -8657 10646 18194 8700 -29058 -45188 -54082 -20144 -14547 -3870 17693
$$ packed form
9946a2694l857K1006K7131j2855o384k720Q058j5878J8554R178j4311r614l771
9933A843J0616J2175J0014k7478j5650J5045M114M249j2686q178K7658L5541K0811
9920G8074N967J6262j0854p909k8453j4073k0030l159M888K6371N306K632j465
9907E3557l496K0586j0234o606J32j897J0258j1008m278M107j4563m1494O846
9894A910L558R175M3175J4216l6557n831J9247k3316m744K507N294k0228j9580
9881a1174J3753J0386o766L552l0139J307L2996L5257j085k8212p098m7954J746
9868c3431J5928M22j5172K8930L0545J2422j226j7849j02P177k1557k5434o343
9855b5690J7436O260o663J9303P548r494l7758j6130q894L3938N597J0677K1563
$$ plain form
9842 17693 31402 23940 25787 19530 23763 28551 51902 16536 9771 3742 -2509 4897 13270 -3065
9828 -3065 11038 25820 24243 8749 -16442 -13866 1540 -9536 3203 4409 8611 -122 -8707
9815 -8707 1679 18430 27499 19695 -176 21001 35128 54267 37195 6222 -9748 15978
9803 15978 28411 31721 20116 21747 22765 11783 3757 -4534 -5952 6895 23775 12428 -267
9790 -267 2639 27957 27579 20061 14440 25371 14694 -9177 -16078 -3540 -25805 -50894 -46231 -2236
9776 -2236 22590 1735 19336 34509 29979 43376 63991 55332 28433 17360 16245 35888 50585
9763 50585 48625 40471 29848 17898 4345 2187 21382 21526 9505 -4489 6583 12192 24998
9750 24998 19082 16421 31658 20269 25362 33864 30283 37765 44581 32920 30798 32526 15432 11729
$$ packed form
9842A7693J3709p462J847o257M233M788K3351l5366o765o029o251P406Q373j6335
9828c065J4103J4782j577j5494k5191K576J5406j1076J2739J206M202q733q585
9815h707J0386J6751R069p804j9871K1177J4127J9139j7072l0973j5970K5726
9803A5978J2433L310j1605J631J018j0982q026q291j418J2847J6880j1347j2695
9790b67K906K5318l78p518n621J0931j0677k3871o901J2538k2265k5089M663M3995
9776b236K4826k0855J7601J5173m530J3397K0615q659k6899j1073j115J9643J4697
9763E0585j960q154j0623j1950j3553k158J9195J44j2021j3994J1072N609J2806
9750B4998n916k661J5237j1389N093Q502l581P482O816j1661k122J728j7094l703
$$ plain form
9736 11729 10395 1494 19110 27337 12855 9541 17202 40867 41231 38305 18963 12712 10472 17387
9722 17387 34109 28990 33260 15068 -3684 8493 16672 15865 -276 23076 36628 51579 73598
9709 73598 86624 95760 85461 51459 33767 40460 32407 21102 17934 7540 13432 17889 5015
9696 5015 14462 15635 7804 17708 21367 13765 15592 31321 48604 49766 31801 18794 1718 -13722
9682 -13722 2104 13135 29526 29713 30469 34674 20970 17332 31388 27151 27945 15128 43724 51219
9668 51219 58139 60513 59295 53138 35504 46178 42901 29504 29086 31542 64367 66572 60096 27088
9654 27088 -4131 6405 -7606 -2425 19236 59543 78759 77551 71567 80066 102623 110929 121479
9641 121479 132049 115974 110418 97917 98424 85099 78011 80051 94764 103590 94366 86006 72732
$$ packed form
9736A1729j334q901J7616Q227j4482l314P661K3665L64k926j9342o251k240O915
9722A7387J6722n119M270j8192j8752J2177Q179q07j6141K3352J3552J4951K2019
9709G3598J3026R136j0299l4002j7692O693q053j1305l168j0394N892M457j2874
9696E015R447J173p831R904L659p602J827J5729J7283J162j7965j3007j7076j5440
9682a3722J5826J1031J6391J87P56M205j3704l638J4056m237P94j2817K8596P495
9668E1219O920K374j218o157j7634J0674l277j3397m18K456L2825K205o476l3008
9654B7088l1219J0536j4011N181K1661M0307J9216j208n984Q499K2557Q306J0550
9641A21479J0570j6075n556j2501N07j3325p088K040J4713Q826r224q360j3274
$$ plain form
9628 72732 69984 78114 89285 101798 113379 106633 78664 50626 48912 36692 52019 41034 59989
9615 59989 61690 84518 74053 60540 76694 88435 93904 75082 77785 94137 79437 83732 101446
9602 101446 128177 147543 112406 57247 81214 101320 101396 68712 65993 60118 73514 96497 79996
9589 79996 70016 69937 83034 83253 75967 90892 116404 119504 107561 101602 102650 99721 95958 92670
9575 92670 83341 72649 68393 73677 86629 87633 73197 56232 75368 52833 49678 61536 74072
9562 74072 97965 114978 125288 125444 128938 129939 113916 91281 59042 72800 78867 64969 75423
9549 75423 114796 140603 131973 113489 84715 66956 70072 75607 95039 91923 85113 72017 65502
9536 65502 76435 106761 98812 103209 96767 114892 119777 115593 87529 76616 83914 78531 87595
$$ packed form
9628G2732k748Q130J1171J2513J1581o746k7969k8038j714j2220J5327j0985J8955
9615E9989J701K2828j0465j3513J6154J1741N469j8822K703J6352j4700M295J7714
9602A01446K6731J9366l5137n5159K3967K0106P6l2684k719n875J3396K2983j6501
9589G9996r980p9J3097K19p286J4925K5512L100j1943n959J048k929l763l288
9575I2670r329j0692m256N284J2952J004j4436j6965J9136k2535l155J1858J2536
9562G4072K3893J7013J0310J56L494J001j6023k2635l2239J3758O067j3898J0454
9549G5423L9373K5807q630j8484k8774j7759L116N535J9432l116o810j3096o515
9536F5502J0933L0326p949M397o442J8125M885m184k8064j0913P298n383R064
$$ plain form
9523 87595 93864 118743 108149 93192 110678 112664 108640 117819 116579 101865 91791 81289 83901
9510 83901 91560 87646 98696 93362 94425 91731 98708 100530 99973 139976 141759 128875 118349 113588
9496 113588 110258 98999 69401 71074 82386 76666 62263 58630 54803 56825 68358 77164 93190
9483 93190 112835 98262 57558 69847 99128 92649 90783 103512 117529 109593 123020 107936
9471 107936 96646 87676 88831 100925 100319 95421 81096 70715 96073 94222 69849 75088 79281
9458 79281 109267 125500 115075 87980 76235 70873 98137 109556 116732 121532 127865 104798 120111
9445 120111 131454 112481 114032 105617 116216 133487 120877 99934 101503 110511 102780 101777 88285
9432 88285 73573 78159 57780 54180 88974 89481 85059 94177 90965 108844 106906 72561 36207
$$ packed form
9523H7595O269K4879j0594j4957J7486J986m024R179j240j4714j0074j0502K612
9510H3901P659l914J1050n334J063k694O977J822n57M0003J783j2884j0526m761
9496A13588l330j1259k9598J673J1312n720j4403l633l827K022J1533Q806J6026
9483I3190J9645j4573m0704J2289K9281o479j866J2729J4017p936J3427j5084
9471A07936j1290q970J155J2094o06m898j4325j0381K5358j851k4373N239M193
9458G9281K9986J6233j0425k7095j1745n362K7264J1419P176M800O333k3067J5313
9445A20111J1343j8973J551q415J0599J7271j2610k0943J569R008p731j003j3492
9432H8285j4712M586k0379l600L4794N07m422R118l212J7879j938l4345l6354
$$ plain form
9419 36207 34634 31863 41432 49724 35690 36005 59348 73092 57569 60773 60766 76757 68467 73048
9405 73048 101654 107560 94591 98699 94465 122730 156992 138697 136221 108721 116852 120308 116138
9392 116138 123355 117482 135300 118082 99720 117941 146161 157815 169337 143275 133133 158919
9380 158919 153580 112028 104795 112745 113097 120387 102197 88236 90578 112516 147918 142159 125093
9367 125093 130493 139399 106338 113330 120066 116373 129629 161411 152392 157134 142957 125991 134763
9354 134763 126133 122583 98939 125424 143591 122121 91703 124708 134570 149764 131573 104478
9342 104478 78988 89859 87734 91044 91487 80074 97621 82496 45618 37708 41716 62010 70513
9329 70513 103497 113875 110884 107794 120276 131591 131998 174503 196502 149797 130803 148549 145981
$$ packed form
9419C6207j573k771R569Q292j4034L15K3343J3744j5523L204pJ5991q290M581
9405G3048K8606N906j2969M108m234K8265L4262j8295k476k7500Q131L456m170
9392A16138P217n873J7818j7218j8362J8221K8220J1654J1522k6062j0142K5786
9380A58919n339m1552p233P950L52P290j8190j3961K342K1938L5402n759j7066
9367A25093N400Q906l3061O992O736l693J3256L1782r019M742j4177j6966Q772
9354A34763q630l550k3644K6485J8167k1470l0418L3005R862J5194j8191k7095
9342A04478k5490J0871k125L310M43j1413J7547j5125l6878p910M008K0294Q503
9329G0513L2984J0378k991l090J2482J1315M07M2505K1999m6705j8994J7746k568
$$ plain form
9316 145981 134887 146486 164395 160675 153968 160106 153274 153692 150678 162231 175069 178641 178854 192553
9302 192553 205508 205779 219784 196131 217930 245410 259147 268750 300772 316637 294195 307777
9290 307777 341359 355293 375865 392566 397520 447682 496766 530648 578891 600298 633090 714240
9278 714240 814645 916036 1025932 1145572 1260101 1405360 1549202 1695349 1843745 1989438
9268 1989438 2091585 2174724 2219929 2213695 2177435 2087190 1987022 1869292 1727150 1599252 1484331
9257 1484331 1392317 1297730 1233769 1186194 1122527 1091169 1071569 1020347 963455 927600 885894
9246 885894 834774 795010 777486 767590 715805 675888 670002 663870 666464 661239 621721 599601 580319
9233 580319 582101 586455 575058 558070 549287 545655 546159 529730 484316 463238 460894 439666 444987
$$ packed form
9316A45981j1094J1599J7909l720o707O138o832M18l014J1553J2838L572K13J3699
9302A92553J2955K71J4005k3653K1799K7480J3737R603L2022J5865k2442J3582
9290C07777L3582J3934K0572J6701M954N0162M9084L3882M8243K1407L2792Q1150
9278G14240J00405J01391J09896J19640J14529J45259J43842J46147J48396J45693
9268A989438J02147Q3139M5205o234l6260r0245j00168j17730j42142j27898j14921
9257A484331r2014r4587o3961m7575o3667l1358j9600n1222n6892l5855m1706
9246H85894n1120l9764j7524r896n1785l9917n886o132K594n225l9518k2120j9282
9233E80319J782M354j1397j6988q783l632N04j6429m5414k1078k344k1228N321
$$ plain form
9220 444987 450529 455056 462661 443775 430989 423126 438623 437313 429618 405554 389713 390482 377517
9207 377517 380664 374029 380046 405314 423328 428314 428062 432859 426536 431317 424996 418026 398836 411875
9193 411875 420567 419721 453353 472071 450197 449772 459348 472355 496862 502149 508765 531631 537142
9180 537142 565561 618190 653064 633380 601765 578510 542906 485425 434462 419070 427171 423024
9168 423024 390336 384007 401098 392103 397924 400499 398100 383774 359863 349080 337182 312930 319612
9155 319612 325860 323491 325836 337680 347831 354674 349003 340616 343807 337075 348952 356663 345922
9142 345922 366665 382684 399421 411775 462670 456957 442086 455780 458977 469399 483218 499665
9130 499665 520259 524030 525283 509479 516005 522845 527830 539797 510809 496982 469342 448268 460335
$$ packed form
9220D44987N542M527P605j8886j2786p863J5497j310p695k4064j5841P69j2965
9207C77517L147o635O017K5268J8014M986k52M797o323M781o321o970j9190J3039
9193D11875Q692q46L3632J8718k1874m25R576J3007K4507N287O616K2866N511
9180E37142K8419N2629L4874j9684l1615k3255l5604n7481n0963j5392Q101m147
9168D23024l2688o329J7091q995N821K575k399j4326k3911j0783j1898k4252O682
9155C19612O248k369K345J1844J0151O843n671q387L191o732J1877P711j0741
9142C45922K0743J6019J6737J2354N0895n713j4871J3694L197J0422J3819J6447
9130D99665K0594L771J253j5804O526O840M985J1967k8988j3827k7640k1074J2067
$$ plain form
9117 460335 463932 466522 477953 481396 462944 457350 471901 480933 476253 471211 447109 435538 462217
9104 462217 469914 457067 451984 465501 478618 474574 496387 509835 526332 551157 553074 551919 574215
9091 574215 546773 543702 549629 585200 626617 638020 655397 641439 639062 660427 687765 697767
9079 697767 701988 714894 716378 713888 710023 712482 713186 724757 725451 726882 755886 776021 809576 840096
9065 840096 851930 845479 851137 848092 865928 913395 962889 988132 1007827 973517 890712 818587
9053 818587 740820 703681 683460 634642 634451 637479 639534 635332 633581 652563 670208 687386 683396
9040 683396 694016 686455 666106 649976 645074 658020 652425 667628 699174 716956 712057 726208
9028 726208 767259 806751 810613 827225 897404 972074 1003814 1036760 1041375 1063232 1083506 1118464
$$ packed form
9117D60335L597K590J1431L443j8452n594J4551R032m680n042k4102j1571K6679
9104D62217P697j2847n083J3517J3117m044K1813J3448J6497K4825J917j155K2296
9091E74215k7442l071N927L5571M1417J1403J7377j3958k377K1365K7338J0002
9079F97767M221J2906J484k490l865K459P04J1571O94J431K9004K0135L3555L0520
9065H40096J1834o451N658l045J7836M7467M9494K5243J9695l4310q2805p2125
9053H18587p7767l7139k0221m8818j91L028K055m202j751J8982J7645J7178l990
9040F83396J0620p561k0349j6130m902J2946n595J5203L1546J7782m899J4151
9028G26208M1051L9492L862J6612P0179P4670L1740L2946M615K1857K0274L4958
$$ plain form
9016 1118464 1139901 1157809 1154610 1157169 1194906 1233472 1275059 1330635 1390888 1434139 1458094 1506389
9004 1506389 1552522 1589510 1623058 1674776 1708232 1709842 1704951 1706997 1689903 1689212 1719443 1801731
8992 1801731 1879887 1907932 1901458 1901511 1896293 1856679 1834116 1855723 1870022 1868122 1883912 1920378 1940666
8979 1940666 1995909 2050518 2088057 2103256 2105678 2077018 2098991 2133425 2157881 2188507 2263739 2335457
8967 2335457 2394710 2450845 2522006 2595137 2668192 2726387 2752803 2749864 2774452 2829412 2902413 2919923
8955 2919923 2947384 3001782 3065587 3142833 3202397 3233531 3279744 3332754 3373937 3428200 3488927
8944 3488927 3582062 3638869 3713051 3815901 3892473 3962171 4040228 4102111 4148816 4201795 4291347
8933 4291347 4392933 4456235 4498993 4580793 4687435 4764628 4885297 4997043 5106153 5184187
$$ packed form
9016A118464K1437J7908l199K559L7737L8566M1587N5576O0253M3251K3955M8295
9004A506389M6133L6988L3548N1718L3456J610m891K046j7094o91L0231Q2288
8992A801731P8156K8045o474N3n218l9614k2563K1607J4299j900J5790L6466K0288
8979A940666N5243N4609L7539J5199K422k8660K1973L4434K4456L0626P5232P1718
8967B335457N9253N6135P1161P3131P3055N8195K6416k939K4588N4960P3001J7510
8955B919923K7461N4398O3805P7246N9564L1134M6213N3010M1183N4263O0727
8944C488927R3135N6807P4182J02850P6572O9698P8057O1883M6705N2979Q9552
8933D291347J01586O3302M2758Q1800J06642P7193J20669J11746J09110P8034
$$ plain form
8923 5184187 5312360 5509834 5692708 5864104 6047210 6277599 6504356 6735442 6978142 7203699
8913 7203699 7464707 7763787 8129502 8537155 8981564 9426943 9889342 10408385 10993323 11626276
8903 11626276 12289298 12970707 13769545 14714184 15744766 16859210 18110382 19502060 21056385
8894 21056385 22817354 24839360 27104087 29696510 32646639 36078226 40094840 44753735
8886 44753735 50204264 56650533 64267963 73355407 84295280 97458434 113219090 131880866
8878 131880866 153730656 178921787 207395012 238825849 272739248 309108864 348546191
8871 348546191 392477453 441485735 490422511 522879654 518211443 473491123 408031490
8864 408031490 343259073 289731020 249311002 220147552 199572248 185353089 175696226
$$ packed form
8923E184187J28173J97474J82874J71396J83106K30389K26757K31086K42700K25557
8913G203699K61008K99080L65715M07653M44409M45379M62399N19043N84938O32953
8903A1626276O63022O81409P98838R44639J030582J114444J251172J391678J554325
8894B1056385J760969K022006K264727K592423K950129L431587M016614M658895
8886D4753735N450529O446269P617430R087444J0939873J3163154J5760656J8661776
8878A31880866K1849790K5191131K8473225L1430837L3913399L6369616L9437327
8871C48546191M3931262M9008282M8936776L2457143m668211m4720320o5459633
8864D08031490o4772417n3528053m0420018k9163450k0575304j4219159r656863
$$ plain form
8857 175696226 169280160 165092772 162121230 159380400 155826907 150714349 143936874 135936843
8849 135936843 127426663 119094769 111343633 104359263 98211958 92806713 88078391 83915989
8841 83915989 80281838 77097519 74264916 71718619 69416049 67350997 65402292 63511119
8833 63511119 61642420 59692913 57607612 55403562 53111815 50788592 48490584 46236846
8825 46236846 44119951 42174299 40344626 38638570 37077671 35641481 34298474 33065390
8817 33065390 31847282 30652485 29473007 28369668 27369271 26391050 25495392 24678376 23910491
8808 23910491 23163850 22469131 21796778 21208509 20638197 20101778 19588535 19089030 18627802
8799 18627802 18220238 17799581 17363253 16934259 16521399 16141080 15783308 15425855 15042990
$$ packed form
8857A75696226o416066m187388k971542k740830l553493n112558o777475q000031
8849A35936843q510180q331894p751136o984370o147305n405245m728322m162402
8841H3915989l634151l184319k832603k546297k302570k065052j948705j891173
8833F3511119j868699j949507k085301k204050k291747k323223k298008k253738
8825D6236846k116895j945652j829673j706056j560899j436190j343007j233084
8817C3065390j218108j194797j179478j103339j000397r78221q95658q17016p67885
8808B3910491p46641o94719o72353n88269n70312n36419n13243m99505m61228
8799A8627802m07564m20657m36328m28994m12860l80319l57772l57453l82865
$$ plain form
8790 15042990 14698853 14371388 14014398 13654264 13310049 12987352 12680911 12368169 12078903
8781 12078903 11804060 11555050 11309135 11043464 10810402 10581229 10345411 10133245 9959567
8772 9959567 9785891 9585334 9390288 9203447 9028577 8837160 8640539 8468088 8293339 8143596
8762 8143596 7987880 7801595 7614186 7447022 7287796 7162781 7099179 7015224 6925811 6844784
8752 6844784 6748291 6627862 6540793 6461646 6352817 6255455 6111362 5983593 5897067 5843296 5793245
8741 5793245 5741530 5637387 5507248 5409190 5291923 5180991 5073710 4956324 4839002 4727939
8731 4727939 4666813 4634661 4558333 4469660 4402217 4325572 4225082 4154180 4105072 4043649 3978797
8720 3978797 3912726 3854253 3796633 3752020 3689196 3630789 3608732 3607187 3594471 3576052 3548122 3507503
$$ packed form
8790A5042990l44137l27465l56990l60134l44215l22697l06441l12742k89266
8781A2078903k74843k49010k45915k65671k33062k29173k35818k12166j73678
8772I959567j73676k00557j95046j86841j74870j91417j96621j72451j74749j49743
8762H143596j55716j86285j87409j67164j59226j25015o3602q3955q9413q1027
8752F844784r6493j20429q7069p9147j08829r7362j44093j27769q6526n3771n0051
8741E793245n1715j04143j30139r8058j17267j10932j07281j17386j17322j11063
8731D727939o1126l2152p6328q8673o7443p6645j00490p0902m9108o1423o4852
8720C978797o6071n8473n7620m4613o2824n8407k2057j545j2716j8419k7930m0619
$$ plain form
8708 3507503 3447717 3412041 3394597 3316297 3239111 3176341 3120448 3075267 3007552 2953545 2909813
8697 2909813 2855087 2796410 2769633 2724733 2709246 2670519 2612108 2564216 2501761 2415494 2372407
8686 2372407 2297668 2230293 2147808 2061827 2012815 1901598 1750543 1630785 1606701 1633749 1627456
8675 1627456 1647573 1655622 1661717 1683420 1681994 1656525 1649669 1627285 1616905 1582765 1532168 1497302
8663 1497302 1455611 1400491 1367318 1343292 1327738 1311546 1285293 1242976 1185137 1161972 1165047 1183149
8651 1183149 1158756 1131030 1114664 1066830 1033143 1020098 1010920 1018683 1018352 996597 972272 971460 953089
8638 953089 921085 917771 930413 908574 891673 865176 844905 860341 861351 850664 856849 837745
8626 837745 830162 834634 836603 845714 836344 830951 808982 762223 775999 795141 775538 775908 776345 775573
$$ packed form
8708C507503n9786l5676j7444p8300p7186o2770n5893m5181o7715n4007m3732
8697B909813n4726n8677k6777m4900j5487l8727n8411m7892o2455q6267m3087
8686B372407p4739o7375q2485q5981m9012j11217j51055j19758k4084K7048o293
8675A627456K0117Q049O095K1703j426k5469o856k2384j0380l4140n0597l4866
8663A497302m1691n5120l3173k4026j5554j6192k6253m2317n7839k3165L075J8102
8651A183149k4393k7726j6366m7834l3687j3045r178P763l31k1755k4325q12j8371
8638I53089l2004l314J2642k1839j6901k6497k0271J5436J010j0687O185j9104
8626H37745p583M472J969R111r370n393k1969m6759J3776J9142j9603L70M37p72
$$ plain form
8612 775573 753103 710386 688333 693383 691210 689918 683616 683382 684560 675890 693506 699006 729402
8599 729402 738802 718104 681800 659803 646134 662013 665983 670431 677611 685878 686590 697526 726402
8586 726402 719229 694209 696609 695612 718093 732582 711769 699517 703786 705687 692149 678979 710251
8573 710251 707014 694488 675840 663083 636085 601258 567551 533730 493763 500085 511406 473062
8561 473062 402978 365666 321202 313742 343837 342183 378509 411142 411128 400032 382625 389095 402789
8548 402789 393394 359303 340500 329192 304891 318411 348516 341989 342842 331239 307527 290164
8536 290164 296748 288795 293394 312465 295747 328333 353136 337728 316656 316743 308298 280297 249299
8523 249299 250943 283627 288089 282286 280997 294546 306341 293793 276186 276389 281111 261986 270411
$$ packed form
8612G75573k2470m2717k2053N050k173j292o302k34J178q670J7616N500L0396
8599G29402R400k0698l6304k1997j3669J5879L970M448P180Q267P12J0936K8876
8586G26402p173k5020K400r97K2481J4489k0813j2252M269J901j3538j3170L1272
8573G10251l237j2526j8648j2757k6998l4827l3707l3821l9967O322J1321l8344
8561D73062p0084l7312m4464p460L0095j654L6326L2633j4j1096j7407O470J3694
8548D02789r395l4091j8803j1308k4301J3520L0105o527Q53j1603k3712j7363
8536B90164O584p953M599J9071j6718L2586K4803j5408k1072Q7q445k8001l0998
8523B49299J644L2684M462n803j289J3549J1795j2548j7607K03M722j9125Q425
$$ plain form
8510 270411 269737 261110 243245 248007 272570 251063 231687 235050 240949 260623 275308 283793 294360
8497 294360 272882 257136 278003 266272 243217 229371 246137 290941 322102 326994 356512 379763
8485 379763 391619 395362 436962 498192 562735 602945 691743 789341 879484 963654 1074093 1181564
8473 1181564 1301451 1438749 1581323 1764515 1895990 2015421 2136340 2236340 2284911 2283710
8463 2283710 2229775 2156928 2038110 1900035 1770628 1651270 1536669 1438241 1362904 1252802
8453 1252802 1174112 1147628 1107616 1074675 1059181 1000584 918265 873694 847150 785958 729879
8442 729879 724598 713137 712488 690129 645089 617870 592125 580987 609188 575970 572160 554191
8430 554191 527366 537299 538388 529802 526711 482410 441582 407917 423362 416757 381279 369386 364849
$$ packed form
8510B70411o74q627j7865M762K4563k1507j9376L363N899J9674J4685Q485J0567
8497B94360k1478j5746K0867j1731k3055j3846J6766M4804L1161M892K9518K3251
8485C79763J1856L743M1600O1230O4543M0210Q8798R7598R0143Q4170J10439J07471
8473A181564J19887J37298J42574J83192J31475J19431J20919J00000M8571j201
8463B283710n3935p2847j18818j38075j29407j19358j14601r8428p5337j10102
8453A252802p8690k6484m0012l2941j5494n8597q2319m4571k6544o1192n6079
8442G29879n281j1461o49k2359m5040k7219k5745j1138K8201l3218l810j7969
8430E54191k6825R933J089q586l091m4301m0828l3665J5445o605l5478j1893m537
$$ plain form
8417 364849 358126 347491 340706 315872 286990 262176 250094 241145 292324 346153 362576 326002
8405 326002 304655 318381 300855 288164 285253 281518 289157 291164 302463 284219 265982 274538 259936
8392 259936 244088 227693 223312 208255 214963 194687 181554 166297 190294 187456 167444 177056
8380 177056 181907 202813 216081 178537 163765 169438 174354 172650 182915 167392 153693 138534
8368 138534 142886 155773 176685 168571 183344 161099 140408 157105 152649 148287 162415 155426 140525
8355 140525 104771 114903 132542 123240 112974 103399 93117 54290 53783 67159 81536 82764 81168
8342 81168 61860 79702 93620 104210 112494 123072 119854 95005 97638 87355 80754 107618 125581
8329 125581 135545 115479 91639 105789 139762 152662 119381 103272 121514 146805 126691 129751
$$ packed form
8417C64849o723j0635o785k4834k8882k4814j2082q949N1179N3829J6423l6574
8405C26002k1347J3726j7526j2691k911l735P639K007J1299j8244j8237Q556j4602
8392B59936j5848j6395m381j5057O708k0276j3133j5257K3997k838k0012R612
8380A77056M851K0906J3268l7544j4772N673M916j704J0265j5523j3699j5159
8368A38534M352J2887K0912q114J4773k2245k0691J6697m456m362J4128o989j4901
8355A40525l5754J0132J7639r302j0266r575j0282l8827n07J3376J4377J228j596
8342H1168j9308J7842J3918J0590Q284J0578l218k4849K633j0283o601K6864J7963
8329A25581R964k0066k3840J4150L3973J2900l3281j6109J8242K5291k0114L060
$$ plain form
8317 129751 129702 127693 98551 93717 103938 99405 115716 130000 137284 113264 103461 115555 110531
8304 110531 88933 102740 111282 85276 69237 62334 62427 89614 112451 110233 109007 108549 103346 89501
8290 89501 95897 124465 148410 176371 146094 92603 57779 49873 46907 63389 46626 21930
8278 21930 43197 77675 122306 129871 105124 110254 131460 114759 85019 90229 105789 74682
8266 74682 54197 51578 67498 95997 97755 80306 55027 44433 50430 41088 34137 30143 47014
8253 47014 61368 50925 28959 49099 86173 83032 58558 34668 50875 94438 109481 104952
8241 104952 69378 15528 6687 24515 27280 32688 52180 52440 43036 27879 43358 58864 58532
8228 58532 65133 95881 93444 76568 74781 87730 64098 46067 32009 46199 50191 48361 59428
$$ packed form
8317A29751m9k009k9142m834J0221m533J6311J4284P284k4020r803J2094n024
8304A10531k1598J3807Q542k6006j6039o903R3K7187K2837k218j226m58n203j3845
8290H9501O396K8568K3945K7961l0277n3491l4824p906k966J6482j6763k4696
8278B1930K1267L4478M4631P565k4747N130K1206j6701k9740N210J5560l1107
8266G4682k0485k619J5920K8499J758j7449k5279j0594N997r342o951l994J6871
8253D7014J4354j0443k1966K0140L7074l141k4474k3890J6207M3563J5043m529
8241A04952l5574n3850q841J7828K765N408J9492K60r404j5157J5479J5506l32
8228E8532O601L0748k437j6876j787J2949k3632j8031j4058J4190L992j830J1067
$$ plain form
8215 59428 75323 80257 80287 67544 33666 19578 50854 54843 56217 61553 57439 12831 -15962
8202 -15962 -7510 1428 16816 23305 22167 35688 47007 34145 12957 -5560 10005 40578 47600
8189 47600 48117 31209 43685 43414 38353 25806 23280 44213 51618 60404 62850 68524 59513 53012
8175 53012 17365 19483 30596 38552 57079 22888 2984 20355 42972 16215 -7862 -3335
8163 -3335 -13386 -18555 -2386 16536 38725 40553 16164 22769 36634 2655 34379 59754 63344
8150 63344 50318 50298 59504 53279 42888 45031 23881 15844 32144 14669 10614 18361 18732 33056
8136 33056 49147 51833 42849 29513 38258 48922 38572 49781 63738 77118 85922 85789 69713
8123 69713 53820 34250 44756 45598 45624 43579 24784 13915 -13446 1873 45960 72967 70022
$$ packed form
8215E9428J5895M934L0j2743l3878j4088L1276L989J374N336m114m4608k8793
8202a5962Q452Q938J5388O489j138J3521J1319j2862k1188j8517J5565L0573P022
8189D7600N17j6908J2476k71n061j2547k526K0933P405Q786K446N674r011o501
8175E3012l5647K118J1113P956J8527l4191j9904J7371K2617k6757k4077M527
8163c335j0051n169J6169J8922K2189J828k4389O605J3865l3979L1724K5375L590
8150F3344j3026k0R206o225j0391K143k1150q037J6300j7475m055P747L71J4324
8136C3056J6091K686q984j3336Q745J0664j0350J1209J3957J3380Q804j33j6076
8123F9713j5893j9570J0506Q42K6k045j8795j0869k7361J5319M4087K7007k945
$$ plain form
8110 70022 37481 16707 35851 56419 54392 74597 101331 90936 68918 53204 32970 26735
8098 26735 37436 40370 21652 39851 41129 35722 20761 13636 26461 39158 35041 35273 30611
8085 30611 53027 71727 69661 78109 72772 59423 43894 36263 24472 19565 40893 44953 29764
8072 29764 34436 48835 58617 73135 75422 71693 62416 49755 13703 20268 10116 11481 27289
8059 27289 34597 40305 45781 39058 14938 22924 18848 6441 -2650 7693 -15331 -8927 -17794 -24909
8045 -24909 -9282 22204 52298 64223 83133 88600 83381 62864 57127 76707 54062 47044 24623
8032 24623 13697 31206 42333 39634 24616 32866 27801 44626 33242 44535 41499 36843 53232
8019 53232 64533 79302 78632 77910 59270 38750 23918 47404 57664 45931 45402 38416 32146
$$ packed form
8110G0022l2541k0774J9144K0568k027K0205K6734j0395k2018j5714k0234o235
8098B6735J0701K934j8718J8199J278n407j4961p125J2825J2697m117K32m662
8085C0611K2416J8700k066Q448n337j3349j5529p631j1791m907K1328M060j5189
8072B9764M672J4399R782J4518K287l729r277j2661l6052O565j0152J365J5808
8059B7289P308N708N476o723k4120P986m076j2407r091J0343k3024O404q867p115
8045b4909J5627L1486L0094J1925J8910N467n219k0517n737J9580k2645p018k2421
8032B4623j0926J7509J1127k699j5018Q250n065J6825j1384J1293l036m656J6389
8019E3232J1301J4769o70p22j8640k0520j4832K3486J0260j1733n29o986o270
$$ plain form
8006 32146 27301 38998 40247 62224 78115 86970 77844 77555 64520 44905 62416 78443 72048
7993 72048 38346 43375 51718 49599 59668 73215 83284 97772 114758 94465 108788 152909
7981 152909 161157 142601 123080 94426 96729 111595 123831 143163 136455 150546 169083 164964
7969 164964 190922 178995 153078 149985 134499 125160 118920 127564 138171 138047 111875 86183 90545
7956 90545 89742 70375 91532 78442 75256 80655 94244 87387 83397 93396 118509 116687 103336
7943 103336 124085 128408 128928 110204 86897 85900 95130 88824 70977 73345 91136 110720 105419
7930 105419 97616 96593 116031 123704 138332 155592 147184 117450 104557 97075 89372 86972 123166
7917 123166 116905 117645 105087 134905 142814 98882 87685 92991 76414 69782 76292 54898 21794
$$ packed form
8006C2146m845J1697J249K1977J5891Q855r126k89j3035j9615J7511J6027o395
7993G2048l3702N029Q343k119J0069J3547J0069J4488J6986k0293J4323M4121
7981A52909Q248j8556j9521k8654K303J4866J2236J9332o708J4091J8537m119
7969A64964K5958j1927k5917l093j5486r339o240Q644J0607j24k6172k5692M362
7956I0545q03j9367K1157j3090l186N399J3589o857l990R999K5113j822j3351
7943A03336K0749M323N20j8724k3307r97R230o306j7847K368J7791J9584n301
7930A05419p803j023J9438P673J4628J7260q408k9734j2893p482p703k400L6194
7917A23166o261P40j2558K9818P909m3932j1197N306j6577o632O510k1394l3104
$$ plain form
7904 21794 14489 17212 33680 63459 92077 109135 71221 51075 41361 44358 95068 153590 147306
7891 147306 100070 63856 45104 29939 21772 35757 41540 57964 34678 18544 28690 44745
7879 44745 76115 71295 36890 26385 53332 39506 51734 41577 8416 12221 -2489 17156
7867 17156 47481 41168 46291 59567 41352 35324 49013 56991 59919 80417 84567 90281 39125
7854 39125 21410 19457 52142 44938 8058 15066 11654 -7619 9206 30828 46700 37038 21195
7841 21195 36646 39726 26206 37401 20140 -7459 -9414 23623 8040 -21661 -8113 -22151
7829 -22151 -27715 -10677 8233 6629 -13982 -30772 36258 20957 -1600 6537 3626 10228 -937
7816 -937 -16159 -21915 365 22650 -8121 -14781 -4548 -93 -21209 -9104 -12939 -8385 -14146
$$ packed form
7904B1794p305K723J6468K9779K8618J7058l7914k0146r714K997N0710N8522o284
7891A47306m7236l6214j8752j5165q167J3985N783J6424k3286j6134J0146J6055
7879D4745L1370m820l4405j0505K6947j3826J2228j0157l3161L805j4710J9645
7867A7156L0325o313N123J3276j8215o028J3689P978K928K0498M150N714n1156
7854C9125j7715j953L2685p204l6880P008l412j9273J6825K1622J5872r662j5843
7841B1195J5451L080j3520J1195j7261k7599j955L3037j5583k9701J3548j4038
7829b2151n564J7038J8910j604k0611j6790O7030j5301k2557Q137k911O602j1165
7816i37j5222n756K2280K2285l0771o660J0233M455k1116J2105l835M554n761
$$ plain form
7803 -14146 -24784 -8381 -7947 -11469 -6570 22712 9013 -1926 -15546 -12771 10443 26991 42166
7790 42166 43029 37388 23216 4427 1102 27760 35454 35151 24240 45152 53326 29579 31094 22733
7776 22733 -2228 -11744 3852 924 -14309 -27158 -16637 36093 25747 -3915 -5733 -9276 -24511
7763 -24511 -24624 6815 7040 -30236 -42342 -38872 -50072 -42474 -17666 6595 10554 -5778 19927
7750 19927 13020 -7410 -29121 -46659 -33596 -39047 -29848 -18039 6800 23653 33809 -6398
7738 -6398 -24467 -24231 -12973 20285 56592 67052 33566 35736 31312 22041 -2805 -12450 -1613
7725 -1613 -19252 -43757 -47533 -26876 3930 -3575 -25887 -40674 -31013 -9604 -8465 4237 26340
7712 26340 11356 -17071 -22132 -7346 -1463 4139 5481 3233 2069 -9157 -22237 -28399 21700
$$ packed form
7803a4146j0638J6403M34l522M899K9282j3699j0939j3620K775K3214J6548J5175
7790D2166Q63n641j4172j8789l325K6658P694l03j0911K0912Q174k3747J515q361
7776B2733k4961r516J5596k928j5233j2849J0521N2730j0346k9662j818l543j5235
7763b4511j13L1439K25l7276j2106L470j1200P598K4808K4261L959j6332K5705
7750A9927o907k0430k1711j7538J3063n451R199J1809K4839J6853J0156m0207
7738f398j8069K36J1258L3258L6307J0460l3486K170m424r271k4846r645J0837
7725a613j7639k4505l776K0657L0806p505k2312j4787R661K1409J139J2702K2103
7712B6340j4984k8427n061J4786N883N602J342k248j164j1226j3080o162N0099
$$ plain form
7699 21700 26690 -5676 -41007 -94389 -99202 -70466 -39914 -32830 -58632 -27147 8953 -9498
7687 -9498 -24683 -23805 -32955 -39744 -40979 -31484 1164 2456 -8924 -18818 -42712 -61260 -47070 -25476
7673 -25476 -17945 22058 14746 7927 8006 11353 15916 7302 -16802 -33650 -41979 -18096 4043 12324
7659 12324 -10879 -17402 -14938 -4628 2563 -929 -33939 -27833 -36311 -18308 -1647 25828 43263
7646 43263 47032 30184 30097 17360 15993 -15768 -31494 -7518 30847 46646 43277 16537 13700
7633 13700 17523 15035 4973 2087 -13423 -13339 -9638 -12043 -27182 -38940 -35262 -12947 9717 -22392
7619 -22392 -25940 -7899 -18600 -1927 -9167 -41174 -24928 -30455 -17378 -32514 -56697 -43181
7607 -43181 -53469 -46674 -5613 14567 -58 -20699 -58756 -60011 -65003 -49878 -3211 18063
$$ packed form
7699B1700M990l2366l5331n3382m813K8736L0552P084k5802L1485L6100j8451
7687i498j5185Q78r150o789j235R495L2648J292j1380r894k3894j8548J4190K1594
7673b5476P531M0003p312o819P9L347M563q614k4104j6848q329K3883K2139Q281
7659A2324k3203o523K464J0310P191l492l3010O106q478J8003J6661K7475J7435
7646D3263L769j6848q7j2737j367l1761j5726K3976L8365J5799l369k6740k837
7633A3700L823k488j0062k886j5510Q4L701k405j5139j1758L678K2315K2664l2109
7619b2392l548J8041j0701J6673p240l2007J6246n527J3077j5136k4183J3516
7607d3181j0288O795M1061K0180j4625k0641l8057j255m992J5125M6667K1274
$$ plain form
7595 18063 22305 16092 -20009 -38050 -16407 -4561 -806 8930 -6390 -10081 -11105 -10194 -44099
7582 -44099 -23620 -21278 -23887 -41086 -25114 -27292 -26614 -25343 -41374 -22364 5545 1929 16347
7569 16347 8374 -12280 -11364 -12120 -8725 2381 7654 749 1811 1539 29309 36109 853 -34942
7555 -34942 -57918 -29243 -2157 -10076 -3088 -2597 -18288 -14603 -8476 2621 10272 27402 33230
7542 33230 24945 20359 14287 13832 27196 25542 16141 7095 15338 16241 -2017 8431 28027 29133
7528 29133 36505 -2001 -7681 21424 37617 22464 20499 19753 9525 24892 39947 38036 9773
7515 9773 -32125 -21861 -27037 -28046 3510 9069 -16019 -19092 -25030 -23595 -5629 10848 16310
7502 16310 -8146 -20774 -47528 -54059 -36528 5222 28551 39591 18251 24798 9683 -24763
$$ packed form
7595A8063M242o213l6101j8041K1643J1846L755R736j5320l691j024R11l3905
7582d4099K0479K342k609j7199J5972k178O78J271j6031J9010K7909l616J4418
7569A6347p973k0654R16p56L395J1106N273o905J062k72K7770O800l5256l5795
7555c4942k2976K8675K7086p919O988M91j5691L685O127J1097P651J7130N828
7542C3230q285m586o072m55J3364j654r401r046Q243R03j8258J0448J9596J106
7528B9133P372l8506n680K9105J6193j5153j965p46j0228J5367J5055j911k8263
7515I773m1898J0264n176j009L1556N559k5088l073n938J435J7966J6477N462
7502A6310k4456j2628k6754o531J7531M1750K3329J1040k1340O547j5115l4446
$$ plain form
7490 -24763 -29515 -15833 -32440 -33701 -8891 -2186 -20982 -28947 -36759 -21962 -6065 -11395 -27941
7477 -27941 -18138 -4977 25264 20776 -20009 -31720 -870 9181 15513 -337 -20670 -2700
7465 -2700 23532 1494 13656 4593 5164 24992 40198 1961 13138 14669 -15156 -3228 22160
7452 22160 11403 -31763 -36036 1582 9751 12425 24520 12017 21852 6666 -6554 18775 10316
7439 10316 -5030 9477 11862 7850 12076 32763 33090 17942 13532 17450 -1084 -10208 -2599 959
7425 959 9949 32892 33291 23381 3581 410 -13952 -27672 -8648 190 30904 22079 1717 5230
7411 5230 -1680 4405 8873 27354 44317 39468 1727 17937 34140 32349 36102 40700 27897
7398 27897 25139 26723 7574 14188 15742 -19705 -16965 4666 -4793 -11717 -13547 -31271 -57907
$$ packed form
7490b4763m752J3682j6607j261K4810O705j8796p965p812J4797J5897n330j6546
7477b7941R803J3161L0241m488m0785j1711L0850J0051O332j5850k0333J7970
7465b700K6232k2038J2162r063N71J9828J5206l8237J1177J531k9825J1928K5388
7452B2160j0757m3166m273L7618Q169K674J2095j2503R835j5186j3220K5329q459
7439A0316j5346J4507K385m012M226K0687L27j5148m410L918j8534r124P609L558
7425I59Q990K2943L99r910j9800l171j4362j3720J9024Q838L0714q825k0362L513
7411E230o910O085M468J8481J6963m849l7741J6210J6203j791L753M598j2803
7398B7897k758J584j9149O614J554l5447K740K1631r459o924j830j7724k6636
$$ plain form
7385 -57907 -63011 -44616 -29866 -15889 -6385 13481 26752 22046 6839 6523 2607 8904 4326
7372 4326 -3074 3233 22320 32868 14414 14522 30178 36432 -7941 -35493 -33872 -46607 -44187
7359 -44187 -20056 -19667 -32862 -31056 -23013 -9627 -12993 -38706 -37162 -22673 -20570 -23399 -13732 -371
7345 -371 20886 8501 9917 8444 -3207 -13203 -32877 -37794 -17360 -11357 -2069 -16984 5109
7332 5109 2782 -5988 -30021 -35609 -39812 -53261 -30349 -10412 1743 8749 -22816 -47890 -44242
7319 -44242 -23728 -4936 -337 15445 10198 -5099 -2923 12040 46959 43894 -1555 -28708 -25059
7306 -25059 -249 -6669 -6664 -2416 -7580 1633 11721 -11207 -9641 9352 29972 30377 17837 22668
7292 22668 13568 -5449 -28956 -20542 11613 12409 11734 -8914 -14176 -10115 -13717 10828 -6117 -199
$$ packed form
7385e7907n104J8395J4750J3977R504J9866J3271m706j5207l16l916O297m578
7372D326p400O307J9087J0548j8454J08J5656O254m4373k7552J621j2735K420
7359d4187K4131L89j3195J806Q043J3386l366k5713J544J4489K103k829R667J3361
7345c71K1257j2385J416j473j1651r996j9674m917K0434O003R288j4915K2093
7332E109k327q770k4033n588m203j3449K2912J9937J2155P006l1565k5074L648
7319d4242K0514J8792M599J5782n247j5297K176J4963L4919l065m5449k7153L649
7306b5059K4810o420NM248n164R213J0088k2928J566J8993K0620M05j2540M831
7292B2668r100j9017k3507Q414L2155P96o75k0648n262M061l602K4545j6945N918
$$ plain form
7278 -199 20338 17985 -2637 -16482 -7953 11311 20655 29213 18705 10847 11249 -687 -24324 -18469
7264 -18469 -5606 13277 8322 -1968 5599 32637 3775 -242 -5941 -24175 -28371 -8221 -30599
7251 -30599 -30495 -9811 -11413 -7876 -24947 -62791 -44643 -29869 -8510 -8311 15711 8493 -6513
7238 -6513 -7836 1922 9462 -13461 -25012 -26475 -26728 -17353 -7691 -10955 7816 21747 -13690 -29057
7224 -29057 -2942 1305 -17685 -35293 -36222 -52008 -48263 -35751 -28752 -46916 -22665 -20160 7180
7211 7180 20725 8468 -5850 -1887 11549 30477 -2579 -57762 -82952 -59655 -36469 -17569
7199 -17569 -32499 -22067 -24469 -8430 -6374 -20752 -37090 -32990 -5322 -4641 -14938 -5625 26
7186 26 -47575 -75840 -42308 -25883 -52715 -67930 -50194 -19840 4361 -8831 -34365 -37309 -10984
$$ packed form
7278a99K0537k353k0622j3845Q529J9264R344Q558j0508p858M02j1936k3637N855
7264a8469J2863J8883m955j0290P567K7038k8862m017n699j8234m196K0150k2378
7251c0599J04K0684j602L537j7071l7844J8148J4774K1359J99K4022p218j5006
7238f513j323R758P540k2923j1551j463k53R375R662l264J8771J3931l5437j5367
7224b9057K6115M247j8990j7608r29j5786L745J2512O999j8164K4251K505K7340
7211G180J3545j2257j4318L963J3436J8928l3056n5183k5190K3297K3186J8900
7199a7569j4930J0432k402J6039K056j4378j6338M100K7668O81j0297R313N651
7186B6m7601k8265L3532J6425k6832j5215J7736L0354K4201j3192k5534k944K6325
$$ plain form
7173 -10984 -5659 -23548 -16128 -8371 -525 11260 29877 20117 8936 13112 24196 36013 29904
7160 29904 -2267 -32586 -16353 -3599 -6235 -21421 -25766 21355 29064 864 3854 16043 53009
7147 53009 49921 36479 34695 16384 13185 -3107 -1014 -10613 -4560 12523 -4013 -23013 -14144
7134 -14144 -22734 -34378 -27233 -13570 -23524 -22356 -8574 4771 -30854 -32212 -44802 -57346 -37672
7121 -37672 -49708 -51446 -44786 -26074 -27640 -11347 3351 -41877 -38349 -31606 -16286 -17768 -41828
7108 -41828 -49836 -45499 -29692 -23288 -28913 -39906 -51181 -36662 -29707 -18593 24 16134 57795
7095 57795 51191 4762 -16730 -14488 -23783 4403 30015 19551 10513 36035 34897 -157 -43500
7082 -43500 -55547 -37431 -15208 -12256 -2614 -12073 -1823 -5965 -20922 -10494 -496 14260 -1845
$$ packed form
7173a0984N325j7889P420P757P846J1785J8617r760j1181M176J1084J1817o109
7160B9904l2171l0319J6233J2754k636j5186m345M7121P709k8200K990J2189L6966
7147E3009l088j3442j784j8311l199j6292K093r599O053J7083j6536j9000Q869
7134a4144q590j1644P145J3663r954J168J3782J3345l5625j358j2590j2544J9674
7121c7672j2036j738O660J8712j566J6293J4698m5228L528O743J5320j482k4060
7108d1828q008M337J5807O404n625j0993j1275J4519O955J1114J8617J6110M1661
7095E7795o604m6429k1492K242r295K8186K5612j0464r038K5522j138l5054m3343
7082d3500j2047J8116K2223K952R642r459J0250m142j4957J0428R998J4756j6105
$$ plain form
7069 -1845 -22326 -11164 -29385 -16993 -14575 -25289 -6821 -13573 -24104 -27664 -39690 -46544 -26246
7056 -26246 5243 -29583 -42182 -41041 -35736 -16698 205 -12401 -10939 -10611 -32337 -49188 -17721
7043 -17721 -782 -32344 -58392 1092 14881 -10205 -16943 -27460 -27370 -25327 -24183 -14040 -24515
7030 -24515 -37763 -20839 -36624 -39297 -16851 -28926 -48903 -44090 -24948 4204 23113 7158
7018 7158 3142 4395 9839 4266 -27193 -32422 -33276 -34702 17595 35647 39599 39626 21220 5588
7004 5588 -35445 -44943 -38491 2525 26673 -5479 -10485 -2868 2677 -9349 -9820 8946 14680 -16146
6990 -16146 -21055 -9655 -16493 8494 27149 15101 -5480 -14156 13406 17055 -5047 2045 9985
6977 9985 -13865 -24682 -13167 14512 7322 -5727 -25133 -16495 3669 -783 22384 40350 18159
$$ packed form
7069a845k0481J1162j8221J2392K418j0714J8468o752j0531l560j2026o854K0298
7056b6246L1489l4826j2599J141N305J9038J6903j2606J462L28k1726j6851L1467
7043a7721J6939l1562k6048N9484J3789k5086o738j0517R0K043J144J0143j0475
7030b4515j3248J6924j5785k673K2446j2075j9977M813J9142K9152J8909j5955
7018G158m016J253N444n573l1459n229q54j426N2297J8052L952K7j8406j5632
7004E588m1033r498O452M1016K4148l2152n006P617N545j2026m71J8766N734l0826
6990a6146m909J1400o838K4987J8655j2048k0581q676K7562L649k2102P092P940
6977I985k3850j0817J1515K7679p190j3049j9406Q638K0164m452K3167J7966k2191
$$ plain form
6964 18159 14718 37691 36952 19171 13760 33922 43904 41919 38288 30368 15016 1670 18937
6951 18937 9027 17039 25044 13238 40647 32699 19842 -6002 -11940 -19353 -24982 -278 19224
6938 19224 25884 31466 52607 29157 32520 57526 35733 256 -13049 -13292 -12792 -8120 -26174
6925 -26174 -41886 -49300 -5212 1934 -17840 -19915 -24281 -16070 1812 11532 15572 7259 -10647
6912 -10647 12621 11177 8384 3334 6059 -17399 4506 30218 34792 19074 6897 1789 11403
6899 11403 -70 -18176 -29254 -23218 -30357 -33030 -42003 -36859 -23571 -1073 6777 -1273 -10780
6886 -10780 -1702 -597 6616 -4713 -30009 -13908 -1607 -813 -14206 -27883 -36149 -67268 -52573
6873 -52573 -25709 -23585 -22174 -23284 -12524 -9348 -17657 -9464 -26339 -44706 -48925 -19974 -26768
$$ packed form
6964A8159l441K2973p39j7781n411K0162R982j985l631p920j5352j3346J7267
6951A8937r910Q012Q005j1806K7409p948j2857k5844n938p413n629K4704J9502
6938A9224O660N582K1141k3450L363K5006k1793l5477j3305k43N00M672j8054
6925b6174j5712p414M4088P146j9774k075m366Q211J7882R720M040q313j7906
6912a0647K3268j444k793n050K725k3458K1905K5712M574j5718j2177n108R614
6899A1403j1473j8106j1078O036p139k673q973N144J3288K2498P850q050r507
6886a0780R078J105P213j1329k5296J6101J2301P94j3393j3677q266l1119J4695
6873e2573K6864K124J411j110J0760L176q309Q193j6875j8367m219K8951o794
$$ plain form
6860 -26768 -24108 -21449 -6014 10495 6987 -8926 -38293 -35677 -19153 -22749 -24671 155 -4544
6847 -4544 -4733 27134 28362 30293 11304 4748 559 -34523 -26339 -20895 -34006 -30544 -20693 -17112
6833 -17112 -24837 -4882 9650 -7483 -21364 -54946 -68709 -50879 -9729 7877 -1422 -25767
6821 -25767 -19150 -4336 6359 27320 33412 21881 17028 10293 -17544 -31716 -36484 -55101 -65597
6808 -65597 -54678 -38849 -28859 -5458 12244 21825 1362 -19293 -3495 16455 29411 1158
6796 1158 -5784 12570 29551 24076 -2508 -6943 -495 -11454 1881 18894 17998 2431 -2976
6783 -2976 -6735 -9939 -26669 -3713 -19226 -18237 -1245 -9437 -18930 -12679 -27666 -29567 -20833 24582
6769 24582 57484 58787 34735 46508 42268 36971 -5409 -39280 -20471 -8997 -4974 3598 -23416
$$ packed form
6860b6768K660K659J5435J6509l508j5913k9367K616J6524l596j922K4826m699
6847d544j89L1867J228J931j8989o556m189l5082Q184N444j3111L462R851L581
6833a7112p725J9955J4532j7133j3881l3582j3763J7830M1150J7606r299k4345
6821b5767O617J4814J0695K0961O092j1531m853o735k7837j4172m768j8617j0496
6808f5597J0919J5829R990K3401J7702R581k0463k0655J5798J9950J2956k8253
6796A158o942J8354J6981n475k6584m435O448j0959J3335J7013q96j5567n407
6783b976l759l204j6730K2956j5513R89J6992q192r493O251j4987j901Q734M5415
6769B4582L2902J303k4052J1773m240n297m2380l3871J8809J1474M023Q572k7014
$$ plain form
6756 -23416 -57443 -47740 -36418 -42717 -54300 -49992 -42376 -45651 -53010 -44026 -46559 -54699 -36556 -19709
6742 -19709 -27954 -41923 -48814 -39337 -8151 20857 -8862 -28250 -34366 -52015 -63532 -37934 -24809
6729 -24809 -27618 -46288 -31768 -9804 -15277 -33817 -38919 -11087 16847 18846 18427 -586 8588
6716 8588 -8511 353 -14582 -11233 7270 -21103 -25535 -35007 -41351 -51985 -45606 -41820 -39453 -15110
6702 -15110 -13185 -18588 -10743 -10787 13457 50788 34499 -3000 -32024 -29721 -34046 -37083 -29161 -26017
6688 -26017 -16083 -12337 -5102 -12855 -13805 -24672 -23271 -25062 -6950 5540 9285 963 2501 16743
6674 16743 10844 -13441 -5058 16857 -815 -15036 -14241 -16104 -27992 -20974 -8745 4533 26317
6661 26317 35757 38698 39959 24094 31249 30128 18708 10529 24665 32079 28392 17966 21517 50504
$$ packed form
6756b3416l4027R703J1322o299j1583M308P616l275p359Q984k533q140J8143J6847
6742a9709q245j3969o891R477L1186K9008k9719j9388o116j7649j1517K5598J3125
6729b4809k809j8670J4520K1964n473j8540n102K7832K7934J999m19j9013R174
6716H588j7099Q864j4935L349J8503k8373m432r472o344j0634O379L786K367K4343
6702a5110J925n403P845m4K4244L7331j6289l7499k9024K303m325l037P922L144
6688b6017R934L746P235p753r50j0867J401j791J8112J2490L745q322J538J4242
6674A6743n899k4285Q383K1915j7672j4221P95j863j1888P018J2229J3278K1784
6661B6317R440K941J261j5865P155j121j1420q179J4136P414l687j0426L551K8987
$$ plain form
6647 50504 53974 1987 -26416 -28538 6078 -15156 -29899 -16950 6521 20610 18770 16649 -9257
6634 -9257 5913 11878 1619 -51 -128 -17867 -27186 -6314 -16727 -5438 31019 16646 -29552
6621 -29552 -32220 -26019 -28770 6351 47680 30331 -7572 -17602 -40291 -45604 -22961 -21795 -14781
6608 -14781 26624 68857 79379 61724 44143 19129 19650 12428 680 -12954 9990 25328
6596 25328 4562 -24591 251 20388 33610 59245 57424 37688 16383 7275 8492 14609 23151
6583 23151 31211 39654 15070 -5580 -27479 -39373 -31456 -45659 -93484 -70519 -24535 -17693 -9663
6570 -9663 1210 -5992 -10611 -11002 -7408 -19134 -32567 -35402 -40461 -50712 -33558 -2614 20535
6557 20535 25512 17031 -7487 -37671 -45348 -27821 2611 22834 7180 -4855 -30081 -13685
$$ packed form
6647E0504L470n1987k8403k122L4616k1234j4743J2949K3471J4089j840k121k5906
6634i257J5170N965j0259j670p7j7739r319K0872j0413J1289L6457j4373m6198
6621b9552k668O201k751L5121M1329j7349l7903j0030k2689n313K2643J166P014
6608a4781M1405M2233J0522j7655j7581k5014N21p222j1748j3634K2944J5338
6596B5328k0766k9153K4842K0137J3222K5635j821j9736k1305r108J217O117Q542
6583B3151Q060Q443k4584k0650k1899j1894P917j4203m7825K2965M5984O842Q030
6570i663J0873p202m619l91L594j1726j3433k835n059j0251J7154L0944K3149
6557B0535M977q481k4518l0184p677J7527L0432K0223j5654j2035k5226J6396
$$ plain form
6545 -13685 17233 14505 -11321 -37055 -49782 -36702 -3870 2207 -11352 -19682 -7981 21710
6533 21710 29494 6237 -260 -2291 -5510 -16107 12036 37938 46197 45375 50550 53531 63936 47692
6519 47692 40003 44216 50643 18904 23742 47644 43100 30939 5833 -322 37396 70002 74006
6506 74006 62824 59158 50526 18715 -37233 -9537 17644 30157 -2280 -46602 -15945 35185
6494 35185 25367 -2754 5607 26420 -16430 -20740 14737 31587 17656 -9603 -9878 -25278 -30318
6481 -30318 -9546 4347 -3280 -12427 9387 -3856 -9433 3787 1841 -1755 1860 39408 48006
6468 48006 19260 -6259 -6848 -11416 -22459 -34038 -14686 -20081 -19770 -13025 -6527 8060 11721 28405
6454 28405 45690 61535 58037 38431 13771 -3288 3032 7296 14765 3435 -16251 2609 8661
$$ packed form
6545a3685L0918k728k5826k5734j2727J3080L2832O077j3559q330J1701K9691
6533B1710P784k3257o497k031l219j0597K8143K5902Q259q22N175K981J0405j6244
6519D7692p689M213O427l1739M838K3902m544j2161k5106o155L7718L2606M004
6506G4006j1182l666q632l1811n5948K7696K7181J2513l2437m4322L0657N1130
6494C5185r818k8121Q361K0813m2850m310L5477J6850j3931k7259k75j5400n040
6481c0318K0772J3893p627r147K1814j3243n577J3220j946l596L615L7548Q598
6468D8006k8746k5519n89m568j1043j1579J9352n395L11O745O498J4587L661J6684
6454B8405J7285J5845l498j9606k4660j7059O320M264P469j1330j9686J8860O052
$$ plain form
6441 8661 -3 10440 21623 10431 21034 25393 16204 11434 7024 7389 -12522 -24897 -22103 -12928
6427 -12928 3636 8987 16567 41360 21462 -13243 -21147 332 12258 23160 19568 29602 28999
6414 28999 11597 32621 33310 31180 40461 18255 -4818 -10423 -14723 -15947 -7905 -5747 9868 25148
6400 25148 18454 9970 -8484 -26043 -11091 2574 -9714 -15339 -21192 -18693 -5514 -14376 -17734
6387 -17734 -5456 -2744 -20554 -15603 3053 22114 26314 1092 -26686 -20983 6900 16865 8226
6374 8226 308 4762 2135 12268 33488 34085 36796 31126 -16566 -43916 -26433 3380 9664 32552
6360 32552 42392 20752 19022 19607 12554 14582 28361 18885 20496 3413 4000 6798 -10386 -2854
6346 -2854 -29843 -15074 -20030 -19783 -2754 -7530 -31723 -32352 -37233 -14201 -6197 -39803 -41568 -30631
$$ packed form
6441H661q664J0443J1183j1192J0603M359r189m770m410L65j9911j2375K794R175
6427a2928J6564N351P580K4793j9898l4705p904K1479J1926J0902l592J0034o03
6414B8999j7402K1024O89k130R281k2206k3073n605m300j224Q042K158J5615J5280
6400B5148o694q484j8454j7559J4952J3665j2288n625n853K499J3179q862l358
6387a7734J2278K712j7810M951J8656J9061M200k5222k7778N703K7883R965q639
6374H226p918M454k627J0133K1220N97K711n670m7692k7350J7483K9813O284K2888
6360C2552R840k1640j730N85p053K028J3779r476J611j7083N87K798j7184P532
6346b854k6989J4769m956K47J7029m776k4193o29m881K3032Q004l3606j765J0937
$$ plain form
6332 -30631 -35986 -40178 -60098 -45230 -11080 -4291 -19863 -9176 -21207 -31679 -15460 23184
6320 23184 20017 19271 2802 -2138 -9538 11061 14568 11817 -536 -19761 -29330 -19656 -26222 -9480
6306 -9480 -9663 -10136 -12272 -63 10197 18524 4609 -21015 -21660 -30112 -8084 843 4666 -2177
6292 -2177 15500 5313 -13894 -32149 -12712 -15313 -37742 -36633 -30988 -15111 -6859 1636 27158
6279 27158 37998 15234 9640 26073 13796 6990 -3833 2610 -891 -32927 -47050 -44842 -54415
6266 -54415 -47981 -39843 -34216 -43307 -45597 -47860 -66274 -35286 -33310 -20254 -12674 -17656 -22517 -24480
6252 -24480 -37819 -25933 11998 14940 -30913 -15911 10038 -3985 -23886 -5035 3672 -1932
6240 -1932 -15335 -50353 -52587 -64201 -66760 -85081 -81275 -84960 -66454 -38561 -6256 -10640 -3601
$$ packed form
6332c0631n355m192j9920J4868L4150O789j5572J0687j2031j0472J6219L8644
6320B3184l167p46j6469m940p400K0599L507k751j2353j9225r569R674o566J6742
6306i480j83m73k136J2209J0260Q327j3915k5624o45q452K2028Q927L823o843
6292b177J7677j0187j9207j8255J9437k601k2429J109N645J5877Q252Q495K5522
6279B7158J0840k2764n594J6433j2277o806j0823O443l501l2036j4123K208r573
6266e4415O434Q138N627r091k290k263j8414L0988J976J3056P580m982m861j963
6252b4480j3339J1886L7931K942m5853J5002K5949j4023j9901J8851Q707n604
6240a932j3403l5018k234j1614k559j8321L806l685J8506K7893L2305m384P039
$$ plain form
6227 -3601 14579 8285 5930 19594 40520 17843 -6313 4667 5669 10258 -268 -6709 1059
6214 1059 17461 18211 16221 17019 31659 23402 20284 19393 14700 -16101 -4926 -16581 -20317 -465
6200 -465 4312 7270 20638 -11291 -14678 -30714 -14751 -25423 -23656 -14449 -9713 12004 18026 19770
6186 19770 22747 -1802 -22169 4818 13010 1107 2950 -21291 -21824 -4160 -10974 -12169 -29062
6173 -29062 -50672 -32857 -37511 -36592 2596 12008 13972 -17545 -36743 -64031 -71963 -40591 -11216
6160 -11216 -16705 -20721 -31616 -15052 2214 5881 -1489 -17423 -14127 8415 -2581 944 18845
6147 18845 -19419 -27793 5524 31240 43163 38745 12715 -18075 -32786 -23784 -9800 -2998 -24821
6134 -24821 -12183 730 7334 15043 -10425 -11598 -16482 -25333 -32998 -48898 -31598 -10028 -11174
$$ packed form
6227c601J8180o294k355J3664K0926k2677k4156J0980J002M589j0526o441P768
6214A059J6402P50j990P98J4640q257l118q91m693l0801J1175j1655l736J9852
6200d65M777K958J3368l1929l387j6036J5963j0672J767R207M736K1717O022J744
6186A9770K977k4549k0367K6987Q192j1903J843k4241n33J7664o814j195j6893
6173b9062k1610J7815m654R19L9188R412J964l1517j9198k7288p932L1372K9375
6160a1216n489m016j0895J6564J7266L667p370j5934L296K2542j0996L525J7901
6147A8845l8264q374L3317K5716J1923m418k6030l0790j4711R002J3984O802k1823
6134b4821J2638J2913O604P709k5468j173m884q851p665j5900J7300K1570j146
$$ plain form
6121 -11174 -32062 -33760 -46933 -75446 -72342 -64260 -42365 -10240 2465 -6253 -9069 -11472 -16363
6108 -16363 -22698 -25687 -22937 -38073 -54797 -73525 -53209 -22697 -21913 -11340 -15110 -8009 8132
6095 8132 -2716 8496 -1294 -31110 -44366 -35194 -2795 468 -1902 -17916 -31426 -44047 -29773
6082 -29773 7051 23154 23798 21268 8737 3905 -28885 -71040 -65404 -38933 -10963 -9027 1377
6069 1377 21531 13965 650 34307 35072 9139 -20493 -49627 -37937 -7868 -13320 19763 10364
6056 10364 -13340 -8140 -54 11211 -1396 19246 20136 5044 -21508 -32647 -33350 -23707 -49396
6043 -49396 -51104 -54541 -70923 -54105 -22671 -5684 -31220 -48140 -47025 -28264 -18546 -26822 -42409
6030 -42409 -35109 -29848 -10462 -39253 -72029 -74574 -50062 -7294 9160 15921 14161 11354 11325 25892
$$ packed form
6121a1174k0888j698j3173k8513L104Q082K1895L2125J2705q718k816k403m891
6108a6363o335k989K750j5136j6724j8728K0316L0512P84J0573l770P101J6141
6095H132j0848J1212r790k9816j3256R172L2399L263k370j6014j3510j2621J4274
6082b9773L6824J6103O44k530j2531m832l2790m2155N636K6471K7970J936J0404
6069A377K0154p566j3315L3657P65k5933k9632k9134J1690L0069n452L3083r399
6056A0364k3704N200Q086J1265j2607K0642Q90j5092k6552j1139p03R643k5689
6043d9396j708l437j6382J6818L1434J6987k5536j6920J115J8761R718q276j5587
6030d2409P300N261J9386k8791l2776k545K4512M2768J6454O761j760k807k9J4567
$$ plain form
6016 25892 48662 66334 40885 18044 16487 34191 2153 10633 33760 26480 14542 -4909
6004 -4909 -12160 -22027 -7957 28462 22176 -4308 -15480 -9643 1617 -5864 -11068 -15704 -19614 30219
5990 30219 38345 34027 38278 33269 37102 39134 15328 5327 -7944 -26140 -20066 -12060 -11376 -13705
5976 -13705 -25613 -40543 -44759 -40309 -26760 -25013 -48831 -50128 -16677 -9098 1190 -11978 3958
5963 3958 9696 21197 16182 -20537 -30733 -27013 -17665 4947 3693 -11466 -21020 -3393 17805
5950 17805 -21453 -25230 -20292 1643 -8762 -25574 -17297 -22079 -26414 -72129 -93701 -67101 -36304
5937 -36304 -3910 -16621 -26764 -15593 -23834 -34836 -40865 -8905 -16491 -30572 -9116 9034
5925 9034 9723 -8310 -49402 -70610 -73743 -41531 -40600 -35045 -29914 -31291 -57565 -59518 -17721 -6568
$$ packed form
6016B5892K2770J7672k5449k2841j557J7704l2038Q480K3127p280j1938j9451
6004d909p251r867J4070L6419o286k6484j1172N837J1260p481n204m636l910M9833
5990C0219Q126m318M251n009L833K032k3806j0001j3271j8196O074Q006O84k329
5976a3705j1908j4930m216M450J3549J747k3818j297L3451P579J0288j3168J5936
5963C958N738J1501n015l6719j0196L720R348K2612j254j5159r554J7627K1198
5950A7805l9258l777M938K1935j0405j6812Q277m782m335m5715k1572K6600L0797
5937c6304L2394j2711j0143J1171q241j1002o029L1960p586j4081K1456J8150
5925I034O89j8033m1092k1208l133L2212R31N555N131j377k6274j953M1797J1153
$$ plain form
5911 -6568 -31369 -43034 -28108 -13980 -1679 -20363 -18108 -1618 14567 16296 25740 15454 8681
5898 8681 3954 11829 30993 43704 54567 43845 21586 -6750 14292 37352 32686 42617 25755
5885 25755 -3065 -1815 13073 10472 3244 -1521 -10565 2528 1337 -6594 -29446 -48175 -47217 -29314
5871 -29314 -19168 -21178 -35664 -32523 -25218 -36253 -14583 -3097 7801 -4129 -23975 -47695
5859 -47695 -50348 -41998 -58022 -33360 9887 23357 26906 25328 27811 -10905 -52256 -15089 -127
5846 -127 -9778 -36049 -30546 -16226 -36070 -39578 -20366 -11909 2987 7377 33697 38616 12005
5833 12005 -2691 -414 -14093 -22972 -11893 8407 148 -19112 -38859 -36758 -32370 -13576 8432
5820 8432 13763 31721 35570 18996 22345 39971 34607 -13410 -42324 -20532 -17936 -27367 -53678
$$ packed form
5911f568k4801j1665J4926J4128J2301j8684K255J6490J6185J729R444j0286o773
5898H681m727P875J9164J2711J0863j0722k2259k8336K1042K3060m666R931j6862
5885B5755k8820J250J4888k601p228m765r044J3093j191p931k2852j8729R58J7903
5871b9314J0146k010j4486L141P305j1035K1670J1486J0898j1930j9846k3720
5859d7695k653Q350j6024K4662M3247J3470L549j578K483l8716m1351L7167J4962
5846a27r651k6271N503J4320j9844l508J9212Q457J4896M390K6320M919k6611
5833A2005j4696K277j3679q879J1079K0300q259j9260j9747K101M388J8794K2008
5820H432N331J7958L849j6574L349J7626n364m8017k8914K1792K596r431k6311
$$ plain form
5807 -53678 -36598 10945 30049 5920 -9887 -2358 -6422 -6375 21436 46846 48818 49816 42818 33014
5793 33014 44252 27291 -13083 -15518 -19832 -27625 -44277 -74717 -57288 -3323 -16739 -26496 -28319
5780 -28319 -9514 8836 -9506 -18703 -9681 -12008 -1239 4034 -20988 -50090 -69992 -49684 -53062
5767 -53062 -70715 -40891 -33739 -42176 -4338 15909 10865 17836 15426 -3191 3919 17606 30134
5754 30134 56904 31548 25367 5658 1963 18065 16401 8117 -8640 -10205 -9208 -13548 -20227 -34941
5740 -34941 -35350 1191 -6596 -50952 -27845 -5668 -19892 -12712 -7374 -7248 1535 -6885 -10481 -29293
5726 -29293 -63138 -66702 -61079 -42013 -23537 -30050 -22604 -15113 -24162 -21688 -24452 -28178 -22599 -42513
5712 -42513 -50925 -47277 -34775 -39708 -50452 -62650 -70185 -53103 -28437 -29804 -39618 -3917 -16308
$$ packed form
5807e3678J7080M7543J9104k4129j5807P529m064M7K7811K5410J972R98o998r804
5793C3014J1238j6961m0374k435m314p793j6652l0440J7429N3965j3416r757j823
5780b8319J8805J8350j8342r197R022k327J0769N273k5022k9102j9902K0308l378
5767e3062j7653K9824P152q437L7838K0247n044O971k410j8617P110J3687J2528
5754C0134K6770k5356o181j9709l695J6102j664q284j6757j565R97m340o679j4714
5740c4941m09L6541p787m4356K3107K2177j4224P180N338J26Q783q420l596j8812
5726b9293l3845l564N623J9066J8476o513P446P491r049K474k764l726N579j9914
5712d2513q412L648J2502m933j0744j2198p535J7082K4666j367r814L5701j2391
$$ plain form
5699 -16308 -28728 -24820 -31241 -42299 -24671 -11857 5101 -1451 -323 -16963 -31970 -36869 -20178
5686 -20178 -6863 2992 9065 10489 -2947 -2544 -24922 -41605 -54201 -75663 -75716 -63822 -37208
5673 -37208 -12992 -24556 -34761 -21156 -38077 -11311 25341 30144 -9022 -11694 -27330 -44547
5661 -44547 7831 21526 12656 -5827 -27653 -32385 -15478 10533 130 -3743 -1555 3018 -28901
5648 -28901 -40846 -20848 -17301 -24056 -29081 -29804 -35062 -36637 -19076 17988 16740 -10254 -1323 30703
5634 30703 6724 -7864 -9495 -7545 -2522 1781 -4846 -26075 -30891 -10439 -7149 -30682 -45456
5621 -45456 -39500 -5134 27610 10118 16037 20497 -1087 2166 9228 37147 39837 30605 17124
5608 17124 36632 34874 24267 4791 -18759 -41134 -64465 -53676 -40895 -22316 13713 -1546
$$ packed form
5699a6308j2420L908o421j1058J7628J2814J6958o552J128j6640j5007m899J6691
5686b0178J3315R855O073J424j3436M03k2378j6683j2596k1462n3J1894K6614
5673c7208K4216j1564j0205J3605j6921K6766L6652M803l9166k672j5636j7217
5661d4547N2378J3695q870j8483k1826m732J6907K6011j0403l873K188M573l1919
5648b8901j1945J9998L547o755n025p23n258j575J7561L7064j248k6994Q931L2026
5634C0703k3979j4588j631J950N023M303o627k1229m816K0452L290k3533j4774
5621d5456N956L4366L2744j7492N919M460k1584L253P062K7919K690r232j3481
5608A7124J9508j758j0607j9476k3550k2375k3331J0789J2781J8579L6029j5259
$$ plain form
5596 -1546 -20352 -29077 -3749 13461 3479 -20747 -31029 -16581 10623 19988 -1361 4167 28640
5583 28640 28653 7676 -15626 -34258 -24907 -31973 -33411 -32404 -31940 -5264 5604 -4130 -3872 24665
5569 24665 23946 5020 7177 11941 18081 18768 23339 13065 909 26728 32180 42711 22373 23528
5555 23528 41929 50510 34186 48631 48484 17923 11390 29558 15012 -1622 -10276 -8825 125
5542 125 38195 51835 47288 24739 21580 3610 19735 41554 47145 20571 -8577 -30683 -23619
5529 -23619 5670 22655 7302 -11153 3159 -1364 -36132 -56797 -43220 -50459 -17340 -4915
5517 -4915 466 471 23431 45522 19605 -8462 -15895 -11789 -2366 2665 -30284 -60068 -50866 -36705
5503 -36705 -14243 -13807 -13750 9451 34221 18684 16459 22377 15060 -3886 -693 3535 -44 -9148
$$ packed form
5596a546j8806q725K5328J7210r982k4226j0282J4448K7204R365k1349N528K4473
5583B8640J3k0977k3302j8632R351p066j438J007M64K6676J0868r734K58K8537
5569B4665p19j8926K157M764O140O87M571j0274j2156K5819N452J0531k0338J155
5555B3528J8401Q581j6324J4445j47l0561o533J8168j4546j6634q654J451Q950
5542A25L8070J3640m547k2549l159j7970J6125K1819N591k6574k9148k2106P064
5529b3619K9289J6985j5353j8455J4312m523l4768k0665J3577p239L3119J2425
5517d915N381NK2960K2091k5917k8067p433M106R423N031l2949k9784R202J4161
5503c6705K2462M36N7K3201K4770j5537k225N918p317j8946L193M228l579r104
$$ plain form
5489 -9148 -16772 9198 12872 11318 14984 -16369 -34037 -55308 -54157 -35132 -1771 14018 10355
5476 10355 -9795 -42735 -67297 -55654 4099 38798 25142 -19739 -29330 -23460 -41506 -65081
5464 -65081 -55062 -61497 -84020 -74300 -50621 -29455 -14123 6982 -13711 -13628 -20106 -782 4947
5451 4947 17063 10881 3713 -11363 -29943 -57857 -11523 18917 20846 16934 29498 3775 -25575
5438 -25575 -26720 -9407 10687 19304 13411 1247 -13278 -30957 -47185 -31932 17045 28418
5426 28418 24019 7090 34353 15739 4171 29604 -2816 -33319 -29704 -22059 -5868 -24718
5414 -24718 -27914 -47269 -64786 -45077 -65517 -64537 -46148 -51016 -36087 -29304 -39074 -38692 -59225
5401 -59225 -47379 -31392 -47900 -45933 -34398 -31132 -71810 -82102 -71983 -56871 -26431 -4608
$$ packed form
5489i148p624K5970L674j554L666l1353j7668k1271J151J9025L3361J5789l663
5476A0355k0150l2940k4562J1643N9753L4699j3656m4881r591N870j8046k3575
5464f5081J0019o435k2523R720K3679K1166J5332K1105k0693Q3o478J9324N729
5451D947J2116o182p168j5076j8580k7914M6334L0440J929l912J2564k5723k9350
5438b5575j145J7313K0094Q617n893j2164j4525j7679j6228J5253M8977J1373
5426B8418m399j6929K7263j8614j1568K5433l2420l0503L615P645J6191j8850
5414b4718l196j9355j7517J9709k0440R80J8389m868J4929O783r770L82k0533
5401e9225J1846J5987j6508J967J1535L266m0678j0292J0119J5112L0440K1823
$$ plain form
5389 -4608 7921 12472 6769 -16685 -29724 -50321 -36961 -19134 -17135 -17687 -6435 -1342 -5914
5376 -5914 -14180 -26789 -52428 -39418 -34616 -39239 -45780 -54021 -35007 -18740 -33069 -41972 -12345
5363 -12345 -2093 5526 -9338 -1404 7243 -37957 -45202 -76574 -99541 -97908 -85748 -27528 15295
5350 15295 25046 25507 46155 61334 29190 11332 -13054 -19768 -27813 -51101 -40810 -24005 482
5337 482 -12604 -7382 14578 35102 6776 -14634 -17828 14828 32526 181 -25861 -23281 -20877
5324 -20877 -6410 -35045 -42215 -32194 -39888 -4822 12949 -13049 4106 17730 15891 6526 -14867
5311 -14867 -25897 -11511 -28553 -33421 -7418 10829 7359 9721 20647 11945 -201 12578 7533
5298 7533 -17199 -15048 2277 -3695 -24401 -32940 -40165 -66021 -92565 -79823 -78474 -74324 -52270
$$ packed form
5389d608J2529M551n703k3454j3039k0597J3360J7827J999n52J1252N093m572
5376e914q266j2609k5639J3010M802m623o541q241J9014J6267j4329q903K9627
5363a2345J0252P619j4864P934Q647m5200p245l1372k2967J633J2160N8220M2823
5350A5295R751M61K0648J5179l2144j7858k4386o714q045k3288J0291J6805K4487
5337D82j3086N222K1960K0524k8326k1410l194L2656J7698l2345k6042K580K404
5324b0877J4467k8635p170J0021p694L5066J7771k5998J7155J3624j839r365k1393
5311a4867j1030J4386j7042m868K6003J8247l470K362J0926q702j2146J2779n045
5298G533k4732K151J7325n972k0706q539p225k5856k6544J2742J349M150K2054
$$ plain form
5285 -52270 -26238 -4863 13768 23459 5015 -1902 -29406 -13898 -8586 -22888 -34198 -19281
5273 -19281 -16121 -7885 6618 21929 3079 -10634 12429 11349 16389 9516 15800 -12096 -12720
5260 -12720 -233 -14215 -15947 17473 11868 -31724 -33971 -13513 -12974 -21894 -37294 -19213 1208
5247 1208 9030 7370 6940 -18224 -30213 -47607 -37558 -5160 20945 -4947 -47300 -63415 -24518
5234 -24518 -8161 -1700 -27688 -29841 -32974 -34885 -22049 -20514 -22542 -18670 -9625 -18263 -34524 -27972
5220 -27972 2773 20555 14919 -19371 -38463 -40934 -27985 -250 -20590 -37022 -41002 -37007 -20324
5207 -20324 -22902 -25958 -26632 -33164 -37661 -37284 -25652 -13903 -2034 7708 -1333 -21254 -25366 -9266
5193 -9266 -9204 -4342 -19410 -34029 -60966 -87148 -53059 -7174 10681 -10577 -3172 20638 48787
$$ packed form
5285e2270K6032K1375J8631R691j8444o917k7504J5508N312j4302j1310J4917
5273a9281L160Q236J4503J5311j8850j3713K3063j080N040o873O284k7896o24
5260a2720J2487j3982j732L3420n605m3592k247K0458N39q920j5400J8081K0421
5247A208P822j660m30k5164j1989j7394J0049L2398K6105k5892m2353j6115L8897
5234b4518J6357O461k5988k153l133j911J2836J535k028L872R045q638j6261O552
5220b7972L0745J7782n636l4290j9092k471J2949K7735k0340j6432l980L995J6683
5207b0324k578l056o74o532m497L77J1632J1749J1869R742r041j9921m112J6100
5193i266O2M862j5068j4619k6937k6182L4089M5885J7855k1258P405K3810K8149
$$ plain form
5180 48787 17533 -10974 -8379 -14694 14060 17262 8665 -15403 -10950 12302 3442 1746 -5026
5167 -5026 -13373 -20961 -10662 -10952 -4973 7521 -302 -4308 -12123 8518 6115 12632 23309 526
5153 526 4 -5910 -39467 -41719 -33999 -34626 -39560 -26642 -25010 -19599 1729 27533 -2790 1292
5139 1292 1608 -10083 19683 27306 35284 22881 -2564 14899 11036 -6782 -41669 -54367 -41481
5126 -41481 -24527 -11710 11360 18355 19124 9411 18255 -3487 -36771 -19087 11113 -4286 -3228
5113 -3228 11387 8786 26517 11445 -18836 -35929 -57935 -46955 -23788 -20073 -28154 -24639 -17941
5100 -17941 14709 34634 20086 -21483 -23278 7050 20419 32392 23232 -3364 -10297 20482
5088 20482 54323 29609 45050 42860 32178 3188 -22477 -37393 -21355 -13415 -12714 -24659 -40253
$$ packed form
5180D8787l1254k8507K595o315K8754L202q597k4068M453K3252q860j696o772
5167e026q347p588J0299k90N979J2494p823m006p815K0641k403O517J0677k2783
5153E26n22n914l3557k252P720o27m934J2918J632N411K1328K5804l0323M082
5139A292L16j1691K9766P623P978j2403k5445J7463l863j7818l4887j2698J2886
5126d1481J6954J2817K3070O995P69r713Q844k1742l3284J7684L0200j5399J058
5113c228J4615k601J7731j5072l0281j7093k2006J0980K3167L715q081L515O698
5100a7941L2650J9925j4548m1569j795L0328J3369J1973r160k6596o933L0779
5088B0482L3841k4714J5441k190j0682k8990k5665j4916J6038P940P01j1945j5594
$$ plain form
5075 -40253 -13763 -5734 -31725 -25864 -31277 -36946 -15402 6501 10465 21211 33909 38910 13148
5062 13148 -13776 -5356 6083 -17663 -24833 -34974 -26766 -19331 -26997 -8318 -25995 -27078 -19602
5049 -19602 -18667 189 19758 20498 7743 16698 15195 13235 -5760 -6984 -13840 -16506 -7290 -13147
5035 -13147 -12663 3884 7418 14425 21560 1504 9281 684 -11668 2010 -8013 -15670 -15001 -1845
5021 -1845 22463 12727 -10217 -9422 -3700 5676 8216 6149 -19831 -3338 6505 5659 16241 25551
5007 25551 22269 -2466 12914 1125 -4544 -8225 -13420 6557 11410 -2640 -11554 5999 17777
4994 17777 3699 173 -9472 -15870 -13451 -28585 -28220 -24959 -7933 -12310 -7088 -14263 8612 40567
4980 40567 51707 39369 43709 49881 38342 3519 -24757 -20632 -16154 -27023 -30685 -29286 -16980
$$ packed form
5075d0253K6490Q029k5991N861n413n669K1544K1903L964J0746J2698N001k5762
5062A3148k6924Q420J1439k3746p170j0141Q208P435p666J8679j7677j083P476
5049a9602R35J8856J9569P40j2755Q955j503j960j8995j224o856k666R216n857
5035a3147M84J6547L534P007P135k0056P777q597j2352J3678j0023p657O69J3156
5021a845K4308r736k2944P95N722R376K540k067k5980J6493R843q46J0582R310
5007B5551l282k4735J5380j1789n669l681n195J9977M853j4050q914J7553J1778
4994A7777j4078l526r645o398K419j5134L65L261J7026m377N222p175K2875L1955
4980D0567J1140j2338M340O172j1539l4823k8276M125M478j0869l662J399J2306
$$ plain form
4967 -16980 -9557 -3660 -10389 -3487 -4424 -20612 -22962 -24381 -16318 -19980 -43764 -35868 -18161 -3630
4953 -3630 -2923 -14117 -23025 -13292 -15037 3817 10820 22831 22601 32974 41173 15090 22488 53192
4939 53192 47406 18243 6982 512 2701 13694 2510 -9666 -20974 -22863 -25722 -13689 21181
4926 21181 14076 15014 16311 30864 23816 23133 15629 4196 8604 -5210 -5616 18996 17403 11726
4912 11726 8903 7599 -11896 -24275 -8419 5627 -6851 -21044 -23110 -20187 2425 5533 -9211
4899 -9211 -27139 -18351 4281 12903 10251 8119 -8209 2281 8724 3213 -18977 -45758 -45801 -29940
4885 -29940 -9416 -12292 -23389 -31472 -16819 -11660 21123 23062 13945 19511 27 -17778 -24083
4872 -24083 6062 26896 10312 12401 9903 9751 35079 41826 51975 43091 6698 -31321 -20131
$$ packed form
4967a6980P423N897o729O902r37j6188k350j419Q063l662k3784P896J7707J4531
4953c630P07j1194q908R733j745J8854P003J2011k30J0373Q199k6083P398L0704
4939E3192n786k9163j1261o470K189J0993j1184j2176j1308j889k859J2033L4870
4926B1181p105R38J297J4553p048o83p504j1433M408j3814m06K4612j593n677
4912A1726k823j304j9495j2379J5856J4046j2478j4193k066K923K2612L108j4744
4899i211j7928Q788K2632Q622k652k132j6328J0490O443n511k2190k6781m3J5861
4885b9940K0524k876j1097q083J4653N159L2783J939r117N566j9484j7805o305
4872b4083L0145K0834j6584K089k498j52K5328O747J0149q884l6393l8019J1190
$$ plain form
4859 -20131 -2354 17434 9319 -4035 -11699 -18330 -13738 -24989 -25368 -12854 10118 3265 -8350
4846 -8350 -2160 9465 11706 19558 31926 22204 20895 13036 18442 29536 25597 1323 -6761 -18004
4832 -18004 -18895 -15268 -30934 -38398 -31311 -18644 -22414 -5020 948 18253 34959 37104 30459 30591
4818 30591 9983 31730 14620 -22527 -27019 -26130 -29138 -26764 -7487 -1531 -4084 -12679 1129
4805 1129 7224 9643 -2029 -6460 14981 15818 32908 7694 16247 43842 35912 17362 -21665
4792 -21665 -33010 -37173 -7774 13033 -18484 -5482 -13233 -4067 45552 63271 56024 42887 36265
4779 36265 35682 10191 -8209 -8425 -21914 -18246 -10857 -2 9218 -8359 -6860 -3860 6717 26559
4765 26559 34893 -2681 8403 4341 894 -1432 9194 5586 24880 25879 25680 16246 21650 12380
$$ packed form
4859b0131J7777J9788q115j3354p664o631M592j1251l79J2514K2972o853j1615
4846h350O190J1625K241P852J2368r722j309p859N406J1094l939k4274q084j1243
4832a8004q91L627j5666p464P087J2667l770J7394N968J7305J6706K145o645J32
4818C0591k0608K1747j7110l7147m492Q89l008K374J9277N956k553q595J3808
4805A129O095K419j1672m431K1441Q37J7090k5214Q553K7595p930j8550l9027
4792b1665j1345m163K9399K0807l1517J3002p751R166M9619J7719p247j3137o622
4779C6265n83k5491j8400k16j3489L668P389J0855R220j7577J499L000J0577J9842
4765B6559Q334l7574J1084m062l447k326J0626l608J9294R99j99r434N404r270
$$ plain form
4751 12380 -30888 -48738 -63208 -61565 -61345 -32572 -11988 -4252 11135 3102 -21890 -20561 -11568
4738 -11568 -8827 -3507 -13943 -5674 -7148 -2277 -2216 -2110 -20201 -12271 -168 -10150 2639 32529
4724 32529 35006 12417 -10791 10791 10238 1565 -6423 -31431 -18936 16342 8561 3746 11946
4711 11946 12799 28209 23169 -1628 -14730 -12417 -26132 -437 -7124 1030 8184 2552 7515 -32811
4697 -32811 -48649 -30351 -44910 -40086 -12841 -12430 -28612 -35729 -49025 -34603 -15076 -7068 -23529
4684 -23529 -39240 -38045 -26301 -41569 -34036 -24931 4994 23690 15885 -346 -14862 -9641 10098
4671 10098 2507 2071 -4578 -20752 4524 5469 -17330 -34445 -10490 13433 27809 37216 36696 36349
4657 36349 5155 -30024 -37511 -55942 -27843 307 -7529 -19749 -21065 -30916 -26940 -28578 -28253
$$ packed form
4751A2380m3268j7850j4470J643K20K8773K0584P736J5387q033k4992J329Q993
4738a1568K741N320j0436Q269j474M871O1J06j8091P930J2103r982J2789K9890
4724C2529K477k2589k3208K1582n53q673p988k5008J2495L5278p781m815Q200
4711A1946Q53J5410n040k4797j3102K313j3715K5695o687Q154P154n632M963m0326
4697c2811j5838J8298j4559M824K7245M11j6182p117j3296J4422J9527Q008j6461
4684b3529j5711J195J1744j5268P533R105K9925J8696p805j6231j4516N221J9739
4671A0098p591m36o649j6174K5276R45k2799j7115K3955K3923J4376R407n20l47
4657C6349l1194l5179p487j8431K8099K8150p836j2220j316r851L976j638L25
$$ plain form
4644 -28253 -8749 -15197 -25287 -8102 21006 43958 45511 35418 23773 16586 22819 36694 40471
4631 40471 26020 25503 35527 31970 18164 10868 2914 15190 3358 -3971 54180 64532 46132
4618 46132 25982 23604 20011 39851 56559 45276 41580 20276 -7452 -34583 -40291 -21569 -26394
4605 -26394 -44496 -69257 -69099 -49599 -30313 -34499 -23647 -19741 -14695 3328 15221 172 8925
4592 8925 -751 -16863 715 -6135 -12024 -14335 -27497 -17995 -13249 -19184 -22488 5091 -3474 7538
4578 7538 -15002 -26314 9724 22205 -14357 -52008 -50764 -33637 -19918 -35109 -27785 -46107
4566 -46107 -47498 -39247 -48761 -44020 -6034 -8903 -2912 -2565 -956 3369 7212 3227 -4478 -8997 -11357
4551 -11357 -2393 6956 27165 23350 35231 38447 7728 17297 10600 18081 20593 9144 11208 10214
$$ packed form
4644b8253J9504o448j0090J7185K9108K2952J553j0093j1645p187O233J3875L777
4631D0471j4451n17J0024l557j3806p296p954J2276j1832p329N8151J0352j8400
4618D6132k0150k378l593J9840J6708j1283l696k1304k7728k7131n708J8722m825
4605b6394j8102k4761J58J9500J9286m186J0852L906N046J8023J1893j5049Q753
4592H925r676j6112J7578o850n889k311j3162R502M746n935l304K7579q565J1012
4578G538k2540j1312L6038J2481l6562l7651J244J7127J3719j5191P324j8322
4566d6107j391Q251r514M741L7986k869N991L47J609M325L843l985p705m519k360
4551a1357Q964R349K0209l815J1881L216l0719R569o697P481K512j1449K064r94
$$ plain form
4537 10214 15549 26474 12806 2554 9585 -17901 -50138 -73665 -53800 -30640 -37517 -2852
4525 -2852 30238 6679 -23701 -39092 -4183 17727 6173 -20728 -21977 -9844 -17069 -8629 -3017
4512 -3017 -16085 -32486 -55062 -65022 -62260 -47057 -50712 -34634 -33328 -14949 -2002 9446 8441
4499 8441 25629 32867 2183 -7704 -4475 -5960 -24103 -26244 -34251 -31917 -45395 -20601 -15157 -18727
4485 -18727 -12334 -6156 -10661 -28517 -37212 -28279 4140 14467 6351 -29454 -10197 4440 1552
4472 1552 -15782 -55608 -54247 -46265 -45456 -30527 -30084 -24857 -35522 -23146 -22440 -9897 14655 38108
4458 38108 26203 24124 31836 11131 11836 32394 49302 36516 24941 14059 -9501 -14217 -21319
4445 -21319 -6490 -11453 -13730 -15727 -44362 -75125 -65720 -38050 -22480 -28803 -34506 -33066 -15693
$$ packed form
4537A0214N335J0925j3668j0252P031k7486l2237k3527J9865K3160o877L4665
4525b852L3090k3559l0380j5391L4909K1910j1554k6901j249J2133p225Q440N612
4512c017j3068j6401k2576r960K762J5203l655J6078J306J8379J2947J1448j005
4499H441J7188P238l0684r887L229j485j8143k141q007K334j3478K4794N444l570
4485a8727O393O178m505j7856q695Q933L2419J0327q116l5805J9257J4637k888
4472A552j7334l9826J361P982Q09J4929M43N227j0665J2376P06J2543K4552K3453
4458C8108j1905k079P712k0705P05K0558J6908j2786j1575j0882k3560m716p102
4445b1319J4829m963k277j997k8635l0763R405K7670J5570o323n703J440J7373
$$ plain form
4432 -15693 -6793 1032 15637 18671 20268 34244 44340 17339 -12095 -31485 -50035 -49998 -28045
4419 -28045 -14018 -13727 -21137 -18883 -21002 -51888 -79697 -48850 -22186 -19941 -5451 17781 1103
4406 1103 662 11134 -13232 -15855 -38009 -41603 -39503 -27159 -5619 -1788 -12612 9990 15806
4393 15806 -11347 -4625 -7465 -12442 -20046 -21377 -907 11777 -8971 -22089 -39608 -39509 -35053 -10516
4379 -10516 5226 926 18685 41301 29074 -4286 -6738 8976 -1892 -10123 -18947 -8528 8228
4366 8228 17551 45991 25491 -23131 -46590 -53014 -35931 -57843 -65007 -38222 -20696 -5066 -12178
4353 -12178 -16422 -37678 -25707 -24395 -32732 -33355 -43556 -30887 -25755 -19007 -26557 -27194 -11222 -18471
4339 -18471 -45838 -32983 -38769 -41287 -34710 -31195 -33260 -6233 20665 20098 9006 -19566 -11605
$$ packed form
4432a5693Q900P825J4605L034J597J3976J0096k7001k9434j9390j8550L7K1953
4419b8045J4027K91p410K254k119l0886k7809L0847K6664K245J4490K3232j6678
4406A103m41J0472k4366k623k2154l594K100J2344K1540L831j0824K2602N816
4393A5806k7153O722k840m977p604j331K0470J2684k0748j3118j7519R9M456K4537
4379a0516J5742m300J7759K2616j2227l3360k452J5714j0868q231q824J0419J6756
4366H228R323K8440k0500m8622k3459o424J7083k1912p164K6785J7526J5630p112
4353a2178m244k1256J1971J312q337o23j0201J2669N132O748p550o37J5972p249
4339a8471k7367J2855n786k518O577L515k065K7027K6898n67j1092k8572P961
$$ plain form
4326 -11605 -3799 -22619 -25015 -29898 -40812 -17480 17485 9717 -17995 -21677 -344 -12047 -13590
4313 -13590 -12478 -10200 12006 2776 -4717 -10909 -13689 -15409 4558 3060 -17379 -24286 -2612 -2550
4299 -2550 3291 14575 34349 35663 34610 16912 15614 -3600 24319 15572 4326 16118 -4570
4286 -4570 6746 17710 32755 11769 37202 50019 32134 12518 12856 -13286 -13070 -3611 -5977
4273 -5977 -8409 -21996 -19192 -1278 -6475 -14923 -32152 -60706 -48537 -11047 388 -28838 -46563
4260 -46563 -6363 10039 6909 -23320 -25512 -12701 -28199 -23340 -9727 -7419 -30206 -43803 -42135
4247 -42135 -23401 -30498 -15294 -1192 -3406 -4815 -15544 -11710 18134 18432 -14267 -22007 -3586
4234 -3586 5824 10749 38012 31480 10152 7679 24693 15714 -6327 -14317 4765 8478 -12287
$$ packed form
4326a1605P806j8820k396m883j0914K3332L4965p768k7712l682K1333j1703j543
4313a3590J112K278K2206r230p493o192k780j720J9967j498k0439o907K1674O2
4299b550N841J1284J9774J314j053j7698j298j9214K7919q747j1246J1792k0688
4286d570J1316J0964J5045k0986K5433J2817j7885j9616L38k6142K16R459k366
4273e977k432j3587K804J7914n197q448j7229k8554J2169L7490J1435k9226j7725
4260d6563M0200J6402l130l0229k192J2811j5498M859J3613K308k2787j3597J668
4247d2135J8734p097J5204J4102k214j409j0729L834K9844K98l2699p740J8421
4234c586R410M925K7263o532k1328k473J7014q979k2041p990J9082L713k0765
$$ plain form
4221 -12287 -19139 -28345 -5574 -7751 -18085 -35596 -45437 -10122 -20134 -48795 -33572 -32427 -35403
4208 -35403 -41365 -36519 -39082 -40711 -50628 -49349 -34659 -15158 -227 1315 1001 16551 12718 -18393
4194 -18393 -55903 -65937 -39071 -11894 3936 1125 -33385 -64071 -65453 -52995 -34168 -42172
4182 -42172 -50357 -20002 4682 -3922 -1327 15562 15715 -6454 -23167 -34669 -11524 -21095 -23909
4169 -23909 -9948 7579 24380 -29538 -69455 -55586 -20437 -11557 2459 16501 5850 -1911
4157 -1911 2367 1761 1902 20411 23790 27437 34027 31607 27014 1287 2908 5800 -2967 -2383 -11877
4142 -11877 8812 7037 -6778 -4950 4290 -29910 -59415 -60465 -38316 -36594 -42964 -7105 16377
4129 16377 -12415 -42197 -27586 -10624 6826 1882 -10604 8968 5004 -12541 -22593 -21497
$$ packed form
4221a2287o852r206K2771k177j0334j7511r841L5315j0012k8661J5223J145k976
4208c5403n962M846k563j629r917J279J4690J9501J4931J542l14J5550l833l1111
4194a8393l7510j0034K6866K7177J5830k811l4510l0686j382J2458J8827q004
4182d2172q185L0355K4684q604K595J6889J53k2169j6713j1502K3145r571k814
4169b3909J3961J7527J6801n3918l9917J3869L5149Q880J4016J4042j0651p761
4157a911M278o06J41J8509L379L647O590k420m593k5727J621K892q767N84r494
4142a1877K0689j775j3815J828R240l4200k9505j050K2149J722o370L5859K3482
4129A6377k8792k9782J4611J6962J7450m944j2486J9572l964j7545j0052J096
$$ plain form
4117 -21497 -10308 -8348 22269 50532 32300 7191 -6807 -16402 -10470 6059 -5492 -18897
4105 -18897 -3560 7208 -1152 -796 -16656 -27862 -4659 -2950 -32655 -37398 -18186 9092 31003
4092 31003 53530 12670 2799 17573 18386 424 -17974 -17829 5891 9329 -7188 -31552 -43933
4079 -43933 -32211 -719 10149 8390 27576 10111 -24595 -44532 -33113 -32026 -62889 -40063
4067 -40063 -2498 -5859 -15833 -17863 -26034 -2431 -9895 -7450 -22130 -21404 -11479 -15378 -3753 23405
4053 23405 18377 -873 -25594 -8065 -8043 -28177 -25141 -31457 -48751 -76068 -55347 -19056 -9761
4040 -9761 -13190 -9954 -16181 -9835 -2206 -22364 -19447 -4823 40046 62214 54371 21350 22935 4454
4026 4454 -25272 -19648 -18995 -23114 -341 10677 16156 35315 34704 -4438 -32436 -32062 -28941 -11101
$$ packed form
4117b1497J1189J960L0617K8263j8232k5109j3998r595N932J6529j1551j3405
4105a8897J5337J0768q360L56j5860j1206K3203J709k9705m743J9212K7278K1911
4092C1003K2527m0860r871J4774Q13j7962j8398J45K3720L438j6517k4364j2381
4079d3933J1722L1492J0868j759J9186j7465l4706j9937J1419J087l0863K2826
4067d0063L7565l361r974k030q171K3603p464K445j4680P26R925l899J1625K7158
4053B3405n028j9250k4721J7529K2k0134L036o316j7294k7317K0721L6291R295
4040i761l429L236o227O346P629k0158K917J4624M4869K2168p843l3021J585j8481
4026D454k9726N624O53m119K2773J1018N479J9159o11l9142k7998L74L121J7840
$$ plain form
4012 -11101 -7175 13846 34206 21730 27502 14942 -9288 -7331 -9668 -14623 -15491 7671 20204
3999 20204 5563 -27657 -26488 7087 30900 16431 -17629 -1540 21152 4607 7231 30377
3987 30377 49615 33163 41800 40662 7226 -28989 -34154 -41489 -21692 -29346 -15533 19703 23286
3974 23286 22889 3783 -14206 1807 7247 -3985 -20815 -17903 -18246 -3266 17600 27935 21111
3961 21111 16687 -2837 -5271 -3284 23262 28182 365 -23882 5093 -26330 -52988 -48531 -28809
3948 -28809 -12832 -9107 -15370 11647 3661 -19864 4079 10901 -11796 -28507 -20743 -19587 -35251
3935 -35251 -40297 -34787 -23342 -31051 -33210 -32734 -20519 -9485 -12369 -12658 -6348 -13852 10222 15982
3921 15982 13063 -8999 -13311 -3586 -19581 -30832 -37442 -46258 -64503 -54542 -50922 -31415 -18168
$$ packed form
4012a1101L926K1021K0360j2476N772j2560k4230J957k337m955q68K3162J2533
3999B0204j4641l3220J169L3575K3813j4469l4060J6089K2692j6545K624K3146
3987C0377J9238j6452Q637j138l3436l6215n165p335J9797p654J3813L5236L583
3974B3286l97j9106j7989J6013N440j1232j6830K912l43J4980K0866J0335o824
3961B1111m424j9524k434J987K6546M920k7817k4247K8975l1423k6658M457J9722
3948b8809J5977L725o263K7017p986k3525K3943O822k2697j6711P764J156j5664
3935c5251n046N510J1445p709k159M76J2215J1034k884k89O310p504K4074N760
3921A5982k919k2062m312R725j5995j1251o610q816j8245R961L620J9507J3247
$$ plain form
3908 -18168 -5138 2925 -18523 -7908 15966 46448 44240 13547 2368 -2032 4850 24436 39624
3895 39624 36420 19834 10615 9097 8302 657 8469 32404 54468 51252 8536 -24869 -38889
3882 -38889 -23833 5355 23503 35296 36844 15515 1384 3342 -7051 -33228 -37438 -22814
3870 -22814 -9485 16961 1501 -7955 -11293 -7095 -3464 11752 4343 2169 10950 25938 46154
3857 46154 44336 26031 5726 -18007 -41278 -29648 -24577 3889 39296 58419 50848 26538
3845 26538 -1074 12294 18644 26791 43368 60877 47399 15921 6994 -7842 -32606 -51688
3833 -51688 -58891 -60835 -33404 -24541 -27177 -29368 -40554 -30702 -9546 -10112 -12699 -22010 -4116 1596
3819 1596 2711 17299 -5044 -27832 -23287 1290 -7540 -36793 -39987 -30299 8885 -18132 -34252
$$ packed form
3908a8168J3030Q063k1448J0615K3874L0482k208l0693j1179m400O882J9586J5188
3895C9624l204j6586r219j518p95p645P812K3935K2064l216m2716l3405j4020
3882c8889J5056K9188J8148J1793J548k1329j4131J958j0393k6177m210J4624
3870b2814J3329K6446j5460r456l338M198L631J5216p409k174Q781J4988K0216
3857D6154j818j8305k0305k3733k3271J1630N071K8466L5407J9123p571k4310
3845B6538k7612J3368O350Q147J6577J7509j3478l1478q927j4836k4764j9082
3833e1688p203j944K7431Q863k636k191j1186R852K1156n66k587r311J7894N712
3819A596J115J4588k2343k2788M545K4577q830k9253l194R688L9184k7017j6120
$$ plain form
3806 -34252 -50534 -9105 11268 -7226 12594 29756 32916 21838 26621 2542 -789 12369
3794 12369 28192 16811 2175 -22870 -38981 -1487 20635 32855 41813 28484 13685 20446
3782 20446 22494 23411 24879 18737 13989 24000 14588 10027 -11631 -6345 74 4117 -370 404 -6930
3767 -6930 -6797 -27505 -40258 -23465 -2398 24265 16652 20196 25341 379 -22687 -17193 -2466
3754 -2466 7867 1573 13271 35917 7762 2157 3108 34007 23561 6943 -14344 -18098 -4010
3741 -4010 22044 41335 35126 19078 10205 12785 2217 -15830 -38815 -65465 -80082 -62435 -44170
3728 -44170 -55852 -30503 -12586 23559 31324 -4831 -37195 -34123 -16059 -6104 -5007 -33058 -52769
3715 -52769 -57073 -38831 -11884 -22434 -55291 -29435 19734 17800 -13939 -18206 -23516 880 36355
$$ packed form
3806c4252j6282M1429K0373j8494J9820J7162L160j1078M783k4079l331J3158
3794A2369J5823j1381j4636k5045j6111L7494K2122J2220Q958j3329j4799O761
3782B0446K048R17J468o142m748J0011r412m561k1658N286O419M043m487P74p334
3767f930J33k0708j2753J6793K1067K6663p613L544N145k4962k3066N494J4727
3754b466J0333o294J1698K2646k8155n605R51L0899j0446j6618k1287l754J4088
3741d010K6054J9291o209j6048q873K580j0568j8047k2985k6650j4617J7647J8265
3728d4170j1682K5349J7917L6145P765l6155l2364L072J8064R955J097k8051j9711
3715e2769m304J8242K6947j0550l2857K5856M9169j934l1739m267n310K4396L5475
$$ plain form
3702 36355 35893 42096 51708 59512 49618 3082 -9768 23025 22032 -6249 6868 15547 274 -10813
3688 -10813 -44174 -40205 -11945 -12390 -15627 -14419 -21928 -3539 24640 26135 5714 -32392 -26304
3675 -26304 -6256 -5850 1569 11810 8343 15540 11688 -17652 -49386 -42641 -19219 13283 41002
3662 41002 42122 37983 -5571 -17459 -8192 -16605 -21281 -9103 9551 36032 48672 27309 5483
3649 5483 -26478 -41871 -18128 -17772 -4335 -12065 -16578 -19780 -35934 -41735 -26960 -8238 -13625
3636 -13625 -27737 -34427 -24141 -29600 -17562 20078 16258 28907 33406 22252 -21430 1459 26226
3623 26226 36385 50799 62716 37691 34268 35885 18477 24988 18202 3844 21785 19882 -5412
3610 -5412 -9995 -2088 -20042 -14805 -28283 -14878 6583 -10790 -33900 -45874 -27675 -17408 -4326
$$ packed form
3702C6355m62O203R612P804r894m6536j2850L2793r93k8281J3117Q679j5273j1087
3688a0813l3361L969K8260m45l237J208p509J8389K8179J495k0421l8106O088
3675b6304K0048M06P419J0241l467P197l852k9340l1734O745K3422L2502K7719
3662D1002J120m139m3554j1888R267q413m676J2178J8654K6481J2640k1363k1826
3649E483l1961j5393K3743L56J3437p730m513l202j6154n801J4775J8722n387
3636a3625j4112o690J0286n459J2038L7640l820J2649M499j1154m3682K2889K4767
3623B6226J0159J4414J1917k5025l423J617j7408O511o786j4358J7941j903k5294
3610e412m583P907j7954N237j3478J3405K1461j7373k3110j1974J8199J0267J3082
$$ plain form
3597 -4326 14612 34861 28239 18634 33968 29631 12906 6216 9287 -17154 -28103 -23307 -4325
3584 -4325 30867 68431 83794 64006 24820 2737 15763 23042 28154 18105 39005 51490
3572 51490 54641 57581 26799 -4600 12546 35479 40736 46973 34413 33553 18776 11090 38573
3559 38573 40010 -324 3689 32447 36309 18657 8263 3493 -15824 -60599 -28902 4244 3915
3546 3915 593 19192 38770 -298 -24515 -17731 -26436 -16630 -1143 14335 10580 14804 -1165
3533 -1165 -1918 1097 -13282 -26671 -23729 -28885 -10937 7164 10593 -690 10761 -3540 13862
3520 13862 20926 -15243 -32107 -3104 20383 33730 12257 -24111 -41798 -46034 -41936 -51500 -40235
3507 -40235 -25802 -39317 -68168 -49743 -29516 -24777 -14160 -5111 -6793 4928 7357 21608 -3774
$$ packed form
3597d326J8938K0249o622r605J5334m337j6725o690L071k6441j0949M796J8982
3584d325L5192L7564J5363j9788l9186k2083J3026P279N112j0049K0900J2485
3572E1490L151K940l0782l1399J7146K2933N257O237j2560q60j4777p686K7483
3559C8573J437m0334M013K8758L862j7652j0394m770j9317m4775L1697L3146l29
3546C915l322J8599J9578l9068k4217O784q705R806J5487J5478l755M224j5969
3533a165p53L015j4379j3389K942n156J7948J8101L429j1283J1451j4301J7402
3520A3862P064l6169j6864K9003K3487J3347k1473l6368j7687m236M098r564J1265
3507d0235J4433j3515k8851J8425K0227M739J0617R049j682J1721K429J4251k5382
$$ plain form
3494 -3774 -39018 -19644 -4506 18009 36544 30141 25846 13101 22852 42880 6816 -14027 -16150
3481 -16150 2955 2271 -14245 -7647 -13998 -4363 9724 -1341 -17744 -16522 59 5314 12461
3468 12461 -3275 20816 43245 52585 56950 18891 -34436 -56603 -38626 -11465 12487 -9118
3456 -9118 -99 28914 8563 12759 -3429 -4969 7225 25654 9522 -16497 -4243 17532 30524
3443 30524 34652 19858 7524 17427 16138 21916 18794 28959 34970 30459 21235 4651 -12935
3430 -12935 -12813 -2463 -985 16098 28632 25928 37195 32591 11472 17714 -325 -7498 -11812
3417 -11812 -11670 -11867 -12802 -2443 -8102 -9204 7284 21193 6983 -17335 -32186 -34345 -27534 -21691
3403 -21691 -41569 -43633 -5788 -7273 -9348 -3844 -5217 1391 30279 47161 30538 -1521 -2865
$$ packed form
3494c774l5244J9374J5138K2515J8535o403m295j2745R751K0028l6064k0843k123
3481a6150J9105o84j6516O598o351R635J4087j1065j6403J222J6581N255P147
3468A2461j5736K4091K2429R340M365l8059n3327k2167J7977K7161K3952k1605
3456i118R019K9013k0351M196j6188j540J2194J8429j6132k6019J2254K1775J2992
3443C0524M128j4794j2334R903j289N778l122J0165O011m511r224j6584j7586
3430a2935J22J0350J478J7083J2534k704J1267m604k1119O242j8039p173m314
3417a1812J42j97r35J0359n659j102J6488J3909j4210k4318j4851k159O811N843
3403b1691j9878k064L7845j485k075N504j373O608K8888J6882j6623l2059j344
$$ plain form
3390 -2865 -9762 -32387 -20774 -370 1911 -9163 -7672 8550 -6119 7702 708 -6447 -15834
3377 -15834 -30901 -42501 -37682 -21719 -21506 -9531 -44887 -41667 -35989 -27509 -36097 -29524 8968
3364 8968 44957 41326 20942 11017 -3044 -24649 -13763 -336 8024 -4215 -7309 -18496 -5028
3351 -5028 -5647 9305 25175 18047 4504 -35957 -51685 -64124 -50639 -10124 -2082 -4616 -17432
3338 -17432 -22454 -15075 -18339 -35938 -18561 -10199 -7110 -8201 -17480 -26181 -42077 -34900 -34046 -16153
3324 -16153 7185 21679 19604 2021 -5622 -9072 -26577 -13857 -7879 -20011 -35759 -36539 -22763
3311 -22763 -26460 -15986 184 5254 -22964 -23296 -26443 -16058 -11954 -27499 -53572 -56382 -36820
3298 -36820 -71268 -51022 -126 21840 21142 -2056 -30617 -22568 -16880 -5318 3742 674 3766
$$ packed form
3390b865o897k2625J1613K0404K281j1074J491J6222j4669J3821o994p155r387
3377a5834j5067j1600M819J5963K13J1975l5356L220N678Q480q588O573L8492
3364H968L5989l631k0384r925j4061k1605J0886J3427Q360j2239l094j1187J3468
3351e028o19J4952J5870p128j3543m0461j5728j2439J3485M0515Q042k534j2816
3338a7432n022P379l264j7599J7377Q362L089j091r279q701j5896P177Q54J7893
3324a6153K3338J4494k075j7583p643l450j7505J2720N978j2132j5748p80J3776
3311b2763l697J0474J6170N070k8218l32l147J0385M104j5545k6073k810J9562
3298c6820l4448K0246N0896K1966o98k3198k8561Q049N688J1562R060l068L092
$$ plain form
3285 3766 3861 662 7045 -3152 -24621 -38887 -29290 -12651 9326 -22206 -56913 -56402 -62257 -44417
3271 -44417 -25184 -40101 -34075 -15350 861 10183 -10360 -42932 -35495 -40296 -44965 -35624 -43882
3258 -43882 -73532 -57175 -60028 -36723 -25990 -32383 -23307 -12982 -22123 -3369 -7178 24254 47318
3245 47318 42274 55996 58718 56212 52798 24938 3033 -2678 -22190 -20392 -35427 -19486 15184
3232 15184 39680 53112 48036 33737 42713 33487 31358 21641 5019 -12344 -18890 -12579 -17517
3219 -17517 -13535 14993 12834 -42006 -25514 3006 -9996 -12664 -16000 -28822 -38469 -16235 17688
3206 17688 41863 44813 26543 19655 20407 6539 -3466 7426 10245 -21704 -5948 -25698 -54260
3193 -54260 -30401 13718 22609 4802 7647 -5805 -1467 -2643 -16117 -13037 9763 7019 17243
$$ packed form
3285C766R5l199O383j0197k1469j4266R597J6639K1977l1532l4707N11n855J7840
3271d4417J9233j4917O026J8725J6211R322k0543l2572P437m801m669R341q258
3258d3882k9650J6357k853K3305J0733o393R076J0325r141J8754l809L1432K3064
3245D7318n044J3722K722k506l414k7860k1905n711j9512J798j5035J5941L4670
3232A5184K4496J3432n076j4299Q976r226k129r717j6622j7363o546O311m938
3219a7517L982K8528k159n4840J6492K8520j3002k668l336j2822r647K2234L3923
3206A7688K4175K950j8270o888P52j3868j0005J0892K819l1949J5756j9750k8562
3193e4260K3859M4119Q891j7807K845j3452M338j176j3474L080K2800k744J0224
$$ plain form
3180 17243 36999 30589 8420 -4709 -7682 2784 -8405 -15127 -18347 -2346 -9860 -2783 17704
3167 17704 20768 13160 13466 31286 23504 25069 33005 30564 7603 -4397 -26069 -21721 5116 6263
3153 6263 1258 10204 12327 -7891 -33384 -9270 -15954 -42396 -40409 -11754 4434 7169 8207
3140 8207 -1282 -3135 26132 33698 47953 61885 32709 28138 19744 9190 16717 26007 29
3127 29 2054 7533 11276 6065 -37837 -57417 -44900 -17140 -17957 -42650 -55350 -64486 -68702 -42581
3113 -42581 -36838 -48451 -38010 -10769 4618 -9062 -18583 -12682 16499 -12244 -12044 11046 6487
3100 6487 3132 29263 18883 -4359 -13015 -6131 5410 11251 4544 -507 -15887 -38868 -13996
3087 -13996 -21081 -30721 -4794 -4545 -3783 -17738 -26666 -12916 4936 3024 -1864 1560 24368 47282
$$ packed form
3180A7243J9756o410k2169j3129k973J0466j1189o722l220J6001p514P077K0487
3167A7704L064p608L06J7820p782J565P936k441k2961j2000k1672M348K6837J147
3153F263n005Q946K123k0218k5493K4114o684k6442J987K8655J6188K735J038
3140H207r489j853K9267P566J4255J3932k9176m571q394j0554P527R290k5978
3127B9K025N479L743n211m3902j9580J2517K7760q17k4693j2700r136m216K6121
3113d2581N743j1613J0441K7241J5387j3680r521N901K9181k8743K00K3090m559
3100F487l355K6131j0380k3242q656O884J1541N841o707n051j5380k2981K4872
3087a3996p085r640K5927K49P62j3955q928J3750J7852j912m888L424K2808K2914
$$ plain form
3073 47282 27617 15118 1210 -22079 -24733 -4244 12128 15988 3873 -13102 -11055 -17867 -16500
3060 -16500 -6908 -8911 -14294 14332 47660 23601 -2733 21331 42394 23344 37410 22910
3048 22910 16179 34579 14739 -3405 4751 13661 26787 6996 -8335 15881 13244 -14080 -923
3035 -923 23336 -10625 -70891 -63416 -9331 20960 6790 -1401 -11594 -27924 -42890 -7264 9632
3022 9632 3375 17042 12954 -23731 -31706 -8957 4459 14196 988 -23000 -39762 -28778 -6337
3009 -6337 -25217 -54622 -45922 -25871 1034 18702 16579 20750 16456 23664 45170 44517 18765
2996 18765 -12588 -7477 21075 41209 42941 21143 -17373 -33820 -20606 -27576 11077 5979 -8246
2983 -8246 -2928 -9268 -12361 -9576 -10532 -1079 1834 -8232 7843 8338 -14855 -11878 -13813 -4144 -28700
$$ packed form
3073D7282j9665j2499j3908k3289k654K0489J6372L860j2115j6975K047o812J367
3060a6500R592k003n383K8626L3328k4059k6334K4064K1063j9050J4066j4500
3048B2910o731J8400j9840j8144Q156Q910J3126j9791j5331K4216k637k7324J3157
3035i23K4259l3961o0266P475N4085L0291j4170q191j0193j6330j4966L5626J6896
3022I632o257J3667m088l6685p975K2749J3416R737j3208k3988j6762J0984K2441
3009f337j8880k9405Q700K0051K6905J7668k123M171m294P208K1506o53k5752
2996A8765l1353N111K8552K0134J732k1798l8516j6447J3214o970L8653n098j4225
2983h246N318o340l093K785r56R453K913j0066J6075M95k3193K977j935R669k4556
$$ plain form
2968 -28700 -53876 -47974 -16935 30223 36428 42360 40316 18688 -36608 -42856 -31645 -15296 -19242
2955 -19242 -8373 -15077 -19385 -3362 -73 -8902 -5146 -4675 -20715 -32965 -49385 -44589 -40474 -30190
2941 -30190 -21700 -62122 -113630 -95529 -58361 -57062 -23230 -1645 -2739 1472 -4133 4724 34268
2928 34268 26120 5747 3217 -14883 -15759 -12481 -18386 -6633 14140 27659 46421 49653 25773
2915 25773 43141 41301 38043 33723 48149 32928 37863 30238 21378 33981 37774 29390 11308
2902 11308 1433 -9365 -6725 7839 1663 9712 7049 -17196 -18156 418 26710 40643 4828
2889 4828 12916 37378 44676 51131 54416 30792 32738 2042 -13065 -6170 -13584 -6110 7285 22407
2875 22407 24293 3026 -4539 -16027 -8890 -20076 -29178 -22904 -31255 -21320 6141 -9674 -15124
$$ packed form
2968b8700k5176N902L1039M7158O205N932k044k1628n5296o248J1211J6349l946
2955a9242J0869o704m308J6023L289q829L756M71j6040j2250j6420M796M115J0284
2941c0190Q490m0422n1508J8101L7168J299L3832K1585j094M211n605Q857K9544
2928C4268q148k0373k530j8100q76L278n905J1753K0773J3519J8762L232k3880
2915B5773J7368j840l258m320J4426j5221M935p625q860J2603L793q384j8082
2902A1308r875j0798K640J4564o176Q049k663k4245r60J8574K6292J3933l5815
2889D828Q088K4462P298O455L285k3624J946l0696j5107O895p414P474J3395J5122
2875B2407J886k1267p565j1488P137j1186r102O274q351R935K7461j5815n450
$$ plain form
2862 -15124 3161 20081 36505 8912 6441 1649 -21276 -19216 -22212 -36935 -39059 -28689 -16661
2849 -16661 -4640 -1292 6705 8477 2983 13476 9706 15784 4040 15565 28761 20977 17190
2836 17190 18339 -7203 -34072 -28489 -14766 -10832 -36598 -38599 -34032 -46989 -31904 -30738 -5918
2823 -5918 15607 1435 1906 3778 19144 5053 -1964 13454 -10093 -5663 -7566 -31957 -36944
2810 -36944 -31188 -14366 13056 38859 33462 26679 23742 744 -18860 -37179 -24965 -45493 -65592
2797 -65592 -57303 -16914 1885 -18136 -38944 -56206 -50666 -46180 -43597 -39986 -55725 -43031 -39236
2784 -39236 -36955 -11635 14070 12784 -1586 2985 1963 5363 12779 13609 -7954 -14596 -10229 5207
$$ packed form
2862a5124J8285J6920J6424k7593k471m792k2925K060k996j4723k124J0370J2028
2849a6661J2021L348P997J772n494J0493l770O078j1744J1525J3196p784l787
2836A7190J149k5542k6869N583J3723L934k5766k001M567j2957J5085J166K4820
2823e918K1525j4172M71J872J5366j4091p017J5418k3547M430j903k4391m987
2810c6944N756J6822K7422K5803n397o783k937k2998j9604j8319J2214k0528k0099
2797f5592Q289M0389J8799k0021k0808j7262N540M486K583L611j5739J2694L795
2784c9236K281K5320K5705j286j4370M571j022L400P416Q30k1563o642M367J5436
$$ [...]
##END NTUPLES=NMR SPECTRUM
##END=
