##TITLE=Analysis number 322293
Compound Code cc 50909
Book Reference 486/54
Project Code adrs
Chemist Name simons
##JCAMPDX= 6.0         $$ Bruker NMR JCAMP-DX V2.0
##DATA TYPE= NMR SPECTRUM
##DATA CLASS= NTUPLES
##ORIGIN= Bruker BioSpin GmbH
##OWNER= nmr
$$ XWIN-NMR		Version 3.5
$$ Wed Sep 20 12:06:19 2006 GMT Daylight Time (UT+1h)  MAYBRIDGE\nmr@NMR_250MHZ
##.OBSERVE FREQUENCY= 250.131544655141
##.OBSERVE NUCLEUS= ^1H
##.ACQUISITION MODE= SIMULTANEOUS (DQD)
##.ACQUISITION SCHEME= undefined
##.AVERAGES= 16
##.DIGITISER RES= 18
##SPECTROMETER/DATA SYSTEM= dpx250
##.PULSE SEQUENCE= zg30
##.SOLVENT NAME= CDCl3
##.SHIFT REFERENCE= (INTERNAL, CDCl3, 0, 16.4519)
##AUDIT TRAIL= $$ (NUMBER, WHEN, WHO, WHERE, WHAT)
$$ ##TITLE= Audit trail, XWIN-NMR		Version 3.5
$$ ##JCAMPDX= 5.01
$$ ##ORIGIN= Bruker BioSpin GmbH
$$ ##OWNER= nmr
$$ C:\u/data/dgb/nmr/ADRS/1040/pdata/1/auditp.txt
$$ ##AUDIT TRAIL=  $$ (NUMBER, WHEN, WHO, WHERE, WHAT)
(   1,<2006-09-20 12:05:48.48 +100>,<MAYBRIDGE\nmr>,<NMR_250MHZ>,
      <created by zg, POWCHK disabled, PULCHK disabled
       configuration hash MD5:
       E2 DF 36 D8 04 B2 41 60 5A D7 A3 38 5A 4B D0 FE
       data hash MD5: 64K
       B9 37 BD 1F 09 87 52 E5 B4 FC 59 87 52 6B 51 B2>)
(   2,<2006-09-20 12:06:09.18 +100>,<MAYBRIDGE\nmr>,<NMR_250MHZ>,
      <Start of raw data processing
       ef LB = 0.3 FT_mod = 6 PKNL = 1 SI = 32K 
       data hash MD5: 32K
       06 37 BA E1 2A 20 6E C0 2C 4C E5 2F 9A 91 28 62>)
(   3,<2006-09-20 12:06:10.89 +100>,<MAYBRIDGE\nmr>,<NMR_250MHZ>,
      <apk 
       data hash MD5: 32K
       A5 D5 6C 98 49 69 8C 10 44 A8 71 07 4B FF 95 D1>)
(   4,<2006-09-20 12:06:11.62 +100>,<MAYBRIDGE\nmr>,<NMR_250MHZ>,
      <abs ABSG = 5 
       data hash MD5: 32K
       34 8A B2 36 F9 9F F5 BA 01 92 75 38 B0 A2 AA A1>)
$$ ##END=
$$ 
$$ hash MD5
$$ D9 3A EA 5D EB 1D 3B 53 69 8E 00 BD BD 2A C9 00
##$RELAX= 
##$RELAX= 
##$RELAX= 
##$RELAX= 
##$RELAX= 
##$RELAX= 
##$RELAX= 
$$ Bruker specific parameters
$$ --------------------------
##$DU= <C:\u>
##$EXPNO= 1040
##$NAME= <ADRS>
##$PROCNO= 1
##$TYPE= <nmr>
##$USER= <dgb>
##$AMP= (0..31)
100 100 100 100 100 100 100 100 100 100 100 100 100 100 100 100 100 100 
100 100 100 100 100 100 100 100 100 100 100 100 100 100 
##$AQSEQ= 0
##$AQ_mod= 3
##$AUNM= <au_zg>
##$AUTOPOS= <19 >
##$BF1= 250.13
##$BF2= 250.13
##$BF3= 250.13
##$BF4= 250.13
##$BF5= 500.13
##$BF6= 500.13
##$BF7= 500.13
##$BF8= 500.13
##$BYTORDA= 1
##$CFDGTYP= 0
##$CFRGTYP= 5
##$CHEMSTR= <none>
##$CNST= (0..31)
1 1 145 1 1 1 1 1 1 1 1 1 1 1 1 1 1 1 1 1 1 1 1 1 1 1 1 1 1 1 1 1 
##$CPDPRG= <>
##$CPDPRG1= <>
##$CPDPRG2= <>
##$CPDPRG3= <>
##$CPDPRG4= <mlev>
##$CPDPRG5= <mlev>
##$CPDPRG6= <mlev>
##$CPDPRG7= <mlev>
##$CPDPRG8= <mlev>
##$CPDPRGB= <>
##$CPDPRGT= <>
##$D= (0..31)
0 1 0 0 0 0 0 0 0 0.06 0 0 0 0 0 0 0.0002 0 0 0 0 0 0 0 0 0 0 0 0 0 0 
0 
##$DATE= 1158750346
##$DBL= (0..7)
120 120 120 120 120 120 120 120 
##$DBP= (0..7)
150 150 150 150 150 150 150 150 
##$DBP07= 0
##$DBPNAM0= <>
##$DBPNAM1= <>
$$ [...]
##$SUBNAM7= <"">
##$SUBNAM8= <"">
##$SUBNAM9= <"">
##$SW= 20.6930455092707
##$SWIBOX= (0..15)
0 0 3 0 0 0 0 0 0 0 0 0 0 0 0 0 
##$SW_h= 5175.983436853
##$TD= 65536
##$TD0= 1
##$TE= 295.16
##$TE2= 300
##$TE3= 300
##$TEG= 300
##$TL= (0..7)
0 120 120 120 120 120 120 120 
##$TP= (0..7)
150 150 150 150 150 150 150 150 
##$TP07= 0
##$TPNAME0= <>
##$TPNAME1= <>
##$TPNAME2= <>
##$TPNAME3= <>
##$TPNAME4= <>
##$TPNAME5= <>
##$TPNAME6= <>
##$TPNAME7= <>
##$TPOAL= (0..7)
0.5 0.5 0.5 0.5 0.5 0.5 0.5 0.5 
##$TPOFFS= (0..7)
0 0 0 0 0 0 0 0 
##$TUNHIN= 0
##$TUNHOUT= 0
##$TUNXOUT= 0
##$USERA1= <user>
##$USERA2= <user>
##$USERA3= <user>
##$USERA4= <user>
##$USERA5= <user>
##$V9= 5
##$VALIST= <valist>
##$VCLIST= <CCCCCCCCCCCCCCC>
##$VD= 0
##$VDLIST= <DDDDDDDDDDDDDDD>
##$VPLIST= <PPPPPPPPPPPPPPP>
##$VTLIST= <TTTTTTTTTTTTTTT>
##$WBST= 1024
##$WBSW= 4
##$XGAIN= (0..3)
0 0 0 0 
##$XL= 0
##$YL= 0
##$YMAX_a= 375714
##$YMIN_a= -483144
##$ZGOPTNS= <>
##$ZL1= 120
##$ZL2= 120
##$ZL3= 120
##$ZL4= 120
##$ABSF1= 16.45187
##$ABSF2= -4.241302
##$ABSG= 5
##$ABSL= 3
##$ALPHA= 0
##$AQORDER= 0
##$ASSFAC= 0
##$ASSFACI= 0
##$ASSFACX= 0
##$ASSWID= 0
##$AUNMP= <proc_1d>
##$AZFE= 0.1
##$AZFW= 0.1
##$BCFW= 0
##$BC_mod= 0
##$BYTORDP= 0
##$COROFFS= 0
##$CY= 12.5
##$DATMOD= 1
##$DC= 0
##$DFILT= <>
##$DTYPP= 0
##$F1P= 14.0000005364418
##$F2P= -0.99999901652339
##$FCOR= 0.5
##$FTSIZE= 32768
##$FT_mod= 6
##$GAMMA= 0
##$GB= 0
##$INTBC= 1
##$INTSCL= 1
##$ISEN= 128
##$LB= 0.3
##$LEV0= 0
##$LPBIN= 0
##$MAXI= 10000
##$MC2= 0
##$MEAN= 0
##$ME_mod= 0
##$MI= 0
##$NCOEF= 0
##$NC_proc= -3
##$NLEV= 6
##$NOISF1= 0
##$NOISF2= 0
##$NSP= 0
##$NTH_PI= 0
##$NZP= 0
##$OFFSET= 16.45187
##$PC= 1
##$PHC0= 151.6795
##$PHC1= 4.517716
##$PH_mod= 1
##$PKNL= yes
##$PPARMOD= 0
##$PSCAL= 4
##$PSIGN= 0
##$REVERSE= no
##$SF= 250.130017540528
##$SI= 32768
##$SIGF1= 0
##$SIGF2= 0
##$SINO= 400
##$SIOLD= 32768
##$SREGLST= <1H.CDCl3>
##$SSB= 0
##$STSI= 32768
##$STSR= 0
##$SW_p= 5175.98343685301
##$SYMM= 0
##$S_DEV= 0
##$TDeff= 65536
##$TDoff= 0
##$TI= <Analysis number 999999
Compound Code 99
Book Reference 9
Project Code 9>
##$TILT= no
##$TM1= 0
##$TM2= 0
##$TOPLEV= 0
##$USERP1= <user>
##$USERP2= <user>
##$USERP3= <user>
##$USERP4= <user>
##$USERP5= <user>
##$WDW= 1
##$XDIM= 32768
##$YMAX_p= 379454070
##$YMIN_p= -215972
$$ End of Bruker specific parameters
$$ ---------------------------------
##NTUPLES= NMR SPECTRUM
##VAR_NAME=  FREQUENCY,     SPECTRUM/REAL,   SPECTRUM/IMAG
##SYMBOL=    X,             R,               I
##VAR_TYPE=  INDEPENDENT,   DEPENDENT,       DEPENDENT
##VAR_FORM=  AFFN,          ASDF,            ASDF
##VAR_DIM=   32768,         32768,           32768
##UNITS=     HZ,            ARBITRARY UNITS, ARBITRARY UNITS
##FACTOR=    0.157963299565203, 1,           1
##FIRST=     4115.10652281979, 0,            0
##LAST=      -1060.87691403322, 0,           0
##MIN=       -1060.87691403322, -215972,     0
##MAX=       4115.10652281979, 379454070,    0
$$ Real data points
##PAGE= N=1
##DATA TABLE= (X++(R..R)), XYDATA
$$ [...]
16216A4710k0752k3757j9621k1422k3455k4531k0505K2346J332j6211N8252K4007
16204d9607O287M2198M1279N2142o4319m7250r9318m3864O6041P4906Q709J894
16192a0902K7816M708l8882M1256J555m2294K5347M2021l1665n4350j5585M0390
16180a0585L8573K773n9152n2471N6930K8751J2722j2530K3368O5601O5024j5310
16168A43694k7148l3454l6502J1853j7070Q242L6793L8918k5316k1276n6514j987
16156B0233N6457j2816o1176K4041K7986k659j4245L1486o0885k155Q471j7816
16144c078k2828J8111j8936L0138J1115m1285l6203K5445K418k694O877L0791
16132a29L0708m7160p2194k5902L7742P963N7875L3618n3077o0650p880L6913
$$ y = [14710, -6042, -29799, -49420, -70842, -94297, -118828, -139333, -116987, -115655, -131866, -73614, -49607, -43320, -1122, 40157, 92299, 27980, -19270, -118588, -162452, -96411, -21505, -12796, -10902, 16914, 21622, -17260, 23996, 25551, -16743, 8604, 50625, 18960, -35390, -50975, -10585, 27988, 30761, -28391, -80862, -23932, 4819, 17541, 5011, 28379, 93980, 159004, 143694, 116546, 83092, 46590, 58443, 41373, 49615, 86408, 125326, 100010, 78734, 22220, 20233, 76690, 63874, 2698, 26739, 54725, 52066, 37821, 69307, 8422, 6267, 14738, -3078, -25906, -7795, -26731, 3407, 14522, -26763, -62966, -37521, -35103, -37797, -30920, -129, 30579, -16581, -88775, -114677, -76935, -68972, -11097, 22521, -30556, -91206, -99086, -62173]
16120f2173N5119m6319P772k435M9064L0317r069K3551m2056m1689L5547k7024
16108b9395K9863M4017K4309m4727l3621K2998L9120n7939O566p2109o3856M1724
16096i3050Q5003K4408N0341M8372N685r9275q2266o98J3761J7249M3036j5976
16084c410j3066Q102N981K4457j4474l4664J0336K0199k9961K327l2766j9165
16072g6104J6404K6559K1593j0853J3226m0894l5219J1305L9263L9665j7982L9739
16060B6702j9607j00423k9462N636k6836L3632N2283L2703m3823k9803k0173M4352
16048g4819O6789N4170L6136j6490p9427j1303l3513n295K2694L5470J6537K6706
16036C7655m346M2099P970J7818N913o1354k2634M1562k1721j7888k700O21K3012
$$ y = [-62173, -7054, -53373, -45601, -48036, 1028, 31345, 22276, 45827, 3771, -37918, -2371, -29395, 468, 44485, 68794, 24067, -9554, 13444, 52564, -5375, 1191, -70918, -134774, -93050, -8047, 16361, 66702, 115074, 120759, 21484, -60782, -61480, -47719, -30470, 12566, -3410, -16476, -8374, -2393, 22064, 7590, -27074, -16738, 3461, -26500, -24173, -56939, -76104, -59700, -33141, -11548, -22401, -9175, -50069, -85288, -73983, -34720, 4945, -13037, 26702, 7095, -93328, -122790, -117154, -143990, -110358, -58075, -25372, -69195, -98998, -119171, -74819, -8030, 46140, 82276, 65786, -13641, -24944, -58457, -63752, -41058, -5588, 10949, 37655, 33309, 75408, 83378, 101196, 107109, 45755, 23121, 64683, 42962, 25074, 22374, 22995, 46007]
16023D6007r412n862O071K1747l8824l9092n7119K1568L307q647J2087M939p452
16010e0682J5891l4520q935O4902M4020M0527K7792p3421j0483j7348j249J5416
15998A1910l311O563K4785M4574j8522n3249l9415J0114L6740Q4610K1226l7882
15986H8143p1300n0748P639k650o4364j3129q638l669m090M3911J844K5871L3378
15973a7802J134n585M0373j4386l9860r42J9914J8233j9054L9895J5087n7533
15961b0526j9572M345J5563K2112l1588o0919k5692O0587M1991j21l4726o6646
15949a15192n0130R1129M7437l1383J6537M665k1809O391K8472J8462K6806K2552
15937D3937j5581M9585l6225p3877k9550o102J6452K3878K1408Q444M842m38j6448
$$ y = [46007, 36595, 30733, 36804, 58551, 19727, -19365, -76484, -54916, -51609, -60256, -48169, -43230, -50682, -34791, -69311, -78246, -13344, 30676, 71203, 98995, 25574, 15091, -2257, -3506, 11910, 8599, 15162, 39947, 84521, 65999, 12750, -26665, -16551, 20189, 104799, 126025, 88143, 16843, -33905, -26266, -28916, -93280, -106409, -115047, -118716, -122806, -78895, -77051, -51180, -17802, -16668, -22253, 18120, 3734, -36126, -37068, -17154, 1079, -17975, 21920, 37007, -20526, -40098, -35753, -20190, 1922, -29666, -90585, -116277, -55690, -13699, -13820, -48546, -115192, -165322, -74193, -26756, -58139, -41602, -36937, -58746, -52355, -23883, -5421, 21385, 43937, 28356, 77941, 41716, -32161, -61711, -67813, -51361, -27483, -6075, 2369, 7211, 6773, -9675]
15924i675m6287n4512L0651L8957J7604j4846k720Q623Q364O803j969j7122O7751
15911C1622J9636K2946k3738o5098k1343L4818k2484K2519J660J336K3678n64
15899B4988m6837l2834N796m471N7674K6837l13l0847j226K4418R838K1127k0074
15886C4076M301l0813o530Q1021K745n6415j3529N899J4740K2679k4331m4682
15874a0839k7202l07k8349n1505K8592K0209K9632M514L89k8714J8024K9872O7931
15861E2247l609K6660m3683o617m3517q971O945K8940j4355n6384J8664O0620
15849A6940j6167J275p990m0050n736o2359N799R061R4819P4981N873K7395j5109
15836H8732m1887m3206r7556M1357Q1154m595l1673o318n081j9187J9089J8280
$$ y = [-9675, -55962, -110474, -79823, -40866, -23262, -38108, -40828, -32205, -23841, -17038, -19007, -36129, 31622, 51258, 74204, 50466, -14632, -35975, -1157, -23641, -1122, 538, 1874, 25552, 24988, -21849, -54683, -48887, -53358, 4316, 31153, 30840, -7, -1233, 23185, 33023, 54150, 34076, 38377, 7564, 1034, 82055, 84800, 28385, 14856, 20755, 35495, 58174, 33843, -10839, -38041, -38348, -66697, -118202, -89610, -69401, -39769, -35255, -34866, -63580, -45556, -15684, 52247, 48638, 75298, 31615, 24998, -18519, -27490, -20545, 8395, -5960, -62344, -43680, 16940, 773, 2048, -5942, -45992, -51728, -114087, -108288, -99227, -4408, 70573, 76446, 103841, 88732, 46845, 3639, -93917, -52560, 28594, 23999, -7674, -13992, -19073, -38260, -19171, -891]
15824h91j7221j0581L9471L7281j4272m656m5796l9475P0663M4771P2160L7063
15812A68517n1040n4679K0290P73J8522l3000n7186p8585l115R040R729j2420
15800f3154J2273N1974m9834k6957k2090o684J3717M7794N1528j7039l6741p034
15788e2247K3799N0239k1573m0102Q2316O9385N965j2092m5388q0447l4349n0793
15776a05287k1806R3097L1816n5796l2298M4681m8656k3241j1821M5550Q0021
15765c740L2456l9731q521P802J7148p559k9307J0207J6978K0566K17K5087k6061
15752A5542j9483K6768K9038j5753l7830N8264M0523n8716l3780k0862l167L4542
15740A5086k3831m8455o5677M587M4529M0428R994K9291j8628l5592j4755k8341
$$ y = [-891, -18112, -28693, 10778, 48059, 33787, 29131, -16665, -56140, 14523, 59294, 131454, 168517, 117477, 62798, 83088, 83861, 102383, 69383, 12197, -66388, -69503, -60463, -50734, -63154, -50881, 1093, -48741, -75698, -97788, -104472, -90755, -42961, 8567, -8472, -45213, -52247, -28448, 21791, 218, -39884, 42432, 111817, 117782, 105690, 60302, -20145, -54494, -105287, -127093, -33996, -2180, -57976, -90274, -45593, -94249, -117490, -129311, -83761, -3740, 28716, -11015, -19536, -11734, 5414, -2145, -31452, -21245, -4267, 16299, 16516, 41603, 15542, -3941, 22827, 51865, 36112, -1718, 56546, 97069, 38353, 4573, -16289, -19456, 15086, -8745, -57200, -122877, -118290, -73761, -33333, -23339, 5952, -12676, -48268, -63023, -91364]
15728i1364K0207K2295L6237O0345j1093l1881n8617n1406L7417K6899L1550K4671
15716A5260M3661n64m4085K3352j710K439p890L7931L0594j3703q867J1870K8755
15703A17043j944j9254l2471l8523Q982j4796K480q840k2414q149K7345j35k9665
15690b0341k2014M6094N1868J0647k8504k0027K6555k420n3956j1307l877J4889
15678a2393L5795O86m2404j543L8333Q608k7526p2244l7964M9626L9593P81M7068
15665B6416J9091l9014L3982N4134j6113k0555O6389O7465k386m133n5440P814
15653A37650j1342n5270M299J5704M4906o366l3988K6189N6113o605j3747L24
15641A57867o5463m7444N127O708q632M4972k7662r2849m1458O652N2049M4932
$$ y = [-91364, -71157, -48862, -12625, 47720, 36627, 4746, -53871, -105277, -67860, -40961, -9411, 15260, 58921, 58357, 14272, 37624, 35914, 38353, 30463, 68394, 98988, 85285, 76418, 88288, 117043, 115099, 95845, 63374, 24851, 33833, 19037, 21517, 12677, -9737, -17886, 9459, 9324, -20341, -42355, 3739, 55607, 66254, 37750, 17723, 44278, 41858, -12098, -23405, -27282, -12393, 23402, 24088, -18316, -19859, 18474, 27082, -444, -72688, -110652, -61026, -21433, -20652, 26416, 45507, 6493, 40475, 94609, 78496, 57941, 124330, 191795, 189409, 185276, 129836, 137650, 126308, 71038, 75337, 91041, 135947, 129581, 95593, 121782, 177895, 171290, 157543, 157867, 92404, 44960, 50087, 56795, 48163, 93135, 65473, -27376, -68834, -62182, -10133, 34799]
15629C4799j5281k048l0042o689M373l0603j0172P1090J1733m9030K6408j6384
15617a1846J4008k1979K2392O2572O0665K4746L8932K7253o3460n9383J6817M8916
15605A59633J2972j4322j07604j08475n5j8063P227K2769O6767J8772J6612O816
15593F3049m2566Q645J2718l6990j1331K0550N5512N3694r246l2554k9541k812
15581D9128l9599o0485N35O3172O4336K1655k5102l3919M7957j1802L1210N238
15569A12324n1464l6132J6516l7222k1360n805O091L243M37R184K0366m671J5462
15556B6969k4970M6272O7100L7216o1548o7028J3666O576k8707m2466p909K1291
15544a3538M0703L4975Q4275O5587j9534j12145k6216j7517o5346o7151N3313
$$ y = [34799, 19518, 17470, -12572, -19261, -14888, -45491, -55663, 15427, 27160, -21870, 4538, -11846, 2162, -19817, 2575, 65147, 125812, 150558, 189490, 216743, 153283, 93900, 110717, 159633, 172605, 158283, 50679, -57796, -57851, -75914, -68687, -45918, 20849, 39621, 56233, 63049, 20483, 29128, 41846, 4856, -6475, 14075, 69587, 123281, 114035, 81481, 51940, 49128, 9529, -50956, -50421, 12751, 77087, 98742, 73640, 39721, 87678, 75876, 107086, 112324, 60860, 24728, 41244, 4022, -17338, -23143, -17052, -13809, -13372, -4188, 16178, 11507, 26969, 1999, 48271, 115371, 152587, 91039, 24011, 37677, 44253, 15546, -26920, -34829, -13538, 27165, 62140, 146415, 212002, 192468, 80323, 54107, 36590, -28756, -95907, -42594]
15533d2594Q6453K4561j5157P070J0933O433K6355J4474n7758k3965K901K8365
15521F8071K6341k042o0559m2486K3217J441p8060n1615L9471R2762P525R270
15509C3336o247o0934K8007K8663l6416j4237m501N1151K7669j382Q057k346K4630
15496G5450l5131j6519p570j7035o9595k49M0407O7565R36m0329J1619K2288K833
15483C4670j5917l5328J5420m2672o7425P74K0189J1996L7461L359N7924R0407
15471A10858J6524l0843o3129m9909N5471L3405n4377k1281k4867j246l6893O158
15459f0129L8583N6627j5675K8269M636k8890m3097j7132k998O0666P602l2588
15447d126j567q418j152l6434P989k0624J6496j0502k244M8997j1740K7315J8669
$$ y = [-42594, 43859, 68420, 53263, 60333, 71266, 77699, 104054, 118528, 60770, 36805, 39706, 68071, 94412, 92370, 31811, -10675, 12542, 13983, -64077, -115692, -76221, 16541, 24066, 33336, 27089, -33845, -5838, 22825, -13591, -27828, -32329, 18822, 46491, 45109, 53166, 50820, 75450, 40319, 23800, 16230, -805, -70400, -70649, -30242, 37323, 38259, -2070, 9549, 31837, 34670, 18753, -16575, -1155, -43827, -111252, -110478, -90289, -78293, -40832, -37473, 20451, 110858, 127382, 96539, 33410, -16499, 38972, 72377, 18000, -3281, -28148, -29394, -66287, -60129, -21546, 35081, 19406, 47675, 52311, 23421, -19676, -36808, -39806, 20860, 28462, -4126, -5693, -14111, -15263, -51697, -43708, -64332, -47836, -58338, -60582, -11585, -23325, 3990, 22659]
15434B2659K3224o468m1568k8972j0735o340q041j5331Q725n986K7635M8980l812
15421C970l5021P188R3011m8470k4384J9202l0223J5058L1771o1978l8753J6957
15409e1672L8163L6031k0977m2131J6705M5832M1149j6040n0797m1000m1694K838
15397h3593L6699L1015q265l9238P785k5217k4763Q511O5776J7622N1092K2546
15385E9970J0643k1570k6224m2018o6017k6938O5878L4500P034k6225K4626j6599
15373b2940K2594M4763m9732k5663n8104r326q34j7853K070J5742J54M9784O0956
15360A1611N7530j2611p4854k9533M2778k2561m4150L088q2747Q997Q5410P6700
15348A9658l1637n9819k826O1906M7147J213l595m2299m227j2816M0579l6238
$$ y = [22659, 45883, 39415, -2153, -31125, -41860, -48200, -56241, -71572, -62847, -68833, -41198, 7782, 3970, -31051, -23863, 69148, 20678, -3706, 15496, -14727, 331, 32102, -29876, -68629, -51672, -13509, 22522, 1545, -40586, -23881, 21951, 63100, 47060, -3737, -44737, -86431, -83593, -46894, -15879, -24144, -63382, -55597, -80814, -105577, -97066, -31290, -13668, 37424, 59970, 70613, 49043, 22819, -19199, -85216, -112154, -46276, -11776, -4742, -30967, -6341, -22940, -346, 44417, -5315, -30978, -89082, -98408, -99242, -117095, -115025, -99283, -99129, -49345, 11611, 69141, 56530, -18324, -47857, -5079, -27640, -71790, -68702, -151449, -142452, -57042, 19658, -11979, -71798, -74624, -12718, 34429, 35642, 32047, -10252, -14479, -27295, 13284, -22954]
15336b2954r125O5507j5800n4751J4729J08466N5918q552j5665J9273l9653l4697
15324F2696m168j8546q3412n1603K4520r03J3722k5946J9826j3428k873O9023
15312a1092O9795K7500P693k0887l1597j4065j0696m1713R087L2737J5490k029
15300C0223k6462k723k4646M851L7752N325n5923n4261M7803K8550M5666L9804
15288G5959j7863n3348j8115l1503L1377L2067J3909M844J3077n4354j651J0619
15276E018l4144N698M8592K9570p0458L284N3899L3227j6502K241K5967k5022
15264F1370n0395J3572k8666J9452k6772l807M5965L0557o5519L1717N7831n3840
15252C1465j28302L0112M6751J9821k2033q019K151N2117N495R804N81L7352K3614
$$ y = [-22954, -32079, 33428, 17628, -37123, -22394, 86072, 141990, 133438, 117773, 137046, 97393, 62696, 58528, 39982, -43430, -95033, -70513, -71416, -57694, -83640, -63814, -77242, -80115, -11092, 58703, 86203, 93896, 73009, 41412, 27347, 16651, -25062, -15975, 16762, 32252, 30223, 3761, 1038, -23608, -18757, 18995, 24320, -31603, -85864, -38061, -9511, 36155, 75959, 58096, 4748, -13367, -44870, -13493, 18574, 32483, 37327, 50404, -3950, -5601, 5018, -29126, -23428, 25164, 54734, -15724, -12440, 41459, 74686, 58184, 60425, 86392, 61370, 10975, 24547, -4119, 15333, -11439, -15246, 30719, 61276, -4243, 27474, 85305, 31465, -96837, -66725, -19974, -153, -22186, -30205, -28054, 24063, 29558, 39362, 39943, 77295, 100909]
15239A00909q3417j03154m577M8150K4633L5234N2419K4953L971l1426l5494Q8350
15227A20551o617r189l5338n0046k24K9243k9667l0363M6621k69n8734m3718o639
15214g4389Q6260N5227r535p899k105J7858n895k664N571j4777k4931o354l763
15201A2604K2143o531P546L0589m8313n8464p2169K8314O7405M9954K1228l4663
15189A9643n0400o3307l510K7707P2994L4178l5371l417P607k9401J4822K6704
15177A8249j6668K4102O7746M640o215n0251j2773J6365j0413J8852l9741o0290
15165d6397J2673J8860Q297R243r9752l753J11409L8181m3853k323j0416o329
15153a4160K0470J1196r066k6338j0577l1659J3175K9042K0981k5541L71L0881
$$ y = [100909, 17492, -85662, -90239, -42089, -17456, 17778, 70197, 95150, 99121, 67695, 32201, 120551, 113934, 104745, 69407, 19361, 19137, 48380, 18713, -11650, 34971, 34702, -24032, -67750, -74389, 11871, 67098, 57563, 49664, 47559, 65417, 59522, 56858, 62429, 47652, 22721, 16367, 12604, 34747, 28216, 35762, 66351, 18038, -40426, -112595, -84281, -16876, 33078, 54306, 19643, -30757, -94064, -97574, -69867, 3127, 37305, 1934, -1483, 6124, -23277, -8455, 18249, 1581, 25683, 93429, 98069, 91854, 41603, 28830, 45195, 34782, 53634, 13893, -46397, -33724, -14864, -6567, 2676, -97076, -100829, 10580, 48761, 4908, 2585, -7831, -14160, 6310, 17506, 8440, -17898, -28475, -60134, -46959, -17917, 3064, -22477, -22106, 8775]
15141H775J9972Q6244l79n4801r1829j6580N0366J6422N1133l4026k0018r699
15129E580M7189n6248l2275L5617N1336R173j7750j9410j954P572L397l465R981
15116C8743k6626K4547L36m744j8082j8253m5881l6002L9669L8639N8664K329
15104E3339k2794K3158m773K2833r714j7766o562K4278K6590j10572l8620M5382
15092a5221k385o769m2906o0799L0776M9907k9865j2613j6248O141O8574M8280
15080A6872L087M6511N2645j6709r7998o7596Q258N2567L2746j2483k5925m5720
15068e3745j3180J030M2834N0017L016n1917r6845l6657K7207J28135m0452n9992
15056a00549L7126N3179j42m8708j859n072o307K761J9518M7254k875j7825j7793
$$ y = [8775, 28747, 114991, 114612, 59811, -32018, -48598, 1768, 18190, 69323, 35297, 15279, 5580, 52769, -3479, -35754, -137, 51199, 60372, 42622, 23212, 21258, 28830, 32227, 28762, 38743, 12117, 36664, 37000, 32256, 14174, -4079, -49960, -85962, -46293, -7654, 51010, 53339, 30545, 53703, 48930, 71763, 62049, 44283, 37721, 61999, 88589, -21983, -60603, -15221, -17606, -24375, -67281, -128080, -97304, -47397, -77262, -89875, -106123, -99982, -31408, 16872, 19959, 66470, 119115, 102406, 4408, -63188, -54930, -2363, 30383, 17900, -8025, -53745, -66925, -65895, -23061, 26956, 29972, -21945, -118790, -155447, -128240, -105, -40557, -100549, -63423, -10244, -10386, -59094, -60953, -66025, -72332, -69571, -50053, -2799, -5674, -23499, -41292]
15043d1292m2373p2612j8129J2656k1572N2810P5715L3561l6101n108N6098l2257
15031c8604p93n801L8341j5480Q802N5231k0204k3444o860j9142J7528k2621k6315
15018e9362J6745N0412L5665K0983l0227L2287k0599m0853j7681n1685k9978N2873
15006d1420P7265l0105K1160N806l9815k9933n793M2696L9187j3296l5866Q665
14994a449j395l8402K7887O8258P32l6799l5406p071K4607j520j9741k2033l3685
14981g6017N7968M8702l6608o086M963l1503J9649O2372L6935j9844r500k3256
14969B7775k9162k1374J3179l1356K4741Q7558j705J7812R803m5206n1501m3767
14957d3203m207j8699o564J3568J3055J9322L226J8972l8562p0467J4135L0167
$$ y = [-41292, -83665, -156277, -174406, -161750, -183322, -130512, -54797, -21236, -57337, -62445, -6347, -38604, -39397, -45198, -6857, -22337, -13535, 41696, 21492, -1952, -8812, -27954, -10426, -33047, -59362, -42617, 7795, 43460, 64443, 34216, 66503, 45904, 5051, -12630, -64315, -94293, -41420, 35845, 5740, 26900, 32706, -7109, -37042, -42835, -139, 39048, 25752, -10114, -1449, -2844, -41246, -13359, 54899, 55631, 18832, -16574, -23645, 962, -558, -20299, -42332, -76017, -18049, 30653, -5955, -12041, -7078, -38581, -18932, 43440, 80375, 60531, 51031, 27775, -1387, -22761, -9582, -40938, -16197, 71361, 69656, 87468, 97271, 52065, 564, -43203, -47410, -66109, -72673, -59105, -46050, -26728, -23502, -4530, -43092, -113559, -99424, -69257]
14945f9257L8579J593K5960R629K9525O41J147m759n2406m5997n8814K4651R056
14932i0452L2275M6686P795r427J6693N285P545k5757K5461o7680K1115Q1554
14920E1093J4600j8312k2073M0348m2095R866J1569p0397K094N2989m1546l7162
14908d9026Q789l1253l743j8079L3867k8261q2967L1891L6745R5348M8805m7471
14896e355J6013n9818j2880K6097L9316J7599l469L1869M8150p364l3049l4258
14884B2851n9121k2081N9946K7084j728k20q5926n8068J680N6746N6206K8443
14872B5812J7983j6184K4016J9098l2592n2030J4358N8210l1590K5243K7402N930
14860H5656k7942l1722r535m512o675J7624N8030K7956N7130l6140J106k4231
$$ y = [-69257, -30678, -29085, -3125, 6504, 36029, 36670, 37817, 33058, -19348, -65345, -124159, -99508, -90452, -58177, -11491, -3696, -13123, 3570, 8855, 16400, -9357, 16104, -51576, -30461, 51093, 65693, 47381, 25308, 65656, 23561, 33427, 44996, -25401, -23307, 29682, -11864, -49026, -40237, -71490, -75233, -93312, -59445, -87706, -170673, -138782, -102037, -6689, 42116, -5355, 10658, -49160, -62040, -35943, 3373, 20972, 17503, 49372, 97522, 90158, 57109, 22851, -36270, -58351, 1595, 28679, 26951, 26731, -59195, -117263, -115583, -58837, -2631, 25812, 43795, 27611, 51627, 70725, 38133, -13897, 461, 58671, 27081, 52324, 79726, 85656, 57714, 25992, 16457, 11945, 5270, 22894, 80924, 108880, 166010, 129870, 130976, 106745]
14848A06745o3394k9373o0636p1448J3319M1182N038J5213O1547R9858l0467q0435
14836G149k132J0059m6154N7367Q1140j648K6706K6039j6208m1823p5821n8106
14824c3432M015L0321M3258k3909j6706p1901L724M1192j2374J46J318P769K6594
14811A5L7466K5000o027K0673m2829p6014k4265p6418L3659M7074J3302L6786
14799a1578O2776O3383l3851n0304j747L3057o01j2991O620k2266q842K1547L5133
14786H0336j1527j7609j2314k0512P9446N1373l7196l8679j5517K596o5343k3937
14774b8883K138K359j3906L0802K0807L989L4027Q238k5541L9097j3663j2069
14762D7395Q859j4094k1254J1816j3014J0588j8877J0532J3181O4447J0916j7046
$$ y = [106745, 43351, 13978, -46658, -118106, -104787, -63605, -58567, -43354, 18193, 118051, 87584, 7149, 5017, 15076, -31078, 26289, 107429, 105781, 132487, 158526, 142318, 100495, 24674, -33432, -29417, 904, 44162, 20253, 3547, -68354, -64630, -23438, -35812, -35666, -34348, -26579, 15, 37481, 62481, 56454, 77127, 34298, -41716, -65981, -142399, -108740, -61666, -48364, -11578, 51198, 114581, 80730, 30426, 28679, 61736, 61135, 48144, 54764, 32498, 23656, 45203, 80336, 68809, 51200, 38886, 18374, 97820, 149193, 111997, 73318, 57801, 60397, -4946, -28883, -26745, -24386, -38292, -7490, 13317, 17306, 51333, 59571, 34030, 73127, 59464, 47395, 56254, 42160, 20906, 32722, 19708, 30296, 11419, 21951, 35132, 99579, 110495, 93449]
14750I3449r098o408l4005N993Q924p2713j3318M0509J9286N3166j462m5385J8643
14737E7581l569N5302k758j5991n6529k5085m8065J3021K2303l279j6314N3525
14725C0142n4165l507r175j1331M1886L0151r885l544K4932J0823L6506o5409
14713A7424N4234J0582N367K6976q794l5475n4580L685j0432m986M2055j0629
14701C5427j8332K407k6665O0134O886N813L1159j124m6659m5364k2964L2164
14689A2882K8280R891N4144J3152n4671L3839O4786k0097l578j8228M8964N7688
14677B27052l0606L4868k256l567K8587O3635J65479J66974J12365J06896P3496
14666I42923P7805J59785J61660P1063n82K4911l1917k0744p5663j29359j32313
$$ y = [93449, 84351, 77943, 43938, 49931, 58855, -13858, -27176, 13333, 32619, 85785, 84323, 38938, 57581, 54012, 109314, 106556, 90565, 34036, 8951, -39114, -26093, -3790, -7069, -23383, 30142, -24023, -27530, -36705, -48036, -6150, 24001, 14116, 10572, 35504, 46327, 82833, 17424, 71658, 82240, 87607, 114583, 105789, 70314, 15734, 19419, 8987, 4001, 46056, 35427, 17095, 19502, -7163, 52971, 59857, 65670, 96829, 95705, 49046, 3682, -19282, 12882, 41162, 51053, 105197, 118349, 63678, 97517, 162303, 142206, 138628, 120400, 169364, 227052, 196446, 231314, 229058, 225491, 254078, 317713, 483192, 650166, 762531, 869427, 942923, 1020728, 1180513, 1342173, 1413236, 1412654, 1437565, 1405648, 1384904, 1309241, 1179882, 1047569]
14655A047569j03065o8171q8642j25329r5388q4882n5220k3419j6738n2646n0025
14644B84044K9299L8034n855o9302k1034P727N9241m4840o2410l6054m0468O877
14632A45259J1297l6576k3371N6844L3072p487M3249N5338o661j07775q3867j43
14620G9179O7801M0892l7197l7478l1546K8708L7787L069k5246l4752O1987P4825
14608B28029O0512k3373n0971k2126o113N719j1559J3437j0451J0352j1790P1401
14596B53067M2648O419j5082o221R707m783M5327L8109l0958n1285k837q003j5784
14583B60324m160j9657n7589j2040m5708L0623L9398L8309j3746p4329m6044N6362
14571A51743L8695m3198n0127L9698L7468l8825K0937K0108l1212k2998k2780
$$ y = [1047569, 944504, 876333, 787691, 662362, 566974, 482092, 426872, 403453, 386715, 334069, 284044, 313343, 351377, 345522, 276220, 255186, 262913, 322154, 277314, 214904, 178850, 138382, 145259, 156556, 119980, 96609, 153453, 186525, 179038, 222287, 277625, 270964, 163189, 79322, 79179, 146980, 187872, 150675, 113197, 81651, 110359, 148146, 151215, 125969, 91217, 153204, 228029, 288541, 265168, 214197, 192071, 185958, 191677, 180118, 193555, 183104, 193456, 181666, 253067, 295715, 302134, 287052, 280831, 290538, 285755, 331082, 369191, 338233, 286948, 284111, 276108, 260324, 256164, 236507, 178918, 166878, 121170, 151793, 191191, 229500, 215754, 141425, 95381, 151743, 190438, 147240, 97113, 136811, 174279, 135454, 156391, 176499, 145287, 122289, 99509]
14560I9509r835P274j7466k0131k4334l6333L6995j5650N5569O6525n1414p168
14548H3541N098L587N9878J4668n1279p3007J2090r579K4459K8240m072K2170
14536A15794P013n5123M4553J9866n7836l2926J0957j7076m410K2631K8162M493
14524H6098l0422K3505k0777j7824Q876p543l1318L1855l8370K5038p573r821
14512A1724J0670N526K3734M7023J9635m287o9174l9345L4577N8761L5047J4267
14500A48158l6651J8161k1598K0765J1101n7571m6509L0801k2531n8518q088O6565
14488D4085j4724k0301K4148k3021m6248k4102O5977O4241J7973J8516n8986L3037
14476H0595K1811l4548K0099L7565J5700M260n389k1226J4656j3318j441M5271
$$ y = [99509, 89674, 96948, 79482, 59351, 35017, -1316, 35679, 20029, 75598, 142123, 90709, 83541, 88639, 92226, 152104, 166772, 115493, 42486, 54576, 44997, 69456, 97696, 93624, 115794, 122807, 67684, 112237, 132103, 74267, 41341, 52298, 35222, 30812, 53443, 81605, 86098, 55676, 79181, 58404, 40580, 49456, 41913, 10595, 42450, 4080, 29118, 21545, 11724, 22394, 27920, 51654, 98677, 118312, 114025, 44851, 5506, 40083, 98844, 133891, 148158, 111507, 129668, 108070, 128835, 139936, 82365, 35856, 66657, 44126, -14392, -22480, 44085, 29361, 9060, 33208, 10187, -36061, -60163, 5814, 70055, 88028, 106544, 47558, 80595, 102406, 67858, 87957, 125522, 141222, 145482, 140093, 118867, 133523, 120205, 118764, 164035]
14464A64035K1688r284m4995j5265N2198M1735O4866p379q3368L410O3623n482
14452B45782o2702o4953P15j1923N9952R94n5227q438J4806j4554K474l250m0923
14439F2753j914O6116l7559l8868K6340N2988K5059m592n3608J1080K488o4737
14427D5546L2424j4793P539j6672Q225p198j8930J1842m370m566j8849j2800J6302
14414B3700L5959M8578P362l98j0370j2607m7493p4783m2099O7293O5622m3968
14402A6796K8M0099J9547k2769j5113N7500l0133O932l968K9636o4260o4740K0139
14389a0306k3823J0615O509j714K7173P7099J8821K6948O2006M7015k4948l7405
14377A77990l2634o2805o0272J7468J1943k6890L101J5816J2318j9468P5978J4658
$$ y = [164035, 185723, 176439, 131444, 116179, 168377, 210112, 274978, 267599, 184231, 187641, 251264, 245782, 183080, 118127, 118842, 106919, 166871, 167865, 112638, 104200, 119006, 104452, 106926, 103676, 62753, 60839, 126955, 89396, 50528, 76868, 129856, 154915, 150323, 96715, 107795, 110283, 45546, 77970, 63177, 70716, 54044, 62269, 55071, 36141, 47983, 43613, 39047, 20198, 7398, 23700, 59659, 108237, 115599, 115201, 104831, 92224, 44731, -30052, -72151, -4858, 60764, 16796, 16824, 56923, 76470, 53701, 38588, 96088, 65955, 72887, 68919, 98555, 34295, -30445, -10306, -34129, -23514, -17005, -18719, 8454, 85553, 104374, 131322, 193328, 240343, 215395, 177990, 145356, 82551, 22279, 39747, 51690, 24800, 27901, 43717, 56035, 36567, 112545, 127203]
14365A27203l0481J2654O0150l6561o3188K1783L9491J3046l0250R5938N3204
14354B62989L7301l6908n0532J4565K1244k1035j6137r8507o5338P315P3305R3423
14342B21685K2406L329M3914N9130j017m9167p2691K4326K8878J9361q237l8569
14330B53348k743j6653j606n475J3483J5744j3864L2690L3343p0120o5520K1877
14318A94504M760J406q78l6197K3188M0155M3280o403q51J2227N2810K05M4200
14305C72406M1998j00170M0194M0923N325k225J2848k7903K1928L4774K6101L5490
14293E01689k0496l3767K7595O5733J273o742R596k2495l6640M8290N2894k2254
14281E64676K9524P0599O8249J7019j4439j787q404K1181O2239J1577k32K8450
$$ y = [127203, 96722, 109376, 169526, 132965, 69777, 91560, 131051, 144097, 113847, 209785, 262989, 300290, 263382, 212850, 227415, 248659, 227624, 211487, 112980, 47642, 54957, 128262, 221685, 244091, 247420, 291334, 350464, 349447, 300280, 227589, 251915, 280793, 300154, 291917, 253348, 250605, 233952, 232346, 226871, 240354, 256098, 242234, 274924, 308267, 238147, 172627, 194504, 199264, 200670, 199792, 163595, 186783, 226938, 270218, 263815, 262964, 275191, 328001, 328206, 372406, 414404, 314234, 354428, 395351, 400676, 398451, 411299, 383396, 405324, 440098, 466199, 501689, 481193, 447426, 475021, 540754, 542027, 535285, 544881, 522386, 485746, 534036, 586930, 564676, 594200, 664799, 733048, 750067, 735628, 733841, 725437, 746618, 808857, 820434, 820202, 848652]
14269H48652m969K6565Q145J124J193K8714L5278R2041K7429O8066J11094P2075
14257A315407J7359M6833Q8260M6876R5463J45212J37045P1149Q0792Q5682J36893
14246B266971J53387J91281J81180K58873K41746K63350L40687L30208M08986
14237D636669N26055N85591O67424P07376Q88888J026206J202146J386882J603556
14228A3230793J968705K348801K872004L488784M457436N529272O676514P874720
14220D8447029Q945677R765201J0127396R868044R047996P722996N777831L340258
14212A13042428N89079k218563m675045o576915p902112q670769q814377q549907
14204F6223819p976220p054284n886871m896505m082534l376804k798015k423008
$$ y = [848652, 843683, 870248, 878393, 879517, 880710, 909424, 944702, 1036743, 1064172, 1132238, 1243332, 1315407, 1332766, 1379599, 1467859, 1514735, 1610198, 1755410, 1892455, 1963604, 2044396, 2130078, 2266971, 2420358, 2611639, 2792819, 3051692, 3293438, 3556788, 3897475, 4227683, 4636669, 5162724, 5748315, 6415739, 7123115, 8012003, 9038209, 10240355, 11627237, 13230793, 15199498, 17548299, 20420303, 23909087, 28366523, 33895795, 40572309, 48447029, 57392706, 67157907, 77285303, 87153347, 96201343, 103924339, 109702170, 113042428, 113631507, 111412944, 106737899, 100160984, 92258872, 83588103, 74773726, 66223819, 58247599, 51193315, 45306444, 40409939, 36327405, 32950601, 30152586, 27729578]
14196B7729578k051454j858894j642573j325524j259170j165040j051018q74048
14188A6501857p42547o45747o53297n84608n42591m83538m48085m23989l90329
14179A1587126m14288l54358l15594l04108k63102k83933k85908l24800l11026
14170H730009k64874k25840k35612k38404j75294j58833k34967k57330k06689
14161F732166j59410j54697j76603j32534j86513j84605j97931j96082j85001
14152E158790q7418q4671m7779q2800j15574j00866j01617j10649j22647o1283
14142D243486L6588L16L7634K5030L6187m0014L546K523r3706p0386j67140j48674
14130C865390r5155j69740j45247j41761j46617m5970q4929j71385j30094q4771
$$ y = [27729578, 25678124, 23819230, 22176657, 20851133, 19591963, 18426923, 17375905, 16501857, 15759310, 15113563, 14460266, 13875658, 13333067, 12849529, 12401444, 11977455, 11587126, 11172838, 10818480, 10502886, 10198778, 9935676, 9651743, 9365835, 9041035, 8730009, 8465135, 8239295, 8003683, 7765279, 7589985, 7431152, 7196185, 6938855, 6732166, 6572756, 6418059, 6241456, 6108922, 5922409, 5737804, 5539873, 5343791, 5158790, 5071372, 4986701, 4938922, 4856122, 4740548, 4639682, 4538065, 4427416, 4304769, 4243486, 4280074, 4280390, 4318024, 4343054, 4379241, 4339227, 4342773, 4345296, 4251590, 4181204, 4014064, 3865390, 3770235, 3600495, 3455248, 3313487, 3166870, 3120900, 3035971, 2864586, 2734492, 2649721]
14120B649721o6138q7012q2149r8085l0848m1920j08256j02094j4753k2087p0206
14109A926173m2486l4622K550o5923r976k3422m6187k6937M2886J8993m4845l6082
14097A660122m6029m5193j4838M8406P4736M2623L8401K6762L4622n8020K0017
14086A781609J5118n3935p8727L5387M5108m9304p4501j15995q9230l0168k789
14075A382573k7181o5951o7373J25J9387J6979J0962o700O2600O5114O4052P7279
14063A531866Q3017N1965L2380J58981J75345K19453K23204L83054L70802M98187
14053C728254O34055O27176N53630K80796P5017k28744m22335n69585o27192n18750
14043C532322m13711k90832k43202k43862k53680j24933p4508o7048o9769j33023
$$ y = [2649721, 2583583, 2496571, 2414422, 2316337, 2285489, 2243569, 2135313, 2033219, 2018466, 1996379, 1926173, 1883687, 1849065, 1851615, 1785692, 1775716, 1752294, 1706107, 1679170, 1722056, 1741049, 1696204, 1660122, 1614093, 1568900, 1554062, 1602468, 1677204, 1719827, 1758228, 1784990, 1819612, 1761592, 1781609, 1796727, 1742792, 1664065, 1699452, 1744560, 1695256, 1620755, 1504760, 1415530, 1385362, 1382573, 1355392, 1289441, 1222068, 1222193, 1241580, 1258559, 1269521, 1262821, 1325421, 1390535, 1454587, 1531866, 1614883, 1666848, 1699228, 1858209, 2033554, 2253007, 2476211, 2859265, 3230067, 3728254, 4362309, 4989485, 5543115, 5823911, 5898928, 5670184, 5247849, 4678264, 4051072, 3532322, 3118611, 2827779, 2584577, 2340715, 2087035, 1962102, 1887594, 1820546, 1750777, 1617754]
14033A617754j35202j03076j20344o2413l0297K2746L3361o1685l7561k0545k7592
14022A075146K514m7648o2560k5416l8439k6915r014L6287J6098q5528j6614j20653
14010F97258r7425Q0724P3941P371L9156P25k4061l2489N2403o9196j5235k883
13998G10289l8565K674M5275l190k6223o7642o1846m5943j4622J6620m202j4030
13986D98595j6108j5076k0067m390m914m8173o2587q6978n1944K4552N2967L9384
13974C05261j062o841J4195k2493n9839n7936K205N6934q354J24r993P3828J0727
13961B96756O482k1981m6937M008l3219m0674L3675K9558N418l0176N7324k0191
13949B40043k530l9907K528J5165L0005O45k7783N688l1768r050M3300j0045p4910
$$ y = [1617754, 1482552, 1379476, 1259132, 1196719, 1166422, 1189168, 1222529, 1160844, 1123283, 1102738, 1075146, 1077660, 1030012, 967452, 942036, 903597, 876682, 867668, 903955, 920053, 834525, 817911, 697258, 599833, 680557, 754498, 761869, 801025, 801750, 777689, 745200, 797603, 728407, 713172, 710289, 671724, 674398, 719673, 716483, 690260, 622618, 560772, 514829, 500207, 516827, 512625, 498595, 482487, 467411, 447344, 442954, 438040, 389867, 327280, 240302, 188358, 212910, 265877, 305261, 304199, 297358, 311553, 289060, 229221, 171285, 173490, 230424, 222070, 222194, 212201, 286029, 296756, 303238, 281257, 234320, 238328, 205109, 164435, 198110, 227668, 233086, 202910, 260234, 240043, 237513, 197606, 200134, 215299, 245304, 245949, 218166, 223854, 192086, 183036, 226336, 216291, 141381]
13936A41381n0672N3006P4363l9216q1576j27676J5208O0163P2529K0585L1067
13925A69162p423O550K552K7846J8324jM474j6973p9270k1761L6782M2663J2372
13912A95297K3456N345J7114j6798l934J5654j075n356J4008l5745M6474J0999
13900B65439N612k3063l5131k7798o0142m3363M0812k585J6978k091K2397K9883
13888A86948K9365k1777J1869K3251n3868p3127j0037L505l3890j883j5526K8952
13876G3782N7177J7421m8248p8540N0453J12434j0296p844j8743j9385r457n1939
13864F6815L6064O8976o972N132j5612k72O912m4525n7546j0905R38K4885M903
13851G8793k1035N220j299j223p5487m7842O1666L0772l2999k037Q791L2134j684
$$ y = [141381, 90709, 143715, 218078, 178862, 97286, -30390, -15182, 44981, 117510, 138095, 169162, 161739, 168289, 170841, 198687, 217011, 217010, 221484, 204511, 125241, 103480, 140262, 182925, 195297, 218753, 224098, 241212, 224414, 220480, 236134, 235059, 229703, 243711, 207966, 254440, 265439, 271051, 247988, 212857, 185059, 124917, 81554, 122366, 119781, 136759, 134668, 157065, 186948, 216313, 194536, 206405, 229656, 175788, 102661, 92624, 96129, 62239, 60356, 44830, 73782, 130959, 148380, 100132, 21592, 72045, 184479, 174183, 166339, 147596, 128211, 118754, 66815, 102879, 171855, 164883, 170015, 154403, 154131, 161043, 116518, 58972, 48067, 49005, 73890, 78793, 57758, 62978, 61679, 60456, -15031, -62873, -1207, 29565, -3434, -5471, 3320, 35454, 33770]
13838C3770P917Q21l6047l2933Q796N1454P8818K9923q254n272M5870m516p3143
13825I7204j2314L591n4463m0814J142L8390j8388K8507L3557N1314n1317k2155
13813E4254M2989L0618p1924q0568N8155M8728k2663m0218j8229R831K3880K5670
13801F0523K4469m0239p2078L0411L6870o936J6673l5088K1075L9090L63l2341
13789D2792q1590n597O6363L5585k8296l961L2936q44J2299K6897j5768l4219
13777D6597l3959o050K2516N2707J9662J6692K2323j7908R0494J3895l8351m4050
13765A44568K2904P3475R8575N8611O1816Q3125N7899O3845K7338j7672m6882
13754F27602J8229k3090p4005p3875r8485k8441j5346l4231K8261O3683o474j00961
$$ y = [33770, 41687, 42508, 6461, -26472, -17676, 33778, 112596, 142519, 134265, 128993, 174863, 170347, 97204, 84890, 88481, 34018, -6796, -5654, 32736, 14348, 42855, 76412, 127726, 76409, 54254, 97243, 127861, 55937, -24631, 33524, 82252, 59589, 19371, 1142, 10973, 34853, 60523, 84992, 44753, -27325, 3086, 39956, 33020, 49693, 14605, 35680, 74770, 75133, 42792, -38798, -44395, 21968, 57553, 29257, 25296, 58232, 57388, 69687, 96584, 80816, 46597, 12638, 6588, 29104, 81811, 101473, 118165, 140488, 122580, 213074, 226969, 188618, 144568, 167472, 240947, 339522, 398133, 459949, 543074, 600973, 664818, 692156, 674484, 627602, 645831, 622741, 548736, 474861, 376376, 347935, 332589, 298358, 326619, 390302, 383828, 282867]
13742B82867l2643K0430p1442n1204p263J7709K386j492k0323k326J3102k0435
13730A29366N739J4311j5111j5737J5132L804l2757k134j562M286n765J6538J4589
13717A30699J946K5688K2882l1684L275k6160o9989R261J2387o151k7685K759
13705D7228k184J378N4352P3579L4138o1855j28448p430P0493k5033k3886L2018
13693F4350J3570K4895j8416l2136J4795k3861o0125k4591N8752N0464k4712q67
13681D2118N8930J858j22214m1211N9551P5624J5141l6814L2641K5190K046k2518
13669I0342r735m6962j0617p4131L899k1230M7497J6713J382M4674j0713l8837
13657g718M0033L192P276J3454J9604M2999N426l0766m4377k5008K8614J5095
$$ y = [282867, 250224, 270654, 199212, 148008, 140745, 158454, 160840, 159348, 139025, 136699, 149801, 129366, 135105, 149416, 134305, 118568, 133700, 137504, 104747, 102613, 101051, 105337, 99572, 116110, 130699, 132645, 158333, 181215, 149531, 152806, 126646, 56657, 65918, 78305, 72154, 44469, 47228, 45044, 46422, 100774, 174353, 208491, 146636, 18188, 10758, 81251, 56218, 32332, 64350, 77920, 102815, 84399, 52263, 67058, 43197, -16928, -41519, 17233, 67697, 42985, 42118, 101048, 102906, -19308, -60519, -968, 74656, 89797, 52983, 85624, 110814, 112860, 90342, 80607, 33645, 23028, -51103, -47204, -68434, -20937, -4224, -2842, 41832, 31119, -7718, 32315, 35507, 42783, 56237, 75841, 118840, 124266, 93500, 49123, 24115, 52729, 67824]
13645F7824K1651Q796k061m3165k9458j1445L3758j865m078j8246k854j0588K1432
13632B9701j6594l2366q9234O18M9264l896N4818L6651L5728L8087l6576j8771
13620D7430k1018l873k6205l781K7058K0648L9741k9018m5165l604Q430M184l210
13607A1617J7052r62j16246o462L697M123M760K5024Q1363R9827o4018Q402K465
13594G0642K9888m313n4579k0673J9755m5514K0656j1442N0373k072l1832n3256
13582c2367J9380M7376O8077L0819q9148q9053N5094K4943l5521l0962j5137P2647
13570B6148K2560l9439k3992q470j8810l1762q51M8343m095j1385L6865M5559
13558D0671j0703K4235k8055n5225K3766K0228k3224N968j9508j1516J7385J0744
$$ y = [67824, 89475, 98271, 96210, 53045, 23587, 12142, 45900, 44035, 39957, 21711, 18857, 8269, 29701, 13107, -19259, -108493, -107875, -58611, -62507, -7689, 28962, 64690, 102777, 66201, 47430, 26412, 22539, -3666, -7447, 19611, 40259, 80000, 50982, 5817, 2213, 10643, 14827, 11617, 28669, 27707, -88539, -95001, -91304, -87181, -82421, -57397, 23966, 123793, 59775, 68177, 70642, 100530, 96217, 41638, 20965, 40720, -4794, 15862, 4420, 54793, 52721, 20889, -32367, -12987, 34389, 102466, 133285, 44137, -44916, 10178, 35121, -400, -31362, -46499, 26148, 48708, 9269, -14723, -23193, -42003, -73765, -74616, -26273, -30368, -41753, -4888, 40671, 29968, 54203, 26148, -29077, -5311, 14917, -8307, -2339, -21847, -33363, -15978, -5234]
13546e234K6158K4370k0353K1499J8210j6368O25J6298l4364l9148l8269K403
13534d4173j5048J551K6349K1856k2300k9702l9095L1958k4176L2051K7434K7619
13522e676m871L2049M2682K4615j5161K2486l2140n1400k2963j2184N4244P3682
13510A05363j4534q0436j4713J6998J7827n747m0276k1501j6976L1763K3152P234
13498H154m0382j7119j5417L8407l4375M3579R6944l843N396j7889m6979l7801
13486b1325R001j2279j743M1438K5650j6234N8968m1565n0875n0330L5556K5518
13474A780j5042k1043j4917j3089M353J3360J3438l793J3969M6259K1095l6264
13462A0106J51J5798Q595k9139j1290M6555j5963m1127l4352L3438P2210L0593
$$ y = [-5234, 20924, 45294, 24941, 46440, 64650, 48282, 48907, 65205, 30841, -8307, -46576, -44173, -59221, -57670, -31321, -9465, -31765, -61467, -100562, -68604, -92780, -60729, -33295, -5676, -10547, 21502, 64184, 88799, 73638, 96124, 63984, 12584, -10379, -22563, 31681, 105363, 90829, 10393, -4320, 12678, 30505, 24758, -15518, -37019, -53995, -22232, 920, 8154, -32228, -49347, -64764, -26357, -60732, -17153, 79791, 75948, 81344, 63455, 16476, -21325, -12324, -24603, -26346, 15092, 40742, 24508, 83476, 41911, -8964, -59294, -23738, 1780, -13262, -34305, -49222, -62311, -57958, -44598, -31160, -34953, -20984, 25275, 46370, 10106, 10257, 26055, 34650, 5511, -5779, 40776, 24813, -16314, -50666, -17228, 54982, 85575]
13450H5575j0593K246K2297m5162o218l0151j4096k8277L4936L0709q3864k2532
13438f5130j0217L8178l7294k7506m857O747L4229L7612m4366l817l4787K2429
13426h8779M9318J760n9804j6215Q6513M910o1038j0563L8624n147k2347J3065
13414f9703L0444K3369Q954k52K1307l2654j6061J6575J7294J0914J3020k4348
13402a141j6478j076R98o876L0077R0941j6446j03413m5057j7674k6300P0385
13390d2060J8423M415K9519M4061J9421j3886l4864k8733K892k3698m401O808
13378b2103j6825M8646K1946K1537k1904q1542k118J9814N7078K742k2720M545
13366I096l6327N320L7882N7939m8749k4782L50k8220m334Mn792k8629J8267J2541
$$ y = [85575, 74982, 77228, 99525, 54363, 48145, 17994, 3898, -24379, 10557, 41266, -42598, -65130, -75347, -37169, -74463, -101969, -106826, -100079, -65850, -28238, -72604, -76421, -111208, -88779, -39461, -37701, -97505, -113720, -27207, -22297, -83335, -93898, -55274, -60421, -82768, -69703, -39259, -15890, -6936, -7188, 14119, -18535, -34596, -18021, -727, 10187, 23207, -1141, -17619, -18695, -17697, -24573, 5504, 96445, 79999, -23414, -68471, -86145, -112445, -42060, -23637, -19222, 10297, 54358, 73779, 59893, 25029, -3704, -812, -24510, -28911, -22103, -38928, 9718, 31664, 53201, 31297, -50245, -52363, -32549, 24529, 27271, 4551, 9096, -27231, -21911, 15971, 73910, 25161, 379, 729, -27491, -31825, -31821, -37613, -66242, -47975, -35434]
13352c5434K4053k2283l1024J8071K6448l278n981K0050m5070k261L6513j5827
13340c6023l872J3044m215K5870L0374l3035P731J5322L3339J6618j03828k6157
13328f4832L7182l0187M587o559M4092Q3020k7658K4761L1506r7958j8766J5668
13316e144L7737Q689n2364j9803j8207K194M6025j6263J7526J1365o946L5515
13304D0324j464n5576l4202l7055P542L7696l6436k8051k9890J3629P4489K772
13292d6222K860J070J647M9053N8374j7949n6702m759L7092J2645j1961J3119
13280C8267j1343K020m7720l4915J6656N57L755j0685M2814Q379j9903m4628R0992
13267C4246O291j8109j2990j4011l291M0641L9622l7085l9021k0740P010p992
$$ y = [-35434, -11381, -33664, -64688, -46617, -20169, -23447, -29428, -9378, -54448, -56709, -20196, -36023, -39895, -26851, -31066, -5196, 25178, -7857, -126, 15196, 48535, 65153, -38675, -64832, -27650, -57837, -53250, -59809, -15717, 67303, 39645, 64406, 95912, -2046, -20812, -5144, 32593, 41282, -11082, -30885, -49092, -46898, -873, -17136, 390, 11755, 4809, 40324, 38860, -16716, -50918, -87973, -80431, -42735, -79171, -107222, -137112, -123483, -48994, -46222, -43362, -42292, -40645, 8408, 66782, 48833, -7869, -12628, 24464, 37109, 25148, 38267, 26924, 28944, -18776, -53691, -37035, -36478, -32723, -43408, -594, 7785, -12118, -56746, 34246, 40537, 22428, 9438, -4573, -7864, 32777, 72399, 35314, -3707, -24447, -17437, -25429]
13255b5429p0321K7548R0136J7826k4185J2931m5727l2082J6215K988k7833m1735
13243i9668K1128M8459k2453m4858K7335l5496k3611J9538k162L4940K1926N7089
13231B167J7021l4617l5773k0526J9015N8436m6899m0013L1966l550m2657O489
13219h8941J8611M2511l706J718n6832j1504L962N6223k2275k9088n8724K676
13207a45369R7578O0555L791m3565l7399k6843m789M8421L1745N400n3071k2664
13195h6210l5529j4116J01513M5481J0632k5658p8752M7165N7140K3015j9135
13184B5546m3828L5629P601k619l377l7028j1770K9976L8524K1414j0300j9885
13172B9883M519o238k6346O3635R086o5622k802L2355j63n571j9146J8580Q961
$$ y = [-25429, -95750, -68202, 21934, 39760, 15575, 28506, -17221, -49303, -33088, -30100, -57933, -99668, -78540, -30081, -52534, -97392, -70057, -105553, -129164, -109626, -111788, -76848, -54922, 2167, 19188, -15429, -51202, -71728, -52713, 5723, -41176, -81189, -49223, -52773, -95430, -88941, -70330, -27819, -31525, -29807, -86639, -98143, -94181, -37958, -60233, -89321, -148045, -145369, -47791, 12764, 16555, -27010, -64409, -91252, -96041, -47620, -15875, -10475, -63546, -86210, -121739, -135855, -34342, 11139, 21771, -3887, -82639, -35474, 21666, 44681, 25546, -18282, 17347, 24948, 22329, 18952, -18076, -29846, 130, 38654, 60068, 49768, 29883, 34402, 28164, 1818, 65453, 74539, 8917, 6115, 38470, 38307, 32736, 13590, 32170, 41131]
13159D1131p641M6085K2360o2702J5294M0198l999j5971k0577o6763P407L3290
13147B8112QJ3979K8791K3657o5221m2075j4832L6412N82j0796q164n2739O777
13134e5509K3124l3448O3949M7868p750m8702k406O1514m095j805J0486N3071
13122A06297K369l3621k1542r152o8587j3079N0142J9162N3023J8265l0285K3294
13110I6286K2713J0702m4338k761r544l3750l6146L6009q639K2583J3347O609
13098G3071m9958l2957J6502K7524j1119k9251m0323o7763m4079P8794J04893
13087B5334J9054k3897j6236j4766l0040P3156j9717n2285o9813q878n0708p709
13075a76505J03630L1701o3707j1522j4832L1608L7167P0792j1115m76K9041K7941
$$ y = [41131, 33490, 79575, 101935, 39233, 54527, 94725, 90726, 74755, 54178, -12585, -5178, 28112, 28120, 42099, 70890, 94547, 29326, -12749, -27581, 8831, 9413, -1383, -9547, -62286, -55509, -32385, -65833, -1884, 45984, 38234, -10468, -12874, 48640, 44545, 42740, 53226, 106297, 108666, 75045, 53503, 44351, -24236, -37315, 12827, 31989, 85012, 103277, 72992, 96286, 118999, 129701, 85363, 82602, 73058, 39308, 3162, 39171, 30532, 53115, 66462, 73071, 23113, -9844, 6658, 34182, 23063, -6188, -46511, -114274, -158353, -79559, 25334, 44388, 20491, 4255, -10511, -40551, 32605, 12888, -39397, -109210, -118088, -168796, -176505, -72875, -41174, -104881, -116403, -131235, -99627, -62460, 8332, -2783, -3259, 25782, 53723]
13063E3723l2760N7728p327Q882q1926j8353O1369K5034o7296n7716l6685k8279
13051a23606N4110N0680j4412l5057P967k295j3697J7096j0304J0134O9708N1305
13039F1629n182k7162n716J7844m3321k6837k046k1085K0925K6479j154L1630
13027B6004n2483k051L4232j3606J6523N2683L5021o7217q3719j7078K8905K3725
13015a9061n7632p095q925L6465K5068M3823J748k016k4720k4299l5663L4691
13003c7616O6252m1460k5238N149L2283O050k411L3380O216J3916J8576O934l2039
12990D9992n0412n2397R909K6761L6447J2144n3608r4802m9053n15Q7886R5028
12978A7380J6170K4561l2565j00129p0945K9250Q4221J7576N7545R40K2588q069
$$ y = [53723, 20963, 78691, 71364, 80246, -1680, -20033, 41336, 66370, -926, -58642, -95327, -123606, -69496, -18816, -33228, -68285, -60318, -62613, -76310, -59214, -69518, -59384, 10324, 61629, 56447, 29285, 23569, 41413, -1908, -28745, -30791, -51876, -30951, -4472, -5626, 26004, -26479, -28530, 5702, -7904, 8619, 61302, 96323, 29106, -54613, -71691, -42786, -19061, -76693, -83788, -92713, -56248, -31180, 12643, 14391, 12375, -12345, -36644, -72307, -37616, 28636, -12824, -38062, -32913, -630, 5420, 3009, 36389, 42605, 56521, 75097, 82031, 49992, -420, -52817, -42908, -16147, 20300, 32444, -21164, -115966, -165019, -165534, -77648, 17380, 33550, 58111, 25546, -74583, -145528, -116278, -32057, -14481, 43064, 44004, 66592, 58523]
12966E8523n3191j0525m4122m8775m270J0402K5323K8712M0070L7106p172j9639
12954A2442l3871l4730O6221l6012l4963k2027J7706O8451N5224j4850l5782l823
12942C986j20503n5283P5299K075J7625O259J1573M7126J7620j3727o1067K8815
12930d0202k690j0565J975l70l2772K0833O0147L4964K5035l8098j8116m6567
12918d6426J4479O0494n833l5574J366M2906k5517n8265k6580J5404J7076O830
12906c9640J688k4761k9976l4956M4236K0603J7661k1469K5665l905m6444R742
12894h1556R627K4527M5351l8648k0091L9698O7077l4593m9576J3024J6778L3813
12882B5431p74j1559j9149j068L9047k7814k2290l303M147O671K303P082N5987
$$ y = [58523, 5332, -5193, -49315, -98090, -102360, -91958, -66635, -37923, 2147, 39253, 32081, 12442, -21429, -56159, 10062, -25950, -60913, -82940, -65234, 3217, 58441, 43591, 7809, 3986, -116517, -171800, -96501, -94426, -76801, -70542, -58969, -11843, 5777, -7950, -69017, -40202, -42892, -53457, -51482, -51852, -84624, -63791, -3644, 31320, 56355, 18257, 141, -46426, -31947, 28547, 22714, -12860, -11494, 31412, 5895, -52370, -78950, -63546, -46470, -39640, -37952, -62713, -92689, -127645, -83409, -62806, -45145, -66614, -40949, -44854, -91298, -81556, -71929, -47402, -2051, -40699, -60790, -21092, 45985, 11392, -38184, -25160, -8382, 25431, 24657, 13098, -6051, -7119, 31928, 4114, -18176, -21479, -17332, -10661, -8358, -1276, 54711]
12869E4711K8062j8394r5343q7880m7295R525Q9869N9360r371K5313J0251m1645
12857b2837o048M8482l4037r743L6854K7247J5319k3661l1109l0102l7715R652
12845e7698k7256J401J1201P8495O0905K8853j0054j6403m3485q0339l5832l5115
12833a25327O0752Q6986j7872k7484o3311j1616J3845K8175M4335k103j6172M3424
12821A3632k3556l2149M0055L4499j5769o189m713l8800k7665M2744K7599q3531
12809g3843j6592K3615q652L9184j1556k4595N8002K8189K483l3457q9348J0183
12797i6387K7458j2740j0717K5280N884R965K3543p917k3793j9032R017N7982
12785a1457J8183K296Q1990N3934m2110r9379O350M7571k6121J6733j1519n4673
$$ y = [54711, 82773, 64379, -30964, -118844, -166139, -156614, -66745, -7385, -16756, 8557, 18808, -22837, -28885, 19597, -14440, -24183, 12671, 39918, 55237, 31576, 467, -29635, -67350, -57698, -84954, -83553, -72352, 6143, 67048, 95901, 85847, 69444, 25959, -54380, -90212, -125327, -64575, 22411, 4539, -22945, -86256, -97872, -84027, -55852, -11517, -13620, -29792, 13632, -9924, -42073, -2018, 32481, 16712, 10523, 5810, -32990, -60655, -17911, 9688, -73843, -90435, -66820, -75472, -36288, -47844, -72439, -14437, 13752, 16235, -17222, -106570, -96387, -68929, -81669, -92386, -67106, -61222, -51257, -27714, -35631, -59424, -78456, -69439, -11457, 6726, 9022, 91012, 144946, 102836, 3457, 9807, 57378, 31257, 47990, 36471, -18202]
12773a8202p6917p810J12313P8215o7437r0376n5301K0789M355l3911J0864J0917
12761a12501J2407R5769P18n5123n260J6874L9722K5980j2054R226j2125K4662
12749B8295j9125j6860l3228J7613m5316J0874k5589m5838Q8050J5107o498n183
12737c7698P87n413j8103K2718J2589K4797Q023L5123J52l6914Q034K1332p2346
12724c6919j1707L6896J6250M2577N6614J2097m8918n8377l0333J1066L7498l2192
12712e448o0646l3138r910L9455L5924l8978j3395L8240O9029L6949K2588j7137
12700F3533K8961P378p757L2773n8661l5987p4571q667N4469J7961k2945M9367
12688D5854O5816N945m7046K463l343k2949m8837l1215p8987J6374P2048Q24k1087
$$ y = [-18202, -95119, -102929, 9384, 87599, 20162, -70214, -125515, -104726, -100371, -134282, -123418, -112501, -100094, -4325, -3607, -58730, -63990, -47116, -7394, 18586, 6532, 15758, 3633, 28295, 9170, -7690, -40918, -23305, -68621, -57747, -83336, -129174, -41124, -26017, -32515, -37698, -36911, -42324, -60427, -37709, -25120, -323, 7700, 42823, 42975, 6061, 14095, 35427, -36919, -48626, -11730, 4520, 47097, 103711, 115808, 66890, 8513, -21820, -10754, 26744, -5448, -66094, -99232, -109142, -69687, -33763, -72741, -86136, -47896, 21133, 58082, 80670, 63533, 92494, 99872, 92115, 124888, 66227, 30240, -44331, -52998, 1471, 19432, -3513, 45854, 111670, 117615, 70569, 73032, 69689, 46740, -2097, -33312, -112299, -95925, -23877, -23053, -44140]
12675d4140l3657j5866Q2539M3694l695L7580m4634n7738p2453M0460L2114j4507
12663e0303k5454N2925P8019J9600m9440p5849p392L3489k7487J4309L273l6825
12651g1135K7707L1844O180K7993L0522J0854m2622p0499n3132R6338k649k0137
12639b8736k6469N0652L444K686j5889j8852J7553J0118l1253j398l0461O5826
12627b779N2640J9124k1054p2669l3022J9483J03232M4480P913K3026l8480K1404
12615A23298J8753m9558k4058K2766j2881j9579K7035Q2095j1346k6940m4414
12604H5171l5876k5778K8122k364j2548k142K3836j3203l5225r212J4321R46O8668
12591H4716l7927o1772N2257M5579k863o5947n6612K3114k467k908K1085K0497
$$ y = [-44140, -77797, -93663, -11124, 32570, 28875, 66455, 21821, -35917, -108370, -67910, -35796, -50303, -75757, -22832, 55187, 74787, 25347, -50502, -57894, -24405, -51892, -37583, -34310, -71135, -43428, -11584, -5404, 22589, 53111, 63965, 21343, -49156, -102288, -5950, -8599, -28736, -55205, -4553, -1109, 1577, -14312, -33164, -15611, -5493, -36746, -38144, -68605, -2779, 49861, 68985, 47931, -24738, -57760, -38277, 64955, 109435, 117348, 140374, 101894, 123298, 142051, 92493, 68435, 91201, 78320, 58741, 85776, 167871, 156525, 129585, 85171, 49295, 23517, 51639, 49275, 36727, 34585, 58421, 45218, 9993, 781, 15102, 16048, 84716, 46789, -14983, 37274, 82853, 79990, 14043, -42569, -19455, -21922, -24830, -3745, 16752]
12579A6752n2334p060M606M6057l7794J699O3960k7924n7528L2957K9167M1920
12567E4478m6245k1658K4185l4666l8035R240J5645M7721L2732p466k8982k8224
12555b1275M4636p213J8096P3233l6406k6222k4023J0546m097j001K2822K5562
12543G4658M9258m2669j9835Q877k3285j9643p4297p115M3338J8840J8337K6995
12531E3459J2436p33j6225m910J4985k6964l5548o942P301J4426k2457o535K4741
12518G034N2100j2746n6367P787L1561o5121p3743m5335J101K2787J2801M841
12506a13300N2506K3443J8260P8136j9118m3129j9997p1726K4142M2979M8582
12495B0778R3037J2426p2187l1811K1227j7461L370l6429p404O5188r616r467
$$ y = [16752, -35582, -42642, -38036, 8021, -29773, -28074, 35886, 7962, -49566, -16609, 12558, 54478, 8233, -13425, 10760, -23906, -61941, -52701, -37056, 10665, 43397, 35931, 6949, -21275, 23361, 16148, 34244, 107477, 71071, 44849, 20826, 31372, 27275, 26274, 49096, 74658, 123916, 81247, 61412, 70289, 47004, 27361, -46936, -54051, -10713, 8127, 26464, 53459, 65895, 65162, 48937, 44027, 59012, 32048, -3500, -10442, -3141, 11285, -11172, -17707, 7034, 59134, 46388, -9979, -2192, 29369, -35752, -109495, -154830, -153729, -130942, -118141, -113300, -60794, -37351, -19091, 59045, 39927, -3202, -23199, -94925, -70783, -27804, 20778, 113815, 126241, 54054, 22243, 43470, 26009, 29379, -7050, -14454, 50734, 41118, 31651]
12483C1651k2020j3281N1065K5217K1087K6279O6406J27683K29502K27539K98846
12472A069974N79089J019472J122249J027814J308538J443961p44054k350530
12464D476513j557009p91311m66772l37992j83380j50169q5951q3954j06112q5001
12454F28862l3399j9981l9128j03202M078K3818n3634l0454L6395j6711k4575
12443C72069j6250k1324p922Q516k118n6760k103J09103K132p287n9537p6007
12431B42512k4412K1986M0892J1000k6925p4584K9634J4195K3252k3991q284K034
12419B27309j8142K082K7314P3563K69o8603j7419J1758l4956n2255j0387j825
12407A38708r22k9321o6811j5246N2764k1402l7716K2504L1035k7193J3452L1251
$$ y = [31651, 9631, -3650, 47415, 72632, 93719, 119998, 186404, 314087, 543589, 771128, 1069974, 1649063, 2668535, 3790784, 4818598, 6127136, 7571097, 6827043, 4476513, 2919504, 2128193, 1661421, 1323429, 1140049, 989880, 903929, 819975, 713863, 628862, 595463, 575482, 536354, 433152, 437230, 461048, 407414, 376960, 413355, 396644, 372069, 355819, 334495, 326573, 335089, 332971, 276211, 274108, 383211, 385343, 378056, 318519, 242512, 218100, 240086, 280978, 291978, 265053, 190469, 220103, 234298, 257550, 233559, 225275, 227309, 209167, 211249, 238563, 312126, 312395, 243792, 226373, 238131, 203175, 150920, 140533, 138708, 137786, 108465, 41654, 26408, 79172, 57770, 20054, 42558, 73593, 46400, 59852, 91103]
12395I1103l910K886q7896M6102M0213K251J7146M4263l193L0271K7501p0438
12383A36299j6855K4122J4399l936m5610K3355M985m2224K0886J2598p002K2299
12371A43316n9516l8536k2338O3493k294r7772K4777P0334K4548k6999k6964J1144
12359F3193m8736n0560n8765K3975J4016N7617M9691l5450Q175P013J048k9288
12347A929m6750l7992j1965M9011J336l804o000K2022l7820K6716K6930M6208
12335B9821L8853K5706o3064j8921j6347J8349m5474l4918N9836J7887P714K2143
12323D1585j4362k3474n109J0518p832K0184J0672l4285m3318K7256O3085J6507
12311F1427o618l2090j8324j0939K7742Q735j2477K4519j2185l0208m3648N6285
$$ y = [91103, 87193, 90079, 2183, 48285, 88498, 90749, 107895, 152158, 148965, 179236, 206737, 136299, 119444, 143566, 157965, 154029, 108419, 131774, 136759, 94535, 115421, 128019, 121017, 143316, 83800, 45264, 22926, 86419, 84125, -13647, 11130, 81464, 106012, 79013, 52049, 63193, 14457, -36103, -94868, -70893, -56877, 740, 50431, 14981, 23156, 30169, 31217, 1929, -44821, -82813, -94778, -45767, -44431, -48235, -54235, -32213, -70033, -43317, -16387, 29821, 68674, 94380, 31316, 12395, -3952, 14397, -31077, -65995, -6159, 11728, 19442, 41585, 27223, 3749, -1360, 9158, 1326, 21510, 32182, -2103, -45421, -18165, 44920, 61427, 54809, 22719, 4395, -6544, 21198, 29933, 17456, 41975, 29790, -418, -44066, 12219]
12299A2219L5389j6472O817m0362k4399K7324J3934j4986R533K7946l8382j1729
12287a3168M7061o384j3939K4443j3792m0051m5813J0785N6406j6043J0384n820
12275e931n359O2300J1985k5709J638j5402j979J9781M1923l327n1577J4323O1187
12262A03853n879j2208L5237l1302p2279l6148o877j6796K940Q222M2419K2576
12250C3758l655k0415R3078M1102K204Q8082L0799J64K2390O6681k4386m385O4434
12237C89851J3847J4365l461m0415k1126q329p1660l6336q2247p9222l123M8948
12225A21092l5056l897M8429k4229J790q687o0574m821L3125M9238J6519l1960
12213A00969m1924m0275N8342K2629q873K735O0489R5384K3353j7827M9480K4475
$$ y = [12219, 47608, 31136, 37953, -2409, -26808, 516, 14450, -536, 8997, 36943, -1439, -13168, 33893, 27509, 13570, 38013, 24221, -15830, -61643, -50858, 5548, -10495, -111, -5931, -11290, 51010, 62995, 37286, 38924, 23522, 21543, 41324, 83247, 79920, 28343, 42666, 103853, 97974, 85766, 121003, 89701, 17422, -18726, -25603, -42399, -39459, -31237, 11182, 33758, 30103, 9688, 102766, 143868, 146072, 234154, 264953, 265117, 287507, 354188, 329802, 325417, 389851, 403698, 418063, 414602, 374187, 353061, 344732, 273072, 236736, 154489, 75267, 72144, 121092, 86036, 82139, 130568, 106339, 108129, 99442, 38868, 34047, 67172, 116410, 132929, 100969, 59045, 18770, 77112, 99741, 90868, 93603, 154092, 249476, 272829, 255002, 304482, 328957]
12201C28957l6930m5102L052m2932k4195M995N5456K0701m4786K4695m8931k939
12189A92041K7172j1953J00j6571m3957j9769j9635j5668o3258l870K3108j3953
12177C3787J9194M0842N0991j7416l7458K5179K4389P029L7581j3955l5822o2943
12165G1398p621J4203K3570l0559j3528K7111O8209p050N3151m5025l6429k9196
12153H8234r779j2919M3351k2523L6057O0603k7833J7784N9681n6791r5190l4490
12141D6185M7775L5234J406q7940m9011J0012P466J5707k4202p417K6755K0258
12129D2228l764J2085l4837l2739M4251M4537j0075l9532k4762K383k6751P779
12117a9197O4415L4242j6204Q735k8450j5589l3301k6930j368N1974K9095k8191
$$ y = [328957, 292027, 246925, 249977, 207045, 182850, 187845, 243301, 264002, 219216, 243911, 194980, 192041, 219213, 207260, 207360, 190789, 146832, 127063, 107428, 91760, 28502, 24632, 47740, 33787, 52981, 93823, 144814, 127398, 89940, 115119, 139508, 146537, 184118, 170163, 134341, 71398, 63777, 77980, 101550, 70991, 57463, 84574, 152783, 145733, 198884, 153859, 117430, 88234, 78455, 65536, 108887, 86364, 122421, 183024, 155191, 172975, 232656, 175865, 80675, 46185, 93960, 129194, 130600, 42660, -6351, 3661, 11127, 26834, 2632, -4785, 21970, 42228, 38464, 50549, 15712, -17027, 27224, 71761, 61686, 22154, -2608, -225, -26976, -19197, 45218, 79460, 63256, 71991, 43541, 27952, -5349, -32279, -33647, 18327, 47422, 19231]
12105A9231L851J7077L40q243p675k0344o603M3823O465m6126J7961O7586J5732
12092A03075q3546k3974K9208L9937j6318L0633q396m6745k7005j3208Q977K4624
12080A7262L535J152M712j6967l7268L1260N5892j6031l928k8497L043N7657k6879
12067D4943n8391J9925L1818m5681l205k3472P846l9985N6588j3099j647K890
12055b1470J3404M8536R503q413m7592q715n6467m9275Q275N8310O9288O858J418
12042B3660L9278O2460m852R803j20056k0411K202n6268k3119O5029N8940J4674
12030E1340o0393m1936J2657K0446J6445k0855N651R9727J243o677p519j2461
12018E7668k6974p263j8753O5750j9873l6356k1423n207O9272K2775p1977l7095
$$ y = [19231, 23082, 40159, 40499, 32256, 24581, 4237, -2366, 41457, 47922, 1796, 19757, 87343, 103075, 19529, -4445, 24763, 64700, 48382, 79015, 70619, 23874, -3131, -16339, -7362, 17262, 20797, 21949, 26661, 9694, -27574, 3686, 59578, 43547, 39619, 11122, 14165, 71822, 44943, -13448, 6477, 38295, -7386, -10591, -34063, -26217, -66202, -9614, -22713, -24360, -21470, -8066, 40470, 49973, 41560, -6032, -14747, -71214, -120489, -112214, -53904, 15384, 22242, 23660, 62938, 125398, 120546, 130349, 10293, -10118, -7916, -64184, -87303, -22274, 36666, 51340, -9053, -50989, -38332, -17886, -1441, -22296, -16645, 83082, 84325, 77648, 70129, 57668, 30694, 23431, 4678, 70428, 50555, 14199, -7224, -12431, 56841, 79616, 7639, -29456]
12006b9456J676k613O0169M194N1100l2786k7718K0720J135j983p9124m7349L9203
11993d2832L5317L3315l2148j1074J8007K809j833j5485J7142N4224n6148o7384
11981f6090N4909L6751L7324m7828k5452L243L286J2953L9360k6002K0946M5254
11969H8654l4613k4387J3852L0396l5435P919J7798j7276m4695p1194j9832M9196
11957c9617M5544k9781n902M6472J3529j5420m6314M7943L6401j3196M096m039
11945C9716m1080j6592J7755L5026j6193j0834k0885J6893o161l2369m8220K3603
11933e9341k6446J7033J5351j5689m445j0095Q7334n8811q1670M0692N565Q1760
11921h762j4770l3176P521j76m6980K7583L8648m3558q481J9103J1650M9547l0884
$$ y = [-29456, -27780, -30393, 29776, 33970, 85070, 52284, 24566, 45286, 46421, 44438, -34686, -82035, -42832, -7515, 25800, -6348, -17422, 585, 3394, 1561, -13924, 3218, 57442, 1294, -66090, -11181, 25570, 62894, 15066, -10386, -7143, -3857, 9096, 48456, 22454, 43400, 88654, 54041, 29654, 43506, 73902, 38467, 46386, 64184, 46908, 2213, -68981, -88813, -39617, 5927, -23854, -29756, 16716, 30245, 14825, -31489, 16454, 52855, 39659, 43755, 39716, -1364, -17956, -201, 34825, 18632, 7798, -13087, 3806, -2355, -34724, -82944, -59341, -85787, -68754, -53403, -69092, -73537, -83632, 3702, -55109, -136779, -96087, -90522, -8762, -23532, -56708, -49187, -49363, -96343, -68760, -30112, -73670, -82151, -63048, -51398, -1851, -32735]
11908c2735k893M4525J0328j1315O261P7643J5479J0814l3152n0740o9143n3211
11896h8139j1971M3814J6564P6191L2638n8469l3480l2796o416K3588o2681Q065
11884i3092J8015J9781J121J5137l8948j5809j6174O1199K5140J05006k1945q1354
11872b1923k0890L2475K875l6173N8123J1883o0468m4018K3341J9741J9555J9593
11860D114j6979K2708K413r0J4492m880m0334N788k147k184K7615K7942O458J6698
11846F1614K1442o9699j8986L5732m4994o9316J1608K3664O9279m1699k3560N018
11834c9897k0129q111J4496j7758q5715L0223J05301Q4518L0759j3768l9601L89
11822D0707m552k2264q6027l1987P4326O4992n3563l5286R295L5842J2004J4737
$$ y = [-32735, -35628, 8897, 19225, 7910, 14171, 91814, 107293, 118107, 84955, 34215, -34928, -88139, -100110, -56296, -39732, 36459, 69097, 10628, -22852, -55648, -62064, -38476, -101157, -93092, -75077, -55296, -54175, -39038, -77986, -93795, -109969, -48770, -23630, 81376, 59431, -21923, -42813, -10338, -7463, -43636, 14487, 26370, -34098, -78116, -54775, -35034, -15479, 4114, -12865, 9843, 12256, 12166, 26658, 21778, -18556, -12768, -14915, -17099, 10516, 38458, 44916, 61614, 83056, 13357, -5629, 30103, -14891, -84207, -72599, -48935, 20344, -21355, -44915, -39897, -60026, -68137, -53641, -71399, -157114, -126891, -21590, 62928, 93687, 79919, 40318, 40707, 36155, 13891, -72136, -104123, -29797, 35195, -18368, -53654, -44359, -8517, 3487, 18224]
11810A8224l9204q946l9379j5850l0750n5795L7024O6643L5161J4720M7033P526
11798C6407J371K8116k8412q2938p385q920K032K1486O8544O5103M816J0763N2440
11785A63423j0854p2066j28471k9464K6355j8903K6813N494k9068l0045M6072
11774e0714N0331N9436N0627r724q5846p049J4656P0573L3135r519m7429l3288
11762C5189o2391j1717K1851p100k9786K4388J6687n060m59j2648j5798L8634
11750h210j8944L6930J9256J7265m368n1029p7350K2714j9165M2494J7139j1031
11738c4299L4K7756K5839J1759j4725m6155N0051R345j498l2167p268K6556L0544
11725D5772k72q38q553o3095k8362K5821K8075j9578j3641M047L2478J6610n6171
$$ y = [18224, -20980, -29926, -69305, -85155, -115905, -171700, -134676, -68033, -32872, -18152, 28881, 36407, 37778, 65894, 37482, -45456, -52841, -61761, -59729, -38243, 30301, 95404, 100220, 110983, 163423, 152569, 80503, -47968, -77432, -51077, -69980, -43167, -37673, -66741, -96786, -50714, -383, 59053, 109680, 99956, 14110, 7061, 21717, 92290, 125425, 115906, 68477, 35189, -27202, -38919, -17068, -24168, -53954, -29566, -12879, -17939, -18398, -31046, -46844, -8210, -27154, 9776, 29032, 46297, 41929, -9100, -86450, -63736, -82901, -40407, -23268, -34299, -34265, -6509, 19330, 31089, 16364, -29791, 20260, 29605, 28107, -4060, -11328, 15228, 45772, 45500, 44662, 36109, -26986, -55348, -29527, -1452, -21030, -34671, -30624, 1854, 18464, -37707]
11712c7707k4766K6131K0157k9243k4001J9768M6867M354j9152k1586j3715j7677
11700g0570o295N1849M5284j5429k4730n0440J4275J0286L5431P3127N9990m2107
11688H0671r2085n5615M3957L5473N6532K1394o6847j6516K3590M8319m260m5292
11676B9321k2452n3370m0658K9377L125P86m0305k0583J7096l3449O8456O8454
11664E798L0249j6797n9603m2587M7520L4591j3517Q968K1446L1408k7779r1184
11652g1487j3272o081O801k2928N6257P9348M6220J0387k2196p840M5841k9342
11640G1708m297l0450l279p782r802j667L0370j4890K4570k8297k4571m9323K5526
11627b2184j466K804J7371l6670l0899K7738O2938J9352J7511J8050p9252n7007
$$ y = [-37707, -62473, -36342, -16185, -45428, -69429, -49661, -2794, 1560, -17592, -39178, -52893, -70570, -76865, -25016, 20268, 4839, -19891, -70331, -56056, -45770, -10339, 62788, 122778, 80671, -11414, -67029, -23072, 12401, 68933, 90327, 23480, 6964, 30554, 78873, 74613, 29321, 6869, -46501, -87159, -57782, -54657, -53871, -94176, -114759, -97663, -131112, -62656, 5798, 36047, 19250, -40353, -82940, -35420, -829, -14346, -5378, 16068, 47476, 19697, -71487, -84759, -90840, -84039, -106967, -50710, 28638, 74858, 85245, 63049, 55209, 101050, 71708, 67411, 36961, 33682, 25900, 16098, 14431, 44801, 29911, 54481, 26184, 1613, -47710, -22184, -23650, -20846, -3475, -40145, -71044, -43306, 19632, 38984, 56495, 74545, -4707, -61714]
11615f1714L4766p075J1140J0217n6416R8056L0500K2658O117o5650l601L156
11603B2154N4810L8352K0860n327j355o878m7944k1825o0808o9597L2883N7609
11591A2934O8783L3566R35P292k719L22m6228o0066M8287J1681L7506N5972J8707
11578A86972k6822k3705M2717K8658K8065l9785n7986q1712m5208J4361K4712
11567E0267J5881m471K019J601j2115n09O8148M4958m0552l7454M789k7905j8169
11554D6488l644K1062m9962l9883K1691N8017r646J0784m6210r815J5137l576
11542A0443M0156r796l2019k2672k3230m413m7677j4634J6717L0125J7405j9666
11530e9261L8138M5649Q045K5962k0563j6295j8463L639l890K3421N6510k3597
$$ y = [-61714, -26948, -34023, -22883, -12666, -69082, 28974, 59474, 82132, 88249, 22599, 18998, 22154, 76964, 115316, 136176, 130849, 129494, 122616, 74672, 52847, -7961, -77558, -44675, 12934, 81717, 115283, 116218, 123510, 120791, 121113, 74885, 14819, 63106, 74787, 112293, 168265, 186972, 160150, 136445, 179162, 207820, 235885, 196100, 138114, 56402, 11194, 25555, 50267, 66148, 61677, 63696, 65297, 53182, 52673, 120821, 165779, 125227, 87773, 92562, 64657, 46488, 42844, 63906, 13944, -25939, -4248, 53769, 44123, 54907, 8697, -1118, 14019, 10443, 50599, 40803, 8784, -13888, -37118, -41531, -89208, -103842, -87125, -57000, -39595, -59261, -21123, 24526, 32571, 58533, 37970, 21675, 3212, 6851, 2961, 26382, 82892, 59295]
11518E9295L7984M194o0778K0175J9472n4624k7847L9206m591l2847j5207O2907
11506D7339O5750q622p5902m8019n6550J9901O4641M1785M042N721J2152p064
11494F5174j1978l067k7047j9480N4997j1212j8018o275l3423o4074Q878N7550
11482g975M885j8891k6377M2706k6053o328K1574K7482n6853l9800l063L4577
11470e4116L1046L3442K5586k4409J9113l9955N04l4507j8461J3214O7114J04690
11458A23261L0998p6658n7318l6961N8203K4350k2162n334j1462J6471L0112j471
11446G2029L1804k8990n4747L441J6255K8995l9702m0135M4005K1959j2528j1817
11434C0569M0832J8786J552m8694o1223q247J05476r02p8376L173M2386O3059
$$ y = [59295, 97279, 101473, 40695, 60870, 80342, 25718, -2129, 37077, 32486, -361, -15568, 47339, 113089, 104467, 28565, -19454, -76004, -56103, 8538, 50323, 54365, 60086, 72238, 65174, 53196, 50129, 23082, 3602, 58599, 47387, 29369, 23094, -10329, -74403, -65525, -7975, -3090, -21981, -48358, -5652, -31705, -38033, -16459, 11023, -45830, -85630, -88693, -54116, -23070, 10372, 35958, 11549, 30662, -9293, -8789, -43296, -61757, -48543, 18571, 123261, 154259, 77601, 20283, -16678, 41525, 65875, 43713, 38379, 26917, 43388, 73500, 72029, 103833, 74843, 20096, 23537, 39792, 68787, 29085, -11050, 32955, 54914, 42386, 30569, 71401, 90187, 91739, 43045, -18178, -26425, 79051, 78149, -227, 2946, 45332, 108391]
11422A08391J7402p7058q4223n278M0069K5204k0941R869o923j2803k7257O843
11410b6705L749P6573J9813K8332k1064L6873J6027m2970J4277L4757K2036j8816
11398A42882p7173q2231m5695j7849K9507P48M552M8444Q2925N9412Q181l7367
11386A16336l5970k5338p299N551k6553J4861K278p0283m4421M7564N949J5112
11374b213K331M7438K4519L1315J5699l251j10930j4658K1906m4184N2886L9743
11362F0601l1014M5833j5529j5530l5528J9336K5440l5448j1201m0636M0610N901
11350A2835l6636O1994N5783M0716M8265P4861P371l1101J4778M1402l083l3417
11338B53768j7880J2519l124k0440k7283j5919j9622j49093j0750O9261J4055
$$ y = [108391, 125793, 48735, -35488, -40766, -697, 24507, 3566, 13435, 6512, -6291, -33548, -26705, -22956, 53617, 73430, 101762, 80698, 117571, 133598, 90628, 104905, 139662, 161698, 142882, 65709, -16522, -62217, -80066, -50559, -49811, -45259, 3185, 86110, 145522, 153703, 116336, 80366, 55028, 47729, 53280, 26727, 41588, 43866, -26417, -70838, -23274, -17325, -2213, 118, 47556, 72075, 103390, 119089, 115838, 4908, -9750, 12156, -32028, 20858, 60601, 29587, 75420, 59891, 44361, 8833, 28169, 53609, 18161, 6960, -33676, 6934, 12835, -23801, 38193, 93976, 134692, 182957, 257818, 265189, 234088, 248866, 290268, 287185, 253768, 235888, 248407, 245283, 224843, 197560, 181641, 162019, 12926, 2176, 71437, 85492]
11327H5492P251K7186k4377n1838J1947L66j7198l8522n990K9683q100o6058K1273
11314b8885O4790J0151J3582j5283k2662J9249L2354j6973l9532l7807K2511L6004
11302C7499J3195J0861L4565K4249m0643r0746k9447J0031j0747J1827J00126
11291G0770n630j8876O6823j2271k1281j6255m1047n8140j6958L8990N3218N8870
11279I8213m5390m4450j9579L4911K1647l9691o7740k1241L5070P5737N3785j666
11267G9606n8267r034M1005k9704m0494l752K6796J1899L8908j2866l1358n3997
11255d1258k7360K1993P5084k7457J0670l0993J3404M461l091n736M0536l5906
11243e653N988l7828m1983m2824J7345P6635M6020K7452p316l4429K2645K4814
$$ y = [85492, 92743, 119929, 95552, 43714, 55661, 56027, 38829, 307, -5683, 24000, 15900, -50158, -28885, 35905, 46056, 59638, 44355, 21693, 40942, 73296, 56323, 16791, -21016, 1495, 37499, 50694, 61555, 96120, 120369, 79726, -11020, -40467, -30436, -41183, -29356, 70770, 65140, 46264, 113087, 100816, 79535, 63280, 22233, -35907, -52865, -13875, 39343, 98213, 52823, 8373, -11206, 23705, 45352, 5661, -62079, -83320, -48250, 27487, 81272, 79606, 21339, 12305, 53310, 23606, -16888, -20640, 6156, 18055, 56963, 44097, 12739, -41258, -68618, -46625, 28459, 1002, 11672, -19321, -5917, -1456, -4547, -10283, 30253, -5653, 335, -37493, -79476, -122300, -104955, -28320, 17700, 45152, 37836, 3407, 26052, 50866]
11231E0866K1303K7676J5524R111n6166M7889J4094p7956r157k8937l6478m011
11219b6242L0088L1539n598L6839N476k0599m0072O0629L4253j9396j8197J0834
11207G9554R454k2230n0581n5360J9636P069j6463J544O5452j5222n1270k6923
11195e5340K1381K9562J997L0004j6794j8877n9990M3172R8270j6602J3816K0061
11183I0660L3596K2291q680l8826m676k2414m2014n3169l1421O0578K4114Q523
11171C8562r429j6083L0468j043P387L6959O6657L9103j4792p9175J1370L5231
11159A45215o3765k3373L3159P2923N794k4887k8262J9106m1782L795l0330J3769
11147H1362q699j4188L0400n921L4666l7987o6480L3826P73J1085K7958j0610
$$ y = [50866, 72169, 99845, 115369, 124480, 68314, 116203, 130297, 52341, 43184, 14247, -22231, -26242, 3846, 35385, 29787, 66626, 72102, 51503, 11431, 72060, 106313, 86917, 68720, 79554, 89008, 66778, 16197, -39163, -19527, -12458, -28921, -27377, 38075, 22853, -28417, -55340, -33959, -4397, -2400, 27604, 10810, -8067, -68057, -24885, 73385, 56783, 70599, 90660, 124256, 146547, 137867, 99041, 94365, 71951, 29937, -23232, -54653, 5925, 30039, 38562, 29133, 13050, 43518, 42475, 49862, 86821, 153478, 192581, 177789, 98614, 109984, 145215, 81450, 58077, 91236, 164159, 169953, 145066, 116804, 135910, 94128, 97923, 67593, 81362, 72663, 58475, 88875, 82954, 117620, 79633, 13153, 46979, 47752, 58837, 86795, 76185]
11135G6185l5423k7945J6239J7403n929q3386K361N0405k567L5288N8376N395
11123A06402k5746Q880K5010j2946l5835J508j5397k9043O802L1457M902J3626
11111G9620O284m1593n5586l3198M2355J8445N2092j2244q1051l8813M5379J3285
11099e025k1675M9632L906o5751J6509N8527p6093n8393Q7878K4958n829k9548
11087b0904p9111J2816O7530J7346l50L3396K7280N3970k9177L6165M8076j9005
11075A48032o7754m4348L4490J6615j0247k4052q0594j8844k9897K165J8192J9738
11063c6504N0824R462j0724l098l16K4155L8276K0992J8592N003J3714m5166q436
11050G6774J1859m5734j3188J0706l9547m5673J4992j7014j5119K4363k128n0702
$$ y = [76185, 40762, 12817, 29056, 46459, 40530, -42856, -40495, 9910, 7343, 42631, 101007, 106402, 80656, 89536, 114546, 101600, 65765, 67273, 51876, 22833, 29635, 61092, 65994, 79620, 85904, 44311, -11275, -44473, -2118, 16327, 68419, 56175, -24876, -63689, -18310, -5025, -26700, 22932, 26838, -38913, -22404, 36123, -39970, -98363, -10485, 14473, 8644, -20904, -100015, -87199, -19669, -2323, -2673, 30723, 58003, 111973, 82796, 118961, 167037, 148032, 80278, 35930, 70420, 87035, 76788, 52736, -27858, -46702, -76599, -74434, -56242, -36504, 14320, 23782, 13058, 9960, 9644, 33799, 72075, 93067, 111659, 116662, 130376, 85210, 76774, 88633, 42899, 29711, 40417, 870, -44803, -29811, -46825, -61944, -37581, -39709, -90411]
11038i0411K727P049j440j1617k0161o0204j1609N5108K3882K8237N9231K9777
11026A0569q0004j7847n926M3090K1940Q1533j2087K647M3200k8495o6840o0K1399
11013A3119j3429l5090r139J0544J4499n8908K7786P5990K3757j6976K014m8158
11001a3991k8132L1281l3393k2959L056L5149M7976K1066m9638l1826J5641L4062
10989H292N717J0625r5881p3334K6639N3523P2859K3250J2419l9354K8711N0739
10977H4205Q881o910O808j14960m4604J2783J1768J295k4872M2480M3477K2766
10965D3117N530j1205M2963L7880o995k1450n008p3310r384N8322J8901k6485
10953E2876m253L5374q513k8385L8091M8248l8890j8934K2489J03647N258J1280
$$ y = [-90411, -87684, -80635, -82075, -93692, -113853, -174057, -185666, -130558, -106676, -78439, -19208, 10569, -69435, -87282, -93208, -50118, -28178, 53355, 41268, 43915, 87115, 58620, -8220, -8280, 13119, -310, -35400, -44539, -33995, -19496, -78404, -50618, 25372, 49129, 32153, 34167, -13991, -42123, -10842, -44235, -67194, -64138, -28989, 18987, 40053, -9585, -41411, -25770, 8292, 14009, 24634, -71247, -144581, -117942, -64419, 8440, 31690, 44109, 4755, 33466, 84205, 93086, 86176, 92984, -21976, -66580, -53797, -42029, -40734, -65606, -23126, 20351, 43117, 48647, 37442, 80405, 118285, 111290, 89840, 84832, 11522, 2138, 60460, 79361, 52876, 48623, 83997, 75484, 47099, 85190, 133438, 94548, 75614, 98103, 201750, 207008, 218288]
10941B18288K5059L7288M9881J73826K34927L49684K55942K26980L08300M6006
10931A926181l85870m23233l36899k23164j02098m5187q7849q3397o2815l7252
10921A38417n557K6890P5463j6725k9928k508j4204M67M4442p116k4073J3875
10909A99443N1246J7452P495N21r4687p3598L4851l42j6815J0770k4220L0490
10897A42606M013j6347O1921k3779r097j5817m2431l0266n9692n085J5603M7757
10885F9386M2757J1775k6455m4364j7817L2117L3439k7034m471K7630o8350j364
10873B7249J7434N910l9956J2578K7320P240L5688L4495p1040n7461L8350P9693
10861A17500J5047o6223l971M6811M1589Q499m456q7392r0884o478K8859Q298
$$ y = [218288, 243347, 280635, 330516, 504342, 739269, 1088953, 1344895, 1571875, 1880175, 1926181, 1540311, 1117078, 780179, 557015, 454917, 409730, 321881, 238484, 175669, 138417, 132860, 159750, 235213, 218488, 188560, 186052, 171848, 172315, 216757, 209641, 185568, 199443, 250689, 268141, 275636, 276157, 181470, 107872, 142723, 142381, 125566, 136336, 112116, 142606, 146619, 130272, 192193, 168414, 159317, 143500, 101069, 70803, 11111, 6026, 21629, 69386, 112143, 123918, 97463, 53099, 35282, 67399, 100838, 73804, 69333, 96963, 28613, 27249, 44683, 50593, 10637, 23215, 50535, 57775, 93463, 127958, 56918, -543, 37807, 117500, 132547, 66324, 62353, 109164, 150753, 159252, 154796, 67404, -23480, -29958, -1099, 7199]
10849G199J4814n554j675p059Q547J2214l987k0176M3622n7303j4844m182N6541
10836B8157J3994l0354j8977m4572L1847j8377K5545l8459j2057n336K2506P649
10824c8434N2189p338k4371P084K0024j1502Q341O887K170k1223m1380N9970O7911
10811H0328J8802j7152k9646j9284l8340n6445K3888L1373M3373J0565j6747m016
10799B6699K7222j3791j0382K6716N2664K3932l3633j3878O0186r702n7250J8551
10787I7334J8157o091L5791M8079l6766m2913m6544m7657L1221P2437N5679j4027
10775A64700k1403K7131M4352j5632k0392R683J4028K9495o963M6802O1683J5089
10763C48573n3244j1783l0269l2580M958R0255N7458O1702R8307R1311K5366p1104
$$ y = [7199, 22013, 16459, 14784, 7725, 16272, 28486, 24499, 4323, 47945, -9358, -24202, -28384, 28157, 42151, 11797, -7180, -51752, -19905, -38282, -12737, -51196, -63253, -68589, -46083, -38434, 13755, 6417, -17954, -10870, 9154, -2348, 5993, 12880, 15050, -6173, -47553, 12417, 80328, 99130, 81978, 52332, 33048, -5292, -61737, -37849, -6476, 36897, 47462, 30715, 26699, 53921, 40130, 29748, 56464, 109128, 133060, 99427, 85549, 145735, 136033, 78783, 97334, 115491, 109400, 145191, 193270, 156504, 113591, 67047, 19390, 50611, 123048, 178727, 164700, 143297, 170428, 214780, 199148, 178756, 188439, 202467, 231962, 224999, 271801, 333484, 348573, 295329, 283546, 253277, 220697, 225655, 315910, 373368, 435070, 533377, 624688, 650054, 578950]
10751E78950r4276n6953n4627o2387m9647o0158L4950r521J3759l899l6955n8433
10739A40803O276K405Q475M7418M9738q8569p0080k1166k2947L5651J6996q088
10727I6912m0024P5635l2607o0250m9225m5321l9513M456J9252J6045n5638k7486
10715a37764J8693k4578J392L9920Q6101Q7769Q8742N0324m0891k4113P1619o7915
10703A49299p2992j558Q3899O2105n2659n7351k0151J772o186k4053j3698J2759
10691F1186J9038R1024O3731J2936Q99k0396m7231n7598N0345k9082o077l8323
10679A00452o711R352M4730L6561o216K5162J136o2063k2779M6027Q161j0906
10667A62906j061P112M0213K5573k043l9667l9294j1254L5149J04620O2991Q0724
$$ y = [578950, 484674, 427721, 373094, 310707, 261060, 200902, 235852, 226331, 240090, 236191, 199236, 140803, 147079, 149484, 157959, 205377, 255115, 166546, 96466, 75300, 52353, 88004, 105000, 96912, 56888, 132523, 99916, 39666, -9559, -54880, -94393, -89937, -70685, -54640, -110278, -137764, -119071, -143649, -142257, -102337, -16236, 71533, 160275, 210599, 169708, 145595, 217214, 149299, 76307, 74749, 158648, 220753, 168094, 110743, 90592, 92364, 86178, 62125, 48427, 61186, 80224, 171248, 234979, 247915, 248814, 228418, 181187, 123589, 173934, 144852, 138775, 100452, 93741, 103093, 147823, 184384, 178168, 203330, 204466, 142403, 119624, 165651, 173812, 162906, 161845, 168957, 209170, 234743, 232700, 193033, 153739, 142485, 177634, 282254, 345245, 425969]
10655D25969O1450r844L9884N664j9091n1373n866K2680l5908p6057m8213n5840
10643B53455j2900J5173O4387m599N0714J7066o8375J4428M0997J3007l7712q337
10631C37304k4309K650K6293L9099K6206l5614l4171O7324J5934o098l394K7683
10619D38907J5130J6777P0319j2463j5591K3623J7970m2594K001M4473o1382n4064
10607D43106l1962P0241L8930L0292L9901l3251k8075Q164j7335l1982n1537L5628
10595D72120P8467Q2742N5617N4723K1127P748O0625J235O177J8956m9010m6374
10583G64153p6007n7103R190R8890N6929P948L7045k5673K5659N9559N5826l4969
10571I21447M6435N0669M5611P0605K1486P9498M7793P8766Q5405J81358K13460
$$ y = [425969, 487419, 477575, 517459, 523123, 504032, 452659, 446793, 469473, 433565, 357508, 309295, 253455, 240555, 255728, 320115, 315516, 366230, 383296, 314921, 329349, 370346, 383353, 345641, 337304, 312995, 315645, 341938, 381037, 407243, 371629, 337458, 404782, 420716, 414618, 411224, 438907, 454037, 470814, 541133, 528670, 513079, 536702, 554672, 512078, 514079, 558552, 497170, 443106, 411144, 481385, 520315, 550607, 590508, 557257, 529182, 537346, 520011, 488029, 436492, 472120, 550587, 633329, 688946, 743669, 764796, 772544, 833169, 834404, 840581, 859537, 810527, 764153, 688146, 631043, 640233, 739123, 796052, 804000, 841045, 815372, 841031, 900590, 956416, 921447, 967882, 1018551, 1064162, 1134767, 1156253, 1235751, 1283544, 1362310, 1447715, 1629073, 1842533]
10560A842533J40451J61262J93783J30782m8852J14724K84246M19470O61347P23179
10550D622925Q90366J117348J067987Q31379O36369L57944J34108L60354K93638
10541A0312418J10823L11765M62477Q26733J458068K223063K929579L777851N174287
10532B7587064P255110J0918062J7593045K9549518M7278074N8832491N4541937
10525B53555301N6654237O4004655N239877q8782738r1398634n7717251l4331317
10518A07224130k1117735j3547989r134960o860151n836962n221537m410882l534718
10510C7559196k716428k175073j919325j676644j471962j386336j241256j076661
10502B3895511r04596p26365n57035o72466j070263r57182p04487n45148n17946
$$ y = [1842533, 1982984, 2144246, 2338029, 2468811, 2419959, 2534683, 2818929, 3238399, 3899746, 4622925, 5513291, 6630639, 7698626, 8530005, 9166374, 9524318, 9658426, 10018780, 10312418, 10423241, 10735006, 11197483, 12024216, 13482284, 15705347, 18634926, 22412777, 27587064, 34842174, 45760236, 63353281, 92902799, 140180873, 199013364, 253555301, 310209538, 374214193, 379454070, 290671332, 199272698, 141555447, 107224130, 86106395, 72558406, 63423446, 56563295, 50726333, 45504796, 41093914, 37559196, 34842768, 32667695, 30748370, 29071726, 27599764, 26213428, 24972172, 23895511, 22990915, 22264550, 21707515, 21035049, 19964786, 19007604, 18303117, 17757969, 17240023]
10493A7240023n04420m75828m88017m75497m94765n07855n31285m41883m04872
10484A2915601m16298l82538l37060l42236l95392l44006l71659l62210k82284
10475I681918k38846k36108k62673k16029j52505k02969k70566k75500k12915
10466G613807k01678j93716k53876k50343k63050k41696j80554j73444j23262
10457E732188j20556r0610j18665j47802j04180j62454j31327j11031j66176j39327
10447D440060j48575j04294j29430q9939o4904m0470m5156o4648j7891q1020o8914
10436C584819p0756j32709j29040o5262k3272r3505p6080m6686q0581p1809p2625
10425B722494j05360j16394p4282m0450q9407l6860l9755n5139N50k4036q2151
$$ y = [17240023, 16735603, 16259775, 15771758, 15296261, 14801496, 14293641, 13762356, 13320473, 12915601, 12499303, 12116765, 11779705, 11437469, 11042077, 10698071, 10326412, 9964202, 9681918, 9443072, 9206964, 8944291, 8728262, 8575757, 8372788, 8102222, 7826722, 7613807, 7412129, 7218413, 6964537, 6714194, 6451144, 6209448, 6028894, 5855450, 5732188, 5611632, 5521022, 5402357, 5254555, 5150375, 4987921, 4856594, 4745563, 4579387, 4440060, 4291485, 4187191, 4057761, 3967822, 3902918, 3862448, 3817292, 3752644, 3734753, 3653733, 3584819, 3514063, 3381354, 3252314, 3187052, 3163780, 3070275, 2994195, 2947509, 2866928, 2795119, 2722494, 2617134, 2500740, 2426458, 2386008, 2296601, 2259741, 2219986, 2164847, 2165397, 2141361, 2059210]
10414B059210j00086q0996p3533k3264K7995n6294p5793j3591r292l8048j2676
10403A603632K370l901j0629m2705l9814J229l1129n5272p6649q9292O2879M3641
10391A364360l5443o8146m4435o1046n8882o5613K8563m2620J1535p884l4782
10380I85607n8117j3203q882L0599J7129k4280p0899l6086J6798L7494K717K4021
10368I02898m6039q0248n7229q0334k5110j5852L941J6761O4034J8349R948o2449
10356F48670o2005M6265M6571q114O225q200k2929k1534j178N061m4855m5351
10344E38626m3243l1903l6308o9949L7928M2985K0680R3614O8317K0584k8105
10333F13226p4899o2952o0816p6533P9M0464M5800k5940l20J5724L0033n3824
$$ y = [2059210, 1959124, 1878128, 1804595, 1781331, 1809326, 1753032, 1677239, 1663648, 1654356, 1616308, 1603632, 1606002, 1602101, 1591472, 1548767, 1508953, 1510182, 1479053, 1423781, 1347132, 1257840, 1320719, 1364360, 1328917, 1260771, 1216336, 1155290, 1096408, 1030795, 1059358, 1016738, 1028273, 1020389, 985607, 927490, 914287, 905405, 936004, 953133, 928853, 857954, 821868, 838666, 876160, 878877, 902898, 856859, 776611, 719382, 639048, 613938, 598086, 602027, 618788, 682822, 701171, 711119, 648670, 586665, 632930, 679501, 671387, 677612, 669412, 646483, 624949, 623771, 628832, 583977, 538626, 495383, 463480, 427172, 357223, 395151, 438136, 458816, 552430, 620747, 641331, 613226, 538327, 475375, 414559, 338026, 338105, 378569, 424369, 398429, 398109, 413833, 443866, 390042]
10321C90042j16636o1331k1099k7041O411O0288L580Q026n80M5746m0553n5551
10309A91302o018L9688n506L8520O2821K6139m4468p7957l6106l0317K261L2299
10297A92658L6492n4768k9530R723M5932K088l136m9415J0911J0514k5833O7485
10285B13121K3892o9315o0482j0803j8464l6798O4486P5210M3751l9094K2160
10274B07664K0968J5778n2099l5614l6428j1403N5650O9242L2719K1470L2138
10263C20085n0573j19187p5054P08p19N151K4322l6063K105J2774N7198N84p6152
10250F5179k7907J9088o6015J8752O2705Q9568O6389p6345q0296m383K7663j6044
10238G8354K4292n4546k0970O941M2044J4904J2103M3428j0407n0927J225o077
$$ y = [390042, 273406, 212075, 190976, 163935, 170346, 230634, 234214, 242240, 241660, 287406, 246853, 191302, 185284, 224972, 219466, 257986, 320807, 346946, 302478, 224521, 188415, 158098, 160359, 192658, 229150, 174382, 144852, 154575, 200507, 202595, 199459, 150044, 160955, 171469, 145636, 213121, 237013, 167698, 107216, 96413, 77949, 41151, 105637, 180847, 224598, 185504, 207664, 228632, 244410, 192311, 156697, 120269, 108866, 164516, 233758, 266477, 287947, 320085, 269512, 150325, 75271, 75979, 75260, 80411, 104733, 68670, 70775, 83549, 140747, 141331, 65179, 37272, 56360, -9655, 9097, 71802, 161370, 227759, 151414, 71118, 66735, 94398, 78354, 102646, 48100, 27130, 34071, 76115, 91019, 103122, 146550, 136143, 85216, 86441, 80364]
10226H0364O5950P2996m5770j5139K7897k2914j3002J4951L0731k3270k8064n351
10214A39379l3197p2944l0570L7845N9609m6974K7101K8691K5614K1722m2020
10203A14256n6161J0369L8580J9009N5610l8236n9632l8714j3698m2973j4580
10192b6170L6218R7265J2733k8951k633L1612l3886L4716J3721j0085j9164K8266
10180A33642m5952p2669k344K8404L6857L6387k377J4407K2515Q967l9969M5886
10168A63754P998o7758n153j4930l868l52j9862j4929J8523o586n521l0377K7582
10155D8521j0516M5858q183O8768O5928m2918l6715m583m8162N9443O1928l8208
10143A61161j7780J297l681K5624j7673j0423K046L3919N157o2823j473N653j3083
$$ y = [80364, 146314, 219310, 173540, 158401, 186298, 163384, 150382, 165333, 196064, 172794, 144730, 139379, 106182, 33238, 2668, 40513, 100122, 53148, 80249, 108940, 134554, 156276, 114256, 58095, 68464, 107044, 126053, 181663, 143427, 83795, 45081, 31383, -11590, -26170, 10048, 107313, 120046, 91095, 88462, 120074, 86188, 120904, 134625, 124540, 105376, 133642, 87690, 15021, 12677, 41081, 77938, 114325, 111948, 126355, 148870, 157837, 117868, 163754, 171752, 103994, 98841, 83911, 80043, 79691, 59829, 44900, 63423, 56837, 51316, 20939, 48521, 38005, 83863, 75680, 144448, 210376, 167458, 130743, 126160, 77998, 137441, 199369, 161161, 143381, 144678, 140997, 166621, 148948, 138525, 140571, 174490, 179647, 116824, 115351, 121004, 107921]
10130A07921K5716R309K7943m815K6654L5359r649J7945j3205k2415m4373j3424
10118A42966N9771Q0482Q5055J04744K15861K94848L64069L61428K75051K36713
10108B220988j77180n40503m74824k53896j60284o1927o1858p2828q5898J1190
10098C42980j5723j5814m8968j7931L1647l718k4515K1877k1053n8615J6912O2819
10086B69898P0597k247l2105o685m1696l7624k5254n9847J7337L3546m0575k6501
10074A18844L5065K7911P0849m6142o408p831L837J05437L8752k5356q0476o5911
10062A68571J959O9739M704o2151L6293k9019l6326K2591P5780N3778N1509R6601
10050D54029J46132K79733M10909K87138L94143M60193k27849p27970m72564k17018
$$ y = [107921, 133637, 142946, 170889, 166074, 192728, 228087, 218438, 236383, 223178, 200763, 156390, 142966, 202737, 283219, 368274, 473018, 688879, 983727, 1347796, 1709224, 1984275, 2220988, 2043808, 1503305, 1028481, 774585, 614301, 552374, 490516, 417688, 331790, 342980, 327257, 311443, 262475, 244544, 276191, 272473, 247958, 269835, 248782, 190167, 207079, 269898, 340495, 338248, 306143, 299458, 257762, 220138, 194884, 135037, 152374, 185920, 145345, 118844, 153909, 181820, 252669, 206527, 200119, 192288, 196125, 301562, 340314, 314958, 234482, 168571, 170530, 240269, 244973, 182822, 219115, 190096, 153770, 176361, 252141, 305919, 357428, 454029, 600161, 879894, 1290803, 1577941, 1972084, 2432277, 2204428, 1476458, 1003894, 786876]
10040G86876k09256j15586p1476k7367O5639M0053K2651K2450l5487o8069j4050
10029C96378M0852L2433m0491n1711r245l170Q60m3936l448n3753M4639R223N665
10016C24296M5475J4708p8315j1791O022L4276K3008k0276O873N1676k0875o265
10004C68812k2284m3708k1727m1018l6211K1861K3586J0366q5899J0821K7710
9993B12309K2965j2940N350K1796n2539j2866M5527M9899K917M6716M3526J0331
9981C82991m9276m4395j5335k2943q486M7154J8360K5379L3998J594K2623K244
9969C93908n3603M4428k4591j12k0243o052k7583n1665M299O6901J6543L1837
9957C74067k0317k6248l5403L1579M2050K6080k767O5285l3664l7543J7900k5540
$$ y = [786876, 577620, 462034, 390558, 363191, 428830, 468883, 491534, 513984, 478497, 410428, 396378, 437230, 469663, 429172, 377461, 368216, 365046, 365906, 321970, 318522, 264769, 309408, 318631, 324296, 369771, 384479, 306164, 294373, 300395, 334671, 357679, 337403, 344276, 395952, 375077, 368812, 346528, 302820, 281093, 240075, 203864, 225725, 249311, 259677, 173778, 184599, 212309, 235274, 222334, 227684, 249480, 196941, 184075, 229602, 279501, 282418, 329134, 372660, 382991, 333715, 289320, 273985, 251042, 242556, 289710, 308070, 333449, 367447, 369041, 391664, 393908, 340305, 384733, 360142, 360030, 339787, 333735, 306152, 254487, 258786, 325687, 342230, 374067, 353750, 327502, 292099, 323678, 365728, 391808, 389041, 454326, 420662, 383119, 401019, 375479]
9945C75479O536k771j3747J0056N1925K7284j0843O0415n8337p4721M0299J4774
9933D26349o24L1497K7776L203R019Q1412l2589n2037L5802k2848P468J2357P078
9920E33863L29J5519q518O0126N9370m893P947j8052l8263K314k8910m5852J3546
9907E48526M7732m2718j697R8028J18986j4495n5381K6257O3635J6202n4328l8804
9895G11943L5022L2991L9351O0365M7656K5723n794l3597l1565J5760l421L4965
9883I29399o074O8329J0946l7319q784m950K6459r159M4244L1255M315K6673N5928
9870A131262k4668k6791J2158l557M4868P5767L6627R6217K2810n4527k8405J3528
9858A295289O1287P7270J4303K095m0796r909P1573K8576K9774N7290M0568L5392
$$ y = [375479, 382015, 379244, 365497, 375553, 427478, 454762, 443919, 504334, 445997, 371276, 411575, 426349, 425725, 457222, 484998, 488201, 497220, 578632, 546043, 494006, 529808, 506960, 514428, 526785, 533863, 534192, 549711, 541193, 601319, 660689, 655796, 663743, 645691, 607428, 609742, 580832, 534980, 548526, 596258, 553540, 551843, 649871, 768857, 754362, 698981, 725238, 788873, 805075, 750747, 711943, 746965, 779956, 819307, 879672, 927328, 953051, 947257, 913660, 882095, 897855, 894434, 929399, 923325, 991654, 1002600, 965281, 956497, 951547, 978006, 968847, 1013091, 1044346, 1048661, 1075334, 1131262, 1106594, 1079803, 1091961, 1088404, 1133272, 1209039, 1245666, 1341883, 1364693, 1310166, 1281761, 1295289, 1356576, 1433846, 1448149, 1450244, 1409448, 1399539, 1471112, 1499688, 1529462, 1586752, 1627320, 1662712]
9846A662712M9488m4170N5776Q5383J9429J7591O6247J06499P3842k4636L4853
9835B103014R2532N1515K3758J9715P944M8852N9547R2452O1097M0927J45332
9824B746685J26017J60523J61476K11972K53791K92127L06006J18510M2676K372
9814D422155j33579k20539r8685l2413k6497k1304q182Q7538J02651J03989J21934
9803D297068O9679M8170N8388M2460Q1875J17776J08102M9302O1335J24866J84981
9792E244002J81424Q0867P6186J21563P9896J56309N3921Q1673J59567J50501
9782F385909O9828J22649J77876J59381J32027J00445Q8719J08368K20132J48602
9772G713936O4394M4713P2526R7080J24500R4076J00074J12521J27140J22519
$$ y = [1662712, 1712200, 1668030, 1723806, 1809189, 1828618, 1846209, 1912456, 2018955, 2092797, 2068161, 2103014, 2195546, 2247061, 2270819, 2290534, 2298478, 2347330, 2406877, 2499329, 2560426, 2601353, 2746685, 2872702, 3033225, 3194701, 3406673, 3660464, 3952591, 4258597, 4377107, 4419783, 4422155, 4288576, 4068037, 3969352, 3936939, 3910442, 3889138, 3880956, 3968494, 4071145, 4175134, 4297068, 4366747, 4414917, 4473305, 4515765, 4597640, 4715416, 4823518, 4872820, 4934155, 5059021, 5244002, 5425426, 5506293, 5582479, 5704042, 5783938, 5940247, 5994168, 6075841, 6235408, 6385909, 6455737, 6578386, 6756262, 6915643, 7047670, 7148115, 7236834, 7345202, 7565334, 7713936, 7778330, 7823043, 7895569, 7992649, 8117149, 8211225, 8311299, 8423820, 8550960, 8673479]
9762H673479N6756R1592L4452M4218O1058m984L545J03545L0491k3315M4368J1470
9750I126675n2532K0846N5190L88n2707j9629m4432l9290l3599j645N4904n7747
9738H956422p7297n6256p805j8208p7371j10412j70465n4019m5656q7159o8767
9727H183007p2599p9797j24570o7128j64932j31891p7190o0075l4378r0562j29083
9716G150802r9011l5003q0123j19989n7912l3056j14374j00898o9439p9888j31345
9705F229764q1485p1605m6671k1484q4462j04739q1492j24156l5851k2599o7346
9694E487874r1088p0206o7110j00340p1036r6479p0047o1499o3243p4909j09986
9683D611931r1938q7009l0871l1334k2658m841l3752J0026m3488l0992q8087r8886
$$ y = [8673479, 8730235, 8821827, 8856279, 8900497, 8961555, 8956571, 8960116, 9063661, 9094152, 9070837, 9115205, 9126675, 9074143, 9094989, 9150179, 9150567, 9097860, 9078231, 9033799, 8994509, 8960910, 8959265, 9014169, 8956422, 8879125, 8822869, 8815064, 8796856, 8719485, 8609073, 8438608, 8384589, 8338933, 8251774, 8183007, 8110408, 8030611, 7906041, 7838913, 7673981, 7542090, 7464900, 7404825, 7370447, 7279885, 7150802, 7051791, 7016788, 6936665, 6816676, 6758764, 6725708, 6611334, 6510436, 6440997, 6361109, 6229764, 6148279, 6076674, 6030003, 6008519, 5924057, 5819318, 5737826, 5613670, 5577819, 5555220, 5487874, 5396786, 5326580, 5259470, 5159130, 5088094, 4991615, 4921568, 4860069, 4796826, 4721917, 4611931, 4519993, 4432984, 4402113, 4370779, 4348121, 4343280, 4309528, 4319554, 4276066, 4245074, 4156987, 4058101]
9671D058101r9447p2360j7735n2589l2134J9219r0665j66288k5440l0523j6561
9660C473578l6284o6407O289j09141l1029k3435K5691k6962n5802q7048j28638
9649B940812L1689j2742m8453q4612j7019j8441L8328J6950k6234q6957l9589
9638B693732n5009J3922r04o3216j00672N3748k0414n9198J5716Q631o4737j2549
9626B409050q821J2656O469o4618m7371o6160m6713J7815J8464j9334J8244m2005
9614B187676o2354o878k0999m04m5680k1103n3975o8655O6246J425q7203m0497
9602A847599n223m939P509j1029j0857N5916M6952Q441k3678q8285m4492M4558
9590A822472J0145k1036q7785n2700k5206k5408K5461k8893n373o1615J145R087
$$ y = [4058101, 3958654, 3886294, 3868559, 3815970, 3783836, 3803055, 3712390, 3546102, 3520662, 3490139, 3473578, 3437294, 3370887, 3377176, 3268035, 3237006, 3213571, 3239262, 3212300, 3156498, 3069450, 2940812, 2972501, 2959759, 2911306, 2826694, 2809675, 2791234, 2829562, 2846512, 2820278, 2733321, 2693732, 2638723, 2652645, 2651741, 2588525, 2487853, 2541601, 2521187, 2461989, 2477705, 2486336, 2421599, 2409050, 2400229, 2412885, 2419354, 2354736, 2307365, 2241205, 2194492, 2212307, 2230771, 2211437, 2229681, 2187676, 2125322, 2118444, 2097445, 2097041, 2051361, 2030258, 1976283, 1907628, 1973874, 1975299, 1888096, 1847599, 1842376, 1837437, 1844946, 1833917, 1823060, 1878976, 1925928, 1934369, 1910691, 1822406, 1777914, 1822472, 1832617, 1811581, 1723796, 1671096, 1645890, 1620482, 1645943, 1617050, 1611677, 1550062, 1551207, 1560294]
9578A560294n1690O1168N547l9255m4570p1267n922k0707K8113M6150L7562k7457
9566A477966j0284j7378k7149K0393J2571P268M403P14k9747k1496o1564K4700
9554A380397O5214K819j9477M7819L8222m1575p5883p2142J3187P4889M5441L2498
9542A491409K2650N875P6242j6162j4238P9975J22235J12789J83161J36848M5847
9531B246631r7450o3467p3729j35820q9258m7727r790k551r5642j35926k3850
9520A471421m0650m8922j0631N94K9687M6297j8948m3738l0359j6175k8455J466
9508A311587k0784L279L5996k6742k1336j944O6317O7743J0525l8766n1825J6874
9496A350924J14665M3731Q6343P3943J22404O5104N6735J81388J8703j5367o1837
$$ y = [1560294, 1508604, 1569772, 1575319, 1536064, 1491494, 1420227, 1414305, 1393598, 1421711, 1467861, 1505423, 1477966, 1467682, 1450304, 1423155, 1443548, 1456119, 1463387, 1467790, 1468504, 1438757, 1417261, 1355697, 1380397, 1445611, 1448430, 1428953, 1476772, 1514994, 1473419, 1397536, 1325394, 1338581, 1413470, 1458911, 1491409, 1514059, 1519934, 1596176, 1580014, 1565776, 1645751, 1767986, 1880775, 2063936, 2200784, 2246631, 2149181, 2085714, 2011985, 1876165, 1786907, 1739180, 1729390, 1726839, 1631197, 1495271, 1471421, 1430771, 1381849, 1371218, 1371812, 1401499, 1447796, 1428848, 1385110, 1354751, 1338576, 1310121, 1311587, 1290803, 1294082, 1330078, 1303336, 1282000, 1280056, 1346373, 1414116, 1424641, 1385875, 1334050, 1350924, 1465589, 1509320, 1595663, 1669606, 1792010, 1857114, 1913849, 2095237, 2113940, 2098573, 2036736]
9485B036736j92796j62777j03093q5533j02999j9240o2622r176k0594l4821O440
9474A249525m2956j0053m0936J6071j171l9570j8734N5205J276r557K8626K0328
9462A208054J849n8975j6243L7927k7707n7237Q642K717j2007L474L7517k781
9450A125230l5713r171l6722j406P6147n571k3471j5119J4176k3693o1746l0107
9438I72834M8343J6977L1315M4268j1647l819k9597n2781l8995K0517M3970l813
9426A037572j7172L5962M1175j0940l1361q2678L9903k030k003K1590j9172j1810
9414I99036R440J1991k3832l8621M0949l1016l3298J8721L1555O9839J8848P032
9402A080644K2261N5087k1813m7945k8847j0089j0243N097p5395j849N730K3144
$$ y = [2036736, 1843940, 1681163, 1578070, 1492537, 1389538, 1370298, 1307676, 1298500, 1277906, 1243085, 1249525, 1206569, 1196516, 1155580, 1171651, 1170480, 1130910, 1112176, 1167381, 1168657, 1159100, 1187726, 1208054, 1209903, 1150928, 1134685, 1172612, 1144905, 1087668, 1096310, 1099027, 1087020, 1090494, 1128011, 1125230, 1089517, 1080346, 1043624, 1042218, 1118365, 1112794, 1089323, 1074204, 1088380, 1064687, 1002941, 972834, 1021177, 1038154, 1069469, 1113737, 1102090, 1098271, 1068674, 1015893, 976898, 997415, 1041385, 1037572, 1020400, 1056362, 1097537, 1086597, 1055236, 972558, 1012461, 1010431, 1008428, 1030018, 1010846, 999036, 1008476, 1020467, 996635, 958014, 998963, 967947, 934649, 953370, 984925, 1054764, 1073612, 1080644, 1102905, 1157992, 1136179, 1088234, 1059387, 1049298, 1039055, 1044152, 968757, 966908, 972638, 995782]
9390I95782L9089j1576l3648j6047j0344L7996k7533m0679O5848Q9465J2975N078
9378A106406k8375k0754N1323j1243r822j3243J115j5871j767q376j4222n5561
9366I79610N0591N4664J1379K425L6602L839L4228l5687p2258p143J652K669O8377
9353A130948j4805m2513n8499l7680N5954P9832n2773N3993M2014k6605K8182
9342A158048j8156R342L1011j2490J1401l5796n8819J0342k4996M1839M1947L5832
9330A189505L2003j5431n6216m6800K0153L2200o336N6742O0317k6686o1588n6388
9318A121475k540j3284N955K9984P0143M2981o2256m0505N1648N5611L7938J7367
9306A314517j3489m9952j2024L9883K7403k283m3931r128O4534M6466K0379j8664
$$ y = [995782, 1034871, 1023295, 989647, 973600, 963256, 1001252, 973719, 933040, 998888, 1088353, 1101328, 1106406, 1078031, 1057277, 1108600, 1097357, 1087535, 1074292, 1075407, 1059536, 1057769, 1049393, 1035171, 979610, 1030201, 1084865, 1096244, 1098669, 1135271, 1139110, 1173338, 1137651, 1065393, 1058250, 1059902, 1062571, 1130948, 1116143, 1073630, 1015131, 977451, 1033405, 1113237, 1060464, 1114457, 1156471, 1129866, 1158048, 1139892, 1149234, 1180245, 1167755, 1179156, 1143360, 1084541, 1094883, 1069887, 1111726, 1153673, 1189505, 1221508, 1206077, 1149861, 1103061, 1123214, 1155414, 1149078, 1205820, 1266137, 1239451, 1177863, 1121475, 1118935, 1105651, 1111606, 1141590, 1211733, 1254714, 1192458, 1151953, 1203601, 1259212, 1297150, 1314517, 1301028, 1251076, 1239052, 1278935, 1306338, 1304055, 1260124, 1250996, 1315530, 1361996, 1382375, 1363711]
9294A363711n3030l4737J8232k9638o5223O7035k999l9963N8700R1741L3151K6443
9282A433423l276R376j0848K5732j1849J4511n0151k6069J6808M6689L0384j0316
9270A464414K003L6534M3510J3549l0713K590K2307J1095l0109m4950K4515M0010
9258A554755K9904p088L8654J9234l5286l1331O378k936l9348o940J4951M4030
9246A584977Q1223J4827l5242J9643j3088k09j1591l2984k1157P229O6658J5261
9234A675547l8174J5785O3700J4042O7865L5954o7122j9785r994k2863l6264j7672
9222A661019K3242K5839j4870o260k6890j6635k26j4329P5870M5778k8239l5988
9210A688311N1804N1523l1951J446K3049k6238P087M1898N301j3229j1967K5060
$$ y = [1363711, 1310681, 1275944, 1294176, 1264538, 1199315, 1266350, 1263351, 1223388, 1282088, 1373829, 1406980, 1433423, 1430147, 1439523, 1428675, 1454407, 1442558, 1457069, 1406918, 1380849, 1397657, 1444346, 1474730, 1464414, 1466417, 1502951, 1546461, 1560010, 1529297, 1531887, 1554194, 1565289, 1535180, 1490230, 1514745, 1554755, 1584659, 1577571, 1616225, 1635459, 1600173, 1568842, 1575220, 1572284, 1532936, 1525996, 1540947, 1584977, 1666200, 1681027, 1645785, 1665428, 1652340, 1652131, 1640540, 1607556, 1586399, 1593628, 1660286, 1675547, 1637373, 1653158, 1716858, 1730900, 1798765, 1834719, 1767597, 1747812, 1737818, 1714955, 1678691, 1661019, 1684261, 1710100, 1695230, 1688970, 1662080, 1645445, 1645219, 1630890, 1706760, 1752538, 1724299, 1688311, 1740115, 1791638, 1759687, 1761133, 1784182, 1757944, 1765031, 1806929, 1812230, 1799001, 1787034, 1812094]
9198A812094l2681n4714p597K3992N121m505Q562J6440K4888q077J2379l6128
9186A759774j1824k2020M0707Q411l2232o3262l6622L0494L2123K6393J7947l5375
9174A714514j11484j7577M6170N0046J3086j5890j6288l7972k872k1310n7459
9163A542964m1477j8933R628K860J2318J7604K5078l7309l7204n7982L44J2487
9151A430378m341l870O763n2750o6418M0353j6751k8333J668L0040K9121J7964
9139A383824J6353p602m0553j6934K0656j2276k2169m4559j6976Q449K2950j9068
9127A272095l3502l2612k1982j9614m4851l6999j0747l533K8740P941K0388J578
9115A126902J3822L5163k9448n9597j2610r8325j12589m3108k456J7891N4516
$$ y = [1812094, 1779413, 1724699, 1717102, 1741094, 1746215, 1741710, 1750272, 1766712, 1791600, 1783523, 1795902, 1759774, 1747950, 1725930, 1766637, 1775048, 1742816, 1679554, 1642932, 1673426, 1705549, 1731942, 1749889, 1714514, 1603030, 1585453, 1631623, 1681669, 1694755, 1678865, 1662577, 1624605, 1621733, 1600423, 1542964, 1501487, 1482554, 1492182, 1495042, 1507360, 1524964, 1550042, 1512733, 1475529, 1417547, 1417891, 1430378, 1426037, 1422167, 1428930, 1376180, 1309762, 1350115, 1333364, 1305031, 1306699, 1336739, 1365860, 1383824, 1400177, 1392575, 1352022, 1335088, 1355744, 1343468, 1321299, 1276740, 1259764, 1268213, 1291163, 1272095, 1238593, 1205981, 1183999, 1164385, 1119534, 1082535, 1071788, 1068255, 1096995, 1104936, 1125324, 1126902, 1140724, 1175887, 1146439, 1086842, 1074232, 975907, 863318, 820210, 817754, 835645, 890161]
9104H90161N839J1977k0951k6690j9571K3122J5393q927r84l6386m6310k9763
9092G56910J5273n037N4872L176l0354q610l2277L1889M8756M4407M5630n6386
9080H68249q2216n1452l6647o2258j199L8369J2810m8489k3788q280K0888k9628
9068E96359K9991k2662l4531K3633M519N4291r152r231k5772k3482L2598K6662
9056F43223r396j6420l038o3350Kj2576j14958j8665J33702N4643K7356m7642
9044E72881K7033j1632k4426k2964o1975l4301M7278J2406j2242j932l4935m9764
9032D05427j1590j5273Q4665J6278m3533j1611M8472l8444k2232K8179j8288n638
9020D16412J5453k3386j0010M6904l4290k8049l6105p763L5495m3166k6246p323
$$ y = [890161, 896000, 907977, 887026, 860336, 840765, 863887, 879280, 870353, 869369, 832983, 786673, 756910, 772183, 767146, 822018, 825194, 794840, 786230, 753953, 785842, 834598, 879005, 924635, 868249, 786033, 734581, 697934, 635676, 634477, 672846, 685656, 637167, 613379, 605099, 625987, 596359, 626350, 603688, 569157, 592790, 597309, 651600, 642448, 633217, 607445, 583963, 616561, 643223, 633827, 617407, 614369, 551019, 551021, 538445, 423487, 404822, 538524, 593167, 620523, 572881, 599914, 588282, 563856, 540892, 478917, 444616, 491894, 504300, 492058, 490126, 455191, 405427, 393837, 378564, 463229, 479507, 435974, 424363, 472835, 434391, 412159, 440338, 422050, 416412, 431865, 408479, 398469, 445373, 411083, 383034, 346929, 339166, 374661, 331495, 305249, 297926]
9008B97926j1855J7540M4380K3399l4397j7867l3927R145Q171k6794j9414L1837
8996B88144J7172J0051j914l91j7665l7795m5573N567K497J965K8843L8605o622
8983B82884k2232p2834K4226L7793l4753l7558L4509M338m9003k132J1939M1453
8971B18630J4793k7742j8324j633L503J1046J7975m738K1815J7275K6587j9662
8959B59525p9964o7124p726K7586J0140k1201O8712p413j4379m724K6435q611
8947A81256m2430m3186P0044K0740L8429l4366l8201j8574l0235Q5n379K576j014
8934I9745M9046l135o122K5423L4287j8361j9645O1312J9185o9478p3943J1589
8922A09903k3651n0534P213k7546j1239k903O4208N6228O5131m3848m818M9118
$$ y = [297926, 286071, 303611, 347991, 371390, 336993, 319126, 285199, 294344, 302515, 275721, 256307, 288144, 305316, 315367, 313453, 313062, 295397, 257602, 212029, 217596, 220093, 222058, 250901, 289506, 282884, 260652, 187818, 212044, 249837, 215084, 177526, 212035, 216373, 167370, 165238, 177177, 218630, 233423, 205681, 187357, 185724, 189227, 200273, 218248, 213510, 235325, 252600, 279187, 259525, 179561, 112437, 104711, 132297, 142437, 121236, 189948, 182535, 168156, 163432, 189867, 181256, 138826, 95640, 165684, 186424, 224853, 190487, 152286, 133712, 103477, 103562, 98183, 100759, 99745, 148791, 145656, 139534, 164957, 199244, 180883, 161238, 222550, 241735, 172257, 98314, 109903, 86252, 35718, 42931, 15385, 4146, 1243, 65451, 121679, 186810, 142962, 138144, 187262]
8910A87262l7910l5780n010j040k9124k9388L758j740j5112N0539K4361L1017
8898A41833R626K5992l4884M616k75m9402N1976k2948o7237l9870j1042M6609
8886E4994J7815j7106R787L6169j1521k0180N6743N6449N3468n4196p1776k3260
8874H7386L6402J6355n4382J9091K1984L8027J370m3277p4079r460K9638J7533
8862H6588o5020n026l9396k1478K6712L1625m146Q437J0177K509l5054m6857n828
8849e6757O6739M2423L0932l2616r539L4091K5979L4548n0894o3808n4989M711
8837b9180J9170J0035k147M7639L8183r429m2648P8899J4242k470J3745j3467
8825A22572o389J8989J9466m9682N879k0215o8282n2052M0760Q5143J29536m7643
$$ y = [187262, 149352, 113572, 108562, 107522, 78398, 49010, 52768, 51028, 35916, 86455, 110816, 141833, 151459, 177451, 142567, 147183, 146908, 97506, 149482, 126534, 59297, 19427, 8385, 54994, 72809, 55703, 65490, 101659, 90138, 69958, 126701, 183150, 236618, 182422, 110646, 87386, 123788, 140143, 85761, 104852, 126836, 164863, 166233, 122956, 48877, 39417, 69055, 86588, 21568, 16542, -22854, -44332, -17620, 14005, 9859, 18296, 28473, 30982, -4072, -50929, -56757, 9982, 52405, 83337, 50721, 41182, 75273, 101252, 135800, 84906, 21098, -33891, -29180, -10010, 25, -2122, 45517, 83700, 74271, 31623, 110522, 124764, 122294, 136039, 122572, 116183, 135172, 154638, 104956, 110835, 90620, 22338, -29714, 11046, 96189, 225725, 178082]
8813A78082n1629l0394J5284o2236K2962l3344k4714M82L7518J1948N955k4926
8801D4988j9694k8889K0264R901K9011O9850J5971l326O0976m399n2840J024K5626
8788A68463n1140k8803k2158R711q56K9154n9498k9559J9869m9532q6236n062
8776a05647N9421L6749p166M7763n8709m1073M8271K4862j4272j9231O709K4531
8764B208l5779L1150M4669J3132J8151p865m5435j2465L290k837N531L6266N7961
8751A07977k847m3634K4756M777l7235k8515J9934L4000p5961q838L5282J1864
8739D1560L4889l9328l6924N687Q646M3116L3954J6005r433j0828l1260l8869
8727A7215l800K630p53k9306J8542L1793L7865L3974L4122k3802q3041l1966L9387
$$ y = [178082, 126453, 96059, 111343, 49107, 72069, 38725, 14011, 14493, 52011, 63959, 69914, 44988, 25294, -3595, 16669, 26570, 55581, 125431, 141402, 138076, 199052, 194653, 141813, 142837, 168463, 117323, 88520, 66362, 76073, 75217, 104371, 44873, 15314, 35183, -14349, -100585, -105647, -46226, -9477, -16643, 31120, -27589, -68662, -20391, 4471, -9801, -29032, -22323, 2208, -33571, -2421, 42248, 55380, 73531, 65666, 20231, 7766, 11056, 8219, 13750, 50016, 107977, 105130, 61496, 86252, 91029, 53794, 25279, 45213, 79213, 3252, -5586, 29696, 41560, 76449, 37121, 197, 5884, 14530, 57646, 91600, 107605, 98172, 87344, 56084, 17215, 13415, 16045, 15292, -14014, 4528, 36321, 74186, 108160, 142282, 118480, 35439, 3473, 42860]
8714D2860R982N599j2566k7275K5141j6093j6131Q437K8256n3968l061K5920J3501
8701C0602m4810l1998L1154L8528L9071J9609J0188R408J0281L5176M200P671
8689A59080K6853N1472K314Q1870P7191J1218p1602k6575j0309l8558n0735q0029
8677A32190m9195k2909m7101L5940O7928L9964K0969J1607j5905o1144k1326L1846
8665A22864j1926k8523o600J8040j8919j7574j4248o1314l2367Q9837N10p276
8653C2504J5357Q535N00P8176L7735L3156N0408K3205J2895M594Q7276J29833
8641E14174L5682L6420J27657M4035p0407j05588r5629j09094r5502k5128m0183
8630B16437J1392K5785L7620k7047l3923M7298n929M13M2198K395o4494j7325
$$ y = [42860, 52842, 58441, 45875, 18600, 43741, 27648, 11517, 19954, 48210, -5758, -8819, 17101, 30602, -14208, -46206, -15052, 23476, 62547, 82156, 92344, 101752, 112033, 147209, 151409, 159080, 185933, 237405, 239719, 321589, 398780, 409998, 338396, 311821, 301512, 262954, 212219, 132190, 82995, 60086, 12985, 48925, 116853, 156817, 177786, 189393, 173488, 112344, 91018, 122864, 110938, 82415, 75815, 93855, 74936, 57362, 43114, -18200, -50567, 39270, 39780, 32504, 47861, 56396, 56896, 135072, 172807, 205963, 256371, 279576, 292471, 297065, 384341, 514174, 549856, 586276, 713933, 757968, 687561, 581973, 486344, 377250, 281748, 256620, 216437, 227829, 253614, 291234, 264187, 230264, 277562, 271633, 272046, 314244, 316639, 252145, 234820]
8618B34820m1170o7954j9424N0348N2453j9204k6657M3720j3535J8727n0749n3159
8606A08216K0118L3933K0003R158J7577L4867J2775K3465K9898O9587J29180O4089
8594E72866K4168J0905R1943j5259j20607j17638n4393n3434j08990p0021M3776
8583B03316L5881K6500l0747j04567j2526j6819l024L2311k6515J0207Q644J4461
8571A37122K9759J9267m8507m5275n730j7330p5129R081Q4831L0136n4748o0317
8559C160l8575M1022M7833o64O8892k945K124K6866L1712m7095k4673o568o656
8546I4433o596L810m2149M516R44O734j6105k4132J3579K6881J5399K9633j3800
8533I3147N2441J1482o1201p4870J8920K2866K1825K4094j5202N753k0084m6590
$$ y = [234820, 193650, 125696, 106272, 156620, 209073, 189869, 163212, 206932, 193397, 212124, 161375, 108216, 128334, 162267, 182270, 191428, 209005, 243872, 256647, 280112, 310010, 379597, 508777, 572866, 597034, 607939, 699882, 684623, 564016, 446378, 391985, 338551, 229561, 159540, 203316, 239197, 265697, 234950, 130383, 117857, 101038, 98014, 130325, 103810, 114017, 122661, 137122, 166881, 186148, 137641, 92366, 86636, 69306, -5823, 3258, 88089, 118225, 63477, 3160, -35415, 5607, 53440, 52776, 121668, 118723, 120847, 147713, 179425, 132330, 107657, 101089, 94433, 87837, 91647, 49498, 54014, 54958, 61692, 45587, 21455, 35034, 61915, 77314, 106947, 93147, 145588, 157070, 95869, 20999, 39919, 62785, 84610, 108704, 93502, 99255, 79171, 32581]
8521C2581j6505O727M370m438l5942l341P6849L0664P409o9914k8643L3930K058
8508C5805M6187N5719l475k059k8449j09867l38O8122K5707K5658p4055n7085
8496a8130L805L6398K3728l4627m17M807o169n053O0182j4180j5666l8868K58
8483c932K3260j2848l3811N1179O3081j2804l4545J6972l9984n2608O0433L5795
8471F0188J2483K0706j1469j1541j0555k4225N3281K2316o3244J5417J5720j5709
8459F3368L02j8118K4886O919J2230r0452j2335P5982J7993n3661Q84J3128K5584
8446F6710M0539m5013M294J1712J2523m9606q5000l600R5331M1275j8474j1353
8434E9338K3598l7302j0709P033p934l0640r585M8684k2665l5703O2771J8427
$$ y = [32581, 16076, 22803, 27173, 22735, -13207, -16548, 60301, 90965, 98374, 28460, -183, 33747, 35805, 81992, 137711, 134236, 132177, 103728, -6139, -6477, 61645, 87352, 113010, 38955, -18130, -14325, 22073, 45801, 11174, 10757, 15564, 9395, 4342, 64524, 50344, 34678, -4190, -3932, 19328, 6480, -27331, 23848, 86929, 74125, 39580, 56552, 16568, -36040, 24393, 60188, 72671, 93377, 81908, 70367, 59812, 35587, 88868, 111184, 47940, 63357, 79077, 63368, 63670, 45552, 70438, 77357, 89587, -865, -13200, 62782, 80775, 27114, 27998, 41126, 66710, 107249, 62236, 66530, 78242, 90765, 41159, -43841, -47441, 47890, 89165, 70691, 59338, 82936, 45634, 34925, 41958, 34024, 3384, -6201, 42483, 19818, -15885, 46886, 65313]
8422F5313J4574L341n9835k7585k1632L1595K6664l7126L8026J9557k4506J308
8410B9694M3645M9085n3145l671k7406J2039l9781m4531J2424Q215n8040l8308
8398a09780l091K5090O0050O7260L8272K989J7546N733M855o0226k6343P683K8299
8385E8337K2926j2640q0871j8779J2140J252L7569l983L395J0110P234k5645M7422
8372E8467k2204l5614J2976L0863K0337m0500k1389j0085J210l497m1318P2140
8360B1386K4858k8559l0571k4328K0435j102K3181J1643L3252j4060R715N6993
8348A02843M1878k320L9231K4282n0106q9872l61K8719l3154K8431Q040j998K2238
8335A17851r7O2175K9684j0497m7007K0463K4127n4471n8102o6172K8952J8589
$$ y = [65313, 79887, 83228, 23393, -4192, -25824, 5771, 32435, -4691, 33335, 52892, 28386, 29694, 73339, 122424, 69279, 65608, 38202, 50241, 10460, -34071, -21647, -13432, -71472, -109780, -112871, -87781, -27731, 39529, 77801, 80790, 98336, 104069, 108924, 48698, 22355, 30038, 58337, 81263, 68623, -12248, -31027, -18887, -17635, 19934, 15951, 19346, 29456, 36690, 11045, 58467, 36263, 649, 13625, 44488, 64825, 24325, 2936, -7149, -5939, -9436, -50754, 21386, 46244, 17685, -12886, -37214, -16779, -17881, 5300, 16943, 50195, 36135, 45850, 102843, 144721, 142401, 181632, 205914, 155808, 65936, 65575, 94294, 61140, 89571, 97611, 95613, 117851, 117754, 179929, 209613, 199116, 152109, 172572, 196699, 142228, 84126, 17954, 46906, 65495]
8323F5495n6415n9322N2226k310k6383M6504K3493l9947J1183j4779j3955K6847
8311A2637L1813M664j9564l8014m3182j3714j7265P5263K7590q2331K8359M5638
8299A1894L6793K1796J6867o15L2463Q5521K2283j0765L2514L331m1179o0176
8287A50727k9302q4506o2544N0131P3413J4768k1226q208j0224L8968N4821j6885
8275A49933j06614q1777k4994K0189M8947k0035J7020N1080J4244k0236k6070
8264B1687L5429L1789j6490k1073J2551K7674m6891p7003m8353r379M5886Q7124
8252D2951K3604k9816j3373k037K1927J2661k2681P99k0047o0280k4781L7475
8240c3598J9499k0840Q41P443J14760j3361m5199k530L3890P484J3042N0577m9445
$$ y = [65495, 9080, -50242, 1984, -326, -26709, 19795, 43288, 3341, 14524, -255, -14210, 12637, 44450, 49114, 29550, -8464, -51646, -65360, -82625, -7362, 20228, -62103, -33744, 11894, 48687, 70483, 87350, 86735, 119198, 204719, 227002, 216237, 248751, 252082, 210903, 150727, 121425, 36919, -25625, 24506, 97919, 112687, 91461, 83253, 73029, 111997, 166818, 149933, 43319, -38458, -63452, -43263, 5684, -14351, 2669, 53749, 67993, 47757, 21687, 57116, 88905, 72415, 51342, 63893, 91567, 44676, -32327, -80680, -90059, -44173, 42951, 66555, 36739, 23366, 21329, 43256, 55917, 33236, 34035, 13988, -46292, -71073, -33598, -14099, -34939, -34098, -26655, 88105, 74744, 29545, 27015, 60905, 68389, 81431, 132008, 82563]
8227H2563n6669J0266k5075J362K3790L3864j1813p2689q5924K1007M9526n918
8215c5710j3357O6722K5771J2125o135m4206m7976o8560J3727L0296R0487J5801
8203C8985j00346J6177n966N1958k0679J8027P537R2004M4408p2085l8851o311
8191B4858N1630R2k8591n2297j6686k74j3090n2616K6325O4612M5406n688m7545
8178c864l1497L3425n8641n8859j9353P3748K9575R159K7957J5434k6339P891
8166a364j3682n5314l115K2055K9991O7480L5110K075l2496k5823n6108l0273
8154f1464L855J0979M7586L7965n6711l2315L2030M4556m5196m4511O1882m4515
8142d5859j3813J3524K3668J3078o5025j0360K5928M7698L859J796L3444J4537
$$ y = [82563, 25894, 36160, 11085, 12447, 36237, 70101, 58288, -14401, -100325, -79318, -29792, -35710, -49067, 17655, 43426, 55551, 49416, 5210, -42766, -111326, -97599, -67303, 23184, 38985, -61361, -45184, -51150, 808, -19871, -1844, 5693, 97697, 142105, 70020, 31169, 24858, 76488, 76580, 47989, -4308, -20994, -21268, -34358, -86974, -60649, 3963, 49369, 43681, -3864, -35361, -1936, -60577, -119436, -138789, -65041, -35466, -26307, 1650, 17084, -9255, -1364, -15046, -70360, -73475, -51420, -21429, 46051, 81161, 83236, 50740, 24917, -31191, -61464, -57609, -46630, 956, 38921, -17790, -50105, -18075, 26481, -18715, -63226, -1344, -45859, -59672, -46148, -22480, -9402, -74427, -84787, -58859, -11161, -7302, -5506, 27938, 42475]
8130D2475j8011j498J4309K1458m0012k088k3430o4771K1183J2875K526J0851
8118b4133k0469p063K4053k7965l3213M955N565M6413Q710L0943m859o7387p1048
8105a35498N1823N7781J216Q434R850R293k9835l0455L8086O280k5146k0478J7997
8092d0652k791L6180N6083N4425l4559r1920l163M9041L5326l8217l3572p108
8080b0927k3850j8953J0520L6017J1308j4800q475K0768P6910J2581m8940m3842
8068a1683o8639n1688M6525J9214K2698N195m8090K0100M802Q17J5413J5191L1259
8055A114N590K4580j5215j01491J3252P0137j7848o2581j7721L4104J3891L8799
8043a3389R063O1913j2865K1324j904m2043M6992k1932n5987J0482L3784O809
$$ y = [42475, 24464, 22966, 37275, 58733, 18721, 16633, -6797, -71568, -50385, -37510, -34984, -24133, -44602, -51665, -27612, -55577, -88790, -83835, -78270, -31857, -23147, 7796, 2937, -64450, -135498, -83675, -25894, -24678, -16244, -6394, 2899, -26936, -57391, -19305, -13025, -38171, -58649, -40652, -43443, -7263, 48820, 103245, 68686, -23234, -26397, 22644, 57970, 19753, -13819, -20927, -44777, -63730, -53210, -17193, -5885, -20685, -29160, -8392, 68518, 81099, 32159, -11683, -80322, -132010, -85485, -66271, -43573, -38378, -86468, -66368, -61566, -60749, -45336, -30145, 1114, 6704, 31284, 16069, -85422, -72170, -2033, -19881, -82462, -100183, -66079, -52188, -13389, -4326, 57587, 44722, 66046, 64142, 22099, 69091, 47159, -8828, 1654, 35438, 42247]
8031D2247J7086k834k7075J3231K2273l8590k4793n0195L2990J8326J5542R639
8019B7847N9302K7012j6803l2217l0203j31n8898m6629O674P8579k823j0335l8122
8006c6747M6378K6495j6006m1645j7185k1174O7084m6119m4264M2439P3235N9742
7994I2233m3757k1026J3455Q477k693n8016L1744J3080m9289n3703J6568L3334
7982a9593K1204K4602Q3799k9475p0005m7863n337j6494K6355P0922K3360l6277
7970B5198p2000J133R469k8114L8438K1711k8070m7148J4861Q4821N2830n837
7958F7292J5683l975j152k4390m4559j810o351J6582j4141n2621m160L4647r183
7945b8138o581k4128k9565K6764M8032O661k0007j9341M3412O2698j3404j5281
$$ y = [42247, 59333, 56499, 29424, 42655, 64928, 26338, 1545, -48650, -15660, 2666, 18208, 27847, 87149, 114161, 97358, 65141, 34938, 34807, -24091, -70720, -64046, 14533, 11710, 1375, -36747, 9631, 36126, 20120, -21525, -38710, -59884, 7200, -38919, -83183, -40744, 32491, 92233, 48476, 27450, 40905, 49382, 46689, -11327, 20417, 33497, -15792, -69495, -52927, -19593, 1611, 26213, 110012, 80537, 10532, -37331, -42668, -59162, -32807, 38115, 61475, 25198, -46802, -45669, -36200, -64314, -25876, -4165, -32235, -79383, -64522, 20299, 73129, 67292, 82975, 79000, 77848, 53458, 8899, 7089, 738, 17320, 3179, -49442, -53602, -18955, -28138, -34719, -58847, -88412, -61648, -13616, -6955, -26962, -46303, -2891, 59807, 46403, 31122]
7933C1122l7147K1726L0435J1868m8407l4912P3091P940j6085J7569J5355J1566
7921H4121K5669k9604p4369j5669m5791R800K9828K7340P2762K7942l5142j8564
7909E8323j8973j0740l8037r3541L006O6352J0184p884J8992J878N9683j9539
7897B9704j7883K5509m898j0551j8449o0612N8606Q500j653M0609Q307R574P0874
7884A37637m9509N925j5777k9934m8636k5803r819J0183M8099j5489k7843m2921
7872f3887K9071K272M8331r835k4498j2456J1586R8409J26279l9128m9020J174
7860A18298k6573n4147N143J5846N407K645M76j28737l7405M7453j9362N244J6652
7847d9060r987q68k3767M0701o778k753L7813J7591J5215m7674k3777m4063k6664
$$ y = [31122, -6025, 15701, 46136, 58004, 9597, -25315, 47776, 55716, 39631, 57200, 72555, 84121, 109790, 80186, 5817, -9852, -55643, -45843, -16015, 11325, 84087, 112029, 76887, 58323, 39350, 28610, -9427, -102968, -99962, -33610, -23426, -31310, -12318, -10440, 49243, 29704, 11821, 37330, 32432, 21881, 3432, -57180, 1426, 9926, 8273, 48882, 57189, 66763, 137637, 88128, 94053, 78276, 48342, -294, -26097, -35916, -25733, 22366, 6877, -20966, -63887, -34816, -32544, 15787, 5952, -18546, -31002, -19416, 78993, 205272, 166144, 117124, 118298, 91725, 37578, 42721, 58567, 63974, 66619, 67095, -61642, -99047, -51594, -70956, -65712, -49060, -59047, -59915, -83682, -42981, -49759, -52512, -14699, 2892, 18107, -29567, -53344, -97407, -124071]
7834a24071o634J5357p585P2854K741M272L204k318N4936l072J0106o8337K0325
7821b8222N4605J1322J3004j6665K395K6668k5279k8951l6918k2933L119L6266
7809a1589Q180K6953K44M432m9952k5379r725K1988L0858J588j7592N647n667
7796b0014K885m1916j2398L9994K8902K0629n1039J1981J9052n1753n1881l7020
7784a42578K945K4756K5118Q1679K9330m6902o0776o124L2485N1243L8723l995
7772B5904m17L1771J7192l6610m0606n4833J5614L9926K615J9635J1676J576j2112
7759B1331J2228M1462k7661p9503j1636L3555K1530j4901K5867P2010k7103l2644
7747C4535l3053L6986J6587O8477k7524r0963p2248P79P921N3097M0536K0237
$$ y = [-124071, -130705, -115348, -122933, -50079, -47338, -43066, -39862, -42180, 12756, 9684, 19790, -48547, -28222, 26383, 37705, 50709, 34044, 36439, 63107, 37828, 8877, -28041, -50974, -47855, -11589, -3409, 23544, 23788, 28220, -21732, -47111, -56836, -34848, -3990, -2402, -19994, -14347, -20014, -17129, -59045, -71443, -31449, -2547, 18082, -32957, -20976, -1924, -53677, -105558, -142578, -139633, -114877, -89759, -8080, 21250, -25652, -86428, -92552, -60067, -8824, 29899, 25904, 25487, 57258, 74450, 37840, -2766, -57599, -41985, -2059, 556, 20191, 31867, 33443, 21331, 33559, 75021, 47360, -32143, -43779, -10224, 11306, -3595, 22272, 94282, 67179, 34535, 1482, 38468, 55055, 123532, 96008, 5045, -67203, -66424, -58503, -5406, 35130, 55367]
7735E5367K4414J8766K5323j2375K0985k3046m1924j557l7224o9754n8818p389
7723a07232J3506L2330K0297J4989k6281n2119K849L2901N2026R7203Q058l5984
7711E2543K8894K0363p9971o4591L0255O4564l41j1266m5840l8120J1502L1871
7699a37j2009n5484k1497P67M2449O367K9740J5167K5007K9438K0989M26J3833
7686I5056L7541j1869l6840m0747Q547l4689j591K9731K3685j11173n2475N7232
7674c7592P0362m240j1981k0634o226K1188K9256k9188o6984M0092K6513N80l9456
7661b8310k1567k2167J6546j1112J6390j4450j5231R26m5196N2084n1866L5759
7649h8194N4280M0345Q8472m7254l5943m775k7502M442k0793K636L2677J9473
$$ y = [55367, 79781, 98547, 123870, 111495, 132480, 109434, 67510, 65953, 28729, -41025, -99843, -107232, -93726, -61396, -41099, -26110, -52391, -104510, -101661, -68760, -16734, 80469, 88527, 52543, 81437, 101800, 21829, -42762, -12507, 52057, 51716, 40450, -5390, -43510, -32008, -137, -12146, -67630, -89127, -88360, -45911, -39544, -9804, 5363, 30370, 59808, 80797, 81223, 95056, 132597, 120728, 83888, 43141, 51688, 16999, 15408, 45139, 68824, -42349, -94824, -37592, 32770, 28530, 16549, -4085, -10311, 10877, 40133, 10945, -56039, -15947, 10566, 11146, -28310, -49877, -72044, -55498, -66610, -50220, -64670, -79901, -78975, -124171, -72087, -123953, -88194, -33914, 6431, 94903, 47649, 11706, 6931, -20571, -16129, -36922, -34286, -1609, 17864]
7637A7864k3601M0975j569q8585K3263O3165o906q633l665N5205m4609q9488k5765
7624i2349L2192R882n1144N7495O1374j02188J7094J0663J9796M5257L3427j2474
7612B9025k3187M067l437J1774K131r949O223M7675L2537l4568l1923o6789l0648
7599f7069L6959L0971J0849l2601l1231L8896L5125M100o408m0621K1772K5199
7587B5941p4799K4144L0282m1518k0827Q182K3542J7364k2530L2333k8569p482
7575c3937K9202j7642O1169L3869k5466J7751p4592m0342J5618q381l4745R412
7563f8084J1532m7542k9137M9954K6441m273p599M048J3468p007O844p976L7760
7550b1571J9233O3563l7440M8012K2941o4354k9553j4415o2664m7647N3958O5424
$$ y = [17864, -5737, 35238, 33669, -54916, -31653, 31512, 24606, 15973, 12308, 67513, 22904, -66584, -92349, -60157, -50275, -101419, -43924, 17450, -84738, -67644, -56981, -37185, 8072, 41499, 29025, 5838, 9905, 6468, 18242, 20373, 10424, 16647, 64322, 96859, 62291, 30368, -36421, -67069, -30110, 861, 11710, -20891, -52122, -13226, 21899, 25999, 19591, -21030, 742, 25941, -48858, -24714, 5568, -35950, -56777, -48595, -25053, -7689, -30219, 2114, -26455, -33937, -4735, -22377, 38792, 72661, 47195, 64946, -9646, -49988, -34370, -42751, -77496, -68084, -56552, -104094, -133231, -83277, -56836, -61109, -68708, -64660, -51192, -58199, -51355, -59331, -21571, -2338, 61225, 23785, 71797, 94738, 30384, 831, -13584, -76248, -123895, -69937, -4513]
7538d513j7279k9161k654O0339k0880l1581l3916N2767K6355k5670J9251l0681
7526c7623k5664j0198J3427N092K2480M199O722j0220J4118j8845o0048K603N585
7513h8372L3023N8690l8319n198O3495l3553o8921J6623J4703j1693J1608J0166
7501c7748j5839j4808K6135M3920j4315l4251M4663N3476p6213m6430J0528K0977
7489c9905K2739K6307J8947l3833L9568k1678k7816j1576j0021N4129j119L5619
7477E1361K6458N344m1218K570l9229l1277J0376j9249R523o6891K3309M4713
7465b4210L7947l7252m4881l8358j517M043P3498k6639m4557J8380L7328K1733
7453b4485K6439j7722K0326p387J4014k8810k9346k2850o188L6069K0959L3610
$$ y = [-4513, -21792, -50953, -53607, 6732, -14148, -45729, -79645, -26878, -523, -26193, -6942, -37623, -63287, -73485, -60058, -54966, -32486, -28287, -21565, -31785, -17667, -36512, -96560, -93957, -88372, -55349, 3341, -34978, -40176, 23319, -10234, -79155, -62532, -47829, -59522, -47914, -37748, -53587, -68395, -42260, 1660, -12655, -46906, -2243, 51233, -24980, -71410, -60882, -39905, -17166, 9141, 28088, -5745, 33823, 12145, -15671, -27247, -37268, 16861, 15742, 51361, 77819, 83163, 41945, 44515, 5286, -25991, -15615, -34864, -25341, -92232, -68923, -24210, 13737, -23515, -68396, -106754, -108271, -104228, -30730, -57369, -101926, -83546, -46218, -24485, 1954, -15768, 4558, -2829, 11185, -17625, -46971, -69821, -76009, -39940, -18981, 14629]
7441A4629J2393m9781l7542J8711J2028J3532J9498N1224m5181o2149p8774J5982
7429a15430j1176J1227M7093N3266m153l3066j1810k634k6515p259q814N461J04812
7416A002Q7916J9869k889m9001k7613l8953j01793k2041J00652K7883J4683L0388
7404D0103j5925l6723j0550j6160N3186l3451j457L1133p2669k5572L0747J2885
7392d4453l8515l2955p940J746O7169M7885N334K423k7111o919K8224m8696q044
7379f1852K8562K4875r402j1848l9204K5182L6422K8556L6405K3508j1481n433
7367F4290j4447n3835Q789O7031j3817l7335N822P296r685k127L3860r944m5304
7354E94l3144M4647J5443j9802L654M7995j8684o8628M4447P5725n136j1447K0485
$$ y = [14629, 27022, -22759, -60301, -41590, -29562, -16030, 3468, 54692, 9511, -52638, -131412, -115430, -126606, -115379, -68286, -15020, -19173, -52239, -64049, -66683, -93198, -100457, -109271, -103810, 1002, 88918, 108787, 105898, 56897, 29284, -9669, -111462, -133503, -32851, -4968, 9715, 40103, 24178, -12545, -23095, -39255, 13931, -19520, -20977, 10156, -62513, -88085, -57338, -44453, -82968, -115923, -123863, -122117, -54948, -7063, -1729, 694, -26417, -33336, -5112, -53808, -61852, -33290, -8415, -17817, -29665, -68869, -43687, -7265, 21291, 57696, 81204, 69723, 64290, 49843, -3992, 4797, 71828, 58011, 20676, 26498, 33794, 24109, 21982, 55842, 45898, 594, -32550, 12097, 27540, 7738, 11392, 59387, 40703, -27925, 16522, 92247, 87111, 75664, 96149]
7341I6149m1460n4389N561L021J1867J3286j9293J4981l739l4914k1722O942j220
7328b4930Q827J4755M8662J1224Q725m4346r8921Q369M6107O0227j1720O385R114
7315D2478m0790m465M8053K8122L0437p8455n0649N162J4588m7115j3632k1131
7303h7397J8280K2563L0744J9922p802j0989o2p414j9324J3149L6611k1037O818
7290e938k892l0088o3850J8214J3225L7903M4398j8862R990p746k8252O236P311
7277b0351j8839J2063J2522K6248m1161K434L1706J0412j7182K6173j137m602
7265A8286k928L4452K2126m4449p6158m5447M9783L2877J4598J4033k1395n0206
7253e4428k7412M6421j6547o1091j885N1936J5355j9824J1648N1282k5363r739
$$ y = [96149, 54689, 300, 5861, 8882, 20749, 34035, 14742, 29723, 25984, -8930, -30652, -23710, -24930, -16103, -1348, 47314, 58538, 67263, 22917, -76004, -67635, -21528, 38699, 26979, 33364, 42478, 1688, -2777, 45276, 73398, 103835, 25380, -25269, -20107, -5519, -52634, -66266, -87397, -69117, -46554, -15810, 4112, -3690, -14679, -14741, -22155, -41479, -28330, 8281, -12756, -5938, -8830, -38918, -102768, -84554, -71329, -33426, 10972, -7890, 2100, -5646, -33898, -27662, -20351, -39190, -27127, -14605, 11643, -29518, -27084, 4622, 15034, -2148, 24025, 22888, 18286, 15358, 49810, 71936, 27487, -48671, -94118, -44335, -11458, 3140, 17173, -4222, -54428, -81840, -35419, -51966, -113057, -114942, -63006, -47651, -67475, -55827, -4545, -29908, -39647]
7241c9647p712m5705L6981O995j3348k9720n840L3430L1235k9169k8657P0636
7229b0521L9819j3811k4864N167l4050k2558j6787K7260j9142j8240L7458k781
7217f3050K5110L4256l8179M3139k464m5255J2183P5975j7127o9661m0787L630
7205h2230j7646m3656M6177N2121M3488L0178n4080J4599k0164j8692N665P443
7193c6797K1377M4963O9262l3574n2648l9110O5871N5347n3831j3475P4811r083
7181I3113j4854j5949m2563k0106j3696m0036j313K1130L5321K015m5073l4320
7169g6331J1597J8978k6938k0188n4645L8915l4327L9449Q8283L1834J4604O5397
7157I6628r568j0573l7123l1444l051k0185K5791k7548o446P776l250k2499L6547
$$ y = [-39647, -47359, -93064, -56083, -49088, -62436, -92156, -97996, -64566, -33331, -62500, -91157, -20521, 19298, 5487, -19377, -14210, -48260, -70818, -87605, -60345, -79487, -97727, -60269, -63050, -37940, -3684, -41863, 1276, -1188, -46443, -34260, 41715, 24588, -45073, -85860, -82230, -99876, -143532, -97355, -45234, -1746, 28432, -25648, -11049, -31213, -49905, -44240, -36797, -15420, 29543, 98805, 65231, 12583, -26527, 39344, 94691, 40860, 27385, 102196, 93113, 78259, 62310, 19747, -359, -14055, -54091, -55404, -34274, 1047, 3062, -42011, -76331, -64734, -45756, -72694, -92882, -147527, -108612, -142939, -103490, -15207, 16627, 31231, 96628, 87060, 76487, 39364, 7920, 4869, -15316, 10475, -17073, -23519, -15743, -18993, -41492, -4945]
7144d945m57N8899J2801k0483q5085p2526K2939M4451m5520L5906J08054J1340
7132F5374k673j7752m0436o4098l4256L7458L0807J7992j6349J3678P705k9766
7120c2316J3557L0888J1525m4490J1716K6539k0332p012k932K7286j3550K6249
7108B7128j4421o6732L8812n421q809k4914o226J6487k937p3731k0443k1114j1737
7095a74058J06392L3658l1089j0038j8697L091L037k4448O0596L1206j0120j6310
7083d6780L41K7787k2714j576l1473K8412N8463M649K232j6769K3773J2999J2403
7070E1747J2356k9727l052L9035M5811K761o4419n6516k879K3163J6723j4064
7058B0939O132M4793K1223k2141l6418L2574J3987k343k1737n1276m893k4433
$$ y = [-4945, -5402, 53497, 66298, 45815, -39270, -111796, -88857, -44406, -89926, -54020, 54034, 65374, 62701, 44949, 4513, -59585, -93841, -56383, -25576, -7584, -23933, -10255, -2550, -32316, -18759, 12129, 23654, -20836, -9120, 17419, -2913, -9925, -12857, 14429, 879, 27128, 12707, -54025, -15213, -20634, -29443, -54357, -60583, -44096, -47033, -120764, -141207, -162321, -174058, -67666, -34008, -65097, -75135, -93832, -90741, -87704, -112152, -51556, -20350, -30470, -46780, -46439, -18652, -41366, -42942, -74415, -46003, 12460, 17109, 19341, 2572, 26345, 39344, 51747, 64103, 34376, 31324, 70359, 116170, 118931, 54512, -2004, -4883, 18280, 35003, 20939, 27071, 71864, 93087, 70946, 34528, 67102, 81089, 78746, 57009, 5733, 840, -23593]
7046b3593m0256L167J7115O334p369j0121L3119K8581M9210R879p9442m6479K2639
7033c7216N7951M345o8007k5654L7027O218k7738l1426l3062J8418K056j6905
7021a13993M6495P380J0045o292K7963J3532l3617J2769l3121p0081K6542N5139
7009e7239o510L0183j9598n324K8535j2988Q862j2044L605L6832L0684J6659R673
6996E1330j4985m0568J4226L8685M6293n0723j04905J0234K7889O4872j8549m7757
6984b3958R349P243J1754l1635l9661j5666K8728m2304O5598N3651o097l2889
6972a5887k8546L0361K847L8503k0276j9019k3606J5544l2435L4274J9601M7181
6960D8542O06n4810P047K9216l4534n1944N7819L1212n291k3350j3675j0999j0472
$$ y = [-23593, -63849, -60682, -43567, -37233, -44602, -54723, -21604, 6977, 56187, 66066, -13376, -59855, -37216, 20735, 25080, -42927, -68581, -31554, -25336, -53074, -84500, -117562, -99144, -97088, -113993, -67498, -60118, -50073, -56365, -28402, -14870, -48487, -35718, -68839, -138920, -112378, -57239, -63749, -33566, -53164, -58488, -29953, -42941, -34079, -46123, -42518, -5686, 24998, 41657, 51330, 36345, -4223, 10003, 48688, 94981, 44258, -60647, -50413, -22524, 42348, 23799, -23958, -14609, -7366, 4388, -27247, -66908, -82574, -53846, -96150, -30552, 23099, 17002, -15887, -44433, -14072, -11225, 27278, 7002, -12017, -35623, -20079, -52514, -18240, 1361, 48542, 49148, -5662, 1385, 30601, -3933, -55877, 1942, 33154, 27863, 4513, -9162, -20161, -30633]
6947c0633K7533j4016p324n5472M6555L3982P1726K0634m7654m6128k956j7005
6935b0758K9288K1226L8035l9145n3261p0777P222k7478j7803N2187j5534q965
6923a05763P3402N1475K6675n1943l1943m170N010J3467K4203j3209k3590J3425
6911b2961L8924K0799J3749k2492p766o998n4716l217P4377N4745l1284k1509
6899C1651m0849m7534O8811O1959l6719l3291k2948l8566p0890j3745L9823K1635
6887h0663j7688L1437M7241M3140K9355n631q8551L4409l725j3469j5314l675
6875d3134O0081O5547j2550m5200p2696l1637k0574L5948K1287L958M6310K6136
6863C3476o3511n8837M9601J10147J5642m4062m0843M8988k8482m0092K451J3300
$$ y = [-30633, -3100, -17116, -24440, -79912, -33357, 625, 72351, 92985, 45331, -797, -3753, -20758, 8530, 29756, 67791, 28646, -24615, -95392, -88170, -115648, -133451, -81264, -96798, -105763, -32361, 19114, 45789, -6154, -38097, -42267, -37257, -23790, 413, -12796, -36386, -22961, 15963, 36762, 50511, 28019, 20253, 13255, -41461, -44678, 29699, 84444, 53160, 31651, -9198, -56732, 12079, 74038, 37319, 4028, -18920, -57486, -128376, -142121, -102298, -80663, -98351, -66914, -19673, 23467, 52822, 47191, -41360, -6951, -10676, -24145, -39459, -43134, 16947, 82494, 69944, 24744, -47952, -79589, -100163, -64215, -42928, -38970, 7340, 33476, -30035, -88872, -39271, 70876, 86518, 42456, 1613, 50601, 22119, -17973, -15522, -2222]
6851b222L4226j8532m5473n191K2567l135l6216J3488j3574L14K1243k6532O4508
6838E471j1011J9250N897J5796m7184p3380j5480P3049L8472m0223J4210m0579
6826e5712M950J0415l5028L9691J0054K2691P4821k5814l1919j6835j9965L265
6814a9386l802P388N5506J7738m2563k8909M743J8076o4023o9113O2418K1l0838
6801i2744O488O3490L920J2281O349K1340m6882k5610n5913l4239j6893K9462
6789a28951M7433L2650R0087Q133j254o99k4434o1381j4688P112m8778O23M9843
6776d4304J9501k1158K2027l7053k1243p713m0294M5430P4403K0324K4394P223
6764D1537l2151J3259J503l7753L2199L434j1819k0864j8015O5409M0237n1953
$$ y = [-2222, 32004, 13472, -32001, -37192, -14625, -17760, -53976, -40488, -54062, -53748, -32505, -59037, 5471, -5540, 13710, 19607, 35403, -11781, -85161, -100641, -27592, 10880, -29343, -15133, -55712, -50762, -40347, -75375, -35684, -25630, -2939, 71882, 46068, 14149, -2686, -22651, -19386, -23188, -15800, 39706, 57444, 14881, -14028, -9285, 8791, -55232, -124345, -61927, -61906, -92744, -86256, -22766, -18846, -6565, -216, 21124, -25758, -51368, -107281, -141520, -158413, -128951, -81518, -48868, 41219, 49352, 48098, 47399, 22965, -38416, -53104, -45992, -94770, -94147, -44304, -24803, -45961, -23934, -60987, -82230, -89943, -130237, -84807, -10404, 9920, 34314, 41537, 9386, 22645, 24148, -13605, 18594, 22028, 10209, -10655, -28670, 36739, 76976, 25023]
6752B5023k5311n007p282j8341M5098k0345m0407K9135O8128J8235n2265l5373
6740a8712R099k2106j4683K4158j4091J2702K0436j6j3715j5981O383J5284K2467
6727A1225n39j2637n249M8993J02527O2218J35887J47656O6126L7649L1432M1139
6715F66427q6112j60910j54844j13408l744j3521m6095m5048O7829J0594m7946
6704G3222k673j0344p146o683k67M1714p3714n2664Q2355L0994p1139j6158j7798
6691c0301J9287k7328j8605M949J9982J9347L2806M5748J2218M1827q717J0892
6679A22105p418L7804r000J575n7284J2241k332j5925K0864r994j7329n67n077
6666F9663J8321k8894j3682l159n7082n4703j6282J7714N2006J6985j2686j1204
$$ y = [25023, -288, -5295, -12577, -30918, 14180, -6165, -46572, -17437, 50691, 68926, 16661, -18712, -9613, -31719, -46402, -22244, -36335, -23633, -3197, -3213, -16928, -32909, -26526, -11242, 11225, 10686, -1951, -7200, 41793, 144320, 206538, 342425, 490081, 556207, 593856, 625288, 666427, 580315, 419405, 264561, 151153, 147409, 133888, 87793, 42745, 110574, 121168, 73222, 70549, 60205, 53059, 46376, 46109, 87823, 14109, -38555, 43800, 74794, 3655, -12503, -30301, -11014, -38342, -56947, -51998, -32016, -12669, 20137, 65885, 78103, 119930, 111213, 122105, 114687, 152491, 143491, 145066, 87782, 100023, 97691, 81766, 102630, 92636, 75307, 74740, 69663, 87984, 59090, 45408, 42249, -14833, -69536, -85818, -68104, -16098, 887, -11799, -23003]
6654b3003q486j4481K1264J321M384O164l2137k4850j5193K439j2842L4458K0914
6641d0048k7169L8690L1468L975o3601m7206L6814J9972L9543M2938j7285n8185
6629d0094o2047j6527L3049j2431j9157K4906N1297R732j0207L4597M4973r524
6617B8567l7040k7451p168L6083L067m7216J0858J7060P800j5677K0254O1661
6605E0798j0557j6913R204o8831r114Q4457l718m3253M0092J0066j8421L6734
6593F0544k5237k5409l3086K450O55J9792J1104M1713k2469j8025m0684k686Q675
6580b2663m5891M2568M6895p856j11956K0091L7132L8212K9874J4824K5327N259
6568G1816N692L810J8955k6111k4506j7399j4717k7295q0846k1376O4852J1901
$$ y = [-23003, -31489, -45970, -24706, -23385, -19001, -12837, -44974, -69824, -85017, -82578, -95420, -60962, -40048, -67217, -28527, 2941, 6916, -56685, -103891, -67077, -47105, -7562, 35376, 18091, -40094, -102141, -118668, -85619, -98050, -117207, -92301, -41004, -31272, -41479, -6882, 38091, 28567, -8473, -35924, -43092, -7009, -3942, -51158, -40300, -23240, -15440, -31117, -10863, 50798, 40241, 23328, 32532, -36299, -45413, 39044, 35326, -7927, 32165, 42231, 23810, 60544, 35307, 9898, -23188, -20738, -20083, -291, 10813, 52526, 30057, 12032, -28652, -31338, -22663, -68554, -25986, 20909, 13053, -98903, -78812, -41680, -3468, 26406, 41230, 66557, 71816, 77508, 81318, 100273, 74162, 49656, 32257, 17540, -9755, -90601, -111977, -47125, -35224]
6556c5224m746R39j6621j4843R471M0336L1294k727n9485l0121K1308K6402J267
6543c2750K9820j788j0707O4008k5053m0631J1068M9398j8945j469r401M8010
6531F1560J0736p615p3846N048M0081m8970R392j0868L407P4139L4883o7483k9550
6518I14M0803j742r757l0683J7143n1969m6679O1774N2553k0120q763l1256l2304
6505f0086l8379M7024L5529R57q8344r66L2413L3718J5718N29M2468K0658q1661
6492d0422l5357M3137N4231J4366m2767N7262O9406l9178p8223m7696j4964P5932
6480A5727K8263r609k2025r777M3648R565l8171n6309p42L3165M0625J4112q324
6467D0148k109P985j4093l1020r20k0937M7959L2371J3056l0844J4200l4221m7201
$$ y = [-35224, -39970, -39031, -55652, -70495, -61024, -20688, 10606, 7879, -51606, -81727, -60419, -34017, -32750, -2930, -4718, -15425, 48583, 23530, -17101, -6033, 43365, 24420, 22951, 13550, 61560, 72296, 64681, -9165, -4117, 35964, -13006, -3614, -14482, -11075, 63064, 97947, 30464, 914, 41717, 39975, 30218, -465, 16678, -35291, -81970, -20196, 32357, 12237, 3474, -27782, -60086, -98465, -51441, -15912, -14955, -103299, -104265, -71852, -38134, -22416, -21887, 20581, 41239, -40422, -75779, -32642, 21589, 35955, -6812, 50450, 119856, 80678, 2455, -45241, -60205, 15727, 43990, 34381, 12356, 2579, 46227, 55792, 17621, -38688, -39430, -6265, 34360, 48472, 40148, 38039, 46024, 31931, 911, -9, -20946, 27013, 59384, 72440, 41596, 55796, 21575, -25626]
6454b5626M962O8348o2791L5732Q1817J9831l4488j6591m8047j1010R540m0061
6442a8384k5183n8014J7600L3349m548Q769l7065j3333J2098K9290K2824m9582
6430h2179j0263K8193J3777N6108N2882k8664o4563q735J23532N0402m0732k3205
6418F6553l7346O5608L7446k2550l0812k7805K1930N8593n3753l7615l2807l9593
6406c2151m6906Q0242j8271j4753K1175J8342K6337M5270k3006l3510K6646m1759
6394G656n9948l4392K3596L2008K1787l8791j3318R187K1385N9114O6884o3368
6382C1800k5055J9217p782k4834j7631j4702P822M4656m704j4905m0432N977J4108
6369b6465n443k3798J3275L1906j2273O2310n594j2172O0412J595j1229j6954
$$ y = [-25626, -20664, 47684, -15107, 20625, 102442, 122273, 87785, 71194, 23147, 12137, 21677, -18384, -43567, -101581, -83981, -50632, -55180, -46411, -83476, -96809, -84711, -55421, -32597, -82179, -92442, -64249, -50472, 5636, 58518, 29854, -34709, -43444, 80088, 130490, 89758, 66553, 29207, 94815, 132261, 109711, 78899, 51094, 73024, 131617, 77864, 40249, 7442, -32151, -79057, 1185, -17086, -31839, -10664, 7678, 34015, 79285, 56279, 22769, 49415, 7656, -52292, -86684, -63088, -31080, -9293, -48084, -61402, -52215, -30830, 28284, 95168, 31800, 6745, 25962, 18180, -6654, -24285, -38987, -31165, 13491, 8787, -6118, -46550, -40573, -26465, -31908, -55706, -42431, -10525, -22798, 39512, 33918, 21746, 82158, 83753, 72524, 55570]
6357E5570l2179l7099q1414k6197K5599M9458K3934N723M4272M5516k7670l9042
6345F471r022K7165l8801L366N438k9745O4797M503l8466k2861J1627M3195j6851
6332A0816m6804R646L0943n356Q679p969K5634J3408l5841k5996l3326P770L8946
6319i450N0681R308J761K2605P731l8890n4840m5723K6697l366m3048n055m13
6306h2002K1495n3134L1648O6901M1117m8065l3936M0758N7595n003M501o830
6294C5045l3303j2879j2187j5106M6694P453j6836K8728k0578l382j2830k8957
6282c8138O3029Q2376J3700k6307r2765m9537R8884J1265k5933N2528K2193j10850
6270D45m9678m457k2982N8674o546M017M7416J393J3892n4993j9522n662L7567
$$ y = [55570, 23391, -13708, -95122, -121319, -95720, -46262, -22328, -16605, 27667, 73183, 45513, 6471, -2551, 24614, -14187, -10821, -5383, -35128, 29669, 34172, -4294, -27155, -15528, 27667, 10816, -35988, -26342, 4601, -755, 7924, -45, 25589, 38997, 3156, -22840, -56166, -48396, -9450, 41231, 50539, 52300, 74905, 82636, 43746, -11094, -56817, -30120, -33486, -76534, -81589, -82002, -60507, -113641, -81993, -15092, 26025, -22040, -55976, -15218, 42377, 37374, 41875, 35045, 1742, -11137, -23324, -38430, 8264, 15717, -1119, 27609, 7031, 3649, -9181, -38138, 24891, 107267, 120967, 94660, 1895, -47642, 51242, 62507, 36574, 89102, 111295, 445, -49233, -53690, -76672, -17998, -24544, -20527, 26889, 28282, 42174, -12819, -32341, -38003, -436]
6257d36j6473J2571K6451j8206l576O649K9965j5562j3240O484K0672J04194o961
6244A32532o125O933j1414o6261m4710l9329K22k041L2498L3859j7964k2827O518
6231A891J8177J6868K5212m875j8482o5388M4091L1735K3444l9242M892K1529
6219E9852k5834k9225L1320j0279K7073L2833K8293j1037m4535j7884J7101K8757
6207H6435j5648r555m4292m9497l76r648m6957n969K3989m5398M3718Q672L0272
6194c4254M5934j609L5620M9497L1924n9326m4327m0895n8860K670M6716N4497
6182B7587j3591L8925q177k6943M9629N126j7386r135l7770n374J2386k9594J4026
6169b91K7700j5240l5599l0041k8334j2821N0024K4477k7396J0871p629K7231
$$ y = [-436, -16909, -4338, 22113, 3907, 331, 6980, 36945, 21383, 8143, 14627, 35299, 139493, 132532, 126407, 133340, 121926, 55665, 10955, -28374, -28152, -30193, 2305, 36164, 18200, -4627, 1891, 20068, 36936, 62148, 57273, 38791, -26597, 17494, 49229, 72673, 33431, 38323, 59852, 34018, 4793, 36113, 25834, 52907, 85740, 114033, 102996, 58461, 40577, 57678, 86435, 70787, 61232, 16940, -32557, -32933, -42581, -89538, -95507, -71518, -116916, -73198, -64526, -34254, 11680, 10071, 45691, 95188, 127112, 67786, 23459, -17436, -76296, -73626, -26910, 27587, 13996, 52921, 44744, 17801, 67430, 72556, 55170, 46035, 8265, 2891, 15277, -14317, -291, 27409, 12169, -23430, -53471, -81805, -94626, -44602, -20125, -47521, -36650, -44279, -17048]
6157a7048L0057l1303M6784R208P951P1537m5653M58k2033j9142m7250k0390k5625
6144f2449j6904k5280K1165R7709j0071o7489R171M9447O821J9698M558j1925
6132A4451l0994o1036L9399k861j0359l8091Q675M0168M0489L3917L6828r03l0112
6119C9571l8506K4475l0022j6055L5390n351j1139m4548o145P9491K6567N209
6107E8937k8666k4572R480K544m1496k5161K3957R5889J3743M191J3l8836m9826
6094A97M1670q464k2189j3106M148l6885L2205p923M577j302M2954K8110L6282
6081A00274K8811L5689q2820r4070Q268M789l2399l9526L1539M735n7620l5965
6069a28295L794M0596Q6905M6193J9879r168m5661k4574J3710n0383M3004M2558
$$ y = [-17048, 13009, -18294, 28490, 37698, 45649, 117186, 71533, 71991, 49958, 30816, -16434, -36824, -62449, -79353, -104633, -83468, 14241, 4170, -63319, -54148, -4701, 2120, 21818, 26376, 14451, -16543, -77579, -38180, -41041, -51400, -89491, -80816, -40648, -159, 33758, 70586, 69683, 39571, 1065, 25540, -4482, -20537, 14853, 9502, -1637, -46185, -52330, 27161, 53728, 58937, 30271, 5699, 15179, 17723, -23773, -48934, -24977, 70912, 84655, 88846, 88859, 50023, 197, 41867, 33403, 11214, -1892, 2256, -34629, -2424, -10347, -5770, -7072, 35882, 63992, 100274, 129085, 164774, 81954, -12116, -3848, 941, -31458, -70984, -39445, -34710, -92330, -128295, -124501, -83905, 3000, 49193, 69072, 59904, 14243, -10331, 3379, -47004, -4000, 38558]
6057C8558l8537l1468k3675K2495j9997K6583j2308j0049l9546p5464L7707M9909
6045g5792m1316m3925Q4649M6031n1623k5405L3975J398J6547M9145K5948m8127
6033b8495j3586l8039k2487O8843J8164m9241j9852m689l2509J263L2930M238
6021h3460p565Q478O2540L3808O724m890l6307j1267o231L8131N306j7720l4213
6008d6666M767r633j1660L1373J0282r553M9370Q0915j5398p6551n3598O5738
5996A9386k4597n255K5586L4156m1057J4938m7565k5999l719p35M1019P3806J2751
5983G2715o0412o1638q4928k6898Q134Q824L5525P503j4803m043o255O3447m1031
5970a03860P762j5812l2224R4064J713j5350Q2913K7448j1575L629L6368K6211
$$ y = [38558, 21, -31447, -55122, -32627, -52624, -26041, -38349, -48398, -87944, -163408, -125701, -75792, -117108, -161033, -76384, -30353, -81976, -107381, -73406, -72008, -55461, -6316, 19632, -28495, -42081, -80120, -102607, -33764, -15600, -64841, -84693, -89382, -121891, -120628, -87698, -83460, -91025, -82547, -20007, 13801, 20525, 15635, -20672, -31939, -38170, -39, 5267, -12453, -46666, -41899, -51532, -63192, -31819, -21537, -31090, 18280, 99195, 83797, 7246, -46352, 19386, -5211, -10466, 15120, 49276, 8219, 23157, -24408, -50407, -54126, -54861, -13842, 59964, 72715, 12303, -49335, -134263, -161161, -153027, -144203, -108678, -101175, -115978, -120021, -126276, -62829, -103860, -96098, -111910, -144134, -50070, -48357, -63707, 19206, 46654, 35079, 38708, 75076, 101287]
5958A01287k0221o8966o5621j1567N2632J6289k8901l5018J077K9984K5972K4386
5946B1333R656K0279M8819m2715l5813O251Q323m8907p0042q723j0674O0140K8445
5933a3628M6506o6819m9990k6169L5720J663L3475Q9621j3339k6024m8963l0384
5921f8331o385o1030r122P0117O8259L535o1252N717J7805k5132m9948J9370J2924
5908h3473r773L9419K4813m7289J0561P8813K8670O9434m184m7695q3607l9613
5896f3924M0816k0523j7155K8393j9270j7432j8884n346l854O947M1688M5754
5884b790m0502o7671M8154Q4899K0792j6185l8346K7388n2256L1461j809j6775
5872b3640k0081n3456J1378L9588k214m5964q76J00053L8098m314l644k498O125
$$ y = [101287, 81066, 12100, -53521, -65088, -12456, 3833, -25068, -60086, -59009, -29025, -3053, 21333, 30989, 51268, 100087, 57372, 21559, 27810, 36133, -12774, -82816, -91539, -102213, -42073, -13628, 32878, -33941, -83931, -110100, -74380, -72717, -39242, 50379, 37040, 11016, -37947, -68331, -74716, -135746, -144868, -74751, -6492, -2957, -64209, -58492, -40687, -65819, -115767, -96397, -83473, -93246, -53827, -29014, -76303, -65742, 13071, 41741, 111175, 106991, 59296, -24311, -63924, -23108, -43631, -60786, -32393, -51663, -69095, -87979, -93325, -97179, -90232, -48544, -2790, -43292, -110963, -62809, 22090, 42882, 26697, -11649, 15739, -36517, -5056, -6865, -23640, -43721, -97177, -85799, -46211, -48425, -94389, -95265, 4788, 42886, 38572, 34928, 32430, 38555]
5859C8555m0304P104k1959j6565o6396K9327R563L7n4466l0095O6565N7670j5951
5846c6915n7906r160P6555k6990r67J8631N1635J742p885J4471q129R491j5512
5833I061k8484O752p3001L901N5486M1404L9371k6642M098R999j9320l5460l6438
5820d9273l9304K2169L6078K185J506J4459O388N0825m889J0678J7333K6557l8031
5807E6681m7238N6061M0002K784j3444j3701k6175j0715J583k0183n7348p6340
5795a08033J3487J1521k3881R646K7955O6954R795o5674j2154j152l3812j5756
5783a21104K8241K3417K111K95J4679N4668p5577J7849L4932J6239O9720k482
5771F2988p4047j7793L71k5505K528M9292M9385o946j4032j16969L7409O353N4368
$$ y = [38555, -1749, 5355, -16604, -33169, -99565, -70238, -60675, -60638, -115104, -145199, -78634, -20964, -36915, -94821, -103981, -27426, -54416, -55383, -36752, 14883, 16625, 8740, 23211, 15082, 24573, 9061, -19423, -12671, -85672, -81771, -26285, 15119, 54490, 27848, 31946, 41945, 22625, -12835, -49273, -88577, -66408, -30330, -28145, -26639, -12180, -5792, 45033, 40144, 50822, 68155, 94712, 56681, 9443, 65504, 105506, 108290, 94846, 81145, 54970, 44255, 45838, 25655, -31693, -108033, -94546, -83025, -106906, -97260, -69305, -2351, 7444, -58230, -70384, -71536, -105348, -121104, -92863, -69446, -67335, -67040, -52361, 2307, -73270, -55421, -20489, -4250, 65470, 62988, -11059, -28852, -28481, -53986, -51458, -2166, 47219, 40273, 26241, -90728, -53319, -46966, 7402]
5758G402N7649k053l7314j2844l9423o8936J2049M4629O1469k4613J4714j2359
5746C70l0268N454k6339j3084n576k4466m199L8613n578K3526L8361J6208J5060
5733B8082N150k4191M1505L2043K3014j6174l8105L0012L2775m4600k0792j1278
5721C7441m1949j6917q0005r5672J7592P8013L8354o24J8391k6429j3304L9073
5709d6036M660o368J7549j325N304P695n9027j6443L3043O4575j4823L0415o00
5696A8619j8711j9214l3254k3390p416R854P316o139l9494J8974R945N1838J0450
5683b0622k608N953j7959J6648m661N9575N7717o4925p2559N3869K847K4106k8009
5670I372m2502K6231J3278j2712l6182K1914L2964K6644p194j4776M6503J3824
$$ y = [7402, 65051, 62998, 25684, 12840, -26583, -95519, -83470, -38841, 22628, -1985, 12729, 370, -29898, -24444, -50783, -63867, -69443, -93909, -98108, -59495, -65073, -41547, -3186, 13022, 28082, 33232, 9041, 50546, 82589, 105603, 89429, 51324, 81336, 114111, 69511, 48719, 37441, -4508, -21425, -101430, -197102, -179510, -101497, -63143, -63767, -45376, -71805, -85109, -46036, -41376, -47744, -30195, -31520, -26216, -18521, -77548, -93991, -60948, 3627, -11196, 19219, 18619, -92, -19306, -52560, -75950, -83366, -73512, -66196, -72335, -111829, -92855, -82910, -31072, -20622, -23230, -17277, -35236, -18588, -23249, 36326, 94043, 29118, -43441, 10428, 13275, 37381, 9372, -33130, -6899, 6379, -6333, -42515, -20601, 12363, 39007, 31813, 17037, 63540, 77364]
5658G7364p6776N4125J0036j9870j6376j6874l6685j7701L804M3197K4251K3212
5646E1707j8736k1208L586n5375j9945Q779k7016k5694L1575j7872j3596q877
5634a12672N1969P3219j9263m3004j6719J9312K6349q595J9112J7628k8210L6993
5622A6119K2801m3394m122L1480l8963j0326j7890j1545J2787J1544L7505J6647
5610B2643j5665k3379j3752K66J2836M883j067k9745l0215k7600J987M5439L5474
5597a7895N3858N7175n5813n5645L5022J4989K0032k5282l6896o6337L5217N0443
5585H868j0691N360L1736R424j6495l5694m9725l781K0132J5108j1114L277Q056
5572b5539J2621l4102l163P1732P64k3923l5541o68M8645M1440j7682p2619k6274
$$ y = [77364, 588, 54713, 64749, 44879, 28503, 11629, -25056, -42757, -38953, 4244, 28495, 51707, 32971, 11763, 15349, -40026, -59971, -51192, -78208, -103902, -72327, -90199, -103795, -112672, -60703, 12516, -6747, -49751, -66470, -47158, -20809, -29404, -10292, 7336, -20874, 16119, 38920, -4474, -8596, 22884, -16079, -26405, -44295, -55840, -43053, -31509, 5996, 22643, 6978, -16401, -30153, -29887, -17051, -12168, -13235, -42980, -73195, -100795, -98808, -53369, -17895, 35963, 93138, 37325, -18320, 16702, 31691, 51723, 26441, -10455, -76792, -41575, 8868, -1823, 3537, 35273, 44697, 28202, -7492, -57217, -60998, -40866, -25758, -36872, -33595, -25539, -12918, -47020, -50183, 21549, 22313, -1610, -37151, -37819, 10826, 52266, 34584, -38035, -64309]
5559f4309L841k8571l8771o776J2145L0754L9192L9609Q289p1627J0996N7160
5547h068l0919M0644K8839l677j226K1099J5656J2562l4721k9339l0525l13L1984
5534A1996o246J9507o6J1193n1900p835j9019P3931K8194m1823j5732J7413J5574
5521C5187k9712J6089j5832r308K4235k9028L5996L2495P92m982k470j9161l3321
5508I80n9991j8285K0664K3744m2623o7857l4080J3364P1165R2752J07688k6824
5496H0697o0816l0421m8501j4457r210J9501N5891L0714N8943j1540K457p582
5484F5676k7185J946P906K3481N325K4042m4566k0129k3506l3665k6273J9433
5472b7515K9320K9153l2398N366k681M3937m1385k4222k3835K9966L744K0421
$$ y = [-64309, -60468, -89039, -127810, -134586, -122441, -91687, -52495, -12886, -4597, -76224, -65228, -8068, -38987, 1657, 30496, 26819, 25593, 46692, 62348, 74910, 40189, 10850, -19675, -19988, 11996, 5750, 25257, 25191, 36384, -15516, -23351, -42370, 31561, 59755, 17932, 2200, 19613, 35187, 5475, 21564, 5732, -3576, 20659, -8369, 27627, 60122, 60914, 55932, 53462, 34301, 980, -59011, -77296, -56632, -32888, -75511, -143368, -177448, -164084, -92919, -167, 107521, 80697, 19881, -10540, -59041, -73498, -82708, -63207, -7316, 23398, 82341, 70801, 73258, 65676, 38491, 40437, 48343, 71824, 77149, 101191, 56625, 36496, 12990, -20675, -46948, -27515, 1805, 30958, -1440, 3926, 1245, 45182, 3797, -20425, -44260, -14294, -10550, 9871]
5460I871M4969j00715j14003j674Q2644k4947N9415J9687j9927k9078O7294L1447
5448B4983k9001k3537k4433L3308P8457M1246m8087n0085j0961J1039L432j4449
5436h088m2836j4750P9192M0666l0421L0615o11K998j5057J6758k6964n3084m33
5423b2015o097l665N5690L7215J2438m8251q594J4959K3939j619n9654J0949L6586
5410D1881j5235K5681J9822K0782n9646n2815L2766l6658O737L4519j8909l9379
5398d0454o903P812M328j3405k4679M4584N5317J0515l215o5565J4527O6219l4651
5385A4430L6000L0132n3415m0631l3346m6290Q985R2100M6498M5390k6991j2731
5373F0131l4125k3193K5748l6390m8776K4402j8874J4111O4664J9341j3710o7877
$$ y = [9871, 54840, -45875, -159878, -161552, -78908, -103855, -44440, -24753, -44680, -73758, -6464, 24983, -4018, -27555, -51988, -18680, 59777, 101023, 52936, 2851, -8110, 2929, 6361, -8088, -50924, -65674, 13518, 54184, 23763, 54378, 53767, 56765, 41708, 58466, 31502, -21582, -22015, -28112, -31777, 23913, 61128, 73566, 25315, 16721, 31680, 55619, 54000, -5654, 5295, 41881, 26646, 52327, 72149, 92931, 33285, -19530, 13236, -23422, -16685, 17834, -1075, -40454, -47357, -39545, -35217, -48622, -73301, -28717, 26600, 37115, 33900, -31665, -17138, 49081, 14430, 50430, 80562, 27147, -13484, -46830, -93120, -84135, 7965, 54463, 99853, 72862, 60131, 26006, 2813, 28561, -7829, -56605, -32203, -51077, -36966, 27698, 47039, 33329, -34548]
5361c4548o2363L0373L592M5612R3523k5373l0005j0837K0050o9870l9159K9151
5349d9854L1591l4422M5443j72L5582K4419j4281M8904m3191j04804r2336k4585
5337a77706L4957L0686J9861K1127M0992L3053k1153l6832l4929j0204L3369L5548
5325c1231N0362j309l4224K2299M7179j2100n9130L770O117J2696m0287j7120
5313e2978K7293j2435K2855J8588o0431M387O3661m0849q2665L7439M2902j179
5301c3412m5500J2273O2364O830l1088k9119r3801K0035N1673O8819P343N1123
5289D7540j8634j4573L5248N7810p3835j7554J5915k679k0091K3497j7181j4338
5277A125L4227j2485K6080O8m3460j581k5703K4299P5246j7743m3694o1702l0853
$$ y = [-34548, -96911, -66538, -62946, -17334, 76189, 50816, 20811, 9974, 30024, -39846, -79005, -49854, -18263, -52685, -7242, -7414, 28168, 52587, 38306, 87210, 44019, -60785, -153121, -177706, -142749, -112063, -92202, -71075, -30083, 2970, -18183, -55015, -89944, -100148, -66779, -31231, 19131, 17822, -16402, 5897, 53076, 40976, -18154, -14384, -8267, 4429, -35858, -52978, -25685, -38120, -15265, 3323, -57108, -52721, 10940, -29909, -112574, -75135, -32233, -33412, -78912, -66639, -4275, 2555, -28533, -57652, -151453, -131418, -79745, -10926, -3583, 47540, 28906, 14333, 49581, 107391, 33556, 16002, 31917, 29238, 9147, 32644, 15463, 1125, 35352, 22867, 48947, 49015, 5555, 3974, -21729, 2570, 77816, 60073, 16379, -45323, -76176]
5264g6176P135k8835M9143M5134j3625k5677k6017J8676K8491Q896K9139M442
5252B0726k3300J4516N0589J351j2861m5643p2726q96L3450L8299p6176L1894
5240d0777M4785k933O908m3009j9380M0904K1168p506L5969N5195J460l9456n6302
5227b974m193L602J0238J4269R785k4190j7430j357K4720J1619n8425j6464N1663
5214H63M886l4278r636j5325L0762l336k6281K8194K6290l0766K3983J765k0019
5201b2898K0573K8429J6847j1354m9279n9503L4041L1254K2318N4390k9656J078
5189C6240N93o6770K0323L8421j7752o5389j8116O0841M6975l9633K2833M2920
5177F1486N0689J4792k5553q0779n1354K9097L7234j1337k2258j6687k3261k3853
$$ y = [-76176, -69041, -97876, -48733, -3599, -17224, -42901, -68918, -50242, -21751, -12855, 16284, 20726, -2574, 11942, 62531, 63882, 51021, 5378, -67348, -68244, -34794, 3505, -72671, -40777, 4008, 1075, 7983, -35026, -54406, -13502, 7666, 160, 36129, 91324, 92784, 53328, -2974, -7167, -3565, 6673, 20942, 30727, 6537, -10893, -12250, 12470, 24089, -34336, -50800, 863, 5749, -28529, -38165, -53490, -22728, -26064, -52345, -24151, 2139, -28627, -4644, -2879, -22898, -2325, 26104, 42951, 31597, -17682, -77185, -43144, -11890, 10428, 64818, 35162, 36240, 36833, -29937, -9614, 28807, 11055, -54334, -72450, -11609, 35366, -4267, 18566, 61486, 112175, 126967, 101414, 20635, -30719, -1622, 35612, 24275, 2017, -14670, -37931, -61784]
5165f1784q243J840M6114Q034K859M4087l9788l2419L5883J7277j5238O4334m491
5152E8465l5728O054p381l1474k763n6585l4873R6788L5587q387K0658k2244l440
5139A4677N2317l5149j0239k5901o4180M6694O632k1707J7823n074J7945K7502
5127B1340k9532K6499p557n5203K833l2570k5237L4932Q641K5831L4900K8901
5115C3778J1681J8590p824p8133K812K1922J4190K6438k7720p6471l1526j1753
5103a04016J2776j3173J0748l8305L277Q8781N1447J8664N7048O221n850K524
5091I0142j7307L0283P6206n9120m4674j6166N393N5964k1580p2039j4730J31
5079A2503q257p229Q488k4046m8016J814O927j0083N3168M9438L19J0714L6305
$$ y = [-61784, -70027, -68187, -22073, -14039, -11180, 32907, -6881, -39300, -3417, 13860, -1378, 62956, 58465, 22737, 28791, 21410, -10064, -12827, -69412, -104285, -7497, 28090, 19703, 40361, 18117, 14677, 66994, 31845, 21606, -4295, -68475, -21781, -15149, -36856, -19033, -24107, -6162, 21340, -8192, 18307, 10750, -44453, -41620, -74190, -99427, -64495, -55854, -30023, 4877, 33778, 45459, 64049, 56225, -21908, -19096, 2826, 17016, 43454, 15734, -60737, -92263, -104016, -91240, -104413, -93665, -131970, -128693, -39912, 11535, 30199, 87247, 93468, 87618, 90142, 72835, 103118, 179324, 120204, 75530, 59364, 64757, 120721, 99141, 27102, 12372, 12503, 4246, -2983, 5505, -18541, -66557, -64743, -57816, -67899, -14731, 34707, 35026, 45740, 82045]
5066H2045K7185n2782q7984n0207M200K9935M0713K7288J3962j1759k0841K7024
5054B8779Q062p737j8136n6958R517r883O6683J9683K8615K35m4374j7005l2095
5041b4614R735k1691p62O7695l0180l4392J3176O712k5703p201J9095J5139L7451
5028B4460j122j8140J6968j9800n5463l2330J5595L3575N790L4626j04774j2336
5016a12951K8722K9470M984O788l4596p1749k3858OO1605N2499J6809j7368K5005
5003c4634L2451k3796k4020M7241J9342M5949l8943Q273o3999m1109K34M7413
4991b5598K6336O1884J2674n4130o3183L8882N4795L9060n3258n5654K477l8833
4979e4548n691N400O9105K4617l0881j9836N9640K5403J2868n4190o8940l7662
$$ y = [82045, 109230, 56448, -31536, -81743, -77543, -47608, -6895, 20393, 34355, 22596, 1755, 28779, 36841, 29104, 10968, -45990, -36473, -46356, 20327, 40010, 68625, 68860, 24486, 7481, -24614, -14879, -36570, -37332, 30363, 183, -34209, -21033, -14321, -40024, -47225, -28130, -12991, 24460, 23338, 5198, 22166, 2366, -53097, -85427, -69832, -36257, -30467, 4159, -100615, -112951, -84229, -54759, -49775, -42987, -77583, -149332, -173190, -173184, -111579, -59080, -42271, -59639, -34634, -2183, -25979, -49999, -2758, 16584, 62533, 23590, 31863, -32136, -73245, -73011, -25598, 738, 62622, 75296, 21166, -42017, -3135, 51660, 90720, 37462, -18192, -15715, -54548, -60239, -54839, 14266, 38883, 8002, -11834, 47806, 73209, 86077, 31887, -37053, -74715]
4967g4715J3435J6014K7752R480n3490l3171Q027n562L9747J4579m3838M1045
4955d0697m533l1604k679J1654P809L1189n653m915M2829N108j6466j003L8412
4942B9451j2476J5223j0408J251j1243m2092K9651M7917Q231n1380l6949k5617
4930e8441m691K8371k1789j1714R0979K2763L825J1975K1636o3348o5225k3081
4918f8740K8327N900K1525K5443Q423R188J2833M1278k712k9883K3418m4557J1124
4905D1567k163j1553m5339m8300J2834M6465L9066o4173M0081J7607l7024N548
4893e384J1737o4969K49K6236L0501P2422N1376l4166r1977M4153K9682k6382
4881D3478j6586o8814J8011Q8051L7331l6747q7568l9864p947K1267m3484M729
$$ y = [-74715, -61280, -45266, -17514, -8034, -61524, -94695, -86668, -92230, -52483, -37904, -81742, -40697, -45230, -76834, -79513, -67859, -60050, -28861, -34514, -39429, 3400, 8508, -7958, -8961, 29451, 16975, 32198, 21790, 23041, 11798, -30294, -643, 47274, 55505, 4125, -32824, -58441, -63132, -34761, -56550, -68264, 22715, 45478, 49303, 61278, 82914, 19566, -45659, -68740, -40413, -34513, -12988, 12455, 20878, 30066, 42899, 84177, 81465, 51582, 75000, 30443, 41567, 39404, 27851, -17488, -65788, -52954, -6489, 32577, -31596, 8485, 26092, -10932, -5384, 6353, -58616, -58367, -32131, -1630, 70792, 122168, 88002, -3975, 40178, 69860, 43478, 26892, -41922, -23911, 64140, 101471, 64724, -22844, -62708, -70655, -49388, -92872, -88143]
4869h8143L1202K6775l518r417L7062j1715p7830J1727O077K1318J2447K3866
4857b0149k846l5115k2951n9489M5072K5223k1241J0022R548K7594m9450l3386
4845a27168J6022J6628N9092N0118N8333L3292m1523m5825M1619l494m4447O2569
4833G5216J612l8992j7273M1189L5631M6510j5254k2880j2736p0396N48l9171
4821a5996K6651J1463m6274J260J1205O095p7119J8198l3740K3759N4896L6824
4809A7222m546k1416l236K5507R135l0039k2158j7555K8782K0466n6936j0277
4797f5051j0898J0638O6796J8041R751J5564K8169r504m846l5769m6782J8253
4785e638k0363Q433Q849n7192m5642r761K5503N872P6468Q5174k2064q6150j2168
$$ y = [-88143, -56941, -30166, -33684, -43101, -6039, -17754, -95584, -83857, -77780, -56462, -44015, -20149, -22995, -58110, -81061, -140550, -95478, -70255, -91496, -81474, -71926, -44332, -93782, -127168, -111146, -94518, -35426, 14692, 73025, 106317, 64794, 18969, 60588, 57094, 12647, 75216, 76828, 37836, 20563, 61752, 97383, 143893, 128639, 105759, 93023, 22627, 23175, -15996, 10655, 22118, -24156, -22896, -11691, -5596, -82715, -64517, -98257, -74498, -19602, 17222, 12676, -8740, -11976, 13531, 22666, -7373, -29531, -47086, -18304, 2162, -54774, -65051, -75949, -65311, 1485, 19526, 29277, 44841, 73010, 63506, 58660, 22891, -23891, -5638, -26001, -17568, -8719, -65911, -111553, -121314, -95811, -89939, -13471, 71703, 49639, -36511, -48679]
4772d8679j9850n363K9310L3370r491k6694p619L6822k5561K7607O8191R751q0821
4759a9027o149N6399N0375n1p2059l958O2735N098m5679R189k1115l2296j0040
$$ y = [-48679, -68529, -73892, -44582, -11212, -20703, -47397, -55016, -18194, -43755, -16148, 52043, 61794, -19027, -25176, 31223, 81598, 81547, 9488, 5530, 68265, 73363, 27684, 36873, 15758, -16538, -26578]
$$ [...]
##END NTUPLES=NMR SPECTRUM
##END=
