##TITLE=Analysis number 329417
Compound Code cc 14901
Project Code adrs
Chemist Name stores
##JCAMPDX= 6.0         $$ Bruker NMR JCAMP-DX V2.0
##DATA TYPE= NMR SPECTRUM
##DATA CLASS= NTUPLES
##ORIGIN= Bruker BioSpin GmbH
##OWNER= nmr
$$ XWIN-NMR		Version 3.5
$$ Thu Aug 30 13:03:26 2007 GMT Daylight Time (UT+1h)  MAYBRIDGE\nmr@NMR_250MHZ
##.OBSERVE FREQUENCY= 250.131544655141
##.OBSERVE NUCLEUS= ^1H
##.ACQUISITION MODE= SIMULTANEOUS (DQD)
##.ACQUISITION SCHEME= undefined
##.AVERAGES= 16
##.DIGITISER RES= 18
##SPECTROMETER/DATA SYSTEM= dpx250
##.PULSE SEQUENCE= zg30
##.SOLVENT NAME= DMSO
##.SHIFT REFERENCE= (INTERNAL, DMSO, 0, 16.522)
##AUDIT TRAIL= $$ (NUMBER, WHEN, WHO, WHERE, WHAT)
$$ ##TITLE= Audit trail, XWIN-NMR		Version 3.5
$$ ##JCAMPDX= 5.01
$$ ##ORIGIN= Bruker BioSpin GmbH
$$ ##OWNER= nmr
$$ C:\u/data/dgb/nmr/ADRS/1840/pdata/1/auditp.txt
$$ ##AUDIT TRAIL=  $$ (NUMBER, WHEN, WHO, WHERE, WHAT)
(   1,<2007-08-30 13:02:11.76 +100>,<MAYBRIDGE\nmr>,<NMR_250MHZ>,
      <created by zg, POWCHK disabled, PULCHK disabled
       configuration hash MD5:
       76 6E 9A 78 1E 09 19 81 EC 84 63 8F B0 6A 59 2D
       data hash MD5: 64K
       0A AC 7C D6 32 BC 63 63 B7 A1 AF 71 B9 A0 E8 AE>)
(   2,<2007-08-30 13:02:42.55 +100>,<MAYBRIDGE\nmr>,<NMR_250MHZ>,
      <Start of raw data processing
       ef LB = 0.3 FT_mod = 6 PKNL = 1 SI = 32K 
       data hash MD5: 32K
       2D DB 47 49 49 A9 EB 24 DB CA 89 B0 11 F6 3F ED>)
(   3,<2007-08-30 13:02:47.66 +100>,<MAYBRIDGE\nmr>,<NMR_250MHZ>,
      <apk 
       data hash MD5: 32K
       4C 99 E5 EC 65 2A 3E 4D 3A 89 75 4D DE 58 A2 AB>)
(   4,<2007-08-30 13:02:52.57 +100>,<MAYBRIDGE\nmr>,<NMR_250MHZ>,
      <abs ABSG = 5 
       data hash MD5: 32K
       AF 0E 86 A6 C8 84 E4 4E 6A 6C C8 77 13 0B 54 25>)
$$ ##END=
$$ 
$$ hash MD5
$$ C7 63 02 EC 43 8F 09 47 82 7E 73 D2 B2 0F E5 09
##$RELAX= 
##$RELAX= 
##$RELAX= 
##$RELAX= 
##$RELAX= 
##$RELAX= 
##$RELAX= 
$$ Bruker specific parameters
$$ --------------------------
##$DU= <C:\u>
##$EXPNO= 1840
##$NAME= <ADRS>
##$PROCNO= 1
##$TYPE= <nmr>
##$USER= <dgb>
##$AMP= (0..31)
100 100 100 100 100 100 100 100 100 100 100 100 100 100 100 100 100 100 
100 100 100 100 100 100 100 100 100 100 100 100 100 100 
##$AQSEQ= 0
##$AQ_mod= 3
##$AUNM= <au_zg>
##$AUTOPOS= <57 >
##$BF1= 250.13
##$BF2= 250.13
##$BF3= 250.13
##$BF4= 250.13
##$BF5= 500.13
##$BF6= 500.13
##$BF7= 500.13
##$BF8= 500.13
##$BYTORDA= 1
##$CFDGTYP= 0
##$CFRGTYP= 5
##$CHEMSTR= <none>
##$CNST= (0..31)
1 1 145 1 1 1 1 1 1 1 1 1 1 1 1 1 1 1 1 1 1 1 1 1 1 1 1 1 1 1 1 1 
##$CPDPRG= <>
##$CPDPRG1= <>
##$CPDPRG2= <>
##$CPDPRG3= <>
##$CPDPRG4= <mlev>
##$CPDPRG5= <mlev>
##$CPDPRG6= <mlev>
##$CPDPRG7= <mlev>
##$CPDPRG8= <mlev>
##$CPDPRGB= <>
##$CPDPRGT= <>
##$D= (0..31)
0 1 0 0 0 0 0 0 0 0.06 0 0 0 0 0 0 0.0002 0 0 0 0 0 0 0 0 0 0 0 0 0 0 
0 
##$DATE= 1188475328
##$DBL= (0..7)
120 120 120 120 120 120 120 120 
##$DBP= (0..7)
150 150 150 150 150 150 150 150 
##$DBP07= 0
##$DBPNAM0= <>
##$DBPNAM1= <>
##$DBPNAM2= <>
##$DBPNAM3= <>
$$ [...]
##$SUBNAM7= <"">
##$SUBNAM8= <"">
##$SUBNAM9= <"">
##$SW= 20.6930455092707
##$SWIBOX= (0..15)
0 0 3 0 0 0 0 0 0 0 0 0 0 0 0 0 
##$SW_h= 5175.983436853
##$TD= 65536
##$TD0= 1
##$TE= 296.16
##$TE2= 300
##$TE3= 300
##$TEG= 300
##$TL= (0..7)
0 120 120 120 120 120 120 120 
##$TP= (0..7)
150 150 150 150 150 150 150 150 
##$TP07= 0
##$TPNAME0= <>
##$TPNAME1= <>
##$TPNAME2= <>
##$TPNAME3= <>
##$TPNAME4= <>
##$TPNAME5= <>
##$TPNAME6= <>
##$TPNAME7= <>
##$TPOAL= (0..7)
0.5 0.5 0.5 0.5 0.5 0.5 0.5 0.5 
##$TPOFFS= (0..7)
0 0 0 0 0 0 0 0 
##$TUNHIN= 0
##$TUNHOUT= 0
##$TUNXOUT= 0
##$USERA1= <user>
##$USERA2= <user>
##$USERA3= <user>
##$USERA4= <user>
##$USERA5= <user>
##$V9= 5
##$VALIST= <valist>
##$VCLIST= <CCCCCCCCCCCCCCC>
##$VD= 0
##$VDLIST= <DDDDDDDDDDDDDDD>
##$VPLIST= <PPPPPPPPPPPPPPP>
##$VTLIST= <TTTTTTTTTTTTTTT>
##$WBST= 1024
##$WBSW= 4
##$XGAIN= (0..3)
0 0 0 0 
##$XL= 0
##$YL= 0
##$YMAX_a= 315902
##$YMIN_a= -241233
##$ZGOPTNS= <>
##$ZL1= 120
##$ZL2= 120
##$ZL3= 120
##$ZL4= 120
##$ABSF1= 16.522
##$ABSF2= -4.171173
##$ABSG= 5
##$ABSL= 3
##$ALPHA= 0
##$AQORDER= 0
##$ASSFAC= 0
##$ASSFACI= 0
##$ASSFACX= 0
##$ASSWID= 0
##$AUNMP= <proc_1d>
##$AZFE= 0.1
##$AZFW= 0.1
##$BCFW= 0
##$BC_mod= 0
##$BYTORDP= 0
##$COROFFS= 0
##$CY= 12.5
##$DATMOD= 1
##$DC= 0
##$DFILT= <>
##$DTYPP= 0
##$F1P= 14.0000005364418
##$F2P= -0.99999901652339
##$FCOR= 0.5
##$FTSIZE= 32768
##$FT_mod= 6
##$GAMMA= 0
##$GB= 0
##$INTBC= 1
##$INTSCL= 1
##$ISEN= 128
##$LB= 0.3
##$LEV0= 0
##$LPBIN= 0
##$MAXI= 10000
##$MC2= 0
##$MEAN= 0
##$ME_mod= 0
##$MI= 0
##$NCOEF= 0
##$NC_proc= -4
##$NLEV= 6
##$NOISF1= 0
##$NOISF2= 0
##$NSP= 0
##$NTH_PI= 0
##$NZP= 0
##$OFFSET= 16.522
##$PC= 1
##$PHC0= -52.62958
##$PHC1= 8.563282
##$PH_mod= 1
##$PKNL= yes
##$PPARMOD= 0
##$PSCAL= 4
##$PSIGN= 0
##$REVERSE= no
##$SF= 250.13
##$SI= 32768
##$SIGF1= 0
##$SIGF2= 0
##$SINO= 400
##$SIOLD= 32768
##$SREGLST= <1H.DMSO>
##$SSB= 0
##$STSI= 32768
##$STSR= 0
##$SW_p= 5175.98343685301
##$SYMM= 0
##$S_DEV= 0
##$TDeff= 65536
##$TDoff= 0
##$TI= <Analysis number 999999
Compound Code 99
Book Reference 9
Project Code 9>
##$TILT= no
##$TM1= 0
##$TM2= 0
##$TOPLEV= 0
##$USERP1= <user>
##$USERP2= <user>
##$USERP3= <user>
##$USERP4= <user>
##$USERP5= <user>
##$WDW= 1
##$XDIM= 32768
##$YMAX_p= 451133211
##$YMIN_p= -252438
$$ End of Bruker specific parameters
$$ ---------------------------------
##NTUPLES= NMR SPECTRUM
##VAR_NAME=  FREQUENCY,     SPECTRUM/REAL,   SPECTRUM/IMAG
##SYMBOL=    X,             R,               I
##VAR_TYPE=  INDEPENDENT,   DEPENDENT,       DEPENDENT
##VAR_FORM=  AFFN,          ASDF,            ASDF
##VAR_DIM=   32768,         32768,           32768
##UNITS=     HZ,            ARBITRARY UNITS, ARBITRARY UNITS
##FACTOR=    0.157963299565203, 1,           1
##FIRST=     4132.6476996994, 0,             0
##LAST=      -1043.33573715361, 0,           0
##MIN=       -1043.33573715361, -252438,     0
##MAX=       4132.6476996994, 451133211,     0
$$ Real data points
##PAGE= N=1
##DATA TABLE= (X++(R..R)), XYDATA
$$ [...]
16395b9127M5693J8905m1780k2981M3444K1077o1383p9532l4749o417q850P631
$$ -29127 16566 35471 -6309 -29290 14154 35231 -26152 -105684 -140433 -146850 -155700 -148069
16383a48069K7306R86m7702L0502J8760R5033K6699J7194r961j7911N8852J6692
$$ -148069 -120763 -119777 -167479 -136977 -118217 -23184 3515 20709 10748 -7163 51689 68381
16371F8381J2875j0920o1392o064K16L98m5167m7140l6520K8752O7372L1966k8719
$$ 68381 81256 70336 8944 2880 3096 3494 -41673 -88813 -125333 -96581 -29209 2757 -25962
16358b5962j1016l6831m4075l9817M4417J0887q2106k4434J3172J9562P513O1532
$$ -25962 -36978 -73809 -117884 -157701 -113284 -102397 -184503 -208937 -195765 -176203 -168690 -107158
16346a07158N1831J0416J9736K4789n5447K5995N7014k5032k9203J5785J032l7248
$$ -107158 -55327 -44911 -25175 -386 -55833 -29838 27176 2144 -27059 -11274 -10242 -47490
16334d7490K6060M5209J3377o7799r341L5228l0158M0990j6456j6667L8905n576
$$ -47490 -21430 23779 37156 -30643 -39984 -4756 -34914 6076 -10380 -27047 11858 6282
16322F282r018p565j8841k9399K9614O0282k5567m5500q902O706N3081l8414l7549
$$ 6282 -2736 -10301 -29142 -58541 -28927 31355 5788 -39712 -48614 -41908 11173 -27241 -64790
16309f4790l5383l0670N5977L1171R3964J2147l79K8487J7543o2875q7959r1436
$$ -64790 -100173 -130843 -74866 -43695 50269 62416 62037 90524 108067 45192 -42767 -134203
16297a34203j0536j742L3132J05576L1161l3381n7056k7806j1798R0209k8273
$$ -134203 -144739 -146481 -113349 -7773 23388 -9993 -67049 -94855 -106653 -16444 -44717
16286d4717o4835P335N8028L0242L831n0302L5305l988j3042k2133K1926N3922
$$ -44717 -109552 -102217 -44189 -13947 -10116 -60418 -25113 -29101 -42143 -64276 -42350 11572
16274A1572J3635l5116j09899j3060p037R384O4538N9497K4338l0069m1000n8901
$$ 11572 25207 -9909 -119808 -132868 -139905 -130521 -65983 -6486 17852 -12217 -53217 -112118
16262a12118M7905N7727N1572J5396p4841o0675k6921l076O0582P6631O6526k9060
$$ -112118 -64213 -6486 45086 60482 -14359 -75034 -101955 -105031 -44449 32182 98708 69648
16250F9648p9982k2146L3244P2202m3635l9455n9153J2857m255l9975j7414N2088
$$ 69648 -10334 -32480 764 72966 29331 -10124 -69277 -56420 -60675 -100650 -118064 -65976
16238f5976J8665J0317O242p160k8919n5833O3893k1848J9568M3121R681j0580
$$ -65976 -47311 -36994 -30752 -37912 -66831 -122664 -58771 -80619 -61051 -17930 -8249 -18829
16226a8829K0679k856P0082J925J0876k6881m2908j0726p25k3882j1722M6617
$$ -18829 1850 -1006 69076 71001 81877 54996 12088 1362 637 -23245 -34967 11650
16214A1650l4652R587p897j02006k7271N2717J1471m6557j3429J3055L3195L3698
$$ 11650 -23002 -13415 -21312 -123318 -150589 -97872 -86401 -132958 -146387 -133332 -100137 -66439
16202f6439k0259o4326P690N122J4283L1197J0626R892N2930J4921Q221K3496
$$ -66439 -86698 -151024 -143334 -138212 -123929 -92732 -82106 -72214 -19284 -4363 3858 27354
16190B7354J1639M51m814J4673J9858j6230j1683L0162p9370n717j7420k022O816
$$ 27354 38993 39444 34630 49303 69161 52931 41248 71410 -7960 -13677 -31097 -33119 -26303
16177b6303l7586m2914j8194L3930M2214K045M7748K409q0424M2700q748J477
$$ -26303 -63889 -106803 -124997 -91067 -48853 -46808 940 3349 -77075 -34375 -43123 -41646
16165d1646k7561L6206l5547m2693j1515L2874P9663Q223Q4841l27m7686q8385
$$ -41646 -69207 -33001 -68548 -111241 -122756 -89882 -10219 -1996 82845 82518 34832 -53553
16153e3553j8413O1877J1560k2648o9699P5447K3434l0415J2143R237M4858N53
$$ -53553 -71966 -10089 1471 -21177 -90876 -15429 8005 -22410 -10267 -1030 43828 44381
16141D4381n2694m8635n0464k913L6250P1811K8634K6138p3774k5645k6723Q808
$$ 44381 -8313 -56948 -107412 -110325 -74075 -2264 26370 52508 -21266 -46911 -73634 -64826
16129f4826L5244K3838M0936l9265l873l6276n9422m4899J2456Q7137L8038J2234
$$ -64826 -29582 -5744 35192 -4073 -7946 -44222 -103644 -148543 -136087 -48950 -10912 1322
16117A322L6637P772l9331o2982p4369L1657M3572K0193k0745j6506j12226k5694
$$ 1322 37959 45731 6400 -56582 -130951 -99294 -55722 -35529 -56274 -72780 -185006 -210700
16105b10700N3664O0214r682q476J09336M6323o589k7738l275K0262l6483M7410
$$ -210700 -157036 -96822 -106504 -114980 -5644 40679 34090 6352 3077 23339 -13144 34266
16093C4266J8836K7297k0156m9421J2858L1803M7150n1527m37K9581o587m0663
$$ 34266 53102 80399 60243 10822 23680 55483 102633 51106 50669 80250 73663 33000
16081C3000l3621j9735J5924K3405j0898j7442O8414r6495o3944O7114L5828l0112
$$ 33000 -621 -20356 -4432 18973 8075 -9367 59047 -37448 -101392 -34278 1550 -28562
16069b8562K9806M331L0929k4584n8574j2902K6080J9950k3121K8473O4945l5086
$$ -28562 1244 5575 36504 11920 -46654 -59556 -33476 -13526 -36647 -8174 56771 21685
16057B1685r2816j9239K6169P1854J729p0828q117J0727o274l122M8582p3869
$$ 21685 -71131 -90370 -64201 7653 9382 -61446 -69563 -58836 -65110 -68232 -19650 -93519
16045i3519j0872l6520J494N6517J2397L2284K3539k465P2477J5028j09174j7242
$$ -93519 -104391 -140911 -139417 -82900 -70503 -38219 -14680 -17145 55332 70360 -38814 -56056
16033e6056L3411L8297N5637m5048r018k9541n5868Q314L2675N1546k4354j9059
$$ -56056 -22645 15652 71289 26241 17223 -12318 -68186 -59872 -27197 24349 -5 -19064
16021a9064l0299j2280n9640O7136R6250n529m5493p3598J7780K0520K153o0954
$$ -19064 -49363 -61643 -121283 -54147 42103 36574 -8919 -82517 -64737 -44217 -42064 -103018
16009a03018l8963L2935j164J8816N4991P312l3744k7243N7143K8443l4608j5661
$$ -103018 -141981 -109046 -110210 -91394 -36403 -29091 -62835 -90078 -32935 -4492 -39100 -54761
15997e4761o5696j2790N8884P8709K6044L6500k1873j9296L6162k4929K2457j8657
$$ -54761 -120457 -133247 -74363 4346 30390 66890 45017 25721 61883 36954 59411 40754
15985D0754K1087K2957j5177P0494n7606j8657N183m3503j8527K0395O1452r929
$$ 40754 61841 84798 69621 140115 82509 63852 69035 25532 7005 27400 88852 78923
15973G8923l8745J2060q05o4324q4031J3268J5951K1656j5388M081j3794J9434
$$ 78923 40178 52238 51433 -12891 -96922 -83654 -67703 -46047 -61435 -57354 -71148 -51714
15961e1714k9565j8275K1209l2325L2043J18488k084r961L5331K9051M8006n5777
$$ -51714 -81279 -99554 -78345 -110670 -78627 39861 37777 27816 63147 92198 140204 84427
15949H4427o9518j55039O138P1878M1747m0561L9003J0593J7111L4561M2266o705
$$ 84427 14909 -140130 -133992 -62114 -20367 -60928 -21925 -11332 5779 40340 82606 75901
15937G5901l5560m0498K0856L9455K4095l9178o7158K008j2054j9850N4207R185
$$ 75901 40341 -157 20699 60154 84249 45071 -22087 -20079 -32133 -51983 2224 11409
15925A1409n0924n9031L7757J0470Q627o3997m915j771m5781J5999K0297P3395
$$ 11409 -39515 -98546 -60789 -50319 -41692 -105689 -110604 -112375 -158156 -142157 -121860 -48465
15913d8465J8359m1146K3837n1682l7078P519J6467L7479N6810K1720k0051n065
$$ -48465 -30106 -71252 -47415 -99097 -136175 -128656 -112189 -74710 -17900 3820 -16231 -21296
15901b1296N3748P3212q9375l5268O223L7259N3653o5448j8325j7028M840j0346
$$ -21296 32452 105664 16289 -18979 -12756 24503 78156 12708 -5617 -22645 -17805 -28151
15889b8151J1983L720N685k1111m7424K9873N0653n775o2117Q290K8693o9134
$$ -28151 -16168 -12448 -6763 -27874 -75298 -45425 5228 -547 -62664 -54374 -25681 -94815
15877i4815J775P9176P7005m6995m2583m4269K2454N6461j652l7255K7556O8760
$$ -94815 -93040 -13864 63141 16146 -26437 -70706 -48252 8209 6557 -30698 -3142 65618
15865F5618J6449J3718n0862m7307K2682O4431L4457m968M402k4912l2432m9323
$$ 65618 82067 95785 44923 -2384 20298 84729 119186 114218 118620 93708 61276 11953
15853A1953m7720j3639J17197M338l2934L175J2477l986L246l2966R0473N2037
$$ 11953 -35767 -49406 67791 72129 39195 42370 54847 50861 54107 21141 111614 163651
15841A63651r2830j00677l9090M293n2606P8835O5010o504J3480k8421j8821j0364
$$ 163651 70821 -29856 -68946 -64653 -117259 -38424 26586 20082 33562 5141 -13680 -24044
15829b4044N721K1778L9898L0100m8965j7428k2866m9514l4058M4882K2099p113
$$ -24044 -18323 3455 43353 73453 24488 7060 -15806 -65320 -99378 -54496 -32397 -39510
15817c9510j6235O233o0232m9695J0574M6660K0637N0237J1214l1637M2499K2091
$$ -39510 -55745 -49512 -109744 -159439 -148865 -102205 -81568 -31331 -20117 -51754 -9255 12836
15805A2836n9237k448M8627l1734q0878j8527K9866k5995o1107M7291N7244j8744
$$ 12836 -46401 -48849 -222 -31956 -112834 -131361 -101495 -127490 -188597 -141306 -84062 -102806
15793a02806J6413k9472P4132L1697m9539m9710J8453Q8085l8501k6014m664L7568
$$ -102806 -86393 -115865 -41733 -10036 -59575 -109285 -90832 -2747 -41248 -67262 -71926 -34358
15781c4358K1911L6948K9453J1365l2486k7320l8171M70l6244M5601j2838Q686
$$ -34358 -12447 24501 53954 65319 32833 5513 -32658 -32188 -68432 -22831 -35669 -26983
15769b6983P1361K4929l7428j8580j0368O4449L9027p3313o0407j06421O815K0036
$$ -26983 44378 69307 31879 13299 2931 67380 106407 33094 -27313 -133734 -126919 -106883
15757a06883J1094J7578l1544j8459K878M2254j6848L5552J7788k3031K2473k4599
$$ -106883 -95789 -78211 -109755 -128214 -125336 -83082 -99930 -64378 -46590 -69621 -47148 -71747
15745g1747N1813K2038k4324o975K1889l3160J0396l4089j8052L6212K8677M67
$$ -71747 -19934 2104 -22220 -29195 -7306 -40466 -30070 -64159 -82211 -45999 -17322 -16855
15733a6855N2356k4234l2610J7458L7812o3388n9296L7995M8089n6928k1544K8792
$$ -16855 35501 11267 -21343 -3885 33927 -29461 -88757 -50762 -2673 -59601 -81145 -52353
15721e2353J8919K9250K081J110N4561k4766l2176N406n2046j1965O9902O2493
$$ -52353 -33434 -4184 -2103 -993 53568 28802 -3374 2032 -50014 -61979 7923 70416
15709G0416K3604q709k1366j07447m203L0300o3827M674M3679R505m9692R407
$$ 70416 94020 85311 63945 -43502 -47705 -17405 -81232 -76558 -32879 -23374 -73066 -63659
15697f3659N32M6049N741j4489q819J1149M4854l3148o5342k0917K1711J496Q669
$$ -63659 -63127 -17078 -11337 -25826 -34645 -23496 21358 -11790 -77132 -98049 -76338 -74842 -66173
15684f6173l5126j4240n54n6904j9216j032Q5512p976o3244J4227L1559M7637
$$ -66173 -101299 -115539 -116093 -172997 -192213 -193245 -107733 -115709 -178953 -164726 -133167 -85530
15672h5530k0654K9932N0575J4791K8832k3547o1789n6232P2538R0775l104m1189
$$ -85530 -106184 -76252 -25677 -10886 17946 -5601 -67390 -123622 -51084 39691 36587 -4602
15660d602o327o7035J3529M1370N3738Q075l0646o4695j3312L710j8702K5309
$$ -4602 -10929 -77964 -64435 -23065 30673 38748 8102 -56593 -69905 -66195 -84897 -59588
15648e9588L1328O0880r279L1903k0682J6142r185m2743Q779l7585l3851J7483
$$ -59588 -28260 32620 23341 55244 34562 50704 41519 -1224 7555 -30030 -63881 -46398
15636d6398L7247j3109K4249K377m4658J1894m590n4063L3615K8697J0467R0267
$$ -46398 -9151 -22260 1989 4366 -40292 -28398 -32988 -87051 -53436 -24739 -14272 75995
15624G5995r63q6857j4380M4457l8949o1225n1974J3179J04355L5979R5743J3624
$$ 75995 75032 -11825 -26205 18252 -20697 -81922 -133896 -120717 -16362 19617 115360 128984
15612A28984l7172K8583n8578q7750J0459O658j4735n596j0419J9352p3406n7585
$$ 128984 91812 120395 61817 -25933 -15474 -8816 -23551 -29147 -39566 -20214 -93620 -151205
15600a51205J5660N6552O3730O756j0558l2206k0780L9210K8785k0972M0219L2338
$$ -151205 -135545 -78993 -15263 -8507 -19065 -51271 -72051 -32841 -4056 -25028 15191 47529
15588D7529J1820O3931l7908p0182k8707m0808k540K7942O1399J0081r331R657
$$ 47529 59349 123280 85372 15190 -13517 -54325 -56865 -28923 32476 42557 33226 42883
15576D2883J08548l5166j08500p3832m0823j8098m7510J014L0145N0523O1736
$$ 42883 151431 116265 7765 -66067 -106890 -124988 -172498 -171484 -141339 -90816 -29080
15565b9080K2136j816J9729p937j2322Q097l4829r841j7172M9548N5990k6601
$$ -29080 -6944 -8760 10969 3032 -9290 -1193 -36022 -45863 -63035 -13487 42503 15902
15553A5902N1860k8078o9460k6947p9994n7722L2912O8668k8876j7796M3753K1985
$$ 15902 67762 39684 -29776 -56723 -136717 -194439 -161527 -92859 -121735 -139531 -95778 -73793
15541g3793J00207N3935o064j4656l092m7232k1804l4101R0762Q8401j6966p9107
$$ -73793 26414 80349 74285 59629 56537 9305 -12499 -46600 44162 132563 115597 36490
15529C6490l8908K3652m867n0837M039L7971M9578j332K6395Q911n7774Q218o153
$$ 36490 -2418 21234 16367 -34470 -30431 7540 57118 55786 82181 91092 33318 41536 35383
15516C5383n0579k468l9018M624J3078P8157k1817k3039N335L5708M3292j3532
$$ 35383 -15196 -17664 -56682 -52058 -38980 39177 17360 -5679 -344 35364 78656 65124
15504F5124l2947m8268o0972J999M393N4109l1336K0991K084k7049l4046m9446
$$ 65124 32177 -16091 -77063 -75064 -70671 -16562 -47898 -26907 -24823 -51872 -85918 -135364
15492a35364L2129P8524j5222j12215l313Q7560Q350K1542k3844M8791Q4553k7479
$$ -135364 -103235 -24711 -39933 -152148 -155461 -67901 -59551 -38009 -61853 -13062 71491 44012
15480D4012n6158O931N8444p580j2572k1969j4397q1948k8686P8496P7505L4478
$$ 44012 -12146 -5215 53229 45649 33077 11108 -3289 -85237 -113923 -35427 42078 76556
15468G6556j2414K7263n3569M825j6968n2246l6857m3934L3922P2395P5910K0556
$$ 76556 64142 91405 37836 42661 25693 -26553 -63410 -107344 -73422 -1027 74883 95439
15456I5439m2125k4529n1647J058J9461l5191K9529J5242n5395l7526J5118L3221
$$ 95439 53314 28785 -22862 -21804 -2343 -37534 -8005 7237 -48158 -85684 -70566 -37345
15444c7345l2847m7710J6147L6654J9369l0403O839o4749n9955J2525Q0061Q2922
$$ -37345 -70192 -117902 -101755 -65101 -45732 -76135 -69296 -134045 -194000 -181475 -101414 -18492
15432a8492K6024o3374n5309K6576m5504K7933n9645Q556M0027N7458J1731J0858
$$ -18492 7532 -55842 -111151 -84575 -130079 -102146 -161791 -153235 -113208 -55750 -44019 -33161
15420c3161M117J2325N852k1894K2558J9293j4494l2405N3556j4594j6137K8806
$$ -33161 -29044 -16719 -10867 -32761 -10203 9090 -5404 -37809 15747 1153 -14984 13822
15408A3822m2696j7269N4730M4580J7412J4627J7241j0856o2721m4912O2763L8524
$$ 13822 -28874 -46143 8587 53167 70579 85206 102447 91591 28870 -16042 46721 85245
15396H5245l1662N4323J655n2621k8650n0754m6786n9453J8937P3091L3530M4836
$$ 85245 53583 107906 109561 56940 28290 -22464 -69250 -128703 -109766 -36675 -3145 41691
15384D1691O0481P85o343q4165m5556j1046l0828j6616N7510Q2630l7288M710
$$ 41691 102172 102957 96614 12449 -33107 -44153 -74981 -91597 -34087 48543 11255 15965
15372A5965K0245n128l4519N4971l4274m7653R420K9805O7911n6822n5628J8125
$$ 15965 36210 31082 -3437 51534 17260 -30393 -20973 8832 76743 19921 -35707 -17582
15360a7582k360P561O5231k2199o6122m6813J1885Q7216M0869o5254k5912l6760
$$ -17582 -19942 -12381 52850 30651 -35471 -82284 -70399 16817 57686 -7568 -33480 -70240
15348g0240N1392K4879R856J9874l0956l8684M2705J3334m5282l218k4843J4399
$$ -70240 -18848 6031 15887 35761 4805 -33879 8826 22160 -23122 -26340 -51183 -36784
15336c6784k8511j8514M0259M2130l190m3357M987j0765k2919L5843j4231j7341
$$ -36784 -65295 -83809 -43550 -1420 -4610 -47967 -42980 -53745 -76664 -40821 -55052 -72393
15324g2393J6592J277L8838J6347o501k0786l4634k2005L6177J2400K436J2794
$$ -72393 -55801 -54524 -15686 661 -5840 -26626 -61260 -83265 -47088 -34688 -32252 -19458
15312a9458K1486q9076K1975Q2862J2183l9275N732n6190m1792M2500P4419K2380
$$ -19458 2028 -87048 -65073 17789 29972 -9303 -3571 -59761 -101553 -59053 15366 37746
15300C7746K5728m9888k211j4077q0873J6441R9747L8286m8050l9912K5934K727
$$ 37746 63474 13586 11375 -2702 -83575 -67134 32613 70899 22849 -17063 8871 11598
15288A1598n8618n1318n670Q431O3035O0606r292l2204l092m3686O3211R157m370
$$ 11598 -47020 -98338 -104008 -95577 -32542 28064 18772 -13432 -16524 -60210 3001 12158 7788
15275G788k7322O8588j5876m6677m7653l331N7250l6733k5815j9908M370L1536
$$ 7788 -19534 49054 33178 -13499 -61152 -64483 -7233 -43966 -69781 -89689 -85319 -53783
15263e3783J6434J4892Q941j8794m7981K5561L8088j8197k3419N1788J9608N0085
$$ -53783 -37349 -22457 -13516 -32310 -80291 -54730 -16642 -34839 -58258 -6470 13138 63223
15251F3223k6392q3346l9424k3411M5372O5939j6194q1944m62J3707m0455M7386
$$ 63223 36831 -46515 -85939 -109350 -63978 1961 -14233 -96177 -96639 -82932 -123387 -76001
15239g6001l9439K509P5089J3818J485n8926l2448L1879P4027K673p1641j0076
$$ -76001 -115440 -112931 -37842 -24024 -22539 -81465 -113913 -82034 -8007 -5334 -76975 -87051
15227h7051j541l3644L8420k511j0027J731K3855N9168j8562m7989M3027L1260
$$ -87051 -88592 -122236 -83816 -86327 -96354 -94623 -70768 -11600 -30162 -78151 -35124 -3864
15215c864j959o145J3996L8767l0823k0034k5888j2397N2907n730n7464P275N8006
$$ -3864 -5823 -11968 2028 40795 9972 -10062 -35950 -48347 4560 -1170 -58634 -51359 6647
15202F647L247j3642L2881r122m8790j3966M4055j8668k339O2349m4724n0920
$$ 6647 9894 -3748 29133 20011 -28779 -42745 1310 -17358 -19697 42652 -2072 -52992
15190e2992P45P3465j2102m3807j0295O755M475J6491j4179O824n2908l3965k1353
$$ -52992 -52247 21218 9116 -34691 -44986 -38231 -33756 -17265 -31444 -24620 -77528 -111493 -132846
15177a32846L6443J3429p2895L1220P2570Q5878R0265j137n4755p0180J8499p144
$$ -132846 -96403 -82974 -155869 -124649 -52079 33799 124064 122927 68172 -2008 16491 9347
15165I347l8572L670P4839K8303k5918k4468r4191J6207J10411N2653J0951j8733
$$ 9347 -29225 -25555 49284 77587 51669 27201 -66990 -50783 59628 112281 123232 104499
15153A04499j4740K313j1164j10421j8878L4002N2991O0644m3841m3235N158k6889
$$ 104499 89759 92072 80908 -29513 -48391 -14389 38602 99246 55405 12170 17328 -9561
15141i561j4627M1488l4409J4876r095l0368J6933j8454k5240J4024K3599r994
$$ -9561 -24188 17300 -17109 -2233 -11328 -41696 -24763 -43217 -68457 -54433 -30834 -40828
15129d0828J1746O8146J0558j9363K3127J4982R055m3463j8571O0976O4231k8471
$$ -40828 -29082 39064 49622 30259 53386 68368 77423 33960 15389 76365 140596 112125
15117A12125p0020q3848n6923l417k8726P7067M2625m298L2649M6166o5252k5578
$$ 112125 42105 -41743 -98666 -102083 -130809 -53742 -11117 -15415 17234 63400 -1852 -27430
15105b7430J3351l8666L6598M2899m0345p3047J9922P2762k4420L6821l1876l1139
$$ -27430 -14079 -52745 -16147 26752 -13593 -86640 -66718 6044 -18376 18445 -13431 -44570
15093d4570L0829P3487M5910m8722o6447q4268N7858J7113L1460O1835O188l6660
$$ -44570 -13741 59746 105656 56934 -9513 -93781 -35923 -18810 12650 74485 80673 44013
15081D4013M170K4818l2945l4423j9345Q9433j5526r600K4319P7103J2505p4659
$$ 44013 48183 73001 40056 5633 -13712 75721 60195 50595 74914 152017 164522 89863
15069H9863j06291n3191M4293M2083K6650p2189p9221l7764n0944P950K6817m1255
$$ 89863 -16428 -69619 -25326 16757 43407 -28782 -108003 -145767 -196711 -188761 -161944 -203199
15057b03199Q2867J17586M4731k8378j6622l3404L119l0644R058M269k0826k0522
$$ -203199 -120332 -2746 41985 13607 -3015 -36419 -33300 -63944 -54886 -50617 -71443 -91965
15045i1965P718L3309N0849J1910P895k0582J1235m708J7244J5072m1825n329
$$ -91965 -84247 -50938 -89 11821 19716 -866 10369 5661 22905 37977 -3848 -9177
15033i177L9915m1425M9223l6139l9208k6741K5589J8747R692n0183J8844J01353
$$ -9177 30738 -10687 38536 2397 -36811 -63552 -37963 -19216 -9524 -59707 -40863 60490
15021F0490L7942o8292o2835j4186k22j3005L1212O534K0559M1423j7622Q210
$$ 60490 98432 30140 -32695 -46881 -47103 -60108 -28896 -22362 -1803 39620 21998 30208
15009C0208J9240j9963r9667o6891M3308N2602k1421P0879R1317k2692o8603R273
$$ 30208 49448 29485 -70182 -137073 -93765 -41163 -62584 8295 99612 76920 8317 17590
14997A7590M4344j7309n4996L9762l4400J0605P813l1237K0834J7028Q40L9231
$$ 17590 61934 44625 -10371 29391 -5009 5596 13409 -17828 3006 20034 20874 60105
14985F0105K304j02712K827K6348N9619N4873K3874k7489n8748j3475N078m861
$$ 60105 62409 -40303 -37476 -11128 48491 103364 127238 99749 41001 27526 32604 27743
14973B7743n0183o6156n83N3062j6780R587M2909p69M6054K4081q068J8830l1777
$$ 27743 -22440 -88596 -89179 -36117 -52897 -43310 -401 -1170 44884 68965 60897 79727 47950
14960D7950M2117R601q9308j8998K3986o3700m5264p821m072M9065l389k2317
$$ 47950 90067 99668 10360 -8638 15348 -48352 -93616 -101437 -105509 -56444 -59833 -82150
14948h2150K3341K3963L1508K401J5376m3390m495R2879M2011K3561q0244Q802
$$ -82150 -58809 -34846 -3338 -937 14439 -28951 -33446 59433 101444 125005 44761 53563
14936E3563m1726l0401L4414m0480n0458j8834O666J9022K349L3073K0960M1614
$$ 53563 11837 -18564 15850 -24630 -75088 -93922 -87256 -68234 -65885 -32812 -11852 29762
14924B9762J15J8115J3646j506K6174L2100N9965N1063j17323j02087K6427k1985
$$ 29762 29877 47992 61638 60132 86306 118406 178371 229434 112111 10024 36451 14466
14912A4466m7242l0091O4707Q0599n2102n3313j2568K2711J7470k0062K8675J9126
$$ 14466 -32776 -62867 1840 82439 30337 -22976 -35544 -12833 4637 -15425 13250 32376
14900C2376l0648M06R6502o6438n7879K5509n941Q774J769n0784L377m6422k971
$$ 32376 1728 2134 98636 32198 -25681 -172 -6113 2661 4430 -46354 -42977 -89399 -92370
14887i2370l2384r154J0640P1443M3479K4851L044q309n6779q5125q361M0411
$$ -92370 -124754 -133908 -123268 -51825 -8346 16505 19549 11240 -45539 -130664 -139025 -98614
14875i8614M4726L0587L0420j0073k9961J9074M0534l4008L840m2750m6785k5358
$$ -98614 -53888 -23301 7119 -2954 -32915 -13841 26693 -7315 -3475 -46225 -93010 -118368
14863a18368P642o322O9654M2628k784K4353n835j02257o6656L673J3591L7843
$$ -118368 -110726 -117048 -47394 -4766 -7550 16803 10968 -91289 -157945 -154272 -140681 -102838
14851a02838K408P1121M5734l1958q1922j6104n53M1337k2839J0944L5413R7679
$$ -102838 -100430 -29309 16425 -15533 -97455 -113559 -114112 -72775 -95614 -84670 -49257 48422
14839D8422n8990m0344L0292k864j4749q351J7067K0715j007k8895p460n024J571
$$ 48422 -10568 -50912 -20620 -23484 -38233 -46584 -29517 -8802 -9809 -38704 -46164 -51188 -49617
14826d9617n7104R464P1694L5449K2287q780k7474J1743L2618O8134N4684m0721
$$ -49617 -106721 -97257 -25563 9886 32173 23393 -4081 7662 40280 108414 163098 122377
14814A22377q5259n0234k1315o7663K8315L1939O27n5411o0865l930k1575M4844
$$ 122377 37118 -13116 -34431 -102094 -73779 -41840 -41213 -96624 -157489 -161419 -182994 -138150
14802a38150N8042J0119k2004J9485M3302p3638K686k0743k1612K1280N2982L2773
$$ -138150 -80108 -69989 -91993 -72508 -29206 -102844 -100158 -120901 -142513 -121233 -68251 -35478
14790c5478k2674o2104o613L6505q089q609J605N7153j7974n4805K8476L9639
$$ -35478 -58152 -120256 -126869 -90364 -98453 -107062 -105457 -48304 -66278 -121083 -92607 -52968
14778e2968P437M3347J3027K9550n7080o6429n888j6843M1006L5324m5276q4872
$$ -52968 -45531 -2184 10843 40393 -16687 -83116 -89004 -105847 -64841 -29517 -74793 -159665
14766a59665M3927k3731m074P3537K0283q546m3867K9478j1564k1172k309M0857
$$ -159665 -115738 -139469 -143543 -70006 -49723 -58269 -102136 -72658 -84222 -105394 -107703 -66846
14754f6846P0399L7887L7253M900N428j6632j132k3650L204n5902m6645O1532
$$ -66846 3553 41440 78693 83593 89021 72389 71257 47607 50811 -5091 -51736 9796
14742I796P505o904j3098L1566M4975j21q5858l8214N5835N9953M214o6064p4665
$$ 9796 17301 10397 -2701 28865 73840 73719 -12139 -50353 5482 65435 69649 3585 -71080
14729g1080j9732J4107l7088N5409M2320J3997m3025l569N5288M7886k0233k7671
$$ -71080 -90812 -76705 -113793 -58384 -16064 -2067 -45092 -48661 6627 54513 34280 6609
14717F609N1688O752K2340q215l2259L9020k5874m5889m7295n7969L9615K8263
$$ 6609 58297 65049 87389 79174 46915 85935 60061 14172 -33123 -91092 -51477 -23214
14705b3214J8707K4661L1193Q1087r0583j13867r805K1224M8330O4887J10752
$$ -23214 -4507 20154 51347 132434 41851 -72016 -81821 -60597 -12267 52620 163372
14694A63372K699l9612m5467j01831n2261M4724k9817n4866l1374L1028L5658
$$ 163372 166071 126459 80992 -20839 -73100 -28376 -58193 -113059 -144433 -113405 -77747
14683g7747J01922K9288k3082l889Q98k8480k3865J1936O379K695p4482l8782
$$ -77747 24175 53463 30381 26492 27390 -1090 -24955 -13019 -6640 -3945 -78427 -117209
14671a17209P5757M1519K8192q097l0517J685K5667r20n0549J3852R898J1782
$$ -117209 -41452 67 28259 20162 -10355 -8670 16997 16077 -34472 -20620 -10722 1060
14659A060L3640N7006O130K7854k9426q4463m3881o7402k8847N5560R327j9505
$$ 1060 34700 91706 97836 125690 96264 11801 -32080 -99482 -128329 -72769 -63442 -82947
14647h2947l2696J9073O6188L6408J108L6167J2571L7094J5586q458l5491n5967
$$ -82947 -115643 -96570 -30382 6026 7134 43301 55872 92966 108552 100094 64603 8636
14635H636l8480K0822L6768n1072j1442O0518J3828J2164l290m6991j7261k8162
$$ 8636 -29844 -9022 27746 -23326 -34768 25750 39578 51742 48452 1461 -15800 -43962
14623d3962j2057j4164j096j4095l4767J1703O7941K8186N2267q654m3863k0460
$$ -43962 -56019 -70183 -71279 -85374 -120141 -108438 -40497 -12311 39956 31302 -12561 -33021
14611c3021K7472J9785j5073l3035j930j635N9574Q269j07096l9901M3373K0833
$$ -33021 -5549 14236 -837 -33872 -35802 -37437 22137 30406 -76690 -116591 -73218 -52385
14599e2385J5699K2696Q2878K430k28J3386k4601k2087l3439K9729k2377P082
$$ -52385 -36686 -13990 68888 71318 71090 84476 59875 37788 4349 34078 11701 18783
14587A8783L7858O636J6857Q570j6690m2448j691k0913K3740J9779p1442l4787
$$ 18783 56641 63277 80134 88704 72014 29566 27875 6962 30702 50481 -20961 -55748
14575e5748n643P1380j3413j5677P8084R793m985J1902m69k3528l1985R1625q8055
$$ -55748 -61391 9989 -3424 -19101 58983 68776 63791 75693 75224 51696 19711 111336 23281
14562B3281j14565Q511P7060P1828L0067j9101o0090J498o0483l3202Q7746N1616
$$ 23281 -91284 -82773 -5713 66115 96182 77081 16991 18489 -41994 -75196 12550 64166
14550F4166p2761j533N0443J8575m7321k1085o7790n897K4413K4813K6677p5274
$$ 64166 -8595 -10128 40315 58890 11569 -9516 -77306 -83203 -58790 -33977 -7300 -82574
14538h2574K1782P5408M4477n0470j1924L6175J199N356n2823k8271o1635k8789
$$ -82574 -60792 14616 59093 8623 -3301 32874 34073 39429 -13394 -41665 -103300 -132089
14526a32089J4024N5255P9822n979P218m0194J3904M8404j1824R697j6999L0078
$$ -132089 -118065 -62810 17012 11033 18251 -21943 -8039 40365 28541 38238 21239 51317
14514E1317L7490n5031o5011J7185J6784p641J3404q024n5302k5289K8147n5647
$$ 51317 88807 33776 -31235 -14050 2734 -4907 8497 473 -54829 -80118 -51971 -107618
14502a07618K1098Q9100K5209j0652L1673K6758k6514l9388n2187L3498K6188
$$ -107618 -86520 2580 27789 17137 48810 75568 49054 9666 -42521 -9023 17165
14491A7165K6448l9947K690M1083k8650L4854k3646j883K0655L3822j5821l5763
$$ 17165 43613 3666 6356 47439 18789 53643 29997 28114 48769 82591 66770 31007
14479C1007m0662k574J5160m2379o9110J7813L417K3041L9662K6042p5789k2962
$$ 31007 -9655 -12229 2931 -39448 -108558 -90745 -87328 -64287 -24625 1417 -74372 -97334
14467i7334P731L7806L9801L1918n0810J491k008O445m828K5035Q8850P2043r3798
$$ -97334 -89603 -51797 -11996 19922 -30888 -29397 -31405 -24960 -29788 -4753 84097 156140 62342
14454F2342r3640J4018K4036L9403M6064L0669r449m9487k8990j0477m5445M463
$$ 62342 -31298 -17280 6756 46159 92223 122892 113443 63956 34966 24489 -20956 -16493
14442a6493Q203K8157L3825l3031o9531k8661M0472L3263k029O846m2369N531
$$ -16493 -8290 19867 53692 20661 -48870 -77531 -37059 -3796 -5825 1021 -41348 -35817
14430c5817l66O0709P1249k7033k1713n5188n0034O2808K0473l1050o145k6887
$$ -35817 -36183 24526 95775 68742 47029 -8159 -58193 4615 25088 -5962 -12107 -38994
14418c8994M1674K6483l9735q9663M839R2058K8785o5585j0442M3449j9514L8578
$$ -38994 2680 29163 -10572 -100235 -95396 -3338 25447 -40138 -50580 -7131 -26645 11933
14406A1933k0252J3055J231r010J1473Q19K7230k1624J1300k2781k3799K4759
$$ 11933 -8319 4736 5967 -3043 8430 9249 36479 14855 26155 3374 -20425 4334
14394D334o481J7009n4626m3178n74j701N6426k3515l1103l5735K179L8226L7475
$$ 4334 -2147 14862 -39764 -82942 -83516 -85217 -28791 -52306 -83409 -119144 -116965 -78739 -41264
14381d1264L647J2213N7933o280l9217j532l8095O1775O1879m3997m1958o0119
$$ -41264 -37617 -25404 32529 26249 -12968 -14500 -52595 9180 71059 27062 -14896 -75015
14369g5015K1858O4599L772k1750K7002p3241o3036l0280M2028N7759k0886J5744
$$ -75015 -53157 11442 15214 -6536 20466 -52775 -115811 -146091 -104063 -46304 -67190 -51446
14357e1446N5737l9958l3575J6229M6639M0221J0507j7224p7662J2930K5934l0276
$$ -51446 4291 -35667 -69242 -53013 -6374 33847 44354 27130 -50532 -37602 -11668 -41944
14345d1944q965N3734N6613r803o6387j8251O8425q922k2893j9655o77k405J8093
$$ -41944 -50909 2825 59438 49635 -16752 -35003 33422 24500 1607 -18048 -18725 -21130 -3037
14332c037L6767k1262J000n3060L798M175k3418J0117J21070n8725J512m3742
$$ -3037 33730 12468 13468 -39592 -35794 -31619 -55037 -44920 76150 17425 18937 -24805
14320b4805m6500N6376L0160M4592L7270n1146n1436O272K1054N1071P207M0487
$$ -24805 -71305 -14929 15231 59823 97093 45947 -5489 783 21837 72908 80115 120602
14308A20602n1541j11735q743P860q954n3362P952J8175L1524L4311J04604N9958
$$ 120602 69061 -42674 -51417 -43557 -52511 -105873 -97921 -79746 -48222 -13911 90693 150651
14296A50651o1900p5970L4732M7126j2714m9072o4356j8524n6027J9284L4658
$$ 150651 88751 12781 47513 94639 81925 32853 -31503 -50027 -106054 -86770 -52112
14285e2112M4144K5651J8717k3140P9944J450o1416K6687K1534j08908l369j437
$$ -52112 -7968 17683 36400 13260 93204 94654 33238 59925 81459 -27449 -30818 -32255
14273c2255q1025q6241l2429L7967J10007p0633j4547N6727K9984J3169q266O975
$$ -32255 -113280 -199521 -231950 -193983 -83976 -154609 -169156 -112429 -82445 -69276 -77542 -70567
14261g0567L8491L0968j8090j9495N3853N0501R166l4328m8913m1315M4511K7545
$$ -70567 -32076 -1108 -19198 -38693 15160 65661 74827 40499 -8414 -49729 -5218 22327
14249B2327K7868O7780N6730o9456o1751N057k9126j54k6177p2759L240J21976
$$ 22327 50195 117975 174705 105249 43498 48555 19429 19275 -6902 -79661 -76421 45555
14237D5555L8892k3348o6612o8562r22J5054L2152O589p371j7035L4047L2827
$$ 45555 84447 61099 -5513 -74075 -74997 -59943 -27791 -21202 -28573 -45608 -11561 21266
14225B1266k2693k9510J4101P976K6013L5480j0416o3020L4800J2677M1192m2772
$$ 21266 -1427 -30937 -16836 -8860 17153 52633 42217 -20803 13997 26674 67866 25094
14213B5094p3916L0533M5960M3943l1319r1366r7534K8968P0660K3865N1169j9652
$$ 25094 -48822 -18289 27671 71614 40295 -51071 -148605 -119637 -48977 -25112 26057 6405
14201F405J0420l6711l673K8750K9594M1711J1453r4794m1820n2262K9905P3292
$$ 6405 16825 -19886 -23559 5191 34785 76496 87949 -6845 -48665 -100927 -71022 2270
14189B270K0192N0464P351l9581O81l7433m7550r103N8427M4957p573o3797m4439
$$ 2270 22462 72926 80277 40696 41377 3944 -43606 -52709 5718 50675 43102 -20695 -65134
14176f5134M0115Q1834j8126q0320j1107K618K6297j891N8336p73N7043j980o6982
$$ -65134 -25019 56815 38689 -41631 -52738 -50120 -23823 -25714 32622 31849 88892 86912 19930
14163A9930J0975P308k1903J0022j0156J2534J3517p1562m095o323l8737m8656
$$ 19930 30905 38213 16310 26332 16176 28710 42227 -29335 -33430 -39753 -78490 -127146
14151a27146R5509L5851p6402o7625M6074L0693K6484L3268L9762M3407K3688
$$ -127146 -31637 4214 -72188 -139813 -93739 -63046 -36562 -3294 36468 79875 103563
14140A03563o9870p1069j5184j1657o4164j9779L5092R909M8552P3649M532m2125
$$ 103563 33693 -37376 -52560 -64217 -128381 -148160 -113068 -103159 -54607 19042 23574 -18551
14128a8551m5753o1755J9374R5084K9827j5170k4447K5444P946L1254J6099N978
$$ -18551 -64304 -126059 -106685 -11601 18226 3056 -21391 4053 11999 43253 59352 65330
14116F5330q243K4023q667k3689k315p86q5279K9757R0967K5813k7579l6081l1410
$$ 65330 57087 81110 72443 48754 46439 45653 -39626 -9869 81098 106911 79332 43251 11841
14103A1841m6457L8323q4184k5761N9682k8873J6276M8220l4996l1503k1830k8364
$$ 11841 -34616 3707 -80477 -106238 -46556 -75429 -59153 -10933 -45929 -77432 -99262 -127626
14091a27626K2117J0059K0719M5618j4208O994M1371j5360j0913l5116K332M4676
$$ -127626 -105509 -95450 -74731 -29113 -43321 -36327 5044 -10316 -21229 -56345 -54013 -9337
14079i337Q0098k0745J4339o6303J1072o290k6223L2175l4954j6177N4491J8469
$$ -9337 70761 50016 64355 -1948 9124 2834 -23389 8786 -26168 -42345 12146 30615
14067C0615j7706k7426J1568J9843m1053j6458n710M5497M0472l3941N7567J5164
$$ 30615 12909 -14517 -2949 16894 -24159 -40617 -46327 -830 39642 5701 63268 78432
14055G8432Q21K4793Q378p4505k1214J5601q3456J6041J04878M7040m6443m8041
$$ 78432 79253 104046 112424 37919 16705 32306 -51150 -35109 69769 116809 70366 22325
14043B2325j6975o56k5100J8125k9665l7718j7954Q8432N7517l7990J6514P718
$$ 22325 5350 4694 -20406 -2281 -31946 -69664 -87618 814 58331 20341 36855 44573
14031D4573k172Q796p456l0715O563j8519K6107m3570L1726L731k3708l8824n3372
$$ 44573 42401 51197 43741 13026 19589 1070 27177 -16393 15333 19064 -4644 -43468 -96840
14018i6840M3385l3933M0249K4334N696M3172j803o2236J304Q3238J9162m479
$$ -96840 -53455 -87388 -47139 -22805 -17109 26063 24260 -37976 -36672 46566 65728 61249
14006F1249o5070P8265M1644k4776M7721j04723k8179l1634j1462R5168M8032
$$ 61249 -3821 74444 116088 91312 139033 34310 6131 -25503 -36965 58203 106235
13995A06235j2984J16N5877j819j6554J1641p9787P193N8498n096n7053n8691
$$ 106235 93251 93367 149244 147425 130871 142512 62725 69918 128416 123320 66267 7576
13983G576r067k0034L1796K9888K0983N1606M8005k4418m2271j6590j4746k0747
$$ 7576 -1491 -21525 10271 40159 61142 112748 160753 136335 94064 77474 62728 41981
13971D1981k1397j8134o3728k2507Q3919O9474o7973j7144k4543j2738k4019n775
$$ 41981 20584 2450 -61278 -83785 134 69608 1635 -15509 -40052 -52790 -76809 -82584
13959h2584L7941L006l4538m6719L7690J05361R874Q947j7301r470k9913K8162
$$ -82584 -44643 -41637 -76175 -122894 -85204 20157 30031 38978 21677 12207 -17706 10456
13947A0456P8943J763K8627p6162o7286k4345j5091R129o0537n6165P340N4759
$$ 10456 89399 91162 119789 43627 -23659 -48004 -63095 -53966 -114503 -170668 -163328 -108569
13935a08569J54437J32136l4465l3515n0208m095m5555n2959r4832j5114J6751
$$ -108569 45868 178004 143539 110024 59816 55721 10166 -42793 -137625 -152739 -135988
13924a35988k4130J9046K4102M2814O2622J3320L8502p0585l4268J5569N3012
$$ -135988 -160118 -141072 -116970 -74156 -11534 1786 40288 -30297 -64565 -48996 4016
13913D016k4074k4146N174J7195J862k665j1995K8181L9386Q247l7451L9565m1804
$$ 4016 -20058 -44204 -39030 -21835 -19973 -22638 -34633 -6452 32934 41181 3730 43295 1491
13900A491j0522N1445O195p6287N3389N2002p51j7961M4302M7980m5672m1162
$$ 1491 -9031 42414 48609 -27678 25711 77713 76962 59001 103303 151283 105611 64449
13888F4449k3378l8561J4548m391N4997N8270o5569j10613k5997N5530N8076j4497
$$ 64449 41071 2510 17058 12667 67664 125934 60365 -50248 -76245 -20715 37361 22864
13876B2864l4820m7605k9762Q778M2701m520k0099L2626L2635J2097M121K8046
$$ 22864 -11956 -59561 -89323 -80545 -37844 -42364 -62463 -29837 2798 14895 19016 47062
13864D7062l2118l3676J1234P0543r704m4925m4503j4686J2814k8205M2497J5185
$$ 47062 14944 -18732 -7498 63045 53341 8416 -36087 -50773 -37959 -66164 -23667 -8482
13852h482k0528P0178j7667l0365l1403J9373J1626M0776j8191J0439p170j4868
$$ -8482 -29010 41168 23501 -6864 -38267 -18894 -7268 33508 15317 25756 18586 3718
13840C718j9708J7142q99J6634M1594J1151J5537j2723j2620R0J4509j3487n885
$$ 3718 -15990 1152 253 16887 58481 69632 85169 72446 59826 59916 74425 60938 55053
13827E5053r1879m3986J06507j2406r7313K4381N0507K914p777j1810J042R878
$$ 55053 -36826 -80812 25695 13289 -84024 -59643 -9136 -6222 -13999 -25809 -24767 -14889
13815a4889K8755Q118k4570J1215O150M9561l4379l3762j5091o475K9110j8311
$$ -14889 13866 21984 -2586 8629 14779 64340 29961 -3801 -18892 -25367 3743 -14568
13803a4568r8698j2093M0833L2026k6611j5422P968O132J0255K5425K3626j1593
$$ -14568 -113266 -125359 -84526 -52500 -79111 -94533 -86565 -80433 -70178 -44753 -21127 -32720
13791c2720J6144M8017j2762j1908m0715m6096M620k7327j0916J6376n3459J1790
$$ -32720 -16576 31441 18679 6771 -33944 -80040 -75420 -102747 -113663 -97287 -150746 -138956
13779a38956R7115N0349k1193m4189n6949M4495Q7174O5820l6895r1276n9843
$$ -138956 -41841 8508 -12685 -56874 -113823 -69328 17846 83666 46771 -44505 -104348
13768a04348O4308M5202L6194M66l1318M3659M1575j3854L901L2532n9972o4187
$$ -104348 -40040 5162 41356 41822 10504 54163 95738 81884 85785 118317 58345 -5842
13756e842K501O0442N3236r334m1736K469J557K2271O490P852r9568p2954j7026
$$ -5842 -3341 57101 110337 101003 59267 61736 63293 85564 92054 99906 338 -72616 -89642
13743h9642m762P1836K0124j799n2026K7145N6651n8260n8649m7598P6428R9467
$$ -89642 -94404 -22568 -2444 -4243 -56269 -29124 27527 -30733 -89382 -136980 -60552 38915
13731C8915j2132N141p4766l5811P3999K5660L8605L4051K9933p5835r6507P6335
$$ 38915 26783 31924 -42842 -78653 -4654 21006 59611 93662 123595 47760 -48747 27588
13719B7588J5948J5025k4081j6535N8391j686L0021j6274o1251p0047M8598O9022
$$ 27588 43536 58561 34480 17945 76336 74650 104671 88397 27146 -42901 5697 74719
13707G4719K4255o3030K5721m7976K92J4375K3309j3822k1321j8190j05052k1248
$$ 74719 98974 35944 61665 13689 13981 28356 51665 37843 16522 -1668 -106720 -127968
13695a27968L3852O3773L4387o5065K2487M1366m8909j0949m870k7745L2445q346
$$ -127968 -94116 -30343 4044 -61021 -38534 2832 -46077 -57026 -61896 -89641 -57196 -65542
13683f5542j6604j6365j2994O266M3848K2886J133K1442P097k6081o543n6661
$$ -65542 -82146 -98511 -111505 -105239 -61391 -38505 -37372 -15930 -8833 -34914 -41457 -98118
13671i8118J6489P0766L4036j761p827L2076k8034j6219o0361J4595J8821J2685
$$ -98118 -81629 -10863 23173 21412 13585 45661 17627 1408 -58953 -44358 -25537 -12852
13659a2852k1941k8389r567N0576N3541Q0904k3928m1616K7311k0284q7485L1657
$$ -12852 -34793 -63182 -72749 -22173 31368 112272 88344 46728 74039 53755 -33730 -2073
13647b073O2237J5638n7768n3101j1574k3061l1384K423m7092J8990K5487m971
$$ -2073 60164 75802 18034 -35067 -46641 -69702 -101086 -98663 -145755 -126765 -101278 -106249
13635a06249O8276L209L2570N8028k14j8485j3261J1745N4874j4918l3611J4105
$$ -106249 -37973 -34764 -2194 55834 55620 37135 23874 35619 90493 75575 41964 56069
13623E6069O952j6343M0453N1918m077r87n9809o6338L7155l6982K486J0051J4821
$$ 56069 63021 46678 87131 139049 134972 133985 74176 7838 44993 8011 10497 20548 35369
13610C5369J0013j7491l0627j6669p6921P323M6998q316j2777K3298J3418J090
$$ 35369 45382 27891 -2736 -19405 -96326 -89003 -42005 -50321 -63098 -39800 -26382 -25292
13598b5292N8630K8556j4465N5070P8143j9236p4654o0539l6512K6853j4329m5470
$$ -25292 33338 61894 47429 102499 180642 161406 86752 26213 -10299 16554 2225 -43245
13586d3245K6255L2910J5292K1517k8313l6682M3004O690o5324o5147K7584M0454
$$ -43245 -16990 15920 31212 52729 24416 -12266 30738 37428 -27896 -93043 -65459 -25005
13574b5005k8311m9356r682P7413O5500N0578K6650K7506q2423p9325P230L6656
$$ -25005 -53316 -102672 -112354 -34941 30559 81137 107787 135293 52870 -26455 -19225 17431
13562A7431Q594j7610J7598j1062N3374j76o3452m4477m826J6070n9213o66N4890
$$ 17431 26025 8415 26013 14951 68325 68149 4697 -39780 -44606 -28536 -87749 -88415 -33525
13549c3525P0401n377l3364j6541j2566J792l0786o3576j4402L7825L2906q380
$$ -33525 36876 31499 -1865 -18406 -30972 -29180 -59966 -123542 -137944 -100119 -67213 -75593
13537g5593J3729l5233o596R994J1679J1705r776J6312M9571K7786k8683k3382
$$ -75593 -61864 -97097 -103693 -93699 -82020 -70315 -80091 -63779 -14208 13578 -15105 -38487
13525c8487K808l3183m8644l5560O3409P1633n1218p3878J3705K2425L7555L1923
$$ -38487 -35679 -68862 -117506 -153066 -89657 -18024 -69242 -143120 -129415 -106990 -69435 -37512
13513c7512o4020O722j1344j1574k6898M6724n31M8404N0231L9310O63j3280J5410
$$ -37512 -101532 -94810 -106154 -117728 -144626 -97902 -98433 -50029 202 39512 40175 26895 42305
13500D2305j6692k5829m2110K2739r28M2183L9404k6509J2837K6110P5n0486K5310
$$ 42305 25613 -216 -42326 -19587 -20515 21668 61072 34563 47400 73510 73585 23099 48409
13487D8409N4935j0372n986K4214L4501l4746l6109r882p723n935Q482n9512j511
$$ 48409 103344 92972 86986 111200 145701 110955 74846 64964 57241 51306 59788 276 -1235
13474a235m5830K8622P079M179k0631j3336n8952M1428L6905r972L7234N8799
$$ -1235 -47065 -18443 -11364 -7185 -27816 -41152 -100104 -58676 -21771 -31743 5491 64290
13462F4290j9149L5645p490J5744K575m6480m3817l8003r0865K5558m5792n654
$$ 64290 45141 80786 73296 89040 91615 45135 1318 -36685 -127550 -101992 -147784 -153438
13450a53438K5708J8067L2597M0621L5969l8608m938n4485L8903M9815k6559l1097
$$ -153438 -127730 -109663 -77066 -36445 -476 -39084 -44022 -98507 -59604 -9789 -36348 -67445
13438f7445O973L7798K513m6710P298J2455L5828L1104K5814j7894K4126j9297
$$ -67445 -60472 -22674 -20161 -66871 -59573 -47118 -11290 19814 45628 27734 51860 32563
13426C2563j8138j4980j5335L7387K7098J596k9240p465N6791N611k6837p9156
$$ 32563 14425 -555 -15890 21497 48595 50191 20951 13486 70277 75888 49051 -30105
13414c0105q2003L9087J8016n0721n6569j6961J35323K9218M53p317l5346K2689
$$ -30105 -112108 -73021 -55005 -105726 -162295 -179256 -43933 -14715 -14262 -21579 -56925 -34236
13402c4236J4689J0298J4842j5627q6807N7532Q0886m9387n7025N849J9267m5791
$$ -34236 -19547 -9249 5593 -10034 -96841 -39309 41577 -7810 -64835 -58986 -39719 -85510
13390h5510o3722j4537L7384N7806L5532L097M2923M506K9197O8101N2822M750
$$ -85510 -149232 -163769 -126385 -68579 -33047 -29950 12973 17479 46676 114777 167599 172349
13378A72349j240l8139l6590j9848j8564r2676K3149J08114O9537O1668l1083
$$ 172349 171109 132970 96380 76532 57968 -34708 -11559 96555 166092 227760 196677
13367A96677k1100q4646l4577m468j3845n0795m0920m2876M9504O6555K4391J116
$$ 196677 175577 90931 56354 51886 38041 -12754 -53674 -96550 -47046 19509 43900 45016
13355D5016q6237m00M0428p3429j0669O9129L5193R923M3687k0566j4642J4876
$$ 45016 -41221 -41621 -1193 -74622 -85291 -16162 19031 28954 72641 52075 37433 52309
13343E2309K4427L3070L9939l5790o6593n1192K772K8122l6665m0935k9101j6106
$$ 52309 76736 109806 149745 113955 47362 -3830 -1058 27064 -9601 -50536 -79637 -95743
13331i5743j4323P0248J1563j5433l529J9712k5596M0065P3011K9866r420M973
$$ -95743 -110066 -39818 -28255 -43688 -47217 -27505 -53101 -13036 59975 89841 80421 85394
13319H5394J3817n5160q1474R1320Q325l6716j6215J4969N7501p4232o7764Q300
$$ 85394 99211 44051 -37423 53897 62222 25506 9291 24260 81761 7529 -60235 -51935
13307e1935L6296Q2550m7343o042q97o0727L11n3626N6567Q9165J4164J674J7656
$$ -51935 -15639 66911 19568 13526 12629 -48098 -47787 -101413 -44846 44319 58483 60157 77813
13294G7813r308n2831q2591K4124M2400m6289m4811K3488J2083j7873M9932Q4612
$$ 77813 68505 15674 -66917 -42793 -393 -46682 -91493 -68005 -55922 -73795 -23863 60749
13282F0749K0179m9926l8039j5823L1575k2621k52l0663k8191L381L5533P435
$$ 60749 80928 31002 -7037 -22860 8715 -13906 -14158 -44821 -73012 -69631 -34098 -26663
13270b6663N721J3740n5441r967P5041j3624k3997O7218P952J2277j087L882M7989
$$ -26663 -20942 -7202 -62643 -72610 2431 -11193 -35190 32028 39980 52257 51170 55052 103041
13257A03041k4435m6045M1315L3082j25710J4883K0931l5946n1112k6823Q7812
$$ 103041 78606 32561 73876 106958 -18752 -3869 17062 -18884 -69996 -96819 -9007
13246i007L8802n4350K9705O7988P8032M5742o2981j25608L0224n5060k3197M3388
$$ -9007 29795 -24555 5150 73138 151170 196912 133931 8323 38547 -16513 -39710 3678
13234C678O6680K5449j8707r1763l2056M1082L1781Q3969j3978m2383j7573k266
$$ 3678 70358 95807 77100 -14663 -46719 -5637 26144 110113 96135 53752 36179 33913
13222C3913q8024J0729J9631P1319J5353j5115l7352L7567R468l633k8672m9295
$$ 33913 -54111 -43382 -23751 47568 62921 47806 10454 48021 57489 53856 25184 -24111
13210b4111K2501L7401M4962K9168k8037o0194k3213K5419N5522J9207k2852j2543
$$ -24111 -1610 35791 80753 109921 81884 21690 -1523 23896 79418 98625 75773 63230
13198F3230n5191p558P242k4704k1182P1655J14494P447n5949r8492k9769L9096
$$ 63230 8039 481 7723 -16981 -38163 33492 147986 155433 99484 992 -28777 10319
13186A0319M6965J7987M160j19990l3911o233M9460O6846M0743l2343q9692o7048
$$ 10319 57284 75271 79431 -40559 -74470 -80703 -31243 35603 76346 44003 -45689 -112737
13174a12737J2827L4069P2575K1414j1112o70L5052l5046j9469J809J3509o2564
$$ -112737 -99910 -65841 6734 28148 17036 16366 51418 16372 -3097 -1288 12221 -50343
13162e0343l6292M488R433N1805L9925J7487Q531K4223l3762K3678J9224L0711
$$ -50343 -86635 -82147 -72714 -20909 19016 36503 45034 69257 35495 59173 78397 109108
13150A09108l475n0160j6211N869m9769l6483j2348k8101K064j6566L0418K787
$$ 109108 105633 55473 39262 45131 -4638 -41121 -53469 -81570 -79506 -96072 -65654 -62867
13138f2867N4065K6987Q7450N5616q071p4757o9635o9472j6686P1344M3488o0051
$$ -62867 -8802 18185 105635 161251 153180 78423 8788 -60684 -77370 -6026 37462 -22589
13126b2589k1638N2278L4229m8501J2166J04533m5612n6749o0227O236K1147r924
$$ -22589 -44227 8051 42280 -6221 5945 110478 64866 8117 -52110 -45874 -24727 -34651
13114c4651K6520N1342L9186l0611l0728N7946k4670p5673J2202M5530L2360k1300
$$ -34651 -8131 43211 82397 51786 21058 79004 54334 -21339 -9137 36393 68753 47453
13102D7453L0678l2997l6585k7864o147L0143P4168K5315p5977l491M7020O0837
$$ 47453 78131 45134 8549 -19315 -25462 4681 78849 104164 28187 24696 71716 132553
13090A32553n1201l3301m9284K5958k7484q3125N1120K4447K3165n859K5920k0508
$$ 132553 81352 48051 -1233 24725 -2759 -85884 -34764 -10317 12848 6989 32909 12401
13078A2401l3817j5263L8666N0500j2901q3881j2722j4752j1430k6538M212J2736
$$ 12401 -21416 -36679 1987 52487 39586 -44295 -57017 -71769 -83199 -109737 -105525 -92789
13066i2789O2170L5254L9631N392l4602j2408N6915J3923j2561l7310p0131m1311
$$ -92789 -30619 4635 44266 49658 15056 2648 59563 73486 60925 23615 -46516 -87827
13054h7827j5635N7017j280j1030O2045l2529K6624K5842m6981J0792P8261M5263
$$ -87827 -103462 -46445 -47725 -58755 3290 -29239 -2615 23227 -23754 -12962 65299 110562
13042A10562j9899o4146l9046L7172P2193l3445j36444n112N8068J0591n8832
$$ 110562 90663 26517 -12529 24643 96836 63391 -73053 -78165 -20097 -9506 -68338
13031f8338J2130O1533K6675P681J7975l4454J1249K1024n0738L5833M2862o4856
$$ -68338 -56208 5325 32000 39681 57656 23202 34451 55475 4737 40570 83432 18576
13019A8576m66k1123o2954K1737N9268J266k8661R370K8447N2742L2239M4077
$$ 18576 18110 -3013 -65967 -44230 15038 16304 -12357 -2987 25460 78202 110441 154518
13007A54518M9308q968q6811L620K8746m7256k7199L605k9789K8227q111K1058
$$ 154518 203826 194858 108047 111667 140413 93157 65958 69563 39774 68001 59890 80948
12995H0948J1273o025o1036m1589k2268L1694K3464m9385l1717O9310N7686J6251
$$ 80948 92221 86196 25160 -16429 -38697 -7003 16461 -32924 -64641 4669 62355 78606
12983G8606n745r719o0416K111m659j1582R1669k3995j2486n3358O052J5146L6131
$$ 78606 72861 63142 2726 4837 178 -11404 80265 56270 43784 -9574 -3522 11624 47755
12970D7755J7272m7852R306j1079n7857j336P7619O560J0394N8218N5914R8100
$$ 47755 65027 17175 26481 15402 -42455 -43791 33828 40388 50782 109000 164914 263014
12958B63014j08509j02911n3816Q39r006J0684N1375m018p0587o7987P6364K410
$$ 263014 154505 51594 -2222 -1383 -10389 295 51670 47652 -22935 -90922 -14558 -12148
12946a2148n4509n5809r2219Q3174J15652O5739r702o4420J9215J167l846j208
$$ -12148 -66657 -122466 -214685 -131511 -15859 49880 40178 -24242 -5027 -3860 -7706 -8914
12934h914P5617M3777k6231p9093k1397o166n4109N1763N0160r5526n4227Q3939
$$ -8914 66703 110480 84249 5156 -16241 -22407 -76516 -24753 25407 -70119 -124346 -40407
12922d0407Q2450J8242k0783j2832n1330q977n7438L8497N2880J8247k875r778
$$ -40407 42043 60285 39502 26670 -24660 -33637 -91075 -52578 302 18549 15674 5896
12910E896j289K6018K4990l0731L0125P661o3008j5609J2365K0360L462K8893
$$ 5896 4607 30625 55615 24884 55009 62670 -338 -15947 -3582 16778 20240 49133
12898D9133J05519q947j02481k5782m440j3952m3939M7615J7375j0666O8230L458
$$ 49133 154652 145705 43224 17442 13002 -950 -44889 2726 20101 9435 77665 81123
12886H1123l4467k3916M994K1196l3417R715J3859p0738M7805N0173J5483J7766
$$ 81123 46656 22740 27734 48930 15513 25228 39087 -31651 16154 66327 81810 99576
12874I9576o6004K2379J1258j8168M7589K8832m0104k3760K0060j8673k6473o602
$$ 99576 33572 55951 67209 49041 96630 125462 85358 61598 81658 62985 36512 29910
12862B9910M732L3327p8764j7903R3179J7327o8060m2147K701K6527j9902k9376
$$ 29910 34642 67969 -10795 -28698 64481 81808 13748 -28399 -25698 829 -19073 -48449
12850d8449J7283N1886J8589O5787l8357j16371l4136M3776M2079M2083l3004
$$ -48449 -31166 20720 39309 105096 66739 -49632 -83768 -39992 2087 44170 11166
12839A1166o1126L3656N7131O3813k3592j5423M9358K2020p3006J4185n405J8242
$$ 11166 -49960 -16304 40827 104640 81048 65625 114983 137003 63997 78182 72777 91019
12827I1019L0818J3633j8391P071M7560J6059k9394j0897n2184L9808J4714m8965
$$ 91019 121837 135470 117079 124150 171710 187769 158375 147478 95294 135102 149816 100851
12815A00851n9140N9303k822n1262k4391K0716j5879p2426M4337M0146L2684j7576
$$ 100851 41711 101014 98192 46930 22539 43255 27376 -45050 -713 39433 72117 54541
12803E4541p987M5062j5717l3682k4495l904j6328L6559J7917l8516p557K5688
$$ 54541 46554 91616 75899 42217 17722 13818 -2510 34049 51966 13450 5893 31581
12791C1581j8650l8645N8672R2871j8809o7397P866m4m39N2664M834q3248J6071
$$ 31581 12931 -25714 32958 125829 107020 39623 47489 47445 47006 99670 104504 21256 37327
12778C7327J22532l2226l1297l4427k4698r9813o3837O91P7742Q2253O5587j1160
$$ 37327 159859 127633 96336 61909 37211 -62602 -126439 -125748 -48006 34247 99834 88674
12766H8674P434q898k6809j0213k7257N5938Q8567k0899j33507l7582J7470Q9813
$$ 88674 96108 87210 60401 50188 22931 78869 167436 146537 13030 -24552 -7082 82731
12754H2731O9031k5370O0982m7121n8474K218j647n9944l4185N8321M2849j7506
$$ 82731 151762 126392 187374 140253 81779 83997 82350 22406 -11779 46542 89391 71885
12742G1885k3642l1791J07768N1963j2586j6086p9573K261j6061o4075L1868J4977
$$ 71885 48243 16452 124220 176183 163597 147511 67938 70199 54138 -9937 21931 36908
12730C6908k9308m2672q756L9811K8514J8652l9528m5882M1849N9501L2369L4882
$$ 36908 7600 -35072 -43828 -4017 24497 43149 3621 -42261 -412 59089 91458 126340
12718A26340j7749m0942L7692J7772o5628j6762K8055L5302M9162J4447m0239
$$ 126340 108591 67649 105341 123113 57485 40723 68778 104080 153242 167689 127450
12707A27450j2488l582n7440l3519L2213m5584m5685O267M5040O1588M9426l5403
$$ 127450 114962 111380 53940 20421 52634 7050 -38635 -32368 12672 74260 123686 88283
12695H8283k0669k6325p9904k5478M5973Q8171O239J2681p9983J333o2647r121
$$ 88283 67614 41289 -38615 -64093 -18120 70051 76290 88971 8988 10321 -52326 -61447
12683f1447K9785N2375N0724k0474p4957M7215L0205m4096K1084n035q181K234
$$ -61447 -31662 20713 71437 50963 -23994 23221 53426 9330 30414 25379 17198 19432
12671A9432j0631Q2483P286j9476k391R566k5358K4008Q659o2773l0880O987n5825
$$ 19432 8801 91284 98570 79094 76703 86269 60911 84919 93578 30805 -75 6912 -48913
12658d8913p9538M9932P0861O4158M3184m8568m1713O551J1876J8710j374K798
$$ -48913 -128451 -78519 -7658 56500 99684 51116 9403 15954 27830 46540 45166 47964
12646D7964j5337J3413o677N2278K5323k7126J145O7155J1815n6612m1929l1920
$$ 47964 32627 46040 39363 91641 116964 89838 90983 158138 169953 113341 71412 39492
12634C9492p3055J1814k2947J4387k0212L7347J01943J8129l3343k980N2407K8526
$$ 39492 -33563 -21749 -44696 -30309 -50521 -13174 88769 106898 73555 70575 122982 151508
12622A51508n6491o9590m0061o7210N5837R2850Q808l1783L9202L1883M0133k2532
$$ 151508 95017 25427 -14634 -81844 -26007 66843 75651 43868 83070 114953 155086 132554
12610A32554J0009O465l2604n5958m7950K7155k7247p4864l0794j7300P4191L7596
$$ 132554 142563 149028 116424 60466 12516 39671 12424 -62440 -93234 -110534 -36343 1253
12598A253K0704O9484J281M901J6104L9325k1441j8140j6211r1789n617N4414
$$ 1253 21957 91441 92722 97623 113727 153052 131611 113471 97260 5471 -146 54268
12586E4268j0699K5603O701n0306k4526N6121M9248j4333O5440l5522k005M9990
$$ 54268 43569 69172 75873 25567 1041 57162 106410 92077 157517 121995 119990 169980
12574A69980K6963l3137n0069j4561o1921L5275R4932K4245m0312p4929k1487
$$ 169980 196943 163806 113737 99176 37255 72530 167462 191707 151395 76466 54979
12563E4979N017k1528m5389j0549N9113N0843K1019j1780M8710l4989n8203O78
$$ 54979 59996 38468 -6921 -17470 41643 92486 113505 101725 150435 115446 57243 57921
12551E7921K4414j8738l529j377j4772l6610O420k738j7346J8160R6376R3343
$$ 57921 82335 63597 60068 58691 43919 7309 13729 10991 -6355 11805 108181 201524
12539B01524K959m7571m54J3624J0063k0992q595J9641j6963J9297K6472o8527
$$ 201524 204483 156912 156458 170082 180145 159153 150558 170199 153236 172533 199005 130478
12527A30478m5543K8582N0595m6348m5497m3448j618Q3184l620o3835k7608J3928
$$ 130478 84935 113517 164112 117764 72267 28819 27201 110385 106765 42930 15322 29250
12515B9250K5192K7471R836N6772K7303n345K2801l3913j2332o8896J4871o874
$$ 29250 54442 81913 91749 148521 175824 170479 193280 159367 147035 78139 93010 86136
12503H6136P7627K2985o3949m1769l3293M97k3684O5800K4026K1648m2171K418
$$ 86136 163763 186748 122799 81030 47737 48234 24550 90350 114376 136024 93853 96271
12491I6271R0129O4679p9380m4268j6390l2007l5624K375K297m6901L6599O8602
$$ 96271 186400 251079 171699 127431 111041 79034 43410 45785 48082 1181 37780 106382
12479A06382R253k3303J2399j1330m607o4235J3979K9628L1815K7865m8035M0813
$$ 106382 115635 92332 104731 93401 88794 24559 38538 68166 99981 127846 79811 120624
12467A20624n2350l6356N4623J01113j2555j1680q1091n7209J7029j0820J2092
$$ 120624 68274 31918 86541 187654 175099 163419 82328 25119 42148 31328 43420
12456D3420M2197K4266L9777K3951Q623j3482R334l0044o534P6550k0854o069
$$ 43420 85617 109883 149660 173611 182234 168752 178086 148042 141508 218058 197204 191135
12444A91135k2789n7547j7058m499k1815n703N4151P6995M4008q9840l3930L9575
$$ 191135 168346 110799 93741 89242 67427 61724 115875 192870 236878 147038 113108 152683
12432A52683N3514l1905J8545L7236M077M318n6404p780k4788l5021N7268r5o7280
$$ 152683 206197 174292 192837 230073 234150 238468 182064 174284 149496 114475 171743 171648 104368
12419A04368j22546j454j7465M0205L9532O3642k774k9982K3158m6959Q795O714
$$ 104368 -18178 -19632 -37097 3108 42640 106282 103508 73526 96684 49725 58520 65234
12407F5234J2780K6381k2510l6677J2609K7152o5779j8864J0112O1655K8420k4332
$$ 65234 78014 104395 81885 45208 57817 84969 19190 326 10438 72093 100513 76181
12395G6181J972R9910L0555j2156o1832J3167r945k6823n2116q343J5739k980
$$ 76181 78153 178063 208618 196462 134630 147797 137852 111029 58913 50570 66309 63329
12383F3329j1002J5461K6184M4340N870p7648M7250j9288p555N879k4729O6321
$$ 63329 52327 67788 93972 138312 144182 66534 113784 94496 86941 92820 68091 134412
12371A34412k6776L5546n6000k8738K3988L4942j4955K3189J433K091n1487l4668
$$ 134412 107636 143182 87182 58444 82432 117374 102419 125608 127041 129132 77645 42977
12359D2977N757K2837k6286o294N652M5021P9638J5657M655j9694k1947o904N3433
$$ 42977 48734 71571 45285 38991 44643 89664 169302 184959 189614 169920 147973 141069 194502
12346A94502n313M8334N318n1122k7356l7909j1146l4287l4923N8147M4794L2541
$$ 194502 189189 237523 242841 191719 164363 126454 115308 81021 46098 104245 149039 181580
12334A81580N8773N0790j6901l1427l5354k0783k9063k9956q785j9428P9362J8380
$$ 181580 240353 291143 274242 242815 207461 186678 157615 127659 118874 99446 178808 197188
12322A97188L2396K7759M5203l4271J822n2589l1692l7186J1241k6874N3252O5193
$$ 197188 229584 257343 302546 268275 270097 217508 185816 148630 159871 132997 186249 251442
12310B51442k4979o8658J6369K2272N9916M510J0124o789k1523K54m8061O210
$$ 251442 226463 157805 174174 196446 256362 260872 270996 264207 242684 242938 194877 201087
12298B01087L1596L5330K247l0353M4262m174J1668k6355l0741j1981J0190N0055
$$ 201087 232683 268013 270260 239907 284169 279995 291663 265308 234567 222586 232776 282831
12286B82831m854k5582R931N7873K5380K8195j8006k7963q2913J4460M2144P142
$$ 282831 277977 252395 262326 320199 345579 373774 355768 327805 244892 259352 301496 308638
12274C08638J4595n8401l8705L6463K5925K1948N1236j4298n6416m1452L454J7156
$$ 308638 323233 264832 226127 262590 288515 310463 361699 347401 290985 249533 252987 270143
12262B70143K0144N8716O4144M8699l2612N4334R716j0134q926M8164L2660j0237
$$ 270143 290287 349003 413147 461846 429234 483568 493284 483150 474224 522388 555048 544811
12250E44811m2209n0730l0162L1620M7914p3968p3775m8040J3920M4048K3548
$$ 544811 502602 451872 421710 453330 501244 427276 353501 305461 319381 363429 386977
12239C86977j3323L2049L4546l3802o7458M1927j2326j536L1969N2279M4996k6779
$$ 386977 373654 405703 440249 406447 338989 380916 368590 367054 399023 451302 496298 469519
12227D69519m6626n2018k6751N3756K9951J0707j4536R1400M4108K0932M2094
$$ 469519 422893 370875 344124 397880 427831 438538 424002 515402 559510 580442 622536
12216F22536J2304k1327m7857j1823o4659l4900m8161M2526L9030q966j8475J273
$$ 622536 634840 613513 565656 553833 489174 454274 406113 448639 487669 478703 460228 461501
12204D61501M7595o3533p1619J8077J5001l137M0163q074q767o773r842m7172
$$ 461501 509096 445563 373944 392021 407022 403885 444048 435974 427207 420434 410592 363420
12192C63420M5486N0833J6572N1956q485K3202J96J3025K6110n3029J8722M6338
$$ 363420 408906 459739 476311 528267 519782 542984 543180 556205 582315 529286 548008 594346
12180E94346p947j2584j7496J9882N7220Q450p5440k7084K2370M0804k6057n1655
$$ 594346 586399 573815 556319 576201 633421 641871 566431 539347 561717 602521 576464 524809
12168E24809L3221M0815l4554m6644j6422m2615J8150R9885Q596p4666j8554N1459
$$ 524809 558030 598845 564291 517647 501225 458610 476760 576645 585241 510575 492021 543480
12156E43480K7831K6353K6629K5851j1915M7960J2484m8528K9284M4176j5544
$$ 543480 571311 597664 624293 650144 638229 686189 698673 650145 679429 723605 708061
12145G08061o4590k1588K2786M1600o320O970m0545l218M362P5239M5091o991
$$ 708061 643471 621883 644669 686269 679949 686919 646374 643156 647518 722757 767848 760857
12133G60857N9203K6077l1336L7984K4109Q5512L9509K6438P7575M5477J18224
$$ 760857 820060 846137 814801 852785 876894 962406 1001915 1028353 1105928 1151405 1269629
12122A269629J38890M4905j6916o723k499q533j5404k3611j215p0994o0587m6972
$$ 1269629 1408519 1453424 1436508 1429785 1427286 1418753 1403349 1379738 1378523 1307529 1246942 1199970
12110A199970j3202k2332l1013j35628m3345j364Q8129m6127n0990M9003n601
$$ 1199970 1186768 1164436 1133423 997795 954450 953086 1041215 995088 944098 993101 987500
12099I87500o6848q429N6717M4600k3511m0810O4982R0726m3208K7466K0297q375
$$ 987500 920652 912223 968940 1013540 990029 949219 1014201 1104927 1061719 1089185 1109482 1101107
12087A101107K2154l552R214K5276N2792J2883m8713q647P6952k6968k8305L0334
$$ 1101107 1123261 1119709 1128923 1154199 1206991 1219874 1171161 1162514 1239466 1212498 1184193 1214527
12075A214527J581L6731k6544k029j204O8988P6985L9930m7344j0184K7153j2123
$$ 1214527 1216108 1252839 1226295 1224266 1223062 1292050 1369035 1408965 1361621 1351437 1378590 1366467
12063A366467K7256M0192k3143N4455O288K1916N1918M5386j4262L1170P6365
$$ 1366467 1393723 1433915 1410772 1465227 1471515 1493431 1545349 1590735 1576473 1607643 1684008
12052A684008j4630k4207O4838P2252Q093m6238M9569J04397j3512J27L3100l7136
$$ 1684008 1669378 1645171 1710009 1782261 1790354 1744116 1793685 1898082 1884570 1884697 1917797 1880661
12040A880661o534Q4933J23542J5899K1700Q4615O0246L310p3959N7675K6934
$$ 1880661 1874127 1959060 2082602 2098501 2120201 2204816 2265062 2268372 2194413 2252088 2279022
12029B279022Q8955K7123K1335M1113Q007R0421O3258J6732M3576K6278J03035
$$ 2279022 2367977 2395100 2416435 2457548 2465555 2555976 2619234 2635966 2679542 2705820 2808855
12018B808855K8458N3380N1168P1086J16878J25675J32256O1012L7991Q3807R5095
$$ 2808855 2837313 2890693 2941861 3012947 3129825 3255500 3387756 3448768 3486759 3570566 3665661
12007C665661j0579K8099Q4425J24526P4897J68859J58066M3915J5935J10203
$$ 3665661 3655082 3683181 3767606 3892132 3967029 4135888 4293954 4337869 4353804 4464007
11997D464007J26969Q0018J09851M4654J23641J74593J81931J69638K84078J89804
$$ 4464007 4590976 4670994 4780845 4825499 4949140 5123733 5305664 5475302 5759380 5949184
11987E949184J13823J29500K04949K77561K54714J65519J97115J47125K42813
$$ 5949184 6063007 6192507 6397456 6675017 6929731 7095250 7292365 7439490 7682303
11978G682303L36144K88913K96725L60461M11016L48402L16998L72659L97559
$$ 7682303 8018447 8307360 8604085 8964546 9375562 9723964 10040962 10413621 10811180
11969A0811180M53908M13182M44854M63364N28621O21480O41809O50214O93737
$$ 10811180 11265088 11678270 12123124 12586488 13115109 13736589 14378398 15028612 15722349
11960A5722349P74293P94280Q26637Q67208R29906R27186R58219J019771J091331
$$ 15722349 16496642 17290922 18117559 18984767 19914673 20841859 21800078 22819849 23911180
11951B3911180J219485J368291J447844J492661J540128J635043J691593J829322
$$ 23911180 25130665 26498956 27946800 29439461 30979589 32614632 34306225 36135547
11943C6135547J883195J919730J991934K066326K014603K078197K089040J971420
$$ 36135547 38018742 39938472 41930406 43996732 46011335 48089532 50178572 52149992
11935E2149992J890030J834544J658308J420098J222618R76689O87567L49394
$$ 52149992 54040022 55874566 57532874 58952972 60175590 61152279 61839846 62189240
11927F2189240m3102l54252p14057r17507j165813j389690j598932j740216j952506
$$ 62189240 62146138 61791886 61077829 60160322 58994509 57604819 56005887 54265671 52313165
11918E2313165k027747j966245k050307k044996k004076j958134j861382j928728
$$ 52313165 50285418 48319173 46268866 44223870 42219794 40261660 38400278 36471550
11910C6471550j819024j688987j625661j568250j511188j428095j324734j202679
$$ 36471550 34652526 32963539 31337878 29769628 28258440 26830345 25505611 24302932
11902B4302932j129249j047570j033934j022269r17871q34403q85599p35397o95186
$$ 24302932 23173683 22126113 21092179 20069910 19152039 18317636 17432037 16696640 16001454
11893A6001454p23676o70422o06563n52034m98864n20066n55088n48892n18935
$$ 16001454 15277778 14607356 14000793 13448759 12949895 12429829 11874741 11325849 10806914
11884A0806914l90207l50833l40049l41977l09596l24487k75747k68967k46764
$$ 10806914 10416707 10065874 9725825 9383848 9074252 8749765 8474018 8205051 7958287
11875G958287k80893k24213j88732k41742k51073j69324k07047k12547j64384
$$ 7958287 7677394 7453181 7264449 7022707 6771634 6602310 6395263 6182716 6018332
11866F018332j52394j18386j16007j26723j23316j57276q7269j38474j89289j78056
$$ 6018332 5865938 5747552 5631545 5504822 5381506 5224230 5136961 4998487 4809198 4631142
11856D631142j17118m6018r3861r5254r7034p2623q7914j27298r4731r1439n9093
$$ 4631142 4514024 4468006 4374145 4278891 4181857 4109234 4021320 3894022 3799291 3707852 3648759
11845C648759k1397j35734q0233k7882j05955p7804q8128j5277R0565m4022j14921
$$ 3648759 3627362 3491628 3411395 3383513 3277558 3199754 3111626 3096349 3186914 3142892 3027971
11834C027971k6722r1613l7573K0663o0768j20791p2836r4278q1220m8305q1123
$$ 3027971 3001249 2909636 2872063 2892726 2831958 2711167 2638331 2544053 2462833 2414528 2333405
11823B333405n9299n1527j9129P353q9573o6657m0348o7806m0389l5523o9635
$$ 2333405 2274106 2222579 2203450 2210803 2121230 2054573 2014225 1946419 1906030 1870507 1800872
11812A800872m2930m7494R87P5881l3438r7657k6798m6664J641r5907l4041n3654
$$ 1800872 1757942 1710448 1711435 1787316 1753878 1656221 1629423 1582759 1584400 1488493 1454452 1400798
11800A400798l9890K6874k7958J0881J1904K9745M6577j1249n0880j00640j4132
$$ 1400798 1360908 1387782 1359824 1370705 1382609 1412354 1458931 1447682 1396802 1296162 1282030
11789A282030P749m8587L884j1576K9800Q463p9666n1577k0561O6403Q515n4476
$$ 1282030 1289779 1241192 1245076 1233500 1263300 1271763 1192097 1140520 1119959 1186362 1194877 1140401
11777A140401J057M562r2778j4616L3138P059L8988Q578n9945p1492k2072J3175
$$ 1140401 1141458 1146020 1053242 1038626 1071764 1078823 1117811 1126389 1066444 994952 972880 986055
11765I86055l3681p001O6363R47m687m130L8881K1744N824L108k6019K6079J2678
$$ 986055 952374 945373 1011736 1012683 1007996 1003866 1042747 1064491 1070315 1073423 1047404 1073483 1086161
11752A086161j28020m145k5497k2656m9386j882K4196K6997K4938k3777N2538
$$ 1086161 958141 953996 928499 905843 856457 854575 878771 905768 930706 906929 959467
11741I59467j7736m5136r2236l2728K7330k7639m0003K4856o157k2738P973k7834
$$ 959467 941731 896595 804359 771631 798961 771322 731319 756175 750018 727280 735253 707419
11729G07419m4936K4044J9849k3815m8484j1702k4501o201P5042J680m7453j0893
$$ 707419 662483 686527 706376 682561 634077 622375 597874 591673 666715 668395 620942 610049
11717F10049o4922j070M0905M2772L4122J5865j41830p1503o032m3761l2997m866
$$ 610049 545127 544057 584962 627734 661856 677721 535891 464388 458356 414595 381598 376732
11705C76732M7042M4013N7920n1051J7930O9110j4584R538n596J1036K4019j0990
$$ 376732 423774 467787 525707 474656 492586 561696 547112 556650 551054 562090 586109 575119
11693E75119n4538l7339m9982K5115P7967J4361o9024m3443J0060M0446m6345
$$ 575119 520581 483242 433260 458375 536342 550703 481679 438236 448296 488742 442397
11682D42397o877M0326k6913j7557J4831j2871l1930k0581J3024R8949l6665l1166
$$ 442397 435520 475846 448933 431376 446207 433336 401406 380825 393849 492798 456133 424967
11670D24967K5712M1461k5975n4042m1942L6107k7191p024K6896O1391j1091p01
$$ 424967 450679 492140 466165 412123 370181 406288 379097 372073 398969 460360 449269 448568
11658D48568k0368j4933K9747l1485K3323j40175o5651P1694L7743K2939n580
$$ 448568 428200 413267 443014 411529 434852 294677 229026 300720 338463 361402 355822
11647C55822m1409p040Q59k8945L4294J2052k0983J4911L2247k607L5333K2060
$$ 355822 314413 307373 308232 279287 313581 325633 304650 319561 351808 349201 384534 406594
11635D06594n86j8335k6437J777q1984k7323n5758l5311L6308J23371O0192r7711
$$ 406594 406008 387673 361236 363013 281029 253706 197948 162637 198945 322316 382508 284797
11623B84797m9219N3567K0782j04927k607O5958L7664O5576r279m8315o3190p5573
$$ 284797 235578 289145 309927 205000 202393 268351 306015 371591 362312 313997 250807 175234
11611A75234m253o684k8706M2630O1796J9182j2682K1168q341n3864l1463j7870
$$ 175234 170981 164297 135591 178221 240017 259199 246517 267685 259344 205480 174017 156147
11599A56147L0802K3821j875k1445j9354p5970N4287K1312l0185J449J8582l8885
$$ 156147 186949 210770 208895 187450 168096 92126 146413 167725 137540 138989 157571 118686
11587A18686J2475J8660k8099J8633M8017K6612l0910L3352k0576j7813O6242
$$ 118686 131161 149821 121722 140355 188372 214984 184074 217426 196850 179037 245279
11576B45279L1846n9609n1011K6684K497o9335j4604Q9030k669j4698P557j178
$$ 245279 277125 217516 166505 193189 195686 126351 111747 200777 198108 183410 190967 189789
11564A89789j5134K0912J5127l046O3241J7705p15l2856o5140l8382N5910k4263
$$ 189789 174655 195567 210694 207648 270889 288594 287879 255023 189883 151501 207411 183148
11552A83148m288N6459l927J6585O8634k859p2569K7023j0979J7214J2617l5280
$$ 183148 178860 235319 231392 247977 316611 313752 241183 268206 257227 274441 287058 251778
11540B51778m6493o3187K2842L029M0035N7212Q6469o4010j15463m3739K2386
$$ 251778 205285 142098 164940 167969 208004 265216 351685 287675 172212 128473 150859
11529A50859L7245m1271K8481k967Q497l2966l0198J4190M1910J09084l019q7780
$$ 150859 188104 146833 175314 172347 180844 147878 117680 131870 173780 282864 279845 192065
11517A92065J6154j0164n7450m5475K8905P1321k1675P5119j5910p0602J0229
$$ 192065 208219 198055 140605 95130 124035 195356 173681 248800 232890 162288 172517
11506A72517j6795M4362j3321p1160k4486N6352M9439J9574l364L5921M1962k2453
$$ 172517 155722 200084 186763 115603 91117 147469 196908 216482 213118 249039 291001 268548
11494B68548R903k1530j8063m046K5054q229j32009K6796R4790O6928P800k6064
$$ 268548 278451 256921 238858 234812 259866 251637 119628 146424 241214 308142 315942 289878
11482B89878o1934q7524P698M8205L6948l5334k9015L3606N763O2223j2315j04451
$$ 289878 227944 140420 148118 196323 233271 197937 168922 202528 208291 270514 258199 153748
11470A53748j7293O9186L2441k6455n3574o4073l1252N1701M2132j4469n6110
$$ 153748 136455 205641 238082 211627 158053 93980 62728 114429 156561 142092 85982
11459H5982R906J995m9665N1330N144o7995m1518J2274m6913N8636L3478M1872
$$ 85982 95888 97883 48218 99548 104692 36697 -4821 7453 -39460 19176 52654 94526
11447I4526Q1555j306j6001l2865n5950K3103L6195M5578M923j4750N414L8011
$$ 94526 176081 174775 158774 125909 69959 93062 129257 174835 179758 165008 170422 208433
11435B08433q884n8375j7970K2894n3850p3855L5812O1963k0526j5069m5263l0950
$$ 208433 199549 141174 123204 146098 92248 18393 54205 116168 95642 80573 35310 4360
11423D360o28P6264P1603K0976K7078j0573k707n4728n9609Q3018K1246k2935
$$ 4360 3732 79996 151599 172575 199653 189080 186373 131645 72036 155054 176300 153365
11411A53365j4803j5164j3422p9j0835k6590r050L420O9874M9675q8902l9429
$$ 153365 138562 123398 109976 109897 99062 72472 63422 66842 136716 186391 97489 58060
11399E8060m6471Q494K894m920J0216J15687j9331M465r2072k0032M0867M6711
$$ 58060 11589 20083 22977 18057 28273 143960 124629 129094 37022 16990 57857 104568
11387A04568j1800k6594l938N6391J7192P3706k9151o1386m9667r093Q673L067
$$ 104568 92768 66174 62236 118627 135819 209525 180374 118988 69321 60228 68901 71968
11375G1968n9709k4419J4471j4172K8053M7899K3962M2788L5379L9531k3265m3295
$$ 71968 12259 -12160 2311 -11861 16192 64091 88053 130841 166220 205751 182486 139191
11363A39191L6113L0922M6098M093j6461m2399r1032Q689k8674l9239o167J520
$$ 139191 175304 206226 252324 256417 239956 197557 106525 115214 86540 47301 41134 42654
11351D2654R007l7542k56O7209M4550o1954Q145J0779M5787n1472m1465l5875
$$ 42654 51661 14119 13863 81072 125622 63668 71813 82592 128379 76907 35442 -433
11339d33k447M451Q3787R7904K6749l4438K0323L988k6391k5629n0438k9813P585
$$ -433 -2880 1571 85358 183262 210011 175573 195896 199884 173493 147864 97426 67613 75198
11326G5198K5431K1081k5148n3347O5282K7093l2287l323j2222m4121O871P4502
$$ 75198 100629 121710 96562 43215 108497 135590 103303 99980 87758 43637 50508 125010
11314A25010l1934J5317n0779J6140Q7168M6831p9884n9039l6691J2782l2547
$$ 125010 93076 108393 57614 73754 160922 207753 127869 68830 32139 44921 12374
11303A2374J0430K0232k0123K1908P7090M2767j04318l4760P2171J2669m7086
$$ 12374 22804 43036 22913 44821 121911 164678 60360 25600 97771 110440 63354
11292F3354R744Q921K3145L8305p869J985q2549l6601J4534K3536j5095K8759
$$ 63354 73098 82019 105164 143469 135600 137585 55036 18435 32969 56505 41410 70169
11280G0169J5555K9716j5661l7609q1529K2805p657j3778L7322L6181J912l999
$$ 70169 85724 115440 99779 62170 -19359 3446 -4211 -17989 19333 55514 57426 53427
11268E3427K8144L397q199J4473r980n2870L6323K4793J6958L0066J0489n1323
$$ 53427 81571 84968 76769 91242 81262 28392 64715 89508 106466 136532 147021 95698
11256I5698j8121N556L8754l0232L1649P5139K977k0044l5881o3465m4530p6291
$$ 95698 77577 83133 121887 91655 123304 198443 201420 181376 145495 82030 37500 -38791
11244c8791j2641K6423N8679Q704q114l3155K9058Q7476r390Q527q485o661n3014
$$ -38791 -51432 -25009 33670 42374 34260 1105 30163 117639 108249 116776 108291 101630 48616
11231D8616j4608L7384k4212j1884L2515j9236n1103O4531N5300j9709r4727K1390
$$ 48616 34008 71392 47180 35296 67811 48575 -2528 62003 117303 97594 2867 24257
11219B4257M6400K6062M3584k2282n1196K4775R1559k6044l3843K5995P1637m9097
$$ 24257 70657 96719 140303 118021 66825 91600 183159 157115 123272 149267 220904 171807
11207A71807p7298N675K0844N0382M6551j9301J9708N282j1612m4856n7196n0086
$$ 171807 94509 100184 121028 171410 217961 198660 218368 223650 212038 167182 109986 59900
11195E9900J5321P1905l7686l5763o6037J8663K8636L454N9039M2920m9100j2089
$$ 59900 75221 147126 109440 73677 7640 26303 54939 58393 117432 160352 111252 99163
11183I9163j9541l9017L655K1158J5898m996O8007L7911n167n3139m4778J6910
$$ 99163 79622 40605 44260 65418 81316 76320 144327 182238 177071 123932 79154 96064
11171I6064K8812M7583m3120q496M2062P5206J09771r192o738P3298J1753O3852
$$ 96064 124876 172459 129339 120843 162905 238111 347882 338690 331952 405250 417003 480855
11159D80855J49150J98494L36948M22939M10528K52315Q4749r7955k59985m17812
$$ 480855 630005 828499 1165447 1588386 1998914 2251229 2335978 2238023 1978038 1560226
11149A560226m17250k94332k26234n9411r3163j03955o3698k2198j6066m1532
$$ 1560226 1142976 848644 622410 562999 469836 365881 302183 279985 263919 222387
11139B22387m2755k7305n2532j001k4297J973L0246P8399J9899j9861l4420l6847
$$ 222387 179632 152327 99795 98794 74497 76470 106716 185115 205014 185153 150733 113886
11127A13886n90l3334p7817O2332J21884m5452o1686m240l4875l3013L2723J7968
$$ 113886 113296 79962 2145 64477 186361 140909 79223 74983 40108 7095 39818 57786
11115E7786p950l5562o4095l5877M062k1555R7953M0569K0610l0749k7307j942
$$ 57786 49836 14274 -49821 -85698 -81636 -103191 -5238 35331 55941 25192 -2115 -4057
11103d057L0981J5497j2172P838K2545K0354m1198q2904O8356J11698k8137p4796
$$ -4057 26924 42421 30249 38087 60632 80986 39788 -43116 25240 136938 108801 34005
11091C4005k9939M700M4642m0432J8487M0134J9032j5152j1861k1097l6308J201
$$ 34005 4066 8766 53408 12976 31463 71597 90629 75477 63616 42519 6211 7412
11079G412K9735N3620k751M0839M4536n6932j36741m134M3649L9906p340Q8210
$$ 7412 37147 90767 88016 128855 173391 116459 -20282 -24416 19233 59139 51799 140009
11067A40009j2703n7200n6459L6293L9246J1867j6777K8161j3730K8155J5934
$$ 140009 127306 70106 13647 49940 89186 101053 84276 112437 98707 126862 142796
11056A42796M6658P5678J7324l3514j6809M0820K5099J18423K8197k0531o7222
$$ 142796 189454 265132 282456 248942 232133 272953 298052 416475 444672 424141 356919
11045C56919q2069j0264K4727j6738Q275p7694j00041K3697J13496J15077J00748
$$ 356919 274850 264586 289313 272575 280850 203156 103115 126812 240308 355385 456133
11034D56133O497m1526K5500L7799j1578m6637o8301O1114Q622l8681N1517J12455
$$ 456133 462630 421104 446604 484403 472825 426188 357887 419001 427623 388942 440459 552914
11022E52914J08833M9255P4985k4967n8294j11671j34794p9790l9602O7839O4052
$$ 552914 661747 711002 785987 761020 702726 591055 456261 376471 336869 404708 468760
11011D68760P1563J11093J16465J5608k5896r0898q0353n014p2457q1758l5106
$$ 468760 540323 651416 767881 783489 757593 666695 586342 581328 508871 427113 392007
11000C92007k7540o2771p295N6739k0189K3974K432l5137m9159J038O044p1254
$$ 392007 364467 301696 294401 351140 330951 354925 357357 322220 273061 274099 280143 208889
10988B08889j702Q8325k906n3146n3698m5806k2029K1698n3052m9879R939K1827
$$ 208889 207187 295512 292606 239460 185762 139956 117927 139625 86573 36694 46633 68460
10976F8460k1701K7363m74N561j2296j7770K3501K2868n0170q2522l5345Q9282
$$ 68460 46759 74122 73648 79209 66913 49143 72644 95512 45342 -37180 -72525 16757
10964A6757O2975J9788o127p685k8516p4063j3914Q9195m1416L4106M4242j10776
$$ 16757 79732 99520 93393 85708 57192 -16871 -30785 58410 16994 51100 95342 -15434
10952a5434j5297k5963K0379L4810J7957q690p7803J8187N4018P6620j0132m7528
$$ -15434 -30731 -56694 -36315 -1505 16452 7762 -70041 -51854 2164 78784 68652 21124
10940B1124m0391J8552M3323O0144L3784O6918P824l1946l5788J4517K7097L162
$$ 21124 -19267 -715 42608 102752 136536 203454 211278 179332 143544 158061 185158 188320
10928A88320j6988O2795j0956N000o293N9638k2704k4759J8708L1761j1064l3344
$$ 188320 171332 234127 223171 228171 221878 281516 258812 234053 252761 284522 273458 240114
10916B40114N5562p178q279r4408k0121R5572J6659l0674j3222k2097Q2362O0163
$$ 240114 295676 288498 280219 185811 165690 261262 277921 247247 234025 211928 294290 354453
10904C54453M050n347q365l8048L8386M0250o6767j17821q3827p4274p3112p903
$$ 354453 358503 353156 344791 306743 345129 385379 318612 200791 116964 42690 -30422 -38325
10892c8325L6567N9896m9669k2317N094q111Q3075K368J5683k7885j6221r458
$$ -38325 -1758 58138 8469 -13848 -8754 -16865 66210 68578 84261 56376 40155 30697
10880C0697M6454R3534O9750N0506K9917M6563k2392J3299M9939N5728J1362K5567
$$ 30697 77151 170685 240435 290941 320858 367421 345029 358328 408267 463995 475357 500924
10868E00924M4220P821n059L0013j9847Q079L4289j4598r507j3888m8472j5905
$$ 500924 545144 552965 547906 577919 558072 566151 600440 585842 576335 562447 513975 498070
10856D98070J4370j9786k0083o7070r282P327J4897J3007j7947L8030L4073j9080
$$ 498070 512440 492654 472571 405501 396219 403546 418443 431450 413503 451533 485606 466526
10844D66526j117m3299o388O1199P4099K9141m1269J9101J6359m4101l4016o915
$$ 466526 465409 422110 415722 476921 551020 580161 538892 557993 574352 530251 496235 489320
10832D89320L2340o6897n9089M3383J28862l015q0431m8776l9592P909Q585j2948
$$ 489320 521660 454763 395674 439057 567919 564904 484473 435697 396105 404014 412599 399651
10820C99651L1775K8246j4592j0777O4188N6851l3186o922L052L1006R5688J08112
$$ 399651 431426 459672 445080 434303 498491 555342 522156 515234 518286 549292 644980 753092
10808G53092M1687R928P2438L8585m9732K1104J1971N1358J65245J06100l9914
$$ 753092 794779 804707 877145 915730 865998 887102 899073 950431 1115676 1221776 1181862
10797A181862L203L2962R483P7479P0214R2305J00498O6620N2707J7238L6400
$$ 1181862 1185065 1218027 1227510 1304989 1375203 1467508 1568006 1634626 1687333 1704571 1740971
10786A740971J66348K17251Q0287J07605R2236J81733K53228K19116K13854J62516
$$ 1740971 1907319 2124570 2204857 2312462 2404698 2586431 2839659 3058775 3272629 3435145
10776C435145J84435L03276L86140M39768N23397P78194R59417R45266O74858
$$ 3435145 3619580 3922856 4308996 4748764 5272161 6050355 7009772 7955038 8629896
10767H629896N77910M43759L83163N90903Q70442J190442J417145J791438K349967
$$ 8629896 9207806 9651565 10034728 10625631 11496073 12686515 14103660 15895098 18245065
10758A8245065L099515L969241N208818O709786Q879294J2427816J8070383K7123793
$$ 18245065 21344580 25313821 30522639 37232425 46111719 58539535 76609918 103733711
10750A03733711M0782422N9058478P7673358Q5233154O3682730K0969358j8120909
$$ 103733711 144516133 203574611 281247969 366481123 430163853 451133211 433012302
10743D33012302n7549147q4334860q1070790o0576631m0315228k6254966j7598926
$$ 433012302 375463155 291128295 210057505 149480874 109165646 82910680 65311754
10736F5311754j2279058r104568p122127n727723m653768l809734l029632k460198
$$ 65311754 53032696 43928128 36806001 31078278 26424510 22614776 19585144 17124946
10728A7124946k026276j631373j195189q53520o17779m20992l55647m51663n55296
$$ 17124946 15098670 13467297 12272108 11418588 10800809 10379817 10024170 9572507 9017211
10719I017211o39426q87831q63481p21084n57933m18990m04087l53219l07675
$$ 9017211 8377785 7489954 6626473 5905389 5347456 4928466 4524379 4171160 3863485
10710C863485k27482j15580j61419j87435j74595j61321q5668j12294j49281j16985
$$ 3863485 3636003 3520423 3359004 3171569 2996974 2835653 2749985 2637691 2488410 2371425
10700B371425q9354l1497j33116j13589l9440p4513j52877m6309n0474n1148r2675
$$ 2371425 2282071 2250574 2117458 2003869 1964429 1889916 1737039 1690730 1640256 1589108 1496433
10689A496433o9360l0254m7859o4028M9647K2968n4800m2658K2930o302m2794
$$ 1496433 1427073 1396819 1348960 1284932 1334579 1357547 1302747 1260089 1283019 1276717 1233923
10678A233923m2750r4852o2239k9019m2920o1144N4507J0399O448L2414L1165
$$ 1233923 1191173 1096321 1034082 1005063 962143 900999 955506 965905 972353 1004767 1035932
10667A035932j9369p3894n7881l5410o186R9654L1575j2214J1713j3044o8314
$$ 1035932 1016563 942669 884788 849378 843192 942846 974421 962207 973920 960876 892562
10656H92562o6738n6970J9469N4711K3972J0825O0489L8994J1230K2026n4746
$$ 892562 825824 768854 788323 843034 867006 877831 938320 977314 988544 1010570 955824
10645I55824O712L5704K7005n5907j0698M5223P510Q9120R5595P4526J34456O5523
$$ 955824 962536 998240 1025245 969338 958640 1003863 1011373 1100493 1196088 1270614 1405070 1470593
10633A470593J93010J84322J42920J73047K90989L06060J46349K97604M48666
$$ 1470593 1663603 1847925 1990845 2163892 2454881 2760941 2907290 3204894 3653560
10624C653560N87822P16460J055721J412103J914830K619655L547054M631561
$$ 3653560 4241382 4957842 6013563 7425666 9340496 11960151 15507205 20138766
10616B0138766N729191O209152N086438K278769p66579k498399k371850j133670
$$ 20138766 25867957 32077109 37163547 39442316 38675737 36177338 33805488 32671818
10608C2671818P54956L167877N841758Q942880J1787076J2743171R504797J800548
$$ 32671818 33426774 36594651 42436409 51379289 63166365 75909536 85414333 87214881
10600H7214881n954321r314341q136597m725426q84766L156093P485261J1965852
$$ 87214881 81260560 71946219 63809622 59084196 58199430 61355523 68840784 80806636
10592H0806636J5349111J5640500R711475k196264j3022203j6841922j4452330
$$ 80806636 96155747 111796247 121507722 119311458 106289255 89447333 74995003
10585G4995003r919626n332595j060040K884562O220869Q633316Q227992L408725
$$ 74995003 65075377 59742782 58682742 61567304 67788173 76421489 84649481 88058206
10577H8058206m797202j1479127j3177625j0999544p607693m460040j809967J47939
$$ 88058206 83261004 71781877 58604252 47604708 39997015 35536975 33727008 33874947
10569C3874947J719569K539880J897285l23853l468228n879447o479305n520398
$$ 33874947 35594516 38134396 40031681 39707828 36239600 30360153 23880848 18360450
10561A8360450m220915l110275k229442j622754j141269q57083o59028m81031
$$ 18360450 14139535 11029260 8799818 7177064 6035795 5178712 4519684 4038653
10553D038653m08473l36746k66104l04673k30153k17414k41785k29063j39281
$$ 4038653 3630180 3293434 3027330 2722657 2492504 2275090 2033305 1804242 1664961
10544A664961j18810n0103q3584j07894m8574j12824J1420j465q7088m7939p9124
$$ 1664961 1546151 1496048 1412464 1304570 1255996 1143172 1154592 1153127 1066039 1018100 938976
10533I38976k4977J1672m4975p260m8399m3298J152j1141m4954J0880k3040j6428
$$ 938976 913999 925671 880696 873436 825037 781739 782891 771750 726796 737676 714636 698208
10521F98208L344Q7463n404o2244j18528J235N389o2921p7480K6831m0348l9355
$$ 698208 701552 789015 783611 721367 602839 604074 609463 546542 469062 495893 455545 416190
10509D16190L8375M5815j2026o8210k3352j1035M7836k1784o8888L2260J11295
$$ 416190 454565 500380 488354 420144 396792 385757 433593 411809 342921 375181 486476
10498D86476o026j8464o7631m0775l8639k4599k7325k7743o3457M251P4767j3001
$$ 486476 480450 461986 394355 353580 314941 290342 263017 235274 171817 176068 250835 237834
10486B37834N0492K5023k1785j19816O373M5205J9439O077N4576M0376R1949J0291
$$ 237834 288326 313349 291564 171748 178121 223326 242765 248842 303418 343794 435743 446034
10474D46034K1071L9860q0320r5770J3258K5825N7256k8059o8024k6332K5905
$$ 446034 467105 506965 426645 330875 344133 369958 427214 399155 331131 304799 330704
10463C30704J4137P957L015J2565r276j1392L072N8104k781L2990M5906m0783
$$ 330704 344841 352798 355813 368378 359102 347710 350782 408886 406105 439095 485001 444218
10451D44218O502j7684j2484l9912k5738n794j40575r0325J3840o395l4484n8689
$$ 444218 450720 433036 420552 380640 354902 349108 208533 118208 132048 125653 91169 32480
10439C2480m531L7153M4262K6634J1001n3294l7124K0758L3773M6048j3239j0573
$$ 32480 27949 65102 109364 135998 146999 93705 56581 77339 111112 157160 143921 133348
10427A33348K9750M9389J7323l674K0811l3193m507j01198m0113k3304M7063L2674
$$ 133348 163098 212487 229810 226136 246947 213754 209247 108049 67936 44632 91695 124369
10415A24369m3822m3322J6295O4729j2835r2624j2651K5409J7113L9860N9161
$$ 124369 80547 37225 53520 118249 105414 12790 139 25548 42661 82521 141682
10404A41682j1053L5755K4452j3450j3964q66k1918m0810O973M6389m4827p575
$$ 141682 130629 166384 190836 177386 163422 162556 140638 99828 106801 153190 108363 100788
10392A00788j1923P4783m048J2943J1843p404j8571p675l8694k2180M8031O8213
$$ 100788 88865 163648 159600 172543 184386 176982 158411 150736 112042 89862 137893 206106
10380B06106M8737m458r7393m4953j7749l0221N4256K886M7025p624n0210K6592
$$ 206106 254843 250385 152992 108039 90290 60069 114325 117211 164236 156612 106402 132994
10368A32994O0090P1842K0314m9257l8481j4086l5896l9143j4267L4296L3347
$$ 132994 193084 264926 285240 235983 197502 183416 147520 108377 94110 128406 161753
10357A61753K7854J2422P4405M5074P573p8988n3700l0427n315K0431j8071K7560
$$ 161753 189607 202029 276434 321508 329081 250093 196393 165966 160651 181082 163011 190571
10345A90571k1588j2121K3639K4821M9748L3160N6063J55736J98879K65394L71242
$$ 190571 168983 156862 180501 205322 255070 288230 344293 500029 698908 964302 1335544
10334A335544M33986M09516K04669J10413q2667l07569m16673m01393l01207j63314
$$ 1335544 1769530 2179046 2383715 2494128 2411461 2103892 1687219 1285826 984619 821305
10324H21305j54356j07818r0575n9732r7340j4616k7032j01378l2689J08187n5002
$$ 821305 666949 559131 468556 408824 311484 296868 269836 168458 135769 243956 188954
10313A88954p606K7541j193l5708r3069K6358Q7520k6692p1173l3227k4532k4841
$$ 188954 181348 208889 207696 171988 78919 105277 192797 166105 94932 61705 37173 12332
10301A2332O6418K8090J03365K4979n5817j010L3248M2166q001R864o2831j8016
$$ 12332 78750 106840 210205 235184 179367 178357 211605 253771 245770 255634 192803 174787
10289A74787p3929p2482R839M8242O1306k6819p8206m2510q556m2334o7442M6823
$$ 174787 100858 28376 38215 86457 147763 120944 42738 228 -8328 -50662 -118104 -71281
10277g1281P2497K4158N575o26P0359N4601M2322O0976J27120J79985P8088J1132
$$ -71281 1216 25374 30949 30323 100682 155283 197605 258581 385701 565686 643774 654906
10265F54906O432j4556j52438j26333K3619K4931j1232l2547q901n1153r5615
$$ 654906 661338 646782 494344 368011 391630 416561 405329 372782 363881 312728 217113
10254B17113P183J7589o8877n7527q0331J2062j8365j5309q741J690O6413R9387
$$ 217113 224296 241885 173008 115481 35150 47212 28847 13538 4797 6487 72900 172287
10242A72287o4149n3376m2625R735j432J8012q047j7461O4586M7456j5919m506
$$ 172287 108138 54762 12137 21872 20440 38452 30405 12944 77530 124986 109067 104561
10230A04561J8322k1021m5590m1638L3738K2416j6969j5224j0353k7142L9977
$$ 104561 122883 101862 56272 14634 48372 70788 53819 38595 28242 1100 41077
10219D1077Q4703L5102l8973M4836n3179m1037l5464p291L9207n2322R944o464
$$ 41077 125780 160882 121909 166745 113566 72529 37065 29774 68981 16659 26603 20139
10207B0139L2414J7258l5641L4136K5024J0765k7461K1428j5619M4597R789K3522
$$ 20139 52553 69811 34170 68306 93330 104095 76634 98062 82443 127040 136829 160351
10195A60351O3497k2217j56037N050Q5802Q736L4397J0018L806o1484n4865M2906
$$ 160351 223848 201631 45594 50644 136446 145182 179579 189597 193403 131919 77054 119960
10183A19960K4485l5318k3245k8951P2494O4632L2579J4877Q505O987J7584m6131
$$ 119960 144445 109127 85882 56931 129425 194057 226636 241513 250018 257005 274589 228458
10171B28458m5901J3016N8983J00327N2018J03982P1288l7727q9095j4661l2695
$$ 228458 182557 195573 254556 354883 406901 510883 582171 544444 455349 440688 407993
10160D07993j4342r558K1439N9142J50243J34411L2419k7583j9969p1940j34184
$$ 407993 393651 384093 405532 464674 614917 749328 781747 754164 734195 662255 528071
10149E28071o7981o688J2534j0440M3747L5934M8291l6365l9542m1037m3461p8146
$$ 528071 460090 453402 465936 455496 499243 535177 583468 547103 507561 466524 423063 344917
10137C44917o0727J3993j9519q8117k0081N5042j0798k4481p496O0968L7198j2305
$$ 344917 284190 298183 278664 190547 170466 225508 214710 190229 182733 243701 280899 268594
10125B68594m3010j30804n4625k3771q1602o5516P17M5131K7477L5482m9596m0202
$$ 268594 225584 94780 40155 16384 -65218 -130734 -130017 -84886 -57409 -21927 -71523 -111725
10113a11725K6922L0232M7987J03944j143o4925l9854l833J08148L8480m2997
$$ -111725 -84803 -54571 -6584 97360 96217 31292 -8562 -12395 95753 134233 91236
10102I1236p179k435M3590k1671M312k7584n7205K2070k100J7890L3507K0136
$$ 91236 84057 81622 125212 103541 107853 80269 23064 45134 43034 60924 94431 114567
10090A14567l9840p1996n9287O3265J08085L9617k6510o9549l6950M2240J0660
$$ 114567 74727 2731 -56556 6709 114794 154411 127901 58352 21402 63642 74302
10079G4302k2236L5913P625k6503K8303J6836N3896p1616m2915k8654j6119L0464
$$ 74302 52066 87979 95604 69101 97404 114240 168136 96520 53605 24951 8832 39296
10067C9296o3277k9907J0375j0837J8273L5076L2416O0640j7350K721L4012L545
$$ 39296 -23981 -53888 -43513 -54350 -36077 -1001 31415 92055 74705 77426 111438 114983
10055A14983k3783j631L4673J3685m5306m9068m3037O1489O1369Q4619J3313k6878
$$ 114983 91200 89569 124242 137927 92621 43553 516 62005 123374 207993 221306 194428
10043A94428p4457o7018k1923l0397m6499O7357N7934l152n8482j7736L6048k6026
$$ 194428 119971 52953 31030 633 -45866 21491 79425 76273 17791 55 36103 10077
10031A0077j3374k7669m7881Q5489r008r1572n4750O2475M5981N9309M2399M8140
$$ 10077 -3297 -30966 -78847 6642 -2366 -93938 -148688 -86213 -40232 19077 61476 109616
10019A09616j7916o9347n5285O86M0489N8809N4019L0705L0989n7885J0800m8593
$$ 109616 91700 22353 -32932 -32246 8243 67052 121071 151776 182765 124880 135680 87087
10007H7087q535j263L4623j1341l9814r989j18199L5799Q3569n504n7310O4431
$$ 87087 78552 77289 111912 100571 60757 50768 -67431 -31632 51937 46433 -10877 53554
9995E3554M6314r582j6989j6106n561j7934j0646q652m9331J5374L3516j072j2005
$$ 53554 99868 90286 73297 57191 51630 33696 23050 14398 -34933 -19559 13957 12885 880
9982H80m1005J2312M6643m8320n9028J8553M6542j6154l5039J8485J8738n6033
$$ 880 -40125 -27813 18830 -29490 -88518 -69965 -23423 -39577 -74616 -56131 -37393 -93426
9970i3426R72L9184P0197l3861n2361M0747m6635l5003M963M1864r493J2143L5405
$$ -93426 -92454 -53270 16927 -16934 -69295 -28548 -75183 -110186 -105223 -63359 -72852 -60709 -25304
9957b5304L968l3810L2380Q2694M1978l0005p1842J021n3984L7517N9548K6579
$$ -25304 -21336 -55146 -22766 59928 101906 71901 59 1080 -52904 -15387 44161 70740
9945G0740l9442n609J1422P9988Q9401k8863p7927n8253K5376Q698k481p9084
$$ 70740 31298 25689 37111 117099 206500 177637 99710 41457 66833 75531 73050 -6034
9933f034k4300R464l9091K7053K2387n7276j7474k6990P5598O1570j3145p2841
$$ -6034 -30334 -20870 -59961 -32908 -10521 -67797 -85271 -112261 -36663 24907 11762 -61079
9921f1079K289o542o252M5122R1821M4426j1046o9524K3750J9008n9848m2262
$$ -61079 -58790 -65332 -71584 -26462 65359 109785 98739 29215 52965 71973 12125 -30137
9909c0137K5348L2848M6013M1877j1958n5458j7479l5082j9352l9226k6005J3141
$$ -30137 -4789 28059 74072 115949 103991 48533 31054 -4028 -23380 -62606 -88611 -75470
9897g5470J3431O5010K9403q8483M2435O7692L008J9600O5083m422p3162q5271
$$ -75470 -62039 2971 32374 -56109 -13674 54018 57026 76626 141709 137287 64125 -21146
9885b1146J8804L2926j6389q99k8681k3548Q769p077n9055q2168m107L2086K3007
$$ -21146 -2342 30584 14195 13296 -15385 -38933 -30164 -37241 -96296 -178464 -182571 -150485 -127478
9872a27478j0498M0841P7247P9224K4749M005L5435K0836q9383p8558K0840J7098
$$ -127478 -137976 -97135 -19888 59336 84085 88090 123525 144361 54978 -23580 -2740 14358
9860A4358M6969L5070Q66p3846m1603k882r952j1423M8405K8480N6934M4307k0335
$$ 14358 61327 96397 97263 23417 -18186 -21068 -31020 -42443 5962 34442 91376 135683 115348
9847A15348m4109O9150J1086m6694m9941j8631o293k7073K6320O7647J647n3633
$$ 115348 71239 140389 151475 104781 54840 36209 29916 2843 29163 96810 98457 44824
9835D4824p3955l9880l799k6877P3859J19155L106l1018L1157m9011p1868n0074
$$ 44824 -29131 -69011 -72810 -99687 -25828 93327 96433 65415 96572 47561 -24307 -74381
9823g4381o659Q4586M5177M7760j0430p1251k7586j5745Q9799J9512j27059l3561
$$ -74381 -81040 3546 48723 96483 86053 14802 -12784 -28529 61270 80782 -46277 -79838
9811g9838P0939Q2550J9753N819k7755m7703k3482Q7848k2571n4328J0935j6619
$$ -79838 -8899 73651 93404 99223 71468 23765 283 88131 65560 11232 22167 5548
9799E548p1756O600M5271J0707n4397M8391r72M4771K9638J5752Q899n5409j3070
$$ 5548 -66208 -59608 -14337 -3630 -58027 -9636 -10608 34163 63801 79553 88452 33043 19973
9786A9973J8817K9011j25600j9263P8447Q3581J4161p020M4142M3454k6787m0514
$$ 19973 38790 67801 -57799 -77062 1385 84966 99127 92107 136249 179703 152916 112402
9774A12402k5588N5928L4673k6683p7378J8224k4450n7509j15983j11827J11993
$$ 112402 86814 142742 177415 150732 73354 91578 67128 9619 -106364 -218191 -106198
9763a06198J43265Q0057l6500n6412l8780J6349O6585M0823O944o8818o424L4545
$$ -106198 37067 117124 80624 24212 -14568 1781 68366 109189 116133 47315 40891 75436
9751G5436P9653k4524k8446n459l2380j15649J3716Q3297m7664J4936o825R143
$$ 75436 155089 130565 102119 96660 64280 -51369 -37653 45644 -2020 12916 6091 15234
9739A5234Q901L1962p707k7079q295O3141q62J2511p715k3477l9905l5644n6521
$$ 15234 24135 56097 48390 21311 13016 76157 75295 87806 80091 56614 16709 -18935 -75456
9726g5456O1144R4419k4179k6932K6319P503M4848q4793j3048L6362j3374o5091
$$ -75456 -14312 80107 55928 28996 55315 62818 107666 22873 9825 46187 32813 -32278
9714c2278r2070L8255L6752l5391r64P0294O0225K2526l532J2461l0761k2505
$$ -32278 -124348 -86093 -49341 -84732 -85696 -15402 44823 67349 63817 76278 45517 23012
9702B3012J0868l1092M1107r909n8299K038J3207N3448J6182j7274J7516m6073
$$ 23012 33880 2788 43895 33986 -24313 -22275 -9068 44380 60562 43288 60804 14731
9690A4731P477m5633o7399J7482N809P1832Q0509M2419J15J520q8299r3556m8957
$$ 14731 22208 -23425 -90824 -73342 -67533 4299 84808 127227 127342 128862 40563 -52993 -101950
9677a01950r0244P3767J18306j8722k0626J958N648M4151O2889k9090j8544N2124
$$ -101950 -192194 -118427 -121 -18843 -39469 -37511 -31863 12288 75177 46087 27543 79667
9665G9667J6163l4413j15088q627O9763K7874r324k6080j6313n4359O520Q578
$$ 79667 95830 61417 -53671 -62298 7465 35339 26015 -65 -16378 -70737 -64217 -55639
9653e5639O1749R1913Q4514Q449j19336K837k572n8410l1663p072N2492m6636
$$ -55639 6110 98023 182537 190986 71650 74487 71915 13505 -18158 -25230 27262 -19374
9641a9374l6980K638L0414M5613J2704P22J3795J7547l5569k5149L0631k8482
$$ -19374 -56354 -53716 -23302 22311 35015 35737 49532 67079 31510 6361 36992 8510
9629H510m8244o2555M5968k1437J7423O512m6167q453J6306J05459J3100m1211
$$ 8510 -39734 -102289 -56321 -77758 -60335 -53823 -99990 -108443 -92137 13322 26422 -14789
9617a4789j6750K0115K3905J7025K7853Q018j0215j1194l7935l669L3782l5598
$$ -14789 -31539 -11424 12481 29506 57359 65377 55162 43968 6033 2364 36146 548
9605E48l6397l332L7513l9784l47Q2667l6791j5465k8033m972J7866m5509m911
$$ 548 -35849 -39181 -1668 -41452 -41799 40868 4077 -11388 -39421 -44393 -26527 -72036 -76947
9592g6947k5525J4692M6926K2915J1857K4029L8646N5119L4319l6800O498j9647
$$ -76947 -102472 -87780 -40854 -17939 -6082 17947 56593 111712 146031 109231 115729 96082
9580I6082m9804j6234L5455k6029J1945j4266j9691K4190J05241K9291j24556
$$ 96082 46278 30044 65499 39470 51415 37149 17458 41648 146889 176180 51624
9569E1624r5621l2497M9170l6564J3801N3811j0313k9118n7311m5897J15394O8300
$$ 51624 -43997 -76494 -27324 -63888 -50087 3724 -6589 -35707 -93018 -138915 -23521 44779
9557D4779k7652L8636O9488L8158j14509p3589N9242j7744O884k8359o2516L5339
$$ 44779 17127 55763 125251 163409 48900 -24689 34553 16809 23693 -4666 -67182 -31843
9545c1843M42l217P362K4606L0632k4316o806l2959l5047P2150J4242n5830o4810
$$ -31843 -31401 -34618 -27256 -2650 27982 3666 -3140 -36099 -71146 1004 15246 -40584 -105394
9532a05394L9138O6871O4169K8511n5811r93N1283N9002K0196k1062n9203o4506
$$ -105394 -66256 615 64784 93295 37484 36491 87774 146776 166972 145910 86707 22201
9520B2201K234l367o5916M9523l9455j13592M0191R8696L5937J1450j16479p5831
$$ 22201 24435 21068 -44848 4675 -34780 -148372 -108181 -9485 26452 37902 -78577 -154408
9508a54408K3124Q0948O6473J7412L2588l6078j2243J1898j7584l038o2531L5711
$$ -154408 -131284 -50336 16137 33549 66137 30059 17816 29714 12130 9092 -53439 -17728
9496a7728L5095J5865l7277l5819n7258O978K3931M4867l3645K845j2805Q0507
$$ -17728 17367 33232 -4045 -39864 -97122 -90144 -66213 -21346 -54991 -52146 -64951 15556
9484A5556j5441L864O819n5445K6300N9560J2197O646o3065l4798J9243Q5235
$$ 15556 115 3979 10798 -44647 -18347 41213 53410 60056 -3009 -37807 -18564 66671
9472F6671l5404r80L1832n5215o7543R4437J14674n9834j27334Q834O2494Q0883
$$ 66671 31267 30287 62119 6904 -60639 33798 148472 88638 -38696 -29862 32632 113515
9460A13515k5959J6466o532q1339N1844J02651j9230m0151q0191o735J4214m0808
$$ 113515 87556 104022 97490 16151 67995 170646 151416 111265 31074 24339 38553 -2255
9448b255j4441Q170L8866l1697N4730O096n1980j1799r931m511n0502m4087M6117
$$ -2255 -16696 -8526 30340 -1357 53373 59469 7489 -4310 -14241 -18752 -69254 -113341 -67224
9435f7224J26109J830l5286q369K8892K5253l4426l3446r281l251k7821k1486
$$ -67224 58885 60715 25429 17060 45952 71205 36779 3333 -5948 -9199 -37020 -58506
9423e8506Q0708R908p353J4340k21l3437n1028K3734M2989J2056l1087Q736m8457
$$ -58506 22202 32110 24757 39097 38876 5439 -45589 -21855 21134 33190 2103 10839 -37618
9410c7618J162K0751j5271k2354M3307M0714K4188J1943n7181p6026n4969J4440
$$ -37618 -36456 -15705 -30976 -53330 -10023 30691 54879 66822 9641 -66385 -121354 -106914
9398a06914N3093P7233J9986J1602l6808Q298j85k4824l4685j3580k8435K5720
$$ -106914 -53821 23412 43398 55000 18192 26490 26305 1481 -33204 -46784 -75219 -49499
9386d9499p950m0777O9029R016P629l1442J7270O2085K4860n4699M0793j2141
$$ -49499 -57449 -98226 -29197 -20181 -12552 -43994 -26724 35361 60221 5522 46315 34174
9374C4174k6074o294J7959J8942L6602m8902l3367n5882N924K6296M1639k561
$$ 34174 8100 1806 19765 38707 75309 26407 -6960 -62842 -56918 -30622 11017 8456
9362H456K5468p777m7896o56R4652N834l1088m8209n1791n3070K126o297M0296
$$ 8456 33924 26147 -21749 -22405 72247 78081 46993 -1216 -53007 -106077 -103951 -110248 -69952
9349f9952K5493P5487J5446m1052m1863K2429J2674J5033l7582l6950K1885J5153
$$ -69952 -44459 31028 46474 5422 -36441 -14012 -1338 13695 -23887 -60837 -38952 -23799
9337b3799K76q588m2894k8802J8679O3744K2964l3994K4682l3037l3098j5687
$$ -23799 -23523 -32111 -75005 -103807 -85128 -21384 1580 -32414 -7732 -40769 -73867 -89554
9325h9554j8284M5187M3674o265j3604k1483L4588K0306M3932M673p785m2949
$$ -89554 -107838 -62651 -18977 -25242 -38846 -60329 -25741 -5435 38497 43170 35385 -7564
9313g564n9906J27892N6331j00880l4820J5477L104m3130j8918L8158O6286J4215
$$ -7564 -67470 60422 116753 15873 -18947 -3470 -366 -43496 -62414 -24256 42030 56245
9301E6245k5259k0469j8900k0317N7809n1034o7345k2618J2357N7910M2913n0431
$$ 56245 30986 10517 -8383 -28700 29109 -21925 -89270 -111888 -99531 -41621 1292 -49139
9289d9139J6000J5724k7176j9592n2539M8612M8470m671K0558O027K6567J7592
$$ -49139 -33139 -17415 -44591 -64183 -116722 -68110 -19640 -24311 -3753 2274 28841 46433
9277D6433K8832J2073j3728j4929n2341J3147k0045n6765J0205O0838L4190k5266
$$ 46433 75265 87338 73610 58681 6340 19487 -558 -57323 -47118 13720 47910 22644
9265B2644m0572L0523N0274o4071P490j6071k6068N7033N8490K2506j6315m6114
$$ 22644 -17928 12595 62869 -1202 6288 -9783 -35851 21182 79672 102178 85863 39749
9253C9749n928l7616m8001K0384M3709j537n6585j840o9685p1424R3793M0425
$$ 39749 33821 -3795 -51796 -31412 12297 10760 -45825 -47665 -117350 -188774 -94981 -54556
9241e4556Q84l7661J5581N3781M0721M989k0116l061k002m409j2546r2987J4278
$$ -54556 -53672 -91333 -75752 -21971 18750 23739 3623 562 -1440 -5849 -18395 -111382 -97104
9228i7104m1463k3280K2650M275L5831Q5831O1899L069M5426N260q0211J1459
$$ -97104 -138567 -161847 -139197 -134922 -99091 -13260 48639 51708 97134 102394 22183 33642
9216C3642j048P1672m6961k6311R905K0833l9865k0666K0188m6428J135J8451
$$ 33642 32594 104266 57305 30994 40899 61732 21867 1201 21389 -25039 -23904 -5453
9204e453k9769M8644P8823J6838j01770m0685N6522N608n2203K5385M5447M8720
$$ -5453 -35222 13422 92245 109083 7313 -33372 23150 28758 -23445 1940 47387 96107
9192I6107K4516K602p3350n7339L692l7773k3365N4922j4424Q664K2278k5939
$$ 96107 120623 123225 49875 -7464 -3772 -41545 -64910 -9988 -24412 -15748 6530 -19409
9180a9409l5714N7407L5711L6817j5432k1029L0159J0754q2078R810K4596l5444
$$ -19409 -55123 2284 37995 74812 59380 38351 68510 79264 -2814 6996 31592 -3852
9168c852n975k6192M3587M661m7945n4030K5546J00896K8026j61J3896o7042k4770
$$ -3852 -9827 -36019 7568 12229 -35716 -89746 -64200 36696 64722 64561 78457 11415 -13355
9155a3355N2764M5575m9012n8471m0200q739J7818r896J7591J9495J3067P0241
$$ -13355 39409 84984 35972 -22499 -62699 -71438 -53620 -63516 -45925 -26430 -13363 56878
9143E6878j6083m6627n1369p765l9282P9068O0995k6586k5794L1065O8458J0067
$$ 56878 40795 -5832 -57201 -64966 -104248 -25180 35815 9229 -16565 14500 82958 93025
9131I3025p061p9728k1303J0316J2176P4749L6589k3521j77j1544k2148K6125
$$ 93025 85964 6236 -15067 -4751 7425 82174 118763 95242 95065 83521 61373 87498
9119H7498K4096l2116n416K8704o0147q5176n6072N22L0868P3886P431k8572J0851
$$ 87498 111594 79478 74062 102766 42619 -42557 -98629 -98107 -67239 6647 14078 -14494 -3643
9106c643P844M26M6791Q529j8247j0515J20194K7426l6197n9946o7488o5984K6546
$$ -3643 4201 4627 51418 59947 41700 31185 151379 178805 142608 82662 15174 -50810 -24264
9093b4264j6151j1409L9359n4901J5657L7895j2111j3534p219k8561O7713M6441
$$ -24264 -40415 -51824 -12465 -67366 -51709 -13814 -25925 -39459 -46678 -75239 -7526 38915
9081C8915k9076K9833j3089j5837j5322O5786P3423k6729n0563l0860k928M9239
$$ 38915 9839 39672 26583 10746 -4576 61210 134633 107904 57341 26481 23553 72792
9069G2792o5139n2247K2726m2535K738M2686J8459o8297p23M1902j278j3514l3745
$$ 72792 7653 -44594 -21868 -64403 -61665 -18979 -520 -68817 -69540 -27638 -28916 -42430 -76175
9056g6175l4965j1229K215o9488l5874P5882Q2677l5775M8954O3875l8667M896
$$ -76175 -111140 -122369 -120154 -189642 -225516 -149634 -66957 -102732 -53778 10097 -28570 -23674
9044b3674k6565l0813l2609K1759N0332K1096L1634K5161L6670K7455k589L2084
$$ -23674 -50239 -81052 -113661 -91902 -41570 -20474 11160 36321 72991 100446 97857 129941
9032A29941j0625k3167o4706p8759J4592N4832M7156K7561j7860p3073l8882p689
$$ 129941 119316 96149 31443 -47316 -32724 22108 69264 96825 78965 5892 -32990 -40679
9020d0679O2349N5929j22684j3928j5372j9406M213L2895o1426j6230M6373L3667
$$ -40679 21670 77599 -45085 -59013 -74385 -93791 -89578 -56683 -118109 -134339 -87966 -54299
9008e4299L459l7366p997m7812K4025O3864L4261q721l7512L549L9097k1601l7874
$$ -54299 -50840 -88206 -96203 -144015 -119990 -56126 -21865 -30586 -68098 -64549 -25452 -47053 -84927
8995h4927m6210K6457N9441L4268j0266N2208j0503k895p431k132K3960l4385
$$ -84927 -131137 -104680 -45239 -10971 -21237 30971 20468 17573 10142 8010 31970 -2415
8983b415k7523k3459q583K9371L3451j5338k9312m828J3169J4898O3157K6231
$$ -2415 -29938 -53397 -61980 -32609 842 -14496 -43808 -48636 -35467 -20569 42588 68819
8971F8819p1899m2575J0762r321L6586P6641M6083k6808m244k5651p5171n1314
$$ 68819 -3080 -45655 -34893 -44214 -7628 69013 115096 88288 84044 58393 -16778 -68092
8959f8092J5317L4617k7966O6074N0730m6899l0282n19q166k2404l8219O1148
$$ -68092 -52775 -18158 -46124 19950 70680 23781 -6501 -7020 -15186 -37590 -75809 -14661
8947a4661M2741l7303n2049P579M1891K4580l7955J6642M413j5515K8342K2353
$$ -14661 28080 -9223 -61272 -53693 -11802 12778 -25177 -8535 -4122 -19637 8705 31058
8935C1058k2809J6017K5279J9578o856r290L6609l148L2119q803n800N9240k0612
$$ 31058 8249 24266 49545 69123 62267 52977 89586 86438 118557 109754 103954 163194 142582
8922A42582J4203k3103j6365k38p4971j6458M4891L1474q8194j04993J6857O9257
$$ 142582 156785 133682 117317 117079 42108 25650 70541 102015 13821 -91172 -74315 -5058
8910e058M9765K7839o5545o3723j4028M1393O6913J4014J1444k6953l786k6331
$$ -5058 44707 72546 7001 -56722 -70750 -29357 37556 51570 63014 36061 32275 5944
8898E944n7950k2799j3102J1561M3874M5212k4212J5942m982m8281J0981J2150
$$ 5944 -52006 -74805 -87907 -76346 -32472 12740 -11472 4470 -512 -48793 -37812 -25662
8886b5662n0538K8765Q1577J6384j7918n8996l0277j65j7375k2187l2236k746
$$ -25662 -76200 -47435 34142 50526 32608 -26388 -56665 -56830 -74205 -96392 -128628 -131374
8874a31374K9792O5378K717J4082p645L974N5403J8445l498j6439M6379k4544
$$ -131374 -101582 -36204 -33487 -19405 -27050 -23076 32327 50772 47274 30835 77214 52670
8862E2670l6987o9864M758n043p974N5006k2181n541j2703j3753o241M4047P4880
$$ 52670 15683 -54181 -49423 -54466 -62440 -7434 -29615 -35156 -47859 -61612 -67853 -23806 51074
8849E1074j7218o2878O0094J01067k2676l8656n7394k4781N2009O860j8368Q5715
$$ 51074 33856 -29022 31072 132139 109463 70807 13413 -11368 40641 47501 29133 114848
8837A14848J903j7549k5286o9770o3477P0026R3836M4341J9269n4117n8730p9535
$$ 114848 116751 99202 73916 4146 -59331 10695 104531 148872 168141 114024 55294 -24241
8825b4241j07042P7663N5668N3301K0033L7243j2352k5613P590n0992l7113N2335
$$ -24241 -131283 -53620 2048 55349 75382 112625 100273 74660 82250 31258 -5855 46480
8813D6480p6339r2891N0308m4604l9507M8334N240J7741l4694Q114J41067M226
$$ 46480 -29859 -122750 -72442 -117046 -156553 -108219 -102979 -85238 -119932 -111818 29249 33475
8801C3475n2172k4730l2556Q0103q318r4709p2630J7487O0570K7508o3080J4522
$$ 33475 -18697 -43427 -75983 4120 -4198 -98907 -171537 -154050 -93480 -65972 -129052 -114530
8789a14530L4040M4647o078p685q1905O8666R2266M4935l1905j5405l8129j8465
$$ -114530 -80490 -35843 -41921 -49606 -131511 -62845 29421 74356 42451 27046 -11083 -29548
8777b9548M2544L3875j1150J3297J8432o7829l6659j3332O6238J2243K3432J1169
$$ -29548 12996 46871 35721 49018 67450 -379 -37038 -50370 15868 28111 51543 62712
8765F2712j4502O78n7613N436L4161n6262R044N9969K4406n5093k2588P484o4193
$$ 62712 48210 48888 -8725 -3289 30872 -25390 -16346 43623 68029 12936 -9652 -2168 -66361
8752f6361o1648k9158M8529L2982k3133r816J4115L3037L8192O5956N565j4297
$$ -66361 -128009 -157167 -108638 -75656 -98789 -108605 -94490 -61453 -23261 42695 48260 33963
8740C3963K8401l1014l6874J7462l2245J3064J5270r5949n1121J8727L8776L4594
$$ 33963 62364 31350 -5524 11938 -20307 -7243 8027 -87922 -139043 -120316 -81540 -46946
8728d6946K6578J7174m7378l8504j9816N69r041N8208j1468M191L6729l0129l3362
$$ -46946 -20368 -3194 -50572 -89076 -108892 -108323 -117364 -59156 -70624 -66433 -29704 -59833 -93195
8715i3195J4026M6979R612K5835L2671q3427n1954L450O3181L0984k133M8545
$$ -93195 -79169 -32190 -22578 3257 35928 -47499 -99453 -96003 -32822 -1838 -3971 44574
8703D4574L0907J0235k9447o926J411K0795m1516o4473N8279l1971o0406N5485
$$ 44574 75481 85716 56269 49343 50754 71549 30033 -34440 23839 -8132 -68538 -13053
8691a3053p380K7907O0814Q042J4917n0870k705N435o3371m421j7998n1943k810
$$ -13053 -20433 7474 68288 76330 91247 40377 37672 43107 -20264 -24685 -42683 -94626 -97436
8678i7436P2994k6755Q305Q6612p188r205O9386o159n9828k1088l9764n2777k6682
$$ -97436 -24442 -51197 -42892 43720 36532 27327 96713 90554 30726 9638 -30126 -82903 -109585
8665a09585L948J1415O529p5043l5394j1908P3695P9249j6646N5094K2513l271
$$ -109585 -105637 -94222 -87693 -162736 -198130 -210038 -136343 -57094 -73740 -18646 3867 596
8653E96j6742J6109q239J6644n75O982n3328P2204O9498N0974l8907l5433P501
$$ 596 -16146 -37 -8276 8368 7793 14775 -38553 33651 103149 154123 115216 79783 87284
8640H7284K6120j0683j03060j7145L0872k8434j744j8600o997Q661j8921M4573
$$ 87284 113404 102721 -339 -17484 13388 -15046 -16790 -35390 -42387 -33726 -52647 -8074
8628h074J0370J7493k3678l8813Q4316N3644j2059J1211L2610J2690n3227K590
$$ -8074 2296 19789 -3889 -42702 41614 95258 83199 94410 127020 139710 86483 89073
8616H9073k2397L2570L870L5767K4389o9358n9562p0826j3266j9125N7390P3265
$$ 89073 66676 99246 103116 138883 163272 93914 34352 -36474 -49740 -68865 -11475 61790
8604F1790m3408l3294L259j2425n562l689j8522o839J0182m0240O737M2261P6080
$$ 61790 18382 -14912 -11653 -24078 -29640 -33329 -51851 -58690 -48508 -88748 -82011 -39750 36330
8591C6330l3132p6733k4962k6493R7588O6021M3847K1033K1207j8819J5488J9199
$$ 36330 3198 -73535 -98497 -124990 -27402 38619 82466 103499 124706 105887 121375 140574
8579A40574K6319J03217O69r9103l79P9082O8420k4662o5397K4747Q8172j5355
$$ 140574 166893 270110 270779 171676 171297 250379 318799 294137 228740 253487 341659 326304
8567C26304p6530n6830r9385m8638P787m6218k1687l7889N9235M9038j0221K223
$$ 326304 249774 192944 93559 44921 52708 6490 -15197 -53086 6149 55187 44966 47189
8555D7189n9836o9593K0476R3217m209J6990J7789K2588l2992l1590N0362Q5347
$$ 47189 -12647 -82240 -61764 31453 27244 44234 62023 84611 51619 20029 70391 155738
8543A55738r0940j10120L2118J08423r154K8112l7372N408M9912k7935q6236M3577
$$ 155738 64798 -45322 -13204 95219 86065 114177 76805 82213 132125 104190 17954 61531
8531F1531J8598j7547K5928N3869p566R215O507L2276o2085q5948r4348n7303
$$ 61531 80129 62582 88510 142379 134813 144028 150535 182811 120726 34778 -59570 -116873
8519a16873K2980P9910J0437K3670L1634O226N0692J2028j7937L833l0655l0992
$$ -116873 -93893 -13983 -3546 20124 51758 57984 108676 120704 102767 106600 75945 44953
8507D4953m2631j2562M9950n4214K4611K2309K4781j6807l4492M3037N0504k2769
$$ 44953 2322 -10240 39710 -14504 10107 32416 57197 40390 5898 48935 99439 76670
8495G6670J0890L2198n0819k7461P500k5416k8299K1118J8273K1419L2639M2030
$$ 76670 87560 119758 68939 41478 48978 23562 -4737 16381 34654 56073 88712 130742
8483A30742r9119k9230P645k8443l926M9875M4919p056p076j0296N0179K6359
$$ 130742 31623 2393 10038 -18405 -22331 27544 72463 65407 58331 48035 98214 124573
8471A24573l2770K4858L892j6559L7957k2081l2957l3231k1075k5618p7460n343
$$ 124573 91803 116661 120553 103994 141951 119870 86913 53682 32607 6989 -70471 -75814
8459g5814L6287O0081o1126J2925J0452N8999L4063L3876J1530J202m3111J8739
$$ -75814 -39527 20554 -40572 -27647 -17195 41804 75867 109743 121273 122475 79364 98103
8447I8103K6585M7612J5396k0659n1458K3523j486o3069n6491l2718m0961j8726
$$ 98103 124688 172300 187696 167037 115579 139102 137616 74547 18056 -14662 -55623 -74349
8435g4349O0006J6763j2054k8738K2230n966j0902j2944N3101L9066k32k2656
$$ -74349 -14343 2420 -9634 -38372 -16142 -22108 -33010 -45954 7147 46213 45981 23325
8423B3325n8335k0864L2752o729P2604J1750J3972m9367l0718M5037r160p8424
$$ 23325 -35010 -55874 -23122 -29851 42753 54503 68475 19108 -11610 33427 24267 -54157
8411e4157k8786Q636n927O1293N6534L8740l439j8736P660O4982J7707r8709r0193
$$ -54157 -82943 -74307 -80234 -18941 37593 76333 72894 54158 61818 126800 144507 45798 -44395
8398d4395m768N5388J24373M9310O174m364l8988r8172J8724k6274p0970n1402
$$ -44395 -49163 6225 130598 179908 186082 181718 142730 44558 63282 37008 -33962 -85364
8386h5364l6805j397k3390k7966Q6135O3212l911O9413j8846m3570k5504L5305
$$ -85364 -122169 -123566 -146956 -174922 -88787 -25575 -29486 39927 21081 -22489 -47993 -12688
8374a2688N3261N3192n4615o5464M7945j4874j5815K6451L4119M87m8408R030
$$ -12688 40573 93765 39150 -26314 21631 6757 -9058 17393 51512 51999 3591 12621
8362A2621R259k9383m8608l2994L0585J6131J8149J7058m4239M4893J47986J35637
$$ 12621 21880 -7503 -56111 -89105 -58520 -42389 -24240 -7182 -51421 -6528 141458 277095
8350B77095O2947n6930r2151o1210n308M6614M5894l3533o4717o5475p858n2476
$$ 277095 340042 283112 190961 129751 124443 171057 216951 183418 118701 53226 45368 -7108
8338g108J9578P436m787l6144k5917R1332P3916j9454M517K5359M3228p779m5541
$$ -7108 12470 19906 15119 -21025 -46942 44390 118306 98852 103369 128728 171956 164177 118636
8325A18636k7598n1674J7255l8104m4031R897K5297k891m0028J2693K3614K1218
$$ 118636 91038 39364 56619 18515 -25516 -15619 9678 6787 -33241 -20548 3066 24284
8313B4284j2264n099J7112K7189K0056K9034l0181k9058K3661o1999m041k0891
$$ 24284 12020 6921 24033 51222 71278 100312 70131 41073 64734 2735 -1306 -22197
8301b2197l7844N9948J2071j8764n321K27R648m2073K4830K7459J499q2811m4418
$$ -22197 -60041 -93 11978 -6786 -12107 -11880 -2232 -44305 -19475 7984 9483 -73328 -117746
8288a17746l2025n600M857J4771j3537J7021P4955K9803K4097O1216o1787n8425
$$ -117746 -149771 -155371 -150514 -135743 -149280 -132259 -57304 -27501 -3404 57812 -3975 -62400
8276f2400K6474M8787O1420L4826J2801n354j06654o8695O1601j1494k4620n734
$$ -62400 -35926 12861 74281 109107 121908 116554 9900 -58795 2806 -8688 -33308 -39042
8264c9042l5486K9121M4830K9054l1189p0884L6188M6575M8992k6149K2956Q0111
$$ -39042 -74528 -45407 -577 28477 -2712 -73596 -37408 9167 58159 32010 54966 135077
8252A35077J4528j12464r5582m5166k6856K3147j2908l0698P4328Q4442M1323
$$ 135077 149605 37141 -58441 -103607 -130463 -107316 -120224 -150922 -76594 7848 49171
8241D9171k9672n4317j3614M8330M1735j2294k6022L9698J5319l0817m0971Q835
$$ 49171 19499 -34818 -48432 -102 41633 29339 3317 43015 58334 27517 -13454 -4619
8229d619M6284M0403j4495L6316J3328J8218J5599m5558l1188j475J3260m2987
$$ -4619 41665 82068 67573 103889 117217 135435 151034 105476 74288 72813 86073 43086
8217D3086L470M06M4029n35j0288k3625k5328n0540k8754k922M3985M3135K4349
$$ 43086 46556 46962 90991 90456 80168 56543 31215 -19325 -48079 -51001 -7016 36119 60468
8204F0468k7149n298m0812q6783k0183M4313K7317m823L2905L4823P743K0123
$$ 60468 33319 28021 -12791 -99574 -119757 -75444 -48127 -52950 -20045 14778 22521 42644
8192D2644J6931N5299m0134n338K1115j1957j6105J1720J0071m8803l9715m0376
$$ 42644 59575 114874 74740 69402 90517 78560 62455 74175 84246 35443 -4272 -44648
8180d4648L6418p596K8826m3469n7295K792L9445l3587K1282K441R9654j3276
$$ -44648 -8230 -15826 13000 -30469 -87764 -84972 -45527 -79114 -57832 -55391 44263 30987
8168C0987M1579L1416P354l8445m8169j1704K9549m843p3964R949k4917O099k981
$$ 30987 72566 103982 111336 72891 24722 13018 42567 37724 -36240 -26291 -51208 -45109 -48090
8155d8090k6436K2780J7353Q098Q813R6056l0887O068j3675j6102K6836N3547
$$ -48090 -74526 -51746 -34393 -26295 -17482 78574 47687 53755 40080 23978 50814 104361
8143A04361j9569j332j0006m4303k4610K729J7078K1680m3656P317K549n7390
$$ 104361 84792 83460 73454 29151 4541 7270 24348 46028 2372 9689 12238 -45152
8131d5152k4237m157K7333K536M7478O7409l0395j5450M2251k4964q5363j27599
$$ -45152 -69389 -73546 -46213 -43677 3801 71210 40815 25365 67616 42652 -42711 -170310
8119a70310O5146J45340N3952o0552o2782K2471N476m7933j2273l755P5216j5394
$$ -170310 -105164 40176 94128 33576 -29206 -6735 -1259 -49192 -61465 -65220 9996 -5398
8107e398m3782q57K9919k6930J1012j6418N7273L6524n1294J0169r934q1084J3087
$$ -5398 -49180 -50037 -20118 -47048 -36036 -52454 4819 41343 -9951 218 -9716 -90800 -77713
8094g7713j9911J3928J0220k3683N6342Q4604K2618p4450K8424P255N7564K0941
$$ -77713 -97624 -83696 -73476 -97159 -40817 43787 66405 -8045 20379 27634 85198 106139
8082A06139l8640o2765j6355k8627p0610N3601J11119L4805K0388q3041o5658
$$ 106139 67499 4734 -11621 -40248 -110858 -57257 53862 88667 109055 26014 -39644
8071c9644q8692j3612M7707l8598P1102R9711j4159n1886m3008p578K6276M9123
$$ -39644 -128336 -141948 -94241 -132839 -61737 37974 23815 -28071 -71079 -78657 -52381 -3258
8059c258j8107k2606j8105r638J5213N4815J8870N20o0379l9966p5010l5182O4590
$$ -3258 -21365 -43971 -62076 -71714 -56501 -1686 17184 17704 -42675 -82641 -157651 -192833 -128243
8046a28243Q3382K1962m9963j361M3863q408k7723k8932j1466M4429k0986j9097
$$ -128243 -44861 -22899 -72862 -74223 -30360 -38768 -66491 -95423 -106889 -62460 -83446 -102543
8034a02543M2431L4104O740k6714O1791J9810J8345K7132J9099J172m6740p127
$$ -102543 -60112 -26008 -19268 -45982 15809 35619 53964 81096 100195 101367 54627 47500
8022D7500k6485m2358N3912o6772j8469L0127R4115N7331J1322j0553j761l5091
$$ 47500 21015 -21343 32569 -34203 -52672 -22545 71570 128901 140223 129670 127909 92818
8010I2818l8917k7508m7455J1391Q7918r804j9248L876o7604o0909R999k2812
$$ 92818 53901 26393 -21062 -9671 78247 68443 49195 53071 -14533 -75442 -65443 -88255
7998h8255K2675J04025O2776m7609l8104K307K3758K6657p3893l334m840O3028
$$ -88255 -65580 38445 101221 53612 15508 17815 41573 68230 -5663 -8997 -13837 49191
7986D9191j189n9051o2467J9802l21k1813K2837M0107r170k9277j0851M7786Q724
$$ 49191 48002 -11049 -73516 -53714 -54035 -75848 -53011 -12904 -22074 -51351 -62202 -14416 -5692
7973e692P8794l0083p3569k3514L2455K9694o745J5380K9702M8580L4687K7696
$$ -5692 73102 43019 -30550 -54064 -21609 8085 1340 16720 46422 95002 129689 157385
7961A57385k0600l4466R005J6285L637J4216k0865P60o9583M222J2391J9528Q902
$$ 157385 136785 102319 111324 127609 131246 145462 124597 125357 55774 59996 72387 91915 100817
7948A00817r7624n3369K5149L0895L277K7431j4274j7286m862O3030j224L9829
$$ 100817 3193 -50176 -25027 5868 9145 36576 22302 5016 154 63184 61960 101789
7936A01789o0479m2079P5724N8431j7324p3197J6808J376n5760o362J6953k2769
$$ 101789 41310 -769 74955 133386 116062 42865 59673 61049 5289 -1073 15880 -6889
7924f889M6273Q544k2641l6381l2337M3827N5280j6479M3814J6217L8168l9063
$$ -6889 39384 47928 25287 -11094 -43431 396 55676 39197 83011 99228 137396 98333
7912I8333n3369k1644j7403K4482K4708n792n1947k9573j4776J0664Q007l1950
$$ 98333 44964 23320 5917 30399 55107 49315 -2632 -32205 -46981 -36317 -28310 -60260
7900f0260M0235l463K7566N2635o7085o433O8160L3885n0438O232j0641k7749
$$ -60260 -20025 -23488 4078 56713 -10372 -16805 51355 85240 34802 41034 30393 2644
7888B644m1809L7514n2384m6160L8743J09372n5397o2943K7792L2932L1326k0257
$$ 2644 -39165 -1651 -54035 -100195 -61452 47920 -7477 -70420 -42628 -9696 21630 1373
7876A373j2268K8621N9867L4447J3401k6995j01268k7868l0971j6791J9341N1341
$$ 1373 -10895 17726 77593 112040 125441 98446 -2822 -30690 -61661 -78452 -59111 -7770
7864g770J935j3065q9719q2072M3528K1004k83J0142m334L1091J417L2399K3224
$$ -7770 -5835 -18900 -108619 -190691 -147163 -126159 -126442 -116300 -120634 -89543 -88126 -55727 -32503
7851c2503k1298P1615K3026o872p7259R95J9932R627J9634N399p8446o373j1087
$$ -32503 -53801 17814 40840 33968 -43291 -42296 -22364 -12737 6897 12296 -66150 -72523 -83610
7838h3610O8871K3025j1316L6532J4658m2737Q6506M0856q1821n1738r8660k8105
$$ -83610 -14739 8286 -3030 33502 48160 5423 91929 132785 50964 -774 -99434 -127539
7826a27539l093M8854k0006M8201L7560K6608K5468L9283o9850m7578l909Q1798
$$ -127539 -130632 -81778 -101784 -53583 -16023 10585 36053 75336 5486 -42092 -46001 35797
7814C5797K5258l7995l3849O2327j393l975O942J0051k4639J7075K271q842m889
$$ 35797 61055 23060 -10789 51538 50145 46170 53112 63163 38524 55599 57870 49028 44139
7801D4139k0936J3852M0555l0337m1594J834k7584K5405m5055p0261O2898J7832
$$ 44139 23203 37055 77610 47273 5679 7513 -20071 5334 -39721 -109982 -47084 -29252
7789b9252M5180N4302k173m1987m121l1007j9306k4876n166m5169P263P5307M6353
$$ -29252 15928 70230 68057 26070 21949 -9058 -28364 -53240 -58406 -103575 -96312 -21005 25348
7776B5348L2823m0538q9430K2677K6834L0620p613n2652o224O9241J5333n501
$$ 25348 58171 17633 -71797 -49120 -22286 8334 721 -51931 -58155 11086 26419 20918
7764B0918M306n8672K133J00237K7328K278n8284m4110N2009k9355k5839O3772
$$ 20918 25224 -33448 -31315 68922 96250 98528 40244 -3866 48143 18788 -7051 56721
7752E6721J5678n623J3833m4772j6214n446J3969j8726N1131L445J6172n9376
$$ 56721 72399 66776 80609 35837 19623 14177 28146 9420 60551 63996 80168 20792
7740B0792p3041N5447L1136j9156o8505J1971L7179P5494L657L7674k6436q295
$$ 20792 -52249 3198 34334 15178 -53327 -41356 -4177 71317 74974 112648 86212 77917
7728G7917Q085k5001j9855l0169L1375O2551l4072n3874M0486O2205L3423J2881
$$ 77917 86002 61001 41146 10977 42352 104903 70831 16957 57443 119648 153071 165952
7716A65952l8280q1203k0660j4911l5220r620L4612J2172p9032J0478k1034J1193
$$ 165952 127672 46469 25809 10898 -24322 -33942 670 12842 -66190 -55712 -76746 -65553
7704f5553K6279o4509J3734L5343k3141k5629k8259N0050J349k8956o365M7780
$$ -65553 -39274 -103783 -90049 -54706 -77847 -103476 -131735 -81685 -80336 -109292 -115657 -67877
7692f7877L5897K838l5125K0491k6470M672N6773j1439j5406M7250n2529n6243
$$ -67877 -31980 -29142 -64267 -43776 -70246 -65574 -8801 -20240 -35646 11604 -40925 -97168
7680i7168K8235K1195m7947O879P7504M1277M2757O0234J2845l8535n844L6905
$$ -97168 -68933 -47738 -95685 -88806 -11302 29975 72732 132966 145811 107276 101432 138337
7668A38337Q142l1332n5144n8258k0986L6991K0731P5462K9955j9651m7498o4764
$$ 138337 146479 115147 60003 1745 -19241 17750 38481 113943 143898 124247 76749 11985
7656A1985l8357l4618j2159M0071j4980j7218q6809J119Q993P9302n6440m4923
$$ 11985 -26372 -60990 -73149 -33078 -48058 -65276 -152085 -150966 -141973 -62671 -119111 -164034
7644a64034O9956P0956L3901O676M0868M067n3918J0211m443K7324p376l2891
$$ -164034 -94078 -23122 10779 17455 58323 62390 8472 18683 14240 41564 34188 1297
7632A297o0546j9511J185O5025K8774j6863n196n884K7357m5708m0770M2795J2941
$$ 1297 -59249 -78760 -77575 -12550 16224 -639 -5835 -11719 15638 -30070 -70840 -28045 -15104
7619a5104J1290m2454M0753O24l8353M998o816N1937K7352K8695L0780j3695K404
$$ -15104 -3814 -46268 -5515 -4891 -43244 -38246 -45062 6875 34227 62922 93702 80007 82411
7606H2411j5284q9715m5484M3033L7788l8894j115K0529K2671p513o251J2616
$$ 82411 67127 -22588 -68072 -25039 12749 -26145 -27260 -6731 15940 8427 2176 14792
7594A4792j1000P2589p4557Q27j0413K0329J7262r580K3250K2811n087O857J3124
$$ 14792 3792 76381 1824 2651 -7762 12567 29829 20249 43499 66310 61223 68080 81204
7581H1204R669n444l2631m6194K976m3955l6659O125L2983K9262m7065o8390J7526
$$ 81204 90873 85429 52798 6604 9580 -34375 -71034 -64909 -31926 -2664 -49729 -118119 -100593
7568a00593L4329L5146M1462K9989r8901l9423k2931K4983N7568o9686l1518Q7213
$$ -100593 -66264 -31118 10344 40333 -58568 -97991 -120922 -95939 -38371 -108057 -139575 -52362
7556e2362K9897n952k2461J6219l2155J6780P4608M5905N553j3690j776o6570
$$ -52362 -22465 -28417 -50878 -34659 -66814 -50034 24574 70479 76032 62342 60566 -6004
7544f004o27L2872l0917J7382J2961j3058K331p9269j6549k7176O2906R3608p640
$$ -6004 -6631 26241 -4676 12706 25667 12609 14940 -64329 -80878 -108054 -45148 48460 40820
7531D0820n2197j1763n7847r504L1577K0225R037l6495n39K4398J3821M2417Q5247
$$ 40820 -11377 -23140 -80987 -90491 -58914 -38689 -29652 -66147 -66686 -42288 -28467 13950 99197
7518I9197k3317j17932r4028L6458J4919K838J1365N973J5755j8649L4791R4112
$$ 99197 75880 -42052 -136080 -99622 -84703 -81865 -70500 -64527 -48772 -67421 -32630 61482
7506F1482L3047j8853l8695n0918k0645O1510j7893j4826P880J0991l1858N52
$$ 61482 94529 75676 36981 -13937 -34582 26928 9035 -5791 2089 13080 -18778 -18226
7494a8226l7249K199k9544m8682q4960K1098J17187Q9996L1311l0561q5403L066
$$ -18226 -55475 -53276 -82820 -131502 -216462 -195364 -78177 11819 43130 12569 -72834 -69768
7482f9768j9730O764P0519J2122p800j5746p1692Q9465O7021L9759P2284l2833
$$ -69768 -89498 -82734 -12215 -93 -7893 -23639 -95331 -5866 61155 100914 173198 140365
7470A40365l5305l0685q7042J664k252m2666p7820j8746L6841j4183K0687K9085
$$ 140365 105060 74375 -12667 -11003 -13255 -55921 -133741 -152487 -115646 -129829 -109142 -80057
7458h0057N9579j0040k3778m341K8247l6103M0906n8236r027K5001R404r311L846
$$ -80057 -20478 -30518 -54296 -58637 -30390 -66493 -25587 -83823 -92850 -67849 -58445 -67756 -63910
7445f3910l77K8352N7831J2323n1375n1083L0173P4317J3659k4277O0695k9768
$$ -63910 -64287 -35935 21896 34219 -17156 -68239 -38066 36251 49910 25633 86328 56560
7433E6560p1536N28J157J5137J2402m7961r729O597K0789k6568J2478k0901Q442
$$ 56560 -14976 -14448 -13291 1846 14248 -33713 -43442 -36845 -16056 -42624 -30146 -51047 -42605
7420d2605l0390m5545J9601P0711L9941o68o4461j802L7506L1763O8514n3542
$$ -42605 -72995 -118540 -98939 -28228 11713 11045 -53416 -55218 -17712 14051 82565 29023
7408B9023k0392l4058l5933M0290J8614m7904o8816K6009K83N928N2245O417L2920
$$ 29023 8631 -25427 -61360 -21070 -2456 -50360 -119176 -93167 -92884 -86956 -34711 -28294 4626
7395D626P2952J3912o4395p0002K1774J7668K3822P655l6644j13422m3557M382
$$ 4626 77578 91490 27095 -42907 -21133 -3465 20357 28012 -8632 -122054 -165611 -161229
7383a61229N1397L0184k4073O7682J37277L3454r0043j00770M7768K6293j8704
$$ -161229 -109832 -79648 -103721 -36039 101238 134692 44649 -56121 -8353 17940 -764
7372g64J4882k6760n4858M950l4841K7307N88L92M3380j616m3852j7111K9005
$$ -764 14118 -12642 -67500 -62550 -97391 -70084 -69496 -69104 -25724 -27340 -71192 -88303 -59298
7359e9298m320J1461j6138M9604p241o1995l5823M8607L9366K7520O9132O2797
$$ -59298 -63618 -52157 -68295 -18691 -25932 -87927 -123750 -75143 -35777 -8257 60875 123672
7347A23672k4432o0844R14M6475l0081J732l8642K0872R366p8983n1223q954o18
$$ 123672 99240 38396 39310 85785 55704 57436 18794 39666 49032 -29951 -81174 -90128 -90746
7334i0746O5206P9882j9783k0481n8681m7684j5940M1226K1653Q9478K8637J7137
$$ -90746 -25540 54342 34559 14078 -44603 -92287 -108227 -67001 -45348 44130 72767 89904
7322H9904J2773l5485m0940n0168k6377O6354N232l0026p569L6726l0949o9064
$$ 89904 102677 67192 26252 -23916 -50293 16061 21293 -8733 -16302 20424 -10525 -79589
7310g9589J1967J25838k1192Q251K4088J6787l2470n506j1061K9910p6093m4727
$$ -79589 -67622 58216 37024 45275 69363 86150 53680 48174 37113 67023 -9070 -53797
7298e3797l3410O1186N1633K1268j6346K1265j0786k0111Q9860L577p9026o8843
$$ -53797 -87207 -26021 25612 46880 30534 51799 41013 20902 110762 114339 35313 -33530
7286c3530l217J3901k1318J8651K6482j6429j4438R769J0084J7451M1649K1869
$$ -33530 -36747 -22846 -44164 -25513 969 -15460 -29898 -20129 -10045 7406 49055 70924
7274G0924j6810O5254l613q3361l7543K0426k540j3564J8430O3748l0969n9572
$$ 70924 54114 119368 115755 32394 -5149 15277 12737 -827 17603 81351 50382 -9190
7262i190l845O0855K345l6927k9687l7742J9955l2409J8796K7323K0213N4341
$$ -9190 -13035 47820 50165 13238 -16449 -54191 -34236 -66645 -47849 -20526 -313 54028
7250E4028P2624q550o0535k4783l0264m8286K9292Q4532K0193l5784m0587q98
$$ 54028 126652 118102 57567 32784 2520 -45766 -16474 68058 88251 52467 11880 10982
7238A0982J3442P8591k6459r8088q899O145K2673k3158M6961P4066n6690m2379
$$ 10982 24424 103015 76556 -21532 -30431 -24286 -1613 -24771 22190 96256 39566 -2813
7226b813j765l0852o1732J7313R4321j1284K0621Q2635L3563j32805p4261J3114
$$ -2813 -4578 -35430 -97162 -79849 14472 3188 23809 106444 140007 7202 -67059 -53945
7214e3945J23164L2615o5174o1882j7790L9337j6158Q423J7385m4208L935K0788
$$ -53945 69219 101834 36660 -25222 -43012 -3675 -19833 -11410 5975 -38233 -34298 -13510
7202a3510l683l2739R671M0813K8356j0389k3858n0307M9602O0904M5918n1026
$$ -13510 -17193 -49932 -40261 552 28908 18519 -5339 -55646 -6044 54860 100778 49752
7190D9752m2208k9977M5365J1124L201p6689k4483L308j1797n0431O1792N9164
$$ 49752 7544 -22433 22932 34056 37257 -39432 -63915 -60607 -72404 -122835 -61043 -1879
7178a879k3500q1568J832M1904K1093K0207L0360l4529k458r316m48k2132k1519
$$ -1879 -25379 -106947 -105115 -63211 -42118 -21911 8449 -26080 -28538 -37854 -38302 -60434 -81953
7165h1953M7709R5756N2535k3592J9139p0202R7o0887o5201j061J4593o3497K1226
$$ -81953 -34244 61512 114047 90455 109594 39392 39489 -21398 -86599 -87660 -73067 -136564 -115338
7152a15338M4096O705J8183J5349J20098Q1002n2081n6479J2380l2625j0192j2541
$$ -115338 -71242 -64537 -46354 -31005 89093 170095 118014 61535 73915 41290 31098 18557
7140A8557M6344l946r0205n0076m6113K4353J5592k7317m2278P1322P7384J8425
$$ 18557 64901 60955 -29250 -79326 -125439 -101086 -85494 -112811 -155089 -83767 -6383 12042
7128A2042k7491o1995n7125j1007l5087j3299L3020R5650O4572J5219L3096J399
$$ 12042 -15449 -77444 -134569 -145576 -180663 -193962 -160942 -65292 -720 14499 47595 48994
7116D8994J4764K0279l8407m0057l2555n7049l5669k9449M5157J4205p425J7088
$$ 48994 63758 84037 45630 5573 -26982 -84031 -119700 -149149 -103992 -89787 -97212 -80124
7104h0124l5317j4153J394j4944L8966L0069M4384O2837J6401n4208j0850l1567
$$ -80124 -115441 -129594 -128200 -143144 -104178 -74109 -29725 33112 49513 -4695 -15545 -47112
7092d7112O879L1805P110n760Q224N7912m6169m7431p116l9690j846O1842o8358
$$ -47112 -40233 -8428 -1318 -7078 1146 59058 12889 -34542 -41658 -81348 -83194 -21352 -89710
7079h9710J1043N5303J863O857l5071j5566N9948K3463k7478j0283l3501k2214
$$ -89710 -78667 -23364 -21501 -14644 -49715 -65281 -5333 18130 -9348 -19631 -53132 -75346
7067g5346K4996k0064o3168J8370N2427j397r444K5896o321M3596K1924n0276
$$ -75346 -50350 -70414 -133582 -115212 -62785 -64182 -73626 -47730 -54051 -10455 11469 -38807
7055c8807j0365O6451q939m663L9064p4768p901M6405r534j9960L4430L3039j7334
$$ -38807 -49172 17279 8340 3677 42741 -32027 -39928 6477 -3057 -23017 11413 44452 27118
7042B7118n4485o984j7221j9089q540m9910n4492O8084J8329m2027O7006R7494
$$ 27118 -27367 -34351 -51572 -70661 -79201 -129111 -183603 -115519 -97190 -139217 -72211 25283
7030B5283L865j2373M99K6494P031m5063q569L919K0234j1388l7636K6853N4418
$$ 25283 29148 16775 17274 43768 50799 5736 -2833 1086 21320 9932 -27704 -851 53567
7017E3567j669k7758j734m5439r6129j3218Q4622J2309L9786M3643L6480L833
$$ 53567 51898 24140 22406 -23033 -119162 -132380 -47758 -35449 4337 47980 84460 88293
7005H8293L2237m218n9921k2719k8370n3060k1124m5782K1338Q504k961n76j8477
$$ 88293 120530 116312 56391 33672 5302 -47758 -68882 -114664 -93326 -84822 -87783 -88359 -106836
6992a06836M2955k8761o0033K9044K3573Q342k1342j2968L4674P6324L5208k477
$$ -106836 -63881 -92642 -152675 -123631 -100058 -91716 -113058 -126026 -91352 -15028 20180 17703
6980A7703m8855L36O9636K3126k6532j2512n7273o964m230k4288K3730J0663L3896
$$ 17703 -31152 -30816 38820 61946 35414 22902 -34371 -41335 -45565 -69853 -46123 -35460 -1564
6967a564O2848k2782p5717k7339O351n2708K1086k8144N9393j7573j8215L4116
$$ -1564 61284 38502 -37215 -64554 -58203 -110911 -89825 -117969 -58576 -76149 -94364 -60248
6955f0248L8758L1455R324m9132R898m4247m8818j6196l896L892j0840J22503
$$ -60248 -21490 9965 19289 -29843 -19945 -64192 -113010 -129206 -133102 -129210 -140050 -17547
6943a7547L7978j7571R423K2438l7632n0488K4292J8469n8575q8406l7410J00415
$$ -17547 20431 2860 12283 34721 -2911 -53399 -29107 -10638 -69213 -157619 -195029 -94614
6931i4614J3454p367l944O610J7559j0231q2520K6785L8877J494p3465m035P8053
$$ -94614 -81160 -88527 -92471 -85861 -68302 -78533 -161053 -134268 -95391 -93897 -167362 -171397 -93344
6918i3344P3964L8799L3541L2568k9386p2946k4997O8656O1528j7523p6201m5276
$$ -93344 -19380 19419 52960 85528 56142 -16804 -41801 26855 88383 70860 -5341 -50617
6906e0617K8444O204j2129K6051L8031l6288J7018N7151P7911k4599m3732o0733
$$ -50617 -22173 -15969 -28098 -2047 35984 -304 16714 73865 151776 127177 83445 22712
6894B2712J4585m509K7846k6566m5176K432P2769R543l2995p3750n4606l7244
$$ 22712 37297 32788 60634 34068 -11108 -8676 64093 73636 40641 -33109 -87715 -124959
6882a24959k3680J2276K2482Q1829M5686N5519J3831j65q669N706n9016j7856
$$ -124959 -148639 -136363 -113881 -32052 13634 69153 82984 82819 74150 79856 20840 2984
6870B984J11765l839K3688J417m6361j6172o2057l2166J2233L9823j1386j3975
$$ 2984 114749 110910 134598 136015 89654 73482 11425 -20741 -8508 31315 19929 5954
6858E954m1782N5851P5001J8076o3240j9006k4440l971J9113m02K9218m5572k3919
$$ 5954 -35828 20023 95024 113100 49860 30854 6414 2443 21556 21154 50372 4800 -19119
6845a9119J5509n1786L5884N1803l1222N2N000q953p694j5925o776j6984j3580
$$ -19119 -3610 -55396 -19512 32291 1069 1121 6121 -2832 -10526 -26451 -33227 -50211 -63791
6832f3791K1542m8234n5624j7026K7743R286K7653L4747P282L9264J1158m7645
$$ -63791 -42249 -90483 -146107 -163133 -135390 -126104 -98451 -63704 -56422 -17158 -6000 -53645
6820e3645K6602L6184m9290m215L0745j8262q179l2916L8243J7328q1290J8575
$$ -53645 -27043 9141 -40149 -44364 -13619 -31881 -40060 -72976 -34733 -17405 -98695 -80120
6808h0120J00783N823N890q815o2461l5877j0851L462k2492K1405N148O5414J8740
$$ -80120 20663 26486 32376 23561 -38900 -74777 -85628 -82166 -104658 -83253 -78105 -12691 6049
6795F049J148l9581q3108K1240P9703N9747l2327j9544J070J6601j5583k4292
$$ 6049 7197 -32384 -115492 -94252 -14549 45198 12871 -6673 -5603 10998 -4585 -28877
6783b8877j2318K5321k3709l5258J6548M4106k5144j1074j1239P5153j7810l6581
$$ -28877 -41195 -15874 -39583 -74841 -58293 -14187 -39331 -50405 -61644 13509 -4301 -40882
6771d0882O6162N3167k7092p109k1155M5918k2436l2763j0772M0516J8389N5915
$$ -40882 25280 78447 51355 44246 23091 69009 46573 13810 3038 43554 61943 117858
6759A17858j07583p0743O5801J3988n1308J982J5506p675M2376q598Q906j484
$$ 117858 10275 -60468 5333 19321 -31987 -30005 -14499 -22174 20202 11604 20510 19026
6747A9026l2078j7653P058J67J9753N4814K1062N1122P071k4676k8367n7322p2976
$$ 19026 -13052 -30705 -23647 -23480 -3727 51087 72149 123271 130342 105666 77299 19977 -52999
6734e2999j5856N7427J8109J9819m0745m4818j1883k4664j750J01237J9027k318
$$ -52999 -68855 -11428 6681 26500 -14245 -59063 -70946 -95610 -97360 3877 22904 20586
6722B0586l827q0120L5973N9893L111K3232M7635j4245P579j729n1002l6605L8100
$$ 20586 16759 -63361 -27388 32505 35616 58848 106483 92238 99817 98088 47086 10481 48581
6709D8581K81J1805m4358p2347K8688P5541K2264m5875l3936L5747j3963j03636
$$ 48581 48862 60667 16309 -56038 -27350 48191 70455 24580 -9356 26391 12428 -91208
6697i1208K0880k116k207K8131Q37k4017Q2853m281m5491k3440J2079l902k371
$$ -91208 -70328 -72444 -74651 -46520 -45683 -69700 13153 8872 -36619 -60059 -47980 -51882 -54253
6684e4253L0131M1132K6001L9405l1969n4472l9384n7129L1876K9004J4084j9448
$$ -54253 -24122 17010 43011 82416 50447 -4025 -43409 -100538 -68662 -39658 -25574 -45022
6672d5022J2820O1896K3735J9302k0574l9798o3573J0451L1311K2968P2177m0854
$$ -45022 -32202 29694 53429 72731 52157 12359 -51214 -40763 -9452 13516 85693 44839
6660D4839p9204L9116N6154o6555L6434k3253m782L6282l4358k1141J9412l4805
$$ 44839 -34365 4751 60905 -5650 30784 7531 2749 39031 4673 -16468 2944 -31861
6648c1861l7593P049L6665L8438L5071k9618m4641M821m6281k095j4148L9462
$$ -31861 -69454 -62405 -25740 12698 47769 18151 -26490 -21669 -67950 -70045 -84193 -44731
6636d4731M599M1479K834m9264n051O0381m2456K0155K2369j0613o5383n500m5102
$$ -44731 -40132 1347 4181 -45083 -50134 10247 -32209 -12054 10315 -298 -65681 -71181 -116283
6623a16283J8765N3758M2945P2238j6566K67K2169p6998l3489O144o3640j1773
$$ -116283 -97518 -43760 -815 71423 54857 55124 77293 295 -33194 -27050 -90690 -102463
6611a02463J17336m5453k1111N7668M3194m5023K3733J4493N8193n2882l6241
$$ -102463 14873 -30580 -51691 5977 49171 4148 27881 42374 100567 47685 11444
6600A1444l534n3761l3288N5087M7226l508k2180k8302k1799J882O8989N0654
$$ 11444 7910 -45851 -79139 -24052 23174 19666 -2514 -30816 -52615 -50733 18256 68910
6588F8910K3144l8681p1939l7511J3612J26641L1310M6315j6388p5872o5263p9359
$$ 68910 92054 53373 -18566 -56077 -42465 84176 115486 161801 145413 69541 4278 -75081
6576g5081J7916Q8512O7553n2552n3789L3318l643j8645o3748L898O8694L2452
$$ -75081 -57165 31347 98900 46348 -7441 25877 22234 3589 -60159 -56261 12433 44885
6564D4885m9808L2791k3030l9955r6077J6821O3888L3394L2929l6663j8385m3675
$$ 44885 -4923 27868 4838 -35117 -131194 -114373 -50485 -17091 15838 -20825 -39210 -82885
6552h2885J2412L2932J3808K7970L5582J1429k1414n6201J2966N9130p373p118
$$ -82885 -70473 -37541 -23733 4237 39819 51248 29834 -26367 -13401 45729 38356 31238
6540C1238K7609l3891O92K4015L4665j9168q6752j067L7700J9390J7625k4056
$$ 31238 58847 24956 25648 49663 84328 65160 -21592 -22659 15041 34431 52056 28000
6528B8000L309J0654m5950l8530j00o007L0769J8107K0033k299l9222k1313m5536
$$ 28000 31309 41963 -3987 -42517 -42617 -48624 -17855 252 20285 17986 -21236 -42549 -88085
6515h8085K0312j3705J3895O8211J8715J3349p7919K8619K6615k4205M6537M9820
$$ -88085 -67773 -81478 -67583 628 19343 32692 -45227 -16608 10007 -14198 32339 82159
6503H2159n9297p0347m6700r750k3086L9202N592P448L2166j970J2148l4406L0516
$$ 82159 22862 -47485 -94185 -103935 -127021 -87819 -82227 -74779 -42613 -44583 -32435 -66841 -36325
6490c6325p636k3317L6745P8179L7731k8800k8036K7214n1951n1199p8320q46
$$ -36325 -43961 -67278 -30533 47646 85377 56577 28541 55755 3804 -47395 -125715 -126561
6478a26561P6577P1711N8846r783j5933o622r4576L0191Q0385p794k1360k7424
$$ -126561 -49984 21727 80573 70790 54857 48235 -46341 -16150 64235 56441 35081 7657
6466G657o3304m3972J4115M1682J2028O687o622o6788L644N6253N2295L2487o6379
$$ 7657 -55647 -99619 -85504 -43822 -31794 -25107 -31729 -98517 -94873 -38620 13675 46162 -20217
6453b0217m6380r256m3079m9405J0972J8035J5879M85L3563N210M8198K4031n116
$$ -20217 -66597 -75853 -118932 -168337 -157365 -139330 -123451 -122966 -89403 -84193 -35995 -11964 -17080
6440a7080n1705j37965M2620Q1498j757J9682p6486P829O3220P190j2778K8192
$$ -17080 -68785 -206750 -164130 -82632 -84389 -64707 -141193 -133364 -70144 -62954 -75732 -47540
6428d7540K6182j4922L5876J10q2742o2513J03234r317J1991K9936k0677j9442
$$ -47540 -21358 -36280 -404 -294 -83036 -145549 -42315 -51632 -39641 -9705 -30382 -49824
6416d9824j2896k1539m6097n48M0937p1038l7967M6370O0296O2639K5651j1342
$$ -49824 -62720 -84259 -130356 -130904 -89967 -161005 -198972 -152602 -92306 -29667 -4016 -15358
6404a5358m3027M2365J7716q145r7159J259N8237J3568J3996K0660k5626M9689
$$ -15358 -58385 -16020 1696 -6449 -103608 -102349 -44112 -30544 -16548 4112 -21514 28175
6392B8175L3318j5527j9930J181k528o0887K2086K5779L0277J0475J00773L8509
$$ 28175 61493 45966 26036 27217 24689 -36198 -14112 11667 41944 52419 153192 191701
6380A91701n7393l6904q9559p8115K2550N3414N9140o4846k0331L7944L6725j2366
$$ 191701 134308 97404 7845 -70270 -47720 5694 64834 -12 -20343 17601 54326 41960
6368D1960o5525m8432P6117p8044o15J3994Q838K2102l0728m1257P1683K7105
$$ 41960 -23565 -71997 4120 -73924 -74539 -60545 -51707 -29605 -60333 -101590 -29907 -2802
6356b802j7252l8135m069L8571O5847K6704n2953M4992k6579l5803q5550m4286
$$ -2802 -20054 -58189 -62258 -23687 42160 68864 15911 60903 34324 -1479 -87029 -131315
6344a31315L4161M1080Q1278l0656n8117m573n3085j6586N4600P8376R437j3035
$$ -131315 -97154 -56074 25204 -5452 -63569 -68142 -121227 -137813 -83213 -4837 4600 -8435
6332h435N3756j3202J5242o5525n7448K1646L1181N945M1526l5506k8204K1517
$$ -8435 45321 32119 47361 -18164 -75612 -53966 -22785 -16840 24686 -10820 -39024 -17507
6320a7507m2390K1827O9660l9433l567l8127j6188k5736k3610J2580O305k2539
$$ -17507 -59897 -38070 31590 -7843 -11410 -49537 -65725 -91461 -115071 -102491 -96186 -118725
6308a18725q238L8784L7469q699O1500N8176m6910m4377J2520o029n4461K2808
$$ -118725 -126963 -88179 -50710 -59409 2091 60267 13357 -31020 -18500 -24529 -78990 -56182
6296e6182J661n6299k7332l5440M7233J03964L7803N3337J068m1177J4096k5355
$$ -56182 -54521 -110820 -138152 -173592 -126359 -22395 15408 68745 69813 28636 42732 17377
6284A7377L7211j3499k8199J2928K370m9260j0393j7140o2130K9411R0749O738
$$ 17377 54588 41089 12890 25818 28188 -21072 -31465 -48605 -110735 -81324 9425 16163
6272A6163k6477j9163O874j0547k3614q73K3779N1414n4345J3658P52L4690K1126
$$ 16163 -10314 -29477 -22603 -33150 -56764 -57637 -33858 17556 -36789 -23131 -22379 12311 33437
6259C3437l5892k3429o1974M2158k5454N933L1205L2230l9620q5085K0551N73
$$ 33437 -2455 -25884 -87858 -45700 -71154 -65221 -34016 -1786 -41406 -126491 -105940 -105367
6247a05367l6842P575R7003J9519k1219P046k2599k5120J2747L2984L4039P4528
$$ -105367 -142209 -134634 -37631 -18112 -39331 -32285 -54884 -80004 -67257 -34273 -234 74294
6235G4294m2886n2331K3425l5840j7334M803n2537J0112J00771L8599j8133j4083
$$ 74294 31408 -20923 2502 -33338 -50672 -45869 -98406 -88294 12477 51076 32943 18860
6223A8860o3901m9114J6515l6941j2706K9200N3818M9662p5437j1509R9625O355
$$ 18860 -45041 -94155 -77640 -114581 -127287 -98087 -44269 5393 -70044 -81553 18072 24427
6211B4427M8474M5353K819k7050n5604l4142K0874o785J9828o345p919L5070l6217
$$ 24427 72901 118254 121073 94023 38419 4277 25151 18366 38194 31849 23930 59000 22783
6198B2783j5964k6096O3465k4958p1643l4007k8717j2854P2239P5448m4608K7128
$$ 22783 6819 -19277 44188 19230 -52413 -86420 -115137 -127991 -55752 19696 -24912 2216
6186B216N6715j55k6465n1696p4832K0755N7170k5970l1907N7843N4596L9489
$$ 2216 58931 58776 32311 -19385 -94217 -73462 -16292 -42262 -74169 -16326 38270 77759
6174G7759K0367p1576O5621R2474L081k4554J5139n8100p0281k6997N429m529
$$ 77759 98126 26550 92171 184645 187726 163172 178311 120211 49930 22933 28362 23833
6162B3833p7003J1289L0418k753m3731K0945L2731K7859L3313r99J8938J0591
$$ 23833 -53170 -41881 -11463 -14216 -57947 -37002 -4271 23588 56901 55902 74840 85431
6150H5431N3795k4013n7290l4377o1400L9550M4800m1870n9131k3960M8005M8994
$$ 85431 139226 115213 57923 23546 -37854 1696 46496 4626 -54505 -78465 -30460 18534
6138A8534L7988k6904m2094J6535K3056K5120l1587P4463K0969k1664j43980l2612
$$ 18534 56522 29618 -12476 4059 27115 52235 20648 95111 116080 94416 -49564 -82176
6126h2176J4813J2127k2830k055K7097J904j0375J2077N2498M5666n9530l096
$$ -82176 -67363 -55236 -78066 -80121 -53024 -51120 -61495 -49418 3080 48746 -10784 -13880
6114a3880l6008O0567R923n2971p570L8605m4619l4601L3127k6130k3360m010
$$ -13880 -49888 10679 20602 -32369 -39939 -1334 -45953 -80554 -47427 -73557 -96917 -100927
6102a00927j2797k3880M6849J5357J231N9621O8276J5761K9901k5066k5745M9572
$$ -100927 -113724 -137604 -90755 -75398 -74167 -14546 53730 69491 99392 74326 48581 98153
6090I8153L5647n9207N6804N7914n0334lm2998J0559R267K6224m684j0917n3472
$$ 98153 133800 74593 131397 189311 138977 138974 95976 106535 115802 142026 137342 126425 72953
6077G2953k6761M575l2492L4004N8793k1187k5484j07380l2673J9634J8792M968
$$ 72953 46192 50767 18275 52279 111072 89885 64401 -42979 -75652 -56018 -37226 -32258
6065c2258o0728K0669J5252j5857K0652K6359q1367n5267J2515N6556N7050L2189
$$ -32258 -92986 -72317 -57065 -72922 -52270 -25911 -107278 -162545 -150030 -93474 -36424 -4235
6053d235j4979n8668L1194J15470N0461j17049q2930J520l3J1788J04122K4710
$$ -4235 -19214 -77882 -46688 68782 119243 2194 -80736 -79216 -79249 -67461 36661 61371
6041F1371m1334M684l0800o9306L2899k191k7762j3900M8674O425K6399O4566
$$ 61371 20037 24721 -6079 -75385 -42486 -44677 -72439 -86339 -37665 -31240 -4841 59725
6029E9725m2708n6646l0872O771L8787M9456q003j5836o0842k323L3386N5572
$$ 59725 17017 -39629 -70501 -63730 -24943 24513 16510 674 -60168 -62491 -29105 26467
6017B6467K0743J1288j7537k7316k5195J6310R1195m1487j07824m7547K1341l0485
$$ 26467 47210 58498 40961 13645 -11550 4760 95955 54468 -53356 -100903 -79562 -110047
6005a10047j3344p144K9667N0207m524O1075p413N7181m3396L169j4580j2764
$$ -110047 -123391 -130535 -100868 -50661 -55185 5890 -1523 55658 12262 15431 851 -11913
5993a1913L8062Q3338l9385n4136l5573k879O5256O9816j418m1500q7926j08150
$$ -11913 26149 109487 70102 15966 -19607 -22486 42770 112586 111168 69668 -18258 -126408
5981a26408m3950K0916j9537O753O0952M6274L2291K9794j3175N6256K7145p435
$$ -126408 -170358 -149442 -168979 -162226 -101274 -55000 -22709 7085 -6090 50166 77311 69876
5969F9876n3779J1020k6403l9613Q1135p3466p2604M5383q640Q923R933P576k5565
$$ 69876 16097 27117 714 -38899 42236 -31230 -103834 -58451 -67091 -58168 -48235 -40659 -66224
5956f6224k1928J9602N7264J8387j6191l5170l9429N8899J01465K0039k02m5862
$$ -66224 -88152 -68550 -11286 7101 -9090 -44260 -83689 -24790 76675 96714 96512 50650
5944E0650m2832m692O40j8962J4211M4036p3924r5590m4027L1314L1052K0429
$$ 50650 7818 3126 3766 -15196 -985 43051 -30873 -126463 -170490 -139176 -108124 -87695
5932h7695J1683k1070K3391J0707k9570j05989k5829N7304L0440K0191O072K041
$$ -87695 -76012 -97082 -73691 -62984 -92554 -198543 -224372 -167068 -136628 -116437 -110365 -108324
5920a08324P8394K7119o4984J0369J9600L4662k6501k3774j9243K8651K7408J435
$$ -108324 -29930 -2811 -67795 -57426 -37826 -3164 -29665 -53439 -72682 -44031 -16623 -15188
5908a5188L4343p668j700p3501m5471K0946J0979K9490J5140j1799k092l2801
$$ -15188 19155 11487 9787 -63714 -109185 -88239 -77260 -47770 -32630 -44429 -46521 -79322
5896g9322j6247k540j9219l452N1631J04562n5485o7229J4645M1737k2009N7152
$$ -79322 -95569 -98109 -117328 -120780 -69149 35413 -20072 -87301 -72656 -30919 -52928 4224
5884D224m1750q852n117m6690j2915J01401L0383l674m3956k3155Q2905N350k555
$$ 4224 -37526 -46378 -51495 -98185 -111100 -9699 20684 17010 -26946 -50101 32804 38154 35599
5871C5599o4313l8171n459P2360M7330J2815j1317J2851n4633q3005O208n1m0255
$$ 35599 -28714 -66885 -72344 16 47346 60161 48844 61695 7062 -75943 -69735 -69786 -110041
5858a10041J6570P2028M5433M1509n8140r3190l0778Q0630K9724J9513l2518N9115
$$ -110041 -93471 -21443 23990 65499 7359 -85831 -116609 -35979 -6255 13258 -19260 39855
5846C9855L7669l978k6782k3425M4398K1837l9776k2931l8224k5396J6226K4239
$$ 39855 77524 73546 46764 23339 67737 89574 49798 26867 -11357 -36753 -20527 3712
5834C712N2054P0539l4580o9781n2977Q327l1903l759J1967J3048j913j5462O4432
$$ 3712 55766 126305 91725 21944 -31033 -22706 -54609 -58368 -46401 -33353 -35266 -50728 13704
5821A3704L1438l8426k7432J2342k1729N767o7850r350M3024N397j6386n559l542
$$ 13704 45142 6716 -20716 -8374 -30103 -24336 -92186 -101536 -58512 -53115 -69501 -75060 -78602
5808g8602L8297k2871m1324L5859P0780j4054L3l6583j8083N5431P1608j3699
$$ -78602 -40305 -63176 -104500 -68641 2139 -11915 -11882 -48465 -66548 -11117 60491 46792
5796D6792m3013j8171q280l4087m2841K7637O8069k2548J2552N6028o325o572
$$ 46792 3779 -14392 -22672 -56759 -99600 -71963 -3894 -26442 -13890 42138 35813 29241
5784B9241J1555K2451k3991n7950N131q44k3820K2254K3385q068R290p0j0872
$$ 29241 40796 63247 39256 -18694 -13563 -14407 -38227 -15973 7412 -656 8634 8564 -2308
5771b308m7480l3038j5292R664O9292P1357m0743o2424P451J1085l3199J2374
$$ -2308 -49788 -82826 -98118 -88454 -19162 52195 11452 -50972 -43521 -32436 -65635 -53261
5759e3261K1552o492K204L933k0738O2191M2520L9629m957p0188r0388k446K2038
$$ -53261 -31709 -38201 -35997 -32064 -52802 9389 51909 91538 86581 16393 -73995 -76441 -54403
5746e4403O5200R823K668k6628k5314N4828M395j1235L6517m4671J8265J2693
$$ -54403 10797 20620 23288 -3340 -28654 26174 30569 19334 55851 11180 29445 42138
5734D2138o311J4646m6010o7981j5521K9461k8740q004R7219k7527j6628O531
$$ 42138 35827 50473 4463 -63518 -79039 -49578 -78318 -86322 10897 -16630 -33258 -26727
5722b6727K3638m2432J2154j9064J6158K6486K4952r082Q2524o62n9297l0901
$$ -26727 -3089 -45521 -33367 -52431 -36273 -9787 15165 6083 88607 87945 28648 -2253
5710b253p1064l2148m3866O9730M3753K7680L6370P846k1030P9061L069m1387
$$ -2253 -73317 -105465 -149331 -79601 -35848 -8168 28202 36048 15018 94079 97148 55761
5698E5761p1960m4516k170k2329r661R934m41K3523L4145K4942R747k9482N339
$$ 55761 -16199 -60715 -62885 -85214 -94875 -84941 -85382 -61859 -27714 -2772 6975 -22507 -17168
5685a7168k6507n4900o5796J9980K8011o148K6443O759J0365M4408K7990M6735
$$ -17168 -43675 -98575 -164371 -144391 -116380 -122528 -96085 -89326 -78961 -34553 -6563 40172
5673D0172J1511J4979n2773J9384k5880n1485l6063O6879N3211l9818j4104M325
$$ 40172 51683 66662 13889 33273 7393 -44092 -80155 -13276 39935 117 -13987 -9662
5661i662P116J300q160K6634P3926q7022m1167m0748K9175M8933j678j4644k9778
$$ -9662 -2546 -1246 -9406 17228 91154 4132 -37035 -77783 -48608 325 -1353 -15997 -45775
5648d5775k2514K3431P2627M3338O811l0560K687R414K0497k5209k5450l5150
$$ -45775 -68289 -44858 27769 71107 77918 47358 50045 59459 79956 54747 29297 -5853
5636e853N3531L2660o6316j7348k0179J5631l1656K5372k0307q9572p5696M8495
$$ -5853 47678 80338 14022 -3326 -23505 -7874 -39530 -14158 -34465 -124037 -199733 -151238
5624a51238L3606J2866N4949m531l0096M660P2590m8751K4503P1775M9498o806
$$ -151238 -117632 -104766 -49817 -54348 -84444 -79784 -7194 -55945 -31442 40333 89831 83025
5612H3025p6036j512N0773J4360n98l7230l1957N3511o4027N4596N7228o030n6108
$$ 83025 6989 5477 56250 70610 70012 32782 825 54336 -9691 44905 102133 96103 39995
5599C9995q2247l7579K1395L1118l0325n816L0139o4699m0892J9998J6008J0169
$$ 39995 -42252 -79831 -58436 -27318 -57643 -63459 -33320 -98019 -138911 -118913 -102905 -92736
5587i2736n890O0230N6335j1214k1040r349m7765k4014j4982N0721P2229P8620
$$ -92736 -98626 -38396 17939 6725 -14315 -23664 -71429 -95443 -110425 -59704 12525 91145
5575I1145l8296m1973l3228q9859l9179N7890K6737L9555K6339Q4942J10725J441
$$ 91145 52849 10876 -22352 -112211 -151390 -93500 -66763 -27208 -869 84073 194798 196239
5563A96239n5281k5121n5493j4742L55L3630n1737m1777l2604K5795L2710O70
$$ 196239 140958 115837 60344 45602 45957 79587 27850 -13927 -46531 -20736 11974 12644
5551A2644n7775m209o4531L9113M2821R2035J7935o0650o3881j6319M6731K3053
$$ 12644 -45131 -49340 -113871 -74758 -31937 60098 78033 17383 -46498 -62817 -16086 6967
5539F967M181L896j5073j391m9891m7357L3489M2707k4154J9236N4302j6762k649
$$ 6967 11148 15044 -29 -1420 -51311 -98668 -65179 -22472 -46626 -27390 26912 10150 7501
5526G501J5907k3156L7489M1327o5084n0594m9504j0377j6923L5799N3268J21372
$$ 7501 23408 252 37741 79068 13984 -36610 -86114 -96491 -113414 -77615 -24347 97025
5514I7025P9099m2481q8961o2790M3341R279n2076j0384o5133J4987P7343M1697
$$ 97025 176124 133643 44682 -18108 25233 34512 -17564 -27948 -93081 -78094 -751 40946
5502D0946L9806l5458j9047k8933j6372q1394k285J3503n2170O4581J10076o267
$$ 40946 80752 45294 26247 -2686 -19058 -100452 -102737 -89234 -141404 -76823 33253 26986
5490B6986k8145L0950K7829n6984j3649l5255m041J6641Q2237J6373K098j3077
$$ 26986 -1159 29791 57620 636 -13013 -48268 -52309 -35668 46569 62942 65040 51963
5478E1963k7096n0048o1158K6889J48390L8703o6897p4901L6900l4197N6395k4103
$$ 51963 24867 -25181 -86339 -59450 88940 127643 60746 -14155 22745 -11452 44943 20840
5466B0840j00316M7576J00983M3623K1231l2755n6399m4566j9511r940l3724j2056
$$ 20840 -79476 -31900 69083 112706 133937 101182 44783 217 -19294 -29234 -62958 -75014
5454g5014M2596M5721o1833j60k2254j08203J3045J05853M8997K318p292M9622
$$ -75014 -32418 13303 -48530 -48690 -70944 -179147 -166102 -60249 -11252 -8934 -16226 33396
5442C3396j5748K2282K3707r976l2395j10079R667J7422P698j29o1791r983M1926
$$ 33396 17648 39930 63637 53661 21266 -88813 -79146 -61724 -54026 -54155 -115946 -125929 -84003
5429h4003O4501o05J4084j4693K41k1755O2343O4729k0411l1818n0780n948L5326
$$ -84003 -19502 -20107 -6023 -20716 -20475 -42230 20113 84842 64431 32613 -18167 -24115 11211
5416A1211L3816P123J2538J0579m493j15981K5276J03615k9059p9157n7302q087
$$ 11211 45027 52150 64688 75267 70774 -45207 -19931 83684 54625 -24532 -81834 -89921
5404h9921P0649J6253m6579K2181j2985m237j7480M31j1298k7213N6427K1954
$$ -89921 -19272 -3019 -49598 -27417 -40402 -44639 -62119 -61688 -72986 -100199 -43772 -21818
5392b1818N229j6481p4006K7253M9449M8525j0762m4070M2924N5700j6954n8020
$$ -21818 -16589 -33070 -107076 -79823 -30374 18151 7389 -36681 6243 61943 44989 -13031
5380a3031K862M3642j6869J1583K0017N5500l8281n1704o9978j59J1347j2479
$$ -13031 -10169 33473 16604 28187 48204 103704 65423 13719 -56259 -56418 -45071 -57550
5368e7550M2554M4567k0916M5628M3254o0352o8935j740j2746j7682J0650R4914
$$ -57550 -14996 29571 8655 54283 97537 37185 -31750 -33490 -46236 -63918 -53268 41646
5356D1646N0500o2891o8430q051M0421l2798l7156J6317M3458n97j5112p2589
$$ 41646 92146 29255 -39175 -47226 -6805 -39603 -76759 -60442 -16984 -17581 -32693 -105282
5344a05282M4176L881k980j8191R2523J6816l9196J5242O3553K6057o5744r2153
$$ -105282 -61106 -57225 -60205 -78396 14127 30943 -8253 6989 70542 96599 30855 -61298
5332f1298m6989Q1046L2815j2981r796P036L7632M6626O6021k4522j6258k0359
$$ -61298 -108287 -27241 5574 -7407 -17203 -10167 27465 74091 140112 115590 99332 78973
5320G8973k806o9277m2374n822j111J6438N0581m3903J2237J1655k2562m5337
$$ 78973 76167 6890 -35484 -41306 -42417 -25979 24602 -19301 -7064 4591 -17971 -63308
5308f3308M2106Q520l9997K4356M9177L6956j0546M208l9954j9602L8953l800
$$ -63308 -21202 -12682 -52679 -28323 20854 57810 47264 51472 11518 -8084 30869 27069
5296B7069k9325p6140J0160J05946P1505M3878r7491r0120L3400l7268l9729p665
$$ 27069 -2256 -78396 -68236 37710 109215 153093 55602 -34518 -1118 -38386 -78115 -85780
5284h5780l918P450M6595K1063J8023M6484J0738j7625j5729l8756m8877r8510
$$ -85780 -89698 -82248 -35653 -14590 3433 49917 60655 43030 27301 -11455 -60332 -158842
5272a58842j629Q4804R277k5586J1439K7007N1823P1403r3134l6074Q3581K1707
$$ -158842 -160471 -75667 -66390 -91976 -80537 -53530 -1707 69696 -23438 -59512 24069 45776
5260D5776m5295J207J7122l1364l1444J564j3105k379K174J9346n5387n7764j7222
$$ 45776 481 1688 18810 -12554 -43998 -42434 -55539 -57918 -55744 -36398 -91785 -149549 -166771
5247a66771J9524R8810M7070j6345k7481K4870L3116j3048J1114o5273J034K6090
$$ -166771 -147247 -48437 -1367 -17712 -45193 -20323 12793 -255 10859 -54414 -53380 -27290
5235b7290L1030L1474J2575n0753l0864m443J5660k8583k7490J275J7968n2989
$$ -27290 3740 35214 47789 -2964 -33828 -38271 -22611 -51194 -78684 -77409 -59441 -112430
5223a12430P8763j0641k0875l659J011M4819L1260m6671j4424N34k0041J6147
$$ -112430 -33667 -44308 -65183 -68842 -67831 -23012 8248 -38423 -52847 -52313 -72354 -56207
5211e6207N7494P0109n4596o1310K2579J2552k9165l8374p099J7874N071j7117
$$ -56207 1287 71396 16800 -44510 -21931 -9379 -38544 -76918 -84017 -66143 -61072 -78189
5199g8189Q108k0873M119j4217K3416k473l2994m0299L5387J02797Q3252o33n2456
$$ -78189 -70081 -90954 -86835 -101052 -77636 -80109 -113103 -153402 -118015 -15218 68034 67401 14945
5186A4945p8282O97O713k6844Q621O1290k3118L1557M0319N0077l325n7250k0176
$$ 14945 -63337 -62640 -55927 -82771 -74150 -12860 -35978 -4421 35898 85975 82650 25400 5224
5173E224J6327J5072n7577N7053l8361O7049K5230j0566K3950j13427r2950K6063
$$ 5224 21551 36623 -20954 36099 -2262 64787 90017 79451 103401 -10026 -102976 -76913
5161g6913P0416P8816m9171n0111l1708L2322O3680O141p623J4942j6979J3217
$$ -76913 -6497 72319 23148 -26963 -58671 -26349 37331 43472 35849 50791 33812 47029
5149D7029n7513m2775j8836O334j791K6694n8172J0411q785M19Q396M1324J8939
$$ 47029 -10484 -53259 -72095 -65761 -67552 -40858 -99030 -88619 -97404 -96985 -88589 -47265 -28326
5136b8326k9655M4979o998j7319m8732J5040j0032n119M3346j8184o9863M3872
$$ -28326 -57981 -13002 -20000 -37319 -86051 -71011 -81043 -86162 -42816 -61000 -130863 -86991
5124h6991L9421R9318J0613j9784l7255r975j9643K8162m4942o2671l693P8378
$$ -86991 -47570 51748 62361 42577 5322 -4653 -24296 3866 -41076 -103747 -107440 -29062
5112b9062J29067k542m9588O214l2363k7013j7229K0345P4588L05m0584J2635
$$ -29062 100005 97463 47875 54089 21726 -5287 -22516 -2171 72417 72722 32138 44773
5100D4773M423j5363k3788m4500q451k6849p7822j8691O0412M2568J7467j7059
$$ 44773 49196 33833 10045 -34455 -42906 -69755 -147577 -166268 -105856 -63288 -45821 -62880
5088f2880J2923M4314k5162j4452k7301K4503K5203n718m6948l7006L0039K7553
$$ -62880 -49957 -5643 -30805 -45257 -72558 -48055 -22852 -28570 -75518 -112524 -82485 -54932
5076e4932J3540j08732K4391M5847p933J549N3870k2906Q768N2227l2483n5078
$$ -54932 -41392 -150124 -125733 -79886 -87819 -86270 -32400 -55306 -46538 5689 -26794 -81872
5064h1872N6528O3661j2788o5263r076J0882m213j525L574J8774m5376l8596j8833
$$ -81872 -25344 38317 25529 -39734 -48810 -37928 -42141 -43666 -40092 -21318 -66694 -105290 -124123
5051a24123O9576P0778M6609J9932o3851j12957k2631N3820Q1159j0524J46j4510
$$ -124123 -54547 16231 62840 82772 18921 -94036 -116667 -62847 18312 7788 7934 -6576
5039f576K6829L9429l6625m4653L8170M9476L8598J4834j4241m6259r5039m0445
$$ -6576 20253 59682 23057 -21596 16574 66050 104648 119482 105241 58982 -36057 -76502
5027g6502m6043l280M2580M2210Q790l1387q785l460M412Q2453J1233k0626p5049
$$ -76502 -122545 -125825 -83245 -41035 -32245 -63632 -72417 -75877 -71465 10988 22221 1595 -73454
5014g3454j9737j2340N9007N7593j8723O1345j6191k7827n5119j5558j0174J8533
$$ -73454 -93191 -105531 -46524 11069 -7654 53691 37500 9673 -45446 -61004 -71178 -52645
5002e2645J37811K0516j01568o7102k9171K1685j4610O0362j0984L5322R169m5859
$$ -52645 85166 105682 4114 -62988 -92159 -70474 -85084 -24722 -35706 -384 8785 -37074
4990c7074M640K9825j1377o5447n74l425N5455R598r690o0918j5316L622N0840
$$ -37074 -32434 -2609 -13986 -79433 -80007 -83432 -27977 -18379 -28069 -88987 -104303 -100681 -49841
$$ [...]
##END NTUPLES=NMR SPECTRUM
##END=
