##TITLE=Analysis number 329370
Compound Code cc 14902
Book Reference 513/123/21
Project Code adrs
Chemist Name ronp
##JCAMPDX= 6.0         $$ Bruker NMR JCAMP-DX V2.0
##DATA TYPE= NMR SPECTRUM
##DATA CLASS= NTUPLES
##ORIGIN= Bruker BioSpin GmbH
##OWNER= nmr
$$ XWIN-NMR		Version 3.5
$$ Thu Aug 23 12:11:05 2007 GMT Daylight Time (UT+1h)  MAYBRIDGE\nmr@NMR_250MHZ
##.OBSERVE FREQUENCY= 250.131544655141
##.OBSERVE NUCLEUS= ^1H
##.ACQUISITION MODE= SIMULTANEOUS (DQD)
##.ACQUISITION SCHEME= undefined
##.AVERAGES= 16
##.DIGITISER RES= 18
##SPECTROMETER/DATA SYSTEM= dpx250
##.PULSE SEQUENCE= zg30
##.SOLVENT NAME= CDCl3
##.SHIFT REFERENCE= (INTERNAL, CDCl3, 0, 16.4488)
##AUDIT TRAIL= $$ (NUMBER, WHEN, WHO, WHERE, WHAT)
$$ ##TITLE= Audit trail, XWIN-NMR		Version 3.5
$$ ##JCAMPDX= 5.01
$$ ##ORIGIN= Bruker BioSpin GmbH
$$ ##OWNER= nmr
$$ C:\u/data/dgb/nmr/ADRS/1060/pdata/1/auditp.txt
$$ ##AUDIT TRAIL=  $$ (NUMBER, WHEN, WHO, WHERE, WHAT)
(   1,<2007-08-23 12:09:49.25 +100>,<MAYBRIDGE\nmr>,<NMR_250MHZ>,
      <created by zg, POWCHK disabled, PULCHK disabled
       configuration hash MD5:
       76 6E 9A 78 1E 09 19 81 EC 84 63 8F B0 6A 59 2D
       data hash MD5: 64K
       71 94 21 B5 A1 D8 A0 87 8A C1 D9 3D 67 94 BB D8>)
(   2,<2007-08-23 12:10:15.75 +100>,<MAYBRIDGE\nmr>,<NMR_250MHZ>,
      <Start of raw data processing
       ef LB = 0.3 FT_mod = 6 PKNL = 1 SI = 32K 
       data hash MD5: 32K
       2A 8D FD A9 29 F4 3E 91 09 EB 29 A3 46 DB 4E 33>)
(   3,<2007-08-23 12:10:21.07 +100>,<MAYBRIDGE\nmr>,<NMR_250MHZ>,
      <apk 
       data hash MD5: 32K
       DC C1 A3 C8 03 3B 27 B3 F4 39 30 65 D6 03 2B 96>)
(   4,<2007-08-23 12:10:30.64 +100>,<MAYBRIDGE\nmr>,<NMR_250MHZ>,
      <abs ABSG = 5 
       data hash MD5: 32K
       4E 85 41 F3 4F C2 C7 CB C7 53 27 0F 1F 1B 7D D9>)
$$ ##END=
$$ 
$$ hash MD5
$$ 77 47 FD 07 5B 8B A5 C0 F5 3E 23 B4 B6 99 92 4F
##$RELAX= 
##$RELAX= 
##$RELAX= 
##$RELAX= 
##$RELAX= 
##$RELAX= 
##$RELAX= 
$$ Bruker specific parameters
$$ --------------------------
##$DU= <C:\u>
##$EXPNO= 1060
##$NAME= <ADRS>
##$PROCNO= 1
##$TYPE= <nmr>
##$USER= <dgb>
##$AMP= (0..31)
100 100 100 100 100 100 100 100 100 100 100 100 100 100 100 100 100 100 
100 100 100 100 100 100 100 100 100 100 100 100 100 100 
##$AQSEQ= 0
##$AQ_mod= 3
##$AUNM= <au_zg>
##$AUTOPOS= <6 >
##$BF1= 250.13
##$BF2= 250.13
##$BF3= 250.13
##$BF4= 250.13
##$BF5= 500.13
##$BF6= 500.13
##$BF7= 500.13
##$BF8= 500.13
##$BYTORDA= 1
##$CFDGTYP= 0
##$CFRGTYP= 5
##$CHEMSTR= <none>
##$CNST= (0..31)
1 1 145 1 1 1 1 1 1 1 1 1 1 1 1 1 1 1 1 1 1 1 1 1 1 1 1 1 1 1 1 1 
##$CPDPRG= <>
##$CPDPRG1= <>
##$CPDPRG2= <>
##$CPDPRG3= <>
##$CPDPRG4= <mlev>
##$CPDPRG5= <mlev>
##$CPDPRG6= <mlev>
##$CPDPRG7= <mlev>
##$CPDPRG8= <mlev>
##$CPDPRGB= <>
##$CPDPRGT= <>
##$D= (0..31)
0 1 0 0 0 0 0 0 0 0.06 0 0 0 0 0 0 0.0002 0 0 0 0 0 0 0 0 0 0 0 0 0 0 
0 
##$DATE= 1187867386
##$DBL= (0..7)
120 120 120 120 120 120 120 120 
##$DBP= (0..7)
150 150 150 150 150 150 150 150 
##$DBP07= 0
##$DBPNAM0= <>
##$DBPNAM1= <>
$$ [...]
##$SUBNAM7= <"">
##$SUBNAM8= <"">
##$SUBNAM9= <"">
##$SW= 20.6930455092707
##$SWIBOX= (0..15)
0 0 3 0 0 0 0 0 0 0 0 0 0 0 0 0 
##$SW_h= 5175.983436853
##$TD= 65536
##$TD0= 1
##$TE= 296.16
##$TE2= 300
##$TE3= 300
##$TEG= 300
##$TL= (0..7)
0 120 120 120 120 120 120 120 
##$TP= (0..7)
150 150 150 150 150 150 150 150 
##$TP07= 0
##$TPNAME0= <>
##$TPNAME1= <>
##$TPNAME2= <>
##$TPNAME3= <>
##$TPNAME4= <>
##$TPNAME5= <>
##$TPNAME6= <>
##$TPNAME7= <>
##$TPOAL= (0..7)
0.5 0.5 0.5 0.5 0.5 0.5 0.5 0.5 
##$TPOFFS= (0..7)
0 0 0 0 0 0 0 0 
##$TUNHIN= 0
##$TUNHOUT= 0
##$TUNXOUT= 0
##$USERA1= <user>
##$USERA2= <user>
##$USERA3= <user>
##$USERA4= <user>
##$USERA5= <user>
##$V9= 5
##$VALIST= <valist>
##$VCLIST= <CCCCCCCCCCCCCCC>
##$VD= 0
##$VDLIST= <DDDDDDDDDDDDDDD>
##$VPLIST= <PPPPPPPPPPPPPPP>
##$VTLIST= <TTTTTTTTTTTTTTT>
##$WBST= 1024
##$WBSW= 4
##$XGAIN= (0..3)
0 0 0 0 
##$XL= 0
##$YL= 0
##$YMAX_a= 230351
##$YMIN_a= -146871
##$ZGOPTNS= <>
##$ZL1= 120
##$ZL2= 120
##$ZL3= 120
##$ZL4= 120
##$ABSF1= 16.44884
##$ABSF2= -4.244333
##$ABSG= 5
##$ABSL= 3
##$ALPHA= 0
##$AQORDER= 0
##$ASSFAC= 0
##$ASSFACI= 0
##$ASSFACX= 0
##$ASSWID= 0
##$AUNMP= <proc_1d>
##$AZFE= 0.1
##$AZFW= 0.1
##$BCFW= 0
##$BC_mod= 0
##$BYTORDP= 0
##$COROFFS= 0
##$CY= 12.5
##$DATMOD= 1
##$DC= 0
##$DFILT= <>
##$DTYPP= 0
##$F1P= 14.0000005364418
##$F2P= -0.99999901652339
##$FCOR= 0.5
##$FTSIZE= 32768
##$FT_mod= 6
##$GAMMA= 0
##$GB= 0
##$INTBC= 1
##$INTSCL= 1
##$ISEN= 128
##$LB= 0.3
##$LEV0= 0
##$LPBIN= 0
##$MAXI= 10000
##$MC2= 0
##$MEAN= 0
##$ME_mod= 0
##$MI= 0
##$NCOEF= 0
##$NC_proc= -4
##$NLEV= 6
##$NOISF1= 0
##$NOISF2= 0
##$NSP= 0
##$NTH_PI= 0
##$NZP= 0
##$OFFSET= 16.44884
##$PC= 1
##$PHC0= -39.55009
##$PHC1= 9.480462
##$PH_mod= 1
##$PKNL= yes
##$PPARMOD= 0
##$PSCAL= 4
##$PSIGN= 0
##$REVERSE= no
##$SF= 250.130018297309
##$SI= 32768
##$SIGF1= 0
##$SIGF2= 0
##$SINO= 400
##$SIOLD= 32768
##$SREGLST= <1H.CDCl3>
##$SSB= 0
##$STSI= 32768
##$STSR= 0
##$SW_p= 5175.98343685301
##$SYMM= 0
##$S_DEV= 0
##$TDeff= 65536
##$TDoff= 0
##$TI= <Analysis number 999999
Compound Code 99
Book Reference 9
Project Code 9>
##$TILT= no
##$TM1= 0
##$TM2= 0
##$TOPLEV= 0
##$USERP1= <user>
##$USERP2= <user>
##$USERP3= <user>
##$USERP4= <user>
##$USERP5= <user>
##$WDW= 1
##$XDIM= 32768
##$YMAX_p= 401785306
##$YMIN_p= -446056
$$ End of Bruker specific parameters
$$ ---------------------------------
##NTUPLES= NMR SPECTRUM
##VAR_NAME=  FREQUENCY,     SPECTRUM/REAL,   SPECTRUM/IMAG
##SYMBOL=    X,             R,               I
##VAR_TYPE=  INDEPENDENT,   DEPENDENT,       DEPENDENT
##VAR_FORM=  AFFN,          ASDF,            ASDF
##VAR_DIM=   32768,         32768,           32768
##UNITS=     HZ,            ARBITRARY UNITS, ARBITRARY UNITS
##FACTOR=    0.157963299565203, 1,           1
##FIRST=     4114.3484469694, 0,             0
##LAST=      -1061.63498988361, 0,           0
##MIN=       -1061.63498988361, -446056,     0
##MAX=       4114.3484469694, 401785306,     0
$$ Real data points
##PAGE= N=1
##DATA TABLE= (X++(R..R)), XYDATA
$$ [...]
$$ plain form
16337 -60152 -178228 -239063 -175580 -59909 -33640 -111086 -24077 2561 -34365 17058 49372
16326 49372 134040 -31927 -119186 -170764 -153754 -104020 -93889 -145909 -108201 -147824 -125736
16315 -125736 -49492 -36824 -74179 -89862 45827 34276 -44247 -1052 -20243 -32261 -20584
16304 -20584 -22327 -96145 -241994 -192855 -120988 -155026 -205291 -105615 -41650 -87067 -156644 -83210
16292 -83210 -138073 -116535 -104146 -144916 -80322 -70105 -67147 -142470 -115656 -25974 1719 42006
16280 42006 155496 223099 261046 113673 -107858 -224918 -164045 -89380 -36503 9955 17
16269 17 -45604 -95559 -145400 -89850 -94418 -170043 -99325 -58545 -52648 15253 -41077 -170779
16257 -170779 -90369 74038 147780 44410 -27321 32802 41878 50392 27110 66272 75361 -52849
$$ packed form
16337f0152j18076o0835O3483J15671K6269p7446Q7009K6638l6926N1423L2314
16326D9372Q4668j65967q7259n1578J7010M9734J0131n2020L7708l9623K2088
16315a25736P6244J2668l7355j5683J35689j1551p8523M3195j9191j2018J1677
16304b0584j743p3818j45849M9139P1867l4038n0265R9676O3965m5417o9577P3434
16292h3210n4863K1538J2389m0770O4594J0217K958p5323K6814Q9682K7693M0287
16280D2006J13490O7603L7947j47373k21531j17060O0873P4665N2877M6458r938
16269A7m5621m9955m9841N5550m568p5625P0718M0780N897O7901n6330j29702
16257a70779Q0410J64407P3742j03370p1731O0123R076Q514k3282L9162R089j28210
$$ plain form
16245 -52849 -20796 17226 902 93137 156200 111226 51739 -138572 -195795 -161287 -88612
16234 -88612 125747 33913 -77887 -95202 -22938 9691 -60801 -71856 -39822 -24746 -64810
16223 -64810 -48167 29926 30603 -13538 46547 205285 254370 145748 81165 40712 -66316
16212 -66316 -32641 55222 91991 24709 -117069 -252040 -267251 -177209 -118480 -60914 780
16201 780 34977 82717 36308 -14104 118208 182024 61250 4670 29298 168937 194473
16190 194473 176246 107522 89689 70833 -7455 -5742 55345 79529 97303 95250 50738 -30593
16178 -30593 -23355 26435 -4430 11657 104787 194895 197302 145102 -71692 -97510 -18341 25333
16166 25333 100244 162359 62145 80887 195652 163504 20579 -63850 -44647 -57178 -50283
$$ packed form
16245e2849L2053L8022j6324R2235O3063m4974n9487j90311n7223L4508P2675
16234h8612K14359r1834j11800j7315P2264L2629p0492j1055L2034J5076m0064
16223f4810J6643P8093O77m4141O0085J58738M9085j08622o4583m0453j07028
16212f6316L3675Q7863L6769o7282j41778j34971j5211R0042N8729N7566O1694
16201G80L4197M7740m6409n0412J32312O3816j20774n6580K4628J39639K5536
16190A94473j8227o8724j7833j8856p8288J713O1087K4184J7774k053m4512q1331
16178c0593P238M9790l0865J6087R3130R0108K407n2200k16794k5818P9169M3674
16166B5333P4911O2115j00214J8742J14765l2148j42925q4429J9203j2531O895
$$ plain form
16155 -50283 7523 -41694 -33216 21311 59997 -1632 -132574 -231001 -180891 -102356 -18786 -43449
16143 -43449 44878 16308 406 -55039 -59517 22095 -111689 -125191 -14903 42516 -45184
16132 -45184 -190589 -104239 -46231 679 62654 90203 51191 16029 -113431 -31635 -68356
16121 -68356 -158906 -166778 -108419 -87395 -70551 74763 129233 76649 79852 74514 -9219 -109116
16109 -109116 -718 -98195 -223661 -169395 -79206 -118861 -105577 -1138 -94619 -92642 -73969
16098 -73969 42557 12961 7977 26452 20916 -42668 -109451 -169828 -271271 -373554 -189184
16087 -189184 -43955 -129195 -124045 -39094 -29396 -16972 64235 89362 93402 64908 155661 93008
16075 93008 -35914 -171827 -217598 -293317 -260224 -192253 -36082 40674 101333 176498 168813
$$ packed form
16155e0283N7806m9217Q478N4527L8686o1629j30942r8427N0110P8535Q3570k4663
16143d3449Q8327k8570j5902n5445m478Q1612j33784j3502J10288N7419q7700
16132d5184j45405Q6350N8008M6910O1975K7549l9012l5162j29460Q1796l6721
16121f8356r0550p872N8359K1024J6844J45314N4470n2584L203n338q3733r9897
16109a09116J08398r7477j25466N4266R0189l9655J3284J04439r3481J977J8673
16098g3969J16526k9596m984J8475n536o3584o6783o0377j01443j02283J84370
16087a89184J45229q5240N150Q4951R698J2424Q1207K5127M040k8494R0753o2653
16075I3008j28922j35913m5771p5719L3093O7971J56171P6756O0659P5165p685
$$ plain form
16064 168813 105282 95635 130292 101384 129904 189324 120591 -131876 -193482 -110378 -61781
16053 -61781 -70221 -71370 -28871 -77144 1423 104699 62439 52956 -7146 39682 77500 68488
16041 68488 25929 -26626 22467 71004 198927 163236 67743 2138 -15020 -45891 -107513
16030 -107513 -60071 -23501 -72609 -131300 -211401 -110571 -89357 42220 143767 151735 125594
16019 125594 49520 -52413 -70658 -66505 -45640 -91065 -130022 -241002 -232922 -177740 -99544
16008 -99544 -72706 -91805 -14818 -107244 -172955 -259045 -290978 -199752 -140207 -121416 -73372 -16373
15996 -16373 -24520 -86896 -135121 -165599 -127850 -101198 -166761 -262912 -284077 -195684 -71525 31855
15984 31855 54609 82130 12772 -3499 129460 67542 -42622 34004 183079 153514 70175
$$ packed form
16064A68813o3531r647L4657k8908K8520N9420o8733k52467o1606Q3104M8597
16053f1781q440j149M2499m8273P8567J03276m2260r483o0102M6828L7818r012
16041F8488m2559n2555M9093M8537J27923l5691r5493o5605j7158l0871o1622
16030a07513M7442L6570m9108n8691q0101J00830K1214J31577J01547P968k6141
16019A25594p6074j01933j8245M153K0865m5425l8957j10980Q080N5182P8196
16008i9544K6838j9099P6987r2426o5711q6090l1933R1226N9545J8791M8044N6999
15996a6373q147o2376m8225l0478L7749K6652o5563r6151k1165Q8393J24159J03380
15984C1855K2754K7521o9358j6271J32959o1918j10164P6626J49075k9565q3339
$$ plain form
15973 70175 -51369 -34764 -40818 -13993 153518 82785 -18941 -67343 107034 192900 294663
15962 294663 230491 160197 17021 -77120 -132326 -81763 28311 163348 74593 -65707 -221171
15951 -221171 -211977 -100427 24542 11417 -39717 -8336 81405 75797 -11386 57933 40398
15940 40398 -43082 1019 -17839 -49868 48349 105333 67207 13581 -46219 -118425 -177529 -155663
15928 -155663 -91653 -9097 14469 -1432 -79322 -117798 -55278 28786 16548 71505 111844
15917 111844 20891 -16973 122316 120152 -7068 -122053 -121710 -97946 -155295 -218104 -282678
15906 -282678 -153198 -31173 104474 79716 15064 -2976 -76385 -70808 -22553 2264 89224
15895 89224 97669 39869 -20403 -8787 -31275 -42703 19199 36888 95126 211093 243099 240479
$$ packed form
15973G0175j21544J6605o054K6825J67511p0733j01726m8402J74377Q5866J01763
15962B94663o4172p0294j43176r4141n5206N0563J10074J35037q8755j40300j55464
15951b21171R194J11550J24969j3125n1134L1381Q9741n608q7183O9319j7535
15940D0398q3480M4101j8858l2029R8217N6984l8126n3626n9800p2206n9104K1866
15928a55663O4010Q2556K3566j5901p7890l8476O2520Q4064j2238N4957M0339
15917A11844r0953l7864J39289k164j27220j14985L43K3764n7349o2809o4574
15906b82678J29480J22025J35647k4758o4652j8040p3409N577M8255K4817Q6960
15895H9224Q445n7800o0272J1616k2488j1428O1902J7689N8238J15967L2006k620
$$ plain form
15883 240479 254776 236672 191503 191617 202126 224176 97129 82824 86717 53524 57528 136492
15871 136492 134398 -68933 -116308 -105482 -148067 -281061 -288397 -202271 -176301 -48255 -62314
15860 -62314 -131365 5050 21767 -229504 -349974 -300699 -115043 -10858 -28560 16727 56026
15849 56026 35175 18337 53140 86082 96683 133509 142908 99077 21914 6561 -47932 60465
15837 60465 137322 114755 123805 256594 157961 -30008 -50359 -43658 -43066 3311 -6838 -118944
15825 -118944 -78536 33071 27052 27308 -21965 -24476 52440 160445 155599 115565 77413 21123
15813 21123 -66381 -136919 -136106 -98938 -3477 -35695 -52492 -68882 27715 -11785 -110797 -132902
15801 -132902 -115685 -59221 -75330 -53952 41268 -23866 -27308 225096 437193 343279 231614
$$ packed form
15883B40479J4297j8104m5169J14J0509K2050j27047j4305L893l3193M004P8964
15871A36492k094k03331m7375J0826m2585j32994p336Q6126K5970J28046j4059
15860f2314o9051J36415J6717k51271j20470M9275J85656J04185j7702M5287L9299
15849E6026k0851j6838L4803L2942J0601L6826R399m3831p7163j5353n4493J08397
15837F0465P6857k2567R050J32789r8633j87969k0351O701N92M6377j0149j12106
15825a18944M0408J11607o019K56m9273k511P6916J08005m846m0034l8152n6290
15813B1123q7504p0538Q13L7168R5461l2218j6797j6390R6597l9500r9012k2105
15801a32902J7217N6464j6109K1378R5220o5134l442K52404K12097r3914j11665
$$ plain form
15790 231614 217706 149331 98999 -10364 -87776 -149329 -113736 -137538 -78134 -22183 -29994
15779 -29994 -37633 -120573 -120869 67261 56681 131730 240406 298643 251127 203239 115309 101642
15767 101642 60092 28231 114884 89097 18450 13913 9183 108354 35169 -46078 -33396 65576
15755 65576 29119 34819 40280 64513 138534 133351 -16553 -6497 1228 -14227 44386 39231
15743 39231 13168 15087 92311 25757 -41995 -17294 -16674 36791 76645 135793 117023 69532
15731 69532 63408 86077 -57101 -52492 -20740 -20322 -82625 -26764 2224 -55284 29027 -1364
15719 -1364 4114 -11027 -45370 -78750 -92497 11670 -5349 31394 111062 51202 -80532 -116232
15707 -116232 -22590 -74171 -58914 -45356 -84429 -48466 -29044 21202 13127 -75838 -36921 31706
$$ packed form
15790B31614j3908o8375n0332j09363p7412o1553L5593k3802N9404N5951p811
15779b9994p639q2940k96J88130j0580P5049J08676N8237m7516m7888q7930j3667
15767A01642m1550l1861Q6653k5787p0647m537m730R9171p3185q1247J2682R8972
15755F5576l6457N700N461K4233P4021n183j49904J0056P725j5455N8613n155
15743C9231k6063J919P7224o6554o7752K4701O20N3465L9854N9148j8770m7491
15731F9532o124K2669j43178M609L1752M18o2303N5861K8988n7508Q4311l0391
15719a364N478j5141l4343l3380j3747J04167j7019L6743P9668n9860j31734l5700
15707a16232R3642n1581J5257J3558l9073L5963J9422N0246q075q8965L8917O8627
$$ plain form
15695 31706 147082 129274 69553 -32732 82923 100930 61810 60062 44979 -18316 83198
15684 83198 121364 111800 99681 2246 -26126 -74500 -63391 54166 35955 2490 22066 55167
15672 55167 -67636 -26262 40943 90848 138785 158400 8825 -104701 -40640 -19744 27267
15661 27267 -88681 -200122 -248327 -230123 -252947 -311765 -218864 -104736 17811 93248 27923
15650 27923 -43436 -157980 -159856 -39718 25741 -31760 -142900 -173980 -7807 55706 2413
15639 2413 37576 -1448 -62347 37267 97067 115625 -111542 -224263 -184701 -108460 1724
15628 1724 61821 42634 -74761 -112518 -110679 -96809 -57318 -113363 -115862 -53473 22432 73804
15616 73804 88613 24242 -28463 -78351 -23201 8419 -75742 -137337 -249995 -202275 -112988
$$ packed form
15695C1706J15376j7808n9721j02285J15655J8007l9120j748j5083o3295J01514
15684H3198L8166r564j2119r7435k8372m8374J1109J17557j8211l3465J9576L3101
15672E5167j22803M1374O7205M9905M7937J9615j49575j13526O4061K0896M7011
15661B7267j15948j11441m8205J8204k2824n8818R2901J14128J22547P5437o5325
15650B7923p1359j14544j876J20138O5459n7501j11140l1080J66173O3513n3293
15639B413L5163l9024o0899R9614N9800J8558k27167j12721L9562P6241J10184
15628A724O0097j9187j17395l7757J839J3870L9491n6045k499O2389P5905N1372
15616G3804J4809o4371n2705m9888N5150L1620q4161o1595j12658M7720Q9287
$$ plain form
15605 -112988 -44197 -194633 -293320 -246614 -133961 -106211 -156237 -179510 -73656 11856 41422
15594 41422 102298 110372 87523 50965 -49674 -52534 40281 104545 57580 59477 -70841 -178985
15582 -178985 -180324 -152662 -160672 -137154 -83799 -76985 -109043 -145427 -98261 76389 235693 182119
15570 182119 91780 154035 173694 118150 72268 128250 58538 -96122 -105972 -69642 -42954
15559 -42954 -24058 41286 60541 -29485 -85642 13001 84223 47230 -16871 25294 107412 121985
15547 121985 115958 127738 69753 16469 80744 193972 178969 113052 125499 104343 129699
15536 129699 187537 180956 71002 -27639 33643 101647 199827 287787 280849 62027 -35979
15525 -35979 -84466 -110142 -13023 67217 20202 -66255 -16973 -753 -85388 -60267 39947
$$ packed form
15605a12988O8791j50436r8687M6706J12653K7750n0026k3273J05854Q5512K9566
15594D1422O0876Q074k2849l6558j00639k860R2815O4264m6965J897j30318j08144
15582a78985j339K7662q010K3518N3355O814l2058l6384M7166J74650J59304n3574
15570A82119r0339O2255J9659n5544m5882N5982o9712j54660r850L6330K6688
15559d2954J8896O5344J9255r0026n6157R8643P1222l6993o4101M2165Q2118J4573
15547A21985o027J1780n7985n3284O4275J13228j5003o5917J2447k1156K5356
15536A29699N7838o581j09954r8641O1282O8004R8180Q7960o938k18822r8006
15525c5979m8487k5676R7119Q0240m7015q6457M9282J6220q4635K5121J00214
$$ plain form
15514 39947 -22340 -119725 -173120 -110938 -64927 -107855 -37928 -115578 -221164 -245535 -218582
15503 -218582 -243404 -230049 -108110 -27157 43838 70580 21205 -54362 -60926 10790 51618
15492 51618 7103 -31243 -111966 -97549 -16043 71109 15380 25975 71104 -7532 -104912 -84649
15480 -84649 -27065 112966 57344 -9805 10239 14092 61457 56022 10991 -180037 -222510 -114221
15468 -114221 -10602 -79855 -134977 -193119 -292067 -323734 -401670 -160646 -45793 -149480 -137803
15457 -137803 -277009 -189398 -85288 -42736 -77862 -53723 48948 94109 58127 -30023 -83107
15446 -83107 -50684 21765 -53735 -38066 -89111 -60375 -83743 -117925 -172332 -149087 -158286 -92981
15434 -92981 -737 -26284 -90041 25931 95118 111638 230659 247264 177419 27890 -87154
$$ packed form
15514C9947o2287r7385n3395O2182M6011m2928O9927p7650j05586k4371K6953
15503b18582k4822J3355J21939Q0953P0995K6742m9375p5567o564P1716M0828
15492E1618m4515l8346q0723J4417Q1506Q7152n5729J0595M5129p8636r7380K0263
15480h4649N7584J40031n5622o7149K0044L853M7365n435m5031j91028m2473J08289
15468a14221J03619o9253n5122n8142r8948l1667p7936K41024J14853j03687J1677
15457a37803j39206Q7611J04110M2552l5126K4139J02671M5161l5982q8150n3084
15446h3107L2423P2449p5500J5669n1045K8736k3368l4182n4407K3245r199O5305
15434i2981R2244k5547o3757J15972O9187J6520J19021J6605o9845j49529j15044
$$ plain form
15423 -87154 43037 22321 -71579 -109517 -10977 -39007 1249 99220 72211 33356 107238
15412 107238 87441 75221 6437 -93286 35695 60411 -3747 -128526 -172630 -120937 -67080
15401 -67080 5712 40697 73981 57395 71680 69148 -5471 59475 178542 188846 245508 227564
15389 227564 150255 8747 -4949 -101 55779 103627 -38600 -126672 -165436 -83359 39484
15378 39484 39606 95119 112290 144654 158290 41858 58872 43587 -8583 -50079 -116194 -90294
15366 -90294 -52049 -4574 9818 -94453 -52429 57474 61257 115290 59111 -48287 -89905
15355 -89905 -961 9860 -41335 -151148 -71974 -133465 -40231 58721 145881 88345 108171
15344 108171 140023 67102 88657 101280 25064 27582 71453 109234 143451 177752 219399 116549
$$ packed form
15423h7154J30191k0716r3900l7938R8540k8030M0256R7971k7009l8855P3882
15412A07238j9797j2220o8784r9723J28981K4716o4158j24779m4104N1693N3857
15401f7080P2792L4985L3284j6586J4285k532p4619O4946J19067J0304N6662j7944
15389B27564p7309j41508j3696M848N5880M7848j42227q8072l8764Q2077J22843
15378C9484J22N5513J7171L2364J3636j16432J7014j5285n2170m1496o6115K5900
15366i0294L8245M7475J4392j04271M2024J09903L783N4033n6179j07398m1618
15355h9905Q8944J0821n1195j09813P9174o1491R3234R8952Q7160n7536J9826
15344A08171L1852p2921K1555J2623p6216K518M3871L7781L4217L4301M1647j02850
$$ plain form
15332 116549 136237 23193 42931 169778 127933 -42128 -30667 82710 193948 187709 111993
15321 111993 50459 130130 169109 67360 39019 -16419 -87390 -151193 -127042 43004 103498
15310 103498 79041 162622 135155 93485 137136 183229 223549 184427 74811 86031 152375
15299 152375 173770 167222 261884 373935 232242 134407 97374 124423 234400 233852 217966
15288 217966 285734 247362 96408 33302 17257 56141 9143 -48353 -87348 -159881 -100525
15277 -100525 -29703 22798 18410 117873 192454 71097 45998 10579 -32858 21143 167200
15266 167200 111436 166201 222331 195324 187738 133676 51487 121463 123898 65707 -85188 -120802
15254 -120802 -150868 -94014 -7074 34466 50470 189457 175483 -49134 -99169 66380 275809
$$ packed form
15332A16549J9688j13044J9738J26847m1845j70061J1461J13377J11238o239p5716
15321A11993o1534P9671L8979j01749k8341n5438p0971o3803K4151J70046O0494
15310A03498k4457Q3581k7467m1670M3651M6093M0320l9122j09616J1220O6344
15299A52375K1395o548R4662J12051j41693r7835l7033K7049J09977n48j5886
15288B17966O7768l8372j50954o3106j6045L8884m6998n7496l8995p2533N9356
15277a00525P0822N2501m388R9463P4581j21357k5099l5419m3437N4001J46057
15266A67200n5764N4765N6130k7007p586n4062q2189O9976K435n8191j50895l5614
15254a20802l0066N6854Q6940M1540J6004J38987j3974k24617n0035J65549K09429
$$ plain form
15243 275809 339011 195507 122725 182508 143141 171579 156265 70797 51993 -8964 -31012
15232 -31012 74153 40978 -39180 -147566 -237950 -233492 -245073 -88231 140888 161048 125881
15221 125881 98907 99075 -34204 -116922 38004 127719 131069 84035 136110 197652 220750 183194
15209 183194 211916 281849 204870 125803 74974 83592 41578 69495 91283 214977 225794
15198 225794 118051 88799 121458 108448 160493 231890 190644 106254 68806 -11757 972
15187 972 84979 66524 7400 -99494 -100771 -64818 -97160 -75987 64780 232466 177470 74449
15175 74449 25858 118498 76648 -14292 13935 -110870 -156466 14109 88895 48745 -26833
15164 -26833 -80957 -36333 -20900 -42583 25027 73083 -21564 -17675 926 74081 130559 96719
$$ packed form
15243B75809O3202j43504p2782N9783l9367K8438j5314q5468j8804o0957k2048
15232c1012J05165l3175q0158j08386r0384M458j1581J56842K29119K0160l5167
15221A25881k6974J68j33279q2718J54926Q9715L350m7034N2075O1542K3098l7556
15209A83194K8722O9933p6979p9067n0829Q618m2014K7917K1788J23694J0817
15198B25794j07743k9252L2659j3010N2045P1397m1246q4390l7448q0563J2729
15187I72Q4007j8455n9124j06894j277L5953l2342K1173J40767J67686n4996j03021
15175G4449m8591R2640m1850r0940K8227j24805m5596J70575P4786m0150p5578
15164b6833n4124M4624J5433k1683O7610M8056r4647L889J8601P3155N6478l3840
$$ plain form
15152 96719 13344 -15720 14533 21883 -76354 -142522 -55744 -58567 -10622 57042 65139 34695
15140 34695 -23514 -152470 -138640 -104629 -64586 -80855 -92822 -126823 -166331 -135594 -84176
15129 -84176 -179184 -274864 -230054 -272431 -174997 -18084 8666 92608 96096 161642 262135
15118 262135 235314 109380 102968 170147 158658 126081 62099 -8269 12686 -15016 -64262
15107 -64262 -75060 -97972 -128473 39186 126335 54138 -39640 -56721 55787 167821 84335
15096 84335 57816 44082 -57519 -50345 22848 19026 -60448 -76897 -51890 -39549 -76166 -104053
15084 -104053 -104373 -115544 -124478 -144854 -144403 -230970 -216545 -161139 -164958 -74823 24029 6730 2329
15071 2329 11995 83647 119884 155790 18274 -56275 -58389 -83642 -128603 -46500 -118221 -218623
$$ packed form
15152I6719q3375k9064L0253P350r8237o6168Q6778k823M7945O7664Q097l0444
15140C4695n8209j28956J3830L4011M0043j6269j1967l4001l9508L0737N1418
15129h4176r5008r5680M4810m2377R7434J56913K6750Q3942L488O5546J00493
15118B62135k6821j25934o412O7179j1489l2577o3982p0368K0955k7702m9246
15107f4262j0798k2912l0501J67659Q7149p2197r3778j7081J12508J12034q3486
15096H4335k6519j3734j01601P174P3193l822p9474j6449K5007J2341l6617k7887
15084a04053l20j1171q934k0376M51q6567J4425N5406l819R0135R8852j7299m401
15071B329R666P1652L6237L5906j37516p4549k114k5253m4961Q2103p1721j00402
$$ plain form
15059 -218623 -129669 -22611 -15442 -68852 -36161 -61392 -61317 13800 56967 -66371 -74801 34884
15047 34884 15245 -54311 -62523 -5402 -45107 -128683 -284137 -389541 -414593 -222324 -119700
15036 -119700 -43186 44180 49026 -158133 -146358 -40779 71033 29814 -109508 -116295 -149193
15025 -149193 -148174 -114703 -117499 -121895 -86676 -114514 -55971 -43924 -43720 -152070 -226279 -227653
15013 -227653 -158406 -29092 -36568 -53061 119317 46309 -57667 -52480 -77004 -71202 -8248
15002 -8248 62051 134695 77673 26211 -19470 68976 2276 58770 92541 76659 -48348 -155831
14990 -155831 -256267 -334613 -230778 -43203 -40057 -149466 -168867 -88232 -20481 -126234 -133173
14979 -133173 -146118 -63072 -58141 -142285 -133213 -69949 -36130 17096 58901 685 -96825 -192183
$$ packed form
15059b18623Q8954J07058P169n3410L2691k5231P5P5117M3167j23338q430J09685
15047C4884j9639o9556q212N7121l9705q3576j55454j05404k5052J92269J02624
15036a19700P6514Q7366M846k07159J1775J05579J11812m1219j39322o787l2898
15025a49193J019L3471k796m396L5219k7838N8543J2047K04j08350p4209j374
15013b27653O9247J29314p476j6493J72378p3008j03976N187k4524N802O2954
15002h248P0299P2644n7022n1462m5681Q8446o6700N6494L3771j5882j25007j07483
14990a55831j00436p8346J03835J87575L146j09409j9401Q0635O7751j05753o939
14979a33173j2945Q3046M931q4144R072O3264L3819N3226M1805n8216r7510r5358
$$ plain form
14967 -192183 -57227 -14385 48177 -52007 -130787 -129695 -162802 -258386 -271678 -128159 11538
14956 11538 -1659 -151146 -161814 -253712 -125339 92888 114892 83559 40350 -63266 -91860
14945 -91860 18764 76351 -46704 23347 111920 22296 -30924 -59505 27302 32106 99433
14934 99433 40754 -43798 -53690 36269 46466 -12128 -64560 15982 -18161 -86898 -99335 -26303
14922 -26303 65587 90334 20335 -8221 40984 43759 2042 -95592 4107 7556 -39991 -3640
14910 -3640 -31867 -71231 -37968 65326 114399 127739 68522 39661 -66365 -147014 -45852
14899 -45852 -13114 -65077 -142426 -121366 -13603 52375 51955 132288 188001 84379 60651 58638
14887 58638 6220 -55944 -129384 -121659 -113941 -134636 -156793 -202419 -165768 -143119 -178862 -188643
$$ packed form
14967a92183J34956M2842O2562j00184p8780J092l3107r5584j3292J43519J39697
14956A1538j3197j49487j0668r1898J28373K18227K2004l1333m3209j03616k8594
14945i1860J10624N7587j23055P0051Q8573q9624n3220k8581Q6807M804O7327
14934I9433n8679q4552r892Q9959J0197n8594n2432Q0542l4143o8737j2437P3032
14922b6303R1890K4747o9999k8556M9205K775m1717r7634R9699L449m7547L6351
14910c640k8227l9364L3263J03294M9073J3340n9217k8861j06026q0649J01162
14899d5852L2738n1963p7349K1060J07763O5978m20Q0333N5713j03622k3728k013
14887E8638n2418o2164p3440P725P718k0695k2157m5626L6651K2649l5743r781
$$ plain form
14875 -188643 -126802 -131569 -108487 -48632 -50466 -66836 -97989 -102456 -50073 -19915 17125 147741
14863 147741 201056 7158 -69248 42273 140694 42078 64360 8193 77641 112643 87366
14852 87366 -24214 -84102 -75654 6034 63156 123548 56619 5367 -166531 -238014 -235466 -223195
14840 -223195 -128671 -104740 -101835 -36652 -53719 -106341 -103933 -121815 -45002 469 47620 103548
14828 103548 147285 58340 -42557 21603 100477 69094 27485 48082 -19261 -5104 -70503
14817 -70503 -194654 -190281 -65077 33526 53801 -33972 -97303 -99035 -94710 -55955 -132668 -48048
14805 -48048 108497 10278 -5898 10637 49487 -11222 -59244 -4995 -41597 -122472 -42837
14794 -42837 21010 52625 -30237 -82920 30486 76038 -80136 -150759 -136312 -52187 -70078
$$ packed form
14875a88643O1841m767K3082N9855j834j6370l1153m467N2383L0158L7040J30616
14863A47741N3315j93898p6406J11521R8421r8616K2282n6167O9448L5002k5277
14852H7366j11580n9888Q448Q1688N7122O0392o6929n1252j71898p1483K548J2271
14840b23195R4524K3931K905O5183j7067n2622K408j7882P6813M5471M7151N5928
14828A03548M3737q8945j00897O4160P8874l1383m1609K0597o7343J4157o5399
14817g0503j24151M373J25204R8603K0275q7773o3331j732M325L8755p6713Q4620
14805d8048J56545r8219j6176J6535L8850o0709m8022N4249l6602q0875P9635
14794d2837O3847L1615q2862n2683J13406M5552j56174p0623J4447Q4125j7891
$$ plain form
14783 -70078 -92899 -44624 18516 -24267 62668 156594 215011 168706 106962 118136 35672 -78204
14771 -78204 -15035 -63506 -107447 -36739 67913 188623 145801 51426 -59552 -26969 -100426
14760 -100426 -74461 151918 347817 378307 292720 212279 296465 191890 -41428 -46867 45342
14749 45342 74028 -5598 -60773 -75904 -56720 -364 -31164 -114877 -145240 -105987 -57698 -100060
14737 -100060 -34301 11013 362 -18803 74753 149502 150396 116559 69702 8374 23480 -25555
14725 -25555 2170 50838 42234 97359 71747 38123 5994 -124458 -208688 -153669 -244765 -263480
14713 -263480 -140994 -6920 107322 213258 206490 144989 38327 -3336 -81770 -61721 -29746
14702 -29746 34185 6314 -80269 -7904 100872 99218 76531 -101516 -91439 -61093 -72606
$$ packed form
14783g0078k2821M8275O3140m2783Q6935R3926N8417m6305o1744J1174q2464j13876
14771g8204O3169m8471m3941P0708J04652J20710m2822r4375j10978L2583p3457
14760a00426K5965K26379J95899L0490q5587q0441Q4186j04575k33318n439R2209
14749D5342K8686p9626n5175j5131J9184N6356l0800q3713l0363L9253M8289m2362
14737a00060O5759M5314j0651j9165R3556P4749Q94l3837m6857o1328J5106m9035
14725b5555K7725M8668q604N5125k5612l3624l2129j30452q4230N5019r1096j8715
14713b63480J22486J34074J14242J05936o768o1501j06662m1663p8434K0049L1975
14702b9746O3931k7871q6583P2365J08776j654k2687j78047J0077L0346j1513
$$ plain form
14691 -72606 -74888 -55234 -44991 53375 113983 58633 86662 -1845 84444 108187 68452 71323
14679 71323 111082 44381 79221 68501 -18960 -13833 -73139 -143786 -149345 -120874 11230 46846
14667 46846 108567 201672 240607 232560 101798 38569 34508 13539 30876 48526 44227 53731
14655 53731 40410 172452 209191 129061 92279 133411 131169 97369 -16722 -70915 4157
14644 4157 13496 -46892 -123685 -142699 -122 53810 1004 14053 78676 165060 119850 28058
14632 28058 37777 132578 139685 -21053 34575 123941 1249 -116513 -138666 -98709 -102989 -192982
14620 -192982 -163018 -19441 47621 -65682 -160319 -163626 -159433 10699 106154 295555 183095
14609 183095 60623 -3169 2633 78315 89316 104190 237638 121820 115784 132970 41344
$$ packed form
14691g2606k282J9654J0243R8366O0608n5350K8029q8507Q6289K3743l9735K871
14679G1323L9759o6701L4840j0720q7461N127n9306p0647n559K8471J32104L5616
14667D6846O1721R3105L8935q047j30762o3229m061k0969J7337J7650m299R504
14655E3731j3321J32042L6739q0130l6782M1132k242l3800j14091n4193P5072
14644D157R339o0388p6793j9014J42577N3932n2806J3049O4623Q6384m5210r1792
14632B8058R719R4801P107j60738N5628Q9366j22692j17762k2153L9957m280q9993
14620a92982K9964J43577O7062j13303r4637l307M193J70132R5455J89401j12460
14609A83095j22472o3792N802P5682J1001J4874J33448j15818o036J7186r1626
$$ plain form
14598 41344 60076 37613 -81309 -31879 87146 62652 72665 150870 81981 -1345 -51727
14587 -51727 -81213 -63623 26 22983 128802 185299 120406 88526 -14008 121377 116420
14576 116420 27863 67197 60888 -10120 62744 48847 -39462 -70887 -80699 46706 -28201 -49548
14564 -49548 -17952 57477 220740 179478 109367 224938 163802 -34553 -182463 -177677 -138779
14553 -138779 -84124 33450 -13527 -89142 -62826 -48833 64543 41202 64768 143963 114507
14542 114507 12166 -111802 -116614 -47504 -32673 3339 -2676 -60652 -159883 -138239 -38050
14531 -38050 102007 106187 25788 91261 68432 -8910 -96708 -98629 -37223 -33202 21850 60932
14519 60932 223279 308968 277360 122219 29724 -29378 13502 31024 2830 54126 137756
$$ packed form
14598D1344J8732k2463j18922M9430J19025k4494J0013P8205o8889q3326n0382
14587e1727k9486J7590O3649K2957J05819N6497o4893l1880j02534J35385m957
14576A16420q8557L9334o309p1008P2864j3897q8309l1425r812J27405p4907k1347
14564d9548L1596P5429J63263m1262p0111J15571o1136j98355j47910M786L8898
14553a38779N4655J17574m6977p5615K6316J3993J13376k3341K3566P9195k9456
14542A14507j02341j23968m812O9110J4831L6012o015n7976r9231K1644J00189
14531c8050J40057M180q0399O5473k2829p7342q7798j921O1406M021N5052L9082
14519F0932J62347Q5689l1608j55141r2495n9102M2880J7522k8194N1296Q3630
$$ plain form
14508 137756 286666 383194 386457 344409 257195 174855 182597 264083 149332 131772 141192 76969
14496 76969 60986 -46504 -139114 -175498 -85130 -60859 -16655 -17307 -38754 -3198 29210 121281
14484 121281 101544 25922 66830 33949 33006 51959 67715 -22467 -102554 -28216 40519 103069
14472 103069 121073 124765 13768 19526 2680 33948 108988 135676 73649 80607 46937 -15662
14460 -15662 -8277 -23336 -7880 34491 89012 76719 -18446 -117903 -119616 -68897 22760 39072
14448 39072 -77760 -111623 59372 7160 23254 91908 52916 -20996 -66420 47498 55775
14437 55775 -3401 -43777 -121138 -245505 -210835 -176394 -47479 35877 37438 77012 118147
14426 118147 213577 157738 57233 98087 219910 277650 273705 244401 170245 291227 285718
$$ packed form
14508A37756J48910R6528L263m2048q7214q2340P742Q1486j14751j7560R420o4223
14496G6969j5983j07490r2610l6384R0368K4271M4204o52k1447L5556L2408R2071
14484A21281j9737p5622M0908l2881r43J8953J5756r0182q0087P4338O8735O2550
14472A03069J8004L692j10997N758j6846L1268P5040K6688o2027O958l3670o2599
14460a5662P385j5059J5456M2371N4521j2293r5165r9457j713N0719R1657J6312
14448C9072j16832l3863J70995n2212J6094O8654l8992p3912m5424J13918Q277
14437E5775n9176m0376p7361j24367L4670L4441J28915Q3356J561L9574M1135
14426A18147R5430n5839j00505M0854J21823N7740l945k9304p4156J20982n509
$$ plain form
14415 285718 201196 45866 -7685 19468 -4896 22458 136647 197553 269928 223118 130900
14404 130900 108803 14390 149595 147748 133153 122489 119181 79521 -91537 -94386 113288
14393 113288 115723 -32371 -78849 -166069 -73416 42854 -4914 -25659 -125862 -107990 -58696
14382 -58696 -34957 -78793 -119094 -51028 57170 74781 107050 2437 -205535 -146369 -3066
14371 -3066 114412 60717 -13566 -39901 -3870 -24521 -68337 -109221 -74523 850 38251 61036
14359 61036 -29213 -61957 168418 259779 152835 83954 155354 72671 -40180 -81572 -34051
14348 -34051 45198 -88112 -36214 -47369 -141994 -109831 -76709 -25763 -23000 -159248 -144273
14337 -144273 -139778 -199705 -142183 11505 104221 162726 153433 111217 50330 69913 147101 35811
$$ packed form
14415B85718q4522j55330n3551K7153k4364K7354J14189O0906P2375m6810r2218
14404A30900k2097r4413J35205j847j4595j0664l308l9660j71058k849K07674
14393A13288K435j48094m6478q7220R2653J16270m7768k0745j00203J7872M9294
14382e8696K3739m3836m0301O8066J08198J7611L2269j04613k07972N9166J43303
14371c066J17478n3695p4283k6335L6031k0651m3816m0884L4698P5373L7401K2785
14359F1036r0249l2744K30375R1361j06944o8881P1400q2683j12851m1392M7521
14348c4051P9249j33310N1898j1155r4625L2163L3122N0946K763j36248J4975
14337a44273M495n9927N7522J53688R2716N8505r293m2216o0887J9583P7188j11290
$$ plain form
14325 35811 -3636 89125 190420 128940 169362 128117 87918 -6613 -38665 4943 93986
14314 93986 128339 99152 138276 153119 41422 -52539 38544 95663 73168 67368 148213 96340
14302 96340 83152 104883 158099 111081 199714 138399 3038 -15564 -66486 -76855 -82729 36501
14290 36501 52535 64642 57331 69703 125817 37978 -172548 -176188 -185680 -235234 -158653 750
14278 750 -12389 -141646 -137814 -152066 -97749 -187719 -261201 -348964 -264470 -152806 -34973 -6425
14266 -6425 40274 3434 -14900 -90406 -94768 23730 56732 166766 113214 107715 63998 -21557
14254 -21557 -19159 -94270 -31938 39177 122397 92987 138844 195971 154545 171810 167452 90824
14242 90824 -42329 35622 159616 195224 323563 355141 324465 200322 118887 143248 111579
$$ packed form
14325C5811l9447R2761J01295o1480M0422m1245m0199r4531l2052M3608Q9043
14314I3986L4353k9187L9124J4843j11697r3961R1083N7119k2495n800Q0845n1873
14302I6340j3188K1731N3216m7018Q8633o1315j35361j8602n0922j0369n874J19230
14290C6501J6034J2107p311J2372N6114q7839k10526l640r492m9554P6581J59403
14278G50j3139j29257L832j4252N4317q9970p3482q7763Q4494J11664J17833K8548
14266f425M6699l6840j8334p5506m362J18498L3002J10034n3552n499m3717q5555
14254b1557K398p5111O2332P1115Q3220k9410M5857N7127m1426J7265m358p6628
14242I0824j33153P7951J23994L5608J28339L1578l0676j24143q1435K4361l1669
$$ plain form
14231 111579 54408 8199 61517 64056 15804 17299 -36804 -52007 -3059 68090 101292 117030
14219 117030 139710 143695 91417 64113 103055 126512 22210 2378 -20772 39674 24985
14208 24985 99009 136251 190015 245453 157162 131713 185549 145994 63720 42969 31573 38127
14196 38127 119437 -82638 -87377 -83399 -203129 -204354 -61009 -21470 -74341 -25584 -20685 32751
14184 32751 -88899 -78983 -35851 -53988 -9379 80120 -55063 -121007 41286 36368 -40594
14173 -40594 37900 77116 64366 11503 25423 114891 105701 77833 86981 52966 107414 112190
14161 112190 -41618 -30516 99569 91184 129115 149976 106045 -91725 -205021 -166024 -147726
14150 -147726 -134666 -124701 -51625 -62666 -35701 -62036 -179055 -76910 64281 111920 -11578
$$ packed form
14231A11579n7171m6209N3318K539m8252J495n4103j5203M8948P1149L3202J5738
14219A17030K2680L985n2278k7304L8942K3457j04302j9832k3150O0446j4689
14208B4985P4024L7242N3764N5438q8291k5449N3836l9555q2274k0751j1396O554
14196C8127Q1310k02075m739L978j19730j225J43345L9539n2871M8757M899N3436
14184C2751j21650R916M3132j8137M4609Q9499j35183o5944J62293m918p6962
14173d0594P8494L9216j2750n2863J3920Q9468r190k7868R148l4015N4448M776
14161A12190j53808J1102J30085q385L7931K0861m3931j97770j13296L8997J8298
14150a47726J3060R965P3076j1041K6965k6335j17019J02145J41191M7639j23498
$$ plain form
14139 -11578 -46489 -51992 17292 51554 -46352 -31433 20042 72760 61954 10698 -38156 -155663
14127 -155663 -144817 -9985 106698 85196 83438 4447 -53359 97688 77343 -1590 -110113
14116 -110113 -128613 -22949 32328 48416 -89871 -30865 -56153 -89250 -165833 -168349 -209802
14105 -209802 -187400 -240481 -318966 -312373 -113957 -62529 -16000 114465 81075 -4502 -36368
14094 -36368 51731 -30491 -113881 -135192 -53756 -30205 -8734 90669 -427 -177050 -178121 28144
14082 28144 161506 258730 281948 147578 7461 70334 42507 19163 109815 77495 92939
14071 92939 67464 -46832 -63626 -27802 76396 8253 8563 44669 79374 72349 8242 14532
14059 14532 84670 61438 -111407 -37417 -14847 19277 86002 -200 -120504 -100577 -94976
$$ packed form
14139a1578l4911n503O9284L4262r7906J4919N1475N2718j0806n1256m8854j17507
14127a55663J0846J34832J16683k1502j758p8991n7806J51047k0345p8933j08523
14116a10113j8500J05664N5277J6088j38287N9006k5288l3097p6583k516m1453
14105b09802K2402n3081p8485O593J98416N1428M6529J30465l3390q5577l1866
14094c6368Q8099q2222q3390k1311Q1436K3551K1471R9403r1096j76623j071K06265
14082B8144J33362R7224K3218j34370j40117O2873k7827k3344R0652l2320J5444
14071I2939k5475j14296j6794L5824J04198o8143L10L6106L4705p025o4107O290
14059A4532P0138k3232j72845P3990K2570L4124O6725q6202j20304J9927N601
$$ plain form
14048 -94976 -204781 -228967 -158666 -175052 -126614 -46549 2770 56983 118692 62104 -3354
14037 -3354 -77095 -75355 -62364 -56348 -51312 107934 55172 87321 94954 56026 -5564 -143219
14025 -143219 -150515 41263 111538 85568 21472 -38485 42695 41778 96071 66881 2241 -27534
14013 -27534 26627 93793 158987 69945 -45974 -55815 -18518 -40757 -120876 -183214 -75951
14002 -75951 -131750 -185092 42275 246214 163104 98000 52035 42495 82151 74110 -109894
13991 -109894 -194376 -122439 20935 -10210 49556 73196 -73237 -77388 32858 129093 137849
13980 137849 80688 77840 74957 79243 77032 -72162 -269402 -199509 -545 20066 -72391 -191565
13968 -191565 -168627 -186510 -118524 -60498 -96214 -94534 -41929 -11596 23204 76783 37368 -26131
$$ packed form
14048i4976j09805k4186P0301j6386M8438Q0065M9319N4213O1709n6588o5458
14037c354p3741J740J2991O016N036J59246n2762L2149P633l8928o1590j37655
14025a43219p296J91778P0275k5970o4096n9957Q1180r17N4293k9190o4640k9775
14013b7534N4161O7166O5194q9042j15919r841L7297k2239q0119o2338J07263
14002g5951n5799n3342K27367K03939q3110o5104m5965r540L9656q041j84004
13991a09894q4482P1937J43374l1145N9766K3640j46433m151J10246R6235Q756
13980A37849n7161k848k883M286k211j49194j97240O9893J98964K0611r2457j19174
13968a91565K2938j7883O7986N8026l5716J680N2605L0333L4800N3579l9415o3499
$$ plain form
13956 -26131 -73255 11104 69935 30195 57827 -26135 -10609 -37204 -33550 -16273 58332 148987
13944 148987 22421 -69473 -47350 -96294 -65941 67579 129868 68158 81375 75361 95192
13933 95192 3909 72303 159160 90264 -12451 -19167 -55237 -57859 -17221 51944 13604 21056
13921 21056 -11955 2987 137877 122416 87135 165816 172107 20994 -47816 -20219 -106722
13910 -106722 -14170 113735 40870 -6489 68044 46041 -111317 -189679 -155908 -114351 -94510
13899 -94510 -40247 -154151 -270819 -172240 -145980 -94252 -26824 -17147 130244 107764 84158
13888 84158 242377 222896 93249 33983 -61879 -135653 -75818 35423 81898 82623 10323
13877 10323 119905 112894 78945 16223 85587 170518 120394 -11683 -16195 7969 -9643 -80690
$$ packed form
13956b6131m7124Q4359N8831l9740K7632q3962J5526k6595L654J7277P4605R0655
13944A48987j26566r1894K2123m8944L0353J33520O2289o1710J3217o014J9831
13933I5192r1283O8394Q6857o8896j02715o716l6070k622M0638O9165l8340P452
13921B1056l3011J4942J34890j5461l5281P8681O291j51113o8810K7597q6503
13910a06722R2552J27905p2865m7359P4533k2003j57358p8362L3771M1557J9841
13899i4510N4263j13904j16668R8579K6260N1728O7428R677J47391k2480k3606
13888H4158J58219j9481j29647n9266r5862p3774N9835J11241M6475P25p2300
13877A0323J09582p011l3949o2722O9364Q4931n0124j32077m512K4164j7612p1047
$$ plain form
13865 -80690 -38285 -31130 -24898 -36564 -13932 124567 64349 -96937 -4359 -42153 -19947 -6613
13853 -6613 -120566 -37127 95226 117256 127740 82078 118958 90155 48043 74945 105546
13842 105546 132184 126648 95644 -39653 -56630 -20845 -15375 -64293 -50050 -23945 -8992 -42342
13830 -42342 -96932 -167264 -136812 -176857 -79680 84304 54635 -81256 -103976 -11605 15512
13819 15512 16512 -52656 -21396 32213 -39464 -165925 -129428 -96322 -66149 77062 46091
13808 46091 527 17198 -10869 -6000 -50506 -2542 -29481 -15464 50093 130661 137831 152486
13796 152486 142885 68296 84553 64564 156453 197800 -29552 -28237 -4728 49920 141477 90106
13784 90106 26426 54673 16879 -19277 -12905 48802 82218 9068 67780 25471 14762 -10499
$$ packed form
13865h0690M2405P155O232j1666K2632J38499o0218j61286R2578l7794K2206J3334
13853f613j13953Q3439J32353K2030J0484m5662L6880k8803m2112K6902L0601
13842A05546K6638n536l1004j35297j6977L5785N470m8918J4243K6105J4953l3350
13830d2342n4590p0332L0452m0045R7177J63984k9669j35891k2720R2371K7117
13819A5512J000o9168L1260N3609p1677j26461L6497L3106L0173J43211l0971
13808D6091m5564J6671k8067M869m4506M7964k6939J4017O5557Q0568P170J4655
13796A52486r601p4589J6257j9989R1889M1347k27352J315K3509N4648R1557n1371
13784I0106o3680K8247l7794l6156O372O1707L3416p3150N8712m2309j0709k5261
$$ plain form
13772 -10499 -64435 -81401 -35757 -64032 -13206 59983 146910 237900 158682 125293 80973 108393
13760 108393 143797 56527 -3561 36793 -22083 769 -56574 -118697 -57803 8504 18594
13749 18594 -14494 -63602 -67226 -139980 -89492 -11744 -42754 -148987 -180069 -113106 -120654 13326
13737 13326 12261 -94068 -99136 -67551 -56699 -57345 -16076 46669 108032 200361 163369 153110
13725 153110 32441 -79605 -116630 -117977 -33250 35119 50533 100625 82498 92516 92604 87969
13713 87969 36507 -60413 -127751 -174555 -30912 -94164 282 -51872 -81037 -54652 -91388
13702 -91388 -25021 -21186 -15903 -59477 18778 -31452 4585 -4628 4428 42781 12657 -45072
13690 -45072 -30235 31707 -8400 -161211 -147757 -67263 -12276 70262 81075 41311 -66745
$$ packed form
13772a0499n3936j6966M5644k8275N0826P3189Q6927R0990p9218l3389m4320K7420
13760A08393L5404q7270o0088M0354n8876K2852n7343o2123O0894O6307J0090
13749A8594l3088m9108l624p2754N0488P7748l1010j06233l1082O6963p548J33980
13737A3326j065j06329n068L1585J0852o46M1269O2745O1363R2329l6992j0259
13725A53110j20669j12046l7025j347Q4727O8369J5414N0092j8127J0018Q8m635
13713H7969n1462r6920o7338m6804J43643o3252R4446n2154k9165K6385l6736
13702i1388O6367L835N283m3574P8255n0230L6037r213R056L8353l0124n7729
13690d5072J4837O1942m0107j52811J3454Q0494N4987Q2538J0813l9764j08056
$$ plain form
13679 -66745 -77895 -45492 -91995 -99327 -88703 -154361 -156899 -119039 -117164 -87543 -153358 -202222
13667 -202222 -177867 -140369 -136387 -130551 -15205 91997 14193 11163 171944 245410 82230
13656 82230 -125900 -89864 -48348 -68201 -156887 -309511 -226186 -151440 -97366 -76943 -63789
13645 -63789 -57279 9948 13341 88675 153202 125792 101767 121300 110288 18242 -66337 24683
13633 24683 11804 -87026 -73317 -87389 -142205 -168823 -139246 -78498 -53112 -82082 -45531 -53057
13621 -53057 106870 221659 153069 47866 33007 112627 120839 79836 219116 268391 241475
13610 241475 165263 -80147 -105115 13713 63124 12354 -90197 -166802 -114692 -36077 -65774
13599 -65774 -105159 -124717 -135470 -7939 32689 53574 61858 168483 96301 -18679 -116770
$$ packed form
13679f6745j1150L2403m6503p332J0624o5658k538L7860J875K9621o5815m8864
13667b02222K4355L7498L982N836J15346J07202p7804l030J60781P3466j63180
13656H2230k08130L6036M1516j9853q8686j52624Q3325P4746N4074K0423J3154
13645f3789O510O7227L393P5334O4527k7410k4025J9533j1012r2046q4579R1020
13633B4683j2879r8830J3709j4072n4816k6618K9577O0748K5386k8970L6551p526
13621e3057J59927J14789o8590j05203j4859P9620Q212m1003J39280M9275k6916
13610B41475p6212k45410k4968J18828M9411n0770j02551p6605N2110P8615k9697
13599f5774l9385j9558j0753J27531M0628K0885Q284J06625p2182j14980r8091
$$ plain form
13588 -116770 -166927 -182467 -210647 -220988 -122562 -72137 -73420 -94317 -132170 -142824 -222728 -320588
13576 -320588 -331363 -234896 -37298 63814 15869 -108318 -108784 32901 25697 5970 41119
13565 41119 19810 1307 114215 210552 124929 -87776 -205208 -123235 11858 22210 23597
13554 23597 108358 103353 94544 88419 111842 140590 -47187 -5848 -88997 -223067 -202760 -111768
13542 -111768 -5630 53274 95061 18896 1497 13163 59577 103355 58654 65712 22373
13531 22373 -55769 -83117 -47642 -84443 -50522 -42325 -22956 -51685 -14288 38583 336 -25872
13519 -25872 13616 29687 22852 48306 172721 137139 53271 49008 -26971 -40297 -10136 19705
13507 19705 29222 35248 20857 -41062 -27519 2472 111102 218334 106735 3543 54267
$$ packed form
13588a16770n0157j5540k8180j0341R8426N0425j283k0897l7853j0654p9904r7860
13576c20588j0775R6467J97598J01112m7945j24187m66J41685p204j9727L5149
13565D1119k1309j8503J12908R6337q5623k12705j17432Q1973J35093J0352J387
13554B3597Q4761n005q809o125K3423K8748j87777M1339q3149j34070K0307R0992
13542a11768J06138N8904M1787p6165j7399J1666M6414M3778m4701P058m3339
13531B2373p8142k7348L5475l6801L3921Q197J9369k8729L7397N2871l8247k6208
13519b5872L9488J6071o835K5454J24415l5582q3868m263p5979j3326L0161K9841
13507A9705R517O026j4391o1919J3543K9991J08630J07232j11599j03192N0724
$$ plain form
13496 54267 59551 -30513 -9652 -4275 34483 2981 -36879 -91624 -54498 -76888 -18531 68586
13484 68586 -38947 18200 42070 122620 188474 161457 196221 159934 161701 149105 114021 78224
13472 78224 114091 159885 111319 2060 -4941 44122 78350 74803 116373 93427 36850 34833
13460 34833 69829 60016 3939 -56851 -85017 -173877 -271446 -218791 -116776 -79407 -22773 25754
13448 25754 28783 84954 130480 99093 46260 -16138 -167847 -217591 -104701 6781 36236
13437 36236 -44168 -2240 50754 30348 66784 15849 -1043 -85874 -9365 -27703 76512
13426 76512 155664 93831 63396 11414 30400 -13950 -41930 -88535 -94259 -161843 -147315 -167491
13414 -167491 -190742 -194063 -225664 -246057 -131723 -15937 118393 211518 110025 -73698 -197996
$$ packed form
13496E4267N284r0064K0861N377L8758l1502l9860n4745L7126k2390N8357Q7117
13484F8586j07533N7147K3870Q0550O5854k7017L4764l6287J767j2596l5084l5797
13472G8224L5867M5794m8566j09259p001M9063L4228l547M1570k2946n6577k017
13460C4833L4996r813n6077o0790k8166q8860r7569N2655J02015L7369N6634M8527
13448B5754L029N6171M5526l1387n2833o2398j51709m9744J12890J11482K9455
13437C6236q0404M1928N2994k0406L6436n0935j6892q4831P6509j8338J04215
13426G6512P9152o1833l0435n1982J8986m4350k7980m6605n724o7584J4528k0176
13414a67491k3251l321l1601k0393J14334J15786J34330R3125j01493j83723j24298
$$ plain form
13403 -197996 -143045 27579 134075 268132 273595 189090 190557 167419 193711 159372 173764
13392 173764 87959 -42597 -7929 108722 172471 119524 15356 120288 75961 57063 52483
13381 52483 -29658 20506 76848 68169 54097 -113980 -137612 -90749 -26692 -49960 -57845 -12640
13369 -12640 -14522 -67208 -155627 -259440 -117732 58217 65179 -28017 -145252 -168336 -89822
13358 -89822 -100461 -186289 -69961 102144 249140 316306 272801 105382 12363 29569 -52801
13347 -52801 -5566 116363 217345 186009 96168 35647 -16422 -53956 -110647 -175326 -121830
13336 -121830 -68229 -39485 48397 -39177 19007 -11089 -35649 -37735 -20976 -50367 -17032 -62920
13324 -62920 -75884 -25763 168315 185367 19853 7201 -68262 -230673 -230944 -90344 24184
$$ packed form
13403a97996N4951J70624J06496J34057N463q4505J467k3138K6292l4339J4392
13392A73764q5805j30556L4668J16651O3749n2947j04168J04932m4327j8898m580
13381E2483q2141N0164N6342q679j4072j68077k3632M6863O4057k3268p885M5205
13369a2640j882n2686q8419j03813J41708J75949O962r3196j17235k3084P8514
13358h9822j0639q5828J16328J72105J46996O7166m3505j67419r3019J7206q2370
13347e2801M7235J21929J00982l1336q9841o0521n2069l7534n6691o4679N3496
13336a21830N3601K8744Q7882q7574N8184l0096k4560k086J6759k9391L3335m5888
13324f2920j2964N0121J94078J7052j65514j2652p5463j62411k71J40600J14528
$$ plain form
13313 24184 185993 209645 134108 116231 68835 12560 97717 56586 7162 118200 99714
13302 99714 22168 -136855 -245492 -177230 -78227 8714 -16460 2325 3761 147563 142386
13291 142386 106561 153201 11325 -25072 -37798 -144244 -116261 -114953 -41904 -39884 -1713
13280 -1713 -49811 -66333 -73084 -43408 43471 204219 126929 20234 21030 -159389 -112831 33787
13268 33787 72129 66134 2859 66903 117196 53701 38477 -79688 -25231 64000 206929
13257 206929 148585 123606 66453 20413 23280 41604 23020 41283 28259 -86162 20079
13246 20079 4775 -186900 -186821 -31067 47711 122108 -30626 -48693 2051 119412 125314 51905
13234 51905 22020 24765 32405 -5727 38311 96048 83503 -550 -2297 -66718 -115725 -112096
$$ packed form
13313B4184J61809K3652p5537j7877m7396n6275Q5157m1131m9424J11038j8486
13302I9714p7546j59023j08637O8262R9003Q6941k5174J8785J436J43802n177
13291A42386l5825M6640j41876l6397j2726j06446K7983J308P3049K020L8171
13280a713m8098j6522o751K9676Q6879J60748p7290j06695P96j80419M6558J46618
13268C3787L8342n995o3275O4044N0293o3495j5224j18165N4457Q9231J42929
13257B06929n8344k4979n7153m6040K867J8324j8584J8263j3024j14421J06241
13246B0079j5304j91675P9J55754P8778P4397j52734j8067N0744J17361N902p3409
13234E1905k9885K745P640l8132M4038N7737j2545q4053j747o4421m9007L629
$$ plain form
13222 -112096 -19260 71262 150365 33206 -60502 58546 154735 139971 82298 43173 86738
13211 86738 79460 -27859 11655 7213 52220 3485 -7643 -13214 -1476 65984 12858 -58925
13199 -58925 37379 194642 174640 59503 -98056 -113082 28400 93271 105119 82867 230890
13188 230890 149250 94739 96480 55044 -53167 -135018 -114668 -26659 -58642 13996 133744
13177 133744 86813 1175 -4966 -19400 -39678 -122549 -163293 -75641 -59469 -123208 -51468 63755
13165 63755 119562 43455 51712 18204 -92989 -139667 -210412 -165248 -177821 -176740 -211609 -189187
13153 -189187 -159118 -45720 55763 208457 99322 80216 65060 120737 -39765 -126481
13143 -126481 -71183 -18297 139566 222800 190532 107146 25819 -47648 -26764 24528 38652
$$ packed form
13222a12096R2836R0522P9103j17159r3708J19048R6189j4764n7673l9125M3565
13211H6738p278j07319L9514m442M5007m8735j1128n571J1738O7460n3126p1783
13199e8925R6304J57263k0002j15137j57559j5026J41482O4871J1848k2252J48023
13188B30890q1640n4511J741m1436j08211q1851K0350Q8009l1983P2638J19748
13177A33744m6931q5638o141j4434k0278q2871m0744Q7652J6172o3739P1740J15223
13165F3755N5807p6107Q257l3508j11193m6678p0745M5164j2573J081l4869K2422
13153a89187L0069J13398J01483J52694j09135j9106j5156N5677j60502q6716
13143a26481N5298N2886J57863Q3234l2268q3386q1327p3467K0884N1292J4124
$$ plain form
13132 38652 -70283 -140922 -198685 -176354 -96158 -133600 -133922 -142159 -59001 -64554 -87630 -40145
13120 -40145 -76330 -126466 -80302 -19135 102413 104228 145535 160264 282081 251776 59526
13109 59526 -67856 84479 78660 99121 148392 25356 -16383 50387 127469 167925 94890
13098 94890 76587 106201 121836 126599 78383 -63949 -90093 16035 17070 44576 147357
13087 147357 96156 96612 99744 25439 -43752 -88382 -83453 -23908 53940 46046 -13494 -14513 109322
13074 109322 19724 -198410 -4405 81595 25452 13582 6105 30625 -3895 -83555 -26369
13063 -26369 -50467 -92005 -32973 18951 -68583 -45342 -18836 8070 69693 144507 168326 130482
13051 130482 45579 -80573 -95102 -172665 -101061 -51375 -78729 -29262 -191960 -254306 -148238
$$ packed form
13132C8652j08935p0639n7763K2331Q0196l7442l22q237Q3158n553k3076M7485
13120d0145l6185n0136M6164O1167J21548J815M1307J4729J21817l0305j92250
13109E9526j27382J52335n819K0461M9271j23036m1739O6770P7082M0456p3035
13098I4890j8303K9614J5635M763m8216j42332k6144J06128J035K7506J02781
13087A47357n1201M56L132p4305o9191m4630M929N9545P7848p894n9540j019J23835
13074A09322q9598k18134J94005Q6000n6143j1870p477K4520l4520p9660N7186
13063b6369k4098m1538N9032N1924q7534K3241K6506K6906O1623P4814K3819l7844
13051A30482q4903j26152j4529p7563P1604M9686k7354M9467j62698o2346J06068
$$ plain form
13040 -148238 -149419 -118145 22745 62299 18059 -18506 47204 14305 101475 173869 170217 130275
13028 130275 115374 128675 166417 164364 79290 32181 18542 85235 20619 -8438 30950 89416
13016 89416 -12950 -87822 -111453 -76072 -6302 57561 86540 33653 -27624 -52379 -70682
13005 -70682 -105780 -164267 -116167 -125764 -116487 -9400 11328 -27624 23476 99146 2306 -107811
12993 -107811 -175840 -96054 -57248 -11468 -34150 -149664 -178901 -166391 -134913 -17902 34373
12982 34373 -94224 -191573 -119566 64675 129 -72176 -170303 -188236 -89688 -131833 -136923
12971 -136923 -233639 -268401 -149464 80523 153169 173280 146609 27875 -85388 -46469 -47306
12960 -47306 39128 160112 179739 146760 65078 -19405 23173 65073 106113 -7755 27808
$$ packed form
13040a48238j181L1274J40890L9554m4240l6565O5710l2899Q7170P2394l652l9942
13028A30275j4901J3301L7742k053q5074m7109j3639O6693o4616k9057L9388N8466
13016H9416j02366p4872k3631L5381O9770O3863K8979n2887o1277k4755j8303
13005g0682l5098n8487M8100r597R277J07087K0728l8952N1100P5670r6840j10117
12993a07811o8029P9786L8806M5780k2682j15514k9237J2510L1478J17011N2275
12982C4373j28597r7349P2007J84241o4546p2305r8127j7933R8548m2145n090
12971a36923r6716l4762J18937K29987P2646K0111k6671j18734j13263L8919q37
12960d7306Q6434J20984J9627l2979q1682q4483M2578M1900M1040j13868L5563
$$ plain form
12949 27808 -7441 7192 -108494 -241067 -253761 -99482 -113159 -231363 -241245 -175185 -117973
12938 -117973 -152534 -135285 -166783 -106717 -74632 -59934 -28098 76398 -33121 -72959 23405
12927 23405 119287 109841 75038 67884 85979 21673 3438 5780 80314 -28569 18255 25411
12915 25411 -54403 -156287 -1498 4219 -106087 -138966 -83009 -23798 -35972 -24344 -45932
12904 -45932 -33091 -219606 -309481 -274862 -195198 -176931 -157728 -19242 -124815 -208004 -132046
12893 -132046 -119146 -230185 -296602 -322058 -187406 -74331 -44737 27863 33742 -59983 -26362
12882 -26362 -49103 -80529 33311 109757 121834 61891 27345 51286 70105 61806 104626 137442
12870 137442 108825 60563 -1552 -23448 77456 102933 41311 9610 138243 149424 -30577
$$ packed form
12949B7808l5249J4633j15686j32573j2694J54279j3677j18204r882O6060N7212
12938a17973l4561J7249l1498O0066L2085J4698L1836J04496j09519l9838R6364
12927B3405R5882r446l4803p154J8095o4306j8235K342P4534j08883M6824P156
12915B5411p9814j01884J54789N717j10306l2879N5957N9211j2174J1628k1588
12904d5932J2841j86515q9875L4619P9664J8267J9203J38486j05573q3189P5958
12893a32046J2900j11039o6417k5456J34652J13075K9594P2600N879r3725L3621
12882b6362k2741l1426J13840P6446J2077n9943l4546K3941J8819q299M2820L2816
12870A37442k8617m8262o2115k1896J00904K5477o1622l1701J28633J1181j80001
$$ plain form
12859 -30577 16757 32734 16222 100884 134958 77469 2874 7999 -99993 -60161 91102
12848 91102 13908 -77595 -69225 41227 52646 -62136 -49210 49199 6490 -75327 42051
12837 42051 71261 -4774 59794 85930 98644 -102573 -213325 -231467 -189639 -98599 -55608
12826 -55608 -58620 5043 56221 -70442 -213343 -268615 -202788 -92580 122315 55221 -61057
12815 -61057 -5204 -18859 -22327 34041 67594 89983 -36002 19915 -68392 -134493 -165018 -55614
12803 -55614 130903 193148 114232 128676 137166 33452 51819 169959 187528 147166 163133
12792 163133 165010 167586 239607 232880 77169 -41134 -69918 -82474 27538 177755 189610
12781 189610 176413 153331 80470 -12537 -73378 -143594 -110200 -164665 -127357 -146607 -1528
$$ packed form
12859c0577M7334J5977j6512Q4662L4074n7489p4595N125j07992L9832J51263
12848I1102p7194r1503Q370J10452J1419j14782J2926R8409m2709q1817J17378
12837D2051K9210p6035O4568K6136J2714k01217j10752j8142M1828R1040M2991
12826e5608l012O3663N1178j26663j42901n5272O5827J10208K14895o7094j16278
12815f1057N5853j3655l468N6368L3553K2389j25985N5917q8307o6101l0525J09404
12803e5614J86517O2245p8916J4444Q490j03714J8367J18140J7569m0362J5967
12792A63133J877K576P2021o727j55711j18303k8784j2556J10012J50217J1855
12781A89610j3197k3082p2861r3007o0841p0216L3394n4465L7308j9250J45079
$$ plain form
12770 -1528 -3555 -137383 -141740 -22528 -139864 -208844 -253118 -241484 -125328 -36236 16908
12759 16908 -41333 -25520 1561 143197 147453 42848 15014 -79523 -104521 -19476 52928
12748 52928 74300 29423 45985 95244 74640 -16185 -53836 -139266 -111987 -24089 -77650 -126429
12736 -126429 -202572 -296227 -310663 -198421 -122318 -148867 -12294 66294 65282 -14064 -16105
12725 -16105 60497 24212 84629 39254 27225 58957 -33051 -221617 -268208 -224850 -130676
12714 -130676 -124530 -193073 -222409 -168135 -164945 -199249 -118011 -69731 -117914 -137107 -201059 -285574
12702 -285574 -266004 -193316 -176869 -150957 -77352 -133353 -201734 -138272 -96899 -113530 -113567 -19883
12690 -19883 -1168 -43520 -97071 -171056 -84506 -59377 -104731 -108140 -333656 -381643 -211756
$$ packed form
12770a528k027j33828m357J19212j17336o8980m4274J1634J16156Q9092N3144
12759A6908n8241J5813K7081J41636M256j04605k7834r4537k4998Q5045P2404
12748E2928K1372m4877J6562M9259k0604r0825l7651q5430K7279Q7898n3561m8779
12736a26429p6143r3655j4436J12242P6103k6549J36573P8588j012p9346k041
12725a6105P6602l6285O0417m5375j2029L1732r2008j88566m6591M3358R4174
12714a30676O146o8543k9336N4274L190l4304Q1238M8280m8183j9193o3952q4515
12702b85574J9570P2688J6447K5912P3605n6001o8381O3462M1373j6631l7R3684
12690a9883J8715m2352n3551p3985Q6550K5129m5354l409k25516m7987J69887
$$ plain form
12679 -211756 -97156 -8483 184835 177811 109088 -9430 -48472 59953 21202 -18602 -53174
12668 -53174 -60847 -48354 -44028 -103599 -124995 -29896 94191 114186 69234 82406 117447 76576
12656 76576 5845 -12193 39270 4857 98267 272271 256209 91171 -48335 21919 -2037
12645 -2037 -144083 -67818 52665 133114 134740 181666 182717 188959 134915 124707 114225 175516
12633 175516 183184 49879 -6157 -26302 -20217 -1475 -22854 -22734 -137148 -166467 -37543 44334
12621 44334 54212 -42696 13303 121725 118943 20776 -38340 -48842 1363 -12894 -47811 -124961
12609 -124961 -83077 11907 46652 41775 142782 218415 125919 65739 35038 -20307 -19127 88775
12597 88775 280546 252217 120511 91919 12700 16876 -20148 -69820 -73574 -3663 1999 -16707
$$ packed form
12679b11756J14600Q8673J93318p024o8723j18518l9042J08425l8751l9804l4572
12668e3174p673J2493M326n9571k1396R5099J24087J9995m4952J3172L5041m0871
12656G6576p0731j8038N1463l4413R3410J74004j6062j65038j39506P0254k3956
12645b037j42046P6265J20483Q0449J626M6926J051O242n4044j0208j0482O1291
12633A75516P668j33305n6036k0145O085J8742k1379J20j14414k9319J28924Q1877
12621D4334R878r6908N5999J08422k782r8167n9116j0502N0205j4257l4917p7150
12609a24961M1884R4984L4745m877J01007P5633r2496o0180l0701n5345J180J07902
12597H8775J91771k8329j31706k8592p9219M176l7024m9672l754O9911N662j8706
$$ plain form
12585 -16707 -116653 -54605 7895 46488 -48529 -125522 -198516 -201135 -193136 -165947 -186040 -167457
12573 -167457 -126673 -94371 -104352 -14792 4935 -10324 -31562 -51259 -37662 -22812 -163298
12562 -163298 -217709 -117937 -23293 -11625 -53683 -29937 -92342 -18567 166148 178982 77743
12551 77743 118768 108356 195344 154615 241001 303352 266631 188116 -33415 -149968 -184886
12540 -184886 -210776 -168059 -111623 -50316 -63570 -134035 -76459 -17680 -102404 -146785 -89817
12529 -89817 -82394 -131186 -180408 -93977 26965 122928 43927 -120485 -92055 -48530 -21990
12518 -21990 19642 -17420 138082 177805 177560 135079 91648 55543 -22383 31655 81706 71887
12506 71887 -75374 -117838 -81738 -24051 71810 -10666 -72691 -51463 -32186 67526 101727
$$ packed form
12585a6707r9946O2048O2500L8593r5017p6993p2994k619P999K7189k0093J8583
12573a67457M0784L2302r981Q9560J9727j5259k1238j9697J3597J4850j40486
12562a63298n4411R9772R4644J1668m2058K3746o2405P3775J84715J2834j01239
12551G7743M1025j0412Q6988m0729Q6386O2351l6721p8515k21531j16553l4918
12540a84886k5890M2717N6436O1307j3254p0465N7576N8779q4724m4381N6968
12529h9817P423m8792m9222Q6431J20942R5963p9001j64412K8430M3525K6540
12518b1990M1632l7062J55502L9723k45m2481m3431l6105p7926N4038N0051r819
12506G1887j47261m2464L6100N7687R5861q2476o2025K1228J9277R9712L4201
$$ plain form
12495 101727 -25491 3348 136688 36114 5331 19933 73511 86941 73017 2487 93877
12484 93877 139538 66203 24790 -69395 -47830 30467 170565 199522 218137 266945 330382
12473 330382 322848 279284 245522 278780 281475 215356 181001 224598 190214 73070 48207 51400
12461 51400 -19945 -35138 -60714 -113290 -189669 -187711 -87855 62536 139667 18937 -119210
12450 -119210 -110900 -80114 -82715 277 155857 83563 65321 82036 86917 -10562 17955 169925
12438 169925 171347 170414 195024 164773 79591 120717 29306 13433 -69574 -12682 -130562 -144082
12426 -144082 -58859 -77457 -186488 -233466 -195281 -86757 -85141 -32557 -42318 41701 -8305
12415 -8305 22789 11608 -12853 -70082 -67339 -23750 -84128 -155551 -126954 25168 -87574 -154239
$$ packed form
12495A01727j27218K8839J33340j00574l0783J4602N3578J3430j3924p0530R1390
12484I3877M5661p3335m1413r4185K1565P8297J40098K8957J8615M8808O3437
12473C30382p534m3564l3762L3258K695o6119l4355M3597l4384j17144k4863L193
12461E1400p1345j5193k5576n2576p6379J958R9856J50391P7131j20730j38147
12450a19210Q310L0786k601Q2992J55580p2294j8242J6715M881r7479K8517J51970
12438A69925J422r33K4610l0251q5182M1126r1411j5873q3007N6892j17880j3520
12426a44082Q5223j8598j09031m6978L8185J08524J616N2584r761Q4019n0006
12415h305L1094j1181k4461n7229K743M3589o0378p1423K8597J52122j12742o6665
$$ plain form
12403 -154239 -96797 -151271 -118223 -25791 -33133 -63725 27475 202606 162701 70331 60465 95645
12391 95645 21955 -65395 -22374 85648 96092 107702 -8986 -92355 -154015 -141365 -69535
12380 -69535 -33673 -1561 -41051 21384 6348 -117074 -126824 15249 86338 22242 74861
12369 74861 59011 55817 96565 125730 187170 162611 34649 9240 -58125 -42809 62598
12358 62598 66466 17322 -74341 -113022 -133970 -25725 6135 5853 144765 155087 -6234 -98224
12346 -98224 -46944 -5931 -29357 58909 58168 92944 121459 148146 245380 273250 115977 105068
12334 105068 12573 -158671 -184236 40032 89751 44294 104714 141853 81399 35007 59377
12323 59377 154240 217226 157447 77736 26581 10447 64821 109250 32478 -56142 -68200 -3127
$$ packed form
12403a54239N7442n4474L3048R2432p342l0592R1200J75131l9905r2370r866L5180
12391I5645p3690q7350M3021J08022J0444J1610j16688q3369o1660J2650P1830
12380f9535L5862L2112l9490O2435j5036j23422r750J42073P1089o4096N2619
12369G4861j5850l194M0748K9165O1440k4559j27962k5409o7365J5316J05407
12358F2598L868m9144r1663l8681k0948J08245L1860k82J38912J0322j61321r1990
12346i8224N1280M1013k3426Q8266p41L4776K8515K6687R7234K7870j57273j0909
12334A05068r2495j71244k5565K24268M9719m5457O0420L7139o0454m6392K4370
12323E9377R4863O2986n9779p9711n1155j6134N4374M4429p6772q8620j2058O5073
$$ plain form
12311 -3127 101121 135056 24769 -44660 23440 35274 5968 -22170 -137519 -175225 17151
12300 17151 91151 97190 23588 -125743 -215097 -176947 -27207 38685 -3339 91689 165300
12289 165300 110713 64873 -27623 21390 25138 18633 104589 61045 -6622 4996 54847 101110
12277 101110 45767 -24847 61160 -7481 -46963 -51594 -97682 -97658 -116631 -140763 -92312 -130490
12265 -130490 -66265 -82453 -107976 -132005 -189979 -83539 -16304 -36007 -41915 -78826 -124608
12254 -124608 -194951 -154849 -59746 -43107 -36651 31380 99759 -44694 -126364 -115265 50377
12243 50377 96082 79570 95679 44309 -41875 29303 23508 -151320 -128193 -73798 -56046 -55179
12231 -55179 -54778 -12226 58794 127216 24230 -20193 -50414 -25390 2024 -17302 71774 39180
$$ packed form
12311c127J04248L3935j10287o9429O8100J1834k9306k8138j15349l7706J92376
12300A7151P4000O039p3602j49331q9354L8150J49740O5892m2024R5028P3611
12289A65300n4587m5840r2496M9013L748o505Q5956m3544o7667J1618M9851M6263
12277A01110n5343p0614Q6007o8641l9482m631m6088K4j8973k4132M8451l8178
12265a30490O4225j6188k5523k4029n7974J06440O7235j9703n908l6911m5782
12254a24608p0343M0102R5103J6639O456O8031O8379j44453q1670J1099J65642
12243E0377M5705j6512J6109n1370q6184P1178n795j74828K3127N4395J7752Q67
12231e5179M01M2552P1020O8422j02986m4423l0221K5024K7414j9326Q9076l2594
$$ plain form
12219 39180 18899 34873 -55279 23585 98956 96955 -11108 -89597 -62561 106323 21275
12208 21275 -65496 -33564 -2399 -29710 -26489 -109229 -29272 71367 41983 6218 63933 59757
12196 59757 -50272 -59690 -29892 10825 -44834 -129521 -204387 -195680 -129220 -87561 -17243 2831
12184 2831 -56230 -136158 -95970 -81422 -67814 -82570 -52806 -69452 -167896 -57750 -86656 -100736
12172 -100736 -78206 -71107 -52375 74056 42944 -40075 -40099 59082 88626 2020 -62902 -116246
12160 -116246 -182053 -147563 -64086 -90390 -109957 -80291 -94869 -228457 -247553 -166503 20868
12149 20868 -33118 -181250 -126219 -11328 24581 -92455 -99126 -73225 -81831 -105593 -87154
12138 -87154 -10832 65641 201084 282095 283574 185278 108262 63960 43801 -70644 -167672
$$ packed form
12219C9180k0281J5974r0152P8864P5371k001j08063p8489K7036J68884q5048
12208B1275q6771L1932L1165k7311L221q2740P9957J00639k9384l5765N7715m176
12196E9757j10029r418K9798M0717n5659q4687p4866Q707O6460M1659P0318K0074
12184B831n9061p9928M0188J4548J3608j4756K9764j6646r8444J10146k8906j4080
12172a00736K2530P099J8732J26431l1112q3019k4R9181K9544q6606o4922n3344
12160a16246o5807L4490Q3477k6304j9567K9666j4578j33588j9096Q1050J87371
12149B0868n3986j48132N5031J14891L5909j17036o671K5901q606k3762J8439
12138h7154P6322P6473J35443Q1011J479r8296p7016m4302k0159j14445r7028
$$ plain form
12127 -167672 -155550 -199247 -90051 17184 112308 -48133 -96825 -7310 28545 -38019 51523
12116 51523 134116 90518 36801 35511 30305 -130 -1961 -11083 96232 100801 204395 234531
12104 234531 102774 59220 107426 84410 74317 89220 222 47196 -27998 -151946 -81218
12093 -81218 -28777 15730 22363 -1889 -32168 -45174 54472 75048 -2236 -69486 -89879 -95882
12081 -95882 13620 104907 78797 -17604 -68638 -12137 -56904 -72229 -113421 -120171 -103433 -76670
12069 -76670 -19725 -21789 -58358 -136498 -98402 -66689 -52856 -69473 -77125 -160709 -56500 1337
12057 1337 13230 -93869 -76324 52909 42333 85920 -26418 -211882 -158864 -100948 -167797
12046 -167797 -50577 105450 128087 123164 9290 -103331 -171232 -95997 -121764 -74977 53631
$$ packed form
12127a67672J2122m3697J09196J07235R5124j60441m8692Q9515L5855o6564Q9542
12116E1523Q2593m3598n3717j290n206l0435j831r122J07315M569J03594L0136
12104B34531j31757m3554M8206k3016j0093J4903q8998M6974p5194j23948P0728
12093h1218N2441M4507O633k4252l0279j3006R9646K0576p7284o7250k0393o003
12081i5882J09502R1287k6110r6401n1034N6501m4767j5325m1192o750J6738K6763
12069g6670N6945k064l6569p8140L8096L1713J3833j6617p652q3584J04209N7837
12057A337J1893j07099J7545J29233j0576M3587j12338j85464N3018N7916o6849
12046a67797J17220J56027K2637m923j13874j12621o7901P5235k5767M6787J28608
$$ plain form
12035 53631 64323 119408 38776 -71509 29382 -26315 6136 -39393 -59755 -62772 38670
12024 38670 96917 -22201 -54070 -163330 -209145 -172915 -105085 -87182 -70155 -106801 -224563
12013 -224563 -223173 -153555 -125300 -98240 -57041 1211 5444 -134999 -173743 -72026 52622
12002 52622 24080 95671 171280 183457 236680 148804 6965 -13615 8416 71526 6046
11991 6046 -43608 77454 -8394 -163284 -33234 16602 -8365 71198 46957 67367 42943
11980 42943 -35696 -40793 94982 83687 -44077 -61990 -914 4136 5496 -65061 -55433 -75076
11968 -75076 -89932 -134058 -283227 -217215 -108396 13968 113100 20666 -50995 -154712 -138267
11957 -138267 -129016 -195235 -199412 -153072 -178207 -83686 -119195 -132508 32585 115354 70571 2187
$$ packed form
12035E3631J0692N5085q0632j10285J00891n5697L2451m5529k0362l017J01442
12024C8670N8247j19118l1869j09260m5815L6230O7830J7903J7027l6646j17762
12013b24563J390O9618K8255K7060M1199N8252M233j40443l8744J01717J24648
12002E2622k8542P1591P5609J2177N3223q7876j41839k0580K2031O3110o5480
11991F046m9654J21062q5848j54890J30050M9836k4967P9563k4241K0410k4424
11980D2943p8639n097J35775j1295j27764j7913O1076N050J360p0557R628j9643
11968g5076j4856m4126j49169O6012J08819J22364R9132r2434p1661j03717J6445
11957a38267R251o6219m177M6340k5135R4521l5509j3313J65093Q2769m4783o8384
$$ plain form
11945 2187 -31337 -76254 -52421 -84205 -120245 -130214 -93258 668 55885 -88286 -99626 -69436
11933 -69436 -89143 -74458 -25292 -23231 -45204 22200 159395 152855 212566 170286 136066 47011
11921 47011 8655 -44546 -174779 -191623 -58154 76709 133276 93336 59153 15540 -96834
11910 -96834 -200169 -147886 -37855 37630 77410 90090 -38597 -114225 -31671 -13435 66470
11899 66470 30054 -26351 -39524 -5533 -33689 -159333 -202227 -104886 -103517 34220 172508
11888 172508 136855 40159 28765 185908 144383 108087 49115 79000 81746 6096 -84988
11877 -84988 -74839 -101435 -152914 -156958 -15070 115709 76810 11581 -11095 -52818 -65296
11866 -65296 -65489 -185607 -181754 -94903 -32229 -45832 -24674 -9577 149018 181032 -50297 -170662
$$ packed form
11945B187l3524m4917K3833l1784l6040r969L6956R3926N5217j44171j1340L0190
11933f9436j9707J4685M9166K061k1973O7404J37195o540N9711m2280l4220q9055
11921D7011l8356n3201j30233j6844J33469J34863N6567l9940l4183m3613j12374
11910i6834j03335N2283J10031P5485L9780J2680j28687p5628Q2554J8236P9905
11899F6470l6416n6405j3173L3991k8156j25644m2894R7341J369J37737J38288
11888A72508l5653r6696j1394J57143m1525l6296n8972K9885K746p5650r1084
11877h4988J0149k6596n1479m044J41888J30779l8899o5229k2676m1723j2478
11866f5296j93j20118L853Q6851O2674j3603K1158J5097J58595L2014k31329j20365
$$ plain form
11854 -170662 -212938 -202248 -167060 -67357 -62960 -159224 -247854 -233086 -148788 -69074 13789 -50885
11842 -50885 -184781 -192186 -124216 10568 62391 -6891 -9626 -11684 62210 -60385 -204675
11831 -204675 -266681 -120323 -78540 -164598 -273694 -340810 -359976 -151602 -29783 -76920 -106362
11820 -106362 -124945 -288067 -245926 -144379 -51020 12173 -3301 -114872 -94857 -7654 21642
11809 21642 105873 108299 24148 -30901 -2699 33930 12049 42202 -29285 -4953 -4346 53303
11797 53303 -15384 -108802 -141868 -35839 -116336 -96962 3379 1799 -78584 -112760 -31575
11786 -31575 -41114 -151460 -171835 -199441 -229284 -242002 -117356 -125543 -64786 -75586 -303924
11775 -303924 -296135 -243595 -192292 -237606 -236462 -159382 -210687 -75249 25185 16414 12774 -34952
$$ packed form
11854a70662m2276J0690L5188R9703M397r6264q8630J4768Q4298P9714Q2863o4674
11842e0885j33896p405O7970J34784N1823o9282k735k058P3894j22595j44290
11831b04675o2006J46358M1783q6058j09096o7116j9166K08374J21819m7137k9442
11820a06362j8583j63122M2141J01547R3359O3193j5474j11571K0015Q7203K9296
11809B1642Q4231K426q4151n5049K8202L6629k1881L0153p1487K4332O07N7649
11797E3303o8687r3418l3066J06029q0497J9374J00341j580q0383l4176Q1185
11786c1575r539j10346k0375k7606k9843j2718J24646q187O0757j0800k28338
11775c03924P789N2540N1303m5314J144P7080n1305J35438J00434q771l640m7726
$$ plain form
11763 -34952 -112385 -45524 82153 120504 10879 44573 47693 72713 82068 55741 -9949 -117728
11751 -117728 -277790 -244003 -170352 -151972 -69992 -37227 -15848 52782 98217 137780 166852
11740 166852 168421 176726 66113 -114932 -180616 -163929 -135263 -135660 13705 32629 1965 5830
11728 5830 -80508 -153620 -134667 -23863 21992 40557 -21005 7167 -63983 -127774 -75081 -275
11716 -275 -80151 -171115 -88069 49479 90907 42769 -17422 -22409 -25257 -14361 -31636 -91676
11704 -91676 -118553 -178327 -195797 -75157 22103 25976 80659 51586 50266 49299 -8280 -33792
11692 -33792 -105827 -141305 -106292 -158693 -194263 -134021 -82161 -65312 -110444 -80162 -159017 -160832
11680 -160832 -56489 -62426 -94580 -88842 -98299 -69655 -29284 -117023 -49270 32103 33729 56455
$$ packed form
11763c4952p7433O6861J27677L8351j09625L3694L120K5020R355k6327o5690j07779
11751a17728j60062L3787P3651J8380Q1980L2765K1379O8630M5435L9563K9072
11740A66852J569Q305j10613j81045o5684J6687K8666l97J49365J8924l0664L865
11728E830q6338p3112J8953J10804M5855J8565o1562K8172p1150o3791N2693P4806
11716b75p9876r0964Q3046J37548M1428m8138o0191m987k848J0896j7275o0040
11704i1676k6877n9774j7470J20640R7260L873N4683k9073j320r67n7579k5512
11692c3792p2035l5478L5013n2401l5570O0242N1860J6849m5132L0282p8855j815
11680a60832J04343n937l2154N738r457K8644M0371q7739O7753Q1373J626K2726
$$ plain form
11668 56455 67889 28086 18025 49148 15944 -153182 -158907 -175568 -130688 -69882 -76549 83338
11656 83338 74128 141805 84381 75701 2699 2334 -84918 -30791 56133 -17159 -12171 116989
11644 116989 218031 72660 -46725 -102760 -142100 -187233 -148463 -117055 24650 149287
11634 149287 165438 138347 -91023 -214290 -259105 -296446 -203616 -142633 -77994 -63218 103339
11623 103339 54223 52796 61780 25611 84425 125708 -10423 -56581 -104510 -137049 -31421
11612 -31421 -77057 -52695 -167923 -125467 -117415 -89467 16143 8514 -46691 9878 -8913 17598
11600 17598 43936 39345 87693 134792 165219 103254 51469 50838 128 -7942 -108355 -233474
11588 -233474 -154677 -70378 44328 114130 145930 27660 -111722 -156233 -245404 -164938 -170689
$$ packed form
11668E6455J1434l9803j0061L1123l3204j69126n725j6661M4880O0806o667J59887
11656H3338r210O7677n7424q680p3002l65q7252N4127Q6924p3292M988J29160
11644A16989J01042j45371j19385n6035l9340m5133L8770L1408J41705J24637
11634A49287J6151k7091k29370j23267m4815l7341R2830O0983O4639J4776J66557
11623A03339m9116j427Q984l6169N8814M1283j36131m6158m7929l2539J05628
11612c1421m5636K4362j15228M2456Q052K7948J05610p629n5205N6569j8791K6511
11600A7598K6338m591M8348M7099L0427o1965n1785o31n0710q070j00413j25119
11588b33474P8797Q4299J14706O9802L1800j18270j39382m4511q9171Q0466n751
$$ plain form
11577 -170689 -156188 -132660 -140600 -187851 -125291 -160466 -47580 98852 70570 79186 90357
11566 90357 91609 33041 -1341 -82131 -88013 10262 111630 153015 186163 106305 -45286 -113109
11554 -113109 -4359 115348 106829 47815 -9503 69350 105667 -2585 -84351 -92382 -120664
11543 -120664 -30946 -38951 -111156 -24160 -19824 -25460 34145 71009 100954 124889 84099 -21508
11531 -21508 37062 79173 105576 53898 -119146 -127554 4902 89555 153514 35099 -38057
11520 -38057 42519 27229 -117034 -34296 139721 189015 145459 118405 16732 36206 159877
11509 159877 208884 109110 7998 -52925 -115946 -43720 43758 67193 44506 -18250 13446
11498 13446 -27478 20498 114224 74797 19025 30455 9356 -25856 -26512 -88043 19602 177451
$$ packed form
11577a70689J4501K3528p940m7251O2560l5175J12886J46432k8282Q616J1171
11566I0357J252n8568l4382q0790n882R8275J01368M1385L3148p9858j51591o7823
11554a13109J08750J19707q519n9014n7318P8853L6317j08252q1766q031k8282
11543a20664Q9718q005p2205Q6996M336n636N9605L6864K9945K3935m0790j05607
11531b1508N8570M2111K6403n1678j73044q408J32456Q4653O3959j18415p3156
11520c8057Q0576j5290j44263Q2738J74017M9294m3556k7054j01673J9474J23671
11509A59877M9007r9774j01112o0923o3021P2226Q7478K3435k2687o2756L1696
11498A3446m0924M7976R3726l9427n5772J1430k1099l5212o56o1531J07645J57849
$$ plain form
11486 177451 225998 18379 -54567 13019 -21583 14901 -45021 -37431 9657 60703 103293
11475 103293 62142 -28982 9186 72731 148537 261500 305816 182063 72047 -5348 -68717
11464 -68717 -196909 -147677 -99058 -30536 -57995 -46488 -83298 -72815 80936 69170 25342
11453 25342 -25281 -47512 104021 166522 152305 86536 49463 -99651 -220862 -101054 -91103
11442 -91103 -217075 -173263 -216982 -115948 -3106 -82453 -22670 21730 60134 62046 43755
11431 43755 60228 31976 67135 174385 142294 -131426 -289242 -186368 -85670 -99850 -159701
11420 -159701 -86097 45444 24315 108628 130489 159431 80552 76415 71127 86180 21778 -6767
11408 -6767 -19396 13555 130993 135053 139531 151526 171125 275190 231501 135727 29644 47729
$$ packed form
11486A77451M8547k07619p2946O7586l4602L6484n9922P590M7088N1046M2590
11475A03293m1151r1124L8168O3545P5806J12963M4316j23753j10016p7395o3369
11464f8717j28192M9232M8619O8522k7459J1507l6810J0483J53751j1766m3828
11453B5342n0623k2231J51533O2501j4217o5769l7073j49114j21211J19808R951
11442i1103j25972M3812m3719J01034J12842p9347N9783M4400L8404J912j8291
11431D3755J6473k8252L5159J07250l2091k73720j57816J02874J00698j4180n9851
11420a59701P3604J31541k1129Q4313K1861K8942p8879m137n288J5053o4402k8545
11408f767j2629L2951J17438M060M478J1995J9599J04065m3689r5774j06083J8085
$$ plain form
11396 47729 10760 46201 12484 115231 232644 266127 144699 28413 -134863 -117000 -40581
11385 -40581 -11727 -70594 -48695 -24331 11994 -1692 -121567 -102970 -107065 -146995 -67750 19687
11373 19687 -23260 -5352 64243 132420 129161 115210 217056 193393 117379 92890 99637 99764
11361 99764 6667 98906 139883 102459 138583 72695 24898 -23618 81649 146693 105830
11350 105830 134415 62909 52825 150851 172392 121571 38582 -31644 -18314 84315 87775
11339 87775 18399 -30321 -82471 -65593 33687 28781 -85571 -42512 -30828 55267 11491 -129848
11327 -129848 -93485 39179 76145 75712 31878 -99783 -72266 -22337 -10643 -64158 -55944 6939
11315 6939 -82938 -130770 -7641 35187 -38598 -54873 59755 214919 112192 3796 31084
$$ packed form
11396D7729l6969L5441l3717J02747J17413L3483j21428j16286j63276J7863P6419
11385d0581K8854n8867K1899K4364L6325j3686j19875J8597m095l9930P9245Q7437
11373A9687m2947J7908O9595O8177l259j3951J01846k3663p6014k4489O747J27
11361I9764r3097R2239M0977l7424L6124o5888m7797m8516J05267O5044m0863
11350A05830K8585p1506j0084R8026K1541n0821q2989p0226J3330J02629L460
11339H7775o9376m8720n2150J6878R9280m906j14352M3059J1684Q6095m3776j41339
11327a29848L6363J32664L6966m33m3834j31661K7517M9929J1694n3515Q214O2883
11315F939q9877m7832J23129M2828p3785j6275J14628J55164j02727j08396K7288
$$ plain form
11304 31084 23172 124985 145271 34035 -84765 -61199 6894 -3563 36877 5119 70125
11293 70125 20022 92680 123821 3521 -83182 -35335 82693 -65284 -46979 47134 162910
11282 162910 204779 243107 205878 159313 25964 -7793 -52251 -73341 111004 61104 50795
11271 50795 67206 147049 171584 165175 269795 375284 430819 492718 658544 923242 1443488
11260 1443488 1950942 2143527 2229215 2164774 1727507 1145952 677948 420544 289042 226960
11250 226960 265030 258162 264742 167559 679 -13628 -62580 -63126 -19983 43807 51977 46970
11238 46970 62279 15536 -5200 -22231 -90319 -80288 -107380 -119969 -91734 -198126 -159037
11227 -159037 -135600 10385 56880 -28244 -109571 7177 164856 50639 15696 -66967 -21864
$$ packed form
11304C1084p912J01813K0286j11236j18800K3566O8093j0457M0440l1758O5006
11293G0125n0103P2658L1141j20300q6703M7847J18028j47977J8305R4113J15776
11282A62910M1869L8328l7229m6565j33349l3757m4458k1090J84345m9900j0309
11271E0795J6411P9843K4535o409J04620J05489N5535O1899J65826K64698N20246
11260A443488N07454J92585Q5688o4441m37267n81555m68004k57404j31502o2082
11250B26960L8070o868O580r7183j66880j4307m8952n46M3143O3790Q170n007
11238D6970J5309m6743k0736j7031o8088J0031k7092j2589K8235j06392L9089
11227a59037K3437J45985M6495q5124q1327J16748J57679j14217l4943q2663M5103
$$ plain form
11216 -21864 130621 147679 244255 269458 169745 67432 125574 115456 130804 -45883 -119815
11205 -119815 -59801 -30965 -3165 -39878 107652 84618 -8310 -17330 -18640 49603 -18404 -106231
11193 -106231 -4273 87554 106558 121907 135020 79580 -19339 -86 4474 39154 78985
11182 78985 113042 2169 -46595 70779 126890 202195 102977 -32975 -95087 -156916 -115895
11171 -115895 -131932 42384 104523 177661 124403 18857 -17865 -31159 6518 128934 238772
11160 238772 149417 9005 -66172 81755 88178 47866 9743 12183 35648 57229 153952
11149 153952 139740 35424 -44674 -139089 -190520 -305259 -248858 -126626 -115560 -142936 -35554
11138 -35554 -7739 21088 33455 65455 163650 62105 28405 -26677 -28806 -67841 -59354 24465
$$ packed form
11216b1864J52485J7058R6576K5203r9713j02313N8142j0118J5348j76687p3932
11205a19815O0014K8836K7800l6713J47530k3034r2928r020j310O8243o8007q7827
11193a06231J01958R1827J9004J5349J3113n5440r8919J9253M560L4680L9831
11182G8985L4057j10873m8764J17374N6111P5305r9218j35952o2112o1829M1021
11171a15895j6037J74316O2139P3138n3258j05546l6722j3294L7677J22416J09838
11160B38772q9355j40412p5177J47927O423m0312l8123K440K3465K1581R6723
11149A53952j4212j04316q0098r4415n1431j14739N6401J22232J1066k7376J07382
11138c5554K7815K8827J2367L2000R8195j01545l3700n5082k129l9035Q487Q3819
$$ plain form
11126 24465 -9655 -64689 -29454 32773 141502 116077 59217 84795 5933 11989 34651 21153
11114 21153 6651 -28395 40756 126723 87664 27378 -8023 37575 70160 122783 224375
11103 224375 308777 231647 77325 37605 145522 177467 77431 100562 23582 74429 128357
11092 128357 44009 22509 -68153 -157524 -76801 58744 79289 -62922 -65021 -140360 -201294
11081 -201294 -123491 -106302 -122007 -67675 -40932 -100135 -140455 -96122 -90217 -83786 -48529 -17392
11069 -17392 61486 23428 -53744 50943 145071 126125 80121 -11087 -93282 -146701 -172993
11058 -172993 -80341 13392 25309 -23665 -119699 -45863 -55728 -69520 -129896 -120077 -112506 -204171
11046 -204171 -254537 -178922 -132637 -102413 -25713 -544 50566 -27525 -98840 -39612 64904
$$ packed form
11126B4465l4120n5034L5235O2227J08729k5425n6860K5578p8862O056K2662j3498
11114B1153j4502l5046O9151Q5967l9059o0286l5401M5598L2585N2623J01592
11103B24375Q4402p7130j54322l9720J07917L1945j00036K3131p6980N0847N3928
11092A28357q4348k1500r0662q9371Q0723J35545K0545j42211k099p5339o0934
11081b01294P7803J7189j5705N4332K6743n9203m0320M4333N905O431L5257L1137
11069a7392P8878l8058p7172J04687R4128j8946m6004r1208q2195n3419k6292
11058a72993R2652R3733J1917m8974r6034P3836r865j3792o0376R819P571r1665
11046b04171n0366P5615M6285L0224P6700K5169N1110p8091p1315N9228J04516
$$ plain form
11035 64904 -12340 -54444 30389 133339 60648 -44775 -92296 63558 120024 -13164 -103890
11024 -103890 -216925 -268607 -233736 -126697 -84817 -21072 121624 118482 -97132 -105153 68060
11013 68060 20104 -34971 92144 142399 84131 120811 41652 149330 238883 179155 60101
11002 60101 -51193 26407 32205 -6517 27498 31503 89838 227222 219478 130984 220423 219052
10990 219052 150960 -57327 -67301 31464 55038 77505 100391 201853 229084 145619 69358
10979 69358 225393 447442 675812 835959 776500 717495 698590 587657 431538 410177
10969 410177 391817 299920 212721 92940 31793 54167 10407 -23013 65093 160783 295303
10958 295303 341831 282706 261307 185477 163085 235736 278485 297584 284826 163630 125794
$$ packed form
11035F4904p7244m2104Q4833J02950p2691j05423m7521J55854N6466j33188r0726
11024a03890j13035n1682L4871J07039M1880O3745J42696l142k15614q021J73213
11013F8060m7956n5075J27115N0255n8268L6680p9159J07678Q9553n9728j19054
11002F0101j11294P7600N798l8722L4015M005N8335J37384p744q8494Q9439j371
10990B19052o8092k08287r974R8765K3574K2467K2886J01462K7231q3465p6261
10979F9358J56035K22049K28370J60147n9459n9005j8905j10933j56119k1361
10969D10177j8360r1897q7199j19781o1147K2374m3760l3420Q8106R5690J34520
10958B95303M6528n9125k1399p5830k2392P2651M2749J9099j2758j21196l7836
$$ plain form
10947 125794 170372 179580 112778 89714 52004 71569 77790 48762 -9430 103679 295956
10936 295956 317192 394473 430932 467883 423450 322088 301969 367588 431218 435906 460685
10925 460685 550368 456847 402708 323465 308226 366693 496653 514477 475404 444706 376749
10914 376749 132928 133122 202426 252347 346215 373821 436706 535079 552672 571771 717199
10903 717199 697618 675002 775244 817705 919423 919160 855397 814076 807587 794150 815023 803264
10891 803264 1041632 1174609 1220513 1310152 1276048 1230732 1181370 1181998 1209740 1382373 1634511
10880 1634511 1883836 2156942 2491502 2870945 3263641 3576885 3938917 4540829 5275398
10871 5275398 5961275 6417517 6650405 6807564 6999044 7353427 8036848 8842833 9801723
$$ packed form
10947A25794M4578R208o6802k3064l7710J9565O221k9028n8192J13109J92277
10936B95956K1236P7281L6459L6951m4433j01362k0119O5619O3630M688K4779
10925D60685Q9683r3521n4139p9243j5239N8467J29960J7824l9073l0698o7957
10914C76749k43821J94O9304M9921R3868K7606O2885R8373J7593J9099J45428
10903G17199j9581k2616J00242M2461J01718k63o3763m1321o489j3437K0873j1759
10891H03264K38368J32977M5904Q9639l4104m5316m9362O28K7742J72633K52138
10880A634511K49325K73106L34560L79443L92696L13244L62032O01912P34569
10871E275398O85877M56242K32888J57159J91480L54383O83421Q05985R58890
$$ plain form
10862 9801723 11110732 12853056 15078061 18074271 22052616 27006371 33525408 42641851
10854 42641851 56080583 76706821 110051873 164282142 247546356 341787459 395761148
10847 395761148 401785306 359043571 269361567 180368082 119174757 82036484 59565272
10840 59565272 45437291 35890617 29132006 24025078 19991476 16822583 14252009 12250964
10832 12250964 10598837 9205378 8314082 7644373 6979503 6635887 6499436 6465644 6416826
10823 6416826 6101114 5654742 5141669 4407368 3842577 3541018 3325838 3061042 2835077
10814 2835077 2601459 2439107 2391643 2407495 2287535 2113539 1867796 1721342 1574443 1440303
10804 1440303 1290462 1295793 1357608 1469980 1374284 1299631 1222124 1203468 1111858 1136407 1152640
$$ packed form
10862I801723J309009J742324K225005K996210L978345M953755O519037R116443
10854D2641851J3438732K0626238L3345052N4230269Q3264214R4241103N3973689
10847C95761148O024158m2741735q9682004q8993485o1193325l7138273k2471212
10840E9565272j4127981r546674o758611n106928m033602l168893k570574k001045
10832A2250964j652127j393459q91296o69709o64870l43616j36451l3792m8818
10823F416826l15712m46372n13073p34301n64791l01559k15180k64796k25965
10814B835077k33618j62352m7464J5852j19960j73996k45743j46454j46899j34140
10804A440303j49841N331O1815J12372r5696p4653p7507j8656r1610K4549J6233
$$ plain form
10793 1152640 1046514 1008250 1077115 1096545 1140482 1077410 1029152 950982 787863 744235 817110
10782 817110 812143 818559 722652 628703 628736 653336 585394 444195 508536 536717 521349 615232
10770 615232 699513 645865 608405 600459 583092 626189 631198 627155 445385 254788 198002 172894
10758 172894 182377 232889 273216 302550 349299 272936 228828 188633 114803 116444 41009 -17899
10746 -17899 34943 163747 268314 233311 160614 141821 157885 207345 241587 293179 351232
10735 351232 318775 312104 337618 411116 355570 259472 325300 412463 604592 599781 535567 465007
10723 465007 285517 194319 181432 285293 309321 349628 435949 426444 262577 217190 209699
10712 209699 259814 257960 231467 207496 253799 288552 296356 216135 95081 -34866 -42228 38820
$$ packed form
10793A152640j06126l8264O8865J9430M3937o3072m8258p8170j63119m3628P2875
10782H17110m967O416r5907r3949L3K4600o7942j41199O4341K8181j5368R3883
10770F15232Q4281n3648l7460p946j7367M3097N009m043j81770j90597n6786k5108
10758A72894R483N0512M0327K9334M6749p6363m4108m0195p3830J641p5435n8908
10746a7899N2842J28804J04567l5003p2697j8793J6064M9460L4242N1592N8053
10735C51232l2457o671K5514P3498n5546r6098O5828Q7163J92129m811o4214p0560
10723D65007j79490r1198j2887J03861K4028M0307Q6321r505j63867m5387p491
10712B09699N0115j854k6493k3971M6303L4753P804q0221j21054j29947p362Q1048
$$ plain form
10700 38820 134044 135922 152068 194680 278283 285528 222079 180638 157031 74100 133735 136512
10688 136512 144467 173348 320971 290415 252896 303024 309587 267981 297989 275501 289577 189280
10676 189280 154608 122550 97196 21059 -130909 -172952 -172908 -168162 -32646 57765 18515 35118
10664 35118 -6812 -31870 -7443 21457 -47281 -60712 130574 175248 154044 152419 163926 217537
10652 217537 186255 139803 194433 227567 228640 182712 200938 281246 397146 479444 341579
10641 341579 211873 179522 200874 185139 203949 204666 233925 212913 120280 -8439 -71033
10630 -71033 -72263 32827 -11083 -3663 -19808 -10057 25703 71310 18082 29484 -38377 -157156
10618 -157156 -84376 -25825 -5165 119260 137416 62593 65215 152560 178768 131056 69769
$$ packed form
10700C8820R5224J878J6146M2612Q3603P245o3449m1441k3607q2931N9635K777
10688A36512P955K8881J47623l0556l7519N0128O563m1606L0008k2488J4076j00297
10676A89280l4672l2058k5354p6137j51968m2043M4M746J35516R0411l9250J6603
10664C5118m1930k5058K4427K8900o8738j3431J91286M4674k1204j625J1507N3611
10652B17537l1282m6452N4630L3134J073m5928J8226Q0308J15900Q2298j37865
10641C41579j29706l2351K1352j5735J8810P17K9259k1012r2633j28719o2594
10630g1033j230J05090m3910P420j6145R751L5760M5607n3228J1402o7861j18779
10618a57156P2780N8551K0660J24425J8156p4823K622Q7345K6208m7712o1287
$$ plain form
10607 69769 19938 112300 106217 -18742 62275 279687 288070 231881 65269 47182 45642 89139
10595 89139 59376 -11601 41270 47548 90202 36299 2522 17650 -23572 -20578 -18877 -69034
10583 -69034 -115432 -47144 -26175 -103049 -87480 -142499 -287462 -336239 -124347 -66381 -56866
10572 -56866 81557 84728 13279 -33949 -82228 -38954 -2832 -8420 -29361 445 28622 63670
10560 63670 15805 -2685 66141 120887 39516 -80364 -116357 26319 13803 -153821 -108325
10549 -108325 -48486 -94911 -107830 -124144 -131836 79883 176862 89739 -49778 -82829 55599
10538 55599 162722 157693 140020 144116 54706 18094 -45802 10184 16403 -112799 -44341 -48989
10526 -48989 21208 -4196 -189861 -292635 -204389 -163274 -71159 -116452 -155267 -64828 1847
$$ packed form
10607F9769m9831R2362o083j24959Q1017K17412Q383n6189j66612j8087j540M3497
10595H9139k9763p0977N2871O278M2654n3903l3777J5128m1222K994J701n0157
10583f9034m6398O8288K0969p6874J5569n5019j44963m8777K11892N7966R515
10572e6866J38423L171p1449m7228m8279M3274L6122n588k0941K9806K8177L5048
10560F3670m7865j8490O8826N4746q1371j19880l5993J42676j2516j67624M5496
10549a08325N9839m6425j2919j6314p692K11719R6979q7123j39517l3051J38428
10538E5599J07123n029j7673M096q9410l6612o3896N5986O219j29202O8458m648
10526d8989P0197k5404j85665j02774Q8246M1115R2115m5293l8815R0439O6675
$$ plain form
10515 1847 -94295 -23957 2673 -59328 -53641 -24753 19654 -54565 -25352 43396 55773 26727
10503 26727 66821 39478 -8832 -154340 -273632 -262664 -233174 -128611 -4513 78230 147011
10492 147011 102426 -26938 -23507 -13223 -82689 -69814 -3011 -70469 -53197 61692 65013
10481 65013 -1824 -40301 -144589 -185460 -121172 -9475 139275 127423 36407 93409 105507
10470 105507 63928 -24294 -270734 -225830 -163547 -3487 18449 -31718 -75564 -40981 148217
10459 148217 214751 157250 165932 106914 27325 90535 92826 121506 132379 141365 14804 -99871
10447 -99871 -69745 -40115 3482 -7069 -14188 56138 100069 136217 246554 426493 495297
10436 495297 526961 806066 1207365 1797421 2252045 2362774 2236086 1867459 1314133 863919
$$ packed form
10515A847r6142P0338K6630o2001N687K8888M4407p4219K9213O8748J2377k9046
10503B6727M0094k7343m8310j45508j19292J0968K9490J04563J24098Q2743O8781
10492A47011m4585j29364L431J0284o9466J2875O6803o7458J7272J14889L321
10481F5013o6837l8477j04288m0871O4288J11697J48750j1852r1016N7002J2098
10470A05507m1579q8222k46440M4904O2283J60060K1936n0167m3846L4583J89198
10459A48217O6534n7501Q682n9018p9589O3210K291K8680J0873Q986j26561j14675
10447i9871L0126K9630M3597j0551p119P0326M3931L6148J10337J79939O8804
10436D95297L1664K79105M01299N90056M54624J10729j26688l68627n53326m50214
$$ plain form
10426 863919 652960 574576 406869 215245 99639 226415 87793 -24869 10980 60495
10416 60495 90789 76396 18944 13274 -44049 38481 -6371 36062 89345 143137 54646 69484
10404 69484 79098 73707 -5927 -100244 -9045 10209 -40958 -95084 -77506 17610 -33852 -36830
10392 -36830 18696 -35037 -17233 -18755 -23471 -123395 -91550 -50951 -84038 -104666 -108956 -118662
10380 -118662 -89175 -109504 -109869 -113244 -144459 -212361 -140801 -115313 -102940 22673 48959 3768
10368 3768 1524 -47574 -155038 -167890 -108865 28382 93465 160074 174891 94847 -5231
10357 -5231 -63359 -23569 69927 59657 16393 -32809 -36195 26231 147689 302554 384403 234767
10345 234767 -2305 -22612 72317 101946 190285 127046 30100 -79342 -105953 -101262 62707
$$ packed form
10426H63919k10959p8384j67707j91624j15606J26776j38622j12662L5849M9515
10416F0495L0294j4393n7452n670n7323Q2530m4852M2433N3283N3792q8491J4838
10404F9484R614n391p9634r4317R1199J9254n1167n4126J7578R5116n1462k978
10392c6830N5526n3733J7804j522m716r9924L1845M0599l3087k0628m290r706
10380a18662K9487k0329l65l375l1215o7902P1560K5488J2373J25613K6286m5191
10368C768k244m9098j07464j2852N9025J37247O5083O6609J4817q0044j00078
10357e231n8128L9790R3496j0270m3264m9202l386O2426J21458J54865Q1849j49636
10345B34767k37072k0307R4929K9629Q8339o3239r6946j09442k6611M691J63969
$$ plain form
10334 62707 124270 87854 29443 1092 151588 238453 163878 133716 133042 89363 59572 28111
10322 28111 -9682 -25652 -34407 -93 16587 -115846 -180145 -163285 -140695 -124290 -29325 62161
10310 62161 28418 -177390 -140117 -71074 -84102 -96572 -6396 -62456 -8297 2102 -18865
10299 -18865 25487 -67702 -175808 -164950 -107452 -111700 -203073 -154980 -34 6581 -138437
10288 -138437 -255342 -207254 31404 2161 -59989 64192 136871 181200 152038 71868 -19479
10277 -19479 -45966 -53599 -135004 -151410 -160259 -180255 -136530 -76355 -962 724 73259 -3262
10265 -3262 -57957 -41574 40256 45939 -84507 -110439 -161302 -131411 -113350 12878 104458 91084
10253 91084 148058 70928 -68150 -154945 -155171 -258961 -221738 -195673 -216641 -220902 -243043 -141524
$$ packed form
10334F2707O1563l6416n8411k8351J50496Q6865p4575l0162o74m3679k9791l1461
10322B8111l7793j5970q755L4314J6680j32433o4299J6860K2590J6405R4965R1486
10310F2161l3743k05808L7273O9043j3028j2470R0176n6060N4159J0399k0967
10299a8865M4352r3189j08106J0858N7498m248r1373M8093J54946O615j45018
10288a38437j16905M8088K38658k9243o2150J24181P2679M4329k9162q0170r1347
10277a9479k6487p633q1405j6406q849j9996M3725O0175P5393J686P2535p6521
10265c262n4695J6383Q1830N683j30446k5932n0863K9891J8061J26228R1580j3374
10253I1084N6974p7130j39078q6795k26j03790L7223K6065k0968m261k2141J01519
$$ plain form
10241 -141524 -112194 -164876 -275355 -241007 -163636 -16265 74549 76387 152542 47966 45336
10230 45336 106060 88543 15652 -70965 -101036 -71705 -72631 -46492 -33965 -20278 -17309 -116040
10218 -116040 -127437 22121 42425 -24775 -24927 -2928 -77924 -177442 -182359 -154463 -235920 -128849
10206 -128849 -13746 -30596 -80218 -98680 -41656 20189 58467 14218 -19951 -8564 -15846
10195 -15846 34486 72840 103621 201947 242214 264307 167898 105660 95283 62636 25955 35768
10183 35768 90776 26643 7062 21034 -13072 56300 64585 72715 27645 -80997 -173187 -184714
10171 -184714 -174284 -67880 -18723 -195710 -252514 -174940 -71912 49168 45385 -9401 -110286
10160 -110286 -66568 93321 79805 -58956 -171883 -223982 -183408 -49920 -98230 -107729 -138128
$$ packed form
10241a41524K9330n2682j10479L4348P7371J47371R0814J838P6155j04576k630
10230D5336O0724j7517p2891q6617l0071K9331r26K6139J2527J3687K969r8731
10218a16040j1397J49558K0304o7200j52K1999p4996r9518m917K7896q1457J07071
10206a28849J15103j6850m9622j8462N7024O1845L8278m4249l4169J1387p282
10195a5846N0332L8354L0781R8326M0267K2093r6409o2238j0377l2647l6681R813
10183C5768N5008o4133j9581J3972l4106O9372Q285Q130m5070j08642r2190j1527
10171a84714J0430J06404M9157j76987n6804P7574J03028J21080l783n4786j00885
10160a10286M3718J59889j3516j38761j12927n2099M0574J33488m8310r499l0399
$$ plain form
10149 -138128 -112097 81043 143911 94080 57024 105405 58841 -134338 -118699 20051 62635
10138 62635 26308 15488 64644 -30687 -12798 -32079 -140721 -185105 -154032 -46849 64444
10127 64444 151340 170355 51915 -72243 -6724 26559 38881 69593 98017 17926 -107864
10116 -107864 -131860 -199587 -242926 -125507 80537 83117 36720 -29169 -146118 -176197 -140620
10105 -140620 -109492 -44895 -6348 8085 -53844 -150826 -170101 -143096 -134293 -168780 -181341 -156240
10093 -156240 -55683 45675 59398 -89545 -111334 -112397 -79537 -131872 -30996 105767 45452
10082 45452 15950 -49244 -96527 -120573 -167751 -91718 -103368 -73631 -142398 -92270 -60513 -136896
10070 -136896 -82643 -17791 -127730 -232281 -204777 -118103 -205210 -305760 -109450 27071
$$ packed form
10149a38128K6031J93140O2868m9831l7056M8381m6564j93179J5639J38750M2584
10138F2635l6327j0820M9156r5331J7889j9281j08642m4384L1073J07183J11293
10127F4444Q6896J9015j18440j24158O5519L3283J2322L0712K8424q0091j25790
10116a07864k3996o7727m3339J17419K06044K580m6397o5889j16949l0079L5577
10105a40620L1128O4597L8547J4433o1929r6982j9275K7005Q803l4487j2561K5101
10093a56240J00557J01358J3723j48943k1789j063L2860n2335J00876J36763o0315
10082D5452k9502o5194m7283k4046m7178P6033j1650K9737o8767N0128L1757p6383
10070a36896N4253O4852j09939j04551K7504Q6674q7107j00550J96310J36521
$$ plain form
10060 27071 -91838 -22247 74626 62957 106368 105989 96212 61914 40547 6389 -13442 35558
10048 35558 64777 140461 80624 -17724 -54234 32519 153908 79446 -12368 56079 -49237
10037 -49237 -90222 -63814 13469 29676 118454 128375 20526 -127428 -71630 -5028 -40930
10026 -40930 -93700 -133447 -204202 -172681 -148909 -80281 54114 28462 -51164 7361 51215
10015 51215 -45984 -123661 82839 114745 27011 11102 74525 71248 -41610 -6675 3313 -105976
10003 -105976 -52098 -115619 -219018 -203894 -262165 -255141 -163654 -160288 -103304 -57210 9158 -108631
9991 -108631 -83411 22503 4791 -26885 -97664 -85027 -73012 -129250 -76793 -125956 -213786
9980 -213786 -147093 -65718 -45762 58471 92892 49341 49501 109848 46657 -37166 -79198 -35713
$$ packed form
10060B7071j18909O9591R6873j1669M3411l79r777l4298k1367l4158j9831M9000
10048C5558K9219P5684n9837r8348l6510Q6753J21389p4462r1814O8447j05316
10037d9237m0985K6408P7283J6207Q8778R921j07849j47954N5798O6602l5902
10026d0930n2770l9747p0755L1521K3772O8628J34395k5652p9626N8525M3854
10015E1215r7199p7677K06500L1906q7734j5909O3423l277j12858L4935R988j09289
10003a05976N3878o3521j03399J5124n8271P024R1487L366N6984M6094O6368j17789
9991a08631K5220J05914j7712l1676p0779J2637J2015n6238N2457m9163q7830
9980b13786O6693Q1375J9956J04233L4421m3551J60O0347o3191q3823m2032M3485
$$ plain form
9968 -35713 -68928 33714 138781 228425 81303 -26077 -90174 -169730 -218348 -71677 -30485
9957 -30485 -89967 -43474 33500 -38443 -54543 -140328 -70242 3873 -76027 -198658 -123496 -40372
9945 -40372 -97352 -103272 -72324 -76371 -26302 -55581 51292 -1019 -86573 -38698 36980 93864
9933 93864 18776 -83137 -32320 -7663 43063 48420 53444 -41989 463 64535 132237 106194
9921 106194 155053 73186 95154 81464 81157 142169 118677 160230 93790 153570 151556 179103
9909 179103 216942 221744 140947 88392 112796 269270 309695 241561 207862 102244 89678
9898 89678 31063 37357 15924 -2487 -63085 -86071 -54560 28550 35326 -23885 -197303 -183035
9886 -183035 -73647 -69863 -113860 -154345 -65488 103161 29804 -21923 -33440 27086 65404
$$ packed form
9968c5713l3215J02642J05067Q9644j47122j07380o4097p9556m8618J46671M1192
9957c0485n9482M6493P6974p1943j6100q5785P0086P4115p9900j22631P5162Q3124
9945d0372n6980n920L0948m047N0069k9279J06873n2311q5554M7875P5678N6884
9933I3864p5088j01913N0817K4657N0726N357N024r5433M2452O4072O7702k6043
9921A06194M8859q1867K1968j3690l07O1012k3492M1553o6440N9780k014K7547
9909A79103L7839M802q0797n2555K4404J56474M0425o8134l3699j05618j2566
9898H9678n8615O294k1433j8411o0598k2986L1511Q3110O776n9211j73418J4268
9886a83035J09388L784m3997m0485Q8857J68649p3357n1727j1517O0526L8318
$$ plain form
9875 65404 123002 29572 27289 -49520 -26941 -63732 -83928 -81361 -39696 15151 4727 60972
9863 60972 41278 83888 16371 -1005 23445 165638 189696 117740 24873 -47008 -78045 -151787
9851 -151787 -151505 -94519 2142 132527 224444 182653 91958 15242 -15519 -38517 33175 51667
9839 51667 119099 187319 41822 83571 40201 74580 37311 -72305 -69151 19020 83400 137075
9827 137075 33099 -65971 -80882 47375 78713 59820 -8249 -85521 -105307 -91439 -85302
9816 -85302 -50253 98518 46310 -31101 -12482 32850 55813 52424 -17681 15472 103925 169471
9804 169471 265304 325397 280625 165137 122267 228560 190779 21056 -88230 -168904 -123238
9793 -123238 -85049 -148069 -134587 -98802 -98579 -39543 27160 -21298 -105596 -187000 -237726 -177563
$$ packed form
9875F5404N7598r3430k283p6809K2579l6791k0196K567M1665N4847j0424N6245
9863F0972j9694M2610o7517j7376K4450J42193K4058p1956r2867p1881l1037p3742
9851a51787K82N6986R6661J30385R1917m1791r0695p6716l0761k2998P1692J8492
9839E1667O7432O8220j45497M1749m3370L4379l7269j09616L154Q8171O4380N3675
9827A37075j03976r9070j4911J28257L1338j8893o8069p7272j9786J3868O137
9816h5302L5049J48771n2208p7411J8619M5332K2963l389p0105L3153Q8453O5546
9804A69471R5833O0093m4772j15488m2870J06293l7781j69723j09286q0674M5666
9793a23238L8189o3020J3482L5785K23N9036O6703m8458q4298q1404n0726O0163
$$ plain form
9781 -177563 -122626 -205257 -249250 -270707 -329028 -408517 -341823 -129587 -132675 -86426 -49228 -56879
9769 -56879 -89144 -154947 -204182 -186886 -167519 -114285 -37184 -99855 -186586 -153931 -20445 598
9757 598 -61181 1382 123542 129128 25551 -15417 -6305 27421 -35953 -93465 -65014 -109137
9745 -109137 -121061 -86759 -91293 -85531 -17904 72780 169389 96516 -27783 -83021 -16713 -21015
9733 -21015 -28083 -63054 8598 -20416 -36416 -37570 -17330 -567 -22956 -92092 -45010 4902
9721 4902 -92 -89626 -70861 38027 -5075 -133942 -113874 -93751 -149438 -170959 -256044 -157523
9709 -157523 -85768 -147384 -140118 14565 70982 111591 124692 27438 -35321 -55846 -32915 -133354
9697 -133354 -228891 -61837 124116 94087 58150 19916 24625 79462 134448 115130 20388
$$ packed form
9781a77563N4937q2631m3993k1457n8321p9489O6694K12236l088M6249L7198p651
9769e6879l2265o5803m9235J7296J9367N3234P7101o2671q6731L2655J33486K1043
9757E98o1779O2563J22160N586j03577m0968R112L3726o3374n7512K8451m4123
9745a09137j1924L4302m534N762O7627R0684R6609p2873j24299n5238O6308m302
9733b1015p068l4971P1652k9014j6000j154K0240J6763k2389o9136M7082M9912
9721D902m994q9534J8765J08888m3102j28867K0068K0123n5687k1521q5085R8521
9709a57523P1755o1616P266J54683N6417M0609J3101r7254o2759k0525K2931j00439
9697a33354r5537J67054J85953l0029l5937l8234M709N4837N4986j9318r4742
$$ plain form
9686 20388 -18209 -102649 -121555 4303 29376 101533 44375 -56324 -166538 -250102 -238641
9675 -238641 -187849 -172854 -80444 -22719 -38951 -50274 26529 28299 36763 -19759 -34357 -58846
9663 -58846 -108708 -208073 -210889 -109057 -4731 129225 161112 202971 320201 306575 168323
9652 168323 73136 3829 25246 4770 -12781 -93984 -122007 11812 48832 25929 38879
9641 38879 64140 56023 97498 232453 182104 111750 26776 35209 61213 -37537 -395 18997
9629 18997 55975 -12711 -10965 12800 56901 -69950 -254991 -325061 -319290 -181569 -78231
9618 -78231 3237 9869 167166 245277 71634 -67504 -88403 -18626 -87202 -143372 -215834
9607 -215834 -129474 -123307 -113503 -26472 -1753 -124924 -267106 -269217 -247029 -75800 117785
$$ packed form
9686B0388l8597q4440j8906J25858K5073P2157n7158j00699j10214q3564J1461
9675b38641N0792J4995R2410N7725j6232j1323P6803J770Q464n6522j4598k4489
9663e8846m9862r9365k816J01832J04326J33956L1887M1859J17230j3626j38252
9652A68323r5187o9307K1417k0476j7551q1203k8023J33819L7020k2903J2950
9641C8879K5261q117M1475J34955n0349p0354q4974Q433K6004r8750L7142J9392
9629A8997L6978o8686J746K3765M4101j26851j85041p0070N771J37721J03338
9618g8231Q1468O632J57297P8111j73643j39138k0899O9777o8576n6170p2462
9607b15834Q6360O167R804Q7031K4719j23171j42182k111K2188J71229J93585
$$ plain form
9596 117785 99127 -99784 -143459 -49976 -47926 -103686 -112151 -11510 -40554 39032 7650 104574
9584 104574 201484 30181 -49359 -65968 -80598 -57181 -8247 24201 -15558 -103054 -116283
9573 -116283 -56407 -62686 -72785 -110577 -71690 -105169 50427 52918 -53722 -35705 108805
9562 108805 140659 108929 180764 200059 253754 152225 53999 24743 -21285 -76460 -25048
9551 -25048 40381 50699 -19165 -32589 9991 -71372 -85801 -110304 -130706 -5338 185764
9540 185764 224458 140830 38094 -24341 -42662 56924 90580 24500 -18773 16338 108942
9529 108942 56679 -67877 -132170 -142330 -195966 -155456 -112111 -177674 -231639 -259906 -248134
9518 -248134 -283240 -233455 -234858 -188754 -98491 9708 65591 131576 146944 26794 -108862
$$ packed form
9596A17785j8658j98911m3675R3483K050n5760q465J00641k9044P9586l1382R6924
9584A04574R6910j71303p9540j6609j4630K3417M8934L2448l9759q7496j3229
9573a16283N9876o279j0099l7792L8887l3479J55596K491j06640J8017J44510
9562A08805L1854l1730P1835J9295N3695j01529r8226k9256m6028n5175N1412
9551b5048O5429J0318o9864j3424M2580q1363j4429k4503k0402J25368J91102
9540A85764L8694q3628j02736o2435j8321R9586L3656o6080m3273L5111R2604
9529A08942n2263j24556o4293j0160n3636M0510M3345o5563n3965k8267J1772
9518b48134l5106M9785j403M6104R0263J08199N5883O5985J5368j20150j35656
$$ plain form
9507 -108862 -104070 -135489 -153994 -94712 -59913 -31449 -39652 85257 165470 235111 157385 185033
9495 185033 132573 30114 75052 174830 154159 46604 85446 97012 67172 41410 -104763
9484 -104763 -37542 41954 70808 35631 -19801 -56010 4643 30105 -65975 -67586 -166865 -125219
9472 -125219 -43868 -108084 -148382 -37478 28032 38493 -18738 -73965 -5322 101532 53367
9461 53367 -57482 -20805 33428 48904 109 -84936 -130234 -144433 -244156 -280609 -44357
9450 -44357 95990 52152 -15378 -60973 72196 87571 49841 116516 156856 189498 170810
9439 170810 122970 188902 125694 -1585 23937 -39396 -81183 -25332 20563 -15835 147211
9428 147211 177228 104852 59770 33696 -16694 14230 34164 4536 -22403 135531 119879
$$ packed form
9507a08862M792l1419j8505N9282L4799K8464q203J24909Q0213O9641p7726K7648
9495A85033n2460j02459M4938R9778k0671j07555L8842J1566k9840k5762j46173
9484a04763O7221P9496K8854l5177n5432l6209O0653K5462r6080j611r9279M1646
9472a25219Q1351o4216m0298J10904O5510J0461n7231n5227O8643J06854m8165
9461E3367j10849L6677N4233J5476m8795q5045m5298j4199r9723l6453K36252
9450d4357J40347m3838o7530m5595J33169J5375l7730O6675M0340L2642j8688
9439A70810m7840O5932o3208j27279K5522o3333m1787N5851M5895l6398J63046
9428A47211L0017p2376m5082k6074n0390L0924J9934k9628k6939J57934j5652
$$ plain form
9417 119879 29160 58624 22457 -70330 41229 153210 205477 206242 142983 79074 12103 38699
9405 38699 64770 112134 142157 99462 87714 147770 204335 125962 78193 76139 89997 43247
9393 43247 -32670 -13379 -8052 -35947 45883 16415 -62718 -113977 -87438 65670 90160 3889
9381 3889 -98715 -156949 -95813 -63457 -62105 8123 38856 9419 -69288 -24458 69750 171653
9369 171653 133741 42496 92949 45180 79421 113630 33342 2531 42454 67541 40700 -83870
9357 -83870 -155282 -90372 -17554 -59765 -66619 -52526 -129104 -107157 44566 70998 114074 58073
9345 58073 16460 15023 9803 58544 -740 -32339 -69593 13072 150504 133064 110090 22074
9333 22074 -54927 -25330 -14179 -58335 -68305 -10077 32300 98896 225858 101530 20500 80044
$$ packed form
9417A19879r0719K9464l6167r2787J11559J11981N2267P65o3259o3909o6971K6596
9405C8699K6071M7364L0023m2695j1748O0056N6565p8373m7769k054J3858m6750
9393D3247p5917J9291N327k7895Q1830k9468p9133n1259K6539J53108K4490q6271
9381C889j02604n8234O1136L2356J352P0228L0733k9437p8707M4830R4208J01903
9369A71653l7912r1245N0453m7769L4241L4209q0288l0811L9923K5087k6841j24570
9357h3870p1412O4910P2818m2211o854J4093p6578K1947J51723K6432M3076n6001
9345E8073m1613j437n220M8741n9284l1599l7254Q2665J37432j7440k2974q8016
9333B2074p7001K9597J1151m4156r970N8228M2377O6596J26962j24328q1030N9544
$$ plain form
9321 80044 142506 202858 111446 8644 -106085 -41033 -45120 -244841 -195985 -95124 -81848
9310 -81848 -26054 -281 -21481 13612 -20146 -30283 -12647 112453 1542 -162290 -213853
9299 -213853 -185962 -199713 -157490 -45808 -126491 -46990 41785 52052 98267 82986 44497
9288 44497 -9720 -29404 -82811 -72236 -26195 61293 89031 163012 196563 119104 108523 35168
9276 35168 80944 197615 292075 191493 65384 32707 5074 28038 -29810 -189111 -238496
9265 -238496 -242576 -218643 -72844 8643 110027 97580 68042 24996 -25304 -48849 28718
9254 28718 -22377 21701 72439 47600 -72225 19459 16366 47627 86288 150224 20631 -14403
9242 -14403 8195 -50412 -182819 -279521 -166573 -43624 57226 -2201 -42213 86809 59386
$$ packed form
9321H0044O2462O0352r1412j02802j14729O5052m087j99721M8856J00861J3276
9310h1848N5794K5773k1200L5093l3758j0137J7636J25100j10911j63832n1563
9299b13853K7891j3751M2223J11682q0683P9501Q8775J0267M6215j5281l8489
9288D4497n4217j9684n3407J0575M6041Q7488K7738P3981L3551p7459j0581p3355
9276C5168M5776J16671R4460j00582j26109l2677k7633K2964n7848j59301m9385
9265b38496m080K3933J45799Q1487J01384j2447k9538m3046n0300k3545P7567
9254B8718n1095M4078N0738k4839j19825R1684l093L1261L8661O3936j29593l5034
9242a4403K2598n8607j32407r6702J12948J22949J00850n9427m0012J29022k7423
$$ plain form
9231 59386 -38215 -97007 -50340 115596 285944 368085 271051 245864 248809 164716 26985
9220 26985 -46259 -25679 -7651 154459 167062 127386 81289 146427 226901 187798 126497 61833
9208 61833 -46543 7781 115816 81449 138959 156615 100214 -43241 -85369 -11405 -17531
9197 -17531 49304 73426 167753 213818 238622 251503 418212 408001 267993 266105 311558 192834
9185 192834 125766 80521 110123 150721 263709 332938 228916 212107 217914 270646 221855
9174 221855 230106 287720 291501 254886 244129 162489 88630 194690 184197 166213 175862 274730
9162 274730 224222 213383 260846 301388 253023 180332 108655 105192 163366 231481 180197 171904
9150 171904 152557 230847 416700 357681 291636 228978 177050 246023 308830 298586 255924
$$ packed form
9231E9386r7601n8792M6667J65936J70348Q2141r7034k5187K945q4093j37731
9220B6985p3244K0580J8028J62110J2603l9676m6097O5138Q0474l9103o1301o4664
9208F1833j08376N4324J08035l4367N7510J7656n6401j43455m2128P3964o126
9197a7531O6835K4122R4327M6065K4804J2881J66709j0211j40008j888M5453j18724
9185A92834o7068m5245K9602M0598J12988O9229j04022j6809N807N2732m8791
9174B21855Q251N7614L781l6615j0757q1640p3859J06060j0493j7984R649R8868
9162B74730n0508j0839M7463M0542m8365p2691p1677l463N8174O8115n1284q293
9150A71904j9347P8290J85853n9019o6045o2658n1928O8973O2807j0244m2662
$$ plain form
9139 255924 205989 301876 376056 386678 408538 379153 339017 421196 440335 452682 440543 341057
9127 341057 355692 456605 432762 508904 538269 599526 679524 693679 688545 645768 746688
9116 746688 823800 851835 911683 954484 926946 926569 938145 968925 1095325 1269490 1322591 1232681
9104 1232681 1246691 1218064 1185822 1321645 1392941 1484236 1657672 1763494 1984944 2140449
9094 2140449 2147234 2267099 2266226 2354811 2573274 2844661 3106775 3342078 3706791 3997106 4491219
9083 4491219 5013896 5486460 6116264 6771829 7450328 8429231 9665568 10865960 12482426
9074 12482426 14454814 16878179 19938912 23703586 28600429 35060434 43558274 54483346
9066 54483346 67854605 83494266 99810067 112619433 117040119 110933225 97308637
$$ packed form
9139B55924m9935R5887P4180J0622K1860k9385m0136Q2179J9139J2347j2139r9486
9127C41057J4635J00913k3843P6142K9365O1257P9998J4155n134m2777J00920
9116G46688P7112K8035N9848M2801k7538l77J1576L0780J26400J74165N3101q9910
9104A232681J4010k8627l2242J35823P1296R1295J73436J05822K21450J55505
9094B140449O785J19865q73Q8585K18463K71387K62114K35303L64713K90315M94113
9083D491219N22677M72564O29804O55565O78499R78903J236337J200392J616466
9074A2482426J972388K423365L060733L764674M896843O460005Q497840J0925072
9066E4483346J3371259J5639661J6315801J2809366M420686o106894j3624588
$$ plain form
9059 97308637 81077940 65805721 52955820 42668403 34791180 28783455 24023670 20299150
9051 20299150 17215727 14943135 13111035 11494885 10041686 8899214 8017714 7220312
9043 7220312 6517739 5930809 5463267 5102424 4736990 4308228 3884309 3512962 3197500 3106843
9033 3106843 3008025 2869565 2578436 2351588 2180072 2034996 1978077 1895019 1717290 1667900
9023 1667900 1557501 1464358 1454646 1369227 1253200 1280488 1219458 1245739 1231528 1227967 1167221
9012 1167221 1044764 1056634 1088136 959436 866539 911509 950959 1016821 893068 857206 672063
9001 672063 647930 769604 795861 686170 740055 832176 647289 525835 419331 405421 503005
8990 503005 561737 586006 614714 526696 495974 453592 375024 324277 308890 405290 392678 276823
$$ packed form
9059I7308637j6230697j5272219j2849901j0287417p877223o007725m759785l724520
9051B0299150l083423k272592j832100j616150j453199j142472q81500p97402
9043G220312p02573n86930m67542l60843l65434m28762m23919l71347l15462r0657
9033C106843r8818j38460k91129k26848j71516j45076n6919q3058j77729m9390
9023A667900j10399r3143r712q5419j16027K7288o1030K6281j4211l561o0746
9012A167221j22457J1870L1502j28700r2897M4970L9450O5862j23753l5862j85143
9001F72063k4133J21674K6257j09691N3885R2121j84887j21454j06504j3910R7584
8990E03005N8732K4269K8708q8018l0722m2382p8568n0747j5387R6400j2612j15855
$$ plain form
8978 276823 356470 446283 424857 451706 328052 326510 368664 446672 439117 459573 418136 317736
8966 317736 206406 303790 314062 290050 253947 273756 361197 469003 497714 540231 494032
8955 494032 435558 444703 337350 194678 149357 201567 311525 320823 488951 457030 402023
8944 402023 460198 442595 459795 431189 387340 488750 477229 341246 207459 221866 200146
8933 200146 237070 241083 212045 183321 240488 236243 383749 436396 506820 397344 364002 354360
8921 354360 292544 199464 143684 151609 117865 85956 74896 68692 54308 26997 47458 65740
8909 65740 183300 215552 183200 93754 158685 114444 77478 99552 74240 31859 106475 107361
8897 107361 120518 169618 107851 222106 211561 49002 79561 202292 179191 118044 108032
$$ packed form
8978B76823P9647Q9813k1426K6849j23654j542M2154P8008p555K0456m1437j00400
8966C17736j11330R7384J0272k4012l6103J9809Q7441J07806K8711M2517m6199
8955D94032n8474R145j07353j42672m5321N2210J09958R298J68128l1921n5007
8944D02023N8175j7603J7200k8606m3849J01410j1521j35983j33787J4407k1720
8933B00146L6924M013k9038k8724N7167m245J47506N2647P0424j09476l3342r642
8921C54360o1816r3080n5780P925l3744l1909j1060o204j4384k7311K0461J8282
8909F5740J17560L2252l2352q9446O4931m4241l6966K2074k5312m2381P4616Q86
8897A07361J3157M9100o1767J14255j0545j62559L0559J22731k3101o1147j0012
$$ plain form
8886 108032 16231 52054 167018 229758 189452 214532 157270 61298 85780 57739 43121
8875 43121 71706 124979 116938 106138 141777 135842 106218 69864 63077 190213 273174 233645
8863 233645 127029 2709 -77234 -1201 214357 139550 -93511 -125414 63223 100215 54159
8852 54159 -6740 -62593 -97713 -72904 -43930 -72513 -9445 71422 78536 59347 69333 76128
8840 76128 45596 78821 165483 268422 381318 208282 99256 142696 176657 205707 209012
8829 209012 192836 60690 17415 -45156 41948 167159 124301 148542 190349 108026 -58274
8818 -58274 -192638 -150715 -103025 9900 46480 49748 80738 78414 81200 -51313 67845 217699
8806 217699 121401 -7788 -40989 35491 28112 26909 78037 90165 51476 22424 -31119 -39669
$$ packed form
8886A08032r1801L5823J14964O2740m0306K5080n7262r5972K4482k8041j4618
8875D3121K8585N3273q041j0800L5639n935k9624l6354o787J27136Q2961l9529
8863B33645j06616j24320p9943P6033K15558p4807k33061l1903J88637L6992m6056
8852E4159o0899n5853l5120K4809K8974k8583O3068Q0867P114j9189R986O795
8840G6128l0532L3225Q6662J02939J12896j73036j09026M3440L3961K9050L305
8829B09012j6176j32146m3275o2571Q7104J25211m2858K4241M1807q2323j66300
8818e8274j34364M1923M7690J12925L6580L268L0990k324K786j32513J19158J49854
8806B17699r6298j29189l3201P6480p379j203N1128J2128l8689k9052n3543q550
$$ plain form
8794 -39669 -32317 95508 221494 201125 75770 66605 -41919 -137322 -96767 35196 54493
8783 54493 42043 48158 91440 154867 1432 -32492 88851 113081 103138 182698 236889 173667
8771 173667 170820 121502 61702 137092 194846 263260 242809 212382 274564 185432 86738 33935
8759 33935 -40880 -83849 7288 48988 -79683 -159243 -122963 -85994 74464 143975 58612
8748 58612 -42750 -67191 -67342 -19014 72896 130415 170100 122328 -16869 -90589 -136980 -87308
8736 -87308 -62997 92362 196510 73565 34492 61736 146461 155478 -28519 -31976 101308
8725 101308 157887 105680 124898 142907 208048 112434 136327 158017 54853 20922 115842
8714 115842 246352 254198 264041 296744 306634 236161 105620 13834 -19767 15030 9899 50969
$$ packed form
8794c9669P352J27825J25986k0369j25355r165j08524r5403M0555J31963J9297
8783E4493j2450O115M3282O3427j53435l3924J21343K4230r943P9560N4191o3222
8771A73667k847m9318n9800P5390N7754O8414k0451l0427O2182q9132r8694n2803
8759C3935p4815m2969R1137M1700j28671p9560L6280L6969J60458O9511q5363
8748E8612j01362k4441j51M8328R1910N7519L9685m7772j39197p3720m6391M9672
8736h7308K4311J55359J04148j22945l9073K7244Q4725R017j83997l457J33284
8725A01308N6579n2207J9218J8009O5141r5614K3893K1690j03164l3931R4920
8714A15842J30510P846R843L2703R890p0473j30541r1786l3601L4797n131M1070
$$ plain form
8702 50969 76615 100970 241813 131876 150134 249037 243950 211771 81179 60958 90854
8691 90854 77497 4499 70915 156082 133575 156944 138430 29012 -44194 -36146 31665 -62900
8679 -62900 -207489 -69703 34981 48229 61721 184410 250671 222145 156043 162692 183486
8668 183486 74038 55014 84209 -12666 8672 178653 291985 324314 430394 451689 331222
8657 331222 328677 380645 346687 357849 306236 261353 281897 262030 213619 97956 78271 162998
8645 162998 222406 190486 128753 177910 183412 95524 25403 186019 248090 279567 296902 278290
8633 278290 281238 273403 276636 270138 299924 331405 392210 468386 470831 515838 464216 366247 387760
8620 387760 313334 253537 316200 397406 570192 650755 458415 487283 520343 443027 422563
$$ packed form
8702E0969K5646K4355J40843j09937J8258R8903n087l2179j30592k0221K9896
8691I0854j3357p2998O6416Q5167k2507K3369j8514j09418p3206Q048O7811r4565
8679f2900j44589J37786J04684J3248J3492J22689O6261k8526o6102O649K0794
8668A83486j09448j9024K9195r6875K1338J69981J13332L2329J06080K1295j20467
8657C31222k545N1968l3958J1162n1613m4883K0544j9867m8411j15663j9685Q4727
8645A62998N9408l1920o1733M9157N502q7888p0121J60616O2071L1477J7335j8612
8633B78290K948p835L233o498K9786L1481O0805P6176K445M5007n1622r7969K1513
8620C87760p4426n9797O2663Q1206J72786Q0563j92340K8868L3060p7316k0464
$$ plain form
8609 422563 450998 473637 543115 633977 666490 603635 632586 727164 862835 907195 884861
8598 884861 897683 965032 924087 846706 797031 711876 407165 370089 428835 414661 362036
8587 362036 271191 389845 507430 522176 569443 394007 223894 159207 124369 187301 204290
8576 204290 247425 195756 26110 79355 96162 35979 -12249 -91865 -107185 -101103 13553
8565 13553 92150 92066 80890 67143 141942 218492 200186 222479 289199 307239 269007 342136
8553 342136 345642 225680 15979 -9343 71387 35264 -13126 -17696 -10444 36238 -20274 -97708
8541 -97708 5158 131981 163908 92963 -7866 -75545 -46125 -53428 -25711 40934 27673
8530 27673 40302 -17569 6374 20454 62808 174782 204585 214459 271572 226760 137307 215297
$$ packed form
8609D22563K8435K2639O9478R0862L2513o2855K8951R4578J35671M4360k2334
8598H84861J2822O7349m0945p7381m9675q5155l04711l7076N8746j4174n2625
8587C62036r0845J18654J17585J4746M7267j75436j70113o4687l4838O2932J6989
8576B04290M3135n1669j69646N3245J6807o0183m8228p9616j5320O082J14656
8565A3553P8597q4j1176j3747P4799P6550j8306K2293O6720J8040l8232P3129
8553C42136L506j19962k09701k5322Q0730l6123m8390m570P252M6682n6512p7434
8541i7708J02866J26823L1927p0945j00829o7679K9420p303K7717O6645j3261
8530B7673J2629n7871K3943J4080M2354J11974K9803R874N7113m4812q9453P7990
$$ plain form
8518 215297 90182 9164 80739 194669 115538 23145 -71029 -47660 -40041 -48415 -14083 99124
8506 99124 207453 180686 89261 62650 38869 21760 49700 178760 183052 160997 236807 315719
8494 315719 275890 89062 39795 -25347 -40215 -61529 77547 168814 103960 50806 -27401
8483 -27401 64232 90907 147661 99671 44520 26696 6714 26990 12229 56905 112940 124465
8471 124465 39767 -32155 89134 113372 120865 100727 183032 354359 285895 150703 49919
8460 49919 27846 89714 31184 -46262 -57871 -101506 -139238 -168748 -45826 -33043 -132274 -113770
8448 -113770 -66969 -49707 18484 43953 12387 64999 -50535 -55046 -105530 6943 -26094
8437 -26094 92326 224318 195126 196245 156276 147860 175226 186808 68990 35794 -86825
$$ packed form
8518B15297j25115q1018P1575J13930p9131r2393r4174K3369P619q374L4332J13207
8506I9124J08329k6767r1425k6611k3781j7109K7940J29060M292k2055P5810P8912
8494C15719l9829j86828m9267o5142j4868k1314J39076R1267o4854n3154p8207
8483b7401R1633K6675N6754m7990n5151j7824j9982K0276j4761M4676N6035J1525
8471A24465q4698p1922J21289K4238P493k0138Q2305J71327o8464j35192j00784
8460D9919k2073O1868n8530p7446j1609m3635l7732k9510J22922J2783r9231J8504
8448a13770M6801J7262O8191K5469l1566N2612j15534m511n0484J12473l3037
8437b6094J18420J31992k9192J119l9969q416K7366J1582j17818l3196j22619
$$ plain form
8426 -86825 -169473 -129943 -3904 32746 21474 22619 -20126 -63933 -42057 4098 10547 83044
8414 83044 33923 -122907 80265 97751 34037 -21467 8244 -24559 -139182 -202058 -203321
8403 -203321 -157887 -142336 -196697 -13454 113594 153514 219195 243141 182914 198949 150466
8392 150466 5108 -56296 -30744 -35130 76664 169199 270652 288275 246303 196647 93387
8381 93387 28307 -45835 -73716 41624 173744 219070 266350 257099 321770 334649 134595
8370 134595 -47812 -113604 -62641 -26918 -54774 -61453 -91847 101756 165062 93100 33059
8359 33059 -21911 -155773 -91350 -56179 -115897 -97888 -188326 -292627 -342695 -247720 -111530
8348 -111530 -10099 61704 67265 67655 21796 56755 91935 -67423 -94177 -60846 6369 -31484
$$ packed form
8426h6825q2648L9530J26039L6650j1272J145m2745m3807K1876M6155O449P2497
8414H3044m9121j56830K03172J7486o3714n5504K9711l2803j14623o2876j263
8403b03321M5434J5551n4361J83243J27048L9920O5681K3946o0227J6035m8483
8392A50466j45358o1404K5552m386J11794R2535J01453J7623m1972m9656j03260
8381I3387o5080p4142k7881J15340J32120M5326M7280r251O4671J2879k00054
8370A34595j82407o5792N0963L5723k7856o679l0394J93603O3306p1962o0041
8359C3059n4970j33862O4423L5171n9718J8009r0438j04301n0068R4975J36190
8348a11530J01431P1803N561L90m5859L4959L5180j59358k6754L3331O7215l7853
$$ plain form
8336 -31484 -147955 -167939 -191661 -107968 -93793 -114273 -108716 -45075 26675 26780 -42758 -8795
8324 -8795 35131 -371 21844 91529 199351 92462 133813 114212 35967 84993 41240 -38632
8312 -38632 -11117 57832 14107 -67306 -117014 -93040 182500 317605 344245 327306 173395
8301 173395 130399 193839 95183 59700 28004 52862 23338 6251 -58875 -37670 16749 6383
8289 6383 -94764 -110153 1772 -19597 -107480 -44480 -23270 156834 145012 84278 134311
8278 134311 22682 -64664 -70164 -170244 -97615 32373 128908 97921 14824 -54741 -41554
8267 -41554 35813 60866 21867 -74663 -36060 32013 4298 -62594 -92551 -15179 42170 58714
8255 58714 43602 -16107 -233027 -96480 54949 115381 -8138 -26945 -12916 -49138 -31721
$$ packed form
8336c1484j16471j9984k3722Q3693J4175k0480N557O3641P1750J05o9538L3963
8324h795M3926l5502K2215O9685J07822j06889M1351j9601p8245M9026m3753p9872
8312c8632K7515O8949m3725q1413m9708K3974K75540J35105K6640j6939j53911
8301A73395m2996O3440r8656l5483l1696K4858k9524j7087o5126K1205N4419j0366
8289F383j01147j5389J11925k1369q7883O3000K1210J80104j1822o0734N0033
8278A34311j11629q7346n500j00080P2629J29988R6535l0987q3097o9565J3187
8267d1554P7367K5053l8999r6530L8603O8073k7715o6892k9957P7372N7349J6544
8255E8714j5112n9709k16920J36547J51429O0432j23519j8807J4029l6222J7417
$$ plain form
8244 -31721 -4027 -89379 -101062 -55407 -87592 -48791 3010 -4448 46184 -10496 -29541 -49573
8232 -49573 -18546 -52451 24499 118966 82494 48246 -9736 -31373 -839 98102 166222 144383
8220 144383 150313 256180 180212 219751 211960 159841 167624 108681 72640 6924 -8323 108735
8208 108735 213166 208722 136189 -9418 -93111 -197670 -99498 104738 142386 40457 18921
8197 18921 21772 57732 -35212 -40953 -137067 -53272 126456 71393 40294 85222 2723 -32142
8185 -32142 73726 218472 118480 473 -84425 -200512 -198944 -100947 50518 48165 100116
8174 100116 131586 128265 120682 196657 187894 131657 120468 99802 186940 180378 86329 53366
8162 53366 75012 130881 134168 20019 185179 133240 20055 42386 126114 122461 100895 158021
$$ packed form
8244c1721K7694q5352j1683M5655l2185L8801N1801p458N0632n6680j9045k0032
8232d9573L1027l3905P6950R4467l6472l4248n7982k1637L0534R8941O8120k1839
8220A44383N930J05867p5968L9539p791n2119P783n8943l6041o5716j5247J17058
8208A08735J04431m444p2533j45607q3693j04559R8172K04236L7648j01929k1536
8197A8921K851L5960r2944n741r6114Q3795J79728n5063l1099M4928q2499l4865
8185c2142J05868J44746r9992j18007q4898j16087J568R7997J51465k353N1951
8174A00116L1470l321p583P5975q763n6237j1189k0666Q7138o562r4049l2963
8162E3366K1646N5869L287j14149J65160n1939j13185K2331Q3728l653k1566N7126
$$ plain form
8150 158021 66375 -34041 -58583 -110640 -120910 2697 142831 159578 187776 98984 -1526
8139 -1526 14744 28606 -6050 -76793 -80588 -59216 12503 49298 -4375 -53254 -47357 414
8127 414 111062 244005 156967 129066 58903 36575 2156 32251 -75590 -127322 -163424 -128076
8115 -128076 49074 197738 343965 337268 126461 136087 77483 -24823 -62383 -106897 -126674
8104 -126674 -34180 32577 143817 189260 145904 218725 189462 206343 184322 196530 220172
8093 220172 147022 113660 86485 156263 171698 108817 88149 13034 -51967 -159542 -180829
8082 -180829 -196853 -141278 -69659 8568 64642 36780 35795 4821 6468 -60726 29228 76785
8070 76785 115225 71512 38924 20919 96619 159936 62614 51831 4242 -47178 -77904 -27091
$$ packed form
8150A58021r1646j00416k4542n2057j0270J23607J40134J6747K8198q8792j00510
8139a526J6270J3862l4656p0743l795K1372P1719L6795n3673m8879N897M7771
8127D14J10648J32943q7038k7901p0163k2328l4419L0095j07841n1732l6102L5348
8115a28076J77150J48664J46227o697k10807R626n8604j02306l7560m4514j9777
8104a26674R2494O6757J11240M5443m3356P2821k9263J6881k2021J2208K3642
8093B20172p3150l3362k7175O9778J5435o2881k0668p5115o5001j07575k1287
8082a80829j6024N5575P1619P8227N6074k7862r85l0974J647o7194Q9954M7557
8070G6785L8440m3713l2588j8005P5700O3317r7322j0783m7589n1420l0726N0813
$$ plain form
8058 -27091 28234 123070 181039 202150 237454 199035 144391 81636 234421 302024 263981 243925
8046 243925 152169 240691 245972 237296 338450 359935 322967 331628 311336 277918 115559 46670
8034 46670 70167 155103 115484 -32065 -135990 -59489 91828 119858 132901 229424 216387
8023 216387 75094 92650 108371 161582 214664 148852 -33115 10925 247702 420994 443543
8012 443543 335073 320820 485402 591073 570493 446270 332158 207345 222640 201245
8002 201245 288553 455650 525709 498343 482636 304375 188568 287775 265459 306873 270716
7991 270716 207103 153328 163497 122239 144123 262598 341487 456444 476022 483788 375878
7980 375878 399027 399648 361046 416467 435688 377215 416994 471241 467923 475150 461721 501298
$$ packed form
8058b7091N5325R4836N7969K1111L5304l8419n4644o2755J52785O7603l8043k0056
8046B43925r1756Q8522N281q676J01154K1485l6968Q661k0292l3418j62359o8889
8034D6670K3497Q4936l9619j47549j03925P6501J51317K8030J3043R6523j3037
8023B16387j41293J7556J5721N3211N3082o5812j81967M4040K36777J73292K2549
8012D43543j08470j4253J64582J05671k0580j24223j14112j24813J5295k1395
8002B01245Q7308J67097P0059k7366j5707j78261j15807R9207k2316M1414l6157
7991B70716o3613n3775J0169m1258K1884J18475P8889J14957J9578P766j07910
7980C75878K3149O21l8602N5421J9221n8473L9779N4247l318P227j3429L9577
$$ plain form
7968 501298 475309 491345 533538 401768 329681 321207 256539 289710 443710 470289 418413
7957 418413 288614 261594 342166 338674 333995 292870 353458 342662 267406 141675 122724 191089
7945 191089 274904 257200 233347 165188 180451 168620 175741 181397 307426 312047 289490 236851
7933 236851 143964 192593 281310 262383 107650 101563 244035 275172 223199 352573 464970
7922 464970 498400 399386 339272 210295 205167 105710 89212 241048 283101 295945 299081 168451
7910 168451 145075 225665 160760 46026 -41149 -42103 149516 284279 394004 424604 426570
7899 426570 324407 243014 292614 300166 261518 176867 214677 282006 484827 490056 271026
7888 271026 127057 76918 98601 202844 267939 271197 253701 206282 126930 -27759 -162152
$$ packed form
7968E01298k5989J6036M2193j31770p2087q474o4668L3171J54000K6579n1876
7957D18413j29799k7020Q0572l492m679m1125O0588j0796p5256j25731j8951O8365
7945A91089Q3815j7704k3853o8159J5263j1831P121N656J26029M621k2557n2639
7933B36851r2887M8629Q8717j8927j54733o087J42472L1137n1973J29374J12397
7922D64970L3430r9014o0114j28977n128r9457j6498J51836M2053J2844L136j30630
7910A68451k3376Q0590o4905j14734q7175r54J91619J34763J09725L0600J966
7899D26570j02163q1393M9600P552l8648q4651L7810O7329K02821N229k19030
7888B71026j43969n0139K1683J04243O5095L258j7496m7419p9352j54689j34393
$$ plain form
7877 -162152 -186012 -145797 17239 115878 207761 150731 -7273 -49903 -50593 -109118 -183229 -61201
7865 -61201 43661 -32981 -61223 -160856 -106015 94733 133114 94823 195770 241459 333683
7854 333683 320575 113464 -3268 137830 217942 180864 161959 191068 13547 -83580 88924
7843 88924 247340 238197 151922 48839 -154726 -97409 -7138 -57608 -72444 -20239 50494
7832 50494 -4271 -71244 -38730 -12139 73428 158082 209678 193505 163186 162634 35937 -81047
7820 -81047 -67502 -25686 -90418 -107986 -86349 34230 48732 35019 72352 74092 -47123 -154057
7808 -154057 72903 317787 278006 62202 79675 89601 46202 59086 40489 -9444 -20225
7797 -20225 45070 69759 164294 297962 159733 -26863 14791 13924 -20016 -63774 -113000 -58428
$$ packed form
7877a62152k3860M0215J63036R8639R1883n7030j58004m2630o90n8525p4111J22028
7865f1201J04862p6642k8242r9633N4841K00748L8381l8291J00947M5689R2224
7854C33683j3108k07111j16732J41098Q0112l7078j8905K9109j77521r7127J72504
7843H8924J58416r143q6275j03083k03565N7317R0271n0470j4836N2205P0733
7832E0494n4765o6973L2514K6591Q5567Q4654N1596j6173l0319n52j26697j16984
7820h1047J3545M1816o4732j7568K1637J20579J4502j3713L7333J740j21215j06934
7808a54057K26960K44884l9781k15804J7473R926m3399J2884j8597m9933j0781
7797b0225O5295K4689R4535J33668j38229j86596M1654q67l3940m3758m9226N4572
$$ plain form
7785 -58428 4120 126670 208651 139578 14223 -76369 -85929 -16526 10830 90093 56087 -29460
7773 -29460 -2871 147100 99514 28506 -51099 82453 127081 150920 229493 214388 185848
7762 185848 108657 -16330 -37871 50793 34575 -56494 -35950 107204 105777 248743 213125
7751 213125 -36286 -151370 -24670 -35326 -24355 -61531 -2251 31086 -40440 -203945 -169774
7740 -169774 -57584 -9356 78623 -46334 -64857 26131 23047 6516 -8445 -66434 -184813
7729 -184813 -167018 -178746 -91072 -63126 -138474 -125524 -98707 -34827 -27396 -57452 -112646 -85274
7717 -85274 -21067 45438 30230 -58499 -92631 -123138 -33908 84534 79919 -104780 -102594 -44237
7705 -44237 46868 21969 15805 146679 54981 -67740 -80799 -59731 -109936 -2619 8259
$$ packed form
7785e8428O2548J22550Q1981o9073j25355r0592r560O9403K7356P9263l4006q5547
7773b9460K6589J49971m7586p1008p9605J33552M4628K3839P8573j5105k8540
7762A85848p7191j24987k1541Q8664j6218r1069K0544J43154j427J42966l5618
7751B13125k49411j15084J26700j0656J0971l7176N9280L3337p1526j63505L4171
7740a69774J12190M8228Q7979j24957j8523R0988l084j6531j4961n7989j18379
7729a84813J7795j1728Q7674K7946p5348J2950K6817O3880P431l0056n5194K7372
7717h5274O4207O6505j5208q8729l4132l0507Q9230J18442m615j84699K186N8357
7705d4237R1105k4899o164J30874r1698j22721j3059K1068n0205J07317J0878
$$ plain form
7694 8259 146315 86425 32131 15026 -9704 -22059 -103718 -132001 -56274 81249 62253 -17551
7682 -17551 -76750 -124468 -196224 -127665 -69933 -87429 -15741 -93483 -58846 -134143 -114388 -15908
7670 -15908 38059 78000 68931 43954 -8621 -108654 -40720 -13893 -53280 -133319 -162201 -106826
7658 -106826 -92191 -188567 -226463 -302205 -385113 -380398 -207141 -111263 -84541 -116977 -183459 -97727
7646 -97727 -64434 -114981 -158136 -45471 -14292 -2215 13901 70833 -45157 -73141 -17907
7635 -17907 -7083 -90226 -204014 -217281 -155487 -9831 17178 -15877 -74449 -40944 33505
7624 33505 -27043 -19240 1890 -105587 -46120 83876 151561 154182 171871 209799 199245 102873
7612 102873 14128 -37785 -33528 22397 -22607 19115 31546 15593 -75192 -96141 -41944 -120075
$$ packed form
7694H259J38056n9890n4294j7105k4730j2355q1659k8283P5727J37523j8996p9804
7682a7551n9199m7718p1756O8559N7732j7496P1688p7742L4637p5297J9755R8480
7670a5908N3967L9941r069k4977n2575j00033O7934K6827l9387q0039k8882N5375
7658a06826J4635r6376l7896p5742q2908M715J73257R5878K6722l2436o6482Q5732
7646i7727L3293n0547m3155J12665L1179J2077J6116N6932j15990k7984N5234
7635a7907J0824q3143j13788j3267O1794J45656K7009l3055n8572L3505P4449
7624C3505o0548P803K1130j07477N9467J29996O7685K621J7689L7928j0554r6372
7612A02873q8745n1913M257N5925m5004M1722J2431j5953r0785k0949N4197p8131
$$ plain form
7600 -120075 -136249 25807 87666 150168 140321 94519 192838 227373 111619 69245 -74984
7589 -74984 -119628 -39703 4581 41548 -24922 -106375 -209749 -68456 -4837 -153114 -127297
7578 -127297 -177041 -132951 -52306 -36654 -3855 -24322 -139159 -47906 88112 40359 -44563
7567 -44563 -104793 41490 112983 114826 175603 108295 147616 149134 111417 6818 -30130 35391
7555 35391 116891 145444 149073 37951 100458 166177 80755 44955 66632 17199 -92020 -42372
7543 -42372 69987 97811 139706 96475 95116 54182 -2628 -42373 -51298 77599 108347 108055
7531 108055 216653 279343 260379 209922 135090 113436 121127 168050 128261 164365 66162 -51823
7519 -51823 -83908 -147433 -104832 -214270 -166639 -21748 -40272 -66213 -97129 -208195 -90227
$$ packed form
7600a20075j6174J62056O1859O2502r847m5802R8319L4535j15754m2374j44229
7589g4984m4644P9925M4284L6967o6470q1453j03374J41293O3619j48277K5817
7578a27297m9744M4090Q0645J5652L2799k0467j14837R1253J36018m7753q4922
7567d4563o0230J46283P1493J843O0777o7308L9321J518l7717j04599l6948O5521
7555C5391Q1500K8553L629j11122O2507O5719q5422l5800K1677m9433j09219M9648
7543d2372J12359K7824M1895m3231j359m0934n6810l9745q925J28897L0748k92
7531A08055J08598O2690j8964n0457p4832k1654P691M6923l9789L6104r8203j17985
7519e1823l2085o3525M2601j09438M7631J44891j8524k5941l0916j11066J17968
$$ plain form
7508 -90227 111156 176379 88318 18787 7462 -35132 36444 73879 9084 -10309 45240 40243
7496 40243 17099 -22266 -93434 4696 115889 157048 218971 203955 45451 -47650 -41336 -90525
7484 -90525 -61897 31974 -11145 -25423 -99956 10713 97006 111635 183873 251868 249172 178947
7472 178947 -13499 -118863 -164364 -126013 -125846 -150664 -69086 96359 211812 200913 13319
7461 13319 -95339 -207742 -288597 -203010 -100600 -25571 5031 4485 106737 90619 145235
7450 145235 153694 165509 148919 77109 92906 42163 89216 -50210 -123916 -69159 -58067 -131166
7438 -131166 -112725 -131424 -191245 -122996 13086 96703 -18220 -54605 30844 75408 67075
7427 67075 -120450 -161081 -58740 -52763 -51719 -27484 -25629 63607 -4381 -58401 10227 33728
$$ packed form
7508i0227K01383O5223q8061o9531j1325m2594P1576L7435o4795j9393N5549m997
7496D0243k3144l9365p1168R8130J11193M1159O1923j5016j58504r3101O314m9189
7484i0525K8628R3871m3119j4278p4533J10669Q6293J4629P2238O7995k696p0225
7472A78947j92446j05364m5501L8351J67k4818Q1578J65445J15453j0899j87594
7461A3319j08658j12403q0855Q5587J02410P5029L0602n46J02252j6118N4616
7450A45235Q459J1815j6590p1810J5797n0743M7053j39426p3706N4757J1092p3099
7438a31166J8441j8699n9821O8249J36082Q3617j14923l6385Q5449M4564q333
7427F7075j87525m0631J02341N977J044K4235J855Q9236o7988n4020O8628K3501
$$ plain form
7415 33728 -40872 -240411 -263256 -190820 -160889 -134353 -54434 -20884 -8165 90396 122751 85862
7403 85862 21164 -49648 -177505 -240310 -67763 13223 -15026 -9316 -16447 -151339 -187255 -45478
7391 -45478 107798 91571 12370 -26902 -74695 54883 127497 137536 178973 44238 -50035
7380 -50035 -23156 8820 -194032 -135147 -1301 2082 -35783 -15177 -555 118195 255488
7369 255488 206939 151372 78287 -60898 -21035 -45087 6414 19697 -83065 -104241 -90717
7358 -90717 -191930 -139476 -124717 -170317 -130537 -127214 -135225 -154001 -173135 -348254 -380327 -318336
7346 -318336 -188081 -186125 -243783 -188800 -151501 -122512 -25654 52489 48131 61699 15641 -40878
7334 -40878 -88286 -84855 -34116 -9405 77160 86910 23686 3878 -40471 -144771 -115394 -53432
$$ packed form
7415C3728p4600j99539k2845P2436K9931K6536P9919L3550J2719R8561L2355l6889
7403H5862o4698p0812j27857o2805J72547Q0986k8249N710p131j34892l5916J41777
7391d5478J53276j6227p9201l9272m7793J29578P2614J0039M1437j34735r4273
7380e0035K6879L1976k02852N8885J33846L383l7865K0606J4622J18750J37293
7369B55488m8549n5567p3085j39185L9863k4052N1501J3283j02762k1176J3524
7358i0717j01213N2454J4759m5600L9780L323q011j8776j9134j75119l2073O1991
7346c18336J30255J956n7658N4983L7299K8989R6858P8143m358J3568m6058n6519
7334d0878m7408L431N0739K4711Q6565R750o3224j9808m4349j04300K9377O1962
$$ plain form
7322 -53432 -82899 -100118 -72283 42129 122041 107008 41657 -23838 -42427 64120 14872
7311 14872 29284 41332 27810 -29851 -133664 -97403 -15475 -157653 -208144 -11190 98919
7300 98919 131533 117667 61218 121820 24386 -30287 -85093 -145519 -28592 47821 -4149 66217
7288 66217 -40715 -71219 -2224 123942 123752 18424 -110710 -114375 -80875 26699 53817
7277 53817 74318 -16410 -13230 41525 30624 40319 7994 -30283 -57545 -28631 51843 98142
7265 98142 151764 209071 190027 115338 -2518 56568 86327 -27059 -12498 -6675 13463 -20815
7253 -20815 -79377 -34563 -20495 -26400 51988 91697 -8850 40674 88577 61953 47887 187983
7241 187983 149506 31057 -115292 -139895 -110409 -111165 -41190 64433 120983 77545 31765
$$ packed form
7322e3432k9467j7219K7835J14412P9912j5033o5351o5495j8589J06547m9248
7311A4872J4412J2048j3522n7661j03813L6261Q1928j42178n0491J96954J10109
7300I8919L2614j3866n6449O0602r7434n4673n4806o0426J16927P6413n1970P0366
7288F6217j06932l0504O8995J26166j90j05328j29134l665L3500J07574K7118
7277E3817K0501r0728L180N4755j0901R695l2325l8277k7262K8914Q0474M6299
7265I8142N3622N7307j9044p4689j17856N9086K9759j13386J4561N823K0138l4278
7253b0815n8562M4814J4068n905P8388L9709j00547M9524M7903k6624j4066J40096
7241A87983l8477j18449j46349k4603K9486p56O9975J05623N6550m3438m5780
$$ plain form
7230 31765 28164 6703 4377 -16710 -53334 -21461 -56331 -93395 -139174 38144 161420 187115
7218 187115 177934 43971 36541 164299 157559 125345 -6831 -46471 3588 -119385 -233378
7207 -233378 -171408 -64261 -2450 56517 22211 -104499 -99321 -110244 -137684 -154240 -162568 -57675
7195 -57675 -32395 -58472 -41780 -13405 39070 56792 28169 -80673 -115610 -66816 -6319 -45389
7183 -45389 -132081 -55083 48163 162915 172064 174429 11029 -130387 -114746 -24404 118714
7172 118714 113302 -2134 -152056 -141017 -40848 56655 146100 22509 -41361 -3939 -28120
7161 -28120 -32480 -8870 -71580 -129164 -167372 -225097 -162868 -86949 -24672 -97032 -106871 -137089
7149 -137089 -178953 -231894 -72812 -35064 -131108 -188891 -262256 -109683 120087 35757 -25817
$$ packed form
7230C1765l601k1461k326k1087l6624L1873l4870l7064m5779J77318J23276K5695
7218A87115r181j33963p430J27758o740l2214j32176l9640N0059j22973j13993
7207b33378O1970J07147O1811N8967l4306j26710N178j0923k7440j6556q328J04893
7195e7675K5280k6077J6692K8375N2475J7722k8623j08842l4937M8794O0497l9070
7183d5389q6692P6998J03246J14752R149K365j63400j41416J5641R0342J43118
7172A18714n412j15436j49922J1039J00169R7503Q9445j23591o3870L7422k4181
7161b8120m360K3610o2710n7584l8208n7725O2229P5919O2277p2360r839l0218
7149a37089m1864n2941J59082L7748r6044n7783p3365J52573K29770q4330o1574
$$ plain form
7138 -25817 27308 -46228 -71321 -81785 -69888 -82508 -122616 -65742 20145 -16884 -108659 -215551
7126 -215551 -239679 -117765 -34428 566 -52001 -189177 -223583 -220298 -112090 -153605 -126448
7115 -126448 -55591 -6322 60323 99082 23856 17371 59191 111267 115555 131622 125602 96831
7103 96831 -39188 -99544 -32457 45243 1130 -117390 -98575 -62171 -37263 55079 65942
7092 65942 63296 5821 3573 -44991 -66490 56438 67021 -19981 -54389 49846 126397 35665
7080 35665 -78736 -137084 -150260 -129013 -18209 115218 79797 30338 -71108 -70727 19977
7069 19977 82772 48810 116672 87736 -44474 -128897 -107302 -71167 -47913 -27398 26311 9837
7057 9837 18939 -65177 -145134 -164910 -98525 -44483 20410 74606 43874 -49733 -116563 -165215
$$ packed form
7138b5817N3125p3536k5093j0464J1897j2620m0108N6874Q5887l7029r1775j06892
7126b15551k4128J21914Q3337L4994n2567j37176l4406L285J08208m1515K7157
7115a26448P0857M9269O6645L8759p5226o485M1820N2076M288J6067o020k8771
7103I6831j36019o0356O7087P7700m4113j18520J8815L6404K4908R2342J0863
7092F5942k646n7475k248m8564k1499J22928J0583q7002l4408J04235P6551r0732
7080C5665j14401n8348j3176K1247J10804J33427l5421m9459j01446L81R0704
7069A9977O2795l3962O7862k8936j32210q4423K1595L6135K3254K0515N3709j6474
7057I837R102q4116p9957j9776O6385N4042O4893N4196l0732r3607o6830m8652
$$ plain form
7045 -165215 -142296 -158570 -132507 -48644 -7903 -27688 4952 -121502 -102833 -58613 -22125
7034 -22125 -853 8277 -55652 139278 211881 138728 135355 61047 4180 119484 100636 -27858
7022 -27858 62907 159726 54992 -192 -42189 -52926 -28916 -34265 -135476 11289 133598
7011 133598 181448 147455 71072 -29122 -75516 -175272 -163530 -85591 -40255 51314 50923 -34137
6999 -34137 -77082 -171718 -298308 -346110 -320789 -140772 37705 28088 -27169 -103303 -200564
6988 -200564 -244864 -220371 -301304 -253010 -186856 -90792 -17107 -36994 -31786 -26221 -7379 -64691
6976 -64691 -18116 -113197 -176295 -130366 -23213 80359 -47285 -195298 -268088 -232130 -145615
6965 -145615 -198956 -292426 -261114 -167726 -35780 -8513 -73634 -19847 115784 199741 61505
$$ packed form
7045a65215K2919j6274K6063Q3863M0741j9785L2640j26454J8669M4220L6488
7034b2125K1272R130o3929J94930P2603p3153l373p4308n6867J15304j8848j28494
7022b7858R0765R6819j04734n5184m1997j0737K4010n349j01211J46765J22309
7011A33598M7850l3993p6383j00194m6394r9756J1742P7939M5336R1569l91q5060
6999c4137m2945r4636j26590m7802K5321J80017J78477r617n5257p6134r7261
6988b00564m4300K4493q0933M8294O6154R6064P3685j9887N208N565J8842n7312
6976f4691M6575r5081o3098M5929J07153J03572j27644j48013p2790L5958Q6515
6965a45615n3341r3470L1312R3388J31946K7267o5121N3787J35631Q3957j38236
$$ plain form
6954 61505 -11015 80818 164239 192930 249595 153641 127510 159997 239055 221032 195345 207115
6942 207115 84395 14974 -51109 7426 -4693 69253 108613 79195 -800 16000 76094
6931 76094 88240 28659 9195 46952 84907 78052 -31634 3430 -15366 -191292 -187850 -98181
6919 -98181 -42363 8093 7605 22374 36691 -34664 -90059 -109661 -132930 -92555 -84107 -40730
6907 -40730 -128878 -108552 -101348 14643 -76550 -194886 -271903 -179421 -142812 -254545 -194195
6896 -194195 -160781 -211612 -181691 -94414 69579 126104 105681 46544 90303 93919 39126 -46924
6884 -46924 -118114 -98239 76377 113398 -6708 -82641 -100989 -60925 -19907 117419 73698
6873 73698 65930 64146 91201 140169 123760 61565 -63938 -22664 54297 -44391 45028 33262
$$ packed form
6954F1505p2520R1833Q3421K8691N6665r5954k6131L2487P9058j8023k5687J1770
6942B07115j22720o9421o6083N8535j2119P3946L9360k9418p9995J6800O0094
6931G6094J2146n9581j9464L7757L7955o855j09686L5064j8796j75926L442Q9669
6919i8181N5818N0456m88J4769J4317p1355n5395j9602k3269M0375Q448M3377
6907d0730q8148K0326P204J15991r1193j18336p7017R2482L6609j11733O0350
6896a94195L3414n0831K9921Q7277J63993N6525k0423n9137M3759L616n4793q6050
6884d6924p1190J9875J74616L7021j20106p5933j8348M0064M1018J37326m3721
6873G3698p768j784K7055M8968j6409o2195j25503M1274P6961r8688Q9419j1766
$$ plain form
6861 33262 -90240 -99475 -80124 -99007 -97088 -182234 -226882 -251106 -212250 -190375 -234600 -175993
6849 -175993 -104244 -87122 -49133 79659 -8782 -132946 -112669 24148 50839 -61850 -119497
6838 -119497 30219 21065 20012 22981 -25856 69046 120641 91673 -5618 -45654 -50250 -19526
6826 -19526 123853 51879 81405 137916 81295 53834 30168 -13256 34843 21153 -2690 73797
6814 73797 104286 172345 166896 -9845 -131071 -102295 -87481 26600 73893 141235 73602
6803 73602 -119236 -135876 -165995 -116121 -95040 -110978 -88422 -76592 -33073 53281 68186 16577
6791 16577 -66574 11293 112043 158026 115129 100449 73157 77356 52127 -25508 -29401 24351
6779 24351 111571 -31776 -67913 -7162 -17264 30574 96864 24243 88515 130175 49040 -1009
$$ packed form
6861C3262j23502r235J9351j8883J919q5146m4648k4224L8856K1875m4225N8607
6849a75993P1749J7122L7989J28792q8441j24164K0277J36817K6691j12689n7647
6838a19497J49716r154j053K969m8837R4902N1595k8968r7291m0036m596L0724
6826a9526J43379p1974K9526N6511n6621k7461k3666m3424M8099j3690k3843P6487
6814G3797L0489O8059n449j76741j21226K8776J4814J14081M7293O7342o7633
6803G3602j92838j6640l0119M9874K1081j5938K2556J1830M3519Q6354J4905n1609
6791A6577q3151P7867J00750M5983m2897j4680k7292M199k5229p7635l893N3752
6779B4351Q7220j43347l6137O0751j0102M7838O6290p2621O4272M1660q1135n0049
$$ plain form
6767 -1009 -10444 5047 -12090 -92048 -72461 -43877 -23847 118578 118950 183712 242027 271843
6755 271843 299888 218026 221798 303124 279483 287762 292838 323669 468963 538807 486556 414252
6743 414252 250744 170841 56098 -75916 -13217 196121 185014 184684 211393 262902 347235
6732 347235 390763 431238 542018 504770 539931 816999 1190473 1757654 2645712 3805319
6722 3805319 5049531 5768010 5132146 3782863 2521262 1643309 1116233 783030 505220
6713 505220 358171 324416 344305 223144 39666 2947 64604 230244 267756 257140 151646
6702 151646 24552 78975 166426 205898 178751 70197 -38304 -78627 -66530 -75680 -130440
6691 -130440 -67368 -105315 -150522 -101043 -46214 -72395 93641 277040 314508 209839 114136
$$ packed form
6767a009r435J5491j7137p9958J9587K8584K0030J42425L72O4762N8315K9816
6755B71843K8045q1862L772Q1326k3641Q279N076L0831J45294O9844n2251p2304
6743D14252j63508p9903j14743j32014O2699K09338j1107l30K6709N1509Q4333
6732C47235M3528M0475J10780l7248L5161K77068L73474N67181Q88058J159607
6722C805319J244212P18479o35864j349283j261601q77953n27076l33203k77810
6713E05220j47049l3755J9889j21161j83478l6719O1657J65640L7512j0616j05494
6702A51646j27094N4423Q7451L9472k7147j08554j08501m0323J2097r150n4760
6691a30440O3072l7947m5207M9479N4829k6181J66036J83399L7468j04669r5703
$$ plain form
6680 114136 157345 121507 -15944 -62213 -79522 -176250 -102239 -83387 -89760 -179158 -66649
6669 -66649 165409 243903 46377 -180263 -212523 -213875 -305473 -208783 14259 51130 36167
6658 36167 16118 88873 48796 26522 88433 128291 132153 167239 168394 224146 235609 148882
6646 148882 106560 17686 14033 13566 72912 44617 13811 3958 -10976 -59633 -61881 -28019 60133
6633 60133 80049 -3610 -101773 -45200 -11484 -10867 -145008 -316819 -143002 -53686 28274 25399
6621 25399 52780 11352 137000 269032 201855 28010 -1163 1985 -11702 51662 75402
6610 75402 85537 122514 125036 10110 -86661 -86569 -119275 -203301 -169747 -42634 70945 187417
6598 187417 175159 91532 -17494 52041 151040 66445 31460 -10282 -33209 -156207 -227200
$$ packed form
6680A14136M3209l5838j37451m6269j7309r6728P4011J8852o373q9398J12509
6669f6649K32058P8494j97526k26640l2260j352r1598R6690K23042L6871j4963
6658C6167k0049P2755m0077k2274O1911L9858L862L5086J155N5752J1463q6727
6646A48882m2322q8874l653m67N9346k8295l0806r853j4934m8657k248L3862Q8152
6633F0133J9916q3659r8163N6573L3716O17j34141j71811J73817Q9316Q1960k875
6621B5399K7381m1428J25648J32032o7177j73845k9173L148j3687O3364K3740
6610G5402J0135L6977K522j14926r6771R2l2706q4026L3554J27113J13579J16472
6598A87417j2258q3627j09026O9535R8999q4595l4985m1742k2927j22998p0993
$$ plain form
6587 -227200 -154468 -125086 -125168 -68327 -6199 -19 33380 82908 168258 184197 175003 226719 145148
6574 145148 23570 -66679 -44820 31388 33435 110358 142504 221036 222103 56819 2405 113148
6562 113148 149342 80093 65108 54901 25006 -43795 -56425 -31281 -154880 -27344 121495
6551 121495 111429 135707 133379 -11562 -6177 50541 60868 27714 53051 -18085 -175613 -184617
6539 -184617 -57243 -30842 -148583 -177354 -161141 -267750 -260287 -53598 -7251 -47987 -68188
6528 -68188 -57448 -41932 -78656 -38244 2652 -26409 26408 78636 67172 149315 128305 112714
6516 112714 90883 115497 -21908 -145971 -55987 -60940 -112010 -100947 -97149 -142176 -150300 -53603
6504 -53603 -41061 -91214 -30771 42480 -32935 -58697 49919 39362 -40441 -1700 91808 93144
$$ packed form
6587b27200P2732K9382q2N6841O2128O180L3399M9528Q5350J5939r194N1716q1571
6574A45148j21578r0249K1859P6208K047P6923L2146P8532J067j65284n4414J10743
6562A13148L6194o9249j4985j0207k9895o8801j2630K5144j23599J27536J48839
6551A21495j0066K4278k328j44941N385N6718J0327l3154K5337p1136j57528r004
6539a84617J27374K6401j17741k8771J6213j06609P463K06689M6347m0736k0201
6528f8188J0740J5516l6724M0412M0896k9061N2817N2228j1464Q2143k1010j5591
6516A12714k1831K4614j37405j24063Q9984m953n1070J1063L798m5027q124R6697
6504e3603J2542n0153O0443P3251p5415k5762J08616j0557p9803L8741R3508J336
$$ plain form
6492 93144 -39371 -80389 -82634 -47697 36285 151359 241133 158907 73163 -75223 -158204
6481 -158204 -183928 -143368 -126614 2698 96719 173303 145517 70306 -3564 -7232 38692 116300
6469 116300 134087 106770 -28955 -99722 -69543 72261 257508 252671 135208 64840 154520
6458 154520 166536 57248 46244 -96382 -196689 -189226 -41443 -29354 72832 146714 45155
6447 45155 -44835 -121526 -102765 -28337 -74804 -67918 -80344 -41302 34014 81423 -56017 -130442
6435 -130442 -172408 -87975 -116988 -41086 -93395 -73007 -28322 -58789 -36677 -2209 49177 59279
6423 59279 1767 -35543 -128496 -54016 53668 108360 120955 -74609 -186661 -210496 -110540
6412 -110540 -97604 -132539 -148466 -53597 4291 42375 3129 -119912 -22247 167217 243021
$$ packed form
6492I3144j32515m1018k245L4937Q3982J15074Q9774q2226q5744j48386q2981
6481a58204k5724M0560J6754J29312R4021P6584k7786p5211p3870l668M5924P7608
6469A16300J7787k7317j35725p0767L0179J41804J85247m837j17463p0368Q9680
6458A54520J2016j09288j1004j42626j00307P463J47783J2089J02186P3882j01559
6447D5155q9990p6691J8761P4428m6467O886j2426L9042P5316M7409j37440p4425
6435a30442m1966Q4433k9013P5902n2309K0388M4685l0467K2112L4468N1386J0102
6423E9279n7512l7310r2953P4480J07684N4692J2595j95564j12052k3835R9956
6412a10540J2936l4935j5927R4869N7888L8084l9246j23041R7665J89464P5804
$$ plain form
6401 243021 242830 124694 68257 99759 130813 169351 176669 -14805 -9563 -50288 37306 48935
6389 48935 -16547 -61953 -119130 -228645 -294970 -288268 -223390 -181659 -121181 -11556 -61014 -66803
6377 -66803 -94145 -174790 -190036 -131125 -216314 -197250 -36696 48131 -6703 -8573 -80815 -94792
6365 -94792 -47053 9732 16244 79611 113740 164147 111832 31958 49084 175752 189509 80283
6353 80283 95444 49571 34602 14206 -28409 -68977 91969 90451 -77401 -108296 -40421 9485
6341 9485 22393 -64963 -73536 -83955 -16251 -41366 -164470 -185329 -99984 -112869 -151374 -49674
6329 -49674 -56618 -50265 -34780 19716 135003 165624 133422 72678 5592 49973 178772 110260
6317 110260 -39891 -95227 -163400 -160731 -162324 -69895 52234 -89891 -142803 -57550 86376
$$ packed form
6401B43021j91j18136n6437L1502L1054L8538P318j91474N242m0725Q7594J1629
6389D8935o5482m5406n7177j09515o6325O702O4878M1731O0478J09625m9458n789
6377f6803k7342q0645j5246N8911q5189J9064J60554Q4827n4834j870p2242j3977
6365i4792M7739N6785O512O3367L4129N0407n2315p9874J7126J26668J3757j09226
6353H0283J5161m5873j4969k0396m2615m0568J60946j518j67852l0895O7875M9906
6341I485J2908q7356q573j0419O7704k5115j23104k0859Q5345j2885l8505J01700
6329d9674o944O353J5485N4496J15287L0621l2202o0744o7086M4381J28799o8512
6317A10260j50151n5336o8173K669j593R2429J22129j42125n2912Q5253J43926
$$ plain form
6306 86376 71772 13139 10043 -21896 -100369 -221794 -215475 -24199 107588 149625 115829 -10457
6294 -10457 -136217 -180384 -62821 50357 70758 -22848 -87408 36347 74329 -20897 -63048
6283 -63048 -59712 40599 55410 132089 159718 61278 -28265 -84390 -100358 -101257 -152795 -162037
6271 -162037 -31060 -140907 -242864 -217931 -143895 -44579 -149081 -165136 -157379 -201624 -204307
6260 -204307 -307146 -307599 -134377 -101877 -136911 -185356 -157519 -101460 -12748 -102673 -114350 -144999
6248 -144999 -152019 -242330 -256077 -207298 -219613 -200932 -75495 -35797 -74857 -47566 -93073 -26577
6236 -26577 -88474 -168836 -128012 -77355 -63222 -44690 -22230 30348 66348 -74886 -15188 -9251
6224 -9251 -52949 -59228 -9301 54423 126035 122422 61070 -46953 -203445 -141002 -154978 -280721
$$ packed form
6306H6376j4604n8633l096l1939p8473j21425O319J91276J31787M2037l3796j26286
6294a0457j25760m4167J17563J13178K0401r3606o4560J23755L7982r5226m2151
6283f3048L336J00311J4811P6679K7629r8440q9543n6125j5968q99n1538r242
6271a62037J30977j09847j01957K4933P4036R9316j04502j6055P757m4245k683
6260b04307j02839m53J73222L2500l5034m8445K7837N6059Q8712q9925j1677l0649
6248a44999p020r0311j3747M8779j2315J8681J25437L9698l9060K7291m5507O6496
6236b6577o1897q0362M0824N0657J4133J8532K2460N2578L6000j41234N9698N937
6224i251m3698o279M9927O3724P1612l613o1352j08023j56492O2443j3976j25743
$$ plain form
6212 -280721 -319264 -243419 -178763 -115536 -23264 8611 1218 -216 -83674 -164964 -124860 -66298
6200 -66298 -89769 -141460 -136549 -100904 -39527 179280 198883 151357 77758 52512 -5979 12756
6188 12756 90535 161780 121141 92393 111273 55087 -55037 11799 -68004 -89447 -31363 10985
6176 10985 155780 166764 66202 -104777 -174520 -264769 -148467 -2020 42538 -11959 -2158
6165 -2158 -48187 -62396 -161192 -161395 -122768 -89720 -72293 -67774 -20779 103148 107958 -94596
6153 -94596 -218126 -133130 -78803 -146049 -157941 -58987 3102 36148 22151 -76726 -104620 -78310
6141 -78310 -118024 -159990 -223936 -124104 -74251 -77787 -83602 -110994 -6860 13139 -85342 -166663
6129 -166663 -2019 48402 122378 124783 7514 -130012 -164974 -135047 16693 57151 157241
$$ packed form
6212b80721l8543P5845O4656O3227R2272L1875p393j434q3458q1290M0104N8562
6200f6298k3471n1691M911L5645O1377K18807J9603m7526p3599k5246n8491J8735
6188A2756P7779P1245m0639k8748J8880n6186j10124O6836p9803k1443N8084M2348
6176A0985J44795J0984j00562j70979o9743r0249J16302J46447M4558n4497R801
6165b158m6029j4209r8796k03L8627L3048J7427M519M6995J23927M810k02554
6153i4596j23530Q4996N4327o7246j1892R8954O2089L3046j3997r8877k7894K6310
6141g8310l9714m1966o3946R9832M9853l536n815k7392J04134J9999r8481q1321
6129a66663J64644N0421P3976K405j17269j37526l4962K9927J51740M0458J00090
$$ plain form
6118 157241 179227 141529 139587 75398 93329 -16810 -171215 -120656 -29080 776 -51541
6107 -51541 -128837 -95076 -42566 -127405 -137515 -93933 -32509 -6666 66741 80552 134584 158632
6095 158632 69308 -16914 -34116 -2369 -24187 -85991 15726 80847 22086 -80410 -89508
6084 -89508 -87671 5941 73502 56399 -41524 46530 -55228 -177233 -196532 -239786 -203813 -132047
6072 -132047 -205236 -187386 -113455 10421 107292 94952 78996 110360 135582 145744 99163
6061 99163 75121 -29047 142500 193537 82240 43625 -33468 -2784 75847 93884 132493
6050 132493 147910 181566 8010 -97295 -48988 103436 36917 -42053 -170673 -170515 -92002
6039 -92002 -58991 -26350 86732 58746 -196275 -220225 -166935 -159604 -51287 -4319 56391
$$ packed form
6118A57241K1986l7698j942o4189J7931j10139j54405N0559R1576K9856n2317
6107e1541p7296L3761N2510q4839j0110M3582O1424K5843P3407J3811N4032K4048
6095A58632q9324q6222j7202L1747k1818o1804J01717O5121n8761j02496r098
6084h9508J837R3612O7561j7103r7923Q8054j01758j22005j9299m3254L5973P1766
6072a32047p3189J7850P3931J23876R6871j2340j5956L1364K5222J0162m6581
6061I9163k4042j04168J71547N1037j11297l8615p7093L0684P8631J8037L8609
6050A32493J5417L3656j73556j05305M8307J52424o6519p8970j28620J58P8513
6039i2002L3011L2641J13082k7986k55021k3950N3290P331J08317M6968O0710
$$ plain form
6028 56391 8720 -26808 -84966 -10885 11076 5501 13486 56344 70981 94978 -19749 -79438
6016 -79438 52526 47766 142459 119992 -18709 -71745 -32740 24112 84294 18731 75671 94654
6004 94654 63527 166774 238888 164394 68483 -65268 -66349 50168 -24390 -137065 -106790
5993 -106790 76223 11067 -158469 -132320 -77769 -28586 9612 -29325 -31815 15065 97710
5982 97710 66809 14985 -13793 8728 -7454 2387 -104220 -107356 -88096 -51635 -63067 46815
5970 46815 25311 40964 -19224 11487 46829 51315 83496 78585 50229 43363 8558 -76164
5958 -76164 -201366 -223823 -107179 -196887 -228018 -101807 -121475 -57627 -10674 -100593 -150456
5947 -150456 -169262 -110147 5172 -40075 -8427 1781 -64932 -122333 -28565 82719 128099
$$ packed form
6028E6391m7671l5528n8158P4081K1961n575P985M2858J4637K3997j14727n9689
6016g9438J31964m760R4693k2467j38701n3036L9005N6852O0182o5563N6940J8983
6004I4654l1127J03247P2114p4494r5911j33751j081J16517p4558j12675L0275
5993a06790J83013o5156j69536K6149N4551M9183L8198l8937k490M6880Q2645
5982I7710l0901n1824k8778K2521j6182R841j06607l136J9260L6461j1432J09882
5970D6815k1504J5653o0188L0711L5342M486L2181m911k8356o866l4805q4722
5958g6164j25202k2457J16644q9708l1131J26211j9668O3848M6953q9919m9863
5947a50456j8806N9115J15319m5247L1648J0208o6713n7401R3768J11284M5380
$$ plain form
5936 128099 175077 40923 -99353 -26040 34915 -138952 -202735 -98468 -62716 -47201 -10148
5925 -10148 -38521 42989 28071 -10946 90965 156886 95917 107030 128081 114441 159492 27164
5913 27164 4650 -16898 -126649 -353990 -207745 -88928 30131 -22340 -139289 -114943 -48690
5902 -48690 -50957 -58288 -2111 -32865 -61349 11717 32715 -5573 46834 5398 39636 21137
5890 21137 56011 131691 147853 143549 91329 70663 81553 -3697 -43860 72183 76023 -9621
5878 -9621 -55105 37072 -6933 11728 33165 -51463 -104247 28121 31860 -25027 -160875 -120643
5866 -120643 -22340 -13730 -71420 -66248 -72493 50874 51259 -17075 -51528 -80192 -37524 -22816
5854 -22816 -80108 -46317 -42777 -47162 -169545 -206307 -121614 555 -107633 -199525 -87783
$$ packed form
5936A28099M6978j34154j40276P3313O0955j73867o3783J04267L5752J5515L7053
5925a0148k8373Q1510j4918l9017J01911O5921o0969J1113K1051j3640M5051j32328
5913B7164k2514k1548j09751k27341J46245J18817J19059n2471j16949K4346O6253
5902d8690k267p331N6177l0754k8484P3066K0998l8288N2407m1436L4238j8499
5890B1137L4874P5680J6162m304n2220k0666J0890q5250m0163J16043L840q5644
5878i621m5484R2177m4005J8661K1437q4628n2784J32368L739n6887j35848M0232
5866a20643R8303Q610n7690N172o245J23367L85o8334l4453k8664M2668J4708
5854b2816n7292L3791L540m385j22383l6762Q4693J22169j08188r1892J11742
$$ plain form
5843 -87783 7705 -54512 -157450 -85635 -73546 -33661 -30993 -15200 49951 -63308 -206135
5832 -206135 -314608 -195593 31106 105085 94589 79874 33067 12054 49785 22994 -112775
5821 -112775 -104722 -67000 -59411 -51324 -63328 3106 85387 31945 -103434 -150836 -80541 -79693
5809 -79693 -94697 -132054 -226256 -128394 -106757 -114923 -58188 -36917 9727 -25433 -20865 9729
5797 9729 -21482 2467 -27159 -83336 -72510 -62491 43927 90812 88938 158277 64722 -134264
5785 -134264 -220074 -171890 -50643 -31485 66171 113005 160851 269954 317839 336662 157543
5774 157543 -71079 -77228 -255570 -321736 -268552 -176520 -159533 -37791 -26618 -25544 36408
5763 36408 110991 121520 -14735 -241044 -263917 -167458 52466 59265 -31275 -42569 -55999
$$ packed form
5843h7783R5488o2217j02938P1815J2089L9885K668J5793O5151j13259j42827
5832b06135j08473J19015K26699P3979j0496j4715m6807k1013L7731k6791j35769
5821a12775Q053L7722P589Q087j2004O6434Q2281n3442j35379m7402P0295Q48
5809g9693j5004l7357r4202R7862K1637q166N6735K1271M6644l5160M568L0594
5797I729l1211K3949k9626n6177J0826J0019J06418M6885j874O9339r3555j98986
5785a34264q5810M8184J21247J9158R7656M6834M7846J09103M7885J8823j79119
5774A57543k28622o149j78342o6166N3184R2032J6987J21742J1173J074O1952
5763C6408P4583J0529j36255k26309k2873R6459K19924O799r0540j1294j3430
$$ plain form
5752 -55999 68367 74907 30050 -45433 -59494 -51368 69068 109516 22613 131148 114631 -94925
5740 -94925 -133918 -102449 104820 141642 241559 151431 16390 -65530 -24206 -57137 -53691 -30313
5728 -30313 -70434 -116985 43283 150144 112237 7056 -28996 25425 22308 64154 106982
5717 106982 161671 130795 60932 22719 125942 86666 -67940 -21717 48707 -5136 3969
5706 3969 21059 84355 166234 131966 162684 223604 119016 70246 -15564 -53635 -13165 75677
5694 75677 194516 251233 214002 184191 137560 97563 47010 28615 39827 -8067 -29771 -57201
5682 -57201 32814 -47499 -200662 -156487 -85127 6420 -124711 -235049 -196756 -206601 -155966
5671 -155966 -100833 24754 219181 214005 -23955 -58773 -81217 -152156 -54694 118209 41585
$$ packed form
5752e5999J24366O540m4857p5483j4061Q126J20436M0448q6903J08535j6517k09556
5740i4925l8993L1469K07269L6822R9917r0128j35041q1920M1324l2931L446K3378
5728c0313m0121m6551J60268J06861l7907j05181l6052N4421l117M1846M2828
5717A06982N4689l0876o9863l8213J03223l9276j54606M6223P0424n3843R105
5706C969J7090O3296Q1879l4268L0718O0920j04588m8770q5810l8071M0470Q8842
5694G5677J18839N6717l7231k9811m6631l9997n0553j8395J1212m7894k1704k7430
5682e7201R0015q0313j53163M4175P1360R1547j31131j10338L8293r845N0635
5671a55966N5133J25587J94427n176k37960l4818k2444p0939R7462J72903p6624
$$ plain form
5660 41585 -31303 -31218 -141699 -118695 -80769 -3349 102882 3877 -70913 -9228 143218 204799
5648 204799 145275 -24516 -104985 -22280 160108 234213 146578 -2638 -66473 76443 244524
5637 244524 132095 179200 160740 128227 99819 -15712 -25043 45277 94173 35603 18127
5626 18127 -103674 -109106 -15730 4017 127894 211358 100542 -43027 -13899 -105953 -38676
5615 -38676 55999 95667 55837 108510 124849 47211 -80 -23754 -22663 -75885 -89345 -2036
5603 -2036 99168 143965 44481 -46368 -138975 -156821 -98298 1697 -198 -153074 -81838 35682
5591 35682 20766 -5224 1289 85052 -71889 -204913 -221093 -197906 -114529 26483 24605 55931
5579 55931 112001 139199 164823 73565 -16775 -54231 -32564 -125163 -118933 -142494 -93867 -90419
$$ packed form
5660D1585p2888Q5j10481K3004L7926P7420J06231r9005p4790O1685J52446O1581
5648B04799n9524j69791q0469Q2705J82388P4105q7635j49216o3835J42916J68081
5637B44524j12429M7105j8460l2513k8408j15531r331P0320M8896n8570j7476
5626A8127j21801n432R3376J9747J23877Q3464j10816j43569K9128r2054O7277
5615c8676R4675L9668l9830N2673J6339p7638m7291k3674J091n3222j3460Q7309
5603b036J01204M4797r9484r0849r2607j7846N8523R9995j895j52876P1236J17520
5591C5682j4916k5990O513Q3763j56941j33024j6180K3187Q3377J41012j878L1326
5579E5931N6070K7198K5624r1258r0340l7456K1667r2599O230k3561M8627L448
$$ plain form
5567 -90419 16883 1853 -148 116792 90288 -10845 26173 48630 -19180 -41307 -54898
5556 -54898 -14139 -46023 -51876 -78170 -77705 94659 125330 44097 -3176 2475 39926 217800
5544 217800 92387 -104447 -82893 -97162 -52741 -77403 51534 3707 -24699 4470 -922
5533 -922 50834 17153 -24426 -13631 -35127 120174 258480 217757 3522 -132049 -56825
5522 -56825 -5983 81837 10764 603 21572 113928 144161 135531 59033 -42490 -18731 -278
5510 -278 -8899 895 72804 92372 91592 103785 136275 46161 -16540 -16689 28607 4226 -12958
5497 -12958 -75804 -72976 -106237 -73958 -45540 23406 131810 75688 -47691 16545 29306 -21925
5485 -21925 32032 -26276 -96725 -161608 -137234 -57395 -54617 7664 85076 70332 29588 -58068
$$ packed form
5567i0419J07302j5030k001J16940k6504j01133L7018K2457o7810k2127j3591
5556e4898M0759l1884n853k6294M65J72364L0671q1233m7273N651L7451J77874
5544B17800j25413j96834K1554j4269M4421k4662J28937m7827k8406K9169n392
5533i22N1756l3681m1579J0795k1496J55301J38306m0723k14235j35571P5224
5522e6825N0842Q7820p1073j0161K0969R2356L0233q630p6498j01523K3759J8453
5510b78q621R794P1909J9568p80J2193L2490r0114o2701j49M5296k4381j7184
5497a2958o2846K828l3261L2279K8418O8946J08404n6122j23379O4236J2761n1231
5485b1925N3957n8308p0449o4883K4374P9839K778O2281P7412j4744m0744q7656
$$ plain form
5473 -58068 -126490 -35518 13866 -51905 6919 21854 35979 4443 15245 -63144 -160641 -110507
5461 -110507 -54021 -96070 -43263 126400 139256 -15873 -139159 -74055 34363 84589 51212
5450 51212 43921 27114 -1491 9782 -132223 -142404 29720 67071 55412 100004 74769 84334
5438 84334 96065 127527 122240 63533 -52820 -272712 -232959 -101610 1707 42591 93905
5427 93905 84290 78341 80012 83906 89760 47003 137189 208899 180844 46705 -159427 -98873
5415 -98873 -10121 -128167 -207588 -207553 -278303 -293347 -223808 -66771 26127 99202 11768 -72048
5403 -72048 -104768 -122677 -17197 607 13623 33486 4559 -123214 -80847 -16272 -74478
5392 -74478 -87268 -58939 -54597 -84913 -96189 -9521 -36458 -56319 -85367 -157201 -70717 -25965
$$ packed form
5473e8068o8422R0972M9384o5771N8824J4935J4125l1536J0802p8389r7497N0134
5461a10507N6486m2049N2807J69663J2856j55129j23286O5104J08418N0226l3377
5450E1212p291j6807k8605J1273j42005j0181J72124L7351j1659M4592k5235R565
5438H4334J1731L1462n287n8707j16353k19892L9753J31349J03317M0884N1314
5427I3905r615n949J671L894N854m2757R0186P1710k8055j34139k06132O0554
5415i8873Q8752j18046p9421L5p0750j5044O9539J57037R2898P3075q7434q3816
5403g2048l2720j7909J05480J7804J3016J9863k8927j27773M2367O4575n8206
5392g4478j2790K8329M342l0316j1276Q6668k6937j9861k9048p1834Q6484M4752
$$ plain form
5380 -25965 -5786 11168 45902 -162993 -183708 -154060 -150804 -186795 -140925 -81794 -26583 -64088
5368 -64088 -168347 -242006 -132107 -124083 -138376 -149491 -170939 -73477 -86748 -49471 -92519 -147796
5356 -147796 -56859 -36328 21385 -67253 -181513 -175148 -203270 -220850 -129671 -110091 -118190 -225426
5344 -225426 -283714 -64631 30527 136580 224174 176299 130489 74318 110243 148048 8180
5333 8180 -73047 17105 105522 118617 176101 154401 120446 44363 -43090 -79755 3289 -44496
$$ packed form
5380b5965K0179J6954L4734k08895k0715K9648L256l5991M5870N9131N5211l7505
5368f4088j04259p3659J09899Q024j4293j1115k1448R7462j3271L7277m3048n5277
5356a47796R0937K0531N7713q8638j14260O365k8122j7580R1179J9580q099j07236
5344b25426n8288K19083R5158J06053Q7594m7875m5810n6171L5925L7805j39868
5333H180q1227R0152Q8417J3095N7484k1700l3955p6083q7453l6665Q3044m7785
$$ [...]
##END NTUPLES=NMR SPECTRUM
##END=
