##TITLE=Analysis number 329127
Compound Code cc 17426
Book Reference 510/78
Project Code adrs
Chemist Name jimp
##JCAMPDX= 6.0         $$ Bruker NMR JCAMP-DX V2.0
##DATA TYPE= NMR SPECTRUM
##DATA CLASS= NTUPLES
##ORIGIN= Bruker BioSpin GmbH
##OWNER= nmr
$$ XWIN-NMR		Version 3.5
$$ Mon Aug  6 15:21:50 2007 GMT Daylight Time (UT+1h)  MAYBRIDGE\nmr@NMR_250MHZ
##.OBSERVE FREQUENCY= 250.131544655141
##.OBSERVE NUCLEUS= ^1H
##.ACQUISITION MODE= SIMULTANEOUS (DQD)
##.ACQUISITION SCHEME= undefined
##.AVERAGES= 16
##.DIGITISER RES= 18
##SPECTROMETER/DATA SYSTEM= dpx250
##.PULSE SEQUENCE= zg30
##.SOLVENT NAME= CDCl3
##.SHIFT REFERENCE= (INTERNAL, CDCl3, 0, 16.4449)
##AUDIT TRAIL= $$ (NUMBER, WHEN, WHO, WHERE, WHAT)
$$ ##TITLE= Audit trail, XWIN-NMR		Version 3.5
$$ ##JCAMPDX= 5.01
$$ ##ORIGIN= Bruker BioSpin GmbH
$$ ##OWNER= nmr
$$ C:\u/data/dgb/nmr/ADRS/230/pdata/1/auditp.txt
$$ ##AUDIT TRAIL=  $$ (NUMBER, WHEN, WHO, WHERE, WHAT)
(   1,<2007-08-06 15:21:29.26 +100>,<MAYBRIDGE\nmr>,<NMR_250MHZ>,
      <created by zg, POWCHK disabled, PULCHK disabled
       configuration hash MD5:
       76 6E 9A 78 1E 09 19 81 EC 84 63 8F B0 6A 59 2D
       data hash MD5: 64K
       01 C6 D9 69 04 5F 1D 42 4F 68 BE 6E 53 8A 16 69>)
(   2,<2007-08-06 15:21:41.40 +100>,<MAYBRIDGE\nmr>,<NMR_250MHZ>,
      <Start of raw data processing
       ef LB = 0.3 FT_mod = 6 PKNL = 1 SI = 32K 
       data hash MD5: 32K
       A6 81 1B 75 FD 0A D7 B3 11 7B 41 05 2D A8 94 D8>)
(   3,<2007-08-06 15:21:43.01 +100>,<MAYBRIDGE\nmr>,<NMR_250MHZ>,
      <apk 
       data hash MD5: 32K
       1C F1 2C 1F C2 AC 82 A1 DE 55 B5 25 4F 80 50 F8>)
(   4,<2007-08-06 15:21:43.75 +100>,<MAYBRIDGE\nmr>,<NMR_250MHZ>,
      <abs ABSG = 5 
       data hash MD5: 32K
       B8 6F E1 70 9A 39 F0 F8 E0 99 45 46 05 08 83 8F>)
$$ ##END=
$$ 
$$ hash MD5
$$ 2C 87 A6 0E 9C 7D D8 12 CB DD AC EB D0 EB 95 0F
##$RELAX= 
##$RELAX= 
##$RELAX= 
##$RELAX= 
##$RELAX= 
##$RELAX= 
##$RELAX= 
$$ Bruker specific parameters
$$ --------------------------
##$DU= <C:\u>
##$EXPNO= 230
##$NAME= <ADRS>
##$PROCNO= 1
##$TYPE= <nmr>
##$USER= <dgb>
##$AMP= (0..31)
100 100 100 100 100 100 100 100 100 100 100 100 100 100 100 100 100 100 
100 100 100 100 100 100 100 100 100 100 100 100 100 100 
##$AQSEQ= 0
##$AQ_mod= 3
##$AUNM= <au_zg>
##$AUTOPOS= <59 >
##$BF1= 250.13
##$BF2= 250.13
##$BF3= 250.13
##$BF4= 250.13
##$BF5= 500.13
##$BF6= 500.13
##$BF7= 500.13
##$BF8= 500.13
##$BYTORDA= 1
##$CFDGTYP= 0
##$CFRGTYP= 5
##$CHEMSTR= <none>
##$CNST= (0..31)
1 1 145 1 1 1 1 1 1 1 1 1 1 1 1 1 1 1 1 1 1 1 1 1 1 1 1 1 1 1 1 1 
##$CPDPRG= <>
##$CPDPRG1= <>
##$CPDPRG2= <>
##$CPDPRG3= <>
##$CPDPRG4= <mlev>
##$CPDPRG5= <mlev>
##$CPDPRG6= <mlev>
##$CPDPRG7= <mlev>
##$CPDPRG8= <mlev>
##$CPDPRGB= <>
##$CPDPRGT= <>
##$D= (0..31)
0 1 0 0 0 0 0 0 0 0.06 0 0 0 0 0 0 0.0002 0 0 0 0 0 0 0 0 0 0 0 0 0 0 
0 
##$DATE= 1186410087
##$DBL= (0..7)
120 120 120 120 120 120 120 120 
##$DBP= (0..7)
150 150 150 150 150 150 150 150 
##$DBP07= 0
##$DBPNAM0= <>
##$DBPNAM1= <>
$$ [...]
##$SUBNAM7= <"">
##$SUBNAM8= <"">
##$SUBNAM9= <"">
##$SW= 20.6930455092707
##$SWIBOX= (0..15)
0 0 3 0 0 0 0 0 0 0 0 0 0 0 0 0 
##$SW_h= 5175.983436853
##$TD= 65536
##$TD0= 1
##$TE= 297.16
##$TE2= 300
##$TE3= 300
##$TEG= 300
##$TL= (0..7)
0 120 120 120 120 120 120 120 
##$TP= (0..7)
150 150 150 150 150 150 150 150 
##$TP07= 0
##$TPNAME0= <>
##$TPNAME1= <>
##$TPNAME2= <>
##$TPNAME3= <>
##$TPNAME4= <>
##$TPNAME5= <>
##$TPNAME6= <>
##$TPNAME7= <>
##$TPOAL= (0..7)
0.5 0.5 0.5 0.5 0.5 0.5 0.5 0.5 
##$TPOFFS= (0..7)
0 0 0 0 0 0 0 0 
##$TUNHIN= 0
##$TUNHOUT= 0
##$TUNXOUT= 0
##$USERA1= <user>
##$USERA2= <user>
##$USERA3= <user>
##$USERA4= <user>
##$USERA5= <user>
##$V9= 5
##$VALIST= <valist>
##$VCLIST= <CCCCCCCCCCCCCCC>
##$VD= 0
##$VDLIST= <DDDDDDDDDDDDDDD>
##$VPLIST= <PPPPPPPPPPPPPPP>
##$VTLIST= <TTTTTTTTTTTTTTT>
##$WBST= 1024
##$WBSW= 4
##$XGAIN= (0..3)
0 0 0 0 
##$XL= 0
##$YL= 0
##$YMAX_a= 440349
##$YMIN_a= -399276
##$ZGOPTNS= <>
##$ZL1= 120
##$ZL2= 120
##$ZL3= 120
##$ZL4= 120
##$ABSF1= 16.44486
##$ABSF2= -4.248312
##$ABSG= 5
##$ABSL= 3
##$ALPHA= 0
##$AQORDER= 0
##$ASSFAC= 0
##$ASSFACI= 0
##$ASSFACX= 0
##$ASSWID= 0
##$AUNMP= <proc_1d>
##$AZFE= 0.1
##$AZFW= 0.1
##$BCFW= 0
##$BC_mod= 0
##$BYTORDP= 0
##$COROFFS= 0
##$CY= 12.5
##$DATMOD= 1
##$DC= 0
##$DFILT= <>
##$DTYPP= 0
##$F1P= 14.0000005364418
##$F2P= -0.99999901652339
##$FCOR= 0.5
##$FTSIZE= 32768
##$FT_mod= 6
##$GAMMA= 0
##$GB= 0
##$INTBC= 1
##$INTSCL= 1
##$ISEN= 128
##$LB= 0.3
##$LEV0= 0
##$LPBIN= 0
##$MAXI= 10000
##$MC2= 0
##$MEAN= 0
##$ME_mod= 0
##$MI= 0
##$NCOEF= 0
##$NC_proc= -5
##$NLEV= 6
##$NOISF1= 0
##$NOISF2= 0
##$NSP= 0
##$NTH_PI= 0
##$NZP= 0
##$OFFSET= 16.44486
##$PC= 1
##$PHC0= -44.51809
##$PHC1= 2.232505
##$PH_mod= 1
##$PKNL= yes
##$PPARMOD= 0
##$PSCAL= 4
##$PSIGN= 0
##$REVERSE= no
##$SF= 250.130019294422
##$SI= 32768
##$SIGF1= 0
##$SIGF2= 0
##$SINO= 400
##$SIOLD= 32768
##$SREGLST= <1H.CDCl3>
##$SSB= 0
##$STSI= 32768
##$STSR= 0
##$SW_p= 5175.98343685301
##$SYMM= 0
##$S_DEV= 0
##$TDeff= 65536
##$TDoff= 0
##$TI= <Analysis number 999999
Compound Code 99
Book Reference 9
Project Code 9>
##$TILT= no
##$TM1= 0
##$TM2= 0
##$TOPLEV= 0
##$USERP1= <user>
##$USERP2= <user>
##$USERP3= <user>
##$USERP4= <user>
##$USERP5= <user>
##$WDW= 1
##$XDIM= 32768
##$YMAX_p= 457949871
##$YMIN_p= -420387
$$ End of Bruker specific parameters
$$ ---------------------------------
##NTUPLES= NMR SPECTRUM
##VAR_NAME=  FREQUENCY,     SPECTRUM/REAL,   SPECTRUM/IMAG
##SYMBOL=    X,             R,               I
##VAR_TYPE=  INDEPENDENT,   DEPENDENT,       DEPENDENT
##VAR_FORM=  AFFN,          ASDF,            ASDF
##VAR_DIM=   32768,         32768,           32768
##UNITS=     HZ,            ARBITRARY UNITS, ARBITRARY UNITS
##FACTOR=    0.157963299565203, 1,           1
##FIRST=     4113.35326374717, 0,            0
##LAST=      -1062.63017310584, 0,           0
##MIN=       -1062.63017310584, -420387,     0
##MAX=       4113.35326374717, 457949871,    0
$$ Real data points
##PAGE= N=1
##DATA TABLE= (X++(R..R)), XYDATA
$$ [...]
18063G86653n0366M582Q4667M9119q0678r6796M6072j8958j01698K7396l2669
18052F17324N7222J12546N4096P5324L2013J32978L0194M5007r2525N5294Q6765
18041A206238q3577r2595o3901n7178k4557k2458N5390N0447Q5368O8499L3609
18030A155285o6423j24333l3523r3772j63332q7233L4929j12662j15597J5444
18020D08783M2879J4935K5954m4653q2855Q589L3287J5190l3477p7887j66721
18009A44024N3428l763J9045j2415j8753K7142m3017l5523K0191R2871m699j15415
17997A23116l2981K2425O1068K0920K5275n9708n1866n451o781N4753J1478O7732
17985B29980M8386L3115n2973j9036J4120j030r3571K1650m2169r2610O527K665
$$ y = [786653, 736287, 740869, 825536, 874655, 793977, 697181, 743253, 724295, 622597, 649993, 617324, 674546, 787092, 841188, 916512, 948525, 1081503, 1111697, 1156704, 1064179, 1119473, 1206238, 1122661, 1030066, 966165, 908987, 884430, 861972, 917362, 967809, 1053177, 1121676, 1155285, 1088862, 964529, 931006, 837234, 673902, 586669, 621598, 508936, 393339, 408783, 451662, 466597, 492551, 447898, 365043, 373632, 406919, 422109, 388632, 310745, 144024, 197452, 193689, 212734, 200319, 181566, 208708, 165691, 130168, 150359, 243230, 238531, 123116, 90135, 112560, 173628, 194548, 219823, 160115, 108249, 102798, 96017, 150770, 162248, 229980, 278366, 311481, 258508, 239472, 253592, 252562, 158991, 180641, 138472, 45862, 52389, 55054]
17973E5054k1107K6061N8656m4455J2827O9270L2713q6212l789Q0223J52032l3022
17961B98251m9319q2306j85463L6727Q0764Q3647P8502o3408J5033m6787o857
17950A58784o3876k585p782j9677K9544P8032j09230j55238J1459O1893P6946
17939E8270J48195J097k2994R74j04069n4016k0545p673n7340k2428M7025J15373
17927H1869J1483o2815l1287K5912L4089k6279r3623J6205Q6881o0431j09300
17916a27296Q5562r671O6158K3467n3467j19237k1421J88341R378J5492N4634
17905A11940o1105n5343k472j9819L0141p879p9051K9301j2601N4331J25742m0330
17893G2855q8129o7995n5987o3575l4199J3220J63020L203j37647j04384j9747
$$ y = [55054, 33947, 60008, 118664, 74209, 87036, 156306, 189019, 102807, 99018, 179241, 331273, 298251, 248932, 166626, -18837, 17890, 98654, 182301, 260803, 197395, 212428, 165641, 158784, 94908, 92323, 84541, 64864, 94408, 172440, 63210, -92028, -80569, -18676, 58270, 206465, 207562, 184568, 185542, 81473, 27457, 6912, -761, -58101, -80529, -33504, 81869, 93352, 30537, -750, 25162, 59251, 32972, -60651, -44446, 42435, -17996, -127296, -41734, -51405, 14753, 38220, -15247, -134484, -155905, 32436, 41814, 57306, 111940, 50835, -4508, -6980, -26799, 3342, -4537, -83588, -54287, -66888, -12557, 113185, 72855, -15274, -83269, -139256, -202831, -237030, -223810, -60790, -57587, -195234, -299618, -319365]
17882c19365M0578J60373Q4141p5573j17960m936L5973J9915J24R2795P9014k2191
17870b7112J4846L5690J16p1490m7505J6146j0157K8852O540n5126p7449K8076
17858a58573M2998J16766P1282M0167j4614l7184j42397p8909j3094J9190R1531
17847f2837P1092J37155K2092l298j531P0359m3550j04654r7412q5392j23843
17836b21819m2697P8760R1422Q7011J01639J40881J65246j09452j92550j42803
17826d4362O4586P1184n6065o811J2528J75l5355N584J2839Q534J43693N0488
17814B27018j3040l1379k1255j84293l3104N5834l544o854o5029N5866k3323j1586
17802e4689L8387K20141L1412r6676j070J47887J33474k2934P1285l167p4674
$$ y = [-319365, -278787, -118414, -34273, -109846, -227806, -232742, -196769, -176854, -176730, -83935, -4921, -27112, -12266, 23424, 23540, -47950, -95455, -79309, -89466, -60614, -54074, -109200, -186649, -158573, -115575, 1191, 72473, 112640, 98026, 60842, -81555, -160464, -173558, -154368, -62837, 8255, 145410, 167502, 164204, 162673, 233032, 189482, 84828, -12584, -97976, -221819, -264516, -185756, -94334, -7323, 94316, 235197, 400443, 290991, 98441, -44362, 20224, 91408, 35343, 28532, 41060, 41235, 5880, 11464, 24303, 32837, 176530, 227018, 213978, 182599, 161344, -22949, -56053, -219, -3763, -10617, -75646, -19780, -43103, -54689, -16302, 203839, 235251, 138575, 137505, 285392, 418866, 395932, 467217, 464050, 389376]
17791C89376m4110r5252m9787M692l8535j69683j1107M7439K5226J45512q430
17780A95341l824q4049M0700k7253n0282K0048R4535J20374J25098O8344q9220
17769D09812l6250r359O893k0809j26786j43792N9542J20518j5645p6792j26093
17758D1239o3633m0466J6327L9974J65793J59734J36162m3463o6319j34796l7745
17747A72807n8084p2318k9672J22666J26935m004k2308r1902r4143J9589P4235
17736A43801j02013J37311Q9514p8085J3749O5088J75757J53482K4949K7971k902
17725F48622j02812J28323K1170j4264J2511r3444l8628o1947j19650l1681M109
17714C52309j38502k8505P0920J60838K12175J19172O8851k9514q5001j12046
$$ y = [389376, 345266, 250014, 200227, 204919, 166384, -3299, -14406, 33033, 58259, 203771, 195341, 191517, 107468, 148168, 120915, 70633, 90681, 185216, 305590, 430688, 499032, 409812, 373562, 364203, 371096, 350287, 223501, 79709, 139251, 259769, 244124, 167332, 41239, -22394, -62860, -46533, -6559, 159234, 318968, 455130, 411667, 345348, 210552, 172807, 114723, 42405, 12733, 135399, 262334, 258330, 236022, 144120, 49977, 69566, 143801, 41788, 179099, 268613, 190528, 204277, 269365, 445122, 598604, 623553, 651524, 648622, 545810, 674133, 695303, 681039, 693550, 600106, 561478, 499531, 379881, 348200, 352309, 213807, 185302, 256222, 417060, 629235, 748407, 817258, 787744, 702743, 590697]
17704E90697j27337p7649j53428q1607N5906k2927k3731K2401M0099L8916o5017
17693A96323l6755L7759m8466l1609J20287J29896k4408l5948K5893J08981j8905
17682D23048k8466J99764N0237Q4852K5626K9562L7488J01929l4888j15080p5180
17671F98892J16962J36293J22227m5483j2991L321M7886N5593K734r2855L7464
17660A070043q0523l921K2358j5319N0750M9952j0832J8930N503j14414j9765
17649I72762J30955J85038J49720J67785R2995M1798J14709L4044L7265J10831
17639B037902J45252J02079L6697R9069J35022J57524J03959K33963K19602K53873
17629C524942K34568J89705L83725M75465N39728P83245Q71691J028516J236289
$$ y = [590697, 463360, 385711, 232283, 150676, 206582, 183655, 159924, 182325, 222424, 261340, 196323, 159568, 197327, 148861, 117252, 237539, 367435, 343027, 307079, 332972, 441953, 423048, 394582, 594346, 644583, 729435, 755061, 784623, 822111, 924040, 889152, 774072, 698892, 815854, 952147, 1074374, 1028891, 1015900, 1019221, 1067107, 1122700, 1125434, 1032579, 1070043, 989520, 985599, 1007957, 992638, 1043388, 1093340, 1082508, 1101438, 1106941, 992527, 972762, 1103717, 1288755, 1438475, 1606260, 1699255, 1741053, 1855762, 1889806, 1927071, 2037902, 2183154, 2285233, 2321930, 2420999, 2556021, 2713545, 2817504, 3051467, 3271069, 3524942, 3759510, 3949215, 4332940, 4808405, 5348133, 6131378, 7003069, 8031585, 9267874]
17620I267874J595243J927972K066296K620445L687416N017847N795994N255584
17612C7234671L017670j35333k617635l223253k429305j108621M32149K163379
17604C3333722L878669N874303Q327537J2105908J7917368K6925879L9631501
17597A47994887N4989662O6841203O3079052L5761887m933015l6855528m9372156
17590B77505992m8961957m3175168l4842723k5361390j6311773q464758j785850
17583I8602373L201350N424596L703693k116696r557412j4475585j5264328j3325760
17575E6192231j0241026p536404n340874l708681k694147j939060j463986j409166
17567B1858887j215396r01515n43245k13223K18033M85490P99520J074038J341050
$$ y = [9267874, 10863117, 12791089, 14857385, 17477830, 21165246, 26183093, 31979087, 37234671, 40252341, 40117008, 37499373, 34276120, 31846815, 30738194, 31170343, 33333722, 37212391, 43086694, 51414231, 63520139, 81437507, 108363386, 147994887, 202984549, 269825752, 332904804, 368666691, 363733676, 326878148, 277505992, 228544035, 185368867, 150526144, 125164754, 108852981, 100388223, 98602373, 101803723, 107228319, 110932012, 108815316, 99257904, 84782319, 69517991, 56192231, 45951205, 38414801, 33073927, 29365246, 26671099, 24732039, 23268053, 21858887, 20643491, 19741976, 19198731, 18985508, 19203541, 19689031, 20488551, 21562589, 22903639]
17558B2903639J810443K647422L878051N630444P833753J0549028J3369355J4759885
17550H3382020J2857039P301407L65743m529061n196549k133542L207210R942922
17542A05197189J7621284K6570590L5533351M2996034M7389294M5105014K8833913
17535C49246669m221113m1334138o1830244o0401030m7252593l3415790k2773158
17528G8018603j5499408j0733990p468236n180174l468418j976618o65816Q19980
17520C3845923J937616K406603J716436n07086l307309n061904n169663m330240
17512B1530376l168899k481987k085601j709791j552177j292151j073292q58868
17504G307610n70052m88606m02694l92723k97962j99796K4280J04047M9293j20971
$$ y = [22903639, 24714082, 27361504, 31239555, 36869999, 44703752, 55252780, 68622135, 83382020, 96239059, 103540466, 103906209, 99377148, 94180599, 92047057, 95254267, 105197189, 122818473, 149389063, 184922414, 227918448, 275307742, 320412756, 349246669, 345025556, 303691418, 241861174, 181460144, 134207551, 100791761, 78018603, 62519195, 51785205, 44316969, 39136795, 35668377, 33691759, 33025943, 33845923, 35783539, 38190142, 39906578, 39399492, 36092183, 31030279, 25860616, 21530376, 18361477, 15879490, 13793889, 12084098, 10531921, 9239770, 8166478, 7307610, 6737558, 6248952, 5846258, 5453535, 5155573, 4955777, 4980057, 5084104, 5133397, 5012426]
17494E012426k5020j68190k90609l79207l26052k14366k53738m8822j19938j17659
17484C068825k35306r2434j93266J511J03110p593o6220K6347J58483O1899k751
17473B822605j51645j08321n5244j42031j39122k59813j19684q2522n2468q6508
17463A625247k53969j14718K5730k3650N543m582o6358n2167R8810L8950j2921
17452A265915n1437r4869n3700J94065N4496l6692J21207O9260P5775K02261L62394
17441B108675L43244j82798m60866l25523k02404k09510p1609r4761n6629L1015
17431H78834L6760J03319N0711r8348k2708o2436o1774J563M212J14113l1236
17420I13010K6441q2782o2691J9353m41j1398j4294l5604k657j29418r2599J4054
$$ y = [5012426, 4987406, 4819216, 4528607, 4149400, 3823348, 3608982, 3355244, 3306422, 3186484, 3068825, 2833519, 2741085, 2547819, 2549330, 2652440, 2644847, 2578627, 2604974, 2763457, 2825356, 2822605, 2670960, 2562639, 2507395, 2365364, 2226242, 1966429, 1846745, 1764223, 1711755, 1625247, 1371278, 1256560, 1282290, 1258640, 1264183, 1259601, 1193243, 1141076, 1239886, 1278836, 1265915, 1214478, 1119609, 1065909, 1259974, 1314470, 1277778, 1398985, 1468245, 1544020, 1746281, 2108675, 2451919, 2269121, 1808255, 1482732, 1280328, 1070818, 999209, 904448, 847819, 878834, 915594, 1018913, 1069624, 971276, 948568, 886132, 824358, 825921, 830133, 944246, 913010, 939451, 856669, 793978, 813331, 812890, 801492, 787198, 751594, 748937, 619519, 526920, 540974]
17408E40974n0874j26692K16781J15509k1396N6712M6627j24223p1397r281l280
17397E69460J3063n4504l9084M3174l6983n3331r241K1775J6297J15539L7275
17386F23440P948n8021P5956N6799j4542J9951L9848Q083j80953k15020Q4296
17375D47785l4143q9485K8452K1356Q0820J5377k540o9859m7632m5828l7089N0240
17363C17454Q061k1937j08715j03747M2243O5651R8867K181O9935q2832l7003
17352B50158K8188P4553j01338j46242l0259m4650L6384L2361R9215K9015l094
17341B24291j04435j0957J25534k6721o3339Q2033J09169M8103o73j0650j3721
17330C58634o6438L6511P6851k974j461M5000n4964j9015K1435q5381k61222N0255
$$ y = [540974, 490100, 363408, 580189, 695698, 674302, 731014, 777641, 653418, 582021, 572740, 569460, 582523, 528019, 488935, 532109, 495126, 441795, 432554, 454329, 470626, 586165, 623440, 631388, 573367, 649323, 706122, 691580, 711531, 751379, 759462, 578509, 363489, 447785, 413642, 324157, 352609, 373965, 454785, 470162, 467622, 397763, 350131, 304303, 267214, 317454, 325515, 303578, 194863, 91116, 133359, 199010, 297877, 300058, 369993, 287161, 250158, 278346, 352899, 251561, 105319, 75060, 30410, 66794, 99155, 198370, 227385, 224291, 119856, 108899, 234433, 207712, 144373, 226406, 335575, 383678, 383005, 372355, 358634, 292196, 328707, 405558, 402584, 401123, 446123, 391159, 372144, 393579, 308198, 46976, 97231]
17318I7231J44982J3887l8987K3535M168m5732j30135p3365J06734N0683l7102
17307A15899J3572l7236j0800L0542L5486P3423o311J3708N2737m0674p1769k5130
17295A43447M7080Q5093J5977j3033j6394j62097p8024P3917L3426K3024J22496
17284B74912p5340l2798L9717j5139P132n4642p22k144m2373P9639N9988K298
17272B40528j19746K3890j8673r0811N7210O55n6428J02651N8230Q5587N7120
17261C40213j11306l2307Q150K9878O195l3496l1041r8097n348p4903k1962J24878
17249A00854P7140K444j9252m2360q0275L5285J03974Q78L0556J6891o7464k0680
17237A37991j1919k3570n615n177n8300N1134r5940o2932L1031o0461L6385J8165
$$ y = [97231, 242213, 256100, 217113, 240648, 244816, 199084, 68949, -4416, 102318, 153001, 115899, 129471, 92235, 81435, 111977, 147463, 220886, 214575, 228283, 281020, 240346, 168577, 143447, 190527, 275620, 291597, 278564, 262170, 100073, 22049, 95966, 129392, 152416, 274912, 199572, 166774, 206491, 191352, 198484, 143842, 143120, 140976, 98603, 178242, 238230, 240528, 120782, 144672, 125999, 35188, 92398, 93053, 36625, 139276, 197506, 283093, 340213, 228907, 196600, 204750, 234628, 240823, 207327, 176286, 78189, 72841, -2062, -24024, 100854, 177994, 180438, 161186, 118826, 38551, 73836, 177810, 178688, 209244, 226135, 158671, 137991, 126072, 102502, 96887, 91710, 33410, 84544, -11396, -74328, -43297, -103758, -67373, -49208]
17225d9208k9700L7822J55866K3048Q070j7789l9717r8894R584M7008N8264J2377
17213A16731n2996L471j4598m5949J3696K40M8291J02502L4737m0355n9648l6631
17201F9491o0097L4901j1020M3773N4964l7918q0956k2023p4555k9085O9793K003
17189d0729n3375J35813m2641p7499q660J58747J56667N1275m9376j8525L3110
17178B44807o7735L0408n968p1095p5705O8089Q8558j6519k2624j757r2543n3143
17166B4773R3295J0072j20557j02336n3887J25780P3262N2918N1120q675J8819
17155A64584o070j32664O5678O7921q6766J9775P2187L5633O6297p9707j3071
17144A73797r4592j10895M1016K08974L2539q7801n979j37947M1250O3383J701
$$ y = [-49208, -78908, -41086, 114780, 137828, 145898, 128109, 88392, -10502, -918, 46090, 104354, 116731, 63735, 67206, 52608, 6659, 20355, 20595, 68886, 171388, 206125, 165770, 106122, 69491, 9394, 44295, 33275, 77048, 132012, 94094, 13138, -8885, -83440, -112525, -42732, -40729, -94104, 41709, -932, -78431, -87091, 71656, 228323, 279598, 230222, 211697, 244807, 177072, 207480, 201512, 130417, 54712, 122801, 211359, 194840, 172216, 170459, 77916, 24773, 118068, 128140, 7583, -94753, -148640, -22860, 50402, 103320, 154440, 145765, 164584, 158514, 25850, 91528, 159449, 72683, 92458, 164645, 200278, 266575, 186868, 173797, 79205, -31690, 9326, 218300, 250839, 163038, 157059, 19112, 60362, 123745, 125446]
17133A25446L4162j03461o0294J5279J326R0118P7160M6073n1992l4146n0859
17122H8812m0505N3176j714m8963k9545k9773N3162O4455k2460j0897K7181P7681
17110A80610J90695m8959n7824p3327q0874j5739J16932J44489J07446p2728L1032
17099D21753P9556K15975J64721N4912L3813o397l5677k1173K8154j4813J4649
17088I35473r1569p3161m2008n9821j29848M3239J77069J30337O6017q8260J5556
17077H83024j5429j64742j39724q7709n8645r8906j11462K5563L4873n3097R8779
17066C12525O6200n889p0324k7675k6354o3467k5008P0245L932K6628k0686j09903
17054A30224j06009J2557O3602Q2327R6626J6556J44189O8149R7924J20770O4870
$$ y = [125446, 159608, 56147, -4147, 11132, 12458, 102576, 179736, 225809, 173817, 139671, 88812, 48307, 101483, 99769, 50806, 21261, -8512, 44650, 109105, 86645, 75748, 102929, 180610, 371305, 322346, 264522, 191195, 110321, 94582, 211514, 356003, 463449, 390721, 421753, 501309, 717284, 882005, 936917, 970730, 964333, 928656, 907483, 935637, 920824, 935473, 843904, 770743, 728735, 668914, 539066, 582305, 759374, 889711, 955728, 867468, 883024, 867595, 702853, 563129, 475420, 416775, 317869, 206407, 231970, 266843, 213746, 312525, 378725, 372836, 302512, 274837, 248483, 185016, 160008, 230253, 234185, 260813, 240127, 130224, 24215, 36772, 100374, 182701, 279327, 295883, 440072, 508221, 606145, 726915, 791785]
17043G91785K8148j417O3003P3909Q6791p766k9545r0334j14464q4832j16309
17032E98969K1272r108o2576k5435k432m0512k8286N97P4577J42928j8646K5300
17020F76648J87271O6193k8024j37672k00863j05141j5138r0286j34554O053J7658
17009B42145P14j4793R8764N4667J4585m1864k05444l1956o6050j9603Q2639K4288
16997A38092m3392k0605K310J50549j02009j85213o4671N5041L0173Q9952N9225
16986A09452j17559L8246J05963p392J3717n0237l7151r460p098j30605p2265
16975a64389P6615K6528m5642m9440M6208l6847j5731O2819J03677K4853j12163
16964h3512N645M9634k2487q890J8396q9558j6602O6246L6485O3001M1198m8332
$$ y = [791785, 819933, 818516, 881519, 955428, 1042219, 1034453, 1004908, 914574, 800110, 715278, 598969, 620241, 611133, 548557, 523122, 520690, 480178, 451892, 452489, 527066, 669994, 651348, 676648, 863919, 930112, 902088, 764416, 563553, 458412, 443274, 352988, 218434, 224487, 242145, 242859, 228066, 326830, 381497, 396082, 354218, 148774, 116818, 50768, 31165, 113804, 138092, 94700, 74095, 76405, 226954, 124945, -60268, -124939, -69898, -39725, 50227, 109452, -8107, 30139, 136102, 128710, 142427, 92190, 55039, 45579, 38481, -92124, -164389, -87774, -61246, -106888, -156328, -110120, -146967, -162698, -99879, 3798, 28651, -83512, -77867, -28233, -50720, -59610, -41214, -130772, -147374, -81128, -44643, 18358, 59556, 11224]
16952A1224o1926M9737J01190n2352n5100o2626Q372L9837N8236L6486K1412n982
16940H8508j7166q3508j03003O654k4411k4837O3909O2086J8157K2098p2217k6625
16928i0355l6741J5382m8882M1399J4340M6192o5702M5710k5247o3750n2746O9544
16916a50856J56461J5973N8770M3915k0178J9302p113p845m5093m4274P3405J537
16904I4004o0622m2185J25057M2692K572j0433j15945m6453P1443j16602q3910
16893a40382P0849o0899L6050J88906j51542j98235Q9883J73789K5571J60275
16883A94265N3072j07331j19246j27838P875R453M7727J0521o517m2275K4212
16872e6082O7604J01415M2086q5555j55440j42682J29256J01920N0197l2137m7989
$$ y = [11224, -50702, -965, 100225, 47873, -7227, -69853, -61481, -21644, 36592, 73078, 94490, 88508, 71342, -12166, -115169, -108515, -132926, -157763, -93854, -31768, -13611, 8487, -63730, -90355, -127096, -111714, -160596, -119197, -104857, -58665, -124367, -78657, -103904, -167654, -220400, -150856, 5605, 21578, 80348, 124263, 104085, 123387, 116274, 108429, 63336, 19062, 92467, 94004, 33382, -8803, 116254, 158946, 161518, 151085, 35140, -11313, 60130, -56472, -140382, -69533, -130432, -94382, 94524, -57018, -255253, -165370, 8419, 33990, 194265, 247337, 140006, 20760, -107078, -99203, -89750, -42023, -31502, -38019, -80294, -56082, 11522, 112937, 155023, 69468, -85972, -228654, -99398, 2522, 52719, 20582, -27407]
16861b7407l7901J21733K6890K4566N1162Q3967p9450k4453j9578j7069m6951
16850E5509j39661K0594Q9546M8049J1112r6107J1751M8756k7162l9137Q1856
16839F5106M4314K6272q4508j27168n0924O6784N7996o5635K50m5331R895Q679
16827i4270R1280r8519o2119P520J09281l1633j38487M7450K0350R2824K048J3565
16815d0710m8548r4589l797Q588J14316J03484p7383J861L380r3247n0374J08837
16803f8182j6624L1179l8683M4166j9270q5124p4260M0764J74244o170m6786J00851
16791C6105L7952q2299Q384L5823K8030k1715j38644r5293r939k9586P8364O6747
16779h6071l0512L2254N2460j5855j2883m8905l3248m7985J7175J01922Q2924
$$ y = [-27407, -65308, 56425, 83315, 107881, 159043, 243010, 163560, 139107, 119529, 102460, 55509, -84152, -63558, 25988, 74037, 85149, -10958, 793, 49549, 22387, -16750, 65106, 109420, 135692, 51184, -75984, -126908, -60124, -2128, -67763, -67513, -112844, -102949, -94270, -2990, -101509, -163628, -156108, -46827, -78460, -216947, -169497, -149147, -56323, -54275, -40710, -89258, -183847, -187644, -179056, -64740, 38744, -38639, -36778, -33398, -126645, -177019, -68182, -84806, -53627, -92310, -48144, -67414, -152538, -226798, -186034, -11790, -17960, -64746, 36105, 74057, -8242, 142, 35965, 63995, 42280, -96364, -191657, -201596, -231182, -152818, -86071, -116583, -84329, -31869, -47724, -60607, -109512, -142760, -190745, -173570, -71648, 11276]
16768A1276N5849L623O0205m3135p8788k6554J22012Q3665k3898l126o1273m7026
16756E2830l3194j38380M4977R1193q5336L219J25223P897m4168M755r235M9501
16744F9282n6108j15667Q367j3118L2402k7812l955O009r5073k3238J54067J02282
16732C7438L0042P972m6460Q6931L8266l5037p0844j52014N4784j651o6931P797
16720a09707R9068KR8466j2822j54028j01854q86O441K614O5639l9538j1964L330
16707a55239m4574j4422J20167K3867k1351N8791J6548L2486p7424L9050K1738
16696c63q5163l9224N8194p5144q6952k7807N4982J78249J43580j7447l031M4600
16684A44474q5653m1486j8396p6192p0695k330J04541P5924m4948o4117j3666
$$ y = [11276, 67125, 70748, 130953, 87818, 9030, -17524, 104488, 188153, 164255, 161129, 99856, 52830, 19636, -118744, -73767, 17426, -67910, -64691, 60532, 68429, 24261, 29016, 19781, 69282, 13174, -102493, -94126, -107244, -74842, -102654, -106609, -100600, -195673, -218911, -64844, 37438, 67480, 75452, 28992, 115923, 154189, 119152, 48308, -103706, -48922, -50573, -117504, -109707, -10639, -10637, 87829, 75007, -79021, -180875, -181761, -175320, -172706, -107067, -146605, -158569, -155239, -199813, -214235, -94068, -70201, -91552, -32761, -16213, 16273, -61151, -22101, -363, -85526, -124750, -66556, -141700, -228652, -256459, -201477, -23228, 120352, 102905, 99874, 144474, 58821, 17335, -1061, -77253, -147948, -150278, -45737, 30187, -14761, -78878, -92544]
16673i2544p502K4413o7119O4209Q6285J6456m8074p2410j1627m0746R8961O8793
16661A9095N0353j5414o5490l6295p67k052j54253m918J10587N7964M7635M4648
16649E1093P007K9970j26189j4621O3879n1017q9897L1243J11622j422k7832K7127
16637A0963K4114r3363J8253K4330J3576n0247q1525J5109m5812Q9503Q12N8221
16625a6066n461k6860k7697j462k2154L5853J4950L7595N6862l8873p5693M4808
16613b4198j7221k5963Q7963M2935q3005p9549O1985R8251J45893m7951j29125
16602C0015l8921m9092m5491o520O6868O1540O7897k8535K4488K2488J3867l0743
16590H7861r5042l0453l7696r0999j2031O8399L9089J58802O1223o458p4670n4394
$$ y = [-92544, -100046, -75633, -142752, -78543, 7742, 24198, -23876, -96286, -107913, -148659, -49698, 19095, 69448, 54034, -11456, -47751, -48518, -50570, -204823, -209741, -99154, -41190, 6445, 51093, 58100, 88070, -38119, -52740, 11139, -39878, -129775, -98532, 13090, 11668, -16164, 10963, 35077, -58286, -40033, -15703, -2127, -52374, -133899, -118790, -164602, -75099, -74287, -16066, -21527, -48387, -76084, -77546, -99700, -63847, -48897, -11302, 45560, 6687, -69006, -24198, -41419, -67382, 20581, 63516, -19489, -99038, -37053, 61198, 207091, 159140, 30015, -8906, -57998, -103489, -110009, -43141, 18399, 86296, 57761, 82249, 104737, 118604, 87861, -7181, -37634, -75330, -166329, -178360, -109961, -70872, 87930, 149153, 142695, 68025, 13631]
16578A3631P6197J8766j5381P783q2908m4110n5070O240p3675p924m4078n196
16566b05725P4815L3830K823K2937k5015K0635j0995M4284m7900n2852m3074J73338
16554a2899J1088r2251r79O0772k1889K1932P4270l7398n3847J26Q7645R1892
16542A28462l277n1893m0807q4035p6216M1171N7402p8388R0287J36251k5059
16531I3898j30070J1808r5968r0772Q0167O1170j7739p7093P6282m2380j18801
16520b49498R111O8263J02152O1218Q2328O2488l5176J501K7318o4859r1366j01970
16508a28490L8142k5618M4222o872O8920K0004q4234r243N7253j4268o8854K9301
16496g9737l7372l8422N309L0893N5407P8412L8338j34694p5589m5784M9261P6723
$$ y = [13631, 89828, 108594, 93213, 100996, 18088, -26022, -81092, -74852, -148527, -156451, -200529, -205725, -130910, -97080, -94257, -71320, -96335, -75700, -86695, -42411, -90311, -143163, -186237, -12899, -1811, -94062, -95041, -34269, -56158, -34226, 40044, 2646, -51201, -51075, 36570, 128462, 125185, 73292, 32485, -51550, -127766, -86595, -29193, -107581, -17294, 118957, 93898, -36172, -24364, -120332, -211104, -130937, -69767, -87506, -164599, -88317, -130697, -249498, -240387, -172124, -69972, -8754, 73574, 136062, 100886, 102387, 129705, 64846, -26520, -128490, -90348, -115966, -71744, -78616, -9696, 10308, -73926, -83169, -25916, -40184, -109038, -79737, -117109, -155531, -150222, -119329, -63922, 14490, 52828, -81866, -157455, -203239, -153978, -77255]
16484g7255k7378N6149J03921q3215j00015P1275L5338O4834R271n8011k5722
16473c0808n564m2421R170N2192o7876r489J19187O572J853Q9916M5426J3625
16461A81783j93185o481K4327J2409j6877n3624p5290q7478J6351J2802N2645
16450a32618J08595J22995J6512K4532j53013o0191j9960M657J04646k9355j14208
16439a27408k8753J22880K8708l3964k3615k7451M7705M2358o049m477k9075l6807
16427g5948j5049R296K3950J16417k7694p5256J6542J6294l7242k1834p943J25985
16415D7518j2265r8790n5231O1364O6016K5099p5855J9106j9205n8447J03680
16404B990L5034k9321l441L3165Q5906q541p067N9910L7812p2299n9217j62741
$$ y = [-77255, -104633, -48484, 55437, -27778, -127793, -56518, -21180, 43654, 52925, -5086, -30808, -36372, -78793, -69623, -17431, -85307, -94796, 24391, 30963, 32816, 122732, 168158, 181783, -11402, -17883, 6444, 18853, 1976, -51648, -126938, -214416, -198065, -185263, -132618, -24023, 98972, 115484, 140016, -12997, -73188, -93148, -88491, 16155, -13200, -127408, -156161, -33281, -4573, -38537, -62152, -89603, -41898, 460, -5589, -10066, -39141, -75948, -90997, -81701, -57751, 58666, 30972, -44284, -27742, -11448, -48690, -70524, -78467, 47518, 35253, -63537, -118768, -57404, 8612, 33711, -42144, -23038, -42243, -100690, 2990, 38024, 8703, 5262, 38427, 124333, 115792, 108725, 168635, 206447, 134148, 74931, -87810]
16392h7810l3979J04067M2721K8156p3270P527J4314J42k762M9224N7430m6914
16380E8846j06009k8958L5214M162q058p1326l8926K151N9671M0361M5631K1406
16368A4165j1492j20763j08600R2170N4346J9567Q951M3736L6538j19626o7543
16357a58551L5428Q478K288R594J68431R8865j02868p2273m2747r931M9039l626
16345a7873J31497q72k4993J0765J3429m0589r2297q8070k3234M7002J29479l8651
16333E593k2452J14702K5821J194l2706q0978L4506p2913M9559n2434o7279o901
16321a04288n1343J08016N1939n0593j03100o3218o2346j129k9754j078J33998
16310a72896L8193k9876l4152k6854J03895M0646J6286N6365J44678N0396p3093
$$ y = [-87810, -121789, -17722, 24999, 53155, -20115, -12588, 1726, 1868, -894, 48330, 105760, 58846, -47163, -76121, -40907, -36745, -44803, -116129, -155055, -152904, -93233, -52872, -7241, 14165, 2673, -118090, -226690, -134520, -80174, -60607, -51656, -7920, 28618, -91008, -158551, -123123, -114645, -112357, -102763, 65668, 164533, 61665, -10608, -53355, -63286, -14247, -17873, 113624, 112752, 87759, 98524, 111953, 71364, -20933, -109003, -132237, -85235, 44244, 5593, -16859, 97843, 123664, 124858, 92152, 11174, 45680, -27233, 22326, -30108, -97387, -104288, -155631, -47615, 4324, -46269, -149369, -212587, -274933, -276062, -305816, -306894, -172896, -134703, -164579, -198731, -225585, -121690, -81044, -64758, -8393, 136285, 186681, 113588]
16299A13588n9089j31857L156Q8735M9676q8873o5o9669J13492Q9968J011P8232
16287A88305J5686j21997j5509n6778o1036k0645M3934R6045P1022n771J4660
16276A47916j8014n8619K7377n7365j48622r6975l8018M7613l0031R0451L9356
16265i4931N475o0052J1116j0835K4000M9158k9282J9032K5644O0627p4013j4377
16253h8438L8817l2005M8078K0827R4385M8278j58392j27504q8031j8408j0318
16242b72711J0626J48190J9355K29j5535Q5556R844J5380l5286m0025J40M2778
16230c1459K7407l1811q3334Q827k5961M5330j1850j4753j18680l6716Q5211J01520
16218h6269M9255J9802j20863l4082J150q8672Q8452M6269O082O6976q1257q6061
$$ y = [113588, 54499, -77358, -74202, 14533, 64209, -24664, -24729, -94398, 19094, 109062, 110073, 188305, 203991, 81994, 66485, 9707, -51329, -71974, -28040, 68005, 139027, 133256, 147916, 129902, 71283, 98660, 41295, -107327, -204302, -242320, -194707, -224738, -134287, -94931, -89456, -149508, -138392, -149227, -125227, -76069, -105351, -86319, -60675, -48, -74061, -88438, -49621, -81626, -33548, -12721, 81664, 129942, -28450, -155954, -243985, -262393, -272711, -262085, -113895, -94540, -94311, -109846, -24290, -14446, 934, -34352, -74377, -74237, -31459, -4052, -35863, -119197, -110370, -136331, -91001, -102851, -117604, -236284, -273000, -187789, -86269, -37014, -17212, -138075, -172157, -171007, -259679, -171227, -124958, -118876, -51900, -133157, -219218]
16206b19218J6446J35038R3235K5895O2700L8923O5052J950k1804r2827m8850
16195E6540O5612o4241j83323j22280M8572L2494p4802j4580M4118J30612j21683
16184b02961m4754J16589J46430J12404l9976p3528o5090O6713M2320J00378k1622
16173A36903o1935l9733m8255p3645M4134P8915Q5349l9528m4819j2679Q950k3626
16161A0031K5237r964Q899L7582o2170r8743j6168J19855o2867j08907r7552L0943
16149b23824K05673J26595j7510j1281r4972j46926k4803R7578Q9211P6942R0662
16138A67345m9134j11116l4917J8302n8172l4981K1317l3238N3975K25321N3128
16127B17830k10907r0660k4743j05432j6349P278k0584N3101k1410N0268M774
$$ y = [-219218, -202772, -67734, 25501, 51396, 114096, 153019, 218071, 220021, 198217, 105390, 56540, 122152, 57911, -125412, -247692, -199120, -166626, -241428, -256008, -211890, -81278, -202961, -247715, -131126, 15304, 127708, 87732, 14204, -50886, 15827, 58147, 158525, 136903, 74968, 35235, -13020, -86665, -42531, 36384, 121733, 82205, 37386, 24707, 33657, 10031, 35268, 25304, 34203, 71785, 9615, -89128, -105296, 14559, -48308, -157215, -254767, -223824, -18151, 108444, 90934, 79653, -15319, -162245, -187048, -89470, -259, 76683, 167345, 118211, 7095, -27822, -9520, -67692, -102673, -81356, -114594, -60619, 164702, 217830, 6923, -83737, -108480, -213912, -230261, -222983, -243567, -190466, -211876, -161608, -156834]
16116a56834K1401j0706L02q2795K0344N3460L4474k2337P6385L2539L1585l660
16104e842J6296L8053k607k3036l9380p4285Q306R8599P7456K5698Q0561j55560
16092D4259j90160m6049L9620J04007l377m0273j02177p2221j7563Q7772J95654
16081e08L1429q234l6630l3356R531j41727j13499L6897Q9501m1291O650Q9054
16069a12183m2722J7422L39M355k1401O465k0353J8047J13029P3560p1717r6403
16057a31562j01246M6816M4055O1742l1095J59628R4291o5601N6361K4056m0753
16046A16692O9003n130n1733P5112N2571n7558o9544q6251r9269q734O4368j9020
16034a9493l3725N2311N2620N061M353r023K3352l8257L9659m645j08263M9905
$$ y = [-156834, -135433, -146139, -145837, -228632, -208288, -154828, -120354, -142691, -66306, -33767, -2182, -5842, 10454, 48507, 45900, 22864, -16516, -90801, -82495, 16104, 93560, 119258, 199819, 44259, -145901, -191950, -152330, -48323, -51700, -91973, -194150, -266371, -283934, -196162, -508, 30921, 22687, -13943, -47299, -37768, -179495, -292994, -256097, -166596, -207887, -201237, -112183, -154905, -137483, -137144, -132789, -154190, -147725, -168078, -150031, -37002, 36558, -35159, -131562, -232808, -185992, -141937, -80195, -111290, 48338, 142629, 77028, 133389, 157445, 116692, 185695, 180565, 128832, 203944, 256515, 198957, 129413, 43162, -56107, -64841, -473, -19493, -53218, -907, 51713, 56774, 61127, 52104, 75456, 37199, 76858, 72213, -36050, 13855]
16022A3855J2034m7386j13626k8256Q2017Q4712K935N6244O9139O6762l3722j2552
16010A52156J2190p6690m7031j9570M3862n1041P0181O4401j1489r2084j5712
15999B9173O0774K4419p1561j6421n6510K6771O8391k3174n0554M0863L3833p7546
15987a1542q5715M6488N8270m3414q1288M9876Q7959k4063k7383N5520N0022q4714
15975i984q0658L5380P5886p0604l6469M4455Q4822Q4165k3637K337q6235n5847
15963c6389J9800M6260p4417j3969P5340L5024j18324P4936j4581O7800k2000
15952C9480p0004k5943q534j74958L3961J23890J5983m4712l7897k997m3538k9465
15940b24734J4031R5781N2034m4241m0417j872o5882Q3033R8532l3881M197J15830
$$ y = [13855, 25889, -21497, -135123, -163379, -81362, 3350, 6285, 62529, 131668, 198430, 164708, 152156, 164346, 87656, 40625, 21055, 64917, 13876, 84057, 148458, 136969, 44885, 29173, 89947, 114366, 42805, 26384, -30126, -3355, 65036, 41862, -8692, 32171, 66004, -11542, -97257, -50769, 7501, -35913, -117201, -67325, 20634, -3429, -30812, 24708, 74730, -9984, -90642, -55262, 20624, -49980, -86449, -41994, 42828, 126993, 103356, 105693, 19458, -36389, -16589, 29671, -44746, -58715, 16625, 51649, -66675, 8261, -6320, 61480, 39480, -30524, -56467, -65001, -239959, -205998, -82108, -66125, -110837, -148734, -151731, -195269, -224734, -210703, -114922, -62888, -107129, -147546, -149418, -215300, -132267, -33735, -67616, -63419, 52411]
15928E2411M1920j29004M9799Q1332l0621n2003j0971k5776j33805k13222N2091
15917c17849J33469J04316L6772m4990j192L8666L0869r135j13807K6579J02250
15906a4052n986k5064J04144M6675J01429j42239k3692q7332K2997l5504N870
15895e2754M8366P3642o352L3620N6496j18298k8915L7272m6492N9509J36432
15884A92526K7057l8993j86932r7058P8338k3702q0552j5173M1259l1242M43O8865
15872f5164l2545k633J8370R342j327j5548P5631k8328O1144P835j32484m9145
15860a54852J21407n0635j090J03724J6916J7056k1709m0824j100j7931P4129
15849D5091N4988l489L7133L7319M2655q4239j6082K9801l3037q810r5389k5983
$$ y = [52411, 94331, -34673, 15126, 96458, 65837, 13834, 2863, -22913, -156718, -369940, -317849, -184380, -80064, -43292, -88282, -89474, -50808, -19939, -29074, -142881, -116302, -14052, -20038, -45102, 59042, 105717, 207146, 64907, 41215, -46117, -23120, -58624, -52754, -4388, 69254, 62902, 96522, 153018, 34720, 5805, 43077, -3415, 56094, 192526, 219583, 180590, -6342, -103400, -25062, -48764, -129316, -144489, -103230, -134472, -134029, -65164, -97709, -100342, -81972, -72630, -73957, -89505, -13874, -42202, 18942, 26777, -105707, -154852, -33445, -84080, -85170, 18554, 35470, 52526, 30817, -10007, -11107, -29038, 45091, 100079, 96590, 133723, 171042, 213697, 129458, 113376, 143177, 110140, 101330, 5941, -20042]
15837b0042l0882J7407j1032N6003J23074n380j19853j41316l9138L0697L1312
15826a09150o2889m7659L116K3150O6615N0509m073l6781L0990L2770J42103K1073
15814A09774q002j36508m9664j6112J19866K8452j55215J34575J07081j3587P7045
15803A97705M5551l067o4121r9310m6985m9595n0480j4086M1761M5023k9987o0992
15791h8583n8695L775L561m5964P2496k256j4719J58750P0540j0978m1353M0323
15779H6897l0368n7338O3941o036j50553q9519N1032R4217O0291J8428n1491j94541
15767b05040M9264J6020K8869P262n5173n2412L5535L9661J98998P6396j27283
15756A2097k5596P0784L9252l6641n3181R7472l7047r7495N1377L5045k6520o5492
$$ y = [-20042, -50924, -33517, -44549, 11454, 134528, 129148, 9295, -132021, -171159, -140462, -109150, -172039, -219698, -216582, -193432, -126817, -76308, -80381, -117162, -86172, -53402, 88701, 109774, 101772, -34736, -84400, -100512, 19354, 47806, -107409, 27166, 134247, 120660, 197705, 243256, 240189, 176068, 76758, 29773, -19822, -70302, -84388, -42627, 2396, -27591, -88583, -147278, -143503, -139942, -185906, -113410, -115666, -130385, 28365, 98905, 87927, 46574, 86897, 56529, -809, 63132, 57096, -93457, -182976, -131944, -37727, 22564, 40992, -10499, -205040, -155776, -139756, -110887, -103625, -158798, -211210, -175675, -136014, 62984, 139380, 12097, -13499, 57285, 96537, 59896, 6715, 104187, 67140, -30355, 21022, 56067, 29547, -35945]
15744c5945l6520p0822o5979J4399N4015M3377J57658k1944q8184L585m9407L7254
15732e8513M7832L2762L2636J5655L9750n1122j53282k9080Q2752J29032j7385
15721G1037r0563k6416R9O5463k6635M6220k1503j0257m417P840O5609Q6838j19239
15708D4076n8212P4726L7348k3283l0463n1935l121q0580j66512N000N3105K6042
15696a73809L1733L1195J42389J03695m6221m3080j05385O3051L7335r873N2959
15685H3989K1135j7772l3580l4736j8962k4383r7241N2954J0175j7751J12083
15674C5911K1243L9069r8619n9544p5024j5642J17028j644m7603J11101O4477
15663I0753J18845j18651k1468R6972n3257q0359L0492o411j2331K029l0029J4502
$$ y = [-35945, -72465, -143287, -209266, -194867, -140852, -97475, 60183, 38239, -49945, -46360, -95767, -58513, -10681, 22081, 54717, 70372, 110122, 59000, -94282, -123362, -40610, 88422, 71037, -19526, -45942, -45843, 19620, -7015, 39205, 17702, 7445, 3028, 10868, 76477, 163315, 44076, -14136, 60590, 97938, 74655, 44192, -7743, -10864, -91444, -257956, -252956, -199851, -173809, -142076, -110881, 31508, 135203, 88982, 45902, -59483, 3568, 40903, 31030, 83989, 105124, 87352, 53772, 19036, 74, -24309, -121550, -68596, -58421, -76172, 35911, 57154, 96223, -2396, -61940, -136964, -152606, -35578, -37222, -84825, 26276, 90753, 209598, 90947, 69479, 166451, 113194, 32835, 63327, 56916, 44585, 46614, 16585, 31087]
15651C1087Q9851o3054K3908n552l4142J8685L2855N6593N0908j01385n4633l2997
15639A2124O4793o3407N0356R4548j6161k13192n9149J38216J37141O0078n3745
15628A51602j0092M7027o9213j39909j01512k5227q120M5762O2311J3443J6527
15617a7401m1304K2924P321j20809l0005J59472J28973k8945J0566j32537m0907
15606h2652J28593m3570R14Q176N2228p424r0932j1105j16072n7567L976J03910
15594a11525K7302J44220o072j34537o6843P2470l9393j17868O1589J22482O5646
15583A7471O6065j58560o8126Q900P1949J04184J36321P5781q6807j38931o1370
15572c3123L8159K6805j2941p132l1718N6074L8415N61J1218m7326o5529l7306
$$ y = [31087, 120938, 57884, 81792, 76240, 42098, 60783, 93638, 150231, 201139, 99754, 45121, 12124, 76917, 13510, 63866, 158414, 142253, -70939, -130088, 8128, 145269, 205347, 151602, 141510, 188537, 119324, -20585, -122097, -147324, -155444, -109682, -47371, -33928, -17401, -58705, -35781, -28460, -149269, -179274, -19802, 109171, 80226, 90792, -41745, -82652, 45941, 2371, 3285, 11461, 63689, 56265, -34667, -45772, -161844, -219411, -215435, -111525, -84223, 59997, 53925, -80612, -147455, -74985, -114378, -232246, -170657, -48175, 17471, 83536, -75024, -143150, -134250, -62301, 41883, 178204, 253985, 167178, 28247, -33123, 5036, 31841, 18900, 11768, -19950, 36124, 74539, 75100, 86318, 38992, -26537, -63843]
15560f3843q1677K7631N0268J37249O4693M3683q5644j20246l1232n6672l9228
15549a55018J9352J16554M7309K9079p3865Q8254J22626o7651j03757j48100J18229
15538f988J91588m951j10139p5511j01469M8815R2679J1689K9144J29294K348
15527B06499r5929o1457k8438n628j05190m0890Q6680M8737q4548j0436M5407
15516d5193M5552j5033j31815N760K01869J00698n5234j25547m3775J356N8362
15505c000j0256n8923q4779k4735N9455J46468N0199r1199k6623R336L5458J15915
15493A17316o4752q4175l8810l0578J15076k0226l3557m0216o3387k5594J01340
15482f7563q11J542l6662l9437O7263J42064Q8149m5497j09422j10170P3333Q5622
$$ y = [-63843, -145520, -117889, -67621, 69628, 134321, 178004, 92360, -27886, -59118, -115790, -155018, -135666, -19112, 28197, 57276, -16589, 71665, 194291, 126640, 22883, -125217, -6988, 184600, 179649, 69510, -6001, -107470, -58655, 34024, 45713, 74857, 204151, 206499, 110570, 49113, 20675, 15047, -90143, -131033, -44353, 4384, -80164, -90600, -45193, 359, -14674, -146489, -140729, 61140, 161838, 106604, -18943, -62718, -61362, -3000, -13256, -72179, -156958, -181693, -122238, 24230, 74429, -16770, -43393, -34057, 1401, 117316, 52564, -31611, -70421, -100999, 14077, -6149, -39706, -79922, -143309, -168903, -67563, -68374, -66832, -103494, -142931, -75668, 66396, 154545, 109048, -374, -110544, -37211, 48411]
15470D8411o3184r0237N4469J12178J03284n1797j33063j38535N4623J07406k9069
15459b5514M1532j6573j1761P9678M6811K8569j15553m2830K4276r6915m7909
15448a36189L0709q2976J2435o8732R0573J12334J5788n9523r7813k6918N235
15437b05077r636L2434K1524L2884M4280M169j718n6701N1471p0459P2253J38658
15425E4082L4460n6837j34728j07870N1063N0828q2407K0512R3980J7054p6117
15414a35980j5985M7464O5966m7483m0111l6202N5813K0783n5196q9545N1275
15403a79201J15122O6015j4040k360l6315M5605M8129m0224j31357l7160R3687
15392g2099K9147O5354L5241K7164j7046j6536L6573J0757j9237j9623m5695j40002
$$ y = [48411, -14773, -105010, -50541, 61637, 164921, 113124, -19939, -158474, -103851, 3555, -25514, 16018, -555, -12316, 67362, 114173, 142742, 27189, -15641, 8635, -88280, -136189, -105480, -188456, -176021, -244753, -154180, -41846, -26058, -85581, -183394, -210312, -205077, -214713, -182279, -160755, -127871, -83591, -79422, -81140, -137841, -86370, -156829, -84576, 54082, 88542, 31705, -103023, -210893, -159830, -109002, -191409, -170897, -76917, -59863, -135980, -151965, -104501, -38535, -86018, -126129, -162331, -106518, -85735, -140931, -230476, -179201, -64079, 1936, -12104, -14464, -50779, -5174, 42955, 2731, -128626, -165786, -72099, -42952, 22402, 57643, 84807, 67761, 51225, 87798, 98555, 79318, 59695, 14000, -126002]
15380a26002J3737O7791K2138N9023o6219k1856J25337J07647j08372q5635k4578
15369c6989o2396k4267N3653M8400l6414n6549m8699l6683m4142N1768K0307o3622
15357b35633p0607J6272P8921J43346M9286K4060j9064n8751l8575J3465q6768
15346a84048K5432R1597j8181l8352N643L2669J8233l3824n8047j57121l6212
15335c52211J75963J40372J7258L384J245N7314l204j3942L6455j6363k5696r2744
15323g2169j38186K4480N8798J13364K0025j0765j05871l5927L8486l704J11716
15312B47L9396m409j03813J1j2242j20762l7976J05073N2273J343k6650o5849
15300a73358L2270O4954L7820q9158l7137J10215O6248l9284j27986j12068J62274
$$ y = [-126002, -112265, -44474, -22336, 36687, -29532, -51388, 73949, 181596, 73224, -12411, -36989, -99385, -123652, -69999, -21599, -58013, -114562, -163261, -199944, -244086, -192318, -172011, -235633, -306240, -289968, -211047, -67701, -18415, 5645, -13419, -72170, -110745, -97280, -184048, -158616, -67019, -85200, -123552, -117909, -85240, -67007, -100831, -158878, -315999, -352211, -176248, -35876, -18618, -15234, -13989, 43325, 40121, 26179, 62634, 46271, 20575, -72169, -210355, -185875, -127077, -13713, 6312, -4453, -110324, -146251, -107765, -111469, 247, 39643, 35234, -68579, -68568, -80810, -201572, -239548, -134475, -82202, -80859, -107509, -173358, -141088, -76134, -38314, -127472, -164609, -54394, 11854, -27430, -155416, -267484, -105210]
15289a05210K8891J31054J0202o5817q3513L697Q5574j2651n9860o641P3717o7213
15277f7770j34801J6134R8144O0158j8678k5051N9446k868k5300M1023p9325j42836
15265b21724K6336O8896k9023L1375j7061k7634Q1261m9787k5093K3166K0207
15254a19081j981J3511O8864J9307K2470J07056m2740j44457j35372J0339J24015
15243g8069l472O3179J5265J9080o8943o0939p9130O1711J05848L0773O590K3028
15231C4921M593r8273p3194k8825q1079M9551n796K1977N9750K4522J27682R0413
15219A26242O6340q1149j50933j63604K7884j6404J2201J20051L3429l9051N470
15208e9524P5917K4545m3138p3049n0278n2624m8391N693J05174J41655P3770
$$ y = [-105210, -76319, 54735, 64937, -880, -84393, -80696, 4878, -7773, -67633, -74274, -557, -67770, -202571, -186437, -88293, -28135, -46813, -71864, -12418, -15286, -40586, 437, -78888, -221724, -195388, -126492, -155515, -124140, -141201, -168835, -87574, -137361, -162454, -139288, -119081, -121062, -107551, -38687, -19380, 3090, 110146, 67406, -77051, -212423, -202084, -78069, -81541, -18362, -3097, 15983, -52960, -113899, -193029, -131318, -25470, 5303, 11893, 34921, 39514, -58759, -131953, -160778, -241857, -192306, -198102, -176125, -116375, -91853, 35829, 126242, 192582, 111433, -39500, -203104, -175220, -191624, -179423, -59372, -25943, -64994, -59524, 16393, 40938, -2200, -75249, -125527, -178151, -226542, -220849, -115675, 25980, 99750]
15197I9750l2356o4620N6079L7488q2592m757J4376L816N7507o0686l2171k1014
15185b9180j5882M837J26987O4586r729j06248j05465l3892l4383L0958k8984
15174a36395J4664m0956N4271J6992q0805m8742M1851J14392J04693K2651J25154
15163A87770R4637o5561o4540k6601J1114J6648K9576j9004o1716l7925P4403
15152A38801p1191m1044k0853k8672O246k8666l5530j65213J9909J96660K0433
15141i120k3956L8802l2181N3739R5224K7239J0239q5003K5903J10253n1922n6533
15129A02684m3203o9627m8667N1106J1831K4479K3045J9621P5938P2959j10768
15118A09398r5830J8923n0178K5747j39203M0336o5209j0429J10670L3866k3256
$$ y = [99750, 67394, 2774, 58853, 96341, 13749, 8992, 23368, 27184, 84691, 24005, -8166, -29180, -45062, -40225, 86762, 151348, 141619, 35371, -70094, -103986, -138369, -107411, -136395, -121731, -162687, -108416, -91424, -172229, -220971, -179120, -64728, 39965, 62616, 187770, 282407, 216846, 152306, 125705, 136819, 153467, 183043, 164039, 102323, 64398, 138801, 67610, 26566, 5713, -22959, -16713, -45379, -80909, -246122, -226213, -29553, -9120, -33076, 5726, -26455, 27284, 122508, 149747, 159986, 74983, 100886, 211139, 159217, 102684, 59481, -10146, -58813, -7707, 4124, 28603, 51648, 71269, 147207, 220166, 109398, 13568, 32491, -17687, 8060, -131143, -90807, -156016, -166445, -55775, -21909, -45165]
15107d5165N3400j3048J6993J49972o8071L6297N47j11306l5004P7774M9040j20937
15095i508q266Q8002L4515J3951J2352n3331j04207l767P9820K3971n1239l8083
15083a5790O5326J1128k7188J9807m4395r0304M6160R0493p3398R1377K8295o165
15071I5346j0137o0865j04791m9793N344o4835L90J30816Q7049p992j23676j08348
15059b11492N0582N5935L6134n115m625m0996m8113l0815q50O294J01827j7757
15047a08991P6390M0594m7504j17426j06271k1312J52521k7236j8821P1216J01605
15036e235l7148m9345j18172l2833N8118Q6451J4952Q3900j3459K9640K0153N112
15024D2134m4287n940J0613K0366j3762p7741L3352j10773P6301J00134K579n2196
$$ y = [-45165, 8235, -4813, 12180, 162152, 94081, 130378, 130925, 19619, -15385, 62389, 111429, -9508, -17774, 70228, 104743, 118694, 131046, 77715, -26492, -30259, 49561, 73532, 22293, -15790, 49536, 60664, 33476, 53283, 8888, -81416, -35256, 55237, -18161, 73216, 101511, 95346, 85209, 24344, -80447, -130240, -124896, -189731, -189341, -58525, 28524, 20532, -103144, -211492, -160910, -104975, -68841, -73956, -78581, -119577, -167690, -198505, -199355, -193061, -91234, -108991, -32601, 7993, -39511, -156937, -263208, -284520, -131999, -159235, -178056, -106840, -5235, -42383, -91728, -209900, -242733, -184615, -98164, -83212, 688, -12771, 16869, 37022, 42134, -2153, -8093, 2520, 22886, 9124, -68617, -35265, -146038, -69737, 30397, 32976, -19220]
15012a9220k3740n3761m0813J03677N5962Q0039N3643J00359K74825M95823O42465
15001A669259R66778P45087o29407j158582p16250l19640j80778j60844O3188
14992B78811J2327p0736p6157l2579l2113l8554n4667q215J32552l7729J497l0775
14980D3662n6149m7481P025O75k6659J7403P270q9920M0100q783M1521M4919K9036
14967B619K1668q133M4485M0321q2802p1495n3776M7460J44599n5225j24091j8714
14955a13084k4624P2606k3958J18579M5070j24199n6680J3267J27605O4784m2040
14944E7326Q2095j28084j31333J0482J06165M3220n5869k2168N582O3882n2105
14933b0807j05425N100J67254J52014l613j80398k8305J13804m8300j36695J34644
$$ y = [-19220, -42960, -96721, -137534, -33857, 22105, 102144, 155787, 256146, 530971, 1026794, 1669259, 2636037, 3381124, 2751717, 1593135, 876885, 557245, 376467, 215623, 278811, 291138, 220402, 144245, 111666, 79553, 40999, -13668, -21883, 110669, 72940, 74437, 43662, -12487, -59968, -52943, -52268, -78927, -61524, -54254, -144174, -104074, -112857, -71336, -26417, 2619, 24287, 16154, 60639, 100960, 18158, -53337, -107113, -59653, 84946, 29721, -94370, -113084, -137708, -65102, -89060, 29519, 74589, -49610, -106290, -93023, 34582, 99366, 57326, 139421, 11337, -119996, -109514, -3349, 39871, -15998, -38166, -32584, 31298, -20807, -126232, -121132, 46122, 198136, 194523, 14125, -14180, 99624, 51324, -85371, 49273]
14922D9273J11958r295o6100o6767j05692N1995P7766j0540m3380o736O5735q3366
14910c5149m6942l0339J6548L3063J3683p345J8061k4320J3047O5583N772k3901
14898b239J404J39384Q6897r3759p7930n3883j2401o9127r1555N9887J15240O5505
14886F7423m2725r0685P3822k8908r630P0736q724m9950l9197o3103m9100J7468
14874a52573J3852P5561n842N0782K5508m3838J6641Q7626L4315J03761N2064
14863B57857p2320j34858l1368Q3329R8153L4740j5897j03795l8860m0414q9252
14852e2685Q521R828q6052L6132J1258K5202K2668q8705L9041J7316l2479O4744
14840b5211j8586m6820J23454R5843m4559m7953l7423q776J9026k8423L6323L0140
$$ y = [49273, 161231, 151936, 85836, 19069, -86623, -34628, 43138, 32598, -10782, -17518, 48217, -35149, -82091, -112430, -95882, -62819, -49136, -56481, -38420, -62740, -49693, 15890, 21662, -2239, -835, 138549, 225446, 131687, 53757, -126, -12527, -81654, -173209, -113322, 1918, 67423, 24698, -65987, 7835, -21073, -30703, 40033, 31309, -18641, -57838, -120941, -170041, -152573, -138721, -63160, -69002, -18220, 7288, -36550, -19909, 67717, 102032, 205793, 257857, 185537, 50679, 19311, 102640, 200793, 235533, 219636, 115841, 76981, 36567, -52685, -44164, -34336, -120388, -84256, -72998, -47796, -25128, -113833, -74792, -57476, -89955, -25211, -43797, -90617, 32837, 128680, 84121, 36168, -1255, -10031, 8995, -19428, 16895, 47035]
14828D7035n518K4850j8497q8184K9346j4278l9626k3451K7881L8933M0964l5339
14816a5884j03352J6617P3197j7877O299o047n043M8957L2690K1196J2551j1136
14804E2168j9834M351n6198Q831N6022O3007l6889p7369o3395R298K2899R5401
14792E8292O1689m3353o4927o64L4772l6477o4674p8544j6474n9250p9442J09376
14780a79676J19638P9521n7612n150J08223l4762m3116o668M8857O6280j2506
14769H3029m6536N095n3006N152m7689N3332J14870L4515p933j2548l3971p709
14757H6601L6822M6793o1486m4950j5866j0337L4393p9273P369J02102j15069
14746a2901N727J49803O8794o5366n7895R913o0479l2804P6577m8806K063K3959
$$ y = [47035, 41517, 66367, 47870, -40314, -10968, -25246, -64872, -88323, -60442, -21509, 19455, -15884, -119236, -102619, -29422, -47299, -41000, -47047, -52090, -3133, 29557, 50753, 63304, 52168, 32334, 36685, -19513, -10682, 45340, 108347, 71458, -5911, -69306, -60008, -37109, 58292, 119981, 76628, 11701, 11037, 45809, 9332, -55342, -133886, -150360, -209610, -289052, -179676, -60038, 19483, -38129, -43279, 64944, 30182, -12934, -19602, 29255, 95535, 83029, 36493, 41588, -11418, -6266, -53955, -623, 114247, 148762, 140829, 128281, 94310, 86601, 123423, 170216, 108730, 63780, 47914, 37577, 71970, -7303, 66, 102168, -12901, -7174, 142629, 211423, 146057, 88162, 98075, 37596, 4792, 81369, 32563, 34626, 58585]
14734E8585m0243o3706m9820J2545Q5712j2877J5129m8367N8538o156j32878Q670
14722a14868K14704p3856n453o5860o2344q5630J2989J6715m3477P6498O5419
14711f5163k2921p5992N8810N8848N382r4197N9513M4867J5186k8335k89K7831
14699a6460P196m4123n5467p010K2742L1992M1661m035o0556L1060J922l2870
14687h3948P055j0563o9980p2616O1243Q9444O8885R9083m2246o209N9238o7425
14675C1961r2483j2053P7476l303l1077J5212M3548J04545K5045j22117n6442
14664a9688L7056Q6291j20572j98313K53J30361J35959n7758M8904l1150N6470
14653F7813J4107r9376k4985N0525l3560R908p0960q3644n1376M1048M0599K6292
$$ y = [58585, 18342, -45364, -95184, -82639, 3073, -9804, 5325, -43042, 15496, 9340, -123538, -114868, 99836, 25980, 20527, -45333, -107677, -193307, -180318, -163603, -207080, -130582, -65163, -88084, -164076, -105266, -46418, -41036, -135233, -75720, -30853, -15667, -44002, -44291, -16460, -9264, -53387, -108854, -115864, -93122, -61130, -19469, -23504, -84060, -53000, -51078, -83948, -76893, -87456, -157436, -230052, -168809, -79365, -10480, 88603, 46357, 40148, 99386, 31961, -60522, -72575, 4901, 1598, -29479, -14267, 29281, 133826, 158871, 36754, -19688, 17368, 103659, -16913, -215226, -214973, -84612, 51347, -6411, 42493, 11343, 67813, 81920, -17456, -42441, 8084, -25476, -15568, -86528, -170172, -221548, -180500, -139901, -113609]
14641a13609j7864m8309L9634Q0197k5980Q4934M1753r3083P425n34J7406l4702
14629f2732J1470k4046l1516o4859M1519J12848k4862j38569J37752l0174j75011
14618b48180Q791J74282R7177m778P5511k4956L3112N4261N4142J221O0928k0820
14606B60691o1607k9546j24150j06049j2331K6877O9761l7758l9866p5227N6974
14595g2231J35393J3975n3382o5745m6969j2452l7102L0211K2695j08231M5407
14584a48431J40134L3891l6950n8068N366L7374l3712l147P8797j1669N7785N2051
14572A13421O0206K2427j1243n3457q0643p4824j1690k0721j7081O235L8572R6459
14560F7661M1412j64551j01238R2432M731L9358Q1861n9187N5361K9415j5210
$$ y = [-113609, -131473, -179782, -140148, -59951, -85931, -997, 40756, -52327, -44902, -45436, -28030, -62732, -51262, -75308, -106824, -171683, -130164, -17316, -42178, -180747, -42995, -73169, -248180, -239389, -65107, 32070, 27292, 102803, 77847, 110959, 165220, 219362, 220583, 281511, 260691, 199084, 169538, 45388, -60661, -72992, -46115, 23646, -14112, -53978, -129205, -72231, 63162, 77137, 23755, -41990, -88959, -101411, -138513, -108302, -85607, -193838, -148431, -8297, 25594, -11356, -69424, -64058, -26684, -60396, -63543, 15254, 3585, 61370, 113421, 173627, 196054, 184811, 131354, 50711, -24113, -35803, -56524, -73605, -67370, -28798, 67661, 109073, -55478, -156716, -64284, -59553, -20195, 61666, 2479, 57840, 87255, 72045]
14549G2045k5032j6667q2200q6410N2901R5058m0183j04787k5325p378j29738
14538b97716k4843M7625N7996K6608n279k4076K4165J75522J89305j717q5485
14527H2105j80660j6813M7548j7657M403n6475R8020K0426r6722n4149m3355M3085
14515a70244Q1670k3723N5583J08342o2962m3477k9247L6217l7968l8288M8949
14504g5148R2403k877J1499N0582j34312k7607J21903L4946p2356m9232k6024
14493g6223N0091L3126p2078R3388j8158L8320K5589N3881j7876R538m7426m2029
14481C0143q368L3880J1752o4311K5355Q0743M4563l5915l9437J4182q1382q7403
14469g6198L7908L15L5255O942N7204k0154q310L6339p7494r1679K0776l5049
$$ y = [72045, 47013, 30346, -51854, -138264, -85363, 9695, -30488, -135275, -160600, -167978, -297716, -322559, -274934, -216938, -190330, -195609, -219685, -195520, -19998, 169307, 167590, 82105, -98555, -115368, -67820, -85477, -81074, -137549, -39529, -19103, -115825, -169974, -213329, -170244, -88574, -112297, -56714, 51628, -11334, -54811, -84058, -47841, -85809, -124097, -75148, 17255, 14378, 25877, 76459, -57853, -85460, 36443, 71389, -967, -50199, -76223, -26132, 6994, -65084, 28304, 10146, 48466, 74055, 127936, 110060, 119598, 72172, 30143, 21775, 55655, 67407, 3096, 28451, 109194, 153757, 117842, 78405, 92587, 11205, -76198, -38290, -37975, -2720, 4222, 61426, 41272, 32962, 69301, -8193, -99872, -79096, -114145]
14457a14145k5211L4899M7208J4856r957k530J7446r2145j0371N537j5742P6086
14445g4069R5023O4001P185j01032j28422O851J07422j1914j5225P247p3282Q2389
14433c3826J30233p294q983k3825n4722R5603M2365K08j08287l004J811R822J02130
14420A42231k0570k25093M0430P8411O0923J48915j02152r7317k8139q0845m984
14409h8190K5865j6314k45P9175l586J01395P5011j81072p2923J07044O4877j00782
14397i745L3075L5628j6088P5706m113j35326j09179M5969l3172j23723R6277
14386a44691J53981K777o1054q0998k3750O6659K4176j9490m5824O5571n033j3591
14374h1267M5599K0247L84r537m9211p147M0168N8681j29723m2602o2941o3943
$$ y = [-114145, -139356, -104457, -57249, -42393, -52350, -54880, -37434, -129579, -139950, -134413, -150155, -74069, 20954, 84955, 92140, -8892, -137314, -130463, -23041, -34955, -50180, -42933, -116215, -33826, 96407, 89113, 80130, 56305, 1583, 97186, 139551, 139759, 31472, 28468, 30279, 40101, 142231, 121661, -103432, -63002, 15409, 76332, 225247, 123095, 25778, -2361, -83206, -88190, -62325, -78639, -78884, 291, -3295, 98100, 173111, -7961, -80884, 26160, 91037, -9745, 23330, 58958, 42870, 118576, 114463, -20863, -130042, -84073, -117245, -240968, -144691, 9290, 12067, -48987, -129985, -153735, -87076, -62900, -82390, -128214, -62643, -67676, -81267, -35668, -15421, -15037, -24574, -73785, -80932, -40764, 17917, -111806, -154408, -217349, -281292]
14362b81292N5306J38598l2039q0613L6271N8635p175J04858N0086j42823r6523
14351a96711J2325Q2751J00635m802n7874r1750K0726R6314L3954l124J588O3986
14339E8018m2196j14530l2188J22116m0632j02367O2512R7116p7425m5526P4513
14328d0589m3959O1554J00783l2955j81102n2276N7703P5830j23872m654K7002
14317a56535o424J03857Q2772m4478k4722k2084N1764N3220P7336j9289j63520
14306f8103O4888q7054j25780O8305R3435j3740n6814J9329o7387o4898J45723
14295i2096L5832J05656N3329J8346o951J5360o6190m4906N9172P6718j85945
14284c1675r0870M4811O7130j6464R514J2750M6271p985K6628l2745j831J38579
$$ y = [-281292, -225986, -87388, -119427, -200040, -163769, -105134, -112309, -7451, 42635, -100188, -196711, -184386, -101635, -1000, -5802, -63676, -155426, -134700, -38386, -4432, -7556, -5968, 58018, 15822, -98708, -130896, -8780, -49412, -151779, -89267, 7849, -69576, -115102, -40589, -84548, -22994, 77789, 44834, -136268, -188544, -130841, -55011, -178883, -183537, -156535, -162959, -59102, 23670, -20808, -45530, -67614, -15850, 37370, 114706, 95417, -68103, -3215, -90269, -216049, -147744, -54309, -68049, -124863, -105534, -172921, -237819, -92096, -56264, 49392, 102721, 121067, 114116, 129476, 63286, 18380, 77552, 154270, -31675, -122545, -77734, -10604, -27068, -17554, -4804, 41467, 33482, 60110, 27365, 25534, 164113]
14272A64113l2881j05240n8256j01102l0262J41666J28967J4106r5328k7583O0265
14261E8465O3084L3463o2237p4533j00161J4990j6876l1045R6182M6686j08608
14250h0590L6880k3446q7177m5215j8853M8525J36243N4379r8668o3338k9719
14239a70979j0147J74223O6392m5550o6921L417J27881j0044o6642j11312j08691
14228b18373p402J35238k1491j09756Q7645O1586N4453j6057o6060j8612o3872
14217a82701l7366J04455Q685J6807l8917O0948N4911O8909j6240j20147j08672
14206a89328k1668L02L8917l4413J4923M3296J17874L4415l3392O6650M4350l29
14194H1597M1280N2641j8466r8863K0933J78666k0938q2499j16976p1447J27610
$$ y = [164113, 131232, 25992, -32264, -133366, -163628, -21962, 107005, 121111, 25783, -1800, 58465, 121549, 155012, 92775, 18242, -81919, -66929, -83805, -114850, -18668, 28018, -80590, -43710, -67156, -154333, -199548, -218401, -169876, -33633, 20746, -77922, -141260, -170979, -181126, -6903, 59489, 13939, -52982, -49565, 78316, 68272, 1630, -109682, -218373, -225775, -90537, -112028, -221784, -134139, -72553, -18100, -34157, -100217, -118829, -182701, -220067, -115612, -106927, -90120, -129037, -68089, -13178, 55731, 39491, -80656, -189328, -210996, -210694, -171777, -206190, -191267, -147971, -30097, 4318, -29074, 37576, 81926, 81597, 122877, 175518, 157052, 58189, 79122, 257788, 236850, 154351, 37375, -34072, 93538]
14183I3538k6252j4058j1357k4318Q668P787j2912q4653N0625K1518J3683J6152
14171C8421j39575O8018R1353N2839m406K3558k749j15735k1468M7674n1764M1891
14159B8057n7085N1023p0828l4835J04881J07257n2495p7804m9905o2730J13873
14148e91k0757j22518M0114J10466J2887j5119R2002n3008o6875P1406Q998M109
14136F1114P2737m706P2178k4479j13234l3090L943k3578n444J09322o083p0164
14124C8516K391n7367M2484P1761Q456j9833L7926l6928j24759j6127O8907O0172
14112G5599K9871l2313k1839r972o9600r2306O4777J06090j7226j19991j49319
14101b36229R5945P9956Q5446R0349N1780j75572k0442P4132l6081p4828n9055
$$ y = [93538, 67286, 53228, 41871, 17553, 26221, 34008, 21096, -63557, -12932, 8586, 22269, 38421, -101154, -33136, 58217, 111056, 106650, 130208, 127459, 11724, -9744, 37930, -13834, 28057, -29028, 21995, -48833, -83668, 21213, 128470, 75975, -1829, -51734, -114464, -591, -21348, -143866, -103752, 6714, 19601, 4482, 96484, 43476, -23399, 48007, 57005, 61114, 133851, 129145, 201323, 176844, 63610, 30520, 34463, 10885, 5441, 114763, 108680, 38516, 40907, -16460, 26024, 97785, 106241, 86408, 124334, 87406, -37353, -53480, 15427, 75599, 105470, 73157, 51318, 41346, -28254, -120560, -55783, 50307, 33081, -86910, -236229, -140284, -60328, 25118, 115467, 167247, -8325, -28767, 45365, 9284, -65544, -124599]
14090a24599N2865K3795l0930J11763j1818p8970j2112Q9629Q2904l1038r581
14079F1908P275k6824m3536M0996M2445l7375o689J4028j4808k6105M65M5397
14067E7177K5433p1734l7748k0994R3394K0044o3108l2012R03q9839j12866J6824
14055b14526J12608K963o2331K5927O2765J27313J8367l2645l9937p347m1107
14044d7950Q725M4203M0645O6715m912o6916o7093q6892R929n828J27600O6699
14032H4925o7991j34458J9154O3551k0800l7859m7676R073L0817q5010K0767J9597
14020a45910j5025R2806O327m0735L5464r698L6003N1809l4517p0575j5323l444
14008a12818m3656K8178L5925J2378K0693M9423m483o8969l6647L1136R426O6601
$$ y = [-124599, -71734, -47939, -78869, 32894, 21076, -57894, -70006, 19623, 102527, 71489, 61908, 69183, 42359, -1177, 39819, 82264, 44889, 38200, 52228, 37420, 11315, 11780, 57177, 82610, 10876, -26872, -47866, 45528, 65572, 2464, -29548, -28645, -118484, -231350, -214526, -101918, -98955, -161286, -135359, -72594, 54719, 73086, 40441, 504, -6843, -47950, -39225, 4978, 45623, 112338, 107426, 40510, -26583, -113475, -103546, -109374, 18226, 84925, 16934, -117524, -98370, -34819, -55619, -93478, -141154, -132081, -101264, -186274, -165507, -145910, -160935, -68129, -61802, -102537, -67073, -76771, -40768, 11041, -23476, -94051, -109374, -112818, -156474, -128296, -92371, -79993, -59300, -9877, -14360, -83329, -119976, -88840, -79414, -12813]
13996a2813M0738k4861J4963n4217K3478m7724K2564J00407O5946J00006m0894
13985A87593j75514j12768k9640n0087J53465J60641L0618q0220n6831L6123R353
13974G2733l9948P6969M2542M0091p4754k4257m1668l437j2664L0958j4193M6549
13962I8921l5448P740M4708n3267r4595l8160J7937J49832q5188j26123P8960
13951c4683J57481l2384o177N1261J1667L8906J9015l1842r9323L2148j3902j15775
13939b3608p5233J20523J19909m4973o131J1318j01853p4958O8333O3977J3696
13928G1000p8037N4040L6014L6625p1626k4554o2408n1299o822M4055p1994N2281
13916g2725J6666L4946m4581p5795M3181L0154R7189K5306L6780Q750p030o7337
$$ y = [-12813, 27925, 3064, 18027, -36190, -12712, -60436, -37872, 62535, 128481, 228487, 187593, 12079, -100689, -130329, -180416, -26951, 133690, 164308, 84088, 27257, 63380, 72733, 32785, 109754, 152296, 192387, 117633, 93376, 51708, 48271, 35607, 66565, 52372, 98921, 63473, 71213, 115921, 62654, -31941, -70101, -52164, 97668, 12480, -113643, -34683, 122798, 90414, 84237, 135498, 147165, 186071, 205086, 173244, 73921, 106069, 92167, -23608, -98841, 21682, 141591, 96618, 90487, 101805, -48, -75006, -6673, 57304, 71000, -7037, 47003, 83017, 119642, 48016, 23462, -38946, -90245, -97067, -53012, -125006, -72725, -56059, -21113, -65694, -141489, -98308, -68154, 29035, 54341, 91121, 99871, 92841, 25504]
13904B5504J8326R5880r9509p8288J1702M2243j9159m3104k4748O0964M9696M9462
13892H8969K1519m8247k1482J7097J00808m9199r3436K5333m3455k1542J46965
13881A23330r193O136j26703m6585J42959O6774o4366j08915N1393o4079m5434
13870g4683K5454n1520o0187K043O2212J02480P0787j09855L8360K7996O445o477
13858C3055l4280P7491Q5468m6201m9516K8211O654L1794j4349q5410k28n7289
13846b4600l4764K0397q8963j4436j447P9735J26556N6907j48995k0376J0615
13835c9371l2946J7668K6261P4731J2652p5308j36060K5860O4009n0073J16451
13824C874J4793j71083o2937K5341J2070R1573J31058J3793j51046r7553O326
$$ y = [25504, 43830, 139710, 40201, -38087, -26385, 15858, -3301, -46405, -71153, -10189, 39507, 88969, 110488, 62241, 40759, 57856, 158664, 109465, 16029, 41362, -2093, -23635, 123330, 114137, 120273, -6430, -53015, 89944, 156718, 92352, -16563, 34830, -29249, -74683, -49229, -100749, -160936, -158893, -96681, 5799, 76586, -33269, 5091, 33087, 39532, 33055, -1225, 76266, 161734, 115533, 66017, 94228, 100882, 132676, 118327, 32917, 32689, -24600, -59364, -38967, -127930, -142366, -143813, -64078, 62478, 119385, -29610, -49986, -39371, -72317, -54649, -28388, 46343, 58995, -16313, -152373, -126513, -62504, -112577, 3874, 18667, -152416, -215353, -190012, -177942, -86369, 44689, 58482, -92564, -190117, -183791]
13813a83791N4125K5085M4872r9068r022P1988P9082R2287J6411l0766n3320O5527
13801G3410l748q4440P3654M688k9713l7216M3657o715o3756J4399M8115n6613
13789b4278j14248k5356M4221Q5435M6303M6599J0185J0569j3124O4949k023j4285
13777A14947P769j90745j8053R3296K6261M6049Q7235J5694m2494O6939J0230
13766B17128j64117l2203N068P1426P0976j01504k8248J6776j2099m7815K7386
13755B2774M4849k3240j1057M988M2247K8547m4161J9617j04817L0826l1489n3346
13743g4262J49190J42063n3697r9311k6109J19751K0640Q337L3533k6658j02015
13732I1462r378J03154R4943n7710j35961p8270J2050l4776j12863j31262J36981
$$ y = [-183791, -129666, -104581, -59709, -158777, -167799, -95811, -16729, 75558, 91969, 61203, 7883, 73410, 69662, -14778, 58876, 63564, 33851, -3365, 40292, 33577, -30179, -15780, 32335, -24278, -138526, -163882, -119661, -34226, 12077, 58676, 68861, 79430, 66306, 131255, 129232, 114947, 122716, -68029, -86082, 7214, 33475, 79524, 166759, 182453, 139959, 206898, 217128, 53011, 20808, 25876, 97302, 168278, 66774, 38526, 55302, 43203, -4612, 22774, 67623, 44383, 33326, 38314, 80561, 109108, 64947, 84564, -20253, 10573, -20916, -74262, 74928, 216991, 163294, 63983, 37874, 157625, 178265, 186602, 220135, 193477, 91462, 82084, 185238, 280181, 222471, 86510, 8240, 20290, -14486, -127349, -258611, -121630]
13721a21630M2891K1227J25048K1047k1178l1856L0977m5824p4754J7899J08363
13710G2210K7491P5229k2938J1153P311J8020K869p2632p1494k6371J030l8791
13698a6913K0520M8327m7641j54519j38308J75086K55354Q2913q7897n7003N5686
13687A35605O197o5844K7966m5187q9535j5087k4613L6318L3651O6541O2930J3437
13675A42379k7290p044L7437l6299k3267j43429n3354J4248P596L8138M5947K7351
13663B2413k3748o054K3820Q6576J02872r8020j45486j22109Q1910J23298L375
13652D8847o4658J8412O0096j7745L0177k2j5689p8796m1209J3252P2033Q0166
13640A04864J5493K8403j1953j05288m2552O4520j3641o9033o4256Q30j2868j1438
$$ y = [-121630, -78739, -57512, 67536, 88583, 67405, 35549, 66526, 20702, -54052, -36153, 72210, 99701, 174930, 151992, 163145, 170456, 188476, 191345, 118713, 47219, 20848, 21878, -16913, 3607, 51934, 4293, -150226, -288534, -113448, 141906, 224819, 136922, 79919, 135605, 141802, 75958, 103924, 58737, -30798, -45885, -70498, -34180, -529, 66012, 128942, 142379, 115089, 108045, 145482, 109183, 85916, -57513, -110867, -96619, -89023, -50885, -4938, 22413, -1335, -7389, 16431, 103007, 205879, 107859, -37627, -159736, -77826, 45472, 48847, -15811, 2601, 62697, 44952, 75129, 75107, 59418, -19378, -60587, -47335, 24698, 104864, 120357, 148760, 136807, 31519, -11033, 53487, 39846, -29187, -93443, -92613, -105481, -116919]
13628a16919o2702J1686R0037J51832K1797p0759P799J9759q43L4763P1659j82552
13616b4443j23861P410J00168M5070j2879k9837Q3899M3737L7047J11579O4118
13605C02008k3925j02591m8153n9590o3505n3033o5627R9738P6287M1939l8770
13594F4778q3628k3075K1272r2429Q405L5511k4845Q5980P1072P2628K2084q7562
13582G0191k0000n3800J1770J07464L588j06067J2826j0888P442Q8787n4185q5905
13570b8777n453Q4655P3853j01526j32431n3123N5590J20202O0322P5455P1507
13559B20274Q9823N2407N5006Q2158k2003k01210l9523j0857J13147k0692p450
13548C11080k9665L8355k7056l199k7468l7338l7153M6345R1726o7651q3212j8886
$$ y = [-116919, -179621, -167935, -77898, 73934, 95731, 24972, 32771, 52530, 51687, 86450, 158109, -24443, -148304, -140894, -40726, 4344, -8535, -38372, 45527, 89264, 126311, 237890, 302008, 278083, 175492, 127339, 67749, 4244, -48789, -114416, -14678, 61609, 103548, 64778, -18850, -41925, -20653, -113082, -104677, -69166, -94011, -8031, 63041, 135669, 157753, 70191, 50191, -3609, 8161, 115625, 119213, 13146, 25972, 15084, 22526, 111313, 57128, -28777, -34230, 50425, 124278, 22752, -109679, -162802, -107212, 12990, 73312, 148767, 220274, 310097, 362504, 417510, 499668, 477665, 276455, 236932, 226075, 339222, 318530, 311080, 281415, 319770, 292714, 289515, 262047, 224709, 187556, 233901, 325627, 257976, 174764, 155878]
13536A55878o3044M5363Q2616L2433j08533k3746L732p754l2059L638M8540K0729
13524A57793n7683l0615R0348n0950m0704J30317n657o6478M0540j9144j45578
13513B189q1972m323j6997o4095P2013P0081J9774j2004R5939K8718j1198m0894
13501E7231j7050n8504K8323J1779J7812R49m3278J5724Q758p5475m9741o948
13489a10420K6749p0024O0566P7675O5378P7285N882j30771m2934J18283P4723
13478A52392l1310J9343J3588m8262j0972j0310j306k1870P0545R4141j09377
13467A16602j45540m6228k5051m8273J6088N6052N9636M9960N4820N6154l0566
13456A13654r4103O8819M9845K4456q0667n6597O0400k9249j7447j32126L0969
$$ y = [155878, 92834, 138197, 220813, 253246, 144713, 120967, 124699, 116945, 84886, 88524, 137064, 157793, 100110, 69495, 159843, 108893, 68189, 198506, 192849, 126371, 166911, 147767, 2189, -79783, -84106, -101103, -165198, -93185, -23104, -3330, -15334, 80605, 109323, 98125, 57231, 40181, -18323, 10000, 21779, 39591, 40540, -2738, 12986, 21744, -53731, -103472, -110420, -83671, -153695, -93129, -15454, 49924, 127209, 133091, 2320, -40614, 77669, 152392, 121082, 140425, 154013, 105751, 94779, 84469, 83163, 61293, 131838, 225979, 116602, -28938, -75166, -100217, -148490, -132402, -76350, -16714, 33246, 88066, 144220, 113654, 19551, 88370, 138215, 162671, 82004, 25407, 85807, 56558, 39111, -93015, -62046]
13445f2046O132k9863m7584N8259R544K6430J47874J2403q5453P7430L9209L4271
13433A86606r8218j03307P6758j960p6129m9707M5473J11205J17603J7547j55227
13422G0644l4490O004r3886K696J42337Q2836R0772k1168j68109m0889N434M2989
13410H5170l5187p465N253J1407j15026N88J74085J12125k109N1896j8383j11827
13398A50527q4909m4249J35564Q3780j55424m2657j9164J3371J26962P783L9407
13387B10991K0105o4061n2194m8317p0634o048L7490N6379L887q744j00197m2687
13375f4030J67332p295m4650j02822p4755k2903R2548j1509J3168K9620Q0182
13364E4886L9651m6220j25721K652J12865J54812n380P1498o3394q3471j54433
$$ y = [-62046, -55914, -85777, -133361, -75102, -65558, -39128, 108746, 121149, 35696, 113126, 152335, 186606, 88388, -14919, 61839, 59879, -16250, -65957, -20484, 90721, 208324, 225871, 70644, 36154, 42158, -51728, -49032, 93305, 176141, 266913, 245745, 77636, 36747, 42181, 85170, 49983, 42518, 47771, 59178, -55848, -55260, 118825, 230950, 228841, 280737, 262354, 150527, 65618, 21369, 156933, 240713, 85289, 42632, 23468, 36839, 163801, 171584, 210991, 231096, 167035, 114841, 66524, -4110, -10158, 27332, 83711, 87598, 78854, -21343, -64030, 103302, 96007, 51357, -51465, -126220, -149123, -56575, -68084, -54916, -25296, 54886, 94537, 48317, -77404, -74752, 38113, 192925, 187545, 259043, 195649, 112178, -42255]
13353d2255j0890J52891O8919o4927Q0146N9239r0226j47781m9856J29136j4076
13342G0320L1911J01342J4695j31816k5399J20169n4002k704k9056J3636K9232
13331A38328n0946l484J14443J5803q7041l3496k1878M4201j12076k3243J45056
13320A25667N1907k6949n1284J07028o7894p4216m9271m9171J63754P5985l8051
13309A67505o63N6464r102q5422L2174N9941j01531r7745L4934J6472P0061Q2269
13297B25357n7248k6004l1519L2431n7767j0145R0605k1545j22157p4664J1128
13286d1528J06269R2594O4301L7707p0321q3207o0248N4604R0540q570m5729N5944
13274A92356J03119K8242j60863l9434o204O3918O5565q7226j54326m8446O4588
$$ y = [-42255, -53145, 99746, 168665, 103738, 183884, 243123, 152897, 5116, -44740, 84396, 70320, 102231, 203573, 218268, 86452, 61053, 181222, 127220, 124516, 95460, 109096, 138328, 87382, 83898, 198341, 214144, 127103, 93607, 71729, 115930, 3854, -19389, 125667, 177574, 150625, 99341, 206369, 138475, 64259, 14988, -34183, 129571, 205556, 167505, 166842, 223306, 214204, 128782, 160956, 220897, 119366, 21621, 56555, 73027, 143088, 225357, 168109, 142105, 110586, 143017, 85250, 75105, 165710, 144165, 22008, -52656, -41528, 64741, 157335, 221636, 259343, 189022, 105815, 45567, 100171, 190711, 182141, 136412, 192356, 295475, 323717, 162854, 123420, 117216, 181134, 246699, 159473, 5147, -43299, 21289]
13263B1289N2249J53664N3194L3512N6256m6986j26637r4772P758O0686M7455
13252B17668N2922l8105j1168j3054q205J01083J33576j5208j8761J47905o3687
13241D84966j14248j0518J78600J75899J83815Q5154R9741K98569K98237K57841
13231A938056K9284k7973m9350j50501j82153k15536k11233j9302j25785j47455
13221H38052o1659R5484J04880N0793J7410K3316M7649n619K9168N1203Q7835
13210A278512J69286O8500O5770J4467J57638R1239K6415R6236J35815J68875
13200B272753J12411r8562j60592j36104k53421j24290k6187p1406l8784J3091
13190A488909K4691K4041j18500j77672k5353L0054l4737k5561r3468j36188k337
$$ y = [21289, 73538, 227202, 280396, 313908, 370164, 323178, 196541, 101769, 109527, 170213, 217668, 270590, 232485, 221317, 208263, 200058, 301141, 434717, 419509, 400748, 548653, 484966, 370718, 360200, 538800, 714699, 898514, 983668, 1083409, 1381978, 1680215, 1938056, 1967340, 1939367, 1890017, 1739516, 1557363, 1341827, 1130594, 1111292, 985507, 838052, 776393, 871877, 976757, 1027550, 1044960, 1068276, 1115925, 1110306, 1139474, 1190677, 1278512, 1447798, 1516298, 1582068, 1596535, 1754173, 1845412, 1871827, 1968063, 2103878, 2272753, 2385164, 2286602, 2126010, 1989906, 1736485, 1612195, 1586008, 1514602, 1475818, 1488909, 1513600, 1537641, 1419141, 1241469, 1216116, 1246170, 1211433, 1185872, 1092404, 956216, 953879]
13179I53879l332M7044M4792J3030k2949k005J66050K54755L15864K83566K44317
13168B295011N5849j57498j90697l57846l32808j63480j69948j51499j16918k1017
13158F89149m755m5134k593l4791j32498O5900M4678m2207m7386m2701p121q612
13146D31929K2553o7458p6584k1433P3895o8435r7809O4267N5416j10155r7068
13135A09118k7653M4068J41819J44183J4516m8363k3093l994j03645k8284n2060
13124A66612j00171k503J19792O9740K8931N3780o9267j8743K5510R6002P7136
13113D46819q6784l4758r8356o4010J4362R9821K0963J9083j08619j05848j9761
13102H2912r176j4624N2293N5308N8028K0075k6503r3275m1998M8799J03287l1210
$$ y = [953879, 950547, 997591, 1042383, 1055413, 1032464, 1030459, 1196509, 1451264, 1767128, 2050694, 2295011, 2350860, 2193362, 2002665, 1644819, 1312011, 1148531, 978583, 827084, 710166, 689149, 684394, 639260, 636667, 601876, 469378, 535278, 579956, 537749, 490363, 447662, 440541, 431929, 454482, 387024, 310440, 289007, 362902, 294467, 196658, 260925, 316341, 206186, 109118, 81465, 125533, 267352, 411535, 426051, 377688, 354595, 350601, 246956, 218672, 166612, 66441, 63938, 183730, 253470, 282401, 336181, 266914, 248171, 273681, 369683, 446819, 360035, 325277, 226921, 162911, 177273, 277094, 298057, 317140, 208521, 102673, 82912, 73736, 59112, 111405, 166713, 224741, 244816, 218313, 125038, 83040, 131839, 235126, 203916]
13090B03916r5941m8773L8994P6026P0964o890M3286r137Q641M3091j11442K1720
13078B34455j37950q6755m6828N695M325M4453J53783J3629k919K3331M2214R4921
13066C42354m979q2354J8413L4885M7298r073N6371j4551q8245o8162k3890K722
13054B10789j4050l7672N2857J1413j29731l1176M8806J09088n0915Q814M2473
13043B20696P2002M4135N3074p9576J02884n5115o1512J6946J6292p3865k481
13032B53480N5128R4291M5213r9258L129J35887l5264O366J2531n2812k6641P0634
13020D62684k7156n351o5982n7693N7123J24126M7917R7456M3672n8748j55136
13009D62912j60059J4449M3675O5855J9134p624Q1958J16801n5632l5010n1809
$$ y = [203916, 107975, 59202, 98196, 174222, 245186, 238296, 281582, 272445, 281086, 324177, 212735, 234455, 96505, 9750, -37078, -31383, -27058, 17395, 171178, 184807, 181888, 205219, 247433, 342354, 337375, 255021, 273434, 308319, 355617, 346544, 402915, 388364, 300119, 231957, 208067, 210789, 196739, 159067, 211924, 223337, 93606, 62430, 111236, 220324, 169409, 178223, 220696, 292698, 336833, 389907, 310331, 413215, 358100, 296588, 313534, 329826, 255961, 253480, 308608, 402899, 448112, 348854, 351983, 487870, 452606, 458972, 471503, 418691, 392050, 462684, 435528, 430177, 364195, 306502, 363625, 487751, 535668, 633124, 676796, 618048, 462912, 302853, 317302, 360977, 426832, 445966, 438342, 520300, 637101, 581469, 546459, 494650]
12998D94650L3591Q628n0799j05029p6849J66188J07939n6803p3103J62392J23896
12987G34701L646r4599j66472O8291K5119L9933M3585j28216k9685M7182j9848
12976E23637M0406o5898n455m7479M1791J13611l3147l017J67049J19098q2458
12965G68138j55170p1282o1264l6748q122l6046j917J6711l6511o2764L3285Q8035
12953D36345K8838n0226M0140R008k1199K4068R2721j06310m4620P7880K0723
12942E07368J8885J4201o843J00009o7328j25025p5748J08635N3015J4525q8142
12931D53552m7676M1677M4218j9063N5601J03516O7170L3546j22567k0368N8846
12920F48452R1957q445R6710P0307R6269L1567m1415J16230p5350N2844R6767
$$ y = [494650, 528241, 536869, 486070, 381041, 304192, 470380, 578319, 521516, 448413, 610805, 734701, 738347, 643748, 477276, 545567, 570686, 610619, 654204, 525988, 496303, 543485, 523637, 564043, 498145, 492690, 445211, 487002, 600613, 567466, 564449, 731498, 850596, 768138, 612968, 541686, 480422, 443674, 435552, 399506, 397589, 414300, 377789, 315025, 348310, 436345, 465183, 414957, 455097, 464105, 442906, 466974, 559695, 453385, 408765, 486645, 507368, 526253, 540454, 533611, 633620, 566292, 441267, 365519, 474154, 527169, 541694, 453552, 405876, 447553, 491771, 472708, 528309, 631825, 698995, 732541, 609974, 589606, 648452, 740409, 731964, 828674, 898981, 995250, 1026817, 985402, 1101632, 1026282, 1079126, 1175893]
12909A175893l82j00829N6384P137M1499M619J80558R3745K473n6100m3254k8451
12897A333292j17046m3549k7413R6935Q5680p6352p4557r903Q0770J08051O1497
12886A417405K3557P6428L1953J88041O4477j42696q4586L1680K116O4921K062
12875A675358J642J3167N7197J6686j00229j40139m6840n6310N409P1962J41303
12864A639206K7287P2547N3660J3703m0788n9316k0159K2356K7273K8960P0218
12853A834947J85163J41690K8986J14496L0751J1933J496J06410j7173l587P7863
12842B512975l672p46Q3436P3898K7289J8898P692O9894J15751J4686L1807L4622
12830B986530L2733R6105J46770P8981J42848N1549J96001J26335J29051Q1791
$$ y = [1175893, 1175511, 1074682, 1131066, 1138203, 1179702, 1184321, 1364879, 1458624, 1461097, 1404997, 1361743, 1333292, 1216246, 1172697, 1145284, 1242219, 1327899, 1251547, 1176990, 1167087, 1247857, 1355908, 1417405, 1440962, 1517390, 1549343, 1737384, 1801861, 1659165, 1574579, 1606259, 1608375, 1673296, 1675358, 1677000, 1690167, 1747364, 1764050, 1663821, 1523682, 1476842, 1420532, 1425941, 1497903, 1639206, 1666493, 1739040, 1792700, 1806403, 1765615, 1706299, 1686140, 1708496, 1735769, 1764729, 1834947, 2020110, 2161800, 2190786, 2305282, 2336033, 2347966, 2349462, 2455872, 2438699, 2435112, 2512975, 2509303, 2508557, 2591993, 2665891, 2693180, 2712078, 2719770, 2789664, 2905415, 2920101, 2951908, 2986530, 3019263, 3115368, 3262138, 3341119, 3483967, 3535516, 3731517, 3857852, 3986903, 4068694]
12820D068694J16514K44771K23387K19264K43369L28288K68188L33083M84887
12811F530445M99926L42166L30139M05086M58999N49418N17321N10546P18653
12802A0862699Q87082J051113J352022J540752J598819J857817K013324K237782
12794B3401410K651165K964656L713547M740546N976227P689870J0181644J3673054
12786G4992119J8322286K4990171L3568686M3935282N4238968N9609651N2230474
12779C61887637K7643830p942270l7949271n1377770n0213929m2138293l2525239
12772A67384695k3810201j6658538j0800492o047907j927407J902159N489958
12765A15532267R142424J2825102J6288381J8157432J8155039J7109669J6946666
$$ y = [4068694, 4185208, 4429979, 4653366, 4872630, 5115999, 5444287, 5712475, 6045558, 6530445, 7030371, 7372537, 7702676, 8107762, 8566761, 9116179, 9633500, 10144046, 10862699, 11749781, 12800894, 14152916, 15693668, 17292487, 19150304, 21163628, 23401410, 26052575, 29017231, 32730778, 37471324, 43447551, 51137421, 61319065, 74992119, 93314405, 118304576, 151873262, 195808544, 250047512, 309657163, 361887637, 389531467, 381589197, 343639926, 292262156, 242048227, 199909934, 167384695, 143574494, 126915956, 116115464, 110067557, 108140150, 110042309, 115532267, 124674691, 137499793, 153788174, 171945606, 190100645, 207210314, 224156980]
12758B24156980J8214222J8903113J7432481J4957794J4834710J8737842K5618581
12751C52855723L2144695L3795619K5844022P111867j6859548l5053018m0807432
12744C59031928l6382895k7031230j7318717r398885m113651k334877l628937
12737B58822736p325985j1278649j3283872j3270647j3770185j5401965j6740898
12730A67750535j5545413j2142281q219653m128989L28311N252840J0872978J7989237
12722A62157565K7294173L8358475N0238158N9917546O0815418M6017379J3151157
12715D57949871k7775727n8491255o8952383o3433732n1853881l9929565l0018900
12708A17494428k2440232j6647767j2583080r638495p488474n896996m641530
$$ y = [224156980, 242371202, 261274315, 278706796, 293664590, 308499300, 327237142, 352855723, 385000418, 418796037, 444640059, 451751926, 434892378, 399839360, 359031928, 322649033, 295617803, 278299086, 268900201, 264786550, 262451673, 258822736, 251496751, 240218102, 226934230, 213663583, 199893398, 184491433, 167750535, 152205122, 140062841, 131843188, 127714199, 128042510, 133295350, 144168328, 162157565, 189451738, 227810213, 278048371, 337965917, 398781335, 444798714, 457949871, 430174144, 371682889, 302730506, 239296774, 187442893, 147513328, 117494428, 95054196, 78406429, 65823349, 56184854, 48696380, 42799384, 38157854]
12701C8157854l707208l104269k603561k185306k068970k095734j980143j939428
12693A8473235j753775j483990j419907j227473r68547r03084q11449o15815n80491
12684H708704m67015m50080m05044l72803k69877j76586k51317l00298k24257
12675E791427j95608k25414k69568k19984k27395j54762j26850n5069j87627j83231
12665C945919k50899j30037j7928l541k6677j53900j73181o6943l9909p0540j39106
12654B873258p9760J4918K2480j03574j19869k2464K2186j46720K274j779j27788
12643B333162q8063k6452j09203q2636P855M6752m0603L110j5521k5883q9609
12632A912909M127J07488k1446p7746j3247J57869M8483q9513j20665m8966o5861
$$ y = [38157854, 34450646, 31346377, 28742816, 26557510, 24488540, 22392806, 20412663, 18473235, 16719460, 15235470, 13815563, 12588090, 11619543, 10716459, 9905010, 9289195, 8708704, 8241689, 7791609, 7386565, 7013762, 6743885, 6567299, 6315982, 6015684, 5791427, 5595819, 5370405, 5100837, 4880853, 4653458, 4498696, 4371846, 4316777, 4129150, 3945919, 3695020, 3564983, 3547055, 3543514, 3516837, 3362937, 3189756, 3122813, 3082904, 3012364, 2873258, 2793498, 2808416, 2830896, 2727322, 2607453, 2584989, 2607175, 2460455, 2462729, 2460950, 2333162, 2245099, 2218647, 2109444, 2026808, 2034663, 2081415, 2040812, 2043922, 2028401, 2002518, 1912909, 1917036, 2024524, 2003078, 1925332, 1912085, 2069954, 2118437, 2028924, 1908259, 1859293, 1793432]
12621A793432j14955P7884O5903r2774j63277p9928l3059J1907O9300k4881o0982
12610A448570J8591K305j2325L6891K5438K3359J15510N1767N3128M1558K03523
12599B008315K86900K29186J58183K13535l5039p5103k48734k70680j99672k59206
12589A807685j83223j66833j09609m7965J02718j06097k46888k32748n7025K5350
12579G85365l0966r976q6937o5800R5539J03498o4635n766l3017n4693L660J69685
12567H05957J61342n4328L3838L7140p4338o3115r568O9408o0658k1808J189n0891
12555G74168l5226r4635j2832Q6848j10117K1004N1052L0503m730n1537p0167
12544E84331j20543k7599N8980P5387m0133p7085M5940J26226j637m5219l2921
$$ y = [1793432, 1678477, 1756361, 1822264, 1729490, 1566213, 1486285, 1453226, 1465133, 1534433, 1509552, 1448570, 1467161, 1469466, 1457141, 1494032, 1519470, 1542829, 1658339, 1710106, 1763234, 1804792, 2008315, 2295215, 2524401, 2682584, 2896119, 2861080, 2785977, 2537243, 2266563, 2066891, 1807685, 1624462, 1457629, 1348020, 1300055, 1402773, 1296676, 1049788, 817040, 760015, 785365, 754399, 744423, 657486, 591686, 687225, 790723, 726088, 720322, 687305, 632612, 636272, 805957, 967299, 912971, 946809, 983949, 909611, 846496, 836928, 906336, 845678, 823870, 825059, 774168, 738942, 644307, 631475, 718323, 608206, 629210, 680262, 710765, 706035, 654498, 584331, 463788, 436189, 495169, 570556, 530423, 453338, 499278, 625504, 623867, 578648, 545727]
12533E45727K9934N2018q1212k3575N7298J3075p0190j8493R5039L3607j438j6029
12521F15761k6814j67673o4090j02333p0131N3378P5253R3512M7030R908N9807
12510E23608l7004p1208j5990O3748P2102J0296L3188K0446M5595k8585o0538
12499E55658j23976P3775M4558j06598p2683n7254q8776N178J08454J16875O6663
12488E21874J8197Q289r3125N60q4326n4650R2067J15320N6793j6745M970M0858
12476F10082K5382l0305n8900m9322q8585P4372J05883j05687j51636l6601O0337
12465C55020K3577Q406q3040l6888M2754r706j00637J259N1372J58200n532M7758
12453D52543l710k0589j3781j4573L2640L3910L1215K7286o1266l7074j8277n4064
$$ y = [545727, 575661, 627679, 546467, 522892, 580190, 593265, 523075, 504582, 599621, 633228, 631790, 615761, 588947, 421274, 357184, 254851, 184720, 238098, 313351, 406863, 453893, 463801, 523608, 486604, 415396, 399406, 463154, 535256, 545552, 578740, 599186, 644781, 616196, 555658, 431682, 505457, 550015, 443417, 370734, 313480, 224704, 229882, 338336, 455211, 521874, 540071, 548360, 455235, 455795, 371469, 316819, 408886, 524206, 580999, 564254, 569224, 610082, 635464, 605159, 546259, 496937, 408352, 482724, 588607, 482920, 331284, 294683, 355020, 378597, 387003, 303963, 267075, 309829, 300123, 199486, 200745, 252117, 410317, 404785, 452543, 448833, 428244, 414463, 399890, 432530, 466440, 497655, 524941, 463675, 426601, 408324, 354260]
12441C54260j5513k6332r4335n948R0751R570P6662J04410J3741o9600j0492N65
12429D27739m9004j8399n947q1122J6654n353J16571M7897O356J9082K807J93
12417D77474P7051J04431l152l3552m7033j8848l33Q6387R6081Q7759J45031J54818
12405A126114J19124K55387L09802J82246K78365K00340Q8255q1494k8482j29847
12395B319810l53360k81772j38382j47688j49196k52187J4739o8123O0298M0038
12385A044177J34568J24927n1093O9905k643L6897J06239L5768Q1584j4490o4240
12374A501599n2256J10218J39206Q0034J49599J27678J24356J42487P741K8115
12364B358777j05377M2956M6273j14469k92665k25339n7734j43584n8976k539
$$ y = [354260, 338747, 312415, 218080, 212132, 302883, 312453, 389115, 493525, 507266, 437666, 427174, 427739, 378735, 360336, 354389, 273267, 289921, 284568, 401139, 449036, 455392, 474474, 477281, 477474, 554525, 658956, 655804, 622252, 575219, 556371, 556038, 642425, 738506, 826265, 971296, 1126114, 1245238, 1500625, 1810427, 1992673, 2271038, 2471378, 2559633, 2478139, 2449657, 2319810, 1966450, 1684678, 1546296, 1398608, 1249412, 997225, 1011964, 943841, 1004139, 1044177, 1178745, 1303672, 1252579, 1322484, 1319841, 1356738, 1462977, 1498745, 1580329, 1565839, 1501599, 1449343, 1559561, 1698767, 1778801, 1928400, 2056078, 2180434, 2322921, 2330662, 2358777, 2253400, 2296356, 2342629, 2228160, 1935495, 1710156, 1652422, 1508838, 1449862, 1447323]
12354A447323j56441j51019r4129m2199k4089m4366j34892m5045J28875R6546
12344I80564J43903K25032O9670J7295N7644O3207J68774K00204K4213q3674j60872
12333A705960j48730j22458o9411j32485j913p0589j4622R6005J39699O9497Q0450
12322A531403K04105J85450r6968p734j48088j38558j21861j88345o4101p8338
12312A076965j7969o5377p9380j4198O6090N2467L6097J06789R7376n9412M7852
12301A247300J60036K25009O7307O6769O8130K40622J86867J50042J53206m9026
12291B516262m4696n1274j61066j11311j33819j55049j72573L2333J81J5050M0692
12280A774730j7678j06686j07140j00243j02534j22385r1772M2552J6039k2798
$$ y = [1447323, 1290882, 1139863, 1045734, 1003535, 979446, 935080, 800188, 755143, 884018, 980564, 1124467, 1349499, 1419169, 1436464, 1494108, 1557315, 1726089, 1926293, 1950506, 1866832, 1705960, 1557230, 1434772, 1365361, 1232876, 1230963, 1160374, 1145752, 1241757, 1381456, 1450953, 1531403, 1735508, 1920958, 1823990, 1816256, 1668168, 1529610, 1407749, 1219404, 1155303, 1076965, 1058996, 993619, 914239, 900041, 966131, 1018598, 1054695, 1161484, 1258860, 1199448, 1247300, 1407336, 1632345, 1699652, 1766421, 1834551, 2075173, 2262040, 2412082, 2565288, 2516262, 2471566, 2420292, 2259226, 2147915, 2014096, 1859047, 1686474, 1718807, 1718988, 1734038, 1774730, 1757052, 1650366, 1543226, 1442983, 1340449, 1218064, 1126292, 1168844, 1184883, 1162085]
12270A162085j35116r8416Q4057P4698R8303O0277J68976J94880K25205L36852
12260B171801K11341K81996Q3037k62297l19642l32455k10998k94666o6500k05485
12250A056132j98459r1278m6606p4778r4394n7036q4591l2265M1922J1757m5226
12239C85178m6437j9841Q8726P3277j0786p5792j5235l768o457p019j2837l0760
12227C18249R446N547P7059P5256o0867m5255p400M7433L4183J5419N523j083
12215D73510m0340J0642R208P1360M5260j34312j6312m9561J20632K2183r5268
12204D17002q0927J09825R4093m62p2586m4032n8604k0617k2518K8171O1121L1839
12192D42305R9534M1878k7336j26881k0437m1537L3758J37141L0432J6954o0137
$$ y = [1162085, 1026969, 928553, 1012610, 1087308, 1185611, 1245888, 1414864, 1609744, 1834949, 2171801, 2383142, 2665138, 2748175, 2485878, 2166236, 1833781, 1622783, 1328117, 1261617, 1056132, 857673, 766395, 719789, 645011, 550617, 493581, 408990, 376725, 418647, 430404, 385178, 338741, 318900, 407626, 480903, 470117, 394325, 379090, 375322, 368865, 361846, 349009, 318249, 327695, 333242, 410301, 485557, 424690, 379435, 372035, 419468, 453651, 469070, 474593, 473510, 433170, 443812, 453020, 524380, 569640, 435328, 419016, 369455, 490087, 512270, 417002, 336075, 445900, 539993, 539531, 466945, 422913, 364309, 343692, 321174, 349345, 410466, 442305, 541839, 583717, 556381, 429500, 409063, 367526, 401284, 538425, 568857, 585811, 525674]
12181E25674o0072r7594m241J2834M7440J67386J50086j2500k8840l5964M8875
12170G13084p5915o3541O7341L4548j01165r9277M2011P1386J5993k4025p406
12159E73034J81288N284p4613j083l4357j7423l3604l0983Q0481P7484j34M446
12147G29820j8855m1018N6252k1830O9524M4763j8933o6008m8518J19432Q3807
12136H88436j20378j19055j04371m6520L9311j4766J6134O3281k4721n6970O57
12125E21038L016J8673K6274l5395P7035P6629J3412L8709K8743M8214K5897M6217
12113H88462m5812K16J68393J26057R8351M8387q8517K2830K7264P0825N3522
12102A369978P333k237P5196k4125J56247K58199K04574J50061K3137M0952O121
$$ y = [525674, 465602, 368008, 363767, 376601, 424041, 591427, 741513, 729013, 700173, 664209, 713084, 637169, 573628, 640969, 675517, 574352, 475075, 517086, 588472, 604465, 580440, 573034, 754322, 759606, 684993, 683910, 649553, 632130, 598526, 567543, 648024, 725508, 725374, 729820, 710965, 669947, 726199, 704369, 773893, 818656, 799723, 733715, 685197, 804629, 888436, 768058, 649003, 544632, 498112, 537423, 522657, 538791, 602072, 577351, 520381, 521038, 524054, 542727, 569001, 533606, 610641, 687270, 700682, 739391, 768134, 816348, 842245, 888462, 842650, 842866, 1011259, 1137316, 1235667, 1284054, 1195537, 1218367, 1245631, 1316456, 1369978, 1377311, 1375074, 1450270, 1426145, 1582392, 1840591, 2045165, 2195226, 2218363, 2259315, 2265436]
12091B265436o7491j88990k52341j02034k8601O1510O2767r486O4842o4289j64109
12080A577214k4246N5082L6433m4668K9346K4045n0454K8296J2248J403M4654
12069A689353J3651N2567J9734n3963K2311K9967k4023m0664o6484K3998P6177
12058A742624M4837N3632o2598j7644Q3476R8995K8746o2339L6655P9555p8214
12047A947725Q9626J64115k4192o4695J08697K15131J09357R9678P1127k666R4023
12036B807926K6023r6743K3020J352R7300J57691k9922J4364J45387Q5097Q6328
12025C317823L8755P0352J40705P8201J1885O3809J85291K15348K43570M6168
12015D411907K15823J48089J11266K68828K67379J58774J96135L45453L49923
$$ y = [2265436, 2197945, 2008955, 1756614, 1654580, 1625979, 1687489, 1750256, 1740770, 1805612, 1741323, 1577214, 1552968, 1608050, 1644483, 1599815, 1629161, 1653206, 1602752, 1631048, 1643296, 1644699, 1689353, 1703004, 1755571, 1775305, 1721342, 1743653, 1773620, 1749597, 1708933, 1642449, 1666447, 1742624, 1787461, 1841093, 1778495, 1760851, 1844327, 1943322, 1972068, 1909729, 1946384, 2025939, 1947725, 2037351, 2201466, 2177274, 2112579, 2221276, 2436407, 2545764, 2645442, 2716569, 2713903, 2807926, 2833949, 2737206, 2760226, 2761578, 2858878, 3016569, 2986647, 3001011, 3146398, 3231495, 3317823, 3356578, 3426930, 3567635, 3645836, 3657721, 3721530, 3906821, 4122169, 4365739, 4411907, 4627730, 4775819, 4887085, 5155913, 5423292, 5582066, 5778201, 6123654, 6473577]
12006F473577L66888L99596M95965N59357M31431M61307L98847N30879O56705
11997A0774552O99872P87745R50314J158085J262623J467366J711008J982995
11989B0794560K532736K793039L260911L994725M903027O187902P597299R499831
11981F1564030J2113915J5667270K0760527K7980082L7213325M8030380N8017459
11974B81346988O2661210N5612610L2895525n01662l2370783n1811050n6111128
11967B91721710n0292673m0432454l0218412k1282019j3811518p662210k233271
11960A25789153K742680P306961J1499719J3844886J3918155J2651662J1666813
11953A99420029J2098880J3433305J3731500J1535010O966116K784927K273206
$$ y = [6473577, 6840465, 7240061, 7736026, 8295383, 8726814, 9188121, 9586968, 10117847, 10774552, 11474424, 12262169, 13212483, 14370568, 15633191, 17100557, 18811565, 20794560, 23327296, 26120335, 29381246, 33375971, 38278998, 44466900, 52064199, 61564030, 73677945, 89345215, 110105742, 138085824, 175299149, 223329529, 281346988, 344008198, 399620808, 432516333, 432014671, 399643888, 347832838, 291721710, 241429037, 200996583, 170778171, 149496152, 135684634, 128022424, 125789153, 128531833, 135838794, 147338513, 161183399, 175101554, 187753216, 199420029, 211518909, 224952214, 238683714, 250218724, 257184840, 259969767, 262242973]
11946B62242973O708935J5552949K6213835L5513018L9793909L5445709K1437953
11939D42909281R85273j8687478l0521471l2228978k6957633k0358058j6461608
11932B98679328j6278326j7949887j9036191j8324897j6386227j4921287j5281190
11925A80501323j6486340j6925656j5449795j2148702q029860l604065N62749
11918A08419654M592516R038924J4088546K0374650K8016973L6402072M3831398
11911B64764733M6793479M0503958K1271693p482935l5154920n1149007n3326822
11904B26220179m6702018l7498456k8652253k1449095j6160059j2081919r434731
11897E4241648p458199o205659n230811m412424l800426l100133k557952k089499
$$ y = [262242973, 268951908, 284504857, 310718692, 346231710, 386025619, 421471328, 442909281, 443894554, 425207076, 394685605, 362456627, 335498994, 315140936, 298679328, 282401002, 264451115, 245414924, 227090027, 210703800, 195782513, 180501323, 164014983, 147089327, 131639532, 119490830, 111460970, 107856905, 108419654, 113012170, 122051094, 136139640, 156514290, 184531263, 220933335, 264764733, 311558212, 352062170, 373333863, 365850928, 330696008, 279547001, 226220179, 179518161, 142019705, 113367452, 91918357, 75758298, 63676379, 54241648, 46783449, 40577790, 35346979, 30934555, 27134129, 24033996, 21476044, 19386545]
11889A9386545j754815j476981j306574j235522r31122q20186o71709l88851n19574
11880A0281211l67624k94674m51824m27895m45032m31066m79712m16229l78921
11871F588234m35847k82738j29716l1273j80181k47095k22521j31214j90847j25592
11861D611210p3321j63301j06197k9937O5049j4973j11526j6910n8948p5819k6368
11850C998959O8361M7587k8883n6133K9938j34803k55249k29984j32798p2483
11840C234512l1716l0254r528k1601j97193p0372p9328q2979j67751p8131M0034
11829B505693r11O5382K7698l4704n430J30169K46985K32668L64252L33520L43513
11818D208835K08361o6203k32179k38172k96379m13903l85091k32425j58669j61911
$$ y = [19386545, 17631730, 16154749, 14848175, 13612653, 12681531, 11861345, 11189636, 10800785, 10281211, 9913587, 9618913, 9167089, 8739194, 8294162, 7863096, 7383384, 6967155, 6588234, 6152387, 5869649, 5739933, 5708660, 5528479, 5281384, 5058863, 4927649, 4736802, 4611210, 4537889, 4374588, 4268391, 4238454, 4303503, 4288530, 4177004, 4160094, 4101146, 4025327, 3998959, 4067320, 4114907, 4086024, 4029891, 4059829, 3925026, 3669777, 3439793, 3306995, 3234512, 3202796, 3172542, 3163014, 3141413, 2944220, 2873848, 2794520, 2711541, 2543790, 2465659, 2505693, 2504782, 2570164, 2597862, 2563158, 2557728, 2687897, 2934882, 3167550, 3531802, 3865322, 4208835, 4417196, 4350993, 4118814, 3880642, 3584263, 3170360, 2785269, 2552844, 2394175, 2232264]
11808B232264r8967m4845l7284k1862P6030Q9818l3865j1315J8260n0936j21476
11797A995822n100N8022L2712O7912K36201J87962K54837L45604K25191J34554
11787C533717P3251L3693k10728m30955l20671j99349j53251k03706n5036n2333
11777B014632o0769n0159m8234k04650k31693k5827q4840q4979m3032l5415N7502
11766A202536q8627k17318J1886J02039J08502K68132K61918J44010J11897J44785
11756B049760l8758j73754j44133k17206j55927j54049p9759j13550j01882m3805
11746H26937j12894j15435j6622O560j7294j0866j0233J7139j42340l2366J40311
11735E32897l9986o9765k331J0020o7268N6867k5713K220J2834j09024j4656O528
$$ y = [2232264, 2133297, 2088452, 2051168, 2029306, 2105336, 2195154, 2161289, 2149974, 2168234, 2117298, 1995822, 1990722, 2048744, 2081456, 2149368, 2385569, 2573531, 2828368, 3173972, 3399163, 3533717, 3606968, 3640661, 3429933, 2998978, 2678307, 2478958, 2325707, 2122001, 2066965, 2014632, 1953863, 1903704, 1855470, 1650820, 1419127, 1393300, 1308460, 1223481, 1180449, 1145034, 1202536, 1113909, 896591, 908477, 1010516, 1119018, 1387150, 1649068, 1793078, 1904975, 2049760, 2011002, 1837248, 1693115, 1475909, 1319982, 1165933, 1086174, 972624, 870742, 826937, 714043, 598608, 581986, 588546, 571252, 560386, 550153, 567292, 424952, 392586, 532897, 492911, 423146, 420815, 430835, 363567, 420434, 394721, 396941, 409775, 300751, 286095, 292623]
11723B92623j2090j8139J11833J3164N3316L2118m1683J4105O0948p9931j57812
11712B68452L6540M4897J00451J30012r8989j18451o1753K5458l5012o6277j08310
11701A17018J23712R5512l2982j06576O65Q5771K8967p1028m7794K9512M6551
11690B69328L1018l2838q1872L1474m2470O7962J08846J4709m487K0197j8963
11679C62904N362q108K1757Q4723J02430P5774j2906j17506R405l2356o7671J790
11667D25598q806l2036n4302O7386p6581j06014M6837J18683k9940j4636O5880
11656D02069j4256M7597K5301j25572l9242J5438L5996N9548o0597k6749j5293
11645C04240j22409m1645L2896o3465J9559J27286P7147N3023j03854j62028j16443
$$ y = [292623, 280533, 262394, 374227, 387391, 440707, 472825, 431142, 445247, 506195, 426264, 268452, 304992, 349889, 450340, 580352, 481363, 362912, 301159, 326617, 291605, 225328, 117018, 240730, 336242, 303260, 196684, 197349, 283120, 312087, 241059, 193265, 222777, 269328, 300346, 267508, 185636, 217110, 174640, 242602, 351448, 366157, 361670, 381867, 362904, 368266, 360158, 381915, 466638, 569068, 644842, 631936, 514430, 523835, 491479, 423808, 425598, 416792, 384756, 330454, 397840, 321259, 215245, 262082, 380765, 350825, 336189, 402069, 387813, 435410, 460711, 335139, 295897, 311335, 347331, 406879, 346282, 319533, 304240, 181831, 140186, 173082, 109617, 129176, 256462, 333609, 386632, 282778, 120750, 4307]
11634D307m7614Q1196J8637Q4984M3688J27448m3013j33629l9553l94l5795N2907
11622A13169m1663o796j09619K7427R7118l4724k125J08748L9771j8024J4810
11611A88092J10165R385L0816o7011j00507L262o3078M0101J52607p6688j65168
11600F1976q1169J54108L8155p3018n6698M4154O4440K7716K4728Q6075K4055
11589C14522j09718j51011l9088o1910m4819J2387M9348N6234L9844L1476J5135
11578A12400L8378p4887j36023R309O5779q8505j05973N5996Q4583N9573N6896
11567G7526o5065m3595Q4842R0212l3107J4039P8207j8871m569J4651Q211J01636
11555C04117Q2760l2719m6394J1729Q9932Q0127r3278n7662K275J46258K02642
$$ y = [4307, -43307, 37889, 56526, 141510, 185198, 312646, 269633, 136004, 96451, 96057, 60262, 113169, 71506, 64710, -44909, -17482, 79636, 44912, 42787, 151535, 191306, 173282, 188092, 298257, 307642, 338458, 271447, 170940, 174202, 111124, 151225, 303832, 227144, 61976, -19193, 134915, 173070, 100052, 43354, 87508, 151948, 179664, 204392, 290467, 314522, 204804, 53793, 14705, -47205, -92024, -79637, -30289, 25945, 65789, 97265, 112400, 150778, 75891, -60132, -50823, 14956, -73549, -179522, -123526, -38943, 20630, 77526, 12461, -31134, 53708, 143920, 110813, 124852, 203059, 184188, 179619, 194270, 202481, 304117, 386877, 354158, 307764, 319493, 409425, 489552, 396274, 338612, 340887, 487145, 689787]
11544F89787J43232J95488J97505K05083J57850J57096J14078M0212J7836m2090
11534A876077k4717k25811l81207k70871j44269l4276k5642n5936k2190N1346
11524G42504J5561J3026N099J8678k8698J20427O7632K10318J92716P6900p7885
11513A356278j15591q1948K8304J97082J86066K09614R9723J52138P3515o4885
11503B040296j40305j47264J2727r0758m8652p2648r1735o2549j1066p1410j05057
11492A211579m6955m263j55607j38303r3506O1244q5887r8541K5864J41511N5778
11481H72914N1747R6412J56033J44817J99110J42649J40522P2793m6937j58269
11471A671791j04602k11384l39989k01687j36776r2880m3246p692j20217j26820
$$ y = [689787, 833019, 1028507, 1226012, 1431095, 1588945, 1746041, 1860119, 1900331, 1918167, 1876077, 1851360, 1625549, 1244342, 973471, 829202, 794926, 769284, 713348, 691158, 742504, 758065, 771091, 776190, 794868, 766170, 886597, 954229, 1164547, 1357263, 1434163, 1356278, 1240687, 1158739, 1187043, 1384125, 1570191, 1779805, 1879528, 2031666, 2105181, 2040296, 1899991, 1752727, 1765454, 1674696, 1626044, 1553396, 1461661, 1399112, 1388046, 1316636, 1211579, 1164624, 1160361, 1004754, 866451, 772945, 834189, 748302, 649761, 675625, 817136, 872914, 924661, 1021073, 1177106, 1321923, 1521033, 1663682, 1804204, 1876997, 1830060, 1671791, 1567189, 1355805, 1015816, 814129, 677353, 584473, 541227, 533535, 413318, 286498]
11461B86498K8266P575o9691K214P8019n1124n5056n6850k1274M6234l8420o7605
11449H8786q0566Q7692J36326j03981j24966j07676j56345P5705K2065J33924
11439b9036J06858m0772j02114Q9531O9312n9161k3943k4946n5951j5628N3113
11428c2737o1488L6764m2029k780n2800n4212N6922j3382L5500j7568P5094L5005
11416c7711Q3383R261l5305j5544J1916O1540j063q5716o3122N892j02627N0492
11404a18604J70809M2580l1901J5343p5889M2550K8117n2427j1909K5563l7358
11393c126j35900k8844k2630J29147J5033o5006o8199o743J02625J12495k9167
11382c15J9069J33448j6997q7069M6371N0974n8780j05901m8156O6027O3065M7975
$$ y = [286498, 314764, 322339, 252648, 254862, 332881, 281757, 226701, 169851, 148577, 194811, 156391, 88786, 8220, 95912, 232238, 128257, 3291, -104385, -260730, -185025, -162960, -29036, 77822, 37050, -65064, 24467, 93779, 34618, 10675, -14271, -70222, -85850, -32737, -94225, -57461, -99490, -102270, -155070, -209282, -152360, -165742, -130242, -147810, -72716, -37711, 45672, 54933, 19628, 4084, 16000, 77540, 76477, -9239, -72361, -66469, -169096, -118604, 52205, 94785, 62884, 78227, 2338, 44888, 73005, 20578, 8669, 34232, -3126, -139026, -167870, -190500, -61353, -46320, -111326, -179525, -186268, -83643, 28852, -315, 18754, 152202, 135205, 48136, 94507, 145481, 86701, -19200, -67356, -1329, 61736, 109711]
11370A09711r8705l746N4217k4598m5331P3932k5396o7660N9114O4157m0541j02100
11358d6946k4133J29720r6146r8163Q3624J3441N2360K8246m4720j890K9529N9019
11346H3941n4640M7992p1795K6587n705j5552j942J14464n5830q6266p7529N5175
11334d1100P8152n4599P144k0910o9223J1905J8563Q4079J03060o2672q7965n1602
11322h5168P1140R3936K2495j11499o807m0283k7400M3896O2282M2982O5006o9426
11310F1154K5829K2286q7137J54357K73884K39754K53798L78509O28992Q00723
11300B752149L86769J19741p8845k45237p02547q00862n17085k87009j54118q9674
11290C83282j00611m5979j5649q0674r6516M9113J2831o2770K5052j18n4096l9841
$$ y = [109711, 11006, 7260, 61477, 36879, -8452, 65480, 40084, -27576, 31538, 95695, 55154, -46946, -71079, 58641, -37505, -135668, -52044, -38603, 13757, 42003, -2717, -4607, 24922, 83941, 29301, 77293, 5498, 32085, 26380, 10828, 8886, 123350, 67520, -18746, -96275, -41100, 37052, -17547, -10403, -31313, -100536, -88631, -70068, 14011, 117071, 54399, -33566, -85168, -14028, 79908, 102403, -9096, -15903, -56186, -83586, -39690, 22592, 65574, 130580, 61154, 86983, 109269, 22132, 176489, 450373, 690127, 943925, 1322434, 1951426, 2752149, 3138918, 3258659, 3179814, 2934577, 2232030, 1431168, 914083, 627074, 472956, 383282, 282671, 236692, 221043, 140369, 43853, 92966, 105797, 43027, 68079, 67961, 13865, -25976]
11278b5976r4316j4464N3688R4187q398q1260j4787P8593K8924j920Q0105O9778
11266A64154r6558k8399L7472K9040m3205m1909K0767Q028Q0458J7737Q7021m9083
11254A85523o6674L4472M4540j27419o6536k7918o086N504j3805j4363L7019R1020
11242G5277n9702j7387Q797N7583m284O2207k5365N7349O5031L4458k7502j33381
11230I3081p6164J9661j9269p1947o9930j68259J048J33865K8825q4588K9164
11219a84513L6599j254J38277P5042K7493P084k9870l6801K9660J06767K6474
11208A94958m6235j98557j9421Q4833p6516l5716j3121M8632J3657P8147P1293
11197A01954J22303J00034Q322j8690j35125k0017J63488K11407L54732O84465
$$ y = [-25976, -120292, -134756, -81068, 13119, 4721, -76539, -91326, -12733, 16191, 14271, 94376, 164154, 67596, 39197, 76669, 105709, 62504, 20595, 41362, 49390, 129848, 147585, 234606, 185523, 118849, 153321, 197861, 70442, 3906, -24012, -30098, -24594, -38399, -52762, -15743, 75277, 15575, -1812, 6985, 64568, 60284, 122491, 97126, 154475, 219506, 253964, 226462, 93081, 16917, 36578, 17309, -54638, -124568, -292827, -291779, -157914, -129089, -213677, -184513, -147914, -149168, -10891, 64151, 91644, 98728, 68858, 32057, 61717, 168484, 194958, 148723, -49834, -69255, 15578, -60938, -96654, -109775, -61143, -47486, 30661, 101954, 224257, 324291, 332613, 313923, 178798, 158781, 322269, 533676, 888408, 1572873]
11187A572873P59866M80913M3584k56073j9459Q5283l17492o84098p34869m14150
11177E16378j73885n3471n6990K3805p5K2403o393J6870r3494j1677L6577n2736
11165A67312k5143m4020m2833j31047N0608n905j034N6567L0054q9957K4792l7828
11153d8434j09090O5377K1325k6896l1512K0525Q8945o39M6812n3728o8947r0862
11141a87124O8129L4567N945Q7857P6696M9362K240l977N4398K7591q6584l3060
11129I6040J4678p176j25888Q173O7666j4407m8527L3k9385n1887m822m5678J1194
11116a29986J2089o01j5399m5751n1577R0464N5606q9142J0176P5975N5418p3406
11104a06134k2352P8390M8358K4631j368j0928J5543Q0696q0900p7387K1398K1000
$$ y = [1572873, 2332739, 2813652, 2857236, 2601163, 2581704, 2666987, 2349495, 1665397, 930528, 516378, 342493, 289022, 232032, 255837, 255762, 278165, 271772, 288642, 195148, 183471, 220048, 167312, 142169, 98149, 55316, -75731, -25123, -31028, -32062, 24505, 54559, -35398, -10606, -48434, -157524, -92147, -70822, -97718, -129230, -108705, -19760, -20399, 26413, -27315, -96262, -187124, -118995, -84428, -78483, 9374, 86070, 135432, 137672, 133695, 188093, 215684, 129100, 96040, 110718, 103542, -22346, -14173, 53493, 39086, -9441, -9408, -38793, -90680, -95502, -141180, -129986, -117897, -118498, -133897, -179648, -231225, -140761, -85155, -174297, -164121, -88146, -32728, -106134, -128486, -50096, -1738, 22893, 21525, 10597, 26140, 106836, 25936, -51451, -30053, -9053]
11092i053l4859P8899N500r9857j8416M8553K0646L1291N9682K8870o5310j22005
11080g6059l9481L2922J3223m0627L6005L6672l4815Q4789l133K3429q961K818
11068B6782R9928J23017m2694r5193j52874K5491J34669M1211k3171J72311k9177
11057B80300m2864p7193o697r4135M3551k6474r7928j5539l2059J2657P887j1101
11045e9595n2137K2166k1837r0413N0405M7065M1137O3109l1805K0470L1446l5683
11033a5672j0298j2555j14513j05046O5610Q7865Q0710k5974K4548N3367M7651
11022G5693k6759o5644R5780J12548o135k110k7735q8553k3538l8910O3886J01298
11010A69821k9612m4277L2188n2825j24654j02483N9168N9190R5495N3201L726
$$ y = [-9053, -43912, 34987, 40487, -59370, -77786, -29233, -8587, 22704, 82386, 111256, 45946, -76059, -115540, -82618, -69395, -110022, -74017, -37345, -72160, 12629, 9496, 32925, 23964, 26782, 126710, 249727, 207033, 111840, -41034, -15543, 119126, 160337, 137166, 309477, 280300, 237436, 160243, 153546, 59411, 102962, 76488, -21440, -36979, -69038, -56381, -48494, -59595, -111732, -89566, -111403, -201816, -151411, -104346, -63209, -100, -31905, -11435, 20011, -15672, -25970, -38525, -153038, -258084, -192474, -104609, -23899, -49873, -25325, 28042, 75693, 48934, -16710, 79070, 191618, 185483, 183373, 155638, 67085, 43547, 4637, 68523, 169821, 140209, 95932, 128120, 75295, -49359, -151842, -92674, -33484, 62011, 115212, 118938]
10999A18938K2131m1910j16912J06280J79552o925k03436l4092k2389j8958J1180
10988f541K5313j03825n1203j2342N8651L2153P373M7164K10P1580K7017M3561
10976A39111m5660o5669k9964L2389M1928r2454J6465J23312J8500l2238j7547
10965H8173M9826K7267l3353l1683o5694N1159m4245o5077j2735l9021J27044
10954E1661l5659m6962m1347O5412M740m364m0777j11780m5124R4849p342M316
10942a12377m3860P4005Q6944k8905q4052n6340N6393j5446m7305k9066k0786
10931b20795N6948L3381K5052j1959Q5880m1462o7970P2246L7365J5972J43499
10920A28157r4408J29922J00874m7214n0131p8192r6868o0501n045n167J29245
$$ y = [118938, 141069, 99159, -17753, 88527, 268079, 261154, 57718, 23626, 1237, -17721, -6541, 18772, -85053, -136256, -148598, -89947, -57794, -50421, -3257, -3047, 68533, 95550, 139111, 93451, 27782, -2182, 30207, 72135, -20319, -3854, 119458, 137958, 105720, 88173, 137999, 165266, 131913, 100230, 34536, 85695, 41450, -23627, -36362, -75383, 51661, 16002, -30960, -72307, -6895, -2155, -6519, -47296, -159076, -204200, -109351, -116693, -112377, -156237, -82232, 4712, -24193, -108245, -164585, -108192, -123638, -170943, -200009, -220795, -163847, -130466, -105414, -117373, -31493, -72955, -140925, -68679, -31314, -15342, 128157, 33749, 163671, 264545, 217331, 167200, 89008, -7860, -68361, -73406, -78573, 50672]
10909E0672J20944J2381k6035r5909j04799j2650j0498O0983O5501q719o1118
10898i247K9001j6846m9138o364j2396o9056M9895k1606J897K21468P8329n5536
10886A40401j2739J8950j3439K0506J0815l1468o1394k0002m5723q0754Q9032
10875A4185p6482l9421J6358J8036J8609J3950K2658m1752L696l6281J0047Q330
10863f8067r397j9363j1290K6352N5054L5968l560j10853p8484l0424J8056L6023
10851a59985k6884P7015J02410O1071J06196q7231q6570J00866R1540j00346j74601
10840i6519J9063J1450R5621L6197j6782j3931r4404O2033Q2163n09K6303K4170
10828A34855l0181j7138m3519m6586L9767L2877K860m9384l3595Q571M0237p3088
$$ y = [50672, 171616, 183997, 157962, 62053, -42746, -55396, -65894, -4911, 60590, 51871, -9247, 19754, 2908, -46230, -52594, -64990, -134046, -84151, -105757, -103860, 117608, 195937, 140401, 127662, 146612, 133173, 153679, 164494, 133026, 71632, 51630, 5907, -74847, 14185, -62297, -101718, -85360, -67324, -48715, -34765, -12107, -53859, -50163, -86444, -76397, -68067, -77464, -96827, -108117, -81765, -26711, 9257, 5697, -105156, -183640, -214064, -196008, -159985, -186869, -109854, -7444, 53627, 159823, 72592, -13978, 86888, 178428, 78082, -96519, -77456, -66006, 29615, 65812, 49030, 35099, -59305, 2728, 84891, 84382, 110685, 134855, 104674, 87536, 44017, -2569, 37198, 70075, 72935, 23551, -10044, -1473, 38764, -34324]
10816c4324p5192o9071O4998K4847OR1204P3074l7773o3417j4039J0170r424j09395
10803a48336p6051K1622R2834l0522P4433L8642r185K4192K9253J9621j21932
10792h5429n2712k8250J220M9831L2727K9969p9073l0758L3838M0587J0223J05254
10780B7427Q8522p9044k3850J13224O9492O4501K13800K55661K62141M69521Q46609
10769B308004J427592J759231N98557j467509j856087j130577n21784l29996j93785
10760E93646j87916l8954o34J9910j31003n2385N804O9479M4170O701o2419o6291
10748B00108l9036p6487p0415p6265O4866m0452j15215M4917J00487k1568K6557
10737b503p237l7320l4870J05325l1843l0334P4390R6320P3174k2215o4918r5923
$$ y = [-34324, -109516, -178587, -113589, -88742, -88736, 2468, 75542, 37769, -25648, -39687, -29517, -38941, -148336, -224387, -202765, -109931, -140453, -66020, -27378, -36563, -12371, 16882, 36503, -85429, -138141, -166391, -165171, -115340, -82613, -52644, -131717, -162475, -128637, -88050, -77827, 27427, 115949, 36905, 13055, 126279, 195771, 260272, 474072, 729733, 991874, 1461395, 2308004, 3735596, 5494827, 6093384, 4625875, 2769788, 1639211, 1117427, 787431, 593646, 405730, 366776, 366142, 386052, 255049, 202664, 208468, 277947, 322117, 328818, 266399, 200108, 161072, 84585, 14170, -62095, 2771, -37681, -152896, -107979, -7492, -29060, -2503, -9740, -47060, -81930, 23395, -8448, -38782, 35608, 131928, 205102, 182887, 117969, 22046]
10725B2046J8922m8709n8847K0253k8526M8094M9517M14L507Q8063l0264o7197
10713A7273m7389n9779J599L6879M3939J29201k342p5873l3747N4380r7138m7581
10701h0578K3934m9265l8478p7372k3946R5511J4710m6705k0347j9002j263j9571
10689b42372K1293K8727J22476j3818r3393J05049J35737O161n4306J33029M7862
10678A96445n9827j15844q6010j7914J20126R1285n8431p7601j00610R269p860
10667a06972q964L493J07113R7258j4936n2635P823r2006J05858J53775o3584
10656A36223j31747n9710n4935o0189J07618J57787L8131j0398m0167O8886O0385
10645B11884k0547P060n9643j28106m7871M7863n7080l9525J47470J6045q2609
$$ y = [22046, 40968, -7741, -66588, -46335, -74861, -26767, 22750, 23164, 26671, 114734, 84470, 17273, -30116, -89895, -88296, -51417, -7478, 121723, 119381, 43508, 9761, 64141, -32997, -80578, -56644, -105909, -144387, -221759, -245705, -150194, -135484, -182189, -202536, -221538, -222801, -242372, -221079, -192352, -69876, -83694, -177087, -72038, 63699, 69860, 15554, 148583, 196445, 136618, 20774, -65236, -83150, 36976, 128261, 69830, -7771, -108381, -99112, -106972, -115936, -112443, -5330, 91928, 76992, 24357, 32180, -59826, 46032, 199807, 136223, 4476, -55234, -110169, -170358, -62740, 95047, 133178, 122780, 82613, 151499, 211884, 191337, 198397, 138754, 10648, -37223, 10640, -46440, -85965, 61505, 77550, -5059]
10634e059K6391M7196K1094j0908j10420k3185p8035j0132J7382N7543o0697l4256
10622a63086P9919N6112P0914R0163M8168m998l3704O6903q7497q9427q7587n9866
10610a13986N3190J913j3183N6782o2517K1369J08838O5718k4990j3135Q4089
10599A64088J8107p5294k6725q4271P2503N3456l3529k4764N8062Q105k1007R3894
10587B02625L6091k756n9413o6900n1978p1753r0084M5514P5889Q0155J8190j43289
10575b7709r0881J08445L2859O365J11652P4558j83881J47623J00768n7984O2393
10564B84208K4673j10622p0417k9512k3771l0587p968N2873L7498n5581m6622
10553B4172r4727N9388O6419L9310l8279j32326r1805M9776J39781Q4454l1505
$$ y = [-5059, 21332, 68528, 89622, 78714, -31706, -54891, -132926, -143058, -125676, -68133, -128830, -163086, -83167, -27055, 43859, 134022, 182190, 177192, 143488, 210391, 122894, 33467, -54120, -113986, -60796, -58883, -72066, -15284, -77801, -56432, 52406, 118124, 93134, 79999, 164088, 182195, 106901, 80176, -4095, 68408, 121864, 88335, 63571, 121633, 129738, 108731, 202625, 238716, 235960, 176547, 109647, 57669, -14084, -104168, -58654, 17235, 97390, 115580, -27709, -118590, -10145, 22714, 29079, 140731, 215289, 31408, 179031, 279799, 221815, 284208, 308881, 198259, 127842, 98330, 74559, 43972, 36004, 88877, 126375, 70794, 24172, -70555, -11167, 55252, 94562, 56283, -76043, -167848, -118072, 21709, 106163, 74658]
10542G4658k6608J3902N027L9344p3200j15043n7206j3824P6440J0617k0501J877
10530h4517k700K993L4036R6962J6301m3295j31195L3279J02432N0654L2122j19806
10518a2734j3503j9600M6223R4022k9191K3897J9878j4894O844p2173R257J3790
10506E1816k6718p1733L0889N933J15532j0221n1889K7567O9368j4157M543L0866
10494A61796l0553k0621L2137n9696M3383J2996L3505K0757j5550m2647j7229
10483A18278N8302O8545j17734r8775J26187J81795n7882P078j359j49730n1109
10472H3596p0071Q9266O0521j9346j15651p7883p0189j134J46466J96798M568
10461B26941o3209j2650O7853j5157j28178J2398N8505o2448j30220p374K307
$$ y = [74658, 48050, 61952, 66979, 106323, 33123, -81920, -139126, -152950, -76510, -65893, -86394, -84517, -87217, -84224, -50188, 46774, 63075, 19780, -111415, -78136, 24296, 74950, 107072, -12734, -26237, -45837, 386, 94408, 65217, 89114, 108992, 94098, 100942, 28769, 38026, 51816, 25098, -46635, -15746, -9813, 105719, 95498, 43609, 71176, 140544, 126387, 130930, 161796, 131243, 110622, 142759, 83063, 126446, 139442, 172947, 193704, 178154, 135507, 118278, 176580, 245125, 127391, 28616, 154803, 336598, 278716, 285794, 284435, 134705, 83596, 13525, 102791, 163312, 143966, 28315, -49568, -119757, -120891, 25575, 222373, 226941, 163732, 151082, 218935, 203778, 75600, 87998, 146503, 84055, -46165, -53539, -51232]
10450e1232J8420m308r633n2015K002J26946P2620n384l6069o8978l4109q022
10438d9762m0865J15332K4447r9619k0130Q5626J72525j506j18412p5315m9869
10427e7548j1531L5082J37316M0732q9745J82097L6329p5096J24099k8516p2542
10416B20677n9717o3902j45312o4354J51354p835j4898j7940o797q5336o4198
10405a58258n6166J40529Q5221j6629L7064o0965j7563k3835Q700N0529O3211
10394E1838J7232j04609j2746o4349j836L7165L7265J00382k1716p0468M4638
10383A2796P7033l1981O7773J27215M7213k1830o4404p6596o6208J6777m1574
10372D6214L9106M7248o4407j14583q4837L9822Q3713K4007j03005j1120J29105
$$ y = [-51232, -32812, -37120, -46753, -98768, -96766, 30180, 102800, 97416, 61347, -7631, -41740, -49762, -90627, 24705, 49152, -50467, -70597, 15029, 187554, 186048, 67636, -7679, -57548, -69079, -33997, 103319, 144051, 54306, 236403, 272732, 197636, 321735, 293219, 220677, 160960, 97058, -48254, -112608, 38746, 30911, 16013, -1927, -8724, -94060, -158258, -214424, -73895, 11326, -5303, 31761, -29204, -46767, -70602, -61902, -11373, 51838, 69070, -35539, -48285, -112634, -114470, -77305, -40040, 60342, 38626, -31842, 12796, 89829, 57848, 125621, 252836, 300049, 278219, 213815, 137219, 71011, 87788, 46214, 85320, 132568, 68161, -46422, -131259, -91437, -7724, 16283, -86722, -97842, 31263]
10361C1263J08444o2914j5532N8653m838p7813K6600Q8126M9813j5938j62365
10350B3499j18105O1148k4871m042J02952l3522m3360P6424O530q5570J26788
10339H7871J15283j25111j85458J3289J63192K5731K6284P7653o4935q031l5136
10328I0632l6900m5569P2308R9573j9978n1765l9551j7464m6671J3374K1962o680
10316C3271M0609o5375K0304K8610Q2565L7228J2159j9384K3749l570j05705j5854
10304F8607L834p8416o0639J07301M0591N4415J8965j41278q4906o952J13363
10293C4885N058K9217j1609L4033M4147o0949q0960k0744m9431j1054M5319K1364
10281b0724n942O9161M5927k5482j11273p3451P5322J61110O9593L088n9748p8834
$$ y = [31263, 139707, 76793, 61261, 119914, 115076, 37263, 63863, 151989, 201802, 185864, 23499, -94606, -33458, -58329, -62371, 40581, 7059, -36301, 40123, 46653, -38917, 87871, 203154, 78043, -107415, -94126, 69066, 94797, 121081, 198734, 133799, 125768, 90632, 53732, 8163, 80471, 180044, 160066, 108301, 68750, 51286, 4615, 17989, 39951, 33271, 73880, 8505, 28809, 57419, 139984, 177212, 189371, 169987, 193736, 190166, 84461, 68607, 72441, -5975, -66614, 40687, 81278, 135693, 154658, 13380, -71526, -78478, 34885, 39943, 69160, 57551, 91584, 135731, 74782, -6178, -26922, -76353, -87407, -42088, -20724, -26666, 42495, 88422, 62940, -48333, -121784, -46462, 114648, 184241, 187329, 127581, 48747]
10269D8747J5018o2270p4654R4802j2996p747L5574Q5141O9620l1114K2110L3801
10257B16032n2013o0536Q6637L2033Q138N0385j41300k6382j0306J5281J4252
10246A32221L0343j11535p942J66122o5149n3167j6126P5777L8374m5630R7930
10235B41218J03204J7565j61220j12160k4041P6730M899M4948l0923L5238N6245
10224B51703n5145q8397J3477K2399j2664p9673J5972o998N1195J03852J08142
10213C23863m7672j90292r5949O7150P8576j163l056m7986J6324N7798o2110n1919
10201D3564Q9672J9482l5965J8177L7339L5535q505n3743n941q1303k8462J0951
10189D0801k2730q366J8932l7029m5804J35688N1928O6603j33803p3531P846Q3156
$$ y = [48747, 63765, 1495, -73159, 21643, 8647, 900, 36474, 121615, 191235, 160121, 182231, 216032, 164019, 103483, 190120, 222153, 230291, 280676, 139376, 112994, 102688, 117969, 132221, 162564, 51029, 43087, 209209, 144060, 90893, 74767, 150544, 188918, 143288, 241218, 344422, 361987, 200767, 88607, 64566, 141296, 146195, 191143, 160220, 195458, 251703, 196558, 108161, 121638, 144037, 131373, 51700, 67672, 60674, 111869, 215721, 323863, 276191, 85899, -10050, 57100, 135676, 134513, 131457, 83471, 99795, 157593, 95483, 43564, 133236, 152718, 116753, 134930, 172269, 207804, 199299, 145556, 139615, 58312, 29850, 40801, 18071, 9705, 28637, -8392, -54196, 81492, 133420, 200023, 66220, -7311, 535, 83691]
10177H3691K3649J8532L1268K1322M5885L3744j7646m6977J678J4405j13943j47503
10165e1895k1890P0881L3863j7042N4618M0475k3080o2231L4933m9840j05481
10154i6689o8518O5055J09048J08957P7066m3063j13957P4871J24304N7807K0269
10143C15150j216N14j06274r7696r5695k0658J37882M8916n854P6023j2324n2823
10131A85945n081O9858k1643O5577J4213o5847m0605l6410m5432j686J8865m8468
10119H9286r0431N2616j5685J6390R0729q4081o7167P0918Q9416K528L114O3390
10107B21023j6124J3358J5818n5013M536M9884R5873K1125r6430K4020o1430j7094
10095A99546P7099L9288K5829r3232j08255k1241Q418M810k4831N2285K8865K0751
$$ y = [83691, 107340, 125872, 157140, 178462, 224347, 258091, 240445, 193468, 195146, 209551, 95608, -51895, -73785, -2904, 30959, 13917, 68535, 109010, 85930, 23699, 58632, 8792, -96689, -165207, -100152, 8896, 117853, 194919, 151856, 37899, 112770, 237074, 294881, 315150, 313934, 314448, 208174, 110478, 14783, -5875, 132007, 180923, 175069, 251092, 238768, 185945, 180864, 250722, 229079, 294656, 308869, 243022, 202417, 166007, 120575, 118889, 137754, 89286, -1145, 51471, 35786, 52176, 142905, 58824, -8343, 62575, 151991, 154519, 157633, 221023, 204899, 218257, 234075, 179062, 183598, 233482, 329355, 350480, 254050, 278070, 216640, 199546, 276645, 315933, 341762, 248530, 140275, 119034, 127452, 132262, 107431, 159716, 188581, 209332]
10083B09332l7566J40913L8094j31343n5859L6193n5358m3715n8777l6518P6694
10072H2090J41762R3258j01735o153l7769j68140n777R1788N820K856Q4938J10693
10060B93631O600L1021O6443k5452L3119J98746L81969O36530R55013J264544
10050C842164o0274j341652r84330n17944l16111r7829j12470n8179O202n292
10040C54285j0195j7586J4933k8138q1983R259M6685k2285l236k0827Q4259k5149
10028C00022j39543j00614L4550J13422J6186l3325j7902o9819Q6666P8032r265
10017B58410j17617r0490O82O0016O8491K9134m3076j18499M7594O864n4450R418
10005E6477J3357j6032J2560M1171R7207k2401L9498Q0525m4380k1315O8996o810
$$ y = [209332, 171766, 312679, 350773, 219430, 163571, 199764, 144406, 100691, 41914, 5396, 82090, 223852, 317110, 215375, 209222, 171453, 3313, -2464, 89324, 95144, 98000, 182938, 293631, 300231, 331252, 397695, 372243, 405362, 604108, 986077, 1622607, 2577620, 3842164, 3781890, 2440238, 1455908, 937964, 621853, 524024, 411554, 353375, 359577, 354285, 344090, 326504, 341437, 313299, 231316, 240575, 287260, 264975, 261739, 240912, 325171, 300022, 160479, 59865, 94415, 207837, 224023, 190698, 172796, 102977, 189643, 267675, 258410, 140793, 50303, 50985, 111001, 179492, 208626, 165550, 47051, 94645, 101509, 47059, 56477, 69834, 53802, 66362, 107533, 204740, 182339, 221837, 302362, 257982, 236667, 305663, 298853]
9993B98853M2984o4101q2043q6932N7994K16382m058j80578k7514k7677O9484
9982B12794m568o1726j8815n7673m0963M4119K7185k3196j5556M9663O0859K1829
9970A93952L6767p7123n0890N816l952m770P7519J7885n3650N0471J00134K7708
9958C19867q2921j03109P5279M7093r51j6385P5698k648j12718l5701M5006N5662
9946B64172j9139n2022k5049P8097M5941L9226j989J5258j3599M1159L1109n761
9934C97403K6143O8453J04820m5899K1078Q460R4044O4865k8450q7151o8047j25441
9922D30278j04137L5365o8382j0388M1094l2819j701o5547k2066m364N9142K8245
9910B84720j3061m8509N480M0565l824M2198o6088o5943N8937M2058m4969L3684
$$ y = [298853, 341837, 277736, 195693, 108761, 166755, 383137, 379079, 198501, 170987, 143310, 212794, 208226, 146500, 127685, 70012, 29049, 73168, 100353, 77157, 61601, 111264, 172123, 193952, 230719, 153596, 102706, 108522, 104570, 99800, 177319, 195204, 141554, 192025, 292159, 319867, 236946, 133837, 209116, 256209, 255258, 238873, 314571, 311923, 199205, 163504, 208510, 264172, 245033, 193011, 167962, 246059, 292000, 331226, 329237, 344495, 330896, 372055, 403164, 397403, 423546, 491999, 596819, 550920, 571998, 580458, 674502, 739367, 710917, 623766, 555719, 430278, 326141, 361506, 293124, 282736, 323830, 291011, 289310, 223763, 201697, 197333, 256475, 284720, 271659, 223150, 228630, 269195, 265371, 307569, 241481, 175538, 234475, 276533, 231564, 265248]
9898B65248J37599Q897O1212J11940N7522o2533n847l3882p06j10207o3560p8705
9886B86978m490L9831n9807q1426n2518J43081O0386k0138l683k502o6069l9736
9874A99907m1068L2226p139l5906O0784N5414k6639N635J1924J13645K7112R0266
9862D86161O5188p5344l6787N6277J13013j3059m61J6739r1627M3847M947p5557
9850D93337j15829m1181M4804j8565p5120k0794O8599O3067J0975J2297J7745
9839D39335l2299k7089M4545R8593m0664j2063j7457O1663j2135O4614J8597j15566
9827D70074r1601n3576O8175m335p3010n4489O5649Q0204p9569N5363J12813P344
9815E03042m9808n4131l651M4988q569Q9794o9494j6149M4626r3484j43799q1822
$$ y = [265248, 402847, 411744, 472956, 584896, 642418, 579885, 574038, 540156, 539450, 429243, 365683, 286978, 282488, 322319, 262512, 181086, 128568, 271649, 332035, 311897, 308214, 305712, 239643, 199907, 158839, 191065, 183926, 148020, 208804, 264218, 237579, 243214, 255138, 368783, 395895, 486161, 551349, 476005, 439218, 495495, 608508, 595449, 594988, 611727, 520100, 563947, 568894, 493337, 377508, 336327, 381131, 362566, 287446, 266652, 335251, 398318, 409293, 421590, 439335, 407036, 379947, 424492, 523085, 482421, 470358, 452901, 514564, 502429, 567043, 585640, 470074, 378473, 324897, 393072, 388737, 315727, 261238, 326887, 407091, 327522, 382885, 495698, 503042, 453234, 399103, 395452, 440440, 431871, 521665, 452171, 436022, 480648, 387164, 243365, 161543]
9803A61543N9533R5643O5752n6478p1559O5004L5672J6569K995k0939o9926j0881
9791B72928l7016K7193o0006J3575q186Q2069l6642m8480r675J9999J14417M9040
9779C79216o015o0949j1964k793K4706Q1483m0877J0039m390N9638J38150J03743
9767F69987j05061k8798P3784l0778q5377m2237q4305J9743M3445K758o483K7530
9755D54208l0145Q879P9476N553l4431m3955J02009M7550m7144l5935j25425m7393
9743C33247P2912j4049l7078N3969J49946M093j70232M0829M389j0175N1186r3969
9731C85068k3201j20586Q7845O0073n113K8365P8283J5989j8965p9841m5149J48776
9719E11544K0309o4503l0880K4088P9116L8016m4083j0160n7754o1386n5270o7677
$$ y = [161543, 221076, 316719, 382471, 325993, 254434, 319438, 355110, 371679, 374674, 353735, 283809, 272928, 235912, 263105, 203099, 216674, 208488, 290557, 253915, 205435, 195760, 215759, 330176, 379216, 373201, 312252, 300288, 297495, 322201, 403684, 362807, 372846, 368456, 428094, 566244, 669987, 564926, 536128, 609912, 579134, 493757, 451520, 367215, 386958, 430403, 433161, 426678, 454208, 424063, 432942, 512418, 517971, 483540, 439585, 541594, 589144, 542000, 506065, 380640, 333247, 406159, 392110, 355032, 409001, 558947, 563040, 392808, 433637, 438026, 427851, 479037, 385068, 361867, 241281, 329126, 389199, 384086, 412451, 490734, 506723, 487758, 407917, 362768, 511544, 531853, 467350, 436470, 460558, 539674, 577690, 533607, 523447, 465693, 404307, 349037, 281360]
9707B81360Q7779Q8842j2118l7622P252M0437O8287l1188q6964o3834N5521o5656
9695C32096r9956J05360N9913J0805k7864n2755o6197O2441J15397N9753j16889
9684C82104q4893J25823K1344l8297L0500R1107J5366m543q0966q9427n3382P2467
9672C87203K2505K0437p9553n4116J32064O8847M7111r0376n1630J8609O3883
9661D84984J3725k9388l7402N1659p858l7670l2525k2284n121L1565J00296J08978
9649F18959L9909p3306j34261r0944M3856P9064J1697K249N9486K6192q4191j45137
9637C53573o3194J4999R1591M3749K1290k711O6326q5037n2059Q1621M5086n292
9625E09942K9143q2760p3518k7795j8304q198O8590O494N9230J18896q0406j09594
$$ y = [281360, 369139, 457981, 445863, 408241, 415493, 455930, 524217, 493029, 406065, 342231, 397752, 332096, 232140, 337500, 397413, 408218, 380354, 327599, 261402, 323843, 439240, 498993, 382104, 297211, 423034, 444378, 406081, 436581, 527688, 543054, 538511, 457545, 368118, 314736, 387203, 409708, 430145, 350592, 296476, 428540, 497387, 544498, 454122, 402492, 421101, 484984, 498709, 469321, 431919, 483578, 475720, 438050, 405525, 383241, 378120, 409685, 509981, 618959, 658868, 585562, 451301, 360357, 404213, 483277, 494974, 497223, 556709, 582901, 498710, 353573, 290379, 305378, 396969, 440718, 462008, 459297, 525623, 440586, 388527, 470148, 515234, 509942, 539085, 456325, 382807, 355012, 336708, 328510, 397100, 403594, 462824, 581720, 501314, 391720]
9613C91720m3078M764n688r432J1307J4076n5751j4287J4792N1212l0955L557
9601C32237N0940J66378N5102j1665o3039l7885p3926p4432J4124J07269K1739
9590D86842J9271O7294j5382N5057l4478J7140j65087j19711M2049J31600P2272
9579E56867n7206M3215M9844o9493L211L2564k8868j02600N016j1368N5610L8291
9567E15083O3597r3157r4989j5019l0496j6714M8778M9129o7503j8948M7236j7245
9555C69752R8020J48031K124j67310L6768Q4873L4456j8167r2933l7942P7455
9544E35127L3961j3377p0533l6605P074j7058K188O5510J2463K2801M0729J9764
9532F02044L3446K2970J6414q9339j1880k9309j943n3192J5366K1707k9617Q8600
$$ y = [391720, 348642, 353406, 347718, 338286, 349593, 363669, 307918, 293631, 308423, 359635, 328680, 332237, 383177, 549555, 604657, 592992, 529953, 492068, 418142, 343710, 357834, 465103, 486842, 506113, 573407, 558025, 613082, 578604, 595744, 430657, 310946, 352995, 484595, 556867, 499661, 542876, 592720, 523227, 526438, 559002, 530134, 427534, 432550, 421182, 476792, 515083, 578680, 485523, 390534, 375515, 345019, 328305, 377083, 426212, 358709, 339761, 386997, 369752, 467772, 615803, 617927, 450617, 487385, 572258, 606714, 588547, 495614, 457672, 535127, 569088, 555711, 485178, 448573, 455647, 438589, 440777, 506287, 518750, 541551, 582280, 602044, 635490, 658460, 674874, 585535, 573655, 544346, 542403, 489211, 504577, 526284, 496667, 585267]
9520E85267m0083L3958Q9909o4509k09147m5669O4337J8833M0436O5699K3556
9509E62587J7086k4908o4482n3272p828L5533n2908R426L6604J18275l4726m1905
9497D99482m7530J652M8379k71J9279L1762L0732J0786O551q562K6079L5918K8024
9484F82281k3537m7838m4567L5783L2812O2194K1762l1731o4496n3479O1774N700
9472F36658K739m5974o0618q221N7245j9456r7321J1909O3345O4234L6375m2791
9460E98124r529Q770L9479o9509r6701n4530r250P0141L2027P8601r0417j54912
9448C42294J5408J7172k4568Q2967O6553M6479j16343N347Q4510o1279q460K0718
9436D70798P9488N6936l9488j28660j5695M8448N3881Q1675m374k1897o5370J5639
$$ y = [585267, 545184, 579142, 669051, 604542, 395395, 349726, 414063, 432896, 473332, 539031, 562587, 579673, 554765, 490283, 437011, 429183, 464716, 411808, 421234, 457838, 576113, 541387, 499482, 451952, 453604, 501983, 501712, 520991, 552753, 583485, 594271, 600822, 592260, 618339, 654257, 682281, 658744, 610906, 566339, 602122, 634934, 697128, 718890, 687159, 622663, 569184, 630958, 636658, 639397, 593423, 532805, 524584, 581829, 562373, 465052, 476961, 540306, 604540, 640915, 598124, 588595, 597365, 636844, 567335, 470634, 416104, 406854, 476995, 509022, 587623, 497206, 342294, 357702, 374874, 350306, 433273, 499826, 546305, 429962, 435309, 519819, 458540, 450080, 470798, 550286, 607222, 567734, 439074, 423379, 471827, 525708, 607383, 603009, 581112, 515742, 531381]
9424E31381O1309O8477J0395p0659r9198n2112J1345o6079n7495J6748O2432R164
9412D25708j00295m9323L0240K04426P9248p253p6341o3265J24301O5775M502
9401F37723K458k0240L3056k5465J01449L325j23128l399k7902n1213j0426j7668
9389D98570l106O7761M4079Q4648o3141p2018l0666o4846j1130Q5887R7200q3750
9377E49488j77935n4447J5828Q251L2697J44356Q2876O0796J1743r3755r3390
9366D86508j07615k7045M8225M4242Q2661J02039m7158r1276K0923l3571l7813
9355D40120K1675R595j01826o7020J15549R8478K0658l0788l1399k3203N357N8329
9343E15525o0428k6246M9824r8658Q8631J36413R3686j57141j09483n833J1679
$$ y = [531381, 592690, 661167, 671562, 600903, 501705, 449593, 460938, 394859, 337364, 354112, 416544, 425708, 325413, 276090, 306330, 510756, 590004, 582751, 506410, 443145, 567446, 633221, 637723, 640181, 619941, 652997, 627532, 728981, 732306, 609178, 605779, 577877, 526664, 516238, 498570, 495464, 563225, 607304, 691952, 628811, 556793, 526127, 461281, 450151, 536038, 633238, 549488, 371553, 317106, 332934, 341185, 373882, 518238, 601114, 661910, 673653, 579898, 486508, 378893, 351848, 400073, 444315, 526976, 629015, 581857, 490581, 511504, 477933, 440120, 461795, 471390, 369564, 302544, 418093, 516571, 537229, 506441, 475042, 451839, 457196, 515525, 455097, 428851, 478675, 380017, 468648, 605061, 698747, 541606, 432123, 426290, 437969]
9332D37969M9457K7859p5287j8191k7045M0159n844M4920k2017j09574Q9865Q3695
9320E15966J7930R622N3099j05750j0741P1846L8316O1547j55340q1217J51321
9309E66599j2450n3092m5240j7695k460m6002j2523N2580M2787L1347n9092o0547
9297C84212n666n5616n3087n5485Q5358J14246J21498R3152k7888O1062n0115
9286F11671j95226o6599M8857m5207n76M6781p89O5618L7785n7017n0490k6723
9274C68085O9962K0999n0408k6128n2101N6162j8317j15353J03675J90428K4954
9263E71958m4948l8794m9334P6424P3092J40235j27732j24790n5208n2420J04016
9252D72499J39924j5503m5922O9290q7472j96521j36022O2282J05984M6754k0666
$$ y = [437969, 487426, 515285, 439998, 421807, 394762, 434921, 429077, 473997, 451980, 342406, 432271, 515966, 533896, 543518, 596617, 490867, 480126, 551972, 590288, 651835, 496495, 415278, 566599, 554149, 501057, 455817, 438122, 435662, 389660, 377137, 429717, 472504, 503851, 444759, 384212, 378546, 322930, 269843, 214358, 299716, 413962, 535460, 628612, 600724, 661786, 611671, 416445, 349846, 398703, 353496, 352920, 399701, 398912, 464530, 502315, 445298, 394808, 368085, 438047, 459046, 408638, 382510, 330409, 386571, 368254, 252901, 356576, 547004, 571958, 527010, 488216, 438882, 515306, 588398, 728633, 600901, 476111, 420903, 368483, 472499, 612423, 596920, 550998, 620288, 532816, 336295, 200273, 262555, 368539, 415293, 394627]
9241C94627K2812J02657P8955l5086q9907j45624m6784J03232K5534j8454j747
9230C90215L1744J17263p815q4038l9497J07214O4460R4159j09376p5334m3748
9219D45247r693L2116o452L2903l9267j5739j8877p4810r4640M6489O4112J04996
9207D66385l6664L8254J8454p2972Q9647K8844M471O9563R5084N3624j2461j22568
9195F19661o5525o771j35337q3388J16250j9715O4655K5880o3572M4981j7558
9184D79561m9311L2524M9353m4869p9311k8756K2875Q1691L026K2642o499j1619
9172D71307j845p3446l5064n9937J06565K8514l7177J9898j8750j6606L0426j12661
9160C01224k391M1589J9468m7039p2344j19671j969J59683J56849p9374m8047
$$ y = [394627, 417439, 520096, 599051, 563965, 474058, 328434, 281650, 384882, 410416, 391962, 390215, 421959, 539222, 531407, 447369, 407872, 515086, 579546, 673705, 564329, 488995, 445247, 435554, 467670, 461218, 494121, 454854, 439115, 420238, 345428, 250788, 297277, 361389, 466385, 429721, 467975, 486429, 413457, 503104, 531948, 536419, 605982, 701066, 754690, 742229, 619661, 554136, 547365, 412028, 328640, 444890, 425175, 489830, 515710, 452138, 497119, 479561, 430250, 462774, 512127, 467258, 387947, 359191, 382066, 463757, 466783, 489425, 482926, 471307, 469462, 396016, 360952, 301015, 407580, 436094, 398917, 418815, 400065, 383459, 413885, 301224, 298833, 340422, 359890, 312851, 240507, 120836, 118867, 278550, 435399, 356025, 307978]
9149C07978k2103p8289m0873L790Q2791J38392l1448k5549L5786Q6131j3035N7844
9137E01415K840k7597r8900r8058m5383L3905R9546m6125j28318l578J10227k0519
9125B79455l3831L6717P0866P6692l79j00238J28204K2942j73968p5466k6781
9114B04213k2507P726K9963J03492J1441l4027M5520L4656J06444m3424k37022
9103B06475l9081p2715M8664J38026J2745k9075J23374k9649j28307k4347j395
9092B04715J10188J02965r29o1287j17476J9771L6443N87J12711R524j60098N781
9080B62895R135J3541P0097p5185j06440J44334K0290L5375Q7060o3236r8997
9069B98869j33964j3578j1690P5953R2921L0710M2455Q759M0192P605n3632p7865
$$ y = [307978, 285875, 207586, 166713, 170503, 253294, 391686, 360238, 334689, 370475, 456606, 443571, 501415, 504255, 476658, 377758, 279700, 234317, 268222, 367768, 321643, 193325, 189747, 299974, 279455, 245624, 282341, 353207, 429899, 429520, 329282, 457486, 480428, 306460, 230994, 204213, 181706, 189432, 219395, 322887, 334328, 300301, 345821, 380477, 486921, 443497, 206475, 167394, 94679, 143343, 281369, 294114, 265039, 388413, 358764, 230457, 206110, 204715, 314903, 417868, 416939, 355652, 238176, 257947, 294390, 294977, 407688, 417212, 257114, 262895, 272030, 285571, 355668, 280483, 174043, 318377, 338667, 374042, 461102, 397866, 298869, 164905, 151327, 139637, 215590, 308511, 339221, 381676, 390435, 430627, 438232, 384600, 306735]
9057C06735k4850R1694N5724m1020l2924j6360j04472p3893J03013R9954K5444
9046C89045l7433m5896N1958j71102m4077k3354j2831J6817R1445j7958j9765
9035A76849N7321L8480K8361J22834P1389K2009q8633q5328k6987m5577K4026
9024B94744K9666O4916p3561n3401j06464j08122O9349O4140l4722k1945K8510
9013A53110n7758m603J78811p9404r2218r460M0250J17412p6259K177R6494q5435
9001A83117j05727k250J1034N8845l7924m5944J54654K6967l9388M1151l8277
8990B06258n6000m9695K4608k684P7461k2382L6585J2705n2485O9741J4833j5528
8978B43417n9068o8327m3520r0580Q8423J15805l7336j4643L2294N0765k7046
$$ y = [306735, 281885, 373579, 429303, 388283, 355359, 338999, 234527, 160634, 263647, 363601, 389045, 351612, 305716, 357674, 186572, 142495, 119141, 106310, 123127, 214572, 196614, 176849, 234170, 272650, 301011, 423845, 495234, 517243, 428610, 343282, 316295, 270718, 294744, 324410, 389326, 315765, 262364, 155900, 47778, 117127, 181267, 146545, 124600, 153110, 95352, 90749, 269560, 190156, 97938, 88478, 128728, 246140, 169881, 172058, 268552, 183117, 77390, 75140, 86174, 145019, 107095, 61151, 215805, 242772, 203384, 244535, 206258, 150258, 100563, 125171, 122487, 199948, 177566, 214151, 226856, 174371, 244112, 258945, 243417, 184349, 116022, 72502, -18078, 70345, 186150, 148814, 134171, 166465, 217230, 190184]
8967A90184k2890O2640J278j10732l3817Q2487P1190L1929r1852l3751M3841l4414
8955A56093l3127K5638m7120k0127P1433J5617J42627q746M6927k1227j5393j55557
8943A57038j16418J08937N4244j29958J0769L4537k8354L4741O5652l9262K0139
8932A72065l2946m9902Q3820K3828P1541K7682m3539m4123p5775j0101n11j5356
8920A06683J01016P7585N291J22750o1709j32290k0165j10223j08273P2828P024
8909F0517O9836J26142j9992K7401n1643j6666Q2741L1960L1961q3864r102L7219
8897B86510J7405j2251q1231j04l6301j21917L3559J44035O7681q496n8506n5901
8885A74483j12096j04721M0884Q3734k4436K4816L5743O4562J5511n3007m297
$$ y = [190184, 167294, 229934, 231212, 120480, 86663, 169150, 240340, 272269, 180417, 146666, 190507, 156093, 122966, 148604, 101484, 81357, 152790, 168407, 311034, 302288, 349215, 327988, 312595, 157038, 40620, 149557, 203801, 73843, 84612, 119149, 90795, 125536, 191188, 151926, 172065, 139119, 89217, 173037, 196865, 268406, 296088, 252549, 208426, 132651, 122550, 122039, 106683, 207699, 285284, 290575, 413325, 351616, 219326, 199161, 88938, -19335, 53493, 60517, 130353, 256495, 236503, 263904, 212261, 195595, 278336, 310296, 342257, 258393, 249291, 286510, 303915, 291664, 210433, 210329, 174028, 52111, 85670, 229705, 297386, 288890, 230384, 174483, 62387, -42334, -1450, 82284, 57848, 82664, 118407, 182969, 198480, 145473, 141176]
8874A41176L9106P3796L3298j3553O026M5310j5147R962R257n1823n5175n3288
8862A68945P9277J5023j6545r4952R931O2216l8428p2860L1507j7310K7005N4805
8850B08614o296j68054K5504j4134m9065K4912J06199P6163J00516O6048M601
8839C75008j04359n4918O1293Q2720R8987o7380n5372j10059j1231p9288o6604
8828F8797L3767L5246M2514p370j3771P7238n5490q2192j3725R6902Q9233J00196
8816C71345m8938j51248p9210q7738r967M0107J62456J8594j22611P881P4811
8805A75482j5585k589K1801M66M9499J30882J06945m4421l5724q1347j70678j35526
8793g95k6928j2091Q5006J17013L6935M1955j2401j164R610m2680p9549l9104
$$ y = [141176, 180282, 254078, 287376, 273823, 279849, 325159, 310012, 319974, 329231, 277408, 222233, 168945, 248222, 263245, 246700, 151748, 161679, 223895, 185467, 112607, 144114, 126804, 153809, 208614, 202318, 34264, 59768, 45634, -3431, 21481, 127680, 203843, 304359, 370407, 375008, 270649, 215731, 277024, 359744, 458731, 391351, 335979, 225920, 214689, 135401, 68797, 102564, 137810, 180324, 172954, 159183, 236421, 180931, 98739, 85014, 181916, 271149, 371345, 322407, 171159, 91949, 4211, -5756, 34351, 196807, 215401, 92790, 100671, 175482, 159897, 157308, 179109, 179575, 229074, 359956, 466901, 422480, 386756, 305409, 134731, -795, -27723, -39814, 45192, 162205, 199140, 241095, 228694, 227530, 237140, 194460, 114911, 75807]
8781G5807o095J16629J7053p6300K0459P1623K2451J4425R4130j6502o8091O1792
8769C27381j26660o7241p6721r734K28212M9413l9305K9201r553l311n1037j51688
8757I8957o9726L0377J8554L273L5187N2962j0746J6440l4773r204p4107m9935
8745G259K3248O6998J42787m9901J6022P6621o4046J5039n3162L6404J05850O8534
8733C91653p1864j60098M4117M4210J32566J8329j9177L9558j8769l4394o6796
8722B99335n4553o092q9175j23711q2265O4078R2042K1688P6292Q9171n8004j79167
8710D9639q53R4676R0065K4190p947L8157J9801n818j06740j62294Q690J07304
8698A48870Q8106n8180P2024k2468o3350o869q0253O8377J08616k5460p9842M321
$$ y = [75807, 69712, 186341, 203394, 127094, 147553, 219176, 241627, 256052, 350182, 333680, 265589, 327381, 200721, 133480, 56759, 47025, 275237, 324650, 285345, 314546, 304993, 301682, 250645, 98957, 29231, 59608, 78162, 81435, 116622, 169584, 158838, 175278, 140505, 131301, 57194, 7259, 30507, 97505, 240292, 190391, 206413, 283034, 218988, 234027, 180865, 217269, 323119, 391653, 319789, 159691, 203808, 248018, 380584, 398913, 379736, 419294, 400525, 366131, 299335, 244782, 238690, 149515, 25804, -56461, 7617, 99659, 121347, 197639, 286810, 228806, 49639, 48786, 143462, 233527, 257717, 249770, 287927, 307728, 301910, 195170, 32876, 41566, 148870, 236976, 178796, 250820, 228352, 165002, 158133, 77880, 146257, 254873, 229413, 149571, 153892]
8686A53892j1134n4515j7363O2325J2395j5412j7176o5489k2890L8525J1462l2577
8674D2043m4957N3807M9095N5899O5682m9979n1424l2198k1899j4222J47105O0156
8662B59108J2298J5429j7043m1477n883q3632o7440r3751P792J9462J4243L0284
8650D9390P2800M4283O6351o6100k8700J54146p0735o7817Q6171M1775k8813J1228
8638B63979m5260K1876L9246M3204o0074j82931p5817N5361M6283P1283k833J5015
8626A89332R2262J0826k9480j06989n3790j0264P4717P7705R986M318N1272m2076
8614B67819l3579k3715J05431k2684q1992L3823P5970N9477K1819N2829N6659
8603E11857j0098l8979K7946J16222N9082n0554r0882m505Q148j03720m0960Q000
$$ y = [153892, 142758, 88243, 70880, 133205, 145600, 130188, 113012, 47523, 24633, 63158, 74620, 42043, -2914, 50893, 99988, 155887, 221569, 171590, 120166, 87968, 66069, 51847, 198952, 259108, 271406, 286835, 269792, 228315, 222432, 138800, 71360, -22391, -14599, 4863, 19106, 49390, 122190, 166473, 232824, 166724, 138024, 292170, 221435, 153618, 239789, 281564, 252751, 263979, 218719, 240595, 279841, 323045, 262971, 80040, 4223, 59584, 105867, 177150, 174317, 189332, 281594, 292420, 262940, 155951, 102161, 91897, 166614, 244319, 254305, 258623, 309895, 267819, 234240, 210525, 315956, 293272, 211280, 245103, 321073, 380550, 402369, 455198, 511857, 501759, 462780, 490726, 606948, 666030, 615476, 524594, 520089, 528237, 424517, 383557, 391557]
8591C91557p6670n9870j18231K1029J00687K5557k1479k2718q7002n0181M6472
8580A49151j331m9594N5895O6418O3251m3201o2922j5479L4188J32930J9266j47519
8568B01053r5061K347L638N7969K7713j23218j43432L465Q1000N9191q234M2222
8556A08653O500P1002j8453K3641j9301J6006J3201n0156j4319l8168l6526J2597
8544G4677K4713N2836m7647j9470O3785P945p1271J6477J01039j7881j4932p9893
8532I0378j40634m0551K9148P9291l8259m6970O8365R8307J2781n3010L2081K1187
8520A12114o4390j6871N5322K6125K4603n4567M0676l0194L1289m7767l2586L0295
8508G4049K4925J4864N6059N8316l5983j06373q4272L3838O1717o0663N4515n6139
$$ y = [391557, 314887, 255017, 136786, 157815, 258502, 284059, 262580, 239862, 152860, 102679, 149151, 147820, 98226, 154121, 220539, 283790, 240589, 177667, 162188, 196376, 329306, 348572, 201053, 105992, 108339, 111977, 169946, 197659, 74441, -68991, -65526, 15474, 74665, 66431, 108653, 115153, 186155, 167702, 191343, 172042, 188048, 201249, 151093, 136774, 98606, 62080, 74677, 99390, 152226, 104579, 85109, 148894, 156839, 85568, 102045, 203084, 185203, 170271, 90378, -50256, -90807, -61659, 17632, -20627, -67597, 768, 99075, 111856, 58846, 90927, 112114, 47724, 30853, 86175, 112300, 136903, 82336, 123012, 92818, 124107, 76340, 43754, 74049, 98974, 113838, 169897, 228213, 192230, 85857, 1585, 35423, 97140, 36477, 90992, 34853]
8496C4853q2723J9668K3350L1705M6190L159r9794r1276l4214J8553J3419J10957
8484f153L0583j22862o2263K0741J02299M005J34537O2719n7939O889P2323L8926
8472B23805l8680j2687N2515m0082r1878k2057L2992J3782O3288o9090q1999k2876
8460G033R4853J52528q9859p7133n0825m3833Q1988J5560m8542M9903L3250o6081
8448E8842k1578k3536L99k2650J15799L9826N8669j40196j51390m9824O1811O2378
8436a1450O0035P5028J3743N2635n1196o7504l8258K837L8957n7313p2735N4108
8424a113J28427l1786j03901l777l5504O0647O0345j6246j7983O9538O2349o7602
8412A03394K6278J0096O853n1338Q3480l3824o7642m0396K5217J666m8943k8913
$$ y = [34853, -47870, -28202, -4852, 26853, 73043, 76202, -23592, -114868, -149082, -130529, -117110, -6153, 24430, -98432, -160695, -139954, -37655, -33650, 100887, 163606, 105667, 112556, 184879, 223805, 185125, 172438, 224953, 184871, 92993, 70936, 103928, 117710, 180998, 111908, 29909, 7033, 101886, 254414, 164555, 87422, 36597, -7236, 74752, 90312, 41770, 91673, 124923, 58842, 37264, 13728, 14127, -8523, 107276, 147102, 205771, 65575, -85815, -135639, -73828, -11450, 48585, 123613, 137356, 189991, 138795, 71291, 33033, 35870, 74827, 17514, -55221, -1113, 127314, 95528, -8373, -12150, -47654, 12993, 73338, 57092, 39109, 108647, 170996, 103394, 129672, 139768, 146621, 95283, 178763, 144939, 77297, 36901, 62118, 63784, 14841, -14072]
8400a4072j2711J5708P3849L6063q6537k5901O3513J2947j4929R7843m6925j06038
8388g190N642J42230K0672j45221L4659K52639J4797j54957o2689j32618n4128
8377h6164O7001M0465k3166P3501J21791N2458j27186r7741Q441p193O351r9563
8365g1005k4117M7681L7784M0348l5193m6049q7923r069L5746J22028P6090L9548
8353A25869J03483O7334K0110p7211m6930o2890k6099K1322l1058p979q1550p2189
8341f7788J4263N4291M6614N1080j634J01943m3602k7848n7204j4896O0205R3157
8329B08581o8899K2120j6481J3588j07778j9933O90K9706M1001K68j415K3923
8317A25371q0051o8099L6127K5877Q2298O7347k0991j11028j40106p2620l1873
$$ y = [-14072, -26783, -11075, 62774, 98837, 12300, -13601, 49912, 62859, 47930, 145773, 98848, -7190, -1548, 140682, 161354, 16133, 50792, 303431, 318228, 163271, 100582, -32036, -86164, -19163, 21302, -1864, 71637, 193428, 245886, 118700, 20959, 29400, 22207, 28558, -71005, -95122, -47441, -9657, 30691, -4502, -50551, -138474, -147543, -111797, 10231, 86321, 125869, 229352, 296686, 316796, 239585, 192655, 129765, 103666, 124988, 93930, 85951, 4401, -67788, -53525, 766, 47380, 98460, 96826, 198769, 155167, 127319, 70115, 55219, 115424, 208581, 139682, 161802, 145321, 158909, 51131, 31198, 31888, 61594, 102595, 102863, 101448, 125371, 45320, -22779, 13348, 39225, 121523, 188870, 167879, 56851, -83255, -155875, -187748]
8306a87748K6304O5323N0184O7322J1592j18869P1695N3265R1758j14294l1627
8295a5095m3292m7349J08038Q5117r0331q8447m7254j5552j06787L0736R6571
8284a33645N6892J754O7489P8484R253L7439p6598j42697j8208P9475O8302k817
8272B5123n2114P8959N556j12097o7145R1463J6344o9973m7466l7188O6592J20009
8260A8063n3526n4001n3190l9479m7457N3686J89076N5727j23683l2808N7367
8249c0225J4670K1120j02512m3971Q2692L6090K2905L5841Q5672p8555m2135L668
8237E260k5944N7146J34958q4653j8759M253j4033o1766k8894Q3607M609Q3539
8225A39323Q971P1264O0422l3635O8996K0148M4885j87845p2493q8321R153K7220
$$ y = [-187748, -161444, -96121, -45937, 21385, 32977, -85892, -14197, 39068, 130826, 16532, -15095, -58387, -105736, 2302, 87419, -2912, -91359, -138613, -154165, -260952, -230216, -133645, -76753, -74999, -7510, 70974, 80227, 117666, 41068, -101629, -119837, -40362, 27940, 25123, -26991, 51968, 57524, -54573, -121718, -30255, -13911, -83884, -131350, -168538, -101946, 18063, -35463, -89464, -142654, -182133, -229590, -175904, 13172, 68899, -54784, -87592, -30225, -15555, 5565, -96947, -140918, -58226, -22136, 769, 36610, 122282, 43727, 1592, 5260, -20684, 36462, 171420, 86767, 68008, 72261, 58228, -3538, -32432, 51175, 55784, 139323, 148294, 219558, 279980, 246345, 315341, 335489, 380374, 192529, 120036, 31715, 40868, 68088]
8213F8088l9153J750l1063j7927N0681p066m1553j6978l6106P6337J52368k335
8201A57043r6500o7849k0392k2468o5652M645R0385m498L3069p9335L5069J2332
8189b4151k384L6412J07664K6123n0367j03775q5628K0603l4736L5293J4495j18601
8177a79052n5993P6209L8267l5977j9171P6700R5078M1177J9530j25829k2053
8166i1114J2748j2435j9957M8403L3204L7615J30472j4491j05968M9256K6190
8155I3923p9016p3442p023J5861Q3926j1497j29761K2212L8161l6394j5015J8690
8143g9375R4552l656o236k9197K5L6973J6145Q2515j0936o054m8774j23795p5353
8130a53166O1642J70414P391m7120m4718r4249P2158J01447j6935o4562m9784
$$ y = [68088, 28935, 30685, -378, -18305, 32376, 25310, -16243, -33221, -69327, 7010, 159378, 157043, 60543, -7306, -27698, -50166, -115818, -111173, -20788, -25286, 7783, -71552, -36483, -24151, -26535, 9877, 117541, 143664, 93297, -10478, -96106, -75503, -110239, -74946, -60451, -179052, -235045, -158836, -120569, -156546, -175717, -99017, -3939, 37238, 56768, -69061, -91114, -78366, -90801, -110758, -62355, -29151, 8464, 138936, 124445, 18477, 67733, 93923, 14907, -58535, -65558, -49697, 34229, 22732, -107029, -84817, -46656, -83050, -98065, -79375, 15177, 11521, 5285, -23912, -23887, 13086, 29231, 111746, 100810, 94756, 45982, -77813, -153166, -91524, 78890, 86281, 39161, -5557, -99806, -27648, 73799, 56864, -7698, -57482]
8119e7482J2660K778j0702l9779r051J8176M3232M988R4855O335k5929k6449L8847
8106E2479L9211M1556M4518R306j83831l9782j7975N9530L0664k8115n553R530
8094A1538K0212p4783k8499J8404J00524J45988j6419o5610j10464p9288J12570
8083C4173k6290m1798Q0650J4218J5667Q2061R233j62796j02711O8380L2087R9899
8071A02773M8833o216j2218j13096n2789j30217k1388O2294J49211O9374m3491
8060E3070q1407j01110j29041P1428J09424k9466P8911Q9546L298j09328o5227
8049a09902N2038j1844o0378r9746Q9921J18194q3973N2916M173j5909J24825
8038F0315N0901l2999j24719J8402k502N8245J3351q1330q94L1105o6136Q8522
$$ y = [-57482, -44822, -42044, -52746, -92525, -101576, -83400, -40168, -35180, 59675, 66010, 40081, 13632, 52479, 91690, 133246, 177764, 187070, 3239, -36543, -54518, 5012, 35676, 7561, 2008, 11538, 31750, -43033, -71532, -53128, 47396, 193384, 176965, 111355, 891, -78397, 34173, 7883, -33915, 46735, 60953, 76620, 158681, 167914, 5118, -97593, -29213, 2874, 102773, 151606, 145390, 133172, 20076, -32713, -162930, -184318, -122024, 27187, 96561, 53070, -28337, -129447, -258488, -187060, -77636, -107102, -28191, 61355, 64653, -44675, -109902, -57864, -69708, -130086, -229832, -139911, -21717, -105690, -52774, -48601, -64510, 60315, 111216, 78217, -46502, -28100, -30602, 27643, 40994, -40336, -41230, -10125, -76261, 12261]
8026A2261j1054p2501O692O0048L0708l0633J0130m0086o0391k8955M2776L9158
8014d1847J8239r451k3833J14456R6033J0035L679O8293Q4484Q030L4919r2395
8002B70642j77162j8972O5914p1629k9988n8973Q0582P8869l5899q6189Q3292
7991A00487P8158J08237k7487j8131k1385M424p2017j04190j41655p397J79377
7980G8421J26381l5186n8514l9768J7989m8934R8363J00592J00460j08887l0487
7969B00430K9981j0720o7836j1051o567r325J12135L4424l6230m5616p1043q1940
7957C6642K6673R0221J274M0530n6034p9661q4710o856M9944Q6009j58131K14
7945e3885J01183Q641q2453K5803M7241r8227n7697R4783M3294j2153o7822L5250
$$ y = [12261, 1207, -71294, -64602, -4554, 26154, -4479, 5651, -34435, -94826, -123781, -81005, -41847, -23608, -33059, -56892, 57564, 153597, 163632, 167311, 235604, 320088, 328118, 363037, 270642, 93480, 74508, 140422, 68793, 38805, -20168, 60414, 139283, 103384, 17195, 100487, 178645, 286882, 259395, 241264, 219879, 224303, 152286, 48096, -93559, -100956, 78421, 204802, 169616, 111102, 71334, 89323, 40389, 138752, 239344, 339804, 230917, 200430, 230411, 219691, 151855, 140804, 134237, 124912, 237047, 271471, 235241, 189625, 118582, 36642, 63315, 153536, 154810, 195340, 139306, 59645, -25065, -31921, 18023, 104032, -54099, -53885, 47298, 55939, -26514, -711, 46530, -51697, -109394, -14611, 28683, 16530, -51292, -16042]
7933a6042r5110J9192O7026J07562J02584m8320l3660j0891k3N6558J11357K32
7921B60465r3453l5684j5221k5233L2643o9364p1376J7183o289J6615L051L6389
7909D9726j2230J6847P9744m0643L0874Q0019M7898l468r2475j39472k5758J1350
7897B412m4216R407N2102N2535o3107k2125j8168r893M7107L9309k8818P59J16426
7884A33730K959M111j4851Q8087J9604n6788o2953m0099l6245o8639k9461N2687
7872g858j8494l049R45j46650R5286R9756L0968l9220J1973L0128K0160j14569
7860d0624k784Q1744l4806l3989K871j2913J7493O1563Q08P1051N1875N434k0350
7847A47373m3535p244N2840m7539j09130K2597N8229m822j66801j897J25089J31680
$$ y = [-16042, -111152, -91960, -24934, 82628, 185212, 136892, 103232, 92341, 92318, 148876, 260233, 260465, 167012, 131328, 116107, 90874, 123517, 54153, -17223, -40, -6329, 10286, 13337, 49726, 37496, 54343, 134087, 93444, 124318, 204337, 252235, 248767, 156292, 16820, -8938, 2412, -41804, -32397, 19705, 72240, 9133, -12992, -31160, -41053, 6054, 45363, 16545, 17304, 133730, 136689, 140800, 125949, 214036, 233640, 176852, 113899, 73800, 37555, -31084, -60545, -7858, -26352, -29401, -28456, -175106, -79820, 19936, 50904, 11684, 23657, 53785, 73945, -40624, -43408, 38336, 3530, -30459, -27588, -40501, -23008, 38555, 39363, 110414, 162289, 167723, 147373, 103838, 96594, 149434, 101895, -7235, 15362, 73591, 68769, -98032, -99929, 25160, 156840]
7835A56840q9133j02604j29J26373m5684n9942O2793o3415L5556M3366n0461o7403
7823e3843K5251P9109r593m5291m5589p0680L7832O1885P118p5188K1426J699
7811f5864n7485R135R386J5272L5634Q4919k6704n7478N0015J2425p3933o6108
7799a30786L5581J9753L3987L7308J9569o444J00499P1656l17p1262r1087m4484
7787b6027K9777L1635N4521M6620q5448j25000m0404J0442J16445O7194l9896
7776C9859M4397L9811m1052l4287Q1580k7441j02726J1908N4553M1903K682q9516
7764B1671n9204n3072k8969M965m2984K0543o4827N1166L866O031M1534K6981
7752g2299M8760k5149p1580P4751O4287o7067K1004K1411r882J05196L1111j12070
$$ y = [156840, 67707, -34897, -35026, 91347, 45663, -14279, 48514, -14901, 20655, 64021, 13560, -53843, -28592, 50517, 40924, -4367, -49956, -120636, -82804, -20919, -13801, -88989, -67563, -65864, -123349, -114214, -104828, -89556, -53922, 30997, 4293, -53185, -3170, 9255, -64678, -130786, -95205, -75452, -41465, -4157, 15412, 8968, 109467, 181123, 180806, 109544, 18457, -26027, 3750, 35385, 89906, 136526, 51078, -73922, -114326, -103884, 12561, 79755, 39859, 84256, 124067, 83015, 48728, 130308, 102867, 141, 12049, 66602, 108505, 111187, 21671, -37533, -90605, -119574, -114609, -157593, -137050, -201877, -150711, -146845, -140814, -99280, -72299, -23539, -48688, -120268, -45517, 18770, -48297, -27293, -5882, -15764, 89432, 120543, 8473]
7740H473k13176k6292Q4598K33584J5403r6375n3685l7235L164l3185L1822N5319
7728b7585Q4900m0145P3410P4938j02537j10871m1713n164o89J7942J0676k8262
7716i5100q2562n9901L4574K4528K6817m412Q039M482j9345J28500J0588R972
7704a3820N4833m2738j05186r5066P1584j5684K1428P2512o4128n1978k2060M9962
7692a40341n753k5538K1566k1789o1646L6596L7008M4728l397k7505j00118P6336
7680a69853N1465N5017J03995L3892p5595o7796M1568P9906M1911n1254j60398
7669a17142k6374R9459r985Q2143k3729j06429p6921O1658J27766j2097l4182
7658c5833n5802o6583M2741J3808L6114k3793o8548Q5174J11176J23l7224m6998
$$ y = [8473, -204703, -230995, -146397, 87187, 102590, 6215, -47470, -84705, -81541, -114726, -82904, -27585, 57315, 17170, 90580, 165518, 62981, -47890, -89603, -94767, -95456, -77514, -66838, -95100, -177662, -237563, -202989, -178461, -151644, -156056, -148017, -143535, -162880, -34380, -23792, -13820, 41013, -1725, -106911, -201977, -130393, -146077, -124649, -52137, -116265, -168243, -190303, -140341, -146094, -171632, -150066, -171855, -233501, -196905, -159897, -115169, -118566, -146071, -246189, -169853, -118388, -63371, 40624, 74516, -1079, -68875, -27307, 52599, 94510, 43256, -117142, -143516, -44057, -54042, 28101, 4372, -102057, -178978, -117320, 10446, -1651, -35833, -91635, -158218, -115477, -101669, -65555, -89348, -157896, -72722, 38454, 38577, 1353, -45645]
7646d5645m774m8301K7786L2161o7895m8738k0153L0250M1393p6439k9124R6924
7634a12555K2675J38731O4477p5981n6172L5606k7618N5653j2922m0105o6957
7623g5168J8851O3013n8190K696j396o1327Q1009M3258o4748l7551q3743N0773
7611a22523L2464l3534K2282J32210O9578o0195K2471R9252L9418j8805j7006
7600A65612K0748l2842n684n2258N5219L0085p4284q8224j6218P9424K8579L880
7588A14037J10532P9000q2085j27015n1667k3199l9676n4020r1444m66m3317J58457
7576e0863M4935N0224n1192j11292M7906L6501M7679J2718N5296j0466M882K697
7564G9025r5957l4264q2332L7966P1808m4783j6545m097Q3423J24695J9985n0342
$$ y = [-45645, -50419, -98720, -70934, -38773, -106668, -155406, -175559, -145309, -103916, -180355, -209479, -112555, -89880, 48851, 113328, 37347, -18825, 16781, -10837, 44816, 31894, -8211, -75168, -56317, 6696, -51494, -48798, -50194, -111521, -30512, 12746, -52002, -89553, -173296, -122523, -90059, -123593, -101311, 30899, 100477, 40282, 62753, 162005, 201423, 182618, 165612, 186360, 153518, 147834, 95576, 150795, 180880, 106596, 18372, 2154, 81578, 110157, 114037, 224569, 303569, 221484, 94469, 42802, 19603, -20073, -74093, -165537, -166003, -209320, -50863, -5928, 44296, -6896, -118188, -70282, -33781, 13898, 26616, 81912, 71446, 76328, 79025, -16932, -51196, -133528, -95562, -23754, -68537, -85082, -89179, -5756, 118939, 138924, 88582]
7552H8582n6729l7705Q877J4249m0538p1714q1897l11O3481O4313Q2563L4963
7540F8134N5981M9752j58730j21955k2227K160O403J9113r096L1113K719O44N0741
7527b5248l1521j5073P3721M3592R984J2940R95P9631q1386l0412J24539j8792
7515A42970n1699j39008q071J02407N3215k384l2943N2657j8804o4818n7271L730
7503b0019p3267P5446j0482m6498J5171n6056r0478Q7259K398j3868Q6910k3037
7491f6521M166j7941n2812N8001J87859R3023o1743Q001r3630k4025k0297Q3998
7479I8079L1388o0714j68210L7229P6252o5073o1730J4985L3980L5426J7961K8427
7467A8000L2271K8699l8414n63L0959j180J1773p3655n1036o9748r2766o9565
$$ y = [88582, 31853, -5852, 3025, 17274, -23264, -94978, -176875, -177186, -113705, -49392, 33171, 68134, 124115, 173867, 15137, -106818, -129045, -126885, -120482, -101369, -110465, -79352, -76633, -75989, -25248, -56769, -71842, 1879, 45471, 55455, 68395, 69390, 149021, 67635, 37223, 161762, 142970, 91271, -47737, -55808, 46599, 99814, 97430, 64487, 117144, 98340, 33522, -23749, -20019, -93286, -17840, -28322, -74820, -59649, -115705, -206183, -118924, -116526, -130394, -43484, -66521, -62355, -80296, -133108, -75107, 112752, 205775, 144032, 152033, 58403, 34378, 14081, 98079, 129467, 68753, -99457, -62228, 14024, -51049, -112779, -97794, -63814, -28388, -10427, 18000, 50271, 78970, 40556, 39993, 70952, 69772, 81545, 7890, -43146, -112894, -205660, -275225]
7455b75225J03376O5839O1292P1966n7594j06393O780N9320k6191J655Kn9914
7443a55087n0172J3553o4250N1002J54769M305j9262j0361j8151K1391O917K4793
7431d0553j8163J9214K4245j3220k1577L45k1203k2897K3004k9957M6093k1915
7419g6584j7973L1453J41323k185K2392l1655k2367P9635R9770p8933j70929n8087
7407h4140L2658k816M14R1676Q763l4796j5976j0903k9657r9051N195P5399J04471
7394D1237O3236j45972K5768L1985j0919j02020J3053R8284j1857q8584r8931
7383a84720J10935R2710Q8077O6074q2455j34447j28192m5267K592Q9492r1493
7372b16694N9198N2397M1196J01648k2657j07860r4160l5464P0559O1581o2641
$$ y = [-275225, -171849, -106010, -44718, 27248, -30346, -136739, -129959, -70639, -96830, -95175, -95173, -155087, -205259, -191706, -255956, -204954, -50185, -45880, -65142, -75503, -93654, -72263, -65346, -40553, -58716, -39502, -15257, -28477, -50054, -49709, -70912, -93809, -70805, -100762, -54669, -76584, -94557, -63104, 78219, 76034, 98426, 66771, 44404, 124039, 223809, 144876, -26053, -84140, -51482, -54298, -53884, 37792, 46555, 11759, -4217, -15120, -44777, -143828, -138633, -63234, 41237, 104473, -41499, -15731, 16254, 5335, -96685, -83632, 14652, 2795, -85789, -184720, -73785, 18925, 107002, 173076, 90621, -43826, -172018, -217285, -214693, -125201, -216694, -157496, -105099, -63903, 37745, 15088, -92772, -186932, -222396, -151837, -90256, -152897]
7361a52897j863N5432n6842M1718J1766N8148n4116M2698J03990k8455j84136
7350a64557j3171J1308j2039R56L8571J41094K6620J3055P9678j72342p5598O3340
7338f3085J8196L3767N8570o8318q8807N47K1837K6007l3727n3696Q378J20171
7326b0160Q9847j3542q8213O7740k5839n4257j24481l7386j39311K6527J07882
7315b11193M1985o6668N6714Q8947M1432J2099r8993M3521R0606n0132L2664J03732
$$ y = [-152897, -154760, -99328, -156170, -114452, -102686, -44538, -98654, -55956, 48034, 19579, -164557, -177728, -166420, -178459, -177503, -138932, 2162, 28782, 41837, 121515, -50827, -126425, -63085, -44889, -11122, 47448, -20870, -109677, -109130, -87293, -61286, -95013, -148709, -140331, -20160, 69687, 56145, -32068, 35672, 9833, -44424, -168905, -206291, -345602, -319075, -211193, -169208, -235876, -179162, -90215, -48783, -36684, -135677, -92156, -1550, -51682, -19018, 84714]
$$ [...]
##END NTUPLES=NMR SPECTRUM
##END=
