##TITLE=Analysis number 328862
Compound Code cc 18414
Project Code adrs
Chemist Name fudan
##JCAMPDX= 6.0         $$ Bruker NMR JCAMP-DX V2.0
##DATA TYPE= NMR SPECTRUM
##DATA CLASS= NTUPLES
##ORIGIN= Bruker BioSpin GmbH
##OWNER= nmr
$$ XWIN-NMR		Version 3.5
$$ Wed Jul 11 10:23:33 2007 GMT Daylight Time (UT+1h)  MAYBRIDGE\nmr@NMR_250MHZ
##.OBSERVE FREQUENCY= 250.131544655141
##.OBSERVE NUCLEUS= ^1H
##.ACQUISITION MODE= SIMULTANEOUS (DQD)
##.ACQUISITION SCHEME= undefined
##.AVERAGES= 16
##.DIGITISER RES= 18
##SPECTROMETER/DATA SYSTEM= dpx250
##.PULSE SEQUENCE= zg30
##.SOLVENT NAME= CDCl3
##.SHIFT REFERENCE= (INTERNAL, CDCl3, 0, 16.522)
##AUDIT TRAIL= $$ (NUMBER, WHEN, WHO, WHERE, WHAT)
$$ ##TITLE= Audit trail, XWIN-NMR		Version 3.5
$$ ##JCAMPDX= 5.01
$$ ##ORIGIN= Bruker BioSpin GmbH
$$ ##OWNER= nmr
$$ C:\u/data/dgb/nmr/ADRS/760/pdata/1/auditp.txt
$$ ##AUDIT TRAIL=  $$ (NUMBER, WHEN, WHO, WHERE, WHAT)
(   1,<2007-07-11 10:23:10.28 +100>,<MAYBRIDGE\nmr>,<NMR_250MHZ>,
      <created by zg, POWCHK disabled, PULCHK disabled
       configuration hash MD5:
       76 6E 9A 78 1E 09 19 81 EC 84 63 8F B0 6A 59 2D
       data hash MD5: 64K
       EC A7 57 C7 9E C4 85 07 D6 45 B4 4D E4 AE 6A CC>)
(   2,<2007-07-11 10:23:23.22 +100>,<MAYBRIDGE\nmr>,<NMR_250MHZ>,
      <Start of raw data processing
       ef LB = 0.3 FT_mod = 6 PKNL = 1 SI = 32K 
       data hash MD5: 32K
       55 84 89 43 34 F6 9E 4E AA 1A 3B 0A 57 B1 D6 34>)
(   3,<2007-07-11 10:23:26.15 +100>,<MAYBRIDGE\nmr>,<NMR_250MHZ>,
      <apk 
       data hash MD5: 32K
       D7 5E 09 42 B0 81 D9 86 AE 20 68 CE 2B EC A5 1A>)
(   4,<2007-07-11 10:23:26.89 +100>,<MAYBRIDGE\nmr>,<NMR_250MHZ>,
      <abs ABSG = 5 
       data hash MD5: 32K
       60 90 D4 23 14 C1 C4 86 32 F2 EC D6 8D 1E EC C0>)
$$ ##END=
$$ 
$$ hash MD5
$$ 65 73 CE C6 DA A7 D8 90 C4 49 02 EF 48 DE ED 09
##$RELAX= 
##$RELAX= 
##$RELAX= 
##$RELAX= 
##$RELAX= 
##$RELAX= 
##$RELAX= 
$$ Bruker specific parameters
$$ --------------------------
##$DU= <C:\u>
##$EXPNO= 760
##$NAME= <ADRS>
##$PROCNO= 1
##$TYPE= <nmr>
##$USER= <dgb>
##$AMP= (0..31)
100 100 100 100 100 100 100 100 100 100 100 100 100 100 100 100 100 100 
100 100 100 100 100 100 100 100 100 100 100 100 100 100 
##$AQSEQ= 0
##$AQ_mod= 3
##$AUNM= <au_zg>
##$AUTOPOS= <5 >
##$BF1= 250.13
##$BF2= 250.13
##$BF3= 250.13
##$BF4= 250.13
##$BF5= 500.13
##$BF6= 500.13
##$BF7= 500.13
##$BF8= 500.13
##$BYTORDA= 1
##$CFDGTYP= 0
##$CFRGTYP= 5
##$CHEMSTR= <none>
##$CNST= (0..31)
1 1 145 1 1 1 1 1 1 1 1 1 1 1 1 1 1 1 1 1 1 1 1 1 1 1 1 1 1 1 1 1 
##$CPDPRG= <>
##$CPDPRG1= <>
##$CPDPRG2= <>
##$CPDPRG3= <>
##$CPDPRG4= <mlev>
##$CPDPRG5= <mlev>
##$CPDPRG6= <mlev>
##$CPDPRG7= <mlev>
##$CPDPRG8= <mlev>
##$CPDPRGB= <>
##$CPDPRGT= <>
##$D= (0..31)
0 1 0 0 0 0 0 0 0 0.06 0 0 0 0 0 0 0.0002 0 0 0 0 0 0 0 0 0 0 0 0 0 0 
0 
##$DATE= 1184145789
##$DBL= (0..7)
120 120 120 120 120 120 120 120 
##$DBP= (0..7)
150 150 150 150 150 150 150 150 
##$DBP07= 0
##$DBPNAM0= <>
##$DBPNAM1= <>
##$DBPNAM2= <>
##$DBPNAM3= <>
$$ [...]
##$SUBNAM7= <"">
##$SUBNAM8= <"">
##$SUBNAM9= <"">
##$SW= 20.6930455092707
##$SWIBOX= (0..15)
0 0 3 0 0 0 0 0 0 0 0 0 0 0 0 0 
##$SW_h= 5175.983436853
##$TD= 65536
##$TD0= 1
##$TE= 296.16
##$TE2= 300
##$TE3= 300
##$TEG= 300
##$TL= (0..7)
0 120 120 120 120 120 120 120 
##$TP= (0..7)
150 150 150 150 150 150 150 150 
##$TP07= 0
##$TPNAME0= <>
##$TPNAME1= <>
##$TPNAME2= <>
##$TPNAME3= <>
##$TPNAME4= <>
##$TPNAME5= <>
##$TPNAME6= <>
##$TPNAME7= <>
##$TPOAL= (0..7)
0.5 0.5 0.5 0.5 0.5 0.5 0.5 0.5 
##$TPOFFS= (0..7)
0 0 0 0 0 0 0 0 
##$TUNHIN= 0
##$TUNHOUT= 0
##$TUNXOUT= 0
##$USERA1= <user>
##$USERA2= <user>
##$USERA3= <user>
##$USERA4= <user>
##$USERA5= <user>
##$V9= 5
##$VALIST= <valist>
##$VCLIST= <CCCCCCCCCCCCCCC>
##$VD= 0
##$VDLIST= <DDDDDDDDDDDDDDD>
##$VPLIST= <PPPPPPPPPPPPPPP>
##$VTLIST= <TTTTTTTTTTTTTTT>
##$WBST= 1024
##$WBSW= 4
##$XGAIN= (0..3)
0 0 0 0 
##$XL= 0
##$YL= 0
##$YMAX_a= 411992
##$YMIN_a= -227268
##$ZGOPTNS= <>
##$ZL1= 120
##$ZL2= 120
##$ZL3= 120
##$ZL4= 120
##$ABSF1= 16.522
##$ABSF2= -4.171173
##$ABSG= 5
##$ABSL= 3
##$ALPHA= 0
##$AQORDER= 0
##$ASSFAC= 0
##$ASSFACI= 0
##$ASSFACX= 0
##$ASSWID= 0
##$AUNMP= <proc_1d>
##$AZFE= 0.1
##$AZFW= 0.1
##$BCFW= 0
##$BC_mod= 0
##$BYTORDP= 0
##$COROFFS= 0
##$CY= 12.5
##$DATMOD= 1
##$DC= 0
##$DFILT= <>
##$DTYPP= 0
##$F1P= 14.0000005364418
##$F2P= -0.99999901652339
##$FCOR= 0.5
##$FTSIZE= 32768
##$FT_mod= 6
##$GAMMA= 0
##$GB= 0
##$INTBC= 1
##$INTSCL= 1
##$ISEN= 128
##$LB= 0.3
##$LEV0= 0
##$LPBIN= 0
##$MAXI= 10000
##$MC2= 0
##$MEAN= 0
##$ME_mod= 0
##$MI= 0
##$NCOEF= 0
##$NC_proc= -5
##$NLEV= 6
##$NOISF1= 0
##$NOISF2= 0
##$NSP= 0
##$NTH_PI= 0
##$NZP= 0
##$OFFSET= 16.522
##$PC= 1
##$PHC0= -28.39386
##$PHC1= -45.45798
##$PH_mod= 1
##$PKNL= yes
##$PPARMOD= 0
##$PSCAL= 4
##$PSIGN= 0
##$REVERSE= no
##$SF= 250.13
##$SI= 32768
##$SIGF1= 0
##$SIGF2= 0
##$SINO= 400
##$SIOLD= 32768
##$SREGLST= <1H.CDCl3>
##$SSB= 0
##$STSI= 32768
##$STSR= 0
##$SW_p= 5175.98343685301
##$SYMM= 0
##$S_DEV= 0
##$TDeff= 65536
##$TDoff= 0
##$TI= <Analysis number 999999
Compound Code 99
Book Reference 9
Project Code 9>
##$TILT= no
##$TM1= 0
##$TM2= 0
##$TOPLEV= 0
##$USERP1= <user>
##$USERP2= <user>
##$USERP3= <user>
##$USERP4= <user>
##$USERP5= <user>
##$WDW= 1
##$XDIM= 32768
##$YMAX_p= 478471733
##$YMIN_p= -464592
$$ End of Bruker specific parameters
$$ ---------------------------------
##NTUPLES= NMR SPECTRUM
##VAR_NAME=  FREQUENCY,     SPECTRUM/REAL,   SPECTRUM/IMAG
##SYMBOL=    X,             R,               I
##VAR_TYPE=  INDEPENDENT,   DEPENDENT,       DEPENDENT
##VAR_FORM=  AFFN,          ASDF,            ASDF
##VAR_DIM=   32768,         32768,           32768
##UNITS=     HZ,            ARBITRARY UNITS, ARBITRARY UNITS
##FACTOR=    0.157963299565203, 1,           1
##FIRST=     4132.6476996994, 0,             0
##LAST=      -1043.33573715361, 0,           0
##MIN=       -1043.33573715361, -464592,     0
##MAX=       4132.6476996994, 478471733,     0
$$ Real data points
##PAGE= N=1
##DATA TABLE= (X++(R..R)), XYDATA
$$ [...]
$$ plain form
23920 -34548 -27007 -70162 -64957 -112731 -90002 -43187 13432 -25647 -34194 37895 36591 8162
23908 8162 -47461 -40674 -17701 -62585 -86922 -120438 -128738 -74205 -54502 -38406 -48621 -21422
23896 -21422 -14359 29297 71157 96240 128150 114206 25607 -52077 -30287 3286 12802 9077
23884 9077 -16045 -6257 13176 5497 12991 -9707 46473 110210 90789 86629 61972 -47248
23872 -47248 -57363 -29409 -53483 -13084 29802 41990 58472 -10293 33586 71611 66202 44267
23860 44267 64254 114184 112135 121982 110140 57563 49058 66032 32086 18299 -13152 -32248
23848 -32248 -83263 -104487 -126122 -86276 -59927 2978 4907 35025 30845 -1506 51377 37740
23836 37740 8461 14297 32144 21595 17411 1437 8007 22290 55911 54854 -835 -18895
$$ packed form
23920c4548P541m3155N205m7774K2729M6815N6619l9079q547P2089j304k8429
23908H162n5623O787K2973m4884k4337l3516q300N4533J9703J6096j0215K7199
23896b1422P063M3656M1860K5083L1910j3944q8599p7684K1790L3573R516l725
23884I077k5122R788J9433p679P494k2698N6180O3737j9421m160k4657j09220
23872d7248j0115K7954k4074M0399M2886J2188J6482o8765M3879L8025n409k1935
23860D4267J9987M9930k049R847j1842n2577q505J6974l3946j3787l1451j9096
23848c2248n1015k1224k1635L9846K6349O2905J929L0118m180l2351N2883j3637
23836C7740k9279N836J7847j0549m184j5974O570J4283L3621j057n5689j8060
$$ plain form
23824 -18895 3637 -30375 -48694 -42829 -24099 -33151 24806 49645 36022 23109 61983 79731
23812 79731 53845 48825 37030 11011 -45182 -3277 36886 71879 9678 14791 4831 -50571
23800 -50571 -7369 9325 25018 40688 63006 56431 20955 -29269 -69785 -64038 -93028 -135065
23788 -135065 -122646 -52644 -889 -34691 -42683 9465 37450 56874 44613 33449 39325 66298
23776 66298 81853 103375 38742 30734 50873 117097 95937 45746 66759 74088 91384 54018
23764 54018 51230 74730 80268 33781 23997 65712 117212 126632 65533 32263 -9467 6930
23752 6930 30868 -6634 -3324 7616 -3681 -49461 -28847 21538 10274 -21960 -48452 -50358
23740 -50358 -70903 -94075 -49041 -11901 64073 66273 33663 37459 -32378 -37717 -40100 -9119
$$ packed form
23824a8895K2532l4012j8319N865J8730r052N7957K4839j3623j2913L8874J7748
23812G9731k5886n020j1795k6019n6193M1905M0163L4993o2201N113r960n5402
23800e0571M3202J6694J5693J5670K2318o575l5476n0224m0516N747k8990m2037
23788a35065J2419P0002N1755l3802p992N2148K7985J9424j2261j1164N876K6973
23776F6298J5555K1522o4633q008K0139O6224k1160n0191K1013P329J7296l7366
23764E4018k788K3500N538m6487r784M1715N1500R420o1099l3270m1730J6397
23752F930K3938l7502L310J0940j1297m5780K0614N0385j1264l2234k6492j906
23740e0358k0545k3172M5034L7140P5974K200l2610L796o9837n339k383L0981
$$ plain form
23728 -9119 -53127 -64104 -17648 20525 19522 21026 -14436 -22912 37135 67247 47808 973
23716 973 66054 66631 39965 -9211 26516 51304 -3615 -23706 -28613 -2682 -15195 7712 19451
23703 19451 1745 -16789 -922 75680 154456 88893 40662 5253 4593 -6665 -828 -13703
23691 -13703 -71206 -11176 29307 73854 34168 -27369 -70302 -113883 -140481 -107753 -13764 -30866
23679 -30866 -46158 -9506 24451 16789 -15219 -57522 -82107 -85564 -41320 -11575 -25521 -43535
23667 -43535 -76802 -95177 -92215 -77035 -54536 29283 42647 26927 -36812 -35332 -57157 -82291
23655 -82291 -75816 -81657 -21676 2506 52230 45252 3065 41668 112000 91375 45475 90242
23643 90242 101316 93481 88685 69554 44337 -23142 -7927 10425 -7056 4430 58718 29692
$$ packed form
23728i119m4008j0977M6456L8173j003J504l5462q476O0047L0112j9439m6835
23716I73O5081N77k6666m9176L5727K4788n4919k0091m907K5931j2513K2907J1739
23703A9451j7706j8534J5867P6602P8776o5563m8231l5409o60j1258N837j2875
23691a3703n7503O0030M0483M4547l9686o1537m2933m3581k6598L2728R3989j7102
23679c0866j5292L6652L3957p662l2008m2303k4585l457M4244K9745j3946j8014
23667d3535l3267j8375K962J5180K2499Q3819J3364j5720o3739J480k1825k5134
23655h2291O475n841N9981K4182M9724o978m2187L8603P0332k0625m5900M4767
23643I0242J1074p835m796j9131k5217o7479J5215J8352j7481J1486N4288k9026
$$ plain form
23631 29692 21232 63087 50778 7018 36185 36582 1872 -51902 -10831 13600 2637 20729
23619 20729 -12685 -13857 35346 1525 14343 44848 3121 -16056 -49674 -27330 17187 -8506
23607 -8506 -62270 8943 14012 36849 40282 23488 14914 20954 18524 -13095 8612 -28154 -56775
23594 -56775 -57523 -56195 -55101 -38398 -43052 31504 73410 72166 90586 121079 103788 33244 -8019
23581 -8019 -44504 15957 66923 12899 -36364 -23651 17807 34755 40642 39520 96834 49177
23569 49177 91846 160278 165036 130058 109573 60068 8881 -14797 -1502 42596 23723 49017
23557 49017 75437 52021 17208 40157 7843 15724 63841 84157 85207 97268 48257 -10396
23545 -10396 9546 61149 128997 164189 132854 93442 99003 70716 36768 -4229 -51553 -61036
$$ packed form
23631B9692q460M1855j2309m3760K9167L97l4710n3774M1071K4431j0963J8092
23619B0729l3414j172M9203l3821J2818L0505m1727j9177l3618K2344M4517k5693
23607h506n3764P1213N069K2837L433j6794q574O040k430l1619K1707l6766k8621
23594e6775p48J328J094J6703m654P4556M1906j244J8420L0493j7291p0544m1263
23581h019l6485O0461N0966n4024m9263J2713M1458J6948N887j122N7314m7657
23569D9177M2669O8432M758l4978k0485m9505n1187k3678J3295M4098j8873K5294
23557D9017K6420k3416l4813K2949l2314P881M8117K0316J050J2061m9011n8653
23545a0396J9942N1603O7848L5192l1335l9412N561k8287l3948m0997m7324r483
$$ plain form
23533 -61036 -59894 -21876 -5345 -12987 -2703 -18851 -6355 -8061 -2792 -670 2910 -2738 19509
23520 19509 66900 62407 48897 48519 62078 35384 4669 64569 101760 58610 -17570 -4493
23508 -4493 10491 14301 -9867 -28912 -64444 -47201 -65973 -76926 -90973 -99813 -77179 -86092
23496 -86092 -71868 -66863 -60535 -77798 -61645 -77793 -70541 -41706 1481 -20145 -37306 -50819
23484 -50819 -43324 -48525 -39986 -19902 -86517 -71386 6779 3108 -22617 -28326 -33433 -27695 -47177
23471 -47177 -85036 -67324 -48627 -64039 -12314 2358 -39516 -50164 -87697 -88606 -64662 -70318
23459 -70318 -33468 -6626 14523 -2694 -8895 -57114 -84399 -45995 -25965 -61663 -61193 16730
23447 16730 56333 38376 8290 42217 62759 14143 -58143 -78957 -73560 -19605 29092 81203
$$ packed form
23533f1036J142L8018J6531p642J0284j6148J2496j706N269K122L580n648K2247
23520A9509M7391m493j3510l78J3559k6694l0715N9900L7191m3150p6180J3077
23508d493J4984L810k4168j9045l5532J7243j8772j0953j4047q840K2634q913
23496h6092J4224N005O328j7263J6153j6148P252K8835M3187k1626j7161j3513
23484e0819P495n201Q539K0084o6615J5131P8165l671k5725n709n107N738j9482
23471d7177l7859J7712J8697j5412N1725J4672m1874j0648l7533r09K3944n656
23459g0318L6850K6842K1149j7217o201m8219k7285L8404K0030l5698M70P7923
23447A6730L9603j7957l0086L3927K0542m8616p2286k0814N397N3955M8697N2111
$$ plain form
23435 81203 65612 49642 37933 43816 16096 20094 55726 35876 -5949 21 40145 37775
23423 37775 61075 65879 94401 40628 -9980 -6358 22749 -590 -38002 -173 -13682 -740
23411 -740 34229 55958 71969 71697 86921 39761 -7789 -11319 -20190 -11603 -25734 -51627 -45896
23398 -45896 -24968 -20798 46603 26251 15446 2408 -41391 -84060 -76234 -68052 -119533 -82102
23386 -82102 -69690 -47809 -21395 -1377 32722 -17759 -73128 -97082 -15508 72531 68321 35199
23374 35199 59678 62016 77052 85088 46924 -25907 -60426 -36113 4027 4299 -72295 -64643 -11446
23361 -11446 16759 35568 58984 58026 -520 -45389 -30337 444 -8229 -45219 -80406 -85228
23349 -85228 -80094 -100256 -32658 -70779 -146146 -129066 -61131 -40864 3130 47407 56443 19718
$$ packed form
23435H1203j5591j5970j1709N883k7720L998L5632j9850m1825N970M0124k370
23423C7775K3300M804K8522n3773n0608L622K9107k3339l7412L7829j3509J2942
23411g40L4969K1729J6011k72J5224m7160m7550l530q871Q587j4131k5893N731
23398d5896K0928M170O7401k0352j0805j3038m3799m2669P826Q182n1481L7431
23386h2102J2412K1881K6414K0018L4099n0481n5369k3954Q1574Q8039m210l3122
23374C5199K4479K338J5036Q036l8164p2831l4519K4313M0140K72p6594P652N3197
23361a1446K8205J8809K3416r58n8546m4869J5052L0781q673l6990l5187m822
23349h5228N134k0162O7598l8121p5367J7080O7935K0267M3994M4277R036l6725
$$ plain form
23337 19718 25850 44186 13049 -26505 -15173 -26462 -42746 -37949 -52826 -38685 -103907 -109664
23325 -109664 -131434 -112303 -89496 -74373 -71596 -81446 -85781 -112755 -99279 -89178 -60801 -21266
23313 -21266 -32728 -27124 -27982 -26791 -208 -5009 -68297 -93843 -44159 6047 8544 5735 8898
23300 8898 7806 -6953 -52477 -68513 -64992 -36352 -18683 5543 -98 39601 15324 10101 -61437
23287 -61437 -86576 -57796 -30888 -14922 59407 68275 45589 -7374 -21088 7995 83522 34765
23275 34765 -46403 -91138 -47636 -67935 -68494 -91109 -100664 -85314 -43722 -3192 6630 -10889
23263 -10889 -51921 -38652 27053 45556 2232 -20706 -2554 7201 19828 41458 52305 17524
23251 17524 -63956 -73103 -52895 751 57391 90618 70268 9133 57425 125781 106835 123698
$$ packed form
23337A9718O132J8336l1137l9554J1332j1289j6284M797j4877J4141o5222n757
23325a09664k1770J9131K2807J5123K777r850m335k6974J3476J0101K8377L9535
23313b1266j1462N604q58J191K6583m801o3288k5546M9684N0206K497k809L163
23300H898j092j4759m5524j6036L521K8640J7669K4226n641L9699k4277n223p1538
23287f1437k5139K8780K6908J5966P4329Q868k2686n2963j3714K9083P5527m8757
23275C4765q1168m4735M3502k0299n59k2615r555J5350M1592M0530R822j7519
23263a0889m1032J3269O5705J8503m3324k2938J8152R755J2627K1630J0847l4781
23251A7524q1480r147K0208N3646N6640L3227k0350o1135M8292O8356j8946J6863
$$ plain form
23239 123698 99558 78359 58194 40229 19383 42636 55764 32131 38607 18164 -57531 -74183
23227 -74183 -48964 -8092 4992 7750 98668 99843 90987 107077 33394 23464 10179 21393
23215 21393 29368 -1915 -36962 -27802 15484 -8716 27392 63703 -6188 -44397 -76186 -90540
23203 -90540 -79745 -62555 -73692 -70018 -47557 -54437 1428 20401 13270 -22615 -18839 -9403 -2650
23190 -2650 40842 47144 58605 -23509 -72176 -43548 22024 38792 16482 3628 -48660 -15877
23178 -15877 40565 21304 51068 10592 -70306 -59254 -3096 70670 59471 48399 63797 42387
23166 42387 67115 68610 98945 70313 94156 77835 47416 16376 26276 49157 47931 54453
23154 54453 12337 -26532 -47479 -42451 27559 111863 60346 17121 54371 64977 40137 -13898
$$ packed form
23239A23698k4140k1199k0165j7965k0846K3253J3128k3633O476k0443p5695j6652
23227g4183K5219M0872J3084K758R0918J175q856J6090p3683r930j3285J1214
23215B1393P975l1283l5047R160M3286k4200L6108L6311o9891l8209l1789j4354
23203i0540J0795J7190j1137L674K2461o880N5865J8973p131l5885L776R436O753
23190b650M3492O302J1461q2114m8667K8628O5572J6768k2310j2854n2288L2783
23178a5877N6442j9261K9764m0476q0898J1052N6158P3766j1199j1072J5398k1410
23166D2387K4728J495L0335k8632K3843j6321l0419l1040R900K2881j226O522
23154E4453m2116l8869k0947N028P0010Q4304n1517m3225L7250J0606k4840n4035
$$ plain form
23142 -13898 -59990 -55685 -47228 -48871 -75351 -77661 -21839 -11133 -14588 -22558 -40534 -41929 -49548
23129 -49548 -58944 -7370 33312 41551 66935 67958 12274 -32996 -55396 -34159 -45262 -16148
23117 -16148 20901 27871 -2853 -18125 12577 28013 18744 30815 61608 60879 57379 19350 23094
23104 23094 31327 -13809 -89367 -48596 -19222 -2553 11345 -3549 3148 126291 76729 -29195
23092 -29195 -58517 -18871 -67602 -87971 -4554 33108 13844 -40952 -30333 4276 3838 28093
23080 28093 27356 79382 55134 73371 25776 -26235 -24570 -20209 -16842 -11963 -34244 -27528 -13698
23067 -13698 16424 54786 52052 61897 96700 86055 59470 30958 15898 -46817 -20518 3250
23055 3250 29721 12551 -9516 -9011 35699 29333 40956 29620 19117 25452 37077 18549 2740
$$ packed form
23142a3898m6092M305Q457j643k6480k310N5822J0706l455p970j7976j395p619
23129d9548r396N1574M0682Q239K5384J023n5684m5270k2400K1237j1103K9114
23117a6148L7049O970l0724j5272L0702J5436r269J2071L0793p29l500l8029L744
23104B3094Q233m5136p5558M0771K9374J6669J3898j4894O697J23143m9562j05924
23092b9195k9322L9646m8731k0369Q3417L7662j9264n4796J0619L4609m38K4255
23080B8093p37N2026k4248J8237m7595n2011J665M361L367M879k2281O716J3830
23067a3698L0122L8362k734R845L4803j0645k6585k8512j5060o2715K6299K3768
23055C250K6471j7170k2067N05M4710o366J1623j1336j0503O335J1625j8528j5809
$$ plain form
23042 2740 21460 -29174 -95696 -78151 -20031 22231 35280 64572 128992 101738 70684 52821
23030 52821 45510 146 -5134 -21496 -58087 -32096 1948 43465 65687 75799 69954 53275
23018 53275 50763 75089 39487 -39346 -116038 -80707 -38636 -10111 1585 -13510 -35032 -15092
23006 -15092 1066 -2078 -38519 -91249 -93301 -45577 1625 48486 69655 31484 -8061 -4100
22994 -4100 35249 12075 -60639 -50317 -28088 -55866 -75190 -70263 -41304 -5145 9527 -22668
22982 -22668 -40322 -25764 -11573 26319 93013 113003 92391 10592 -49932 -93005 -137220 -137653
22970 -137653 -105192 -9260 5298 -11337 17784 38909 52237 17956 20468 107599 96878 16943
22958 16943 -73573 -56255 4718 88164 112690 100887 85361 87136 81624 129394 132553 110445
$$ packed form
23042B740J8720n0634o6522J7545N8120M2262J3049K9292O4420k7254l1054j7863
23030E2821p311m5364n280j6362l6591K5991L4044M1517K2222J0112n845j6679
23018E3275k512K4326l5602p8833p6692L5331M2071K8525J1696j5095k1522J9940
23006a5092J6158l144l6441n2730k052M7724M7202M6861K1169l8171l9545L961
22994d100L9349k3174p2714J0322K2229k7778j9324M927K8959L6159J4672l2195
22982b2668j7654J4558J4191L7892O6694J9990k0612q1799o0524m3073m4215m33
22970a37653L2461R5932J4558j6635K9121K1125J3328l4281K512Q7131j0721p9935
22958A6943r0516J7318O0973Q3446K4526j1803j5526J775n512M7770L159k2108
$$ plain form
22946 110445 45834 37332 25778 -13593 7650 3670 -16100 -37967 -54434 -29232 -37808 -47001
22934 -47001 -4528 -44893 -81699 -132075 -85247 -63107 -101644 -42343 29507 31185 22466 22971
22922 22971 -15504 -7715 -25453 -53044 -82825 -77753 -23258 -16621 -51735 10578 42142 48870
22910 48870 40319 -500 -40078 -44669 -53685 -52680 -10292 -9134 -6089 41704 81016 48179 -2102
22897 -2102 -42247 -50528 -56734 -2843 -33232 -127772 -123047 -80653 -33053 2246 12720 45735
22885 45735 9537 -49132 -20774 19324 9158 -10412 -39889 -84488 -99375 -106160 -65609 -53894
22873 -53894 -59954 -85083 -40045 -1393 58250 88248 46590 -29476 -36100 8370 21792 35792
22861 35792 68570 34284 740 9041 -27637 -62135 -78907 -28255 -19655 -48093 -39127 7276
$$ packed form
22946A10445o4611q502j1554l9371K1243l980j9770k1867j6467K5202q576r193
22934d7001M2473m0365l6806n0376M6828K2140l8537N9301P1850J678q719N05
22922B2971l8475P789j7738k7591k9781N072N4495O637l5114O2313L1564O728
22910D8870q551m0819l9578m591r016J005M2388J158L045M7793L9312l2837n0281
22897b102m0145q281o206N3891l0389r4540M725M2394M7600L5299J0474L3015
22885D5735l6198n8669K8358M0098j0166j9570k9477m4599j4887o785M0551J1715
22873e3894o060k5129M5038L8652N9643K9998m1658p6066o624M4470J3422J4000
22861C5792L2778l4286l3544Q301l6678l4498j6772N0652Q600k8438Q966M6403
$$ plain form
22849 7276 12068 38331 67235 86892 32026 -60006 -63623 -28691 -37676 -56253 -27545 -17855 16746
22836 16746 33902 109121 102711 47735 -9799 -35684 -38807 -23499 -29951 -2112 38502 3613
22824 3613 -14924 -39569 -36686 -31514 -17470 -17255 -59489 -90767 -40302 -35607 -21468 -7312 -15225
22811 -15225 -53564 -28545 23397 32942 -16645 12553 1089 9483 69898 79333 6579 -71858
22799 -71858 -48604 -82637 -104948 -150555 -142234 -50670 -51709 -97534 -56471 -8466 46103 34842
22787 34842 59142 68140 36659 11446 -29199 -39225 -46333 -48055 -43864 -77421 -123428 -124132 -94356
22774 -94356 -31685 467 -9761 56450 110129 64521 35673 35520 33693 56021 46163 -8444
22762 -8444 -310 -26504 -60762 19435 13144 -35414 -61294 -32223 13702 59450 51617 29376
$$ packed form
22849G276M792K6263K8904J9657n4866r2032l617L4932q985j8577K8708R690L4601
22836A6746J7156P5219o410n4976n7534k5885l123J5308o452K7839M0614l4889
22824C613j8537k4645K883N172J4044K15m2234l1278N0465M695J4139J4156p913
22811a5225l8339K5019N1942R545m9587K9198j1464Q394O0415R435p2754p8437
22799g1858K3254l4033k2311m5607Q321R1564j039m5825M1063M8005N4569j1261
22787C4842K4300Q998l1481k5213m0645j0026p108j722M191l3557m6007p04K9776
22774i4356O2671L2152j0228O6211N3679m5608k8848j53j827K2328r858n4607
22762h444Q134k6194l4258Q0197o291m8558k5880K9071M5925M5748p833k2241
$$ plain form
22750 29376 31009 -6808 -62380 -62693 -96878 -126940 -64691 -18253 -44883 -56761 -35446 -7781
22738 -7781 24491 32558 12179 -13912 5147 -826 -54641 -47750 -33810 -1534 34415 46762
22726 46762 5327 -13004 57277 89215 3063 -54478 -40271 -49384 4041 11888 -5898 -12517
22714 -12517 51271 56342 -1028 -39858 -52284 -93674 -101233 -61732 -104722 -103965 -64170 -2404
22702 -2404 10290 -1446 -1776 10999 -9535 -23846 -45268 -95569 -45017 8251 -15981 -40677
22690 -40677 -27853 57365 75788 42890 9316 59906 113853 122755 48876 -32982 -33082 -42547
22678 -42547 -48528 11201 59240 -49564 -118591 -119917 -59415 -59043 -90289 -91766 -61642 -35416
22666 -35416 16069 53527 13278 33336 -1461 -44515 -38631 -29586 -1725 -17567 -35152 -24832
$$ packed form
22750B9376J633l7817n5572l13l4185l0062O2249M6438k6630j1878K1315K7665
22738g781L2272Q067k0379k6091J9059n973n3815O891J3940L2276L5949J2347
22726D6762m1435j8331P0281L1938q6152n7541J4207r113N3425P847j7786o619
22714a2517O3788N071n7370l8830j2426m1390p559L9501m2990P57L9795O1766
22702b404J2694j1736l30J2775k0534j4311k1422n0301N0552N3268k4232k4696
22690d0677J2824Q5218J8423l2898l3574N0590N3947Q902p3879q1858j00r465
22678d2547n981N9729M8039j08804o9027j326O0502L72l1246j477L0124K6226
22666c5416N1485L7458m0249K0058l4797m3054N884R045K7861j5842j7585J0320
$$ plain form
22654 -24832 -24499 -10910 -35650 -45541 -56780 -47539 -11479 60289 37106 24236 -40381 -61317
22642 -61317 2352 45354 24444 16429 10637 -31095 -70769 -93649 -51763 -36504 -81367 -105636
22630 -105636 -70220 -9340 48597 -13798 -39833 -50309 -14274 -19507 -38472 -6650 -2295 -58850
22618 -58850 -35507 -38491 -15297 11939 41865 35637 64526 104203 114413 82647 55298 50074
22606 50074 70930 45327 39158 -15656 -18419 -22771 18863 71234 99887 62420 44435 72785
22594 72785 80438 61913 66084 43051 -9042 -28073 -39952 -46129 -52150 -33794 -54070 -62161 -61213
22581 -61213 -30628 -30250 21668 -47687 -99484 -86430 -83866 -53065 -58064 -20325 -35739 -68029
22569 -68029 -45698 -82654 -89564 -50664 -101306 -87086 -30503 -8036 5289 -71851 -70735 -64690
$$ packed form
22654b4832L33J3589k4740r891j1239R241L6060P1768k3183j2870o4617k0936
22642f1317O3669M3002k0910q015n792m1732l9674k2880M1886J5259m4863k4269
22630a05636L5416O0880N7937o2395k6035j0476L6035n233j8965L1822M355n6555
22618e8850K3343k984K3194K7236K9926o228K8889L9677J0210l1766k7349n224
22606E0074K0856k5603o169n4814k763m352M1634N2371K8653l7467j7985K8350
22594G2785P653j8525M171k3033n2093j9031j1879o177o021J8356k0276q091R48
22581f1213L0585L78N1918o9355n1797J3054K564L0801m999L7739j5414l2290
22569f8029K2331l6956o910L8900n0642J4220N6583K2467J3325p7140J116O045
$$ plain form
22557 -64690 -71471 -116619 -129920 -62526 -15092 -5559 69 -25668 -42599 -34287 13212 98449
22545 98449 121160 78992 41541 56613 -7877 -70273 -92624 -64365 -50534 -14132 -2888 16214
22533 16214 -7142 21433 16984 -51870 -52400 -50759 -97824 -86882 24979 51826 105603 118403
22521 118403 78767 80339 -1530 -54988 -83366 -58908 -15617 -60536 -97771 -99764 -94300 -36450
22509 -36450 -27052 4977 -7482 -8847 -7376 7819 -2628 -5965 49461 71461 14505 1518
22497 1518 -33011 -62850 -82452 -54654 -23341 -15895 -13728 14114 4184 -66286 -114296 -85714
22485 -85714 -63343 -75726 -50153 -617 -30627 -6986 50086 61733 19609 5911 -8294 18736
22473 18736 35204 75836 51247 44115 56620 36060 -18140 -55488 -21301 -13257 -16588 24676
$$ packed form
22557f4690o781m5148j3301O7394M7434R533N628k5737j6931Q312M7499Q5237
22545I8449K2711m2168l7451J5072o4490o2396k2351K8259J3831L6402J1244J9102
22533A6214k3356K8575m449o8854n30J641m7065J0942J11861K6847N3777J2800
22521A18403l9636J572q1869n3458k8378K4458M3291m4919l7235j993N464N7850
22509c6450R398L2029j2459j365J471J5195j0447l337N5426K2000n6956j2987
22497A518l4529k9839j9602K7798L1313P446K167K7842r930p0470m8010K8582
22485h5714K2371j2383K5573M9536l0010K3641N7072J1647m2124j3698j4205K7030
22473A8736J6468M0632k4589p132J2505k0560n4200l7348L4187Q044l331M1264
$$ plain form
22461 24676 29407 37668 19416 -15779 -77660 -84118 -57823 -30212 -80047 -81602 -54753 -39882
22449 -39882 -73344 -124704 -161107 -118006 -93037 -17472 52177 -2398 -69305 -106285 -47135 8264
22437 8264 47963 20388 53713 14614 14537 2635 -13651 18729 -20195 -34764 -55183 -89164
22425 -89164 -38842 7315 36523 -5172 -90038 -37427 10831 46647 50057 74287 110044 96155
22413 96155 88195 62947 7939 -18740 -2466 -23721 -24317 18930 45656 4831 2629 10167 649
22400 649 -9415 50831 86587 55310 16913 6389 26299 10367 17024 18501 44172 83555
22388 83555 93532 55156 54836 68281 56216 51130 67238 4525 -52848 -70653 -98286 -92583 -90881
22375 -90881 -52847 -25939 -42862 -58497 -80611 -38019 6821 2784 62181 103104 93105 26267
$$ packed form
22461B4676M731Q261j8252l5195o1881o458K6295K7611m9835j555K6849J4871
22449c9882l3462n1360l6403M3101K4969P5565O9649n4575o6907l6980N9150N5399
22437H264L9699k7575L3325l9099p7j1902j6286L2380l8924j4569k0419l3981
22425h9164N0322M6157K9208m1695q4866N2611M8258L5816L410K4230L5757j3889
22413I6155p960k5248n5008k6679J6274k1255n96M3247K6726m0825k202P538r518
22400F49j0064O0246L5756l1277l8397j0524J9910j5932O657J477K5671L9383
22388H3555R977l8376l20J3445j2065n086J6108o2713n7373j7805k7633N703J702
22375i0881L8034K6908j6923j5635k2114M2592M4840m037N9397M0923r999o6838
$$ plain form
22363 26267 -46886 9335 598 -8446 -18327 2120 -24116 -3497 9866 -40169 -61060 -57898
22351 -57898 -68040 -89555 -88409 -65180 -81798 -114950 -114751 -63912 -29904 16603 31957 -44623
22339 -44623 -65679 -29832 -84819 -62051 2654 -17866 -29428 -3979 -55123 -65595 -25114 4275
22327 4275 6526 -19063 -31620 -27134 -15795 -41977 -12744 -3962 22980 29789 11652 -3958 -6662
22314 -6662 -27629 -27112 -23697 -22996 -53449 -54650 -59868 -42951 -43190 -3950 -17240 -59534 -27123 14131
22300 14131 72478 52047 33527 -6746 -51748 -58087 -55340 -76136 -75186 -53848 -92027 -112905
22288 -112905 -96151 -55656 -11288 -28101 -57433 -44179 -34141 -16016 -33232 -54404 -69835
22277 -69835 -77164 -70321 -62836 -24350 -40438 -44089 -15600 28784 29650 -9589 -23084 -21315 55885
$$ packed form
22363B6267p3153N6221q737r044r881K0447k6236K0619J3363n0035k0891L162
22351e7898j0142k1515J146K3229j6618l3152J99N0839L4008M6507J5354p6580
22339d4623k1056L5847n4987K2768O4705k0520j1562K5449n1144j0472M0481K9389
22327D275K251k5589j2557M486J1339k6182K9233Q782K6942O809j8137j5610k704
22314f662k0967N17L415P01l0453j201n218J6917k39L9240j3290m2294L2411M1254
22300A4131N8347k0431j8520m0273m5002o339K747k0796R50K1338l8179k0878
22288a12905J6754M0495M4368j6813k9332J3254J0038J8125j7216k1172j5431
22277f9835p329O843P485L8486j6088l651K8489M4384Q66l9239j3495J769P7200
$$ plain form
22264 55885 67280 89289 35302 -12459 -27726 -9318 465 -16637 -27045 -31298 -35494 -27622
22252 -27622 5118 15661 -10858 -21097 21266 11520 -70329 -19504 -10067 -34003 -10074 -40409
22240 -40409 -45557 -71264 -88714 -54184 -52798 -6195 15878 46368 17795 -4038 -6238 -34475
22228 -34475 -21600 -22542 -99381 -121686 -65995 -28511 -18613 -14182 19281 31694 17474 -5458
22216 -5458 9883 38152 33332 -25112 -66322 -31133 -26307 -27158 -13857 -17916 -7899 778 -22035
22203 -22035 17236 63872 16203 -37468 -41677 -19381 -8367 1699 -44051 -74990 -132036 -112030
22191 -112030 -98605 -61429 -22184 -8638 -10083 22724 -33878 -104723 -112741 -85449 -95761 -48349
22179 -48349 200 -983 -16280 -2230 -11135 6536 49676 68902 38308 10579 10358 5188 -19937
$$ packed form
22264E5885J1395K2009n3987m7761j5267J8408R783j7102j0408m253m196P872
22252b7622L2740J0543k6519j0239M2363r746q1849N0825R437k3936K3929l0335
22240d0409n148k5707j7450L4530J386M6603K2073L0490k8573k1833k200k8237
22228c4475J2875r42p6839k2305N5691L7484R898M431L3463J2413j4220k2932
22216e458J5341K8269m820n8444m1210L5189M826q51J3301m059J0017Q677k2813
22203b2035L9271M6636m7669n3671m209K2296J1014J0066m5750l0939n7046K0006
22191a12030J3425L7176L9245J3546j445L2807n6602p0845q018K7292j0312M7412
22179d8349M8549j183j5297J4050q905J7671M3140J9226l0594k7729k21n170k5125
$$ plain form
22166 -19937 -3438 6322 -25227 -46079 -84764 -41756 51063 70465 59128 73253 54683 60110
22154 60110 -4537 -12858 28645 29517 15705 12189 -12491 -5961 52939 20053 -8857 7893 16097
22141 16097 -47298 -35019 -34724 15454 23489 28925 21026 3275 4914 44621 39247 42119 75546
22128 75546 89561 85986 109807 99244 24947 -8245 4331 4630 -2223 -21317 -1387 10096
22116 10096 -59312 -87342 -69817 -61819 -70598 -72138 -40247 -73 -5493 -8244 8898 22244 56843
22103 56843 116338 75314 9849 46093 28026 24135 72551 83841 39024 -52105 -100550 -90752
22091 -90752 -43068 -56753 -22847 31490 -25019 -27880 4763 40412 74910 19287 -5248 -15738
22079 -15738 -37466 -45463 -21658 -41484 -14693 -24061 9938 4074 8270 -26370 -32353 -34232 -35233
$$ packed form
22166a9937J6499R760l1549k0852l8685M3008R2819J9402j1337J4125j8570N427
22154F0110o4647q321M1503Q72j3812l516k4680O530N8900l2886k8910J6750Q204
22141A6097o3395J2279K95N0178Q035N436p899j7751J639L9707n374K872L3427
22128G5546J4015l575K3821j0563p4297l3192J2576K99o853j9094J9930J1483
22116A0096o9408k8030J7525P998q779j540L1891M0174n420k751J7142J3346L4599
22103E6843N9495m1024o5465L6244j8067l891M8416J1290m4817r1129m8445R798
22091i0752M7684j3685L3906N4337n6509k861L2643L5649L4498n5623k4535j0490
22079a5738k1728p997K3805j9826K6791r368L3999n864M196l4640n983j879j001
$$ plain form
22066 -35233 -16396 25996 12798 -8887 13551 45158 53441 31419 -604 -25682 -65478 -36473
22054 -36473 -3024 -13517 53533 47167 50253 20507 -20733 -114811 -115449 -55615 -56820 -48023 -45106
22041 -45106 -53710 -49048 -41354 -56191 -44459 -38425 -53772 -22382 13024 -7220 33937 72194
22029 72194 55038 29912 -31773 -10389 19067 2444 -31975 -61182 -117377 -120011 -32739 10239
22017 10239 -14982 -32420 -18924 -17013 -57254 -73815 -83536 -76696 -28709 12661 -29981 -67829
22005 -67829 10488 4108 39847 41618 -29626 -53779 -52254 -72504 -38325 -29406 -11985 -28854
21993 -28854 -22067 -57658 -45950 17307 30725 24433 4796 14075 6399 -16450 16569 12541 40009
21980 40009 45174 38162 55756 2566 -8861 11577 4476 -3784 -833 31349 33522 -12497 -37265
$$ packed form
22066c5233J8837M2392j3198k1685K2438L1607Q283k2022l2023k5078l9796K9005
22054c6473L3449j0493O7050o366L086k9746m1240r4078o38N9834j205Q797K917
22041d5106q604M662P694j4837J1732O034j5347L1390L5406k0244M1157L8257
22029G2194j7156k5126o1685K1384K9456j6623l4419k9207n6195k634Q7272M2978
22017A0239k5221j7438J3496J911m0241j6561r721O840M7987M1370m2642l7848
22005f7829P8317o380L5739J771p1244k4153J525k0250L4179Q919J7421j6869
21993b8854O787l5591J1708O3257J3418o292j9637R279p676k2849L3019m028K7468
21980D0009N165p012J7594n3190j1427K0438p101q260K951L2182K173m6019k4768
$$ plain form
21967 -37265 -40384 -64187 -66223 -51128 -41847 -47382 -37252 -19262 -15419 -8208 -4727 -28864 -3695
21954 -3695 -8398 -8468 9507 7876 -7695 17906 44455 13619 -6657 -30234 -33095 -16991 -19381
21941 -19381 -23420 -955 -9401 -44649 -42414 -62742 -65696 9982 -26844 -55533 -61432 -71891 -65430
21928 -65430 -136550 -146272 -135511 -100237 -102239 -78296 -35538 4752 52948 48577 -18666 -31980
21916 -31980 -18034 16932 56069 44339 -15181 -79117 -50976 -24649 10309 2413 -43263 -35923
21904 -35923 -6506 8184 -15201 -31476 -39440 -87241 -67223 -75329 -87542 -87919 -95964 -81510 -82316
21891 -82316 -80385 -105993 -121687 -3600 27645 -11465 -30092 -66019 -125027 -147288 -112952 -161981
21879 -161981 -228239 -204882 -144218 -110593 -80446 -103182 -84099 -49995 -19532 -4613 38476
$$ packed form
21967c7265l119k3803k036J5095R281n535J0130J7990L843P211L481k4137K5169
21954c695m703p0J7975j631j5571K5601K6549l0836k0276k3577k861J6104k390
21941a9381m039K2465q446l5248K235k0328k954P5678l6826k8689n899j0459O461
21928f5430p1120r722J0761L5274k002K3943M2758M0290M8196m371o7243j3314
21916c1980J3946L4966L9137j1730n9520o3936K8141K6327L4958p896m5676P340
21904c5923K9417J4690k3385j6275p964m7801K0018q106j2213l77q045J4454q06
21891h2316J931k5608j5694J18087L1245l9110j8627l5927n9008k2261L4336m9029
21879a61981o6258K3357O0664L3625L0147k2736J9083L4104L0463J4919M3089
$$ plain form
21868 38476 57857 67006 108514 116624 99290 52484 14897 2692 -28145 -26529 -8246 635
21856 635 33413 3983 73497 52672 20198 -24769 -45501 -35382 -85276 -113925 -40492 8237
21844 8237 29928 57963 35782 9650 -25068 -57521 -103987 -112232 -71490 -68254 -67600 -72175 -60976
21831 -60976 -23222 -28915 -16439 10415 -28221 -41504 -27519 -45918 -27301 9757 -9084 -32624
21819 -32624 -39350 -94886 -103306 -62012 -71032 -124771 -81024 -52043 -106527 -82723 -38723 -63616
21807 -63616 4053 36443 28878 83773 100936 77011 69905 35545 23421 13199 3107 -22414
21795 -22414 -86487 -94161 -14110 30552 68427 85316 69866 35649 24828 8870 -831 39667
21783 39667 17324 47085 36264 11221 -18691 50328 56606 41736 6536 -19870 -43304 -28156
$$ packed form
21868C8476J9381R149M1508Q110j7334m6806l7587j2205l0837J616J8283Q881
21856F35L2778k9430O9514k0825l2474m4967k0732J0119m9894k8649P3433M8729
21844H237K1691K8035k2181k6132l4718l2453m6466q245M0742L236O54m575J1199
21831f0976L7754n693J2476K6854l8636j3283J3985j8399J8617L7058j8841k3540
21819c2624o726n5536q420M1294r020n3739M3747K8981n4484K3804M4000k4893
21807f3616O7669L2390p565N4895J7163k3925p106l4360j2124j0222j0092k5521
21795b2414o4073p674Q0051M4662L7875J6889j5450l4217j0821j5958r701M0498
21783C9667k2343K9761j0821k5043k9912O9019O278j4870l5200k6406k3434J5148
$$ plain form
21771 -28156 -19558 -16977 -3009 16199 38258 2218 -57354 -78225 -59607 -27799 -52299 -25243
21759 -25243 95 14372 41178 21039 -15390 -66504 -77262 -89653 -98162 -15574 25587 13970
21747 13970 33321 63900 57972 24799 -20956 -72768 -111382 -56441 -67871 -91953 -73896 -12961
21735 -12961 -53986 -47862 -6807 23130 13255 176 20710 17573 -17024 -15828 -31140 -76542
21723 -76542 -57432 -70499 -83239 -39803 -63472 -122617 -99986 -90020 -113950 -106172 -77559 -47518
21711 -47518 -8030 48646 41016 45106 27193 -2044 -13031 34071 5705 -42473 -57531 -26057
21699 -26057 -45372 -85133 -40811 -88740 -44474 -47096 -39880 7201 37607 32152 -11468 -6283
21687 -6283 -904 -21407 -313 19959 -35876 -55478 -32851 -17751 12298 66706 40204 20936
$$ packed form
21771b8156Q598K581J3968J9208K2059l6040n9572k0871J8618L1808k4500K7056
21759b5243K5338J4277K6806k0139l6429n1114j0758j2391q509Q2588M1161j1617
21747A3970J9351L0579n928l3173m5755n1812l8614N4941j1430k4082J8057O0935
21735a2961m1025O124M1055K9937r875j3079K0534l137l4597J196j5312m5402
21723g6542J9110j3067j2740M3436k3669n9145K2631R966k3930P778K8613L0041
21711d7518L9488N6676p630M090j7913k9237j0987M7102k8366m8178j5058L1474
21699b6057j9315l9761M4322m7929M4266k622P216M7081L0406n455m3620N185
21687f283N379k0503K1094K0272n5835j9602K2627J5100L0049N4408k6502j9268
$$ plain form
21675 20936 17905 30649 60028 87894 43735 -11891 -41510 -106909 -109960 -82099 -20950 40244
21663 40244 54483 -22778 -86117 -123158 -170524 -151976 -116326 -117975 -44127 -28834 -38997 -42128
21651 -42128 -69447 -20760 -88486 -108746 -82904 -68372 -100673 -133764 -53983 -42530 -89211 -119411
21639 -119411 -91718 -82407 -96539 -95716 -85050 -48848 -17606 -5354 -5188 2766 68360 122447 110214
21626 110214 83651 41897 52505 64963 55876 16523 -11643 -32255 -1622 14507 26968 52940
21614 52940 8001 -53883 -63226 -30119 -65350 -54772 -64410 -127286 -36708 2854 -51165 -85869
21602 -85869 -154892 -186046 -115200 -55702 -42150 -29479 -11701 -34345 -22684 23511 11391 53956
21590 53956 80475 72137 -4660 -68765 -77068 -20491 28890 35821 42232 2025 8394 38849 15490
$$ packed form
21675B0936l031J2744K9379K7866m4159n5626k9619o5399l051K7861O1149O1194
21663D0244J4239p7261o3339l7041m7366J8548L5650j649P3848J5293j0163l131
21651d2128k7319M8687o7726k0260K5842J4532l2301l3091P9781J1453m6681l0200
21639a19411K7693R311j4132Q23J0666L6202L1242J2252J66P954O5594N4087j2233
21626A10214k6563m1754J0608J2458r087l9353k8166k0612L0633J6129J2461K5972
21614E2940m4939o1884r343L3107l5231J0578r638o2876R0578L9562n4019l4704
21602h5869o9023l1154P0846N9498J3552J2671J7778k2644J1661M6195j2120M2565
21590E3956K6519q338p6797o4105q303N6577M9381O931O411m0207O369L0455k3359
$$ plain form
21577 15490 52098 -2038 -79311 -79529 10377 68163 34532 26660 16878 -73770 -124631 -126405 -103024
21564 -103024 -60217 -41881 -78985 -71894 -82140 -80764 -48751 -13272 -27090 -40414 -20394 -57458
21552 -57458 -65257 -31925 -5169 22560 -11993 -1024 6388 -6837 -36653 -50783 -26553 -36686
21540 -36686 -53241 -62635 -31085 12917 -18704 14144 31981 11255 1369 -47698 -48685 -86203
21528 -86203 -19003 -241 17541 31565 -10484 -84375 -88128 -71098 -57823 -62981 -80945 -57917
21516 -57917 18779 -7522 -20164 -60488 -33135 -59104 -52824 -10273 -3721 9114 43623 7018
21504 7018 -10187 -18556 -43831 -103781 -47498 -65701 -39598 -12881 -59631 -68161 -55171 -58740
21492 -58740 -87952 -134372 -119746 -62418 -35344 -53619 -30416 -35921 -35823 -22033 -49287 -32712
$$ packed form
21577A5490L6608n4136p7273k18Q9906N7786l3631p872r782r0648n0861j774K3381
21564a03024M2807J8336l7104P091j0246J376L2013L5479j3818j3324K0020l7064
21552e7458p799L3332K6756K7729l4553J0969P412j3225k9816j4130K4230j0133
21540c6686j6555r394L1550M4002l1621L2848J7837k0726r886m9067r87l7518
21528h6203O7200J8762J7782J4024m2049p3891l753J7030J3275n158j7964K3028
21516e7917P6696k6301j2642m0324K7353k5969O280M2551O552J2835L4509l6605
21504G018j7205q369k5275n9950N6283j8203K6103K6717m6750q530J2990l569
21492e8740k9212m6420J4626N7328K7074j8275K3203n505R8J3790k7254J6575
$$ plain form
21480 -32712 -47120 -64298 -80089 -50867 -32374 -86561 -117188 -110680 -53796 14590 8516 -6430
21468 -6430 -26551 -15959 2971 59372 71845 29509 31016 -10360 -26480 208 33936 5556
21456 5556 -41261 -708 43175 39557 41914 12446 -9526 -65097 -93785 -59802 -19518 326
21444 326 -11375 -25939 -64205 -68523 -71573 -27191 8763 16901 -24532 8324 -11448 -57380 -36049
21431 -36049 -29396 24349 31784 -15690 -29482 8969 65909 96688 109345 68709 36867 21459
21419 21459 -72677 -93383 -11636 8056 15188 70764 78871 51240 38378 35355 37358 4263
21407 4263 -74180 -64927 -85514 -126889 -67149 -67751 -80303 -76451 -58197 -42115 -69138 -62502 -24586
21394 -24586 -20962 -38194 -81815 -88241 -92104 -47165 -67120 -90329 -83344 -89202 -57943 -34764 -7594
$$ packed form
21480c2712j4408j7178j5791K9222J8493n4187l0627O508N6884O8386o074j4946
21468f430k0121J0592J8930N6401J2473m2336J507m1376j6120K6688L3728k8380
21456E556m6817M0553M3883l618K357k9468k1972n5571k8688L3983M0284J9844
21444C26j1701j4564l8266m318l050M4382L5954Q138m1433L2856j9772m5932K1331
21431c6049O653N3745P435m7474j3792L8451N6940L0779J2657m0636l1842j5408
21419B1459r4136k0706Q1747J9692P132N5576Q107k7631j2862l023K003l3095
21407D263p8443R253k0587m1375N9740o02j2552L852J8254J6082k7023O636L7916
21394b4586L624j7232m3621o426l863M4939j9955k3209O985n858L1259K3179K7170
$$ plain form
21381 -7594 58465 31489 -28396 -6324 -14548 -60342 -88046 -14805 53467 62786 47424 43923
21369 43923 5089 20638 52869 41606 23570 30215 36796 62000 64867 74563 64077 97798
21357 97798 97235 6299 -37884 -6156 57933 80832 10253 -13526 -41032 -57172 -86128 -97147
21345 -97147 -65440 -77195 -60130 -34014 -4375 2284 -18913 -31916 26278 7213 268 2085
21333 2085 20975 -598 7013 35002 46052 19978 -34169 -59749 -65817 -27351 -10892 -35622
21321 -35622 -68833 -56477 -24588 -47250 -4515 24682 -44471 -61255 4384 14850 48369 29989
21309 29989 -36298 -29356 -52602 -44010 -28318 -22484 -40282 13336 14436 1112 -68773 -116097
21297 -116097 -108544 -148418 -116186 -69167 -65730 -86079 -82888 -21142 29310 26987 12433 49579
$$ packed form
21381g594O6059k6976n9885K2072q224m5794k7704P3241O8272R319j5362l501
21369D3923l8834J5549L2231j1263j8036O645O581K5204K867R696j0486L3721
21357I7798n63r0936m4183L1728O4089K2899p0579k3779k7506j6140k8956j1019
21345i7147L1707j1755J7065K6116K9639O659k1197j3003N8194j9065o945J817
21333B085J8890k1573P611K7989J1050k6074n4147k5580o068L8466J6459k4730
21321c5622l3211J2356L1889k2662M2735K9197o9153j6784O5639J0466L3519j8380
21309B9989o6287O942k3246Q592J5692N834j7798N3618J100j3324o9885m7324
21297a16097P553l9874L2232M7019L437k0349L191O1746N0452k323j4554L7146
$$ plain form
21285 49579 64601 34472 8027 8732 44043 14069 14543 -4466 17665 46051 32846 8443
21273 8443 -41891 -58296 -96529 -77288 -37113 -47446 -38195 -24730 -19863 -33039 4541 37557
21261 37557 34926 29404 25360 -24922 5071 22092 -18035 -37406 -33479 -38053 16237 1817 -87624
21248 -87624 -80879 -76665 -51747 -55631 -75794 -112752 -111537 -128380 -63273 -2977 30381 -15746
21236 -15746 -41834 -50885 -16244 1916 839 -2719 10984 26407 25689 35930 9899 18181 18236
21223 18236 24965 30085 34203 107991 105104 57764 30048 19129 34713 33688 42797 17566 -1742
21210 -1742 -39736 -69858 -81421 -64113 -63397 -72842 -38818 -22777 -2226 715 -22659 -24378 4178
21197 4178 19618 1303 41564 67188 29506 22003 6935 -42903 -95711 -76524 -92460 -100863
$$ packed form
21285D9579J5022l0129k6445P05L5311k9974M74j9009K2131K8386j3205k4403
21273H443n0334j6405l8233J9241M0175j0333R251J3465M867j3176L7580L3016
21261C7557k631n522m044n0282K9993J7021m0127j9371L927m574N4290j4420q9441
21248h7624O745M214K4918l884k0163l6958J215j6843O5107O0296L3358m6127
21236a5746k6088r051L4641J8160j077l558J3703J5423p18J0241k6031Q282N5
21223A8236O729N120M118P3788k887m7340k7716j0919J5584j025R109k5231j9308
21210a742l7994l0122j1563J7308P16r445L4024J6041K0551K941k3374j719K8556
21197D178J5440j8315M0261K5624l7682p503j5068m9838n2808J9187j5936q403
$$ plain form
21185 -100863 -127074 -43004 -27520 -116341 -154647 -135984 -71315 -48507 -50266 -56841 -48994 -115199
21173 -115199 -146643 -92835 -89201 -150521 -123282 -89627 -67323 -43638 6431 25525 -32044 -61273
21161 -61273 -32163 -48039 -69400 -55747 6818 21635 14611 14674 614 -167 -11874 -18117 -106864
21148 -106864 -114179 -87783 -95686 -101052 -142487 -122816 -64592 -59678 -32992 -3808 14469 4044
21136 4044 -7666 -34276 -77854 -106799 -113277 -79007 -77595 -80254 -79240 -62689 -62813 -100941 -125202
21123 -125202 -99138 -77735 -83705 -18427 -18715 -55249 -9663 -1994 -15502 -26731 -24742 -45575
21111 -45575 -60118 -57925 -26845 -4895 10544 26231 1486 57865 86037 40793 27136 79949
21099 79949 85415 89561 91362 59383 57191 61559 76702 91389 76187 38643 54350 25906 2404
$$ packed form
21185a00863k6211Q4070J5484q8821l8306J8663O4669K2808j759o575P847o6205
21173a15199l1444N3808L634o1320K7239L3655K2304K3685N0069J9094n7569k9229
21161f1273K9110j5876k1361J3653O2565J4817p024O3j4060p81j1707o243q8747
21148a06864p315K6396p903n366m1435J9671N8224M914K6686K9184J8277j0425
21136D044j1710k6610m3578k8945o478L4270J412k659J014J6551j24l8128k4261
21123a25202K6064K1403n970O5278k88l6534M5586P669j3508j1229J989k0833
21111d5575j4543K193L1080K1950J5439J5687k4745N6379K8172m5244j3657N2813
21099G9949N466M146J801l1979k192M368J5143J4687j5202l7544J5707k8444k3502
$$ plain form
21086 2404 -21655 -13153 -38928 2308 15329 -15196 -39934 -66852 -11370 14884 -22021 -83706
21074 -83706 -90665 -57869 -16801 9359 60397 106164 26320 -72198 -67596 -36712 -10565 -658
21062 -658 52367 26896 -38632 -85551 -90770 -85736 9266 16696 44585 21366 61565 48049 24074
21049 24074 30062 35815 -8256 -92971 -123390 -42785 -12675 -18973 5386 -7522 -15827 -58645
21037 -58645 -3934 57488 64275 50702 -9258 -51798 -119539 -143561 -113838 -106262 -80550 -82258
21025 -82258 -61491 -34108 -20304 -57168 -110738 -77906 -21505 28717 37156 6469 -31210 -87169
21013 -87169 -114242 -124388 -58060 26192 41135 30625 724 -14756 -16060 -34189 4431 15357
21001 15357 38179 78653 16471 7487 -35000 -91090 -71207 -50233 -17183 -64291 -60691 5695
$$ packed form
21086B404k4059Q502k5775M1236J3021l0525k4738k6918N5482K6254l6905o1685
21074h3706o959L2796M1068K6160N1038M5767p9844r8518M602L0884K6147R907
21062f58N3025k5471o5528m6919n219N034R5002P430K7889k3219M0199j3516k3975
21049B4074N988N753m4071q4715l0419Q0605L0110o298K4359j2908q305m2818
21037e8645N4711O1422O787j3573n9960m2540o7741k4022K9723P576K5712j708
21025h2258K0767K7383J3804l6864n3570L2832N6401N0222Q439l0687l7679n5959
21013h7169k7073j0146O6328Q4252J4943j0510k9901j5480j304j8129L8620J0926
21001A5357K2822M0474o2182q984m2487n6090J9883K0974L3050m7108L600O6386
$$ plain form
20989 5695 48750 1078 -24515 -42613 -62566 -63887 -105631 -77641 -76926 -81700 -63556 -57874 -41078
20976 -41078 -59661 -60460 -48956 7741 5811 -28909 -75100 -22143 21119 2882 -36008 -18253
20964 -18253 -24936 -59381 -86973 -74998 -73535 -51105 -97137 -115712 -103289 -81319 -63032 -47933
20952 -47933 -54903 -73571 -50868 -77524 -110263 -146700 -140060 -77788 -68453 -87380 -76039 -86122
20940 -86122 -86130 -88824 -108846 -88657 -29193 -45507 -51898 -51082 -76640 -86079 -23141 -22659 -23715 -25554
20926 -25554 18421 4174 5264 -25657 -14217 36338 77207 48947 14548 -6881 56052 75195
20914 75195 40825 42309 23993 -29907 -64858 -62983 -74421 -83789 -111226 -72210 -99147 -103344
20902 -103344 -63949 -68898 -108783 -132112 -130226 -114664 -137391 -118376 -128656 -84441 -63949 -46859
$$ packed form
20989E695M3055m7672k5593j8098j9953j321m1744K7990P15m774J8144N682J6796
20976d1078j8583p99J1504N6697j930l4720m6191N2957M3262j8237l8890J7755
20964a8253o683l4445k7592J1975J463K2430m6032j8575J2423K1970J8287J5099
20952d7933o970j8668K2703k6656l2739l6437O640O2272R335j8927J1341j0083
20940h6122qk694k0022K0189N9464j6314o391Q16k5558r439O2938M82j056j839
20926b5554M3975j4247J090l0921J1440N0555M0869k8260l4399k1429O2933J9143
20914G5195l4370J484j8316n3900l4951J875j1438r368k7437L9016k6937m197
20902a03344L9395m949l9885k3329J886J5562k2727J9015j0280M4215K0492J7090
$$ plain form
20890 -46859 -21593 4055 -3917 4572 -1170 -5661 -28979 -36041 -12136 -23668 -43543 -49208 -57890
20877 -57890 -146712 -156725 -177957 -118796 -48241 -58430 -120245 -141341 -110748 -86511 -117381 -125092
20865 -125092 -128971 -131327 -65694 -9237 -65389 -68309 -26109 -850 22229 -17981 -7935 -14877
20853 -14877 -66067 2597 11856 -44058 -44314 3304 42656 64354 27129 17664 -11434 -24421
20841 -24421 -28350 -6785 -46637 823 -13613 -36932 -21151 13785 9379 12897 -42972 -124152
20829 -124152 -119347 -56434 -26973 -68331 -89310 -79296 -49467 -71468 -41694 -53927 -29099 -14298
20817 -14298 1479 -8619 -65904 -110471 -147410 -140193 -124771 -113115 -104120 -108205 -94112 -103572
20805 -103572 -93249 -67247 -89928 -96650 -91947 -94770 -94873 -89296 -129824 -151852 -90331 4525 27069
$$ packed form
20890d6859K5266K5648p972Q489n742m491k3318p062K3905j1532j9875n665q682
20877e7890q8822j0013k1232N9161P0555j0189o1815k1096L0593K4237l0870p711
20865a25092l879k356O5633N6457n6152k920M2200K5259K3079m0210J0046o942
20853a4877n1190O8664R259n5914k56M7618L9352K1698l7225r465k9098j2987
20841b4421l929K1565l9852M7460j4436k3319J5781L4936m406L518n5869q1180
20829a24152M805O2913K9461m1358k0979J0014K9829k2001K9774j2233K4828J4801
20817a4298J5777j0098n7285m4567l6939P217J5422J1656Q995m085J4093r460
20805a03572J0323K6002k2681o722M703k823j03N577m0528k2028O1521R4856K2544
$$ plain form
20792 27069 -36947 -24037 -42219 17262 51632 31164 16689 -25010 -47296 -66083 -47459 -55423
20780 -55423 -81557 -82214 -31102 -5413 26823 -51193 -145687 -157520 -128273 -90228 -88407 -50667
20768 -50667 14968 31017 23874 73174 83117 43764 10889 11312 7239 -25265 -21824 -42918 -35228
20755 -35228 -19279 6184 11272 44344 68917 74028 68323 -42867 -86815 -26602 -18970 57
20743 57 8556 29542 57349 38740 45061 -6448 -3659 33907 35917 14104 -52702 -90208 -58336
20730 -58336 -33068 -67427 -67909 -51341 -31812 -79695 -99255 -135464 -64154 -14491 -53342 -8359
20718 -8359 -22281 -40500 -16086 5172 -4337 -5057 40008 25083 -9960 -11647 41364 32978 44285
20705 44285 23401 -80937 -126960 -151788 -127553 -151549 -110173 -52050 28251 21791 2513 41334
$$ packed form
20792B7069o4016J2910j8182N9481L4370k0468j4475m1699k2286j8787J8624p964
20780e5423k6134o57N1112K5689L2236p8016r4494j1833K9247L8045J821L7740
20768e0667O5635J6049p143M9300R943l9353l2875M23m073l2504L441k1094P690
20755c5228J5949K5463N088L3072K4573N111n705j11190m3948O0213P632J9027
20743E7Q499K0986K7807j8609O321n1509K789L7566K010k1813o6806l7506L1872
20730e8336K5268l4359m82J6568J9529m7883j9560l6209P1310M9663l8851M4983
20718h359j3922j8219K4414K1258r509p20M5065j4925l5043j687N3011q386J1307
20705D4285k0884j04338m6023k4828K4235k3996M1376N8123Q0301o460j9278L8821
$$ plain form
20693 41334 -22548 -30751 -38884 -51206 -30177 -9138 -38439 -64487 -93204 -147776 -117087 -88507
20681 -88507 -70794 -32732 -50130 -71689 -31890 -73552 -137560 -160532 -142126 -166283 -149587 -94806
20669 -94806 -41412 -87231 -165604 -170806 -119623 -70869 -45347 -56339 -56079 -36896 -39394 -60481
20657 -60481 -39650 -16105 -85223 -60767 -13833 -52784 -100329 -99986 -54675 -68606 -61120 -4735
20645 -4735 38069 24581 -12418 -22997 -69288 -82006 -87794 -69716 -86280 -94372 -65677 -56232
20633 -56232 -50230 -38632 -52762 -69964 -44876 4095 57356 53632 65276 71062 86766 57643
20621 57643 25264 1302 -54851 -35238 21464 -19504 -35856 -88626 -42696 7593 27959 40798
20609 40798 28496 -2589 -43113 -5150 -2799 -1470 -20820 37424 67638 -3876 20040 73300
$$ packed form
20693D1334o3882q203q133j2322K1029K1039k9301k6048k8717n4572L0689K8580
20681h8507J7713L8062j7398k1559L9799m1662o4008k2972J8406k4157J6696N4781
20669i4806N3394m5819p8373n202N1183M8754K5522j0992K60J9183k498k1087
20657f0481K0831K3545o9118K4456M6934l8951m7545L43M5311j3931P486N6385
20645d735M2804j3488l6999j0579m6291j2718n788J8078j6564q092K8695R445
20633e6232O002J1598j4130j7202K5088M8971N3261l724J1644N786J5704k9123
20621E7643l2379k3962n6153J9613N6702m0968j6352n2770M5930N0289K0366J2839
20609D0798j2302l1085m0524L7963K351J329j9350N8244L0214p1514K3916N3260
$$ plain form
20597 73300 16567 -33903 9884 84002 75465 -3721 -48849 5032 -2847 -55555 -74375 -90474
20585 -90474 -66910 -49729 -59983 -83360 -43527 -11633 33487 39559 68687 93710 39603 50303
20573 50303 98173 94884 91568 92132 75937 30838 7754 44200 38357 17544 17090 2999 -20623
20560 -20623 -39767 -48808 -54273 9454 -21871 -125415 -115144 -89039 -68466 -5674 30355 -6724
20548 -6724 -73684 -47926 -22728 -61473 -78340 -108309 -93587 -53671 -42020 -69172 -85750 -54287
20536 -54287 -37951 -73080 -97812 -93716 -48422 41300 34183 -61893 -85134 -3283 13766 -3135
20524 -3135 -37665 -64541 -94218 -101355 -48585 -6703 -11564 -10822 -21828 -94141 -120227 -66139 -67685
20511 -67685 -59120 58908 97799 62431 47965 77061 90269 68212 11368 -51038 -52092 -36873
$$ packed form
20597G3300n6733n0470M3787P4118q537p9186m5128N3881p879n2708j8820j6099
20585i0474K3564J7181j0254k3377L9833L1894M5120O072K9128K5023n4107J0700
20573E0303M7870l289l316N64j6195m5099k3084L6446n843k0813m54j4091k3622
20560b0623j9144r041n465O3727l1325j03544J0271K6105K0573O2792L6029l7079
20548f724o6960K5758K5198l8745j6867k9969J4722L9916J1651k7152j6578L1463
20536e4287J6336l5129k4732M096M5294Q9722p117r6076k3241Q1851J7049j6901
20524c135l4530k6876k9677p137N2770M1882m861P42j1006p2313k6086N4088j546
20511f7685Q565J18028L8891l5368j4466K9096J3208k2057n6844o2406j054J5219
$$ plain form
20499 -36873 -15071 -12758 -82720 -122222 -109890 -85758 -50336 -104445 -91437 -78255 -73924 -83775
20487 -83775 -110462 -99022 -26180 17584 -21460 -33716 -32491 -29436 -18094 2481 9567 -1046
20475 -1046 16854 25355 17457 851 -1866 -55629 -97315 -102555 -71680 -9199 30095 28695 -6835
20462 -6835 -6263 6390 -37854 -66843 -96415 -71502 -66646 -34856 -7800 -11359 5538 8723 14864
20449 14864 -971 -10084 -65441 -58974 -14795 8167 -13085 -56495 -72890 -42651 -24032 -72815
20437 -72815 -87998 -70518 -90930 -101346 -68185 -19923 19339 -2901 20623 44055 39963 -9533
20425 -9533 -43187 -75483 -44394 -35855 -61285 -75455 -83733 -72611 -49479 -32725 -72902 -24989
20413 -24989 -14005 -12334 -4266 -3757 -18306 15475 -5766 -16358 -21989 -61408 -23271 -20141 -54487
$$ packed form
20499c6873K1802K313o9962l9502J2332K4132L5422n4109J3008J3182M331r851
20487h3775k6687J1440P2842M3764l9044j2256J225L055J1342K0575P086j0613
20475a046J7900Q501p898j6606k717n3763m1686n240L0875O2481L9294j400l5530
20462f835N72J2653m4244k8989k9572K4913M856L1790K7056l559J6897L185O141
20449A4864j5835r113n5357O467M4179K2962k1252m3410j6395L0239J8619m8783
20437g2815j5183J7480k0412j0416L3161M8262L9262k2240K3524K3432m092m9496
20425i533l3654l2296L1089Q539k5430j4170q278J1122K3132J6754m0177M7913
20413b4989J0984J671Q068N09j4549L3781k1241j0592n631l9419L8137L130l4346
$$ plain form
20400 -54487 -28265 -8748 16834 52394 57943 50328 68321 -17893 -113057 -156112 -115309 -119924
20388 -119924 -99300 -109336 -53257 1320 29752 25375 5506 -6265 -30026 -2390 -45248 -72105
20376 -72105 -12837 -19449 -19471 -22906 6449 33389 12083 -50057 -74164 -77964 -132645 -123377 -50473
20363 -50473 12409 72290 47121 32371 57101 104114 87291 -5560 -31837 -9948 -29421 -59064
20351 -59064 -49676 -30439 -12845 -10370 -33916 1264 39481 26596 -38626 -68828 -102357 -84311
20339 -84311 -92128 -77801 -35775 -73101 -94629 -123873 -90420 -25552 -72294 -137174 -138007 -66709
20327 -66709 -24826 -84020 -71227 -48763 -83562 -100499 -121819 -108170 -99666 -73480 -46988 -47553
20315 -47553 -73910 -93270 -77425 -60441 -64138 -63132 -76169 -75003 -114381 -79643 -14261 -31171
$$ packed form
20400e4487K6222J9517K5582L5560N549p615J7993q6214r5164m3055M0803m615
20388a19924K0624j0036N6079N4577K8432m377j9869j1771k3761K7636m2858k6857
20376g2105N9268o612k2l435K9355K6940k1306o2140k4107l800n4681R268P2904
20363e0473O2882N9881k5169j4750K4730M7013j6823r2851k6277K1889j9473k9643
20351e9064R388J9237J7594K475k3546L5180L8217j2885o5222l0202l3529J8046
20339h4311p817J4327M2026l7326k1528k9244L3453O4868m6742o4880q33P1298
20327f6709M1883n9194J2793K2464l4799j6937k1320J3649Q504K6186K6492n65
20315d7553k6357j9360J5845J6984l697J006j3037J166l9378L4738O5382j6910
$$ plain form
20303 -31171 -59631 -40465 -59645 -30172 16598 -5555 -66543 -84381 -77154 -55006 22254 21137
20291 21137 -836 -6725 -4613 21544 37080 10753 -14995 -11809 -38473 -89201 -89145 -39709 2474
20278 2474 38559 37303 4849 -925 -25720 -34717 -63794 -94007 -102353 -42702 -3282 -58666 -130510
20265 -130510 -193243 -117674 -99579 -79174 -51607 -5247 -3349 -55538 -77034 -61866 -21728 38076
20253 38076 21285 58621 16757 -61246 -67168 -75634 -38245 -67482 -90587 -125989 -186373 -145354
20241 -145354 -94956 -136509 -138780 -66231 -42050 -42918 -41708 -26702 -5696 -23340 -40280 -45713
20229 -45713 -60805 -42175 -24041 -44794 -69456 -61094 -36511 18191 12145 -4600 4692 40457
20217 40457 -14862 -90755 -74249 -81562 -120591 -92851 -108152 -201027 -196033 -120621 -56079 -51652
$$ packed form
20303c1171k8460J9166j9180K9473M6770k2153o0988j7838P227K2148P7260j117
20291B1137k1973n889K112K6157J5536k6327k5748L186k6664n0728N6M9436M2183
20278B474L6085j256l2454n774k4795q997k9077l0213q346N9651L9420n5384p1844
20265a30510o2733P5569J8095K0405K7567M6360J898n2189k1496J5168M0138N9804
20253C8076j6791L7336m1864p8003n922q466L7389k9237k3105l5402o0384M1019
20241a45354N0398m1553k271P2549K4181q68J210J5006K1006j7644j6940n433
20229d5713j5092J8630J8134k0753k4662Q362K4583N4702o046j6745R292L5765
20217D0457n5319p5893J6506p313l9029K7740j5301r2875M994P5412O4542M427
$$ plain form
20205 -51652 -69112 -60094 -36064 -55787 -48468 -26810 -63780 -67166 -76054 -78651 -57365 -35060 -58844
20192 -58844 -72358 -64377 -88642 -129536 -109242 -54774 -10402 -32196 -22568 25092 54215 59827
20180 59827 68750 18606 -70979 -47988 -25603 11734 23963 3812 -45998 -98884 -76071 -69923
20168 -69923 -97868 -130643 -144257 -119508 -69905 -15864 1622 51387 67273 -12917 -37272 -48458
20156 -48458 -10809 27189 5948 27319 10310 27516 34828 -43436 -91638 -96438 -41777 -37931
20144 -37931 -71106 -64272 -29060 6321 68974 108217 14328 -32475 -25264 -18616 -11435 -13292 29566
20131 29566 37372 38387 -13662 -58563 -46340 -75511 -93542 -87540 -46529 4670 60480 55841
20119 55841 -3838 -16034 -6363 3609 7305 -28233 -42599 -27635 -47332 -36546 -66130 -17395
$$ packed form
20205e1652j7460R018K4030j9723P319K1658l6970l386q888k597K1286K2305k3784
20192e8844j3514P981k4265m0894K0294N4468M4372k1794R628M7660K9123N612
20180E9827Q923n0144q9585K2991K2385L7337J2229k0151m9810n2886K2813O148
20168f9923k7945l2775j3614K4749M9603N4041J7486M9765J5886q0190k4355j1186
20156d8458L7649L7998k1241K1371j7009J7206P312p8264m8202m800N4661L846
20144c7931l3175O834L5212L5381O2653L9243r3889m6803P211O648P181j857M2858
20131B9566P806J015n2049m4901J2223k9171j8031O002M1011N1199N5810m639
20119E5841n9679j2196R671R972L696l5538j4366J4964j9697J0786k9584M8735
$$ plain form
20107 -17395 -19070 -29296 -49238 -72062 -123069 -132354 -107150 -42026 -23622 -29133 -47386 -17576
20095 -17576 -19336 -35796 -45413 -58069 -60820 -88343 -112299 -90523 -93639 -90175 -44470 -38701 -12199
20082 -12199 -74205 -110149 -134478 -107497 -95309 -86012 -64645 -64992 -53838 -66709 -78845 -72554
20070 -72554 -103421 -113643 -58485 -20517 -54066 -61281 -66959 -39293 -48427 -32267 50952 60192
20058 60192 30743 31981 40202 32924 -40345 -27721 -37719 -97052 -131620 -75518 -36961 2177
20046 2177 -7290 20525 16228 3843 7626 6243 20555 11166 -25077 -84782 -82559 -92515 -76685
20033 -76685 -98853 -93222 -94133 -88135 -63442 -16065 21810 3071 -22635 -51463 -74834 -79339 -33291
20020 -33291 12083 -4605 -42923 -71557 24964 23933 -27969 -52652 -72560 -67722 -74051 -63722
$$ packed form
20107a7395j675j0226j9942k2824n1007r285K5204O5124J8404n511j8253K9810
20095a7576j760j6460r617j2656k751k7523k3956K1776l116L464M5705N769K6502
20082a2199o2006l5944k4329K6981J2188R297K1367l47J1154j2871j2136O291
20070g2554l0867j0222N5158L7968l3549p215n678K7666r134J6160Q3219R240
20058F0192k9449J238Q221p278p3269J2624r998n9333l4568N6102L8557L9138
20046B177r467K7815m297j2385L783j383J4312r389l6243n9705K223r956J5830
20033g6685k2168N631r11N998K4693M7377L7875j8739k5706k8828k3371m505M6048
20020c3291M5374j6688l8318k8634R6521j031n1902k4683j9908M838o329J0329
$$ plain form
20008 -63722 -38868 -46280 -38658 -76670 -94123 -63837 -49776 -56816 -30586 -20165 -55935 -45601
19996 -45601 1906 -7807 -7914 5185 18511 -17736 -57763 -35457 -20046 -13066 -6979 -30459 -53802
19983 -53802 -17104 -54178 -60396 -56271 -43117 -43660 -21626 -4999 -4042 -57246 -44504 -8423 -21175
19970 -21175 -25369 -33868 -8365 -65311 -105659 -100783 12723 27950 -7123 -44598 -91948 -113998
19958 -113998 -150678 -123075 -53121 -24228 -23642 20853 40629 -7924 -70706 -43484 -9376 1743
19946 1743 -4654 -43369 -72603 -68410 -98065 -73677 -9035 20825 18837 39562 56570 16980
19934 16980 -62633 -82292 -32651 2308 -6971 -39067 -52882 7982 -11353 -44564 -65380 -71643
19922 -71643 -94571 -115989 -64907 -29871 -44367 -38735 -29562 -39827 -69949 -76455 -67897 -13260
$$ packed form
20008f3722K4854p412P622l8012j7453L0286J4061p040K6230J0421l5770J0334
19996d5601M7507r713j07J3099J3326l6247m0027K2306J5411O980O087k3480k3343
19983e3802L6698l7074o218M125J3154n43K2034J6627R57n3204J2742L6081j2752
19970b1175m194q499K5503n6946m0348M876J13506J5227l5073l7475m7350k2050
19958a13998l6680K7603O9954K8893N86M4495J9776m8553o2782K7222L4108J1119
19946A743o397l8715k9234M193k9655K4388O4642K9860j988K0725J7008l9590
19934A6980p9613j9659M9641L4959r279l2096j3815O0864j9335l3211k0816o263
19922g1643k2928k1418N1082L5036j4496N632R173j0265l0122o506Q558N4637
$$ plain form
19910 -13260 -35970 -99316 -87229 -95433 -83568 -52085 27775 -20897 -107213 -118511 -112407 -89412
19898 -89412 -22710 -15420 -62913 -78692 -73827 -36472 -72328 -71949 -37344 -14365 34078 48145
19886 48145 88174 82720 35128 -8907 856 -12791 -17667 -26433 -85870 -30852 22781 92434
19874 92434 113283 63360 72428 42887 21993 -7783 30091 43760 -7309 -22884 -17204 -79700
19862 -79700 -103537 -74792 -43200 -10514 -45505 -88459 -118103 -106909 -77555 -61709 -47958 -12280
19850 -12280 12763 -22787 -58745 -25108 -38712 -86012 -127039 -137606 -108622 -136574 -90013 -44833
19838 -44833 -52611 -76783 -6473 3166 -23846 -83235 -71385 -4669 -24453 -41622 -52176 -50297
19826 -50297 -49968 -31587 -60283 -21130 19449 11086 9086 13819 -6133 -40139 -51321 21464 36707
$$ packed form
19910a3260k2710o3346J2087q204J1865L1483P9860m8672q6316j1298O104K2995
19898h9412O6702P290m7493j5779M865L7355l5856L79L4605K2979M8443J4067
19886D8145M0029n454m7592m4035R763j3647m876q766n9437N5018N3633O9653
19874I2434K0849m9923R068k9541k0894k9776L7874J3669n1069j5575N680o2496
19862g9700k3837K8745L1592L2686l4991m2954k9644J1194K9354J5846J3751L5678
19850a2280K5043l5550l5958L3637j3604m7300m1027j0567K8984k7952M6561M5180
19838d4833p778k4172P0310R639k7012n9389J1850O6716j9784j7169j0554J879
19826e0297L29J8381k8696L9153M0579q363k000M733j9952l4006j1182P2785J5243
$$ plain form
19813 36707 -5558 -14075 27145 79489 92012 86242 46156 -16899 -37135 -40921 -45191 -39146 -14266
19800 -14266 -3781 -26477 -7728 -28737 -74133 -76716 -87897 -93720 -121097 -113201 -71552 -59292
19788 -59292 -114088 -110231 -82359 -79270 -79407 -83148 -18864 33059 -4488 -72904 -72641 -32939 -24117
19775 -24117 -18349 20699 8927 1791 -28664 -77595 -43412 -24230 -53812 -63969 -98837 -128439
19763 -128439 -94669 -23477 7665 56398 52112 56971 53110 43986 -1507 -36006 -81416 -101193
19751 -101193 -75885 -66212 -71932 -38970 -39367 -65599 -58151 -49386 -38671 -88931 -115307 -92789 -47823
19738 -47823 -19771 18230 12190 9182 11786 -435 -40454 -30831 -82686 -149587 -112925 -67340
19726 -67340 -36410 -27855 -45333 -30148 -37972 -53599 -73500 -70077 -101229 -96123 -131883 -130040 -93648
$$ packed form
19813C6707m2265q517M1220N2344J2523n770m0086o3055k0236l786m270O045K4880
19800a4266J0485k2696J8749k1009m5396k583j1181n823k7377P896M1649J2260
19788e9292n4796L857K7872L089j37l741O4284N1923l7547o8416K63L9702Q822
19775b4117N768L9048j1772p136l0455m8931L4183J9182k9582j0157l4868k9602
19763a28439L3770P1192L1142M8733m286M859l861r124m5493l4499m5410j9777
19751a01193K5308R673n720L2962l97k6232P448Q765J0715n0260k6376K2518M4966
19738d7823K8052L8001o040l008K604j2221m0019R623n1855o6901L6662M5585
19726f7340L0930Q555j7478J5185p824j5627j9901L423l1152N106l5760J843L6392
$$ plain form
19713 -93648 -97746 -61949 -50462 -64816 -33829 -78634 -105850 -109396 -96197 -112346 -116051 -95099
19701 -95099 -36417 -58536 -83577 -92238 -99544 -62378 -57551 -32684 -22925 16356 -5393 -19409
19689 -19409 13119 52253 606 -43979 -38405 -29879 -78100 -73636 -60571 -83574 -56712 -51048
19677 -51048 -49274 -68809 -85365 -100489 -154905 -123752 -62140 -91213 -85672 -10198 -25828 -45972
19665 -45972 -137078 -184934 -228232 -229599 -136875 -51791 -22331 -25638 7056 15035 -8579 -55125
19653 -55125 -121837 -103727 -89843 -55704 -59037 -53985 -100387 -108585 -60399 -70073 -33893 -6011
19641 -6011 22561 -36182 -80561 -142700 -194472 -192396 -159038 -79465 -81705 -86428 -107660 -125919
19629 -125919 -101732 -99039 -128754 -137769 -141355 -107166 -55814 -50508 -91828 -110301 -87091 -88250
$$ packed form
19713i3648m098L5797J1487j4354L0987m4805k7216l546J3199j6149l705K0952
19701i5099N8682k2119k5041q661p306L7166M827K4867R759L9281k1749j4016
19689a9409L2528L9134n1647m4585N574Q526m8221M464J3065k3003K6862N664
19677e1048J774j9535j6556j5124n4416L1153O1612k9073N541P5474j5630k0144
19665d5972r1106m7856m3298j367R2724Q5084K9460l307L2694P979k3614m6546
19653e5125o6712J8110J3884L4139l333N052m6402q198M8186r674L6180K7882
19641f011K8572n8743m4379o2139n1772K076L3358P9573k240m723k1232j8259
19629a25919K4187K693k9715r015l586L4189N1352N306m1320j8473K3210j159
$$ plain form
19617 -88250 -64616 -77871 -49935 -57452 -34760 4015 -16601 -24258 -1707 9831 12128 -17020
19605 -17020 -61054 -41780 8221 -28579 -90837 -82724 -93770 -79410 -55160 -51545 -41851 -44905
19593 -44905 -27815 -8507 -20690 -35362 -44197 -37619 -61557 -33660 16449 56949 63519 51662
19581 51662 55551 47869 -22026 -10774 -46503 -106117 -93232 -13304 941 -9134 -59729 -107099
19569 -107099 -141947 -132108 -105162 -134524 -144145 -111999 -131124 -127608 -93283 -90468 -104064 -89541
19557 -89541 -120849 -85749 22746 17267 276 33341 32108 -11878 -18046 41098 53897 32355
19545 32355 5277 3284 58975 44025 -21274 -31411 -31508 -37326 -44712 -50510 25079 38463 9032
19532 9032 9110 7322 50042 68011 58115 49505 100916 112458 140852 186102 320176 551335 774075
$$ packed form
19617h8250K3634j3255K7936p517K2692L8775k0616p657K2551J1538K297k9148
19605a7020m4034J9274N0001l6800o2258Q113j1046J4360K4250L615R694l054
19593d4905J7090J9308j2183j4672q835O578k3938K7897N0109M0500O570j1857
19581E1662L889p682o9895J1252l5729n9614J2885P9928J4245j0075n0595m7370
19569a07099l4848R839K6946k9362r621L2146j9125L516L4325K815j3596J4523
19557h9541l1308L5100J08495n479j6991L3065j233m3986o168N9144J2799k1542
19545C2355k7078j993N5691j4950o5299j0137r7n818p386n798P5589J3384k9431
19532I032P8j788M2720J7969r896q610N1411J1542K8394M5250J34074K31159K22740
$$ plain form
19519 774075 982229 1102102 1078220 1045890 1085943 1028650 834918 705982 574277 461081
19509 461081 406833 386513 510459 692433 875021 1119076 1223057 1155316 1143038 1222678
19499 1222678 1170717 924868 688770 454370 228265 150237 133746 143568 159406 144403 153649
19488 153649 156687 110136 73879 25815 -13627 -29515 -33908 -11776 -9483 -52875 -64376 -49720
19476 -49720 -35362 -73543 -128973 -121185 -104025 -77086 -77650 -101024 -60376 -57479 -54757 -23104 -39218
19463 -39218 -48529 -60344 -45889 -73280 -68576 -112799 -96648 -76182 -106574 -101031 -81592 -84862
19451 -84862 -32291 2561 13747 -45773 -77054 -93790 -86391 -60536 -84206 -66008 -42143 -54564
19439 -54564 -80033 -71960 -12218 -12788 -47771 -25845 -26883 24132 20065 29410 21539 -20070 -41051
$$ packed form
19519G74075K08154J19873k3882l2330M0053n7293j93732j28936j31705j13196
19509D61081n4248k0320J23946J81974J82588K44055J03981o7741j2278P9640
19499A222678n1961k45849k36098k34400k26105p8028j6491R822J5838j5003R246
19488A53649L038m6551l6257m8064l9442j5888m393K2132K293m3392j1501J4656
19476d9720J4358l8181n5430P788J7160K6939n64k3374M0648K897K722L1653j6114
19463c9218r311j1815J4455k7391M704m4223J6151K0466l0392N543J9439l270
19451h4862N2571L4852J1186n9520l1281j6736P399K5855k3670J8198K3865j2421
19439e4564k5469Q073N9742n70l4983K1926j038N1015m067R345p871m1609k0981
$$ plain form
19426 -41051 -15535 26626 12612 25087 -2050 36214 36214 -117 8009 31826 3874 -1835 -8077
19413 -8077 -28812 -45149 -35879 -32849 -69971 -96315 -48781 -41023 -20421 18340 41307 55477
19401 55477 38440 -39494 -63084 -29874 26685 79190 118147 74295 59120 44452 -5988 -15911
19389 -15911 14761 20983 -23629 -20774 -41077 -32120 -29658 -52841 -107220 -137748 -129561 -129767 -90769
19376 -90769 -65262 -72730 -50400 -44191 -64869 -128433 -121114 -101752 -111112 -121729 -117646 -122126 -104451
19363 -104451 -75259 -607 3816 -10259 -7454 43991 45670 2576 -30158 55879 104955 117335
19351 117335 188693 214371 306921 372146 464590 643390 824250 887272 943421 1007877 1018156
19340 1018156 1017621 1007158 963727 919425 871899 880794 896776 963057 1005856 1027966 1029311 983355
$$ packed form
19426d1051K5516M2161j4014J2475k7137L8264%l6331Q126K3817k7952n709o242
19413h077k0735j6337R270L030l7122k6344M7534P758K0602L8761K2967J4170
19401E5477j7037p7934k3590L3210N6559N2505L8957m3852j5175j4668n0440r923
19389a5911L0672O222m4612K855k0303Q957K462k3183n4379l0528Q187k06L8998
19376i0769K5507p468K2330O209k0678o3564P319J9362r360j0617M083m480J7675
19363a04451K9192P4652M423j4075K805N1445J679m3094l2734Q6037M9076J2380
19351A17335P1358K5678R2550O5225R2444J78800J80860O3022N6149O4456J0279
19340A018156n35j0463m3431m4302m7526Q895J5982O6281M2799K2110J345m5956
$$ plain form
19328 983355 922484 850295 750688 592445 436150 285013 215332 246716 190742 154561 141603
19317 141603 76966 98565 177368 216507 189504 208673 185572 168586 157067 166832 158995 200974
19305 200974 214466 228694 204806 181488 199613 245180 274254 282882 252508 298116 313323 309895
19293 309895 295929 331418 381491 377928 354064 294037 211919 180842 205074 216883 192607 160298
19281 160298 157997 108849 76668 46932 11040 19297 -2392 7265 -13142 -1803 4003 52500
19269 52500 55607 -5390 -67603 -59505 -67923 -76012 -122446 -104289 -41220 1463 -6326 -62271 -76388
19256 -76388 -140615 -159714 -74075 -46773 -38362 -53102 -74042 -65961 -61615 -54764 -46851 -53900 -51456
19243 -51456 -129971 -169218 -169107 -141003 -102975 -21615 16795 9213 -34917 -65474 -43492 -61471
$$ packed form
19328I83355o0871p2189r9607j58243j56295j51137o9681L1384n5974l6181j2958
19317A41603o4637K1599P8803L9139k7003J9169k3101j6986j1519R765p837M1979
19305B00974J3492J4228k3888k3318J8125M5567K9074Q628l0374M5608J5207l428
19293C09895j3966L5489N0073l563k3864o0027q2118l1077K4232J1809k4276l2309
19281A60298k301m9148l2181k9736l5892Q257k1689R657k0407J1339N806M8497
19269E2500L107o0997o2213Q098q418q089m6434J8157O3069M2683p789n5945j4117
19256g6388o4227j9099Q5639K7302Q411j4740k0940Q081M346O851P913p049K444
19243e1456p8515l9247J11K8104L8028Q1360L8410p582m4130l0557K1982j7979
$$ plain form
19231 -61471 -93397 -103018 -115278 -98480 -78454 -53550 -51690 -61892 -40977 -28905 -19253 -42377
19219 -42377 -72942 -107159 -124839 -65549 -35523 -16090 -1351 19747 -33249 -79683 -73607 -84648
19207 -84648 -53818 -73504 -77587 -67367 -84507 -136314 -200931 -134724 -76689 -77879 -87279 -2915
19195 -2915 -29281 -113577 -148439 -86640 -67807 -76017 -46360 -55880 -36360 -2230 18065 21790
19183 21790 83306 134724 160588 157253 94816 90340 52871 27801 -5364 -15392 -4325 68348
19171 68348 87956 104829 107396 69130 40096 40929 28797 -7046 -24631 17238 -24525 -57220
19159 -57220 -65729 -103197 -120593 -150620 -119389 -108192 -105200 -138120 -129901 -68801 -75390 -103926
19147 -103926 -89261 -30086 18448 56194 38491 2736 -36321 -65702 -98030 -65534 -45952
$$ packed form
19231f1471l1926r621j2260J6798K0026K4904J860j0202K0915J2072R652k3124
19219d2377l0565l4217j7680N9290L0026J9433J4739K1098n2996m6434O076j1041
19207h4648L0830j9686m083J0220j7140n1807o4617O6207N8035j190r400Q4364
19195b915k6366q4296l4862O1799J8833q210K9657r520J9520L4130K0295L725
19183B1790O1516N1418K5864l335o2437m476l7469k5070l3165j0028J1067P2673
19171F8348J9608J6873K567l8266k9034Q33j2132l5843j7585M1869m1763l2695
19159e7220q509l7468j7396l0027L1231J1197K992l2920Q219O1100o589k8536
19147a03926J4665N9175M8534L7746j7703l5755l9057k9381l2328L2496J9582
$$ plain form
19136 -45952 -66161 -106559 -151309 -162567 -96553 -39341 8259 -18043 -41150 -58789 -37930 -4642
19124 -4642 -52 -1450 40791 81211 33198 -48690 -16254 99471 89835 58456 29142 -15714
19112 -15714 -36456 -18868 -64779 -96429 -73966 -27176 7565 64518 12954 -10744 -61161 -70179
19100 -70179 -107214 -150815 -145811 -122047 -116114 -50712 -67379 -84820 -104095 -153059 -114363 -104583
19088 -104583 -152081 -151778 -165785 -155895 -114227 -108779 -101191 -59505 -51911 -68998 -28557 -31075 -92832
19075 -92832 -170003 -219937 -244574 -277018 -236039 -171172 -232645 -276110 -288510 -253800 -216288 -180736
19063 -180736 -167373 -165651 -142216 -126336 -151765 -143460 -71392 -36641 -49042 -104866 -105548 -52832
19051 -52832 -68505 -128308 -94327 -97512 -114585 -98747 -146024 -230075 -220821 -196476 -240763 -251899
$$ packed form
19136d5952k0209m0398m4750j1258O6014N7212M7600k6302k3107j7639K0859L3288
19124d642M590j398M2241M0420m8013q1888L2436J15725r636l1379k9314m4856
19112a5714k0742J7588m5911l1650K2463M6790L4741N6953n1564k3698n0417r018
19100g0179l7035m3601N004K3764N933O5402j6667j7441j9275m8964L8696R780
19088a04583m7498L03j4007R890M1668N448P588M1686P594j7087M0441k518o1757
19075i2832p7171m9934k4637l2444M0979O4867o1473m3465j2400L4710L7512L5552
19063a80736J3363J722K3435J5880k5429Q305P2068L4751j2401n5824o82N2716
19051e2832j5673n9803L3981l185j7073J5838m7277q4051R254K4345m4287j1136
$$ plain form
19039 -251899 -211997 -173316 -126509 -43083 -7466 -70078 -72241 -33942 -20462 -59902 -87453 -125011
19027 -125011 -180346 -225038 -222979 -126367 -117369 -80601 -32765 60513 108667 117944 145375 160943
19015 160943 90815 110911 99144 108814 79130 109481 136965 162951 215589 232110 291993 300251
19003 300251 227090 181036 189866 155071 160653 151283 138310 112552 90716 127153 177266 219785
18991 219785 251167 297310 341817 363397 411007 452567 498340 499517 461633 455903 460177 405172
18979 405172 412644 447477 463314 525151 611149 688732 759761 879197 1005297 1069263 1229016
18968 1229016 1420965 1526392 1669663 1799405 1934436 2144746 2430175 2812786 3330701
18959 3330701 3914051 4466652 4892154 5340573 5655334 5902126 6042087 6109757 6150857 6312761
$$ packed form
19039b51899L9902L8681M6807Q3426L5617o2612k163L8299J3480l9440k7551l7558
19027a25011n5335m4692K059R6612Q998L6768M7836R3278M8154R277K7431J5568
19015A60943p0128K0096j1767R670k9684L0351K7484K5986N2638J6521N9883Q258
19003C00251p3161m6054Q830l4795N582r370j2973k5758k1836L6437N0113M2519
18991B19785L1382M6143M4507K1580M7610M1560M5773J177l7884n730M274n5005
18979D05172P472L4833J5837O1837Q5998P7583P1029J19436J26100O3966J59753
18968A229016J91949J05427J43271J29742J35031K10310K85429L82611N17915
18959C330701N83350N52601M25502M48419L14761K46792J39961O7670M1100J61904
$$ plain form
18949 6312761 6788393 7471535 8340074 9505734 11038987 12847214 14890874 17231485 20144263
18940 20144263 23779147 28658728 35482616 45570392 61312329 86529523 124584534
18933 124584534 170774433 206972239 222458649 225902548 232105251 236309968 221446202
18926 221446202 186050424 144546068 112493689 93983442 87237663 91116569 106735187
18919 106735187 136745325 178616548 215826486 232856871 234272340 235732303 238664083
18912 238664083 225521480 189973362 143637573 103424230 75500594 57312688 45370089
18905 45370089 37156469 31169362 26637166 23276923 20731507 18525758 16453684 14604022
18897 14604022 13081890 11752894 10662528 9828983 9251782 8842951 8703660 8731009 8604321
$$ packed form
18949F312761M75632O83142Q68539J165660J533253J808227K043660K340611K912778
18940B0144263L634884M879581O823888J0087776J5741937K5217194L8055011
18933A24584534M6189899L6197806J5486410L443899O202703M204717j4863766
18926B21446202l5395778m1504356l2052379j8510247o745779L878906J5618618
18919A06735187L0010138M1871223L7209938J7030385J415469J459963K931780
18912B38664083j3142603l5548118m6335789m0213343k7923636j8187906j1942599
18905D5370089q213620n987107m532196l360243k545416k205749k072074j849662
18897A4604022j522132j328996j090366q33545n77201m08831j39291K7349j26688
$$ plain form
18888 8604321 8435445 8229959 7935258 7574666 6993725 6368758 5713393 5182074 4804865
18879 4804865 4549418 4424473 4397744 4420717 4492653 4435272 4276418 4104227 4034558 4040615 4095888
18868 4095888 4114046 4053527 3881615 3689472 3494242 3312714 3239489 3231832 3313492 3449178
18858 3449178 3472199 3317124 3057572 2849557 2722933 2654332 2599931 2518938 2478332 2412709
18848 2412709 2332422 2201922 2132138 2108915 2101923 2102301 2062820 2001065 1972129 1978451 2019010 2004333
18836 2004333 1965355 1927439 1904863 1874754 1872206 1898719 1908935 1839381 1769927 1778991 1798362 1803662
18824 1803662 1890503 1923396 1896801 1906462 1890963 1867165 1946116 2087628 2148539 2191998 2264600
18813 2264600 2323573 2343140 2341768 2408964 2503314 2620626 2786885 2969963 3097054 3235394
$$ packed form
18888H604321j68876k05486k94701l60592n80941o24967o55365n31319l77209
18879D804865k55447j24945k6729K2973P1936n7381j58854j72191o9669O057N5273
18868D095888J8158o0519j71912j92143j95230j81528p3225p657Q1660J35686
18858C449178K3021j55075k59552k08015j26624o8601n4401q0993m0606o5623
18848B412709q0287j30500o9784k3223o992L78l9481o1755k8936O322M0559j4677
18836B004333l8978l7916k2576l0109k548K6513J0216o9554o9454R064J9371N300
18824A803662Q6841L2893k6595R661j5499k3798P8951J41512O0911M3459P2602
18813B264600N8973J9567j372O7196R4350J17312J66259J83078J27091J38340
$$ plain form
18803 3235394 3458460 3688917 3900659 4076997 4201237 4322147 4570607 4834923 5088006
18794 5088006 5394364 5716647 6111487 6533828 6962641 7383611 7753725 8148016 8506879
18785 8506879 8814787 9251663 9735913 10277210 10950575 11706354 12573622 13634457 14912089
18776 14912089 16308290 17850191 19696436 21967910 24713763 28004470 32188569 37701058
18768 37701058 45102796 55101152 68466400 86000657 108051918 133392695 158346986
18761 158346986 178496702 191721003 199047836 201916698 199871206 192345716 181540614
18754 181540614 172302556 169399441 174568813 185635588 197378571 204839874 206428268 203188373
18746 203188373 195383207 181567659 161157051 136447800 111691497 90122473 72874827
$$ packed form
18803C235394K23066K30457K11742J76338J24240J20910K48460K64316K53083
18794E088006L06358L22283L94840M22341M28813M20970L70114L94291L58863
18785H506879L07908M36876M84250N41297O73365P55779Q67268J060835J277632
18776A4912089J396201J541901J846245K271474K745853L290707M184099N512489
18768C7701058P401738R998356J3365248J7534257K2051261K5340777K4954291
18761A58346986K0149716J3224301P326833K868862k045492p525490j0805102
18754A81540614r238058k903115N169372J1066775J1742983P461303J588394l239895
18746B03188373p805166j3815548k0410608k4709251k4756303k1569024j7247646
$$ plain form
18739 72874827 59629103 49599421 41995470 36180469 31609390 27949958 24927477 22444625
18731 22444625 20384708 18656010 17061410 15654089 14481959 13458687 12530788 11750895
18723 11750895 11068328 10442220 9912243 9473705 9118763 8824476 8482441 8128055 7818172
18714 7818172 7554068 7264725 6948157 6604441 6301239 5939731 5644542 5414645 5226733
18705 5226733 5050632 4879872 4727429 4598195 4352378 4140973 3986104 3896278 3729976 3608649
18695 3608649 3490485 3322085 3167862 3056179 2968045 2942059 2860534 2691598 2592106 2536763
18685 2536763 2491260 2446514 2425710 2405821 2420706 2387996 2348386 2354178 2296170 2230868 2243403
18674 2243403 2209641 2241146 2308478 2404939 2346013 2282727 2185432 2076361 1947412 1905274 1945566
$$ packed form
18739G2874827j3245724j0029682p603951n815001m571079l659432l022481k482852
18731B2444625k059917j728698j594600j407321j172130j023272r27899p79893
18723A1750895o82567o26108n29977m38538l54942k94287l42035l54386l09883
18714G818172k64104k89343l16568l43716l03202l61508k95189k29897j87912
18705E226733j76101j70760j52443j29234k45817k11405j54869q9826j66302j21327
18695C608649j18164j68400j54223j11683q8134k5986q1525j68936r9492n5343
18685B536763m5503m4746k0804j9889J4885l2710l9610N792n8008o5302J2535
18674B243403l3762L1505O7332R6461n8926o3286r7295j09071j28949m2138M0292
$$ plain form
18663 1945566 1957349 1912138 1903584 1843832 1854623 1869809 1762479 1621938 1571005 1579062 1518886
18652 1518886 1549661 1551301 1510558 1457527 1450736 1404266 1344191 1329699 1363712 1364799 1367874 1377830
18640 1377830 1392056 1427986 1481463 1588500 1617290 1612131 1647193 1679382 1626922 1550463 1544421
18629 1544421 1581128 1596859 1595598 1600963 1629148 1645352 1623035 1660519 1644072 1625496 1641655 1621273
18617 1621273 1578216 1579516 1604750 1631027 1595715 1480947 1349134 1316151 1354429 1362714 1344018
18606 1344018 1341860 1353466 1301948 1224605 1139725 1165642 1168007 1113316 1074218 1081385 1058946 1011042
18594 1011042 981750 978935 934196 893624 876161 871635 887319 896774 837767 788838 801231 794437
18582 794437 789739 774019 781384 804641 807093 771327 789324 735122 652442 606965 559017 567640
$$ packed form
18663A945566J1783m5211q554n9752J0791J5186j07330j40541n0933Q057o0176
18652A518886L0775J640m0743n3031o791m6470o0075j4492L4013J087L075R956
18640A377830J4226L5930N3477J07037K8790n159L5062L2189n2460p6459o042
18629A544421L6707J5731j261N365K8185J6204k2317L7484j6447j8576J6159k0382
18617A621273m3057J300K5234K6277l5312j14768j31813l2983L8278Q285j8696
18606A344018k158J1606n1518p7343q4880K5917K365n4691l9098P167k2439m7904
18594A011042k9292k815m4739m0572j7463m526J5684R455n9007m8929J2393o794
18582G94437m698j5720P365K3257K452l5766J7997n4202q2680m5477m7948Q623
$$ plain form
18570 567640 600347 635992 641904 567154 590984 590558 609815 650553 585633 602350 586055 606660
18558 606660 609240 606372 627326 668925 698465 659708 625236 629725 695546 722689 660652 586976
18546 586976 471452 396099 385723 394052 473391 572226 635948 671403 646276 642479 660018 656852
18534 656852 714781 728045 659738 650741 639407 569837 557752 557152 587095 596446 653640 709152
18522 709152 725705 747122 734332 678931 646606 570271 604923 647513 676423 668753 667293 639549
18510 639549 596758 625803 647590 632720 647378 685611 741288 758555 818931 820128 876693 959348
18498 959348 1022041 1069586 1016116 990251 977787 971422 949952 903574 830319 747931 701706 739350
18486 739350 782163 848462 913706 949546 1051398 1090693 1134711 1157241 1174059 1204862 1210012
$$ packed form
18570E67640L2707L5645N912p4750K3830m26J9257M0738o4920J6717j6295K0605
18558F06660K580k868K0954M1599K9540l8757l4472M489O5821K7143o2037p3676
18546E86976j15524p5353j0376Q329P9339R8835O3722L5455k5127l797J7539l166
18534F56852N7929J3264o8307q997j1334o9570j2085o00K9943R351N7194N5512
18522G09152J6553K1417j2790n5401l2325p6335L4652M2590K8910p670j460k7744
18510F39549m2791K9045K1787j4870J4658L8233N5677J7267O0376J197N6565Q2655
18498I59348O2693M7545n3470k5865j2464o365k1470m6378p3255q2388m6225L7644
18486G39350M2813O6299O5244L5840J01852L9295M4018K2530J6818L0803N150
$$ plain form
18475 1210012 1314670 1461637 1546073 1639345 1710941 1761531 1794964 1932730 2053660 2209033
18465 2209033 2302898 2366458 2392959 2357058 2359332 2446741 2512184 2651610 2808435 2982832 3264904
18454 3264904 3613114 3985661 4395495 4796361 5166227 5611866 6372850 7473867 8801541
18445 8801541 10209337 11548365 12955076 14750946 17505583 22126005 29089874 36813149
18437 36813149 41487924 40742401 35770623 29968770 25869147 23842976 23458269 24392030
18429 24392030 26445796 29644171 34053181 40132607 48544751 60529458 78522724 107027779
18421 107027779 153472701 225194303 314879457 388802204 417425755 397916737 344747578
18414 344747578 277610061 210824863 156333807 119450566 97573573 86482562 83617276
$$ packed form
18475A210012J04658J46967Q4436R3272P1596N0590L3433J37766J20930J55373
18465B209033R3865O3560K6501l5901K274Q7409O5443J39426J56825J74397K82072
18454C264904L48210L72547M09834M00866L69866M45639P60984J101017J327674
18445H801541J407796J339028J406711J795870K754637M620422O963869P723275
18437C6813149M674775p45523m971778n801853m099623k026171l84707R33761
18429B4392030K053766L198375M409010O079426Q412144J1984707J7993266K8505055
18421A07027779M6444922P1721602Q9685154P3922747K8623551j9509018n3169159
18414C44747578o7137517o6785198n4491056l6883241k1876993j1091011k865286
$$ plain form
18407 83617276 88338393 101152328 120111741 136042083 137263808 121159258 95734892
18400 95734892 71837905 54432812 42992540 35546503 30663406 27451370 25329654 24060311
18392 24060311 23551500 23514148 23564825 23631648 23618756 23494975 23553372 24112746 25407840 27676139
18382 27676139 31093938 36527814 45281443 59252811 80462165 107981233 132820655
18375 132820655 142619747 133992258 114959113 97329032 87341987 85369792 90824495 104540080
18367 104540080 130047127 173241675 237636850 315793275 393172558 452421851 465670223
18360 465670223 419631795 331648950 237938094 166153439 119199196 89547731 70579126
18353 70579126 58031939 49329892 42894009 37900135 34031486 31384331 30142754 30699160
$$ packed form
18407H3617276M721117J2813935J8959413J5930342J221725j6104550k5424366
18400I5734892k3896987j7405093j1440272p446037m883097l212036k121716j269343
18392B4060311n08811l7352N0677O6823j2892j23781N8397N59374J295094K268299
18382B7676139L417799N433876Q753629J3971368K1209354K7519068K4839422
18375A32820655R799092q627489j9033145j7630081r987045j972195N454703J3715585
18367A04540080K5507047M3194548O4395175P8156425P7379283N9249293J3248372
18360D65670223m6038428q7982845r3710856p1784655m6954243k9651465j8968605
18353G0579126j2547187q702047o435883m993874l868649k647155j241577N56406
$$ plain form
18345 30699160 33697976 39608733 47111857 51848966 50116830 42694722 33587370 26325100
18337 26325100 21583804 18697636 16861586 15420176 13916615 12179215 10487580 9031235
18329 9031235 7926786 7173851 6709959 6336662 6134965 6084598 6110175 6068121 5993811 5854837
18319 5854837 5691300 5472771 5203518 4955933 4653205 4322824 4024195 3754585 3564726
18310 3564726 3400043 3259577 3110796 3006812 2923765 2896015 2904077 2836488 2782123 2739999 2702233
18299 2702233 2669748 2662562 2613016 2591504 2553463 2544382 2616961 2678351 2696304 2729885 2682500 2584689
18287 2584689 2466935 2369684 2249770 2204269 2171456 2152472 2103312 2046350 2045287 2041871 1995296
18276 1995296 1897407 1771278 1725447 1702024 1690680 1726593 1709292 1670178 1666542 1730859 1678773
$$ packed form
18345C0699160K998816N910757P503124M737109j732136p422108r107352p262270
18337B6325100m741296k886168j836050j441410j503561j737400j691635j456345
18329I031235j104449p52935m63892l73297k01697n0367K5577m2054p4310j38974
18319E854837j63537k18529k69253k47585l02728l30381k98629k69610j89859
18310C564726j64683j40466j48781j03984q3047k7750Q062o7589n4365m2124l7766
18299B702233l2485p186m9546k1512l8041r081P2579O1390J7953L3581m7385r7811
18287B584689j17754r7251j19914m5501l2813j8984m9160n6962j063l416m6575
18276A995296r7889j26129m5831k3423j1344L5913j7301l9114l636O4317n2086
$$ plain form
18265 1678773 1645702 1593472 1517144 1451078 1411612 1376675 1343563 1294874 1274258 1290753 1311913
18254 1311913 1282387 1292447 1313526 1417826 1489481 1479231 1410226 1365195 1336661 1321864 1305084
18243 1305084 1332261 1355241 1297503 1348599 1460730 1523552 1634451 1785065 1900826 1878179
18233 1878179 1711819 1609071 1489150 1377376 1333627 1315457 1285067 1302435 1392066 1437163
18223 1437163 1493233 1476589 1410722 1329715 1199641 1134189 1123713 1139999 1115766 1081906 1025558
18212 1025558 1022825 1082749 1130655 1137900 1129589 1188248 1168196 1097887 1045155 1010678 974335 954212
18200 954212 978437 993248 1042878 967782 960324 1002542 969265 939467 962443 1001135 1006362 987669
18188 987669 940708 958883 990317 1023913 1025205 1011795 1078959 1177253 1205798 1238811 1277491 1294324
$$ packed form
18265A678773l3071n2230p6328o6066l9466l4937l3112m8689k0616J6495K1160
18254A311913k9526J0060K1079J04300P1655j0250o9005m5031k8534j4797j6780
18243A305084K7177K2980n7738N1096J12131O2822J10899J50614J15761k2647
18233A878179j66360j02748j19921j11774m3749j8170l0390J7368Q9631M5097
18223A437163N6070j6644o5867q1007j30074o5452j0476J6286k4233l3860n6348
18212A025558k733N9924M7906P245q311N8659k0052p0309n2732l4477l6343k0123
18200I54212K4225J4811M9630p5096p458M2218l3277k9798K2976L8692N227j8693
18188I87669m6961J8175L1434L3596J292j3410O7164R8294K8545L3013L8680J6833
$$ plain form
18176 1294324 1343528 1360071 1314296 1358441 1450746 1583888 1677014 1738965 1858587 1912102 1881022
18165 1881022 1886177 1893374 1851933 1853771 1901298 1956487 2003130 2012121 1957300 1885829 1834844 1799339
18153 1799339 1758748 1696117 1639275 1543714 1479490 1389018 1398690 1333461 1168989 1104220 1150204
18142 1150204 1229361 1254394 1219170 1185195 1149222 1192483 1248356 1344636 1405910 1495335 1528859
18131 1528859 1563256 1633544 1685557 1729874 1768378 1897924 2109570 2352543 2627395 2874379
18121 2874379 3156611 3423832 3784190 4345645 5119145 6153782 7646051 9799452 13035472
18112 13035472 18195448 27029408 42311024 66031107 89504584 95258615 81073311
18105 81073311 57305977 37039553 24284898 16757415 12178011 9315662 7407081 6049931
$$ packed form
18176A294324M9204J6543m5775M4145R2305J33142R3126O1951J19622N3515l1080
18165A881022N155P197m1441J838M7527N5189M6643Q991n4821p1471n0985l5505
18153A799339m0591o2631n6842r5561o4224r0472R672o5229j64472o4769M5984
18142A150204P9157K5033l5224l3975l5973M3261N5873R6280O1274Q9425L3524
18131A528859L4397P0288N2013M4317L8504J29546K11646K42973K74852K46984
18121B874379K82232K67221L60358N61455P73500J034637J492269K153401L236020
18112A3035472N159976Q833960J5281616K3720083K3473477N754031j4185304
18105H1073311k3767334k0266424j2754655p527483m579404k862349j908581j357150
$$ plain form
18097 6049931 5107317 4358801 3760713 3283146 2959172 2649541 2407215 2228829 2071789
18088 2071789 1872510 1750599 1618987 1525606 1452752 1332601 1201475 1116828 1069743 1046681
18078 1046681 1041399 967153 914590 908482 896005 857644 869995 882571 823486 791316 885415 884304
18066 884304 868302 917011 948823 909572 854248 773864 725293 757443 842140 889460 871616
18055 871616 833345 813895 782980 798878 809833 785140 777054 852646 923889 929241 897931 855922
18043 855922 864041 911036 956756 966371 942172 983791 1007467 1032212 1072765 1181692 1279998 1319529
18031 1319529 1333818 1300327 1259244 1214173 1143702 1028692 965228 902938 864821 781329 752412
18020 752412 762031 706591 730331 702218 651196 623237 623418 566387 578268 607847 558265 532536
$$ packed form
18097F049931r42614p48516n98088m77567l23974l09631k42326j78386j57040
18088B071789j99279j21911j31612r3381p2854j20151j31126q4647m7085k3062
18078A046681n282p4246n2563o108j2477l8361J2351J2576n9085l2170R4099j111
18066H84304j6002M8709L1812l9251n5324q0384m8571L2150Q4697M7320j7844
18055H71616l8271j9450l0915J5898J0955k4693q086P5592P1243N352l1310m2009
18043H55922Q119M6995M5720R615k4199M1619K3676K4745M0553J08927R8306L9531
18031A319529J4289l3491m1083m5071p0471j15010o3464o2290l8117q3492k8917
18020G52412R619n5440K3740k8113n1022k7959J81n7031J1881K9579m9582k5729
$$ plain form
18008 532536 575194 530679 520800 557782 567322 590604 609299 619110 633598 599759 560348 500245
17996 500245 522187 552503 601704 618595 575424 535047 512760 534097 584400 585917 639128 685834
17984 685834 659271 652102 679372 702285 683973 622482 632186 660522 609366 577905 551293 542800
17972 542800 541866 541424 523469 509970 510308 487957 495750 523508 487013 465948 506967 599191 593818
17959 593818 548720 545693 533467 554191 551982 500124 500300 527361 592688 576656 540010 497424
17947 497424 488286 437507 407902 471968 550454 594635 567047 585266 575559 529158 527867 524367
17935 524367 482399 437150 469469 504769 549678 611437 659912 717015 786687 768709 715356
17924 715356 668879 634951 663669 728155 765017 840379 986854 1155196 1326866 1400315 1367999
$$ packed form
18008E32536M2658m4515r879L6982R540K3282J8695R811J4488l3839l9411o0103
17996E00245K1942L0316M9201J6891m3171m0377k2287K1337N0303J517N3211M6706
17984F85834k6563p169K7270K2913j8312o1491R704K8336n1156l1461k6612q493
17972E42800r34m42j7955j3499L38k2351P793K7758l6495k1065M1019R2224n373
17959E93818m5098l027j2226K0724k209n1858J76K7061O5327j6032l6646m2586
17947D97424r138n0779k9605O4066P8486M4181k7588J8219r707m6401j291l500
17935E24367m1968m5249L2319L5300M4909O1759M8475N7103O9672j7978n3353
17924G15356m6477l3928K8718O4486L6862P5362J46475J68342J71670P3449l2316
$$ plain form
17913 1367999 1250493 1156296 1122198 1213054 1415843 1542850 1463250 1369817 1300032 1296024 1314202
17902 1314202 1339393 1333054 1394300 1429631 1441101 1416987 1274611 1063903 932643 874720 813880
17891 813880 772281 771588 836352 862671 891311 928679 943164 952006 923398 824460 787955 783818
17879 783818 713886 581979 563287 658591 715844 705163 747254 787938 795051 828323 893021
17868 893021 1006153 1181694 1398162 1450377 1451052 1397074 1347785 1432625 1638429 1837461 1918373
17857 1918373 1838251 1720752 1585139 1413376 1217398 1077587 967962 944992 977866 1028985
17847 1028985 1056621 1083911 1146109 1302410 1490539 1636385 1630846 1528565 1445395 1344084
17837 1344084 1311658 1226503 1095241 950288 829541 800672 757556 764676 716906 671081 647205
$$ packed form
17913A367999j17506r4197l4098R0856K02789J27007p9600r3433o9785m008J8178
17902A314202K5191o339O1246L5331J1470k4114j42376k10708j31260n7923o0840
17891H13880m1599o93O4764K6319K8640L7368J4485Q842k8608r8938l6505m137
17879G83818o9932j31907j8692R5304N7253j0681M2091M0684P113L3272O4698
17868H93021J13132J75541K16468N2215O75n3978m9289Q4840K05804J99032Q0912
17857A918373q0122j17499j35613j71763j95978j39811j09625k2970L2874N1119
17847A028985K7636K7290O2198J56301J88129J45846n539j02281q3170j01311
17837A344084l2426q5155j31262j44953j20747k8869m3116P120m7770m5825k3876
$$ plain form
17826 647205 618985 603066 522378 519531 548619 539118 506366 460277 452520 501377 517468 542508
17814 542508 523632 529186 562059 593292 645656 676279 754040 818686 830298 844308 1018129
17803 1018129 1144257 1240992 1272164 1287489 1263889 1304398 1487177 1658902 1619762 1532172 1350317
17792 1350317 1255338 1159555 1086150 1173651 1311340 1460406 1564893 1629470 1591103 1529457 1519901
17781 1519901 1562365 1684412 1752215 1691598 1538033 1322046 1132735 1071742 1126303 1237515
17771 1237515 1314545 1326605 1300243 1198386 1003984 873985 805901 763579 717764 702541 695529
17760 695529 664809 721082 723864 675404 718010 743263 835786 920655 985607 1084943 1179893 1205526
17748 1205526 1099323 1019308 963247 887339 808235 856503 991626 1157112 1341211 1500444
$$ packed form
17826F47205k8220j5919q0688k847K9088r501l2752m6089p757M8857J6091K5040
17814E42508j8876N554L2873L1233N2364L0623P7761O4646J1612J4010J73821
17803A018129J26128R6735L1172J5325k3600M0509J82779J71725l9140q7590j81855
17792A350317r4979r5783p3405Q7501J37689J49066J04487O4577l8367o1646r556
17781A519901M2464J22047O7803o0617j53565k15987j89311o0993N4561J11212
17771A237515P7030J2060k6362j01857j94402j29999o8084m2322m5815j5223p012
17760F95529l0720N6273K782m8460M2606K5253R2523Q4869O4952R9336R4950K5633
17748A205526j06203q0015n6061p5908p9104M8268J35123J65486J84099J59233
$$ plain form
17738 1500444 1503695 1393885 1344311 1272182 1302195 1375314 1464149 1576701 1537129 1395753 1263435
17727 1263435 1199999 1183572 1249122 1376497 1484581 1600446 1564598 1401166 1194856 1116201
17717 1116201 977735 906403 859104 887598 850967 815808 790937 747107 662051 638813 562301
17706 562301 513300 471798 515529 552730 562739 572169 570864 600788 677219 687673 619839 591462
17694 591462 522065 509026 498672 491333 530521 551810 619518 635854 639245 674066 676200 617940
17682 617940 613004 618873 619808 616795 599628 551500 586264 607466 566937 558809 595651 599821 556351
17669 556351 593417 655197 623516 632003 635024 646575 630277 576905 605536 584012 543483 547200
17657 547200 594522 649707 609471 543680 520796 502266 487434 551048 610513 612530 570699 565491
$$ packed form
17738A500444L251j09810m9574p2129L0013P3119Q8835J12552l9572j41376j32318
17727A263435o3436j6427O5550J27375J08084J15865l5848j63432k06310p8655
17717A116201j38466p1332m7299K8494l6631l5159k4871m3830q5056k3238p6512
17706E62301m9001m1502M3731L7201J0009R430j305K9924P6431J0454o7834k8377
17694E91462o9397j3039j0354p339L9188K1289O7708J6336L391L4821K134n8260
17682F17940m936N869R35l013j7167m8128L4764K1202m0529q128L6842M170m3470
17669E56351L7066O1780l1681Q487L021J1551j6298n3372K8631k1524m0529L717
17657E47200M7322N5185m0236o5791k2884j8530j4832O3614N9465K017m1831n208
$$ plain form
17645 565491 579826 564849 557965 607509 620107 598011 574038 596515 625520 662018 729415 745681
17633 745681 677865 656584 639818 608506 641231 644932 672614 722558 697163 650683 651022 645260
17621 645260 638325 595105 585095 600727 629242 616778 595366 540282 568145 574788 574837 543609
17609 543609 536328 533951 569483 626490 682988 614811 579962 589608 598825 608040 642163 643265 598479
17596 598479 642638 662059 632240 646661 651846 674270 627112 595619 668409 698715 703392 721981
17584 721981 778216 792167 783688 763863 778487 759671 789879 815042 770446 689344 642838 626741
17572 626741 720929 766273 745007 746402 717583 716436 756346 824742 861036 835653 763680 797515
17560 797515 844021 802419 741576 754013 737911 692440 697204 738520 781795 775023 826802 907775
$$ packed form
17645E65491J4335j4977o884M9544J2598k2096k3973K2477K9005L6498O7397J6266
17633G45681o7816k1281j6766l1312L2725L701K7682M9944k5395m6480L39n762
17621F45260o935m3220j0010J5632K8515j2464k1412n5084K7863O643M9l1228
17609E43609p281k377L5532N7007N6498o8177l4849R646R217R215L4123J102m4786
17596E98479M4159J9421k9819J4421N185K2424m7158l1493P2790L0306M677J8589
17584G21981N6235J3951q479j9825J4624j8816L0208K5163m4596q1102m6506j6097
17572F26741R4188M5344k1266J395k8819j147L9910O8396L6294k5383p1973L3835
17560G97515M6506m1602o0843J2437j6102m5471M764M1316M3275o772N1779Q0973
$$ plain form
17548 907775 940428 942043 1010077 1060404 1028289 972792 956183 962734 964930 919600 868694 871498
17536 871498 801718 779424 797913 849496 845713 834219 882887 879509 830109 802711 827184 792684
17524 792684 765312 775647 809399 811721 855536 834768 853396 849648 821726 865323 908357 951032
17512 951032 1005268 1062295 1125469 1173287 1094534 998770 948567 882365 854555 892480 931694
17501 931694 943346 932386 963405 1003162 1065053 1173956 1240085 1233941 1140150 1141256 1137077 1181506
17489 1181506 1257234 1319353 1242310 1190400 1164026 1162098 1167056 1150013 1182815 1239218 1276511 1191995
17477 1191995 1053374 1041779 1060617 1026659 947135 1003662 1055531 1030776 1024022 1039652 1049525
17466 1049525 1044927 1004054 969047 1034319 1011120 993780 1058753 1138024 1260848 1266167 1281111
$$ packed form
17548I07775L2653J615O8034N0327l2115n5497j6609O551K196m5330n0906K804
17536H71498o9780k2294J8489N1583l783j1494M8668l378m9400k7398K4473l4500
17524G92684k7372J0335L3752K322M3815k0768J8628l748k7922M3597M3034M2675
17512I51032N4236N7027O3174M7818p8753r5764n0203o6202k7810L7925L9214
17501I31694J1652j0960L1019L9757O1891J08903O6129o144r3791J106m179M4429
17489A181506P5728O2119p7043n1910k6374j928M958j7043L2802N6403L7293q4516
17477A191995j38621j1595J8838l3958p9524N6527N1869k4755o754J5630R873
17466A049525m598m0873l5007O5272k3199j7340O4973P9271J22824N319J4944
$$ plain form
17455 1281111 1331335 1387451 1363592 1285052 1199744 1148762 1111681 1152598 1160496 1163156 1181057 1248929
17443 1248929 1394177 1592334 1707771 1730314 1674748 1546768 1410626 1335765 1357174 1410115
17433 1410115 1422393 1462534 1456353 1528405 1638084 1821858 1937632 1943413 1813882 1711384 1695070
17422 1695070 1619810 1573704 1617371 1611059 1592392 1609834 1638972 1737497 1917390 2205578 2527012
17411 2527012 2949219 3549518 4568413 6198460 8189229 9595804 9968651 9400562 8326715
17402 8326715 6997485 5679192 4551189 3819862 3335874 3007343 2917561 3046810 3335938
17393 3335938 3750944 4248944 4497158 4260562 3697996 3101058 2684851 2418948 2202506
17384 2202506 2052705 1981307 1914608 1871239 1910826 1983246 2003457 2023641 2078925 2132799 2212025
$$ packed form
17455A281111N0224N6116k3859p8540q5308n0982l7081M0917P898K660J7901O7872
17443A248929J45248J98157J15437K2543n5566j27980j36142p4861K1409N2941
17433A410115J2278M0141o181P2052J09679J83774J15774N781j29531j02498j6314
17422A695070p5260m6106M3667o312j8667J7442K9138R8525J79893K88188L21434
17411B527012M22207O00299J018895J630047J990769J406575L72847n68089j073847
17402H326715j329230j318293j128003p31327m83988l28531q9782J29249K89128
17393C335938M15006M98000K48214k36596n62566n96938m16207k65903k16442
17384B202506j49801p1398o6699m3369L9587P2420K0211K0184N5284N3874P9226
$$ plain form
17373 2212025 2325635 2366588 2439107 2604423 2844334 3185938 3749960 4491822 5208861 5537349
17363 5537349 5324969 4754834 4150408 3839205 3782180 3930723 4227928 4678344 5416864 6602337
17353 6602337 8386247 10745892 13291077 15383113 15984168 14709143 12309369 9672565
17345 9672565 7667278 6362719 5598903 5111629 4734632 4509340 4461909 4513167 4607773 4688465
17335 4688465 4706089 4766587 4960980 5267530 5777280 6436907 7110674 7617716 7907354 7997839
17325 7997839 8061057 8297860 8725718 9317045 10309272 11711133 13140932 14510088 15726985
17316 15726985 16939031 18634474 21379558 25890239 33071607 42952089 51741482 54249408
17308 54249408 49682382 41784323 35297658 31669428 30306431 30594921 32289687 35258615
$$ packed form
17373B212025J13610M0953P2519J65316K39911L41604N64022P41862P17039L28488
17363E537349k12380n70135o04426l11203n7025J48543K97205M50416P38520J185473
17353F602337J783910K359645K545185K092036O01055j275025k399774k636804
17345I672565k005287j304559p63816m87274l76997k25292m7431N1258R4606Q0692
17335D688465J7624O0498J94393L06550N09750O59627O73767N07042K89638R0485
17325G997839O3218K36803M27858N91327R92227J401861J429799J369156J216897
17316A5726985J212046J695443K745084M510681P181368R880482Q789393K507926
17308E4249408m567026p898059o486665l628230j362997K88490J694766K968928
$$ plain form
17300 35258615 39344847 44867729 52691095 64151274 81380362 108200568 151315833
17293 151315833 220762645 320874726 422824711 478471733 472924321 416122844 336086140
17286 336086140 253748525 184038667 136118210 106920751 90539035 83489606 84533602
17279 84533602 94312334 113329049 136233989 148539447 140046343 114692198 85749371
17272 85749371 63257247 48361291 38769791 32497441 28237924 25322832 23506216 22701981
17264 22701981 22651361 23095024 23380217 23285390 22930311 22667572 22874011 23823228 25704078
17255 25704078 28726830 33217759 39964186 50589370 67264170 91820250 120582441
17248 120582441 140126137 139979455 123084760 101846924 86860774 80434652 81738756
$$ packed form
17300C5258615M086232N522882P823366J1460179J7229088K6820206M3115265
17293A51315833O9446812J00112081J01949985N5647022n547412n6801477q0036704
17286C36086140q2337615o9709858m7920457k9197459j6381716p049429J043996
17279H4533602R778732J9016715K2904940J2305458q493104k5354145k8942827
17272H5749371k2492124j4895956r591500o272350m259517k915092j816616q04235
17264B2701981n0620M43663K85193r4827l55079k62739K06439R49217J880850
17255B5704078L022752M490929O746427J0625184J6674800K4556080K8762191
17248A20582441J9543696j46682j6894695k1237836j4986150o426122J304104
$$ plain form
17241 81738756 90988602 110261507 144332691 198144247 267981301 338712412 400933714
17234 400933714 433852597 411488540 338374081 244156102 166454679 115576267 83672406
17227 83672406 63256745 49711415 40480674 34108492 29568090 26292016 24025084 22802195
17219 22802195 22805757 24405812 28316800 34797002 41301658 43058937 38542680 30190707
17211 30190707 22276113 16883708 13634949 11795264 10645681 9802550 8857255 7744379
17203 7744379 6588125 5564867 4863869 4445872 4217116 4191048 4404803 4759107 5347100
17194 5347100 6241215 7215029 7903186 8092760 7768248 7113201 6245828 5461759 4885547
17185 4885547 4536067 4471593 4495539 4436770 4247423 4077545 4021526 4198765 4740005 5545113
$$ packed form
17241H1738756R249846J9272905L4071184N3811556O9837054P0731111O2221302
17234D00933714L2918883k2364057p3114459r4217979p7701423n0878412l1903861
17227H3672406k0415661j3545330r230741o372182m540402l276074k266932j222889
17219B2802195L562J600055L910988O480202O504656J757279m516257q351973
17211C0190707p914594n392405l248759j839685j149583q43131r45295j112876
17203G744379j156254j023258p00998m17997k28756k6068K13755L54304N87993
17194E347100Q94115R73814O88157J89574l24512o55047q67373p84069n76212
17185D885547l49480o4474K3946n8769j89347j69878n6019J77239N41240Q05108
$$ plain form
17175 5545113 6388824 7027646 7383393 7158535 6234732 5039745 4017260 3350600 2998322
17166 2998322 2882596 2868905 2847772 2809002 2776428 2620031 2385642 2224161 2118801 2041529
17156 2041529 2117098 2375961 2758333 3124199 3179535 2981630 2662015 2392098 2102768 1924124
17146 1924124 1828763 1791030 1792848 1911606 1983778 2126581 2327086 2647269 3107198 3897798
17136 3897798 5045829 6760440 9177890 11922311 13914704 14366041 13118416 10833150
17128 10833150 8324286 6252454 4841452 3955734 3444114 3206974 3194557 3362561 3603906
17119 3603906 4015591 4552061 4984606 4965878 4537950 3892982 3328817 2979940 2777701 2651008
17109 2651008 2556898 2567739 2510228 2357771 2176908 1963247 1736358 1558738 1408556 1311327
$$ packed form
17175E545113Q43711O38822L55747k24858r23803j194987j022485o66660l52278
17166B998322j15726j3691k1133l8770l2574j56397k34389j61481j05360p7272
17156B041529P5569K58863L82372L65866N5336j97905l19615k69917k89330j78644
17146A924124r5361l7733J818J18758P2172J42803K00505L20183M59929P90600
17136C897798J148031J714611K417450K744421J992393M51337j247625k285266
17128A0833150k508864k071832j411002q85718n11620k37140j2417J68004K41345
17119C603906M11685N36470M32545j8728m27928o44968n64165l48877k02239j26693
17109B651008r4110J0841n7511j52457j80863k13661k26889j77620j50182r7229
$$ plain form
17099 1311327 1304880 1287061 1259562 1329291 1465155 1711232 2076498 2632977 3279435 3749501
17089 3749501 3741488 3350680 2897600 2595118 2453835 2430327 2494660 2720293 3249989 4168617
17079 4168617 5428914 6789994 8101209 9144068 9367645 8443393 6657832 4814850
17071 4814850 3488880 2605600 2030625 1673922 1415196 1190249 1067390 972645 781321
17062 781321 728030 767748 819972 872564 968341 1044541 1129075 1262029 1251907 1136002 967531
17051 967531 817590 758539 665477 538619 466197 452288 445785 435198 390688 346692 343858
17040 343858 390575 427726 476206 554723 622148 646841 677063 699492 699279 704357 714449 669089
17028 669089 636361 738043 759024 730693 724322 648246 596107 635344 636132 633141 604415 587563
$$ packed form
17099A311327o447j7819k7499O9729J35864K46077L65266N56479O46458M70066
17089C749501q013l90808m53080l02482j41283k3508O4333K25633N29696R18628
17079D168617J260297J361080J311215J042859K23577r24252j785561j842982
17071D814850j325970q83280n74975l56703k58726k24947j22859r4745j91324
17062G81321n3291L9718N2224N2592R5777P6200Q4534J32954j0122j15905j68471
17051I67531j49941n9051r3062j26858p2422j3909o503j0587m4510m3996k834
17040C43858M6717L7151M8480P8517O7425K4693L0222K2429k13N078J0092m5360
17028F69089l2728J01682K0981k8331o371p6076n2139L9237P88k991k8726j6852
$$ plain form
17016 587563 573375 524554 511463 532934 562643 632282 664812 704186 737083 764944 739365
17005 739365 640769 541031 545431 537486 545008 524851 461416 528268 533472 546663 496331 402026
16993 402026 384102 430572 415565 380059 343401 361969 333916 346580 408806 441677 434238 424936
16981 424936 441933 546558 606479 636437 642618 604295 563024 522002 517381 435232 370108 432903
16969 432903 465605 427966 402871 456224 498342 534411 494142 505340 506954 523423 596349 625297
16957 625297 699547 720348 716884 600863 487257 498619 565081 641738 650958 565995 481635
16946 481635 526667 521175 577670 598539 626750 629524 554043 515349 525739 544321 553784 500099
16934 500099 445825 503910 522849 547651 566470 512061 545767 561529 546972 560772 583457
$$ packed form
17016E87563j4188m8821j3091K1471K9709O9639L2530L9374L2897K7861k5579
17005G39365r8596r9738M400p945P522k0157o3435O6852N204J3191n0332r4305
16993D02026j7924M6470j5007l5506l6658J8568k8053J2664O2226L2871p439r302
16981D24936J6997J04625N9921K9958O181l8323m1271m1022m621q2149o5124O2795
16969D32903L2702l7639k5095N3353M2118L6069m0269J1198J614J6469P2926K8948
16957F25297P4250K0801l464j16021j13606J1362O6462P6657R220q4963q4360
16946D81635M5032n492N6495K0869K8211K774p5481l8694J0390J8582R463n3685
16934E00099n4274N8085J8939K4802J8819n4409L3706J5762j4557J3800K2685
$$ plain form
16923 583457 588979 533398 499421 513086 553925 589416 524336 496631 520775 470252 460090 463313
16911 463313 510512 525891 531491 543184 559559 622478 641337 639369 658232 654915 637105 593819
16899 593819 534462 515703 522155 532009 582397 638807 683039 651785 636490 590585 550804 534619
16887 534619 542683 549261 537992 600423 577806 535400 540930 641700 722205 813553 832702 861430
16875 861430 856739 848086 816710 788917 751099 765844 796442 804002 848717 884664 930166 934317
16863 934317 1000453 1019787 1008195 1070231 1088809 1117817 1135473 1099976 1038590 1069483 1102491
16852 1102491 1127736 1146880 1152224 1213552 1280423 1326805 1350224 1395737 1449595 1455063 1414353 1409058
16840 1409058 1383805 1374330 1395864 1413575 1425489 1411704 1496625 1518764 1506197 1550442 1659374
$$ packed form
16923E83457N522n5581l3977J3665M0839L5491o5080k7705K4144n0523j0162L223
16911D63313M7199J5379N600J1693J6375O2919J8859j968J8863l317j7810m3286
16899E93819n9357j8759O452R854N0388N6410M4232l1254j5295m5905l9781j6185
16887E34619Q064O578j1269O2431k2617m2406N530J00770Q0505R1348J9149K8728
16875H61430m691q653l1376k7793l7818J4745L0598P560M4715L5947M5502M151
16863I34317O6136J9334j1592O2036J8578K9008J7656l5497o1386L0893L3008
16852A102491K5245J9144N344O1328O6871M6382K3419M5513N3858N468m0710n295
16840A409058k5253r475K1534J7711J1914j3785Q4921K2139j2567M4245J08932
$$ plain form
16829 1659374 1742294 1797424 1840580 1894799 1960522 1984515 1971636 1995755 1985117 2059822 2200842
16818 2200842 2274219 2327043 2452519 2627604 2747505 2836531 2896016 3015374 3119189 3200741
16808 3200741 3284255 3468423 3710590 3899150 4097991 4359119 4626926 5034302 5481441 5987488
16798 5987488 6508901 6930133 7185068 7338187 7399126 7654720 8113198 8818615 9735571 10736189
16788 10736189 11672741 12545319 13401799 14328866 15398794 16553523 17980512 19930155 22511323
16779 22511323 25923733 30513500 36979103 46367370 60425831 81493238 111350239 145657415
16771 145657415 169813939 170611588 149940888 121356764 97991130 84471005 80203028
16764 80203028 84430674 97831539 122091715 157786875 197896118 228536510 243332610
$$ packed form
16829A659374Q2920N5130M3156N4219O5723K3993j2879K4119j0638P4705J41020
16818B200842P3377N2824J25476J75085J19901Q9026N9485J19358J03815Q1552
16808C200741Q3514J84168K42167J88560J98841K61128K67807M07376M47139N06047
16798E987488N21413M21232K54935J53119O0939K55594M58478P05417R16956J000618
16788A0736189R36552Q72578Q56480R27067J069928J154729J426989J949643K581168
16779B2511323L412410M589767O465603R388267J4058461K1067407K9857001L4307176
16771A45657415K4156524P97649k0670700k8584124k3365634j3520125m267977
16764H0203028M227646J3400865K4260176L5695160M0109243L0640392J4796100
$$ plain form
16757 243332610 246776969 241094993 221326055 186842942 146919879 113474896 91176531
16750 91176531 79186624 76054305 81328708 95857478 119981214 147685933 163690412
16743 163690412 156592340 130021933 97531360 70433193 51376758 38549062 29843344
16736 29843344 23671940 19118544 15667151 13152243 11186195 9739265 8775343 8146224
16728 8146224 7647066 7278198 7008604 6725618 6322930 5759706 5091482 4457280 3887344
16719 3887344 3379486 3097629 2944235 2787218 2689186 2563069 2382006 2153546 1871029 1566387
16709 1566387 1303973 1176373 1096400 967621 866089 837991 780497 703902 624100 565591
16699 565591 532244 547404 572928 559009 525669 499830 481636 441641 439470 406527 344680 305241
$$ packed form
16757B43332610L444359n681976j9768938l4483113l9923063l3444983k2298365
16750I1176531j1989907l132319N274403J4528770K4123736K7704719J6004479
16743A63690412p098072k6570407l2490573k7098167j9056435j2827696q705718
16736B9843344o171404m553396l451393k514908j966048j446930r63922o29119
16728H146224m99158l68868k69594k82986m02688n63224o68224o34202n69936
16719C887344n07858k81857j53394j57017r8032j26117j81063k28460k82517l04642
16709A566387k62414j27600p9973j28779j01532k8098n7494p6595p9802n8509
16699E65591l3347J5160K5524j3919l3340k5839j8194l9995k171l2943o1847l9439
$$ plain form
16687 305241 240473 256443 286332 285945 240756 243274 227444 207537 185561 201632 157033 77048
16675 77048 -18935 -67458 -78930 9044 24273 48043 73542 64805 5741 33252 31344 64442
16663 64442 90210 75680 44111 58651 -4843 -75581 -61344 -67935 -38410 27736 58734 68223
16651 68223 56436 61137 85398 145387 183608 198544 242322 266632 169924 136244 166954 152376
16639 152376 120703 79116 77366 110948 131328 194119 239207 252042 279863 308684 291165 245633
16627 245633 208427 193182 170843 119265 35724 42553 54658 28845 87188 166523 221068 187113
16615 187113 149746 141210 79889 7531 -69349 -108833 -51849 -47257 -3453 15701 324 6111
16603 6111 -44324 -32768 -34967 -66571 -141801 -154818 -141100 -113240 -44403 -30349 -38243 -24688
$$ packed form
16687C05241o4768J5970K9889l87m5189K518j5830j9907k1976J6071m4599p9985
16675G7048r5983m8523j1472Q7974J5229K3770K5499q737n9064K7511j908L3098
16663F4442K5768j4530l1569J4540o3494p0738J4237o591K9525O6146L0998R489
16651F8223j1787M701K4261N9989L8221J4936M3778K4310r6708l3680L0710j4578
16639A52376l1673m1587j750L3582K0380O2791M5088J2835K7821K8821j7519m5532
16627B45633l7206j5245k2339n1578q3541O829J2105k5813N8343P9335N4545l3955
16615A87113l7367q536o1321p2358p6880l9484N6984M592M3804J9154j5377N787
16603F111n0435J1556k199l1604p5230j3017J3718K7860O8837J4054p894J3555
$$ plain form
16591 -24688 -83680 -85418 -88771 -129717 -125166 -118519 -152641 -193610 -228249 -245477 -262575 -239453
16579 -239453 -177170 -173392 -180954 -177450 -212941 -198230 -206347 -249150 -274965 -237263 -253459 -279368
16567 -279368 -301778 -309689 -334579 -297799 -241447 -224574 -266934 -319408 -307083 -259988 -250887 -254387
16555 -254387 -290986 -276998 -241234 -164440 -173258 -208762 -212691 -162409 -203434 -256926 -219771 -175282
16543 -175282 -172294 -155311 -147877 -145925 -131150 -129710 -147144 -180958 -180798 -145848 -146293 -127092 -121796
16530 -121796 -124426 -160342 -131785 -112146 -64017 1741 19288 -90381 -169310 -178983 -138797 -114727
16518 -114727 -110850 -139920 -146887 -122905 -141505 -113275 -144714 -113076 -94657 -126193 -133393 -107732
16506 -107732 -81389 -52218 -50585 -94899 -156474 -196087 -198991 -169792 -165527 -120204 -127918 -162838
$$ packed form
16591b4688n8992j738l353m0946M551O647l4122m0969l4639j7228j7098K3122
16579b39453O2283L778p562L504l5491J4711q117m2803k5815L7702j6196k5909
16567b79368k2410p911k4890L6780N6352J6873m2360n2474J2325M7095R101l500
16555b54387l6599J3988L5764P6794q818l5504l929N0282m1025n3492L7155M4489
16543a75282K988J6983P434J952J4775J440j7434l3814J60L4950m45J9201N296
16530a21796k630l5916K8557J9639M8129O5758J7547j09669p8929r673M0186K4070
16518a14727L877k9070o967K3982j8600K8230l1439L1638J8419l1536p200K5661
16506a07732K6343K9171J633m4314o1575l9613k904K9199M265M5323p714l4920
$$ plain form
16494 -162838 -199540 -233928 -180571 -179189 -156963 -143678 -125315 -71244 -107153 -172368 -172288 -187412
16482 -187412 -170682 -134219 -103147 -51960 -23189 -24875 -76358 -86404 -76643 -78056 -109731 -146732
16470 -146732 -184098 -237838 -214283 -170289 -138861 -124051 -188169 -205927 -146425 -88208 -111590
16459 -111590 -158764 -176069 -194812 -191538 -132576 -96554 -117394 -160376 -144423 -96104 -94106 -120230
16447 -120230 -189840 -222268 -193199 -146762 -155271 -183292 -120109 -37025 -37146 -56011 -90355 -95853
16435 -95853 -108377 -165121 -201397 -161751 -130814 -143959 -165240 -126544 -89599 -91483 -115403 -38497
16423 -38497 -1375 -38524 -71634 -91607 -57218 -59778 -91836 -104371 -79609 -92167 -112391 -122119
16411 -122119 -131508 -163198 -163768 -146075 -106485 -94935 -116960 -98797 -99156 -118848 -121349 -111837 -90098
$$ packed form
16494a62838l6702l4388N3357J382K2226J3285J8363N4071l5909o5215Q0j5124
16482a87412J6730L6463L1072N1187K8771j686n1483j0046R761j413l1675l7001
16470a46732l7366n3740K3555M3994L1428J4810o4118j7758N9502N8217k3382
16459a11590m7174j7305j8743L274N8962L6022k0840m2982J5953M8319J998k6124
16447a20230o9610l2428K9069M6437q509k8021O3183Q3084j21j8865l4344n498
16435i5853j2524n6744l6276L9646L0937j3145k1281L8696L6945j884k3920P6906
16423c8497L7122l7149l3110j9973L4389k560l2058j2535K4762j2558k0224r728
16411a22119r389l1690n70J7693L9590J1550k2025J8163l59j9692k501R512K1739
$$ plain form
16398 -90098 -143944 -108188 -75201 -140106 -202533 -176125 -109271 -102516 -136934 -153154 -162405 -112102
16386 -112102 -135577 -129080 -79858 -71464 -107994 -168248 -210030 -149936 -87486 -47760 -53354 21802
16374 21802 15687 -101323 -166696 -152060 -155970 -169682 -172110 -130813 -119108 -160306 -158913 -104748
16362 -104748 -73604 -68644 -91083 -111388 -118431 -152962 -112195 -86824 -120326 -136231 -102120 -88615
16350 -88615 -58794 -79169 -146891 -142186 -66566 -107195 -127717 -132012 -74786 -54159 -28288 -18525
16338 -18525 -46885 -45781 -22880 -27694 -123375 -138463 -123251 -103618 -107664 -62010 -74788 -39309
16326 -39309 11383 -30856 -17941 -18281 -18024 -28157 -38881 -12763 -51639 -52664 -38690 -14877 -19107
16313 -19107 -11684 -195 -40496 -38028 -4830 -29132 -81866 -62233 -60255 -100358 -118116 -82094
$$ packed form
16398i0098n3846L5756L2987o4905o2427K6408O6854O755l4418j6220r251N0303
16386a12102k3475O497M9222Q394l6530o0254m1782O0094O2450L9726n594P5156
16374B1802o115j17010o5373J4636l910j3712k428M1297J1705m1198J393N4165
16362a04748L1144M960k2439k0305p043l4531M0767K5371l3502j5905L4111J3505
16350h8615K9821k0375o7722M705P5620m0629k0522m295N7226K0627K5871R763
16338a8525k8360J104K2901m814r5681j5088J5212J9633m046M5654j2778L5479
16326c9309N0692m2239J2915l40K57j0133j0724K6118l8876j025J3974K3813m230
16313a9107P423J1489m0301K468L3198k4302n2734J9633J978m0103j7758L6022
$$ plain form
16301 -82094 -81383 -84940 -24542 24990 -33760 -60798 -87949 -65827 -9221 -20012 -33266 -19885
16289 -19885 -15458 -51330 -67561 -117536 -123018 -123059 -104070 -55884 -4980 5856 15865 -953 -53657
16276 -53657 -33537 -2257 11838 -24005 -17940 -29859 -42041 -114071 -64433 -16376 -27531 -91608
16264 -91608 -61502 8105 7417 -15070 -71450 -89975 -83077 -99671 -57629 -44093 -66355 -48420
16252 -48420 1304 34240 12356 -49923 -63583 -28352 -61507 -39328 17337 34348 -10291 -34928
16240 -34928 -8531 24328 7412 -25718 -9132 -18173 -53987 -18448 23277 19549 55417 26252
16228 26252 -27262 -51988 -60600 -46332 -33129 -72347 -41840 24387 52862 72168 69845 46871
16216 46871 73646 106249 112757 185047 260838 374966 499783 559996 655821 799002 818487
$$ packed form
16301h2094P11l557O0398M9532n8750k7038k7151K2122N6606j0791j3254J3381
16289a9885M427l5872j6231m9975n482m1J8989M8186N0904J0836J0009j6818n2704
16276e3657K0120L1280J4095l5843O065j1919j2182p2030M9638M8057j1155o4077
16264i1608L0106O9607o88k2487n6380j8525O898j6594M2042J3536k2262J7935
16252d8420M9724L2936k1884o2279j3660L5231l3155K2179N6665J7011m4639k4637
16240c4928K6397L2859j6916l3130J6586r041l5814L5539M1725l728L5868k9165
16228B6252n3514k4726q612J4268J3203l9218L0507O6227K8475J9306k323k2974
16216D6871K6775L2603O508P2290P5791J14128J24817O0213R5825J43181J9485
$$ plain form
16205 818487 723513 608028 502677 473411 469692 502166 627400 754067 908885 1101904
16195 1101904 1247599 1293468 1291924 1214348 1114703 958960 771108 589406 476264 392975
16185 392975 395680 472141 556793 636085 742980 764133 716390 609498 427323 244403 165360
16174 165360 135463 56003 57635 69317 -37551 -130622 -104374 1275 37892 55700 74018
16163 74018 136367 111188 54007 -21704 -60998 -40706 -42241 -55641 -19498 -23103 -15134 -24151
16151 -24151 -68376 -45532 -46447 -22209 -43964 -96429 -150014 -199240 -209407 -74605 -25956 -72294
16139 -72294 -104886 -105875 -112852 -64148 -90032 -103034 -85485 -63527 -18035 -3356 4021 30682
16127 30682 -35554 -48431 -40977 -117728 -114705 -87643 -71017 -12386 59705 72097 78164 7791
$$ packed form
16205H18487r4974j15485j05351k9266l719L2474J25234J26667J54818J93019
16195A101904J45695M5869j544p7576r9645j55743j87852j81702j13142q3289
16185C92975K705P6461Q4652P9292J06895K1153m7743j06892j82175j82920p9043
16174A65360k9897p9460J632J1682j06868r3071K6248J05649L6617J7808J8318
16163G4018O2349k5179n7181p5711l9294K0292j535j3400L6143l605P969r017
16151b4151m4225K2844r15K4238k1755n2465n3585m9226j0167J34802M8649m6338
16139g2294l2592r89o977M8704k5884j3002J7549K1958M5492J4679P377K6661
16127C0682o6236j2877P454p6751L023K7062J6626N8631P2091J2392O067p0373
$$ plain form
16115 7791 -26750 11166 15178 28656 -12273 -28816 4421 6883 35463 1859 36421 103845
16103 103845 40018 -19834 -17015 -52557 -40432 26018 67434 -19782 -56229 -78090 -80106 -43530
16091 -43530 17573 8607 -13542 -34637 -7955 28184 -1587 -60562 -44981 -56991 -63473 -27536
16079 -27536 -36349 -59516 4657 30763 18362 -12209 18275 -16641 -36111 -92474 -105974 -71605
16067 -71605 9684 49674 25959 4672 -39170 -58003 -93749 -70314 -29818 -26244 -28036 -81749
16055 -81749 -148183 -134767 -144494 -127283 -80084 -34975 -28805 -43156 -74152 -16983 12764 -80907
16043 -80907 -84688 -52904 -64404 -28253 60461 70438 41497 -13326 -9576 5194 53243 25474
16031 25474 31251 15445 -2793 -32106 -49713 -13836 38890 31596 15535 32399 28956 45350
$$ packed form
16115G791l4541L7916M012J3478m0929j6543L3237K462K8580l3604L4562O7424
16103A03845o3827n9852K819l5542J2125O6450M1416q7216l6447k1861k016L6576
16091d3530O1103q966k2149k1095K6682L6139k9771n8975J5581j2010o482L5937
16079b7536q813k3167O4173K6106j2401l0571L0484l4916j9470n6363j3500L4369
16067g1605Q1289L9990k3715k1287m3842j8833l5746K3435M0496L574j792n3713
16055h1749o6434J3416r727J7211M7199M5109O170j4351l0996N7169K9747r3671
16043h0907l781L1784j1500L6151Q8714R977k8941n4823L750J4770M8049k7769
16031B5474N777j5806j8238k9313j7607L5877N2726p294j6061J6864l443J6394
$$ plain form
16019 45350 -15606 -56741 -70479 3207 42741 24191 39569 52600 57858 15170 -18338 -41509
16007 -41509 -25714 49313 61694 55179 26535 -14230 -46156 -56356 -32330 10408 53597 70258
15995 70258 24201 6164 8540 -4512 34661 32874 1681 -5 -18453 -57867 -69787 -27676
15983 -27676 8873 -1925 18817 -1844 -14061 -18187 -35222 -84815 -66140 -52877 -46037 -77924
15971 -77924 -52139 -7667 -1044 -22595 -19838 -71036 -28353 31312 57456 25444 16644 -10722
15959 -10722 -30848 -16990 -35639 -51880 -11327 4818 -49773 -91825 -128271 -94520 -31125 47433
15947 47433 56194 100100 48055 -1019 -19619 49713 52120 -20011 14429 50039 15984 -26602
15935 -26602 -30362 -30103 -33222 -18209 -21261 -17249 -13396 -28206 13982 25967 3778 15596 63052
$$ packed form
16019D5350o0956m1135j3738P3686L9534j8550J5378J3031N258m2688l3508k3171
16007d1509J5795P5027J2381o515k8644m0765l1926j0200K4026M2738M3189J6661
15995G0258m6057j8037K376j3052L9173j787l1193j686j8448l9414j1920M2111
15983b7676L6549j0798K0742k0661j2217m126j7035m9593J8675J3263O840l1887
15971g7924K5785M4472O623k1551K757n1198M2683N9665K6144l2012q800k7366
15959a0722k0126J3858j8649j6241M0553J6145n4591m2052l6446L3751O3395P8558
15947D7433Q761M3906n2045m9074j8600O9332K407p2131L4440L5610l4055m2586
15935b6602l760K59l119J5013l052M012L853j4810M2188J1985k2189J1818M7456
$$ plain form
15922 63052 85760 64433 39221 60894 57725 29593 20918 20082 2690 8915 8950 22677 30096
15909 30096 45003 40278 71753 70177 -17253 -17781 9638 51447 118221 141371 135108 78510 28971
15896 28971 42887 68351 102959 103802 66214 50962 68360 45097 -24124 -24285 -7847 53613
15884 53613 6810 -57684 -82915 -68448 -23128 33409 56255 14402 -24047 -6698 -8590 1986
15872 1986 5399 49240 56438 38912 16567 30182 66267 81882 61339 27051 17005 -55332
15860 -55332 -89098 -54429 -64381 -85311 -128206 -105415 -54964 -14606 -7789 -43979 -74347 -9826
15848 -9826 46435 70681 104904 116469 101270 77734 12737 -47170 -93461 -90989 -68570 -14197
15836 -14197 13900 10916 88011 124075 138788 111579 101265 96502 18408 -34797 -4728 14891
$$ packed form
15922F3052K2708k1327k5212K1673l169k8132q675q36j7392O225L5J3727P419
15909C0096J4907m725L1475j576q7430n28K7419M1809O6774K3150o263n6598m9539
15896B8971J3916K5464L4608Q43l7588j5252J7398k3263o9221j61J6438O1460
15884E3613m6803o4494k5231J4467M5320N6537K2846m1853l8449J7349j892J0576
15872A986L413M3841P198j7526k2345J3615L6085J5615k0543l4288j0046p2337
15860e5332l3766L4669r952k0930m2895K2791N0451M0358O817l6190l0368O4521
15848i826N6261K4246L4223J1565j5199k3536o4997n9907m6291K472K2419N4373
15836a4197K8097k984P7095L6064J4713k7209j0314m763p8094n3205L0069J9619
$$ plain form
15824 14891 6079 -3904 48724 133496 95340 58862 17524 15181 61323 56391 69115 8643
15812 8643 -60429 -54486 -17417 20766 19369 31648 64183 34160 -43136 -52001 -47547 -75966 -117528
15799 -117528 -80436 -71738 -53232 -16143 3383 5630 61794 48748 -37709 -83903 -98847 -81816
15787 -81816 -47475 -25512 -25043 -53845 -39495 18975 -1698 -35791 -36589 12688 35082 -2873
15775 -2873 46323 62772 32002 10147 -1462 -6600 12202 14067 -5400 2858 40275 4384
15763 4384 6736 49925 70495 27236 9531 27452 31404 47364 50683 59367 58991 49451 51846
15750 51846 38492 25626 14145 55802 54773 66731 53349 682 -5527 20903 36313 31476
15738 31476 18056 -25380 -3387 37968 50303 44281 27629 63104 64163 43037 -740 46460
$$ packed form
15824A4891q812r983N2628Q4772l8156l6478m1338k343M6142m932J2724o0472
15812H643o9072N943L7069L8183j397J2279L2535l0023p7296q865M454k8419m1562
15799a17528L7092Q698J8506L7089J9526K247N6164j3046q6457m6194j4944J7031
15787h1816L4341K1963M69k8802J4350N8470k0673l4093p98M9277K2394l7955
15775b873M9196J6449l0770k1855j1609n138J8802J865j9467Q258L7417l5891
15763D384K352M3189K0570m3259j7705J7921L952J5960L319Q684l76r540K395
15750E1846j3354j2866j1481M1657j029J1958j3382n2667o209K6430J5410m837
15738C1476j3420m3436K1993M1355J2335o022j6652L5475J059k1126m3777M7200
$$ plain form
15726 46460 79169 37115 31339 32484 4082 -12152 35966 69593 74647 66762 29213 28076 35308
15713 35308 107354 73450 -580 5849 40996 86803 119553 132941 98067 38803 9875 32981
15701 32981 22874 13699 6452 -7969 -31675 -3149 1536 -25314 -30833 -30382 -19960 -19901 -78396
15688 -78396 -87405 -34484 -24825 16175 40623 31127 -1154 -39939 -17374 -17106 -5269 49743 70134
15675 70134 71160 102363 118707 51061 -11737 -7642 62112 84311 110117 91936 53042 -6675
15663 -6675 39253 107731 75895 39589 11758 -23941 -35691 10182 4483 16406 65726 39456
15651 39456 -5211 -48786 -50340 26056 7165 -5269 27147 65161 82509 101084 73899 65978
15639 65978 15130 -30272 -17410 35839 86814 82931 76303 72788 84421 133676 103958 89042
$$ packed form
15726D6460L2709m2054n776J145k8402j6234M8118L3627N054p885l7549j137P232
15713C5308P2046l3904p4030O429L5147M5807L2750J3388l4874n9264k8928K3106
15701C2981j0107r175p247j4421k3706K8526M685k6850n519M51J0422N9n8495
15688g8396r009N2921R659M1000K4448r496l2281l8785K2565K68J1837N5012K0391
15675G0134J026L1203J6344o7646o2798M095O9754K2199K5806j8181l8894n9717
15663f675M5928O8478l1836l6306k7831l5699j1750M5873n699J1923M9320k6270
15651C9456m4667m3575j554P6396j8891j2434L2416L8014J7348J8575k7185p921
15639F5978n0848m5402J2862N3249N0975l883o628l515J1633M9255k9718j4916
$$ plain form
15627 89042 104859 67004 -21026 -39805 -54378 -55007 -38867 -1479 36313 73532 79758 60871
15615 60871 70245 73652 12662 -96619 -45160 1583 72027 69431 88643 77039 79721 104210
15603 104210 72318 14345 12768 72538 70889 47797 -1160 32468 111719 128910 93500 26332
15591 26332 -6579 33324 65338 38802 56245 81211 9417 -10725 27221 29929 53557 116476
15579 116476 84197 61297 58333 50687 26962 23586 60967 44531 37120 65223 102181 91714
15567 91714 55907 81390 50948 36896 66467 70435 114166 106610 52236 4524 3900 46064
15555 46064 75208 48592 81057 110331 176938 192049 114657 73461 26551 -13768 -4178 51148
15543 51148 37203 16195 -6160 12065 23337 29046 44842 45305 26259 29397 45320 54284 94296
$$ packed form
15627H9042J5817l7855q8030j8779j4573o29J6140L7388L7792L7219O226j8887
15615F0871R374L407o0990j09281N1459M6743P0444k596J9212j1604K682K4489
15603A04210l1892n7973j577N9770j649k3092m8957L3628P9251J7191l5410o7168
15591B6332l2911L9903L2014k6536J7443K4966p1794k0142L7946K708K3628O2919
15579A16476l2279k2900k964p646k3725l376L7381j6436p411K8103L6958j0467
15567I1714l5807K5483l0442j4052K9571L968M3731p556n4374m7712o24M2164
15555D6064K9144k6616L2465K9274O6607J5111p7392m1196m6910m0319R590N5326
15543E1148j3945k1008k2355J8225J1272N709J5796M63j9046L138J5923Q964M0012
$$ plain form
15530 94296 115973 98827 40411 -6559 27078 55342 98163 118845 107423 75439 27348 36049
15518 36049 46008 48708 118889 105846 98813 120957 82021 57202 108693 96880 92399 52866
15506 52866 25539 56195 41726 86750 69697 -5419 -16624 -30732 -38362 39283 41430 -1064
15494 -1064 21312 57219 87765 117921 165455 159064 97840 75593 81161 68573 54152 85178
15482 85178 64915 43562 44123 -7502 -18264 14707 513 -26368 -21933 60314 141959 172300
15470 172300 119116 94370 67593 43523 17596 43587 27947 57129 66155 47000 11747 19538
15458 19538 51809 59318 53959 87192 90799 91883 95532 91414 62524 -2618 28985 124693 84678
15445 84678 32537 36642 90384 134543 163509 157680 152737 119795 61129 42584 61389 66495
$$ packed form
15530I4296K1677j7146n8416m6970L3637K8264M2821K0682j1422l1984m8091Q701
15518C6049R959K700P0181j3043p033K2144l8936k4819N1491j1813m481l9533
15506E2866k7327L0656j4469M5024j7053p5116j1205j4108p630P7645K147m2494
15494a064K2376L5907L0546L0156M7534o391o1224k2247N568j2588j4421L1026
15482H5178k0263k1353N61n1625j0762L2971j4194k6881M435Q2247Q1645L0341
15470A72300n3184k4746k6777k4070k5927K5991j5640K9182R026j9155l5253P791
15458A9538L2271P509n359L3233L607J084L649m118k8890o5142L1603R5708m0015
15445H4678n2141M105N3742M4159K8966n829m943l2942n8666j8545J8805N106
$$ plain form
15433 66495 51845 109038 143352 110471 86739 74232 52950 37031 27705 16105 -809 51237
15421 51237 87102 132903 125039 82985 81909 54536 47320 105003 103968 119901 104575 76515
15409 76515 106589 149579 182863 168192 116554 55086 91609 106476 90906 89241 58871 59876
15397 59876 116613 177385 187063 149174 120140 113101 138270 145847 122454 146182 127103 127871 126313
15384 126313 119695 88407 92532 96366 29615 29173 15761 14425 53586 69300 91400 99371 108908
15371 108908 122705 190755 155485 97822 23715 57994 71815 65235 73845 72144 70567 57797
15359 57797 101112 149442 152754 105673 106698 121646 80484 106102 112711 65537 64711 69971 68128
15346 68128 63562 38726 59738 33860 52041 44691 114356 123293 92104 110442 107761 110545 74788
$$ packed form
15433F6495j4650N7193L4314l2881k3732j2507k1282j5919r326j1600j6914N2046
15421E1237L5865M5801p864m2054j076k7373p216N7683j035J5933j5326k8060
15409G6515L0074M2990L3284j4671n1638o1468L6523J4867j5570j665l0370J005
15397E9876N6737O0772R678l7889k9034p039K5169P577k3393K3728j9079P68j558
15384A26313o618l1288M125L834o6751m42j3412j336L9161J5714K2100P971R537
15371A08908J3797O8050l5270n7663p4107L4279J3821o580Q610j701j577j2770
15359E7797M3315M8330L312m7081J025J4948m1162K5618O609m7174q26N260j843
15346F8128m566k4836K1012k5878J8181p350O9665Q937l1189J8338k681K784l5757
$$ plain form
15333 74788 79421 78543 47361 90421 163872 166102 161782 75262 44203 4229 3514 41000 118530
15320 118530 110287 43543 -37095 -8271 51697 129084 126776 96604 120294 169470 206745 209913
15308 209913 144481 82771 147392 203235 211442 203102 194877 201142 154939 83298 106593 146278
15296 146278 167020 160860 121577 163933 148377 97276 72781 91922 117296 152256 151894 171511
15284 171511 154734 112752 126221 171618 161140 102555 107879 163843 81189 58843 58750 126890
15272 126890 139670 112965 72563 47441 97420 180970 169025 114849 143028 152975 134770 104752
15260 104752 102758 99562 143390 105814 68662 67124 159693 133729 96079 91651 94268 85541 81903
15247 81903 50761 35062 60975 72430 39199 77477 161906 138334 173579 214190 221345 180699
$$ packed form
15333G4788M633q78l1182M3060P3451K230m320q6520l1059l9974p15L7486P7530
15320A18530q243o6744q0638K8824N9968P7387k308l0172K3690M9176L7275L168
15308B09913o5432o1710O4621N5843Q207q340q225O265m6203p1641K3295L9685
15296A46278K0742o160l9283M2356j5556n1101k4495J9141K5374L4960l62J9617
15284A71511j6777m1982J3469M5397j0478n8585N324N5964q2654k2346r3O8140
15272A26890J2780k6705m0402k5122M9979Q3550j1945n4176K8179R947j8205l0018
15260A04752j994l196M3828l7576l7152j538R2569k5964l7650m428K617q727l638
15247H1903l1142j5699K5913J1455l3231L8278Q4429k3572L5245M0611P155m0646
$$ plain form
15235 180699 179826 143298 116637 65706 27929 9513 27138 39356 85555 47132 37308 53130
15223 53130 78178 73148 48015 32331 5407 84882 202432 202185 136074 111597 138050 136410
15211 136410 128388 143936 170191 168151 148229 150567 129438 106057 107175 157608 194240 205047
15199 205047 202335 181076 172831 111102 86204 169283 212225 230714 172955 157692 120111 89098
15187 89098 43044 61422 89286 140021 198388 208179 179505 190324 148290 144146 182965 162327
15175 162327 192180 203601 160481 144874 127221 85546 52919 101471 136910 128357 116871 124890
15163 124890 118308 149693 114414 60109 17130 49620 85260 36334 15808 19795 109710 157704
15151 157704 210326 197817 103556 56096 79392 102579 102487 120513 146951 179900 206302 161561
$$ packed form
15235A80699q73l6528k6661n0931l7777j8416J7625J2218M6199l8423r824J5822
15223E3130K5048n030k5133j5684k6924P9475J17550k47o6111k4477K6453j640
15211A36410q022J5548K6255k040j9922K338k1129k3381J118N0433L6632J0807
15199B05047k712k1259q245o1729k4898Q3079M2942J8489n7759j5263l7581l1013
15187H9098m6054J8378K7864N0735N8367R791k8674J0819m2034m144L8819k0638
15175A62327K9853J1421m3120j5607j7653m1675l2627M8552L5439q553j1486Q019
15163A24890o582L1385l5279n4305m2979L2490L5640m8926k0526L987Q9915M7994
15151A57704N2622j2509r4261m7460K3296K3187r2J8026K6438L2949K6402m4741
$$ plain form
15139 161561 119231 91392 89789 107053 58152 39511 100590 96329 124529 201778 222469 189904
15127 189904 195956 173352 135605 120545 124828 130303 109949 117765 139267 119862 109158 91912
15115 91912 32290 57143 122414 96077 94868 170482 187329 172871 158440 154139 127200 131385
15103 131385 111569 96531 109073 145323 185357 158918 118572 82701 71869 95569 162193
15092 162193 166248 146754 138342 101708 126117 172331 147366 187484 200006 111739 92464 96742
15080 96742 104494 149994 157188 208651 283141 273813 235760 195190 144399 133975 208170 207900 201720
15067 201720 112588 66943 129412 136007 160282 101660 68055 110178 133648 146851 144344 164485
15055 164485 160694 138099 122329 149783 140265 160374 172362 163149 146817 140856 131066 122266 107963
$$ packed form
15139A61561m2330k7839j603J7264m8901j8641O1079m261K8200P7249K0691l2565
15127A89904O052k2604l7747j5060M283N475k0354P816K1502j9405j0704j7246
15115I1912n9622K4853O5271k6337j209P5614J6847j4458j4431m301k6939M185
15103A31385j9816j5038J2542L6250M0034k6439m0346l5871j0832K3700O6624
15092A62193M055j9494q412l6634K4409M6214k4965M0118J2522q8267j9275M278
15080I6742P752M5500P194N1463P4490r328l8053m0570n0791j0424P4195k70o180
15067B01720q9132m5645O2469O595K4275n8622l3605M2123K3470J3203k507K0141
15055A64485l791k2595j5770K7454r518K0109J1988r213j6332n961r790q800j4303
$$ plain form
15042 107963 145022 129965 76017 7130 -341 -765 -16592 -13585 42307 89694 121919 181469
15030 181469 221674 169623 155036 155901 133733 93952 148270 200407 153558 121176 69057 58418
15018 58418 92317 75240 77143 82614 82699 132183 168231 145067 106880 80435 61915 123401 201349
15005 201349 225134 183292 132695 99993 141798 195037 187585 174819 224951 268587 256079 208684
14993 208684 212629 129587 111857 192704 144877 160205 128257 160234 189362 150180 94716 68293
14981 68293 55339 51942 93210 120693 172658 184780 201904 162702 162993 164028 100518 83086
14969 83086 126632 188130 203662 203506 198329 140052 151998 164620 202304 180415 127625 87334
14957 87334 88409 122344 118813 109954 130993 128379 67516 81142 69151 84847 91435 126570 203725
$$ packed form
15042A07963L7059j5057n3948o8887p471m24j5827L007N5892M7387L2225N9550
15030A81469M0205n2051j4587Q65k2168l9781N4318N2137m6849l2382n2119j0639
15018E8418L3899j7077J903N471Q5M9484L6048k3164l8187k6445j8520O1486P7948
15005B01349K3785m1842n0597l2702M1805N3239p452j2766N0132M3636j2508m7395
14993B08684L945q3042j7730Q0847m7827J5328l1948L1977K9128l9182n5464k6423
14981F8293j2954l397M1268K7483N1965J2122J7124l9202K91J035o3510j7432
14969H3086M3546O1498J5532j56n177n8277J1946J2622L7684k1889n2790m0291
14957H7334J075L3935l531q859K1039k614o0863J3626j1991J5696O588L5135P7155
$$ plain form
14944 203725 192051 168838 121325 159833 176916 173890 168931 104886 40749 83694 198094 233880
14932 233880 185682 182107 162987 195774 148369 136972 194100 262493 312284 287542 236721 188479
14920 188479 173142 146053 86285 33700 32103 142626 179719 169175 111961 171342 137239
14909 137239 71280 30102 72293 158975 227296 222053 184269 170900 162897 177961 158571 108756
14897 108756 77263 109616 127500 146989 161409 149284 166341 169752 99123 62665 114317 148771
14885 148771 220522 269553 248192 196112 180984 125887 124250 167762 210018 196133 200573 234912
14873 234912 271163 224739 213956 176338 203446 192974 189222 206168 229513 195200 153382 88093
14861 88093 66212 60876 148270 184502 110470 49859 111964 140990 105651 90144 124238 175372
$$ packed form
14944B03725j1674k3213m7513L8508J7083l026m959o4045o4137M2945J14400L5786
14932B33880m8198l575j9120L2787m7405j1397N7128O8393M9791k4742n0821m8242
14920A88479j5337k7089n9768n2585j597J10523L7093j0544n7214N9381l4103
14909A37239o5959m1178M2191Q6682O8321n243l7784j3369q003J5064j9390m9815
14897A08756l1493L2353J7884J9489J4420j2125J7057L411p0629l6458N1652L4454
14885A48771P1751M9031k1361n2080j5128n5097j637M3512M2256j3885M440L4339
14873B34912L6251m6424j0783l7618K7108j0472l752J6946K3345l4313m1818o5289
14861H8093k1881n336Q7394L6232p4032o0611O2105K9026l5339j5507L4094N1134
$$ plain form
14849 175372 174660 134959 130110 137451 194587 216039 191082 179632 173192 187432 190195 136200 119848
14836 119848 170459 157930 138031 139058 200597 218199 159119 128974 210403 240198 229915 204012
14824 204012 123197 120817 142479 157626 168341 216752 197322 175951 172860 139947 171180 198550
14812 198550 204960 209508 119338 85500 195694 200943 176133 194619 165170 151605 162541 179134
14800 179134 203193 228998 210826 212205 196156 226017 243549 277963 268313 253297 259535 246586
14788 246586 252084 182467 156257 137685 139666 102755 91004 105051 131495 170166 185273 158775
14776 158775 198261 198726 248590 284577 208946 197174 188283 136679 142954 185820 174416 154492
14764 154492 168416 183778 195380 210286 218850 183520 171857 218763 242569 223770 202965 200982
$$ packed form
14849A75372p12l9701m849P341N7136K1452k4957j1450o440J4240K763n3995j6352
14836A19848N0611j2529j9899J027O1539J7602n9080l0145Q1429K9795j0283k5903
14824B04012q0815k380K1662J5147J0715M8411j9430k1371l091l2913L1233K7370
14812A98550O410M548r0170l3838J10194N249k4810J8486k9449j3565J0936J6593
14800A79134K4059K5805j8172J379j6049K9861J7532L4414r650j5016O238j2949
14788B46586N498o9617k6210j8572J981l6911j1751J4047K6444L8671J5107k6498
14776A58775L9486M65M9864L5987p5631j1772q891n1604O275M2866j1404j9924
14764A54492J3924J5362J1602J4906Q564l5330j1663M6906K3806j8799k0805j983
$$ plain form
14752 200982 220091 163263 101707 143202 174133 232285 239773 216210 179689 161531 186049 185687
14740 185687 184033 205604 198046 140969 134406 137424 154267 186592 255339 286681 242853 177444
14728 177444 165141 137986 143617 167758 208478 248278 194145 173539 203112 206256 195974 240524
14716 240524 241993 194801 168986 108130 114651 115007 157412 181160 131084 125778 157743 158743 147799
14703 147799 142622 146172 152363 180217 207109 202808 199833 228801 206975 139972 129661 170782
14691 170782 219380 262510 245830 214526 241999 277182 260841 237512 231290 212614 171732 170049
14679 170049 208285 199521 162390 204586 281845 283570 253565 280776 279077 265667 251763 200520
14667 200520 178225 179522 159288 175847 159301 208658 245850 201545 175965 208879 200328 170236
$$ packed form
14752B00982J9109n6828o1556M1495L0931N8152P488k3563l6521j8158K4518l62
14740A85687j654K1571p558n7077o563L018J6843L2325O8747L1342m3828o5409
14728A77444j2303k7155N631K4141M0720L9800n4133k0606K9573L144j0282M4550
14716B40524J469m7192k5815o0856O521L56M2405K3748n0076n306L1965J000j0944
14703A47799n177L550O191K7854K6892m301k975K8968k1826o7003j0311M1121
14691A70782M8598M3130j6680l1304K7473L5183j6341k3329o222j8676m0882j683
14679A70049L8236q764l7131M2196P7259J725l0005K7211j699j3410j3904n1243
14667B00520k2295J297k0234J6559j6546M9357L7192m4305k5580L2914q551l0092
$$ plain form
14655 170236 205827 190610 135319 174475 228078 253382 263300 200284 167241 189746 150018 124468
14643 124468 146931 160901 141302 135922 191908 198986 213983 187265 171003 181406 223261 255454
14631 255454 191090 176635 176730 186481 196283 213997 202383 175301 201375 263172 244390 211910
14619 211910 189612 255382 274569 256654 224928 203571 155532 171676 197621 186871 173434
14608 173434 181302 187717 201596 255139 285539 330919 283818 200052 179393 188788 213910 273787
14596 273787 274501 294370 327467 342999 248241 248809 271091 211166 129579 112544 213393 257264
14584 257264 224398 195347 225677 267162 279834 308837 285538 261598 275429 285247 300787 296050
14572 296050 273796 233347 213210 200905 180023 196868 235877 238137 177266 191937 229106 279119
$$ packed form
14655A70236L5591j5217n5291L9156N3603K5304R918o3016l3043K2505l9728k5550
14643A24468K2463J3970j9599n380N5986P078J4997k6718j6262J0403M1855L2193
14631B55454o4364j4455R5R751R802J7714j1614k7082K6074O1797j8782l2480
14619B11910k2298O5770J9187j7915l1726k1357m8039J6144K5945j0750j3437
14608A73434P868O415J3879N3543L0400M5380m7101q3766k0659R395K5122N9877
14596B73787P14J9869L3097J5532r4758N68K2282n9925q1587j7035J00849M3871
14584B57264l2866k9051L0330M1485J2672K9003k3299k3940J3831R818J5540m737
14572B96050k2254m0449k0137j2305k0882J6845L9009K260o0871J4671L7169N0013
$$ plain form
14560 279119 280620 267170 226758 210046 176642 166569 155324 181236 189680 234709 271189 231220
14548 231220 214137 223407 159605 114764 175182 206954 197887 180271 149783 154988 156878 215895
14536 215895 185551 194634 211050 242105 263485 195238 125056 165145 190328 227451 279238 258856
14524 258856 214275 221832 282684 287752 236715 180384 122509 146777 165722 191190 233887 233761
14512 233761 217710 234350 216888 235867 249856 219682 237833 281747 328015 347603 318102
14501 318102 277525 246471 225127 242961 249396 216199 275275 273324 271860 281055 276991 302222
14489 302222 296045 277347 298799 280154 201234 232288 266291 280804 316428 349847 324596 254531
14477 254531 238826 251187 265654 243402 212072 198575 210095 253739 251853 257916 312418 310671
$$ packed form
14560B79119J501j3450m0412j6712l3404j0073j1245K5912Q444M5029L6480l9969
14548B31220j7083R270o3802m4841O0418L1772r067j7616l0488N205J890N9017
14536B15895l0344R083J6416L1055K1380o8247p0182M0089K5183L7123N1787k0382
14524B58856m4581P557O0852N068n1037n6331n7875K4268J8945K5468M2697j26
14512B33761j6051J6640j7462J8979J3989l0174J8151M3914M6268J9588k9501
14501C18102m0577l1054k1344J7834O435l3197N9076j951j464R195m064K5231
14489C02222o177j8698K1452j8645p8920L1054L4003J4513L5624L3419k5251p0065
14477B54531j5705J2361J4467k2252l1330j3497J1520M3644j886O063N4502j747
$$ plain form
14465 310671 243396 212589 215350 201378 169094 193812 238970 277820 313953 333056 299358 227827
14453 227827 214417 198083 185122 168764 172644 175048 216642 240190 198825 199546 197412 223888
14441 223888 261343 264103 223217 228434 262961 250099 221327 221265 212115 173686 154898 207803 205854
14428 205854 221386 215849 250311 258949 172803 174047 190531 235115 309089 272641 259553 267430
14416 267430 270727 235584 255530 254203 263101 277867 295697 302249 282485 325226 371739 345877
14404 345877 313080 302804 246853 274462 290304 244319 216958 196132 208705 263513 286586
14393 286586 318500 282548 305467 324761 337664 309601 249389 244410 251987 261322 242823 206639
14381 206639 222159 230624 268100 272042 262308 260807 247198 257550 209848 173098 169565 116456
$$ packed form
14465C10671o7275l0807K761j3972l2284K4718M5158L8850L6133J9103l3698p1531
14453B27827j3410j6334j2961j6358L880K404M1594K3548m1365P21k134K6476
14441B23888L7455K760m0886N217L4527j2862k8772o2r150l8429j8788N2905j949
14428B05854J5532n537L4462Q638q6146J244J6484M4584P3974l6448j3088P877
14416B67430L297l5143J9946j327Q898J4766J7830O552j9764M2741M6513k5862
14404C45877l2797j0276n5951K7609J5842m5985k7361k0826J2573N4808K3073
14393B86586L1914l5952K2919J9294J2903k8063o0212m979P577R335j8499l6184
14381B06639J5520Q465L7476L942r734j501j3609J0352m7702l6750l533n3109
$$ plain form
14369 116456 101765 134243 132048 123688 164759 172376 214320 233972 211352 256500 313985 291654
14357 291654 258401 211338 192646 215319 245138 215139 143692 176936 225383 224747 199485 187952
14345 187952 193460 219194 209781 180075 159256 155759 184260 201958 151578 139130 186439 258208
14333 258208 287031 288030 291094 244564 258271 286372 288751 325881 321757 241906 184560 198750
14321 198750 191835 241283 316680 305198 263577 224457 232366 229523 285729 311478 246840 269457
14309 269457 305021 265710 228936 269520 263976 293152 308883 243968 249149 261102 282764 285585
14297 285585 312546 304051 246193 214087 262695 291058 280912 207033 239327 292447 345806 249936
14285 249936 239890 286785 259991 207232 215897 268586 308010 313101 286443 311510 359122 377377
$$ packed form
14369A16456j4691L2478k195q360M1071P617M1944J9652k2620M5148N7485k2331
14357B91654l3253m7063j8692K2673K9819k9999p1447L3244M8447o36k5262j1533
14345A87952N508K5734r413k9706k0819l497K8501J7698n0380j2448M7309P1769
14333B58208K8823R99L064m6530J3707K8101K379L7130m124p9851n7346J4190
14321A98750o915M9448P5397j1482m1621l9120P909k843N6206K5749o4638K2617
14309B69457L5564l9311l6774M0584n544K9176J5731o4915N181J1953K1662K821
14297B85585K6961q495n7858l2106M8608K8363j0146p3879L2294N3120N3359r5870
14285B49936j0046M6895k6794n2759Q665N2689L9424N091k6658K5067M7612J8255
$$ plain form
14273 377377 378932 347450 349019 386690 451110 429698 395687 347825 320146 293410 321006 348326
14261 348326 347819 341651 356270 368939 330936 272066 256213 284178 326117 328220 259196 232516
14249 232516 303099 286462 293230 277864 242231 211753 198113 233304 225552 232837 259802 232060
14237 232060 235370 259180 234581 259959 301214 315970 376121 419645 351227 274103 228543 225368
14225 225368 254736 279914 266234 229674 241664 222926 210372 255168 269510 292124 308920
14214 308920 261930 276900 255538 256669 256621 252797 211529 216469 202104 267215 304688 350734 336895
14201 336895 340918 345101 356492 366470 378526 392154 388252 346773 381352 362085 359603 307205
14189 307205 286702 267276 304413 345394 370152 342236 299677 330806 373339 410764 408030 368259
$$ packed form
14273C77377J555l1482J569L7671O4420k1412l4011m7862k7679k6736K7596K7320
14261C48326n07o168J4619J2669l8003n8870j5853K7965M1939K103o9024k6680
14249B32516P0583j6637O768j5366l5633l0478j3640L5191p752P285K6965k7742
14237B32060L310K3810k4599K5378M1255J4756O0151M3524o8418p7124m5560l175
14225B25368K9368K5178j3680l6560J1990j8738j2554M4796J4342K2614J6796
14214C08920m6990J4970k1362J131m8l824m1268M940j4365O5111L7473M6046j3839
14201C36895M023M183J1391R978J2056J3628l902m1479L4579j9267k482n2398
14189C07205k0503j9426L7137M0981K4758k7916m2559L1129M2533L7425k734l9771
$$ plain form
14177 368259 346514 340530 315555 323880 345589 345708 347980 345648 335012 336085 355724 355943 315378
14164 315378 242055 209547 228847 299594 372063 335862 323395 335610 384436 440136 482624
14153 482624 465755 383375 299465 283304 269262 327047 347983 300436 326474 315820 239681
14142 239681 296871 381848 392678 470736 459505 413808 401413 403554 366654 357777 368334 372778
14130 372778 361868 328838 325452 384701 374604 364916 333662 301375 289209 289157 398060 351740
14118 351740 327220 394796 403503 335481 319552 363215 408554 350778 333190 356747 319807 316460
14106 316460 286658 295155 355551 324223 341738 352471 328150 296910 307654 345201 353448 387861
14094 387861 376692 326983 325061 356459 383900 448412 474942 436156 399874 441652 418962 340024
$$ packed form
14177C68259k1745n984k4975Q325K1709J19K272k332j0636J073J9639K19m0565
14164C15378p3323l2508J9300P0747P2469l6201j2467J2215M8826N5700M2488
14153D82624j6869q2380q3910j6161j4042N7785K0936m7547K6038j0654p6139
14142B39681N7190Q4977J0830P8058j1231m5697j2395K141l6900q877J0557M444
14130C72778j0910l3030l386N9249j0097r688l1254l2287j2166n2J08903m6320
14118C51740k4520O7576Q707o8022j5929M3663M5339n7776j7588K3557l6940l347
14106C16460k9802Q497O0396l1328J7515J0733k4321l1240J0744L7547Q247L4413
14094C87861j1169m9709j922L1398K7441O4512K6530l8786l6282M1778k2690p8938
$$ plain form
14082 340024 288461 373757 406145 394069 398628 384054 327234 287244 339265 329530 314803 312807
14070 312807 348359 434245 473207 477840 439257 451882 442581 429326 378528 319436 316140 333852
14058 333852 379266 391910 408866 440653 411140 382248 434898 366618 339885 357486 362999 393041
14046 393041 402289 391881 386087 411226 452772 429278 478424 493269 443007 434018 446730 448591
14034 448591 420057 347678 335357 338122 363851 412087 422110 409460 370907 397705 429473 437660
14022 437660 425087 394074 416094 406318 417469 391558 392228 401038 388623 354029 330179 293137
14010 293137 333520 378390 378692 418951 434205 414963 385534 388075 389304 407772 401358 374661
13998 374661 316402 336143 286366 263938 309857 340264 417291 475496 440791 397332 389692 407134
$$ packed form
14082C40024n1563Q5296L2388j2076M559j4574n6820l9990N2021r735j4727j996
14070C12807L5552Q5886L8962M633l8583J2625r301j3255n0798n9092l296J7712
14058C33852M5414J2644J6956L1787k9513k8892N2650o8280k6733J7601N513L0042
14046C93041R248j0408n794K5139M1546k3494M9146J4845n0262q989J2712J861
14034D48591k8534p2379j2321K765K5729M8236J0023j2650l8553K6798L1768Q187
14022D37660j2573l1013K2020r776J1151k5911O70Q810j2415l4594k3850l7042
14010B93137M0383M4870L02M0259J5254j9242k9429K541J229J8468o414k6697
13998C74661n8259J9741m9777k2428M5919L0407P7027N8205l4705m3459p640J7442
$$ plain form
13986 407134 390643 377717 398227 365501 312541 270310 265455 304037 289419 302519 313871 332725
13974 332725 380512 380416 396936 364984 367401 419029 488774 490124 481545 427652 449361 503578 417530
13961 417530 412222 432171 460497 413023 359052 360999 395288 363905 362456 401037 410448 399225
13949 399225 384121 409914 386443 369707 350703 345403 332313 327030 275026 280968 350973 403456
13937 403456 384900 375567 381132 351958 401915 423994 456273 468639 459495 462199 452654 443121 418192
13924 418192 443151 490380 423596 374249 371893 388759 415227 403877 407233 416073 482450 435410
13912 435410 413333 454998 415961 416623 446440 407348 383360 343793 332239 378699 405378 394485
13900 394485 408968 410984 360470 363002 404152 355302 336917 347498 342651 340197 322748 359938
$$ packed form
13986D07134j6491j2926K0510l2726n2960m2231m855L8582j4618J3100J1352J8854
13974C32725M7787r6J6520l1952K417N1628O9745J350q579n3893K1709N4217q6048
13961D17530n308J9949K8326m7474n3971J947L4289l1383j449L8581R411j1223
13949C99225j5104K5793k3471j6736j9004n300j3090n283n2004N942P0005N2483
13937D03456j8556r333N565k9174M9957K2079L2279J2366r144K704r545r533k4929
13924D18192K4959M7229o6784m9347k356J6866K6468j1350L356Q840O6377m7040
13912D35410k2077M1665l9037O62K9817l9092k3988l9567j1554M6460K6679j0893
13900C94485J4483K016n0514K532M1150m8850j8385J0581m847k454j7449L7190
$$ plain form
13888 359938 457418 427141 404341 423329 407992 420921 451491 411393 375533 401503 455497
13877 455497 464935 461189 505026 517132 440231 396435 370569 370902 471181 450711 437663 413050
13865 413050 409108 477717 455906 375055 348253 417508 453933 505928 547384 579692 561343 546665
13853 546665 530885 517422 566380 525748 424917 435463 462548 488142 474172 451614 435470
13842 435470 412952 432970 431277 386665 340048 374577 390204 422823 400442 385256 418976 468651
13830 468651 472171 481770 472018 430734 439359 426934 362855 329493 296014 318012 374318 412094
13818 412094 375701 377851 407372 446483 487239 466188 491079 489481 502633 511516 526780 478119
13806 478119 448432 432120 390034 387219 450282 475083 491065 563608 599503 546260 444599
$$ packed form
13888C59938R7480l0277k2800J8988j5337J2929L0570m0098l5860K5970N3994
13877D55497R438l746M3837J2106p6901m3796k5866L33J00279k0470j3048k4613
13865D13050l942O8609k1811q0851k6802O9255L6425N1995M1456L2308j8349j4678
13853E46665j5780j3463M8958m0632j00831J0546K7085K5594j3970k2558j6144
13842D35470k2518K0018j693m4612m6617L4529J5627L2619k2381j5186L3720M9675
13830D68651L520R599r752m1284Q625j2425o4079l3362l3479K1998N6306L7776
13818D12094l6393K150K9521L9111M0756k1051K4891j598J3152Q883J5264m8661
13806D78119k9687j6312m2086k815O3063K4801J5982P2543L5895n3243j01661
$$ plain form
13795 444599 400490 398045 445305 514165 548684 512913 510563 529694 541140 525187 514683 521895
13783 521895 524636 516745 518924 547008 577114 512365 486942 546937 558333 507353 475609 485261
13771 485261 510564 552656 551991 548551 521810 498972 514372 528317 579068 603199 552490 510220
13759 510220 513010 476310 475364 543771 601769 575028 561147 626691 603435 548495 510121 517021
13747 517021 559521 516215 485937 459476 435555 466105 505153 484595 494779 499026 511561 513828
13735 513828 501400 471478 444832 458356 484913 439648 507996 567247 541734 536209 509858 506429
13723 506429 537381 501062 514235 522116 527640 478848 469809 509038 575079 636959 594411 542467
13711 542467 540524 501687 565242 575378 591769 577040 603749 567579 503826 487638 471432 493441
$$ packed form
13795D44599m4109k445M7260O8860L4519l5771k350J9131J1446j5953j0504P212
13783E21895K741p891K179K8084L0106o4749k5423N9995J1396n0980l1744R652
13771D85261K5303M2092o65l440k6741k2838J5400J3945N0751K4131n0709m2270
13759E10220K790l6700r46O8407N7998k6741j3881O5544k3256n4940l8374O900
13747E17021M2500m3306l0278k6461k3921L0550L9048k0558J0184M247J2535K267
13735E13828j2428k9922k6646J3524K6557m5265O8348N9251k5513n525k6351l429
13723E06429L0952l6319J3173P881N524m8792r039L9229O6041O1880m2548n1944
13711E42467j943l8837O3555J0136J6391j4729K6709l6170o3753j6188j6206K2009
$$ plain form
13699 493441 497523 529238 544074 550958 551543 556929 515147 484605 548369 597494 589261 618591 590837
13686 590837 551539 552278 558207 606366 619080 634762 634335 624866 586697 642047 656960 612956 644449
13673 644449 647315 658386 647797 628180 600363 627820 621286 591235 562499 518740 484367 538612
13661 538612 585095 576373 597999 588436 578726 526119 537635 584215 575968 607774 663617 652499
13649 652499 620275 546591 564429 542898 519946 516558 469184 487850 549249 636120 569314 508429
13637 508429 539892 547902 563023 616346 653823 626120 567191 572788 571826 579419 592659 627236
13625 627236 611914 650119 686382 649195 606418 645928 599969 524597 506011 510883 547805 608945
13613 608945 626185 660865 671573 693653 769429 787392 810339 818392 784343 720245 621521 598029
$$ packed form
13699D93441M082L1715J4836O884N85N386m1782l0542O3764M9125q233K9330k7754
13686E90837l9298P39N929M8159J2714J5682m27r469l8169N5350J4913m4004L1493
13673F44449K866J1071j0589j9617k7817K7457o534l0051k8736m3759l4373N4245
13661E38612M6483q722K1626r563r710n2607J1516M6580q247L1806N5843j1118
13649F52499l2224p3684J7838k1531k2952l388m7374J8666O1399Q6871o6806o0885
13637E08429L1463Q010J5121N3323L7477k7703n8929N597r62P593J3240L4577
13625F27236j5322L8205L6263l7187m2777L9510m5959p5372j8586M872L6922O1140
13613F08945J7240L4680J0708K2080P5776J7963K2947Q053l4049o4098r8724k3492
$$ plain form
13601 598029 614828 602116 590833 560922 573099 551983 588134 632547 652756 708762 736267
13590 736267 701907 677832 664269 643980 612506 646123 693539 669286 629874 620675 655379 701723
13578 701723 681202 656453 661244 665674 648301 666446 677626 679626 658977 616773 570290 539414
13566 539414 580612 640907 614391 618379 642064 619786 582468 567949 561972 590286 583076 599894
13554 599894 628254 648809 718900 742304 726326 707172 732216 755035 753899 739793 730060 756239
13542 756239 689269 639069 638279 623244 651397 640201 613783 603346 606853 644786 634907 612027
13530 612027 603915 609719 610795 613022 669748 689826 658453 640853 676170 659836 651409 652463 650241
13517 650241 694883 754441 775926 715693 658999 688626 694937 715412 763068 749839 720770 705645
$$ packed form
13601E98029J6799j2712j1283k9911J2177k1116L6151M4413K0209N6006K7505
13590G36267l4360k4075j3563k0289l1474L3617M7416k4253l9412r199L4704M6344
13578G01723k0521k4749M791M430j7373J8145J1180K000k0649m2204m6483l0876
13566E39414M1198O0295k6516L988K3685k2278l7318j4519n977K8314p210J6818
13554E99894K8360K0555P0091K3404j5978j9154K5044K2819j136j4106r733K6179
13542G56239o6970n0200p90j5035K8153j1196k6418j0437L507L7933r879k2880
13530F12027q112N804J076K227N6726K0078l1373j7600L5317j6334q427J054k222
13517F50241M4642N9558K1485o0233n6694K9627O311K0475M7656j3229k9069j5125
$$ plain form
13505 705645 665337 578315 571862 618479 656352 675200 632706 700919 703066 760671 800867 758657
13493 758657 737010 742373 784971 801318 826959 822341 759405 695360 705528 707447 757827 739135
13481 739135 704160 671150 663397 720874 797552 729638 725171 771851 786388 673683 689680 724359
13469 724359 757551 768036 703992 727083 749209 743078 764019 794503 813538 797508 755226 756988
13457 756988 722283 691998 677667 668483 699423 713559 695350 714349 750142 839298 857365 829026
13445 829026 812244 792989 723433 675270 673134 669917 665222 664803 703038 776410 811617 847012
13433 847012 813396 787864 806855 800503 770483 738756 679373 724203 750779 700258 713205 768469
13421 768469 785647 739885 774504 784523 752802 750810 740036 736482 763091 795690 813925 839397
$$ packed form
13505G05645m0308q7022o453M6617L7873J8848m2494O8213K147N7605M0196m2210
13493G58657k1647N363M2598J6347K5641m618o2936o4045J0168J919N0380j8692
13481G39135l4975l3010p753N7477P6678o7914m467M6680J4537j12705J5997L4679
13469G24359L3192J0485o4044K3091K2126o131K0941L0484J9035j6030m2282J762
13457G56988l4705l0285j4331r184L0940J4136j8209J8999L5793Q9156J8067k8339
13445H29026j6782j9255o9556m8163k136l217m695m19L8235P3372L5207L5395
13433H47012l3616k5532J8991o352l0020l1727n9383M4830K6576n0521J2947N5264
13421G68469J7178m5762L4619J0019l1721j992j0774l554K6609L2599J8235K5472
$$ plain form
13409 839397 810630 751436 749574 723011 721442 744033 803681 817043 853109 886067 863249 863670
13397 863670 859001 841209 829237 847217 848761 870713 884572 897005 907098 934821 994021 969451
13385 969451 942730 946647 897682 904905 882771 901445 928128 946379 895855 904827 885964 899966
13373 899966 906974 889907 845910 862291 857913 825867 847289 841872 856449 859307 866419 811469
13361 811469 769633 814803 846586 877542 896364 843763 835472 902140 883009 853539 894752 886223
13349 886223 903680 899847 935574 875855 842200 853107 926019 989973 978543 1007663 1037647 1014738
13337 1014738 1027008 1058837 1060547 1064480 1012970 988208 1043764 1002290 977486 954085 970316 964503
13325 964503 932088 963756 938212 972240 1025521 1018387 1031974 1010134 992109 928540 883883 860713
$$ packed form
13409H39397k8767n9194j862k6563j569K2591N9648J3362L6066L2958k2818M21
13397H63670m669j7792j1972J7980J544K1952J3859J2433J0093K7723N9200k4570
13385I69451k6721L917m8965P223k2134J8674K6683J8251n0524Q972j8863J4002
13373H99966P008j7067m3997J6381m378l2046K1422n417J4577K858P112n4950
13361H11469m1836M5170L1783L0956J8822n2601q291O6668j9131k9470M1213q529
13349H86223J7457l833L5727n9719l3655J0907P2912O3954j1430K9120K9984k2909
13337A014738J2270L1829J710L933n1510k4762N5556m1474k4804k3401J6231n813
13325I64503l2415L1668k5544L4028N3281p134J3587k1840j8025o3569m4657k3170
$$ plain form
13313 860713 907180 976679 1017791 1008371 1000557 1036034 1032844 1007872 958883 968106 1028271 1051098
13301 1051098 1042694 1032214 997901 999753 998130 1027983 1025016 1013547 1017911 968327 992885 1040635
13289 1040635 1052708 1069479 1132650 1143393 1109063 1130289 1160750 1142261 1105383 1117903 1115764
13278 1115764 1078313 1051928 1082889 1084315 1065576 1026497 990934 974132 1021874 1038889 1021093
13267 1021093 1019711 1011969 1018365 1018637 1058489 1006826 993434 1046179 1108375 1123944 1124240 1129297 1146230
13254 1146230 1149835 1137043 1090864 1115586 1173647 1176056 1141668 1140582 1159478 1179060 1121908 1084993
13242 1084993 1063735 1054908 1005898 1000044 1044986 1110666 1141856 1148814 1125965 1108667 1092103 1081494
13230 1081494 1046406 1037230 1044126 1043821 1042145 1050983 1040832 1095774 1103319 1091741 1102248 1104649 1128535
$$ packed form
13313H60713M6467O9499M1112r420p814L5477l190k4972m8989R223O0165K2827
13301A051098q404j0480l4313J852j623K9853k967j1469M364m9584K4558M7750
13289A040635J2073J6771O3171J0743l4330K1226L0461j8489l6878J2520k139
13278A115764l7451k6385L0961J426j8739l9079l5563j6802M7742J7015j7796
13267A021093j382p742O396K72L9852n1663j3392N2745O2196J5569K96N057J6933
13254A146230L605j2792m6179K4722N8061K409l4388j086J8896J9582n7152l6915
13242A084993k1258q827m9010n854M4942O5680L1190O958k2849j7298j6564j0609
13230A081494l5088r176O896l05j676Q838j0151N4942P545j1578J0507K401K3886
$$ plain form
13217 1128535 1129543 1117006 1114836 1094187 1100836 1139623 1124386 1114034 1108165 1089054 1087195 1156260
13205 1156260 1158734 1221952 1202476 1204431 1189538 1186010 1161628 1158252 1193957 1151180 1155803 1172231
13193 1172231 1169258 1199964 1208040 1239260 1269372 1204577 1132225 1151249 1247793 1324956 1319203 1288768
13181 1288768 1313642 1351251 1391020 1357209 1304247 1292949 1316001 1292847 1289604 1302671 1327537
13170 1327537 1325341 1346542 1375459 1326481 1291919 1312783 1294761 1312258 1341143 1391567 1379701
13159 1379701 1368588 1362729 1383830 1389594 1411712 1434093 1443121 1423420 1395241 1422931 1505948 1468943
13147 1468943 1394837 1400561 1440290 1396028 1364176 1365293 1403333 1442922 1422702 1344175 1307062 1315481
13135 1315481 1347587 1334273 1357911 1434939 1457088 1420570 1402474 1414661 1466327 1471324 1523106
$$ packed form
13217A128535J008j2537k170k0649O649L8787j5237j0352n869j9111j859O9065
13205A156260K474O3218j9476J955j4893l528k4382l376L5705m2777M623J6428
13193A172231k973L0706Q076L1220L0112o4795p2352J9024R6544P7163n753l0435
13181A288768K4874L7609L9769l3811n2962j1298K3052k3154l243J3067K4866
13170A327537k196K1201K8917m8978l4562K0864j8022J7497K8885N0424j1866
13159A379701j1113n859K1101N764K2118K2381R028j9701k8179K7690Q3017l7005
13147A468943p4106N724L9729m4262l1852J117L8040L9589k0220p8527l7113Q419
13135A315481L2106j3314K3638P7028K2149l6518j8096J2187N1666M997N1782
$$ plain form
13124 1523106 1518501 1514238 1461787 1479016 1466897 1505463 1532653 1512783 1458684 1476581 1500542 1529109
13112 1529109 1531689 1541049 1534360 1585084 1635711 1618653 1615980 1587968 1542055 1502093 1525949 1550845
13100 1550845 1540797 1527936 1568344 1569645 1545772 1578666 1571397 1567696 1602323 1606693 1616178 1658222
13088 1658222 1667630 1644350 1626206 1659791 1680056 1660198 1635249 1630420 1613684 1594022 1599708 1613038
13076 1613038 1613832 1587477 1570886 1579639 1615500 1675318 1788059 1813773 1763624 1739813 1726188 1722640
13064 1722640 1737705 1738099 1705532 1699838 1702745 1641571 1628647 1683177 1773690 1787377 1732860 1749803
13052 1749803 1784900 1766911 1761404 1798068 1781565 1824815 1843901 1796062 1757403 1780346 1750751
13041 1750751 1725585 1829870 1885293 1892464 1909157 1920489 1878694 1839021 1802345 1819369 1830112
$$ packed form
13124A523106m605m263n2451J7229j2119L8566K7190j9870n4099J7897K3961K8567
13112A529109K580R360o689N0724N0627j7058k673k8012m5913l9962K3856K4896
13100A550845j0048j2861M0408J301k3873L2894p269l701L4627M370R485M2044
13088A658222R408k3280j8144L3585K0265j9858k4949m829j6736j9662N686J3330
13076A613038P94k6355j6591Q753L5861N9818J12741K5714n0149k3811j3625l548
13064A722640J5065L94l2567n694K907o1174j2924N4530R0513J3687n4517J6943
13052A749803L5097j7989n507L6664j6503M3250J9086m7839l8659K2943k9595
13041A750751k5166J04285N5423P171J6693J1332m1795l9673l6676J7024J0743
$$ plain form
13030 1830112 1917306 1972244 1939351 1880931 1896384 1883270 1837659 1894889 1890963 1827116 1846947
13019 1846947 1878495 1921624 1974161 1955815 1969281 1969191 1934769 1908501 1945530 1962865 1992609 2040000
13007 2040000 2039013 2049169 2073784 2047812 2034572 2038184 2067735 2047493 2077445 2107966 2118289 2133602
12995 2133602 2083597 2063596 2081122 2128699 2125658 2131344 2116907 2083374 2066690 2059375 2003950 2027784
12983 2027784 2078377 2116176 2161178 2207815 2199236 2222435 2208238 2261065 2271169 2291135 2303292
12972 2303292 2297919 2269358 2258988 2212873 2236288 2278943 2265559 2223923 2227819 2258834 2291762 2314167
$$ packed form
13030A830112Q7194N4938l2893n8420J5453j3114m5611N7230l926o3847J9831
13019A846947L1548M3129N2537j8346J3466r0l4422k6268L7029J7335K9744M7391
13007B040000r87J0156K4615k5972j3240L612K9551k0242K9952L0521J0323J5313
12995B133602n0005k0001J7526M7577l041N686j4437l3533j6684p315n5425K3834
12983B027784N0593L7799M5002M6637q579K3199j4197N2827J0104J9966J2157
12972B303292n373k8561j0370m6115K3415M2655j3384m1636L896L1015L2928K2405
$$ [...]
##END NTUPLES=NMR SPECTRUM
##END=
