##TITLE=Analysis number 328980
Compound Code cc 23803
Book Reference 486/172
Project Code adrs
Chemist Name simons
##JCAMPDX= 6.0         $$ Bruker NMR JCAMP-DX V2.0
##DATA TYPE= NMR SPECTRUM
##DATA CLASS= NTUPLES
##ORIGIN= Bruker BioSpin GmbH
##OWNER= nmr
$$ XWIN-NMR		Version 3.5
$$ Mon Jul 23 09:17:25 2007 GMT Daylight Time (UT+1h)  MAYBRIDGE\nmr@NMR_250MHZ
##.OBSERVE FREQUENCY= 250.131544655141
##.OBSERVE NUCLEUS= ^1H
##.ACQUISITION MODE= SIMULTANEOUS (DQD)
##.ACQUISITION SCHEME= undefined
##.AVERAGES= 16
##.DIGITISER RES= 18
##SPECTROMETER/DATA SYSTEM= dpx250
##.PULSE SEQUENCE= zg30
##.SOLVENT NAME= CDCl3
##.SHIFT REFERENCE= (INTERNAL, CDCl3, 0, 16.4483)
##AUDIT TRAIL= $$ (NUMBER, WHEN, WHO, WHERE, WHAT)
$$ ##TITLE= Audit trail, XWIN-NMR		Version 3.5
$$ ##JCAMPDX= 5.01
$$ ##ORIGIN= Bruker BioSpin GmbH
$$ ##OWNER= nmr
$$ C:\u/data/dgb/nmr/ADRS/1310/pdata/1/auditp.txt
$$ ##AUDIT TRAIL=  $$ (NUMBER, WHEN, WHO, WHERE, WHAT)
(   1,<2007-07-23 09:16:58.27 +100>,<MAYBRIDGE\nmr>,<NMR_250MHZ>,
      <created by zg, POWCHK disabled, PULCHK disabled
       configuration hash MD5:
       76 6E 9A 78 1E 09 19 81 EC 84 63 8F B0 6A 59 2D
       data hash MD5: 64K
       97 F3 A7 5D 6B 8D AC 83 8C BD 32 0C CA 8A F5 B7>)
(   2,<2007-07-23 09:17:14.35 +100>,<MAYBRIDGE\nmr>,<NMR_250MHZ>,
      <Start of raw data processing
       ef LB = 0.3 FT_mod = 6 PKNL = 1 SI = 32K 
       data hash MD5: 32K
       92 78 BD A1 FA EE 8C BC D0 97 2C 3C 44 27 20 EB>)
(   3,<2007-07-23 09:17:16.51 +100>,<MAYBRIDGE\nmr>,<NMR_250MHZ>,
      <apk 
       data hash MD5: 32K
       5C 2E 40 C9 AF 4D 34 07 54 30 4D FA DB 70 30 DA>)
(   4,<2007-07-23 09:17:17.23 +100>,<MAYBRIDGE\nmr>,<NMR_250MHZ>,
      <abs ABSG = 5 
       data hash MD5: 32K
       D6 9A 8D 00 49 BC 7F BB 54 13 A7 5E D8 A2 89 E8>)
$$ ##END=
$$ 
$$ hash MD5
$$ 32 F0 C0 A6 7E F8 3E CD 3A BB 2F E9 24 67 8A 7E
##$RELAX= 
##$RELAX= 
##$RELAX= 
##$RELAX= 
##$RELAX= 
##$RELAX= 
##$RELAX= 
$$ Bruker specific parameters
$$ --------------------------
##$DU= <C:\u>
##$EXPNO= 1310
##$NAME= <ADRS>
##$PROCNO= 1
##$TYPE= <nmr>
##$USER= <dgb>
##$AMP= (0..31)
100 100 100 100 100 100 100 100 100 100 100 100 100 100 100 100 100 100 
100 100 100 100 100 100 100 100 100 100 100 100 100 100 
##$AQSEQ= 0
##$AQ_mod= 3
##$AUNM= <au_zg>
##$AUTOPOS= <3 >
##$BF1= 250.13
##$BF2= 250.13
##$BF3= 250.13
##$BF4= 250.13
##$BF5= 500.13
##$BF6= 500.13
##$BF7= 500.13
##$BF8= 500.13
##$BYTORDA= 1
##$CFDGTYP= 0
##$CFRGTYP= 5
##$CHEMSTR= <none>
##$CNST= (0..31)
1 1 145 1 1 1 1 1 1 1 1 1 1 1 1 1 1 1 1 1 1 1 1 1 1 1 1 1 1 1 1 1 
##$CPDPRG= <>
##$CPDPRG1= <>
##$CPDPRG2= <>
##$CPDPRG3= <>
##$CPDPRG4= <mlev>
##$CPDPRG5= <mlev>
##$CPDPRG6= <mlev>
##$CPDPRG7= <mlev>
##$CPDPRG8= <mlev>
##$CPDPRGB= <>
##$CPDPRGT= <>
##$D= (0..31)
0 1 0 0 0 0 0 0 0 0.06 0 0 0 0 0 0 0.0002 0 0 0 0 0 0 0 0 0 0 0 0 0 0 
0 
##$DATE= 1185178617
##$DBL= (0..7)
120 120 120 120 120 120 120 120 
##$DBP= (0..7)
150 150 150 150 150 150 150 150 
##$DBP07= 0
##$DBPNAM0= <>
##$DBPNAM1= <>
$$ [...]
##$SUBNAM7= <"">
##$SUBNAM8= <"">
##$SUBNAM9= <"">
##$SW= 20.6930455092707
##$SWIBOX= (0..15)
0 0 3 0 0 0 0 0 0 0 0 0 0 0 0 0 
##$SW_h= 5175.983436853
##$TD= 65536
##$TD0= 1
##$TE= 296.16
##$TE2= 300
##$TE3= 300
##$TEG= 300
##$TL= (0..7)
0 120 120 120 120 120 120 120 
##$TP= (0..7)
150 150 150 150 150 150 150 150 
##$TP07= 0
##$TPNAME0= <>
##$TPNAME1= <>
##$TPNAME2= <>
##$TPNAME3= <>
##$TPNAME4= <>
##$TPNAME5= <>
##$TPNAME6= <>
##$TPNAME7= <>
##$TPOAL= (0..7)
0.5 0.5 0.5 0.5 0.5 0.5 0.5 0.5 
##$TPOFFS= (0..7)
0 0 0 0 0 0 0 0 
##$TUNHIN= 0
##$TUNHOUT= 0
##$TUNXOUT= 0
##$USERA1= <user>
##$USERA2= <user>
##$USERA3= <user>
##$USERA4= <user>
##$USERA5= <user>
##$V9= 5
##$VALIST= <valist>
##$VCLIST= <CCCCCCCCCCCCCCC>
##$VD= 0
##$VDLIST= <DDDDDDDDDDDDDDD>
##$VPLIST= <PPPPPPPPPPPPPPP>
##$VTLIST= <TTTTTTTTTTTTTTT>
##$WBST= 1024
##$WBSW= 4
##$XGAIN= (0..3)
0 0 0 0 
##$XL= 0
##$YL= 0
##$YMAX_a= 503205
##$YMIN_a= -455436
##$ZGOPTNS= <>
##$ZL1= 120
##$ZL2= 120
##$ZL3= 120
##$ZL4= 120
##$ABSF1= 16.4483
##$ABSF2= -4.244873
##$ABSG= 5
##$ABSL= 3
##$ALPHA= 0
##$AQORDER= 0
##$ASSFAC= 0
##$ASSFACI= 0
##$ASSFACX= 0
##$ASSWID= 0
##$AUNMP= <proc_1d>
##$AZFE= 0.1
##$AZFW= 0.1
##$BCFW= 0
##$BC_mod= 0
##$BYTORDP= 0
##$COROFFS= 0
##$CY= 12.5
##$DATMOD= 1
##$DC= 0
##$DFILT= <>
##$DTYPP= 0
##$F1P= 14.0000005364418
##$F2P= -0.99999901652339
##$FCOR= 0.5
##$FTSIZE= 32768
##$FT_mod= 6
##$GAMMA= 0
##$GB= 0
##$INTBC= 1
##$INTSCL= 1
##$ISEN= 128
##$LB= 0.3
##$LEV0= 0
##$LPBIN= 0
##$MAXI= 10000
##$MC2= 0
##$MEAN= 0
##$ME_mod= 0
##$MI= 0
##$NCOEF= 0
##$NC_proc= -2
##$NLEV= 6
##$NOISF1= 0
##$NOISF2= 0
##$NSP= 0
##$NTH_PI= 0
##$NZP= 0
##$OFFSET= 16.4483
##$PC= 1
##$PHC0= -51.61511
##$PHC1= 8.300141
##$PH_mod= 1
##$PKNL= yes
##$PPARMOD= 0
##$PSCAL= 4
##$PSIGN= 0
##$REVERSE= no
##$SF= 250.130018432438
##$SI= 32768
##$SIGF1= 0
##$SIGF2= 0
##$SINO= 400
##$SIOLD= 32768
##$SREGLST= <1H.CDCl3>
##$SSB= 0
##$STSI= 32768
##$STSR= 0
##$SW_p= 5175.98343685301
##$SYMM= 0
##$S_DEV= 0
##$TDeff= 65536
##$TDoff= 0
##$TI= <Analysis number 999999
Compound Code 99
Book Reference 9
Project Code 9>
##$TILT= no
##$TM1= 0
##$TM2= 0
##$TOPLEV= 0
##$USERP1= <user>
##$USERP2= <user>
##$USERP3= <user>
##$USERP4= <user>
##$USERP5= <user>
##$WDW= 1
##$XDIM= 32768
##$YMAX_p= 338559962
##$YMIN_p= -47756
$$ End of Bruker specific parameters
$$ ---------------------------------
##NTUPLES= NMR SPECTRUM
##VAR_NAME=  FREQUENCY,     SPECTRUM/REAL,   SPECTRUM/IMAG
##SYMBOL=    X,             R,               I
##VAR_TYPE=  INDEPENDENT,   DEPENDENT,       DEPENDENT
##VAR_FORM=  AFFN,          ASDF,            ASDF
##VAR_DIM=   32768,         32768,           32768
##UNITS=     HZ,            ARBITRARY UNITS, ARBITRARY UNITS
##FACTOR=    0.157963299565203, 1,           1
##FIRST=     4114.21343409504, 0,            0
##LAST=      -1061.77000275797, 0,           0
##MIN=       -1061.77000275797, -47756,      0
##MAX=       4114.21343409504, 338559962,    0
$$ Real data points
##PAGE= N=1
##DATA TABLE= (X++(R..R)), XYDATA
$$ [...]
19238A089524j63106j13703q0092n7297n2888m5808l0646k3718j1506j0560L63
19227E00563L999j373m9035o2242l0196k5223q377r631j8600k8923j7300k0650
19215B33012M351m654o186k4546J52K290j5665j4626o527j3163o276k340R131
19202A54953M42m538o493j5201j0584r248q532j4099L89K889L6126P2268O4970
19189B63342L8027J5255k0128k1922q691J4914K4559K9560J5445j8504m8843m2798
19177B40216l7974l4517k9200l1171j0097k3407j6244M260l368j5557l100j230
19165C8611n487k97L629Q850J2380N782o333j6028k2163k105M634Q240m437m336
19151B0940J607P446Q168M02M72l390p634m058j1265K176J9473K639p134n712
$$ plain form
19238 1089524 926418 812715 732623 675326 622438 576630 545984 522266 510760 500200 500563
19227 500563 504562 503189 454154 391912 361716 336493 328116 318485 299885 270962 253662 233012
19215 233012 237363 232709 226523 201977 202129 204419 188754 174128 167601 154438 148162 145822 154953
19202 154953 155395 150857 144364 129163 118579 109331 100799 86700 87089 89978 126104 198372 263342
19189 263342 301369 316624 296496 274574 265883 280797 305356 334916 350361 331857 283014 240216
19177 240216 202242 167725 138525 107354 97257 73850 57606 61866 58498 42941 39841 38611
19165 38611 33124 32827 36456 45306 57686 63468 57135 41107 18944 16839 21473 29713 25276 20940
19151 20940 22547 29993 38161 38563 39035 35645 28011 23953 12688 14864 34337 36976 29842 24130
19137B4130J2431Q403J7033K791J3480J1752J2418o651j9691j3977q151Q71J7697
19124G2536J4682j0855j36j2304o869n993r875m454m516Q384L057q020M174r066
19110C0745O107Q110J528j1597j533O249O543j0254j1659P200M458K90J8210m040
19096E0357m705r922M608J4150J3497m5j2589J0041n490p268K871M972r728p258
19082D3491J618n231q445k547p175p075P20m623L167J0026P91J058j0068r438
19068F269J7015K309L069J1934j241j4184j0688P735P927P27M704J1606M063j002
19054E0243n39P165j8135j1779m250Q28j948R697J0991k120k091O681M993j4585
19040C5151n478j0401P631J4011l318J702J1896p228K6J484J3851P823j4854k8515
$$ plain form
19137 24130 36561 44964 61997 64788 78268 90020 102438 95787 76096 62119 53968 54839 72536
19124 72536 87218 76363 76227 63923 57054 51061 41186 36732 32216 40600 43657 35637 39811 30745
19110 30745 36852 44962 46490 34893 33360 39609 46152 35898 24239 31439 35897 36187 54397 50357
19096 50357 45652 35730 40338 54488 67985 67940 55351 65392 59902 52634 55505 60477 50749 43491
19082 43491 45109 39878 31433 28886 21711 14636 15356 10733 13900 23926 24717 25775 15707 6269
19068 6269 23284 25593 28662 40596 39355 25171 14483 22218 30145 30872 35576 47182 51245 50243
19054 50243 49704 56869 38734 26955 22705 23533 21585 31282 42273 40153 38062 44743 49736 35151
19040 35151 29673 19272 26903 40914 37596 39298 51194 43966 43992 45476 59327 67150 52296 23781
19026B3781j8653n687o134p77M653O472Q555P425k288j0326J987k656P641J0049
19012B4042l63n832J0998K991j3432o37O256J2188O779m73m257Q090Q770l600
18998E1520J1128K7562K1014L1172M0517L2711J4428J0985o267l7665k9694j5958
18986A51453l3306k4878Q151N735R304K4832L5811N4140N2827L4109Q560k3181
18974C03557k8641n4482o4528n0128l2546k0281q428j7093j4802j256R312P370
18962B8054p563j1395m010j2121M228K1564J3050n216L502r560P203l030j5614
18949I092m347J0346O580n200l432j972l902p76K3172O639j0934l697k589J0261
18935B9241l016Q322J620j4757l044J3685j2567n504P88k692J4117J5039R327
$$ plain form
19026 23781 5128 -559 -6693 -7470 -2817 3655 12210 19635 17347 7021 9008 6352 13993 24042
19012 24042 23679 17847 28845 31836 18404 17767 24023 36211 42990 42517 38260 46350 55120 51520
18998 51520 62648 90210 111224 142396 182913 215624 230052 241037 234770 197105 167411 151453
18986 151453 118147 93269 101420 107155 116459 141291 177102 231242 284069 318178 326738 303557
18974 303557 274916 220434 155906 105778 73232 52951 44523 27430 12628 11372 20684 28054
18962 28054 20491 9096 5086 -7035 -2807 18757 31807 26591 30093 20533 27736 24706 9092
18949 9092 4745 15091 21671 16471 13039 11067 7165 6389 29561 36200 25266 21569 18980 29241
18935 29241 26225 34547 36167 21410 18366 32051 19484 13980 14768 12076 26193 41232 50559
18922E0559J0785M941j931q139o935n879p370r394j0369N577M58j1458R842P135
18908B7822P184o940o079J500O012R079l765n194m976M78k5003q855J559J1199
18894D021J4913q42o172M286P12O676J5845k1M826J7472L061P156j1528M716L664
18879F8785q054P534J0311J7521K6931N0902P7332J42898J15447J4446m4578l7640
18867D41835m3550q0737r6937o5704l1628j3375O324L2237L4740J6801k7424m9030
18855A23552l8208j2041r753q304n392r558k312n618L353r892j505R078N888J178
18841D0466o692m407Q700O574Q249J9693J053J1088K3728M2788N5794Q2296P9674
18828C69004L9504j2645m9655k8206O474K1459L1064M1043J04350J56120J35754
$$ plain form
18922 50559 61344 66285 64354 56215 49280 43401 36031 26637 16268 21845 22303 10845 20687 27822
18908 27822 35006 28066 21987 23487 29499 38578 34813 29619 24643 25121 118 -8737 -7178 4021
18894 4021 18934 18092 11920 16206 16918 23594 39439 39418 44244 61716 64777 71933 60405 65121 68785
18879 68785 60731 68265 78576 96097 123028 173930 251262 394160 509607 524053 479475 441835
18867 441835 398285 317548 220611 154907 123279 109904 116228 148465 183205 200006 172582 123552
18855 123552 85344 73303 63550 55246 49854 40296 37984 32366 35719 25827 24322 33400 39288 40466
18841 40466 33774 29367 38067 44641 52890 72583 73636 84724 108452 151240 207034 289330 369004
18828 369004 408508 395863 346208 318002 324476 345935 376999 418042 522392 678512 814266
18817H14266Q4368L2308p6306j93017j95132j31326n6556k8518q636Q751K4202
18806B74404L8027K5180J9422K7289L189l9760n4474j9980J8374J0023M744j0522
18794B95916q592L6203M4250n670o8231p3274n8324k2114k2063j6870m59j2787
18782H7985j1477L369j3654q076j028J0105K6257L3347K6895L2868N7066N3303
18770B96960m637m1545k9880L9036R0855M3726l3619p6624n8707k8335j6867J2193
18758A92556L1983K5982m884j8599j1668k492K1561M438j9153m1941l1711J8397
18746A64469K1864J9883k5488n1828m0892p478J0364J1146J3416M1320N6819N8575
18734B72170J2077n4407q5996n0749k8809j1663j3693n34M525r161m154N219j747
$$ plain form
18817 814266 898634 930942 854636 661619 466487 335161 278605 250087 241451 250202 274404
18806 274404 312431 337611 357033 384322 387511 347751 293277 273297 291671 301694 306438 295916
18794 295916 287324 323527 367777 362107 293876 220602 162278 140164 118101 101231 100772 87985
18782 87985 76508 79877 66223 58147 57119 67224 93481 126828 153723 186591 243657 296960
18770 296960 292323 250778 220898 259934 350789 394515 360896 284272 225565 197230 180363 192556
18758 192556 224539 250521 245637 227038 215370 212878 234439 238877 219724 177783 146072 164469
18746 164469 186333 206216 180728 128900 88008 80530 90894 102040 115456 156776 213595 272170
18734 272170 284247 229840 143844 93095 64286 52623 38930 38396 42921 33760 29606 34825 33078
18721C3078l537L97J0738p179k3039j3713L335P617O061k459o076o163n635k210
18707h785K0550J1488j957q842n025J0317L930q145P20J6978k784K189l052q022
18693A9560L270l808l81L539P837k800j8341k5210M795J4766R062n794q454j3509
18679a5468L218K2065N610l038m328M771J7552J2620o066r91l76m227j1331j1157
18665H854P77L924J0623J2851J0204k760J781M25J011p876J831O925q01J0859
18651E8628K6773K9404Q704j0222j7943k1184j5825m523l724l223q833M828J2928
18638E5788R227k5519j4302P467O515l592j0326j5405j1443q712L205m383l817
18625a5297O52R712K905L245J1509o027j863j132L708J2381J542j0427j748l134
$$ plain form
18721 33078 29541 29938 40676 33497 10458 -3255 80 7697 13758 11299 5223 -940 -6575 -8785
18707 -8785 11765 23253 21296 12454 7429 17746 21676 13531 14251 31229 28445 30634 27582 19560
18693 19560 22830 19022 18641 22180 30017 27217 8876 -16334 -11539 3227 12289 6495 -1959 -15468
18679 -15468 -12250 9815 15425 12387 8059 12830 30382 43002 36936 35945 35569 31342 20011 8854
18665 8854 9631 13555 24178 37029 47233 44473 46254 46679 47690 39814 41645 48570 47769 58628
18651 58628 85401 114805 123509 113287 95344 74160 58335 53812 50088 46865 38032 42860 55788
18638 55788 65015 39496 25194 32661 39176 35584 25258 9853 -1590 -10302 -7097 -11480 -15297
18625 -15297 -14645 -4933 -2028 1217 12726 6699 4836 3704 7412 19793 21335 10908 9160 6026
18611F026o551J6359O290K897P588j0298j1395l663P218j422M997J3808N707m322
18597C3239Q170J3325o845Q295R084p163p320o611j2398j813j3247O778P662L376
18583C4532o496M737L850j1570J1412Q221j4891l01M317m861k219J3086J507n233
18569C6091j119j0667m144o891k573Q159R579j944l510J3270K4109N102O008L773
18555G5243k067J0193K3525J6688P249j2607o521j615J0395R752l426J2260L6661
18542A75730M9022J02588J63025J74287O4632o2082p8461q4427j16854j11451
18532B76009o7103l1652m970O642Q526K6403L8946K3100m1221n4936l1797j7552
18520A30395j2071r270O514m146j7776L993R579K8042n027j8340K862J2755p720
$$ plain form
18611 6026 -525 15834 22124 25021 32609 22311 10916 7253 14471 13049 18046 31854 37561 33239
18597 33239 41409 54734 47889 56184 65268 58105 50785 44174 31776 29963 16716 23494 31156 34532
18583 34532 28036 32773 36623 25053 36465 44686 29795 29494 33811 28950 26731 39817 41324 36091
18569 36091 34972 24305 20161 13270 10697 18856 28435 26491 22981 36251 60360 65462 71470 75243
18555 75243 73176 83369 106894 123582 130831 118224 111703 110088 120483 130235 126809 139069 175730
18542 175730 224752 327340 490365 664652 729284 667202 588741 504314 387460 276009
18532 276009 208906 177254 172284 178926 187452 213855 252801 275901 234680 179744 147947 130395
18520 130395 118324 109054 115568 111422 93646 97639 107218 135260 130233 111893 114755 127510 119790
18507A19790j8927n711m459P711J0134N035L665J083K7727L8298M1464K2086q387
18494B39509l5492k7840j7792J5226J7806L5613P0214Q2719M8853L5262N2117
18483E16195L8231p1095j37444r7419n9211m3055p041K13P789j7476R144J6072
18471A54903J5721P693m835k4249o007m096P607N935n863j917R933L338j141j3792
18457A43230j3275N692J0855L648L434P750k624N75L897K4686K1564K7668L091
18444B40191j1259N587J4906K3220M2374K1358J7798L0690N4519Q5338J09693
18433F34415J30727J23794R4738M2826m453k2390k5108P432L3755N0326P8383
18422A144445J02696J55328K14660K54259L19115L39090L30100L69381M87457
$$ plain form
18507 119790 100863 95152 90693 98404 108538 113573 117238 118321 146048 184346 225810 247896 239509
18494 239509 204017 176177 158385 173611 191417 227030 297244 379963 428816 464078 516195
18483 516195 554426 483331 345887 248468 189257 146202 139161 139374 147163 129687 138831 154903
18471 154903 170624 178317 173482 149233 143226 139130 146737 152672 146809 144892 154825 158163 157022 143230
18457 143230 129955 135647 146502 150150 153584 161334 158710 159285 163182 187868 209432 237100 240191
18444 240191 228932 234519 249425 272645 315019 336377 354175 384865 439384 524722 634415
18433 634415 765142 888936 983674 1026500 1022047 999657 974549 981981 1015736 1066062 1144445
18422 1144445 1247141 1402469 1617129 1871388 2190503 2529593 2859693 3229074 3716531
18413C716531O78027J082356J790238K990484M849849P163520R089539R440508
18405D0801052O334098J272964l372485p890170r299969p684158n326191k875395
18397A1959746r25033P02669K509582M821140P328477R082495Q776744M796380
18389D9052200m26274n106377r276049r830263p910090n533651l375385j990763
18381E603348j216623p89708n32005l96627l32795k88976k48809k19395j98263
18372A380147j93013j67924j12428n0620j8474K6143M0208M0301M7087J6871k5742
18361I82556p0811j09946j05640q6139q2006o5576n2780m2226j0900P50j2918
18350C44364k767q90p594j7021k5658k4196k0997l081k880l717j1988m220m869
$$ plain form
18413 3716531 4394558 5476914 7267152 10257636 15107485 22271005 31360544 40801052
18405 40801052 47135150 48408114 45035629 37145459 27845490 20161332 14835141 11959746
18397 11959746 11034713 11737382 14246964 19068104 26396581 35479076 44255820 49052200
18389 49052200 48625926 43519549 34243500 24413237 16503147 10969496 7594111 5603348
18381 5603348 4386725 3597017 3065012 2668385 2335590 2046614 1797805 1578410 1380147
18372 1380147 1187134 1019210 906782 856162 837688 863831 904039 944340 991427 1008298 982556
18361 982556 911745 801799 696159 610020 528014 462438 409658 367432 356532 357282 344364
18350 344364 341597 340707 333113 316092 290434 266238 245241 242160 239280 235563 223575 219355 214486
18337B14486j486J0566m180n706j727p771j9012r876o804r11l953l390R223l477
18323A65982o281r881j6203K584q461j0339k7584j9354O259P414M365O57L061
18310I2219r834q925l153q499O91J726r118P239J1328j3736j792J2194p668j1114
18296E1558O397Q351K4366J3485j269P814L3392M4367O1791O7101O6206K1093
18284D04652j7773m5796n8000l0863k3039l89L498l099q850J0407K6173M7642
18272C04563M5769J2820o676m0081n9226m9077l8382j8378j9399j2451k193k8347
18260H8942j0021j5212j2594r053J0100o584j8746p862R78K621R335K001m017
18247B9888p851j0037N474N354r549r865j0173q61k407R823J2962j986J120k634
$$ plain form
18337 214486 213000 223566 219386 213680 211953 204182 185170 175294 168490 167579 163626 160236 169459 165982
18323 165982 159701 149820 133617 136201 127740 117401 89817 70463 76722 84136 88501 89158 92219
18310 92219 82385 73460 70307 61808 62499 64225 55107 62346 73674 59938 58146 70340 62672 51558
18296 51558 57955 66306 90672 104157 102888 110702 144094 188461 250252 317353 383559 404652
18284 404652 386879 341083 283083 252220 229181 228792 232290 229191 220341 230748 256921 304563
18272 304563 350332 363152 356476 316395 257169 208092 169710 151332 131933 119482 117289 88942
18260 88942 78921 63709 51115 42062 52162 45578 26832 18970 19948 22569 31904 33905 29888
18247 29888 22037 12000 17474 22828 13279 3414 -6759 -7620 -10027 -204 12758 10772 11892 9258
18233I258J9265K4490Q145j6141j3169m159L644r494l53R446P746O488J495q794
18219C7867k102l862l881j249l419l629j5800j0868J2374J8543J9314O715L068
18206E3071k954o822k726l877M379R456k687j5681j2236l471L014J0284m564Q71
18192B6057l589q299l654R129P887j1786j4667P768O754m262M760M719J0837J0444
18178D2098p675j1830p019R541J8248J0970j0350p495N616P401n81j9975j331
18165B7618L430l772O081J3534Q99j2599p562n343m67R659J6596L465r600k940
18151C8999j3467J3564J2157R769o307Q901M695J8617J0906q199r45J2283J4723
18138A15696K40J0803L0211L419j1883J1233n195J9344J6911L6013M9688K2653
$$ plain form
18233 9258 28523 53013 61158 45017 31848 27689 31333 21839 21486 30932 38678 45166 46661 37867
18219 37867 35765 31903 28022 26773 23354 19725 3925 -6943 5431 23974 43288 50003 53071
18206 53071 50117 43295 40569 36692 41071 50527 47840 32159 19923 16452 19466 29750 25186 26057
18192 26057 22468 14169 10515 19644 27531 15745 1078 8846 15600 11338 16098 20817 31654 42098
18178 42098 34423 22593 15574 25115 43363 54333 43983 36488 42104 49505 48924 28949 27618
18165 27618 31048 27276 33357 46891 47790 35191 27629 22286 21819 31478 48074 51539 41939 38999
18151 38999 25532 39096 51253 61022 54715 63616 68311 86928 97834 89635 88690 100973 115696
18138 115696 115936 126739 156950 160369 148486 159719 154524 173868 190779 226792 276480 299133
18126B99133J7581K7311K5369K0686M9748O9606P1635P2495J03167J52004K10001
18115A118736L01207M28038P04644J207314K148468M118609P801776J0336108
18107B8164900K801006r218541j0069222n178011k496321j294658p37327m89571
18099A482255l34670k30311j64161j49526j08449p6343n7847m5786m4439n1542
18089B19181l6483l0251k5305r030l092L204J2569l923j8544r859j0850K419j758
18076H8278j4625j6925r663Q039q24R667Q08o273m756J40K421N017j241j4649
18062D5414j18j0493j4403J13J1048J3472k747p016q397K601L92j7828l64N273
18048A6947k665o202L442J2968M561K02j3865j0427Q48N697m55j048J0213p863
$$ plain form
18126 299133 316714 344025 369394 390080 439828 509434 581069 653564 756731 908735 1118736
18115 1118736 1419943 1847981 2552625 3759939 5908407 10027016 17828792 28164900
18107 28164900 30965906 21747365 11678143 6500132 4003811 2709153 1971826 1482255
18099 1482255 1147585 917274 753113 603587 495138 418795 360948 315162 270723 219181
18089 219181 182698 152447 127142 118112 115020 118224 130793 126870 108326 98467 87617 90036 88278
18076 88278 73653 56728 47065 55104 54280 63947 64755 58482 53726 53866 56287 61304 60063 45414
18062 45414 45296 34803 20400 20513 31561 45033 42286 35270 26873 29474 29866 12038 11674 16947
18048 16947 14282 8080 11522 24490 29051 29253 15388 4961 5809 11506 11051 10003 20216 12353
18034A2353m178k73J371j8865j6857L492J7263J0305O814j1991j6818m096J6574
18021d906O323j4674p607P602J4131k586p096q717j1771J3771o630J0948J2528
18008A316r026l65K0808j332J407P636j856j816o166l334K465m047m906R07j0596
17993h905K724O320R020j3180M466J167q37L40q048J394R650K4606J0713j2189
17979B7241j4395j0867K397k053j170K774J588r363j110j0880N62J2882k73m731
17965g398l729P91r529p613J2806Q569m406M45O128R68Q618J0219m353j448J747
17950A1815J0545j0020p197J1917r929q552o340L5O367l775N310J002j8295q505
17936b5622P236N495J4123M783k459q180N108N334j1534J572K04K19o655P492
$$ plain form
18034 12353 8175 7902 9273 -9592 -26449 -22957 -5694 4611 11425 -566 -17384 -21480 -4906
18021 -4906 1417 -13257 -20864 -13262 869 -1717 -8813 -17530 -29301 -15530 -22160 -11212 1316
18008 1316 -7710 -8075 12733 11401 12808 20444 18588 16772 10606 7272 9737 5690 784 1691 -8905
17993 -8905 -6181 139 9159 -4021 445 1612 775 1115 -6933 -5539 4111 28717 39430 27241
17979 27241 12846 1979 4376 2323 1153 3927 5515 -3848 -4958 -15838 -15276 -2394 -2667 -7398
17965 -7398 -11127 -10336 -19865 -27478 -14672 -6103 -10509 -10064 -3936 -2968 5650 15869 11516 10068 11815
17950 11815 22360 12340 5143 17060 7131 -1421 -7761 -7726 -1359 -5134 176 1178 -17117 -25622
17936 -25622 -18386 -12891 1232 6015 3556 -4624 484 5818 -5716 -4144 -3940 -3721 -10376 -2884
17922b884k397r795J1864P995p527q027N144k690j0632j810q958J9563J4849Q901
17908A3596j0314j2551J1870J2435j0193o617m839l3N743q718O296k101j032m496
17894a0954K628J1526j7976m693J75R501J7544Q695n197l365j896P055K060m26
17880A4677j1043o922J660k290N263j0735n691M797K654k544R254m215L616J7605
17866A6086L05j7867j0222n028Q95R543P380r857j4776O269K0043k952r383j952
17852a1516l468R710J2560R488l548q401j2991j7994N080O251j0157R201J9175
17839C390l80l444q230k50j2464O84P81Q035K5214J5458L773j1648j0537L265
17825A3647J2886P024o153j7374K835J7289Q541L552J5555N578j880J9810L3477
$$ plain form
17922 -2884 -5281 -15076 -3212 4783 -2744 -10771 -5627 -8317 -18949 -20759 -29717 -10154 4695 13596
17908 13596 3282 -9269 2601 15036 4843 -1774 -6613 -6646 -903 -9621 -3325 -5426 -6458 -10954
17894 -10954 -8326 3200 -14776 -19469 -19294 -9793 7751 16446 11249 7884 5988 13043 15103 14677
17880 14677 3634 -3288 -1628 -3918 1345 -9390 -15081 -10284 -7630 -10174 -920 -5135 -1519 16086
17866 16086 16391 -1476 -11698 -16726 -15831 -6288 1092 -8765 -23541 -17272 2771 -181 -9564 -11516
17852 -11516 -14984 -5274 7286 16774 13226 4825 -8166 -26160 -21080 -14829 -24986 -15785 3390
17839 3390 3010 -434 -8664 -8914 -21378 -20694 -19913 -11878 13336 28794 32567 20919 10382 13647
17825 13647 26533 33557 27404 10030 12865 30154 38695 42247 57802 63380 61500 81310 114787
17812A14787K9652M7503M5063P690j1004m4630m4293k7549k2620k2261l713j92
17800F8433M328K3257L2597L4510L1761K1155j1446l4277l2756l1189l2246n244
17788F8883k4454j4259n466j822Q05l759o649n271o740j1445m277N883M319q07
17774e059O624k633l25N466O971O439j1424j5005j047J0867J0103L684p861N030
17760A1830k391k899k071p890l83K389j836J1603l713N97J261q978J942j0103
17746a0642J404Q97Q008O36M009j0779q379N774J0221L391J062J0114L074j0353
17732H437l004L214P411J3073r1j916j0150j2095q141J0084P827q102M42J96k508
17717D677K373m245J792K426l79M431Q563J7460N680j196J6489N6041P4425Q0230
$$ plain form
17812 114787 144439 191942 237005 244695 233691 189061 144768 117219 94599 72338 68625 68433
17800 68433 72761 96018 128615 163125 194886 216041 204595 170318 137562 106373 74127 68883
17788 68883 44429 30170 24704 22882 23687 19928 13279 8008 1268 -10177 -14454 -8571 -4252 -5059
17774 -5059 1565 -1068 -1393 4073 11044 17483 6059 -8946 -9993 874 10977 14661 6800 11830
17760 11830 9439 6540 4469 -3421 -3804 -1415 -3251 8352 4639 5236 6497 -2481 -539 -10642
17746 -10642 -9238 -8341 -333 303 4312 -6467 -14846 -9072 1149 4540 5602 15716 18790 8437
17732 8437 5433 8647 16058 29131 29040 27124 16974 4879 -3262 6822 14649 6547 6989 7185 4677
17717 4677 7050 2805 4597 7023 6644 11075 19638 37098 42778 41582 58071 114112 188537 268767
17703B68767O4184k7355q1489p9158n4127j9397j6378j5907r208K3062L2580K5388
17691A10962M4753M7500O5381L9857k9708p6621p3162m6828k7635j1606N68j2084
17679C1377K675m286j2950o782Q484J2726kq298j1709J342m63M296r335j2025
17665d950p474j528n186o752J932J8975J1359N0j971l916j3832k313L29J709L362
17650a0206J34K534L11o69o361j1012M609O507K681l916k612n622J883P178J9680
17635E119R958p833n863P33M634N630l319k80O0k940k541j3383j2243J64M201
17620a7903Q557Q913o0J5363L225O71o290k147q752j3941l63Q786Q39o564L459
17605f207l481L238m573r304o546m281l033P204K643K466P057J0094q406j244
$$ plain form
17703 268767 332951 305596 224107 144949 90822 71425 55047 39140 29932 52994 85574 110962
17691 110962 155715 203215 268596 308453 278745 202124 128962 82134 54499 42893 43461 31377
17679 31377 34052 29766 16816 10034 18518 31244 31242 22944 11235 12577 12114 16410 7075 -4950
17665 -4950 -12424 -13952 -19138 -25890 -23958 -4983 6376 6426 4455 539 -13293 -15606 -15277 -13568 -10206
17650 -10206 -10072 -7538 -7227 -7896 -14257 -25269 -20660 -14153 -11472 -15388 -18000 -23622 -21739 -14561 5119
17635 5119 15077 7244 1381 2114 6748 12378 9059 8779 8839 5899 3358 -10025 -22268 -22104 -17903
17620 -17903 -9346 -433 -493 14870 18095 18766 12476 10329 1577 -12364 -12727 -3941 -3102 -9666 -6207
17605 -6207 -9688 -6450 -11023 -20327 -26873 -31154 -34187 -26983 -24340 -21874 -14817 -4723 -13129 -14373
17591a4373N616R776J2465J443R494n451q693k617r592j9362M284M815o38L456
17577i377M127O936p622Q872o065Q34q951Q899J585k4300O677K504L603q68L331
17562i815P882N065N581q951j1421l893J1280M535N297q993l904O84P806J4908
17548A6061J0405q458j6038j9067L973L513M094k922L012J0955J5061m313j1741
17535D535k100r234l772N883r50M976l248r71L76R623L12n617l766l503J0908
17520C452l013r056j1003P099Q037J0743J057r868j0567J761Q234M936n155j2658
17506a6001M294J549J3672k963j3715r339M288K1820m342j0685k611j396R08P55
17492a3766R205n27R648k039j6005j2345K379J7556M213J0500J0860j7121j0774
$$ plain form
17591 -14373 -8757 1019 13484 14927 24421 18970 10277 7660 -1932 -21294 -17010 -12195 -12833 -9377
17577 -9377 -5250 1686 -5936 2936 -3129 -2295 -11246 -2347 -762 -25062 -18385 -15881 -12278 -13146 -9815
17562 -9815 -1933 3132 8713 -238 -11659 -15552 -4272 263 5560 -3433 -7337 -6653 1153 16061
17548 16061 26466 18008 1970 -17097 -13124 -9611 -5517 -8439 -5427 5528 20589 16276 4535
17535 4535 2435 -6799 -10571 -4688 -5638 -662 -3910 -4881 -4505 5118 5430 -187 -3953 -7456 3452
17520 3452 439 -8617 -19620 -12521 -4484 6259 7316 -2552 -13119 -11358 -3124 1812 -3343 -16001
17506 -16001 -11707 -10158 3514 551 -13164 -22503 -18215 3605 -737 -11422 -14033 -15429 -14521 -13766
17492 -13766 -4561 -5088 4560 2521 -13484 -25829 -23450 -5894 -1681 8819 19679 2558 -8216
17479h216J307k4L360o569J2710J9745J250o925n125q221o894K859j2311j1477
17465b4531J0437J3326O601n224l609p18q777j862J0769K127j4379n225p02Q552
17451a3215j423M320l904J4752O244M974J9578J0798K3138M8939M8526k1980n7155
17438H3592l4079k6145j3551j1904k347K5361J2750n228O33j814p686j9600j0613
17425a0631K928N478R821R394l973Q334J71m186j2748m655O613P295R590p608
17411A5823j6913M584K066N594m55j0505K790Q640L7J055J0563J7228K27l644
17397C7090r667m162O596p418q347J1812J1318n282j725J303K941J59J7255k974
17383D8899j1389k080P794K719k0533j2199R213l580m249q99P867J1049k25j4006
$$ plain form
17479 -8216 -6909 -6933 -3573 -10142 2568 22313 23563 16638 11513 3292 -3602 -743 -13054 -24531
17465 -24531 -14094 -768 5833 609 -3000 -3718 -12495 -14357 -3588 -1461 -15840 -21065 -21767 -13215
17451 -13215 -14638 -10318 -14222 530 6774 11748 31326 42124 65262 114201 162727 140747 83592
17438 83592 49513 23368 9817 -2087 -4434 20927 33677 28449 29082 27268 19582 -18 -10631
17425 -10631 -7703 -2225 7596 16990 13017 21351 21522 17336 4588 -67 6546 13841 23431 15823
17411 15823 -1090 3494 5560 11154 10699 194 2984 11624 11661 12716 23279 40507 40734 37090
17397 37090 27423 23261 29857 22439 14092 25904 37222 31940 30215 31518 34459 34618 51873 48899
17383 48899 37510 35430 43224 45943 25410 13211 22424 18844 14595 13696 21563 32612 32387 18381
17369A8381r537j0719J004M097m393K893N415J461J034K510l698r665l835J7192
17355A2140N891j2873k1150j509K342K1182J3052N186l853j010r745K902M102
17342A6657m390L466m822O841m483l804j4229j4180l429L071R688K296R362J1332
17328A3376j091k986L562K598J0847m704j6415j1494J986J2186l29l920J967O42
17314F225J8441K842K065M109p79k854j7458m195M143n079Q451P965J1976p120
17300B8732K726O531o900N985L169n68j799R0R76L019o451o102N742J0761o042
17285C9869p259N782J1187P418l285k185o172J455l860r363J3191K7295K0332
17272I4405l920j1119j0607M13J99o735J0345P697p315o601l317L196K6807J9846
$$ plain form
17369 18381 8844 -1875 -871 3226 -1167 1726 7141 8602 9636 12146 8448 -1217 -5052 12140
17355 12140 18031 5158 -15992 -17501 -15159 6023 19075 24261 20408 19398 9653 12555 16657
17342 16657 12267 15733 10911 17752 13269 9465 -4764 -18944 -22373 -19302 -9614 -7318 2044 13376
17328 13376 12285 9299 12861 15459 26306 21602 5187 -6307 -4321 7865 7536 3616 5583 6225
17314 6225 24666 27508 29573 33682 32903 30049 12591 8396 12539 7460 15911 23876 35852 28732
17300 28732 31458 37989 31089 37074 40243 39675 37876 37966 38942 41961 35510 29408 35150 45911 39869
17285 39869 32610 38392 49579 56997 53712 51527 45355 46810 42950 33587 46778 74073 94405
17272 94405 90485 79366 68759 69172 69371 62636 72981 80678 73363 66762 63445 66641 93448 113294
17258A13294j0300j6820q551R02j5747j5705M10J7736J1359O809j3166k130n824
17245F2267r53N19l212K911M24K110j0438k312N203R287L473L381n353j810L672
17230F9169r456o846L690K0365K4538n418p118O21J89J2844J6221o395p314j469
17216A03621Q789n002j5289K235J2852J3663J6537J366P45Q861j2804l058J687
17203A34203k387J149Q127J0790Q633P037m263J2273R003R927Q87R176O90M933
17189B10178J0860J7332J7530K2136K0972J7032J9311J8384K4839K4858L3002
17178D36434N7489P8343Q4729R6584J25133J02804M4946L5171O5425Q6862O8140
17167A282060P3928J27503J92012K67209K65179J90339K00265L06545M76708O32208
$$ plain form
17258 113294 102994 86174 77623 78525 62778 47073 47483 65219 76578 83387 70221 68091 62267
17245 62267 61314 61833 58621 61532 61956 64066 53628 51316 56519 65806 69279 72660 67307 65497 69169
17230 69169 59713 52867 56557 76922 101460 96042 88924 89545 89734 102578 118799 112404 105090 103621
17216 103621 112410 107408 92119 94354 107206 120869 137406 138772 139517 148378 135574 132516 134203
17203 134203 131816 132965 141092 151882 160515 167552 163289 175562 184565 194492 195379 204555 205245 210178
17189 210178 221038 238370 255900 278036 299008 316040 335351 353735 378574 403432 436434
17178 436434 493923 572266 656995 753579 878712 981516 1026462 1061633 1127058 1213920 1282060
17167 1282060 1355988 1483491 1675503 1942712 2207891 2398230 2598495 2905040 3381748 4013956
17157D013956Q08771J157925J846895L015848N036973Q739463J4481676J8441029
17149E7542536J0287224q889728j8953456j4703677q290522m334512k144580q69470
17141I643815O9244J158301K675850N041506R107734J4943124J7205126N955540
17133F5800240j2643017j8881742j3284019p477590m160067k467374j616497j087633
17125D182301p29086m98854l67526k59314k19612j99406j40675j20900j80589
17116A466339k01751j59686j24630j05957q0685k1105k471K3J3596J520m3764
17105G41429q9662q2253n7982m3503l9417m1249k5769p700j6764j5619o759k4215
17093B90537k0356j9928o973o624K629N014r079q650j3955K218K606k913k9255
$$ plain form
17157 4013956 4822727 5980652 7827547 10843395 15880368 24619831 39101507 57542536
17149 57542536 67829760 58940032 39986576 25282899 16992377 12657865 10513285 9643815
17141 9643815 9713059 10871360 13547210 18588716 27696450 42639574 59844700 65800240
17133 65800240 53157223 34275481 20991462 13513872 9353805 6886431 5269934 4182301
17125 4182301 3453215 2954361 2586835 2327521 2107909 1908503 1767828 1646928 1466339
17116 1466339 1264588 1104902 980272 874315 793630 772525 770054 770077 783673 785193 741429
17105 741429 651767 569514 511532 468029 428612 387363 361594 353894 337130 321511 314752 290537
17093 290537 270181 250253 243280 236656 239285 244299 235220 226570 212615 214833 217439 214526 185271
17080A85271l0735k290m236l610j3041K142j397o071K523p352j940l154K913O404
17066A25427j3879k4770r169j298p109o942J3601M243K501J0679K1343J7722P165
17053A39514j745l8919k6447o399l353q209j0493k094M534J3172J0766O2J0466
17040H0855J6031r35o576k4996k4855j8959n333m323J0538J5921j878P85l611
17027C2664J094N147Q990K6117K5122l22j4303j7719k7095o454K2935K5012J7971
17014I9159k68p392k4316k7039J2733M0780K4997p869l3879l6800j3120K1218
17002D8204J6108R571L763n160j0050k4561j4319L760L374j1554j3201j4741o440
16989a5246J1033J2155n432O547K61j6019P662o300n058K0815J3844R27O136M815
$$ plain form
17080 185271 154536 152246 148010 144400 131359 133501 132104 126033 128556 121204 119264 116110 119023 125427
17066 125427 111548 86778 77609 76311 69202 62260 75861 80104 82605 93284 114627 132349 139514
17053 139514 137769 98850 72403 66004 62651 54442 43949 41855 46389 59561 70327 70389 80855
17040 80855 96886 95951 89375 64379 39524 20565 15232 10909 21447 37368 35490 36275 32664
17027 32664 33758 38905 47895 74012 99134 98812 84509 66790 39695 33241 56176 81188 99159
17014 99159 98891 91499 67183 40144 52877 93657 118654 110785 76906 40106 26986 48204
17002 48204 64312 73883 77646 72486 62436 37875 23556 27316 30690 19136 5935 -8806 -15246
16989 -15246 -4213 7942 2510 9057 9318 -6701 961 -5339 -10397 10418 24262 25189 31325 36140
16975C6140J302k166P550n736j5091j0865j020J6L638J0295R90o674j2414m567
16961A398O990l479j7316j134J4985N455n782R801k774J4087J1651k503l534l653
16947B4192R457p457k548k010m470j0394o499j8866J6667J5880K361O735O848
16934B9896Q30Q007N461L635r93J799k660J5972K8930K8898K3634K6354O1630
16921B31393J08586J38477K5585j19070j31771p4369m9242l4416o666R846K2227
16910A20580J7329J6635M7175R0375J29031R4090m2670j45401j13777p4236n7861
16899H1270l5811p600l198q441k793J760Q09n246J130R237J1173m094j1087m193
16885B2916J43j3135r52Q113K436O960P429N024p628j8476M930p389j9167k240
$$ plain form
16975 36140 37442 35276 42826 37090 21999 11134 10114 10130 13768 24063 25053 18379 5965 1398
16961 1398 8388 4909 -12407 -13541 1444 6899 1117 10918 8144 22231 33882 31379 27845 24192
16947 24192 33649 26192 23644 21634 17164 6770 271 -18595 -1928 13952 16313 23048 29896
16934 29896 30726 38733 44194 47829 46836 48635 45975 61947 90877 119775 143409 169763 231393
16921 231393 339979 478456 504041 384971 253200 178831 129589 95173 88507 98353 120580
16910 120580 137909 154544 201719 292094 421125 515215 472545 327144 213367 139131 81270
16899 81270 45459 37859 34661 26220 23427 25187 25996 20750 21880 31117 42290 38196 27109 22916
16885 22916 23059 9924 8972 17085 19521 26481 33910 38934 31306 12830 17760 10371 -8796 -11036
16871a1036N17N719O442J1008l360j640j5470k932K395J7800j42j6911l364P198
16857c776k944M717n582j4035K873J2906P128j616j8215j1589J2293J1502J0268
16844C930J1584K70q947q809N74K915p129j0328o453L486J1444P659M725j0615
16830e694M923j966j034n973k656p07N355N449N054p335j365J608P80J0801m115
16815C125k4526m366M853J827J52M552N274q746k185j739m094j85M12M164R401
16800a2081J3513J3906R992r188m67J014q409j3534O031R159Q624l888M26j373
16786A3725j0197j504M416J2865m098Q72O289j674o345j8617N671P806l96j3412
16772d599k5644N516Q241L237J3870j93P70j2942o846R05P123O220j5673N741
$$ plain form
16871 -11036 -10519 -4800 1642 12650 9290 7650 -7820 -10752 -8357 9443 9301 -7610 -10974 -3776
16857 -3776 -6720 -2003 -7585 -21620 -18747 -5841 1287 -329 -18544 -30133 -17840 -6338 3930
16844 3930 15514 15784 6837 -1972 -1398 1517 -5612 -15940 -22393 -18907 -7463 196 4921 -5694
16830 -5694 -771 -2737 -3771 -9744 -12400 -13107 -7752 -2303 2751 -4584 -5949 -4341 -3561 7240 3125
16815 3125 -21401 -25767 -20914 -19087 -18935 -14383 -9109 -17855 -20040 -21779 -25873 -26058 -25646 -21482 -12081
16800 -12081 1432 15338 25330 16142 15675 16689 8280 -5254 777 9936 18560 14672 15098 13725
16786 13725 3528 2024 6440 19305 15207 16079 22368 20694 14349 -4268 1403 9209 8813 -4599
16772 -4599 -30243 -24727 -16486 -13249 621 428 1198 -11744 -18590 -17685 -10562 -4342 -20015 -14274
16758a4274J3090Q220K714p875J3085K398k1224k612m817L583M375R452l874N419
16744G660j2126j3979P42k478M608N822N674M796j3018K642j968M007J0166J24
16730B672j5840j0852O007M019n572p378P931J3564P877Q689j773k6445j3571
16717c0672o834K753K7061L477j4435J0147R676q293j134j97m888j4171l657Q237
16703b2930J6181L089J0999m74m495p297O889n584j2244L210n993j212J3894M601
16689a366m588k043m718J724Q095R389m310j0710j8598j9193J3055K4568R644
16676I49l268n986R41o685k717m607J2576N167L209P626o624j1326N884O188J21
16661A448L626o520j0384J075M04N304j266O783M697m244K122k041L645o213K930
$$ plain form
16758 -14274 -1184 7036 9750 1875 14960 17358 -3866 -6478 -11295 -7712 -3337 6115 2241 7660
16744 7660 -4466 -18445 -17703 -20181 -15573 -9751 -4077 719 -12299 -9657 -11625 -7618 2548 2672
16730 2672 -13168 -24020 -18013 -13994 -19566 -26944 -19013 -5449 2428 11117 9344 -17101 -30672
16717 -30672 -37506 -34753 -7692 -4215 -18650 -8503 1173 -7120 -8254 -8451 -13339 -27510 -31167 -22930
16703 -22930 -6749 -3660 7339 6865 2370 -4927 1962 -3622 -15866 -12656 -18649 -19861 -5967 -1366
16689 -1366 -5954 -7997 -12715 -10991 -2896 6493 2183 -8527 -27125 -46318 -33263 -8695 949
16676 949 -2319 -8305 -7364 -14049 -16766 -21373 -8797 -3630 -421 7205 581 -10745 -4861 1327 1448
16661 1448 5074 -1446 -11830 -10755 -10351 -5047 -6313 470 5167 923 3045 1004 4649 -1564 1366
16646A366o202p232N185J193n461J1395J7230m789p042r831k228M44r78j562o878
16631a5390K917J6334n511K890j675o951O355j1705r547J355J0034o235p163L64
16617b3928m751o552R424J806q83M692R072J0248J4053r698k2445L088N072N331
16603e471J6325J6056p850r072J06M388M075O087K0719J9742J7140L9387P1374
16590A93006Q0476O6425j6672q7853q8070o3838m6954k1070J1393N716J5732K6023
16578G4314K7557L5190O0476P9679N7767m3238r9141o7671m3523l3942k3387r304
16566A4777n727N489J6041N837k82m253k1036p15J0519p652r496o883K098j117
16552b400j1602J6908Q505j5160L43J6442K464m081l576m408n316O150n359J450
$$ plain form
16646 1366 -4836 -12068 -6883 -5690 -11151 244 17474 12685 5643 -4188 -6416 -5972 -6950 -8512 -15390
16631 -15390 -12473 3861 -1650 1240 -435 -7386 -1031 -12736 -22283 -20928 -10894 -17129 -24292 -23928
16617 -23928 -28679 -35231 -25807 -24001 -24884 -20192 -11120 -872 13181 3483 -18962 -15874 -10802 -5471
16603 -5471 10854 26910 19060 9988 10094 14482 18557 24644 45363 65105 82245 121632 193006
16590 193006 273482 339907 323235 235382 147312 83474 36520 15450 26843 32559 48291 74314
16578 74314 101871 137061 197537 277216 334983 291745 192604 124933 81410 47468 24081 14777
16566 14777 9050 14539 30580 36417 36135 31882 10846 10131 20650 12998 3502 -3381 -1283 -2400
16552 -2400 -14002 2906 11411 -3749 -3406 13036 15500 11419 7843 3435 -1881 4269 -1090 360
16538C60m068j3953j787j4842K400J3597L132Q048L502n397j362j082p657K615
16524a6494Q241N086j894j3711n736K866P495R539J3909K484r769n117m263K468
16510d896L798K023k195l465P749k01n149l228p017j04K861o907k605R888p846
16495a7294q570q08l093K1426K0494K703j7224Q65M10Q18M808o964j941o490n199
16480a6059j876J5823p341j0181J1899J1930m224n718J177O861M325j693q67J661
16466E717o238l733P245P531R70l46L966j1422r700m321p441J0610N866j930q426
16451a1652j1278M360J7694Q504j875j0225R87m163j0635M467N614o200m043M589
16437a3856J6532J9543n916k3281k389O066n194p653p578J0156J760k455N299
$$ plain form
16538 360 -3708 -17661 -19448 -34290 -31890 -18293 -15161 -7113 -3611 -9008 -10370 -11452 -19109 -16494
16524 -16494 -8253 -3167 -5061 -18772 -24508 -21642 -14147 -4608 9301 11785 2016 -3101 -7364 -4896
16510 -4896 -1098 925 -1270 -4735 3014 2813 -2336 -5564 -12581 -12685 -9824 -16731 -19336 -9448 -17294
16495 -17294 -25864 -26672 -29765 -8339 12155 14858 -2366 -1501 -1091 -273 4535 -2429 -4370 -10860 -16059
16480 -16059 -17935 -2112 -9453 -19634 -7735 4195 -29 -5747 -4570 2291 6616 4923 4056 5717
16466 5717 -521 -4254 2991 10522 11492 11146 15112 3690 -6010 -10331 -17772 -7162 -1296 -3226 -11652
16451 -11652 -22930 -18570 -876 7628 5753 -4472 -3485 -7648 -18283 -13816 -8202 -14402 -18445 -13856
16437 -13856 2676 22219 16303 -6978 -9367 -3301 -8495 -16148 -23726 -13570 -11810 -14265 -8966
16424h966k316R80L513N652j928M32R007P674j2551j1630r65l972N593K682j368
16409h163j1292m148J099N337O154n14N090q635m910L60j2208l367J8300j305
16395a8202k725o8J1414O366n412l683O458J296j22k719n20l692o468O998R351
16380a728N47o436n831j2352q813M8J0401P943J4818M229j5345n676P515K366
16366h314Q611M659m796p094M956Q530J357l712r444K316L806j3270q164L842
16352a6717R362J1182m629q22m874o202r452n480l143k511R062O808k4021m122
16338d5559J3173J4444p11L727O924J82j1746l632J4563N248L636J907m572k216
16324d632n302j4579o90O500P562K507L257N627J0460q073m318R859O901l741
$$ plain form
16424 -8966 -11282 -10302 -6789 -1137 -3065 -2633 6374 14048 1497 -10133 -11098 -15070 -9477 -6795 -8163
16409 -8163 -19455 -23603 -22504 -17167 -11013 -11527 -6437 -15072 -19982 -19622 -31830 -35197 -16897 -18202
16395 -18202 -20927 -20995 -9581 -3215 -8627 -12310 -5852 -4556 -4678 -7397 -7917 -11609 -18077 -11079 -1728
16380 -1728 -1181 -7617 -13448 -25800 -34613 -34565 -24164 -16221 -1403 2826 -12519 -18195 -10680 -8314
16366 -8314 297 4956 160 -6934 -1978 6552 7909 4197 -5247 -2931 875 -12395 -20559 -16717
16352 -16717 -7355 3827 -802 -1624 -6498 -12700 -22152 -27632 -30775 -33286 -24224 -17416 -41437 -45559
16338 -45559 -32386 -17942 -18653 -14926 -8002 -7820 -19566 -23198 -8635 -3387 249 2156 -2416 -4632
16324 -4632 -9934 -24513 -25203 -18703 -11141 -8634 -5377 250 10710 2637 -1681 8178 15079 11338
16310A1338j5039p455j5502j0630L180q9%O740k890r276J2035J0212q65J227R588
16295g426P634J1169J189M436N045M233j7321j70m554n033N189q569l090N12j899
16280h655L283K394o084j5164p757J3560K4353P78M268O836L13n759j0160r020
16266f814O657k484p644j7869k284J5354J856J2432J5826j2336j2031m692O293
16253g736n809R267N135j1455j4176j696Q079l088K728J113P723O163Q33O897
16239C978L682P146k340j6812j4083m894R956J1706n635j6685J3606J4352q102
16226d125p463M370q646j0847R02J852J0337J7677q028R72Q554o993j1027O42
16212a1823j988m000q79L984J4901O251r184j2562R740O562L595j0916k9170q868
$$ plain form
16310 11338 -3701 -11156 -26658 -37288 -34108 -34197 -34197 -27457 -30347 -39623 -27588 -17376 -18241 -17014 -7426
16295 -7426 208 11377 12566 17002 22047 26280 8959 8789 4235 -798 4391 -4178 -7268 -6756 -8655
16280 -8655 -5372 -2978 -9062 -24226 -31983 -18423 5930 6708 10976 17812 18125 12366 2206 -6814
16266 -6814 -157 -2641 -10285 -28154 -30438 -15084 -13228 -796 15030 2694 -9337 -14029 -7736
16253 -7736 -13545 -4278 857 -10598 -24774 -26470 -18391 -21479 -18751 -17638 -9915 -3752 -2919 3978
16239 3978 7660 14806 12466 -4346 -18429 -23323 -13367 -1661 -7296 -23981 -10375 3977 -4125
16226 -4125 -11588 -7218 -15864 -26711 -25809 -23957 -13620 4057 -3971 -2999 5555 -1438 -12465 -11823
16212 -11823 -13811 -17811 -18690 -14706 195 6446 -2738 -15300 -5560 1002 4597 -6319 -35489 -44357
16198d4357J6292J2482J7777q086j1247o625L803J8986q60j7077m022J2764l764
16185a3934O702Q695M223n699k504K657n677j0115j326J0395j881j5388n353J0908
16171a8297J581j0949J76O421J0666k0486j0896J5827K770J1353J1127P441m101
16158B633j3798q561M891O058M666o003o102J954m092N75L293o436J3814n788
16144a2896M089K00N243o747o263J1206J3286M323p510k957j19n678k710m802
16130a1335m627K157k691O808N168K647J812K123q21J6942m015m195n705j291
16116B977q199o265N73J0734J1489m052r267m450k04r874J860J1782n375l693
16102a1964K0046Q53j6012j2517K682L713J0674J0640j5015j0729K831J8346J75
$$ plain form
16198 -44357 -28065 -15583 2194 -5892 -17139 -23764 -19961 -975 -1835 -18912 -22934 -10170 -13934
16185 -13934 -7232 1463 5686 -13 -2517 140 -5537 -15652 -16978 -6583 -8464 -23852 -29205 -18297
16171 -18297 -16716 -27665 -27489 -21068 -10402 -30888 -41784 -25957 -23187 -11834 -707 6734 2633
16158 2633 -11165 -19726 -14835 -8777 -4111 -10114 -16216 -14262 -18354 -17779 -14486 -20922 -7108 -12896
16144 -12896 -8807 -8607 -3364 -10111 -16374 -5168 8118 12441 4931 1974 1855 -3823 -6533 -11335
16130 -11335 -15962 -13805 -16496 -9688 -4520 -1873 -61 2062 1241 18183 14168 9973 4268 2977
16116 2977 -5222 -11487 -10914 -180 11309 7257 -2010 -6460 -6664 -16538 -14678 -2896 -8271 -11964
16102 -11964 8082 8935 -7077 -19594 -16912 -13199 -2525 8115 -6900 -17629 -14798 3548 3723
16089C723j1162J2287r718j7891j2882J4130N660Q322r328o451J3867N842K955
16076f46J367q315j454K065J469J0015j2225r365m224O688m008p705J53L514k973
16061b5644M003J1298o665q187M191P553O187o191o579P582L189J3133R297o438
16047F729j2478K966L057m974L3n45J347P284K492J1925L060P661r197j8702l963
16032c305l925J0914J1022l735o027p497j196J627q253o952o508j0715j853J4127
16018b2276Q918R361K451j1741k068J4073J6355P538J935p97r034o886K352J0018
16004B0199l732j4594M41k832l78P22p358k018m35M871n556l374M253J6388M487
15989A1084K863m010M19K155j842m360l764j3357o079m080L447Q350K312j830
$$ plain form
16089 3723 -7439 4848 -4870 -22761 -35643 -21513 -15853 -7531 -16859 -23310 -9443 -3601 -646
16076 -646 721 -7594 -9048 -6983 -5514 4501 -7724 -17089 -21313 -14625 -18633 -26338 -26185 -22671 -25644
16061 -25644 -21641 -10343 -17008 -25195 -21004 -13451 -7264 -13455 -20034 -12452 -9263 3870 13167 6729
16047 6729 -5749 -2783 274 -4700 -4667 -5212 -3865 3419 5911 17836 20896 28557 19360 658 -3305
16032 -3305 -7230 3684 14706 10971 4944 -2553 -3749 -2122 -10375 -17327 -23835 -34550 -36403 -22276
16018 -22276 -13358 -3997 -1546 -13287 -15355 -1282 15073 22611 24546 23749 14715 7829 10181 20199
16004 20199 16467 1873 2314 -518 -896 -174 -7532 -9550 -9985 -5114 -10670 -14044 -9791 6597 11084
15989 11084 13947 9937 10356 12511 10669 6309 2545 -10812 -16891 -20971 -17524 -9174 -6862 -8692
15975h692M007j308N067o843m593J6529J982K19J104P192m706j4140q970r121
15961b2273j69Q257J4214M593j0466j3427j568r555M592l562R192P109o036J2602
15947f497n83J794J6872O156j5961M996Q029n746j6672j3500r793j5676O871J4643
15933b5067J9828N165N900K000n170o294q729Q758J8310J2878m126M219j0170
15920A7502j5352n390J2702L715M698k2M927r559j1833p904j8J3097J396r086
15906a127J658J607J504K818k59l010J4943q046j3065L886J219K785J257J478
15892G648K992p646j5032j9479J6634J2276Q383O133L268J781m353m532K846Q593
15878A9512q64m72m452J03l770L097R49j8665q125P180K992j710m657J910j146
$$ plain form
15975 -8692 -4685 -5993 -926 -7769 -12362 4167 6149 6368 7472 14664 9958 -4182 -13152 -22273
15961 -22273 -22442 -14185 29 4622 -5844 -19271 -20839 -30394 -25802 -29364 -20172 -13063 -19099 -6497
15947 -6497 -7080 -5286 11586 17742 1781 6777 14806 9060 -7612 -21112 -30905 -46581 -39710 -25067
15933 -25067 -5239 -74 5826 7826 2656 -3638 -12367 -3609 14701 27579 23453 27672 17502
15920 17502 2150 -3240 9462 13177 17875 17853 22780 13221 1388 -6516 -6534 6563 7959 -1127
15906 -1127 531 2138 3642 6460 6201 3191 18134 10088 -2977 909 2128 4913 6170 7648
15892 7648 10640 2994 -12038 -31517 -14883 -2607 5776 11909 15177 16958 12605 8073 10919 19512
15878 19512 18648 18176 13724 13827 10057 13154 14103 -4562 -12687 -5507 -2515 -4225 -8882 -6972 -8118
15863h118l774j1149o514N224K146p785J0020K2196J3822j702k77l073Nq610j4103
15848a1692Q605n057o152J0397N303P604P873q033o856q008O182q47n734n084
15834a1499m085j918M799J237J3558N059r219j2235N53J3098J594j0335L767l36
15820e962j1531p865m089R403P071O505J0410L88p670r109r345N361J593k124
15806a6964p150P538N511J19N76l106O639N807Q378N761k049m079j305n221K331
15791B786Q67r570q579L553O855O382k922p444n801N009p747R53K5378J6083n723
15776B0080p437j2132l628j967L162R960q283L395m21L073j2608J92n162J7426
15762E650M785q662k0021p432Q745J0982j1087p729k164k643K1341J1524L976
$$ plain form
15863 -8118 -11892 -23041 -29555 -24331 -22185 -29970 -19950 2246 16068 14366 14089 11016 11021 2411 -11692
15848 -11692 -3087 -8144 -14296 -3899 1404 9008 16881 8848 1992 -6016 166 -681 -6415 -11499
15834 -11499 -15584 -17502 -12703 -11466 2092 7151 -2068 -14303 -13750 -652 942 -9393 -5626 -5962
15820 -5962 -17493 -25358 -29447 -20044 -12973 -6468 3942 4330 -3340 -12449 -21794 -16433 -14840 -16964
15806 -16964 -24114 -16576 -11065 -10946 -10370 -13476 -6837 -1030 7348 13109 11060 6981 5676 455 2786
15791 2786 3653 -5917 -14496 -10943 -4088 2294 -628 -8072 -13873 -8864 -16611 -15658 9720 25803 20080
15776 20080 12643 511 -3117 -5084 -1922 8038 -245 3150 2729 5802 -6806 -6614 -11776 5650
15762 5650 10435 1773 -18248 -25680 -16935 -5953 -17040 -24769 -26933 -29576 -8235 3289 7265
15749G265r82j6380j0337p576k274O140P671N65k264J1901R691j6383M128J0492
15735A657J1908J0794j2621l708o367k123J865P493n126p81M76j8755J516L017
15721a0755N576J6863q42j0643q948L149l490m694n656j4093Q776J333n076j729
15707c0229J1365J6245L025l816k665N859k674L13j2456m264N840J0292q269k956
15693a4390K997j703J026m942m906m738j6753O279J5955J4735J0401o901o745
15680i685l361L285J0446N776J581o155j5296R684k128j533M300P545N39p216
15666b218J633k7N800j154J742k710p490J0422J0569p57k429J414o41m917l253
15651E984Q107P467m475j3854R543J2834j0684k40j6257j99J4070q427o163p150
$$ plain form
15749 7265 6283 -10097 -20434 -28010 -30284 -24144 -16473 -15908 -18172 -6271 3420 -12963 -8835 1657
15735 1657 13565 24359 11738 8030 1663 -460 1405 8898 3772 2991 3467 -15288 -13772 -10755
15721 -10755 -5179 11684 10842 199 -8749 -5600 -9090 -13784 -19440 -33533 -24757 -23424 -28500 -30229
15707 -30229 -18864 -2619 406 -3410 -6075 -216 -2890 -2577 -15033 -19297 -13457 -3165 -11434 -14390
15693 -14390 -11393 -13096 -12070 -17012 -21918 -26656 -43409 -37130 -21175 -6440 3961 -2940 -9685
15680 -9685 -13046 -9761 685 6461 8042 1887 -13409 -3725 -5853 -7386 -3086 4459 4998 -2218
15666 -2218 -585 -612 5188 4034 5776 3066 -4424 5998 16567 15810 13381 14795 14154 9237 5984
15651 5984 14091 21558 17083 3229 12772 25606 14922 14682 -1575 -1774 12296 3869 -2294 -9444
15637i444n142m091l455l161n133O48K130P154O862J6391k640Q21l636M443o218
15622d471L630j406q448M02k929k131L49J0342k900J0109N124j5731j0154L847
15608a4367O463l360J0940K179j433N197l068j093J5442l467r931j7408n095J7810
15594a191J6490m691M39j9879l935R162K161J636M88o988j7663O54l240k268J2093
15579a6732R463M235k670P192J0256n146r121N358L533q099j0215q6K215L585
15565f232L627k702q758M914j366r717n943M779O616j858J233J4426R930K1163
15551C0112m110l628k546o455r483k33o614q622n158K740J2616p985j1457k663
15537b3486P125J047J2273J3284n705q673L422J0412Q013J5922K796k3782j7070
$$ plain form
15637 -9444 -14586 -18677 -22132 -25293 -30426 -29778 -27648 -20494 -13632 2759 119 940 -2696 1747 -4471
15622 -4471 -841 -2247 -10695 -10293 -13222 -15353 -15004 -4662 -7562 2547 7671 -8060 -18214 -14367
15608 -14367 -7904 -11264 -324 1855 422 5619 2551 1458 16900 13433 3502 -13906 -19001 -1191
15594 -1191 15299 10608 11047 -8832 -12767 -3605 -1444 192 680 -6308 -23971 -23317 -26557 -28825 -16732
15579 -16732 -7269 -3034 -5704 1488 11744 6598 -2523 2835 6368 -1731 -11946 -12032 -9817 -6232
15565 -6232 -2605 -5307 -14065 -9151 -10517 -20234 -26177 -21398 -14782 -16640 -15407 -981 8949 30112
15551 30112 26002 22374 19828 13373 3890 3657 -2957 -11579 -16737 -13997 -1381 -9366 -20823 -23486
15537 -23486 -16361 -15314 -3041 10243 4538 -4135 -713 9699 17712 33634 36430 12648 -4422
15524d422j873K745l594L118k884j3067j588M843J143o81l664j6679o389L27J0486
15509c2179J3876P927p966l760K948R207O142L494o902L462R016P233r661p684
15495d847m620J2923J188j0113N141o787J739N757J788j2058o372J7307M653J202
15481F901r429r192J0915k849j5058j0808J3413J400M973J817J2552P88L137r906
15467a346N067j162L719l843j3289Q65J3264Q707j1662p138j0272n63l234M832
15453a6055M300J895K1759o576p889K47J6744P446l231m828j2779P20m826j1551
15439a4624J4651Q66q983n728L547J2248O696n741J1642J4602p94j3312M038j1672
15425G436j7989j33M596m379R951J0610j043o65J1636l427l231j1437q292o12
$$ plain form
15524 -4422 -6295 -3550 -7144 -4026 -6910 -19977 -21565 -16722 -15579 -16260 -19924 -36603 -42992 -42665 -32179
15509 -32179 -18303 -10376 -18342 -22102 -19154 -9947 -3805 -311 -7213 -3751 5265 12498 2837 -4847
15495 -4847 -9467 3456 4644 -5469 -328 -7115 -5376 381 2169 -9889 -16261 1046 5699 6901
15481 6901 -2528 -11720 -805 -3654 -18712 -29520 -16107 -14707 -9734 -7917 4635 5423 8560 -1346
15467 -1346 3721 2559 6278 2435 -10854 -9989 3275 11982 320 -6818 -17090 -17653 -20887 -16055
15453 -16055 -11755 -9860 11899 5323 -2566 -2319 14425 21871 18640 13812 1033 1753 -3073 -14624
15439 -14624 27 893 -8090 -13818 -10271 1977 8673 2932 14574 29176 28382 15070 19108 7436
15425 7436 -10553 -10686 -6090 -10469 -518 10092 9049 8384 20020 16593 13362 1925 -6367 -6979
15411f979O402n694l768J1758P403M06k4708j6375R98O762m7j4028K0610J8170
15397I10L131l874j4049P023K618L477n66J186n892Q186m126j5551P1Q287k12
15382i381l237n241O127J294o815P219Q279J458j6476p415p382J421J1711O506
15368a1932O395k740J1606K494K621o16p391k995O152o636o209j8572L529J6740
15354g554k580p237Q575m016k483k661N57R226R137R557N479r616j9183o112J5114
15339c797K49m130p069j128J1426k531J1529J1999J7659j2376j0922j2021j4078
15326a5190q811l761J3329k026l171J6930j6747r931q41k294N634J7870J962J4437
15312G390J4893N577j1117n160R233J2048nj7126j3438m956p411r238M267l837
$$ plain form
15411 -6979 -577 -6271 -10039 1719 9122 9528 -15180 -31555 -30557 -23795 -23842 -37870 -17260 910
15397 910 4041 167 -13882 -6859 -4241 -764 -1330 -144 -6036 2150 -1976 -17527 -17456 -9169 -9381
15382 -9381 -12618 -17859 -11732 -10438 -17253 -10034 -1755 -297 -16773 -24188 -31570 -30149 -18438 -11932
15368 -11932 -5537 -8277 3329 5823 8444 7828 437 -2558 3594 -3042 -9251 -27823 -24294 -7554
15354 -7554 -10134 -17371 -8796 -12812 -15295 -17956 -17399 -8173 964 10521 16000 6384 -12799 -18911 -3797
15339 -3797 -3548 -7678 -14747 -15875 -4449 -6980 4549 16548 34207 21831 10909 -1112 -15190
15326 -15190 -24001 -27762 -14433 -16459 -19630 -2700 -19447 -29378 -30219 -32513 -26879 -9009 -7047 7390
15312 7390 22283 27860 16743 11583 20816 32864 32859 15733 2295 -2661 -10072 -19310 -15043 -18880
15298a8880k631J2554L966k482N554k801m990n045k454k632m609j6606J0972J0670
15284a9414J2114N025k005m634j194q858L640R01j2881M900o814L269O873j0304
15270b9382J618J180K1277o606n213Q686L913k024R152Q887L267j2020j487L141
15256D389m169j2409M074l000k274P507j049M930L677n072k858L164j288M554
15242A76n193l728k907j88Q78L81r414k62O263j1844j825j926J4833J1443J6342
15227A3029L27l451k5120m947J8325l793n703R449J3689m057M226n779J925M777
15213A2897o260r572j6151M891J9322K497j326j4478L373J3247K822m981J762
15200H043M427l344n641M177j4078p715k455K490O912o507o158L641J0246j045
$$ plain form
15298 -18880 -21511 -8957 -4991 -7473 -1919 -4720 -9710 -14755 -17209 -19841 -24450 -41056 -30084 -19414
15284 -19414 -7300 -2275 -4280 -8914 -10108 -18966 -15326 -14425 -27306 -22406 -29220 -25951 -19078 -29382
15270 -29382 -27764 -26584 -5307 -11913 -17126 -8440 -4527 -6551 2601 11488 14755 2735 1248 4389
15256 4389 220 -12189 -8115 -11115 -13389 -5882 -6931 -2001 1676 -3396 -6254 -3090 -4378 176
15242 176 -5017 -8745 -11652 -11840 -10962 -10581 -19995 -20257 -13994 -25838 -27663 -29589 -14756 -3313 13029
15227 13029 13356 9905 -15215 -20162 -1837 -5630 -11333 -1884 11805 7748 11974 6195 8120 12897
15213 12897 6637 -2935 -19086 -14195 5127 7624 6298 -8180 -4807 8440 11262 6281 8043
15200 8043 12470 9126 3485 7662 -6416 -14131 -16586 -14096 -7184 -13691 -19849 -16208 -5962 -7007
15186g007K590K404j093q010O991N437J832j34j0791P189Q330o634j801N959k655
15171B607N865M955M447k407n351j150K139j4906j2173N023R50J104m399j0978
15157b4274R943l410J2584P823L868K549o706p406R57Q085m639n756K620J2348
15143H586J0128l706q546O027M59l356p117k680Q671M545o261n791P654r045J1995
15128A1563O465l975j4521J3836R135o770n24p999j2011p129J08J4160l328r027
15114a0017J2368K521J782j1370o994k012m008m132M267J718L832J0980N41o4
15100e88K683J4471J642j0372j8448K333P905K873j0323j67J1411k869N017O310
15086A1878R127m115j1434j4387o158l126K291M974k788k67K552M300m263K91
$$ plain form
15186 -7007 -4417 -2013 -3106 -11116 -4125 1312 3144 3010 -7781 -592 7738 1104 -697 5262 2607
15171 2607 8472 13427 17874 15467 10116 8966 11105 -3801 -15974 -10951 -10001 -8897 -13296 -24274
15157 -24274 -14331 -17741 -5157 2666 6534 9083 2377 -5029 -4072 4013 -626 -6382 -3762 8586
15143 8586 18714 15008 6462 12489 12948 9592 2475 -205 8466 13011 6750 959 8613 -432 11563
15128 11563 18028 14053 -468 13368 22503 15733 15209 7210 -4801 -11930 -11822 2338 -990 -10017
15114 -10017 2351 4872 6654 -4716 -11710 -13722 -17730 -21862 -17595 -15877 -12045 -1065 -524 -588
15100 -588 2095 16566 18208 7836 -10612 -8279 -374 2499 -7824 -7991 3420 551 5568 11878
15086 11878 21005 16890 5456 -8931 -15089 -18215 -15924 -10950 -13738 -14005 -11453 -7153 -11416 -11125
15072a1125J036j848p512J669J8201M607p271K422q103O387J0539j7501j1451
15059a9950o664J0885J5200q906j0843j0386R124L969j2532l805J8964L342j1491
15046b3093J1288j292j179l217l580k887k968J0966J6558Q480J353o315M253N298
15032A3665Q079j8359j3265K67O507j3947j264J3654j0115l281K481j839l880
15019b1297O599R57L782M216J1066l047j5010o432L025k300J354J5319J1817R3
15005A0142q864o812Q930k685N952k225k486q633N852k236J571p561q331o149
14991b3535o352L003J3004R815J954n466n570o319q66N722j431j5732k734J8400
14977a6107P915N037o151P951P167P742N583p607Q86J6442K819j4680j8788p076
$$ plain form
15072 -11125 -10089 -11937 -19449 -17780 421 5028 -2243 179 -7924 -1537 9002 -8499 -19950
15059 -19950 -26614 -15729 -529 -9435 -20278 -30664 -21540 -17571 -30103 -33908 -14944 -11602 -23093
15046 -23093 -11805 -13097 -14276 -17493 -21073 -23960 -26928 -15962 596 9076 10429 4114 8367 13665
15032 13665 21744 3385 -9880 -9613 -3106 -17053 -18317 -4663 -14778 -18059 -15578 -17417 -21297
15019 -21297 -14698 -13741 -9959 -5743 5323 2276 -12734 -19166 -16141 -18441 -17087 -1768 10049 10142
15005 10142 1278 -5534 3396 711 6663 4438 1952 -6681 -829 -3065 -1494 -9055 -17386 -23535
14991 -23535 -29887 -26884 -13880 -4065 -2111 -7577 -13147 -19466 -20332 -14610 -16041 -31773 -34507 -16107
14977 -16107 -8192 -3155 -9306 -1355 5812 13554 19137 11530 12416 28858 31677 16997 -1791 -8867
14963h867J2243J568j2407j4010k740k662M939J5060k415K588P026m925J2180
14950G578R626P276m598m304q999j4370n487L080J01N592Q374J810m9J2491N687
14935B3808j2883k1074n290M673J0068N942m341l507j669j2664R06J7008P163
14922H140p553J963J466j2837K073J1177K8497L699j1953l410L1K577m720j2254
14908F896p891j85J2431Lj1304k072k796o798O718K676J379j0424R234N566P07
14893D140q10L240j1145J195J1692r760j6688l960J5433r96J910O12M013J202
14879G8j2539o392J0650J9271K593q280j891J878J181J744L628j0476q106L310
14865c351j2337q761J5057P170L414Q384k699K664p09j5402o886L011m492p126
$$ plain form
14963 -8867 3376 4944 -7463 -21473 -24213 -26875 -21936 -6876 -9291 -6703 323 -4602 7578
14950 7578 17204 24480 19882 15578 6579 -7791 -13278 -10198 -10097 -4505 3869 5679 5630 18121 23808
14935 23808 10925 -10149 -15439 -10766 -698 5244 903 -2604 -4273 -16937 -16031 977 8140
14922 8140 587 2550 4016 -8821 -6748 4429 32926 36625 24672 21262 21293 23870 19150 6896
14908 6896 -995 -1180 11251 11254 -50 -2122 -4918 -11716 -4998 -2322 -943 -11367 -2133 3433 4140
14893 4140 3330 6570 -4575 -3380 8312 -1448 -18136 -22096 -6663 -7659 -5749 -5137 -1124 78
14879 78 -12461 -18853 -8203 11068 13661 5381 3490 5368 6549 8293 11921 1445 -6661 -3351
14865 -3351 -15688 -24449 -9392 -2222 1192 9576 6877 9541 8832 -6570 -13456 -10445 -14937 -22063
14851b2063k005R658O601o656J0307J308k451J2756q606j5664o514J9889N147
14838A707J0995J1341n588o197q913n492l906j8184R30O443J5869J2283J2122
14825B3410L800j7408r444M667n056J1481Q158k223j960J71k474j1920j4264l853
14811a6915l253k692j627O17Q241L236j611j4391J3817J3421j522R414p788j795
14797b848m701m830p714k566J2416Q486R830J0259M761Q820m261l0091L313J9950
14783B0824l131j1436N375k966r073J2101o93j1535j4438m040j9558R21J1543
14770b6106P939q04j947o77O64R435j673K450q206p566P728L154L993N077P897
14755A358o554J648J563m430n97n735O330m086q155J1514J896l764N975K719m996
$$ plain form
14851 -22063 -24068 -14410 -7809 -14465 -4158 -2850 -5301 7455 -1151 -16815 -23329 -3440 1707
14838 1707 12702 24043 18455 12258 3345 -2147 -6053 -24237 -23307 -16864 -995 11288 23410
14825 23410 27210 9802 358 5025 -31 11450 19608 17385 15425 15596 13122 1202 -13062 -16915
14811 -16915 -20168 -22860 -24487 -23870 -15629 -12393 -14004 -28395 -14578 -1157 -2679 6735 -1053 -2848
14797 -2848 -7549 -12379 -20093 -22659 -10243 -1757 8073 18332 23093 31913 27652 -2439 874 20824
14783 20824 17693 6257 11632 8666 -407 11694 11001 -534 -14972 -19012 -38570 -37649 -26106
14770 -26106 -18167 -18971 -20918 -21595 -20931 -11496 -13169 -10719 -18925 -26491 -18763 -15609 -11616 -6539 1358
14755 1358 -5196 -3548 -1985 -6415 -7012 -12747 -6417 -10503 -18658 -7144 -5248 -9012 -3037 -318 -5314
14740e314n26o731J2855R308J2148N730o123p157j7140M192Q753j0550l935o39
14726e129J4712Q016p762P30o804M25j647K073N432m822p405J3019K182J2072
14712B5092J3837m888k869R60m956r627j1886n153o479K774J950k9m123p066j032
14697a3495p450P132M909J6371O236p893l534O731P731m976j4033j2547p257J327
14683b0748J214J862L346J2415Q726N958L557l091j6496j2154m477n370J749M657
14669a8852J3566o701j2333m918J3073K770j952M021M430J6827O849n863p527
14656C390J139j128L867N01j3979p428K251O966m31o240O659O544o036L11n74
14641d188N063m089K270j294l426N915P896J080K136r007k095q82Q68O958P830
$$ plain form
14740 -5314 -5840 -12571 284 9592 21740 27470 21347 14190 -2950 1242 9995 -555 -4490 -5129
14726 -5129 9583 17599 9837 10567 3763 4188 2541 4614 10046 5224 -2181 10838 13020 25092
14712 25092 38929 34041 31172 32132 27176 17549 5663 510 -5969 -3195 -1245 -1274 -5397 -12463 -13495
14697 -13495 -20945 -13813 -8904 7467 13703 5810 2276 9007 16738 11762 -2271 -14818 -22075 -20748
14683 -20748 -19534 -17672 -14326 -1911 6815 12773 16330 13239 -3257 -15411 -19888 -25258 -23509 -18852
14669 -18852 -5286 -11987 -24320 -29238 -16165 -13395 -15347 -11326 -6896 9931 16780 10917 3390
14656 3390 4529 3401 7268 7769 -6210 -13638 -11387 -4421 -4852 -11092 -4433 2111 -3925 -3614 -4188
14641 -4188 875 -3214 -944 -2238 -5664 251 8147 9227 11363 2356 261 -621 247 7205 15035
14626A5035r047j3626N178N403j391k01p561P463K666L763m722M082r248j4717
14612a6923K141J2465q348r794M211j1556o436J2624J4156N818Q905k478j2052
14599g267j291J857l861M52Q88N903l11O14J2192J1397j1566L027K558j1769j1211
14584h388K594Q516J1978M794j4502m933j1209j0113L015J2478O767k25k92l628
14570c148j678j0172P211J0397l563r971M19m115P510p541j0772N125m109L381
14556b1026R296J6135P048n184o698o38K649M407M187J687M461j961m436j1213
14542a286l037r956N640J1276k553M78J6268l978K206j0216j56L385o672j5298
14528a3899k502J1541J1827l376n274o618j289l323k328Q188n247m093J9555R202
$$ plain form
14626 15035 5988 -7638 -2460 2943 1552 1351 -6210 1253 3919 7682 2960 7042 -2206 -16923
14612 -16923 -14782 -2317 -10665 -20459 -16248 -27804 -34240 -21616 -7460 -1642 7263 4785 -7267
14599 -7267 -8558 -6701 -10562 -10110 -9222 -3319 -3630 -3016 9176 20573 9007 12034 14592 2823 -8388
14584 -8388 -5794 2722 14700 19494 4992 59 -11150 -21263 -18248 -5770 997 772 480 -3148
14570 -3148 -4826 -14998 -7787 2610 -953 -10924 -10505 -14620 -7110 -14651 -25423 -20298 -24407 -21026
14556 -21026 -11730 4405 11453 6269 -429 -1067 1582 5989 10176 11863 16324 14363 9927 -1286
14542 -1286 -4323 -14279 -8639 2637 84 562 16830 12852 15058 4842 4686 8071 1399 -13899
14528 -13899 -16401 -4860 6967 3591 -1683 -8301 -9590 -12913 -15241 -7053 -12300 -16393 3162 12364
14514A2364M554n866k609j0803p41m011J344M729p19M857n093K569K958p056R12
14499b611j500l156J4586L870Q382M494j4066o532M434J385k154K472o686j99
14485B719J021l060L291M449L662J1830m326j1490L42O173m910q365o436r425
14471a4525O434Q333Q779N715Q420o840l02j4245l245P668k502J857L747O750
14457A6044j6315p968O107K730K524n643l821j23M128k234j350o49j679j1887
14443b0136l610Q30q644J1674P038O10M763J620l826k855J5186J8007j5246r470
14429d059P153M050j1115j22J3558P552j1143j0392j065J3778q78l448p94O17
14415C692n473K29l556l686k490n768q874o029n30M878O39J862J7442L089N267
$$ plain form
14514 12364 16918 11052 8443 -2360 -3101 -7112 -5768 -1039 -1758 3099 -1994 575 3533 -3523 -2611
14499 -2611 -4111 -7267 7319 11189 19571 24065 9999 3467 7901 9286 7132 9604 2918 2719
14485 2719 3740 680 3971 8420 12082 23912 19586 8096 8438 14611 9701 1336 -5100 -14525
14471 -14525 -8091 242 9021 14736 23156 16316 16014 1769 -1476 6192 3690 5547 9294 16044
14457 16044 -271 -8239 -2132 598 3122 -2521 -6342 -6465 -2337 -4571 -5921 -6570 -8249 -20136
14443 -20136 -23746 -22916 -31560 -19886 -12848 -12238 -7475 -5855 -9681 -12536 2650 20657 5411 -4059
14429 -4059 3094 7144 -3971 -4093 9465 17017 5874 -4518 -5583 8195 7317 3869 3075 3692
14415 3692 -1781 -1552 -5108 -8794 -11284 -17052 -25926 -31955 -32485 -27607 -26968 -25106 -7664 -4575 692
14400F92Q854N277j099O86k31N940q178n394L962J366K153Q608J262k344j9327
14385B227r831K836j195K453K218k63j516J1167P245r248j452j615K517l511p068
14370e036k088n253j850K167o250M615J0000J824n136n90K408m441j133J0014
14356g49o052P337L220Q103o642j0726L073R384K643j2125r513j782p060k808
14342b3697k536N842N383L139N367M946R023j08Q051K290p813j4078m819o839
14328a5849k716n155J0620J4218p086j007L643J932l639o277O59N042M361j4500
14314a5754J2018J3507J0518J525M149L642o854n509Q59m382j9217R560N465K779
14300A2306P188q628p38R052q707l691j2571n061L786M262J705n150K061r35N263
$$ plain form
14400 692 9546 14823 13724 14410 14179 20119 11941 6547 10509 11875 14028 22636 23898 21554 2227
14385 2227 -7604 -4768 -5963 -3510 -1292 -1555 -3071 8096 15341 6093 4641 3026 5543 2032 -5036
14370 -5036 -7124 -12377 -14227 -12060 -18310 -13695 -3695 -1871 -7007 -7597 -5189 -9630 -10763 -749
14356 -749 -6801 536 3756 11859 5217 -5509 -2436 6948 9591 -2534 -12047 -13829 -20889 -23697
14342 -23697 -26233 -20391 -15008 -11869 -6502 -1556 7467 7359 15410 17700 9887 -4191 -9010 -15849
14328 -15849 -18565 -23720 -13100 1118 -5968 -6975 -3332 -1400 -5039 -11316 -10657 -5615 -1254 -15754
14314 -15754 -3736 9771 20289 21814 25963 29605 22751 17242 18101 13719 -5498 4062 9527 12306
14300 12306 19494 10866 10128 19180 10473 6782 -5789 -10850 -7064 -2802 -1097 -6247 -4186 -5121 142
14285A42N925q711l893j265j329m046P234J6898P959M73j0110m955P907j30Q273
14270B0372Q861j0766j3526Q83P530k192r362j9296R40J6729P246q737j2211j3327
14256b6856J660J2895J4905q748K701p654j4123j0197K113K1105N658q559k715
14243a7815L402M089r715l901P808J0795L027r50p793M720j341k778o714K484
14229a4682J5651j22q257j973J500j214n275o780P584j832J0053J0239M165O273
14215A5330P479k805J952k014q031K992j0410m771P386k066J131j2115p588N205
14201h325K380o207K20O134N674j5064p600k326k579P422O961M581J3664Q835
14187A3770j5657k900N05j946J0630J9026M66n60j0530N242q544j4663N975N088
$$ plain form
14285 142 6067 -2644 -6537 -7802 -9131 -13177 -5943 10955 18914 19387 9277 4322 12229 12099 20372
14270 20372 29233 18467 4941 5824 13354 11162 1800 -17496 -16556 173 7419 -1318 -13529 -26856
14256 -26856 -25196 -12301 2604 -6144 -3443 -11097 -25220 -35417 -33304 -12199 -6541 -15100 -17815
14243 -17815 -14413 -10324 -20039 -23940 -16132 -5337 -2310 -3260 -11053 -6333 -7674 -10452 -17166 -14682
14229 -14682 969 847 -7410 -9383 -7883 -9097 -14372 -21152 -13568 -15400 -5347 4892 9057 15330
14215 15330 22809 20004 21956 19942 11911 14903 4493 -278 7108 5042 6173 -5942 -13530 -8325
14201 -8325 -5945 -12152 -11932 -5798 -124 -15188 -22788 -25114 -27693 -20271 -13310 -8729 4935 13770
14187 13770 -1887 -4787 -4282 -6228 4402 23428 23894 23334 12804 18046 9502 -5161 814 5902
14173E902Q149M459p330q814L974o582j7550r667m027j0758J977J6165J2782N189
14159f131l088j7912P556L923O159J0285n79j6274J4993J7977p024j461Q128o554
14145I998p545J498j0060l483J786m619P840J2279p793m984n10p33J1925o074
14131d75k2135O29R505n383L727K3149J0370O355k2483k356k66l754L696p251
14117f672k665R873K559M630n294k3597k241J5631J2295n71K085r795o12J4035
14103I661Q534j4125p541N282j3847L733R611j485M27k588O938j9r01k467L953
14088E166N680l90p859j754J4803j0728j2758K23N787O443j2136Q35O932n944
14074e700R875P513j4671q836N845J1361p178m398J0757J1979q026p751P829l842
$$ plain form
14173 5902 14051 18510 11180 2366 6340 -242 -17792 -27459 -31486 -42244 -40267 -24102 -11320 -6131
14159 -6131 -9219 -27131 -19575 -15652 -9493 792 213 -16061 -1068 16909 9885 8424 16552 9998
14145 9998 2453 3951 -6109 -9592 -7806 -12425 -4585 7694 -99 -5083 -5593 -6326 5599 -475
14131 -475 -22610 -21981 -12476 -17859 -14132 9017 19387 25742 3259 903 637 -3117 579 -6672
14117 -6672 -9337 536 3095 7725 2431 -21166 -23407 -7776 4519 3948 6033 -3762 -4374 9661
14103 9661 18195 4070 -3471 1811 -12036 -8303 1308 -177 250 -2338 4600 4581 3680 1213 5166
14088 5166 10846 10456 2597 843 15646 4918 -7840 -7617 -1830 4613 -7523 -6688 244 -5700
14074 -5700 4175 11688 -2983 -11819 -5974 5387 -1791 -6189 4568 16547 8521 770 8599 4757
14060D757p955L51R183L231j0604n189l624l475K937O532m266m615M659l026j876
14045a2980o644q371O161K0776J0649n475L278p520j643N941l367J355m804j7040
14031a9684k948J413R069N148J4367J35n515k043L633O031M646k707M427O87j6552
14016A07m796o71P350J0109q017J0005k820j0141r09m886R632J7855j0486r956
14002B376k163M744m433K000r212j712j200p370J4212N885M142m067r92L801q905
13987b894p566p45O76M185m603j0784J6990R081j1113M17Q931J3028J5j5397o25
13972d04L390j2869j8130R12J1632M935m676N657Q267O615N296M410L130m994
13958A3171r763j7956q646N877N873k461p038J0849K2079M197j3589m672M835
$$ plain form
14060 4757 -3198 -2847 6336 9567 -1037 -6226 -9850 -13325 -10388 -3856 -8122 -12737 -8078 -11104 -12980
14045 -12980 -19624 -27995 -21834 -1058 9591 4116 7394 -126 -1769 4172 805 2160 -2644 -19684
14031 -19684 -22632 -21219 -12150 -7002 7365 7500 1985 -58 3575 9606 14252 11545 15972 16659 107
14016 107 -4689 -5360 1990 12099 4082 14087 11267 1126 217 -4669 4963 22818 12332 2376
14002 2376 213 4957 524 2524 -6688 -8400 -9600 -16970 -2758 3127 7269 3202 2210 6011 -2894
13987 -2894 -10460 -11205 -10529 -6344 -10947 -21731 -4741 4340 -6773 -6356 2575 15603 15618 221 -404
13972 -404 2986 -9883 -28013 -27101 -15469 -10534 -15210 -9553 -1286 5329 10625 15035 18165 13171
13958 13171 3408 -14548 -23194 -17317 -11444 -13905 -20943 -10094 11985 16182 2593 -2079 2756
13945B756P59m805P507m175O872N923q93j6784n499O191p465O010M356L027P963
13930A1743J6156n342K455m119j0604k1870L962J8707o295j1213j5341L439P949
13917a0373J0441P226j3786r068Q664j959L53k735N240M983k021K661k084P19
13903a739o772m124P055J0665K733J7753N91j3075j4241l112O194m490j897L086
13889a373k319j522p01k910K219L21o275K478O495J3441L696j7477j1942J2101
13875c768Q811J1794R302l868j6056P777p355j1301R95m134l770M767M599M120
13861A913o356j301q663M599o057J046K884K051n461k780p594K120J3390j257
13847a1466j630M440P993Q028O19k615J898N279j251r446k090R266Q90J1985N810
$$ plain form
13945 2756 3515 -1290 6217 2042 8914 14837 13944 -2840 -8339 -2148 -9613 -3603 753 3780 11743
13930 11743 27899 22557 25012 20893 10289 -11581 -7619 11088 4793 -6420 -21761 -18322 -10373
13917 -10373 68 7294 -6492 -15560 -6896 -8855 -8502 -11237 -5997 -1014 -3035 -374 -2458 -1739
13903 -1739 -8511 -12635 -5580 5085 7818 25571 26162 13087 -1154 -4266 1928 -2562 -4459 -1373
13889 -1373 -3692 -5214 -5915 -8825 -6606 -6285 -12560 -10082 -3587 9854 13550 -3927 -15869 -3768
13875 -3768 5043 16837 26139 22271 6215 13992 6637 -4664 -3669 -7803 -11573 -6806 -2207 1913
13861 1913 -4443 -5744 -14407 -9808 -15865 -14819 -11935 -9884 -15345 -18125 -25719 -23599 -10209 -11466
13847 -11466 -13096 -8656 -663 7365 7984 5369 7267 12546 11295 1849 -241 9025 9915 21900 27710
13832B7710j2991r938K288j0884k751M761k420L250m781L791Q676k745q800n607
13818a0441J2726K31M754O823M945J812q015p080l692j4019m778K836L642J0339
13804H3L270j695J222K1176O108q691j2393j0865j1711M871K355M388N02O061
13790D681k631j8073j1752J6660l176N150J8983j5457R23j5939n062Q727O784
13777a0182j356J5061J4321q913j2013P760k615r832O695p34M984j2679m255J2424
13763a334J4521M12r906k457K310K733J0004K003K372k589m780J6141L01l206
13749B6525n382q221r927Q115j032j0137M180J1473K391m228p41l114N599N993
13735B1494j302j1459j0555n568J0157J2152n352N670O382J2062j679k0044R48
$$ plain form
13832 27710 14719 4781 7069 -3815 -6566 -1805 -4225 -975 -5756 -1965 6711 3966 -4834 -10441
13818 -10441 2285 2516 7270 14093 19038 20850 12835 5755 2063 -11956 -16734 -13898 -10256 83
13804 83 3353 1658 2880 24056 30164 21473 9080 -1785 -13496 -8625 -6270 -1882 -1380 4681
13790 4681 2050 -16023 -27775 -11115 -14291 -9141 9842 -5615 -4692 -20631 -25693 -16966 -10182
13777 -10182 -11538 3523 17844 8931 -3082 4678 2063 -7769 -1074 -1808 3176 -9503 -13758 -1334
13763 -1334 13187 13599 3693 1236 3546 6279 16283 18286 20658 18069 13289 29430 29731 26525
13749 26525 21143 12922 2995 11110 10078 -59 4121 15594 17985 13757 13016 9902 15501 21494
13735 21494 20192 8733 -1822 -7390 2767 14919 9567 15237 21619 33681 32002 11958 12906
13722A2906q389j9163J420L093J6106J4146K158p704J596o197r572N879l838p119
13708d678M815N813J2842N372q155o102J631M235n451R423R690k463k0419j6107
13694i554m681k256j0315P348J8710J242j1557O284J0341k070n2l49o354j351
13680d614O238K795j306R798j0120N010J7300M739k2409k6035m814J1392N701
13667f325m751M302J0173o16L927p404m065J1084k832M917O710O981L374M694
13653C0169o302j7234j5068p662O64J2076J1960q48k0334j2983j621J0033M217
13640a2933J6697O636o245r085j971K715M681J49Q045l623R169p033j2424m01
13626e623J891O892p791k95k150k950N146J531k0435j0083M075J9435R835q93
$$ plain form
13722 12906 4517 -14646 -13226 -10133 5973 20119 22277 14573 16169 9972 400 6279 2441 -4678
13708 -4678 137 5950 18792 24164 16009 9907 11538 15773 10322 19745 29435 26972 6553 -9554
13694 -9554 -14235 -16491 -26806 -19458 -748 494 -11063 -4779 5562 3492 3440 3091 -3263 -4614
13680 -4614 1624 4419 3113 12911 2791 7801 25101 29840 7431 -18604 -23418 -12026 -6325
13667 -6325 -11076 -6774 3399 2783 6710 -694 -4759 6325 3493 8410 15120 22101 25475 30169
13653 30169 23867 6633 -8435 -16097 -15433 -3357 8603 7755 -12579 -25562 -27183 -17150 -12933
13640 -12933 3764 10400 4155 -4930 -6901 -4186 495 644 8689 5066 14235 7202 -5222 -5623
13626 -5623 -3732 3160 -4631 -4926 -7076 -10026 -4880 -3349 -23784 -33867 -29792 -10357 -522 -1415
13612a415q862J2554J1494j6233j8188M24J5149O768J142J2027o215o482R230
13599A1393O183j849j200n092n573l309P161M712m351l066r713O866K3367l68
13585B5161j3548n505j6756p32N5j5242O975J0977K661J8889J561k2297n066J551
13571a1316q04Q292J2121M362o767J0095L56M440M732J48J0805l945j3986K405
13557B0938L794j5264m988P73n658N035J6260r417p723L429l061j363O305M763
13543A3823J1203J0218j1294j8641j1760M561J0369m018l192J0655R92M283j177
13530A6022j2891m601P014K684m528q28N615K0929k999j0488N77K057k2695o607
13516a0739L230P814P976o484j568J8029j2289r829p024p601P735P478J751n947
$$ plain form
13612 -1415 -10277 2277 13771 -2462 -20650 -20226 -5077 1691 2833 14860 8645 2163 11393
13599 11393 17576 15727 14527 9435 3862 553 7714 12426 8075 5009 -4704 2162 25529 25161
13585 25161 11613 6108 -10648 -11380 -11325 -26567 -19592 -8615 -5954 12935 14496 -7801 -12867 -11316
13571 -11316 -12120 -3828 8293 12655 5888 15983 16339 20779 25511 25659 36464 32519 18533 20938
13557 20938 24732 9468 4480 5253 -405 4630 20890 11473 3750 7179 4118 2755 9060 13823
13543 13823 25026 35244 23950 5309 -6451 -1890 8479 4461 1269 11924 12916 17199 16022
13530 16022 3131 -1470 5544 8228 3700 2872 8487 29416 26417 15929 16506 18563 -4132 -10739
13516 -10739 -7509 305 8281 1797 229 18258 5969 -3860 -10884 -18485 -10750 -3272 -1521 -7468
13502g468R42J3965q618j0780P698L123O10L325P210p73M985N601j961j8279J859
13487A439n665p423k171q27o693N64o465o584P821J0040J7684L362k317P491R303
13472A9559K21n702j0391m014N419J823k166p760Q292k215q280J1937J2569N41
13458A9833O890l298j7051K003r824n133L950J47j4486o202p600m388J4381J078
13444a9700p943j459M883J4459O154r44K113K808R433k738r18q30J2886J1371
13430B9575J719j1251n649K0783R204j8188r347k3927n944P118J0235J0070Q22
13417A5220j2226j076k011m111n0j2716q085Q782J565J7864J2762P189J8382J505
13403D2994j3775j6810P932Q658J1654j52p632j6015o146j186l118L224J1224
$$ plain form
13502 -7468 -6526 7439 -1179 -11959 -4261 -1138 -528 2797 10007 9234 14219 19820 17859 -420 1439
13487 1439 -4226 -11649 -13820 -14647 -21340 -20776 -27241 -33825 -26004 -15964 1720 5082 2765 10256 19559
13472 19559 19780 14078 3687 -327 5092 6915 4749 -3011 5281 3066 -5214 6723 19292 19833
13458 19833 26723 23425 6374 8377 -1447 -6580 -2630 -2483 -16969 -23171 -30771 -35159 -20778 -19700
13444 -19700 -27643 -29102 -24219 -9760 -3606 -4550 -2437 371 9804 7066 6148 5318 18204 29575
13430 29575 31294 20043 14394 35177 44381 26193 16846 -7081 -13025 -5907 4328 14398 15220
13417 15220 2994 1918 -93 -4204 -4254 -16970 -25055 -16273 -14708 3156 15918 23107 41489 42994
13403 42994 29219 12409 20341 28999 40653 40501 32869 16854 10708 9522 6404 9628 20852
13390B0852Q265r148q517P43O468K860J0474j654K586P888j304J2788K0453J2608
13376H5362j15N505J9420K8576K5048N9599Q7868J35385K34204L85328M45799
13365A511979K51624j6983k49727m39843l76187k34933j31657p8833m8471m6548
13355A40421l5074k5295k1686j7406k959J1473Ok598o122o576L705J1475L41m610
13341D5095r197k236j6169L014O806N688j878p651j1984j1035J2665k926J176
13328A1368m258M857J6655K370j9833k489J4868k648o60K0232M259o631j7354
13315B0736n297m330M668O360L776j1076J0610J3162j5814n424m46Q48O778J1536
13301C6087N530J615j5008r168q512j961J0783j854J134L09l554o868p020j2387
$$ plain form
13390 20852 29117 19969 11452 12195 18663 21523 31997 30343 32929 40817 39513 52301 72754 85362
13376 85362 85247 90752 110172 138748 163796 223395 311263 446648 680852 1066180 1511979
13365 1511979 1763603 1746620 1496893 1057050 680863 445930 314273 235440 186969 140421
13355 140421 105347 80052 58366 40960 38001 49474 49480 46882 40760 34184 37889 49364 49705 45095
13341 45095 35898 33662 17493 20507 27313 33001 31123 23472 11488 453 13118 10192 11368
13328 11368 7110 11967 28622 30992 11159 8670 23538 20890 20230 40462 44721 38090 20736
13315 20736 15439 11109 15777 22137 25913 14837 25447 38609 22795 17371 16925 17773 24551 36087
13301 36087 41617 43232 28224 19056 10544 8583 19366 17512 18646 18955 15401 8533 1513 -10874
13287a0874k332J3003J1463K2762J4602l863p394m640l311j2992O433K363L357
13274B8577O220p676m468p512j0699l731l748R589R077o050q141k578M580N704
13260I144o946m354J6827R426k172l51K654r100Q152j256m921L763n159R792K130
13245B7629J37L892k732M236Q2M619q206j9127j3327J1094J0093J323k1729r683
13231a1699o241J6669J0639M872K3305R886Q0m751Q045L578m668l602j3452J951
13217C4612O011L465J392P217J888J1844P64k385j52j9980k0174j0768J566k903
13203A2397L251K416J3308o068q171P193K7l108O475Q814j431J968N003j9159
13189B2915R6J6990J3591J2463Q709J7563J670K1844K3606L672P937J863j0270
$$ plain form
13287 -10874 -13206 -203 11260 34022 48624 44761 37367 32727 29416 16424 22857 25220 28577
13274 28577 34797 27121 22653 15141 4442 711 -3037 6552 15629 9579 1438 -1140 3440 9144
13260 9144 2198 -2156 14671 24097 21925 21574 24228 15128 23280 22024 17103 20866 15707 25499 27629
13245 27629 27766 31658 28926 33162 33244 37863 29657 10530 -2797 8297 18390 19713 -2016 -11699
13231 -11699 -17940 -1271 9368 14240 37545 47431 47511 42760 50805 54383 49715 46113 32661 34612
13217 34612 40623 44088 45480 52697 54585 66429 67193 64808 64656 44676 24502 13734 15300 12397
13203 12397 15648 18064 31372 25304 17133 24326 24353 21245 27720 36534 35103 37071 42074 22915
13189 22915 23011 40001 53592 66055 74764 92327 93997 115841 139447 143119 151056 152919 142649
13176A42649P971o512r238o916q648j2905j5340j5084k5264j3318j1646p313J939
13163B0375J0233J7702J3295J104o926j8397K122M751r556o316j3624j6072j3252
13150a4561R92Q39K852m207l477J2922J13M336J0045K103j45K4627J8242q85j9174
13135C4622j1208K125n803m15j2790p765L729J2729J5679J1529m070p661j5129
13122A5572J102J4081J9963J4715L038j2576n184j1565j5875P297j1429k8472
13110i333k3182O154j036l641J5184J5315J3723P667q451J2654k712m025J6859
13097C5176J8403J4907J3493L695j481J9843M036j3968j6324o9P69q759m484J027
13083F6264l29p927j0574n544J2457P091O594J8392L364m111N580L245K0470L286
$$ plain form
13176 142649 150620 144108 134870 127954 119306 106401 91061 75977 50713 37395 25749 18436 20375
13163 20375 30608 48310 61605 62709 55783 37386 39508 44259 34703 28387 14763 -1309 -14561
13150 -14561 -13569 -12730 -9878 -14085 -17562 -4640 -4527 -191 9854 11957 11812 36439 54681 53796 34622
13135 34622 23414 25539 19736 19321 6531 -1234 2495 15224 30903 42432 38362 30701 15572
13122 15572 16674 30755 50718 65433 68471 55895 50711 39146 23271 30568 19139 -9333
13110 -9333 -32515 -26361 -27397 -31038 -15854 -539 13184 20851 12400 25054 22342 18317 35176
13097 35176 53579 68486 81979 85674 84193 104036 108072 94104 77780 77711 78480 69721 65237 66264
13083 66264 65935 58008 47434 41890 54347 61438 68032 86424 89788 85677 91257 94502 114972 118258
13069A18258l934o254Q168P089j3684q832j0535m004P325J1564M951m283J7666
13056A23495L9419J7074J0653k5750j5286K9655P7941R4432M7125j5828m0217
13045C42713m7639l6836l0713j3980p524q278k039L259j510M715j0550j5758r656
13032A66204j6374O90p122j1425o725p755P531J8277J5536p44o534J463o786J1335
13018A57571O510k054L726N796L09N882J7031K3488J3687J894L376m373r448O61
13004B24056L0411J9961J8347J0499l639J70L548N60q982J9428J1547j3915m785
12991C07206R741J5738J6396J0927P55M481K4434M0226K6181N474r613k1765j0211
12978D19970K0637N097k410j0068o14J6637M4101M4291J4676K7493L1338M7156
$$ plain form
13069 118258 114324 108070 116238 123327 109643 100811 90276 86272 93597 105161 110112 105829 123495
13056 123495 162914 179988 190641 164891 149605 179260 257201 351633 398758 382930 342713
13045 342713 295074 258238 227525 213545 206021 197743 195704 198963 197453 202168 191618 175860 166204
13032 166204 149830 150520 143398 131973 125248 117493 125024 143301 158837 158093 151559 153022 146236 157571
13018 157571 164081 162027 165753 171549 171858 177740 194771 218259 231946 233840 237216 232843 223395 224056
13004 224056 254467 274428 292775 303274 299635 299805 303353 303913 294931 314359 325906 311991 307206
12991 307206 316947 332685 349081 360008 360763 365244 389678 429904 456085 461559 451946 430181 419970
12978 419970 440607 445704 443294 433226 432612 449249 493350 537641 552317 579810 611148 658304
12966F58304M3411L9015L9237N3432P8106Q2315R1102Q8119O3490O1081R5752
12955A393364J33450J75753K02249J81775J63998J60736K10449K79192L37924
12946C238890M09094M43710M52599M82868N23744N99287P27411Q88422J098224
12937H864249J377749J781340K468090L378632M414505N959054Q656503J3501119
12929E0401241K2815248M0146318O6743516Q5340394O2291070J0822175l9077734
12922B99482228q0214449q1308976n1458567k8180416j5976064r783907o661877
12915B5897972n037265l994798l211443k506430j907274j400059j125052r19182
12907E796469p43425o19022m83058l48600k58193j80467j17640j10005j23598
$$ plain form
12966 658304 701715 740730 779967 833399 911505 993820 1084922 1173041 1236531 1297612 1393364
12955 1393364 1526814 1702567 1904816 2086591 2250589 2411325 2621774 2900966 3238890
12946 3238890 3647984 4091694 4544293 5027161 5550905 6150192 6877603 7766025 8864249
12937 8864249 10241998 12023338 14491428 17870060 22284565 28243619 36900122 50401241
12929 50401241 73216489 113362807 180106323 265446717 327737787 338559962 299482228
12922 299482228 219267779 137958803 86500236 58319820 42343756 32559849 25897972
12915 25897972 20860707 16865909 13654466 11148036 9240762 7840703 6715651 5796469
12907 5796469 5053044 4434022 3950964 3602364 3344171 3163704 3046064 2936059 2812461
12898B812461j45756j58530j55089j40811j07077q6986j06339j04525j01700q1275
12888A624373o2650m5360k2611k2576k6443j5440J7547L7007r291m9853r7193
12877A327510j12014r1447o6388l4473k6206l2780j1310n916k0097j9209K1954
12866I29624R7613J77206L32809M99372N57179L18421l2956l55902n89378n33831
12856A400157l31252k03369j45208q6697o1669m3333l2312k7009l5886l9056k2313
12845C72053K786l054j1339k2243k1850j8477k3427k367q374o174o730R192o90
12832B59306M77j1269n06N196j8096j9439j3269k3891j0019l982J839J3993J0332
12819A90672K0301q083j1871k5112q041j3687k5465k0891P40J208J2593N891J586
$$ plain form
12898 2812461 2666705 2508175 2353086 2212275 2105198 2018212 1911873 1807348 1705648 1624373
12888 1624373 1561723 1516363 1493752 1471176 1444733 1429293 1446840 1483847 1474556 1424703 1327510
12877 1327510 1215496 1124049 1057661 1023188 996982 964202 952892 946976 926879 907670 929624
12866 929624 1027237 1204443 1537252 2036624 2593803 2912224 2879268 2523366 1933988 1400157
12856 1400157 1068905 865536 720328 633631 571962 528629 496317 469308 433422 394366 372053
12845 372053 374839 371785 360446 338203 316353 297876 274449 272082 263708 257534 250804 259996 259306
12832 259306 259783 248514 248008 253204 235108 215669 202400 178509 168490 164508 166347 180340 190672
12819 190672 210973 202890 191019 165907 157866 144179 118714 97823 98563 99771 112364 118255 119841
12806A19841j0266R446J0561J5289J8242O7015J28188J18564R2906l898j03009
12795D62879r4733o5838n6123k9687k2541k5188k5989j4673O453K019j5881l146
12783A17552j3131j2157P666O632k553j2929j3786n044o225L498J4068j18m303
12770G9170J2861O852M41o863r374J285j620m978o634n783j3230L298j626J5673
12756F9472J020n183j809q69O908Q267R477J0942p883j7951P80R666Q097J0615
12742A01549J8717J6898J4432j777j7736k6813l2560k6226J134J8055K2163K288
12730I0124k0638N008J7791J0265J01k1873j9440Q650R46J5806Q688J759R498
12717A06685L871k1095r135j4799j5756L962J1162L156K0882R585r282J35R24
$$ plain form
12806 119841 109575 119021 129582 144871 163113 230128 358316 476880 569786 565888 462879
12795 462879 368146 302308 246185 216498 193957 168769 142780 128107 134560 136579 120698 117552
12783 117552 104421 92264 99930 106562 104009 91080 77294 72250 66025 69523 83591 83473 79170
12770 79170 92031 98883 99324 92461 83087 84372 82752 77774 71140 65357 52127 55425 53799 69472
12756 69472 70492 65309 63500 62631 69539 77806 87283 98225 90342 72391 73171 82837 90934 101549
12742 101549 120266 137164 151596 149819 132083 105270 72710 46484 47618 65673 87836 90124
12730 90124 69486 74494 92285 102550 102651 80778 61338 69988 70934 86740 95428 97187 106685
12717 106685 110556 89461 80326 65527 49771 53733 64895 68051 88933 98518 89236 89371 90295
12704I0295l910l965n170J1458R49K803j2591j0360J0901o2j4508k0513k1891
12691B3436q020P92J181J0106O47L772N925m625K263J73J7237N262n235R239Q202
12676G0355L375j046P209M785j6835k329J1122L327j5431J784Q930k483n511O970
12662G4222K26n24j0126j1405K005k6858j3912J5760Q893P714L080p944n477L311
12648C8965k332j2705n552J3390l691K080O546Q50q97o513j4193Q56N321P080
12634B9205J2168o861o707M473K696j1377K164q238P013M222p87j6224m794q50
12620F103J3411K3058J926N679K105j8017j6683m226j248m94L930N053K12o835
12606A3974P356K894L564m132n146K077N979O254K183n708L679j0712j3025n357
$$ plain form
12704 90295 86385 82420 77250 88708 89657 92460 79869 69509 80410 80348 65840 45327 23436
12691 23436 15416 16208 17389 27495 28142 31914 37839 33214 35477 35650 52887 58149 52914 62153 70355
12676 70355 73730 72684 79893 84678 67843 65514 76636 79963 64532 66316 75246 72763 67252 74222
12662 74222 74448 73924 63798 52393 54398 27540 13628 29388 38281 45995 49075 41131 35654 38965
12648 38965 36633 23928 18376 31766 28075 30155 36701 37551 36654 30141 15948 16804 22125 29205
12634 29205 41373 34512 27805 32278 34974 23597 25761 17523 24536 28758 27971 11747 6953 6103
12620 6103 19514 42572 44498 50177 52282 34265 17582 13356 12108 11614 15544 20597 20809 13974
12606 13974 21330 24224 27788 23656 18510 20587 26566 32820 35003 29295 32974 22262 9237 3880
12592C880m015n450J273J5314J5214N63k55j862m34M477J436o162j4229N697k447
12577A3000m202O513j2772M348P888J583O743n282m387n719J1114j2966j729M617
12563H749J8956Q083m803O36n993L732q599l552Q311Q71J531j043j6177p939j2281
12548i518p123m98J4202J8324J2880P801J272k65k7408k0914J0268M429K090J340
12534F880M707J4304K856j8946p036K201m797O4L371n058R836K135R770j809j1061
12519G417q421P058P15J7462l893k960l88o034l246J2490Q052n794l220j147l122
12504A4969J518m185J3277P438J586J219j3350k134J5809N417l625L554Q445M750
12490E4688L083L798R812L1118K9191L8017L8147P0089J20242K13417L25705M30630
$$ plain form
12592 3880 -135 -5585 -4312 11002 26216 26779 26524 24662 24228 28705 30141 23979 9750 15447 13000
12577 13000 8798 15311 2539 6887 14775 16358 23101 17819 13432 7713 18827 5861 4132 8749
12563 8749 27705 35788 30985 31621 25628 29360 20761 17209 25520 26391 27922 26879 10702 2763 -9518
12548 -9518 -16641 -17139 -2937 15387 28267 36068 37340 37075 9667 -11247 -979 3450 5540 6880
12534 6880 11587 25891 28747 9801 2765 4966 169 233 3604 -1454 8382 10517 20287 18478 7417
12519 7417 -1004 6054 6769 24231 20338 17378 16990 10956 7710 20200 28252 22458 19238 18091 14969
12504 14969 16487 12302 25579 33017 34603 35822 22472 20338 36147 41564 37939 41493 49938 54688
12490 54688 57771 61569 71381 102499 131690 169707 207854 277943 398185 611602 937307 1367937
12478A367937L43699O6770j89146l97273m17343k76716j44917q1171p1619m4024
12468A56197k9416j7510k2605j7995j5300o192K147q180l532l595j0066k625L81
12455B1709q68j984k013J966J0371j760k536O162L26K858o48J629q237k583j7023
12440G369l477J0939r84M137J602l273j0245J950J3768J7158P709o098n181L047
12426C8421l31q415j9569l291l5J75J1184o271K786L070K512J6022Q919j3769
12412C1408k0426P098O065q424o435j3815k713Q025J2788J4390n451j2423m258
12399E829J3589L709p115k610q165M103n324p1O205l355r8N034l844o208j1600
12384i921J6028P087j3493j5789K682l93J0673J7689J238P10j56j973M386k270
$$ plain form
12478 1367937 1711636 1778406 1589260 1191987 774644 497928 353011 271840 200221 156197
12468 156197 126781 109271 86666 68671 53371 47179 49326 41146 37614 34019 23953 21328 21709
12455 21709 20841 18857 16844 18810 29181 27421 24885 31047 31373 34231 33583 35212 26975 24392 7369
12440 7369 3892 14831 13847 17984 19586 16313 6068 8018 21786 38944 46653 40555 35374 38421
12426 38421 38090 29675 10106 6815 6780 6955 18139 11868 14654 17724 20236 36258 45177 31408
12412 31408 10982 18080 24145 15721 9286 -4529 -7242 783 13571 27961 22510 10087 5829
12399 5829 19418 23127 16012 13402 5237 9340 4016 3945 10150 6795 6697 11731 7887 1679 -9921
12384 -9921 6107 13194 -299 -16088 -13406 -13799 -3126 14563 15801 16511 16355 14382 18768 16498
12370A6498J306r61L326j1037j164l337j213P991L322K139j2565j1801l272J4661
12356C893L881p692r005J3162J3449r874r540J187J672J0791L503M699j4482k957
12342B687N92J2261J0667j3984j6264l630J1676J8741K279n140m401m957r001
12329A526o739J4359P757k950j8934m493M588J698o141n663O554J7116k3o157
12315B498o52K229p500K519Q669O953p296k169J0823M36j0316l375P152Q2k578
12300G475N669r9j437k751L080j7469q490O604R671Q01Q106o974r320p412K067
12285a0479j558p524Q337K327J1805M013R43j0335j2850q90K1219J8587o247o397
12271A0951q837l767n383l666K971j024j3890M455J2661P842M042M844N002j4017
$$ plain form
12370 16498 17804 16843 20169 9132 7968 4631 3418 11409 14731 16870 4305 -7496 -10768 3893
12356 3893 7774 82 -8923 4239 17688 7814 -1726 -539 1133 11924 15427 20126 5644 2687
12342 2687 3279 15540 26207 12223 -4041 -7671 4005 22746 25025 19885 15484 10527 1526
12329 1526 -5213 9146 16903 13953 -4981 -9474 -4886 -3188 -9329 -14992 -8438 8678 8655 2498
12315 2498 1846 4075 -3425 -906 7763 14716 7420 5251 16074 16510 6194 2819 9971 10053 7475
12300 7475 13144 13045 11608 8857 11937 -5532 -14022 -7418 2253 3054 11160 4186 -5134 -12546 -10479
12285 -10479 -12037 -19561 -11224 -8897 2908 6921 7864 -2471 -15321 -16211 5008 23595 17348 10951
12271 10951 2114 -1653 -7036 -10702 -7731 -8755 -22645 -18190 -5529 2313 6355 11199 16201 2184
12257B184k2884j5823L755J5506J3549p08q062j23J8766J17o654k771J034l790
12243e904O405J1404R494P88j362q505l270L473j434j866N974Q512K114j2595
12229A3228k5492k204R581J949P668n333o354P502Q697n906N675J1469M636o781
12215A8335j4557n322o559n115J7158J1242M006j2444k124J2889P655M256j2360
12202A7060k820M281n952j1055q083J69k762j2530N382J5826P052j302O080m283
12188G063p455o568l043q725J5483M714L123M22O328Q184j244q622m451J5874
12174B1083n237q750J033L730r09K315J5018M837P61j62m049O247p687j1280q799
12159H151P831R632J711k0592k322M886k275j391J201l122n900n846M970J4023
$$ plain form
12257 2184 -20700 -36523 -32768 -17262 -3713 -4421 -12483 -12606 6160 6277 -377 -3148 -2114 -5904
12243 -5904 501 11905 21399 22187 20825 12320 9050 12523 11089 9223 15197 23709 25823 13228
12229 13228 -12264 -14468 -4887 -2938 4730 -603 -6957 545 9242 3336 9011 20480 25116 18335
12215 18335 3778 -1544 -8103 -13218 3940 15182 19188 6744 4620 17509 25164 29420 17060
12202 17060 14240 18521 12569 1514 -6569 -6400 -9162 -21692 -16310 -484 6568 5266 11346 7063
12188 7063 -392 -6960 -10003 -18728 -3245 1469 4592 5014 11342 19526 18282 9660 5209 21083
12174 21083 15846 7096 8129 11859 10950 13265 28283 33120 33881 33719 29670 35917 28230 16950 8151
12159 8151 15982 25614 27325 6733 4411 9297 7022 5631 6832 3710 -2190 -8036 -3066 10957
12145A0957J3283k108r4o914j5408p553k144Q373K416j593J7249K025n343k312
12131A0834p066J407n862j94J3980p20L407L087q47j8425P520J4932r797r760
12117B496O832p040k810j0812J944J0234R478q98o90q422J0189Q700j3251j6476
12103a0526j038M549N578M171j3207m693P727M470J205P599L259M119m946m405
12089C862j2679j2545k465K791Q862O216J1323L934n596J0829l323j6481J242
12076d030J809J2795l099O737O323j1243J166J6039k869p091j1661q78J0771P273
12062B2042M801J389k1199j5166L686K678r026m41K1254O887K843N700J2175j0899
12048B6724j0401j2394p146p675n155J4527J214m083k104l31O111N24K512P772
$$ plain form
12145 10957 24240 22132 22038 15124 -284 -7837 -9981 -1608 808 -785 16464 18489 13146 10834
12131 10834 3768 5175 -687 -881 13099 12379 15786 18873 18026 -399 7121 22053 12256 2496
12117 2496 9328 2288 -522 -11334 -9390 844 10322 9424 8734 312 10501 19201 5950 -10526
12103 -10526 -11564 -7015 -1437 2734 -10473 -15166 -7439 -2969 -1764 5835 9094 13213 8267 3862
12089 3862 -8817 -21362 -23827 -21036 -12174 -5958 5365 9299 3703 14532 11209 -5272 -4030
12076 -4030 -2221 10574 7475 14212 20535 9292 10458 26497 23628 16537 4876 3998 14769 22042
12062 22042 26843 28232 7033 -8133 -4447 -1769 -10795 -11236 10018 16905 19748 25448 37623 26724
12048 26724 16323 3929 -3217 -10892 -16047 -1520 -306 -4389 -6493 -6824 -713 -189 2323 10095
12034A0095l920n62N40P895l421j0309N678k611Q732R546J6826L754o428p727
12020B8088j6839o798n511N846Q957Q112M495j1479l443J586m573M893N289l643
12006A4980O660m491m704j0032l058J640R012J177o021K182j581N101L220q214
11992E871J0314j6543k0428n416K465J499K158N792K1617J1571m344p841p021
11979c06r036K418J8446J726p240j8621r922J014J8551K718l009K517k009M80
11965b273L213q842K803R725J2425l264j0238m715P433K777j5852q153J9441O774
11951A1254P921Q535Q54j1233j4875n136j556O00R240j645j2668r536J855O157
11937a0233l640r86j8577j405K5239J7816K515j161l917k850r690N937J4769j2309
$$ plain form
12034 10095 6175 5613 6153 14048 10627 318 5996 3385 12117 21663 38489 42243 35815 28088
12020 28088 11249 4451 -1060 4786 13743 21855 26350 14871 11428 13014 8441 13334 18623 14980
12006 14980 21640 17149 12445 2413 -645 995 10007 11184 5163 7345 5764 10865 14085 5871
11992 5871 16185 -358 -20786 -26202 -23737 -22238 -20080 -14288 7329 18900 14556 6715 -306
11979 -306 -9342 -6924 11522 13248 6008 -12613 -22535 -21521 -2970 -252 -3261 -744 -2753 -2273
11965 -2273 940 -7902 -5099 4626 17051 13787 3549 -1166 6267 9044 -6808 -14961 4480 11254
11951 11254 19175 27710 28564 17331 2456 -2680 -4236 -3636 5604 3959 -8709 -18245 -16390 -10233
11937 -10233 -13873 -14859 -33436 -34841 -9602 8214 10729 9568 5651 2801 -6889 -952 13817 1508
11923A508K05k067K757j024q156K447J0366R501j82N482l423j0386l245Q788j1154
11908A417p885K629N110L547J3912K975j0997l613R950L706n326j1491r088l425
11894h579J635k57O450k121k87J1989L061J753q074k3624J174N239M139P718O952
11879G168K710j8267j0191N807J8536m157o503q508K572p703n476L295J559o230
11865b5388J4374O860R242K621q671R663j182J1192M29j0705j0021J802L426m595
11851i53l338K804j032m281M264J039M707q135j0059r412J223J3504J0541L97
11837A269p852l442J60J0668R338m092o630K264q690j1648R427M996K50J2530
11823H548k078j1013J431N254k82p106j5168L46m078m944J046P483J2869J173
$$ plain form
11923 1508 1713 -354 2403 1379 -6777 -4330 6036 15537 15355 20837 17414 7028 3783 12571 1417
11908 1417 -6468 -3839 1271 4818 18730 21705 10708 7095 17045 20751 15425 3934 -5154 -8579
11894 -8579 -6944 -7201 -751 -2872 -3159 8830 11891 13644 5570 -18054 -16880 -11641 -7502 216 7168
11879 7168 9878 -8389 -18580 -12773 5763 1606 -4897 -13405 -10833 -18536 -24012 -20717 -19158 -25388
11865 -25388 -11014 -4154 5088 7709 -962 8701 7519 18711 19140 8435 -1586 216 3642 -953
11851 -953 -4291 -1487 -2519 -6800 -2536 -1497 3210 -4925 -14984 -24396 -23173 -9669 872 1269
11837 1269 -6583 -10025 -9865 803 10141 6049 -581 1683 -7007 -18655 -9228 -4232 -3982 8548
11823 8548 6470 -4543 -3112 2142 1860 -5246 -20414 -20068 -24146 -29090 -28044 -20561 -7692 -6519
11809f519L992J0041L210j844n934j8850L885K3144p699n914m854p713j004K158
11795a3901P486P150K313j0973l44K276K790J0779J453j4486r264L627p9k659
11781a3832K150L00k222m079K918K510j2180j2425N932M454J1346R483L400J545
11767g00o803J977Q883j283r77j4819p905P354Q433l903P208R65q993K584L410
11752d569M446k424l69M587n832L344N951n09p046M809P73J0606o982k247L000
11737G538J089j9859q383R648J3760n170o869j1665J0058J2m68J0532M596K347
11723G166M08j2383p903L348J1524j592n881O43R170l672m940J4168Q086N9R129
11708B7330n498n329o028r452k918K311N014J690j097N20k311n233J1980N24k2053
$$ plain form
11809 -6519 -2527 7514 10724 8880 2946 -15904 -12019 11125 3426 -2488 -7342 -15055 -16059 -13901
11795 -13901 -6415 735 3048 -7925 -8269 -5993 -3203 7576 9029 -5457 -14721 -11094 -11173 -13832
11781 -13832 -11682 -11382 -13604 -17683 -14765 -12255 -24435 -36860 -30928 -26474 -15128 -5645 -2245 -700
11767 -700 -7503 -5526 3357 2074 1097 -13722 -21627 -14273 -5840 -9743 -2535 -1570 -10563 -7979 -4569
11752 -4569 -123 -2547 -2916 1671 -4161 -817 5134 4625 -2421 2388 3161 13767 6785 4538 7538
11737 7538 8627 -11232 -19615 -9967 3793 -1377 -8246 -19911 -9853 -9841 -10309 223 4819 7166
11723 7166 7574 -4809 -12712 -9364 2160 568 -5313 -4670 4500 828 -4112 10056 18142 18201 27330
11708 27330 21832 16503 10475 1023 -1895 416 5430 7120 6023 6543 4232 -1001 10979 11503 -10550
11693a0550j1705J2187Q467l215q87j870L530P11J962m17J857K690j870n243J880
11678b473j802j187j4564L207J3527N59K575j39M150K41q096J0434q454j5312
11664a7334O076l130O115J4881K855l685q244m860m969J3448R747P680o664N417
11650A7333L877j2672J0627n503k0749j1017J5826J9248p008k386q754N162Q966
11637A2950j6375j4668J2603k80r930M010K383O550p097n285J147n703N053n455
11623b0097M799O434Q326j1903R950m2r686Q959l638k909j180k829o46n359l287
11608b3108J795J0296Q901m238j543K98J263M265p332Q511Q93J4616J4718o102
11594B3233j5566j3948j3349q064j6814J0045J7627J3111p59o773k141o834j101
$$ plain form
11693 -10550 -22255 -10068 -1601 -4816 -5703 -7573 -4043 -3332 -1370 -1787 70 2760 890 -4353 -2473
11678 -2473 -4275 -5462 -20026 -16819 -3292 -2733 -158 -297 3853 4094 -4002 6432 -2022 -17334
11664 -17334 -11258 -14388 -8273 6608 9463 5778 -2466 -7326 -12295 1153 10900 18580 11916 17333
11650 17333 21210 8538 19165 13662 -7087 -18104 -2278 16970 9962 7576 -1178 3984 12950
11637 12950 -3425 -18093 -5490 -5770 -15700 -11690 -9307 -2757 -9854 -15139 -13992 -19695 -14642 -20097
11623 -20097 -15298 -8864 -538 -12441 -2491 -2533 -12219 -3260 -6898 -9807 -10987 -13816 -14462 -19821 -23108
11608 -23108 -21313 -11017 -2116 -6354 -7897 -7599 -6336 -2071 -9403 -892 1 14617 29335 23233
11594 23233 7667 -6281 -19630 -27694 -44508 -34463 -16836 -3725 -4484 -11257 -13398 -20232 -21333
11581b1333K147l395J0749k629O270p072j551J017N908Q263Q235m217j7739j576
11567a6923M882o034l475P105O025p589k722J5286K1171j1380j3257P002P102
11554G193Q625o001j0949r949N828J4280O273Q636j5383k0355n180M411Q364m755
11540h962l713r589P106R670J1149M565q663o515N340k866j963j731p755m552
11526a8479M898k497K656R01J983J1335P422Q563q02n811q265p56J509p767l365
11511h475j525M837P349j512n705j5291K616J249r250J4247K2240J8426l35m562
11497B4309k001j5344k1716k498J2873m216o142O797k172L069o30K4700O625q239
11483A5415m645n231l587k129M077j305l657k033J404N179k016L647K615j6179
$$ plain form
11581 -21333 -19186 -22581 -11832 -14461 -8191 -15263 -16814 -15797 -9889 -1626 6609 2392 -15347 -16923
11567 -16923 -12041 -18075 -21550 -14445 -8420 -16009 -18731 -3445 17726 6346 -6911 91 7193
11554 7193 15818 9817 -1132 -11081 -5253 9027 15300 23936 8553 -11802 -16982 -12571 -4207 -8962
11540 -8962 -12675 -22264 -15158 -5488 5661 10226 1563 -4952 388 -2478 -4441 -6172 -13927 -18479
11526 -18479 -13581 -16078 -13422 -12521 -10538 797 8219 16782 15980 10169 1904 1148 2657 -5110 -8475
11511 -8475 -10000 -5163 2186 674 -5031 -20322 -17706 -16457 -25707 -11460 10780 29206 28871 24309
11497 24309 22308 6964 -14752 -17250 -4377 -8593 -14735 -7938 -10110 -7041 -7671 17029 23654 15415
11483 15415 10770 5539 1952 -177 3900 2595 -1062 -3095 -1691 3488 1472 5119 7734 -8445
11469h445N553L048j0401j4739n53M062J2037J1504J3660M632K910M275J250j9241
11455I552k225k329N610m6k351j5837j3273j908N972J3884L80M020J8447o447
11441A3449j3990j902R405j7061j6918J2507R752m393j86P953R88J940J5237l045
11427A3736o627j3043K096Q333p00m123o052M503l580k960N959L055j1835J0041
11413a197q360O881R54p231j1856l356J7213P922P321N284n932l462p91J0381
11399A3771J2022m662n193K003J0930o987k944q765k523L721P547R081K626j0152
11385B0475m041j420l88j2179k1301o698M141k10J2386j2661p079M921J2334N531
11371f189l14o241J1623J5542j3520j6895m869P293K063o814M621M117Q401J1279
$$ plain form
11469 -8445 -2892 156 -10245 -24984 -25537 -21475 -9438 2066 15726 20358 23268 27543 28793 9552
11455 9552 7327 4998 10608 10562 8211 -7626 -20899 -22807 -16835 -2951 -2571 1449 19896 13449
11441 13449 -541 -2443 6962 -10099 -27017 -14510 -4758 -9151 -9337 -1384 -396 1544 16781 13736
11427 13736 7109 -5934 -3838 4495 3795 -328 -6380 -1877 -5457 -8417 -2458 597 -11238 -1197
11413 -1197 -9557 -2676 -1722 -8953 -20809 -24165 -6952 970 8291 13575 7643 4181 3390 13771
11399 13771 25793 21131 15938 17941 28871 21884 18940 10175 7652 11373 18920 28001 30627 20475
11385 20475 16434 15014 14626 2447 -18854 -25552 -21411 -21621 -9235 -21896 -28975 -24054 -11720 -6189
11371 -6189 -6503 -12744 -1121 14421 901 -15994 -20863 -13570 -11507 -18321 -13700 -9583 -1182 10097
11357A0097n021j3237q267k717K997j24j3367P00p98J5433J4906K993j3647p569
11343a7621R365P192J4649o579j0545J7505M892k139j3586k645q657O118p53o700
11329i504k906J6034J5640K253j1612j4395o870J928l537r631J5181J282K991
11316c146q406l893J7387M449j317q462p473J911J2449M563N585r27q192q625
11302d097Q740n785N555L845n208n39o207q534J402k294r203L837K700K0559l669
11287A102j469J3767n959p619r346o270J1571J0286L034n187j0513j1223l214
11274b1040r0M520J3514M724M492j5334K289r89M949K511q905P557O388m406J328
11259A508n851J939J5920p082j5589K085r79J692j245M740Q042l8K148l350q402
$$ plain form
11357 10097 5076 -8161 -16428 -19145 -16148 -16272 -29639 -28939 -29737 -14304 602 3595 -10052 -17621
11343 -17621 -8256 -1064 13585 7006 -3539 13966 18858 16719 3133 488 -8169 -2051 -2804 -9504
11329 -9504 -12410 3624 19264 21517 9905 -4490 -11360 -9432 -12969 -22600 -7419 -6137 -3146
11316 -3146 -11552 -15445 1942 6391 5074 -3388 -10861 -8950 3499 8062 13647 12720 4528 -4097
11302 -4097 4643 -1142 4413 8258 3050 2511 -3696 -12230 -10828 -13122 -22325 -18488 -15788 4771 1102
11287 1102 -367 13400 7441 -178 -9524 -15794 -4223 6063 9097 3910 -6603 -17826 -21040
11274 -21040 -21130 -16610 -3096 1628 6120 -9214 -6925 -7914 -2965 -454 -9359 -1802 4586 180 1508
11259 1508 -4343 -2404 13516 6434 -9155 -7070 -8049 -6357 -7602 -2862 5180 5142 7290 3940 -4462
11244d462L941J3551pK467q048p265P419J4018N750q680n157n940n322j443j4666
11229a3844q867M401M902J0151P94J155Q123r752r153N81K864J09J727J335L470
11214b004j967q483j961j125m581J1255m054n624n495L453L105J1701J537j1159
11200a5402m926J1684J2612J5077q232l000j612Q06o847j3295J423j913k196P697
11186h124O245J1478J1808j3951j993l967j26n662j2518k54J4556M078j0806L523
11172e713M381r859O043J3498N969n628k4297o151R310q23K293k116j901R745
11158e249Q832J777P253K160r153L272M470K506l520L514M986j3076J461J1409
11144B0642j4545j9157L556l632q82R661L257O257K207n824o329j1030L367O263
$$ plain form
11244 -4462 -521 13030 13023 15490 7442 177 7596 21614 27364 18684 13527 7587 2265 822 -13844
11229 -13844 -22711 -18310 -13408 -3257 -2463 -1308 6815 -2937 -12090 -11509 -8645 -8536 -6809 -5474 -2004
11214 -2004 -3971 -12454 -14415 -15540 -20121 -8866 -12920 -18544 -24039 -20586 -17481 -5780 -4243 -15402
11200 -15402 -20328 -8644 3968 19045 10813 7813 6201 7007 160 -13135 -11712 -13625 -15821 -8124
11186 -8124 -1879 9599 21407 7456 5463 1496 1370 -4292 -16810 -17064 -2508 1570 -9236 -5713
11172 -5713 -1332 -11191 -5148 8350 14319 8691 -15606 -21757 -12447 -13270 -10977 -13093 -14994 -5249
11158 -5249 3583 5360 12613 14773 5620 8892 13362 15868 12348 15862 20848 7772 9233 20642
11144 20642 6097 -13060 -9504 -13136 -14018 -4357 -1100 5157 7364 1540 -4789 -15819 -12452 -6189
11130f189J442k3009M649L205r891O146j527P2l05J1724O316O370l17k409m983
11115h706J199O046n690p211J0444k142k617k901N376R443J2787M957j0602o203
11101D180N518M34p254l392m954o714N741R070p47n790P984N291M55q868j8750
11086a7796L862P887L794k454P657l880R58O125j9061l65K6619R276J245n982
11072A7885n832K069k770j3447l83Q009k399m725p49M60O307o75k168L959q864
11057c323l191p319n04N362M91M514J3156n242m373L324m530K374o115M272P251
11042F147M242n677J786N704n144r745Q94L006P286P978r975J280M11o786P67
11027B174J844n684L92L345K664q978j3190p350N428J5388J895N529o699N768
$$ plain form
11130 -6189 -4747 -27756 -23107 -19902 -29793 -23647 -25174 -25102 -25407 -13683 -7367 -997 -1314 -3723 -8706
11115 -8706 -7507 -1461 -7151 -14362 -3918 -6060 -8677 -11578 -6202 3241 16028 20985 10383 4180
11101 4180 9698 10132 2878 -514 -5468 -12182 -6441 2629 1882 -3908 4076 9367 9822 954 -17796
11086 -17796 -13934 -6047 -2253 -4707 2950 -930 28 6153 -12908 -13273 13346 22622 23867 17885
11072 17885 12053 14122 11352 -2095 -2478 5531 3132 -1593 -2342 -1882 4425 3750 1582 5541 -3323
11057 -3323 -6514 -13833 -14337 -8975 -8484 -3970 9186 3944 -429 2895 -1635 739 -5376 -1104 6147
11042 6147 10389 4712 6498 12202 7058 -2687 -1793 1213 8499 16477 6502 7782 8193 1407 2174
11027 2174 4018 -1666 -1274 2071 4735 -4243 -17433 -24783 -19355 -3967 -2072 3457 -3242 2526
11013B526j0989j1200J1733J0049j2691q721J3460J3426R970M075l841J389m658
11000A4528j4239P889M237Q028j1539k081J0863j2710r571J086R375N274M144
10987A5284p148J709J845j4799j2961M635J7844J712j5379j457j70r463r224J519
10973b6053k421M924R070P368P896J1344O63K051K237k285M263o072j4339q288
10959i642q231m163o926m636J5681Q398O391R68j702j2787o987M006J0715J3277
10945D362J652j1041j2038M298K212k859M307Q310N261j0824q05J2085J6222o788
10931A4354j2156o70j0109P961J100j642N583j153L788r77r535p30N426r605m534
10916a2899N409O749N437o530O552K3149Q623j2802n794k268j2505j1948m847
$$ plain form
11013 2526 -8463 -19663 -7930 2119 -10572 -19293 -5833 7593 17563 21638 17797 19186 14528
11000 14528 289 8178 12415 20443 8904 6823 17686 4976 -4595 -3509 5866 11140 15284
10987 15284 8136 9845 11690 -3109 -16070 -11435 6409 8121 -7258 -8715 -8885 -18348 -27572 -26053
10973 -26053 -28474 -23550 -14480 -7112 784 12128 12791 14842 17079 14794 19057 12985 -1354 -9642
10959 -9642 -17873 -22036 -28962 -33598 -17917 -9519 -3128 -2160 -3862 -16649 -23636 -19630 -8915 4362
10945 4362 6014 -5027 -17065 -12767 -10555 -13414 -9107 -797 4464 -6360 -7165 4920 21142 14354
10931 14354 2198 1528 -8581 -620 480 -1162 4421 3268 7056 6079 -3456 -4186 1240 -8365 -12899
10916 -12899 -7490 -741 4696 -1834 4718 27867 36490 23688 17894 15626 3121 -8827 -13674
10903a3674R926L524m741O63m61J606P19m273n28M960P550o237j1327o858Q101
10888a1050Q920m345O236M113r726p334r82K728R543n95k352N632k468L191M135
10873E646j0044P448J111M542Q5q485p432j770J9672l775J696K561j0401m290
10859c436j876o671o663Q95K196J9127J1337n360p519j274o920N556J934n159
10845c833J799n589j0002R823R391N74l446p564J6L470L407J2423K943j2898o296
10830e782O388j647Q153N214n137N334K39o775q989r345n8O421j756l912L093
10815h559J980R941k1701j1312K815M571p41k737p309J235J4118J2265M860J0373
10801I799l738J88P449J135k472n558Q69j0372j6043P026P095N848o772j9576
$$ plain form
10903 -13674 -3748 -224 -4965 -4302 -4763 -3157 -2438 -6711 -7239 -2279 5271 -966 -12293 -19151 -11050
10888 -11050 -2130 -6475 -239 3874 -5852 -13186 -14168 -11440 -1897 -2492 -4844 788 -1680 1511 5646
10873 5646 -4398 3050 4161 8703 8788 303 -7129 -8899 10773 6998 8694 11255 854 -3436
10859 -3436 -5312 -11983 -18646 -17751 -15555 3572 14909 9549 2030 756 -6164 -608 1326 -3833
10845 -3833 -2034 -7623 -17625 -7802 1589 2163 -1283 -8847 -8831 -5361 -1954 10469 13412 514 -5782
10830 -5782 606 -1041 7112 12326 7189 12523 12762 5987 -3002 -12347 -12405 -5984 -7740 -11652 -8559
10815 -8559 -6579 3362 -18339 -29651 -26836 -22265 -23006 -25743 -33052 -31817 -17699 -5434 -574 9799
10801 9799 6061 6249 13698 14833 12361 6803 7672 -2700 -18743 -11717 -4622 1226 -5546 -25122
10787b5122N075J7625J410n919l489K412K873j445j560r44q451q221R457J2507
10773c792J2465Q610r976j3900r586k201O451R374K767l148j0144k967R647M254
10759b146n468q462j590J1069O244M869P465O031o961k0149j4613l59J2284m426
10745a6212L224j134J2892K4110P87q257j0706L001O620L906m301j2326o576m682
10731i654Q64m352J8655J82j3253m808j1405K482j672l002O45J3050J0678K181
10717E91m043o880P368R867J955o911q85m764J810K797L497j1256K767J3203P087
10702A6203L675o959j248o366p132M032q547j41J0492J2188K960l039N813m706
10688A7225k965j4388l259P248K912N737K434n313o33L78J880n666r258j0361
$$ plain form
10787 -25122 -20047 -2422 -1012 -6931 -10420 -8008 -5135 -6580 -8140 -9084 -17535 -25756 -16299 -3792
10773 -3792 8673 17283 7307 -6593 -16179 -18380 -11929 -2555 212 -2936 -13080 -16047 -6400 -2146
10759 -2146 -7614 -16076 -17666 -6597 -353 4516 11981 18012 11051 -9098 -23711 -24070 -11786 -16212
10745 -16212 -12988 -14122 -1230 22880 23667 15410 4704 7705 14325 18231 13930 1604 -4972 -9654
10731 -9654 -8790 -13142 5513 5695 -7558 -12366 -23771 -21289 -22961 -25963 -25318 -12268 -1590 591
10717 591 -3452 -10332 -2964 6903 8858 1947 1062 -3702 -1892 905 4402 -6854 -4087 9116 16203
10702 16203 19878 12919 11671 5305 -1827 2205 -6342 -6483 4009 16197 19157 16118 21931 17225
10688 17225 14260 -128 -3387 3861 6773 12510 14944 9631 8998 9376 11256 5590 -3668 -14029
10674a4029P320J5104n30k673m717o530j215O892j1068R458J171q175m37R649
10660B20J449J814l057O534j3842j4395Q647P753j969O069O641m89N431M02l419
10645G789o987j1387l824j3667M800P388J6998K311j1672p879q700O102J1271
10632g457Q623k984N558l204o767l754M047n496j0149J8158L324j2670K712P871
10618b188L078p742m903Q41o20L20P920N943p263j5802n033J2940J1532Q416L470
10603A0909K982J359j181r197j1152m736J7415P227O631r982j2471N465o584j4605
10589a7920K204K3498K8813n212j9100k4679M681J1082Q869j9870q844j382O978
10576a0882O906p647N820k84m273o018J1317P24M893l686k30O558L08r608m317
$$ plain form
10674 -14029 -6709 8395 7865 5192 475 -6055 -7270 -378 -11446 -1988 -817 -8992 -9429 220
10660 220 1669 3483 426 6960 -6882 -21277 -12630 -4877 -6846 -777 5864 5375 10806 11208 7789
10645 7789 802 -10585 -14409 -28076 -23276 -15888 1110 3421 -8251 -16130 -24830 -18728 -7457
10632 -7457 1166 -1818 3740 536 -6231 -9985 -5938 -11434 -21583 -3425 -101 -12771 -10059 -2188
10618 -2188 890 -6852 -11755 -10914 -11534 -11214 -3294 2649 -4614 -20416 -25449 -12509 -977 7439 10909
10603 10909 13891 15250 14069 4872 -6280 -11016 6399 13626 20257 10275 -2196 3269 -3315 -17920
10589 -17920 -15716 7782 36595 31383 12283 -12396 -7715 3367 12236 -7634 -16478 -17860 -10882
10576 -10882 -3976 -11623 -5803 -6087 -10360 -16378 -5061 -4337 556 -3130 -3360 3198 3506 -6102 -10419
10561a0419O708j425N46k863M534Q67M762n672J3947j931p355j34j298J643J3196
10546A5106Q338j5211l333O983N928N78k0285m057J5525O452n213j0090K758R75
10532D454K509o583K827N574O485K887j3655m789m845p687r849K064R898o893
10518a7603R279K962j5223J0081K349k896r194N41P328n183l388L405L032n323
10504a9833J2702K170O508J6729n467j9052j1825m50J2180m454m234O813J631
10491f582n108R636Q000m647n391R51Q947O271m803r460n645J5925J5536M023
10477B7653j1072l930o966l912n135Q297M564j566L372j395R91p077r399p22n072
10462a1369J5596J2190l649j0167j7684L097J8240N802m931K681J284N185J567
$$ plain form
10561 -10419 -3711 -5136 -4590 -7453 -2919 -2052 2710 -2962 10985 9054 1699 1565 267 1910 15106
10546 15106 23444 8233 4900 11883 17811 18389 -1896 -5953 9572 16024 10811 721 3479 4454
10532 4454 6963 380 3207 8781 15266 18153 4498 -291 -5136 -12823 -22672 -20608 -10710 -17603
10518 -17603 -8324 -5362 -20585 -10504 -8155 -11051 -20245 -19704 -12376 -17559 -20947 -17542 -14510 -19833
10504 -19833 -7131 -4961 1547 18276 12809 -6243 -18068 -18518 -6338 -10792 -15026 -8213 -6582
10491 -6582 -11690 -2054 5946 1299 -4092 -3141 5806 12077 7274 -2186 -7831 8094 23630 27653
10477 27653 16581 12651 5685 1773 -3362 4935 9499 7933 11305 9910 10901 3824 -5575 -6297 -11369
10462 -11369 4227 16417 12768 2601 -15083 -11986 6254 12056 7125 9806 11090 16275 17842
10449A7842J0941m761m179j8170r76J438j799J308k021N019l325J820J2868P768
10435B3773j5802l711N451Q96N803j1102l311R05P283M248m259q650j4307J245
10421a1538R336O511n129m897M796M37p214J619p080r004O541M275K479J0390
10407A522j1310j3468M985N605L363j911R101O619m950N635m01j0218j3050P557
10393a0921J2571Q655O810l373o541R53l760r652j1511l414L971Q440L027M027
10379g18M290N598K282K794o643l912j054M330L468J649q85l287Q570l135K161
10364A5508J0084j511j8659p060k037o840j6827Q719P209J0457P145j291m176
10351G21l104R89J167J0108L177j9007j820k126P03L366l239j9288J7J0349O292
$$ plain form
10449 17842 28783 24022 19843 1673 697 2135 336 1644 -377 4642 1317 3137 16005 23773
10435 23773 7971 4260 9711 10607 16410 5308 1997 2902 10185 14433 10174 1524 -12783 -11538
10421 -11538 -2202 4309 -820 -5717 -921 -484 -7698 -6079 -13159 -22163 -15622 -11347 -8868 1522
10407 1522 -9788 -23256 -18271 -12666 -9303 -11214 -2113 4506 -444 5191 4790 -5428 -18478 -10921
10393 -10921 1650 10305 17115 13742 7201 8154 4394 -5258 -16769 -20183 -16212 -7772 -4745 -718
10379 -718 3572 9170 11452 14246 7603 3691 2637 6967 10435 12084 11199 7912 16482 13347 15508
10364 15508 25592 24081 5422 -1638 -3675 -10515 -27342 -18623 -11414 -957 6188 4897 721
10351 721 -2383 -1394 -227 9881 13058 -5949 -7769 -9895 -9192 -5826 -9065 -28353 -28336 -17987 -11695
10336a1695P666m835N814M177L0P027j192o426J9928O883j1133r544N492N266
10322A7458m169j4593K25q651O484J410l305K007O124q636R38k507q867O919K936
10307f227j6502k888o00L461j114J1628J3819j089q083r52q81L48O20J1154J655
10292D349O957K716m875r838q694J4213J2589J1574K340j5562j4131j0375m74
10279i211R805J7534L426k492m831p675o109P093J515j2246M8n742j936J688P47
10264h386N096J0382R467j3380j4307J515Q930J80n554P146M524L326p472J990
10250C457j902P470j808M875m600k817j3108l067p245P136Q881r624Q58N036N371
10235a087p215P777j1027j3888M163K3839J3739j4469k53K480N396L297l787n310
$$ plain form
10336 -11695 -4029 -8864 -3050 1127 1157 8184 6992 566 20494 27377 16244 6700 12192 17458
10322 17458 13289 -1304 -1079 -9730 -3246 -1836 -5141 -3134 2990 -5646 -4708 -7215 -16082 -9163 -6227
10307 -6227 -22729 -25617 -26217 -22756 -23870 -12242 1577 488 -7595 -8547 -9428 -9080 -8460 2694 4349
10292 4349 11306 14022 9147 -691 -9385 4828 17417 28991 31331 15769 1638 -8737 -9211
10279 -9211 594 18128 21554 19062 14231 6556 447 7540 9055 -3191 -3143 -8885 -10821 -9133 -8386
10264 -8386 -3290 7092 16559 3179 -11128 -9613 -683 -503 -6057 1089 5613 8939 1467 3457
10250 3457 1555 9025 7217 12092 7492 4675 -8433 -11500 -18745 -11609 -2728 -12352 -11494 -6458 -1087
10235 -1087 -8302 -525 -11552 -25440 -21277 2562 16301 1832 1579 4059 9455 12752 8965 3655
10221C655k054Q332N258r435l742j2494j4864J2661L077j0170m501J1067P249
10208e961K24K160r87R985Q986n70j8746J4812J2687m601j5648j4110m377L674
10194a2472J5775k778k589K347R313J8626O687j2339m383J947r047k0344j894
10181a1151N877q347r786R434J9915r289r043n6m38N874l960n658K906P750o0
10166f032j2067J1027Q76Q565j035J1079L087k3844k207J0969J2534J2206M670
10153B9828r034p548p670l900j870j0268n231q003P795K1287J841M342K615o596
10139G588J0555q921j224L408q366j1799j4429j355O767P721m434J229M101m523
10125a3682o859J0532J8933J0752j0965r920j2842L986L329R48M924j110P552
$$ plain form
10221 3655 1601 9933 15191 5756 2014 -10480 -25344 -12683 -9606 -19776 -24277 -13210 -5961
10208 -5961 -5737 -3577 -4564 5421 14407 13837 -4909 9903 22590 17989 2341 -11769 -16146 -12472
10194 -12472 3303 525 -2064 283 9596 28222 34909 22570 18187 20134 11087 -9257 -11151
10181 -11151 -5274 -13621 -23407 -13973 5942 -3347 -12390 -12446 -12884 -7010 -10970 -16628 -13722 -5972 -6032
10166 -6032 -18099 -7072 -6196 2369 1334 12413 15500 -8344 -10551 418 12952 25158 29828
10153 29828 20794 13246 5576 1676 -194 -10462 -15693 -23696 -15901 5386 7227 11569 14184 7588
10139 7588 18143 9222 7998 11406 3040 -8759 -23188 -24543 -17776 -10055 -14489 -13260 -9159 -13682
10125 -13682 -20541 -10009 8924 19676 8711 -1209 -14051 -10065 -6736 -5788 -864 -1974 5578
10112E578J8202m198j0141p492K632R464K4n239N252L58m088j3192L6j909m702
10097i415j153J0716l747N788M920K482j0780n917M673N939k178p186J5938J3437
10083B3517L028l848j7726k0232o656P326j067l119M054M663O944M987p191q4
10069e404j564k870K575Q488j477P918j654P49N077m770j194j1436K090j0686
10055a4158K439Q358J3006P281K785N27J1844L3705O3700J03249J60689Q9624
10043D83049j22534j65760p9308m5672k1604j3933j2053j6692k306K1682M750
10032B9619m826k3862j6949K0815J2077O325O424j0120j2593j5430k85j965J2828
10019B058K3995o010o847q268o263L375l011k819J1343k959n760M985l753J2661
$$ plain form
10112 5578 23780 19582 9441 1949 4581 14045 14069 8830 14082 14440 10352 -2840 -2804 -4713 -9415
10097 -9415 -10568 148 -3599 2189 7109 9591 -1189 -7106 -2433 3506 1328 -5858 10080 23517
10083 23517 26545 22697 4971 -15261 -21917 -14591 -15658 -18777 -14723 -10060 -3116 1871 -5320 -5404
10069 -5404 -6968 -9838 -7263 1225 -252 7666 6012 6761 11838 7068 5874 -5562 -3472 -14158
10055 -14158 -11719 -3361 9645 16926 19711 20238 32082 65787 129487 232736 393425 483049
10043 483049 360515 194755 115447 69775 48171 34238 22185 5493 3187 24869 29619
10032 29619 24793 931 -16018 4797 16874 23199 29623 19503 6910 -8520 -8805 -10770 2058
10019 2058 26053 20043 13196 4928 -1335 2040 -971 -3790 7553 4594 -1166 3819 66 12727
10005A2727P72j2270N223J1682n290o390O391J4312j1818j4200p883K719P029
9992C004n590K382R608o176m38L501M725N399j1038j83J5188j208J97N337j3720
9977A0988k824P914j0853o362l281p825j647R991l06K989O16N817m684p477k146
9962i090J732P359r495j8156J4517N218K203M943N094q629J0394R515j1116j3553
9948i064k008J291J8950J5601j6012p313l567M712N862J075m726J3841j5m652
9934A3975O471k19j121K6913L0472M1871K5730m522l5480m1049l2261k6259K243
9921F764O440J3273K758k752J597q217j7578l739N895K3110K246r221j1612l215
9907E749r203M81M594L007M089K462n385k798k016k974K949P274M527J290j337
$$ plain form
10005 12727 13499 1229 6452 18134 12844 6454 12845 27157 15339 1139 -6744 -4025 3004
9992 3004 -2586 -204 9404 3228 2790 6291 11016 16415 5377 5194 20382 19174 19371 24708 10988
9977 10988 8164 16078 5225 -1137 -4418 -12243 -13890 -3899 -4205 -1216 -600 5217 533 -6944 -9090
9962 -9090 -7358 1 -9494 -27650 -13133 -7915 -5712 -769 4325 -4304 6090 15605 4489 -9064
9948 -9064 -11072 -9781 9169 24770 8758 1445 -2122 2590 8452 9527 4801 18642 18627 13975
9934 13975 20446 20227 19106 46019 76491 118362 144092 139570 104090 63041 30780 4521 6764
9921 6764 13204 26477 29235 26483 28080 19863 2285 -1454 4441 27551 29797 20576 8964 5749
9907 5749 -3454 -2973 1621 4628 8717 11179 5794 2996 980 -1994 955 8229 12756 14046 12709
9892A2709O545Q705p325J143Q478Q938o084j8400j9269q292J2515J512Q122r163
9878A34n322M723M949m560j1414r00N506q880m997o391K283K2755J4379j2060
9864B05M227L170J8080P370O308M752j6535o760n771q723j531M354J0720J7801
9850C7667J2811p640k1554j3091j556L080j643M216O723J139o262L197K290l562
9836A5815o558l171Q00N418l986p49k1046p985J4676L288Q171O543J1326J067
9822B3609r499p031r05l976l198R807O071q751O732J1352O654j1538o031n106
9808H190Q421K406l415q034j657L404Q359j6p618m159M239N622P570j2934o840
9793C538o14J8201M478j6485J3P474M740M090J399o511k032j747p011K762L100
$$ plain form
9892 12709 19254 27959 20634 21777 30255 39193 33109 14709 -4560 -12852 -337 1175 9297 134
9878 134 -5188 -465 4484 -76 -11490 -12390 -6884 -15764 -20761 -27152 -24869 -2114 12265 205
9864 205 4432 7602 25682 33052 39360 44112 27577 20817 15046 6323 4792 9146 19866 37667
9850 37667 50478 42838 21284 8193 6637 9717 8074 12290 19013 20152 13890 17087 19377 15815
9836 15815 9257 6086 6886 12304 8318 7569 -13477 -21462 -6786 -3498 4673 11216 22542 23609
9822 23609 14110 7079 6174 2198 -1000 8807 14878 6127 12859 24211 30865 19327 13296 8190
9808 8190 16611 19017 15602 7568 5911 9315 17674 17658 10040 5881 10120 15742 23312 10378 3538
9793 3538 2924 21125 25603 9118 9131 16605 21345 25435 26834 20323 18291 16544 9533 12295 15395
9778A5395N471k577R566R331p351j3383j032j635l872k219l436J42P431N286m601
9763A2516J770M809J963n13q734j4628j8708J6920K2585J3114J5713j186k391
9750D3230k6640j1324P43L472k736N478J1364l451J522M984L093m799K442k712
9736B4666M20j309j6300J089P000J1902P741j5357j0796J1168M837J1260m71j1336
9722B4514p520Q380O241J2854k522j798j6603j7330N784J6631L922l064p917k776
9708A8796N820O140j999J364N08j4081R594Q416K102K798j0292o188N832K393
9694C1203J0728r904J507m258n31J6898J9630j3850j0628k275m756j1124M10Q282
9680C1332l469j1482J6045R016p497m809r807j0170N100m08Q365J572J5258Q615
$$ plain form
9778 15395 20866 18289 27855 37186 29835 16452 15420 13785 9913 7694 4258 4400 11831 17117 12516
9763 12516 14286 19095 21058 20545 11811 -2817 -21525 -4605 17980 31094 46807 45621 43230
9750 43230 16590 5266 6009 9481 6745 12223 23587 20136 21658 26642 29735 24936 27378 24666
9736 24666 25086 23777 7477 8566 15566 27468 35209 19852 9056 20224 25061 36321 35850 24514
9722 24514 16994 25374 31615 44469 41947 40149 23546 6216 12000 28631 32553 29489 21572 18796
9708 18796 24616 30756 28757 30121 30629 16548 26142 34558 36660 39458 29166 22978 28810 31203
9694 31203 41931 32027 33534 29276 28745 45643 65273 51423 40795 38520 33764 22640 23050 31332
9680 31332 27863 16381 32426 41442 33945 29136 19329 9159 14259 13851 22216 23788 39046 47661
9666D7661j546k488J1135J3161L465r443k0800l614p692j1006o613L399R68M741
9652B1328K5654J0812k514j3482p143p329Q01J0293J3128l00o943q248K106J054
9638C9217L999Q066k397l379N969q097P702O399r781q427j5615j3581n562J6039
9624B0552K7812M502L82P1N227k850j941O185Q677r32n927j2956N952K530k735
9609E4549n206j617J9864J3565j732k867N354J038k174m548k2796O973J6693L813
9595H0909L123l908j3326o613R084J2389P484M21n950R971J1914j281o638n938
9581I1641p305m214K151m035l756l608l442N510J5327J8393L952j571o383k2540
9567H0120j8585M019Q351N997J1611J1997o29O31M334l837R121J5967J0974l010
$$ plain form
9666 47661 46115 43627 54762 67923 71388 61945 41145 37531 29839 18833 12220 15619 16587 21328
9652 21328 46982 57794 55280 41798 34655 27326 28127 38420 51548 51248 44305 36057 38163 39217
9638 39217 43216 51282 48885 45506 51475 43378 51080 57479 47698 39271 23656 10075 4513 20552
9624 20552 48364 52866 53248 53319 58546 55696 53755 59940 68617 67685 61758 48802 54754 57284 54549
9609 54549 49343 47726 67590 81155 79423 76556 81910 82948 80774 76226 53430 60403 77096 80909
9595 80909 84032 80124 66798 60185 69269 81658 89142 89563 83613 93584 105498 104217 97579 91641
9581 91641 84336 80122 82273 78238 74482 70874 67432 72942 88269 106662 110614 109043 102660 80120
9567 80120 61535 65554 73905 79902 91513 103510 102881 103512 107846 104009 113130 129097 140071 137061
9553A37061l505J7428J0451j1325j2772K001R057n856q170J672O163M477J8225
9540A64907K295j0429o546Q494J0106j1205p390Q866R080m18N918J6368k664k799
9526A84583J701j3699k613J1268Q545O930m364j1606M597J6733p175R8P728J2489
9512B15215j358Q283l690O765J2031R772j550j9649M603J6441P8J0984K192l879
9498B56238M043J6253L506n757R135R819n886n007P190J5412L673J4286J4447
9485C37352L206J0807O521R876M091j1241j0871M620J2476O109J1718j1080R075
9472C82659R735J2620J314P921O049K593o960L339J30j0110M270k459Q115j0568
9458D08648j960N382n127J7950K8528Q502k119M279J0331n313n415j839J921P257
$$ plain form
9553 137061 133556 150984 161435 150110 137338 139339 148396 142540 134370 136042 142205 146682 164907
9540 164907 167202 156773 150227 158721 168827 157622 150232 159098 168178 167760 173678 190046 187382 184583
9526 184583 186284 172585 169972 181240 189785 196715 192351 180745 185342 202075 194900 194998 202726 215215
9512 215215 213857 222140 218450 225215 237246 247018 245468 225819 230422 246863 246941 257925 260117 256238
9498 256238 260281 276534 280040 274283 283418 293237 287351 282344 289534 304946 308619 322905 337352
9485 337352 340558 351365 357886 367762 371853 360612 349741 354361 366837 372946 384664 373584 382659
9472 382659 392394 405014 406328 414249 420298 422891 415931 419270 419400 409290 413560 411101 419216 408648
9458 408648 406688 412070 406943 424893 453421 461923 459804 464083 474414 469101 463686 461847 463768 471025
9444D71025K272q558j920j1135l150M848l054k102j1915N660M938n223m675j7081
9430D19930K883J4994L350L482R547l258k3755j8323n205N539O961p243n779K422
9416D05545m766r498r636N633N35j9412p890k1421j7499j6816n764K0130l218
9403C15923n529J5143J2981r641j2318o185P08R041M706m494n299j7213j4133
9390B83690K206N654J147m145r65j4717n616n463j1886p892R417r531j5907J4071
9376B40063J1933j1328P800K863j4694j2842o507m142P982J866p255j991j893
9363B11855o781K744m158j4550n248Q83r488r668O526j988M061n481j3839k348
9349A52520l236O739m473r461J604L856l096J2446n684k3749k014r922M932l615
$$ plain form
9444 471025 473297 464739 462819 451684 448534 453382 450328 448226 436311 441971 446909 441686 437011 419930
9430 419930 422813 437807 441157 444639 454186 450928 427173 408850 403645 409184 416145 408902 403123 405545
9416 405545 400779 391281 381645 387278 387813 368401 360511 339090 321591 304775 299011 319141 315923
9403 315923 310394 325537 338518 328877 316559 310374 311082 320123 324829 320335 315036 297823 283690
9390 283690 285896 291550 292697 288552 287587 272870 267254 261791 249905 242013 251430 241899 225992 240063
9376 240063 251996 240668 248468 251331 236637 223795 217288 213146 221128 222994 215739 213748 211855
9363 211855 205074 207818 203660 189110 183862 184745 175257 165589 172115 170127 174188 168707 154868 152520
9349 152520 149284 156023 151550 142089 143693 147549 144453 156899 151215 127466 125452 115530 120462 116847
9335A16847n16j002N919N884J174L224p494j1994j2514R688N418j82j5841m795
9321I3816O781J6902p610l023N076o148p093J0692L973j4652r751N049M891n781
9307I3122J997P334j6722M841M594p34k78O198m952r520r482k180j852J2329j3022
9292G1673j2792K299m613j573M368n424j439K048P401J4201l372K53r511J5372
9278G8891p114m332p534L982J741p099k150r378k655R020Q462m913k980j5654
9264C8287j4524O555J645r41J715J1304p80r392L474n88k868R129j066p603j1996
9249B2351k288J6973M971j1011O92Q300j744K677M724l828r407j0769Q812J5889
9235D6342p378r709j1992o861J0710J4410M921L865M136j704M02J1387l700q804
$$ plain form
9335 116847 116331 115329 121248 127132 128306 131530 124036 112042 99528 109216 114634 114452 98611 93816
9321 93816 100597 117499 109889 106866 111942 105794 98701 109393 113366 98714 88963 94012 98903 93122
9307 93122 95119 102453 85731 90572 95166 94432 94154 100352 95400 85880 76398 74218 72366 84695 71673
9292 71673 58881 61180 56567 54994 59362 53938 52499 54547 61948 76149 72777 73030 63519 78891
9278 78891 71777 67445 59911 63893 65634 58535 56385 47007 44352 53372 61834 56921 53941 38287
9264 38287 23763 30318 31963 31022 32737 44041 43261 33869 37343 36755 33887 43016 41950 34347 22351
9249 22351 20063 37036 42007 30996 31688 39988 38244 40921 45645 41817 32410 21641 30453 46342
9235 46342 38964 29255 17263 10402 21112 35522 40443 44308 48444 46740 47142 58529 54829 46025
9221D6025n571o36l377j0318q099N768N919M400l407j3050l211m0K727R762j4271
9206A2621n102N803M906k263J075p861R602P392l181l293k493K3224K1878j1713
9192E0595r080j6098k070P64J938J341m824p467P467L311K122L812M175q685j4184
9177A3117K363J2488P476l640m406J0961J289m415j5116j4151J2877J5290j0290
9164B3843r883N59r37O439K993Q097J631k0253k702O891K955M349Q910O381L445
9149D2718k003l654k472L901n59j989k1376q139L583Q688J5138o095k2198J1429
9135A6972J7296J557p310j576k666j2900q262L138M19R672J4113j936O999O392
9121D1908j2297j7376q395M583J5999L496j0453p180o841K878N335p072n010J2870
$$ plain form
9221 46025 40454 39818 36441 26123 18024 23792 29711 34111 30704 17654 14443 14403 17130 26892 12621
9206 12621 7519 13322 18228 15965 17040 9179 18781 26173 22992 19699 17206 40430 62308 50595
9192 50595 41515 25417 23347 24111 26049 27390 22566 15099 22566 25877 27999 31811 35986 27301 13117
9177 13117 15480 27968 35444 31804 27398 38359 39648 35233 20117 5966 18843 34133 23843
9164 23843 13960 14519 13582 20021 23014 31111 32742 12489 9787 16678 19633 23982 32892 39273 42718
9149 42718 40715 37061 34589 38490 37931 35942 14566 6427 10010 18698 33836 27741 5543 16972
9135 16972 34268 35825 28515 26939 24273 11373 3111 6249 6668 16340 30453 28517 35516 41908
9121 41908 29611 12235 3840 8423 24422 27918 17465 10285 3444 6322 11657 4585 -425 12445
9107A2445O121o302o484O66l112J292Q115J3651M079r892n809J308J0793m501
9093B2370q141K792k679Q031J5745l592j4817M540J0469m979n535j1306k24J5512
9079B8186k965q719J6K132j923J1128J332L434j2167n279O421L865j1378j4300
9065b17p00nP809K427N852P492k350L869j220m809p248m273q414m517j152M383
9049c073P608L961j4117l496L519n067k523J281L33J0661r55n471k369K654J0159
9034C105o32l761Q030q17p675P73L350j646k23N226k592m448P326J1652q982k046
9018F640R179Q804L222m582j2038m47J3368J0685M73p703r364k661j850N359r791
9003I294q964M16K441N568P267J2861K548j7218k2654q706N350N709P656J5020
$$ plain form
9107 12445 18566 12264 5780 6446 3334 4626 12741 26392 30471 20579 14770 16078 26871 22370
9093 22370 14229 17021 14342 22373 38118 34526 19709 24249 34718 29739 24204 12898 12674 28186
9079 28186 25221 16502 16518 18650 16727 27855 29187 32621 20454 15175 21596 25461 14083 -217
9065 -217 -917 -922 6887 9314 15166 22658 20308 24177 22957 18148 10900 6627 -1787 -6304 -7456 -3073
9049 -3073 4535 8496 -5621 -9117 -5598 -10665 -13188 -11907 -11574 -913 -1868 -7339 -9708 -7054 3105
9034 3105 2473 -1288 6742 5925 -1750 -977 2373 727 504 5730 3138 -1310 6016 17668 8686 6640
9018 6640 15819 24623 27845 23263 11225 10778 24146 34831 35304 27601 18237 15576 13726 19085 9294
9003 9294 330 746 3187 8755 16022 28883 31431 14213 -8441 -17147 -11797 -6088 1568 16588
8989A6588J4710o782k341M640k428O483l977r249j5405p880L856L41P365J5719
8975B1640j455j348M679m142l575l704Q538L956r162q602n015j015o708P004Q105
8960I196p367M373o513j223O848l17M293m617o836m759L088o19n853R590P857
8945G141j03m945J125J627K19o417m364J2469J792o702r985J3582R969k761r267
8930C380N481K283J98r14l902Q766l685j4650k319k370J4166Q106p886m092M442
8915G004n419k140M467k189j638K501l322L372J0405k570n980l794j0593j8741
8901b8637J59J7435P475m107q388J0769K3265L180j7212n487O723n23K544n528
8887A668j1820m91O788O30q533p240L978Q65o225O653J6639M256P7j763N546K276
$$ plain form
8989 16588 31298 24516 22175 26815 24387 30870 26893 17644 2239 -5641 -1785 -1444 5921 21640
8975 21640 20185 18837 23516 19374 15799 12095 20633 24589 15427 6825 1810 795 -5913 1091 9196
8960 9196 1829 6202 -311 -1534 5314 4997 9290 4673 -2163 -6922 -3834 -4453 -10306 -716 7141
8945 7141 7038 2093 3218 4845 5064 -1353 -5717 6752 8544 1842 -8143 5439 15408 12647 3380
8930 3380 8861 11144 11342 10428 6526 15292 11607 -3043 -5362 -7732 6434 14540 6654 2562 7004
8915 7004 1585 -555 3912 1723 85 2586 -736 2636 13041 10471 4491 697 -9896 -28637
8901 -28637 -28478 -11043 -3568 -7675 -16063 -5294 17971 21151 3939 -1548 5175 4652 7196 1668
8887 1668 -10152 -10643 -3855 -3225 -11758 -18998 -15020 -14155 -20380 -13727 2912 7168 7245 5482 11028 13304
8871A3304l056j1282j498J8705j750Q920o514k0338o129J6963Q816N243o813N078
8857A9649m743j5521j1275k537J4502O309j7881p206O201j194N981o085j636l987
8843a9423n525k063L095K6027R890l562k802j929R310K450r369l423J5071M540
8829B2287k279r564n597o961K904n978N751J0202J1050l699n316j1614K356R86
8815D528K047Q496J07J5560j7315j8216J726R78k092k01Q545p359J637N966J27
8800D534M971J019J080k131K813n269j243M48O729l9j1842K1593L785j7553j828
8785G067k230O423K659m145j8198K673m60j0727K2593K119p566n709o175p706
8771a9382l21j560J5284J2455J744k630l819k620l844P853K0386k278j4356k1241
$$ plain form
8871 13304 10248 -1034 -2532 16173 14423 23343 16829 -3509 -9638 7325 16141 21384 14571 19649
8857 19649 14906 -615 -11890 -14427 75 6384 -11497 -18703 -12502 -13696 -7715 -13800 -15436 -19423
8843 -19423 -24948 -27011 -23916 2111 12001 8439 5637 3708 13018 15468 6099 2676 17747 22287
8829 22287 20008 10444 4847 -2114 790 -5188 563 10765 21815 18116 12800 1186 3542 4528
8815 4528 6575 15071 15178 30738 13423 -4793 -3067 -2089 -4181 -4382 4163 -3196 -1559 4407 4534
8800 4534 9505 10524 11604 9473 12286 7017 5774 6222 12951 12912 1070 22663 26448 8895 7067
8785 7067 4837 11260 13919 9774 -8424 -5751 -6211 -16938 5655 7774 208 -5501 -11676 -19382
8771 -19382 -19703 -21263 -5979 6476 8220 5590 1771 -849 -4693 3160 23546 21268 6912 -14329
8757a4329J2796J121q494J4334k336j552L872R86J6332l597j7358J365Q688p145
8743D683p011J744N866k171j913j7012j2697n412K163K0902Q236K434l030J098
8729b120J253J4689j53m659N627o039J714Q519j2102j696p617L03P619R642L174
8714A8154P422l119j3141k9714j0575k682k674K172R9K1377J7952J9816J0949
8701C6036K396j4418q199q731p372o132K613k052O74m20J3751Q271p727o483n865
8686c658j2933P102J0721j1144R938L713J1753N083p376q85Q557M498q723l401
8672A3245k914n732M115r773n635J5458m046P769p739m515L33r409O232P077K741
8657G207O286L249k937p130r196R006l384R42o64r66p0R47J1166J8058K0478j6583
$$ plain form
8757 -14329 -1533 -412 -8906 5428 3092 1540 5412 6398 22730 19133 1775 3140 11828 4683
8743 4683 -2328 -584 5282 3111 1198 -15814 -28511 -33923 -31760 -10858 -2622 -188 -3218 -2120
8729 -2120 -867 13822 13669 9010 14637 8598 10312 18831 6729 5033 -2584 -2281 5338 14980 18154
8714 18154 25576 22457 9316 -20398 -30973 -33655 -36329 -34157 -34058 -12681 5271 25087 36036
8701 36036 38432 24014 15815 7084 -288 -6420 -3807 -5859 -5185 -5605 8146 16417 8690 2207 -3658
8686 -3658 -16591 -9489 1232 -9912 26 3739 15492 20575 13199 12314 20871 25369 16646 13245
8672 13245 10331 4599 8714 -1059 -6694 8764 4718 12487 4748 233 566 -8843 -2611 4466 7207
8657 7207 13493 16742 13805 6675 -2521 6485 3101 4043 3379 2413 2343 3290 14456 32514 52992 36409
8641C6409k3118j2578o652m736J947J6675j027k664p369j1154J461J600Q719J4640
8627A2153L239l048l997J127j847r397m53J1832j192J108J1884N443L588j1846
8613A8594n326n269j387K83J2671j459k4846n088J0750Q820N391K348l627j0421
8599A434J5053Q413o781n055l899O247P31J6229L760m783J90q01n976j5775N364
8584A4351Q025l50j7597k2439J9458K262r683j0237o613N111J8133K583m60K055
8570D599r175Q471J7273r8p201j3834r939k292K363J6471N584n771k085O768L425
8555A4559J017o163j305o055M10n033k238L550Q559O922o783K776m520n586R93
8540A103K932J685l915n313j278o613o173O331J8342n094P965k526j5464m182
$$ plain form
8641 36409 13291 713 -5939 -10675 -8728 7947 6920 4256 -3113 -14267 -12806 -11206 -2487 12153
8627 12153 15392 12344 8347 9474 7627 -1770 -2223 9609 8417 9525 21409 26852 30440 18594
8613 18594 13268 7999 6612 6895 19566 18107 -6739 -11827 -1077 7743 13134 15482 11855 1434
8599 1434 16487 24900 18119 13064 9165 15412 16143 32372 36132 31349 31539 30738 24762 8987 14351
8584 14351 22376 22026 4429 -18010 1448 3710 -5973 -16210 -22823 -17712 421 3004 2544 4599
8570 4599 -4576 3895 21168 21070 13869 35 -9904 -12196 -9833 6638 12222 6451 4366 11134 14559
8555 14559 15576 9413 8108 2053 2463 -2570 -4808 -1258 7301 14223 7440 10216 5696 110 1103
8540 1103 4035 5720 1805 -3508 -4786 -11399 -17572 -11241 7101 2007 9972 7446 -8018 -12200
8526a2200J3329J7214P883j3189r638o072k152Q442L156j3039L839K2419Q25r048
8512A1769j182m505m56m767j1481n386R038M972J466n363M317m19O771M891j166
8497H499l266j3910O956J739r57J272q78j6312j8551J4324o919Q739J9628l03
8483F1k177l457p352M177L675j0758q579P9N513J2439o67l564k931j1328Q295
8468a6574J2360K777K670P847j2710o982O598j219L59J5845O593q314j5478m086
8454a0314J0009Q501l391J3761J6470r011j5883L483l114o703l678K875J4851
8441A7856l092j8814o141k496N898L556R287J6467M552l114o252j8781o900K3037
8427A5063N188r451o866j0792Q387J1443M450j5071K213J664n719j2033o11L109
$$ plain form
8526 -12200 1129 18343 26226 13037 3399 -2673 -4825 3617 6773 -6266 -2427 19992 20817 11769
8512 11769 10587 6082 5626 859 -10622 -16008 -6970 -1998 -532 -5895 -1578 -1997 4774 9665 8499
8497 8499 5233 -8677 -1721 18 -939 333 -545 -16857 -35408 -21084 -28003 -19264 364 61
8483 61 -2116 -5573 -12925 -8748 -5073 -15831 -24410 -24331 -18818 -6379 -7046 -10610 -13541 -24869 -16574
8468 -16574 -4214 -1437 1233 9080 -3630 -10612 -4014 -5233 -4874 10971 17564 9250 -6228 -10314
8454 -10314 -305 8196 4805 18566 35036 26025 10142 13625 10511 3808 130 3005 17856
8441 17856 14764 -4050 -10191 -12687 -6789 -3233 6054 22521 27073 23959 17707 -1074 -7974 15063
8427 15063 20251 10800 3934 -6858 1529 12972 17422 2351 4564 6228 509 -11524 -12135 -9026
8413i026R93m967R924K291J3420J44j0974K152K3492o04q971O266q480j5090j1910
8398a1340L535L985O586P212j900J1812K8508L1222Q271N538j5759m859j3246
8385E9565j2371j1034j4241j7242K438j0265j439k046J716O348j981Q544R91o855
8371B128Q185l781q241q957m19J1477m072k197N401J1543J5775R23P301K1155
8357E6221J4981Q751L968k819j6778j4459j6381k9338j7404L121L768J2547J3405
8344A9583K196n068k366P155n817k72m410n734n320p358K724r908j740P952J971
8329f412O405O962j568n334l120N516N331Q92M674o913p065R64Q627M430R279
8314B2668j0607K967K829o888L698L807K566q883m4p848q784q089l116O244K0035
$$ plain form
8413 -9026 -8033 -13000 -3076 -785 12635 12779 1805 3957 27449 26845 17874 24140 15660 570 -11340
8398 -11340 -7805 -3820 2766 9978 8078 19890 48398 79620 87891 93429 77670 72811 59565
8385 59565 47194 36160 21919 4677 7115 -3150 -4589 -6635 -4919 1429 -552 7992 8983 2128
8371 2128 10313 6532 -1709 -10666 -11085 392 -3680 -5877 -476 11067 26842 27765 35066 56221
8357 56221 71202 79953 83921 81102 64324 49865 33484 4146 -13258 -10137 -6369 6178 19583
8344 19583 21779 16711 14345 21500 15683 15411 11001 5267 -53 -7411 -4687 -14595 -16335 -8383 -6412
8329 -6412 -7 6955 5387 53 -3067 2449 7780 8672 13346 6433 -632 332 8959 13389 22668
8314 22668 12061 15028 17857 10969 14667 18474 21040 12157 12113 4265 -4519 -12608 -15724 -9480 10555
8299A0555O257j892P773p182q617j3011j1509j232Q329K76o142K589P27p23J2588
8284a214J4427K730k179j1297n157J0920N755N028L47j5141p427O142j0P578o71
8269I831q043Q869k153o851L897P972q303o789N689O288j3257P112J1646j447
8255A4461j8566o59N506M444j806j963N423N978o198j2692l505O454L720K139
8241B736j532R94n497L279j2384n092J7551J4596q767j4719R649J3413m880K258
8227A1605K076M5r228j1121P263J2149l784q752l235J236R97o122j8186n803J1961
8212a8899L262J0553J0378m32k151L097m465m584q662R663J4728k310j9227n878
8198a4927J0950J5115J544j6778j0759O613P493J0641J429j0678K980P69j1121
$$ plain form
8299 10555 16812 14920 22693 15511 6894 -6117 -17626 -18858 -10529 -10253 -16395 -13806 -13079 -13802 -1214
8284 -1214 13213 15943 13764 2467 -2690 8230 13985 19013 19360 4219 -3208 2934 2924 10502 9831
8269 9831 1788 10657 8504 1653 5550 13522 5219 -1570 4119 10407 -2850 4262 15908 14461
8255 14461 -4105 -4764 742 5186 3380 1417 6840 12818 6620 -6072 -9577 -3123 597 2736
8241 2736 1204 2198 -3299 -20 -12404 -17496 55 14651 5884 -8835 814 14227 9347 11605
8227 11605 13681 13726 4498 -6623 640 12789 9005 253 -2982 -1746 -749 -6871 -25057 -30860 -18899
8212 -18899 -15637 -5084 5294 4862 2711 5808 1343 -3241 -11903 -2240 12488 10178 -9049 -14927
8198 -14927 -3977 11138 12682 -4096 -14855 -8242 -749 9892 11321 643 3623 4392 -6729
8185f729j558Q733m531J705P326M310l590j3258o91N645L363Q772P621Q829j0910
8170A5037j4983o009j3234k979R474M219J345Qj267k761N435m275J440j3555l260
8155b5365K2293R376Q527J581j1321j1157J487j278l041n920l741K513O089Q907
8141a050l186o117N694k843l134J2085n433P58O385o245M42J1824N407j1820j2630
8126i863m576N129J4410P245l693m838j5108j3880o351O371J3003J0824j274M246
8112A645Q86o228k232L262r823R550P221Q040K62k441j1997j2447k628K6409L966
8097A3445k5871k410Q443l463K532L984M237j5033p364M505J8611R33n342K561
8083b32r331j725M06k665j463o009r3n9o473J3689P686O466j674j3447M081P583
$$ plain form
8185 -6729 -8287 446 -4085 -2380 4946 9256 5666 -7592 -8283 -2638 725 9497 17118 25947 15037
8170 15037 54 -5955 -19189 -22168 -12694 -8475 -7130 -7122 -8389 -11150 -5715 -9990 -8550 -22105 -25365
8155 -25365 -3072 6304 14831 16412 5091 -6066 -4579 -5857 -8898 -14818 -18559 -16046 -9957 -1050
8141 -1050 -4236 -10353 -4659 -7502 -10636 1449 -3984 -3226 3159 -3086 -2644 9180 14587 2767 -9863
8126 -9863 -14439 -9310 5100 12345 8652 3814 -11294 -25174 -31525 -25154 -12151 -1327 -2601 1645
8112 1645 2531 -3697 -5929 -2667 -12490 -2940 4281 12321 12583 10142 -1855 -14302 -16930 9479 13445
8097 13445 -12426 -14836 -6393 -9856 -7324 -3340 897 -14136 -21500 -16995 1616 2549 -2793 -232
8083 -232 -9563 -11288 -10882 -13547 -15010 -21019 -21112 -21171 -27644 -13955 -6269 197 -1477 -14924 -10843 -3260
8067c260O54J145O127Q211j828R450L6390M6179P8668J04173P9537j6185q9043
8054B60218r8089p4325m4729j2744M869j5923N075P419j112R2m323K959k409j1732
8040A5246j3911j2964L132J9245Q944J1188m162m464N009l54O389J1735p402K56
8026C7887J779J3843n758p723J9784K2904J0570L0023N7776J14097J93975K49088
8014G38245K88721K34960M1147k46387l78085k94191j52796q1447m4820k1508
8004H3839k0436l413l232J0105k937l611j0129j7323J346o52q101p467o010K829
7990A4808j3430l94J2368j873p165r99k666O088J8897P81o692P62J0582J0833
7976D1900j0951k1285n315J1974N203L518M533p044m928p231J535K622J5092L762
$$ plain form
8067 -3260 -2606 -1461 4666 12877 11049 20499 56889 103068 181736 285909 365446 349261 260218
8054 260218 162129 87804 43075 30331 35200 19277 24352 31771 30659 30751 26428 29387 26978 15246
8040 15246 1335 -11629 -8497 10748 19692 30880 26718 22254 27263 26909 33298 45033 37631 37887
8026 37887 39666 53509 47751 40028 59812 82716 93286 123309 181085 295182 489157 738245
8014 738245 1026966 1261926 1303073 1056686 678601 384410 231614 150167 105347 83839
8004 83839 63403 59990 56758 66863 63926 60315 50186 32863 34209 33557 25456 17989 11979 14808
7990 14808 1378 984 13352 11479 4314 3315 649 6737 25634 26415 19723 20485 31067 41900
7976 41900 30949 9664 4349 16323 21526 25044 29577 22533 17605 10374 11909 14531 29623 33385
7962C3385N437P481n561k5361j0561R506q811l956O743K650p688J3797J5152j8213
7948A4000j3534J70j2869r332Q716O972L179M344J614K903J8926m967o309r556
7934D257j373k544k061L352J2822J7224k661l244j1399J983J1347j3065p691k665
7920D282L910J1012m578K14P826M083r355k764J497M35M429O869P131J13n007
7905C0097j254j1086J844n83L611P911j4782j7573n180K080Q17p967R826J2121
7891I882J463M027j3205r730O047K301k68Q693j606o222J4867J2092L722p924
7877B4139r092L692p353j4264N530l533j958N966J2974q136k2871J0073J1006
7864F173O703L908j146j5510M7J0861Q892O684K554r50r892q094j1730j164Q210
$$ plain form
7962 33385 38822 46303 40742 15381 4820 14326 5515 1559 8302 10952 3264 17061 32213 14000
7948 14000 466 636 -12233 -21565 -12849 -5877 -2698 1646 3260 6163 25089 20122 13813 4257
7934 4257 2884 340 -1721 1631 14453 31677 29016 25772 14373 16356 27703 14638 6947 4282
7920 4282 8192 19204 14626 14840 22666 26749 17394 14630 16127 16562 20991 27860 34991 35104 30097
7905 30097 28843 17757 19601 19018 22629 30540 15758 -1815 -6995 -4915 -4098 -12065 -2239 9882
7891 9882 11345 15372 2167 -7563 -1516 785 517 9210 7604 1382 16249 28341 32063 24139
7877 24139 15047 18739 11386 -2878 2652 -881 -2839 3127 16101 7965 -14906 -4833 6173
7864 6173 12876 16784 15638 128 175 11036 19928 26612 29166 28216 18324 10230 -1500 -2664 5546
7849E546J5044n248p305N911J729l466R044J6315j5483j1274r740j5031J123J1315
7835a520P133j6544N289J2792J8426l469j6554J080K858j1637O94J1074N143M900
7821A9665j8253o416n869p51J1575n456J47K24N799p39n53p175P116P829R389
7806A6532o473j0170r27J2381L13p399m560o612K995M168L158J2457p110q293
7792D60j1206L8L422l550J3373J2974N075j4136j1457J456O93j4390j1139J5423
7778a2964R483k846m073K351R990J7346J0075j1129j5197N481o873r554R681j1044
7764i273j5730o91J9072Q833m692R377j755j1103p203J2445J0564o923R5j3277
7750a0261K621J1041J690k376q546p730o659m444R296R138J7736L617j2256q765
$$ plain form
7849 5546 20590 15342 8037 13948 15677 12211 21255 37570 22087 10813 1073 -13958 -12835 -1520
7835 -1520 5613 -10931 -5642 7150 25576 22107 5553 6633 9491 -2146 -1452 9622 14765 19665
7821 19665 1412 -5004 -10873 -11624 -49 -5505 -5358 -5134 665 -74 -627 -7802 -686 7143 16532
7806 16532 10059 -111 -1038 11343 11656 4257 -303 -6915 -3920 248 3406 15863 8753 460
7792 460 -10746 -10708 -7286 -10836 2537 15511 20586 6450 -5007 -3551 -2858 -17248 -28387 -12964
7778 -12964 -3481 -6327 -10400 -8049 1941 19287 29362 18233 3036 8517 1644 -7910 1771 -9273
7764 -9273 -25003 -25694 -6622 2211 -2481 6896 5141 -5962 -13165 -720 9844 2921 3016 -10261
7750 -10261 -7640 3401 5091 2715 -5831 -13561 -20220 -24664 -15368 -6230 11506 15123 2867 -5898
7736e898l296j1734m297K0936J5634N83k468j4606k2081R877n790J4094J9488
7723A0442j778j0516k441N844k813R080k598n667j4186j811r466M892K8373J5265
7709B2620j9120k2154p330J2449q92l65q530J554n1J5782P310N19k779r522q136
7694a8645M283o395j4144M383N480J3537K0409P587k0109n303M485k835q153J428
7680a3992J9746M701q709m439m122l883J3569K331J429r49n985p290L764O636
7666B807n522M344J5758j3645n348j280m760p419O707R953m393N566J1138N307
7652A9213m084j0166K949k121P903P773K237l091j5574r44j3710R010N355J044
7638E794M63n250k237j7327l208m800O667J228j2772q928J2036J4592P445m422
$$ plain form
7736 -5898 -9194 -20928 -25225 -4289 11345 11928 9460 -5146 -27227 -17350 -23140 -9046 10442
7723 10442 8664 -1852 -4293 1551 -1262 7818 5220 -447 -14633 -16444 -25910 -21018 7355 22620
7709 22620 3500 -18654 -25984 -13535 -14427 -14792 -23322 -21768 -21819 -6037 1273 1792 -987 -10509 -18645
7694 -18645 -14362 -20757 -34901 -30518 -25038 -11501 8908 16495 -3614 -8917 -4432 -7267 -15420 -13992
7680 -13992 5754 10455 1746 -2693 -6815 -10698 2871 5202 6631 5682 -303 -7593 -3829 2807
7666 2807 -2715 1629 17387 3742 -1606 -2886 -7646 -15065 -8358 1595 -2798 2768 13906 19213
7652 19213 15129 4963 7912 5791 13694 21467 23704 20613 5039 4095 -9615 -605 4750 5794
7638 5794 6257 1007 -1230 -18557 -21765 -26565 -19898 -18670 -31442 -40370 -28334 -13742 -6297 -10719
7624a0719r541R319N035L247M31J33m663O359j817M34l785j5528P709J5789L504
7609E907j620k335k234J669R18q852m677J1675L715j464r353p188j421P150J5094
7594F984N665r40n478j4342L10M247k269Q88m228j1875k653m585L599J3860R316
7579a501p372Q29N380k104J719k761K215L737r197j0699k787q168K112J8329K600
7564g668J0042J7247P788L055j2146L748M988j7714j899M324j3482n588L512j4414
7550a8207o050J8639Q744j5025j6198J985J3628J11P234K654j530Q363J7q045
7536c680J873M287j0381k839J612Rm952n186o64j253J477N722l812o297K935M616
7520a6533N059P811J4023l478k2384p149m81P03J5704K280J782N653M13k867N715
$$ plain form
7624 -10719 -20260 -10941 -5906 -2659 -2228 -2095 -6758 -399 -2216 -1782 -5567 -21095 -13386 2403 5907
7609 5907 4287 1952 -282 1387 2305 -6547 -11224 451 4166 2702 -6651 -13839 -15260 -8110 6984
7594 6984 12649 11709 6231 -8111 -7801 -3554 -5823 -4935 -9163 -21038 -23691 -28276 -24677 -10817 -1501
7579 -1501 -8873 -8044 -2664 -4768 -3049 -5810 -3595 142 -9055 -19754 -22541 -30709 -28597 -10268 -7668
7564 -7668 2374 19621 27409 30464 18318 22066 27054 9340 7441 11765 -1717 -7305 -3793 -18207
7550 -18207 -24257 -5618 3126 -11899 -28097 -26112 -12484 -12373 -5139 -2485 -4015 4348 4365 -3680
7536 -3680 -1807 2480 -7901 -10740 -9128 -9119 -14071 -19257 -19921 -21174 -19697 -13975 -17787 -24084 -21149 -16533
7520 -16533 -11474 -3663 10360 6882 -15502 -22651 -23132 -22429 -6725 -4445 -2663 2990 3403 536 6251
7505F251J37j5104j2213j0J2366P004j149O913m802j6398n464P017J2886o945
7491i511j434J336M189o679L723j081o51k74O313o637L024J2782J29n748l23k680
7475c522N620N376L674Q872r301j2975R68j3139p717J3011L505J144P317o853
7461d020N982J3171K347j2413J937Q167q793j6693j8884J5754P207m702m941k798
7447a8679L322M035J4240J2621R223O19j918k1314k783l824N911q022j003j0572
7433a8144N969J4669r631j5157M163K811k982J7059N522m720m761K594j871r168
7419a3647J3602K0267p163j0799q674r244L351Q485n883P564R080J484k4480j0843
7405b6900Q199N595J3668j0920k539J6270Q056o865m893Q811j3715o698k849J589
$$ plain form
7505 6251 6388 -8716 -20929 -20939 -8573 -1569 -2718 4195 -607 -17005 -22469 -15452 -2566 -9511
7491 -9511 -10945 -9609 -5420 -12099 -8376 -9457 -10108 -10382 -4069 -10706 -7682 5100 5229 -519 -842 -3522
7475 -3522 2098 7474 11148 20020 10719 -2256 -1288 -14427 -22144 -9133 -5628 -4484 2833 -4020
7461 -4020 1962 15133 17480 5067 7004 15171 6378 -10315 -29199 -13445 -6238 -10940 -15881 -18679
7447 -18679 -15357 -11322 2918 15539 24762 25381 23463 2149 -634 -4458 1453 -6569 -7572 -18144
7433 -18144 -12175 2494 -7137 -22294 -18131 -15320 -18302 -1243 4279 -441 -5202 -2608 -4479 -13647
7419 -13647 -45 20222 13059 2260 -6414 -15658 -12307 -3822 -9705 -2141 6939 8423 -16057 -26900
7405 -26900 -18701 -13106 562 -10358 -12897 3373 11429 4564 -329 8482 -5233 -11931 -14780 -13191
7391a3191N737N976j896m525j5929l342J2056J4284L873J559j7469j549J2559
7378a857Q732M977l211j2757q073M447J0043M519Q92n133q563n865M605L276J418
7363b550L126Q441N588j340L804k402M06p661j3253j0544M75k744Q400J0488J0762
7348A0996o926N523K92j113o863j2551K926R30P915M845L222p617j3183q899J425
7333a9078P838n318p245K637Q034M280J1362J2933j1484j3947k237l866K657J1710
7319a724P07l289M690J216r879l606l935l884J8157Q925p444J943N894j3699j415
7304g343l536O584J0554L269k607r896m579M238N752M658o474r158m168N932P326
7289E52J2170n002j2116q089k319l201p539J2826J1089l629k260J0193j356l215
$$ plain form
7391 -13191 -7454 -1478 -3374 -7899 -23828 -27170 -15114 -830 3043 4602 -12867 -14416 -1857
7378 -1857 6875 11852 8641 -4116 -12189 -7742 2301 6820 7712 2579 -5984 -11849 -7244 -3968 -2550
7363 -2550 576 9017 14605 13265 17069 14667 15073 7412 -5841 -16385 -15910 -18654 -10254 234 10996
7348 10996 4070 9593 9885 8772 1909 -10642 -7716 -6786 1129 5974 9196 1579 -11604 -20503 -19078
7333 -19078 -11240 -16558 -23803 -21166 -13132 -8852 2510 15443 3959 -9988 -12225 -16091 -13434 -1724
7319 -1724 -1017 -4306 384 1600 -8279 -11885 -15820 -19704 -1547 7378 -66 1877 7771 -5928 -7343
7304 -7343 -10879 -4295 6259 9528 6921 -2975 -7554 -3316 2436 7094 620 -8538 -12706 -6774 552
7289 552 12722 7720 -4396 -12485 -14804 -18005 -25544 -12718 -1629 -5258 -7518 2675 1319 -1896
7275a896L803p990n864J4137L731j3987K135N105J846L200l479k666o50N802j0941
7260g714K399P571k505m837j235r8k613o059K883J5629J0522n630r377l372j969
7245f405J491K600l355r858r807L418M79J2705J6099p62L23l935o457J265R307
7230G108m183J0636P103P291o753r052k600j8201l867P978l461j95Q642J0862
7216A1308P14P31p639m340n063Q333J5638j513r516r160N487P962m013o679Q282
7201A0532m515j2928M445J1496j9361k1563j229P876O618R644k360J0497j461
7188b309n743J0304K194k460m513n362P74N72M558P378l702m84N316M304k674
7173H153j0385k357J2679l312m702j3710m307J3758J2169R343j410q003l909o782
$$ plain form
7275 -1896 1907 -6083 -11947 2190 5921 -8066 -5931 -826 1020 4220 741 -1925 -2575 3227 -7714
7260 -7714 -5315 2256 -249 -5086 -6321 -6419 -9032 -15091 -12208 3421 13943 8313 -1064 -4436 -6405
7245 -6405 -4914 -2314 -5669 -15527 -25334 -21916 -21437 -8732 7367 6605 6928 2993 -3464 -2199 7108
7230 7108 2925 13561 20664 27955 21202 12150 9550 -8651 -12518 -4540 -8001 -8196 446 11308
7216 11308 12022 12753 5114 774 -4289 4044 19682 18169 8653 -507 4980 12942 8929 2250 10532
7201 10532 6017 -6911 -2466 9030 -10331 -31894 -33123 -25247 -18629 -8985 -11345 -848 -2309
7188 -2309 -8052 2252 4446 1986 -2527 -7889 -7115 -6543 -1985 5393 1691 1207 6523 10827 8153
7173 8153 -2232 -4589 8090 4778 76 -13634 -17941 -4183 7986 17329 15919 7916 4007 -2775
7159b775M222Q73j1957Q31M223l213n050m139r271K99J3977L811M724j184r951
7144a4580n49R009o858K055K3288L40j2858j3439n996J1733n397o201K60q40J6730
7129c303L572L309j848r794o612R490O243m077J960L223j249n03l014k128p303
7114a2034j639J595p229Q491J1604l310L273L828M177L48Q44j2666j3794j2070
7100b8582p72J6782P300N48J0514K886n453l572j1708J2124O151q141m714K965
7086c672K437K431k134R953J1630j5277j457M001j276k034O992J704m555k549
7072F194l467O616k61P423j724r15O208q470p859j849o278M511q157o766R808
7057d986N771O227m922k2742M842j989n738K191r92J3601J5717P825m649j324
$$ plain form
7159 -2775 1447 2320 -9637 -8806 -4583 -7796 -12846 -16985 -26256 -25957 -11980 -8169 -3445 -4629 -14580
7144 -14580 -15129 -6120 -12978 -10923 12365 12705 -153 -13592 -19588 -7855 -13252 -19453 -19193 -20033 -3303
7129 -3303 269 3578 1730 -8064 -14676 -5186 1057 -3020 -1060 2163 914 411 -2603 -4731 -12034
7114 -12034 -13673 -12078 -19307 -10816 788 -2522 751 4579 8756 9104 9948 -2718 -16512 -28582
7100 -28582 -29354 -12572 -5272 -4724 5790 8676 3223 -349 -12057 67 6218 -1923 -6637 -3672
7086 -3672 -1235 1196 -938 9015 20645 5368 3911 7912 6636 4602 11594 13298 8743 6194
7072 6194 2727 9343 9082 16505 14781 13866 20074 11604 3745 1896 -4382 129 -8028 -14794 -4986
7057 -4986 785 7012 2090 -20652 -15810 -17799 -23537 -21346 -22338 -8737 6980 14805 10156 8832
7043H832k586N475m32q792J0200n27r188p136j7497k013j434J6567K5565l177
7029A3857j5297q397R465J3990J065j1721L577K597J2067j135k0126r194l502
7016a2754J1014M924M315K233o749j9328K308J9081J854n897m104j3973k705K6950
7002G169P373j0328j2248L493Q126N635n131n036j1300j6759j1632P677J9558
6989a3403N210L932J0823n518m953J7164K0179p030j5285j6140p376J10k872l042
6975a8201j1337J0498J3742n956n840J0759J0715J1669J3479l241k0006q748L949
6962A482J609p34M627K982o20J101k552k294Q67J954j0181j8739j2436J4707O286
6947a1941p993k8J2937J911J1651N622n41q554j697m639N208l232n053j332j3659
$$ plain form
7043 8832 6246 11721 11289 2497 12697 12170 2982 -4154 -21651 -23664 -25098 -8531 17034 13857
7029 13857 -1440 -9837 -372 13618 14683 2962 6539 9136 21203 20068 -58 -9252 -12754
7016 -12754 -1740 3184 7499 9732 2983 -16345 -14037 5044 6898 1001 -3103 -17076 -19781 7169
7002 7169 14542 4214 -8034 -4541 3585 9220 4089 -947 -12247 -29006 -40638 -32961 -13403
6989 -13403 -8193 -4261 6562 1044 -3909 13255 33434 26404 11119 -5021 -12397 -12287 -15159 -18201
6975 -18201 -29538 -19040 -5298 -11254 -17094 -6335 4380 16049 29528 26287 6281 -2467 1482
6962 1482 3091 2357 6984 9966 9346 10447 7895 5601 6468 8422 -1759 -20498 -32934 -18227 -11941
6947 -11941 -19934 -19962 -7025 -5114 6537 12159 11618 3064 1367 -3272 1936 -1296 -6349 -7681 -21340
6932b1340k496M035R500L666M569M004k891m695P649M141M584J0348q156l823
6918I095j2309q862N375N258J230J870k633j469O706J59K74N487K564j80k139
6903A0426j916k830r824K297Q302q458j6042K155J1634J2690j0391o995j203J456
6889h699q58O577J8572m462j4745j4239L316m588k780j560J7631K6075K394j7624
6875E010o659J5395o47p994k161J1056M584j2576Q065N947o191j4802j4703N912
6861i764j285m321O576K919j3294j518M812m465J4484N179j1024m656O730J4540
6847D913j748j1142k1830o920J0622J4113R433q312j1316R926N236O293n159K623
6833c268Q364L068m780J843J276p270o46q455j5084q211P680J3745J665K990L048
$$ plain form
6932 -21340 -23836 -19801 -10301 -6635 -2066 1938 -953 -5648 2001 6142 10726 21074 12918 9095
6918 9095 -3214 -12076 -6701 -1443 -213 1657 -976 -2445 4261 4420 4694 10181 12745 12565 10426
6903 10426 8510 5680 -4144 -1847 6455 -2003 -18045 -15890 -4256 8434 -1957 -8952 -10155 -8699
6889 -8699 -9557 -2980 15592 11130 -3615 -17854 -14538 -19126 -21906 -23466 -5835 20240 22634 5010
6875 5010 -1649 13746 13099 5105 2944 14000 18584 6008 14073 20020 13829 -973 -15676 -9764
6861 -9764 -11049 -15370 -8794 -5875 -19169 -20687 -15875 -20340 -5856 -677 -11701 -16357 -9627 4913
6847 4913 3165 -7977 -29807 -36727 -26105 -11992 -2559 -10871 -22187 -12261 -7025 -732 -5891 -3268
6833 -3268 5096 8164 3384 5227 6503 -767 -1413 -9868 -24952 -33163 -25483 -11738 -10073 -7083 -4035
6818d035K724n689j943j2836Q462Q459J549j2626O665J7657j652O851J943j1274
6804D255m32q035n242k514Q834k075l532J699R856N643m621O879j968r440J156
6789D63m24k703M857q766j542K88L582J6664J583k522k809o45J1873K737o087
6774A6549r168r107o289L785R484N440q514p114J2087L484j0863j2741l737J4853
6760a851L059o158O144J741P967m012p609p393n419N706K822p61n476r033M234
6745a6039l607l711m157J1648Q682P893J0232l929K170L043j3502n199J2931J4650
6731B1105j618j4079M148l423J5860M3739K8785L9735M4445M9379k3614o2661
6719A41801l6596k6240k4306j5157j8779r165j253j865j6975j1801R689J5705
$$ plain form
6818 -4035 -1311 -7000 -8943 -21779 -13317 -4858 -3309 -15935 -9270 8387 6735 13586 15529 4255
6804 4255 3823 -4212 -9454 -11968 -3134 -5209 -8741 -7042 2814 8457 3836 10715 8747 -693 463
6789 463 39 -2664 2193 -6573 -8115 -7827 -4245 12419 14002 11480 8671 8026 19899 22636 16549
6774 16549 7381 -1726 -8015 -4230 5254 10694 2180 -4934 7153 10637 -226 -12967 -16704 -1851
6760 -1851 1208 -4950 1194 2935 10902 6890 -719 -8112 -13531 -7825 -5003 -5764 -11240 -20273 -16039
6745 -16039 -19646 -23357 -27514 -15866 -7184 709 10941 7012 9182 12225 -1277 -6476 6455 21105
6731 21105 19487 5408 9556 6133 21993 65732 94517 134252 178697 228076 204462 141801
6719 141801 105205 78965 54659 39502 20723 11558 10305 8440 -8535 -20336 -10647 5058
6707E058m4m325m601k66Q331m957J0891j0983l020n79N215j265m897j276p655
6692a4373m281R607J3481J4421J654j1124q912L889O451r063o3M60l186J2545
6678A1506N587l610k2299k454J5791J234J105n083l279q336o593R457l427j591
6664a1992j917j686n669N537N207k623M839J353K867o815J894Q907j31p289N348
6649b170J0895J174k045p518n563j23N71J9492j5249j4829k34M22Q859Q006P513
6634I201j0695L842N538J6809M934p806n489p908j0970L361p162k61p433j2535
6620b6574J934j190O207J7864J0106l454p53R79Q927q069q796n979M49J287J634
6605e428J1621p374j4175J2642K0718n828k354N238r359j3420p438M219R586J5915
$$ plain form
6707 5058 5014 689 -3912 -4178 4153 -804 10087 -896 -3916 -4495 720 -545 -5442 -6718 -14373
6692 -14373 -18654 -9047 4434 18855 20509 9385 473 4362 10813 1750 1687 2147 -1039 11506
6678 11506 17093 13483 -8816 -11270 4521 5755 6860 1777 -1502 -9838 -16431 -6974 -10401 -11992
6664 -11992 -13909 -15595 -21264 -15727 -10520 -13143 -8304 -6951 -4084 -10899 -9005 -98 -229 -7518 -2170
6649 -2170 8725 9899 7854 336 -5227 -5350 -4779 14713 -536 -15365 -15599 -15177 -6318 1688 9201
6634 9201 -1494 2348 7886 24695 29629 21823 16334 8426 -2544 817 -6345 -6606 -14039 -26574
6620 -26574 -24640 -25830 -19623 -1759 8347 4893 4140 5119 14046 5977 -2819 -8798 -8349 -7062 -5428
6605 -5428 6193 -1181 -15356 -2714 18004 12176 9822 15060 5701 -7719 -15157 -10938 -1352 14563
6591A4563q72q268j5340P835R434j196j2982K688l00n767J4463N274j2731r609
6577a2808m70r72Q421J801r096P907M279N420n274r811j2267N644J5163O192N820
6562I949m087k99P358k714k55j2081j8972Q275J087l669K461J3093j884r337k469
6547a3544n312k317j1530J4329K2062K9094J2911j0998k5106j4032q060J5243
6535B740J8560J4017k512p647j6705k9991j1084R533Q759m441j0235R378J1179
6522h449M899p748k917K277K272J0286M276O852p557q646j964j229N210O889o592
6507b141n497M608J481M097J3593n226j7751o812N686L819Q209M922j9499L02
6493a0209J1312R098K478j7943r037N681j0784r180K914J701L469P624J0595j472
$$ plain form
6591 14563 13691 5423 -9917 -2082 7352 6156 -6826 -4138 -4438 -10205 4258 9532 -3199 -12808
6577 -12808 -13278 -14250 -5829 -4028 -13124 -5217 -938 4482 -792 -10603 -22870 -17226 -2063 4129 9949
6562 9949 5862 5563 12921 10207 9952 -2129 -21101 -12826 -11739 -15408 -12947 146 -1738 -11075 -13544
6547 -13544 -18856 -21173 -32703 -18374 3688 32782 45693 34695 9589 -4443 -12503 2740
6535 2740 21300 35317 32805 25158 8453 -21538 -32622 -23089 -14330 -18771 -29006 -19628 -8449
6522 -8449 -3550 -11298 -14215 -11938 -9666 620 4896 11748 4191 -4455 -6419 -7648 -2438 4451 -2141
6507 -2141 -7638 -3030 -1549 2548 16141 10915 -6836 -13648 -7962 -4143 4066 8988 -10511 -10209
6493 -10209 1103 10201 12679 -5264 -14301 -8620 -19404 -28584 -25670 -23969 -20500 -12876 -2281 -3753
6479c753j2405J0233K726J848o519k446N280M453j192Q436J1175k892n654j0628
6465a338o391L969l576k304L577J7780J962n149k1302k315J827m279n71N992p766
6450a9884K948K323n694J1948J4238j423j1072O414P207J470r699j5296L062K160
6436a1298K53K0406P59j7526p003j181M624R224m700j8117l30J1511n944K545
6422a6777l646l754K160Q980J623L329M986j801N623L75J0134J6021J3060j3432
6408B6881j5652j1044j2067o910q8J1932k247n983K739o032j690Q078J1162M793
6394C872q521J730M627N86L828p167q644J2400J2514m646m317j0583l427K56Q40
6379f652N457J339r435j931O352J1733J0386K727L06j6755p045k110j4328m748
$$ plain form
6479 -3753 -16158 -5925 -3199 -1351 -7870 -10316 -5036 -583 -1775 6661 17836 14944 9290 -1338
6465 -1338 -7729 -3760 -7336 -9640 -6063 11717 13679 8530 -12772 -15087 -13260 -17539 -18110 -12118 -19884
6450 -19884 -16936 -14613 -20307 -8359 5879 4456 -6616 -202 7005 8475 -1224 -16520 -13458 -11298
6436 -11298 -11045 9361 10120 -7406 -14409 -15590 -10966 -1742 -6442 -24559 -24889 -13378 -19322 -16777
6422 -16777 -20423 -24177 -22017 -13037 -11414 -8085 -3099 -4900 723 1098 11232 27253 40313 26881
6408 26881 11229 185 -11882 -18792 -18880 -6948 -9195 -15178 -12439 -18471 -20161 -12083 -921 3872
6394 3872 -4649 -2919 1708 2294 6122 -1045 -9689 2711 15225 10579 6262 -4321 -7748 -7492 -6652
6379 -6652 -1195 144 -9291 -11222 -4870 6863 17249 19976 20282 3527 -3518 -5628 -19956 -24704
6365b4704N78J2991R195M395m280p47m744j1577n152Q961O173J661j0975n710
6351b3935l741N262J3326j0765K415N798M137J1832K273P854P469J135j26j1366
6337A1568J512J447M44j0415k0460L837k142L035J658p312l894N749K362n450
6323a8061O098R810J7684M505J283j7363n980K705l045n207P4j678P716p04l150
$$ plain form
6365 -24704 -24126 -11135 -1940 2455 -1825 -2572 -7316 -18893 -24045 -15084 -8911 -7250 -18225 -23935
6351 -23935 -27676 -22414 -9088 -19853 -17438 -11640 -7503 4329 6602 14456 21925 23060 22934 11568
6337 11568 13080 14527 14971 4556 -15904 -12067 -14209 -11174 -9516 -16828 -20722 -14973 -12611 -18061
6323 -18061 -11963 -2153 15531 20036 21319 3956 -2024 681 -2364 -7571 -7497 -9175 -1459 -2163 -5313
$$ [...]
##END NTUPLES=NMR SPECTRUM
##END=
