##TITLE=Analysis number 329125
Compound Code cc 25801
Book Reference 513/113/33
Project Code adrs
Chemist Name ronp
##JCAMPDX= 6.0         $$ Bruker NMR JCAMP-DX V2.0
##DATA TYPE= NMR SPECTRUM
##DATA CLASS= NTUPLES
##ORIGIN= Bruker BioSpin GmbH
##OWNER= nmr
$$ XWIN-NMR		Version 3.5
$$ Mon Aug  6 10:34:39 2007 GMT Daylight Time (UT+1h)  MAYBRIDGE\nmr@NMR_250MHZ
##.OBSERVE FREQUENCY= 250.131544655141
##.OBSERVE NUCLEUS= ^1H
##.ACQUISITION MODE= SIMULTANEOUS (DQD)
##.ACQUISITION SCHEME= undefined
##.AVERAGES= 16
##.DIGITISER RES= 18
##SPECTROMETER/DATA SYSTEM= dpx250
##.PULSE SEQUENCE= zg30
##.SOLVENT NAME= DMSO
##.SHIFT REFERENCE= (INTERNAL, DMSO, 0, 16.522)
##AUDIT TRAIL= $$ (NUMBER, WHEN, WHO, WHERE, WHAT)
$$ ##TITLE= Audit trail, XWIN-NMR		Version 3.5
$$ ##JCAMPDX= 5.01
$$ ##ORIGIN= Bruker BioSpin GmbH
$$ ##OWNER= nmr
$$ C:\u/data/dgb/nmr/ADRS/220/pdata/1/auditp.txt
$$ ##AUDIT TRAIL=  $$ (NUMBER, WHEN, WHO, WHERE, WHAT)
(   1,<2007-08-06 10:34:16.57 +100>,<MAYBRIDGE\nmr>,<NMR_250MHZ>,
      <created by zg, POWCHK disabled, PULCHK disabled
       configuration hash MD5:
       76 6E 9A 78 1E 09 19 81 EC 84 63 8F B0 6A 59 2D
       data hash MD5: 64K
       1B 2C A6 E1 C5 8B AD 89 F0 63 13 CE 5A F7 12 88>)
(   2,<2007-08-06 10:34:29.86 +100>,<MAYBRIDGE\nmr>,<NMR_250MHZ>,
      <Start of raw data processing
       ef LB = 0.3 FT_mod = 6 PKNL = 1 SI = 32K 
       data hash MD5: 32K
       57 EF 18 85 40 33 9C 8D 57 91 94 B2 C3 3F AD 65>)
(   3,<2007-08-06 10:34:31.43 +100>,<MAYBRIDGE\nmr>,<NMR_250MHZ>,
      <apk 
       data hash MD5: 32K
       82 C8 08 51 A5 97 DD F3 B8 A2 91 3E 8A BF 15 F5>)
(   4,<2007-08-06 10:34:32.19 +100>,<MAYBRIDGE\nmr>,<NMR_250MHZ>,
      <abs ABSG = 5 
       data hash MD5: 32K
       80 9A 87 5E 0B 43 E6 52 10 E4 40 11 8C 0B 36 95>)
$$ ##END=
$$ 
$$ hash MD5
$$ 1C 0F D6 F2 A4 22 1A 49 08 11 C6 C6 5E DC FA BD
##$RELAX= 
##$RELAX= 
##$RELAX= 
##$RELAX= 
##$RELAX= 
##$RELAX= 
##$RELAX= 
$$ Bruker specific parameters
$$ --------------------------
##$DU= <C:\u>
##$EXPNO= 220
##$NAME= <ADRS>
##$PROCNO= 1
##$TYPE= <nmr>
##$USER= <dgb>
##$AMP= (0..31)
100 100 100 100 100 100 100 100 100 100 100 100 100 100 100 100 100 100 
100 100 100 100 100 100 100 100 100 100 100 100 100 100 
##$AQSEQ= 0
##$AQ_mod= 3
##$AUNM= <au_zg>
##$AUTOPOS= <40 >
##$BF1= 250.13
##$BF2= 250.13
##$BF3= 250.13
##$BF4= 250.13
##$BF5= 500.13
##$BF6= 500.13
##$BF7= 500.13
##$BF8= 500.13
##$BYTORDA= 1
##$CFDGTYP= 0
##$CFRGTYP= 5
##$CHEMSTR= <none>
##$CNST= (0..31)
1 1 145 1 1 1 1 1 1 1 1 1 1 1 1 1 1 1 1 1 1 1 1 1 1 1 1 1 1 1 1 1 
##$CPDPRG= <>
##$CPDPRG1= <>
##$CPDPRG2= <>
##$CPDPRG3= <>
##$CPDPRG4= <mlev>
##$CPDPRG5= <mlev>
##$CPDPRG6= <mlev>
##$CPDPRG7= <mlev>
##$CPDPRG8= <mlev>
##$CPDPRGB= <>
##$CPDPRGT= <>
##$D= (0..31)
0 1 0 0 0 0 0 0 0 0.06 0 0 0 0 0 0 0.0002 0 0 0 0 0 0 0 0 0 0 0 0 0 0 
0 
##$DATE= 1186392855
##$DBL= (0..7)
120 120 120 120 120 120 120 120 
##$DBP= (0..7)
150 150 150 150 150 150 150 150 
##$DBP07= 0
##$DBPNAM0= <>
##$DBPNAM1= <>
$$ [...]
##$SUBNAM7= <"">
##$SUBNAM8= <"">
##$SUBNAM9= <"">
##$SW= 20.6930455092707
##$SWIBOX= (0..15)
0 0 3 0 0 0 0 0 0 0 0 0 0 0 0 0 
##$SW_h= 5175.983436853
##$TD= 65536
##$TD0= 1
##$TE= 296.16
##$TE2= 300
##$TE3= 300
##$TEG= 300
##$TL= (0..7)
0 120 120 120 120 120 120 120 
##$TP= (0..7)
150 150 150 150 150 150 150 150 
##$TP07= 0
##$TPNAME0= <>
##$TPNAME1= <>
##$TPNAME2= <>
##$TPNAME3= <>
##$TPNAME4= <>
##$TPNAME5= <>
##$TPNAME6= <>
##$TPNAME7= <>
##$TPOAL= (0..7)
0.5 0.5 0.5 0.5 0.5 0.5 0.5 0.5 
##$TPOFFS= (0..7)
0 0 0 0 0 0 0 0 
##$TUNHIN= 0
##$TUNHOUT= 0
##$TUNXOUT= 0
##$USERA1= <user>
##$USERA2= <user>
##$USERA3= <user>
##$USERA4= <user>
##$USERA5= <user>
##$V9= 5
##$VALIST= <valist>
##$VCLIST= <CCCCCCCCCCCCCCC>
##$VD= 0
##$VDLIST= <DDDDDDDDDDDDDDD>
##$VPLIST= <PPPPPPPPPPPPPPP>
##$VTLIST= <TTTTTTTTTTTTTTT>
##$WBST= 1024
##$WBSW= 4
##$XGAIN= (0..3)
0 0 0 0 
##$XL= 0
##$YL= 0
##$YMAX_a= 309153
##$YMIN_a= -286883
##$ZGOPTNS= <>
##$ZL1= 120
##$ZL2= 120
##$ZL3= 120
##$ZL4= 120
##$ABSF1= 16.522
##$ABSF2= -4.171173
##$ABSG= 5
##$ABSL= 3
##$ALPHA= 0
##$AQORDER= 0
##$ASSFAC= 0
##$ASSFACI= 0
##$ASSFACX= 0
##$ASSWID= 0
##$AUNMP= <proc_1d>
##$AZFE= 0.1
##$AZFW= 0.1
##$BCFW= 0
##$BC_mod= 0
##$BYTORDP= 0
##$COROFFS= 0
##$CY= 12.5
##$DATMOD= 1
##$DC= 0
##$DFILT= <>
##$DTYPP= 0
##$F1P= 14.0000005364418
##$F2P= -0.99999901652339
##$FCOR= 0.5
##$FTSIZE= 32768
##$FT_mod= 6
##$GAMMA= 0
##$GB= 0
##$INTBC= 1
##$INTSCL= 1
##$ISEN= 128
##$LB= 0.3
##$LEV0= 0
##$LPBIN= 0
##$MAXI= 10000
##$MC2= 0
##$MEAN= 0
##$ME_mod= 0
##$MI= 0
##$NCOEF= 0
##$NC_proc= -5
##$NLEV= 6
##$NOISF1= 0
##$NOISF2= 0
##$NSP= 0
##$NTH_PI= 0
##$NZP= 0
##$OFFSET= 16.522
##$PC= 1
##$PHC0= -58.4489
##$PHC1= 5.227679
##$PH_mod= 1
##$PKNL= yes
##$PPARMOD= 0
##$PSCAL= 4
##$PSIGN= 0
##$REVERSE= no
##$SF= 250.13
##$SI= 32768
##$SIGF1= 0
##$SIGF2= 0
##$SINO= 400
##$SIOLD= 32768
##$SREGLST= <1H.DMSO>
##$SSB= 0
##$STSI= 32768
##$STSR= 0
##$SW_p= 5175.98343685301
##$SYMM= 0
##$S_DEV= 0
##$TDeff= 65536
##$TDoff= 0
##$TI= <Analysis number 999999
Compound Code 99
Book Reference 9
Project Code 9>
##$TILT= no
##$TM1= 0
##$TM2= 0
##$TOPLEV= 0
##$USERP1= <user>
##$USERP2= <user>
##$USERP3= <user>
##$USERP4= <user>
##$USERP5= <user>
##$WDW= 1
##$XDIM= 32768
##$YMAX_p= 312497485
##$YMIN_p= -415937
$$ End of Bruker specific parameters
$$ ---------------------------------
##NTUPLES= NMR SPECTRUM
##VAR_NAME=  FREQUENCY,     SPECTRUM/REAL,   SPECTRUM/IMAG
##SYMBOL=    X,             R,               I
##VAR_TYPE=  INDEPENDENT,   DEPENDENT,       DEPENDENT
##VAR_FORM=  AFFN,          ASDF,            ASDF
##VAR_DIM=   32768,         32768,           32768
##UNITS=     HZ,            ARBITRARY UNITS, ARBITRARY UNITS
##FACTOR=    0.157963299565203, 1,           1
##FIRST=     4132.6476996994, 0,             0
##LAST=      -1043.33573715361, 0,           0
##MIN=       -1043.33573715361, -415937,     0
##MAX=       4132.6476996994, 312497485,     0
$$ Real data points
##PAGE= N=1
##DATA TABLE= (X++(R..R)), XYDATA
$$ [...]
16466C6287M2001J5166j85839p952J02337J37866M366j69132j20670J04453L7396
$$ 36287 78288 93454 -92385 -100337 2000 139866 144232 -24900 -145570 -41117 -3721
16455c721j25430J4111M3466J7298O5763N0460q4738m5960L3546L8455j48681
$$ -3721 -129151 -115040 -71574 -54276 11487 61947 -22791 -68751 -35205 3250 -145431
16444a45431O207O0293P3923r4575r1013O5254J7201N8487N8723k4753m7268j54003
$$ -145431 -139224 -78931 -5008 -99583 -190596 -125342 -108141 -49654 9069 -15684 -62952 -216955
16432b16955M7439R4800n6063L7082N9437m1910p6133j64703j6224K5535J06684
$$ -216955 -169516 -74716 -130779 -93697 -34260 -76170 -152303 -317006 -333230 -307695 -201011
16421b01011J01416N7566q4567j71508l9681N2938J46712P0203p1474q3530L8059
$$ -201011 -99595 -42029 -126596 -298104 -337785 -284847 -138135 -67932 -139406 -222936 -184877
16410a84877L0114m9314J08582M8503o3439k4742n2658N777P7832J34593P8459
$$ -184877 -154763 -204077 -95495 -46992 -110431 -135173 -187831 -182054 -104222 30371 108830
16399A08830j23792j0880J57196K7052o8738k2630j5643l5512q0916p8934p5093
$$ 108830 -14962 -25842 131354 158406 89668 67038 51395 15883 -65033 -143967 -219060
16388b19060M8670J15675K4838n1425j23360L230J06087Q3082J6259N2397Q5559
$$ -219060 -170390 -54715 -29877 -81302 -204662 -201432 -95345 -12263 3996 56393 141952
16377A41952o157j04548j6679o7019N7768q3535o8668P7105K9463r15J2065o5755
$$ 141952 135795 31247 14568 -52451 5317 -78218 -146886 -69781 -40318 -41233 -29168 -94923
16365i4923J6631J08927L4400j9826k5205Q4838N6169n7l5922n621j7109m0755
$$ -94923 -78292 30635 65035 45209 20004 104842 161011 160954 125032 119411 102302 61547
16353F1547j10851j40956M0330m3396q380p9555P5883J54404J6622O389j1857
$$ 61547 -49304 -190260 -149930 -193326 -201706 -281261 -205378 -50974 -34352 -27963 -39820
16342c9820O2756K778M8165M0998J7071n657k9405K925q7030p0274K1396q5355
$$ -39820 22936 25714 73879 114877 131948 126291 96886 99811 12781 -57493 -36097 -121452
16330a21452M5555J8125M2868m8655p1345l6232K6779J73858P6018o3261m3193
$$ -121452 -75897 -57772 -14904 -63559 -134904 -171136 -144357 29501 105519 42258 -935
16319i35K5795r376L0744K240L8620N3560l5641q5020q3274o3907O1900J09426
$$ -935 24860 15484 46228 48468 87088 140648 105007 19987 -63287 -127194 -65294 44132
16307D4132P1907K7605K9341K6661l1850p0117K9139j3753q4799j57619k378K1298
$$ 44132 116039 143644 172985 199646 167796 97679 126818 113065 28266 -129353 -131731 -110433
16295a10433k2805O5178J8217K09K8268j0744N280k2919j21127n0999J79310N0373
$$ -110433 -133238 -68060 -49843 -49634 -21366 -32110 -26830 -49749 -170876 -221875 -42565 7808
16283G808l3842O7649O1977j9334L6010r6388j51767P0430N3949N3121L008O5296
$$ 7808 -26034 41615 103592 84258 120268 23880 -127887 -57457 -3508 49613 52621 117917
16271A17917k6627l5883r4785O3527r874J5182n4378M2276n8908o2046J13491
$$ 117917 91290 55407 -39378 24149 14275 29457 -24921 17355 -41553 -103599 9892
16260I892p131j3193O1210k51N4512l2284M2518n8810k0022l9267P959Q0382M04
$$ 9892 2761 -10432 50778 50527 105039 72755 115273 56463 36441 -2826 5133 85515 85919
16247H5919p6362p0383M0354m4356L339M6290j9636k1520L7188l072P4459K092
$$ 85919 9557 -60826 -20472 -64828 -61489 -15199 -34835 -56355 -19167 -22239 52220 54312
16235E4312o0153J4094l644n6379J04087J05655J4011k4781o6310L4142l660r4457
$$ 54312 -5841 8253 4609 -51770 52317 157972 171983 147202 80892 115034 111374 16917
16223A6917j01386N3729M9908r5980n2208J28177k0963k676J12618Q5768l7568
$$ 16917 -84469 -30740 19168 -76812 -129020 -843 -21806 -24482 88136 173904 136336
16212A36336j22554K0810Q8570j52680j89349l6838J6811J52522k3554l994L8143
$$ 136336 13782 34592 123162 -29518 -218867 -255705 -238894 -86372 -109926 -113920 -75777
16201g5777j1838O2535R6723l6562n5517J5365n829J1770k8754J06491K9773n5147
$$ -75777 -87615 -25080 71643 35081 -20436 -5071 -10900 870 -27884 78607 108380 53233
16189E3233j8243j6979j15574n6143Q7208L5325p3166p5364R6839R5288J7855
$$ 53233 34990 18011 -97563 -153706 -66498 -31173 -104339 -179703 -82864 12424 30279
16178C0279l2071k8139O202j52408j30424r5445K3662J71942J78395q3941j27398
$$ 30279 -1792 -29931 -23729 -176137 -306561 -402006 -378344 -206402 -28007 -111948 -239346
16167b39346J15529M9687J70522J16768j47802r8294J8031r5761K5616J26109
$$ -239346 -123817 -74130 96392 213160 65358 -32936 -14905 -110666 -85050 41059
16157D1059q5305M2857M9407k6264J9931Q6079k3547j8178q035n5036q1114n988
$$ 41059 -44246 -1389 48018 21754 41685 127764 104217 86039 78004 22968 -58146 -64134
16145f4134J62416r0424m0928l9386l1933p7702q029O9449M6641K44292J07053
$$ -64134 98282 7858 -33070 -72456 -104389 -182091 -190120 -120671 -74030 170262 277315
16134B77315m6676l1005o7784n382K0259J3609J1926o2809j54000K203k4510m3111
$$ 277315 230639 199634 131850 126468 146727 160336 172262 109453 -44547 -42344 -66854 -109965
16122a09965P1263N429O1377N7753J9344l2946j71925K1492p8557J35227Q1635
$$ -109965 -38702 -33273 28104 85857 105201 72255 -99670 -78178 -156735 -21508 60127
16111F0127n761n4034r4926N3991P4102R9661q982l1505p1711n4026N9828N0230
$$ 60127 54366 332 -94594 -40603 33499 133160 124178 92673 20962 -33064 26764 76994
16099G6994j567J02528j7759j14303q8668K5949m2415n7922M1161J88316P2475
$$ 76994 75427 177955 160196 45893 -42775 -16826 -59241 -117163 -76002 112314 184789
16088A84789n2798k8544r6413j18350k3870O7958J43392M360q9707R5141O8268
$$ 184789 131991 103447 7034 -111316 -135186 -67228 76164 80524 -9183 85958 154226
16077A54226j219j0934j9784J08118L3911o9409j16868p2354l1494J1632J2877
$$ 154226 153007 142073 122289 230407 264318 194909 78041 5687 -25807 -14175 -1298
16066a298Q6186Q0320j25864j65132J9432R9467R8082j39945l8154M9903O7494
$$ -1298 84888 165208 39344 -125788 -106356 -6889 91193 -48752 -86906 -37003 30491
16055C0491Q7090k5745q0978r9225L449n7451Q9950M7022J1045K6412r3090m6244
$$ 30491 117581 91836 10858 -88367 -84918 -142369 -52419 -5397 5648 32060 -61030 -107274
16043a07274j7972j00895l2240M5530M076L7543J1687J9243N8302Q0179L2166
$$ -107274 -125246 -226141 -258381 -212851 -208775 -171232 -159545 -140302 -82000 -1821 30345
16032C0345k4881j1554L9623L0180L1332m4386j00539j7476J35044n3274j35399
$$ 30345 5464 -6090 33533 63713 95045 50659 -49880 -67356 67688 14414 -120985
16021a20985N7277O82N0469q829n2916J4707k7701k4010J9651l7224l0416N0876
$$ -120985 -63708 -63026 -12557 -21386 -74302 -59595 -87296 -111306 -91655 -128879 -159295 -108419
16009a08419Q4733J37920l9401q0454j20420K6391O140j8464j34241Q5921K95246
$$ -108419 -23686 114234 74833 -5621 -126041 -99650 -93510 -111974 -246215 -160294 134952
15998A34952L3262j53081m2236J61091K0974m9374L8971o1079j13641O3654P5372
$$ 134952 168214 15133 -27103 133988 154962 105588 144559 83480 -30161 33493 108865
15987A08865m0730j1040J3382O996n2997q5232j0045J08940O5479k5946j12252
$$ 108865 68135 57095 70477 77473 24476 -60756 -70801 38139 103618 77672 -34580
15976c4580J6564Q5815p6778N2309P2265l1832n8630M8568J4725L7645o8039l1146
$$ -34580 -18016 67799 -8979 43330 115595 83763 25133 73701 88426 126071 58032 26886
15964B6886k3294O8411O3042L2611k5301O2419J04424o9885j27396q5246p0240
$$ 26886 3592 72003 135045 167656 142355 204774 309198 239313 111917 26671 -43569
15953d3569O4391Q9070M7854m6826j1684l0460J21869N2078j02889p1472o930
$$ -43569 20822 109892 157746 110920 99236 68776 190645 242723 139834 68362 61432
15942F1432M8151r70j1595M3248M5924K4547K8549P1665j00790j28870l0559k2878
$$ 61432 109583 108613 97018 140266 186190 210737 239286 310951 210161 81291 50732 27854
15930B7854P4745o6589j59004k6727J05059J06783m2006p0183j9523k6419K3195
$$ 27854 102599 36010 -122994 -149721 -44662 62121 20115 -50068 -69591 -96010 -72815
15919g2815o891M5348L7114j09536n4039J00296K6558l0088J1513M7226p9861
$$ -72815 -79706 -34358 2756 -106780 -160819 -60523 -33965 -64053 -52540 -5314 -85175
15908h5175n6583L0219J09144J99180j08529l49475p7926J50039J17282P6908
$$ -85175 -141758 -111539 -2395 196785 88256 -261219 -339145 -189106 -71824 5084
15898E084l8271P0206O4466O8830o4332j21729K6059J32801P9064K5441j21902
$$ 5084 -33187 37019 101485 170315 105983 -15746 10313 143114 222178 247619 125717
15887A25717j2323N4079O596M9242j54013R0660j2651j14163K644j33158L8958
$$ 125717 113394 167473 174069 223311 69298 159958 147307 33144 35788 -97370 -58412
15876e8412J6157n7490J34477K9186j03852j6076N3330Q9538J6562R1901M752
$$ -58412 -42255 -99745 34732 63918 -39934 -56010 -2680 86858 103420 195321 200073
15865B00073l9210j07955n4669K8399L2867J7369k7552K2073k34j3525o1565m6147
$$ 200073 160863 52908 -1761 26638 59505 76874 49322 71395 71161 57636 -3929 -50076
15853e0076j8936J14200L6603q6445J25621R5565p5998q7796j72623Q1122O0156
$$ -50076 -69012 45188 81791 -4654 120967 216532 140534 52738 -119885 -38763 21393
15842B1393L5799r3823r4381L3495K1996P5316P9365o9018p4999P0372j1358l6847
$$ 21393 57192 -36631 -131012 -97517 -75521 -205 79160 10142 -64857 5515 -5843 -42690
15830d2690l4539j2070K8451q0994M4424J37334o1448j33904n08J0475L9042J8760
$$ -42690 -77229 -89299 -60848 -141842 -97418 39916 -21532 -155436 -155944 -145469 -106427 -87667
15818h7667K3565J11377j2765j4696J16319j8036j69560J8566O1705P4750l5057
$$ -87667 -64102 47275 34510 19814 136133 118097 -51463 -32897 28808 103558 68501
15807F8501j55030M644J24266o0690l6019K43392P4839q0757l6J16355j57830
$$ 68501 -86529 -81885 42381 -18309 -54328 189064 263903 183146 183110 299465 141635
15796A41635r9105o877j42742Q2522O2150N8958m1627n5905J8870M0901l1143
$$ 141635 42530 35653 -107089 -24567 37583 96541 54914 -991 17879 58780 27637
15785B7637l9661N8243M1484j24139j20371J08972J20262J64905L1794j59017
$$ 27637 -12024 46219 87703 -36436 -156807 -47835 72427 237332 269126 110109
15775A10109R9019K8849j18697m1214M6318K3334m0356m0334n0924j24575J71414
$$ 110109 209128 237977 119280 78066 124384 147718 107362 67028 16104 -108471 62943
15764F2943J50939k924o1413j11083k3395r3787p0216J9812j9983Q9937R9035
$$ 62943 213882 210958 149545 38462 15067 -78720 -148936 -129124 -149107 -59170 39865
15753C9865r569J03820M8964n5036K4104l423j57243m8334R9909J05481L4317
$$ 39865 30296 134116 183080 128044 152148 148725 -8518 -56852 43057 148538 182855
15742A82855n9696j68915l3158K5990M6890K6922j37876L7606M6491M9174L0076
$$ 182855 123159 -45756 -78914 -52924 -6034 20888 -116988 -79382 -32891 16283 46359
15731D6359k0634l0541M9553n7313Q973N1814O0610P9695k7260j10265K4547m0312
$$ 46359 25725 -4816 44737 -12576 -3603 48211 108821 188516 161256 50991 75538 35226
15719C5226r6452j61699l9160Q3225Q5096M071j0259M6795M5751R6411M530r3063
$$ 35226 -61226 -222925 -262085 -178860 -93764 -89693 -99952 -53157 -7406 89005 93535 472
15707D72j01814J324J84747J47149J6563p7469l5444m6000j8573J13134P1180
$$ 472 -101342 -100018 84729 231878 248441 170972 135528 89528 70955 184089 255269
15696B55269j45506m6657l6427N5479J3675n5837k6668Q9305J489j34424l4883
$$ 255269 109763 63106 26679 82158 95833 39996 13328 102633 104122 -30302 -65185
15685f5185k2615L2571J43106k827n5390R8200M8801p0056l4047r860n8049k5811
$$ -65185 -87800 -55229 87877 85050 29660 127860 176661 106605 72558 62698 4649 -21162
15673b1162K4651Q5947M9922Q828P0237P1919j05237p9197M2998k32653o4686
$$ -21162 3489 89436 139358 148186 218423 290342 185105 105908 148906 -83747 -148433
15662a48433J2178P5385J35825l371j01716n3203O802j3444M0492M6007n587J16970
$$ -148433 -136255 -60870 74955 71584 -30132 -83335 -76533 -89977 -49485 -3478 -9065 107905
15650A07905k5528k6440n6327m0125J05116J15835k9488J21440N1683q3554n3384
$$ 107905 82377 55937 -390 -40515 64601 180436 150948 272388 324071 240517 187133
15639A87133Q9518q054j70111j18077K8652J02463l6205q3112j1430k5255J09408
$$ 187133 276651 268597 98486 -19591 9061 111524 75319 -7793 -19223 -44478 64930
15628F4930J51931l709m8526n00m2949j34513Q1241J34787k6911J3182K6921j42734
$$ 64930 216861 213152 164626 164126 121177 -13336 67905 202692 175781 188963 215884 73150
15616G3150j80268k2328O2890j5614m5259J41764o8361n0117r6394m2288O5324
$$ 73150 -107118 -129446 -66556 -82170 -127429 14335 -54026 -104143 -200537 -242825 -177501
15605a77501J95299J21310j45954K7302K2792l7786o149n698N1149R0935o683
$$ -177501 17798 139108 -6846 20456 43248 5462 -687 -6385 44764 135699 129016
15594A29016m5597m3026P1547n4610J49821R4713P983j30205k6816J44210J5693
$$ 129016 83419 40393 111940 57330 207151 301864 309847 179642 152826 297036 312729
15583C12729j00901j55917O9889K3765j26726r0449M1244J88891J00620R4473
$$ 312729 211828 55911 125800 149565 22839 -67610 -26366 162525 263145 357618
15573C57618j81150L719O8242l2622q6040j09577N361L0985J5626J5435j8487
$$ 357618 176468 180187 248429 215807 129767 20190 25551 56536 72162 87597 69110
15562F9110r8606K3447P0505l0282K3660q0766p8902J35461K1315o6061L2264
$$ 69110 -29496 -6049 64456 34174 57834 -22932 -101834 33627 54942 -11119 21145
15551B1145l9212J03898N3888Q878k2671j20093L3000J2425m6842R8182Q0797
$$ 21145 -18067 85831 139719 148597 125926 5833 38833 51258 4416 102598 183395
15540A83395O938r7550j36897L2579Q4617K4740p642j8650O7572L3543K4622O1520
$$ 183395 190333 92783 -44114 -11535 73082 97822 90180 71530 139102 172645 197267 258787
15528B58787O5555m6561M5288k3442j41006p6630l8851j1938L0456k0901o2330
$$ 258787 324342 277781 323069 299627 158621 81991 43140 31202 61658 40757 -21573
15517b1573n4588J13252j7963j57025J61879J37916j1231K5305m5742Q9353p9763
$$ -21573 -76161 37091 19128 -137897 23982 161898 150667 175972 130230 219583 139820
15506A39820P3546j4792m6634n8168n15M8307j35420p2615J48241N1579Q383n9731
$$ 139820 213366 198574 151940 93772 93257 141564 6144 -66471 81770 133349 141732 82001
15494H2001m9160K1406l096m9416j30651N3127J6092k8597o7545J39649K0442
$$ 82001 32841 54247 51151 1735 -128916 -75789 -59697 -88294 -155839 -16190 4252
15483D252o182R1663J18341R6499k428m6857j07444q2045k3920q561l8269o687
$$ 4252 -1930 89733 208074 304573 302145 255288 147844 65799 41879 33318 -4951 -11638
15471a1638J29738N8823j989k0293m4263M5776M0279q0971j28247K7103J26745
$$ -11638 118100 176923 174934 154641 110378 156154 196433 115462 -12785 14318 141063
15460A41063j3209l4129n4831J1448K6127M9395j1062n7432L152K0972J9841r2877
$$ 141063 127854 93725 38894 50342 76469 125864 114802 57370 60522 81494 101335 8458
15448H458m6742n9130j03794Q9480P9173p5987N1531P7823J28708j06291n1411
$$ 8458 -38284 -97414 -201208 -111728 -32555 -108542 -57011 20812 149520 43229 -8182
15437h182J1615k5221j20232O3101J9510K8991l2357J6688N4276M7041N5965L213
$$ -8182 3433 -21788 -142020 -78919 -59409 -30418 -62775 -46087 8189 55230 111195 114408
15425A14408j71917j11974o790J40330L6176J1314J23698M1022l9960n8781j01116
$$ 114408 -57509 -169483 -176273 -35943 233 11547 135245 176267 136307 77526 -23590
15414b3590n6556q403J68461M1358K6258n2981n2031J14282M791K506M1911K1308
$$ -23590 -80146 -88549 79912 121270 147528 94547 42516 156798 161589 164095 206006 227314
15402B27314j28271m4792j49652r5252O0891R4291k0907Q9612k7708n7465o119
$$ 227314 99043 54251 -95401 -190653 -129762 -35471 -56378 33234 5526 -51939 -58058
15391e8058J15014L5063n6160p9582m4520N501J21675Q1860n4958r070J5974L0811
$$ -58058 56956 92019 35859 -43723 -88243 -82742 38933 120793 65835 56765 72739 103550
15379A03550P3111K0116N5643r0608l4122l5830N3857J874j5863K8138q1625q4412
$$ 103550 176661 196777 252420 161812 127690 91860 145717 147591 131728 159866 78241 -6171
15367f171q8269O7470J4192Q8568J05421N5593M419m9540o6392J9963l2192K7766
$$ -6171 -94440 -26970 -12778 75790 181211 236804 241223 191683 125291 145254 113062 140828
15355A40828m2929r7145P1876N6472n9474n5382Q7854M5212K6805l1833n4012
$$ 140828 97899 754 72630 129102 69628 14246 102100 147312 174117 142284 88272
15344H8272j4437M5881J0519j08530m836M5391j20835K9415N163N8925L9276M587
$$ 88272 73835 119716 130235 21705 16869 62260 -58575 -29160 -23997 34928 74204 78791
15332G8791Q5408p100P06Q6524K5635j23253j00516R8608L1970k4234O1331L4205
$$ 78791 164199 157099 157805 244329 269964 146711 46195 144803 176773 152539 213870 248075
15320B48075q7063q9737r5916J3117Q7808K8326L2352J9767k5891m7769J8016
$$ 248075 161012 71275 -24641 -11524 76284 104610 136962 156729 130838 83069 101085
15309A01085q9000P5401j07908j20625k2612J20512M3688P4717K3378j15019k666
$$ 101085 12085 87486 -20422 -141047 -163659 -43147 541 75258 98636 -16383 -19049
15298a9049L4860Q7488l6655q2518Q565j1713j31079l2316J46369J17990L4141
$$ -19049 15811 103299 66644 -15874 -7309 -19022 -150101 -182417 -36048 81942 116083
15287A16083k1878R5727N7481j4916j1284K3517K6779r9516J5349J09441Q858
$$ 116083 94205 189932 247413 232497 221213 244730 271509 171993 187342 296783 305641
15276C05641r0885p9602m9608O2020O7200o4483o6040R8004j69937r3136R9484
$$ 305641 214756 135154 85546 147566 214766 150283 84243 182247 12310 -80826 18658
15265A8658n806l6330J19200j1871m1219J60743n2217j02244K7705K7280J9898
$$ 18658 12852 -23478 95722 83851 42632 203375 151158 48914 76619 103899 123797
15254A23797o5119j0481k5430l5025j2837Q7716P6638R5548M3130o0911n8977
$$ 123797 58678 48197 22767 -12258 -25095 62621 139259 234807 277937 217026 158049
15243A58049n3660P9674R2650p7086j08057l1286K6067L2093J6121N3604R6783
$$ 158049 104389 184063 276713 199627 91570 60284 86351 118444 134565 188169 284952
15232B84952J3806p9786k9304j10127j0445K6861p9706l4872N5099L9717q7908
$$ 284952 298758 218972 189668 79541 69096 95957 16251 -18621 36478 76195 -11713
15221a1713l4548p6616J80836J17192k4042n9618J381m1289j1215M2921J9868
$$ -11713 -46261 -122877 57959 175151 151109 91491 92872 51583 40368 83289 103157
15210A03157m6096M0130K4633K3160p1708q8415q8574q9995K5961J30352J17798
$$ 103157 57061 97191 121824 144984 73276 -15139 -103713 -193708 -167747 -37395 80403
15199H0403n3639q064n3260j26412J09029j5751R8933J66170K6830r921M6699
$$ 80403 26764 18700 -34560 -160972 -51943 -67694 31239 197409 224239 214318 261017
15188B61017j06782j33396J5095m4695R636J68676R4749k5130j24283n6559P0373
$$ 261017 154235 20839 35934 -8761 875 169551 264300 239170 114887 58328 128701
15177A28701M6775N088J26622J44508p6734r8565n3828L1752K7090m0191q9059
$$ 128701 175476 180564 307186 451694 374960 276395 222567 254319 281409 241218 152159
15166A52159k2600n5795j0357O235j56669j4396J90049O1036J8646M1541j03498
$$ 152159 129559 73764 63407 69642 -87027 -101423 88626 149662 168308 209849 106351
15155A06351n0455J8696L4143k9770J8796m7780j10067j71J39422N1736N9800
$$ 106351 55896 74592 108735 78965 97761 49981 -60086 -60257 79165 130901 190701
15144A90701R6056J813l8792m7888j09840k5415j14212R4171J92573N3369M3146
$$ 190701 286757 288570 249778 201890 92050 66635 -47577 46594 239167 292536 335682
15133C35682p3438j16123o6693J1268j5484l3825K5320J59012P5136j15126Q4860
$$ 335682 262244 146121 79428 90696 75212 41387 66707 225719 300855 185729 270589
15122B70589L6831r5569j14789j024N7933L7440L4195n0195J4089M792l3928l0360
$$ 270589 307420 211851 97062 96038 153971 191411 225606 175411 189500 194292 160364 130004
15110A30004n828n5951N2993m0433N0351Q1767l1195M2331N4334L2881j12701
$$ 130004 124176 68225 121218 80785 131136 212903 181708 224039 278373 311254 198553
15099A98553n5509L5729P6638J1071j11031m5452J3074M0626J28480N3810l0808
$$ 198553 143044 178773 255411 266482 155451 109999 123073 163699 292179 345989 315181
15088C15181p3484p4766J5199R5192k0645L6850m0775O8387R3261n0765l1154
$$ 315181 241697 166931 182130 277322 256677 293527 252752 321139 414400 363635 332481
15077C32481L1636J3592j31186k4864q3830j70186j6959J50997Q1811l9921j729
$$ 332481 364117 377709 246523 221659 137829 -32357 -49316 101681 183492 143571 141842
15066A41842j07318n3507N8460K5039J03473J2033K2663n3355k3955J9134j58022
$$ 141842 34524 -18983 39477 64516 167989 180022 202685 149330 125375 144509 -13513
15055a3513j10344K2761P6279r0155K3133Q3441M8564O532K5956k8603K4183j19923
$$ -13513 -123857 -101096 -24817 -114972 -91839 -8398 40166 46698 72654 44051 68234 -51689
15043e1689L3532M2708m4409n5086k2034R937N3520O7027N0717l8480p868J03754
$$ -51689 -18157 24551 -19858 -74944 -96978 -87041 -33521 33506 84223 45743 37875 141629
15031A41629P3056j39774n7427N6528K6537O5687N948j0755j19733j17701P5178
$$ 141629 214685 74911 17484 74012 100549 166236 172184 161429 41696 -76005 -827
15020h27J37374n355n8406o0373r2055L8869J10701l663m5302p1356L1883J39082
$$ -827 136547 131192 72786 12413 -79642 -40773 69928 66265 20963 -50393 -18510 120572
15008A20572O0710K9694R2913n8980n1858J7530m0344n9802J5553m579J1804O3020
$$ 120572 181282 210976 303889 244909 193051 210581 170237 110435 125988 121409 133213 196233
14996A96233k2473n4264L4423q6032K2028M5317K8272K4132K1519j33518o1612
$$ 196233 173760 119496 153919 67887 89915 135232 163504 187636 209155 75637 14025
14985A4025J0549q9001M1884Q6150j03277l8896J11031J50309J19765R70O4363
$$ 14025 24574 -64427 -22543 63607 -39670 -78566 32465 182774 302539 303509 367872
14974C67872m5744L3272n1299j38628j35251K5044O4952n5769N4515J17079J20737
$$ 367872 322128 355400 304101 165473 30222 55266 120218 64449 118964 236043 356780
14963C56780q8812k3593K5321r4438p4059q2779j20439K8349J16136P2383J39975
$$ 356780 267968 244375 269696 175258 101199 18420 -102019 -73670 42466 114849 254824
14952B54824j8183l0745p5421m187R4334M1037j24041j44052P8764O3359K3314
$$ 254824 236641 205896 130475 126288 220622 261659 137618 -6434 72330 135689 159003
14941A59003J2985k3162L1967P2223J21706q8654j02234P2804m6366o935N6600
$$ 159003 171988 148826 180793 253016 374722 286068 183834 256638 210272 203337 259937
14930B59937P1198n1818o467k8016j11641j43174L3715J02933k4621O5236P167
$$ 259937 331135 279317 272850 244834 133193 -9981 23734 126667 102046 167282 174449
14919A74449k6095J37148N4865j44964m9054O4640J3700q6153j18888j10368n5496
$$ 174449 148354 285502 340367 195403 146349 210989 224689 138536 19648 -90720 -146216
14908a46216Q6497J6687K5592K04519J29846o1705q6294q3529M2968O2732q9426
$$ -146216 -59719 -43032 -17440 187079 316925 255220 168926 85397 128365 191097 101671
14897A01671k4805n0532o5989M4285J39251P3024l1339m7536l4640J45234J980
$$ 101671 76866 26334 -39655 4630 143881 216905 185566 138030 103390 248624 250604
14886B50604j40343p0231j07068J044J12667Q5932p0266j5426J09089P2472P8624
$$ 250604 110261 40030 -67038 -65994 46673 132605 62339 46913 156002 228474 307098
14875C07098n0225r4805K271M9210J657M9148P522j40807q973n357O88k9411J11872
$$ 307098 256873 162068 164339 213549 215206 264354 271876 131069 122096 116739 117427 88016 199888
14862A99888L8584O068K0729N4209j53354k3958J1455l4496J9364Q9009j0788
$$ 199888 238472 244540 265269 319478 166124 142166 153621 119125 138489 227498 216710
14851B16710j26979J1191J02539L4924j9580j8008r8144q4977J08958R6290N3778
$$ 216710 89731 100922 203461 238385 218805 200797 102653 17676 126634 222924 276702
14840B76702R7424M5645J6460J2705j46107j44846l2923P650q3165P7566R5379
$$ 276702 374126 419771 436231 448936 302829 157983 125060 132710 49545 127111 222490
14829B22490l3791J1885p8531P0832k4584n8540j4856J0165k9346J181O1294N176
$$ 222490 188699 200584 122053 192885 168301 109761 94905 105070 75724 76905 138199 143375
14817A43375k3896O0714J08353K0195j0850N960J7733K7605K5879P305o7698j35922
$$ 143375 119479 180193 288546 308741 297891 303851 321584 349189 375068 382373 314675 178753
14805A78753q1747j4070J5323L382N6348O8984n2496N3635L9660q7832l244r031
$$ 178753 97006 82936 98259 101641 157989 226973 174477 228112 267772 179940 176696 167665
14793A67665r534p8140J44982J2859n9910K2318p1100n1876l566j4737J07542
$$ 167665 158131 79991 224973 237832 177922 200240 129140 77264 73698 58961 166503
14782A66503J05627l7383r675r1218N2555N9057m3336l0414m4076O7373M7594
$$ 166503 272130 234747 225072 133854 186409 245466 202130 171716 127640 195013 242607
14771B42607n027p0551o2362k5276J0995Q1752j3000Q685o9426l5994J6966l0793
$$ 242607 237580 167029 104667 79391 90386 172138 159138 167823 98397 62403 79369 48576
14759D8576N1472k5595m1780o181J08536R6210q8668M5087K9335j5724j15958
$$ 48576 100048 74453 32673 26492 135028 231238 142570 187657 216992 201268 85310
14748H5310j3033J40818K11205L2917k16494l7877N7690J3503k6752N0729r103
$$ 85310 72277 213095 424300 457217 240723 202846 260536 274039 247287 298016 288913
14737B88913K2194N677l6602n2715j39519l471M2816j273o3319p3028K9989J32098
$$ 288913 311107 316784 280182 227467 87948 84477 127293 126020 62701 -10327 19662 151760
14725A51760J17438K668M8916J835J7993J9323m4374M7752Q0146l3129q8945p9866
$$ 151760 269198 271866 320782 322617 340610 359933 315559 363311 443457 410328 321383 241517
14713B41517P1341J00237n9977L259p6575j58140Q5486R168o2443O2192J8409
$$ 241517 312858 413095 353118 356377 279802 121662 207148 216316 153873 216065 234474
14702B34474M0887n622m146K7457Q996N224R3584J3961m8848k10565K9544m6007
$$ 234474 275361 269739 265593 293050 302046 307270 400854 414815 365967 155402 184946 138939
14690A38939j20817K8239L9198K7088J78365P6697j06104p0760O1524J928n0484
$$ 138939 18122 46361 85559 112647 291012 367709 261605 190845 252369 254297 203813
14679B03813J2303N7743j9695j03172j06457L389J12727J25825P1938P354n509
$$ 203813 216116 273859 254164 150992 44535 47924 160651 286476 358414 365768 360259
14668C60259p7324J1842O3694M0960p734j79284k9607k0849Q9802P2929J2593
$$ 360259 282935 294777 358471 399431 391697 212413 182806 161957 251759 324688 337281
14657C37281O7251P666q5689l8251l1289n1943J06629Q5260L2890m5344P4572
$$ 337281 404532 412198 326509 288258 256969 205026 311655 396915 429805 384461 459033
14646D59033J3079j23374j70080J52J41845k0928p4347j47466K0173J76188J13534
$$ 459033 472112 348738 178658 178810 320655 299727 225380 77914 98087 274275 387809
14635C87809j7882n8992k0913o963J05765M5944m3441m1609j16408j2861J35322
$$ 387809 369927 310935 290022 283059 388824 434768 391327 349718 233310 220449 355771
14624C55771j1258n4311P6633J7112k2645o7406r472K2087p1764r3140j105k8507
$$ 355771 344513 290202 366835 383947 361302 293896 284424 306511 234747 141607 140502 111995
14612A11995J2701Q0178Q1743n3074J4538o9727m0902j4628Q3586K8943o7160
$$ 111995 124696 204874 286617 233543 248081 178354 137452 122824 206410 235353 168193
14601A68193j2009M3179J3270j10280P7O2862M2139q080P8465J5285k6239M1433
$$ 168193 156184 199363 212633 102353 102430 165292 207431 199351 277816 293101 266862 308295
14589C08295J24749p0062p4500K7395j4768N256L6661n1954j04887m9161N0792
$$ 308295 433044 362982 288482 315877 301109 306365 343026 291072 186185 137024 187816
14578A87816J26261j2263M2645L4445j28445j25889l9016O2536J19502m8329j26326
$$ 187816 314077 301814 344459 378904 250459 124570 85554 148090 267592 219263 92937
14567I2937k6548P8142L3908K5373Q8980M0273r1246j80231q1972M7463J75357
$$ 92937 66389 144531 178439 203812 292792 333065 241819 61588 -20384 27079 202436
14556B02436O7649j4971K0403R5824k4387m3921n0183P885Q8418k7866K7366n3955
$$ 202436 270085 255114 275517 371341 346954 303033 252850 260735 349153 321287 348653 294698
14544B94698N067m7559j8539l6219p0303k9067J1386n678J3270L8101R534j06197
$$ 294698 299765 252206 233667 197448 127145 98078 109464 103786 117056 155157 164691 58494
14532E8494j4656Q3031M7064k4365o9731j5477J8557L279n2744N7693J65146K5106
$$ 58494 43838 126869 173933 149568 79837 64360 82917 86196 33452 91145 256291 281397
14520B81397O5383p5658j1052l8889j0449l0732o8254J1956P6034j0649J8195
$$ 281397 346780 271122 260070 221181 210732 180000 111746 123702 199736 189087 207282
14509B07282n0300o0159r5941n1326J39148J12812P7099q0857j07732j6122Q5327
$$ 207282 156982 96823 882 -50444 88704 201516 278615 197758 90026 73904 159231
14498A59231n785O8366k9899J5082J23732J7000r6185o0315M783m8307Q9608K02537
$$ 159231 153446 221812 191913 206995 330727 347727 251542 191227 196010 147703 237311 439848
14486D39848n1633j05762L5940r7864o2277J27259j1642P400j22825j2056J13334
$$ 439848 388215 282453 318393 220529 158252 285511 273869 281269 158444 146388 259722
14475B59722R0752M797j03460p1013m29O7642M8030r950p8298l13J17376O2400
$$ 259722 350474 355271 251811 180798 180369 248011 296041 286091 207793 207480 324856 387256
14463C87256o3028L1787J19322J7618m1109j12343r1657k12108j1855J61448R7241
$$ 387256 324228 356015 475337 492955 451846 339503 247846 35738 23883 185331 282572
14452B82572j14693q2537m5872J66655p595r6171R2715R827m9560j64239j01438
$$ 282572 167879 85342 39470 206125 198530 102359 195074 204901 155341 -8898 -110336
14441a10336J2292J51827P1523K6239M7612P5991k7620L1539K0564j8243j81p5648
$$ -110336 -98044 53783 125306 151545 199157 275148 247528 279067 299631 281388 281207 205559
14429B05559j8919Q9091N215J27237J5984k44314o9778R0162K6825J33254j50947
$$ 205559 186640 275731 280946 408183 424167 179853 110075 200237 227062 360316 209369
14418B09369p8836j184m306J1396p688L0180N4321N7822O3586m9657O4703o0982
$$ 209369 130533 129349 125043 136439 128751 158931 213252 271074 334660 285003 349706 288724
14406B88724j17066p6624Q3590R5919j00825m3012R0249J01474M2730K9560n6710
$$ 288724 171658 95034 178624 274543 173718 130706 220955 322429 365159 394719 338009
14395C38009K2082j03756J34962N928N1299O7789J1683j4935p9774q8801p6820
$$ 338009 360091 256335 391297 397225 448524 516313 527996 513061 433287 344486 267666
14384B67666K2466P9979p0695j69884M9746P2236l0044J2062l0889Q1159M9797
$$ 267666 290132 370111 299416 129532 179278 251514 221470 233532 202643 283802 333599
14373C33599j4876k2661J16991N763n2183l456L7219k1267k4958l1605m8360j2735
$$ 333599 318723 296062 413053 418816 366633 363177 400396 379129 354171 322566 274206 261471
14361B61471O8306J24985J6105q9458O8666J49059j8244r9793n8680q9218m9358
$$ 261471 329777 454762 470867 381409 450075 599134 580890 481097 422417 333199 283841
14350B83841l679j59959p0728J19801N5103L9420K1943j38989l5074m9855R8394
$$ 283841 280162 120203 49475 169276 224379 263799 285742 146753 111679 61824 160218
14339A60218J24046j30665o2912M0593J2081L1237k4441o1246M7263J1481M9060
$$ 160218 284264 153599 90687 131280 143361 174598 150157 88911 136174 147655 196715
14328A96715J51792J24596K7059o8853j27799J1673R215L0921M2857j09631q2269
$$ 196715 348507 473103 500162 431309 303510 315183 324398 355319 398176 288545 206276
14317B06276q3859p799J14649J04813o0996j32622m2650K6052N0186R3371J11521
$$ 206276 122417 114618 229267 334080 273084 140462 97812 123864 174050 267421 378942
14306C78942j57733j62597M005O2618q100O1810J810M8587Q37j17764J1999L5327
$$ 378942 221209 58612 62617 125235 117135 178945 180755 229342 230179 112415 124414 159741
14294A59741l3425O6238M9842N209K7618O5966J2522o528Q5373r3797j43559k6605
$$ 159741 126316 192554 242396 247605 275223 341189 353711 347183 432556 338759 195200 168595
14282A68595n151Q235J15930N1781l1684M6837O5724j77436r6627Q4164J8992
$$ 168595 163444 171679 287609 339390 307706 354543 420267 242831 146204 230368 249360
14271B49360J2135j4276P4943K2884N6861p764m8397k2354k4517O1955J9857p1923
$$ 249360 261495 247219 322162 345046 401907 394143 345746 323392 298875 360830 380687 308764
14259C08764J24996J3271o7503q5962P0835n4218O1682m1294L6223N1790j8230
$$ 308764 433760 447031 379528 293566 364401 310183 371865 330571 366794 418584 400354
14248D00354q4857L1524j8100J7159L8718J6389o8609k2458j5549j6026R6019
$$ 400354 315497 347021 328921 346080 384798 401187 332578 310120 294571 278545 374564
14237C74564R298j02576p6258J4961J4538J12308l5843r2407K9098o83K7102J0486
$$ 374564 383862 281286 205028 219989 234527 346835 310992 218585 247683 247000 274102 284588
14225B84588J8496j09358j5842L4495Q3838m319n1243J4726o2478j25497J27171
$$ 284588 303084 193726 177884 212379 296217 291898 240655 255381 192903 67406 194577
14214A94577J29143M5368l8150q0413l5217R0381M6832N8225m2571j9996R7120
$$ 194577 323720 369088 330938 250525 215308 305689 352521 410746 368175 348179 445299
14203D45299l1876j6953p7354Q7912O1166l581l5011j72759K522q9769L0108J27928
$$ 445299 413423 396470 319116 407028 468194 464613 429602 256843 259365 169596 199704 327632
14191C27632R3746Q8740k0194j12326m4081P6651M0624n5048K6863N1506Q001
$$ 327632 421378 510118 489924 377598 333517 410168 450792 395744 422607 474113 482114
14180D82114K9927l1967k8821k7697l8091j7425r4272P5103M6458j0418o800j4203
$$ 482114 512041 480074 451253 423556 385465 368040 273768 348871 395329 384911 378111 363908
14168C63908l6426o8596m5697J8409j2568L0499n5977M8614M8483J8603N1402
$$ 363908 327482 258886 213189 231598 219030 249529 193552 242166 290649 309252 360654
14157C60654P7001j37061j99148j8530J81068R0767P7875K9362j56469Q337Q3188
$$ 360654 437655 300594 101446 82916 263984 354751 432626 461988 305519 313856 397044
14146C97044J7750j9800l3620l0830K696N151J6972K1684P4451j4893j1782r1883
$$ 397044 414794 394994 361374 330544 333240 338391 355363 377047 451498 436605 424823 332940
14134C32940R8733M88j59219R7500N393n3259k3405j01349n4117N0290N9809N667
$$ 332940 431673 432161 272942 370442 375835 322576 299171 197822 143705 193995 253804 259471
14122B59471l3759Q6603m6101o8993j0245O6008O1622R3378O1151n7547M9067
$$ 259471 225712 312315 266214 197221 186976 252984 314606 407984 469135 411588 460655
14111D60655j3226q9209q7042J07954J31706r1146m4732m8198N0103J3963J23291
$$ 460655 447429 358220 271178 379132 510838 419692 374960 326762 376865 390828 514119
14100E14119l7312j25826q3191Q7756M9146o1005j11778K0319q429J2179Q8411
$$ 514119 476807 350981 267790 355546 404692 343687 231909 252228 243799 255978 344389
14089C44389N4737r3386O088R5499Q548n5718J10082M2263q9668o3695N9396R9003
$$ 344389 399126 305740 311828 407327 415875 360157 470239 512502 422834 359139 418535 517538
14077E17538o1836o9663q373O1556j9790j4781O1286p805n3249m2133m1750n7000
$$ 517538 455702 386039 377666 439222 419432 404651 465937 458132 404883 362750 321000 264000
14065B64000N0946J10161j3724o2480j3682q0858l4615J14660N9989m8344K1661
$$ 264000 314946 425107 411383 348903 335221 254363 219748 334408 394397 346053 367714
14054C67714l2782j3850O4112m5563k8096J96420M91p4169M0540m4657M2384l8009
$$ 367714 334932 321082 385194 339631 311535 507955 508446 434277 474817 430160 472544 434535
14042D34535L7920K6697n87k3751q5190j5015m6003r1743J3451k1474L5320P5520
$$ 434535 472455 499152 498565 474814 389624 374609 328606 236863 250314 228840 264160 339680
14030C39680P6639J10600q846n9816L4792L1281p428q274j11391m5431p480P0369
$$ 339680 416319 526919 518073 458257 493049 524330 516902 508628 397237 351806 344326 414695
14018D14695n3177Q4055J06564q0403k1576k6959K8459q3531K9777Q666k3677
$$ 414695 361518 445573 552137 471734 450158 423199 451658 368127 397904 406570 382893
14007C82893N1397j32063k3539k527K8869P1184R2561P1868j02233j09351N2794
$$ 382893 434290 302227 278688 276161 305030 376214 468775 540643 438410 329059 381853
13996C81853p5681m2468J29347J70823J1901k6177j2307j0464k2410P4749P9351
$$ 381853 306172 263704 393051 563874 575775 549598 537291 526827 504417 579166 658517
13985F58517j22238p9234k5150l7703J66320M9731j33135j25462N909M4964o0574
$$ 658517 536279 457045 431895 394192 560512 610243 477108 351646 357555 402519 341945
13974C41945O816l7633j6929J8278J70828K4716n4901M4806J16832Q7818O188
$$ 341945 348761 311128 294199 312477 483305 508021 453120 497926 614758 702576 708764
13963G08764N064p8175r7457m8715j15714L4621J45809N2461R550l1L0215J5871
$$ 708764 713828 635653 538196 489481 373767 408388 554197 606658 616208 616177 646392 662263
13951F62263j2717j35610N5756J47392L323p3380l5899J25931P9031j00881J63554
$$ 662263 649546 513936 569692 717084 720407 647027 611128 737059 816090 715209 878763
13940H78763l3782j61676J7647j01728j8457P1974K5866m7650l5793m9713o9102
$$ 878763 844981 683305 700952 599224 580767 652741 678607 630957 595164 545451 476349
13929D76349J4754q4880l0646R4606p6878J23003R3524o6416l0674P5376J06287
$$ 476349 491103 406223 375577 470183 393305 516308 609832 543416 512742 588118 694405
13918F94405m6338p6930q6681N7856L6742P9387m773m432O724O1629m5689K3478
$$ 694405 648067 571137 484456 542312 579054 658441 653668 649236 655960 717589 671900 695378
13906F95378p511m8018K4755O9593l2285j09891l0684J40289N471L2227R0112
$$ 695378 687867 639849 664604 734197 701912 592021 561337 701626 707097 739324 829436
13895H29436Q908K53R0877M5705m3711o8040l6807J48073R5267J0727r0574n6891
$$ 829436 838344 838597 929474 975179 931468 863428 826621 974694 1069961 1080688 990114 933223
13883I33223o2354l2882j037K8387N6245j4734L8655M119r086O7336r0915j26100
$$ 933223 870869 837987 836950 865337 921582 906848 945503 949622 940536 1007872 916957 790857
13871G90857r1694p031K4649O6999N415r8485j15607O1626P1304r2255l4400K7987
$$ 790857 699163 692132 716781 783780 789195 690710 575103 636729 708033 615778 581378 609365
13859F09365L2406P9133o5641o8429q5412n1236r9145P2898J28677P3437l76j41923
$$ 609365 641771 720904 655263 586834 501422 450186 351041 423939 552616 626053 625677 483754
13847D83754j55263j8959j2336J46939J7015n0678K8799o427l2506q6232q0279
$$ 483754 328491 309532 297196 444135 461150 410472 439271 432844 400338 314106 233827
13836B33827K2457P7707M877J02948J43255l6167l2654j07952l0574N1773o778
$$ 233827 256284 333991 338868 441816 585071 548904 516250 408298 377724 429497 422719
13825D22719J60193k5131j64755J3927Q1158P9250J0468m4713r4078L6054J21997
$$ 422719 582912 557781 393026 406953 488111 567361 577829 533116 439038 475092 597089
13814E97089K3646j23557n8719J29581o5022o3048L2415M645J95162J86332j677
$$ 597089 620735 497178 438459 568040 503018 439970 472385 477030 672192 858524 856847
13803H56847j63460k14263l7136M7613L9212J24455N4097M3355q4748o7792n3228
$$ 856847 693387 479124 441988 489601 528813 653268 707365 750720 665972 598180 544952
13792E44952J01116K5823n1454J9558r2800n9091P7313L3162M9881K7839n1740
$$ 544952 646068 671891 620437 639995 547195 488104 565417 598579 648460 676299 624559
13781F24559m4471J9251J5236P1882K7815j05420J8051J36316j03904m6032K724
$$ 624559 580088 599339 614575 686457 714272 608852 626903 763219 659315 613283 616007
13770F16007O2609J2860r754j40481m7856k4215Q0182l6190K774R0972Q9982n1200
$$ 616007 678616 691476 681722 541241 493385 469170 549352 513162 515936 606908 696890 645690
13758F45690k3035k1939K3169j4878o7420p1532N4174J56281N198p9152r8799
$$ 645690 622655 600716 623885 609007 541587 470055 524229 680510 685708 606556 507757
13747E07757j7089N2678M1126M6049J38527r7525o1473Q9817N2359L3386q3565
$$ 507757 490668 543346 584472 630521 769048 671523 610050 699867 752226 785612 702047
13736G02047j36716j50366O1315J6021L922O8273Q1215J31449K6749L6264j20677
$$ 702047 565331 414965 476280 492301 496223 564496 645711 777160 803909 840173 719496
13725G19496n9852R0216M5385j18913k703k4562L2569q796P1717L4327J4893k6812
$$ 719496 659644 749860 795245 676332 673629 649067 681636 672840 744557 778884 793777 766965
13713G66965M0670o779q7184R4037n0719j3148L9230m0342n775n1301n4422r9062
$$ 766965 807635 800856 713672 807709 756990 743842 783072 742730 736955 685654 631232 532170
13701E32170n5208j6289R5544j9027N1905K2978l2184N9027Q7198n9497m3741
$$ 532170 476962 460673 556217 537190 589095 612073 579889 638916 726114 666617 622876
13690F22876L7683P8609J11667J1543k2713J3325j03711o2801M1983J8433j2903
$$ 622876 660559 739168 850835 862378 839665 852990 749279 686478 728461 746894 733991
13679G33991K3384N2956J1109K5411N4366Q1267n8163j14133K3038P7796r8608
$$ 733991 757375 810331 821440 846851 901217 982484 924321 810188 833226 911022 812414
13668H12414o6334j08797N5297J49414J29243P3887m9296o0389m6965P085J52275
$$ 812414 746080 637283 692580 841994 971237 1045124 995828 935439 888474 895559 1047834
13657A047834M7545m6627J3125l9397l0035j0230l5505k9273J01699R1107R290
$$ 1047834 1095379 1048752 1061877 1022480 992445 982215 946710 917437 1019136 1110243 1119533
13646A119533n2163m0860O7975M9883p1322Q6107J39493m3064j42804O5756O312
$$ 1119533 1067370 1026510 1094485 1144368 1073046 1159153 1298646 1255582 1112778 1178534 1184846
13635A184846j25965n9113q0174J00755J39797R7256n8417J3821L674o3734r5463
$$ 1184846 1058881 999768 919594 1020349 1160146 1257402 1198985 1212806 1216480 1152746 1057283
13624A057283K7186m2175o0277l205J01035J13567O8589j07504K8377r9926j50282
$$ 1057283 1084469 1042294 982017 978812 1079847 1193414 1262003 1154499 1182876 1082950 932668
13613I32668K6432O5081k0510P5185L4806J19955J24187p9465j3632L5642p3044
$$ 932668 959100 1024181 1003671 1078856 1113662 1233617 1357804 1278339 1264707 1300349 1227305
13602A227305p0221j0477L2747k6776j38n5275j5170L2157o7983j0777J08754
$$ 1227305 1157084 1146607 1179354 1152578 1152440 1097165 1081995 1114152 1046169 1035392 1144146
13591A144146o7177M2929P3000j6192N1304K8861q339P0033j411n8009N646N9983
$$ 1144146 1076969 1119898 1192898 1176706 1228010 1256871 1248532 1318565 1317154 1259145 1264791 1324774
13579A324774N5273K4572K5177l0838j43344P2766k4n9885M1561K640J1184m1168
$$ 1324774 1380047 1404619 1429796 1398958 1255614 1328380 1328356 1268471 1310032 1312672 1323856 1282688
13567A282688N0394J09086O6788k4502L8683L0470L8427k901K2735o1527L3695
$$ 1282688 1333082 1442168 1508956 1484454 1523137 1553607 1592034 1589133 1611868 1550341 1584036
13556A584036J5955q7996M575J23142O1933O6168l4521r3653L2501o5201l9276
$$ 1584036 1599991 1511995 1516570 1639712 1701645 1767813 1733292 1639639 1672140 1606939 1567663
13545A567663k9510J00544K54426K01884N1808K0770q1990q4483l6382N0581j00215
$$ 1567663 1538153 1638697 1893123 2095007 2146815 2167585 2085595 2001112 1964730 2015311 1915096
13534A915096m0029R1248J18775p8364L1406J08387l436p2057J29404P7504N6216
$$ 1915096 1875067 1966315 2085090 2006726 2038132 2146519 2143083 2071026 2200430 2277934 2334150
13523B334150R1311R5821J21760R2959M7855o7140P6442M1267J14721Q4996K11576
$$ 2334150 2425461 2521282 2643042 2736001 2783856 2716716 2793158 2834425 2949146 3034142 3245718
13512C245718J10838K75561L21687J46278L35478L26308L64305M94128N19150
$$ 3245718 3356556 3632117 3953804 4100082 4435560 4761868 5126173 5620301 6139451
13503F139451N92454Q67208J203459J610214K074132K679032L162594L538687
$$ 6139451 6731905 7599113 8802572 10412786 12486918 15165950 18328544 21867231
13495B1867231L645578L305461K813921K720917K471386J532620K522j178940
$$ 21867231 25512809 28818270 31632191 34353108 36824494 38357114 38359636 37180696
13487C7180696j151189n73128j47288O283L98534J377166K585886M006933N250828
$$ 37180696 36029507 35456379 35309091 35315374 35713908 37091074 39676960 43683893 48934721
13478D8934721N599214M112910J123909k413363m632706m460301k945163j231599
$$ 48934721 54533935 58646845 59770754 57357391 52724685 48264384 45319221 44087622
13470D4087622J8181j58738j510194k616548k631159j932215j707202j931048
$$ 44087622 44105803 43947065 42436871 39820323 37189164 35256949 33549747 31618699
13462C1618699k515434l175813l233132k658208k158443j679127j444158j186639
$$ 31618699 29103265 25927452 22694320 20036112 17877669 16198542 14754384 13567745
13454A3567745r03231q66940o50624o65216n68255m39289n32104k92792j63145
$$ 13567745 12664514 11797574 11146950 10481734 9913479 9474190 8942086 8649294 8486149
13445H486149j90440j04281r549q8716K6672K99042L54909N28862O03792P98440
$$ 8486149 8295709 8191428 8181879 8093163 8119835 8418877 8773786 9302648 9906440 10704880
13435A0704880J024958J243470J675122K339727L094978L968669M902101N694233
$$ 10704880 11729838 12973308 14648430 16988157 20083135 24051804 28953905 34648138
13427C4648138N954355N922292N718709N781666N727812M266752J370397j912302
$$ 34648138 40602493 46524785 52243494 58025160 63752972 68019724 69390121 67477819
13419F7477819l883265m097819l132611j878857n93238K03540L02460R1022K64430
$$ 67477819 63594554 59496735 56364124 54485267 53892029 54095569 54398029 54489051 54753481
13410E4753481J030702K325557L572309M287216M147500L325857K423684J773356
$$ 54753481 55784183 58109740 61682049 65969265 70116765 73442622 75866306 77639662
13402G7639662Q50435q47547l350026n506073o057159n047247m096449m161383
$$ 77639662 78490097 77642550 74292524 68786451 62729292 57682045 53585596 49424213
13394D9424213m765278n215986n092986m400766l506828k898104k367562j844885
$$ 49424213 44658935 39442949 34349963 29949197 26442369 23544265 21176703 19331818
13386A9331818j555707j558223j334701j262262j124212r18908r07324q74803
$$ 19331818 17776111 16217888 14883187 13620925 12496713 11577805 10670481 9795678
13378I795678q00531p72738p00945o26370n19704n20991m62586n97097l42013
$$ 9795678 8995147 8222409 7521464 6895094 6375390 5854399 5391813 4794716 4452703
13369D452703k14889l01503l26587l27370j90003k5440j4838j40836j36890r1612
$$ 4452703 4237814 3936311 3609724 3282354 3092351 3066911 3052073 2911237 2774347 2682735
13359B682735j20071k34732j64629j59381k0492m4049m5006N7704L5425k6892
$$ 2682735 2562664 2327932 2163303 2003922 1983430 1939381 1894375 1952079 1987504 1960612
13349A960612j02722j7946n5603j21724o1908j48484l1071o6799l8931J41325
$$ 1960612 1857890 1839944 1784341 1662617 1600709 1452225 1421154 1354355 1315424 1456749
13339A456749L3250j09709n2359p606r532M0844N3633N8960o5578q7285o6513
$$ 1456749 1489999 1380290 1327931 1320325 1310793 1351637 1405270 1464230 1398652 1311367 1244854
13328A244854m268O0989J19731j25684j23815j2811l6305N5855M9626o2397k7125
$$ 1244854 1240586 1301575 1421306 1295622 1171807 1158996 1122691 1178546 1228172 1165775 1138650
13317A138650J0869N461R9972J14585n9847n8948j6047k0953M4693P5378o829
$$ 1138650 1149519 1154980 1254952 1369537 1309690 1250742 1234695 1213742 1258435 1333813 1326984
13306A326984j54573q8985K3645J303m4146q2284m4906k6432J8652J50653Q9141
$$ 1326984 1172411 1083426 1107071 1108374 1064228 981944 937038 910606 929258 1079911 1169052
13295A169052l3185n4649N4804N5554J149R5093j2935n991k0428O1574N6629l9554
$$ 1169052 1135867 1081218 1136022 1191576 1192725 1287818 1274883 1268892 1248464 1310038 1366667 1327113
13283A327113r614J9650J05323P5517j25097j11251m7609Q6024K1409n5947O2109
$$ 1327113 1317499 1337149 1442472 1517989 1392892 1281641 1234032 1320056 1341465 1285518 1347627
13272A347627R7055j9779O6565n1187l3926M4439p6500M1650J98523K10334P9525
$$ 1347627 1444682 1424903 1491468 1440281 1406355 1450794 1374294 1415944 1614467 1824801 1904326
13261A904326k1319l7578J07680N2796J30572M9938N8358M273k7779K2792L082
$$ 1904326 1883007 1845429 1953109 2005905 2136477 2186415 2244773 2249046 2221267 2244059 2247141
13250B247141j8337M3762m8845j22411j3248O3440m911M3108L7691m1241J26963
$$ 2247141 2228804 2272566 2223721 2101310 2088062 2151502 2146591 2189699 2227390 2186149 2313112
13239B313112K28913K16580J98531K92268M12337K80643O2533m2038j04297k42778
$$ 2313112 2542025 2758605 2957136 3249404 3661741 3942384 4004917 3962879 3858582 3615804
13229C615804k42829j45965j13343j77912j65945n3599O5474R6465P2942l2293
$$ 3615804 3372975 3227010 3113667 2935755 2769810 2716211 2781685 2878150 2951092 2918799
13219B918799R581J19308K41343J35353N2854M3661K06793J94355O7051J72690
$$ 2918799 2928380 3047688 3289031 3424384 3477238 3520899 3727692 3922047 3989098 4161788
13209D161788L14546M00087N60432N38790O59228P33400R44099J028405J418052
$$ 4161788 4476334 4876421 5436853 5975643 6634871 7368271 8312370 9340775 10758827
13200A0758827J953905K529464L258953M228520N171936N855593O013802N263171
$$ 10758827 12712732 15242196 18501149 22729669 27901605 33757198 39771000 45034171
13192D5034171L948601J639637j256765l687397m287062l158855j692603m91619
$$ 45034171 48982772 50622409 49365644 45678247 41391185 38232330 36539727 36048108
13184C6048108N1875k24507q96174j824590k197891k068021j820791j266792n69663
$$ 36048108 36099983 35875476 34979302 33154712 30956821 28888800 27068009 25801217 25231554
13175B5231554j4894L94926R31962J271563J324626J496065J359099R03036O62906
$$ 25231554 25216660 25611586 26543548 27815111 29139737 30635802 31994901 32897937 33560843
13166C3560843M63870M28213N90504P21563P16790L46964l36428p12554q19409
$$ 33560843 34024713 34452926 35043430 35764993 36481783 36828747 36492319 35779765 34960356
13157C4960356n32371L02444R09870J093497Q94180Q4995q58171j742927j936435
$$ 34960356 34427985 34730429 35640299 36733796 37627976 37712971 36854800 35111873 33175438
13148C3175438j342397p3138J248281K731439M214508N537422N749690L989327
$$ 33175438 31833041 31759903 33008184 35739623 39954131 45491553 51241243 55230570
13140E5230570O74080k533809m559815n311667n212711m622740l555313k376002
$$ 55230570 55904650 53370841 48811026 43499359 38286648 33663908 30108595 27732593
13132B7732593j434131n41436L05925J259523K190328K755142L030582L127294
$$ 27732593 26298462 25757026 26062951 27322474 29512802 32267944 35298526 38425820
13124C8425820K650227J587514o7198j788621k861435k595927j989191j910537
$$ 38425820 41076047 42663561 42596363 40807742 37946307 35350380 33361189 31450652
13116C1450652j969518k084573j981196j715652j262703n86678k28372O6088K99834
$$ 31450652 29481134 27396561 25415365 23699713 22437010 21850332 21621960 21688048 21987882
13107B1987882L53135o6326m67166r94475j266581j273303j285034j028304o19271
$$ 21987882 22341017 22274691 21807525 20813050 19546469 18273166 16988132 15959828 15340557
13098A5340557l22048m1452o9271J6825K62250O46136J081746J509291J801452
$$ 15340557 15018509 14977057 14907786 14924611 15186861 15832997 16914743 18424034 20225486
13089B0225486J943926J969340J560555J130121Q67123R17816O83445O1545o66312
$$ 20225486 22169412 24138752 25699307 26829428 27696551 28614367 29297812 29359357 28693045
13080B8693045j105328j211625o20361M31698J769106K936789L876656L578855
$$ 28693045 27587717 26376092 25755731 26187429 27956535 30893324 34769980 38348835
13072C8348835J420958j402256l562885m453160m477476m016272l351280k572405
$$ 38348835 39769793 38367537 34804652 30351492 25874016 21857744 18506464 15934059
13064A5934059j973197j469023j147694q54529q38876p19914o17165o25534o16107
$$ 15934059 13960862 12491839 11344145 10489616 9650740 8930826 8313661 7688127 7072020
13055G072020o48491n61030m85879m21409k91976k92485k90713k63844k48589
$$ 7072020 6423529 5862499 5376620 4955211 4663235 4370750 4080037 3816193 3567604
13046C567604k19548j29980j39364k62477j47531k5967p6893k05859j89998l4414
$$ 3567604 3348056 3218076 3078712 2816235 2668704 2642737 2565844 2359985 2169987 2135573
13036B135573r5271q311k5309j15679o2122M5839J23363J16013j7704k2623J21419
$$ 2135573 2040302 2031991 2006682 1891003 1828881 1874720 1998083 2114096 2096392 2073769 2195188
13025B195188J79018J94754P1372j54130p7416l2347j62678j54259j16185n1601
$$ 2195188 2374206 2568960 2640332 2486202 2408786 2376439 2213761 2059502 1943317 1891716
13015A891716j24765l1144l2853n4523k0P6624J5682j18377j11128J0667m219
$$ 1891716 1766951 1735807 1702954 1648431 1648411 1725035 1740717 1622340 1511212 1521879 1517660
13004A517660P9682k892q6845l8760R2534j4036j12807j07865L6859M0609M568
$$ 1517660 1597342 1594450 1507605 1468845 1561379 1547343 1434536 1326671 1363530 1404139 1408707
12993A408707m0896m9138O14n7798o1870m3345k0800n9356M4477M327j29273K324
$$ 1408707 1367811 1318673 1319287 1261489 1199619 1156274 1135474 1076118 1120595 1124922 995649 997973
12981I97973q2494m075L0103j0174K625l8010j21483l7456M6710M5641J11548
$$ 997973 915479 911404 941507 931333 933958 895948 774465 737009 783719 829360 940908
12970I40908M6810r5121p4714J0157K8900N2322J49870j9786p1012k2993j17488
$$ 940908 987718 892597 817883 828040 856940 909262 1059132 1039346 968334 945341 827853
12959H27853j2423l0976K9243N4656K6590p2391J07024P6511j7869J25923R7265
$$ 827853 815430 784454 813697 868353 894943 822552 929576 1006087 988218 1114141 1211406
12948A211406N9646M0061L8048o1513m3100M2323L763l4892j06435m0616k2910
$$ 1211406 1271052 1311113 1349161 1287648 1244548 1286871 1290634 1255742 1149307 1108691 1085781
12937A085781R2807K7099M6298q061K8720m8707L3880n1986k3291Q5658j0348
$$ 1085781 1178588 1205687 1251985 1243924 1272644 1223937 1257817 1205831 1182540 1268198 1257850
12926A257850j5391j80704J1263J43893R366j1783j2881N4296N8410l4815k09508
$$ 1257850 1242459 1061755 1073018 1216911 1226277 1214494 1201613 1255909 1314319 1279504 1069996
12915A069996j43329L552N0386r347K4460r8193N420k7886J66952N3204n5399
$$ 1069996 926667 930219 980605 971258 995718 897525 902945 875059 1042011 1095215 1039816
12904A039816N0904J13519k2539m0905N7341o3692q6146j0391Q2145q5514m6703
$$ 1039816 1090720 1204239 1181700 1140795 1198136 1134444 1048298 1037907 1120052 1034538 987835
12893I87835L1813j6385L370j59560o3186J29344M7433m34J21458l7552j8257
$$ 987835 1019648 1003263 1006633 847073 783887 913231 960664 960230 1081688 1044136 1025879
12882A025879M0989n016j16520j27630J5778J44358o856j7216j5776q4346K7144
$$ 1025879 1066868 1061852 945332 817702 833480 977838 970982 953766 937990 853644 880788
12871H80788J38654P3114l0933J8564n1086p9853J5918J56105J05691j8851q364
$$ 880788 1019442 1092556 1061623 1080187 1029101 949248 965166 1121271 1226962 1208111 1199747
12860A199747r1976q816N1926r6314j47964o5463K5648Q8778N1603m8440j12421
$$ 1199747 1107771 1098955 1150881 1054567 906603 841140 866788 955566 1007169 958729 846308
12849H46308K3291R1736Q7209n1068l6274j02323l9765J09734J03038j8037j66733
$$ 846308 869599 961335 1048544 997476 961202 858879 819114 928848 1031886 1013849 847116
12838H47116r1678J642J03773J11544R9468K6409k7176K9351L3599p4093j82955
$$ 847116 755438 757080 860853 972397 1071865 1098274 1071098 1100449 1134048 1059955 877000
12827H77000O2508K05398R8794P3462p9328j50988k1631l660N5068J4289K4660
$$ 877000 939508 1144906 1243700 1317162 1237834 1086846 1065215 1061555 1116623 1130912 1155572
12816A155572j3205p9665l5270O1729J23667J1506m9632Q2121k5731j02650m1934
$$ 1155572 1142367 1062702 1027432 1089161 1212828 1224334 1174702 1256823 1231092 1128442 1086508
12805A086508k036j6051k8107l4516K7964O1650k9232r7539P825k8344L8135L9988
$$ 1086508 1084472 1068421 1040314 1005798 1033762 1095412 1066180 968641 976466 948122 986257 1026245
12793A026245j2170p828k8241K8482J85359n319r1596Q926N3529J09828J07759
$$ 1026245 1014075 1006247 978006 1006488 1191847 1186528 1094932 1103858 1157387 1267215 1374974
12782A374974n8382p2001l1848k4842O348k7980M0589J9147j09323L5529P0462
$$ 1374974 1316592 1244591 1212743 1187901 1194249 1166269 1206858 1226005 1116682 1152211 1222673
12771A222673n1310K8695r1755j7633j5632L6564N7598j1927J12721j08349o6382
$$ 1222673 1171363 1200058 1108303 1090670 1075038 1111602 1169200 1157273 1269994 1161645 1095263
12760A095263m1913P9465P5335m7651k8607N7260M6743l7812n7516o6153p0218
$$ 1095263 1053350 1132815 1208150 1160499 1131892 1189152 1235895 1198083 1140567 1074414 1004196
12749A004196j9900L7237J32539J75416l9009L4836J9889k753n6744o8609M4978
$$ 1004196 984296 1021533 1154072 1329488 1290479 1325315 1345204 1342451 1285707 1217098 1262076
12738A262076L8498L811L2358J7878n0054q3803N7851M9920P5165K4076j8044
$$ 1262076 1300574 1304385 1336743 1354621 1304567 1220764 1278615 1328535 1403700 1427776 1409732
12727A409732N6734l7041K8060n2448q6651q646N9218P587O4711N6849o0597Q1878
$$ 1409732 1466466 1429425 1457485 1405037 1318386 1309740 1368958 1376545 1441256 1498105 1437508 1519386
12715A519386q7371l4332j6942J46953M9676o5272L9184p4919m0434J9473n5361
$$ 1519386 1432015 1397683 1380741 1527694 1577370 1512098 1551282 1476363 1435929 1455402 1400041
12704A400041m9818L8303J11961m1051j74719j8419K9537J5050l1972J9616k4746
$$ 1400041 1350223 1388526 1500487 1459436 1284717 1266298 1295835 1310885 1278913 1298529 1273783
12693A273783K6756M8532M8684M7952N8969q7921n9772J29433P2568J3934J16377
$$ 1273783 1300539 1349071 1397755 1445707 1504676 1416755 1356983 1486416 1558984 1572918 1689295
12682A689295M4432j02345n7567j06097K5458J2018J09376R4374O0958L4097L7206
$$ 1689295 1733727 1631382 1573815 1467718 1493176 1505194 1614570 1708944 1769902 1803999 1841205
12671A841205j04625l7663o2611M6142n2541k7864j7444P5235J01717r0105o4876
$$ 1841205 1736580 1698917 1636306 1682448 1629907 1602043 1584599 1659834 1761551 1671446 1606570
12660A606570J7101k5614m4204m41J1162m2311j25131O410M4726L8813Q2830N6101
$$ 1606570 1623671 1598057 1553853 1553412 1564574 1522263 1397132 1403542 1448268 1487081 1569911 1626012
12648A626012O5153L2896o066J5131J06935j1212j68933p2287P2728M2277M0808
$$ 1626012 1691165 1724061 1717995 1733126 1840061 1828849 1659916 1587629 1660357 1702634 1743442
12637A743442J9207n3924k98q8670o960M124J27230K0164j30512j49096P4811
$$ 1743442 1762649 1708725 1708427 1619757 1612797 1616921 1744151 1764315 1633803 1484707 1559518
12626A559518M5506J01742K3947O4890K8420q7689M4935j4995j29569L0938O725
$$ 1559518 1605024 1706766 1730713 1795603 1824023 1736334 1781269 1766274 1636705 1667643 1674368
12615A674368N6171M4827J0744l2128j10438j00712J02307K0430n654l2128R8784
$$ 1674368 1730539 1775366 1786110 1753982 1643544 1542832 1645139 1665569 1659915 1627787 1726571
12604A726571Q286O1715J1988k038k2899j676Q5002P9595q6659k15824n8791P4781
$$ 1726571 1734857 1796572 1808560 1806522 1783623 1781947 1866949 1946544 1859885 1644061 1585270 1660051
12592A660051p1840o0906J86356O1411m9160M6897K1370j3291n4532l2691J07786
$$ 1660051 1588211 1527305 1713661 1775072 1725912 1772809 1794179 1780888 1726356 1693665 1801451
12581A801451J099o8047J22082M1683l5087l0037N2453n1301J4597L7926o9386
$$ 1801451 1802550 1734503 1856585 1898268 1863181 1833144 1885597 1834296 1848893 1886819 1817433
12570A817433r1067R4770l3844j78974P1923K4554P632R0979N9869P3866j0088
$$ 1817433 1726366 1821136 1787292 1608318 1680241 1704795 1712427 1803406 1863275 1937141 1927053
12559A927053j37883O7508J17266k7708j17996M9317J2599j304K105J7749n4002
$$ 1927053 1789170 1856678 1973944 1946236 1828240 1877557 1890156 1888852 1890957 1908706 1854704
12548A854704k5551K9354P3439Q3775j17334p9535L1658N3163m8769o6904R8418
$$ 1854704 1829153 1858507 1931946 2015721 1898387 1818852 1850510 1903673 1854904 1788000 1886418
12537A886418l1074O6996q7636K921N4791Q2423M1153l3053q4069J34423R8380
$$ 1886418 1855344 1922340 1834704 1837625 1892416 1974839 2015992 1982939 1898870 2033293 2131673
12526B131673j550j1750n5193R63o4860o4778N9122Q8192j46286N14J58957Q8140
$$ 2131673 2130123 2118373 2063180 2064143 1999283 1934505 1993627 2081819 1935533 1936047 2095004 2183144
12514B183144N8301L9451k0430M5356N7032L6820K5281o4283o4179j48850l2905
$$ 2183144 2241445 2280896 2260466 2305822 2362854 2399674 2424955 2360672 2296493 2147643 2114738
12503B114738Q2150R5403L3014R3630R0436J31169l96r6106n613K720n723K3412
$$ 2114738 2196888 2292291 2325305 2418935 2509371 2640540 2640144 2544038 2538425 2541145 2535422 2558834
12491B558834o1708j18097j10643J15414J82347K8456j24308j03250j31994r862
$$ 2558834 2497126 2379029 2268386 2383800 2566147 2594603 2470295 2367045 2235051 2225189
12481B225189l0215o4460m6664N0322Q3738N0400p4561P069j23991l2717Q9406
$$ 2225189 2194974 2130514 2083850 2134172 2217910 2268310 2193749 2200818 2076827 2044110 2133516
12470B133516K8966P371Q639k0984J4890J17690J9780p1509K5568J7465J20523
$$ 2133516 2162482 2169853 2178492 2157508 2172398 2290088 2309868 2238359 2263927 2281392 2401915
12459B401915N5627K1091o7654l9233p014L7461m4850j7953N6900J19336j01727
$$ 2401915 2457542 2478633 2410979 2371746 2364732 2402193 2357343 2339390 2396290 2515626 2413899
12448B413899m2170N4230n3162n8490P733M2007q4325k3438M8642m3048p8806
$$ 2413899 2371729 2425959 2372797 2314307 2322040 2364047 2279722 2256284 2304926 2261878 2183072
12437B183072j611M7685J1613n8501J72482J23999L282M2447l4034J2245N3664
$$ 2183072 2181461 2229146 2240759 2182258 2354740 2478739 2482021 2524468 2490434 2502679 2556343
12426B556343m7247j0539K4328m4732n0011K8468J76304O7437q7354r265l0159
$$ 2556343 2509096 2498557 2522885 2478153 2428142 2456610 2632914 2700351 2612997 2603732 2573573
12415B573573M9819k620K3628K8015L6657m6339k6923L4660M5320k5746N745P1557
$$ 2573573 2623392 2620772 2644400 2672415 2709072 2662733 2635810 2670470 2715790 2690044 2695789 2767346
12403B767346r045L4355M5981P859R582k222K0807k1358o5602n8549M0390l1222
$$ 2767346 2758301 2792656 2838637 2846496 2856078 2853856 2874663 2853305 2787703 2729154 2769544 2738322
12391B738322o4878l8076J58650J05421K8204j9895O6239k9927N8081n7986j6296
$$ 2738322 2673444 2635368 2794018 2899439 2927643 2907748 2973987 2944060 3002141 2944155 2927859
12380B927859J37924n9327o3677p3081j21585j1385J77796J18339P709K1635K2679
$$ 2927859 3065783 3006456 2942779 2869698 2748113 2736728 2914524 3032863 3040572 3062207 3084886
12369C084886j04051j65612J2351K40116J08571L8869n9350q3221r8867J08008
$$ 3084886 2980835 2815223 2827574 3067690 3176261 3215130 3155780 3072559 2973692 3081700
12359C081700O5493j33836m5953n5601m8770P146J08694R8936L6176o5118M444
$$ 3081700 3147193 3013357 2967404 2911803 2863033 2870179 2978873 3077809 3113985 3048867 3053311
12348C053311K5351K4431q828l6957N3236p8825O6600P4803k42k7667O0181Q1059
$$ 3053311 3078662 3103093 3094265 3057308 3110544 3031719 3098319 3173122 3172880 3145213 3205394 3286453
12336C286453O718J40129l113m1652M0154N7682j265o9041q2925K5650J8192m0954
$$ 3286453 3293171 3433300 3430187 3388535 3428689 3486371 3485106 3416065 3333140 3358790 3376982 3336028
12324C336028J6034J67012N6139j1494j6114L7509K1379p3147j46424n1656J11979
$$ 3336028 3352062 3519074 3575213 3563719 3547605 3585114 3606493 3533346 3386922 3335266 3447245
12313C447245J56703O6973n6644o1005m0600P7689J66443L0239L5897K1574j33273
$$ 3447245 3603948 3670921 3614277 3553272 3512672 3590361 3756804 3787043 3822940 3844514 3711241
12302C711241j40601J9191j1230l3901P7562n7494o7038k428N8127O4413L9111
$$ 3711241 3570640 3589831 3578601 3544700 3622262 3564768 3497730 3495302 3553429 3617842 3656953
12291C656953m8089K4780N099M9799Q4234K4238m289p8821j43223L0938J01470
$$ 3656953 3608864 3633644 3638743 3688542 3772776 3797014 3792725 3713904 3570681 3601619 3703089
12280C703089j1242P6179J41858l6061j51738j2617R068K09615l3957J24126J7019
$$ 3703089 3691847 3768026 3909884 3873823 3722085 3709468 3718536 3928151 3894194 4018320 4035339
12269D035339n5624J20775m9380o8514N7564j21066L8339O2816M5261p1054j5812
$$ 4035339 3979715 4100490 4051110 3982596 4040160 3919094 3957433 4020249 4065510 3994456 3978644
12258C978644l4196R6816L2399O2425N9920l1169P7273j4006K5638p9355k6744
$$ 3978644 3944448 4041264 4073663 4136088 4196008 4164839 4242112 4228106 4253744 4174389 4147645
12247D147645J9073j7686L7422J35437P525j3769j3948J7608M9331Q4377J67276
$$ 4147645 4166718 4149032 4186454 4321891 4329416 4315647 4301699 4319307 4368638 4453015 4620291
12236D620291o3788o2014r8265r293O5340j2380m5718J6018q2525J10344P0260
$$ 4620291 4556503 4494489 4396224 4386931 4452271 4439891 4394173 4410191 4327666 4438010 4508270
12225D508270k5391N4275J51108j0042j73787k226Q462k8208m149k2101R4423
$$ 4508270 4482879 4537154 4688262 4678220 4504433 4502207 4510669 4482461 4478312 4456211 4550634
12214D550634N2834l903M4173j9576m5953N1976O5656J24262M1374R8385P130
$$ 4550634 4603468 4599565 4643738 4624162 4578209 4630185 4695841 4820103 4861477 4959862 4966992
12203D966992N405J2715K3881o2337Q6485Q334j05196R1838P7278R0261N5241
$$ 4966992 4972397 4985112 5008993 4946656 5033141 5041475 4936279 5028117 5105395 5195656 5250897
12192E250897m381p9260K3344r7674n6539K9539J4170J11368O8858l1427k7414
$$ 5250897 5246516 5167256 5190600 5092926 5036387 5065926 5080096 5191464 5260322 5228895 5201481
12181E201481m312M3008J63516N6464n5149o8273k9186J9677K4528q4788L6803
$$ 5201481 5197169 5240177 5403693 5460157 5405008 5336735 5307549 5327226 5351754 5266966 5303769
12170E303769J70327J0829R283P6061L8876l7425J4609j13943J25147R3626k1276
$$ 5303769 5474096 5484925 5494208 5570269 5609145 5571720 5586329 5472386 5597533 5691159 5669883
12159E669883m6986l0507j0962J41739J02672N0177J41524J6368k5465K8223J22614
$$ 5669883 5622897 5592390 5581428 5723167 5825839 5876016 6017540 6033908 6008443 6036666 6159280
12148F159280P7932J17201K08652J11360j4130L0839J04132J31389N1812L1872
$$ 6159280 6237212 6354413 6563065 6674425 6660295 6691134 6795266 6926655 6978467 7010339
12138G010339j3853M2274n2543J33487Q9749O436j24385K4444M4209Q7371j20258
$$ 7010339 6996486 7038760 6986217 7119704 7209453 7215889 7091504 7115948 7160157 7247528 7127270
12127G127270j59549l5765j31261j62946L987m0822j44275j70450k1704J00084
$$ 7127270 6967721 6931956 6800695 6637749 6641736 6600914 6456639 6286189 6264485 6364569
12117F364569K1093R313J1417k8515k3668J07591J39636J07701p207j75067j57893
$$ 6364569 6385662 6394975 6406392 6377877 6354209 6461800 6601436 6709137 6701930 6526863 6368970
12106F368970N5701p076o5282r1216J44356M2884o7869k4943K07867P1238J6517
$$ 6368970 6424671 6417595 6352313 6261097 6405453 6448337 6380468 6355525 6563392 6634630 6651147
12095F651147J3223J5553K6020o8476M3397k2449r937j56114j8824j9421J30713
$$ 6651147 6664370 6679923 6705943 6637467 6680864 6658415 6648478 6492364 6473540 6454119 6584832
12084F584832J54658p713M8921N247j03993M7755K8597J2199L5908M6990J9657
$$ 6584832 6739490 6731777 6780698 6785945 6681952 6729707 6758304 6770503 6806411 6853401 6873058
12073F873058R315J8457L451N3118J4460L5750J1527o1176L578N0376P5135k0949
$$ 6873058 6882373 6900830 6904281 6957399 6971859 7007609 7019136 6957960 6961538 7011914 7087049 7066100
12061G066100j830P9922O5963k8484L8284N5387O2480n3526j56361n8016m6152
$$ 7066100 7064270 7144192 7210155 7181671 7219955 7275342 7337822 7284296 7127935 7069919 7023767
12050G023767L3797R3244P0455Q2345M8978M6163l0913n481p7987j6413J28745
$$ 7023767 7057564 7150808 7221263 7303608 7352586 7398749 7367836 7362355 7284368 7267955 7396700
12039G396700M9453j4590M3096k3479j19728j05779J8734J13451Q2464l6182j03203
$$ 7396700 7446153 7431563 7474659 7451180 7331452 7225673 7244407 7357858 7440322 7404140 7300937
12028G300937M8715J20116O6821l0651j5567m9641k0683J42407J48059J1018L9776
$$ 7300937 7349652 7469768 7536589 7505938 7490371 7440730 7420047 7562454 7710513 7721531 7761307
12017G761307J8469J841J40591o2892j43528L18m5399Q8355J61480J4605j23273
$$ 7761307 7779776 7781617 7922208 7859316 7715788 7716106 7670707 7759062 7920542 7935147 7811874
12006G811874r8688J42991R5735p4952M9031J4598l9530N6280n451J3818J232
$$ 7811874 7713186 7856177 7951912 7876960 7925991 7940589 7901059 7957339 7951888 7965706 7966938
11995G966938L6803J17061M8864P0106k1092j99326j05204J4338Q0369j42272
$$ 7966938 8003741 8120802 8169666 8239772 8218680 8019354 7914150 7928488 8008857 7866585
11985G866585m2001Q4587J8311L3848l9488m1753N3935O2431K7162K0789K7924
$$ 7866585 7824584 7909171 7927482 7961330 7921842 7880089 7934024 7996455 8023617 8044406 8072330
11974H072330p795N5755o051M6020O7657N4309l4412o4335K7492N7068p8458j66896
$$ 8072330 8064535 8120290 8114239 8160259 8227916 8282225 8247813 8183478 8210970 8268038 8189580 8022684
11962H022684l503J84064J87604Q3450j01956k2383j011l2469j11200K549K4537
$$ 8022684 8019181 8203245 8390849 8474299 8372343 8349960 8348949 8316480 8205280 8207829 8232366
11951H232366j6808j20843k9316j5270l885L9552M1751N1677P4714L9646j85601
$$ 8232366 8215558 8094715 8065399 8050129 8046244 8085796 8127547 8179224 8253938 8293584 8107983
11940H107983m3969J00736M5090o0360j2885J00787R3279q1244j04785j7178M5237
$$ 8107983 8064014 8164750 8209840 8149480 8136595 8237382 8330661 8249417 8144632 8127454 8172691
11929H172691j5409L1626J91449Q9751j25003k12684j829R7158j04762j08071
$$ 8172691 8157282 8188908 8380357 8470108 8345105 8132421 8130592 8227750 8122988 8014917
11919H014917q1341J72991J8500n683L015P5434k9917j28320O3972Q5755M8004
$$ 8014917 7933576 8106567 8125067 8119384 8122399 8197833 8167916 8039596 8103568 8189323 8237327
11908H237327J16849k7745j33375j71047N5559L1161L8909P8514m9175m6393m4892
$$ 8237327 8354176 8326431 8193056 8022009 8077568 8108729 8147638 8226152 8176977 8130584 8085692
11897H085692J0315N184j36531m5069O7552R2526m8675m8935o302N4022J8100
$$ 8085692 8096007 8101191 7964660 7919591 7987143 8079669 8030994 7982059 7975757 8029779 8047879
11886H047879j9349m6954J1800n8998r0478l6318m993K3142Q6862j358J6483j4799
$$ 8047879 8028530 7981576 7993376 7934378 7843900 7807582 7802589 7825731 7912593 7911235 7927718 7912919
11874G912919m5941o1496l7373k1603O3285L0635k2901K3165J32849j4410j09285
$$ 7912919 7866978 7805482 7768109 7746506 7809791 7840426 7817525 7840690 7973539 7959129 7849844
11863G849844j56152O455M3425l324P435r3863O2970R1465J07835p5930r6649
$$ 7849844 7693692 7700147 7743572 7740248 7747683 7653820 7716790 7808255 7916090 7840160 7743511
11852G743511p9892K4905l6656k6829o9322l1467J05644Q7191O546j22975q9739
$$ 7743511 7663619 7688524 7651868 7625039 7555717 7524250 7629894 7717085 7723631 7600656 7510917
11841G510917M0515K6206P6787M6986k0960j8948j14545m3392O618N6892j9904
$$ 7510917 7551432 7577638 7654425 7701411 7680451 7661503 7546958 7503566 7510184 7567076 7547172
11830G547172r0697L5672m7043K5227J2820l2120j65708p1860o1357k4694Q3727
$$ 7547172 7456475 7492147 7445104 7470331 7483151 7451031 7285323 7213463 7152106 7127412 7211139
11819G211139M5807k8601m4869p4478L7297K5736l7339l5655J542J5191N3242
$$ 7211139 7256946 7228345 7183476 7108998 7146295 7172031 7134692 7099037 7100579 7115770 7169012
11808G169012j2482J5881j535k4707o9256r3716o1826j4512N0623P7501l3660
$$ 7169012 7156530 7172411 7170876 7146169 7076913 6983197 6921371 6906859 6957482 7034983 7001323
11797G001323O2530k1710p8688j11889K5049J23075M1699M1175j15682l9304m2724
$$ 7001323 7063853 7042143 6963455 6851566 6876615 6999690 7041389 7082564 6966882 6927578 6884854
11786F884854l3190j27264r9377P5288K10413O8098o137r7728l8439j24929m0039
$$ 6884854 6851664 6724400 6625023 6700311 6910724 6978822 6972685 6874957 6836518 6711589 6671550
11775F671550O0931l5351j24523j29379J21199l312r3282M2120p480r9848K1992
$$ 6671550 6732481 6697130 6572607 6443228 6564427 6561115 6467833 6509953 6502473 6402625 6424617
11764F424617j74o0910o3938J14138Q398o5652Q6034j10566L236J6544R1686o7567
$$ 6424617 6424443 6363533 6299595 6413733 6422131 6356479 6442513 6331947 6335183 6351727 6443413 6375846
11752F375846L956L9185j571L6786Q813j21184j52483J00995q7111M515k5054
$$ 6375846 6379802 6418987 6417416 6454202 6463015 6341831 6189348 6290343 6203232 6207747 6182693
11741F182693p1012J0379k5122n1033R5341J39029J72560l5487L5363Q3273j8858
$$ 6182693 6111681 6122060 6096938 6045905 6141246 6280275 6452835 6417348 6452711 6535984 6517126
11730F517126J1057K4620R3453O9884K3223r0130r9379j54879n0601M6095k8153
$$ 6517126 6528183 6552803 6646256 6716140 6739363 6649233 6549854 6394975 6344374 6390469 6362316
11719F362316R8702N291m7665l486j01392L699K1366r3510o2693n283p7530j27232
$$ 6362316 6461018 6466309 6418644 6415158 6313766 6317465 6338831 6245321 6182628 6177345 6099815 5972583
11707E972583j05655l6023r679J8051j3037l4007j6011p0337q183p8996j42024
$$ 5972583 5866928 5830905 5821226 5839277 5826240 5792233 5776222 5705885 5697702 5618706 5476682
11696E476682J4540J25651M0582M206o2773j2097q6194R1474J93784J5025q2623
$$ 5476682 5491222 5616873 5657455 5661661 5598888 5586791 5500597 5592071 5785855 5800880 5718257
11685E718257J89099J41375P3121K1282l897M754o1536P3170J49540j47706j33570
$$ 5718257 5907356 6048731 6121852 6143134 6139237 6143991 6082455 6155625 6305165 6157459 6023889
11674F023889o4737K70J6260j52353j77266j09497o7035m1338J4129k7681j26147
$$ 6023889 5959152 5959422 5975682 5823329 5646063 5536566 5469531 5428193 5442322 5414641 5288494
11663E288494j94847k9682m8473q2959K5620m6165k4984L6510o9533l8701r9055
$$ 5288494 5093647 5063965 5015492 4932533 4958153 4911988 4887004 4923514 4853981 4815280 4716225
11652D716225n2664o3932P9523N6811r5793l4473L4141L4775P624j9943K2371
$$ 4716225 4663561 4599629 4679152 4735963 4640170 4605697 4639838 4674613 4682237 4662294 4684665
11641D684665M7967K187N445K5614o2006j39742n8335m4164k191l6801L3842K7689
$$ 4684665 4732632 4734819 4740264 4765878 4703872 4564130 4505795 4461631 4459440 4422639 4456481 4484170
11629D484170k4681L3703P9984N580o462q7102m3093K5347M6215j82318j09773
$$ 4484170 4459489 4493192 4573176 4578756 4572294 4485192 4442099 4467446 4513661 4331343 4221570
11618D221570k5226k4323n534L7303n3864n356K005M7656m4158o2842L291o888
$$ 4221570 4196344 4172021 4166487 4203790 4149926 4144570 4146575 4194231 4150073 4087231 4090522 4083634
11606D083634K0255o685j60301l3090O1308j3258l0516R1705r7878m6596J9959
$$ 4083634 4103889 4097204 3936903 3903813 3965121 3951863 3921347 4013052 3915174 3868578 3888537
11595C888537j5292J3435J30187M7345j00575j17271q1547k3706J2301m8700O1887
$$ 3888537 3873245 3886680 4016867 4064212 3963637 3846366 3764819 3741113 3753414 3704714 3766601
11584C766601j9186M3365J43016Q7657R0693r1431p7973j71729o8866q3453K9973
$$ 3766601 3747415 3790780 3933796 4021453 4112146 4020715 3942742 3771013 3702147 3618694 3648667
11573C648667J50729P3866l5181o1115M2439J03819p4749q3942o6445m301L3681
$$ 3648667 3799396 3873262 3838081 3776966 3819405 3923224 3848475 3764533 3698088 3693787 3727468
11562C727468P5024J26646J6441J3993l572m3438j9636p5171m5537k2215m3605
$$ 3727468 3802492 3929138 3945579 3959572 3956000 3912562 3892926 3817755 3772218 3750003 3706398
11551C706398J9263j1509J22077P1481j00356Q1305n6832J8806J13954o577q0001
$$ 3706398 3725661 3714152 3836229 3907710 3807354 3888659 3831827 3850633 3964587 3958010 3878009
11540C878009L8571n8138j32439l9351R816R974j56728K8573Q8644Q768j4351
$$ 3878009 3916580 3858442 3726003 3686652 3696468 3706442 3549714 3578287 3666931 3675699 3661348
11529C661348j16252L8820J32925j2341j50273n0346O4148k6200k5014N5268M5971
$$ 3661348 3545096 3583916 3716841 3704500 3554227 3503881 3568029 3541829 3516815 3572083 3618054
11518C618054j13148j9225O551J14046L4499p6120j14811Q6M4186N7719N2318
$$ 3618054 3504906 3485681 3492232 3606278 3640777 3564657 3449846 3449932 3494118 3551837 3604155
11507C604155J0720j3617q1725o7836J05675m1717l7149J7185Q662j14375n7557
$$ 3604155 3614875 3601258 3519533 3451697 3557372 3515655 3478506 3495691 3504353 3389978 3332421
11496C332421n0122m7577M8649J51392L3568Q1495K012J2876L0241o6522j0849
$$ 3332421 3282299 3234722 3283371 3434763 3468331 3549826 3551838 3564714 3594955 3528433 3517584
11485C517584n2570j20491R9632J00634M9271k3767m7057n4190l9892M7786J7847
$$ 3517584 3465014 3344523 3444155 3544789 3594060 3570293 3523236 3469046 3429154 3476940 3494787
11474C494787L85M0638r5647m8001O6314j3194l0133N1021L0698j1833J9866o983
$$ 3494787 3495172 3535810 3440163 3392162 3458476 3445282 3415149 3466170 3496868 3485035 3504901 3497918
11462C497918j4429k0188R6392J29812J56097k8623k7435M4315J66223R5755l7318
$$ 3497918 3483489 3463301 3559693 3689505 3845602 3816979 3789544 3833859 4000082 4095837 4058519
11451D058519N956j0974R447M7816q4083j49240J1849J04840r5873M6747j9194
$$ 4058519 4064475 4053501 4062948 4110764 4026681 3877441 3889290 3994130 3898257 3945004 3925810
11440C925810K0746P5889J08941J33278J18319N0730j31871J54445Q3430J18795
$$ 3925810 3946556 4022445 4131386 4264664 4382983 4433713 4301842 4456287 4539717 4658512
11430D658512K0448N3156K18174L77784K37660K97507M82215N98984P21848P27302
$$ 4658512 4678960 4732116 4950290 5328074 5565734 5863241 6345456 6944440 7666288 8393590
11420H393590Q74955O98372L25731j55482n14410o03662n38861n28882m62671
$$ 8393590 9268545 9966917 10292648 10137166 9622756 9019094 8480233 7951351 7488680
11411G488680k06890n3656P9076O6054P0506K2295J34231K79224L01699N81552
$$ 7488680 7281790 7228134 7307210 7373264 7443770 7466065 7600296 7879520 8181219 8762771
11401H762771O55083Q66834P99770M96193K72053Q4696L1843K66995M22964N81306
$$ 8762771 9417854 10284688 11084458 11580651 11852704 11937400 11969243 12236238 12659202 13240508
11391A3240508O05811O14106J67143l63986o25274o66130n61865m99921l34968
$$ 13240508 13846319 14460425 14627568 14263582 13638308 12972178 12410313 11910392 11575424
11382A1575424j91468j1376J32017L30904O66193Q78066Q49580R59224R82529
$$ 11575424 11383956 11372580 11504597 11835501 12501694 13379760 14229340 15188564 16171093
11373A6171093O47273K79168J26705R7204Q35988J403876J891861K610964L185268
$$ 16171093 16818366 17097534 17224239 17321443 18157431 19561307 21453168 24064132 27249400
11364B7249400L128042J626835n74697k614310l233948k702671k050438j497902
$$ 27249400 30377442 32004277 31429580 28815270 25581322 22878651 20828213 19330311
11356A9330311j008319n01582k87989r0294K2955L64191P43072R70876J480441
$$ 19330311 18321992 17820410 17532421 17442127 17465082 17829273 18572345 19543221 21023662
11347B1023662K037454K709972L882064M956536N275878M368048K218141J45397
$$ 21023662 23061116 25771088 29653152 34609688 39885566 44253614 46471755 46617152
11339D6617152j59116J200158K824536L715269L099933J254851j047947k999093
$$ 46617152 46458036 47658194 50482730 54197999 57297932 58552783 57504836 54505743
11331E4505743l710830l517089k659214j758871o75172L31521R83341J964395
$$ 54505743 50794913 47277824 44618610 42859739 42184567 42516088 43499429 45463824
11323D5463824L165033M553916N927822P575627R270608J0245074J0658311J0188183
$$ 45463824 48628857 53182773 59110595 66686222 75956830 86201904 96860215 107048398
11315A07048398R058487P020004M410802J986324J766340L830165O767129R539687
$$ 107048398 116106885 123126889 127537691 129524015 131290355 135120520 141887649 151427336
11307A51427336J2019937J3973504J5713337J7364729J8786501J9341299J8932844
$$ 151427336 163447273 177420777 193134114 210498843 229285344 248626643 267559487
11300B67559487J6921446J3619847R275794M582900N38011k371985l797867m410145
$$ 267559487 284480933 298100780 307376574 311959474 312497485 310125500 306327633 301917488
11292C01917488n056708n910778o192672n893627n701406o307036p795682r916393
$$ 301917488 296860780 290950002 284757330 278863703 273162297 266855261 259059579 249143186
11284B49143186j2322742j4316232j5331095j5651990j5126522j3785180j2182180
$$ 249143186 236820444 222504212 207173117 191521127 176394605 162609425 150427245
11277A50427245j0424389r155336q099019p267180o797743o633680o479836o495337
$$ 150427245 140002856 130847520 122748501 115481321 108683578 102049898 95570062 89074725
11269H9074725o507883o472408o231528n790525n310485m905417m515133l739278
$$ 89074725 82566842 76094434 69862906 64072381 58761896 53856479 49341346 45602068
11261D5602068l235138k893931k364851j734707j218235j010321r53509p86242
$$ 45602068 42366930 39472999 37108148 35373441 34155206 33144885 32191376 31405134
11253C1405134o39323o06972n71682o14378p69573p13741q41591j003265r94126
$$ 31405134 30765811 30158839 29587157 28972779 28203206 27489465 26647874 25644609 24650483
11244B4650483j083730j088626j254484j240840j281550j105957j092313r27544
$$ 24650483 23566753 22478127 21223643 19982803 18701253 17595296 16502983 15575439
11236A5575439q52329q71642p61246q47162p92526q38509p82347o84615p19638
$$ 15575439 14723110 13851468 13090222 12243060 11450534 10612025 9829678 9145063 8425425
11227H425425n14024m15826l66506l98205l54841k31271k10482k31155j86408
$$ 8425425 7911401 7495575 7129069 6730864 6376023 6144752 5934270 5703115 5516707
11218E516707j76609k30007l09945k37702j45812j12095o5581j72884k01075j61299
$$ 5516707 5340098 5110091 4800146 4562444 4416632 4304537 4238956 4066072 3864997 3703698
11208C703698k7916J4291j47268j09882q2113l4667j01774j04702R584l4269m3716
$$ 3703698 3675782 3690073 3542805 3432923 3350810 3316143 3214369 3109667 3119251 3084982 3041266
11197C041266r9226m051j19042k99646j64409R1470O5406j42811j14941k9657
$$ 3041266 2942040 2937989 2818947 2519301 2354892 2446362 2511768 2368957 2254016 2224359
11187B224359Q2104p3176j50565m8688J9921L9020J4171m5358l226q7271j08693
$$ 2224359 2306463 2233287 2082722 2034034 2053955 2092975 2107146 2061788 2058562 1971291 1862598
11176A862598j53437o8090o018P6828J39436N3442r1039o9927k7834r5495Q2563
$$ 1862598 1709161 1641071 1635053 1711881 1851317 1904759 1813720 1743793 1715959 1620464 1703027
11165A703027O5439J2867k0590m9074K7431O051o5139o4374n369Q5063N4263J39226
$$ 1703027 1768466 1781333 1760743 1711669 1739100 1745151 1680012 1615638 1610269 1695332 1749595 1888821
11153A888821l1111j27943r1795R4305J60218O2098n8603j64330r8399k9377J21120
$$ 1888821 1857710 1729767 1637972 1732277 1892495 1954593 1895990 1731660 1633261 1603884 1725004
11142A725004O4327j22335m4650J6469q1858j15093K7001M5105q187j1209o1239
$$ 1725004 1789331 1666996 1622346 1638815 1556957 1441864 1468865 1513970 1505783 1494574 1433335
11131A433335J6716j8062m3750k8836j44054o5019L6995L0584N3048J4309J11609
$$ 1433335 1450051 1431989 1388239 1359403 1215349 1150330 1187325 1217909 1270957 1285266 1396875
11120A396875P1076l5153j21572n0851M5927K4702r4479k0426l0895j8356M8469
$$ 1396875 1467951 1432798 1311226 1260375 1306302 1331004 1236525 1216099 1185204 1166848 1215317
11109A215317j15593j5022R536n8153p746J16557K1229q4088j49973j7071N8446
$$ 1215317 1099724 1084702 1094238 1036085 1028339 1144896 1166125 1082037 932064 914993 973439
11098I73439J38616J6867q0346n3459J9300J1350L3288p2896k4229J6339p8136
$$ 973439 1112055 1128922 1048576 995117 1014417 1025767 1059055 986159 961930 978269 900133
11087I00133J0558M6955J22005R7385j8679j16633j08640O0093o2694k3657l6210
$$ 900133 910691 957646 1079651 1177036 1158357 1041724 933084 993177 930483 906826 870616
11076H70616R873l0323L8442N4187J01795k2745j8452l4034p5252l226j04897
$$ 870616 880489 850166 888608 942795 1044590 1021845 1003393 969359 894107 890881 785984
11065G85984j5639J73833J6897o9504j22220R7585L3015O4301M3962Q9672k333
$$ 785984 770345 944178 961075 891571 769351 866936 899951 964252 1008214 1097886 1095553
11054A095553j70698j46369N7009K05152J96952R3698j6873m2895j5697K7174
$$ 1095553 924855 778486 835495 1040647 1237599 1331297 1314424 1271529 1255832 1283006
11044A283006L1641j20047j05204l0106J16110J42300m7610k8189J22012J41566
$$ 1283006 1314647 1194600 1089396 1059290 1175400 1317700 1270090 1241901 1363913 1505479
11034A505479J09906j1189q7488K0071o2674q3426K0405K734J9564J9570R7418
$$ 1505479 1615385 1604196 1516708 1536779 1474105 1390679 1411084 1413818 1433382 1452952 1550370
11023A550370K36066J75122O2405j54669j30840j71802j31362j17440j27958Q8205
$$ 1550370 1786436 1961558 2023963 1869294 1738454 1566652 1435290 1317850 1189892 1278097
11013A278097K23593P4397R8114P5297J9553j35632k46946j22717K5016m3041
$$ 1278097 1501690 1576087 1674201 1749498 1769051 1633419 1386473 1263756 1288772 1245731
11003A245731r1621j0988P400P6915J11469N5102J4991j48540j29326O2578m913
$$ 1245731 1154110 1143122 1150522 1227437 1338906 1394008 1408999 1260459 1131133 1193711 1188798
10992A188798q4310j57200j11793j617N5326P6039K5972m7358o0573j5604n326
$$ 1188798 1104488 947288 835495 833878 889204 965243 991215 943857 883284 867680 862354
10981H62354N0834n5549j33389Q5696P4429P0594j3305r5890j0169p0018n0863
$$ 862354 913188 857639 724250 809946 884375 954969 941664 845774 835605 765587 714724
10970G14724Q0305r41n4932m05J75964P599n2123O8683J8557p9898M0790m9500
$$ 714724 795029 794088 739156 738751 914715 922314 870191 938874 957431 877533 918323 868823
10958H68823m5619M2446m311r3912m1926J44445P8641k7794M3383j4475j7231
$$ 868823 823204 865650 861339 767427 725501 869946 948587 920793 964176 949701 932470
10947I32470n1244r4867P1369J13891J41344j6439k3407q152r1820o6153p4914
$$ 932470 881226 786359 857728 971619 1112963 1096524 1073117 1064965 973145 906992 832078
10936H32078j22066O4613P6834M2766J2067k0439Q1308Lk6377L484J7492m9667
$$ 832078 710012 774625 851459 894225 906292 885853 967161 967164 940787 944271 961763 912096
10924I12096M3073J01094N6500L1558l7887j49933j99409N1492j5372k1517M4282
$$ 912096 955169 1056263 1112763 1144321 1106434 956501 757092 808584 793212 771695 815977
10913H15977j2437j04601n593L013M9929K02402R5711m1780l6794R5468q48J54163
$$ 815977 803540 698939 693346 696359 746288 948690 1044401 1002621 965827 1061295 1060447 1214610
10901A214610J62224j5711J2008M4284M9942Q8506M0957N8517J22233p3159p2184
$$ 1214610 1376834 1361123 1373131 1417415 1467357 1555863 1596820 1655337 1777570 1704411 1632227
10890A632227K4090J60032r0946m0953k9089l1006q0315L1841l6730N1200q774
$$ 1632227 1656317 1816349 1725403 1684450 1655361 1624355 1544040 1575881 1539151 1590351 1581577
10879A581577n8692l9038N2795l0827j16033m8900j58649j05347J8323l7454M6212
$$ 1581577 1522885 1483847 1536642 1505815 1389782 1340882 1182233 1076886 1095209 1057755 1103967
10868A103967j7220j03425N4320q6100K5025J01376l6516j14277l6323P0599R4676
$$ 1103967 1086747 983322 1037642 951542 976567 1077943 1041427 927150 890827 961426 1056102
10857A056102P8971j10571m7375K00497J41729J4477J11255K4836O5627R6216
$$ 1056102 1135073 1024502 977127 1177624 1319353 1333830 1445085 1469921 1535548 1631764
10847A631764n8003j34987l9233r4264O7362N9598M1072J4657p4028Q8112n816
$$ 1631764 1573761 1438774 1399541 1305277 1372639 1432237 1473309 1487966 1413938 1502050 1496234
10836A496234n1964j28796j72361j13919O0223n7351j31033K4583R1563L1247
$$ 1496234 1444270 1315474 1143113 1029194 1089417 1032066 901033 925616 1017179 1048426
10826A048426R412o5521M014k7549k2738M3795j71183j07981l8335q7539m1264
$$ 1048426 1057838 992317 996331 968782 946044 989839 818656 710675 672340 584801 543537
10815E43537L1744N7679O9420Q2319J19080N710j31551j2901j3055l5514j38667
$$ 543537 575281 632960 702380 784699 903779 909489 777938 765037 751982 716468 577801
10804E77801k810Q8356l835P251p2165O4440J03943r4736l0299K8357N8605o3770
$$ 577801 574991 663347 659512 666763 594598 659038 762981 668245 637946 666303 724908 661138
10792F61138n1121o9599N0085O4923J30702J44217J1307o3872o0821q0759j4592
$$ 661138 610017 540418 590503 655426 786128 930345 941652 877780 816959 736200 721608
10781G21608j3941n6700k6169j02131N3817j1090j29353L3326P1481J42948L7323
$$ 721608 707667 650967 624798 522667 576484 565394 436041 469367 540848 683796 721119
10770G21119p7559o3345l4746l8920K1426L53J16724M5951M0775P2785o3674K2455
$$ 721119 643560 580215 545469 506549 527975 528328 645052 691003 731778 804563 740889 763344
10758G63344J77867Q0548o2837j26277l2238l6500J18064K8013J53149Q0420N840
$$ 763344 941211 1021759 958922 832645 800407 763907 881971 909984 1063133 1143553 1149393
10747A149393m5764l6324k7604l9783l3978O399L2684J46407P4867k483J19525
$$ 1149393 1103629 1067305 1039701 999918 965940 972339 1005023 1151430 1226297 1223814 1343339
10736A343339Q7239j10590J6213M8315L7349K0252L8747m7171n0671R980M7621
$$ 1343339 1430578 1319988 1336201 1384516 1421865 1442117 1480864 1433693 1383022 1393002 1440623
10725A440623m2735N7767K2057o0280L3659l4502j61586O375O8960J9382p7419
$$ 1440623 1397888 1455655 1477712 1417432 1451091 1416589 1255003 1261378 1330338 1349720 1272301
10714A272301M1023m2083K6781N8235r9201r2095j18190l0034R997J1208J34167
$$ 1272301 1313324 1271241 1298022 1356257 1257056 1164961 1046771 1016737 1026734 1037942 1172109
10703A172109L6248Q264K8646j8635Q6119K0434P957r8529n1226O1170O6205j0763
$$ 1172109 1208357 1216621 1245267 1226632 1312751 1333185 1341142 1242613 1191387 1252557 1318762 1307999
10691A307999j22497M1677L1253J23586J81050l0314p650M7451j7880m0655p5103
$$ 1307999 1185502 1227179 1258432 1382018 1563068 1532754 1525104 1572555 1554675 1514020 1438917
10680A438917l4921K9140N5266K2269J9906N1645R8653k9861j80647j8084k0004
$$ 1438917 1403996 1433136 1488402 1510671 1530577 1582222 1680875 1651014 1470367 1452283 1432279
10669A432279K3744J12327m0226q7182J0681K10353R2695m7470P8866J37915M5286
$$ 1432279 1456023 1568350 1528124 1440942 1451623 1661976 1754671 1707201 1786067 1923982 1969268
10658A969268Q738L8179N2348J66524J05917J7156R3506R4862J13264J86273J38981
$$ 1969268 1978006 2016185 2068533 2235057 2340974 2358130 2451636 2546498 2659762 2846035 2985016
10647B985016J9756M372K25807J65694J89298K67973M62793M97455L74104M35369
$$ 2985016 3004772 3009144 3234951 3400645 3589943 3857916 4320709 4818164 5192268 5627637
10637E627637K64959K2768Q4830J66511Q2993J87776J79134K31456J49614K52757
$$ 5627637 5892596 5915364 6000194 6166705 6249698 6437474 6616608 6848064 6997678 7250435
10627G250435N51979O25247R94693J349522J598718K178194L211100M319957N555980
$$ 7250435 7802414 8427661 9422354 10771876 12370594 14548788 17759888 22079845 27635825
10618B7635825O948094Q101662Q432891O880298L741963J51332k008907j740212
$$ 27635825 34583919 42685581 51118472 57998770 61740733 61892065 59883158 58142946
10610E8142946r0902K439169N661001R209477J3336848J6187445J6406739J2190995
$$ 58142946 58052044 60491213 66152214 75361691 88698539 104885984 121292723 133483718
10602A33483718L641728n080532r465927q694330m785654L61767O005208J1553124
$$ 133483718 137125446 132044914 122578987 113884657 109099003 109460770 115465978 127019102
10594A27019102J6922072K0438128J9403437J1447815j982142j4528210j9997693
$$ 127019102 143941174 164379302 183782739 195230554 193248412 178720202 158722509
10587A58722509j8432721j3491820p456101j733208L283399P494444J0041857
$$ 158722509 140289788 126797968 119341867 117608659 120892058 128386502 138428359
10580A38428359Q815603L057955o077244j4045439j6948476j5118418j1210017
$$ 138428359 147243962 150301917 144224673 130179234 113230758 98112340 86902323
10573H6902323p277044l906024j192103Q01075J575602R03796j618503n298920
$$ 86902323 79625279 75719255 74527152 75328227 76903829 77807625 76189122 70890202
10565G0890202q101926r135045q453254p042168n566309m387414l473914k661811
$$ 70890202 62788276 53653231 45199977 38157809 32591500 28204086 24730172 22068361
10557B2068361k278475j820548j567593j444019j225254j138524j190343j101214
$$ 22068361 19789886 17969338 16401745 14957726 13732472 12593948 11403605 10302391
10549A0302391r87648q19037p72577q26459o75927o25160m79051m10352l81410
$$ 10302391 9314743 8495706 7723129 6896670 6220743 5595583 5116532 4706180 4324770
10540D324770m20755l73492l37231j71470k18210j35984k20987k83989k82493
$$ 4324770 3904015 3530523 3193292 3021822 2803612 2667628 2446641 2162652 1880159
10531A880159j71014j46968r8197j17076j12673j18430K7894j39948j13004K7527
$$ 1880159 1709145 1562177 1463980 1346904 1234231 1115801 1143695 1003747 890743 918270
10521I18270m0502j94272o2233j7940K4607m0273j17976j16411p335J17613L3480
$$ 918270 877768 683496 621263 603323 627930 587657 469681 353270 345935 463548 497028
10510D97028j46271K8123J06034J40809O646j25108q4570O7763L5950L6213n7908
$$ 497028 350757 378880 484914 625723 632369 507261 422691 490454 526404 562617 504709
10499E04709O19O9224J35281K2470J4238m0078m7406q0977k07711o0315K1600
$$ 504709 505328 574552 709833 732303 746541 706463 659057 578080 370369 310054 331654
10488C31654q0307n6041L8514k5520j26082O5375J9663L9970j35152j38793R5997
$$ 331654 251347 195306 233820 208300 82218 147593 167256 207226 72074 -66719 29278
10477B9278J81640R7386k9407r6419k9945l7130K0933l6206O0428L705L7238j03165
$$ 29278 210918 308304 278897 182478 152533 115403 136336 100130 160558 164263 201501 98336
10465I8336O4856M8403j3208M4256m4983j49103n4168K13153K3154m4512j7436
$$ 98336 163192 211595 198387 242643 197660 48557 -5611 207542 230696 186184 168748
10454A68748j0957j18611r4190R7701K8746m1506m42L5197o3461Q978M9050J7726
$$ 168748 157791 39180 -55010 42691 71437 29931 29489 64686 1225 10203 59253 76979
10442G6979P320N6616n0713M226J0069q208n0044n3469J22112q8561R6201K0490
$$ 76979 84299 140915 90202 94428 104497 96289 46245 -7224 114888 26327 122528 143018
10430A43018l7121o0441K663O4599P4817M7975N9231l7580k1257j7005m6475j7935
$$ 143018 105897 45456 48119 112718 187535 235510 294741 257161 235904 218899 172424 154489
10418A54489M3093N351k3720j25638k7676L1578l8105j3892o0053J8536J01236
$$ 154489 197582 202933 179213 53575 25899 57477 19372 5480 -54573 -36037 65199
10407F5199J33743R353m5008J2765J6421l0279n8991J1719N9804k4156P913M5215
$$ 65199 198942 208295 163287 176052 192473 162194 103203 114922 174726 150570 158483 203698
10395B03698l8404j92932m3054Q8316Q782n2156M7034L5152L4884k3705R953j8658
$$ 203698 165294 -27638 -70692 17624 26406 -25750 21284 56436 91320 67615 77568 58910
10383E8910j26586M6479M7141L4090p259j8075P9366j7232j05158j11698Q805
$$ 58910 -67676 -21197 25944 60034 52775 34700 114066 96834 -8324 -120022 -111217
10372a11217J5454K2996J34816L8274p412l6692N1504q5462k8683j12718P4313
$$ -111217 -95763 -72767 62049 100323 92911 56219 107723 22261 -6422 -119140 -44827
10361d4827N2361q7904J6897O0078n5829J05563O1097J6333M0298J4860o491q8545
$$ -44827 7534 -80370 -63473 -3395 -59224 46339 107436 123769 164067 178927 172436 83891
10349H3891j75850l9276R8029N6622o0765m1101j8601O4551L7493o2132l5730
$$ 83891 -91959 -131235 -33206 23416 -37349 -78450 -97051 -32500 4993 -57139 -92869
10338i2869N4740P6634O3427n8659L9786m5415j07809r1403l2143P187k7008R4148
$$ -92869 -38129 38505 101932 43273 83059 37644 -70165 -161568 -193711 -186524 -213532 -119384
10326a19384J03921o074R6645O615R8152j2109m9611j7827l443Q0497R8257q9884
$$ -119384 -15463 -21537 75108 81723 179875 167766 118155 100328 96885 177382 275639 185755
10314A85755j22043O625p8955K7138P6921J9036j011o8838J7572j9102m330j00201
$$ 185755 63712 70337 -8618 18520 95441 114477 113466 44628 62200 43098 38768 -61433
10302f1433l7198O7608l7257k152R9472J7148R3277O0646K1134j6543r9804n347
$$ -61433 -98631 -31023 -68280 -70432 29040 46188 139465 200111 221245 204702 104898 99551
10290I9551m9892r7169k704K2185J29546J14724n3447q0712P261l2881j19435
$$ 99551 49659 -47510 -50214 -28029 101517 216241 162794 82082 89343 56462 -62973
10279f2973k1063L8352P0234O607p7848m5321o033p6823q6621M9520J81328J5007
$$ -62973 -84036 -45684 24550 31157 -46691 -92012 -98045 -174868 -261489 -211969 -30641 -15634
10267a5634l8297k0949m7097k6046M81m0457J09244L9712j1068k1177O6552L5146
$$ -15634 -53931 -74880 -121977 -148023 -147542 -187999 -78755 -39043 -50111 -71288 -4736 30410
10255C0410j07665n0822J01526J70611Q7586L1731r030q2689p9116K3821N0785
$$ 30410 -77255 -128077 -26551 144060 231646 263377 254347 171658 92542 116363 167148
10244A67148n7182N7412o6374j35697k429J0222m2733J22229j3619n3135p6638
$$ 167148 109966 167378 101004 -34693 -37122 -26900 -69633 52596 38977 -14158 -90796
10233i0796j051J28780J0940l0610K0992K4012N6842k2017k5279k3266k970R1761
$$ -90796 -91847 36933 47873 17263 38255 62267 119109 97092 71813 48547 45577 137338
10221A37338N8764k9701k5126l3910j7737n1894j23979L5350O2163O0499k5711
$$ 137338 196102 166401 141275 107365 89628 37734 -86245 -50895 11268 71767 46056
10210D6056o9692N103p965m9151L9823P2861m2790j43221o0687L8403K2127m8196
$$ 46056 -23636 -18533 -26498 -75649 -35826 37035 -5755 -148976 -209663 -171260 -149133 -197329
10198a97329N4236J72810n6621P6832l4722K915J37450M7828k1304J07642j08718
$$ -197329 -143093 29717 -26904 49928 15206 18121 155571 203399 182095 289737 181019
10187A81019k30736j01305P0792M6875J60046Q7556K0562J29413Q4135n4182M315
$$ 181019 -49717 -151022 -80230 -33355 126691 214247 234809 364222 448357 394175 398490
10176C98490J09790K0416j03736K594l0763J00968J37622N3357N3159Q9529N6571
$$ 398490 508280 528696 424960 427554 396791 497759 635381 688738 741897 831426 887997
10165H87997p072j50174o4575m7178J08o041J22086J89847R1994N1896n0108m5887
$$ 887997 880925 730751 666176 618998 619106 613065 735151 924998 1016992 1068888 1018780 972893
10153I72893o8729m4569k22773j11008j20925J6142m4030P2983J11217Q5402R5434
$$ 972893 904164 859595 636822 525814 404889 421031 377001 449984 561201 646603 742037
10142G42037m0052o3247j89053j06328p8272O374N5067L6041M3058J10953L3134
$$ 742037 701985 638738 449685 343357 265085 271459 326526 362567 405625 516578 549712
10131E49712m9925M2238r2374k40716L4168j6506r1077p162J68830r4065r1426
$$ 549712 499787 542025 449651 208935 243103 226597 135520 128358 297188 203123 111697
10120A11697L5156j32484j10397L025J03488J23802j04854j16498j12314N1051
$$ 111697 146853 14369 -96028 -93003 10485 134287 29433 -87065 -199379 -148328
10110a48328N7251J3836J57668J64685Q3990j22274j76022M5522Q0554N1496P7100
$$ -148328 -91077 -77241 80427 245112 329102 206828 30806 76328 156882 208378 285478
10099B85478L3213j46965p1168r4200o8311P0962p0458q2272J1091m1412J41850
$$ 285478 318691 171726 100558 6358 -61953 9009 -61449 -143721 -132630 -174042 -32192
10088c2192O0832J09419n6801j26101k9985Q354K7990J21926J44187m7448K3521
$$ -32192 28640 138059 81258 -44843 -74828 -66474 -38484 83442 227629 180181 203702
10077B03702l519j6564n5826j37194l1512P4530P3877M2832J40626M8624K1178
$$ 203702 200183 183619 127793 -9401 -40913 33617 107494 150326 290952 339576 360754
10066C60754j07507m1736Q1706j01522j28922j33593j0204Q0271J43262p094j16829
$$ 360754 253247 211511 293217 191695 62773 -70820 -81024 -753 142509 135415 18586
10055A8586p0715J7643l7289p401Q3498N2766L137Q97j01815j14398j5967J14214
$$ 18586 -52129 -34486 -71775 -79176 4322 57088 60225 61122 -40693 -155091 -171058 -56844
10043e6844l6758J02301K0665L702k9460q5621l986K2243r7073N0600L663r8747
$$ -56844 -93602 8699 29364 33066 3606 -82015 -86001 -63758 -160831 -110231 -106568 -205315
10031b05315O8105J0030O8223k3688M6937J52143j6682l6748o6740M8540j1074
$$ -205315 -137210 -127180 -58957 -82645 -35708 116435 99753 63005 -3735 44805 33731
10020C3731k1407j43077j750K2437o7782o7353K2943K0845J31352k2042K5950
$$ 33731 12324 -130753 -132503 -110066 -177848 -245201 -222258 -201413 -70061 -92103 -66153
10009f6153L2093m8107k3842J07753q6618O940J37433p985j06912O0806N6630
$$ -66153 -34060 -82167 -106009 1744 -84874 -77934 59499 51514 -55398 5408 62038
9998F2038m9214j92561o9576p2229P3917J71214l6766m8653O1911J19207K6563
$$ 62038 12824 -179737 -249313 -321542 -247625 -76411 -113177 -161830 -99919 19288 45851
9987D5851l4189N61p605n9050L5047r544j7224R1341K2865K6367j7898j04795
$$ 45851 11662 12223 4618 -54432 -19385 -28929 -46153 45188 68053 94420 76522 -28273
9975b8273O3583M3226N0786k8007j6806m3959l2329K9914J37920l4175m0241l5940
$$ -28273 35310 78536 129322 101315 84509 40550 8221 38135 176055 141880 101639 65699
9963F5699r8760K0615K4059P816k1451k6949m0712J37943M2894J4166n1427p2811
$$ 65699 -33061 -12446 11613 19429 -2022 -28971 -69683 68260 111154 125320 73893 1082
9951A082l7841r7414l8791R2507J16078j9691k2489n638O7203J7149l4832l6424
$$ 1082 -36759 -134173 -172964 -80457 35621 15930 -6559 -12197 55006 72155 37323 899
9939H99O0440M8927l732K8888Q4608R7402J19578N9578O8963p6868k84060k53434
$$ 899 61339 110266 106534 135422 220030 317432 437010 496588 565551 488683 204623 -48811
9927d8811R125Q0670p1901O1307M4749J8758n1370O9233j283n6514j43519Q2244
$$ -48811 -39686 40984 -30917 30390 75139 93897 42527 111760 110477 53963 -89556 -7312
9915g312J02805j3196l9191K7599M0949P488o6488j24322K1994j845o7373J20065
$$ -7312 95493 82297 43106 70705 111654 119142 52654 -71668 -49674 -51519 -118892 1173
9903A173J23154M0971l4665J2898j0548R3673p6077j41606o480K8039l2368r8881
$$ 1173 124327 165298 130633 143531 132983 226656 150579 8973 2493 30532 -1836 -100717
9891a00717N8709r7325K2488J28497L1492k2254N0633J02914J2728p6675m8179
$$ -100717 -42008 -139333 -116845 11652 43144 20890 71523 174437 187165 110490 62311
9880F2311l4117R1394O5085j01573j81326q6100o267R1943O2022J06677q599L1445
$$ 62311 28194 119588 184673 83100 -98226 -184326 -190593 -98650 -36628 70049 61450 92895
9868I2895k7271N1995L4630o6726O0948L7477o2295n9826p6120l8174Q0303j04517
$$ 92895 65624 117619 152249 85523 146471 183948 121653 61827 -14293 -52467 27836 -76681
9856g6681j6653J598P9399k2260j2617O5499K5630m5879k8716r1646J2498M0038
$$ -76681 -93334 -91736 -12337 -34597 -47214 18285 43915 -1964 -30680 -122326 -109828 -69790
9844f9790K3843k6014J6222n3291M1059k3936q6502n394J56100R9968R81N9331
$$ -69790 -45947 -71961 -55739 -109030 -67971 -91907 -178409 -183803 -27703 72265 73246 132577
9832A32577N0328K1501n8939j40715p3834Q6648k5778l3901J374O0209O8140r490
$$ 132577 182905 204406 145467 4752 -69082 17566 -8212 -42113 -40739 19470 87610 78120
9820G8120J5098N1718O6333j16446j62046k7466M3481L1676l8448K1028J9159
$$ 78120 93218 144936 211269 94823 -67223 -94689 -51208 -19532 -57980 -36952 -17793
9809a7793Q5205K8303m1892O2051p0280L380Q7229L39m7935q2101q9099P3023
$$ -17793 67412 95715 53823 115874 45594 48974 136203 136542 88607 6506 -82593 -9570
9797i570k8662l7775J80876J57328k6281j18826q8276j87587l316n4935M1598
$$ -9570 -38232 -76007 104869 262197 235916 117090 28814 -158773 -162089 -217024 -175426
9786a75426M6527K2097j30528K0228J75281K9447L3050N9086K5073k1313K880
$$ -175426 -128899 -106802 -237330 -217102 -41821 -12374 20676 79762 104835 83522 86402
9775H6402L997M140j06998J9905m2151K6322J9475k2198p0688j14673L1732P3774
$$ 86402 90399 94539 -12459 7446 -34705 -8383 11092 -11106 -81794 -196467 -164735 -90961
9763i0961m3037k6762P430j07870L5661Q7652J35136n109q1329m4465K3636L7366
$$ -90961 -133998 -160760 -153330 -261200 -225539 -137887 -2751 -7860 -89189 -133654 -110018 -72652
9751g2652m3076j0931k3612M4538Q743O0691J14175k9853l1189j25773n8756o8144
$$ -72652 -115728 -126659 -150271 -105733 -96990 -36299 77876 48023 16834 -108939 -167695 -235839
9739b35839L1486N8703R3359k9128P7267m2985n1235q8230J6044M5113O2952j0902
$$ -235839 -204353 -145650 -52291 -81419 -4152 -47137 -98372 -186602 -170558 -125445 -62493 -73395
9727g3395R5172l2904P007o4264n7683L7373J5604P2551L4933m2218m9960o2141
$$ -73395 21777 -11127 -4120 -68384 -126067 -88694 -73090 -539 34394 -7824 -57784 -119925
9715a19925j02732r8411J33199J63341J03659R9943j4879q9342K056Q2842J4087
$$ -119925 -222657 -321068 -187869 -24528 79131 179074 164195 74853 76909 159751 173838
9704A73838k7352j76836j13888K9608l1285o7105L0221Q1314M9685r7177K2900
$$ 173838 146486 -30350 -144238 -114630 -145915 -213020 -182799 -101485 -51800 -148977 -126077
9693a26077J00754k1274J25960J2166p175N379k467r3695p0636K5774M5185l9323
$$ -126077 -25323 -46597 79363 91529 84354 89733 87266 -6429 -77065 -51291 -6106 -45429
9681d5429n3313O7O5029J9336Q8368r7216k5990L0459n7423P4748J0982M4257
$$ -45429 -98742 -98675 -33646 -14310 74058 -23158 -49148 -18689 -76112 -1364 9618 53875
9669E3875P4977P1638j62512j32093o0660p7533J40364M8793R1019J13444n5112
$$ 53875 128852 200490 37978 -94115 -154775 -232308 -91944 -43151 47868 161312 106200
9658A06200m3061J20368J70765J86310L34621K88825J58404k96262l74402k75682
$$ 106200 63139 183507 354272 540582 875203 1164028 1322432 1026170 651768 376086
9648C76086r472o1180L2167j2892j19216n6881J57073M4253K37k0594m0050j04125
$$ 376086 366614 305434 337601 324709 205493 148612 305685 349938 350175 329581 289531 185406
9636A85406n8996k0935k4010P177P0130j80135j14470J37384L6721j8635p4205
$$ 185406 126410 105475 81465 88642 158772 -21363 -135833 1551 38272 19637 -54568
9625e4568l4785O4393n1950l4086n313L2449p4849P5656J34593n2940p8292q2382
$$ -54568 -89353 -24960 -76910 -110996 -116309 -83860 -158709 -83053 51540 -1400 -79692 -162074
9613a62074k5010R2793K2421m5266N5501m7840m0778O4984R5965l6406q7109O5507
$$ -162074 -187084 -94291 -71870 -117136 -61635 -109475 -150253 -85269 10696 -25710 -112819 -47312
9601d7312n1792n0249J3290P69L2740n595K4755L1389K8096L6716k6933m9681
$$ -47312 -99104 -149353 -136063 -135294 -102554 -108149 -83394 -52005 -23909 12807 -14126 -63807
9589f3807R0402q2051j09117J71143O9523l3209m8773m7235l1578K6763K908J9429
$$ -63807 26595 -55456 -164573 6570 76093 42884 -5889 -53124 -84702 -57939 -55031 -35602
9577c5602J42842j945q7878n9876l4734J09480N9954o4405p4523O7293Q695l8948
$$ -35602 107240 105295 17417 -42459 -77193 32287 92241 27836 -46687 20606 29301 -9647
9565i647p478o3401M6424M3020j5397q1640l9595l741M4725J57838q6814J8520
$$ -9647 -17125 -80526 -34102 8918 -6479 -88119 -127714 -131455 -86730 71108 -15706 2814
9553B814O993q8406j09558j2257J06669K5604L3676J90765R4822k3592l1352N7518
$$ 2814 9807 -78599 -188157 -200414 -93745 -68141 -34465 156300 251122 227530 196178 253696
9541B53696j8521j49347j52712l778N806J30392k7972m682K2080J9766P471j33802
$$ 253696 235175 85828 -66884 -70662 -64856 65536 37564 32882 54962 74728 82199 -51603
9529e1603m2768J51810Q666p3478M9758j8784j06651p060L868N472m1230J0517
$$ -51603 -94371 57439 66105 -7373 42385 23601 -83050 -90110 -86242 -80770 -122000 -111483
9517a11483J6065m5710q2893J32340N1161O889L5268m0319r0391J5492J31825
$$ -111483 -95418 -141128 -224021 -91681 -40520 -33631 1637 -38682 -129073 -113581 18244
9506A8244o0849j44901j3778Q4695L9623l062K418k3910q909J09064P7570J9390
$$ 18244 -42605 -187506 -201284 -116589 -76966 -80028 -77610 -101520 -110429 -1365 76205 95595
9494I5595M05J3121k6141L0472M8615L0513Q0543k2700P033j15960k4604K2420
$$ 95595 96000 109121 82980 113452 162067 192580 273123 250423 257456 141496 116892 139312
9482A39312l9076j25376j39715n0771O6283J5262K9663k4819J06527M9531k8345
$$ 139312 100236 -25140 -164855 -215626 -149343 -134081 -104418 -129237 -22710 26821 -1524
9471a524j07377L3445O5347m4540p6364k5899J7221L7150Q0375j3821M2664n612
$$ -1524 -108901 -75456 -10109 -54649 -131013 -156912 -139691 -102541 -22166 -35987 6677 1065
9459A065p3249J06971O4540r716p9056l8663J50428J02380m8920o5183J4830j2905
$$ 1065 -72184 34787 99327 89611 10555 -28108 122320 224700 175780 110597 125427 112522
9447A12522r0265L6799o1681j07911m8058K3286L8395Q5522J97566J3343n924
$$ 112522 22257 59056 -2625 -110536 -158594 -135308 -96913 -11391 186175 199518 193594
9436A93594j07848k7839k7961j1704o6128L0501L0771l5424j01898p2662l041
$$ 193594 85746 57907 29946 18242 -47886 -17385 13386 -22038 -123936 -196598 -199639
9425a99639M9067m8728J18110Q2106N1870j02257j57006J4309J36168M1174r2952
$$ -199639 -150572 -199300 -81190 916 52786 -49471 -206477 -192168 -56000 -14826 -107778
9414a07778J16666l7843P92J38134m4011j20136k3786J01642J52079J25087k4113
$$ -107778 8888 -28955 -28163 109971 65960 -54176 -77962 23680 175759 300846 276733
9403B76733r0609r1898j01327j02721N8399J00095Q0869J00846M0334L000n2888
$$ 276733 186124 94226 -7101 -109822 -51423 48672 129541 230387 270721 273721 220833
9392B20833o4082j2504r6146j2560j48702l0651j338K5942k0080L4041M9268q627
$$ 220833 156751 144247 48101 35541 -113161 -143812 -145150 -119208 -139288 -105247 -55979 -64606
9380f4606m0755l439M1045q6257J45513Q7908n0705r4022k6847M0831L6489J84346
$$ -64606 -105361 -108800 -67755 -154012 -8499 79409 28704 -65318 -92165 -51334 -14845 169501
9368A69501O2372p2944j13264j48650j49570O1227k4449K8612J9924m2449J27997
$$ 169501 231873 158929 45665 -102985 -252555 -191328 -215777 -187165 -167241 -209690 -81693
9357h1693O0881j2958j9555j08543L7391M4875l1971p569P7374L7712J6882K0756
$$ -81693 -20812 -33770 -53325 -161868 -124477 -79602 -111573 -119142 -41768 -4056 12826 33582
9345C3582p217j14202K3866J17558J29928J0597j9304J5498r0565j18145P337
$$ 33582 26365 -87837 -63971 53587 183515 194112 174808 190306 99741 -18404 -11067
9334a1067M5724n2507Q346l8496R491j6285q3653k013Q2769L6563k6437P079m7199
$$ -11067 34657 -17850 -9504 -48000 -38509 -54794 -138447 -140460 -57691 -21128 -47565 -40486 -87685
9321h7685M0137K02589j16433j16206n536j0536L3423p7477J09216R3940j31473
$$ -87685 -47548 155041 38608 -77598 -83134 -93670 -60247 -137724 -28508 65432 -66041
9310f6041r6074J12869K51122q6725j36833J7395Q4625M7242K1697p4828o7589
$$ -66041 -162115 -49246 201876 115151 -21682 -4287 80338 127580 149277 74449 6860
9299F860J9894L1968J1732n3485J3417q1030r5780o4683L333Q0145J71008J01683
$$ 6860 26754 58722 70454 16969 30386 -50644 -146424 -211107 -207774 -127629 43379 145062
9287A45062j7039n6872K3864j26280j07498L2023K6162k3926J9559O0653J00704
$$ 145062 128023 71151 95015 -31265 -138763 -106740 -80578 -104504 -84945 -24292 76412
9276G6412M3112R046r579m941J2647N535o0006q3603o7529O919L0945k4644R2445
$$ 76412 119524 128570 118991 114050 126697 132232 72226 -11377 -78906 -71987 -41042 -65686 26759
9263B6759O3537J16846j88133j49063r1401o2070K4915P4237J73675j3798q0159
$$ 26759 90296 207142 19009 -130054 -221455 -283525 -258610 -184373 -10698 -24496 -104655
9252a04655l3333R5360J3648J4733R530J5438l7534q7816J26565K1724l9957m6203
$$ -104655 -137988 -42628 -28980 -14247 -4717 10721 -26813 -114629 11936 33660 -6297 -52500
9240e2500P7145r2422r3964M3943Q119R226m1577L8932R7502n1518J11490m632
$$ -52500 24645 -67777 -161741 -117798 -109679 -100453 -142030 -103098 -5596 -57114 54376 49744
9228D9744j38823L7748N3268o0042P1617k6497j55k9782K3859l9382L2752o1503
$$ 49744 -89079 -51331 1937 -58105 13512 -12985 -13140 -42922 -19063 -58445 -25693 -87196
9216h7196l4117o743q9531L1032M2013l6931N0988L9900O6503J94567L227n0139
$$ -87196 -121313 -128056 -217587 -186555 -144542 -181473 -130485 -90585 -24082 170485 173712 123573
9204A23573k6729p2211n4267m0785M3125N2635L711m4058R5332Q7899n1181q5380
$$ 123573 96844 24633 -29634 -70419 -27294 25341 29052 -15006 80326 168225 117044 31664
9192C1664l4306J31319k0750p8769k2528l9350L6244J7553n4377k5961O4119O9060
$$ 31664 -2642 128677 107927 29158 6630 -32720 3524 21077 -33300 -59261 4858 73918
9180G3918q0393l9292Q146l0433J6955J61186N4037q2536j24855K0694M1282J0715
$$ 73918 -6475 -45767 -37621 -68054 -51099 110087 164124 81588 -43267 -22573 18709 29424
9168B9424J3264r6918j80804j8513J22276M9893O0644J37477J2959k6817o6806
$$ 29424 42688 -54230 -235034 -253547 -131271 -81378 -20734 116743 129702 102885 36079
9157C6079n7208n5951M6785l0016K827K7935j50135m9665J9171J42977J7372J8158
$$ 36079 -21129 -77080 -30295 -60311 -57484 -29549 -179684 -229349 -210178 -67201 -49829 -31671
9145c1671j3297l0531l9800j3069K2161J0717m1211K8659l5909q3668P1419J11433
$$ -31671 -44968 -75499 -115299 -128368 -106207 -95490 -136701 -108042 -143951 -227619 -156200 -44767
9133d4767j9115N8497J05586L5649M6542K9104k82991k7201L3138j0962n4019
$$ -44767 -63882 -5385 100201 135850 182392 211496 -71495 -98696 -65558 -76520 -130539
9122a30539p8536p3798N1493J61248L5353L5685K6076k4419p8696m5416P4667
$$ -130539 -209075 -282873 -231380 -70132 -34779 906 26982 2563 -76133 -121549 -46882
9111d6882L6705M0908j21570m9250O0289M068k0276N2499J6653j9895j4148j700
$$ -46882 -10177 30731 -90839 -140089 -79800 -75732 -96008 -43509 -26856 -46751 -60899 -62599
9099f2599l9388N668j3350J04800J45019o68M3840M4532m5641j40076k6058j03873
$$ -62599 -101987 -96319 -109669 -4869 140150 139482 183322 227854 182213 42137 16079 -87794
9087h7794J4770N5056J8442J8668o232R0226l4825j52023K4561J62366r2245l3065
$$ -87794 -73024 -17968 474 19142 12910 103136 68311 -83712 -59151 103215 10970 -22095
9075b2095K9861R387J25134q3747n7082M9368P5274J3219j3664q721q1209j63835
$$ -22095 7766 17153 142287 58540 1458 50826 126100 139319 125655 116934 35725 -128110
9063a28110l0120L820J22316J05473k6104k5129m0953L2786M3006o851j19173
$$ -128110 -158230 -154410 -32094 73379 47275 22146 -18807 13979 56985 50134 -69039
9052f9039j55944J34158O6211l3768J37852J33854q720o5035j50416q289J07804
$$ -69039 -224983 -90825 -24614 -58382 79470 213324 204604 139569 -10847 -19136 88668
9041H8668K4321l8952m8978k3174J1515l0266J26237O5251j32836m736N6802l7095
$$ 88668 112989 74037 25059 1885 13400 -16866 109371 174622 41786 37050 93852 56757
9029E6757q5416k9046R0543j5836L711R2298k0899p9156n7134q7783Q475j5456
$$ 56757 -28659 -57705 32838 17002 20713 113011 92112 12956 -44178 -131961 -123486 -138942
9017a38942J2969L0843J69214J28640j41853m6218Q8370q9580l9862q6708J16601
$$ -138942 -125973 -95130 74084 202724 60871 14653 103023 13443 -26419 -113127 3474
9006C474M5772J0392M2606M0701m2681j5879p3760j083P2874N5533J0812q1992
$$ 3474 49246 59638 102244 142945 100264 84385 10625 9542 82416 137949 148761 66769
8994F6769r0476m3653r8914q2350L407J25514R7939M1556n2305p2579L4741j02428
$$ 66769 -23707 -67360 -166274 -248624 -245217 -119703 -21764 19792 -32513 -105092 -70351 -172779
8982a72779N6938J14952j4635l3192O8093J15114K0676J6106P4238j41714o4892
$$ -172779 -115841 -889 -15524 -48716 19377 134491 155167 171273 245511 103797 38905
8971C8905m8963L0077o5063J3245J62508J33501L204p6774n9639q3182o7873P3362
$$ 38905 -10058 20019 -45044 -31799 130709 264210 267414 190640 131001 47819 -20054 53308
8959E3308M0039L3677r0244r0114L0845J15389n0936o3324m920M642j1572J18988
$$ 53308 93347 127024 36780 -53334 -22489 92900 41964 -21360 -26280 -21638 -33210 85778
8947H5778Q2674k1865j33197k8186O0024j23638n2932p8299o0213J77720l6687
$$ 85778 168452 146587 13390 -14796 45228 -78410 -131342 -209641 -269854 -92134 -128821
8936a28821l424l8594m9088N3702Q7659L9697l6107J22460N1009j11042n3300
$$ -128821 -132245 -170839 -219927 -166225 -78566 -38869 -74976 47484 98493 -12549 -65849
8925f5849j7393n3532J48838R4072K4088P9277l9457k11122j21121J05740L2375
$$ -65849 -83242 -136774 12064 106136 130224 209501 170044 -41078 -162199 -56459 -24084
8914b4084k0310j7743p2558M3605J30477P1174K7660J6681m9572n367r162N9349
$$ -24084 -44394 -62137 -134695 -91090 39387 110561 138221 154902 105330 99963 90801 150150
8902A50150j02414K5881L6805m1988J9707j65680K025q5675j48662O171R2760
$$ 150150 47736 73617 110422 68434 88141 -77539 -75514 -161189 -309851 -303680 -210920
8891b10920L8558J40861J22725M8678p9904l5796p3180p8960R2540J28918N6134
$$ -210920 -172362 -31501 91224 139902 59998 24202 -48978 -127938 -35398 93520 149654
8880A49654j33394m0120j991l7651j06538O7183q2474l340m9156P1942J09237
$$ 149654 16260 -23860 -25851 -63502 -170040 -102857 -185331 -188671 -237827 -165885 -56648
8869e6648k5133J35991L5012m5336q5978P0097K2023J9266m0909p9949R0266N4611
$$ -56648 -81781 54210 89222 43886 -42092 28005 50028 69294 28385 -51564 38702 93313
8857I3313K985n7412K8830m031o953J31844m4629j28502j07955Q906N3441M9769
$$ 93313 96298 38886 67716 63685 56732 188576 143947 15445 -92510 -83604 -30163 19606
8845A9606O1027Q3887J6197J13970j7171j09326j71730j03247m8459N8233J50475
$$ 19606 80633 164520 180717 294687 277516 168190 -3540 -106787 -155246 -97013 53462
8834E3462J28910n9634j28507p1472p2983J6159J38975j3635j8961L262P2024
$$ 53462 182372 122738 -5769 -77241 -150224 -134065 4910 -8725 -27686 -24424 47600
8823D7600p6247j05630K9969O0289n108j32705J3899N5924m8590J19825P7706
$$ 47600 -28647 -134277 -104308 -44019 -49127 -181832 -167933 -112009 -160599 -40774 36932
8812C6932R9158j31750l1688L514J9901M4611j12387J0843K6915n7363M6406K4015
$$ 36932 136090 4340 -27348 -23834 -3933 40678 -71709 -60866 -33951 -91314 -44908 -20893
8800b0893N276M4334Q7280o6541k1039K7420l538L1003o2318m9230J5602Q9982
$$ -20893 -15617 28717 115997 49456 28417 55837 52299 83302 20984 -28246 -12644 77338
8788G7338j3503j9658m2069J2157R3993o9477j9501q275N4913k5096p4488N5597
$$ 77338 63835 44177 2108 14265 108258 38781 19280 11005 65918 40822 -33666 21931
8776B1931N4325q1205R8964q7214l7503j23760Q1272Q0533j1051j24616k2411
$$ 21931 76256 -4949 94015 6801 -30702 -154462 -73190 7343 -3708 -128324 -150735
8765a50735N4565l6135n7392Q3663J68123J16149k0586n8971l5987l4843n3183
$$ -150735 -96170 -132305 -189697 -106034 62089 178238 157652 98681 62694 27851 -25332
8754b5332J8129O2515n1419j10493O5905M620j05496n8774J48862R7990P2853
$$ -25332 -7203 55312 3893 -106600 -40695 -36075 -141571 -200345 -51483 46507 119360
8743A19360j223j72886p1278K187J83627R3899r7314P5320r1855r9618K8527l7447
$$ 119360 118137 -54749 -126027 -123840 59787 153686 56372 131692 39837 -59781 -31254 -68701
8731f8701M9664k1392Q9247j8363q1700O5059P5304K0469j01807p0646M8571L1931
$$ -68701 -19037 -40429 48818 30455 -51245 13814 89118 109587 7780 -62866 -14295 17636
8719A7636r3522l1641r4190k7867k7808L1272K7843K22197J71338m195p8111p5380
$$ 17636 -75886 -107527 -201717 -229584 -257392 -226120 -198277 23920 195258 191063 112952 37572
8707C7572J2889M6293m823O6197J9558n604p2462r1580O6457J19961m1412j41133
$$ 37572 50461 96754 91931 158128 177686 172082 99620 8040 74497 194458 153046 11913
8695A1913J8578J24171N2762J5079k27278j60305N360J27149J36546r304o4352
$$ 11913 30491 154662 207424 222503 -4775 -165080 -159720 -32571 103975 94671 30319
8684C0319j56440p346j7797j01376J00677N6489O9047k643l1323N4065j0632n758
$$ 30319 -126121 -133467 -151264 -252640 -151963 -95474 -26427 -29070 -60393 -6328 -16960 -22718
8672b2718K7298m7461r4873K7700P5105Q252Q9628J12380l2595o5964m6088k2235
$$ -22718 4580 -42881 -137754 -110054 -34949 -26697 62931 175311 142716 76752 30664 8429
8660H429P009k0182L282J942L8362M9679M2235J27457K1619j07068O4210j01531
$$ 8429 15438 -4744 -1462 480 38842 88521 130756 258213 279832 172764 236974 135443
8648A35443j33633n495J53455l3695J318j23344q4378Q840Q7951J32783J5644
$$ 135443 1810 -3685 149770 116075 117393 -5951 -90329 -81489 6462 139245 154889
8637A54889K6943J0388j1291j06024K6984Q3469j830M5335j67090j86870J4908
$$ 154889 181832 192220 180929 74905 101889 185358 183528 228863 61773 -125097 -110189
8626a10189L8262l9384O6648l5832M8227L4718L3876J67826R4636r112M7667p588
$$ -110189 -71927 -111311 -44663 -80495 -32268 2450 36326 204152 298788 289676 337343 329755
8614C29755n2542p0938k85o016p1972j19511m9357O6691R1972P3885j26K9888
$$ 329755 277213 206275 205990 199974 128002 8491 -40866 25825 117797 191682 191556 221444
8602B21444q7830M1480L0735N635J8066n5771j07288n69J64484l1892n1291K1129
$$ 221444 133614 175094 205829 211464 229530 173759 66471 65902 230386 198494 147203 168332
8590A68332K8306j2209n0947j31516j4837Q9735P9496J54160o8519l8394j19705
$$ 168332 196638 184429 133482 1966 -12871 76864 156360 310520 242001 203607 83902
8579H3902m698L8114R5883m8110j56361p1178k8726L5415K110j2893m8735R5152
$$ 83902 79204 117318 213201 165091 8730 -62448 -91174 -55759 -53649 -66542 -115277 -20125
8567b0125O6262R8083p0626P4619l64k6379J0707l2769j64169J3747Q7934R560
$$ -20125 46137 144220 73594 148213 147849 121470 132177 99408 -64761 -51014 36920 46480
8555D6480j1098n0871J27809N6867j0741N1846m9752j2732o9471L019L4771o5058
$$ 46480 35382 -15489 112320 169187 158446 210292 160540 147808 78337 81356 116127 51069
8543E1069m3804p3931M0892J29065m5840j16455m8728M6356K125M687Q7409N5491
$$ 51069 7265 -66666 -25774 103291 57451 -59004 -107732 -61376 -59251 -54564 32845 88336
8531H8336O9227N295j3057J13772K5586j39672m9101q3864r7756P2294J85958
$$ 88336 157563 162858 149801 263573 289159 149487 100386 16522 -81234 -8940 177018
8520A77018L0211n3935o8339k2730j3672o3372N3458J83551k5106j65393p8430
$$ 177018 207229 153294 84955 62225 48553 -14819 38639 222190 197084 31691 -46739
8509d6739P7998R8521j5965N594j49207l8550l4005J713R799M3570R149k0619
$$ -46739 31259 129780 113815 119409 -29798 -68348 -102353 -100640 -90841 -47271 -38122 -58741
8497e8741j2131N7545J43491j8316l7516P510r921J5173M8044M5758o4598j13214
$$ -58741 -70872 -13327 130164 111848 74332 81842 71921 87094 135138 180896 116298 3084
8485C084J9754Q7676J4909k9657j15257j33991M7867J79330N0052j37272J000
$$ 3084 22838 110514 125423 95766 -19491 -153482 -105615 73715 123767 -13505 -12505
8474a2505n5182k5931N3680O2321R8876K30652J22434q309j56010k52769L5510
$$ -12505 -67687 -93618 -39938 22383 121259 351911 474345 466036 310026 57257 92767
8463I2767O0249m5673k405J08712j3547O650J47724j3605q0074j19987j22412
$$ 92767 153016 107343 104938 213650 200103 206753 354477 340872 260798 140811 18399
8452A8399p261M6921j5488J01342N8871K916r5930k4552N0263J20322j68015r9007
$$ 18399 11138 58059 42571 143913 202784 205700 109770 85218 135481 255803 87788 -11219
8440a1219Q190m7373j24641p9936K1254J52166J32745Q4179n8451K9576p0948
$$ -11219 -3029 -50402 -175043 -254979 -233725 -81559 51186 135365 76914 106490 35542
8429C5542M3918o5559j19718k8329P2328J32953m107K694R816r1007q5966K0078
$$ 35542 79460 13901 -105817 -134146 -61818 71135 67028 69722 79538 -11469 -97435 -77357
8417g7357O8442j53l7878j947Q0013P5917n4018q0127p3217R900P7103N2218M196
$$ -77357 -8915 -9068 -46946 -48893 31120 107037 53019 -27108 -100325 -90425 -13322 38896 43092
8404D3092l4126l0683N3085J12187L6386p5619l0715J0949n1810r8455J0663J08222
$$ 43092 8966 -21717 31368 143555 179941 104322 73607 84556 32746 -65709 -55046 53176
8392E3176k2131m9162j06272Q9503Q9472j57490q6170Q4732J21010l2218M7132
$$ 53176 31045 -18117 -124389 -34886 54586 -102904 -189074 -104342 16668 -15550 31582
8381C1582K2364j25121K2797K9422M6633J7396n3314K3457J48068K0730j71271
$$ 31582 53946 -71175 -48378 -18956 27677 45073 -8241 15216 163284 184014 12743
8370A2743j16301q3727j84271P1030J12397J09781K0997n2748K994M6297J21603
$$ 12743 -103558 -187285 -371556 -300526 -188129 -78348 -57351 -110099 -107105 -60808 60795
8359F0795L951m2220j35993l0813J34608M0427K3958j5890m2397L4908J39530
$$ 60795 64746 22526 -113467 -144280 -9672 30755 54713 38823 -3574 31334 170864
8348A70864K3797j6165l2722j50945j88543k2015J21313l1517N194l2488J0132
$$ 170864 194661 178496 145774 -5171 -193714 -215729 -94416 -125933 -120739 -153227 -143095
8337a43095l085O1660l1911N9827L0188n3551l374J12427R6923L1305n765J7542
$$ -143095 -146180 -84520 -116431 -56604 -26416 -79967 -83341 29086 126009 157314 151549 169091
8325A69091j8298J05338J14612k00779j18436o1065m9261q3490k633k5352n1948
$$ 169091 150793 256131 370743 169964 51528 -9537 -58798 -142288 -144921 -170273 -222221
8314b22221P8656J5926N7572R2685N4019q3084L529n6412l6210L1189l8658j18707
$$ -222221 -143565 -127639 -70067 22618 76637 -6447 -2918 -59330 -95540 -64351 -103009 -221716
8302b21716Q0823K22250J19271j4966l0518J1120P0988M2635j26748k8282n0415
$$ -221716 -140893 81357 200628 185662 155144 166264 237252 279887 153139 124857 74442
8291G4442l4893L014N5068K5642o1823J28025j8261O562n4532J171M4471p9067
$$ 74442 39549 42563 97631 123273 61450 189475 171214 177776 123244 124415 168886 89819
8279H9819n8020J8513o822P0668k7335j18963N5113K3597m9222j6167L1022Q7079
$$ 89819 31799 50312 43490 114158 86823 -32140 22973 46570 -2652 -18819 12203 99282
8267I9282L5476p7365J06095P5993K0203j9782j42997n0282M3137o069M5033n6868
$$ 99282 134758 57393 163488 239481 259684 239902 96905 46623 89760 83691 128724 71856
8255G1856k15674k3621L6667L4160Q4502L8478P0550p1870M6402L5428O6022p7266
$$ 71856 -143818 -167439 -130772 -96612 -12110 26368 96918 25048 71450 106878 172900 95634
8243I5634p3435J4850J0596m5282l1262m0417o7161K8155P6356n0430j4609K14468
$$ 95634 22199 37049 47645 2363 -28899 -69316 -136477 -108322 -31966 -82396 -97005 117463
8231A17463Q9865p3112O8415N7563M203R743j1462j14842K9719K1959m8620j2942
$$ 117463 207328 134216 202631 260194 264397 274140 262678 147836 177555 199514 150894 137952
8219A37952p7962j4842p0589q1868n4977J32331J11328j1867j29451J3504N5250
$$ 137952 59990 45148 -25441 -107309 -162286 -29955 81373 69506 -59945 -46441 8809
8208H809K9610N559j5447Q9327l7115P175J3030L9110k6154K4000q3521k15261
$$ 8809 38419 43978 28531 117858 80743 87918 100948 140058 113904 137904 54383 -160878
8196a60878k9528J6125J17388M7408Q2336Q3406L3246j4483o8452p2641O479N2524
$$ -160878 -190406 -174281 -56893 -9485 72851 156257 189503 175020 106568 33927 40406 92930
8184I2930j00233L9051L1223j8577K928p004m632M4417J8909n694L4932q5001
$$ 92930 -7303 31748 62971 44394 47322 40318 35686 80103 99012 93318 128250 43249
8172D3249j52119q9537R4450l3467q9654J03131J19419J02320J8827o435o1568
$$ 43249 -108870 -198407 -103957 -137424 -227078 -123947 -4528 97792 116619 110184 48616
8161D8616l1930Q807O4026o3350q7976L9222k9611L3915R0569l5355r4727n0459
$$ 48616 16686 25493 89519 26169 -61807 -22585 -52196 -18281 72288 36933 -57794 -108253
8149a08253J1406J67787J29857r0835q5074k6081J37157Q0834n2543m0690n6610
$$ -108253 -96847 70940 200797 109962 24888 -1193 135964 216798 164255 123565 66955
8138F6955k6893M9648l0802J31569p6013j75763l2561O4142M1556j4646m794L7790
$$ 66955 40062 89710 58908 190477 114464 -61299 -93860 -29718 11838 -2808 -7602 30188
8126C0188R660k4643O177N6711O0258j31573j04977m4292J6016Q2388N7224O1257
$$ 30188 39848 15205 21382 78093 138351 6778 -98199 -142491 -126475 -44087 13137 74394
8114G4394m7226j3819j4887j9191N5767k3879k8792Q7909J19561q7107j37491
$$ 74394 27168 13349 -1538 -20729 35038 11159 -17633 70276 189837 102730 -34761
8103c4761M9316J54206j669o7522r642N5851j18705j1885l0161m3125J16223o1036
$$ -34761 14555 168761 167092 99570 89928 145779 27074 15189 -14972 -58097 58126 -2910
8091b910J194J38518O3652k9740j16337M2428o4166m7347o8286N5357J3269q6831
$$ -2910 -1716 136802 200454 170714 54377 96805 32639 -14708 -82994 -27637 -14368 -101199
8079a01199k1415N5668L6328K429o4003j3230R5766Q6666j6473k7095l6582r829
$$ -101199 -122614 -66946 -30618 -28189 -92192 -105422 -9656 77010 60537 33442 -3140 -12969
8067a2969n3504K6666j4168j5246L9095N6819m3187n4371j5131P9866O3664O2244
$$ -12969 -66473 -39807 -53975 -69221 -30126 26693 -16494 -70865 -85996 -6130 57534 119778
8055A19778l3964k3308p3972j8458M5579m3125q7841R0606K15678j2100q0343
$$ 119778 85814 62506 -11466 -29924 15655 -27470 -115311 -24705 190973 178873 98530
8044I8530j65562n3123P203J5251o586M9081k3494o3613J45783j4500q8380Q8909
$$ 98530 -67032 -120155 -112952 -97701 -104287 -55206 -78700 -142313 3470 -11030 -99410 -10501
8032a0501n66q2485o341L1042Q0038J02654n3189p9385J66188J8377j37258o3586
$$ -10501 -11067 -93552 -99893 -68851 11187 113841 60652 -18733 147455 165832 28574 -35012
8020c5012k3326M4289P1979L4790q6686J14737j673O4575q2322P69k8084k9683
$$ -35012 -58338 -14049 57930 92720 6034 120771 119098 183673 101351 102120 74036 44353
8008D4353o7459O1135j9178l6405L7326m0718k6931N840J8788K7453p780N7813
$$ 44353 -23106 38029 18851 -17554 19772 -20946 -47877 -42037 -23249 4204 -3576 54237
7996E4237k208L8940l7704j3486k73j46549j3902O9353R8545m9947j6223M5809
$$ 54237 52029 90969 53265 39779 39506 -107043 -120945 -51592 46953 -2994 -19217 26592
7984B6592l026k5614n9129N7417Q205q8559Q8480l2279m0821k9774J09624J46392
$$ 26592 23566 -2048 -61177 -3760 4445 -84114 4366 -27913 -68734 -98508 11116 157508
7972A57508J0896j23316q9595j12340m1907J73956L0959o261J7226J63019O2356
$$ 157508 168404 45088 -44507 -156847 -198754 -24798 6161 -100 17126 180145 242501
7961B42501J6870m5734j03945j0923n225o7310j13514p4692N4539p4112P4578
$$ 242501 259371 213637 109692 98769 93544 26234 -87280 -161972 -107433 -181545 -106967
7950a06967n5757j03902J60355J71899j1782q6389n4463l564O238J64312L1255
$$ -106967 -162724 -266626 -106271 65628 53846 -32543 -87006 -90570 -84332 79980 111235
7939A11235k10648m1693m1137p3476j6887J18848M8801Q5639K9397j181j7138
$$ 111235 -99413 -141106 -182243 -255719 -272606 -153758 -104957 -19318 10079 8898 -8240
7928h240J0562n1038m0980m1695l4113J8441j1013N3744P2574R726r2486r2697
$$ -8240 2322 -48716 -89696 -131391 -165504 -147063 -158076 -104332 -31758 -22032 -114518 -207215
7916b07215J1984R3611J1250N1137k1793L7939p0431m483J05074R2146l4978l9798
$$ -207215 -195231 -101620 -90370 -39233 -61026 -23087 -93518 -98001 7073 99219 64241 24443
7904B4443q3637l012j20454j7494J26670M5300l3480j32038o904J60218J34280
$$ 24443 -59194 -62206 -182660 -200154 -73484 -28184 -61664 -193702 -200606 -40388 93892
7893I3892Q9223r3619o3639j7262o3719L3940O0039m1186P1731o471j2035J141
$$ 93892 183115 89496 25857 8595 -55124 -21184 38855 -2331 69400 62929 50894 52035
7881E2035o9772k7478j38390j3897J03369M5308K4848j2039j49836l6410J21560
$$ 52035 -17737 -45215 -183605 -197502 -94133 -48825 -23977 -36016 -185852 -222262 -100702
7870a00702J67266N2861q8038r7072j19418q6525O4906O8116O8265M9849k6354
$$ -100702 66564 119425 31387 -65685 -185103 -271628 -206722 -138606 -70341 -20492 -46846
7859d6846J370J10054L142j3591J03178K810p3887m941J8764L9262l7854j54513
$$ -46846 -45476 64578 67720 54129 157307 160117 86230 81289 100053 139315 101461 -53052
7847e3052m4207j01138l8043K5786k5145J3843N6557P9514R5573L3147p1501k6937
$$ -53052 -97259 -198397 -236440 -210654 -235799 -221956 -165399 -85885 9688 42835 -28666 -55603
7835e5603n0380L9343M1808k772j965L5956k4422l5244L3280L2913J89520N824
$$ -55603 -105983 -66640 -24832 -27604 -29569 6387 -18035 -53279 -19999 12914 202434 208258
7823B08258r3658O0613N498k8552j1778Q880J3281j46985j30545J05121R5227
$$ 208258 114600 175213 180711 152159 140381 149261 162542 15557 -114988 -9867 85360
7812H5360j06973j23683m0458N7040N8398R8372j0767r810j48793m4983K18736
$$ 85360 -21613 -145296 -185754 -128714 -70316 28056 17289 7479 -141314 -186297 32439
7801C2439n27q9410p590Q8595J27470r3379q3293q4562O4869O6686R3627L9286
$$ 32439 31912 -57498 -65088 23507 150977 57598 -25695 -110257 -45388 21298 114925 154211
7789A54211j0400n1979J49177Q8547L4529j32096j05760J6644k3396j2872M5216
$$ 154211 143811 91832 241009 329556 364085 231989 126229 142873 119477 106605 151821
7778A51821J4490j13397l3757Q4392l0573r0719J3169M2539k2689l2200j2414
$$ 151821 166311 52914 19157 103549 72976 -17743 -4574 37965 15276 -16924 -29338
7767b9338K6552o0351J8282m9111K1947l2386N7516j9101L9217O2323l9561k6283
$$ -29338 -2786 -63137 -44855 -93966 -72019 -104405 -46889 -65990 -26773 35550 -4011 -30294
7755c0294K9224m9639l7628M1021k6610N5971K5870l4852K5897p5756N2942m872
$$ -30294 -1070 -50709 -88337 -47316 -73926 -17955 7915 -26937 -1040 -76796 -23854 -28726
7743b8726m9179l0414L7574Q002l2690M0029j05618J18052J6695j37698j25203
$$ -28726 -77905 -108319 -70745 -62743 -95433 -55404 -161022 -42970 -26275 -163973 -289176
7732b89176J20428k1258k5938M2225O9220J39428O6521J09703M9724K9021o9446
$$ -289176 -168748 -190006 -215944 -173719 -104499 34929 101450 211153 260877 289898 220452
7721B20452r780j12555j16901N0958L1888K5025r3888j17564R8507N3250o8765
$$ 220452 210672 98117 -18784 32174 64062 89087 -4801 -122365 -23858 29392 -39373
7710c9373n9701J164k2251K7448N4053Q5263j2123m0536q5144m4187M5909L4630
$$ -39373 -99074 -97910 -120161 -92713 -38660 46603 34480 -6056 -91200 -135387 -89478 -54848
7698e4848M1397M070l806M2135j10963l9148L6000R0185j7663K1107J13386O7819
$$ -54848 -13451 -9381 -13187 28948 -82015 -121163 -85163 5022 -12641 8466 121852 189671
7686A89671r4206j6469p3397j59017j8460J31909k466o0685O669L0115M4935K1725
$$ 189671 95465 78996 5599 -153418 -171878 -39969 -42435 -103120 -96451 -66336 -21401 324
7674C24o299P5007j8467j70768l9752J14164J29636M8682l5158o094l8518o7870
$$ 324 -5975 69032 50565 -120203 -159955 -45791 83845 132527 97369 91275 52757 -15113
7662a5113m1619N3488K2973j15936l2470q182P9812J44431k4707k09826O6920
$$ -15113 -56732 -3244 19729 -96207 -128677 -136859 -57047 87384 62677 -147149 -80229
7651h0229R6707m7927n6574J09964q7051N3672J22764J14637j6837l0411k5057
$$ -80229 16478 -31449 -88023 21941 -65110 -11438 111326 225963 209126 178715 153658
7640A53658l7571p1410n321P5944Q4785K9622K2883j53866r9914j548R0678K5060
$$ 153658 116087 44677 39356 115300 200085 229707 252590 98724 -1190 -2738 87940 113000
7628A13000n4063n8245p7543K0786O6163n0738N9808n2023l1957K30096p949k36218
$$ 113000 58937 692 -76851 -56065 10098 -40640 19168 -32855 -64812 165284 157335 -78883
7616g8883L234K5762P499l5634L1127j7353p9871r1756J24436K01446l9737p4597
$$ -78883 -75649 -49887 -42388 -78022 -46895 -64248 -144119 -235875 -111439 90007 50270 -24327
7604b4327j5380m3964K3469m3659j13423N1056K57473l6263j59977o1413K5868
$$ -24327 -39707 -83671 -60202 -103861 -217284 -166228 91245 54982 -104995 -166408 -140540
7593a40540l8699j1704K7737O0593J0151m6387p5948L9384J0535O0457j6213L9723
$$ -140540 -179239 -190943 -163206 -102613 -92462 -138849 -214797 -175413 -164878 -104421 -120634 -80911
7581h0911N8424J1623J29962M9114r2129j38624m9475J8513Q2353Q6163K2678
$$ -80911 -22487 -10864 119098 168212 76083 -62541 -112016 -93503 -11150 75013 97691
7570I7691p629k811N1439j42028j57758l2813P0374o4220O7763j1606p0390p1068
$$ 97691 90062 87251 138690 -3338 -161096 -193909 -123535 -187755 -119992 -131598 -201988 -273056
7558b73056Q0459n0758m5487J92902J67376j25425p9617q8000O2967O9983N3222
$$ -273056 -192597 -243355 -288842 -95940 71436 -53989 -133606 -221606 -158639 -88656 -35434
7547c5434O1677n37L329j2169l4463O7702q6844n8450l5982N3036J42209M3300
$$ -35434 26243 25706 29035 16866 -17597 50105 -36739 -95189 -131171 -78135 64074 107374
7535A07374j8569R7054j29967j41248q2801K4460J5948p7982Q494O6997k353N5054
$$ 107374 88805 185859 55892 -85356 -168157 -143697 -127749 -205731 -197237 -130240 -132593 -77539
7523g7539j8470J4338O7848j9666l148J35342R5480m4910L4558o2293o7366n0691
$$ -77539 -96009 -81671 -13823 -33489 -36637 98705 194185 149275 183833 121540 54174 3483
7511C483J2462j06053j9049J14344N7478n6343r9208l1681P0970Q5700l9693N2437
$$ 3483 15945 -90108 -109157 5187 62665 6322 -92886 -124567 -53597 32103 -7590 44847
7499D4847p2025M74J93129k8795j12193j06397j69495k4627J10365L5367J0946
$$ 44847 -27178 -26704 166425 137630 25437 -80960 -250455 -275082 -164717 -129350 -118404
7488a18404r885L230Q3577o9325j27731P7706Q8772O5300j6950r7717N262R4472
$$ -118404 -128289 -125059 -41482 -110807 -238538 -160832 -72060 -6760 -23710 -121427 -116165 -21693
7476b1693J7562m1483J772j2992n8167M1659k0747O6700R8305l4934l5406K0905
$$ -21693 -4131 -45614 -43842 -56834 -115001 -73342 -94089 -27389 70916 35982 576 21481
7464B1481J4386n433j15810r6220O0593J59607R8002p5188o4877K9700N3648q1613
$$ 21481 35867 30434 -85376 -181596 -121003 38604 136606 61418 -3459 26241 79889 -1724
7452a724o4387j3010R895O994K56J4337p3066j564J75942N5000p8881j302m1849
$$ -1724 -66111 -79121 -69226 -62232 -61976 -47639 -120705 -122269 53673 108673 29792 28490 -13359
7439a3359m1902l4163P8075O6051K1686k8517l7702j50048m585k6321R225M9811
$$ -13359 -55261 -89424 -11349 54702 76388 47871 10169 -139879 -144464 -170785 -161560 -111749
7427a11749K5712M1920m5315p5051j635p8771Q575l2686P9762K19838M0791n3089
$$ -111749 -86037 -44117 -89432 -164483 -166118 -244889 -236314 -269000 -189238 30600 71391 18302
7415A8302p6882j8756J56348J3784n1512o2792J04306l8521q972k8291p4878q7518
$$ 18302 -58580 -77336 79012 92796 41284 -21508 82798 44277 35305 7014 -67864 -155382
7403a55382p8410R854K09204J03222K0071j849j3977L2701p1751o1889r476M1052
$$ -155382 -233792 -223938 -14734 88488 108559 106710 92733 125434 53683 -8206 -17682 23370
7391B3370L3859Q4951M2295m7037n7691o8759j03634Q616M4556J27530Q1553j2176
$$ 23370 57229 142180 184475 137438 79747 10988 -92646 -84030 -39474 88056 169609 157433
7379A57433l271o6275j92212o1423K6660R8501Q3612J4443k7874K5672R4958j75961
$$ 157433 154162 87887 -104325 -165748 -139088 -40587 43025 57468 29594 55266 150224 -25737
7367b5737j92226L6290Q4857M6477O7100P3843l7622p6832m2923M3003J7847p7603
$$ -25737 -217963 -181673 -96816 -50339 16761 90604 52982 -23850 -66773 -23770 -5923 -83526
7355h3526P6878o8733l5141r9840J2225L2023L8061P2661J2544p2944j01605J57766
$$ -83526 -6648 -75381 -110522 -210362 -198137 -166114 -128053 -55392 -42848 -115792 -217397 -59631
7343e9631Q6030k3076O7674p4147l5754m0624j1466l4538P7486P2117J11218j09783
$$ -59631 26399 3323 70997 -3150 -38904 -79528 -90994 -125532 -48046 24071 135289 25506
7331B5506L91M5472R928m6178r2621l4266J20236L1188r0282q9956n628k5879
$$ 25506 25897 71369 81297 35119 -57502 -91768 28468 59656 -30626 -120582 -126210 -152089
7319a52089p999Q2648P7358N4053m740p3429p4503J0687q154n1574l6047r3777
$$ -152089 -160088 -77440 -82 53971 49231 -24198 -98701 -88014 -96168 -147742 -183789 -277566
7307b77566M4745P4047j2466n3592n9887L9870J00719k0541Q639N3904P8700K327
$$ -277566 -232821 -158774 -171240 -224832 -284719 -244849 -144130 -164671 -156032 -102128 -23428 -21101
7295b1101M9166N7011Q2359O1119J5196j32720j37359m8459k4144J57654R7294
$$ -21101 28065 85076 167435 228554 243750 111030 -26329 -74788 -98932 58722 156016
7284A56016J7284n3395o4663N0127q1221n6917M3341O7486J00167q1081k9789
$$ 156016 173300 119905 55242 105369 24148 -32769 10572 78058 178225 97144 67355
7273F7355R1492r1892j61985l4102M6739K6182M3346k8080O7412M6185P6730p8393
$$ 67355 158847 66955 -95030 -129132 -82393 -56211 -12865 -40945 26467 72652 149382 70989
7261G0989j28307r336q622K4651J20209J0751m7241p1016n9137o3434N6081k7170
$$ 70989 -57318 -66654 -75276 -50625 69584 80335 33094 -37922 -97059 -160493 -104412 -131582
7249a31582J40463Q7711m0550N2112L7935l7878j19940j8462p7490k8580P3707
$$ -131582 8881 96592 56042 108154 146089 108211 -11729 -30191 -107681 -136261 -62554
7238f2554L8384m1868l4848R9188m2087j17902J06823K8615j5608N7283O5710
$$ -62554 -24170 -66038 -100886 -1698 -43785 -161687 -54864 -26249 -41857 15426 81136
7227H1136j6661m0130l0406O125p8490o3032J18234J2662o9652k5888m1674l0122
$$ 81136 64475 24345 -6061 64 -78426 -141458 -23224 -10562 -80214 -106102 -147776 -177898
7215a77898J12212J20686N7692o9040j32324q2957Q766K8495N8566L6867K31802
$$ -177898 -65686 55000 112692 43652 -88672 -171629 -162863 -134368 -75802 -38935 192867
7204A92867N0194K8817j9509j82627n2233l7311K1403Q1289J4642j12793j00069
$$ 192867 243061 271878 252369 69742 17509 -19802 1601 82890 97532 -15261 -115330
7193a15330j8032K9091M650l9974p9689J4525M1051K8967l3502J19677J08466
$$ -115330 -133362 -104271 -99621 -139595 -219284 -204759 -163708 -134741 -168243 -48566 59900
7182E9900k2904R9163L1618K5880r4082l3049k7249n3230q6096k3744j34660L7158
$$ 59900 36996 136159 167777 193657 99575 66526 39277 -13953 -100049 -123793 -258453 -221295
7170b21295J46604N2152O2065o9968q0136k5730O6456K0791J9763R0490J31982
$$ -221295 -74691 -22539 39526 -30442 -110578 -136308 -69852 -49061 -29298 61192 193174
7159A93174O5375n9277j38103o4668N0652N5011j75840j6320J84599Q4639k0870
$$ 193174 258549 199272 61169 -3499 47153 102164 -73676 -89996 94603 179242 158372
7148A58372q3988o1067m5792K8279m8565q7408q325O3074r528k8573N8003j4206
$$ 158372 74384 13317 -32475 -4196 -52761 -140169 -148494 -85420 -94948 -123521 -65518 -79724
7136g9724l011P2514j9102o972o3521k9915J53186j818j5644k8302J5608J08405
$$ -79724 -82735 -10221 -29323 -36295 -99816 -129731 23455 21637 5993 -22309 -6701 101704
7124A01704J2250j05037K2882m2731n0771R0932j7346O5718O0633n2326J480l2114
$$ 101704 113954 8917 31799 -10932 -61703 29229 11883 77601 138234 85908 87388 55274
7112E5274J4115K342r9044J6818P4033r7535L9738l6642n8048L6299O1056n5058
$$ 55274 69389 71731 -27313 -10495 63538 -33997 5741 -30901 -88949 -52650 8406 -46652
7100d6652n2592J9597q3423o6668j1988J34163J57700K4799n0858N4450J04860
$$ -46652 -99244 -79647 -163070 -229738 -241726 -107563 50137 74936 24078 78528 183388
7089A83388P1946j23988k22593j58544j3021J49010M2181k1850O3518j45063N9200
$$ 183388 255334 131346 -91247 -249791 -262812 -113802 -71621 -93471 -29953 -175016 -115816
7078a15816Q3159Q8164P5036j8520n4045J15137n3871k17656k1409p2448J924
$$ -115816 -32657 55507 130543 112023 57978 173115 119244 -98412 -119821 -192269 -190345
7067a90345R7596R7227N8294j1909j16332r2075O4835M5824N8486P2085j4648
$$ -190345 -92749 4478 62772 50863 -65469 -157544 -92709 -46885 11601 83686 69038
7056F9038n9210p0633L0435J19044L0833k5426j12593q9664m2248N4658J04559
$$ 69038 9828 -60805 -30370 88674 119507 94081 -18512 -108176 -150424 -95766 8793
7045H793J18288P5748J4311l4470k9285r4108n3080k5069j6084M2128L6795O237
$$ 8793 127081 202829 217140 182670 153385 59277 6197 -18872 -34956 7172 43967 50204
7033E0204P018L9292o5152m7335P5497j2158o277K4307l7669k42277O5046J25434
$$ 50204 57222 96514 31362 -15973 59524 47366 41089 65396 27727 -214550 -149504 -24070
7021b4070P4790o3516r9774K9430O5875m6887P9774K9119o0504j9236P0619O562
$$ -24070 50720 -12796 -112570 -83140 -17265 -64152 15622 44741 -15763 -34999 35620 42182
7009D2182O4961Q889m0322m8198j37881J61013J71627n7248j35187j78875K3555
$$ 42182 107143 116032 75710 27512 -110369 50644 222271 165023 29836 -149039 -125484
6998a25484N8453K9394Q1720j2510M5245k7243Q2476q4862l1258J5838R3252l6734
$$ -125484 -67031 -37637 44083 31573 76818 49575 132051 47189 15931 31769 125021 88287
6986H8287n8716M0098P0276j04182m8926P940o844j29905O4361J14627m5933K2599
$$ 88287 29571 69669 139945 35763 -13163 -5223 -12067 -141972 -77611 37016 -8917 13682
6974A3682j2813q8313R622Q9828N2010p8324n9726j30066K6825R8982R8168O5652
$$ 13682 869 -87444 -77822 12006 64016 -14308 -74034 -204100 -177275 -78293 19875 85527
6962H5527Q931O8480j1192P807J08576n7813j63400m2396K849k0042R8249j9644
$$ 85527 94458 162938 151746 159553 268129 210316 46916 4520 7369 -12673 85576 65932
6950F5932J44026M9097j20807j94420n0260O8807k4206Q336N1157J05475J12046
$$ 65932 209958 259055 138248 -56172 -106432 -37625 -61831 -53495 -2338 103137 215183
6939B15183n1474j03285l9805N8670l929k1319L5704l8259m3629n5325j9671K7096
$$ 215183 163709 60424 20619 79289 75360 54041 89745 51486 7857 -47468 -67139 -40043
6927d0043Q6017J29280M191r3255p9798r5909j48199Q1546J31657J8010N2784
$$ -40043 45974 175254 179445 86190 6392 -89517 -237716 -156170 -24513 -6503 46281
6916D6281M293k093k9436j9012j0923R194j2386j27823j4732L8117j3900J8680
$$ 46281 50574 48481 19045 33 -10890 -1696 -14082 -141905 -156637 -118520 -132420 -113740
6904a13740j1177P4036L1630o8723o3921L4161R9851r9489p2666P0003K0023O198
$$ -113740 -124917 -50881 -19251 -87974 -151895 -117734 -17883 -117372 -190038 -120035 -100012 -93814
6892i3814J9461J22229Q9614k633k4887k14548J763l8870k6968J83703L6653M5977
$$ -93814 -74353 47876 137490 134857 109970 -104578 -102815 -141685 -168653 15050 51703 97680
6880I7680k2012r4469R489L3848j2342R1972n5984J0652P11j7685j56473K1045
$$ 97680 75668 -18801 -9312 24536 12194 104166 48182 58834 59545 41860 -114613 -93568
6868i3568K3851P9636J13096l0969p5632r9188K01m0515j537J1234Q628J6997
$$ -93568 -69717 9919 123015 92046 16414 -82774 -82573 -123088 -124625 -113391 -104763 -87766
6856h7766j37247L9407J409k9382k0513R4584P4703N7439J0816o3494N6271J29564
$$ -87766 -225013 -185606 -184197 -213579 -234092 -139508 -64805 -7366 3450 -60044 -3773 125791
6844A25791o0414p1470j7351m4729j7252j5321J5710k1604q700J1078m5768m979
$$ 125791 65377 -6093 -23444 -68173 -85425 -100746 -85036 -106640 -115340 -104262 -150030 -155009
6832a55009m806l7520m492q672R6810K8639p1826p234J46150o3033j7778P7168
$$ -155009 -159815 -197335 -201827 -210499 -113689 -85050 -156876 -164110 -17960 -80993 -98771 -21603
6820b1603K411n8648r6966m2899N3707O1122P2906P2661K5086N7238K5600j0063
$$ -21603 -19192 -77840 -174806 -217705 -163998 -102876 -29970 42691 67777 125015 150615 140552
6808A40552l3153j10233J6183J67325l6560J9298q5999m6731J2698K3015P3185
$$ 140552 107399 -2834 13349 180674 144114 163412 77413 30682 43380 66395 139580
6797A39580p9081j275j2781j7887P2236K3723l0765J2866K2250m905j9127J8571
$$ 139580 60499 59224 46443 28556 100792 124515 93750 106616 128866 123961 104834 123405
6785A23405O8891J1093j22627L541O989J2246J8047j1847m2829j07596o8283K3302
$$ 123405 192296 203389 80762 84303 91292 103538 121585 109738 66909 -40687 -108970 -85668
6773h5668K7581P5213K620l7216l1882j6893Q3887M8773r1487N3738n2662j4104
$$ -85668 -58087 17126 19746 -17470 -49352 -66245 17642 66415 -25072 28666 -23996 -38100
6761c8100N5933p238J0786r7968l2361R5412K4917o096o8023j18220M7974N212
$$ -38100 17833 10595 21381 -76587 -108948 -13536 11381 5285 -62738 -180958 -132984 -127772
6749a27772r3695L1171P8454R4283J8669o2602q2016R850k3747R0352J73782k2650
$$ -127772 -221467 -190296 -111842 -17559 1110 -61492 -143508 -133658 -157405 -67053 106729 84079
6737H4079l210j8026n5753j4208k3007P1017J4460J3183j6768j19425n7152M6032
$$ 84079 80869 62843 7090 -7118 -30125 40892 55352 68535 51767 -67658 -124810 -78778
6725g8778n2586J05999R5263p3435n4236p8760M0445n6673k8005N2649J2213Q3123
$$ -78778 -131364 -25365 69898 -3537 -57773 -136533 -96088 -152761 -180766 -128117 -115904 -32781
6713c2781J11302m3865J680r2453L8070Q3725K748j58015j24873N9515L9469m1412
$$ -32781 78521 34656 36336 -56117 -18047 65678 68426 -89589 -214462 -154947 -115478 -156890
6701a56890P1425N5293O0446p276P8819R9560j7638o7077k8802Q126j01215q6642
$$ -156890 -85465 -30172 30274 22998 101817 201377 183739 116662 87860 95986 -5229 -91871
6689i1871j521J2447o3642M0367N9134n7K7410K0289r844k1191r065m6482j3557
$$ -91871 -93392 -80945 -144587 -104220 -45086 -45143 -17733 2556 -7288 -28479 -37544 -84026 -97583
6676i7583O0610R8275q358j67969q5247Q4303L6341n3846o0746L6181Q5790Q4619
$$ -97583 -36973 61302 52944 -115025 -200272 -115969 -79628 -133474 -194220 -158039 -72249 12370
6664A2370J0816m1289k5930j0514j19088k5620J31352Q6058o2223l4676j09790
$$ 12370 23186 -18103 -44033 -54547 -173635 -199255 -67903 18155 -44068 -78744 -188534
6653a88534M6827J43497J38216l4422j33840k7773J06540k7781k0082O416j0391
$$ -188534 -141707 1790 140006 105584 -28256 -56029 50511 22730 2648 9064 -1327
6642a327J4086P0614n6099q469k3700j34203j13898J28112O4536j6487k6446J11774
$$ -1327 12759 83373 27274 18805 -4895 -139098 -252996 -124884 -60348 -76835 -103281 8493
6630H493O0911p7746K1497n9890N9624K8895r2024l3715j09242J8292J00444J04517
$$ 8493 69404 -8342 13155 -46735 12889 41784 -50240 -83955 -193197 -174905 -74461 30056
6618C0056J46107J1222j31580j28585j2987n8067Q762n0753L6329O2605O1961
$$ 30056 176163 187385 55805 -72780 -85767 -143834 -135072 -185825 -149496 -86891 -24930
6607b4930M74M9552m9223L1587M1054N9938m0895o9664J29802J0980l7876l5397
$$ -24930 -24456 25096 -24127 7460 48514 108452 67557 -2107 127695 138675 100799 65402
6595F5402j31482j60564L2642o1200M8703J01444j9421J33972J63306N8621K5323
$$ 65402 -66080 -226644 -194002 -255202 -206499 -105055 -124476 9496 172802 231423 256746
6584B56746P466r865K0278j1833j60708j95753j3125N2810M4212J9031m1102j34952
$$ 256746 264212 254347 274625 262792 102084 -93669 -106794 -53984 -9772 9259 -31843 -166795
6572a66795M2119J2929K2909J69654J60580l4462n4558l6722R603j1589q1269
$$ -166795 -124676 -111747 -88838 80816 241396 206934 152376 115654 125257 113668 32399
6561C2399k0030K1572N9949r7255M359R2699l903l9006J22896r580o7466j9645
$$ 32399 12369 33941 93890 -3365 994 93693 89790 50784 173680 164100 96634 76989
6549G6989K5615m0434O0424k5910n536P2016j9168p6507n0053k1754o3222J15207
$$ 76989 102604 62170 122594 96684 91148 163164 143996 67489 17436 -4318 -67540 47667
6537D7667J6512l8828k8425M9058o9524K8764O1713p1399n6449P9716J26113J49148
$$ 47667 64179 25351 -3074 45984 -23540 5224 66937 -4462 -60911 18805 144918 294066
6525B94066j09120j35044J23704R8522l230p1971j06173m9448o6055K3236J05431
$$ 294066 184946 49902 173606 272128 268898 196927 90754 41306 -24749 -1513 103918
6514A03918p2389j28906J8121j1046K26227J08371j15263Q695l3375j69875N5828
$$ 103918 31529 -97377 -79256 -90302 135925 244296 129033 137728 104353 -65522 -9694
6503i694L1376J12637O4928j2088j39160O0294J02315R379l7322p7538K5887p1501
$$ -9694 21682 134319 199247 187159 47999 108293 210608 219987 182665 105127 131014 59513
6491E9513k356j1266Q9650J33911L5505j32388j56607J640N5790m5011n121o2433
$$ 59513 57157 45891 135541 269452 304957 172569 15962 17602 73392 28381 23260 -39173
6479c9173o7145M8350M34k4035n9337J14905L1778j50800p7316P3734P5391L2331
$$ -39173 -106318 -57968 -57534 -81569 -140906 -26001 5777 -145023 -222339 -148605 -73214 -40883
6467d0883n267N3108L6071Q3866l2467k433j6049q9145p9897M2036O2715J38248
$$ -40883 -46150 6958 43029 126895 94428 91995 75946 -13199 -93096 -51060 11655 149903
6455A49903n4248q4014q720J4649j46362k228Q3003q7161k4742K00860N1431M0442
$$ 149903 95655 11641 2921 17570 -128792 -131020 -48017 -135178 -159920 40940 92371 132813
6443A32813o5159J0433J2000j27819j30109j0589K38435J00927K1852m1665q6127
$$ 132813 67654 78087 90087 -37732 -167841 -178430 60005 160932 182784 141119 54992
6432E4992m2272q1941O8664j2013j83446j30249R6659K3442N3362Q035k3720P3358
$$ 54992 12720 -69221 -557 -12570 -196016 -326265 -229606 -206164 -152802 -144767 -168487 -95129
6420i5129R2914M846L0626J13189L7107L2635p0171j34891j14163Q4159P1293
$$ -95129 -2215 2631 33257 146446 183553 216188 146017 11126 -103037 -18878 52415
6409E2415P5126j05466p2436p7537L3302Q9830L4344O1326N6616j56206k7046
$$ 52415 127541 22075 -50361 -127898 -94596 -4766 29578 90904 147520 -8686 -35732
6398c5732O682m6358l6212N6786o821o6520L8586R0747j3780j1942M189j3083
$$ -35732 -29050 -75408 -111620 -54834 -61655 -128175 -89589 1158 -12622 -24564 -20375 -33458
6386c3458m2212J25058l7694r4737l9830P4618K9960o2914m1321L6326K8802k7267
$$ -33458 -75670 49388 11694 -83043 -122873 -48255 -18295 -81209 -122530 -86204 -57402 -84669
6374h4669N5242R0832p9375p442o6716n3579l6576j2066J10771J86346r057o6893
$$ -84669 -29427 61405 -17970 -25412 -92128 -145707 -182283 -194349 -83578 102768 93711 26818
6362B6818r46Q242Q5703J9325L8500p2331j01920J0605Q5185P6209q1041j18108
$$ 26818 25872 34114 119817 139142 177642 105311 3391 13996 99181 175390 94349 -23759
6350b3759p1930J02510M4010K3207n8936n0293m0355K7693K7327J00917j9387
$$ -23759 -95689 6821 50831 74038 15102 -35191 -75546 -47853 -20526 80391 61004
6339F1004J6245k2234k7838m2264q491N0807P5376M4925j06053j8276K4681J54286
$$ 61004 77249 55015 27177 -15087 -23578 27229 102605 147530 41477 23201 47882 202168
6327B02168N6918m8582k5408m9096j51028j70385k7155P462M1495J34992L2277
$$ 202168 259086 210504 185096 136000 -15028 -185413 -212568 -205106 -163611 -28619 3658
6316C658j04377j33975P3232J77336l2785p2074k9222J1174N9414L3158L8693
$$ 3658 -100719 -234694 -161462 15874 -16911 -88985 -118207 -107033 -47619 -14461 24232
6305B4232j09690j7741Q508Q108p5116n5596M4619j7297l0912K00277N5291K028
$$ 24232 -85458 -103199 -94691 -86583 -161699 -217295 -172676 -189973 -220885 -20608 34683 36711
6293C6711j4754r1785n0726K8132J3488q3813P7125L8982r3853O7827Q2868K3197
$$ 36711 21957 -69828 -120554 -92422 -78934 -162747 -85622 -46640 -140493 -72666 10202 33399
6281C3399n5283n0621O9448L9325M3531k6476J29772l5870q4601o8955J6370R435
$$ 33399 -21884 -72505 -3057 36268 79799 53323 183095 147225 62624 -6331 10039 19474
6269A9474k0355L2881o9034m3094l0743p403J13032o3442R641J27343j4510k8576
$$ 19474 -881 32000 -37034 -80128 -110871 -118274 -5242 -68684 -59043 68300 53790 25214
6257B5214n7939M7515k27n9807J60822j2041j04480o4517n9385O0300j815o0747
$$ 25214 -32725 14790 14563 -45244 115578 103537 -943 -65460 -124845 -64545 -66360 -127107
6245a27107j8520L8512K3793L7543o7290o7623K5262P0172p7088k7876R5289J21071
$$ -127107 -145627 -107115 -83322 -45779 -113069 -180692 -155430 -85258 -162346 -190222 -94933 26138
6233B6138O9057q3295j15997M9513J77687l4549p0248k4739K3272N0397l2274
$$ 26138 95195 11900 -104097 -54584 123103 88554 18306 -6433 16839 67236 34962
6222C4962K7941j4263M3695Q2712m0322r7807o2669Q0015J6390o6818m531J5037
$$ 34962 62903 48640 92335 175047 134725 36918 -25751 54264 70654 3836 -695 14342
6210A4342l0229q2566j11188j3499J52733J33775Q7290O2076K6883q8294r6270
$$ 14342 -15887 -98453 -209641 -223140 -70407 63368 150658 212734 239617 151323 55053
6199E5053o3740N6398K3037J1375P3288R5986n5284n0250p1084o434m5867k6314
$$ 55053 -8687 47711 70748 82123 155411 251397 196113 145863 74779 68345 22478 -3836
6187c836N786l3913N7102M726l7254N70j1135J30571O3218l4146k356j06518k48332
$$ -3836 1950 -31963 25139 29865 -7389 -6819 -17954 112617 175835 141689 139333 32815 -215517
6174b15517n9582P4234p843R405L0832n1219k2066K27348N7858j47722p3274K9958
$$ -215517 -275099 -200865 -208708 -199303 -168471 -219690 -241756 -14408 43450 -104272 -177546 -147588
6162a47588P3356l3661j66707O0632K7220K9991p5534l6364J38479R2778m6373
$$ -147588 -74232 -107893 -274600 -213968 -186748 -156757 -232291 -268655 -130176 -37398 -83771
6151h3771Q5396N5758M3602K5172o6901k4734K0791j5257j3232J3712m5838k9924
$$ -83771 1625 57383 100985 126157 59256 34522 55313 40056 26824 40536 -5302 -35226
6139c5226M4803L6983l4755j5760l0364J386K9409k5265K9166m3392K5234J24635
$$ -35226 9577 46560 11805 -3955 -34319 -32933 -3524 -28789 377 -43015 -17781 106854
6127A06854l2009O0357N6412l2805q0418j04830l3372K1964J11457m956j87929
$$ 106854 74845 135202 191614 158809 78391 -26439 -59811 -37847 73610 68654 -119275
6116a19275n656Q545L8947k7484L3426J31354J6871p8587K9771j4137j00017p238
$$ -119275 -124931 -116386 -77439 -104923 -71497 59857 76728 -1859 27912 13775 -86242 -93480
6104i3480K2775K1401J52612L0946J11672l2728r3064J7914p7918n31J24528q8580
$$ -93480 -70705 -49304 103308 134254 245926 213198 120134 138048 60130 59599 184127 95547
6092I5547n8431K8610R9445Q5630k7875O121o8162j01112l3202l7830m086J3780
$$ 95547 37116 65726 165171 250801 222926 229047 160885 59773 26571 -11259 -15345 -1565
6080a565q9574J25279J3118l0584l747K8565N3726r5308o4912l3139j911J38307
$$ -1565 -91139 34140 47258 16674 12927 41492 95218 -90 -65002 -98141 -100052 38255
6068C8255J12136j0515n549n6155M5314o2459o4015J18718J63807N151p6740k23464
$$ 38255 150391 139876 134327 78172 123486 61027 -2988 115730 279537 284688 207948 -15516
6056a5516K5883J04351P4988L8048j2027J4429j3417j27452j08272O825n743p613
$$ -15516 10367 114718 189706 227754 215727 230156 216739 89287 -18985 -12160 -17903 -25516
6044b5516n5336L7898J26896J52139J14523o8909j24414j65116q5073k4689k5906
$$ -25516 -80852 -42954 83942 236081 350604 281695 157281 -7835 -92908 -117597 -143503
6033a43503K8080N3263N2085J64305j58614l01613M2017Q0995J41103p9843K4107
$$ -143503 -115423 -62160 -10075 154230 -4384 -305997 -263980 -182985 -41882 -121725 -97618
6022i7618j8283o594L0092R108J9412p199K0951N8447m5806q781R6594L5398j19673
$$ -97618 -115901 -122495 -92403 -83295 -63883 -71082 -50131 8316 -37490 -46271 50323 85721 -33952
6009c3952j06201L396p4205j6261J25399P6300n2114K6039p1330n2818L8766o9276
$$ -33952 -140153 -136757 -210962 -227223 -101824 -25524 -77638 -51599 -122929 -175747 -136981 -206257
5997b06257M3930N1470o418m4721j5668j8567J9216O8397j16557q417K25171r2998
$$ -206257 -162327 -110857 -117275 -161996 -177664 -196231 -177015 -108618 -225175 -233592 -8421 -101419
5985a01419j044J23163J071M3626M7588l6869p8946l5275M7344k3913j27141L8737
$$ -101419 -102463 20700 21771 65397 112985 76116 -2830 -38105 9239 -14674 -141815 -103078
5973a03078R3368Q2889j48289j65203q148P7411Q3943N8239k6550l3737j4196
$$ -103078 -9710 73179 -75110 -240313 -248461 -171050 -87107 -28868 -55418 -89155 -103351
5962a03351R676q7562L6266J44220J57141q9372o4910j69350j88629K085J95861
$$ -103351 -93675 -181237 -144971 -751 156390 67018 2108 -167242 -355871 -353786 -157925
5951a57925R153r501M7618N4957M3342p0646n3288j3320l1651j12633O4703K0121
$$ -157925 -148772 -158273 -110655 -55698 -12356 -83002 -136290 -149610 -181261 -293894 -229191 -209070
5939b09070N6190J3586J10167j0355r1402j6197K8470K0564M160j5974J8904N6069
$$ -209070 -152880 -139294 -29127 -39482 -130884 -147081 -118611 -98047 -93887 -109861 -90957 -34888
5927c4888M5283J3653O0894R9639K4558J548m1165n6210m7599j34011j05473L5468
$$ -34888 10395 24048 84942 184581 209139 210687 169522 113312 65713 -68298 -173771 -138303
5915a38303O366O5885R2979J3540p2985L8737M2474K7049L6799o572K0944m0377
$$ -138303 -131937 -66052 26927 40467 -32518 6219 48693 75742 112541 105969 126913 86536
5903H6536q3004K538P0533O8614k9461j21988n6243l674r616K5309J25723J17157
$$ 86536 3532 6070 76603 145217 115756 -6232 -62475 -66149 -75765 -50456 75267 192424
5891A92424j8445j31035j16100P0705N7031j9018k9311M9611n7788o8272k1272
$$ 192424 173979 42944 -73156 -2451 54580 35562 6251 55862 -1926 -70198 -91470
$$ [...]
##END NTUPLES=NMR SPECTRUM
##END=
