##TITLE=Analysis number 328671
Compound Code cc 27001
Book Reference 511/148
Project Code adrs
Chemist Name stevem
##JCAMPDX= 6.0         $$ Bruker NMR JCAMP-DX V2.0
##DATA TYPE= NMR SPECTRUM
##DATA CLASS= NTUPLES
##ORIGIN= Bruker BioSpin GmbH
##OWNER= nmr
$$ XWIN-NMR		Version 3.5
$$ Tue Jun 26 09:52:33 2007 GMT Daylight Time (UT+1h)  MAYBRIDGE\nmr@NMR_250MHZ
##.OBSERVE FREQUENCY= 250.131544655141
##.OBSERVE NUCLEUS= ^1H
##.ACQUISITION MODE= SIMULTANEOUS (DQD)
##.ACQUISITION SCHEME= undefined
##.AVERAGES= 16
##.DIGITISER RES= 18
##SPECTROMETER/DATA SYSTEM= dpx250
##.PULSE SEQUENCE= zg30
##.SOLVENT NAME= DMSO
##.SHIFT REFERENCE= (INTERNAL, DMSO, 0, 16.5131)
##AUDIT TRAIL= $$ (NUMBER, WHEN, WHO, WHERE, WHAT)
$$ ##TITLE= Audit trail, XWIN-NMR		Version 3.5
$$ ##JCAMPDX= 5.01
$$ ##ORIGIN= Bruker BioSpin GmbH
$$ ##OWNER= nmr
$$ C:\u/data/dgb/nmr/ADRS/1880/pdata/1/auditp.txt
$$ ##AUDIT TRAIL=  $$ (NUMBER, WHEN, WHO, WHERE, WHAT)
(   1,<2007-06-26 09:52:08.71 +100>,<MAYBRIDGE\nmr>,<NMR_250MHZ>,
      <created by zg, POWCHK disabled, PULCHK disabled
       configuration hash MD5:
       76 6E 9A 78 1E 09 19 81 EC 84 63 8F B0 6A 59 2D
       data hash MD5: 64K
       01 CF 7B B0 EC 64 AB F3 17 80 F3 2E 4F C8 B6 51>)
(   2,<2007-06-26 09:52:23.17 +100>,<MAYBRIDGE\nmr>,<NMR_250MHZ>,
      <Start of raw data processing
       ef LB = 0.3 FT_mod = 6 PKNL = 1 SI = 32K 
       data hash MD5: 32K
       88 B8 3B A8 C3 E2 B9 93 4B 3A 95 3A 3B A5 99 0C>)
(   3,<2007-06-26 09:52:24.98 +100>,<MAYBRIDGE\nmr>,<NMR_250MHZ>,
      <apk 
       data hash MD5: 32K
       01 58 E1 E8 67 21 56 BF 58 38 53 03 0E C0 6C 32>)
(   4,<2007-06-26 09:52:25.96 +100>,<MAYBRIDGE\nmr>,<NMR_250MHZ>,
      <abs ABSG = 5 
       data hash MD5: 32K
       B4 75 97 1B 8A 34 01 A3 AA 08 40 D6 8B B4 24 DF>)
$$ ##END=
$$ 
$$ hash MD5
$$ DB E1 7B 93 B9 26 B1 87 2C 46 6A 90 77 E1 D8 78
##$RELAX= 
##$RELAX= 
##$RELAX= 
##$RELAX= 
##$RELAX= 
##$RELAX= 
##$RELAX= 
$$ Bruker specific parameters
$$ --------------------------
##$DU= <C:\u>
##$EXPNO= 1880
##$NAME= <ADRS>
##$PROCNO= 1
##$TYPE= <nmr>
##$USER= <dgb>
##$AMP= (0..31)
100 100 100 100 100 100 100 100 100 100 100 100 100 100 100 100 100 100 
100 100 100 100 100 100 100 100 100 100 100 100 100 100 
##$AQSEQ= 0
##$AQ_mod= 3
##$AUNM= <au_zg>
##$AUTOPOS= <7 >
##$BF1= 250.13
##$BF2= 250.13
##$BF3= 250.13
##$BF4= 250.13
##$BF5= 500.13
##$BF6= 500.13
##$BF7= 500.13
##$BF8= 500.13
##$BYTORDA= 1
##$CFDGTYP= 0
##$CFRGTYP= 5
##$CHEMSTR= <none>
##$CNST= (0..31)
1 1 145 1 1 1 1 1 1 1 1 1 1 1 1 1 1 1 1 1 1 1 1 1 1 1 1 1 1 1 1 1 
##$CPDPRG= <>
##$CPDPRG1= <>
##$CPDPRG2= <>
##$CPDPRG3= <>
##$CPDPRG4= <mlev>
##$CPDPRG5= <mlev>
##$CPDPRG6= <mlev>
##$CPDPRG7= <mlev>
##$CPDPRG8= <mlev>
##$CPDPRGB= <>
##$CPDPRGT= <>
##$D= (0..31)
0 1 0 0 0 0 0 0 0 0.06 0 0 0 0 0 0 0.0002 0 0 0 0 0 0 0 0 0 0 0 0 0 0 
0 
##$DATE= 1182847927
##$DBL= (0..7)
120 120 120 120 120 120 120 120 
##$DBP= (0..7)
150 150 150 150 150 150 150 150 
##$DBP07= 0
##$DBPNAM0= <>
##$DBPNAM1= <>
$$ [...]
##$SUBNAM7= <"">
##$SUBNAM8= <"">
##$SUBNAM9= <"">
##$SW= 20.6930455092707
##$SWIBOX= (0..15)
0 0 3 0 0 0 0 0 0 0 0 0 0 0 0 0 
##$SW_h= 5175.983436853
##$TD= 65536
##$TD0= 1
##$TE= 295.16
##$TE2= 300
##$TE3= 300
##$TEG= 300
##$TL= (0..7)
0 120 120 120 120 120 120 120 
##$TP= (0..7)
150 150 150 150 150 150 150 150 
##$TP07= 0
##$TPNAME0= <>
##$TPNAME1= <>
##$TPNAME2= <>
##$TPNAME3= <>
##$TPNAME4= <>
##$TPNAME5= <>
##$TPNAME6= <>
##$TPNAME7= <>
##$TPOAL= (0..7)
0.5 0.5 0.5 0.5 0.5 0.5 0.5 0.5 
##$TPOFFS= (0..7)
0 0 0 0 0 0 0 0 
##$TUNHIN= 0
##$TUNHOUT= 0
##$TUNXOUT= 0
##$USERA1= <user>
##$USERA2= <user>
##$USERA3= <user>
##$USERA4= <user>
##$USERA5= <user>
##$V9= 5
##$VALIST= <valist>
##$VCLIST= <CCCCCCCCCCCCCCC>
##$VD= 0
##$VDLIST= <DDDDDDDDDDDDDDD>
##$VPLIST= <PPPPPPPPPPPPPPP>
##$VTLIST= <TTTTTTTTTTTTTTT>
##$WBST= 1024
##$WBSW= 4
##$XGAIN= (0..3)
0 0 0 0 
##$XL= 0
##$YL= 0
##$YMAX_a= 245015
##$YMIN_a= -213347
##$ZGOPTNS= <>
##$ZL1= 120
##$ZL2= 120
##$ZL3= 120
##$ZL4= 120
##$ABSF1= 16.51311
##$ABSF2= -4.180063
##$ABSG= 5
##$ABSL= 3
##$ALPHA= 0
##$AQORDER= 0
##$ASSFAC= 0
##$ASSFACI= 0
##$ASSFACX= 0
##$ASSWID= 0
##$AUNMP= <proc_1d>
##$AZFE= 0.1
##$AZFW= 0.1
##$BCFW= 0
##$BC_mod= 0
##$BYTORDP= 0
##$COROFFS= 0
##$CY= 12.5
##$DATMOD= 1
##$DC= 0
##$DFILT= <>
##$DTYPP= 0
##$F1P= 14.0000005364418
##$F2P= -0.99999901652339
##$FCOR= 0.5
##$FTSIZE= 32768
##$FT_mod= 6
##$GAMMA= 0
##$GB= 0
##$INTBC= 1
##$INTSCL= 1
##$ISEN= 128
##$LB= 0.3
##$LEV0= 0
##$LPBIN= 0
##$MAXI= 10000
##$MC2= 0
##$MEAN= 0
##$ME_mod= 0
##$MI= 0
##$NCOEF= 0
##$NC_proc= -3
##$NLEV= 6
##$NOISF1= 0
##$NOISF2= 0
##$NSP= 0
##$NTH_PI= 0
##$NZP= 0
##$OFFSET= 16.51311
##$PC= 1
##$PHC0= -66.80342
##$PHC1= 19.57667
##$PH_mod= 1
##$PKNL= yes
##$PPARMOD= 0
##$PSCAL= 4
##$PSIGN= 0
##$REVERSE= no
##$SF= 250.13000222164
##$SI= 32768
##$SIGF1= 0
##$SIGF2= 0
##$SINO= 400
##$SIOLD= 32768
##$SREGLST= <1H.DMSO>
##$SSB= 0
##$STSI= 32768
##$STSR= 0
##$SW_p= 5175.98343685301
##$SYMM= 0
##$S_DEV= 0
##$TDeff= 65536
##$TDoff= 0
##$TI= <Analysis number 999999
Compound Code 99
Book Reference 9
Project Code 9>
##$TILT= no
##$TM1= 0
##$TM2= 0
##$TOPLEV= 0
##$USERP1= <user>
##$USERP2= <user>
##$USERP3= <user>
##$USERP4= <user>
##$USERP5= <user>
##$WDW= 1
##$XDIM= 32768
##$YMAX_p= 444998565
##$YMIN_p= -249583
$$ End of Bruker specific parameters
$$ ---------------------------------
##NTUPLES= NMR SPECTRUM
##VAR_NAME=  FREQUENCY,     SPECTRUM/REAL,   SPECTRUM/IMAG
##SYMBOL=    X,             R,               I
##VAR_TYPE=  INDEPENDENT,   DEPENDENT,       DEPENDENT
##VAR_FORM=  AFFN,          ASDF,            ASDF
##VAR_DIM=   32768,         32768,           32768
##UNITS=     HZ,            ARBITRARY UNITS, ARBITRARY UNITS
##FACTOR=    0.157963299565203, 1,           1
##FIRST=     4130.42404267144, 0,            0
##LAST=      -1045.55939418157, 0,           0
##MIN=       -1045.55939418157, -249583,     0
##MAX=       4130.42404267144, 444998565,    0
$$ Real data points
##PAGE= N=1
##DATA TABLE= (X++(R..R)), XYDATA
$$ [...]
$$ plain form
16133 -92863 -105464 -53437 -32363 -62750 -82657 -67587 -40982 -43704 -67851 -52942 -45437 -60688
16121 -60688 -37354 -287 16211 23493 28110 -2206 10773 -22340 -41945 -28857 -25600 -37284
16109 -37284 -50472 -58789 -55951 -49627 -39453 -8310 12472 23047 7214 -12982 -41751 -26638
16097 -26638 -30170 -37783 -49674 -57232 -48532 -46473 -41519 -17293 7779 -18426 -46539 -42269 -34535
16084 -34535 -38065 -39947 -29394 -25623 -18538 -43776 -69525 -76310 -63056 -52449 -36246 -17893 -19192
16071 -19192 9744 -11705 -28030 -23691 -18171 -11347 -25149 -48732 -32707 6546 2264 -36624
16059 -36624 -68107 -83966 -50860 -53494 -36442 -15833 -28488 -58180 -71679 -79149 -90169 -75425
16047 -75425 -40161 -554 2339 -24275 -31930 -12081 7196 9675 7592 -16914 -22937 -17384 11194
$$ packed form
16133i2863j2601N2027K1074l0387j9907J5070K6605k722k4147J4909P505j5251
16121f0688K3334L7067J6498P282M617l0316J2979l3113j9605J3088L257j1684
16109c7284j3188q317K838O324J0174L1143K0782J0575j5833k0196k8769J5113
16097b6638l532p613j1891p558Q700K059M954K4226K5072k6205k8113M270P734
16084c4535l530j882J0553L771P085k5238k5749o785J3254J0607J6203J8353j299
16071a9192K8936k1449j6325M339N520O824j3802k3583J6025L9253m282l8888
16059c6624l1483j5859L3106k634J7052K0609j2655k9692j3499p470j1020J4744
16047g5425L5264L9607K893k6614p655J9849J9277K479k083k4506o023N553K8578
$$ plain form
16034 11194 2003 -29250 -41269 -31371 -10123 8841 25121 13818 28894 60100 42903 44973
16022 44973 32114 -155 -27749 -42739 -32074 -8141 -10571 -12370 147 5454 28956 40729
16010 40729 2763 249 9641 38081 33172 15229 1342 -22664 -40759 -39499 -29244 -16318
15998 -16318 -13684 13498 21960 -31975 -46884 -31557 -30141 -21503 -10738 -6797 27811 39057 17554
15985 17554 -22640 -32364 52 -2544 -1006 -6593 -5713 -38314 -46573 -55356 -38424 -41467 -38842 -31276
15971 -31276 -41003 -44476 -42969 -8602 2587 -25007 -45688 -35100 9489 22753 23253 1258 -20011
15958 -20011 -23892 -4994 -12382 -56409 -66879 -57545 -41371 -35613 -47054 -41423 -15103 -2861 -9110
15945 -9110 -12790 10228 16847 12744 21129 -14895 -43889 -31382 -38155 -41869 -7438 8198 -2334
$$ packed form
16034A1194r191l1253j2019R898K1248J8964J6280j1303J5076L1206j7197K070
16022D4973j2859l2269k7594j4990J0665K3933k430j799J2517N307K3502J1773
16010D0729l7966k514R392K8440m909j7943j3887k4006j8095J260J0255J2926
15998a6318K634K7182Q462n3935j4909J5327J416Q638J0765L941L4608J1246k1503
15985A7554m0194r724L2416k596J538n587Q80l2601q259q783J6932l043K625P566
15971c1276r727l473J507L4367J1189k7594k0681J0588M4589J3264N00k1995k1269
15958b0011l881J8898p388m4027j0470R334J6174N758j1441N631K6320J2242o249
15945i110l680K3018O619m103Q385l6024k8994J2507o773l714L4431J5636j0532
$$ plain form
15932 -2334 -11756 -16424 -16239 -13708 -30015 -26587 19347 23402 18123 -616 -243 5064 9969 -40326
15918 -40326 -65693 -60951 -30414 16943 16389 10394 -5055 -2482 8199 -10418 -17830 -33529 -22520
15905 -22520 -23189 -28660 -31835 -24133 -28768 -33417 -22946 -24598 -24658 -13987 10496 8560 19032 -32569
15891 -32569 -62540 -66207 -62839 -63459 -44787 -23153 -8783 -12369 -9044 3503 409 8177 -5990
15878 -5990 -9816 12570 -14271 -33312 -50493 -40479 -40759 -39379 -48193 -3573 19164 2957 -31111
15865 -31111 -41368 -47663 -40756 -44483 -20082 -2823 -17150 -4246 2544 -15148 -7953 -11730 -24272
15852 -24272 -39243 -37798 -35983 -20644 -19411 -7385 -3754 -5541 28280 3868 -3692 -12295 -26475
15839 -26475 -5902 -6285 -16950 -18925 -21401 7273 -12234 -22947 -33939 -10675 10242 -1285
$$ packed form
15932b334r422m668J85K531j6307L428M5934M055n279j8739L73N307M905n0295
15918d0326k5367M742L0537M7357n54n995j5449K573J0681j8617p412j5699J1009
15905b2520o69n471l175P702m635m649J0471j652o0J0671K4483j936J0472n1601
15891c2569k9971l667L368o20J8672K1634J4370l586L325J2547l094P768j4167
15878e990l826K2386k6841j9041j7181J0014k80J380q814M4620K2737j6207l4068
15865c1111j0257o295O907l727K4401J7259j4327J2904O790j7692P195l777j2542
15852b4272j4971J445J815J5339J233J2026L631j787L3821k4412p560q603j4180
15839b6475K0573l83j0665j975k476K8674j9507j0713j0992K3264K0917j1527
$$ plain form
15827 -1285 -4679 -12898 -53048 -42608 -35049 -30520 -8271 -656 -41947 -46394 -17349 -6198 -25599
15814 -25599 -14237 6106 16549 16949 -11805 -29115 -29094 -20733 -21142 -14049 -8335 -11283 -36906 -61658
15800 -61658 -35019 -9262 -18802 -21266 -28787 -27350 -32439 -38129 -55872 -53257 -49674 -35137 -44706
15787 -44706 -50124 -32510 -17636 -13060 -11742 -28214 -56112 -58666 -42510 -40400 -50745 -67928 -44228
15774 -44228 -2295 -24199 1636 37178 45097 25484 9925 13168 -6149 -1536 -1457 -5187 -17386
15761 -17386 -21769 -27169 -45607 -56542 -32720 -27741 -42456 -40742 -39680 -49492 -44181 -11812 9659
15748 9659 9503 814 -289 31298 35103 40754 32764 42242 -958 -3534 -9082 -15716 -33489 -57595
15734 -57595 -36777 -4741 200 -14966 7332 7553 -5585 -32556 -36135 -28095 -26626 727 -20438
$$ packed form
15827a285l394q219m0150J0440P559M529K2249P615m1291m447K9045J1151j9401
15814b5599J1362K0343J0443M00k8754j7310K1Q361m09P093N714k948k5623k4752
15800f1658K6639K5757r540k464p521J437n089n690j7743K615L583J4537r569
15787d4706n418J7614J4874M576J318j6472k7898k554J6156K110j0345j7183K3700
15774d4228M1933k1904K5835L5542P919j9613j5559L243j9317M613P9l730j2199
15761a7386m383n400j8438j0935K3822M979j4715J714J062r812N311L2369K1471
15748I659j56q689j103L1587L805N651p990R478m3200k576n548o634j7773k4106
15734e7595K0818L2036M941j5166K2298K21j3138k6971l579Q040J469K7353k1165
$$ plain form
15721 -20438 3479 -7073 -20301 -7031 14258 -4584 -31035 -34679 -26595 -10787 -35546 -43743
15709 -43743 -27194 -10245 -4033 14936 5881 1125 8697 -9206 -2565 470 -19699 -6291 1542
15696 1542 3245 -9978 -37843 -29733 -16819 -15445 -33976 -38083 -27297 -34506 -41559 -33028 -18238
15683 -18238 -23304 -29695 -47426 -9258 3215 -6942 -4590 -7960 -11797 -13049 -26532 -30048 -3607
15670 -3607 10648 -2865 -14935 13842 8820 -15846 -19011 8661 279 -8269 15310 51113 39185
15657 39185 17332 43227 26110 13068 -4130 6633 17664 34456 23791 691 20111 50363
15645 50363 47767 53684 34444 21012 15894 26075 2162 -18139 -3350 17162 30261 2453
15633 2453 891 7818 5119 -8413 -6575 11551 8439 12292 32241 7993 -3941 6991 21588
$$ packed form
15721b0438K3917j0552j3228J3270K1289j8842k6451l644Q084J5808k4759q197
15709d3743J6549J6949O212J8969r055m756P572j7903O641L035k0169J3408P833
15696A542J703j3223k7865Q110J2914J374j8531m107J0786p209p053Q531J4790
15683a8238n066o391j7731L8168J2473j0157K352l370l837j252j3483l516K6441
15670c607J4255j3513j2070K8777n022k4666l165K7672q382q548K3579L5803j1928
15657C9185k1853K5895j7117j3042j7198J0763J1031J6792j0665k3100J9420L0252
15645E0363k596N917j9240j3432n118J0181k3913k0301J4789K0512J3099k7808
15633B453j562O927k699j3532J838J8126l112L853J9949k4248j1934J0932J4597
$$ plain form
15620 21588 15708 13282 -18257 -20344 -9750 -46335 -43113 -18342 7543 28701 23464 40557 46355
15607 46355 16031 11278 18692 -2729 -3755 11381 23708 31997 14697 -938 -9904 69 -31092
15594 -31092 -37865 -15185 -9286 -28707 -29797 -16441 4486 9622 9713 -10774 572 -1622 -25893
15581 -25893 -61544 -47052 -33465 -29508 -29448 -13479 -35049 -32473 -20576 -11545 -42908 -49073 -10985
15568 -10985 11365 18578 6424 3891 31782 21635 -4398 2548 20312 27148 34239 1736 -15827
15555 -15827 -5924 13693 2866 -790 1997 -38105 -87178 -62170 -45594 -66296 -74733 -69631 -77401
15542 -77401 -90656 -80344 -55433 -47325 -49435 -34159 -9798 -30332 -54020 -49933 -13036 -24358
15530 -24358 -39004 -59686 -33073 3024 32415 29998 5834 -2161 -28848 -43919 -29390 20594
$$ packed form
15620B1588n880k426l1539k087J0594l6585L222K4771K5885K1158n237J7093N798
15607D6355l0324m753P414k1421j026J5136J2327Q289j7300j5635q966R973l1161
15594c1092o773K2680N899j9421j090J3356K0927N136R1k0487J1346k194k4271
15581b5893l5651J4492J3587L957O0J5969k1570K576J1897R031l1363o165L8088
15568a0985K2350P213j2154k533K7891j0147k6033O946J7764O836P091l2503j7563
15555a5827R903J9617j0827l656K787m0102m9073K5008J6576k0702q437N102p770
15542g7401j3255J0312K4911Q108k110J5276K4361k0534k3688M087L6897j1322
15530b4358j4646k0682K6613L6097K9391k417k4164p995k6687j5071J4529M9984
$$ plain form
15518 20594 20183 3835 1441 427 33510 32774 4646 -11180 -15675 -47 -13086 -11137 175
15505 175 -3877 4280 2143 -24448 -40066 -40568 -71614 -47011 -42633 -53427 -52707 -20187 -15937 7573
15491 7573 -1459 -29994 -70892 -37198 -18002 -34901 -53434 -75851 -63091 -52201 -34207 -61712
15479 -61712 -78115 -69984 -63041 -57750 -45472 -44594 -37453 -15591 -11069 -27920 -27789 -9465 -25924
15466 -25924 -33060 -21411 -6009 11258 8459 -263 -30747 -40313 -44159 -53313 -25381 5568 10634
15453 10634 5393 -8539 3120 5018 25236 17121 3930 18742 13924 19156 34781 38469 16956
15440 16956 6332 8498 -6568 -28834 -23982 -32360 -42140 -37919 -41911 -33517 -43282 -24846 -19219
15427 -19219 -12400 -8600 28481 60670 44349 21926 25230 -3955 -26212 2769 -12407 -17326
$$ packed form
15518B0594m11j6348k394j014L3083p36k8128j5826m495J5628j3039J949J1312
15505A75m052Q157k137k6591j5618n02l1046K4603M378j0794P20L2520M250K3510
15491G573r032k8535m0898L3694J9196j6899j8533k2417J2760J0890J7994k7505
15479f1712j6403Q131O943N291J2278Q78P141K1862M522j6851J31J8324j6459
15466b5924p136J1649J5402J7267k799q722l0484r566l846r154K7932L0949N066
15453A0634n241j3932J1659J898K0218q115j3191J4812m818N232J5625L688k1513
15440A6956j0624K166j5066k2266M852q378r780M221l992Q394r765J8436N627
15427a9219O819L800L7081L2189j6321k2423L304k9185k2257K8981j5176m919
$$ plain form
15415 -17326 -14698 9871 10225 -11694 -8390 -19378 -15975 -5443 -4845 10000 28631 42480 13202
15402 13202 -12916 -22616 -30469 -26885 -10297 28083 17634 1016 -26076 -25198 2027 -1906 -2983
15389 -2983 -26468 -40656 -29646 -38538 -29748 -36140 -23335 -33441 -9598 1031 24496 15292 -7284
15376 -7284 -10864 -29252 -25885 -28387 -33435 -30863 -29489 -17471 -4078 -8196 1120 22370 26336 -24150
15362 -24150 -36265 -16400 -8983 -8447 1569 1162 -30716 -39601 -39571 -37815 -47382 -49557 -55249 -39383
15348 -39383 -17969 -17462 -23588 -20068 -36333 -22942 -6501 -6817 -28158 -10486 3956 12680 5007
15335 5007 5085 8042 6916 3737 -21573 -34161 -35113 -38750 -39977 -54337 -36468 -21703 -14440 -26902
15321 -26902 11669 32391 28384 -10863 -32922 -26551 -30137 -28920 -50027 -41602 -25812 -39776 -50792
$$ packed form
15415a7326K628K4569L54k1919L304j0988L403J0532N98J4845J8631J3849k9278
15402A3202k6118r700p853L584J6588L8380j0449j6618k7092Q78K7225l933j077
15389b983k3485j4188J1010q892Q790o392J2805j0106K3843J0629K3465r204k2576
15376g284l580j8388L367k502n048K572J374J2018J3393m118R316K1250L966n0486
15362b4150j2115J9865P417N36J0016m07l1878q885L0J756r567k175n692J5866
15348c9383K1414N07o126L520j6265J3391J6441l16k1341J7672J4442Q724p673
15335E007P8K957j126l179k5310j2588r52l637j227j4360J7869J4765P263j2462
15321b6902L8571K0722m007l9247k2059O371l586J217k1107Q425J5790j3964j1016
$$ plain form
15308 -50792 -21813 -4754 -13815 -28487 -13794 2930 4741 25640 47945 39891 24362 2464
15296 2464 1223 -29214 -38244 -46101 -30462 -29983 2966 42952 40240 20598 9906 -908 -839 1302
15282 1302 -4507 -11823 -30269 -19372 -14571 -24094 -24452 -14665 -12411 7935 21884 5242 -13544
15269 -13544 -14696 -19418 -13242 -1540 -8255 -21767 -11142 25097 36629 6989 -5281 -17679
15257 -17679 -4215 -6142 -9239 -28524 -37367 -24404 16975 46712 28138 14149 3686 -121
15245 -121 18700 7149 1881 9974 17432 -987 -25060 -68099 -57465 -40983 -18948 -44422 -34363
15232 -34363 5444 21617 -14369 -9838 -11791 -9399 -16710 -20338 -33017 -26808 -2822 -38132 -49994
15219 -49994 -26092 -7011 -11941 -7432 -7930 -29930 -39515 -64517 -60328 -31859 -21885 -31316 -19537
$$ packed form
15308e0792K8979J7059r061j4672J4693J6724J811K0899K2305q054j5529k1898
15296B464j241l0437r030p857J5639M79L2949L9986k712j9642j0692j0814O9K141
15282A302n809p316j8446J0897M801r523l58R787K254K0346J3949j6642j8786
15269a3544j152m722O176J1702o715j3512J0625L6239J1532k9640j2270j2398
15257a7679J3464j927l097j9285q843J2963M1379K9737j8574j3989j0463l807
15245a21J8821j1551n268Q093P458j8419k4073m3039J0634J6482K2035k5474J0059
15232c4363L9807J6173l5986M531j953K392p311l628j2679O209K3986l5310j1862
15219d9994K3902J9081m930M509m98k2000r585k5002M189K8469R974r431J1779
$$ plain form
15206 -19537 -21987 -35113 -20968 6937 12008 -8853 -24036 -41372 -36707 -44814 -36014 -23563 -9300
15193 -9300 8691 21675 11001 -11436 -4084 372 -5921 5147 -10370 -8699 -11746 -33970 -46808
15180 -46808 -44344 -40041 -33823 -34764 -17915 -11084 -18867 -32413 -32543 -7700 -23729 -30738 -407 -8322
15166 -8322 -50301 -58052 -73771 -45135 2524 10963 -534 -30447 -58075 -62271 -46067 -45019 -37837
15153 -37837 -17769 -7888 -12748 -50369 -54900 -41744 -48134 -26272 7346 2739 -24928 -7668 14831
15140 14831 29697 40640 33360 34353 34950 33535 6020 -7209 -3950 46771 59632 50746 21436
15127 21436 17219 50684 66446 59701 64267 44420 7665 -168 -3211 27750 39191 23674 -13267
15114 -13267 -25555 -31346 -21194 -20878 -29107 -10708 -5134 12050 19733 19686 28117 23497 10326 34919
$$ packed form
15206a9537k450j3126J4145K7905N071k0861j5183j7336M665q107Q800J2451J4263
15193i300J7991J2984j0674k2437P352M456o293J1068j5517J671l047k2224j2838
15180d6808K464M303O218r41J6849O831p783j3546j30K4843j6029p009L0331p915
15166h322m1979p751j5719K8636M7659Q439j1497k9913k7628m196J6204J048P182
15153c7837K0068R881m860l7621m531J3156o390K1862L3618m607k7667J7260K2499
15140A4831J4866J0943p280R93N97j415k7515j3229L259N0721J2861q886k9310
15127B1436m217L3465J5762o745M566j9847l6755p833l043L0961J1441j5517l6941
15114a3267j2288n791J0152L16q229J8399N574J7184P683m7Q431m620j3171K4593
$$ plain form
15100 34919 39438 31313 -21099 -61203 -45024 -47479 -70557 -60235 -37159 -19818 -21658 -6485
15088 -6485 -9382 -5344 -2861 -5245 -5721 13282 19719 41127 55769 33943 27656 10512 1919 20441
15074 20441 13569 -7089 -20091 624 -8345 -19609 -25214 -29459 -21437 15417 -4626 -36820 -30961
15061 -30961 -15508 -26115 -38826 -13288 5851 -2579 16954 27832 28969 6124 6998 -178 -20662
15048 -20662 8279 13076 26179 21038 3932 7708 3587 11382 -7859 -24967 -39826 -33327 -11692
15035 -11692 -5471 12929 -11591 -12752 -8970 -14287 -31598 -11725 -2004 2085 -10179 -18412 -24851
15022 -24851 -15040 -32805 -34741 -33263 -19733 -33222 -39550 2648 32047 43719 34700 26425 11133
15009 11133 34160 45371 27858 27433 42914 32621 7857 -10984 1841 -2759 -25135 -37569
$$ packed form
15100C4919M519q125n2412m0104J6179k455k3078J0322K3076J7341j840J5173
15088f485k897M038K483k384m76J9003O437K1408J4642k1826o287j7144q593J8522
15074B0441o872k0658j3002K0715q969j1264n605m245Q022L6854k0043l2194N859
15061c0961J5453j0607j2711K5538J9139q430J9533J0878J137k2845Q74p176k0484
15048b0662K8941M797J3103n141j7106L776m121P795j9241j7108j4859O499K1635
15035a1692O221J8400k4520j161L782n317j7311J9873R721M089j2264q233o439
15022b4851R811j7765j936J478J3530j3489o328M2198K9399J1672r019q275j5292
15009A1133K3027J1211j7513m25J5481j0293k4764j8841J2825m600k2376j2434
$$ plain form
14997 -37569 -55968 -43259 -14541 -24234 -9792 -20829 -21742 -16382 -20085 -16666 -2117 24941 13966
14984 13966 10377 8759 -18554 -38239 -37843 -14878 -15130 -23808 -3821 -25051 -18576 15780 21100
14971 21100 -5689 -30613 -23619 -36988 -29856 -8273 -5598 19936 20753 9718 3004 44868 40973
14958 40973 -2075 -38016 -27196 -29255 -28528 -34586 -50795 -39946 -9242 634 -10789 -1897 28202
14945 28202 2687 -18391 -29036 -72707 -78689 -52067 -48926 -46791 -20987 551 -28861 -47652
14933 -47652 -44903 -34936 -24324 5999 10616 -7922 -22557 -53076 -69589 -47679 12584 42652
14921 42652 26570 28271 15722 -4175 -3809 20573 13311 -20506 -33544 -52119 -48825 -21096 -4458
14908 -4458 -6582 -37101 -31629 -38897 -63955 -83189 -85252 -78411 -66062 -23924 -13074 -21833 -18180
$$ packed form
14997c7569j8399J2709K8718r693J4442j1037r13N360l703L419J4549K7058j0975
14984A3966l589j618k7313j9685L96K2965k52q678J9987k1230O475L4356N320
14971B1100k6789k4924O994j3369P132K1583K675K5534Q17j1035o714M1864l895
14958D0973m3048l5941J0820k059P27o058j6209J0849L0704R876j1423Q892L0099
14945B8202k5515k1078j0645m3671n982K6622L141K135K5804K1538k9412j8791
14933d7652K749R967J0612L0323M617j8538j4635l0519j6513K1910O0263L0068
14921D2652j6082J701j2549j9897L66K4382p262l3817j3038j8575L294K7729J6638
14908d458k124l0519N472p268k5058j9234k063O841J2349M2138J0850q759L653
$$ plain form
14895 -18180 -5760 7309 -15825 -26228 -11075 10089 -11361 -50636 -36458 -23862 6705 5768
14883 5768 -5193 26124 43050 28711 34778 48231 20645 -19016 -36161 -19761 -10071 -10230 -34269
14870 -34269 -35179 -39627 -40230 -27225 -28968 -9599 -15204 -15215 -18814 -37198 -18754 9881 -2326 -18375
14856 -18375 976 24108 12133 -7117 -27559 -22483 -33886 -33300 -29364 -17982 -23385 -11469 -6597
14843 -6597 -6984 -10993 24173 49083 30730 -679 -18605 -33975 -37356 -14974 -6518 -4537 3493
14830 3493 23864 24297 22856 -4653 4114 -379 -12591 -11125 4322 3952 -38240 -57373 -44020
14817 -44020 -26879 -35553 -14222 11214 7629 -8267 -13861 -35894 -22356 -260 -5182 8473
14805 8473 13048 41039 33409 18331 1546 3015 20177 16847 -4018 -12904 34742 49354 24852
$$ packed form
14895a8180J2420J3069k3134j0403J5153K1164k1450l9275J4178J2596L0567r37
14883E768j0961L1317J6926j4339O067J3453k7586l9661j7145J6400R690j59k4039
14870c4269r10m448o03J3005j743J9369n605j1l599j8384J8444K8635j2207j6049
14856a8375J9351K3132j1975j9250k0442N076j1403N86L936J1382n403J1916M872
14843f597l87m009L5166K4910j8353l1409j7926j5370l381K2382Q456J981Q030
14830C493K0371M33j441k7509Q767m493j2212J466J5447l70m2192j9133J3353
14817d4020J7141q674K1331K5436l585j5896n594k2033J3538K2096m922J3655
14805H473M575K7991p630j5078j6785J469J7162l330k0865q886M7646J4612k4502
$$ plain form
14792 24852 -25457 -36197 2094 35620 33988 -4505 -16839 10665 -441 37667 61846 51861
14780 51861 32335 1739 -2524 4642 1151 11600 30280 13958 -20317 -19100 1104 11046 -10121
14767 -10121 -10428 11571 6750 3219 -10391 -17297 -2596 24805 16438 1715 3404 4401 9124 18390
14753 18390 -4870 -28163 -26474 -5969 -14961 -30235 -23757 -16946 -36948 -24405 -6946 15873
14741 15873 7374 -33298 -32173 -32918 -27899 -4512 8670 -20528 -24665 7659 6758 10359 6026 16579
14727 16579 12567 17014 35186 14705 17574 2942 -17777 -11101 -30754 -43980 -58262 -46928
14715 -46928 -35327 -22385 11428 13861 29640 20297 9530 12719 -3081 -24413 -4976 14978
14703 14978 -4161 -19602 11320 16289 9968 -8252 -28229 -29670 -3156 -19584 -39149 -48194
$$ packed form
14792B4852n0309j0740L8291L3526j632l8493j2334K7504j1106L8108K4179r985
14780E1861j9526l0596m263P166l491J0449J8680j6322l4275J217K0204R942k1167
14767a0121l07K1999m821l531j3610o906J4701K7401q367j4723J689R97M723R266
14753A8390k3260k3293J689K0505q992j5274O478O811k0002J2543J7459K2819
14741A5873q499m0672J125p45N019K3387J3182k9198m137L2324r01L601m333J0553
14727A6579m012M447J8172k0481K869j4632k0719O676j9653j3226j4282J1334
14715d6928J1601J2942L3813K433J5779r343j0767L189j5800k1332J9437J9954
14703A4978j9139j5441L0922M969o321j8220j9977j441K6514j6428j9565r045
$$ plain form
14691 -48194 -48554 -53115 -54027 -44120 -33890 -38196 -37698 -40669 -42746 -41648 -22967 -20643 -25802 -16590 -28499
14676 -28499 -22149 -632 2345 -5032 2897 3379 17513 18295 -2459 -34410 -37660 -13486 6327
14663 6327 20886 45888 46202 18432 893 5658 3921 -2861 3504 11128 13576 -16370 -21089 -1883
14649 -1883 14542 -27382 -55974 -51896 -34848 -40292 -60713 -53109 -27546 -36546 -53564 -58648 -27618
14636 -27618 -16623 -40683 -54522 -55006 -23202 -5919 1384 -39473 -51631 -55107 -44128 -21733
14624 -21733 -18486 -4681 -17559 -47899 -6600 13174 -14700 -28642 -44464 -32590 -19652 -22045
14612 -22045 -31561 -25721 -18230 -8597 21908 12695 10691 20768 37051 41729 22050 -7306 -30874
14599 -30874 -12793 -20970 -14763 -6653 -2001 21449 23542 13153 -10101 -2075 811 4857 37984
$$ packed form
14691d8194l60m561r12R907J0230m306M98k971k077J098J8681K324n159R212j1909
14676b8499O350K1517K977p377P929M82J4134P82k0754l1951l250K4174J9813
14663F327J4559K5002L14k7770j7539M765j737o782O365P624K448k9946m719J9206
14649a883J6425m1924k8592M078J7048n444k0421P604K5563r000j7018n084L1030
14636b7618J0995k4060j3839m84L1804J7283P303m0857j2158l476J0979K2395
14624b1733L247J3805j2878l0340M1299J9774k7874j3942j5822J1874J2938k393
14612b2045r516N840P491R633L0505r213k004J0077J6283M678j9679k9356k3568
14599c0874J8081q177O207Q110M652K3450K093j0389k3254Q026K886M046L3127
$$ plain form
14586 37984 40043 12559 -862 -9318 -39691 -45899 -33003 -17843 -3084 2517 45965 42831 40853
14573 40853 29817 11576 2450 -2613 -15787 -20627 -10462 10531 8815 -8906 -19940 -42108
14561 -42108 -58139 -63944 -53676 -178 23662 -6248 -16322 -22307 -22815 -14604 10971 22241 8794
14548 8794 -31410 -59199 -45865 -1849 38367 37010 8112 -11105 -28388 -39198 -33605 -31774
14536 -31774 -23776 -8485 -20354 -20443 16267 884 -23967 -54668 -38514 2406 285 23991 30719
14523 30719 4452 17488 50646 28436 -20154 -46261 -19082 6202 26054 45034 28326 20930
14511 20930 35276 42615 7273 -30118 -58700 -21458 36602 36421 15668 1873 6275 14616 29589
14498 29589 48977 54258 21468 26836 16810 5808 -6219 3110 8294 10473 13640 -27758 -31677
$$ packed form
14586C7984K059k7484j3421q456l0373o208J2896J5160J4759N601M3448l134j978
14573D0853j1036j8241r126n063j3174m840J0165K0993j716j7721j1034k2168
14561d2108j6031n805J0268N3498K3840k9910j0074n985n08Q211K5575J1270j3447
14548H794m0204k7789J3334M4016M0216j357k8898j9217j7283j0810N593J831
14536c1774P998J5291j1869q9L6710j5383k4851l0701J6154M0920k121K3706O728
14523C0719k6267J3036L3158k2210m8590k6107K7179K5284J9852J8980j6708p396
14511B0930J4346P339l5342l7391k8582L7242N8060j81k0753j3795M402Q341J4973
14498B9589J9388N281l2790N368j0026j1002j2027R329N184K179L167m1398l919
$$ plain form
14485 -31677 -7359 23840 20469 -18543 -31391 -29548 -30216 -35898 -24328 -11829 12280 -15934 -56494
14472 -56494 -66318 -54377 -37368 -6548 23993 -1805 -11539 -21811 -4798 2206 10165 14310 13916
14459 13916 4183 -1909 6451 14842 20170 9404 -14239 9925 14175 6414 -5382 3059 1870
14446 1870 -21970 -30285 -24074 -21902 -8440 13783 15994 -12580 -25706 -19283 -14365 -29009 -39126
14433 -39126 -10493 7724 27675 46471 45298 18792 24599 22501 24430 -453 -16456 5069
14421 5069 44045 19463 11919 58732 43646 36183 47131 20947 6399 8460 -2240 2959 -22163
14408 -22163 -51467 -54957 -61262 -73335 -73316 -27681 5836 6349 1153 -5229 -36362 -46162 -40249 -9057
14394 -9057 6946 37312 30038 -6656 -20735 -24877 -43195 -38900 4038 15510 31721 52622
$$ packed form
14485c1677K4318L1199l371l9012j2848J843o68n682J1570J2499K4109k8214m0560
14472e6494r824J1941J7009L0820L0541k5798r734j0272J7013P004P959M145l94
14459A3916r733o092Q360Q391N328j0766k3643K4164M250p761j1796Q441j189
14446A870k3840q315O211K172J3462K2223K211k8574j3126O423M918j4644j0117
14433c9126K8633J8217J9951J8796j173k6506N807k098J929k4883j6003K1525
14421E069L8976k4582p544M6813j5086p463J0948k6184j4548K061j0700N199k5122
14408b2163k9304l490o305j2073J9M5635L3517N13n196o382l1133r800N913L1192
14394i057J6003L0366p274l6694j4079m142j8318M295M2938J1472J6211K0901
$$ plain form
14382 52622 20934 -8878 15646 24369 5663 -4850 -10962 -8289 -14388 -43242 -15596 338
14370 338 -28167 -41768 -16904 3684 -34665 -37772 -15126 1956 -14324 38 18949 27690
14358 27690 196 -12967 -21848 -41172 -31413 -53442 -75368 -36445 -16144 3439 -13764 -264
14346 -264 -11042 3933 17081 10445 18215 28648 48300 75815 48966 17047 36447 44897 57108
14333 57108 25505 17884 9729 -27688 -55048 -30519 5973 -10546 -31729 -22071 -18443 -32329
14321 -32329 -40803 -8501 -649 19638 -4696 -47780 -55992 -38506 -41712 -16671 -7886 -16139 -9423
14308 -9423 -17314 -31415 -22012 -22772 -9935 -39949 -52791 -19164 31359 53202 69827 48618 45660
14295 45660 33800 4836 6398 347 -22183 -15063 17999 34177 15461 -4600 14802 20864
$$ packed form
14382E2622l1688k9812K4524Q723j8706j0513o112K673o099k8854K7646J5934
14370C38k8505j3601K4864K0588l8349l107K2646J7082j6280J4362J8911Q741
14358B7690k7494j3163q881j9324R759k2029k1926L8923K0301J9583j7203J3500
14346b64j0778J4975J3148o636P770J0433J9652K7515k6849l1919J9400Q450J2211
14333E7108l1603p621q155l7417k7360K4529L6492j6519k1183R658L628j3886
14321c2329q474L2302P852K0287k4334m3084q212J7486l206K5041Q785q253O716
14308i423p891j4101R403p60J2837l0014j2842L3627N0523K1843J6625k1209k958
14295D5660j1860k8964J562o051k2530P120L3062J6178j8716k0061J9402O062
$$ plain form
14283 20864 -3817 -14736 -18933 -32221 -35053 -41978 -23021 -6404 -24967 -47149 -36159 -38929
14271 -38929 -76221 -62821 -57668 -72572 -50354 -2269 13664 -9212 -26942 -6682 -1098 -53972
14259 -53972 -43862 -46 -1058 -7914 21357 30194 21330 -1386 9598 32456 24488 6904 -13408
14246 -13408 -33290 -21706 6088 14154 11526 -2652 -6898 8697 8435 -7830 -2582 26698 12674
14233 12674 -6337 7306 7439 10891 40413 34384 14587 -15001 -31806 -30546 -9404 -6747 -21478
14220 -21478 -32002 -11870 -574 9527 22743 8450 -21716 -4939 9688 13422 -27680 -44581
14208 -44581 -4231 30282 29936 51915 46163 25512 14427 12474 -26328 -22415 -12300 16862 10297
14195 10297 19232 47044 31211 8849 -5665 14661 12383 4400 -1866 -391 19989 30593 36359
$$ packed form
14283B0864k4681j0919m197j3288k832o925J8957J6617j8563k2182J0990k770
14271c8929l7292J3400N153j4904K2218M8085J5933k2876j7730K0260N584n2874
14259e3972J0110M3816j012o856K9271Q837q864k2716J0984K2858p968j7584k0312
14246a3408j9882J1584K7794Q066k628j4178m246J5595k62j6265N248K9280j4024
14233A2674j9011J3643J33L452K9522o029j9797k9588j6805J260K1142K657j4731
14220b1478j0524K0132J1296J0101J3216j4293l0166J6777J4627L734m1102j6901
14208d4581M0350L4513l46K1979n752k0651j1085j953l8802L913J0115K9162o565
14195A0297Q935K7812j5833k2362j4514K0326k278p983o266J475K0380J0604N766
$$ plain form
14182 36359 19610 7002 7593 -8099 -21426 -36525 -31520 -18267 165 686 -10289 9642 9046
14169 9046 -28114 -40403 -52574 -45599 -19504 -16662 -19239 -31569 -50201 -34548 -27174 -7929 14988
14156 14988 7133 -5891 1519 39064 55552 79779 75080 78283 62507 59580 20430 14867 29552
14143 29552 31719 30333 15605 -6571 12520 24808 34464 32725 37781 23175 6942 20382 25427
14130 25427 16259 58990 70673 62950 30505 8782 12337 16634 -3722 -1103 12333 13927 27295
14117 27295 32692 5250 -17907 14249 46478 38296 34210 30091 13993 -174 14697 11504 -17727
14104 -17727 -41626 -45156 -29745 13456 29781 15934 5172 -4568 2641 324 -14717 1550
14092 1550 24852 4350 1482 29613 64742 66487 68019 51073 2456 -6452 19708 60179 52234
$$ packed form
14182C6359j6749j2608N91j5692j3327j5099N005J3253J8432N21j0975J9931n96
14169I046l7160j2289j2171O975K6095K842k577j2330j8632J5653P374J9245K2917
14156A4988p855j3024P410L7545J6488K4227m699L203j5776k927l9150n563J4685
14143B9552K167j386j4728k2176J9091J2288R656j739N056j4606j6233J3440N045
14130B5427r168M2731J1683p723l2445k1723L555M297k0356K619J3436J594J3368
14117B7295N397k7442k3157L2156L2229q182m086m119j6098j4167J4871l193k9231
14104a7727k3899l530J5411M3201J6325j3847j0762r740P209k317j5041J6267
14092A550K3302k0502k868K8131L5129J745J532j6946m8617q908K6160M0471p945
$$ plain form
14079 52234 24324 16392 -7353 -57250 -49811 -34476 -25872 -11635 12516 8874 -12235 -30302
14067 -30302 -20390 -11996 -24516 -45532 -30883 1666 4224 -18004 -23388 -39764 -40627 -8867 3300
14054 3300 -4818 -4072 26358 58711 50940 26361 40136 44889 45203 26889 25605 46383 24273
14041 24273 12689 7452 26011 21901 25720 18766 14754 29479 13633 813 12727 5632 -11161
14028 -11161 -9711 -25822 -33756 -5612 14126 5439 21241 17565 20611 37664 26094 12658 9120
14015 9120 -18556 -45554 -62402 -20830 22496 533 10451 34160 21180 -27159 -37231 -9786
14003 -9786 28916 36340 42750 47283 54928 48691 36120 38295 36958 35958 41466 51525 42694 25464
13989 25464 -1139 -35028 -44335 -39700 -27405 -17106 16146 11760 14304 34027 50855 55572 32683
$$ packed form
14079E2234k7910p932k3745m9897P439J5335Q604J4237K4151l642k1109j8067
14067c0302R912Q394j2520k1016J4649L2549K558k2228n384j6376q63L1760J2167
14054C300q118P46L0430L2353p771k4579J3775M753L14j8314j284K0778k2110
14041B4273j1584n237J8559m110L819o954m012J4725j5846j2820J1914p095j6793
14028a1161J450j6111p934K8144J9738q687J5802l676L046J7053j1570j3436l538
14015I120k7676k6998j6848M1572M3326k1963R918K3709j2980m8339j0072K7445
14003i786L8702P424O410M533P645o237j2571K175j337j000N508J0059q831j7230
13989B5464k6603l3889r307M635J2295J0299L3252m386K544J9723J6828M717k2889
$$ plain form
13976 32683 23193 -995 -7785 -14265 26451 49279 62909 60107 28153 8 -15709 -5046
13964 -5046 -5876 4703 -12815 -8426 12136 16545 51285 46295 10442 25695 -4742 -3689 -10942
13951 -10942 5026 -12847 -4290 2390 3475 22659 11020 3478 16086 67089 62228 68392 88858
13938 88858 100568 98271 68045 58248 78257 53993 36315 38079 28196 29695 39994 21065 1671
13925 1671 19289 -9009 -10294 6193 33086 50041 61766 47677 33659 22687 -4764 -3622
13913 -3622 14889 12768 -4089 -9836 -27231 -37744 -24780 2652 22802 22074 -7774 -28870 -44619
13900 -44619 -14181 15139 43442 65037 27705 29053 32640 44876 41262 42294 53324 67704
13888 67704 39306 18275 6340 -16262 7741 24742 28856 31486 11839 12951 11343 8534 18460
$$ packed form
13976C2683r490k4188o790o480M0716K2828J3630k802l1954k8145j5717J0663
13964e046q30J0579j7518M389K0562M409L4740m990l5853J5253l0437J053p253
13951a0942J5968j7873Q557O680J085J9184j1639p542J2608N1003m861O164K0466
13938H8858J1710k297l0226r797K0009k4264j7678J764r883J499J0299j8929j9394
13925A671J7618k8298j285J6487K6893J6955J1725j4089j4018j0972k7451J142
13913c622J8511k121j6857n747j7395j0513J2964K7432K0150p28k9848k1096j5749
13900d4619L0438K9320K8303K1595l7332J348L587J2236l614J032J1030J4380
13888F7704k8398k1031j1935k2602K4003J7001M114K630j9647J112j608k809R926
$$ plain form
13875 18460 34888 11016 -12440 -953 26688 11502 -23109 -50797 -54866 -43977 -6127 -11716
13863 -11716 -17665 1070 9841 -20044 -11163 -21129 -33398 -22604 10593 52223 43540 27237 32791
13850 32791 18201 -12927 -12754 -41210 -35508 -34000 -46956 -46414 -28196 -21811 -11195 38669 60188
13837 60188 53040 62594 62091 54096 34545 2055 -23264 9685 29898 27025 23348 -6241 -6108
13824 -6108 -18977 -18208 -10649 -16589 -61098 -42460 -71 26483 34875 46724 48604 18793 22973
13811 22973 24727 24476 22380 13364 21446 18508 -3651 -7828 -3305 3306 36574 58247 54414 41479
13797 41479 27193 33796 47862 31406 24947 2815 20643 57167 38988 -125 -9769 28785
13785 28785 47617 8890 -14743 -5675 32046 15239 17407 18516 13804 -8196 11633 37133
$$ packed form
13875A8460J6428k3872k3456J1487K7641j5186l4611k7688m069J0889L7850n589
13863a1716n949J8735Q771k9885Q881r966j2269J0794L3197M1630q683j6303N554
13850C2791j4590l1128J73k8456N702J508j2956N42J8218O385J0616M9864K1519
13837F0188p148R554n03p995j9551l2490k5319L2949K0213k873l677k9589J33
13824f108j2869P69P559n940m4509J8638M2389K6554Q392J1849J880k9811M180
13811B2973J754k51k096r016Q082k938k2159m177M523O611L3268K1673l833j2935
13797D1479j4286O603J4066j6456o459k2132J7828L6524j8179l9113r644L8554
13785B8785J8832l8727k3633R068L7721j6807K168J109m712k2000J9829K5500
$$ plain form
13773 37133 12533 -4024 364 28783 10806 717 -34384 -35492 -26307 -24121 -27952 3496 15642
13760 15642 5964 8567 26646 2131 1049 10971 -1268 11112 17633 -1204 -19969 -2437 -16904
13747 -16904 -7320 -14225 22860 24762 21973 46875 42399 52538 36819 30528 43451 24286 25207
13734 25207 34422 9784 947 6017 -8007 306 7248 7497 -3230 -26376 -49764 -55984 -17218
13721 -17218 -9828 -10790 14959 25839 26263 33192 41718 27526 21447 4929 -9880 21897 33234
13708 33234 -7506 -26813 5724 2923 -6341 -11533 1561 12563 22354 25894 21959 34606 14885
13695 14885 -5890 19309 30780 34930 32084 17565 19323 11139 13184 -15329 -64289 -32873 25282
13682 25282 21447 5383 -5044 4827 -8224 -35029 -21027 17785 26035 24207 19019 20077 28553
$$ packed form
13773C7133k4600j6557M388K8419j7977j0089l5101j108R185K186l831L1448J2146
13760A5642r678K603J8079k4515j082R922j2239J2380O521j8837j8765J7532j4467
13747a6904R584o905L7085J902k789K4902m476J0139j5719o291J2923j9165R21
13734B5207R215k4638q837N070j4024Q313O942K49j0727k3146k3388o220L8766
13721a7218P390r62K5749J0880M24O929Q526j4192o079j6518j4809L1777J1337
13708C3234m0740j9307L2537k801r264n192J3094J1002R791L540l935J2647j9721
13695A4885k0775K5199J1471M150k846j4519J758q184K045k8513m8960L1416N8155
13682B5282l835j6064j0427R871j3051k6805J4002L8812Q250j828n188J058Q476
$$ plain form
13669 28553 71566 98240 73219 60915 15435 -8972 -7908 -20735 -4103 4874 -2173 -19016
13657 -19016 -25151 -8191 28962 31102 37948 26733 30781 8727 32549 22259 18554 44936 53607
13644 53607 25585 41249 41529 54487 90753 91320 99305 99567 70401 38610 -13831 -3435 27101
13631 27101 32090 72533 90034 68062 37769 17778 -1770 11651 49657 44559 30008 36014
13619 36014 45466 55193 27785 185 17915 48822 40600 17812 5602 9971 3974 -14202 17877
13606 17877 36513 45853 49243 36135 28897 34019 17943 -2010 736 9623 5759 -4596 -4590 9616
13592 9616 33282 43816 42133 48630 65268 55319 44319 20641 26480 37970 55257 51851 49974
13579 49974 56140 37703 46101 53087 54426 49527 34608 27471 27805 32176 30859 34486 17801 -4114
$$ packed form
13669B8553M3013K6674k5021j2304m5480k4407J064j2827J6632Q977p047j6843
13657a9016o135J6960L7153K140O846j1215M048k2054K3822j0290l705K6382Q671
13644E3607k8022J5664K80J2958L6266N67P985K62k9166l1791n2441J0396L0536
13631B7101M989M0443J7501k1972l0293j9991j9548J3421L8006n098j4551O006
13619C6014R452R727k7408k7600J7730L0907q222k2788j2210M369n997j8176L2079
13606A7877J8636R340L390j3108p238N122j6076j9953K746Q887l864j0355OJ4206
13592I616K3666J0534j683O497J6638r949j1000k3678N839J1490J7287l406j877
13579D9974O166j8437Q398O986J339m899j4919p137L34M371j317L627j6685k1915
$$ plain form
13565 -4114 -6609 44088 47522 16662 24990 28602 12916 5433 -2102 2246 -2170 14226 37564
13552 37564 45985 23871 7277 42621 59786 70197 72768 59208 54417 39928 44319 9322
13540 9322 -5773 -7938 2471 32540 45191 47179 67787 79208 52791 39748 45601 45918 49749
13527 49749 45083 57518 67843 41858 1158 11778 8681 14613 38325 41929 63905 82397
13515 82397 86310 64359 82212 64919 75291 82035 81234 88416 80387 84775 62856 49729 64037
13502 64037 57019 41601 54403 44152 26114 41214 49733 24424 28965 36662 41401 22932 -23103
13489 -23103 7837 3249 14504 16245 8802 14917 33883 66091 50530 47588 53115 76301 88353
13476 88353 81724 83094 66497 72495 59387 59889 42344 19499 20641 26957 33653 58718 44206
$$ packed form
13565d114k495N0697L434l0860Q328L612j5686p483p535M348m416J6396K3338
13552C7564Q421k2114j6594L5344J7165J0411K571j3560m791j4489M391l4997
13540I322j5095k165J0409L0069J2651J988K0608J1421k6417j3043N853L17L831
13527D9749m666J2435J0325k5985m0700J0620l097N932K3712L604K1976J8492
13515H2397L913k1951J7853j7293J0372O744q01P182q029M388k1919j3127J4308
13502F4037p018j5418J2802j0251j8038J5100Q519k5309M541P697M739j8469m6035
13489b3103L0940m588J1255J741p443O115J8966L2208j5561k942N527K3186J2052
13476H8353o629J370j6597N998j3108N02j7545k2845J142O316O696K5065j4512
$$ plain form
13463 44206 51733 49524 40815 11877 10592 4517 12062 18162 1071 -4552 -8520 6131 4697 -10078
13449 -10078 13861 43094 29117 55320 94952 101576 78797 67619 43139 32911 59745 74851
13437 74851 71099 55521 45551 30492 21099 40694 61238 25621 18188 44634 52576 85277 94347
13424 94347 87458 71620 53028 80701 107287 83406 63580 71144 68666 84592 77348 73388 32799
13411 32799 13693 19606 -550 27673 44290 46420 17777 10693 11276 26498 46954 64657 69505
13398 69505 71987 80866 61420 70149 61489 52194 32472 28509 38021 43943 38769 41210 43811 12656
13384 12656 -9386 515 9644 49801 57603 16118 -3842 -16532 4752 32242 34696 11418
13372 11418 14562 35285 56539 18922 7734 11306 -3239 -25499 -31301 20410 45800 60956
$$ packed form
13463D4206P527k209q709k8938j285o075P545O100j7091n623l968J4651j434j4775
13449a0078K3939K9233j3977K6203L9632O624k2779j1178k4480j0228K6834J5106
13437G4851l752j5578r970j5059r393J9595K0544l5617p433K6446P942L2701R070
13424I4347o889j5838j8592K7673K6586k3881j9826P564k478J5926p244l960m0589
13411C2799j9106N913k0156K8223J6617K130k8643p084N83J5222K0456J7703M848
13398F9505K482Q879j9446Q729q660r295j9722l963R512N922n174K441K601l1155
13384A2656k2042R901R129M0157P802m1485j9960j2690K1284K7490K454k3278
13372A1418L144K0723K1254l7617j1188L572j4545k2260n802N1711K5390J5156
$$ plain form
13360 60956 88130 90491 71518 84969 79002 54175 31517 46888 69681 43412 39172 44682
13348 44682 62468 80907 87461 61752 21853 -6786 19655 34079 45364 94973 106877 113348
13336 113348 103168 90252 85728 74263 54056 45156 39110 58687 56225 44514 55532 58232
13324 58232 48293 48794 62368 74268 80288 74629 69248 53115 43014 51088 46347 59622 58606
13311 58606 71380 76246 91841 68453 26498 33037 41277 50488 71392 90193 118753 119215 126375
13298 126375 132803 128007 107601 88511 79658 63467 58978 39007 54307 77147 94787 97038
13286 97038 111273 136806 158151 137023 88673 46383 30103 24171 64944 67886 64824 61219
13274 61219 70046 72080 69266 73496 81738 95415 67528 42517 46160 50615 30340 47827 16432
$$ packed form
13360F0956K7174K361j8973J3451n967k4827k2658J5371K2793k6269m240N510
13348D4682J7786J8439O554k5709l9899k8639K6441J4424J1285M9609J1904O471
13336A13348j0180j2916m524j1465k0207q900o046J9577k462j1711J1018K700
13324E8232r939N01J3574J1900O020n659n381j6133j0101Q074m741J3275j016
13311E8606J2774M866J5595k3388m1955O539Q240R211K0904J8801K8560M62P160
13298A26375O428m796k0406j9090q853j6191m489j9971J5300K2840J7640K251
13286I7038J4235K5533K1345k1128m8350m2290j6280n932M0773K942l062l605
13274F1219Q827K034k814M230Q242J3677k7887k5011L643M455k0275J7487l1395
$$ plain form
13261 16432 -1687 17474 29125 28581 63396 54707 31577 42261 77746 68732 92630 102280 84401
13248 84401 85910 80690 79153 70587 66703 87333 131199 137397 124818 116490 110702 65047 18339
13235 18339 33877 57150 87870 77192 59722 54961 73970 67194 92443 106244 101974 112758
13223 112758 91248 64996 59169 36931 37635 50707 58854 98070 114395 90308 58021 39160
13211 39160 35717 45801 51492 45432 53971 64091 64316 79336 99540 112933 112528 77238 27621
13198 27621 25636 57923 69507 54478 52881 52280 59895 57512 55201 69993 92488 62304 33512
13185 33512 28123 51321 53910 54693 32917 29549 46325 59594 38309 23165 33267 37035 23928
13172 23928 18872 22335 31654 31423 28586 90359 137166 150940 168178 134339 115412 87291 107453
$$ packed form
13261A6432j8119J9161J1651n44L4815q689k3130J0684L5485r014K3898R650j7879
13248H4401J509n220j537q566l884K0630M3866O198j2579q328n788m5655m6708
13235A8339J5538K3273L0720j0678j7470m761J9009o776K5249J3801m270J0784
13223A12758k1510k6252n827k2238P04J3072Q147L9216J6325k4087l2287j8861
13211C9160l443J0084N691o060Q539J0120K25J5020K0204J3393m05l5290m9617
13198B7621j985L2287J1584j5029j597o01P615k383k311J4792K2495l0184k8792
13185C3512n389K3198K589P83k1776l368J6776J3269k1285j5144J0102L768j3107
13172B3928n056L463R319k31k837O1773M6807J3774J7238l3839j8927k8121K0162
$$ plain form
13159 107453 127191 131320 118259 88318 72562 84745 97279 68028 69590 82006 99055 65666
13147 65666 46804 71109 81740 63120 81504 77202 102955 138710 127602 109712 79125 73994
13135 73994 81075 81576 91327 85004 70254 86051 109497 113312 74525 37699 29157 9363 12713
13122 12713 47946 71336 85220 114033 109696 90184 81114 86243 89972 95004 95190 110980 102132
13109 102132 74291 65865 57455 38452 69721 96418 96562 85472 98623 104213 67441 105504
13097 105504 128462 112482 85624 103597 138737 145806 147965 151925 131806 111472 90615 68088
13085 68088 72535 87419 99582 104179 82266 76608 68664 69296 85300 106118 152989 176818 193235
13072 193235 258898 353099 427063 453331 426842 342018 260431 199162 149163 140148 127798 123457
$$ packed form
13159A07453J9738M129j3061k9941j5756J2183J2534k9251J562J2416J7049l3389
13147F5666j8862K4305J0631j8620J8384m302K5753L5755j1108j7890l0587n131
13135G3994P081N01R751o323j4750J5797K3446L815l8787l6826q542j9794L350
13122A2713L5233K3390J3884K8813m337j9512r070N129L729N032J86J5790q848
13109A02132k7841q426q410j9003L1269K6697J44j1090J3151N590l6772L8063
13097A05504K2958j5980k6858J7973L5140P069K159L960k0119k0334k0857k2527
13085F8088M447J4884J2163M597k1913n658p944O32J6004K0818M6871K3829J6417
13072A93235O5663R4201P3964K6268k6489q4824q1587o1269m9999r015j2350m341
$$ plain form
13060 123457 127835 123733 153236 158017 133707 153805 171566 166510 141894 121673 143932 126249
13048 126249 105030 88098 79717 57729 89377 129513 131792 97516 78714 100085 114339 129694
13036 129694 108199 121620 120823 141070 165163 190412 254361 285894 371029 510585 679549
13025 679549 872983 958974 941206 795948 572740 419110 324760 274373 218456 200743 197667
13014 197667 162414 157644 159338 164754 171409 153359 127123 104179 87198 93583 131034 125629 108464
13001 108464 116084 124602 148329 162350 151535 136184 127458 131736 149547 153842 146636 143652 154160
12988 154160 173607 196278 177055 207719 269966 372072 519991 713231 934133 1054379
12978 1054379 982830 762020 544424 391375 296150 273762 223402 183770 173411 175600 152212
$$ packed form
13060A23457M378m102K9503M781k4310K0098J7761n056k4616k0221K2259j7683
13048A26249k1219j6932q381k1988L1648M0136K279l4276j8802K1371J4254J5355
13036A29694k1495J3421p97K0247K4093K5249O3949L1533Q5135J39556J68964
13025F79549J93434Q5991j7768j45258k23208j53630r4350n0387n5917j7713l076
13014A97667l5253m770J694N416O655j8050k6236k2944j6981O385L7451n405j7165
13001A08464P620Q518K3727J4021j0815j5351q726M278J7811M295p206k984J0508
12988A54160J9447K2671j9223L0664O2247J02106J47919J93240K20902J20246
12978A054379p1549k20810k17596j53049r5225k2388n0360l9632j0359K189k3388
$$ plain form
12967 152212 146361 119900 102044 118231 121840 141117 136919 118768 112562 129394 140741 145151
12955 145151 127855 91469 86343 124216 144733 154465 142858 150074 154668 126403 143232 153470
12943 153470 154943 207839 203204 187561 205643 226745 258882 340663 413632 447185 414908 380159
12931 380159 307425 205146 153291 167355 147415 139720 162573 191352 193803 197218 187123 170531
12919 170531 173991 161079 138572 157485 156350 122978 100710 96565 110727 115562 110409 93005
12907 93005 89507 102382 121761 162280 168845 168398 165028 148043 118222 108953 116350 113322 96713
12894 96713 109381 99926 83012 104643 108544 144182 154829 160753 159621 142026 144852 128930 120978
12881 120978 143842 136610 131689 117817 105848 113259 121999 144345 118140 110069 107777 118224 133234
$$ packed form
12967A52212n851k6461j7856J6187L609J9277m198j8151o206J6832J1347M410
12955A45151j7296l6386n126L7873K0517R732j1607P216M594k8265J6829J0238
12943A53470J473N2896m635j5643J8082K1102L2137Q1781P2969L3553l2277l4749
12931C80159p2734j02279n1855J4064j9940p695K2853K8779K451L415j0095j6592
12919A70531L460j2912k2507J8913j135l3372k2268m145J4162M835n153j7404
12907I3005l498J2875J9379M0519O565m47l370j6985k9821r269P397l028j6609
12894I6713J2668r455j6914K1631L901L5638J0647N924j132j7595K826j5922p952
12881A20978K2864p232m921j3872j1969P411Q740K2346k6205q071k292J0447J5010
$$ plain form
12868 133234 122982 120180 118863 108051 119095 136224 137343 154778 158596 147720 154705 166205
12856 166205 176919 186415 189057 172867 174400 166043 174940 185579 188474 178852 139321 100975 104843
12843 104843 128353 132183 110458 92646 119066 156879 177212 192540 154658 111487 132103 151550
12831 151550 160528 152116 182755 182316 166041 149857 159214 162220 159158 153399 152160 163102 162198 156290
12817 156290 134351 136451 169413 183125 189764 169626 137197 119748 101852 105740 109838 136563
12805 136563 150822 131001 116110 170022 198679 196562 199709 213761 244422 233014 216113 211312
12793 211312 192201 161581 159084 163303 151798 140308 128480 135354 163042 191865 207030 226689
12781 226689 191937 194171 212010 208336 180255 167852 167927 173175 182831 157304 146269 145776 135538
$$ packed form
12868A33234j0252k802j317j0812J1044J7129J119J7435L818j0876O985J1500
12856A66205J0714R496K642j6190J533q357Q897J0639K895r622l9531l8346L868
12843A04843K3510L830k1725j7812K6420L7813K0333J5328l7882m3171K0616J9447
12831A51550Q978q412L0639m39j6275j6184R357L006l062n759j239J0942r04n908
12817A56290k1939K100L2962J3712O639k0138l2429j7449j7896L888M098K6725
12805A36563J4259j9821j4891N3912K8657k117L147J4052L0661j1408j6901m801
12793B11312j9111l0620k497M219j1505j1490j1828O874K7688K8823J5165J9659
12781B26689l4752K234J7839l674k8081j2403P5N248R656k5527j1035m93j0238
$$ plain form
12768 135538 158646 163425 155234 174975 177705 163555 145768 155648 172985 212552 225576 228399
12756 228399 211803 184847 192403 217613 216473 221126 203130 209900 224350 238544 221599 209861
12744 209861 198877 191933 205806 223929 222204 243753 232823 201517 193507 187918 193979 172305
12732 172305 147178 163498 187129 199044 179713 167865 184749 227592 224303 238248 219069 175702
12720 175702 159774 167874 166373 170025 176597 197807 196759 193387 185881 213208 189775 171137 185655
12707 185655 204288 220633 222699 192432 208688 224541 224106 221876 217115 179996 194668 191855 181607
12694 181607 204579 221649 220484 222076 194529 188270 186606 206259 262569 286831 279552 257405
12682 257405 234999 236645 249945 247389 214345 206402 213468 213445 224752 229264 230498 238022 253044
$$ packed form
12768A35538K3108M779q191J9741K730j4150j7787R880J7337L9567J3024K823
12756B28399j6596k6956P556K5210j140M653j7996O770J4450J4194j6945j1738
12744B09861j0984o944J3873J8123j725K1549j0930l1306q010n589O061k1674
12732A72305k5127J6320K3631J1915j9331j1848J6884M2843l289J3945j9179m3367
12720A75702j5928Q100j501L652O572K1210j048l372p506K7327k3433j8638J4518
12707A85655J8633J6345K066l0267J6256J5853m35k230m761l7119J4672k813j0248
12694A81607K2972J7070j165J592k7547o259j664J9653N6310K4262p279k2147
12682B57405k2406J646J3300k556l3044p943P066k3J1307M512J234P524J5022
$$ plain form
12669 253044 240534 196226 157091 177289 216521 233842 231215 221502 223930 243743 233620 210795
12657 210795 227140 262875 279339 244551 193803 196051 201150 230956 208200 183437 198551 237972
12645 237972 232971 204075 211074 218987 220928 242104 227596 232945 245187 249286 259963 237232 207380
12632 207380 203566 196917 224052 212021 216119 233049 219535 224886 249339 256715 238257 217955
12620 217955 228228 233075 227969 246960 239756 235048 237937 217511 240012 254458 246393 241957 246674
12607 246674 243790 247476 240431 233547 222671 250933 266191 242717 241222 274300 270816 261568 263977
12594 263977 262246 261731 260569 239872 229482 242639 251961 257070 213516 221633 224459 234476 263817
12581 263817 254010 258068 271146 284328 291682 301094 289729 303677 309384 272945 268582 288810 297223
$$ packed form
12669B53044j2510m4308l9135K0198L9232J7321k627r713K428J9813j0123k2825
12657B10795J6345L5735J6464l4788n0748K248N099K9806k2756k4763J5114L9421
12645B37972n001k8896O999P913J941K1176j4508N349J2242M099J0677k2731k9852
12632B07380l814o649K7135j2031M098J6930j3514N351K4453P376j8458k0302
12620B17955J0273M847n106J8991p204m708K889k0426K2501J4446q065m436M717
12607B46674k884L686p045o884j0876K8262J5258k3474j495L3078l484r248K409
12594B63977j731n15j162k0697j0390J3157R322N109m3554Q117K826J0017K9341
12581B63817r807M058J3078J3182P354R412j1365J3948N707l6439m363K0228Q413
$$ plain form
12568 297223 272536 271901 276867 257853 259332 260944 276849 281061 286852 296051 293901 324180 341563
12555 341563 347109 352015 327150 301302 281271 289821 272187 257663 248109 266333 298082 321696
12543 321696 339859 335256 332190 340791 331395 307244 278175 279163 296413 288071 308510 321009 304575
12530 304575 334028 361344 397785 408065 391409 360537 336846 332047 320255 337174 337214 321363
12518 321363 314888 312095 277408 282926 279405 279385 278344 294242 306840 310381 300930 295343 316115 367794
12504 367794 373075 368489 374615 355889 347335 332034 344685 344756 339564 335745 353757 374335 357745
12491 357745 341666 343534 338833 349055 361938 369239 354408 365543 374694 350103 360893 364441
12479 364441 377881 390804 375983 392173 381176 354749 357842 362487 374405 329194 338569 373356
$$ packed form
12568B97223k4687o35M966j9014J479J612J5905M212N791R199k150L0279J7383
12555C41563N546M906k4865k5848k0031Q550j7634j4524r554J8224L1749K3614
12543C21696J8163m603l066Q601r396k4151k9069R88J7250q342K0439J2499j6434
12530C04575K9453K7316L6441J0280j6656l0872k3691m799j1792J6919M0j5851
12518C21363o475k793l4687N518l521k0j041J5898J2598L541r451n587K0772N1679
12504C67794N281m586O126j8726q554j5301J2651P1n192l819J8012K0578j6590
12491C57745j6079J868m701J0222J2883P301j4831J1135R151k4591J0790L548
12479C64441J3440J2923j4821J6190j0997k6427L093M645J1918m5211R375L4787
$$ plain form
12467 373356 385268 374161 361786 420653 454326 440991 439979 394474 370832 359489 361689 373277
12455 373277 382705 391327 379401 383535 393129 373282 368347 371901 401272 422083 397091 379609 409938
12442 409938 412379 415789 391351 364871 387689 419430 437587 409366 387854 403990 425207 421664
12430 421664 427776 424744 427913 402440 381531 371846 373444 383348 391394 424124 429909 466508 484296
12417 484296 474194 480873 480026 460727 467762 467724 457053 461208 442327 428404 422935 448512 438516
12404 438516 419217 411435 421881 416775 419264 415927 443993 437107 437277 453410 443385 429206 437396
12391 437396 446224 454200 460472 437597 457005 468810 472184 469302 468304 479122 486614 480325 475696
12378 475696 466266 465487 463439 453505 450436 465923 468793 492270 486111 471996 485208 477048 441333
$$ packed form
12467C73356J1912j1107j2375N8867L3673j3335j012m5505k3642j1343K200J1588
12455C73277R428Q622j1926M134R594j9847m935L554K9371K0811k4992j7482L0329
12442D09938K441L410k4438k6480K2818L1741J8157k8221k1512J6136K1217l543
12430D21664O112l032L169k5473k0909r685J598R904Q046L2730N785L6599J7788
12417D84296j0102O679q47j9299P035l8j0671M155j8881j3923n469K5577r996
12404D38516j9299p782J0446n106K489l337K8066o886J70J6133j0025j4179Q190
12391D37396Q828P976O272k2875J9408J1805L374k882r98J0818P492o289m629
12378D75696r430p79k048r934l069J5487K870K3477o159j4115J3212q160l5715
$$ plain form
12365 441333 450286 460281 490062 501179 484124 462011 473333 508394 530496 525266 506171 493860
12353 493860 493965 453207 484005 501427 496175 492642 486227 475463 473401 458059 464036 477069 487460
12340 487460 487552 477887 495140 519485 522664 494805 480508 499875 510876 502756 504713 500693 486968
12327 486968 480169 478983 489775 508839 514846 513438 494070 497065 505866 506632 540906 546107 542782
12314 542782 555036 562026 547575 536851 529530 528998 532440 552442 567126 581193 575356 576630 578101
12301 578101 555555 580541 612110 626356 624937 617960 611038 612284 611907 593161 576397 597646 618455
12288 618455 644636 629786 589594 577785 592206 638372 654861 661985 672142 682856 679327 688027
12276 688027 715803 746941 782209 820504 800918 746062 673171 640715 622538 635232 655936
$$ packed form
12365D41333Q953R995K9781J1117j7055k2113J1322L5061K2102n230j9095j2311
12353D93860J05m0758L0798J7422n252l533o415j0764k062j5342N977J3033J0391
12340D87460R2r665J7253K4345L179k7859j4297J9367J1001q120J957m020j3725
12327D86968o799j186J0792J9064O007j408j9368K995Q801P66L4274N201l325
12314E42782J2254O990j4451j0724p321n32L442K0002J4684J4067n837J274J471
12301E78101k2546K4986L1569J4246j419o977o922J246l77j8746j6764K1249K0809
12288F18455K6181j4850m0192j1809J4421M6166J6489P124J0157J0714l529Q700
12276F88027K7776L1138L5268L8295j9586n4856p2891l2456j8177J2694K0704
$$ plain form
12265 655936 651262 630532 631581 593362 602031 657728 682181 690508 666894 637021 658293 658559 657765
12252 657765 678819 662716 634705 651441 674165 680774 694541 715517 725459 710452 673429 647778
12240 647778 621521 637723 668990 700794 708409 690244 689784 694256 701031 703351 692900 702122 693135
12227 693135 685019 663775 656750 669385 682551 668810 672787 686007 685912 692871 694932 675064 659857
12214 659857 689802 706178 707563 697788 717985 704590 709614 749829 753141 743122 726330 725935 747191
12201 747191 765217 756591 767168 767370 757741 751779 744890 762454 751356 729062 754202 800328 800434
12188 800434 780390 774255 754009 753268 751649 766101 767758 762431 768942 791005 774602 785956 799604
12175 799604 793287 783592 746491 760612 752196 765180 772719 757664 755195 752509 736534 754099 778952
$$ packed form
12265F55936m674k0730J049l8219Q669N5697K4453Q327k3614k9873K1272K66p94
12252F57765K1054j6103k8011J6736K2724O609J3767K0976R942j5007l7023k5651
12240F47778k6257J6202L1267L1804P615j8165m60M472O775K320j0451R222q987
12227F93135q116k1244p025J2635J3166j3741L977J3220r5O959K061j9868j5207
12214F59857K9945J6376J385r775K0197j3395N024M0215L312j0019j6792l95K1256
12201G47191J8026q626J0577K02r629n962o889J7564j1098k2294K5140M6126J06
12188H00434k0044o135k0246p41j619J4452J657n327O511K2063j6403J1354J3648
12175G99604o317r695l7101J4121q416J2984P539j5055k469k686j5975J7565K4853
$$ plain form
12162 778952 756494 733973 748242 780805 791067 793760 777570 762844 774671 766200 781825 794601
12150 794601 790512 795864 802190 811052 803553 826001 858819 869484 870191 874735 904140 923533 931344
12137 931344 896206 877816 872123 852978 874969 868612 871514 856055 851540 851561 838973 858618 860230
12124 860230 861201 863580 849065 864043 870851 865425 880621 866803 855913 861366 860208 851049 852264
12111 852264 861783 880457 875045 876095 897540 900070 891532 906480 940878 951545 960222 970229 972560
12098 972560 991410 1026541 1080559 1158106 1240118 1223795 1149971 1083808 1033378 996396 964342
12087 964342 941603 944009 946573 932289 930013 950920 930571 923114 911823 929841 953099 953971 972125
12074 972125 965769 956076 966290 960157 939067 949244 952851 922157 894647 907118 891666 917037
$$ packed form
12162G78952k2458k2521J4269L2563J0262K693j6190j4726J1827q471J5625J2776
12150G94601m089N352O326Q862p499K2448L2818J0665P07M544K9405J9393P811
12137I31344l5138j8390n693j9145K1991o357K902j5459m515K1j2588J9645J612
12124H60230R71K379j4515J4978O808n426J5196j3818j0890N453j158r159J215
12111H52264R519J8674n412J050K1445K530q538J4948L4398J0667Q677J0007K331
12098I72560J8850L5131N4018P7547Q2012j6323p3824o6163n0430l6982l2054
12087I64342k2739K406K564j4284k276K0907k0349p457j1291J8018K3258Q72J8154
12074I72125o356r693J0214o133k1090J0177L607l0694k7510J2471j5452K5371
$$ plain form
12062 917037 939215 957163 948614 931708 934338 942619 957962 982681 1025215 1044296 1089055 1149154
12050 1149154 1223621 1280231 1252117 1182294 1127279 1050441 1012934 1001287 990139 982702 989258 998778
12038 998778 999372 993294 1010139 1013302 1021872 1016733 993510 951413 940905 967456 980848 999700 1002253
12025 1002253 984433 1012141 1029231 1024582 999302 986694 977561 994223 1020742 1062353 1044508 1033713
12013 1033713 1044706 1004408 993056 989933 980626 1028516 1086777 1142955 1149197 1120221 1082268 1060283
12001 1060283 1053619 1031474 1015554 1038557 1043557 1064597 1094514 1137209 1158559 1172529 1160960 1128172
11989 1128172 1069021 1019077 1013280 1015971 1018764 1015815 973377 959480 972011 989237 1008583 1027823
11977 1027823 1026890 1003088 994013 972289 950246 945151 986674 1031458 1017480 993045 994177 995910
$$ packed form
12062I17037K2178J7948q549j6906K630Q281J5343K4719M2534J9081M4759O0099
12050A149154P4467N6610k8114o9823n5015p6838l7507j1647j1148p437O556R520
12038I98778N94o078J6845L163Q570n139k3223m2097j0508K6551J3392J8852K553
12025A002253j7820K7708J7090m649k5280j2608r133J6662K6519M1611j7845j0795
12013A033713J0993m0298j1352l123r307M7890N8261N6178O242k8976l7953k1985
12001A060283o664k2145j5920K3003N000K1040K9917M2695K1350J3970j1569l2788
11989A128172n9151m9944n797K691K793k949m2438j3897J2531J7226J9346J9240
11977A027823r33k3802r075k1724k2043n095M1523M4784j3978k4435J132J733
$$ plain form
11965 995910 1022680 1049200 1018221 998651 1018039 1055985 1063888 1029694 1019974 1021177 1030428 1037168
11953 1037168 1007414 989386 991927 1005084 1015577 989921 960852 965128 965112 971334 976298 985147 988387
11940 988387 1013041 1042750 1051584 1057030 1028639 999487 1004662 1042161 1046885 1046598 1041004 1020497 1002275
11927 1002275 1008268 1013290 1017317 1017111 959187 966547 990455 993526 1015706 1017420 1020173 1027441 1038095
11914 1038095 1039740 1027229 975856 929824 894199 903581 922444 935373 951065 980160 1001565 1020013
11902 1020013 1028705 1025283 1042369 1030533 1012398 988039 971653 948565 950505 979583 977023 974943
11890 974943 958478 941116 954323 967640 977101 953916 967965 959717 959249 967583 975208 974544 957293
11877 957293 966881 992940 999876 1006557 967331 941309 924275 918436 936195 923016 930806 956095
$$ packed form
11965I95910K6770K6520l0979j9570J9388L7946P903l4194r720J203R251O740
11953A037168k9754j8028K541J3157J0493k5656k9069M276j6O222M964Q849L240
11940I88387K4654K9709Q834N446k8391k9152N175L7499M724k87n594k0507j8222
11927A002275N993N022M027k06n7924P360K3908L071K2180J714K753P268J0654
11914A038095J645j2511n1373m6032l5625R382J8863J2929J5692K9095K1405J8448
11902A020013Q692l422J7086j1836j8135k4359j6386k3088J940K9078k560k080
11890I74943j6465j7362J3207J3317R461k3185J4049q248m68Q334P625o64j7251
11877I57293R588K6059O936O681l9226k6022j7034n839J7759j3179P790K5289
$$ plain form
11865 956095 947339 923468 930300 921790 938464 956287 934336 925228 936972 932376 936365 945447 968337
11852 968337 962112 927628 923803 920471 930191 930896 899784 899867 923187 940153 917554 908376 897698
11839 897698 922553 938809 932830 924839 916457 931419 916780 898895 879775 860983 852285 872302
11827 872302 886074 897639 921860 916687 891640 909291 909574 891933 880125 873518 872722 874421 861499
11814 861499 862231 858687 861898 853423 839285 820115 829754 820654 846702 855307 858509 852350 854155 850166
11800 850166 848939 850220 857405 869921 849563 823503 841502 852495 837439 819173 833445 854450
11788 854450 837820 792010 780221 814326 800536 786932 794491 778984 767771 767166 771529 776260
11776 776260 768003 785757 831927 842824 824428 817204 827104 844934 841602 817225 792449 782931
$$ packed form
11865I56095q756k3871O832q510J6674J7823k1951r108J1744m596L989R082K2890
11852I68337o225l4484l825l332R720P05l1112Q3K3320J6966k2599r178j0678
11839H97698K4855J6256n979p991q382J4962j4639j7885j9120j8792q698K0017
11827H72302J3772J1565K4221n173k5047J7651K83j7641j1808o607p96J699j2922
11814H61499P32l544L211q475j4138j9170R639r100K6048Q605L202o159J805l989
11800H50166j227J281P185J2516k0358k6060J7999J0993j5056j8266J4272K1005
11788H54450j6630m5810j1789L4105j3790j3604P559j5507j1213o05M363M731
11776G76260q257J7754M6170J0897j8396p224R900J7830l332k4377k4776r518
$$ plain form
11764 782931 787205 788137 756185 738678 741186 724936 740298 758799 761975 773110 764517 753961 747393
11751 747393 766910 781286 773948 744835 705571 709657 719276 737530 792320 781800 762106 755481
11739 755481 747386 747000 747762 751191 749648 734857 729423 720356 717989 736810 734469 734974 736642 715104
11725 715104 725093 740385 724672 700027 678305 688092 699650 696859 685344 674442 674336 701202
11713 701202 727604 686057 661812 666296 669257 699829 700768 692092 687431 657021 672712 675285 652069
11700 652069 653976 648929 670796 660326 656267 668828 638471 619246 640747 664160 690142 690852
11688 690852 677865 657795 650431 668532 643980 623259 640698 662144 660718 634983 630985 624521
11676 624521 643021 665588 647721 631056 617069 598219 591635 592942 628064 654016 616642 599192
$$ packed form
11764G82931M274R32l1952j7507K508j6250J5362J8501L176J1135q593j0556o568
11751G47393J9517J4376p338k9113l9264M086R619J8254N4790j0520j9694o625
11739G55481q095l86P62L429j543j4791n434r067k367J8821k341N05J668k1538
11725G15104R989J5292j5713k4645k1722R787J1558k791j1515j0902j06K6866
11713G01202K6402m1547k4245M484K961L0572R39q676m661l0410J5691K573k3216
11700F52069J907n047K1867j0470m059J2561l0357j9225K1501K3413K5982P10
11688F90852j2987k0070p364J8101k4552k0721J7439K1446j426k5735l998o464
11676F24521J8500K2567j7867j6665j3987j8850o584J307L5122K5952l7374j7450
$$ plain form
11664 599192 607195 615780 611079 587423 586209 594539 591620 608257 618846 635448 634946 629892 636507
11651 636507 620057 617522 606382 595179 555243 534927 548763 562937 584649 629387 669114 660982
11639 660982 646931 608557 574926 560746 575978 569390 541196 528658 539278 542462 548382 560963
11627 560963 580597 569714 566372 569223 550390 544794 576460 576768 552525 556618 559265 571891 564469
11614 564469 537918 535484 537267 529352 496361 483925 480253 490435 467169 501983 528536 527280
11602 527280 526522 542452 526492 493730 507953 513835 500798 497307 503047 520888 518711 481112 467124
11589 467124 506976 519373 523776 496679 487669 481987 506985 507452 497613 504806 469114 425027 436529
11576 436529 462999 457349 423865 441226 462487 460588 442789 443940 447367 464995 472343 456697
$$ packed form
11664E99192Q003Q585m701k3656j214Q330k919J6637J0589J6602n02n054O615
11651F36507j6450k535j1140j1203l9936k0316J3836J4174K1712M4738L9727q132
11639F60982j4051l8374l3631j4180J5232o588k8194j2538J0620L184N920J2581
11627E60963J9634j0883l342K851j8833n596L1666L08k4243M093K647J2626p422
11614E64469k6551k434J783p915l2991j2436l672J0182k3266L4814K6553j256
11602E27280p58J5930j5960l2762J4223N882j3037l491N740J7841k177l7599j3988
11589D67124L9852J2397M403k7097r010n682K4998M67r839P193l5692m4087J1502
11576D36529K6470n650l3484J7361K1261j899j7799J151L427J7628P348j5646
$$ plain form
11564 456697 476591 471848 466067 457531 475492 488209 481683 475918 491073 476715 459128 411838
11552 411838 437183 468428 487395 476866 457835 422222 383974 379678 385604 408541 403451 384634
11540 384634 394609 391893 405294 420635 427306 437779 437940 450089 450351 429849 413687 424559 395698
11527 395698 363223 365176 391253 417690 437858 436408 386359 370288 403937 410074 387259 368742
11515 368742 355540 350767 360411 381377 391173 411189 402104 382444 363094 352633 363893 379700
11503 379700 359416 344573 336259 348646 346027 344137 368244 387289 406183 394480 369463 340202
11491 340202 319275 315191 336529 377299 410930 389619 341351 316757 320750 356920 388249 384225
11479 384225 366963 361286 362966 369914 352829 364286 384582 377444 355493 353657 347751 340081 328168
$$ packed form
11564D56697J9894m743n781q536J7961J2717o526n765J5155j4358j7587m7290
11552D11838K5345L1245J8967j0529j9031l5613l8248m296N926K2937n090j8817
11540C84634R975k716J3401J5341O671J0473J61J2149K62k0502j6162J0872k8861
11527C95698l2475J953K6077K6437K0168j450n0049j6071L3649O137k2815j8517
11515C68742j3202m773R644K0966R796K0016r085j9660j9350j0461J1260J5807
11503C79700k0284j4843q314J2387k619j890K4107J9045J8894j1703k5017k9261
11491C40202k0927m084K1338M0770L3631k1311m8268k4594L993L6170L1329m024
11479C84225j7262n677J680O948j7085J1457K0296p138k1951j836n906p670j1913
$$ plain form
11466 328168 299613 278891 291744 303054 288564 302861 311198 307873 294906 311893 339336 331428
11454 331428 302785 294359 285151 277297 275006 265548 261683 277416 304712 314128 325289 305237 295714
11441 295714 312949 301073 309234 336066 346989 349600 326750 296265 277746 272641 267041 260421
11429 260421 269611 261841 243206 240132 300883 356148 315292 281292 295622 275372 297580 309567
11417 309567 302126 305933 326881 326419 305298 266355 260206 289424 288909 275545 261151 231522 233713
11404 233713 260628 272861 262568 251930 264904 271500 257466 260392 276865 276778 246100 234504
11392 234504 231402 250930 253914 263747 284434 297284 294717 270775 258547 280994 267618 273347
11380 273347 263514 256332 279486 256099 237506 250250 239167 224246 219494 234513 236459 226746
$$ packed form
11466C28168k8555k0722J2853J1310j4490J4297Q337l325j2967J6987K7443p908
11454C31428k8643q426r208p854k291r458l865J5733K7296R416J1161k0052r523
11441B95714J7235j1876Q161K6832J0923K611k2850l0485j8519n105n600o620
11429B60421R190p770j8635l074O0751N5265m0856l4000J4330k0250K2208J1987
11417C09567p441L807K0948m62k1121l8943o149K9218n15j3364j4394k9629K191
11404B33713K6915J2233j0293j0638J2974O596j4034K926J6473q7l0678j1596
11392B34504l102J9528K984R833K0687J2850k567k3942j2228K2447j3376N729
11380B73347r833p182K3154k3387j8593J2744j1083j4921m752J5019J946r713
$$ plain form
11368 226746 237578 287436 283495 254428 259182 252209 232875 226525 203901 216989 200281 228935
11356 228935 261694 272546 282427 273659 276793 256929 207116 184217 166933 178237 187693 182544
11344 182544 190233 221983 245410 240082 195677 179613 208804 202825 209781 211434 188182 168984
11332 168984 158903 157432 168802 177435 176098 187894 191625 200377 207614 213518 191529 170454 189490
11319 189490 218263 218358 233833 214489 202780 181948 178749 185765 184908 174953 177364 189451 183702
11306 183702 227585 240148 222393 191219 160333 162428 166023 160973 157177 156117 149443 128340 114602
11293 114602 128728 167343 191298 225910 242731 237238 223608 217590 193865 119424 105995 119036
11281 119036 159667 181718 229029 225417 199038 189675 202538 194352 176992 171728 161826 144659
$$ packed form
11368B26746J0832M9858l941k9067M754o973j9334o350k2624J3088j6708K8654
11356B28935L2759J0852R881q768L134j9864m9813k2899j7284J1304R456n149
11344A82544P689L1750K3427n328m4405j6064K9191n979O956J653k3252j9198
11332A68984j0081j471J1370Q633j337J1796L731Q752P237N904k1989k1075J9036
11319A89490K8773R5J5475j9344j1709k0832l199P016q57r955K411J2087n749
11306A83702M3883J2563j7755l1174l0886K095L595n050l796j060o674k1103j3738
11293A14602J4126L8615K3955L4612J6821n493j3630o018k3725p4441j3429J3041
11281A19036M0631K2051M7311l612k6379r363J2863q186j7360n264r902j7167
$$ plain form
11269 144659 123816 148849 173643 186778 160702 160282 174074 167093 149841 154312 154603 151992 172175
11256 172175 168068 177563 185090 166170 162626 138005 117399 110460 134817 149471 162154 193281
11244 193281 185080 186991 175476 133934 107230 124190 136824 173371 181971 180676 182174 207529
11232 207529 181540 143127 150295 157049 147921 142632 140055 133691 115492 119465 112417 97896 132847
11219 132847 175026 180474 177426 141355 68843 85817 122808 124548 108013 107060 128825 105219
11207 105219 114788 157132 200724 210614 192123 167667 153907 139420 106486 97143 95714 102537
11195 102537 106978 93787 76694 58305 64705 74805 87679 112489 111589 114754 111322 122329 104140
11182 104140 76924 67389 69855 111998 135281 129943 118628 98584 111016 82355 57433 64906
$$ packed form
11269A44659k0843K5033K4794J3135k6076m20J3792o981j7252M471K91k611K0183
11256A72175m107R495P527j8920l544k4621k0606o939K4357J4654J2683L1127
11244A93281q201J911j1515m1542k6704J6960J2634L6547Q600j295J498K5355
11232B07529k5989l8413P168O754r128n289k577o364j8199L973p048j4521L4951
11219A32847M2179N448l048l6071p2512J6974L6991J740j6535r53K1765k3606
11207A05219R569M2344M3592R890j8491k4456j3760j4487l2934r343j429O823
11195A02537M441j3191j7093j8389O400J0100J2874K4810r00L165l432J1007j8189
11182A04140k7216r535K466M2143K3283n338j1315k0044J2432k8661k4922P473
$$ plain form
11170 64906 75138 72226 69634 78470 86969 54429 60539 59455 61043 63730 83045 102612 82046
11157 82046 86530 120070 126352 111528 70865 71893 73325 73596 83290 74805 93849 112093 104652
11144 104652 133866 146113 130281 91882 70602 79401 92277 100670 117657 121416 93883 39739
11132 39739 44290 62815 50016 62920 98979 120978 139704 127101 92778 69374 51665 74054
11120 74054 75329 69464 89558 100458 95379 114727 138156 144691 142840 114210 96771 84577 89579
11107 89579 80596 79321 54878 48768 35270 10131 44595 84589 77778 68977 85581 85440 74849
11094 74849 45366 63585 82275 75988 26278 16703 10778 44870 57259 54274 64450 54979 35374
11081 35374 39241 50646 51135 46816 33389 28511 37310 35409 26410 52656 98897 105333 102270 68946
$$ packed form
11170F4906J0232k912k592Q836Q499l2540O110j084J588K687J9315J9567k0566
11157H2046M484L3540O282j4824m0663J028J432K71R694q485J9044J8244p441
11144A04652K9214J2247j5832l8399k1280Q799J2876Q393J6987L759k7533n4144
11132C9739M551J8525j2799J2904L6059K1999J8726j2603l4323k3404j7709K2389
11120G4054J275n865K0094J0900n079J9348K3429O535j851k8630j7439j2194N002
11107H9579q983j275k4443o110j3498k5139L4464L9994o811q801J6604j41j0591
11094G4849k9483J8219J8690o287m9710r575n925L4092J2389k985J0176r471j9605
11081C5374L867J1405M89m319j3427m878Q799j901q999K6246M6241O436l063l3324
$$ plain form
11067 68946 45976 37496 54658 48379 29270 19549 37066 60106 65732 57178 39352 48060 41536
11054 41536 29515 36651 68540 75874 86599 94754 91387 97530 118100 109846 105112 90613 89455
11041 89455 99983 103082 99614 93485 113321 151116 177539 196982 203711 206967 215829 196011 154602
11028 154602 138962 165741 161606 142626 116286 142925 216450 271924 288836 264275 253798 237166
11016 237166 197305 195418 186448 173675 161409 171949 154794 150922 156934 181447 173169 147575
11004 147575 127772 111820 86560 95047 133321 117602 98477 111476 118885 100361 52218 14941
10992 14941 30599 26664 16893 37977 28449 12647 9670 47278 42498 16372 14580 30778 29504
10979 29504 16926 7327 3240 -267 -22449 5361 14613 19864 3089 -19945 -15491 3932 55534
$$ packed form
11067F8946k2970q480J7162o279j9109r721J7517K3040N626q554j7826Q708o524
11054D1536j2021P136L1889P334J0725Q155l367O143K0570q254m734j4499j158
11041H9455J0528L099l468o129J9836L7795K6423J9443O729L256Q862j9818m1409
11028A54602j5640K6779m135j8980k6340K6639P3525N5474J6912k4561j0477j6632
11016B37166l9861j887q970j2773j2266J0540j7155l872O012K4513q278k5594
11004A47575j9803j5952k5260Q487L8274j5719j9125J2999P409j8524m8143l7277
10992A4941J5658l935r771K1084r528j5802k977L7608m780k6126j792J6198j274
10979B9504j2578r599m087l507k2182K7810R252N251j6775k3034M454J9423N1602
$$ plain form
10966 55534 56455 30346 18531 9747 -6936 -42153 -12203 -27329 -36819 -9409 14535 -4419
10954 -4419 -9560 -3025 15431 -4857 -9682 1703 -16465 -13271 9725 23825 42339 60228 44699
10941 44699 39329 25975 38711 47566 47645 32358 14918 15101 23124 6021 7807 30910 13671
10928 13671 3863 -23583 -2100 -7591 -9285 -3369 -2505 -285 -5621 7297 29547 33899 33434 12945
10914 12945 -24534 -48757 -36345 -49868 -72243 -72509 -58881 -11883 25709 46283 33930 5879
10902 5879 -14912 5729 -3589 -27307 -56181 -65175 -63930 -44127 7249 44868 65380 58669 8453
10889 8453 -17946 2490 8738 18932 30972 3527 -6388 11648 22400 28923 4677 -11652
10877 -11652 -28953 -49178 -35521 -33654 -22674 -27370 -24741 -29818 -52403 -51974 -17466 -32124 -35639
$$ packed form
10966E5534R21k6109j1815q784j6683l5217K9950j5126r490K7410K3944j8954
10954d419n141O535J8456k0288m825J1385j8168L194K2996J4100J8514J7889j5529
10941D4699n370j3354J2736Q855P9j5287j7440J83Q023j7103J786K3103j7239
10928A3671r808k7446K1483n491j694N916Q64K220n336J2918K2250M352m65k0489
10914A2945l7479k4223J2412j3523k2375k66J3628M6998L7592K0574j2353k8051
10902E879k0791K0641r318k3718k8874q994J245J9803N1376L7619K0512o711n0216
10889H453k6399K0436O248J0194J2040k7445r915J8036J0752O523k4246j6329
10877a1652j7301k0225J3657J867J0980m696K629n077k2585M29L4508j4658l515
$$ plain form
10864 -35639 -18997 -25684 -22402 -9554 -13173 -25827 -10824 -3750 -3632 -23422 -56002 -10028 -4654
10851 -4654 -18405 -30194 -20985 -15331 -29718 -54117 -49248 -39634 -46590 -48596 -37803 -19383 -35927
10838 -35927 -43950 -13977 -18201 -5112 -9861 -22046 -27269 -5683 -2378 -5577 -28167 -65998 -82320
10825 -82320 -81322 -66210 -67954 -66680 -47965 -33994 -50411 -74617 -90747 -97529 -100356 -97231 -101947
10812 -101947 -95427 -80382 -33997 -20770 -34876 -43284 -51665 -73891 -75328 -48261 -43033 -30449
10800 -30449 -31118 -39208 -68362 -73139 -54626 -31441 -58266 -80307 -72085 -64401 -93901 -100648 -75342
10787 -75342 -76914 -79660 -71559 -53040 -53142 -35435 -46696 -69106 -76077 -65785 -89616 -134268 -128832
10774 -128832 -117172 -100042 -114020 -118065 -96114 -93543 -92095 -85338 -82953 -107148 -114380 -128945 -125401
$$ packed form
10864c5639J6642o687L282J2848l619j2654J5003P074J18j9790l2580M5974N374
10851d654j3751j1789R209N654j4387k4399M869R614o956k006J0793J8420j6544
10838c5927q023K9973m224J3089m749j2185n223K1586L305l199k2590l7831j6322
10825h2320R98J5112j744J274J8715J3971j6417k4206j6130o782k827L125m716
10812a01947O520J5045M6385J3227j4106q408q381k2226j437K7067N228J2584
10800c0449o69q090k9154m777J8513K3185k6825k2041Q222P684k9500o747K5306
10787g5342j572k746Q101J8519j02J7707j1261k2410o971J0292k3831m4652N436
10774a28832J1660J7130j3978m045K1951K571J448O757K385k4195p232j4565L544
$$ plain form
10761 -125401 -85473 -91413 -95317 -76076 -86891 -85623 -97859 -71322 -78363 -100735 -108164 -133711
10749 -133711 -135461 -131202 -105362 -78794 -74149 -70644 -89038 -88777 -56821 -36027 -10861 7725 35470
10736 35470 26172 30457 38115 51103 26678 16642 -312 -39323 -66557 -62895 -58851 -72356 -94748
10723 -94748 -110037 -108607 -122238 -92044 -99427 -124509 -146677 -165274 -154298 -125942 -105023 -144465
10711 -144465 -174909 -174316 -153485 -178186 -181316 -181790 -175268 -141079 -140922 -179935 -192482 -203349 -196177
10698 -196177 -190553 -169021 -133604 -150729 -160891 -173316 -174101 -175223 -166546 -171693 -141065 -148637 -151953
10685 -151953 -113799 -93251 -72212 -57572 -87632 -108415 -74201 -10888 40354 106230 218502
10674 218502 382115 619281 928512 1350262 1766750 2001124 1996530 1740520 1318262 913025
$$ packed form
10761a25401L9928n940l904J9241j0815J268j2236K6537p041k2372p429k5547
10749a33711j750M259K5840K6568M645L505j8394K61L1956K0794K5166J8586K7745
10736C5470r298M285P658J2988k4425j0036j6954l9011k7234L662M044j3505k2392
10723i4748j5289J430j3631L0194p383k5082k2168j8597J0976K8356K0919l9442
10711a44465l0444N93K0831k4701l130m74O522L4189J57l9013j2547j0867P172
10698a96177N624K1532L5417j7125j0162j2425p85j122Q677n147L0628p572l316
10685a51953L8154K0548K1039J4640l0060k0783L4214O3313N1242O5876J12272
10674B18502J63613K37166L09231M21750M16488K34374m594k56010m22258m05237
$$ plain form
10664 913025 608511 397540 242246 154117 103069 56850 3545 -29696 -40789 -57435 -73429
10653 -73429 -70898 -82404 -85111 -110890 -125620 -101379 -82988 -73904 -105697 -145779 -152341 -165289
10641 -165289 -173870 -168685 -143399 -90726 -49912 -39165 -41537 -48629 -3476 59498 117990 163720
10629 163720 212257 302647 366487 444949 552349 683179 918678 1258536 1694099 2325778
10619 2325778 3233422 4452971 6055202 8097224 10361645 12298262 13283830 13133974 12285203
10610 12285203 11402681 10970933 11214129 12220762 14215242 17337286 21469008 26100553
10602 26100553 29781214 30820853 29045546 25869830 22947920 21152785 20676169 21664925
10594 21664925 24228952 28379644 33870581 39667409 43615683 43455056 39257021 33433934
$$ packed form
10664I13025l04514k10971j55294q8129n1048m6219n3305l3241j1093j6646j5994
10653g3429K531j1506k707k5779j4730K4241J8391R084l1793m0082o562j2948
10641a65289q581N185K5286N2673M0814J0747k372p092M5153O2974N8492M5730
10629A63720M8537R0390O3840P8462J07400J30830K35499L39858M35563O31679
10619B325778R07644J219549J602231K042022K264421J936617R85568j49856q48771
10610A2285203q82522m31748K43196J006633J994480L122044M131722M631545
10602B6100553L680661J039639j775307l175716k921910j795135m76616R88756
10594B1664925K564027M150692N490937N796828L948274j60627m198035n823087
$$ plain form
10586 33433934 28166934 24423012 22342164 21759716 22580063 24675089 27686806 30718543
10578 30718543 32267168 30916978 27082028 22428092 18383181 15523421 13772622 12944450
10570 12944450 12858866 13384881 14251469 14966028 14955404 13814107 11799699 9542368 7501225
10561 7501225 5902786 4708807 3877353 3270034 2803332 2439005 2165822 1916537 1736961
10552 1736961 1590877 1464956 1385122 1315282 1246082 1199665 1137209 1086519 1040449 1000991 995017
10541 995017 1003002 977407 1003111 1049032 1090808 1156277 1222547 1342135 1546963 1864252 2296684
10530 2296684 2984820 4017619 5511315 7443893 9243555 9548589 8776186 8141397 8303884
10521 8303884 9170133 9796413 8786944 6831818 5021239 3745477 2880374 2313668 1931516
$$ packed form
10586C3433934n267000l743922k080848n82448Q20347K095026L011717L031737
10578C0718543J548625j350190l834950m653936m044911k859760j750799q28172
10570A2944450q5584N26015Q66588P14559j0624j141297k014408k257331k041143
10561G501225j598439j193979q31454o07319m66702l64327k73183k49285j79576
10552A736961j46084j25921p9834o9840o9200m6417o2456n0690m6070l9458n974
10541I95017P985k5595K5704M5921M1776O5469O6270J19588K04828L17289M32432
10530B296684O88136J032799J493696J932578J799662L05034p72403o34789J62487
10521H303884Q66249O26280j009469j955126j810579j275762q65103n66706l82152
$$ plain form
10512 1931516 1657715 1459411 1324353 1189488 1063916 961133 891357 854568 825816 773904
10502 773904 674590 626314 601359 571463 535751 534046 526543 503762 459206 432648 406400 391727
10490 391727 412269 371953 322886 267120 240671 234460 250018 278693 294655 283290 295081 291940
10478 291940 305152 301297 309529 269433 240516 231241 225568 215680 204766 191290 181459 161077 147329
10465 147329 157118 185661 193395 191404 156215 152371 142239 120112 122297 145167 166323 164204 142604
10452 142604 128933 129330 112585 108788 96213 76812 53790 36409 55816 87143 97848 113442
10440 113442 126841 134116 142234 127938 125216 115612 100006 83083 59741 26494 26672 21589 18290
10427 18290 33620 92824 141428 181617 206049 242547 263532 267981 257472 231598 226268 184949
$$ packed form
10512A931516k73801j98304j35058j34865j25572j02783o9776l6789k8752n1912
10502G73904r9314m8276k4955k9896l5712j705p503k2781m4556k6558k6248j4673
10490C91727K0542m0316m9067n5766k6449o211J5558K8675J5962j1365J1791l141
10478B91940J3212l855Q232m0096k8917r275n673r888j0914j3476r831k0382j3748
10465A47329R789K8543P734j991l5189l844j0132k2127K185K2870K1156k119k1600
10452A42604j3671L97j6745l797j2575j9401k3022j7381J9407L1327J0705J5594
10440A13442J3399P275Q118j4296k722r604j5606j6923k3342l3247J78n083l299
10427A8290J5330N9204M8604M0189K4432L6498K0985M449j0509k5874n330m1319
$$ plain form
10415 184949 116469 85408 119160 83502 27692 19876 45552 62405 51572 52992 52462 38200
10403 38200 58612 89360 107914 100049 97799 125879 160775 176695 208015 252471 234634 128092
10391 128092 32497 -9001 23814 94639 192536 243824 262434 220290 116152 41376 -22496
10380 -22496 -94222 -153216 -206113 -228840 -223295 -197584 -175694 -169192 -174043 -184160 -168324 -148497
10368 -148497 -165165 -153676 -136851 -130879 -120898 -123184 -152327 -187591 -213264 -230365 -227674 -236016
10356 -236016 -225869 -192590 -193378 -184634 -151091 -126420 -145261 -174943 -194013 -188754 -187343 -180514 -171668
10343 -171668 -170109 -167513 -183928 -186973 -190658 -186640 -177592 -210777 -223346 -235226 -242594 -249583 -224817
10330 -224817 -185334 -182604 -208561 -209607 -207152 -230954 -230627 -223383 -189661 -168038 -155467 -153066 -161052
$$ packed form
10415A84949o8480l1061L3752l5658n5810p816K5676J6853j0833J420n30j4262
10403C8200K0412L0748J8554p865k250K8080L4896J5920L1320M4456j7837j06542
10391A28092r5595m1498L2815P0825R7897N1288J8610m2144j04138p4776o3872
10380b2496p1726n8994n2897k2727N545K5711K1890O502m851j0117J5836J9827
10368a48497j6668J1489J6825N972R981k286k9143l5264k5673j7101K691q342
10356b36016J0147L3279p88Q744L3543K4671j8841k9682j9070N259J411O829Q846
10343a71668J559K596j6415l045l685M018R048l3185j2569j1880p368o989K4766
10330b24817L9483K730k5957j046K455k3802L27P244L3722K1623J2571K401p986
$$ plain form
10317 -161052 -141771 -95660 -71095 -58140 -1879 16573 15539 19609 38436 54762 104402 147778
10305 147778 168431 212689 229088 288527 356374 434402 547284 676319 795449 908022 1002708
10294 1002708 1105572 1210693 1305729 1453039 1660429 1889245 2225156 2651192 3188984 3901094
10284 3901094 4720316 5533546 6175021 6682645 7045978 7414642 8026561 9016318 10401828
10275 10401828 12295081 14861824 18279427 22572593 27971642 35190549 45355750 60649366
10267 60649366 84556598 121896206 178222620 257513314 353428255 424389844 444998565
10260 444998565 422053646 346933024 255172231 178786031 127780627 95450310 74590468
10253 74590468 60627186 50752569 43270894 37259532 32082201 27598107 23876562 20901479
$$ packed form
10317a61052J9281M6111K4565J2955N6261J8452j034M070J8827J6326M9640M3376
10305A47778K0653M4258J6399N9439O7847P8028J12882J29035J19130J12573R4686
10294A002708J02864J05121R5036J47310K07390K28816L35911M26036N37792P12110
10284C901094Q19222Q13230O41475N07624L63333L68664O11919R89757J385510
10275A0401828J893253K566743L417603M293166N399049P218907J0165201J5293616
10267F0649366K3907232L7339608N6326414P9290694R5914941P0961589K0608721
10260D44998565k2944919p5120622r1760793p6386200n1005404l2330317k0859842
10253G4590468j3963282r874617p481675o011362n177331m484094l721545k975083
$$ plain form
10245 20901479 18538381 16672484 15275118 14305256 13627596 13148518 12589950 11847927 10931596
10236 10931596 9827298 8796416 7999284 7370756 6839539 6396857 5990928 5649007 5331841
10227 5331841 5050675 4836245 4631529 4428977 4257704 4133038 4016499 3909794 3807462
10218 3807462 3711178 3606386 3525801 3403201 3287060 3193537 3098854 2989139 2892746 2825812
10208 2825812 2745675 2666908 2619282 2568197 2513432 2471866 2408428 2372162 2303832 2252232 2217146
10197 2217146 2209233 2172795 2127258 2069065 2019861 1951281 1901020 1881560 1840042 1824406 1809476
10186 1809476 1775843 1767060 1748004 1717607 1711964 1686838 1625301 1622404 1632226 1629917 1590400 1528826
10174 1528826 1485920 1441020 1425098 1418285 1394252 1388733 1441408 1464191 1486476 1507729 1501281 1473167
$$ packed form
10245B0901479k363098j865897j397366r69862o77660m79078n58568p42023r16331
10236A0931596j104298j030882p97132o28528n31217m42682m05929l41921l17166
10227E331841k81166k14430k04716k02552j71273j24666j16539j06705j02332
10218C807462r6284j04792q0585j22600j16141r3523r4683j09715r6393o6934
10208B825812q0137p8767m7626n1085n4765m1566o3438l6266o8330n1600l5086
10197B217146p913l6438m5537n8193m9204o8580n0261j9460m1518j5636j4930
10186A809476l3633q783j9056l0397n643k5126o1537k897R822k309l9517o1574
10174A528826m2906m4900j5922o813k4033n519N2675K2783K2285K1253o448k8114
$$ plain form
10162 1473167 1451723 1445025 1428449 1390463 1394590 1400306 1401399 1417603 1426436 1439544 1430596 1386182
10150 1386182 1355059 1347115 1326919 1306028 1279059 1301728 1339946 1378316 1367307 1367673 1408086 1407749
10138 1407749 1362618 1302723 1267789 1278561 1307912 1357634 1307575 1231657 1121977 1022915 963708
10127 963708 909336 846417 831314 821670 828846 824397 824344 795102 762843 766852 771414 725814 697558
10114 697558 698735 719851 747336 785430 818968 840453 804382 792288 778915 787906 782045 777209
10102 777209 797082 798397 756140 731899 708714 657751 646236 663464 676337 673553 628082 627662
10090 627662 661547 653537 643256 644842 636271 641935 614983 604893 587362 552990 590474 609381
10078 609381 606951 635579 653859 661928 665324 642015 637344 626545 633860 609195 606820 626065 609418
$$ packed form
10162A473167k1444o698j6576l7986M127N716J093J6204Q833J3108q948m4414
10150A386182l1123p944k0196k0891k6969K2669L8218L8370j1009L66M0413l37
10138A407749m5131n9895l4934J0772K9351M9722n0059p5918j09680r9062n9207
10127I63708n4372o2919j5103r644P176m449n3k9242l2259M009M562m5600k8256
10114F97558J177K1116K7485L8094L3538K1485l6071j2094j3373Q991n861m836
10102G77209J9873J315m2257k4241k3185n0963j1515J7228J2873k784m5471m20
10090F27662L3885q010j0281J586q571N664k6952j0090j7531l4372L7484J8907
10078F09381k430K8628J8280Q069L396k3309m671j0799P315k4665k375J9245j6647
$$ plain form
10065 609418 613365 600054 586613 563814 576422 598127 609096 627163 632684 658312 650202 639676
10053 639676 614881 589525 581907 595055 558831 522266 506458 500389 476166 484231 507388 500913
10041 500913 488708 521124 545165 534546 513991 539856 559804 541225 530498 540099 534351 525722
10029 525722 528958 518869 512441 514881 517685 515818 504159 465147 431068 434548 435320 444768 460040
10016 460040 465588 458471 470957 459030 456517 482403 503934 495396 474431 469750 446490 433819
10004 433819 447097 435686 430110 402116 420265 431782 424452 421804 423248 425525 420371 413543 423188
9991 423188 433301 429499 415929 429324 452163 455128 430113 450534 450416 440161 437763 436425 427182
9978 427182 438659 459006 452569 415055 383938 375144 394544 414380 409345 407982 389536 400752
$$ packed form
10065F09418L947j3311j3441k2799J2608K1705J0969J8067N521K5628q110j0526
10053F39676k4795k5356p618J3148l6224l6565j5808o069k4223Q065K3157o475
10041E00913j2205L2416K4041j0619k0555K5865J9948j8579j0727R601n748q629
10029E25722L236j0089o428K440K804j867j1659l9012l4079L480P72R448J5272
10016D60040N548p117J2486j1927k513K5886K1531q538k0965m681k3260j2671
10004D33819J3278j1411n576k7994J8149J1517p330k648J444K277n154o828R645
9991D23188J0113l802j3570J3395K2839K965k5015K0421j18j0255k398j338r243
9978D27182J1477K0347o437l7514l1117q794J9400J9836n035j363j8446J1216
$$ plain form
9966 400752 377624 389894 384961 360779 365294 345187 324262 332532 353103 338942 359353 382827
9954 382827 402369 424868 401555 395850 406887 416453 423783 420159 422654 419352 368624 349408 364384
9941 364384 356476 339976 319481 302650 332346 348819 374274 385030 384181 389054 398816 400953 429903
9928 429903 500755 554281 499398 421733 388686 409703 400212 364814 359576 345465 334212 322214
9916 322214 334804 347422 361896 359191 335831 324677 335521 334134 302494 310268 334925 287703
9904 287703 301997 338169 370082 395856 398532 358909 342499 337737 332668 321728 289517 322277
9892 322277 337179 330615 318960 286681 267350 271211 242039 238899 226746 215901 246552 298544
9880 298544 304621 313911 322823 320708 313296 296211 302501 312332 291363 285855 293657 318715 338503
$$ packed form
9966D00752k3128J2270m933k4182M515k0107k0925Q270K0571j4161K0411K3474
9954C82827J9542K2499k3313n705J1037R566P330l624K495l302n0728j9216J4976
9941C64384p908j6500k0495j6831K9696J6473K5455J0756q49M873R762K137K8950
9928D29903P0852N3526n4883p7665l3047K1017r491l5398n238j4111j1253j1998
9916C22214J2590J2618J4474k705k3360j1154J0844j387l1640P774K4657m7222
9904B87703J4294L6172L1913K5774K676l9623j6410m762n069j0940l2211L2760
9892C22277J4902o564j1655l2279j9331L861k9172l140j2153j0845L0651N1992
9880B98544O077R290Q912k115p412j7085O290R831k0969n508P802K5058J9788
$$ plain form
9867 338503 342536 352381 368053 374397 385196 389879 365919 370670 385317 411998 443737 516618 585022
9854 585022 676554 827992 1088104 1468203 1925676 2323933 2488230 2466752 2182390 1743378
9844 1743378 1316474 1020314 819549 688520 604852 523368 470919 415781 396541 408174 391222
9833 391222 374635 339842 355453 318834 285674 267851 285957 309849 287061 283686 290477 258581
9821 258581 227995 217749 232872 248648 286442 297807 288898 290537 294755 280191 261351 259053
9809 259053 256509 265453 287054 303704 304555 264294 236834 221167 245138 248043 275991 293771 275154
9796 275154 294611 330453 326316 325169 277733 242634 242478 242457 228783 246527 263021 282750 323749
9783 323749 345307 363410 433410 529357 683463 949793 1398994 2129501 3160252 4151501
$$ packed form
9867C38503M033R845J5672O344J0799M683k3960M751J4647K6681L1739P2881O8404
9854E85022R1532J51438K60112L80099M57473L98257J64297k1478k84362m39012
9844A743378m26904k96160k00765j31029q3668q1484n2449n5138j9240J1633j6952
9833C91222j6587l4793J5611l6619l3160j7823J8106K3892k2788l375O791l1896
9821B58581l0586j0246J5123J5776L7794J1365q909J639M218j4564j8840k298
9809B59053k544Q944K1601J6650Q51m0261k7460j5667K3971K905K7948J7780j8617
9796B75154J9457L5842m137j147m7436l5099j56k1j3674J7744J6494J9729M0999
9783C23749K1558J8103P0000R5947J54106K66330M49201P30507J030751R91249
$$ plain form
9773 4151501 4379792 3616899 2508613 1629366 1112732 856738 691896 569013 485934 444019
9763 444019 418900 376469 336764 322883 323513 330916 344631 327976 303269 312555 289700 315786
9751 315786 316641 307130 309441 290323 273084 278289 273488 279071 277465 273950 263430 246462 237536 218148
9737 218148 211271 236792 261095 250034 238840 243030 264128 255440 287723 291975 268298 293970
9725 293970 295712 269632 257410 254065 249238 240551 204238 183497 179938 201750 219525 219163 217170
9712 217170 210082 249597 259445 243006 253596 276516 264186 210994 216653 203849 177780 214747
9700 214747 249046 259403 236865 210478 204484 195575 181808 187490 218093 215131 187970 175214
9688 175214 174807 201288 229565 227466 222464 203817 217768 285310 270911 247216 235522 208696
$$ packed form
9773D151501K28291p62893j108286q79247n16634k55994j64842j22883q3079m1915
9763D44019k5119m2431l9705j3881O30P403J3715j6655k4707R286k2855K6086
9751C15786Q55r511K311j9118j7239N205m801N583j606l515j0520j6968q926j9388
9737B18148o877K5521K4303j1061j1194M190K1098q688L2283M252k3677K5672
9725B93970J742k6080j2222l345m827q687l6313k0741l559K1812J7775l62j993
9712B17170p088L9515R848j6439J0590K2920j2330n3192N659j2804k6069L6967
9700B14747L4299J0357k2538k6387n994q909j3767N682L0603k962k7161j2756
9688A75214m07K6481K8277k099n002j8647J3951O7542j4399k3695j1694k6826
$$ plain form
9676 208696 232971 265361 246288 237921 238590 226287 237920 247918 231489 236118 231297 209580 213400
9663 213400 223147 197378 166961 167884 198094 224833 222060 241567 296331 385981 516337 696447
9651 696447 959432 1388881 2065037 2587390 2248660 1577347 999161 674483 492380 362844
9641 362844 316529 320138 295016 273603 259149 246683 250899 282817 302503 273144 262826 239147
9629 239147 220548 243973 251807 222979 185826 162040 158475 153469 135584 170707 205090 210393
9617 210393 220844 220799 201363 189398 184252 187394 171945 173562 160806 172566 195379 193267 155062
9604 155062 150261 159134 174110 167238 182139 191663 191869 186417 165093 146880 126770 137527 155740
9591 155740 182035 165119 167084 189002 184760 176723 165384 139082 123207 128308 144521 174705
$$ packed form
9676B08696K4275L2390j9073q367O69j2303J1633R998j6429M629m821k1717L820
9663B13400R747k5769l0417R23L0210K6739k773J9507N4764Q9650J30356J80110
9651F96447K62985M29449O76156N22353l38730o71313n78186l24678j82103j29536
9641C62844m6315L609k5122k1413j4454j2466M216L1918J9686k9359j0318k3679
9629B39147j8599K3425P834k8828l7153k3786l565n006j7885L5123L4383N303
9617B10393J0451m5j9436j1965n146L142j5449J617j2756J1760K2813k112l8205
9604A55062m801Q873J4976o872J4901R524K06n452k1324j8213k0110J0757J8213
9591A55740K6295j6916J965K1918m242q037j1339k6302j5875N101J6213L0184
$$ plain form
9579 174705 205697 180237 169920 178983 190065 189229 168094 165082 162038 160553 150742 180781 188019
9566 188019 214981 228674 189474 168935 170990 161650 137722 138270 151704 174393 164372 154393 177696
9553 177696 160592 140570 128887 129680 140825 163914 157842 168524 181887 172951 147994 138100 155791
9540 155791 135992 119717 130856 115806 99034 99770 119027 155702 179768 195389 206896 196941
9528 196941 194352 194732 189036 166811 155178 158345 141569 117986 138374 159354 135160 129455 130970
9515 130970 118874 112732 120369 155847 163301 167197 142814 141662 153761 149586 130091 132052 111204
9502 111204 123424 141319 134174 150271 168169 172578 149201 160056 159061 166597 175368 174667 151133
9489 151133 145761 163155 187897 194387 197660 167789 147999 128902 147816 184881 178057 150268
$$ packed form
9579A74705L0992k5460j0317R063J1082q36k1135l012l044j485r811L0039P238
9566A88019K6962J3693l9200k0539K055r340k3928N48J3434K2689j0021r979K3303
9553A77696j7104k0022j1683P93J1145K3089o072J0682J3363q936k4957r894J7691
9540A55791j9799j6275J1139j5050j6772P36J9257L6675K4066J5621J1507r955
9528A96941k589L80n696k2225j1633L167j6776k3583K0388K0980k4194n705J515
9515A30970j2096o142P637L5478P454L896k4383j152J2099m175j9495J961k0848
9502A11204J2220J7895p145J6097J7898M409k3377J0855r95P536Q771p01k3534
9489A51133n372J7394K4742O490L273k9871j9790j9097J8914L7065o824k7789
$$ plain form
9477 150268 127488 145338 154832 148086 175460 169849 118577 106701 100465 113422 151279 177359
9465 177359 147498 108082 109443 136961 168299 183256 176052 149102 121337 136719 136051 168296
9453 168296 170041 161000 142444 129557 138365 134972 115722 109051 126963 112399 98117 109729 114787
9440 114787 131816 130917 116315 106235 127127 157986 149412 151982 163541 155538 128367 120685 128763
9427 128763 147862 146487 152233 154733 150657 133658 124899 118049 87409 66211 89094 111817 114622
9414 114622 114085 120701 119609 91532 93830 87797 81397 124132 164434 164097 184695 167531 145899
9401 145899 141615 125018 94500 81527 109139 115328 148722 165590 173790 178320 183435 170505 143047
9388 143047 131525 155306 159513 133829 132283 116401 106482 101542 107952 86923 94497 109292 138746
$$ packed form
9477A50268k2780J7850R494o746K7374n611n1272j1876o236J2957L7857K6080
9465A77359k9861l9416J361K7518L1338J4957p204k6950k7765J5382o68L2245
9453A68296J745r041j8556j2887Q808l393j9250o671J7912j4564j4282J1612N058
9440A14787J7029q99j4602j0080K0892L0859q574K570J1559q003k7171p682Q078
9427A28763J9099j375N746K500m076j6999q759o850l0640k1198K2883K2723K805
9414A14622n37O616j092k8077K298o033o400M2735M0302l37K0598j7164k1632
9401A45899m284j6597l0518j2973K7612O189L3394J6868Q200M530N115j2930k7458
9388A43047j1522K3781M207k5684j546j5882r919m940O410k1029P574J4795K9454
$$ plain form
9375 138746 119796 95125 90491 74680 68648 96380 124550 146195 149173 111645 87702 90802
9363 90802 110466 104960 107217 145054 160284 176371 173192 118798 62709 99038 129458 132818 116782
9350 116782 110518 144904 132739 130194 106763 86990 121315 145112 139864 117482 106944 143217
9338 143217 120295 118615 136998 114594 84094 89012 96949 93695 112938 135449 167175 148760
9326 148760 105190 124989 142804 163985 156872 147584 125509 117604 140033 120635 111815 132317
9314 132317 149466 129804 149762 154846 140081 154665 159022 129218 127956 122601 138109 136302 128202
9301 128202 134593 147817 137781 114266 91532 126013 134295 106200 93221 72227 94208 139808
9289 139808 134519 112559 85996 80099 92427 110216 98967 92541 91663 98871 102849 77348 84592
$$ packed form
9375A38746j8950k4671m634j5811o032K7732K8170K1645K978l7528k3943L100
9363I0802J9664n506K257L7837J5230J6087l179n4394n6089L6329L0420L360j6036
9350A16782o264L4386j2165k545k3431j9773L4325K3797n248k2382j0538L6273
9338A43217k2922j680J8383k2404l0500M918P937l254J9243K2511L1726j8415
9326A48760m3570J9799J7815K1181p113r288k2075p905K2429j9398q820K0502
9314A32317J7149j9662J9958N084j4765J4584M357k9804j262n355J5508j807q100
9301A28202O391J3224j0036k3515k2734L4481Q282k8095j2979k0994K1981M5600
9289A39808n289k1960k6563n897J2328J7789j1249o426q78P208L978k5501P244
$$ plain form
9276 84592 118332 155828 144525 124090 131814 150246 156914 150520 142235 142514 112893 92903 72692
9263 72692 77369 87582 108377 110359 129086 146625 137375 108907 97307 83790 115492 105414
9251 105414 96722 93704 74876 83170 102848 110847 113796 145274 159058 142533 109948 83845 96993
9238 96993 93649 79950 89357 114354 105654 73245 93495 108681 115673 117684 87107 107885 127512
9225 127512 99741 78205 58463 62286 69836 74249 81493 81187 72236 81639 97460 97493 88278 78942
9211 78942 78090 67309 63177 123896 146526 110588 117646 121400 108042 99032 83231 105018 97734
9198 97734 75282 71808 65889 74991 88026 82503 54719 54217 57128 61454 57205 80861 123637 99227
9184 99227 105569 125551 126310 107801 116805 122390 121974 99061 98249 81200 80593 116064 114032 111686
$$ packed form
9276H4592L3740L7496j1303k0435P724J8432O668o394q285K79k9621j9990k0211
9263G2692M677J0213K0795J982J8727J7539r250k8468j1600j3517L1702j0078
9251A05414q692l018j8828Q294J9678P999K949L1478J3784j6525l2585k6103J3148
9238I6993l344j3699R407K4997q700l2409K0250J5186O992K011l0577K0778J9627
9225A27512k7771k1536j9742L823P550M413P244l06q951R403J5821L3r215r336
9211G8942q52j0781m132O0719K2630l5938P058L754j3358r010j5801K1787p284
9198I7734k2452l474n919R102J3035n523k7784n02K911M326m249K3656M2776k4410
9184I9227O342J9982P59j8509R004N585m16k2913q12j7049o07L5471k032k346
$$ plain form
9170 111686 100818 74081 92972 134620 140277 107329 85142 88107 100678 126176 142301 119998
9158 119998 71650 71304 87159 82425 85393 134844 146239 132075 131191 121134 119974 134752 146082
9145 146082 110055 97966 104531 105502 108113 99395 62855 37263 52617 76157 107621 94291 78308
9132 78308 111876 118303 93292 82585 75559 77772 103793 117037 103884 70695 76334 86708 91761
9119 91761 89422 90290 119925 122740 123461 103278 86326 92911 109284 129281 130696 132621 135589 131844
9105 131844 109315 89880 80839 79749 91724 91890 84870 48778 59081 80422 102199 85450 103307
9092 103307 128274 138451 120879 105819 105309 83490 82369 78810 69097 65154 69930 78641 101574
9079 101574 132733 126474 95920 75861 77160 64894 47780 64351 95540 90504 89372 108183
$$ packed form
9170A11686j0868k6737J8891M1648N657l2948k2187K965J2571K5498J6125k2303
9158A19998m8348l46J5855m734K968M9451J1395j4164q84j0057j160J4778J1330
9145A46082l6027j2089O565R71K611q718l6540k5592J5354K3540L1464j3330j5983
9132G8308L3568O427k5011j0707p026K213K6021J3244j3153l3189N639J0374N053
9119I1761k339Q68K9635K815P21k0183j6952O585J6373J9997J415J925K968l745
9105A31844k2529j9435r041j090J1975J66p020l6092J0303K1341K1777j6749J7857
9092A03307K4967J0177j7572j5060n10k1819j121l559r713l943M776Q711K2933
9079A01574L1159o259l0554k0059J299j2266j7114J6571L1189n036j132J8811
$$ plain form
9067 108183 117334 92888 97986 99894 98850 101927 118884 113209 109304 110987 130820 129922 118459 141021
9053 141021 119019 116791 123727 102024 47406 20333 58950 110614 114274 68830 75465 74858 76503
9040 76503 53363 54333 67461 78137 89940 100456 93371 60345 49618 79223 102155 112261
9028 112261 82518 41319 47982 73861 62273 72209 86877 118018 104002 83213 93304 93095
9016 93095 102192 106330 102408 122353 110909 80560 65621 56569 83486 110373 109284 83729 51700
9003 51700 62466 76596 87580 88324 106860 131415 130865 134875 131209 120879 148972 145166 129113
8990 129113 103104 73633 46747 26209 79606 112108 111482 120436 106445 114065 135151 141335 121890
8977 121890 112780 86966 76423 77844 85007 87397 84241 99040 105738 112546 100444 72265 82429
$$ packed form
9067A08183R151k4446N098J908j044L077J6957n675l905J683J9833q98j1463K2562
9053A41021k2002k228O936k1703n4618k7073L8617N1664L660m5444O635o07J645
9040G6503k3140R70J3128J0676J1803J0516p085l3026j0727K9605K2932J0106
9028A12261k9743m1199O663K5879j1588R936J4668L1141j4016k0789J0091k09
9016I3095R097M138l922J9945j1444l0349j4939r052K6917K6887j089k5555l2029
9003E1700J0766J4130J0984P44J8536K4555n50M010l666j0330K8093l806j6053
8990A29113k6009k9471k6886k0538N3397L2502o26Q954j3991P620K1086O184j9445
8977A21890r110k5814j0543J421P163K390l156J4799O698O808j2102k8179J0164
$$ plain form
8964 82429 88352 75964 97412 97659 78665 71572 107970 122434 108963 92892 92747 100783 95174
8951 95174 88549 62105 65378 77808 80928 82956 85693 57125 33116 39001 22473 45846 36916
8938 36916 34080 39764 53358 54892 67567 81444 79175 58660 68227 78678 58785 73151 82607
8925 82607 77622 81351 81223 70414 47690 34979 33003 31153 57059 98864 101115 103226 123169
8912 123169 126476 129369 115158 117525 95019 81979 92606 68054 34217 42211 60465 75753
8900 75753 85968 94965 70098 59370 47268 59246 69258 81898 93333 82499 67651 71301
8888 71301 61209 57517 36102 54415 44024 59776 101587 125866 123416 100867 91857 104054
8876 104054 92588 91768 126289 130276 121196 102329 109706 114573 79953 79224 71287 81671 98012
$$ packed form
8964H2429N923j2388K1448K47j8994p093L6398J4464j3471j6071j45Q036n609
8951I5174o625k6444L273J2430L120K028K737k8568k4009N885j6528K3373q930
8938C6916k836N684J3594J534J2675J3877k269k0515R567J0451j9893J4366R456
8925H2607m985L729j28j0809k2724j2711j976j850K5906M1805K251K111J9943
8912A23169L307K893j4211K367k2506j3040J0627k4552l3837P994J8254J5288
8900G5753J0215Q997k4867j0728j2102J1978J0012J2640J1435j0834j4848L650
8888G1301j0092l692k1415J8313j0391J5752M1811K4279k450k2549r010J2197
8876A04054j1466q20L4521L987r080j8867P377M867l4620p29p937J0384J6341
$$ plain form
8863 98012 97705 101700 119307 99194 90893 111859 100622 101323 95736 104633 107587 87224 54571 40808
8849 40808 25778 18786 -3302 8919 63778 73398 80542 79797 85113 66633 66183 62065 69865 91438
8835 91438 70735 62772 65935 72248 95875 103307 77556 47832 18123 17364 20087 28368 36220 54345
8821 54345 97848 116241 81577 63410 73813 64829 45467 50483 53743 62874 87016 88767 83816
8808 83816 88458 71700 101050 95048 91483 81377 81309 81376 120997 135172 113067 98443 92169 82013
8794 82013 73174 98399 105762 117987 106312 89755 97461 98147 105853 110525 104634 90151 81028 49800
8780 49800 40866 34033 25398 47139 84933 82525 107525 126738 121274 124880 100218 78444 63414
8767 63414 74040 58779 54441 63991 81935 80466 82943 82419 71142 86980 103578 105037 96083
$$ packed form
8863I8012l07L995J7607k0113q301K0966j1237P01n587Q897K954k0363l2653j3763
8849D0808j5030o992k2088J2221N4859R620P144p45N316j8480m50m118P800K1573
8835I1438k0703p963L163O313K3627P432k5751k9724k9709p59K723Q281P852J8125
8821E4345M3503J8393l4664j8167J0403q984j9362N016L260R131K4142J751m951
8808H3816M642j6758K9350o002l565j0106o8O7L9621J4175k2105j4624o274j0156
8794H2013q839K5225P363J2225j1675j6557P706O86P706M672n891j4483r123l1228
8780D9800q934o833q635K1741L7794k408K5000J9213n464L606k4662k1774j5030
8767F3414J0626j5261m338R550J7944j469K477n24j1277J5838J6598J459q954
$$ plain form
8754 96083 91118 64446 77531 138054 157520 137040 116443 68278 59715 80721 107794 115829
8742 115829 110579 100049 103010 77062 48866 70305 88523 76707 67355 77444 112182 115282
8730 115282 108601 93314 76193 74580 69128 104244 115908 74907 51989 62158 74031 87884
8718 87884 90588 111542 122380 126927 98766 66454 24029 -7645 24438 61964 80256 79754 65010
8705 65010 64357 83472 92058 72189 76121 84891 81461 73237 79402 101400 96180 105801 108061 91208
8691 91208 92051 89347 108340 108151 104868 90390 91927 75592 63154 94055 77488 65331 56223
8678 56223 57327 106105 116292 127316 139781 129339 151882 162164 121498 101662 61171 39430
8666 39430 32954 69494 91048 98583 111173 127453 127604 137307 124063 122879 110060 98977 81940
$$ packed form
8754I6083m965k6672J3085O0523J9466k0480k0597m8165q563K1006K7073Q035
8742A15829n250j0530K961k5948k8196K1439J8218j1816r352J0089L4738L100
8730A15282o681j5287j7121j613n452L5116J1664m1001k2918J0169J1873J3853
8718H7884K704K0954J0838M547k8161l2312m2425l1674L2083L7526J8292n02j4744
8705F5010o53J9115Q586j9869L932Q770l430q224O165K1998n220R621K260j6853
8691I1208Q43k704J8993j89l283j4478J537j6335j2438L0901j6567j2157r108
8678E6223J104M8778J0187J1024J2465j0442K2543J0282m0666j9836m0491k1741
8666C9430o476L6540K1554P535J2590J6280J51R703j3244j184j2819j1083j7037
$$ plain form
8653 81940 102394 122067 101178 102821 92862 64315 54542 75812 120820 115820 136750 121257 108125
8640 108125 113146 80936 36438 15336 9215 36780 80308 86562 72085 50279 45370 79288
8628 79288 127904 131594 95484 52101 36065 54693 72162 100430 83681 89594 85899 71266
8616 71266 58398 80673 57809 45137 58094 82185 34199 24281 60617 81310 86007 71223
8604 71223 66214 69718 76518 62334 42418 54172 63300 36025 -1479 4084 14311 55646 76919
8591 76919 68011 54040 76300 62844 63238 57136 39447 25745 15399 5879 16201 36999 67616
8578 67616 53597 70055 95062 62009 52761 77532 61431 70612 104824 97649 57133 61554 51924
8565 51924 74483 54680 24533 10855 27938 58967 73632 58247 55172 57421 69061 85350
$$ packed form
8653H1940K0454J9673k0889J643r959k8547r773K1270M5008n000K0930j5493j3132
8640A08125N021l2210m4498k1102o121K7565M3528O254j4477k1806m909L3918
8628G9288M8616L690l6110m3383j6036J8628J7469K8268j6749N913l695j4633
8616G1266j2868K2275k2864j2672J2957K4091m7986r918L6336K0693M697j4784
8604G1223n009L504O800j4184j9916J1754R128k7275l7504N563J0227M1335K1273
8591G6919q908j3971K2260j3456L94o102j7689j3702j0346r520J0322K0798L0617
8578F7616j4019J6458K5007l3053r248K4771j6101R181L4212p175m0516M421r630
8565E1924K2559j9803l0147j3678J7083L1029J4665j5385l075K249J1640J6289
$$ plain form
8553 85350 63384 56037 57953 44088 64919 49966 21597 25167 16199 34377 47628 11820 36880
8540 36880 44014 54294 96616 114862 93118 81218 77342 102536 154736 215752 359008 575861
8528 575861 874108 1143152 1074778 803334 532251 345052 267311 198948 164296 148971 154176
8517 154176 126737 113465 96439 79930 81478 79435 93212 94367 102138 98820 100962 103935 95184
8504 95184 99106 78006 80353 83726 60189 77911 90904 111269 106226 107748 102904 88705 105533
8491 105533 128813 171976 176086 179378 262411 418997 654110 1045809 1674537 2312003 2208718
8480 2208718 1589541 975024 612758 408324 275292 230142 189814 149606 165093 156961 151101
8469 151101 152616 160196 174458 155648 130871 110290 78173 79673 91228 85077 83373 89779 99780
$$ packed form
8553H5350k1966p347J916j3865K0831j4953k8369L570q968J8178J3251l5808K5060
8540C6880P134J0280M2322J8246k1744j1900l876K5194N2200O1016J43256K16853
8528E75861K98247K69044o8374k71444k71083j87199p7741o8363l4652j5325N205
8517A54176k7439j3272j7026j6509J548k043J3777J155P771l318K142K973q751
8504I5184L922k1100K347L373k3537J7722J2993K0365n043J522m844j4199J6828
8491A05533K3280M3163M110L292Q3033J56586K35113L91699O28728O37466j03285
8480B208718o19177o14517l62266k04434j33032m5150m0328m0208J5487q132n860
8469A51101J515P580J4262j8810k4777k0581l2117J500J1555o151j704O406J0001
$$ plain form
8456 99780 93706 84925 112296 72471 58025 50400 40636 62381 67438 65968 60805 84324 138235
8443 138235 155772 178061 250988 360239 582603 877427 1152758 1143763 869773 601340 426823
8432 426823 310239 254791 200389 166579 144318 128006 134293 137762 124935 104743 93941 90452
8420 90452 79704 52901 57625 87693 97074 106948 76351 42656 38599 35277 45555 75876 66764
8407 66764 74315 79041 70664 67418 75228 78730 76982 70582 86790 60081 50565 38001 50411 73035
8393 73035 69452 67549 88881 123114 87090 69193 68556 57622 49635 58594 38243 37604 34297 60804
8379 60804 82092 75750 75001 117232 98664 96035 76668 77205 89967 105907 95111 88071 66715
8366 66715 90772 85245 65952 43080 30880 13353 23421 50290 76857 89398 89417 70801 57319
$$ packed form
8456I9780o074q781K7371l9825j4446p625r764K1745N057j470n163K3519N3911
8443A38235J7537K2289P2927J09251K22364K94824K75331q995k73990k68433j74517
8432D26823j16584n5448n4402l3810k2261j6312O287L469j2827k0192j0802l489
8420I0452j0748k6803M724L0068R381R874l0597l3695m057l322J0278L0321r112
8407F6764P551M726q377l246P810L502j748o400J6208k6709r516j2564J2410K2624
8393G3035l583j903K1332L4233l6024j7897o37j0934p987Q959k0351o39l307K6507
8379F0804K1288o342p49M2231j8568k629j9367N37J2762J5940j0796p040k1356
8366F6715K4057n527j9293k2872j2200j7527J0068K6869K6567J2541J9j8616j3482
$$ plain form
8353 57319 44641 37281 44924 28500 56372 83728 62558 42659 34907 50747 91111 133138
8341 133138 179179 287141 423560 462943 395092 304143 216392 164031 121053 97228 78238
8330 78238 98461 107489 72470 40343 30508 26654 42666 57460 45210 35101 46690 42882 40849
8317 40849 45341 57242 52672 64201 74749 76934 69839 70465 45928 30230 54399 48707 30205
8304 30205 32293 52653 57732 71980 131907 169612 200080 281113 418313 649675 820377 729441
8292 729441 507705 330546 211679 162442 128107 88469 68963 54369 39468 26706 35946
8281 35946 83392 89833 83750 96594 107645 98001 75641 52107 40474 54843 53881 54370 83056
8268 83056 65958 62496 44799 47019 56888 68399 74264 74201 77780 73592 52421 33428 16152 75452
$$ packed form
8353E7319j2678p360P643j6424K7872K7356k1170j9899p752J5840M0364M2027
8341A33138M6041J07962J36419L9383o7851r0949q7751n2361m2978k3825j8990
8330G8238K0223R028l5019l2127r835l854J6012J4794j2250j0109J1589l808k033
8317D0849M492J1901m570J1529J0548K185p095O26k4537j5698K4169n692j8502
8304C0205K088K0360N079J4248N9927L7705L0468Q1033J37200K31362J70702r0936
8292G29441k21736j77159j18867m9237l4335l9638j9506j4594j4901j2762R240
8281C5946M7446O441o083J2844J1051r644k2360k3534j1633J4369r62M89K8686
8268H3056j7098l462j7697K220R869J1511N865o3L579m188k1171j8993j7276N9300
$$ plain form
8254 75452 125555 159545 201969 273327 352927 355337 286715 195567 152822 107101 63687 72868
8242 72868 78784 71535 52918 54215 86391 75306 49765 45841 46916 60798 79532 86426 51898
8229 51898 58462 76100 63628 49249 51711 41228 30248 44279 45166 38780 34400 36950 42773
8216 42773 19186 -6185 26258 53537 29826 30174 25556 27059 35484 35726 39283 60613 61817 88542
8202 88542 98322 80881 86961 122067 91683 49085 52115 40579 17568 35548 44902 55449 62170
8189 62170 36564 36254 20524 33840 31050 23972 52148 73153 100562 102057 83747 59492 53507
8176 53507 50585 38981 69546 59753 72850 75739 99417 107827 99137 116023 129404 103138 51610
8163 51610 48218 41173 12960 -18390 -20411 -14987 -8365 16263 45799 62248 41668 32454 56566
$$ packed form
8254G5452N0103L3990M2424P1358P9600K410o8622r1148m2745m5721m3414R181
8242G2868N916p249j8617J297L2176j1085k5541l924J075J3882J8734O894l4528
8229E1898O564J7638j2472j4379K462j0483j0980J4031Q87o386m380K550N823
8216D2773k3587k5371L2443K7279k3711L48m618J503Q425K42L557K1330J204K6725
8202H8542R780j7441O080L5106l0384m2598L030j1536k3011J7980R354J0547O721
8189F2170k5606l10j5730J3316k790p078K8176K1005K7409J495j8310k4255n985
8176E3507k922j1604L0565r793J3097K889K3678Q410q690J6886J3381k6266n1528
8163E1610l392p045k8213l1350k021N424O622K4628K9536J6449k0580r214K4112
$$ plain form
8150 56566 52881 30757 21751 38455 42840 28367 767 1630 6515 13547 29267 22784 10052
8137 10052 27235 34385 40844 67450 52914 41977 52507 64796 70061 61365 50989 33140 33378
8124 33378 26898 35622 44765 50334 28198 3097 -11842 4282 17744 8088 11004 24511 24501 25040
8110 25040 8156 28296 32471 2600 2352 24604 25423 2577 31703 58749 58715 35427 44622 68048
8096 68048 71770 62674 69311 58997 2593 20228 31958 40185 39852 32946 30523 39258 46336 17934
8082 17934 -17030 -28774 -28131 -32050 -1898 7631 22570 43929 51366 40192 24425 -3863 -23081
8069 -23081 -30200 -14017 9395 1329 32049 64409 69600 25555 2058 36405 54450 62415 83871
8056 83871 88608 97388 98468 80450 66061 56318 56517 66861 52393 33722 15295 1151 32529
$$ packed form
8150E6566l685k2124r006J6704M385j4473k7600Q63M885P032J5720o483j2732
8137A0052J7183P150O459K6606j4536j0937J0530J2289N265q696j0376j7849K38
8124C3378o480Q724R143N569k2136k5101j4939J6124J3462r656K916J3507j0N39
8110B5040j6884K0140M175k9871k48K2252Q19k2846K9126K7046l4k3288R195K3426
8096F8048L722r096O637j0314n6404J7635J1730Q227l33o906k423Q735P078k8402
8082A7934l4964j1744O43l919L0152R529J4939K1359P437j1174j5767k8288j9218
8069b3081p119J6183K3412q066L0720L2360N191m4045k3497L4347J8045P965K1456
8056H3871M737Q780J080j8018j4389r743J99J0344j4468j8671j8427j4144L1378
$$ plain form
8043 32529 35927 4860 27171 24287 40322 81945 90212 72988 70486 43415 47561 47421 36232
8030 36232 31795 35472 13993 10189 8434 7230 -5918 -29493 -16053 18523 48493 61087 65478
8017 65478 40353 26155 41633 25553 14574 25169 69861 79290 74358 79187 68273 78827
8005 78827 68464 52460 59454 52294 42908 22538 4856 29573 46958 24260 20974 42140 49449
7992 49449 85818 76923 39308 -1556 -22523 9841 28445 41663 17475 -7979 2733 -431
7980 -431 -47718 -59314 -14223 4500 20772 12195 -3441 -13589 -2810 25996 -7353 -10390 -220
7967 -220 5520 2313 -9925 17563 35456 55516 48523 42691 39702 34225 12133 -2463 -15337
7954 -15337 2706 13986 16493 15709 -5365 -9063 -12473 -25272 -31420 -13107 -1022 -16089 -7472
$$ packed form
8043C2529L398l1067K2311k884J6035M1623Q267j7224k502k7071M146j40j1189
8030C6232m437L677k1479l804j755j204j3148k3575J3440L4576K9970J2594M391
8017F5478k5125j4198J5478j6080j0979J0595M4692R429m932M829j0914J0554
8005G8827j0363j6004O994p160r386k0370j7682K4717J7385k2698l286K1166P309
7992D9449L6369q895l7615m0864k0967L2364J8604J3218k4188k5454J0712l164
7980d31m7287j1596M5091J8723J6272q577j5636j0148J0779K8806l3349l037J0170
7967b20N740l207j2238K7488J7893K0060o993n832k989n477k2092j4596j2874
7954a5337J8043J1280K507p84k1074l698l410j2799o148J8313J2085j5067Q617
$$ plain form
7941 -7472 3717 24507 42429 26635 635 -33819 -27155 -23157 -2857 35232 21281 31636
7929 31636 32161 38031 64523 73255 77094 53474 45962 35940 11833 12209 -10299 -20690 -7531
7916 -7531 -13117 -17646 -35617 -54006 -54368 -31342 -31246 -18690 27071 12499 4928 10366 6605 -13011
7902 -13011 -11061 31953 66181 81793 102476 105205 82660 62040 62891 86590 69236 -2090 -28886
7889 -28886 -35625 -29283 -19251 -8999 -8430 -17239 17988 9180 -4415 19529 32887 34901 43982
7876 43982 43954 45300 34332 14357 21866 21925 -13716 2261 52134 64155 44712 34359 12805
7863 12805 20893 -1502 -8182 13175 37052 49465 55565 39310 36024 16340 10788 26508 51091
7850 51091 56691 50924 31294 21887 26141 14058 18477 -18539 -25278 -23125 -8103 1650 -7730 -22174
$$ packed form
7941g472J1189K0790J7922j5794k6000l4454O664L998K0300L8089j3951J0355
7929C1636N25N870K6492Q732L839k3620p512j0022k4107L76k2508j0391J3159
7916g531n586m529j7971j8389l62K3026R6J2556M5761j4572p571N438l761j9616
7902a3011J950M3014L4228J5612K0683K729k2545k0620Q51K3699j7354p1326k6796
7889b8886o739O342J0032J0252N69q809L5227q808j3595K3944J3358K014R081
7876D3982k8J346j0968j9975P509N9l5641J5977M9873J2021j9443j0353k1554
7863A2805Q088k2395o680K1357K3877J2413O100j6255l286j9684n552J5720K4583
7850E1091N600n767j9630r407M254j2083M419l7016o739K153J5022R753r380j4444
$$ plain form
7836 -22174 -33445 -12548 2642 12031 10835 34217 43888 5403 -2687 1324 4312 10021 -2700
7823 -2700 -41803 -53262 -19822 18919 3188 23310 42967 57035 52401 34750 44402 41935 19816
7810 19816 8250 32041 55813 48879 27494 20225 38056 50519 35408 3882 -10116 1186
7798 1186 23739 36703 38500 53763 63968 62366 60944 51044 43426 24654 32866 47381 26502
7785 26502 -4109 -8801 14326 18019 -17434 -25738 -10789 -7516 -23113 -51816 -36853 18765 61403
7772 61403 66043 56214 14126 10784 -10290 -7775 -18355 -36330 -3039 4349 -2996 -8709 -38238
7759 -38238 -26049 -41725 -56858 -57105 -23441 -11114 9594 4310 -4091 34125 9735 456 22248
7746 22248 30164 34314 55548 71247 52604 44457 38554 44798 65597 40521 17234 -10704 -22864
$$ packed form
7836b2174j1271K0897J5190R389j196K3382R671l8485q090M011K988N709j2721
7823b700l9103j1459L3440L8741j5731K0122J9657J4068m634j7651R652k467k2119
7810A9816j1566K3791K3772o934k1385p269J7831J2463j5111l1526j3998J1302
7798A186K2553J2964J797J5263J0205j602j422r900p618j8772Q212J4515k0879
7785B6502l0611m692K3127L693l5453q304J4949L273j5597k8703J4963N5618M2638
7772F1403M640r829m2088l342k1074K515j0580j7975L3291P388p345n713k9529
7759c8238J2189j5676j5133k47L3664J2327K0708n284q401L8216k4390r279K1792
7746B2248P916M150K1234J5699j8643q147n903O244K0799k5076k3287k7938j2160
$$ plain form
7733 -22864 5791 9071 -8377 -8410 -21173 -19886 -422 -15784 -26990 -18654 -3498 27087 57601
7720 57601 66097 54338 32423 28590 23126 -1243 16742 -2387 -1405 30905 28045 48276 47830
7707 47830 25321 22224 17129 4596 -38302 -59997 -57721 -37956 -2673 21919 19963 24826 25279
7694 25279 26563 6375 -3528 -2271 16077 19330 29474 16235 -9914 -19702 19009 35246 726
7681 726 -8171 -15343 -21246 -13481 -8291 -3108 9659 6829 -23434 -39522 -48237 -26907 -9333 3680
7667 3680 4006 -27301 -24971 -5287 -11974 -13175 -31104 -12545 13962 32684 6572 -14960 -1439
7654 -1439 33731 38093 24344 25131 20154 23135 34735 53287 44206 17251 7688 -7579 -1614 778
7640 778 2621 -1888 -3326 5543 11303 20540 -885 -25983 -40122 -53335 -29450 -14522 2353
$$ packed form
7733b2864K8655L280j7448l3j2763J287J9464j5362j1206Q336J5156L0585L0514
7720E7601Q496j1759k1915l833n464k4369J7985j9129R82L2310k860K0231m46
7707D7830k2509l097n095j2533m2898k1695K276J9765L5283K4592j956M863M53
7694B5279J284k0188r903J257J8348L253J0144j3239k6149r788L8711J6237l4520
7681G26q897p172n903P765N190N183J2767k830l0263j6088q715K1330J7574J3013
7667C680L26l1307K330J9684o687j201j7929J8559K6507J8722k6112k1532J3521
7654a439L5170M362j3749P87m977K981J1600J8552r081k6955r563j5267N965K392
7640G78J843m509j438Q869N760R237k1425k5098j4139j3213K3885J4928J6875
$$ plain form
7627 2353 4553 39751 46650 13146 21347 7476 -14828 -5626 14842 -7266 8879 41867 28274
7614 28274 27227 23480 5992 -9614 -4852 -3140 -14684 -27464 -40893 -31832 -33656 -34302 -30302 -13880
7600 -13880 24890 43205 13748 -16245 -68324 -53463 -47170 -49819 -22094 -14662 -18492 -11148 3049
7587 3049 14240 18996 31970 54496 41819 42199 47565 54166 53732 48772 21160 7172 -6409 -12389
7573 -12389 -17612 -22427 -34202 -13184 -9297 -4344 -17691 -12972 -17463 -9538 -26572 -34823 1085
7560 1085 1926 3246 -15703 -19338 11225 16113 31067 23437 16085 24516 37353 41668 32799 31660
7546 31660 28650 25150 21688 35826 9214 -23073 -15528 -25455 -35043 814 42239 73778 68945
7533 68945 44910 20434 50419 57423 44444 33724 9148 40232 53339 37161 29883 63433
$$ packed form
7627B353K200L5198O899l3504Q201j3871k2304R202K0468k2108J6145L2988j3593
7614B8274j047l747j7488j5606M762J712j1544j2780j3429R061j824o46M000J6422
7600a3880L8770J8315k9457k9993n2079J4861O293k649K7725P432l830P344J4197
7587C049J1191M756J2974K2526j2677L80N366O601m34m960k7612j3988j3581n980
7573a2389n223m815j1775K1018L887M953j3347M719m491P925j7034q251L5908
7560A085Q41J320j8949l635L0563M888J4954p630p352Q431J2837M315q869j139
7546C1660l010l500l462J4138k6612l2287P545r927r588L5857M1425L1539m833
7533F8945k4035k4476K9985P004j2979j0720k4576L1084J3107j6178p278L3550
$$ plain form
7521 63433 62759 26192 13466 30008 19148 4106 -8215 -7778 10190 -12514 -18752 4142 11445
7508 11445 2194 -4475 -15928 -26721 -48938 -55384 -26760 -1970 -14563 -7453 21118 48287 42352
7495 42352 8233 -28498 -42009 -29815 -36277 -22515 17169 38008 32165 11687 1454 1844 -8023
7482 -8023 10917 48238 13053 -19011 -9086 16432 5604 -11594 5807 15680 -3430 -1813 894
7469 894 -9541 -29493 -25895 -28576 -13571 13884 6922 -2482 -11618 -11764 -23508 -22793 -17581 -482
7455 -482 15583 8497 -1171 19614 23334 46982 63403 64450 33125 6491 -10052 -19040 -20135
7442 -20135 26717 39497 10440 -24770 -24551 -22290 -8439 18639 47551 48510 25925 33464 44394
7429 44394 30688 12731 -26716 -17404 -1201 -131 -19484 -23127 -15651 18792 54567 43035 25474
$$ packed form
7521F3433o74l6567j2726J6542j0860j5042j2321M37J7968k2704o238K2894P303
7508A1445r251o669j1453j0793k2217o446K8624K4790j2593P110K8571K7169n935
7495D2352l4119l6731j3511J2194o462J3762L9684K0839n843k0478j0233L90r867
7482h023J8940L7321l5185l2064R925K5518j0828j7198J7401R873j9110J617K707
7469H94j0435j9952L598k681J5005K7455o962r404r136j46j1744P15N212J7099
7455d82J6065p086r668K0785L720K3648J6421J047l1325k6634j6543q988j095
7442b0135M6852J2780k9057l5210K19K261J3851K7078K8912R59k2585P539J0930
7429D4394j3706j7957l9447R312J6203J070j9353l643P476L4443L5775j1532j7561
$$ plain form
7416 25474 20512 -15974 -47355 -4003 43751 45520 17787 -3606 -9983 -15681 -13433 -36755 -27750
7403 -27750 -29551 -16888 -1964 -8804 -25295 -9240 -6654 2891 -2241 -41201 -62162 -41117 -24497
7390 -24497 4728 41129 25652 -6044 -13480 12097 41868 38389 25031 27176 12937 -10595
7378 -10595 5573 25007 22211 22362 15700 6411 8114 -3955 -13825 1105 17972 21075 33829
7365 33829 38883 9524 -4617 -7028 -9503 -3391 -9872 6363 18618 12085 -9386 -28571 -36607
7352 -36607 -39068 -30490 -19302 -22758 -37452 -31103 -1696 9789 -24837 -66506 -66228 -44501 -15795
7339 -15795 -26406 -31301 -16797 -25049 -43844 -49168 -39586 -46178 -65383 -21391 10898 5243 49937
7326 49937 42644 56783 28433 -9629 -2679 3921 -17080 -6141 16964 6454 2040 -22824 -18004
$$ packed form
7416B5474m962l6486l1381M3352M7754J769k7733k1393o377n698K248k3322R005
7403b7750j801J2663J4924o840j6491J6055K586R545n132l8960k0961K1045J6620
7390b4497K9225L6401j5477l1696p436K5577K9771l479j3358K145j4239k3532
7378a0595J6168J9434k796J51o662r289J703j2069r870J4930J6867L103J2754
7365C3829N054k9359j4141k411k475O112o481J6235J2255o533k1471j9185q036
7352c6607k461Q578J1188l456j4694O349K9407J1485l4626m1669K78K1727K8706
7339a5795j0611m895J4504q252j8795n324R582o592j9205M3992L2289n655M4694
7326D9937p293J4139k8350l8062O950O600k1001J0939K3105j0510m414k4864M820
$$ plain form
7313 -18004 641 19809 35181 19143 26633 30124 41504 45712 25322 3535 22891 30114 18875
7300 18875 23714 -5109 -26986 -10777 -17725 -17175 16335 49675 61196 54394 30323 34563 47284
7287 47284 55421 32385 -8394 -10037 1190 -8675 -21938 -43851 -47974 -12800 -6745 592 14424
7274 14424 1099 -10640 22294 31774 -13777 -8829 9766 -2851 -7818 2955 1620 -4855 -14095
7261 -14095 -28221 5313 18257 -4373 -19106 3307 14254 13063 -5390 -26271 -49574 -59486
7249 -59486 -42247 -5816 10086 5874 -20260 -27068 -16374 -32865 -32255 -12405 -11545 15406 51920
7236 51920 73552 38985 15943 -4614 -25113 -13718 14428 -4047 8646 23400 -1156 -15916
7224 -15916 -11979 -21422 -40075 -59067 -60974 -43983 -7145 8380 -12680 -15227 -23299 5795 2151
$$ packed form
7313a8004J8645J9168J5372j6038P490L491J1380M208k0390k1787J9356P223j1239
7300A8875M839k8823k1877J6209o948N50L3510L3340J1521o802k4071M240J2721
7287D7284Q137k3036m0779j643J1227r865j3263k1913m123L5174O055P337J3832
7274A4424j3325j1739L2934R480m5551M948J8595j2617m967J0773j335o475r240
7261a4095j4126L3534J2944k2630j4733K2413J0947j191j8453k0881k3303r912
7249e9486J7239L6431J5902m212k6134o808J0694j6491O10J9850Q60K6951L6514
7236E1920K1632l4567k3042k0557k0499J1395K8146j8475J2693J4754k4556j4760
7224a5916L937r443j8653j8992j907J6991L6838J5525k1060k547q072K9094l644
$$ plain form
7211 2151 -30953 -24909 -9026 14036 21912 819 4579 18610 3719 -2747 7107 30610 42608
7198 42608 -6806 -46810 -38037 -49444 -40253 -27275 -25387 -4923 21256 20187 -8334 -37338 -45683
7185 -45683 -5553 24712 19962 26016 -1572 -16625 -49776 -31611 -18992 -24433 -15498 8514 1093
7172 1093 -11012 -6563 4785 -5587 -15512 9275 7945 -21865 -17782 -12738 -12684 -13418 14551 58514
7158 58514 76362 42269 5280 -9174 -2194 12805 5835 -9853 -267 -7434 -25642 -14076 -19613
7145 -19613 -29495 -11489 -18267 -39579 -28592 -36200 -18813 -1558 41014 46964 42328 23192 1528
7132 1528 -19293 -47662 -54055 -31604 -33094 -29973 -25912 -12381 16449 24019 2312 -16910 -45165
7119 -45165 -34328 -22245 -6800 24268 44093 52737 49396 30387 14483 -1163 -8385 -9299 8762
$$ packed form
7211B151l3104O044J5883K3062P876k1093L760J4031j4891o466R854K3503J1998
7198D2608m9414m0004Q773j1407R191J2978J888K0464K6179j069k8521k9004q345
7185d5683M0130L0265m750O054k7588j5053l3151J8165J2619n441Q935K4012p421
7172A093j2105M449J1348j0372r925K4787j330k9810M083N044N4p34K7969M3963
7158E8514J7848l4093l6989j4454O980J4999o970j5688R586p167j8208J1566n537
7145a9613r882J8006o778k1312J0987p608J7387J7255M2572N950m636j9136k1664
7132A528k0821k8369o393K2451j490L121M061J3531K8830P570k1707j9222k8255
7119d5165J0837J2083J5445L1068J9825Q644l341j9009j5904j5646p222r14J8061
$$ plain form
7106 8762 17633 14496 32185 -9168 28117 31130 28212 9056 803 10630 15223 26653 32287 14711
7092 14711 6018 -16448 -25854 -34549 -53429 -45436 -37945 -27755 -29313 -27480 -19942 -30511 -63771
7079 -63771 -66255 -53783 -35125 -7748 -2107 -1780 -6377 -31842 -27572 -11892 -36279 -37331 -15477
7066 -15477 -18703 -14214 -4425 -33306 -60627 -47482 -20851 -4968 -11067 -18897 -18719 -25472 -40428
7053 -40428 -42888 -50992 -64676 -26819 3159 -17648 -24230 22177 44608 20812 16333 22486 880
7040 880 1424 6192 -132 18942 25250 38265 52625 42921 -114 -44108 -22565 -25410 -15391 -19390
7026 -19390 -44893 -4221 10593 48976 63762 52666 39104 33437 14952 11759 5167 5657 34117
7013 34117 31797 14307 -24197 -46908 -43165 -9056 32598 49034 60108 19073 -185 -4090
$$ packed form
7106H762Q871l137J7689m1353L7285L013k918j9156q253R827M593J1430N634j7576
7092A4711q693k2466r406q695j8880P993P491J0190j558J833P538j0569l3260
7079f3771k484J2472J8658K7377N641L27m597k5465M270J5680k4387j052K1854
7066a5477l226M489R789k8881k7321J3145K6631J5883o099p830J78o753j4956
7053d0428k460q104j3684L7857K9978k0807o582M6407K2431k3796m479O153k1606
7040H80N44M768o324J9074O308J3015J4360r704m3035m3994K1543k845J0019l999
7026a9390k5503M0672J4814L8383J4786j1096j3562n667j8485l193o592M90K8460
7013C4117k320j7490l8504k2711L743L4109M1654J6436J1074m1035j9258l905
$$ plain form
7001 -4090 -11963 -16145 768 26431 33516 18095 -19081 -48317 -37933 -38690 14212 45027 62849
6988 62849 72530 65978 50436 28507 18484 22987 40467 27975 26718 22155 11523 20973 42028
6975 42028 41549 8109 -12498 20209 54080 23586 14280 63686 74141 74045 70180 68755 61423 12914
6961 12914 -20671 1979 2624 -13158 4080 46066 72251 59580 48003 18089 7182 5747
6949 5747 18496 34666 26048 -7365 -39648 -40867 -35840 -18216 8067 2908 -13319 -20946 -22708
6936 -22708 -25964 -5522 -8270 -23885 -52093 -32850 -19772 -12134 2030 4203 -10690 -16292 -11363
6923 -11363 -13012 -42426 -55287 -36697 9563 17519 -42636 -65510 -72523 -103374 -77704 -37449
6911 -37449 -64844 -75446 -72710 -64368 -63188 -53887 -60349 -71108 -80943 -61288 -31855 -21002 31180
$$ packed form
7001d090p873m182J6913K5663P085j5421l7176k9236J0384p57N2902L0815J7822
6988F2849R681o552j5542k1929j0023M503J7480j2492j257m563j0632R450K1055
6975D2028m79l3440k0607L2707L3871l0494r306M9406J0455r6l865j425p332m8509
6961A2914l3585K2650O45j5782J7238M1986K6185j2671j1577k9914j0907j435
6949E747J2749J6170q618l3413l2283j219N027J7624K6283n159j6227p627j762
6936b2708l256K0442k748j5615k8208J9243J3078P638J4164K173j4893n602M929
6923a1363j649k9414j2861J8590M6260P956o0155k2874p013l0851K5670M0255
6911c7449k7395j0602K736Q342J180R301o462j0759r835J9655K9433J0853N2182
$$ plain form
6898 31180 39927 45564 38835 47261 19162 2020 -26233 -17048 18954 35617 38562 71 -21172
6885 -21172 -16344 -7127 -19186 -50864 -56490 -71548 -86499 -50451 -33126 -6417 21404 48197
6873 48197 50178 -1832 -21731 -8988 -29437 -28232 -40140 -65808 -66916 -20552 -6219 -719 22946
6860 22946 21809 18041 32350 12628 2123 16853 27281 33004 21544 -5842 -39075 -66525
6848 -66525 -61187 -55577 -56516 -39539 -20301 -45283 -44404 -32405 -23285 -65 18115 11636 14116 7278
6834 7278 -444 14160 8773 18174 6191 3149 -7510 -22622 -38544 -24985 -7295 17386 21826
6821 21826 -15943 -28300 -5593 -13183 -39224 -39313 -13990 -15468 5660 -7783 -13802 20386 24276
6808 24276 -6088 -16891 -21385 -11425 -5119 22946 8319 -17175 -17888 -13087 6831 10739 21199
$$ packed form
6898C1180Q747N637o729Q426k8099j7142k8253R185L6002J6663K945l8491k1243
6885b1172M828R217j2059l1678n626j5058j4951L6048J7325K6709K7821K6793
6873D8197J981n2010j9899J2743k0449J205j1908k5668j108M6364J4333N500K3665
6860B2946j137l768J4309j9722j0505J4730J0428N723j1460k7386l3233k7450
6848f6525N338N610r39J6977J9238k4982Q79J1999R120K3220J8180o479K480o838
6834G278p722J4604n387R401j1983l042j0659j5112j5922J3559J7690K4681M440
6821B1826l7769j2357K2707p590k6041q9K5323j478K1128j3443o019L4188L890
6808B4276l0364j0803m494R960O306K8065j4627k5494p13M801J9918L908J0460
$$ plain form
6795 21199 38311 36732 9992 -10463 2617 1531 -7104 -7400 -25309 10581 45606 25703 -5382
6782 -5382 -14167 12389 23676 -21491 -45988 -33630 -21282 2598 43403 29831 18702 -23736
6770 -23736 -44916 -46870 -40047 -24268 -8874 -1305 -13578 -51915 -58427 -46285 -38105 -10026 19863
6757 19863 15363 16124 22433 43051 50016 34051 -2922 -4990 -38298 -17148 14381 10442 5385
6744 5385 13957 -9297 -27238 -35106 -16347 -3016 -9899 -16122 -39982 -36413 -13905 -21669 -32904
6731 -32904 -40763 -9360 1156 -10086 -27272 -11666 5931 -29600 -60152 -42056 -17264 -42296
6719 -42296 -64289 -70928 -35242 -10744 -12385 -24177 -28783 -42785 -5555 30826 39707 41549 60917
6706 60917 28844 -11985 -19515 -27461 -18264 -2944 -7827 -12708 -11845 -619 -53 -28964 -52162 -39250
$$ packed form
6795B1199J7112j579k6740k0455J3080j086q635k96j7909L5890L5025j9903l1085
6782e382q785K6556J1287m5167k4497J2358J2348K3880M0805j3572j1129m2438
6770b3736k1180j954O823J5779J5394P569j2273l8337o512J2142Q180K8079K9889
6757A9863m500P61O309K0618O965j5965l6973k068l3308K1150L1529l939n057
6744E385Q572k3254j7941p868J8759J3331o883o223k3860L569K2508p764j1235
6731c2904p859L1403J0516j1242j7186J5606J7597l5531l0552J8096K4792k5032
6719d2296k1993o639L5686K4498j641j1792m606j4002L7230L6381Q881J842J9368
6706F0917l2073m0829p530p946R197J5320m883m881Q63J1226N66k8911k3198J2912
$$ plain form
6692 -39250 -28523 -21367 -16328 -6548 -6004 22075 36886 18049 -64 -31693 -29078 -16198 -18105
6679 -18105 -4197 -19991 -34700 -31193 -21988 3635 6741 10609 13696 -10381 10638 65790 47250
6666 47250 9733 -27902 -50812 157 3173 -20874 -36678 -40399 -57437 -43930 -19122 -26057
6654 -26057 -28660 3993 22917 37630 25514 52451 62178 46636 1449 -13871 -28918 -19866
6642 -19866 3502 45023 63560 34827 20573 16628 26401 52084 38891 53787 48609 29955
6630 29955 -384 2247 8866 22422 67867 151978 227632 356286 639857 1125173 1820841
6619 1820841 2026238 1552807 989790 586748 376635 287748 241877 200682 151918 124206
6609 124206 103710 84736 84143 61704 53757 25223 11131 10634 23442 51008 60704 69981 63402
$$ packed form
6692c9250J0727P156N039R780N44K8079J4811j8837j8113l1629K615J2880j907
6679a8105J3908j5794j4709L507R205K5623L106L868L087k4077K1019N5152j8540
6666D7250l7517l7635k2910N0969L016k4047j5804l721j7038J3507K4808o935
6654b6057k603L2653J8924J4713j2116K6937R727j5542m5187j5320j5047R052
6642a9866K3368M1521J8537k8733j4254l945R773K5683j3193J4896n178j8654
6630B9955l0339K631O619J3556M5445Q4111P5654J28654K83571M85316O95668
6619A820841K05397m73431n63017m03042k10113q8887m5871m1195m8764k7712
6609A24206k0496j8974n93k2439p947k8534j4092m97J2808K7566R696R277o579
$$ plain form
6596 63402 47129 55546 58610 43673 32988 22304 17824 29059 13979 -31279 -61295 -24556
6584 -24556 11961 25961 25135 30710 45087 16453 -18863 -31156 9309 37637 25518 -3494
6572 -3494 2009 36173 40098 12679 -532 -19412 -14543 6425 13198 12332 -4515 13831 26865
6559 26865 13209 -4954 -21394 -12020 -9716 -21495 -18029 -1605 -8863 -6823 -12727 -9830 17216
6546 17216 37659 48406 40560 22792 28117 13923 7066 -13852 -18918 -18694 -13686 1849 -11720
6533 -11720 -2849 11311 -12211 -6795 -9742 -8138 -26548 -46601 -28995 -12261 1576 -7679 -14732
6520 -14732 16333 4206 -14345 9992 22998 -10182 -14053 -18281 229 16971 15525 4085
6508 4085 -20508 -11657 -41297 -39754 -15470 -22896 -30070 -2384 25952 20709 2071 988 1450 -19785
$$ packed form
6596F3402j6273Q417L064j4937j0685j0684m480J1235j5080m5258l0016L6739
6584b4556L6517J4000q26N575J4377k8634l5316j2293M0465K8328j2119k9012
6572c494N503L4164L925k7419j3211j8880M869K0968O773q66j6847J8346J3034
6559B6865j3656j8163j6440R374K304j1779L466J6424p258K040n904K897K7046
6546A7216K0443J0747p846j7768N325j4194o857k0918n066K24N008J5535j3569
6533a1720Q871J4160k3522N416k947J604j8410k0053J7606J6734J3837r255p053
6520a4732L1065j2127j8551K4337J3006l3180l871m228J8510J6742j446j1440
6508D085k4593Q851k9640J543K4284p426p174K7686K8336n243j8638j083M62k1235
$$ plain form
6494 -19785 -21899 -24540 -44699 -52151 -40575 -39763 -38179 -21747 -1048 9379 34066 40053 20797
6481 20797 -27077 -11975 41960 41504 30412 28690 51019 44826 41385 31092 15596 -6705 -18375
6468 -18375 -11717 -3838 -25850 -33001 -5582 24311 14973 10742 13965 33898 46127 32544 23625
6455 23625 31166 6860 2769 -17712 -34503 7533 61412 56405 31698 11998 7891 -4923 -19294
6442 -19294 -10098 -10535 -18045 -153 786 -4023 518 8186 -8122 -2854 -10824 -4486 2669 -9716
6428 -9716 -12343 -20443 -6794 -18017 -13791 8546 -11156 -14969 1007 -154 11026 22068 5615
6415 5615 13341 32835 44712 34908 29598 20130 24414 4638 -3178 -26017 -24882 -32462 -29612 -25253
6401 -25253 -1806 -1213 -19200 -27264 -16768 -27083 -19524 8524 8061 17312 17423 3737 -888 -7521
$$ packed form
6494a9785k114k641k0159p452J1576Q12J584J6432K0699J0427K4687N987j9256
6481B0797m7874J5102N3935m56j1092j722K2329o193l441j0293j5496k2301j1670
6468a8375O658P879k2012p151K7419K9893r338m231L223J9933J2229j3583q919
6455B3625P541k4306m091k0481j6791M2036N3879n007k4707j9700m107j2814j4371
6442a9294R196m37p510J7892R39m809M541P668j6308N268p970O338P155j2385
6428i716k627q100J3649j1223M226K2337j9702l813J5976j161J1180J1042j6453
6415E615P726J9494J1877r804n310r468M284j9776p816k2839J135p580K850M359
6401b5253K3447N93j7987q064J0496j0315P559K8048m63R251J11j3686m625o633
$$ plain form
6387 -7521 -21445 31580 57973 32435 29240 23444 784 -19413 -24397 -41805 12744 23967 16997
6374 16997 -20499 -25546 -15710 5929 13200 11020 24685 32747 27648 15377 24436 20772 22465 -16576
6360 -16576 -19050 -8321 1426 2412 -16 20018 18456 3499 -7462 11245 8545 4997 -5357
6347 -5357 -21140 -24512 -26774 -23040 -9658 22825 20704 -30144 -36899 -13354 -18688 428 -2234
6334 -2234 4835 43341 51240 31226 6950 33241 -8794 -10917 1425 -44270 -43148 -34816 -16825
6321 -16825 48370 69344 50772 17454 7828 19841 19415 35728 37437 39656 39519 45907 12638
6308 12638 4262 26183 46426 26194 20755 6437 -343 8516 13370 -3334 6112 28443 37055
6295 37055 26895 52067 52693 24747 11459 8735 -12611 -41868 -19655 9769 8918 8358 -11016
$$ packed form
6387g521j3924N3025K6393k5538l195n796k2660k0197m984j7408N4549J1223o970
6374A6997l7496n047R836K1639P271k180J3665Q062n099j2271R059l664J693l9041
6360a6576k474J0729R747R86k428K0034j562j4957j0961J8707k700l548j0354
6347e357j5783l372k262L734J3382L2483k121n0848o755K3545n334J9116k662
6334b234P069L8506P899k0014k4276K6291m2035k123J2342m5695J122Q332J7991
6321a6825O5195K0974j8572l3318r626J2013m26J6313J709K219j37O388l3269
6308A2638q376K1921K0243k0232n439j4318o780Q859M854j6704R446K2331Q612
6295C7055j0160K5172O26k7946j3288k724k1346k9257K2213K9424q51n60j9374
$$ plain form
6282 -11016 -10269 -9060 -20376 -12807 -38012 -57559 -76458 -48480 -4327 39132 34320 15332 -4376
6269 -4376 -18929 -12086 8602 9827 3091 -12541 -18428 -11879 11640 15555 11521 41545 20535
6256 20535 -16917 -42513 -36539 -17659 18816 39387 8553 5025 -21424 -33070 -25887 -10170
6244 -10170 -18620 -40912 -17372 -8519 10069 37124 32087 28153 -7134 -21912 -33911 -40091 -61300
6231 -61300 -55323 -67133 -38752 -8613 25553 18289 -10332 -1912 -35423 -32106 -23730 -19176 -24818
6218 -24818 -20182 1201 -17557 3896 32724 23576 31514 37473 17066 13737 4115 -8812 -4719
6205 -4719 -16301 -10900 10957 23821 10378 -8369 -14854 -17242 -3113 -20600 -22321 -30427 -51580
6192 -51580 -42082 -10782 15339 10417 4196 -3268 1358 -7616 -4092 -21236 -25511 -50002 -48619 -46122
$$ packed form
6282a1016P47J209j1316P569k5205j9547j8899K7978M4153M3459m812j8988j9708
6269d376j4553O843K0688J225o736j5632n887O549K3519L915m034L0024k1010
6256B0535l7452k5596N974J8880L6475K0571l0834l528k6449j1646P183J5717
6244a0170q450k2292K3540Q853J8588K7055n037l934l5287j4778j1999o180k1209
6231f1300N977j1810K8381L0139L4166p264k8621Q420l3511L317Q376M554n642
6218b4818M636K1383j8758K1453K8828r148P938N959k0407l329r622j2927M093
6205d719j1582N401K1857J2864j3443j8747o485k388J4129j7487j721q106k1153
6192e1580R498L1300K6121m922o221p464M626q974L524j7144m275k4491J383K497
$$ plain form
6178 -46122 -23497 -12511 -16198 -7022 7751 17530 27220 69010 33962 3260 -12611 -23789 9612
6165 9612 26431 35330 13887 -23026 -14276 -8997 641 3241 17771 43291 44755 19269 13874
6152 13874 2952 -9288 -1843 -28317 -43040 -44498 -29343 -10170 -18358 7731 -11078 -6875 -10244
6139 -10244 -29518 -31403 -32960 6409 19833 27678 27971 25785 10318 9699 10592 12276 18404 12187
6125 12187 8382 5976 -4410 -26489 -39879 -31963 -27393 -22636 -3042 -2431 11770 44631 13530
6112 13530 -31952 -73028 -60184 -15227 -28903 -43301 -44817 161 15442 -3722 43455 70951
6100 70951 48583 17214 -16989 -12683 24066 21822 -4131 23415 29490 -5026 -292 19278 37142
6087 37142 30271 12412 11917 -16455 -6240 10443 7855 5220 40562 37625 24340 29441 39191
$$ packed form
6178d6122K2625J0986l687R176J4773R779R690M1790l5048l0702j5871j1178L3401
6165I612J6819Q899k1443l6913Q750N279R638K600J4530K5520J464k5486n395
6152A3874j0922j2240P445k6474j4723j458J5155J9173q188K6089j8809M203l369
6139a0244j9274j885j557L9369J3424P845K93k186j5467o19Q93J684O128o217
6125A2187l805k406j0386k2079j3390P916M570M757J9594O11J4201L2861l1101
6112A3530m5482m1076J2844M4957j3676j4398j516M4978J5281j9164M7177K7496
6100G0951k2368l1369l4203M306L6749k244k5953K7546O075l4516M734J9570J7864
6087C7142o871j7859m95k8372J0215J6683k588k635L5342k937j3285N101R750
$$ plain form
6074 39191 26084 -25478 -24513 154 6401 18712 -3351 -16175 -33081 -53543 -38594 -11656
6062 -11656 -7216 3622 -21803 9230 40900 67060 79826 85423 80789 53248 3633 -33332
6050 -33332 -36141 -14388 4880 32533 22114 -28188 -44439 -24375 2320 14049 24587 36799
6038 36799 54703 56031 5300 20552 37926 18391 -8244 -12788 -7755 -14122 -13246 -33372 -31546
6025 -31546 -31180 -45557 -53785 -21396 -15825 -18612 3866 -10572 -10829 2958 -8676 -27525 -49065
6012 -49065 -22148 -17458 1392 -25541 -56479 -63523 -15738 -1663 -6676 -9752 -19272 -20298 -14174
5999 -14174 -6178 -3798 -9611 -32683 -41751 -13979 -27573 -57407 -30542 -16233 -14904 -13944 -33036
5986 -33036 -39483 -30457 -13809 -3780 -15169 -30133 -21222 -22348 -41367 -58543 -53016 -31898 -22262
$$ packed form
6074C9191j3107n1562R65K4667O247J2311k2063j2824j6906k0462J4949K6938
6062a1656M440J0838k5425L1033L1670K6160J2766N597m634k7541m9615l6965
6050c3332k809K1753J9268K7653j0419n0302j6251K0064K6695J1729J0538J2212
6038C6799J7904J328n0731J5252J7374j9535k6635m544N033o367Q76k0126J826
6025c1546L66j4377q228L2389N571k787K2478j4438k57J3787j1634j8849k1540
6012d9065K6917M690J8850k6933l0938p044M7785J4075n013l076r520j026O124
5999a4174P996K380n813k3072r068K7772j3594k9834K6865J4309J329R60j9092
5986c3036o447R026J6648J0029j1389j4964Q911j126j9019j7176N527K1118R636
$$ plain form
5973 -22262 -50507 -44068 -25707 -14230 -17924 -33999 -37531 -12531 -7652 5264 31008 32489 20188
5960 20188 12028 3487 5558 5222 -1104 -10673 1489 -20061 -31817 -29071 -28324 -31693 -22884 -13642
5946 -13642 -22021 -39900 -55265 -47356 -31808 -42507 -38519 -35560 -33061 -10392 -14108 -3047 9081
5933 9081 -1607 -16279 26894 39206 11186 -14206 -30801 -30177 -40150 -21840 -3109 -11694 -28238
5920 -28238 -25851 -61362 -53203 -36404 -52593 -27574 8137 -2407 -24800 -37129 -39848 -22294
5908 -22294 -11167 13217 18989 -13759 7438 14900 12371 11598 46048 38421 27339 15272 41156
5895 41156 51496 32125 15721 9297 -18308 -24858 -43502 -49955 -30768 -46 34102 22349
5883 22349 27374 5735 -32496 -29408 -26555 -40736 -31496 6013 21564 37824 25244 -7973 2561
$$ packed form
5973b2262k8245O439J8361J1477l694j6075l532K5000M879J2916K5744J481j2301
5960B0188q160q541K071l36o326r569J2162k1550j1756K746P47l369Q809R242
5946a3642q379j7879j5365P909J5548j0699L988K959K499K2669l716J1061J2128
5933I081j0688j4672M3173J2312k8020k5392j6595O24r973J8310J8731q585j6544
5920b8238K387l5511Q159J6799j6189K5019L5711j0544k2393j2329k719J7554
5908b2294J1127K4384N772l2748K1197P462k529p73L4450p627j1082j2067K5884
5895D1156J0340j9371j6404o424k7605o550j8644o453J9187L0722L4148j1753
5883B2349N025k1639l8231L088K853j4181R240L7509J5551J6260j2580l3217J0534
$$ plain form
5870 2561 6488 -18406 -16929 3929 -1332 -15093 -6993 6579 -5190 -23751 -45457 -22109 -34238
5857 -34238 -65568 -85753 -41368 -29366 -37968 -17819 -36338 -53694 -43732 -52971 -56588 -87161 -96394
5844 -96394 -54155 -46231 -62510 -61311 -57246 -44785 -43032 -60095 -43646 -36293 -11229 12191 -10992
5831 -10992 -17565 -521 5395 4029 14097 -10146 -18945 -8553 -19864 -9022 -42911 -54280 -26644
5818 -26644 -25106 -3317 -24676 -21431 3835 4230 -5542 -14375 -21377 11164 14936 1351 -30649
5805 -30649 -38502 -37793 -6129 252 -13804 -14007 14436 -9416 -23781 -31962 -10000 -492 -36601
5792 -36601 -33243 -46903 -64108 -36995 22328 40727 24346 25515 12882 -16030 -16510 -26649 -37376
5779 -37376 -45117 -16405 15730 23005 14603 20117 8172 -20120 -54214 -95090 -84899 -53747 -44080
$$ packed form
5870B561L927k4894J477K0858n261j3761Q100J3572j1769j8561k1706K3348j2129
5857c4238l1330k0185M4385J2002q602K0149j8519j7356R962r239l617l0573r233
5844i6394M2239P924j6279J199M065J2461J753j7063J6449P353K5064K3420k3183
5831a0992o573J7044N916j366J0068k4243q799J0392j1311J0842l3889j1369K7636
5818b6644J538K1789k1359L245K5266L95r772q833p002L2541L772j3585l2000
5805c0649p853P09L1664O381j4056k03K8443k3852j4365q181K1962R508l6109
5792c6601L358j3660j7205K7113N9323J8399j6381J169j2633k8912m80j0139j0727
5779c7376p741K8712L2135P275q402N514j1945k8292l4094m0876J0191L1152R667
$$ plain form
5766 -44080 -17852 -21094 -19696 -11291 -17372 1275 12370 -23288 -52904 -48937 -38657 -53915 -70104
5753 -70104 -59972 -3612 7004 7044 10412 -28548 -2258 23430 37531 -4567 -20974 -9646 13089
5740 13089 -1907 -6888 6767 12808 -3365 21176 43106 59415 40299 40109 15637 -10859 -10751
5727 -10751 -4661 10092 11358 5679 26269 25894 -4176 -19709 -32213 -23070 -48116 -65027 -69774
5714 -69774 -44965 -10446 13031 20299 5398 -4512 -1433 -21296 -66192 -88972 -54566 -14579
5702 -14579 1416 16502 32473 25729 50595 34293 10499 -6779 -14878 -16051 -36639 -23928
5690 -23928 -2362 -1540 -22493 -11908 -23120 -20597 3531 20913 4589 25547 16653 -13335 -39806
5677 -39806 -43785 -36429 -6544 20790 19899 -3589 -33557 -25561 -40994 -35349 -39406 -45140 -31057
$$ packed form
5766d4080K6228l242J398Q405o081J8647J1095l5658k9616L967J0280j5258j6189
5753g0104J0132N6360J0616M0L368l8960K6290K5688J4101m2098j6407J1328K2735
5740A3089j4996m981J3655O041j6173K4541K1930J6309j9116j90k4472k6496J08
5727a0751O090J4753J266n679K0590l75l0070j5533j2504R143k5046j6911m747
5714f9774K4809L4519K3477P268j4901r910L079j9863m4896k2780L4406L9987
5702a4579J5995J5086J5971o744K4866j6302k3794j7278q099j173k0588J2711
5690b3928K1566Q22k0953J0585j1212K523K4128J7382j6324K0958q894k9988k6471
5677c9806l979P356K9885K7334q91k3488k9968P996j5433N645m057n734J4083
$$ plain form
5664 -31057 -19716 -12645 -4885 -3884 -16530 9093 27194 17241 6484 38173 36277 40114 23371
5651 23371 -16365 -38983 -47150 -29664 -43163 -46117 -49683 -37598 -35320 -58575 -61161 -57416 -30035
5638 -30035 9176 49883 48495 47597 33210 19901 15565 1379 14983 7200 21259 20303 25487
5625 25487 64738 47166 32865 31321 17267 3798 4296 -17103 -32989 14824 27216 21601 12570
5612 12570 -14654 -34980 -42468 -22392 -7160 1232 3584 -12506 -32245 -28966 -3223 2548 -41775
5599 -41775 -64814 -56328 -47563 -30856 -30647 -48054 -21283 -14790 -37006 -34661 -33149 -2614 26602
5586 26602 22696 -342 -36134 -55598 -16071 -80 -37292 -45354 -36475 -7255 19197 16419 3093
5573 3093 -17992 -12258 3941 39771 63050 48960 18713 5032 12571 24404 18054 15016 19606
$$ packed form
5664c1057J1341P071P760J001j2646K5623J8101r953j0757L1689j896L837j6743
5651B3371l9736k2618q167J7486j3499k954l566J2085K278k3255k586L745K7381
5638c0035L9211M0707j388q98j4387j3309m336j4186J3604p783J4059r56N184
5625B5487L9251j7572j4301j544j4054j3469M98k1399j5886M7813J2392n615r031
5612A2570k7224k0326p488K0076J5232Q392K352j6090j9739L279K5743N771m4323
5599d1775k3039Q486Q765J6707K09j7407K6771O493k2216K345J512L0535K9216
5586B6602l906k3038l5792j9464L9527J5991l7212q062Q879K9220K6452k778j3326
5573C093k1085N734J6199L5830K3279j4090l0247j3681P539J1833o350l038M590
$$ plain form
5560 19606 30871 21570 -9709 -52770 -57593 -22165 -3129 3414 -14612 -40184 -67618 -73579 -70900
5547 -70900 -57753 -46988 -32872 -40157 -19584 4686 -27755 -47576 -77043 -43630 -30219 -42570
5535 -42570 -8040 -10027 -30560 -21751 -10187 11279 29986 41925 64150 43547 -11116 -15835
5523 -15835 5921 7171 26245 13853 3255 7637 -35603 -37545 -7190 20153 9788 -5834
5511 -5834 -22411 2007 24288 23387 44855 30677 -4749 -23581 1974 16172 20073 13156 -7628
5498 -7628 -25775 -39993 -41780 -20586 -5864 9044 2159 -16932 -16280 -722 13549 34260 51918
5485 51918 26426 16682 28844 52409 60533 41731 18623 26772 22091 -4831 -18160 -11533 7086
5472 7086 -18283 -25368 -22041 -53853 -65350 -58545 -35348 -14110 -201 -635 -11736 -25425 -48330
$$ packed form
5560A9606J1265r301l1279m3061m823L5428J9036O543j8026k5572k7434n961K679
5547g0900J3147J0765J4116p285K0573K4270l2441j9821k9467L3413J3411j2351
5535d2570L4530j987k0533Q809J1564K1466J8707J1939K2225k0603n4663m719
5523a5835K1756J250J9074j2392j0598M382m3240j942L0355K7343j0365j5622
5511e834j6577K4418K2281r01K1468j4178l5426j8832K5555J4198L901o917k0784
5498g628j8147j4218j787K1194J4722J4908o885j9091O52J5558J4271K0711J7658
5485E1918k5492r744J2162K3565Q124j8802k3108Q149m681k6922j3329O627J8619
5472G086k5369p085L327l1812j1497O805K3197K1238J3909m34j1101j3689k2905
$$ plain form
5459 -48330 -40870 6480 5473 -13225 1256 18993 -3873 10910 -13247 -8657 22701 19256 12010
5446 12010 15113 18377 -12165 -8948 -22645 -32717 5258 18596 4206 10497 3350 -21986 -38185
5433 -38185 -10648 -2707 -8584 -19559 -35693 -19926 13809 30995 29241 -7387 -5387 9564 965
5420 965 14531 41612 14904 -17034 -6028 23124 37748 21199 -868 33241 34251 21395
5408 21395 5356 -13138 -57869 -51974 -57828 -46185 -24279 -8273 27409 27492 6859 -16956 -23736
5395 -23736 -15561 -15311 -40643 -47221 -44598 -11371 18190 7265 -12692 -8553 -3508 9369 -11848
5382 -11848 -42881 -44802 -27957 -29754 -12777 -11054 -28968 -24112 -18115 2661 -14165 -9385 -22599
5369 -22599 -33899 -29647 -46751 -47438 -34488 -22721 -26028 -34631 -10462 -7895 32248 43276 -18630
$$ packed form
5459d8330P460M7350j007j8698J4481J7737k2866J4783k4157M590L1358l445p246
5446A2010L103L264l0542L217j3697j0072L7975J3338j4390O291p147k5336j6199
5433c8185K7537P941n877j0975j6134J5767L3735J7186j754l6628K000J4951q599
5420I65J3566K7081k6708l1938J1006K9152J4624j6549k2067L4109J010j2856
5408B1395j6039j8494m4731N895n854J1643K1906J6006L5682Q3k0633k3815o780
5395b3736Q175K50k5332o578K623L3227K9561j0925j9957M139N045J2877k1217
5382a1848l1033j921J6845j797J6977J723j7914M856N997K0776j6826M780j3214
5369b2599j1300M252j7104o87J2950J1767l307q603K4169K567M0143J1028o1906
$$ plain form
5356 -18630 -71736 -65537 -28003 -8979 3312 9893 -16432 -4019 -14779 -50596 -35853 -27763
5344 -27763 -23147 -15669 -19798 9927 -14369 -42887 -64398 -78425 -46107 -4950 4811 26283 42066
5331 42066 40877 46330 21788 -11300 -32642 -15263 -8800 -22835 -24975 -19110 -682 27588 17470
5318 17470 3428 1681 38976 33264 19725 39328 10857 22767 -4950 -3096 -21854 -38591
5306 -38591 -26108 -5769 5072 1788 -8327 -41908 -25169 -2435 4210 -667 -29065 -54723
5294 -54723 -48593 -41999 -41999 -20540 -12296 -16410 -24790 -25221 -40680 -27463 -26584 -35270 -24380 -19032 -21335
5279 -21335 -17817 -30402 -45096 -42174 -58620 -68175 -50319 -23874 6676 29789 18549 13354 -3536
5266 -3536 -19991 -18415 -17444 -20605 -23784 19954 47785 32962 15650 7710 24280 34459 28478
$$ packed form
5356a8630n3106O199L7534J9024J2291O581k6325J2413j0760l5817J4743Q090
5344b7763M616P478m129K9725k4296k8518k1511j4027L2318M1157R761K1472J5783
5331D2066j189N453k4542l3088k1342J7379O463j4035k140N865J8428K8270j0118
5318A7470j4042j747L7295n712j3539J9603k8471J1910k7717J854j8758j6737
5306c8591J2483K0339J0841l284j0115l3581J6739K2734O645m877k8398k5658
5294e4723O130O594%K1459Q244m114q380m31j5459J3217Q79q686J0890N348k303
5279b1335L518j2585j4694K922j6446r555J7856K6445L0550K3113j1240n195j6890
5266c536j6455J576R71l161l179M3738K7831j4823j7312p940J6570J0179n981
$$ plain form
5253 28478 37837 32331 19048 -7019 9903 -12870 -47370 -59662 -70430 -46348 -25702 -33583
5241 -33583 -48218 -34267 -8639 -24001 -29417 -33915 -29194 -35006 -5814 -8342 -34477 -35848 -32305
5228 -32305 -40745 -38359 -29471 -24737 -29517 -44702 -33267 -48303 -26854 -2381 4023 -2314 402
5215 402 -10722 -27977 -34157 -27676 -21954 -23564 -5138 -168 29978 29091 12042 14087 16367 17056
5201 17056 7437 -8681 1093 -13301 -10201 -26567 -8018 21383 11669 7812 352 7336 18715
5188 18715 34676 44664 58135 56100 37907 3322 -41497 -6237 -9918 -24486 2359 22296
5176 22296 25184 20914 9050 -1588 14523 37339 34330 43845 48600 47248 20810 20361 -2874
5163 -2874 20217 7474 -5423 -7694 -29352 -11159 14146 4585 -25031 -27145 -24931 -3110 -35388
$$ packed form
5253B8478R359n506j3283k6067J6922k2773l4500j2292j0768K4082K0646p881
5241c3583j4635J3951K5628j5362n416m498M721n812K9192k528k6135j371L543
5228c2305q440K386Q888M734m780j5185J1435j5036K1449K4473O404o337K716
5215D02j1124j7255o180O481N722j610J8426M970L0146q87j7049K045K280O89
5201A7056r619j6118R774j4394L100j6366J8549K9401r714l857p460O984J1379
5188A8715J5961R988J3471k035j8193l4585m4819L5260l681j4568K6845J9937
5176B2296K888m270j1864j0638J6111K2816l009R515M755j352k6438m49k3235
5163b874K3091j2743j2897k271k1658J8193K5305r561k9616k114K214K1821l2278
$$ plain form
5150 -35388 -34372 -33414 -21969 -21695 -16582 13697 11460 -1276 -22682 -33525 -33221 -30002 -37889 -29612
5136 -29612 -19368 -26491 -50338 -67596 -63447 -57880 -60855 -58079 -26587 13529 5646 -14970 -13973
5123 -13973 3744 25536 19372 -6969 -14734 -7403 2359 12404 -6246 14042 8387 7198 6762
5110 6762 6247 7388 -1331 -10823 -12145 -24147 -29910 -4146 23506 23808 -8966 -27385 1863 23247
5096 23247 34933 42514 19208 13560 1757 -20720 -45653 -28439 -1639 7176 -16115 -20422 6018
5083 6018 -5972 -26392 -49858 -43776 -57316 -73958 -73556 -29794 -28729 -24548 1507 14361 -10400
5070 -10400 -2584 -1923 3605 -1259 1447 -16736 -30996 -48018 -42420 -17465 -4139 -25196 -68004
5057 -68004 -40254 2898 -12958 -10295 11606 -5284 -1763 17803 6790 -3755 -12330 -28048
$$ packed form
5150c5388J016R58J1445K74N113L0279k237j2736k1406j0843L04L219p887Q277
5136b9612J0244p123k3847j7258M149N567k975K776L1492M0116p883k0616R97
5123a3973J7717K1792o164k6341p765P331R762J0045j8650K0288n655j189m36
5110F762n15J141q719r492j322j2002n763K5764K7652L02l2774j8419K9248K1384
5096B3247J1686P581k3306n648j1803k2477k4933J7214K6800Q815k3291m307K6440
5083F018j1990k0420k3466O082j3540j6642M02M3762J065M181K6055J2854k4761
5070a0400P816O61N528m864K706j8183j4260j7022N598K4955J3326k1057m2808
5057f8004K7750M3152j5856K663K1901j6890L521J9566j1013j0545q575j5718
$$ plain form
5045 -28048 -41956 -54263 -41701 -29694 -28911 -23045 21377 36322 1055 -23784 -16042 -34979 -49239
5032 -49239 1366 39707 26732 -9520 -30122 -12541 -21136 -26100 1246 15998 7550 -18952
5020 -18952 -31220 -15970 8797 7805 -19484 -920 -6969 -32019 -29367 -3017 26228 54220 37111
5007 37111 25266 25938 17690 12394 19554 21547 26365 15003 -9596 -16908 -25531 -31318 -33146 -35818
4993 -35818 -18143 -19460 -18443 -39581 -42599 -42469 -2656 29807 33670 31410 120 -1077 11373
4980 11373 6732 4944 25195 29018 12242 19511 20542 13559 54283 64550 41574 23162 -2271
4967 -2271 -15028 -3365 12063 21361 19446 -771 -14392 -3041 19786 27417 14558 -14735 -36991
4954 -36991 -28374 1572 3294 1576 -10110 -22814 -11765 -9479 21614 18489 17060 20603 10811
$$ packed form
5045b8048j3908j2307J2562J2007P83N866M4422J4945l5267k4839P742j8937j4260
5032d9239N0605L8341j2975l6252k0602J7581q595m964K7346J4752q448k6502
5020a8952j2268J5250K4767r92k7289J8564o049k5050K652K6350K9245K7992j7109
5007C7111j1845O72q248n296P160J993M818j1362k4599p312q623n787j828k672
4993c5818J7675j317J017k1138l018J30L9813L2463L863k260l1290j197J2450
4980A1373m641j788K0251L823j6776P269J031o983M0724J0267k2976j8412k5433
4967b271j2757J1663J5428R298j915k0217j3621J1351K2827P631j2859k9293k2256
4954c6991Q617K9946J722j718j1686j2704J1049K286L1093l125j429L543r792
$$ plain form
4941 10811 8709 1514 5989 23311 33640 -6764 1849 -16260 -39337 -23186 -14126 -17514 -3018
4928 -3018 -6014 -10142 18208 2641 -7231 -11319 -45989 -50006 -48885 -46468 -15599 -12805 -45025 -47447
4914 -47447 -13535 -6474 4891 -6329 -44793 -66195 -36060 3476 5821 36575 47954 36372
4902 36372 -3370 -43660 -58607 -72399 -64726 -42121 -11146 -16051 -35079 -13641 -14941 -5412 -11444
4889 -11444 -51245 -52288 -46646 -53125 -47837 -48951 -40223 -26870 -8255 -27628 -33620 -32979 -27231 -28154
4875 -28154 -4757 9875 15560 16552 -15902 -38098 -26771 -26917 -26904 -12268 7225 27477 14183
4862 14183 11378 5164 3492 -3182 13309 11024 -3223 -28936 -23673 -27438 -58886 -76486 -77752
4849 -77752 -45124 -15816 1850 -4290 11398 683 -9050 -23706 -60372 -66150 -31526 -21989 -27333
$$ packed form
4941A0811k102p195M475J7322J0329m0404Q613j8109k3077J6151R060l388J4496
4928c018k996m128K8350j5567r872m088l4670m017J121K417L0869K794l2220k422
4914d7447L3912P061J1365j1220l8464k1402L0135L9536K345L0754J1379j1582
4902C6372l9742m0290j4947j3792P673K2605L0975m905j9028K1438j300R529o032
4889a1444l9801j043N642o479N288j114Q728J3353J8615j9373n992O41N748r23
4875b8154K3397J4632N685R92l2454k2196J1327j46J3J4636J9493K0252j3294
4862A4183k805o214j672o674J6491k285j4247k5713N263l765l1448j7600j266
4849g7752L2628K9308J7666o140J5688j0715r733j4656l6666n778L4624R537n344
$$ plain form
4836 -27333 -21381 -28257 -31890 -38385 -39958 -38890 -33387 22129 35942 46258 42475 17237 -4379
4823 -4379 -15364 -31152 -20200 2367 9002 7963 -3461 -5846 13924 8373 -1706 2255 4264
4810 4264 4100 12175 29186 47390 31860 -14589 -25202 -31634 -11956 1654 -16171 -48780 -16716
4797 -16716 -866 -44938 -68268 -73118 -46747 -53875 -37274 9598 12673 21474 9425 -21752 -18797
4784 -18797 -21938 -28091 -22852 -2384 -29059 -20211 -3439 12230 25352 7571 31409 18213 -10767
4771 -10767 7758 33391 24993 38285 16110 6361 -6212 21081 15951 10812 -17200 -36370 -27482
4758 -27482 -17922 6345 22186 8329 18675 18699 868 -20918 -33859 -19805 5832 -6576 -15564
4745 -15564 -30478 -41456 -29720 -4122 -11903 8493 33126 20219 30741 15050 -25424 -34040
$$ packed form
4836b7333N952o876l633o495j573J068N503N5516J3813J0316l783k5238k1616
4823d379j0985j5788J0952K2567O635j039j1424k385J9770n551j0079L961K009
4810D264j64Q075J7011J8204j5530m6449j0613o432J9678J3610j7825l2609L2064
4797a6716J5850m4072k3330m850K6371p128J6601M6872L075Q801j2049l1177K955
4784a8797l141o153N239K0468k6675Q848J6772J5669J3122j7781K3838j3196k8980
4771a0767J8525K5633q398J3292k2175r749j2573K7293n130n139k8012j9170Q888
4758b7482R560K4267J5841j3857J0346K4j7831k1786j2941J4054K5637j2408q988
4745a5564j4914j0978J1736K5598p781K0396K4633j2907J0522j5691m0474q616
$$ plain form
4733 -34040 -40792 -65242 -40497 -9419 -13610 -2972 5355 -7499 -10141 -15540 -34257 -61572 -75566
4720 -75566 -66761 -42283 -30411 -33420 -10312 -3781 -39539 -31269 -45522 -38758 -24671 -13508 -20513
4707 -20513 -22270 -8651 -12625 -6942 -24085 -23355 -7452 2692 -43895 -24651 -12563 -21101 -7784
4694 -7784 -5008 2925 -11657 -28838 -45982 -47465 -34050 -11722 -24613 -50858 -22668 -13382 -36267
4681 -36267 -17451 -21347 -21317 -26207 -20278 -39666 -28701 -33081 -41360 -44286 -41362 -29279 -18029 -6077
4667 -6077 3888 18254 905 -15581 2931 6640 7756 25022 58005 71066 41769 29596 26791
4654 26791 -10544 -19983 23820 34993 34752 24811 7483 -39901 -42279 -34023 -11418 -11934 1844
4641 1844 29345 45462 63750 50504 43361 41793 26104 1302 8434 6755 -4033 -15641 -41974
$$ packed form
4733c4040o752k4450K4745L1078m191J0638Q327j2854k642n399j8717k7315j3994
4720g5566Q805K4478J1872l009K3108O531l5758Q270j4253O764J4087J1163p005
4707b0513j757J3619l974N683j7143P30J5903J0144m6587J9244J2088q538J3317
4694g784K776P933j4582j7181j7144j483J3415K2328j2891k6245K8190R286k2885
4681c6267J8816l896L0m890N929j9388J0965m380q279k926K924J2083J1250J1952
4667f077R965J4366j7349j6486J8512L709J116J7266L2983J3061k9297j2173k805
4654B6791l7335r439M3803J1173k41r941j7328m7384k378Q256K2605n16J3778
4641A844K7501J6117J8288j3246p143j568j5689k4802P132j679j0788j1608k6333
$$ plain form
4628 -41974 -50692 -30774 11688 33596 23238 10432 -5753 -6171 14425 23231 25962 -2084 -11844
4615 -11844 8587 33565 4387 -14571 -33772 -30703 -16592 12883 2120 -42904 -43351 -12113
4603 -12113 5976 30187 53632 49858 33978 -2259 -24885 -65344 -74069 -37679 -34612 -30222 7530
4590 7530 7558 6667 -4323 -52372 -68565 -8647 28189 2430 -40461 -59730 -33677 -18294 -1318
4577 -1318 994 -14639 -20003 -4505 -2141 -15162 -21953 -19914 -4168 -23204 -10462 -38068 -68362
4564 -68362 -45656 -7179 7761 -13590 -4023 -5721 -6438 -29102 -67220 -60954 -23088 8763 -21432
4551 -21432 -25039 -9284 -107 -1238 -8128 -24512 -26342 -29553 -45533 -47103 -37662 -11544 13598
4538 13598 1852 -7331 -26880 -43986 -26959 -23547 -17045 -21208 -52864 -49386 -58425 -56687 -28618
$$ packed form
4628d1974q718J9918M2462K1908j0358j2806j6185m18K0596Q806K731k8046r760
4615a1844K0431K4978k9178j8958j9201L069J4111K9475j0763m5024m47L1238
4603a2113J8089K4211K3445l774j5880l6237k2626m0459q725L6390L067M390L7752
4590G530K8q91j0990m8049j6193N9918L6836k5759m2891j9269K6053J5383J6976
4577a318K312j5633n364J5498K364j3021o791K039J5746j9036J2742k7606l0294
4564f8362K2706L8477J4940k1351R567j698p17k2664l8118O266L7866L1851l0195
4551b1432l607J5755R177j131o890j6384j830l211j5980j570R441K6118K5142
4538A3598j1746r183j9549j7106J7027L412O502m163l1656L478r039J738K8069
$$ plain form
4525 -28618 -2962 1977 -16397 -35808 -40363 -59218 -71248 -73290 -44946 -46446 -36175 -16382 -2963
4512 -2963 -45364 -58956 -37282 -35434 -18067 -32709 -28380 -33361 -23214 -29128 -27040 1555 24537
4499 24537 26803 24549 3778 -17914 -21227 -69298 -90344 -66704 -35877 -31268 -38196 -47231 -40689
4486 -40689 -37623 -18716 14629 28611 1656 -2480 2133 19569 29966 20203 -14916 -34640 -61824
4473 -61824 -94459 -92328 -52098 -7229 2406 -4834 -8840 -41828 -44739 -46966 -45401 -26723 -13724
4460 -13724 -5171 -5222 16433 13778 1434 -11570 -9548 11869 20039 -22251 -44458 -51539 -75387
4447 -75387 -59072 -44411 -39027 -49653 -34343 -32707 -18313 -39919 -25077 -9493 5812 10755
4435 10755 -16413 -30211 -47467 -58468 -100275 -80127 -53356 -87096 -100438 -68904 -42333 -45342
$$ packed form
4525b8618K5656M939j8374j9411m555j8855j2030k042K8344j500J0271J9793J3419
4512b963m2401j3592K1674J848J7367j4642M329m981J0147n914K088K8595K2982
4499B4537K266k254k0771k1692l313m8071k1046K3640L0827M609o928r035O542
4486d0689L066J8907L3345J3982k6955m136M613J7436J0397r763l5119j9724k7184
4473f1824l2635K131M0230M4869R635p240m006l2988k911k227J565J8678J2999
4460a3724Q553n1K1655k655j2344j3004K022K1417Q170m2290k2207p081k3848
4447g5387J6315J4661N384j0626J5310J636J4394k1606J4842J5584J5305M943
4435A0755k7168j3798j7256j1001m1807K0148K6771l3740j3342L1534K6571l009
$$ plain form
4423 -45342 -25921 2460 -156 -12590 -20602 -25803 -23882 -27170 -40095 -66286 -70663 -34736 -39584
4410 -39584 -84785 -112151 -107353 -109538 -128067 -122364 -114259 -94893 -81753 -82666 -69483 -76283 -57534
4397 -57534 -28673 8251 24085 -5374 -17621 -16279 -12092 6985 28590 20285 -1865 694 5757
4384 5757 29672 42359 11418 -11532 -35725 -13988 5386 -10130 -9303 6736 9587 3964 8667
4371 8667 7564 2469 20043 32342 8203 -16126 6494 -8677 -45922 -34374 -6492 -6286 -5906
4358 -5906 -6182 -14833 -19803 560 15632 18491 14629 16182 7260 10715 23561 -1184 -6832 -8015
4344 -8015 600 -14864 -14874 9646 -16542 -36013 -35718 -9355 -8873 1502 7393 13236 -12990 -14241
4330 -14241 -74280 -67791 -49647 -52988 -66760 -66065 -63633 -46838 -51836 -44565 -16187 715 13937
$$ packed form
4423d5342J9421K8381k616j2434q012n201J921l288j2925k6191m377L5927m848
4410c9584m5201k7366M798k185j8529N703Q105J9366J3140r13J3183o800J8749
4397e7534K8861L6924J5834k9459j2247J342M187J9077K1605q305k2150K559N063
4384E757K3915J2687l0941k2950k4193K1737J9374j5516Q27J6039K851n623M703
4371H667j103n095J7574J2299k4139k4329K2620j5171l7245J1548K7882K06L80
4358e906k76q651m970K0363J5072K859l862J553q922L455J2846k4745n648j183
4344h015Q615j5464j0K4520k6188j9471K95K6363M82J0375N891N843k6226j251
4330a4241o0039O489J8144l341j3772O95K432J6795m998P271K8378J6902J3222
$$ plain form
4317 13937 4975 8664 17423 4100 -3242 7534 3536 -24675 -41781 -36714 -18417 -21546 -24667
4304 -24667 -43142 -49518 -38663 -47997 -24787 -13692 -8335 -7406 -21910 810 3364 4973 14769
4291 14769 17054 15000 13902 -33971 -43921 -33215 -46341 -61643 -33550 9683 13429 18551 31884
4278 31884 29067 8549 -9827 -16423 8509 17242 -2327 9052 5510 1948 7777 15800 32897
4265 32897 35436 24781 24163 6640 11229 9529 9481 6267 -12656 -23842 6126 36078 14857 2822
4251 2822 -10375 -15213 -16328 -23279 -34614 -47601 -58571 -57368 -23664 -21634 -23010 -38399 -4933
$$ packed form
4317A3937q962L689Q759j3323p342J0776l998k8211j7106N067J8297l129l121
4304b4667j8475o376J0855r334K3210J1095N357R29j4504K2720K554J609R796
4291A4769K285k054j098m7873r950J0706j3126j5302K8093M3233L746N122J3333
4278C1884k817k0518j8376o596K4932Q733j9569J1379l542l562N829Q023J7097
4265C2897K539j0655o18j7523M589j700m8l214j8923j1186K9968K9952k1221j2035
4251B822j3197m838j115o951j1335j2987j0970J203L3704K030j376j5389L3466
$$ [...]
##END NTUPLES=NMR SPECTRUM
##END=
