##TITLE=Analysis number 328727
Compound Code cc 27002
Book Reference 511/152
Project Code adrs
Chemist Name stevem
##JCAMPDX= 6.0         $$ Bruker NMR JCAMP-DX V2.0
##DATA TYPE= NMR SPECTRUM
##DATA CLASS= NTUPLES
##ORIGIN= Bruker BioSpin GmbH
##OWNER= nmr
$$ XWIN-NMR		Version 3.5
$$ Thu Jun 28 10:18:45 2007 GMT Daylight Time (UT+1h)  MAYBRIDGE\nmr@NMR_250MHZ
##.OBSERVE FREQUENCY= 250.131544655141
##.OBSERVE NUCLEUS= ^1H
##.ACQUISITION MODE= SIMULTANEOUS (DQD)
##.ACQUISITION SCHEME= undefined
##.AVERAGES= 16
##.DIGITISER RES= 18
##SPECTROMETER/DATA SYSTEM= dpx250
##.PULSE SEQUENCE= zg30
##.SOLVENT NAME= CDCl3
##.SHIFT REFERENCE= (INTERNAL, CDCl3, 0, 16.4367)
##AUDIT TRAIL= $$ (NUMBER, WHEN, WHO, WHERE, WHAT)
$$ ##TITLE= Audit trail, XWIN-NMR		Version 3.5
$$ ##JCAMPDX= 5.01
$$ ##ORIGIN= Bruker BioSpin GmbH
$$ ##OWNER= nmr
$$ C:\u/data/dgb/nmr/ADRS/2180/pdata/1/auditp.txt
$$ ##AUDIT TRAIL=  $$ (NUMBER, WHEN, WHO, WHERE, WHAT)
(   1,<2007-06-28 10:18:21.14 +100>,<MAYBRIDGE\nmr>,<NMR_250MHZ>,
      <created by zg, POWCHK disabled, PULCHK disabled
       configuration hash MD5:
       76 6E 9A 78 1E 09 19 81 EC 84 63 8F B0 6A 59 2D
       data hash MD5: 64K
       62 A0 AC 45 D2 EE B3 EE A4 FF 66 1F 70 44 A0 68>)
(   2,<2007-06-28 10:18:35.03 +100>,<MAYBRIDGE\nmr>,<NMR_250MHZ>,
      <Start of raw data processing
       ef LB = 0.3 FT_mod = 6 PKNL = 1 SI = 32K 
       data hash MD5: 32K
       09 22 40 2D 3D 0F C3 57 5E C5 06 17 F5 2B 1E 3B>)
(   3,<2007-06-28 10:18:36.68 +100>,<MAYBRIDGE\nmr>,<NMR_250MHZ>,
      <apk 
       data hash MD5: 32K
       19 00 1D 7C A1 33 6D 83 9B D1 FA 0D 63 44 F2 C2>)
(   4,<2007-06-28 10:18:37.47 +100>,<MAYBRIDGE\nmr>,<NMR_250MHZ>,
      <abs ABSG = 5 
       data hash MD5: 32K
       F7 64 F7 B9 34 29 3C 1C 5B 6C 04 95 7B 10 54 E5>)
$$ ##END=
$$ 
$$ hash MD5
$$ 31 3B 84 FA B5 55 5F 13 DF A8 90 52 78 11 E2 46
##$RELAX= 
##$RELAX= 
##$RELAX= 
##$RELAX= 
##$RELAX= 
##$RELAX= 
##$RELAX= 
$$ Bruker specific parameters
$$ --------------------------
##$DU= <C:\u>
##$EXPNO= 2180
##$NAME= <ADRS>
##$PROCNO= 1
##$TYPE= <nmr>
##$USER= <dgb>
##$AMP= (0..31)
100 100 100 100 100 100 100 100 100 100 100 100 100 100 100 100 100 100 
100 100 100 100 100 100 100 100 100 100 100 100 100 100 
##$AQSEQ= 0
##$AQ_mod= 3
##$AUNM= <au_zg>
##$AUTOPOS= <10 >
##$BF1= 250.13
##$BF2= 250.13
##$BF3= 250.13
##$BF4= 250.13
##$BF5= 500.13
##$BF6= 500.13
##$BF7= 500.13
##$BF8= 500.13
##$BYTORDA= 1
##$CFDGTYP= 0
##$CFRGTYP= 5
##$CHEMSTR= <none>
##$CNST= (0..31)
1 1 145 1 1 1 1 1 1 1 1 1 1 1 1 1 1 1 1 1 1 1 1 1 1 1 1 1 1 1 1 1 
##$CPDPRG= <>
##$CPDPRG1= <>
##$CPDPRG2= <>
##$CPDPRG3= <>
##$CPDPRG4= <mlev>
##$CPDPRG5= <mlev>
##$CPDPRG6= <mlev>
##$CPDPRG7= <mlev>
##$CPDPRG8= <mlev>
##$CPDPRGB= <>
##$CPDPRGT= <>
##$D= (0..31)
0 1 0 0 0 0 0 0 0 0.06 0 0 0 0 0 0 0.0002 0 0 0 0 0 0 0 0 0 0 0 0 0 0 
0 
##$DATE= 1183022299
##$DBL= (0..7)
120 120 120 120 120 120 120 120 
##$DBP= (0..7)
150 150 150 150 150 150 150 150 
##$DBP07= 0
##$DBPNAM0= <>
##$DBPNAM1= <>
$$ [...]
##$SUBNAM7= <"">
##$SUBNAM8= <"">
##$SUBNAM9= <"">
##$SW= 20.6930455092707
##$SWIBOX= (0..15)
0 0 3 0 0 0 0 0 0 0 0 0 0 0 0 0 
##$SW_h= 5175.983436853
##$TD= 65536
##$TD0= 1
##$TE= 295.16
##$TE2= 300
##$TE3= 300
##$TEG= 300
##$TL= (0..7)
0 120 120 120 120 120 120 120 
##$TP= (0..7)
150 150 150 150 150 150 150 150 
##$TP07= 0
##$TPNAME0= <>
##$TPNAME1= <>
##$TPNAME2= <>
##$TPNAME3= <>
##$TPNAME4= <>
##$TPNAME5= <>
##$TPNAME6= <>
##$TPNAME7= <>
##$TPOAL= (0..7)
0.5 0.5 0.5 0.5 0.5 0.5 0.5 0.5 
##$TPOFFS= (0..7)
0 0 0 0 0 0 0 0 
##$TUNHIN= 0
##$TUNHOUT= 0
##$TUNXOUT= 0
##$USERA1= <user>
##$USERA2= <user>
##$USERA3= <user>
##$USERA4= <user>
##$USERA5= <user>
##$V9= 5
##$VALIST= <valist>
##$VCLIST= <CCCCCCCCCCCCCCC>
##$VD= 0
##$VDLIST= <DDDDDDDDDDDDDDD>
##$VPLIST= <PPPPPPPPPPPPPPP>
##$VTLIST= <TTTTTTTTTTTTTTT>
##$WBST= 1024
##$WBSW= 4
##$XGAIN= (0..3)
0 0 0 0 
##$XL= 0
##$YL= 0
##$YMAX_a= 476397
##$YMIN_a= -479094
##$ZGOPTNS= <>
##$ZL1= 120
##$ZL2= 120
##$ZL3= 120
##$ZL4= 120
##$ABSF1= 16.43671
##$ABSF2= -4.256462
##$ABSG= 5
##$ABSL= 3
##$ALPHA= 0
##$AQORDER= 0
##$ASSFAC= 0
##$ASSFACI= 0
##$ASSFACX= 0
##$ASSWID= 0
##$AUNMP= <proc_1d>
##$AZFE= 0.1
##$AZFW= 0.1
##$BCFW= 0
##$BC_mod= 0
##$BYTORDP= 0
##$COROFFS= 0
##$CY= 12.5
##$DATMOD= 1
##$DC= 0
##$DFILT= <>
##$DTYPP= 0
##$F1P= 14.0000005364418
##$F2P= -0.99999901652339
##$FCOR= 0.5
##$FTSIZE= 32768
##$FT_mod= 6
##$GAMMA= 0
##$GB= 0
##$INTBC= 1
##$INTSCL= 1
##$ISEN= 128
##$LB= 0.3
##$LEV0= 0
##$LPBIN= 0
##$MAXI= 10000
##$MC2= 0
##$MEAN= 0
##$ME_mod= 0
##$MI= 0
##$NCOEF= 0
##$NC_proc= -1
##$NLEV= 6
##$NOISF1= 0
##$NOISF2= 0
##$NSP= 0
##$NTH_PI= 0
##$NZP= 0
##$OFFSET= 16.43671
##$PC= 1
##$PHC0= -50.24506
##$PHC1= 5.816109
##$PH_mod= 1
##$PKNL= yes
##$PPARMOD= 0
##$PSCAL= 4
##$PSIGN= 0
##$REVERSE= no
##$SF= 250.130021332457
##$SI= 32768
##$SIGF1= 0
##$SIGF2= 0
##$SINO= 400
##$SIOLD= 32768
##$SREGLST= <1H.CDCl3>
##$SSB= 0
##$STSI= 32768
##$STSR= 0
##$SW_p= 5175.98343685301
##$SYMM= 0
##$S_DEV= 0
##$TDeff= 65536
##$TDoff= 0
##$TI= <Analysis number 999999
Compound Code 99
Book Reference 9
Project Code 9>
##$TILT= no
##$TM1= 0
##$TM2= 0
##$TOPLEV= 0
##$USERP1= <user>
##$USERP2= <user>
##$USERP3= <user>
##$USERP4= <user>
##$USERP5= <user>
##$WDW= 1
##$XDIM= 32768
##$YMAX_p= 343041643
##$YMIN_p= -69048
$$ End of Bruker specific parameters
$$ ---------------------------------
##NTUPLES= NMR SPECTRUM
##VAR_NAME=  FREQUENCY,     SPECTRUM/REAL,   SPECTRUM/IMAG
##SYMBOL=    X,             R,               I
##VAR_TYPE=  INDEPENDENT,   DEPENDENT,       DEPENDENT
##VAR_FORM=  AFFN,          ASDF,            ASDF
##VAR_DIM=   32768,         32768,           32768
##UNITS=     HZ,            ARBITRARY UNITS, ARBITRARY UNITS
##FACTOR=    0.157963299565203, 1,           1
##FIRST=     4111.31471239842, 0,            0
##LAST=      -1064.66872445459, 0,           0
##MIN=       -1064.66872445459, -69048,      0
##MAX=       4111.31471239842, 343041643,    0
$$ Real data points
##PAGE= N=1
##DATA TABLE= (X++(R..R)), XYDATA
$$ [...]
17443C2510J4586K1836K3112q705j9026j7988j6472j3503j008M488K145p753l705
17430A0517p13J0841P825K284j474J828J0995J2178J7620L0950N0141O1179P1491
17417B85662M9617J1878n439m8851o8223o4704n1811l9104k4652r902j0327r218
17405A4926m787L458M572n565j544L531R29k258J030k279l252j443p9M338P776
17390A9353m266n008j26n289o044q95J588N526L624j389m410l467l851n510o354
17375a6518N68N550N598r22n272M611J0260L827k188n133l024l113p261j384R644
17360d757K680p77J472J473K466P592j19k112l149J538L931j533L353K550o831
17345G777K530L323J306j595k653P488J146q652l66J105l882K111n505r039p119
$$ y = [32510, 47096, 68932, 92044, 83339, 64313, 46325, 29853, 16350, 15342, 19830, 21975, 14222, 10517, 9804, 20645, 28470, 30754, 29280, 31108, 42103, 54281, 71901, 102851, 152992, 214171, 285662, 335279, 347157, 341718, 292867, 224644, 159940, 108129, 69025, 44373, 34471, 24144, 14926, 10139, 13597, 18169, 12604, 11060, 14591, 15520, 13262, 14292, 12013, 8761, 7318, 7239, 11577, 19353, 15087, 10079, 9953, 4664, -1380, -2275, -687, 4839, 8463, 7074, 2664, -803, -4654, -10164, -16518, -15950, -10400, -4802, -5724, -10996, -6385, 3875, 7702, 5514, 381, -2643, -5756, -13017, -14401, -4757, -2077, -2854, -1382, 91, 2557, 10149, 10030, 7918, 4769, 6307, 10238, 8705, 12058, 14608, 7777, 10307, 13630, 14936, 13341, 10688, 18176, 19322, 10670, 10304, 11409, 7527, 9638, 4133, -4906, -12025]
17330a2025O78K799J554L323L649L205J152l733n8R68J138K028q886l088Q96J0341
17314C941N30k471l873j969j293M252M270m545p38j775K216K122J987j781l318
17299b445J507J554N34K995k477M70K009P93Q68P83M300L232l514O174j345o882
17283H556J170M609r990P72J215L3r352m077L44o40M326M026P612q3p105m019
17267b603Q62q37l722M129R772R09o892m368j809M08N566N099j482n492r99m84
17251a943j879M159j466k834L616R682P67m866l687J900k715n453l24M089M384
17236C430P112m282j0379l928l506K192P792N39k182L733k421l524j193K483K693
17221a441l013P500M715O14q34J338R22k276O024m388j0340j0146m406L513R671
$$ y = [-12025, -11347, -8548, -6994, -3671, -22, 3183, 4335, 602, 544, 1512, 2650, 4678, -4208, -7296, -6400, 3941, 4471, 2000, -1873, -3842, -5135, -883, 3387, -1158, -1896, -3671, -1455, 667, 2654, 873, -2445, -938, 616, 1150, 4145, 1668, 2138, 4147, 4940, 5808, 6591, 10891, 14123, 10609, 16783, 15438, 8556, 9726, 14335, 4345, 5117, 6332, 6365, -2987, -7064, -6720, -7360, -3034, 992, 8604, 8521, 1416, -2603, -1741, -2578, -6300, -2171, 7601, 8510, 1618, -2750, -4559, -4151, 1415, 6514, 5032, -460, -1459, -1943, -3822, 337, -1129, -3963, -347, 9335, 10102, 5236, 1549, 3449, 734, -4719, -5043, -954, 3430, 10542, 6260, -4119, -8047, -11553, -9361, -1569, -1030, -3212, 521, -1900, -5424, -6617, -4134, -1441, -4454, 3046, 7761, 8375, 7541, 8879, 9801, 7525, 13549, 9161, -1179, -11325, -15731, -12218, -2547]
17206b547J722j637L547l827L174K762Q351j469l898K217k712j0935l500N478
17192c274j084R047L567n870q902k201J145K769L894O131O88p609M79j918K633
17177e05N266l506m503l241k150K750L182n34m66Q77O049J833m147j896m450K491
17161b950M032K061l994K891M569J265k517m741k667Q854L823J714m325n563N472
17146G924N900o70K440j577P196P273O317R161J3899K0184M0718P2067Q4888R3285
17132C69005J05477N1072J1984k7699r0130r6273r1569p7954m5729l4927k2641
17121E0616j2284p977m732l576l007R64q77m708p516j202J770n81k881m943r78
17106a912L545l19J473K728J94M079l527o490L05L312J053O01j110O67n700n531
$$ y = [-2547, -825, -2462, 1085, -2742, 432, 3194, 11545, 10076, 6178, 8395, 5683, -5252, -8752, -3274, -4358, 4689, 8256, 2386, -6516, -8717, -7572, -4803, -909, 5222, 5910, -1699, -1220, -3138, -505, 4761, 1255, -3248, -6489, -8639, -5889, -2707, -3241, -3707, -2830, 3219, 5052, 905, -991, -5441, -2950, 1082, 3143, -851, 2040, 6609, 7874, 5357, 616, -2051, 6803, 10626, 12340, 8015, 2452, 7924, 13824, 13154, 15594, 14017, 21213, 28486, 34803, 43964, 57863, 78047, 118765, 190832, 275720, 369005, 474482, 525554, 537538, 509839, 419709, 323436, 231867, 153913, 108184, 73257, 50616, 38332, 30355, 25623, 22047, 19040, 20004, 19127, 14419, 6903, 5701, 7471, 6890, 4009, -934, -1912, 1633, 1314, 2787, 5515, 5709, 9788, 6261, -229, 76, 3388, 4441, 5042, 3932, 4599, -1101, -6632]
17090f632J475J610j759L458J451J303l94Q10P043J63J008K682l934j117J543
17075H710j877k622m398o338K401n9K093r82O12K704M999m493m804k948O426m27
17059a003J41K919l61L541K863K626p18n53k076n219K123J1426J2451L838o95
17044C1303j246q79n436o651q437n420M678M161n668K054J679j961n813m98J360
17029C226J539N477L679L385j0063l646l622j0336o67K988L223M220J034l167
17015b730l109l61j180N249M140j417M980L926m141k132m101j453J546j660J179
17000a264j599J520K587k744q61k664M169J321k98k215j297j312Q109J431l371
16985A512K162p4j984q84K279K106J768n52j546K602j34M85k596K479j456l507
$$ y = [-6632, -5157, -3547, -5306, -1848, -397, 906, 512, 1322, 8365, 8528, 9536, 12218, 8284, 7167, 8710, 6833, 4211, -187, -6525, -4124, -4183, -2090, -3072, -2460, 244, 5243, 750, -4054, -7002, -576, -1003, -862, 2057, 1696, 5237, 8100, 10726, 10008, 9455, 7379, 2160, 4283, 15709, 28160, 31998, 31303, 30057, 29178, 23742, 17091, 8654, 3234, 7912, 12073, 6405, 8459, 10138, 8177, 2364, 1866, 3226, 4765, 10242, 13921, 17306, 7243, 3597, -25, -10361, -11028, -8040, -4817, -597, 437, -2730, -5839, -6200, -7380, -2131, 2009, 592, 5572, 9498, 5357, 3225, -876, -2329, -783, -2443, -1264, -2863, -1343, 1244, -1500, -2361, -5025, -856, 465, 167, -2048, -3345, -4657, 3452, 4883, 1512, 3674, 3600, 1616, 732, 3011, 5117, 6885, 6333, 4787, 7389, 7255, 7740, 5144, 7623, 6167, 2660]
16969B660j028m3J225n427o520o65P49P11j743L573M316j56J502k578m14m189
16953h027m597M829L467l255j419M857M496j357j336l10j128M382ll337l500n558
16937a1796J61N773L869O643J030O71L94m830J154k24J054M478l381m096J545
16922B445j845M272K385m453K201M040j257k621M967J083P27j654M575Q273K067
16907B5205l046j908j188j809J773L895J1420R08l678J694q40L231L476M936L256
16892D7325N962J2634J0406J0188L0379M3495P2027J18188J76767J55911L4490
16881G17772J2311J06852K77945M77292K42447k43492k81734q6205J88580L75954
16871A787722O513l89461l84115k18214n4731R043j01559j74275j52394r9104
$$ y = [2660, 1632, 1589, 2814, -2613, -9133, -9798, -9049, -8338, -10081, -6508, -2192, -2348, -846, -3424, -3838, -8027, -12624, -7795, -4328, -7583, -9002, -4145, 351, -1006, -2342, -2652, -3780, 602, 599, -2738, -6238, -11796, -11635, -5862, -1993, 4650, 5680, 6351, 6745, 1915, 3069, 2845, 3899, 8377, 4996, 900, 2445, 600, 4872, 7257, 2804, 5005, 9045, 7788, 5167, 10134, 11217, 11944, 10290, 14865, 23138, 25205, 22159, 20251, 19063, 17254, 19027, 22922, 34342, 35250, 31572, 33266, 32426, 35657, 39133, 44069, 47325, 53287, 65921, 76327, 86515, 116894, 160389, 232416, 350604, 527371, 683282, 717772, 730083, 836935, 1114880, 1592172, 1834619, 1591127, 1309393, 1223188, 1411768, 1787722, 1794235, 1404774, 1020659, 802445, 747714, 756757, 655198, 480923, 328529, 229425]
16861B29425n4743l9087k1914j4324j3434m797p734p353j1311L14k223n903j655
16848D5261l168r393p726J900N241m914o110m999l309K054P313N21k9o974j195
16833A4473L100n61l691p87K482M783L78q048L459k810o155p043m922M803P019
16818F480k9J221K845M281m472l08n95o124L078M286M739K863l883m155J600n813
16802F014m230k121j573P208J57l200l09L445p04l092l266L361O79L890J665n99
16786G325m904r17N613P598J768k947j327n10l621o361k998r73K797R2o340j767
16770g472J945Q173N50q198l093L556J087J373O554M560J58J295m890m840J840
16755B598L275j897o641J012P148M034k839k272J702l661l393K751K766Q470l425
$$ y = [229425, 174682, 135595, 113681, 99357, 85923, 81126, 73392, 66039, 54728, 55042, 52819, 46916, 45261, 42093, 32700, 24974, 26874, 32115, 27201, 21091, 16092, 12783, 14837, 22150, 22671, 22642, 15668, 14473, 17573, 17012, 13321, 12534, 15016, 19799, 20177, 12129, 15588, 12778, 6623, -420, -5342, -539, 6480, 6451, 7672, 10517, 14798, 10326, 10018, 9423, 3299, 6377, 10663, 15402, 18265, 14382, 10227, 11827, 6014, 1784, -337, -1910, 5298, 5455, 2255, 1946, 5391, 4687, 1595, -1671, 1690, 2369, 6259, 7924, 7325, 2421, 1504, 7117, 14715, 16483, 13536, 12209, 11699, 8078, 1717, -1281, -2254, 543, 635, -5705, -7472, -5527, 2646, 3196, -5002, -8095, -4539, -3452, -2079, 4475, 9035, 9193, 10488, 5598, 758, 2598, 5873, 3976, -2665, -1653, 5495, 9529, 6690, 4418, 6120, 2459, -934, 1817, 4583, 13053, 9628]
16740I628k856l957m181k771K973N051L112N276l941p166l445m870k593J0930
16726A190P317J550k802l817j180M04k37l352k516K578O73O44J818J28O98n81
16710B515N28k188k143M07K190K258M93j1269n082j63P225M856N947l900r62q13
16694a01r08n085n665j421L558j342L117M837P772j521J748j334p867K783P678
16679F249J642l307j659l233j838K199k246m072M287M835j072m184k318j829K26
16664f320P28J179O502O657k264J264l631j116l87K383j042k80J837k362r22p0
16648B156j0831k420L023K539N639J933k484k143j655K364l164n464m189M181
16634a0515j404N757P271L026o55L635r95J958J39l689k052J702J524n313P8K378
$$ y = [9628, 6772, 2815, -1366, -4137, -1164, 3887, 6999, 12275, 8334, 1168, -2277, -7147, -9740, 1190, 8507, 10057, 7255, 3438, 2258, 2662, 2425, -927, -3443, -865, -192, 452, 2270, 2398, 3096, 2515, 3043, 855, -1288, -881, 1309, 3567, 4060, -7209, -12291, -12454, -5229, -373, 5574, 1674, 712, -101, -1009, -6094, -11759, -13180, -9622, -10964, -7847, -3010, 4762, 3241, 4989, 3655, -4212, -1429, 6249, 7891, 4584, 2925, -308, -2146, 53, -2193, -6265, -1978, 2857, 1785, -2399, -4717, -6546, -6320, -5592, -4413, 2089, 8746, 6482, 7746, 4115, 2999, 2612, 4995, 3953, 3673, 5510, 3148, 2226, 2156, -8675, -11095, -8072, -5533, 106, 2039, -445, -2588, -4243, -1879, -5043, -10507, -14696, -10515, -11919, -6162, 1109, 4135, 3480, 7115, 6120, 8078, 8217, 4528, 2476, 4178, 5702, 389, 467, 2845]
16618B845K357p331k763L284L921l348J79J175J773j525k212k86P954L569l664
16603E928J969o377K99O399J927l563k577J100j088m714m019K104O479K876m031
16588B712l676m230m729J779Q77K839o259m168k957P077O768M575M47k45q949
16573h139n54M093L283K696m582j768O302R67M900p501m020J089J289p288m216
16558a3449M573R896k079o506K072N556M371N737k240l362l770l89N77j438j26
16543e77L799M514J247p039k592j452l382P61J173k732n305m326K477M27m92O761
16527f738O962M43P006l164k578k312O508J536n121p07J026Q00L86o95j880nm845
16510c378j780R55o3l697J001N010n86n665n052j847J170k870L776j518J036K808
$$ y = [2845, 5202, -2129, -4892, -1608, 2313, -1035, -856, 319, 2092, 567, -1645, -1931, 6023, 9592, 5928, 7897, 1520, 1819, 8218, 10145, 6582, 4005, 5105, 4017, -697, -4716, -2612, 3867, 6743, 2712, -964, -5194, -9923, -8144, -7267, -4428, -10687, -14855, -17812, -10735, -3967, 608, 1055, 810, -8139, -8693, -4600, -1317, 1379, -3203, -4971, 1331, 2298, 7198, -303, -4323, -3234, -1945, -9233, -13449, -8876, 1020, -1059, -7565, -5493, 63, 4434, 10171, 7931, 4569, 799, 410, 987, -451, -577, 3222, 7736, 8983, 1944, -648, -2100, -5482, -4721, -3548, -6280, -11585, -15911, -13434, -13007, -13499, -6738, 224, 667, 7673, 4509, 1931, -381, 6127, 7663, 2542, 1835, 2861, 3661, 4047, 3352, 1472, 1467, -3378, -5158, -4203, -4266, -7963, -6962, -1952, -2538, -8203, -13255, -15102, -13932, -16802, -13026, -14544, -13508, -10700]
16494a0700J690N680M228R18l248o811l420K141Q926L508J411k108j893o214K036
16479c856j266L049P836p0j40j794K606m923q699M63L502M176m047k156L218L705
16463A604j127J812L114L80n646m52L929k099n443K449m639k330k639j075N390
16448f772j593n221L287N204N799k536J568P966K033j171l371m499k838j547j860
16433e551J532K094j875K301J043L99m48J228n4l693o333j510L378l612N40J455
16417i106o551K374O457K133J758n278L588N013K603L931j77l271j640L277L373
16402H484n584M48M736J280l036m473p78M17k573j724M817K525K096K887j972
16387G550k832l472j955K67k451m022K639l929K497L890l501k638L0L547N69l428
$$ y = [-10700, -9010, -3330, 898, 1816, -1432, -8243, -11663, -9522, -596, 2912, 4323, 2215, 322, -5892, -3856, -5122, -2073, 5763, 5693, 5553, 3759, 6365, 1442, -7257, -6794, -3292, 884, -3163, -5319, -2101, 1604, 477, 2289, 5403, 5783, 137, -315, 3614, 1515, -3928, -1479, -6118, -8448, -11087, -12162, -6772, -8365, -13586, -10299, -5095, 704, -1832, -264, 7702, 9735, 8564, 5193, 694, -2144, -3691, -5551, -4019, -1925, -3800, -1499, -456, -57, -505, 723, 669, -3024, -9357, -10867, -7489, -11101, -10561, -9106, -15657, -13283, -6826, -4693, -2935, -8213, -4625, 388, 2991, 6922, 6745, 3474, 1834, 5111, 8484, 2900, 3348, 8084, 9364, 6328, 1855, 1077, 1494, -1079, -2803, 2014, 4539, 6635, 9522, 7550, 4718, 1246, -709, -442, -2893, -6915, -4276, -8205, -5708, -1818, -5319, -7957, -7927, -4380, -3811, -7239]
16371g239J861J598k229m293j751j74P47L04N139L835l400L883K736o786M176
16356a593M326o53L565l999j0180l179J004k400k735k486P646J0788K121N283
16342G508j426J292j721Q64O53L5J079j66l781q586p522L605J0456J089J16p84
16326B711q691l510m456R732L04n24M3r740k298M524J330K708J242n04M350N421
16310B642L942L656J257p247o888R75P4k321K424O847k373o53L627n477m122k458
16294f095K748K923O632N210k665M489j347K55M137O32p967J730J094J874j643
16279A2007r95o960p426p49k796N461K201m325o2L969K822O520l027k656l998
16264a4k709M102M806n072k48k393m180O84m781k428R005R246J798k90k301O71
$$ y = [-7239, -5378, -3780, -6009, -10302, -12053, -12227, -11480, -11176, -6037, -2202, -5602, -1719, 1017, -5769, -1593, 2733, 2080, 5645, 1646, -8534, -11713, -10709, -13109, -15844, -18330, -10684, 104, 2225, 7508, 6082, 7374, 5653, 6517, 7170, 7205, 8284, 8118, 4337, -4249, -11771, -8166, 2290, 3379, 3495, 2711, -5980, -9490, -13946, -4214, -3910, -4434, -4391, -14131, -16429, -11905, -10575, -7867, -6625, -7129, -2779, 2642, 6584, 10240, 11497, 4250, -2638, -1663, -1589, -3910, -1486, 5361, 2988, 2335, 5962, 485, -3637, -6095, -3347, -424, 6208, 11418, 8753, 13242, 11895, 12150, 16287, 16919, 8952, 10682, 11776, 13650, 12007, 11012, 4052, -3374, -4123, -6919, -1458, 743, -3582, -3644, 325, 3147, 9667, 6640, 3984, -14, -2723, 1379, 6185, 1113, 865, -1528, -5708, -5024, -9805, -12233, -3228, 6018, 7816, 7526, 5225, 5896]
16248E896l569q446n178J0764L449m348J888R10M29n530q659K251L215j994j653
16233a0575N984R919O8j913m262m391m340L812M151m509n683L31k345k078k53
16218a6084J852M341O000R27o104m128j311M408L773N824J0738K279k433K030
16204A2112m351j904L079l721n241L31J765k512m151J050L937K512m06k408R53
16189A045K165J316l178k229q49m974N27O06J118R41o947l606L941M002J121M35
16173d566j147J029P24K818J070j666k297j201k533P31k895L272J938J676Q8q267
16157a1226n448J0852Q054M616r24m178l937j010J209l12L663J830N90J914k780
16142B913j055l961m458K37N465j000j314m733P35J0132L997j926M645n10n921
$$ y = [5896, 2327, -6119, -11297, -533, 2916, -1432, 456, 1366, 1795, -3735, -12394, -10143, -6928, -8922, -10575, -4591, 5328, 5396, 3483, -779, -5170, -9510, -5698, -1547, -6056, -11739, -11408, -13753, -15831, -16084, -14232, -9891, -3891, -2964, -9068, -13196, -14507, -10099, -6326, -502, 10236, 12515, 10082, 12112, 7761, 5857, 8936, 5215, -26, 305, 2070, -442, -4593, -3543, 394, 2906, 2500, 92, 1045, 3210, 4526, 1348, -881, -1730, -6704, -6177, -5571, -4453, -3512, -10459, -14065, -10124, -6122, -5001, -4566, -5713, -4684, -3960, -1142, -72, -1738, -4035, -5236, -7769, -7038, -9933, -6661, -4723, -3047, -2959, -11226, -16674, -5822, 2232, 6848, 5924, 1746, -2191, -3201, -1992, -2304, 1359, 3189, 3779, 5693, 2913, 1858, -2103, -6561, -6324, -859, -1859, -3173, -7906, -7171, 2961, 6958, 5032, 9677, 9167, 3246]
16127C246l133J791K682l853k903N940n48q95n28N40m822p224m21Q205O584j660
16111C001q54M03M9R88o018k951q89N60n353O170N585k814l302J162K024L467
16095A228M156J626L67j58k959r664k890R871M123n677l65L634k397k808j003
16080b916K448k331O518M535J06l075o132p385j709M046L979J668J773L045N761
16065A0331n53L183m68l045l669J876j21p901k904j213o82o38k541K678K073N7
16049c537K998K199N263n665p420j084n43L742N643L948M528n368o915p772O263
16034c720N495j590n21j426J81l6M649M228N02m351n15N0o37k677n157k07J126
16017d606j582K20K274m034K248L442j929o459L42M675J802j746o021J331N730
$$ y = [3246, 113, 1904, 4586, 733, -2170, 3770, 3222, 2327, 1799, 2339, -2483, -9707, -10128, -1923, 4661, 3001, 2147, 2550, 2599, 3587, -2431, -5382, -6271, -5711, -11064, -4894, 691, -2123, -5425, -4263, -2239, 1228, 5384, 7010, 7377, 7219, 4260, -5404, -8294, 1577, 5700, 23, -342, 3292, 895, -1913, -2916, -468, -2799, 3719, 8254, 8360, 5285, -847, -8232, -9941, -5895, -1916, -248, 1525, 4570, 10331, 9778, 12961, 12493, 9448, 5779, 7655, 7534, -367, -3271, -4484, -5166, -5804, -8345, -5667, -3594, -3537, -539, 1660, 6923, 1258, -6162, -7246, -7789, -4047, 1596, 5544, 10072, 4704, -2211, -9983, -3720, 1775, 185, -336, -1762, -1581, -1617, 3032, 7260, 7762, 3411, 2896, 2946, 2309, -368, -5525, -5732, -4606, -6188, -5968, -3694, -7728, -5480, -2038, -3967, -10426, -10084, -5409, -3607, -5353, -11374, -10043, -4313]
16002d313N028K170p20M559L423j866q383l403L613o063K075j181J186j73l130
15987g178O536O440k867l755O16K634J956n220m661j534j731J567K277J058j221
15972e083J205K707O529K842j074n548k174N703N561J270n16q77n477q395m104
15957g431K614K032J348J041P80J489L878l956r105l788N979k971L63Q27K296
15942d604N396k61k640J721M2N412l505o349Q90L943k333J046l029n085K228R17
15926f211L697K514L472K356j657j776k582L391q87k296K257L65j711L171J952
15911F055m361o456k130M857K471j001L897J822L11j439o034N82J061L446j158
15896A923m958L362q89o822j40L306M707r270J661N917N800J080M006L677l722
$$ y = [-4313, 715, 2885, 2165, 6724, 10147, 8281, -102, -3505, 108, -5955, -3880, -5061, -3875, -4048, -7178, -642, 5798, 2931, -824, -208, 2426, 4382, -838, -5499, -7033, -8764, -7197, -4920, -3862, -5083, -3878, -1171, 5358, 8200, 7126, 1578, -596, 5107, 10668, 11938, 11422, 10545, 5068, -3327, -7431, -4817, -2785, -1437, -396, 384, 1873, 5751, 1795, -7310, -11098, -5119, -8090, -7727, -6900, -4604, 792, 531, -2109, -388, -346, 5066, 1561, -4788, -3898, 45, -2288, -1242, -4271, -9356, -7128, -6211, -2514, 0, 3472, 5828, 4171, 2395, -187, 3204, 2317, 21, 2278, 2643, 932, 4103, 6055, 1694, -4762, -6892, -2035, 436, -565, 3332, 5154, 5465, 4026, -2008, -1426, -365, 3081, 1923, -3035, 327, -562, -7384, -7524, -4218, 489, -8781, -7120, -1203, 4597, 5677, 9683, 13360, 9638]
15881I638l529l900k169L095N022m628k923R70k563l289j522L986K097l33m787
15866d835m944l958o915L624M340k653M301N645L167l048K459M749m925j546J796
15851b743j757j035o51K450k99j510l105k904m55Q53L621M327K450L973J985j906
15835C294k367K293m916J043K171K872j233j657K292o107m825M681L894l62J256
15820B329R4n709l572q096L36J965K189K741O810O624q26L234p911Q60L383k70
15804D181k125j040j894j539L265L334m582k758K604o586m431M701l897L649M601
15789b517L515k367M279j34j647l996J339l916k081n549J607J571M904K252k832
15774e572J703Q700P087m748r147P33L297k945o923N639N309j924j993J051K785
$$ y = [9638, 6109, 2209, 40, 3135, 8157, 3529, 606, 1576, -987, -4276, -5798, -1812, 285, -48, -4835, -9779, -13737, -20652, -17028, -12688, -15341, -11040, -5395, -2228, -5276, -2817, 1932, -2993, -4539, -2743, -4500, -5535, -6186, -3736, -4035, -5545, -8650, -11554, -12009, -11156, -7535, -3208, -758, 3215, 5200, 3294, 927, 3220, -1696, -653, 1518, 4390, 3157, 1500, 3792, -2315, -7140, -2459, 1435, 1073, 2329, 2423, -3286, -6858, -14954, -14618, -12653, -10464, -7723, -913, 5711, 4885, 8119, 208, 1068, 4451, 4181, 2056, 1016, -878, -2417, 848, 4182, -400, -3158, -554, -7140, -11571, -6870, -10767, -7118, -2517, 998, -1369, 2910, 2776, 1129, -2867, -1528, -5444, -7525, -13074, -11467, -9896, -4992, -2740, -5572, -3869, 4831, 11918, 7170, -1977, -1244, 2053, -892, -7815, -2176, 3133, 1209, -784, 267, 3052]
15759C052P545l814q508j95m926J082Q73Q97K318k027J611k817L0k696J533N314
15743g28j013m335L790j866M338K62Q9J239j925K86N631M925J501o073l573L628
15727F176j439n964j746L528L563m895j064K9o22k445M020K134P72k36k677p76
15711a642P340O3j35l756j150Q96o459m726M358Q202p007m328M844O460l542o22
15695a204K717m7o884J208l783m637K574M27K694n28k055O538N587o07k019m843
15679d862J517K521n799l635L04M074K305q60K05n69l20j38m828l613N61M783
15663h354P294M348l631n428m025K365m001n955J0712K232J799P67M578K26o611
15648c684j44K408M627j451L37J999n939n413R939N477n904o490r36r78l268L119
$$ y = [3052, 10597, 6783, -1725, -1920, -6846, -5764, -4891, -3994, -1676, -3703, -2092, -4909, -4879, -7575, -6042, -728, -1741, -6076, -2286, -4152, 186, 448, 537, 1776, -149, 137, 5768, 10693, 12194, 6121, 2548, 6176, 4737, -1227, -2973, 555, 4118, -777, -1841, -1812, -2434, -4879, -859, 1275, 2047, 1811, -866, -1642, 5698, 5761, 5626, 1870, 720, 1616, -4843, -9569, -5211, 2991, -4016, -8344, -3500, 2960, -582, -1204, 1513, 1466, -5418, -4210, -7993, -12630, -10056, -9629, -6935, -7463, -9518, -2980, 2607, 2000, -19, -4862, -3345, -824, -6623, -10258, -9954, -5880, -3575, -4435, -4230, -4799, -5119, -5257, -10085, -13698, -13137, -8354, -1060, 3288, -343, -5771, -9796, -7431, -11432, -17387, -6675, -4443, -2644, -1877, 2701, 2927, -3684, -3828, -1420, 3207, 1756, 2093, 4092, -1847, -7260, 2679, 8156, 2252, -4238, -5174, -6152, -9420, -6301]
15632f301j71Q08j38J064Q431N607m34m335J286p55n580n847M83m12k181L325
15616e150J437N659J435O816k545l445m720n06N19p2N01L598l212M059l470n326
15600d422O01L739L352m8m97j181n244P59o62J728J237p1n108M18L4q83K353L166
15582g29k149j519O80m540K346M184K717M804n023k387j027p69N243j816k896
15567b881M269K174J723l375m169j531J954j922m138J779j486m053k513j246j788
15552a7203n61K238K619K259J0644L918k525N390L977p29p395o060O2N429m367
15537b304N60N89o096l556L237L562L155r32L157M472k691n366k600p13j45l344
15521i015j689m880J195P129K817n67q05j051m809J408M766j592M808k51j92L680
$$ y = [-6301, -6472, -5664, -5802, -4738, 3693, 9300, 8866, 4531, 5817, 5062, -518, -6365, -5882, -6294, -8475, -5150, -3713, 1946, 3381, 10197, 7652, 4207, -513, -1019, -500, -572, -71, 3527, 315, 4374, 904, -4422, -3821, -82, 3270, 3222, 2725, 1544, -3700, -2941, -3603, -1875, -638, -709, -5817, -5399, -5365, -6248, -3895, -729, -2878, -4397, -3717, -8257, -5911, -1727, 990, 5794, 771, -1616, -2643, -3412, 1831, 15, -2881, 1388, 3562, 5285, 1910, -2259, -3790, -1836, -3758, -7896, -6117, -7603, -11656, -14169, -15415, -17203, -17764, -15526, -12907, -10648, -4, 3914, 1389, 6779, 10756, 10027, 2632, -3428, -3366, 2063, -2304, -1744, -1155, -7251, -10807, -7570, -4008, -853, -1785, 1372, 5844, 3153, -2213, -4813, -5526, -5671, -9015, -10704, -15584, -14389, -7260, -4443, -5010, -5815, -6866, -11675, -10267, -5501, -7093, -2285, -2536, -2728, 952]
15505I52O05m113K14L426J562p25l116l805P305L786j736n90j495n946L452l357
15489c581N353Q181q857m753J102n276N234j13j574j787j138l089J564n541o87
15474a4962K129m32O25L742M679N007j162J360M207q44l648l416L078k674L061
15459G50P40j680m358M103K512P19J264m134l577J362j568m087n139J385O893
15444d815M041o049j299L151J134L505J057m32k05L833m314J048R30M674Q89N626
15428A2774K693r777O66p9n849o524K348Q1O10k160K747J646o435k119Q421K694
15412A737n399k675j397K908J625K670j097o393j649L667K11j53Q18M56j805l379
15396i855n363M666J052L780L345R80n224j0491m094R533R684L89LR885L230m823
$$ y = [952, 1557, -2556, -2342, 1084, 2646, 1921, -1195, -5000, 2305, 6091, 4355, 3765, 2270, -3676, -224, -3581, 1772, 9953, 1096, -3657, -2555, -7831, -2597, -2710, -4284, -6071, -7209, -10298, -8734, -14275, -14962, -12833, -13265, -12640, -8898, -4219, 788, -374, 986, 5193, 4349, 701, -2715, 363, -2311, 750, 1490, -190, -4548, -445, 2067, 2786, 4050, -84, -3661, -2299, -3867, -7954, -13093, -11708, -4815, -774, -6823, -8122, -4971, -3837, -332, 725, 293, 88, 3921, -393, 655, 1585, 6259, 7148, 12774, 15467, 5690, 6356, 6277, 428, -6096, -3748, -3667, -3057, -5217, -2470, -824, -7259, -9378, -957, 1737, -3662, -6337, -7734, -4826, -3201, -531, -1628, -8021, -9670, -6003, -5792, -5945, -5127, -4671, -6476, -9855, -15218, -10552, -9500, -5720, -2375, -1395, -6619, -17110, -21204, -11671, -1987, -1598, -1595, 8290, 11520, 6697]
15380F697l796j461M7L794L794j766o928j816J676j534j410o38M588J163J884
15365D294P13l064j370r31L184L477l778J160n946n13J790o076O785L45k452k166
15349d548k706k036k249O137n63l447P24O600P18j625k759j209M45K266K420k89
15333b121j542J636p00m270j598K285P580J146k445m201M412N216l163k258j819
15318a842K227L031N085L678j516p411m749M130M837n822q651K976J279P2q84
15303c560R94K288J968M95L796N535k492m056o281o631k170N367P52K842K326
15288A173L244j613m678J030l511j017j738O339k337J999j957j404N157r30l03
15273e46N17R45J057N736J781K503m487m066J156n838l333l145k31R86J579O13
$$ y = [6697, 2901, 1440, 1487, 5281, 9075, 7309, 381, -1435, 241, -1293, -2703, -3341, 1247, 2410, 4294, 5007, 1943, 573, -358, 2826, 6303, 2525, 3685, -2261, -2774, -984, -7060, -275, 70, -2382, -4548, -7254, -9290, -11539, -5402, -5965, -9412, -8688, -2088, -1370, -2995, -5754, -6963, -6518, -4252, -1832, -2121, -3663, -2027, -2727, -6997, -8595, -6310, 1270, 2416, -29, -4230, 182, 5398, 2235, -23, -1842, 385, 3416, 8501, 12179, 10663, 3252, -1497, 2633, 7470, 1648, -7003, -4027, -2748, -2676, -3560, -2566, -278, 1690, 2185, 5981, 11516, 9024, 4968, -1313, -7944, -10114, -4747, -3995, -1153, 1173, 4417, 2804, -1874, -844, -4355, -5372, -7110, -771, -3108, -1109, -3066, -4470, 687, -243, -546, -29, 916, 1973, 7709, 9490, 11993, 7506, 3440, 4596, -1242, -4575, -7720, -7951, -6965, -5386, -4773]
15257d773n597k848J656O743J08L40K196J156J631O138J84n817K753o18j425J377
15241C204n36P33o074j580L198N842o759r79k415o65K431K444l526l820l44M469
15225d377N60j578L50L226P748M181l543l8j923L578J988J2J740k20n189l111
15209C404k35k280j529J657l168K838J078P79j689O261J127n156K29N38j08m181
15193d35o80O576P372l371P83k856q958k584O02O72K606l841n429k860J661J007
15177i735K534j103L965J004k832L901O354l664k857N27jl295m291J959m2m024
15161a1600N545M048k380O68L015J170L163k1J957j458j976j66M40n163k094P376
15145B524O07q056k738K874O58M678O915l236l407q42n04L220J794j85J921Q03
$$ y = [-4773, -10370, -13218, -11562, -4819, -4711, -4371, -2175, -1019, 612, 6750, 6934, 1117, 3870, 3252, 1827, 3204, 2668, 3401, -2673, -4253, -1055, 4787, -1972, -2951, -5366, -6031, -3600, -1156, -4682, -8502, -8846, -4377, -3817, -5395, -5045, -1819, 5929, 10110, 6567, 6529, 4606, 8184, 10172, 10184, 11924, 11704, 6515, 3404, 3169, 889, -640, 1017, -2151, 687, 1765, 2544, 855, 7116, 8243, 3087, 3316, 3854, 3746, -435, -1115, 5461, 12833, 9462, 10245, 7389, -1569, -4153, -3551, -2879, -273, -4114, -9543, -12403, -10742, -9735, -7201, -8304, -4339, -3335, -6167, -2266, 4088, 424, -2433, -1906, -1907, -5202, -9493, -7534, -7576, -11600, -6055, -2007, -4387, -3719, -704, 466, 3629, 3608, 5565, 4107, 2131, 1965, 2405, -2758, -4852, 2524, 3131, -4925, -7663, -4789, -4131, 547, 7462, 4226, 819, -23, -527, 2693, 4487, 4302, 6223, 7026]
15129G026l171n494R49j33o677L178J919J261l903p411K894O878L114P80m334
15114c124m945j833j836m189Q42K719P900o79J833M376O78N35K298J709p518J466
15098B32O412l694m487J423O60J041J330L14k58q35K68L504J201k146k957L185
15082E193p187n218P30J77K316n55N333q451q7K289r844j532O999O328L577l349
15066c281m478j056R226J662m025N925j174k107L559L782l868n139n693R214J717
15051D264p579K949j114j14M956n446k462Q989O474r05N871k886j0103n769M960
15036B085J156j858M929j820o397n490k188P695N607K0m87j132J073M580j683
15021F090j142J954K14J202p418j248k845K499r82R22J038L481K295j028k997
$$ y = [7026, 3855, -1639, -690, -823, -7500, -4322, -2403, -1142, -5045, -12456, -9562, -2684, 430, 1210, -3124, -8069, -9902, -11738, -15927, -15085, -12366, -4466, -5145, -3312, 1064, 1742, 2277, 4575, 6284, -1234, 232, 6644, 2950, -1537, -114, 546, 1587, 2917, 3231, 2973, 2138, 2406, 5910, 7111, 4965, 2008, 5193, -1994, -7212, -6482, -6305, -3989, -4544, 789, -7662, -7749, -5460, -15304, -16836, -9837, -3509, 68, -3281, -7759, -8815, 411, 2073, -1952, 3973, 2799, 692, 4251, 8033, 4165, -974, -6667, 2547, 4264, -3315, -366, -1480, -1594, 3362, -2084, -4546, 4443, 10917, 10012, 15883, 12997, 2894, -2875, 2085, 3241, 1383, 6312, 4492, -1905, -7395, -9583, -1888, 3719, 3739, 3252, 2120, 3193, 7773, 6090, 4948, 6902, 7116, 8318, 900, -348, -3193, -694, -1676, -754, 284, 3765, 6060, 5032, 2035]
15006B035k956J965L205J122l185m447n679l864K519P523O182j666j907r64j399
14991a516M585j636l535K83J375j676l158n923P10J0183L411k711k080L929j446
14976G95Q65k790k354P520L104l131J727j793j1255r89O254O919L870k31L040
14961A1551k901m556m191q211k523Q565M977l370J884p54L191L593m330o468J378
14946b165M759M866j606l502k600N618M457R42j702m181J427l66m186j298j170
14931g07K046m057K32K500K502K236m457n859L575J879Q300K385k183m928J086
14916D550L177l283J922j51j723l064l514j692N671O026K4j794o443o258n157
14901a1709J828L631J5j017J042l09N811M002J646j117o093l552Q165J391k97
$$ y = [2035, -921, 1044, 4249, 5371, 2186, -2261, -7940, -11804, -9285, -1762, 4420, 2754, 847, -117, -1516, 3069, 1433, -2102, -1819, -444, -2120, -5278, -11201, -10491, -308, 3103, 392, -1688, 2241, 795, 1660, -1130, -3484, 4036, 7140, 4009, 5736, 3943, -7312, -8301, -2047, 4872, 8742, 8511, 11551, 8650, 4094, -97, -8308, -10831, -2266, 2711, -659, 1225, 471, 3662, 7255, 2925, -3543, -2165, 2594, 7460, 5854, 2352, -248, 5370, 9827, 10769, 9067, 4886, 6313, 5947, 1761, 463, -707, 1339, -2718, -2486, 14, 2516, 4752, 295, -5564, -1989, -110, 8190, 10575, 8392, 3464, 4550, 7727, 4444, 6366, 6215, 4492, 1428, -2086, -3778, 1893, 7919, 7943, 6149, -294, -6552, -11709, -9881, -6250, -6235, -7252, -6210, -6519, -708, 3294, 4940, 3823, -2270, -5822, 2343, 3734, 3437]
14886C437j959n249K785k427l598j431Q51J550J997n195l820J49Q40L704O574
14871a792j442k377K991N405L442P454k188n890p372R51L77l872m489O68N311
14856b823J503K101M446l251n146o91K156O161j046J975j27K03m505l59P8j85
14840D90J184Q708j050K08m577j350m57k866l124J268P83L144J260k146k179J193
14824D89n115q028j341Q934j969m940M305K182N01K035J294k428r68k911P293
14809f67M727j067m08K783k994Q77j421l723j902M18J821J687n841K822L015N69
14793F96j00l254k519J024M257k386J490L764K446l9k275k868K642K713l037q803
14777f249k305O910N545n196q662L210L916j772l926J585O315L281O036J213o061
$$ y = [3437, 1478, -3771, -986, -3413, -7011, -8442, -7591, -6041, -4044, -9239, -13059, -12910, -12070, -8366, -1792, -3234, -5611, -2620, 2785, 6227, 13681, 11493, 5603, -1769, -818, -441, -4313, -8802, -8134, -2823, -1320, 781, 5227, 1976, -3170, -3861, -1705, 4456, 3410, 5385, 5258, 5461, 956, 597, 675, 490, 1674, 10382, 9332, 9540, 4963, 3613, 3156, 290, -2834, -1566, -783, 2361, 3621, 1475, -704, 489, -4626, -12654, -13995, -5061, -7030, -11970, -7665, -5483, -4982, -2947, -1653, -4081, -5049, -7960, -667, 4060, 2993, 2585, 5368, 2374, 3251, 1830, -1893, -3795, -3377, -1556, 131, -5710, -2888, 127, 696, 596, -2658, -5177, -4153, 104, -2282, -792, 2972, 5418, 5379, 3104, 236, 2878, 5591, 2554, -6249, -8554, -1644, 3901, -1295, -9957, -6747, -2831, -4603, -8529, -6944, -629, 2652, 8688, 9901, 3840]
14762C840p125J583M052J715k510j844m105n101O247K595m376J613M373M260l15
14747D902P69o349m582l8K424N225k012o990K546J421k13q843j547L520O571k159
14731e355m48p52J781J377L95M017r56M705o35N273k572j1414j944K126K992L630
14715B220j00k531l464j563N074m152p598M128P966K220p690j074J866J418O518
14700C238O63k513n681l87J127L459j919j398l16P070K067J633l712j805m065
14685b539J38L540L866K935j513j893o432l905l92O536J86m346j270J915L521
14670C47J732J111k560j427N844M42P065j424m528k145m441m202K86j249L087
14655b062M012p22j845l375L238M125j682q032k476n64m24J278L942R72L95J634
$$ y = [3840, -3285, -1702, 2350, 4065, 1555, -289, -4394, -9495, -3248, -653, -5029, -3416, 957, 5217, 4902, 5671, -678, -5260, -5298, -2874, 2351, 339, -6651, -4105, -2684, -2897, -11740, -13287, -9767, -3196, -5355, -5803, -6555, -4774, -3397, -3002, 1015, 59, 4764, 4129, 9402, 6830, -4584, -6528, -4402, -1410, 2220, 2120, -411, -3875, -5438, -364, -4516, -12114, -7986, -20, 2200, -5490, -6564, -4698, -3280, 3238, 3901, 1388, -4293, -4680, -3553, -94, -2013, -3411, -3727, 3343, 5410, 7043, 3331, 1526, -2539, -2401, 1139, 5005, 7940, 6427, 4534, -1898, -5803, -6195, 341, 527, -3819, -5089, -3174, 347, 2079, 3190, 630, -797, 5047, 5489, 12554, 11130, 6602, 4457, 16, -4186, -3900, -5149, -2062, 1950, 1228, -617, -3992, -754, 3371, 1689, -6343, -8819, -9383, -9807, -8529, -4587, -3615, -3220, -1586]
14639a586K271K694J759Q219R83n116k066l111m69j702o034k158L758R052K688
14624I182m676m091l862K768j068q60N304K740k278o071n423k70J594r78j409
14609i398P94n025j034M772N043J279K226m513L938K807l811j009O502j821m943
14594d193l085j340N036M529q68o023L04l077M106j621L911M629k345o07M126
14579C482l902q959q84M69L209P000R584N91m547m195K731O410L81k352M61p484
14563A995o951K447N734M991m84l673l438L720K749K503M210p723o529j1616l160
14548a5225j997R214Q680J531K712q55p715k539k631P34M751N938j35j391N052
14533F124k739J29J695K18j016J291l473n543K165O191J699m085l440l85L371
$$ y = [-1586, 685, 3379, 5138, 13357, 14340, 9224, 7158, 4047, 3578, 1876, -4158, -6316, -2558, 6494, 9182, 4506, 415, -3447, -679, -1747, -2607, 2697, 5437, 3159, -2912, -8335, -8605, -7011, -7989, -9398, -8604, -13629, -14663, -9891, -4848, -3569, -1343, -5856, -1918, 889, -2922, -3931, 2571, 750, -4193, -7278, -8618, -3582, 947, 79, -5944, -5640, -8717, -4611, -6232, -2321, 2308, -37, -644, 3482, -420, -9379, -10263, -9794, -6585, 415, 9999, 10590, 6043, 1848, 4579, 10989, 11370, 9018, 9479, 1995, -4956, -2509, 3225, 8216, 7732, 4059, 621, 4341, 7090, 9593, 13803, 6080, -449, -12065, -15225, -17222, -8008, 672, 2203, 4915, 4060, -3655, -6194, -8825, -8091, -3340, 2598, 2463, 1072, 6124, 3385, 3514, 5209, 5427, 4411, 5702, 2229, -3314, -1149, 5042, 6741, 2656, -784, -1169, 2202]
14518B202M606l586l884J164m478q154LM755R790O734p865j635m733L08K693P325
14502E245R236k077K590l475q206K844j065q80J603k820m762n732k165j395r29
14487a1988P877P31O789n309l953r05k434J417M178O897j098k389R43O23J707
14472C086p133j628K599j44o509K813N495N149M174q747o069K824k297l6m448
14457a0871k290M98r49L403J0057L554M67J740k398m367p63k70l139K05N332P684
14441G893R46L045K978n737o817q61J716M256k954p788L070l1n215m8N519L105
14425C077J66K308n702n55J663Q653l428o592n869K80J0371m718o504l283N492
14410d641j341L897P055L069k3l893r25n738R1j08K85N449Q088k492m065k431
$$ y = [2202, 6808, 3222, -662, 502, -3976, -12130, -12127, -7372, 2418, 9152, 1287, -348, -5081, -4773, -2080, 5245, 14481, 12404, 14994, 11519, 3313, 6157, 5092, 4212, 5815, 2995, -1767, -7499, -9664, -11059, -11988, -4111, -3380, 3409, -1900, -5853, -6758, -9192, -7775, -3597, 3300, 2202, -187, 756, 1379, 3086, -4047, -5675, -3076, -3220, -9729, -6916, -1421, 3728, 7902, -845, -6914, -4090, -6387, -6423, -10871, -13161, -12663, -13612, -10209, -152, 3402, 3869, 5609, 3211, -1156, -1919, -2189, -5328, -5123, 209, 7893, 8839, 11884, 14862, 9125, 2308, 1447, 3163, 7419, 4465, -3323, -253, -284, -5499, -5547, -28, 3077, 3243, 5551, -151, -706, 957, 9610, 6182, -410, -6279, -5999, 4372, -346, -6850, -10133, -4641, -5982, -2085, 4970, 8039, 8016, 4123, 3198, -2540, -2449, -2557, -2272, 3177, 11265, 8773, 4708, 2277]
14394B277K172K736j362n776p720P306J583o222R06M990k344K659N334l454l433
14379c48J073J021o042l901L488M303k579n336m034P978K435M474o37k237k14
14364e56K073M079n61k607J22K131m236j1116J150J0061l396N376j939k087J052
14349d54K406k073j794N168Q50n30L097p07N108R8n770k588k87n92Q65j905M95
14332A387j263k644J114N342k010m998J289k514l265M337J712M59J554M628N22
14317E650l457n477j473N95J692J773K645r24K225k029N28k104o292k766Q043
14302a371L238M316L280n54l23M66l645j0373O075M946J853j035n375l026J377
14287a51J835p84O867O856m82k38l038l306k141m109j471k04r28o68l366k452
$$ y = [2277, 4449, 7185, 5823, 47, -7673, -367, 1216, -5006, -4100, 890, -1454, 1205, 6539, 3085, -348, 725, 1746, -4296, -8197, -4709, -406, -2985, -8321, -12355, -4377, -1942, 2532, 1895, -342, -556, 1517, 5596, 5035, 2428, 2550, 4681, 445, -10671, -9521, 540, -2856, 2520, 581, -1506, -454, 1952, -121, -1915, 3253, 4103, 3573, 6670, 5963, 11071, 11169, 5399, 2811, 2524, 1932, 2797, 892, 1387, 124, -2520, -1406, 3936, 1926, -3072, -1783, -4297, -7562, -3225, -1513, -1054, 500, 5128, 5650, 2193, -3284, -4757, -4162, -2470, -697, 1948, 1024, 3249, 1220, 1748, -356, -6648, -9414, -1371, 1867, 6183, 9463, 8909, 8586, 9052, 5407, -4966, 1109, 6055, 7908, 6873, 1498, -1528, -151, 1684, 900, 7767, 14623, 14141, 13903, 10865, 7559, 5418, 1309, -162, -366, -1294, -1962, -5328, -7780]
14271g780J487m288J879n95J68R425J212r99m147j927O311J995k186K603J877
14256E035k694n372Q99k604j835R530O66l116j563J23L258K644p71j135j660j63
14240A242M087j738j927p403J66M375K745M270j28j844k806o311J400L091j233
14225b014j64J266k232N232L030N399N904J335j0218j3116m186j282n45M662J617
14210e312j238K145J372J988J706J133m10N30J758O54m29m874j795L9J694j212
14194b251M373L450K957k37m55J311J1k541j833m169k081j174l890K12M915j628
14178c030J274K708K027j645q245N0K251k628L198r0J983Q41P558L48m536n099
14162c035k230O19k555m38j121m047m415M929O152K966j076K075J265k25K476
$$ y = [-7780, -6293, -10581, -8702, -9297, -9129, 296, 1508, 509, -3638, -5565, 746, 2741, 555, 3158, 5035, 2341, -3031, -2132, -4736, -6571, 2959, 3625, 509, -1054, -931, 2327, 4971, 4200, 3065, 1405, 1242, 5329, 3591, 1664, -5739, -5573, -1198, 1547, 5817, 5689, 3845, 1039, -5272, -3872, -781, -2014, -2178, -912, -3144, 2088, 5118, 10517, 16421, 17756, 7538, -5578, -9764, -11046, -11591, -6929, -5312, -6550, -4405, -3033, -1045, 661, 1794, 1384, 1914, 3672, 4326, 3897, -977, -2772, -2733, -1039, -2251, 2122, 5572, 8529, 8292, 7837, 9148, 9159, 6618, 4785, 616, -1465, -2639, -6529, -6317, -1402, -3030, -1756, 952, 2979, 1334, -6911, -6861, -4610, -7238, -4040, -4130, -2147, -1306, 6252, 6600, 2064, -3035, -5265, -4646, -7201, -7639, -8760, -12807, -17222, -12293, -6141, -3175, -4251, -2176, -911, -1136, 1340]
14147A340l450K985J741p240K133R450J923j002K3Q58K441L28m865l208K235n178
14131E14m249j988m337m747j058J735K822j39n316R54J0030J0361l131K474L442
14116G367r96m114M094l081J768N757L151n115j753M634m982M18l313m331r24
14101a420N571l370l536M548M295M420l182m06J577o400o285k78p98J016k6O67
14085c607K400l169J768M593K544p36J760R96p651J802k286k726j504l051r74
14070i841j046K170J424L278J214N982M932k356l548o221l846J31N54M30l269
14055a0012L295N306P403j897K961K856o87m127R13o367K124M638l475j439p91
14040G01R634n54m722n173l708k51l403Q03L535r31l090j635M329N964L854o589
$$ y = [1340, -2110, 875, 2616, -4624, -2491, 6959, 8882, 7880, 7903, 8761, 11202, 11530, 6665, 3457, 5692, 514, -3735, -5723, -10060, -14807, -15865, -14130, -11308, -11447, -16763, -15809, -5779, 4582, 1451, 3925, 7367, 6371, 2257, 6351, 3270, 5038, 10795, 13946, 8831, 7078, 11712, 6730, 7148, 3835, -496, -1420, 4151, 781, -2755, 1793, 6088, 10508, 7326, 6920, 8497, 2097, -4188, -4466, -5264, -4248, -4274, -3607, -1207, -4376, -2608, 1985, 4529, 3793, 5553, 6549, -1102, 700, -1586, -4312, -5816, -8867, -9841, -10887, -8717, -7293, -4015, -2801, 3181, 8113, 5757, 2209, -4012, -7858, -7727, -7173, -6743, -10012, -6717, -1411, 5992, 4095, 7056, 9912, 9225, 5098, 6011, -356, 1768, 6406, 2931, 1492, 701, 10335, 9781, 5059, -114, -3822, -4073, -7476, -6673, -3138, -4069, -7159, -8794, -4465, 1499, 5353, -1236]
14024a236q162L59j974L755P860j918k228N29N189Q66l635M055K157p83j0989
14009f155m772K358N687m902m335j291L222L409P856r8l925k408l792l121Q705
13994c562K894O211M382N50l91k222k862n669m355N089M552m037j430n316M558
13979a608j672N14j84L948K472k523N192M682K558l503j394j217n836l998Q44
13964a725K317p56K08m66j004O81N724R12j721K585N2j467O741o324r903m337
13948h483P38N080J334l810k160N830M85L60l830j427J093j351k447P96m067L798
13932h061Q196M235l062k477L710j266l321L56k487J45L111K869L45l302J829
13917H20L619m25k114k653j251r66L420L457L74l744L895L185n979j566k605l068
$$ y = [-1236, -9398, -9039, -11013, -7258, 602, -1316, -3544, -3015, 2174, 3040, -595, 3460, 5617, 4834, -6155, -10927, -8569, -2882, -7784, -12119, -13410, -10188, -6779, 1077, 979, -2946, -5354, -9146, -12267, -3562, -668, 5543, 9925, 10475, 10084, 7862, 5000, -669, -5024, 65, 4617, 580, -850, -6166, -1608, -3280, -2766, -2950, 998, 3470, 947, 6139, 10821, 13379, 9876, 8482, 7265, 1429, -2569, -1725, 592, -164, 44, -422, -1426, -745, 4979, 5891, 4170, 6755, 6807, 5340, 12081, 5757, -4146, -8483, -7745, -2665, -1331, -5141, -7301, -1471, -986, -626, -4456, -5883, -4790, -6141, -8588, -7792, -11859, -8061, 135, 4370, 1308, -1169, 2541, 1275, -2046, -1690, -4177, -4032, -921, 1948, 2293, -1009, 820, 4439, 4014, 1900, -753, -2004, -2970, 450, 3907, 4281, 537, 4432, 7617, 1638, 72, -2533, -5601]
13901e601J648M53q219L427M021q46j588N102m95l152M095K05l484O836L390m010
13885A782J268K783p97k561M313J535j168k680N143J3728J4847J3830J8373R987
13871H0383m600j2857j6457k0425j0986L73m306m626j266J386K901O20L397m377
13857I160k421n45p11l976k384J614K054j609p040K247j947L813L947J146n97
13842B751k769L710N015l713l06k598m39L02J671k006k435J966K001K295l711
13827A734k206J214l178N795J013k045k992k003k834L8R088L977j384n948m474
13812d205k750K071M085J531M162r90q87n195r6J852j28J337N21l109M930L449
13796F578m341j621J37k700J993m833J786k78p098K691O355K679M252o119l405
$$ y = [-5601, -3953, -3500, -11719, -8292, -4271, -5117, -6705, -1603, -2098, -5250, -1155, -950, -4434, 2402, 5792, 1782, 3050, 5833, 5036, 2475, 6788, 8323, 7155, 4475, 9618, 23346, 38193, 52023, 70396, 80383, 75783, 62926, 46469, 26044, 15058, 15431, 11125, 6499, 5233, 6619, 9520, 10140, 13537, 9160, 6739, 6194, 5483, 1507, -877, 737, 2791, 1182, -5858, -3611, -5558, -1745, 2202, 3348, 2751, -18, 3692, 8707, 4994, 4688, 2090, 1651, 1953, 3624, 1618, -817, 1149, 3150, 5445, 1734, -472, 742, -2436, 3359, 4372, 2327, -665, -2668, -5502, -5464, 3624, 7601, 6217, 269, -4205, -6955, -4884, -799, 732, 4894, 3904, 3017, -2178, -2274, -422, -550, 787, 1308, -1801, 3129, 6578, 2237, 616, 753, -1947, 46, -4787, -3001, -3279, -10377, -7686, -1331, 1348, 5600, -519, -3924]
13781c924l328N718j101J338L887k546k024P30L028L12k155L67K943k799O0P881
13765H387P8m131L91O537j708l744L68K600L456K604o085o115L35j532K464K133
13749F038j559m4K711k5J395m077k015j268o67J367N142N762K54m981n756K393
13733D670k009p587m001J947M306J906L093Q13j90k207l733L437J35l399J775
13718a044J609J027j904p86n44K213P38r293Q30K860m502K496O27p471q479Q240
13702a3383J1048N300l32r752l907J386j430N463M991l942P18Q18K373L50N475
13687E176j960m184K315J459O86O79l827k046o46M143M916K302J853k487m42L535
13671A1472q98n033m92R69m245n781q606j083O738N537P208n790m36M704J247
$$ y = [-3924, -7252, -1534, -2635, -1297, 2590, 44, -1980, -1250, 1778, 2090, -65, 302, 3245, 446, 506, 8387, 8465, 4334, 4725, 11262, 9554, 5810, 6178, 8778, 12234, 14838, 8753, 2638, 2973, 1441, 3905, 6038, 4479, 4435, 7146, 7121, 8516, 4439, 2424, 1156, 489, 1856, 6998, 12760, 13014, 8033, 2277, 4670, 2661, -4926, -8927, -6980, -2674, -768, 2325, 3138, 2948, 741, -2992, 445, 580, -2819, -1044, 565, 1592, -312, -1098, -1642, 571, 1309, -7984, -7154, -4294, -8796, -6300, -5673, -13144, -21623, -13383, -2335, 2965, 2633, -7119, -11026, -9640, -11070, -5607, -616, -4558, -3840, -3022, -649, -299, 5176, 3216, -968, 1347, 2806, 3492, 4171, 344, -1702, -2348, 1795, 6711, 9013, 10866, 8379, 7937, 11472, 10574, 5541, 5049, 6018, 1773, -4008, -12614, -13697, -6959, -1422, 5786, -4, -440, 4264, 5511]
13656E511J721o438k041M251j418l90K109j49L446m100K860M044m564K242Q87
13641G971m385n61K959L411q26j603m543N588q80K82j960J668J978o374o605M22
13625c458L562K858j575k620k28P10K250J709p33l67l104n706j137P430Q972L
13609H566q086K183K645n672l564J327L730M022o88p3l202r301j361M907P836
13594C269j054k004k597j23j444P57N686L010L987J072l67m954n559q225k682
13579a1228N662O78J658O436N220O03J373l087K952m614k506M851k453l891j140
13564E14J172k278j36q85r17k074J901O121J239Q24l388m775J13j733J531j249
13548d020K048M274L349J660O274n528n02o588j405K141j558K519L833n802J930
$$ y = [5511, 7232, 794, -1247, 3004, 1586, 1196, 3305, 3156, 6602, 2502, 5362, 9406, 4842, 7084, 7971, 3586, 3025, 5984, 9395, 8569, 6966, 2423, 8011, 7131, 7413, 5453, 7121, 9099, 2725, -3880, -3458, 104, 2962, 1387, -1233, -1461, -751, 1499, 3208, 2475, 2108, -996, -6702, -7839, -409, 8563, 8566, 480, 2663, 5308, -364, -3928, -2601, 1129, 5151, 4463, 4390, 1188, -8113, -9474, -4567, 3269, 2215, 211, -2386, -2509, -3953, -3196, 2490, 5500, 9487, 10559, 10192, 5238, -321, -8546, -11228, -5566, -4888, -3230, 3206, 8426, 9029, 10402, 7315, 10267, 5653, 3147, 7998, 5545, 1654, 514, 1686, -592, -728, -1613, -2530, -4604, -2703, 3418, 4657, 5481, 2093, -2682, -2569, -4302, -2771, -4020, -1972, 2302, 5651, 7311, 13585, 8057, 7555, 967, -438, 1703, 145, 2664, 6497, 695, 2625]
13533B625O532M964q099o623j129O686K526k036j334q69L744l929n751K333O730
13518F370K650m120J837N28L481P07n430m508k006M509M484k527k816p15J260
13503C704N846p66j658m661k540L336R021Q92q931j666j310L78k3l235N48K863
13487A798J366j971K759M980J509k077M64K571J999J833l859k10j337o337n779
13472b291o192K930N543L939j297j578L760k539k082P62j51k222O27N230m23o524
13456b508N7j736m124J002J983l843l422J366K542N446J0532p32L140r06J693
13441A0490k911k002k209n546J83k216M606P465j439k711k273j339J072r68N11
13426G13l011J89M231q39m658q34N500k247o394m038K236L729L191J924n522o80
$$ y = [2625, 9157, 14121, 6022, -601, -1730, 4956, 7482, 5446, 4112, 3243, 6987, 3058, -2693, -360, 6370, 9020, 4900, 6737, 7265, 10746, 11453, 6023, 1515, -491, 4018, 8502, 5975, 3159, 2444, 3704, 9550, 8784, 7126, 2465, -75, 3261, 12282, 13174, 4243, 2577, 1267, 1645, 1622, -1613, -1065, 1798, 3164, 1193, 3952, 8932, 10441, 8364, 8828, 11399, 13398, 15231, 11372, 11162, 9825, 3488, -2291, -8483, -5553, -10, 3929, 2632, 1054, 4814, 2275, 193, 955, 804, -1418, -791, 4439, 4016, -2508, -2451, -4187, -8311, -7309, -5326, -9169, -12591, -11225, -8683, -3237, 7295, 6563, 9703, 8797, 10490, 7579, 5577, 3368, -2178, -1995, -4211, 395, 7860, 6421, 3710, 1437, 98, 1170, 202, 713, -2298, -2109, 2122, 1283, -3375, -4209, 1291, -956, -7350, -11388, -9152, -5423, -2232, -308, -5830, -6510]
13410f510K155K504l58n591l014O0L312Q26r02J760L511K318L85k708K635J146
13394A529j837k549K353K811Q81k487l070J033N49P996M872m095j883J72j1168
13379d893r928P819M274O117N035n379l209j820m881j904J589L106j088L085Q188
13364F111L412Q69n85l343j806p694n699k520M880J390K109K253L104k206l260
13349b985Q891j457p808j197J403P065N732k298p037J049k51J821n025k245Q99
13334c443N663M830o685l432P50J56J575k264n502M560L952m7l415L90M289L985
13318E362j31l887n092L945N682M570j324j0706k655J299M412L275L288j0083
13304b045j374P277K275j108n388L70j660l329k680P582Q683L781j818k172J184
$$ y = [-6510, -4355, -1851, -2209, -7800, -10814, -10754, -7442, -6616, -7518, -5758, -2247, 71, 456, -2252, 383, 1529, -308, -2857, -504, 2307, 3188, 701, -2369, -1336, -787, 7209, 12081, 7986, 6103, 6275, -4893, -14821, -7002, -2728, 3389, 8424, 3045, -164, -1984, -6865, -8769, -7180, -4074, -5162, -2077, 6111, 9523, 10392, 9807, 6464, 4658, -3036, -8735, -11255, -6375, -4985, -2876, -623, 2481, 275, -2985, 5906, 4449, -3359, -4556, -3153, 3912, 9644, 7346, 309, 1358, 1107, 2928, -2097, -4342, -3443, 2220, 7050, 365, -3067, -2317, -2161, -586, -2850, -8352, -3792, 160, 113, -3302, -2912, 1377, 5362, 5231, 1344, -3748, 197, 5879, 10449, 9125, -1581, -4236, -2937, 1475, 4750, 8038, -2045, -3419, 3858, 6133, 5025, -363, 7, -1653, -4982, -7662, -80, 8603, 12384, 10566, 8394, 9578]
13289I578n861n111J069k331n629K765L608R46j985J33p21M01K291J469k915l029
13273e322j10k344L55K13N537K062k960m059O94l78M534P179L267J342p890p074
13257d954j39L878M607k016R95m2K111j317n489k618K080K362K432L933k026l300
13241D97r56J7o005j990L201j686m142N41J005M050p6P419j500m125L295n283
13225e738k618K177j494m435k257L57K442R144J300j764p23k596q88N768j491
13210b816l679m506L78l20J79r53k31L502O808L876J955J091k101k942n925j357
13194g041M367J137n457k313K681L31L840M33p11L646O19J497o39O573k327p771
13178a135l994P33L079j321L360J195r374l032M735O586O477l011q24M892j818
$$ y = [9578, 3717, -1394, -325, -2656, -8285, -5520, -1912, -966, -2951, -2818, -3539, -3138, -847, 622, -2293, -5322, -5432, -7776, -7421, -7208, -1671, 391, -2569, -6628, -5934, -6312, -1778, 5401, 8668, 10010, 2120, -4954, -5093, -1215, 3392, 1376, 2371, 2329, 4440, 3123, -2366, -4984, -2904, -542, 1890, 5823, 3797, 497, -459, -442, -6447, -8437, -5236, -6922, -11064, -10523, -9518, -5468, -5544, 1875, 375, -3750, -455, -5738, -8356, -6179, -7673, -12108, -14365, -14008, -11566, -2422, -1122, -2886, -3609, -6205, -7093, -1325, -2816, -6495, -11001, -10623, -10943, -10764, -11717, -11948, -8446, -1638, 2238, 4193, 5284, 3183, 241, -5684, -7041, -2674, -1537, -6994, -9307, -6626, -6295, -2455, -2022, -2733, 913, 1532, 3029, 2390, 8963, 6636, -1135, -5129, -4396, -1317, -2638, 722, 1917, -7457, -10489, -5754, 832, 7309, 4298, 3474, 8366, 6548]
13163F548m905J478L857l240n465r19L250O179k565m369r24J320M29M817p24l969
13147G98M581M884L551o714q248m846l446l815O819P787j627M152p43K521M483
13132A0137l951N096K399l83J535m793j161J592o750n764K118j181k054k991j38
13117f289Q53l833P640M428k557M998R184j866r078m465J994k310j562k516J937
13102c442r12k522j360N224L937p123m641Q170M331M49m79N424k700P89j924K959
13086F180N450j66k527o6m274j588Jp512k68J476k413M235M22j208M15O026K84
13069D467l568n20m195k028k847N699Q250N01K338j868n681J604K265k14K857
13054G060n67j277L824J154r142l574N29k143n242Q107O131j724k603l682M863
$$ y = [6548, 1643, 3121, 6978, 3738, -1727, -2646, 604, 6783, 4218, -151, -1075, 245, 674, 5491, 4767, 798, 5379, 10263, 13814, 7100, -1148, -5994, -9440, -13255, -6436, 1351, -276, 3876, 3133, 5654, 10137, 6186, 11282, 13681, 13298, 14833, 10040, 8879, 10471, 3721, -2043, 75, -1106, -3160, -6151, -6289, -5436, -9269, -1629, 2799, 242, 5240, 14424, 12558, 3480, -985, 1009, -1301, -2863, -5379, -3442, -4354, -6876, -8236, -3012, 925, -6198, -10839, -2669, 1662, 2111, 1632, 7056, 4356, 5145, 3221, 6180, 11630, 11464, 8937, 8871, 4597, 3009, 3010, -4502, -4770, -3294, -5707, -1472, -1050, -2258, -1843, 4183, 4467, 899, 379, -3816, -5844, -8691, -2992, 5258, 5759, 8097, 6229, 548, 2152, 4417, 4203, 7060, 6493, 5216, 9040, 10194, 1052, -2522, -1993, -4136, -9378, -1271, 4860, 3136, 533, -3149, 1714]
13039A714k168M05P388p519j57J177k905L521L919M248k556j686M522j571l410
13024D922j935R52j082n973M122L976L998j185n244M93k970q826N113O448O266
13009I075L28j0760k477N658J2068J745l395p012l303M553P616n42m913K275M15
12994A1331j976J869l239j1455j735L306l88j510K743O2L05M313N543K439k861
12979H747n611J707l997j968R798M044q338r223o006m34l034M184J760N542J841
12964i88o353J379M975j063j396l290J519q59M405l328K876O034K727P62n255
12949B145N67K966L9m222m41L41j688k604n580M760O521J393L470P34n535o45
12933B221N76k215O46N77L901k709k196j498n3L09J799O53m718O666l297l510
$$ y = [1714, -454, -49, 7339, -180, -337, 840, -2065, 1456, 5375, 9623, 7067, 5381, 9903, 8332, 4922, 2987, 3939, 2857, -3116, 1006, 4982, 8980, 7795, 2551, 3044, 74, -8752, -3639, 2809, 9075, 9403, -1357, -3834, 1824, 13892, 15637, 12242, 5230, 1927, 6480, 14096, 13554, 8641, 10916, 11331, 9355, 11224, 7985, -3470, -5205, -1899, -2287, -3797, -1054, -992, -687, 3626, 9169, 11608, 8747, 3136, 4843, 846, -1122, 8676, 12720, 4382, -4841, -10847, -11281, -14315, -10131, -8371, -2829, -988, -7341, -5962, -987, -2050, -3446, -6736, -5217, -6076, -1671, -4999, -2123, 3911, 6638, 7400, 2145, 2712, 5678, 5717, 1495, 1054, 1395, -293, -2897, -8477, -3717, 2804, 4197, 7667, 8401, 2866, 2221, 2797, 582, 1228, 1805, 5706, 2997, 801, -697, -750, -441, 1358, 2011, -2707, 3959, 662, -2848]
12917b848k071k226O212m28o38K7j162j959k472K526l10M711J39j496K476k512
12901b031K064K875J750M132l515o03K640J744n005l796K306J463l959N13K525
12886C103Q7N665J98m984j362j978j478q97k012K392P829j894r23m106O560R606
12870A5806j93n42k029o905k53k35N617p53J668r74j377N61j018l487j590m52
12854C844M917p36p336l641K638r21n381L624J408M186n751j212O05k504K800
12839c460M530K181J490k067j046q02r82m070N332R21n01M811J102l433M300L191
12823A1497j04p378o425M076M622j886m677j273L01M013J044Q540j360j673P59
12808A0076O272l185k109r228n59R07L94J459k243m42m937m984L835R727o870
$$ y = [-2848, -4919, -7145, -933, -1361, -1999, -1972, -3134, -5093, -7565, -5039, -5349, -638, -499, -1995, 481, -2031, 33, 2908, 4658, 8790, 5275, 4672, 7312, 9056, 4051, 255, 2561, 4024, 65, 578, 3103, 3190, 8855, 9053, 4069, 2707, 729, -749, -1646, -3658, -1266, 6563, 4669, 3746, -360, 6200, 15806, 15613, 15071, 13042, 6137, 5884, 5649, 11266, 10513, 12181, 11207, 9830, 10391, 9373, 5886, 4296, 3844, 8761, 8025, 689, -2952, -314, -1235, -6616, -2992, -1584, 2602, -3149, -4361, -3756, -6260, -3460, 1070, 3251, 4741, 2674, 1628, 826, -156, -4226, 1106, 2027, 1526, 6337, 7439, 4006, 8306, 11497, 11393, 4015, -2410, 1666, 6288, 4402, -275, -1548, -1247, 2766, 3810, 12350, 10990, 9317, 10076, 16348, 13163, 11054, 1826, 1267, 2174, 2568, 4027, 1784, 1342, -3595, -8579, -4744, 4983, -1887]
12793a887m689j102m319K890N864l43L860M861j030p409n203J70N686J175l21
12778a797k10N590j48K22k3l502l106M280O273p35j385J333j678o672l633m75
12762e666m572J734N608L821L096k905M97O50m561O518L202m640o925k106L422
12747b827J655M011o97L042L356M293m795j0269l597L723L037P015M069m942L491
12732A0565k636j437L922l364m318o279Q02N646K037L354Q5L179o216j970K279
12717E649K29Q19l278l568p227r58L733o168J156P603l740J888L098J376l67J124
12701A369M912m76m870o957Q890J1269o747j204n034k87N400K08P39j4k899l582
12685G17O252j222J40l662j624m650J317L104l909k448k589j388M65l725O400
$$ y = [-1887, -6576, -7678, -11997, -9107, -3243, -3586, 274, 5135, 4105, -3304, -8507, -8337, -2651, -1476, -1797, -2007, 3583, 3435, 3657, 3634, 132, -2974, 1306, 7579, 6844, 5459, 6792, 5114, -1558, -5191, -5666, -10238, -8504, -2896, 925, 4021, 1116, 1613, 2263, -2298, 4220, 7422, 2782, -4143, -6249, -2827, -1172, 2839, 2142, 5184, 8540, 12833, 8038, -2231, -5828, -2105, 932, 7947, 12016, 7074, 10565, 7929, 6492, 10414, 7050, 2732, -3547, -2745, 2901, 4938, 8292, 8377, 11556, 5340, 3370, 5649, 5878, 6697, 3419, -149, -7376, -8334, -4601, -10769, -9613, -2010, -5750, -3862, -764, 612, 245, 1369, 6281, 5805, 935, -6022, 2868, 14137, 7390, 6186, 1152, 865, 6265, 6473, 7212, 7198, 4299, 717, 6969, 5747, 5887, 2225, 601, -4049, -2732, 372, -3537, -5985, -8574, -9962, -9497, -13222, -6822]
12670f822P025J496K455L504o773n259K011l18J162P394R69J75m815k601K910
12655B513J005j447j567K151K74m996M435J864Q59j539j477l134m400j648K707
12640d400J24l485J417O647O349k330o5M291n923o18J741M994J340j778o969k905
12624a570L311j484l868M163N854n804p70L947l645m051J421J833k368P04L940
12609A613R98n171k319L161Q26q30L903k375k939J632p21j335r26o393l286j468
12593a5630L542J319M088L578M611M834J68j967k740J360J912l880l894J280k370
12578c789j91l310K047J186N526l173n551m830P97N086N629N879L882m011k683
12563B494q10k650K490k925r68M096m366K48J720j649o65K527k981J06L940J441
$$ y = [-6822, 203, 1699, 4154, 7658, 885, -4374, -2363, -2681, -1519, 5875, 6844, 7019, 2204, -397, 2513, 3518, 2071, 504, 2655, 2929, -2067, 2368, 4232, 5091, 3552, 2075, -1059, -5459, -7107, -4400, -4276, -7761, -6344, 303, 6652, 4322, 4257, 8548, 2625, 2007, 3748, 8742, 10082, 8304, 1335, -1570, 1741, 257, -3611, 552, 6406, 602, -168, 3779, 134, -3917, -2496, -663, -3031, -2327, 1613, 2611, -2560, -4879, -1718, -892, -1722, 2181, -194, -3133, -1501, -2222, -3557, -4483, -10876, -14162, -15630, -12088, -10769, -6681, -3103, 1508, 6342, 6510, 4543, 1803, 3163, 5075, 1195, -2699, -1419, -3789, -3980, -7290, -5243, -4057, 1469, -1704, -7255, -12085, -11288, -6202, -573, 5306, 9188, 5177, 2494, 1684, -966, 1524, -1401, -2369, 1727, -2639, -2391, -671, -2320, -2985, -458, -3439, -3333, 607, 2048]
12547B048l086K300J43m60j632l044K951Q239L363j592j801l03K603K003m969
12532F763r043l554P624N909k514k717O97k008j155l037Q17K906J740N37P31j407
12516B289l805M442m263n133J419P18L711K783j430L813Mk434l065M017K055K11
12500E332p81k646p06O365j513K29M619k616n623m691N77N035Q48m972M616N140
12484I213P56j43J34L189j347n244l683l666o721O393L019l951l392K34j614J573
12468e250k285j452k572L735L800K191l084J161P127K151o311L797N006o061n339
12453c386l157P1J0083Q742n42k333p26m188K84L240J694k619j834N15J658J656
12437I158q488k817O972K434J766O23N75kj636M271k406j0521l767j614J694Q47
$$ y = [2048, -1038, 1262, 1405, 945, -687, -3731, -780, 7459, 10822, 9230, 7429, 7126, 9729, 11732, 6763, -2280, -5834, 1790, 7699, 5185, 2468, 3165, 1157, 2, -3035, -2218, 688, 2428, 2965, 3696, 2289, -1516, 2926, -1337, -6470, -5051, -4333, -622, 2161, 731, 4544, 4548, 2114, -951, 3066, 5121, 5332, 4551, 1905, 1199, 7564, 6051, 6280, 10899, 8283, 2660, -2031, -1454, 3581, 4429, -543, 4073, 9213, 9969, 9826, 9960, 13149, 11802, 6558, 2875, -791, -7512, -1119, 1900, -2051, -5443, -5209, -6823, -5250, -7535, -8987, -11559, -7824, -4024, -1833, -4917, -3756, 3371, 5522, -789, 3008, 8014, 1953, -3386, -6543, -6472, 3611, 12353, 11811, 9478, 8752, 4564, 4848, 8088, 9782, 7163, 5329, 5844, 7502, 9158, 670, -2147, 4825, 7259, 9025, 9648, 10223, 10221, 8585, 12856, 10450, -71, -3838, -5452, -3758, -2911]
12421b911j040L964K951l746l038O368m46o219L7M579r9l313j481N106N960N591
12405A2263Q18k189j4270j0999l67R873L551L804J658L512K065q633p24M996o83
12390D675j543k873R35m442J593l270l56K079n115K477L901k635J068K485N72
12375d49o777m887P229M897k374j286p26j288J855K225O898P345l630o978N32
12360B586K769o18j30M22j833n696j6L706J47J599JN467M655j812n716j1976o899
12343a3344l614M317L274O173N354m926l993R122O023j460k012n69n055q407M485
12328d632J599O772J147K392K183J958j349p201j671p38n70K482k016J177P07
12313B240J94O36L003k979K066o50j873j788q16M318q220r15L170M439j186m222
$$ y = [-2911, -3951, 13, 2964, -782, -3820, 2548, 2102, -4117, -4080, 499, 400, -2913, -4394, 712, 6672, 12263, 13081, 10892, -3378, -14377, -14744, -4871, -1320, 2484, 4142, 7654, 9719, 1086, 362, 5358, 4675, 3132, 259, 1194, -3248, -1655, -4925, -5281, -3202, -8317, -5840, -1939, -4574, -3506, -1021, -449, -7226, -12113, -4884, 13, -2361, -3647, -4373, -5661, -3806, -1581, 5317, 12662, 9032, 2054, 2586, 5355, 4737, 4607, 5029, 3196, -2500, -2516, 1190, 1337, 2936, 2937, 8404, 13059, 11247, 5531, -6445, -13344, -16958, -12641, -9367, -3194, 2160, -2766, -6759, 2363, 8386, 6926, 4914, 4345, -710, -9117, -4632, -3033, 3739, 4886, 7278, 9461, 11419, 10070, 2869, 1198, 460, -110, 2372, 356, 1533, 2240, 2434, 3070, 6073, 3094, 5160, 4510, 2637, 849, 33, 4351, -3869, -4784, -1614, 2825, 1639, -2583]
12297b583l52n78k878Q701J008n827J3k638k403M739O934J835l126j693K405J7
12281C574L97j993J546n453k783j913J327N374j009m79L233M694o147k963Q093
12266E498R59o093K114K874M89k265n470J641O679n463l424m74J01k69K700K519
12250B116M829J0195J403o861j142j704l276j501r34N515k939M274L382m156r232
12235c1q38N82O64Q90K648j674j361r90n42M600K256k2l368p286j844l16Q39L757
12217b036m280M39J225K224K021n663k837N475M869J934R57k148K742j15m359
12202D48q85j409L088J043L076M747j967J25l297l163k398p00M36p43l137n042
12186i778m405J740O765j409j404l32R696K075o728N14k06L753j410j603l541
$$ y = [-2583, -2935, -3513, -6391, 2310, 3318, -2509, -2496, -5134, -7537, -2798, 4136, 5971, 2845, 1152, 3557, 3574, 3971, 1978, 3524, -1929, -4712, -6625, -5298, 76, -933, -1412, 1821, 6515, 368, -2595, 5498, 6457, 364, 2478, 5352, 5841, 3576, -1894, -253, 6426, 963, -2461, -2935, -2834, -3103, -403, 2116, 6945, 17140, 18543, 11682, 10540, 8836, 5560, 4059, 3125, 8640, 5701, 9975, 13357, 9201, -31, -869, -287, 377, 1267, 3915, 2241, 880, -110, -652, 3948, 6204, 6182, 2814, -4472, -6316, -6632, -5793, -2036, -6316, -5877, -4652, -2428, -407, -6070, -8907, -3432, 1437, 3371, 4328, 2180, 4922, 4807, 448, -437, -1846, 1242, 2285, 5361, 10108, 8141, 8266, 4969, 1806, -592, -1292, -856, -1599, -4736, -9778, -14183, -12443, -5678, -7087, -8491, -8823, 873, 2948, -3780, -3266, -3472, 281, -1129, -2732, -6273]
12171f273L197M625L248J128m508k622R18J89l493L576M378L689o028l385j571
12156b932Q05m218L99L977Q6J153R131K555k107k678p350j0510n54J1317O220
12141E294JL39q013k534O226J777m420q61M829q62N6O367M02q013J033l664K945
12124I02O33j037j73P6k32k288n682M281nn89J04P581l356k195l671k4P92j24
12106e007L058K43j492M78J986L297K865Q34J403o497m591N307L414J699J853
12091H850J152l200m240J546N910L73o385l476K076K496M731L432n157n052m07
12076B649J770j591l566N436k945l035L60K613m225m289R3L701L645K520p70m776
12060b410K571N908k346L557m426J389j158L985K511j440j882j523n57k551j156
$$ y = [-6273, -3076, 1549, 4797, 5925, 1417, -1205, -287, -98, -3591, -15, 4363, 8052, 2024, -1361, -2932, -2127, -6345, -5946, -1969, -1883, -730, 8401, 10956, 8849, 6171, -1179, -11689, -12243, -926, 5294, 5295, 5634, -2379, -4913, 1313, 3090, -1330, -2191, 2638, 1776, 1832, 8199, 8601, 588, 1621, -2043, 902, 1535, 498, 325, 401, 169, -2119, -7801, -3520, -3525, -4114, -4010, 3571, 215, -1980, -5651, -5675, -4883, -5007, -1949, -1706, -3198, -2720, -734, 2563, 5428, 6262, 7665, 1168, -3423, 1884, 5298, 6997, 8850, 10002, 6802, 2562, 4108, 10018, 10391, 4006, 530, 2606, 5102, 9833, 13265, 8108, 3056, 2649, 4419, 2828, -738, 4698, 1753, -1282, -922, 1691, -2534, -6823, -6730, -3029, 616, 3136, 2366, -2410, 161, 6069, 3723, 7280, 2854, 4243, 3085, 7070, 9581, 8141, 6259, 4736, 4179, 1628, 472]
12045D72M749N094p204k904n774l844N031Q915P981l292k078n812k288k165k95
12030c414J031k521L998K062l784m331K555n34J226k201M505P115M510J701N6
12015A1974k465p773R684M300o804l469j321L437J665o439l013r97l78l02l006
12000d907k433m295O20J0357K750M26M96M647m804m115K36l150L000n58n344o088
11984a3162M369J0942M275Q25j772q192n324Q785O989m208l487J738L360j578
11970C560j462O305m644q182r86q67O51O040m67l657O274O362J326l721o039J504
11954A997M699J212m456l22m188J74P15l250k67J615M374O356M576j102l139n420
11938C574P80o07j256j390l178O656M603O334K50k831p016n20q221m090K426P632
$$ y = [472, 5221, 10315, 3111, 207, -5567, -9411, -4380, 4535, 12516, 9224, 7146, 1334, -954, -3119, -3414, -2383, -4904, -906, 1156, -2628, -6959, -4404, -4938, -3712, -5913, -1408, 5707, 10217, 11918, 11974, 9509, 1736, 11420, 15720, 8916, 5447, 4126, 7563, 9228, 2789, -224, -1221, -1599, -1901, -4907, -7340, -11635, -11015, -658, 2092, 2518, 3014, 7661, 2857, -1258, -1022, -4172, -1172, -1730, -7074, -13162, -8793, 2149, 6424, 7249, 5477, -2715, -8039, 746, 7735, 3527, 40, 1778, 5138, 3560, 2098, 8403, 3759, -4423, -5409, -6276, -5625, 415, -52, -3709, 2565, 8927, 10253, 6532, 493, 1997, 6696, 7908, 3452, 3130, -1058, -884, -169, -3419, -3686, -2071, 2303, 8659, 13235, 12133, 8994, 3574, 4354, 3747, 2491, 1101, -2077, 4579, 9182, 15516, 15766, 12935, 5919, 5399, -2822, -6912, -4486, 3146]
11922C146K202o073n160n274N385K996j849K495L22J537l526K648m839j369r47
11907h306K128P570N52L506J785p224k390J306J261n445O976P575r27k456Q67
11892F778k308n585K316m94j204j141L820k240L619L36N045k3k431j566k272J593
11876D243N019Q71o148n451n912m612r78M762L609j087P531O223n194l858q86
11861a868K610k266n79K673K259k165j900J265j215l583r14M634Q643R790l97
11846A6987r866n093l243l904O9M575k220N85n07J776j55L83l561J773l78L161
11830C82m880o197L48L76L698O931J841k628L928K04m198k4K488m481r49M012
11814H51L940K412k216l218O99k193N29N4k477n110j943j299L777O37k77k10O008
$$ y = [3146, 5348, -725, -5885, -11159, -5774, -2778, -4627, -2132, -1810, -273, -3799, -1151, -5990, -7359, -8306, -6178, 1392, 1944, 5450, 7235, 11, -2379, -1073, 188, -5257, 1719, 9294, 8367, 5911, 6778, 4470, -1115, 1201, 707, -497, -1638, 2182, -58, 3561, 3897, 8942, 8919, 6488, 4922, 2650, 4243, 9262, 10133, 3985, -1466, -7378, -11990, -12968, -8206, -4597, -5684, 1847, 8070, 2876, -982, -1868, 742, -1524, -2103, 570, 2829, 664, -1236, 29, -1186, -4769, -5683, -1049, 7594, 17384, 16987, 7121, 2028, -1215, -5119, -5050, -475, -2695, -2110, -2617, -841, -996, -613, -4174, -2401, -2779, 382, -4498, -10695, -10347, -9971, -6273, 658, 2499, -129, 3799, 4003, -195, -219, 2269, -2212, -3161, 851, 4791, 7203, 4987, 1769, 2468, 275, 804, 858, -1619, -6729, -8672, -9971, -6194, -5557, -5834, -6044, -36]
11797c6l095n933k796L949Q13Q47M478M532k774J124O839Q25k487p721L298m87
11781A376j195l112m2O823N353n038p827L604O264Q90k586n34k180m370n306K161
11765e719M257K13J1212L055L1k938l302k270l862K405J280k716L718K582l379
11750D567j152l714O444M60N746N633l766m288M379l891j11m31J465R03l143Q42
11734I943K004k035N412L296m9O581J0362Q590O079M914J0537Q078K750J4278
11720I0740J2607n651q899o061r865j8371j5175m128m878R25J280p437o995J533
11706A9625J927j797k716p659j377L230J288l388p133k920JL092N246m274j348
11691A797l152J445M237L621j268K160K132p88J240J36m251K41N729j244o972
$$ y = [-36, -3131, -9064, -11860, -7911, -7098, -6251, -1773, 2759, -15, 1109, 7948, 8773, 6286, -1435, 1863, 1376, 181, -2931, -2973, 3850, 9203, 4165, -3662, -58, 6206, 7096, 4510, 3976, 1796, -2574, -7880, -5719, -1462, -1249, 9963, 13018, 13049, 10111, 6809, 4539, 677, 3082, 4362, 1646, 5364, 7946, 4567, 3415, -299, 6145, 6605, 12351, 17984, 14218, 9930, 14309, 10418, 10307, 9876, 11341, 12244, 9101, 9943, 11947, 9912, 15324, 18620, 18571, 25152, 35514, 44104, 50183, 55097, 65634, 73712, 76462, 90740, 103347, 97696, 88797, 82736, 72871, 54500, 39325, 35197, 30319, 31244, 32524, 25087, 18092, 19625, 21552, 19755, 17039, 9380, 8003, 11233, 12521, 9133, 2000, -920, -919, 2173, 7419, 3145, 1797, -1355, 90, 4327, 7948, 6680, 8840, 10972, 10184, 11424, 11560, 7309, 7550, 13279, 12035, 5063]
11676E063j455L51K761k507o728P18l544K850N963Q329l082k027L587P830K020
11661B0129n958l932p208n646j027K956J0204J395k759m176l748L599O429M506
11647A4764J284r489p272N303M108k552n693l554r20J147L898J048p761N68O29
11632d492M520M346K350P95l283R150L23k747M063P017M973m807l590J484P97
11617B0899J27r788m318k123K699K26%N040N40j017J685m406Q76M998O581j973
11601B0046k078j309j424J394J132l527p386k928L878M710L242j175p282l319
11587C974l67K772O08j073L493J979p016l848J681j035j805N969K354J498k233
11572F951j969m25j765k008M226J684l340K707N036K229q182k839j262R249O273
$$ y = [5063, 3608, 3959, 6720, 4213, -2515, -1797, -5341, -2491, 3472, 11801, 8719, 6692, 10279, 18109, 20129, 14171, 10239, 3031, -2615, -3642, -686, 9518, 10913, 8154, 3978, 230, 3829, 10258, 14764, 16048, 6559, -713, 4590, 8698, 6146, 453, -3101, -4021, -2874, 1024, 2072, -5689, -5121, -4492, 28, 4374, 6724, 7519, 4236, 13386, 13709, 10962, 15025, 22042, 27015, 22208, 18618, 20102, 20899, 21026, 11238, 6920, 4797, 7496, 7722, 7722, 12762, 13302, 12285, 13970, 9564, 10440, 15438, 22019, 20046, 17968, 16659, 15235, 16629, 17761, 14234, 6848, 3920, 7798, 12508, 15750, 14575, 7293, 3974, 3607, 6379, 6987, 5914, 9407, 11386, 4370, 522, 2203, 1168, -637, 5332, 7686, 9184, 6951, 4982, 4557, 2792, 784, 5010, 6694, 3354, 6061, 11097, 13326, 5144, 2305, 1043, 10292, 16565]
11557A6565K218k031n657M849K04n318o59m61o407m090K816N085j288J879J27
11542G832J220K108L958R071K972k958l900k319R772J0796P62N306R712J5304
11528F9636J2580J0647M096l741j3968j5737j1358j3059n877m922m402j879J308
11515B3324p796q204J111L122k253l874l865n32J367L149m96r0P09J69L177M737
11499A3755r26P86l70M809m958j401k725o019k233M316m51K35R7Q614j944l317
11483H268K49O640j624n139j726l468n043M373L368L823P6M589j288l548M14m249
11467E715J913M396L682p029m060q96j750L073M380J0149J670p721M216J444L448
11452B2630J387M950J494m054n566p574o147q302j906O319q37l226L976K519p48
$$ y = [16565, 18783, 16752, 11095, 15944, 16148, 10830, 10171, 9710, 3303, -787, 2029, 7114, 5826, 7705, 7832, 9052, 11160, 15118, 24189, 27161, 24203, 20303, 17984, 27756, 38552, 39314, 44620, 54332, 69636, 82216, 92863, 96959, 93218, 79250, 63513, 52155, 39096, 33219, 28297, 23895, 22016, 23324, 15528, 7324, 8435, 11557, 9304, 5430, 1565, 1033, 2400, 5549, 5053, 4963, 5672, 5841, 9018, 13755, 12829, 13615, 13245, 18054, 13096, 11695, 8970, 2951, 718, 5034, 4583, 4818, 4915, 13529, 11585, 8268, 8517, 15157, 13533, 8394, 6668, 3200, -1843, 2530, 5898, 9721, 9797, 14386, 13098, 9550, 9964, 5715, 7628, 12024, 15706, 8677, 4617, 3721, 1971, 5044, 9424, 19573, 21243, 13522, 17738, 19182, 22630, 24017, 28967, 30461, 26407, 20841, 13267, 7120, -1182, -3088, 3231, 2394, -832, 3144, 5663, 4915]
11437D915M720P041K637m499k259p629J247J534l526J727J738Q12J081r322l053
11422b836J604L665J498L98K188O51k391j591L335j017K075M424k441J347q46
11407A0063N245L903q1K135n521l449P75l245O867j648k454j203o530O789N686
11392A7332k918L743k838l456L278m85R66m730J937O336L63r31k316o804L618
11377A3095L202n538k392n227k438M740P194K425r40J072j649j196k135Q22L41
11362A1376n168O79P35J755N904N217K647Q7k06M716O723K175o267p356M580N832
11346C3429k900k396j436R22L273k684j453j946N110Q620j179L303J339M609Q549
11331E5160J795J1354J1154Q317O586J1382J6121K3364L1146M3402O3859R5824
$$ y = [4915, 9635, 16676, 19313, 14814, 12555, 4926, 6173, 7707, 4181, 5908, 7646, 8458, 9539, 217, -2836, -1232, 2433, 3931, 4329, 6517, 7168, 4777, 3186, 6521, 5504, 7579, 12003, 9562, 10909, 10063, 15308, 19211, 19130, 21265, 15744, 12295, 13070, 9825, 16692, 15044, 12590, 11387, 4857, 11646, 17332, 14414, 18157, 15319, 11863, 15141, 14656, 15622, 10892, 12829, 19165, 19528, 18597, 16281, 9477, 13095, 16297, 10759, 8367, 3140, 702, 5442, 12636, 15061, 14121, 15193, 13544, 12348, 10213, 11035, 11376, 6208, 6887, 7622, 9377, 15281, 20498, 23145, 23232, 23026, 27742, 34465, 36640, 30373, 23017, 27597, 33429, 30529, 28133, 26697, 27619, 30892, 28208, 26755, 24809, 29919, 38539, 37360, 40663, 42002, 46611, 55160, 56955, 68309, 79463, 87780, 94366, 105748, 121869, 145233, 176379, 219781, 283640, 379464]
11319C79464J44093K37492L64683M70017M27180K34005N3927j42423l53498m44950
11309A369990m02006k98050j94364j20721p8223m7783l5235k5090k4371j3761
11299A30386j0865j3080j4038j3340j015o586n697l541k868m594p269j757l431
11286D2305j355P48M92j67p768k82j420R49m81l683m487J663k349q981o446L479
11270A2217N417k213J170N765n877n918l95K70L42k14N90L857J717k517J20k073
11254A2258K177M258p70ML814o89l251n115N747M393k490k137K358k139O92k970
11238A6140K036j410j122j695N923m940p15M379M924p01K209m14m151j935J53
11223A8681L177K165K19K007J886m168k468l348K753N528M760j616K003J585J022
$$ y = [379464, 523557, 761049, 1125732, 1595749, 2022929, 2256934, 2310861, 2168438, 1814940, 1369990, 967984, 669934, 475570, 354849, 276626, 228843, 193608, 168518, 144147, 130386, 119521, 106441, 92403, 79063, 78048, 71462, 65765, 62224, 59356, 54762, 47493, 45736, 42305, 40950, 41698, 42190, 42023, 34255, 33973, 32553, 33502, 33021, 29338, 24851, 26514, 24165, 15184, 8738, 12217, 17634, 15421, 16591, 22356, 16479, 10561, 10166, 10436, 10778, 10564, 11154, 15011, 16728, 14211, 14331, 12258, 14435, 18693, 17923, 17927, 21741, 21052, 17801, 12686, 18433, 22826, 20336, 18199, 20557, 18418, 19110, 16140, 18176, 16766, 15644, 13949, 19872, 14932, 14217, 18596, 23520, 22819, 25028, 24614, 20463, 18528, 18681, 21858, 24023, 24242, 26249, 28135, 23967, 21499, 18151, 20904, 26432, 31192, 29576, 31579, 33164, 34186]
11208C4186j540L838R024K101m096M062L268O819J2519Q948J512R685K3067K6206
11194A39599L0308M1083N3160P2513J25202K04857L16367M34048M01602J81705
11184B000444J1179J4759j8655k26273m03516m05764l02439j98257j19245p5381
11174B76852m7549l5225l7737k4438j9755j4450j1986q248l045n951m839n053
11162E8576L13j498m850o724j255m106j098R29l508n438m642l828k822j27L015
11147B2937L43N237j757j876M622J174Q64j071J827L391L006n374j908m830p86
11132B5799p060p14L848j954L767n323J611J075k656j896k651J87j843N710P88
11117A8688M329J030l774M29j473k224L508L353k478j22j510L146Kl030L478K43
$$ y = [34186, 32646, 36484, 45508, 47609, 43513, 47575, 50843, 57662, 70181, 79129, 80641, 90326, 113393, 139599, 169907, 210990, 264150, 336663, 461865, 666722, 983089, 1417137, 1818739, 2000444, 2011623, 2026382, 2007727, 1781454, 1377938, 972174, 669735, 471478, 352233, 276852, 229303, 194078, 156341, 131903, 112148, 97698, 85712, 77464, 74419, 68468, 63629, 58576, 58889, 57391, 52541, 45817, 44562, 40456, 39358, 40287, 36779, 31341, 26699, 22871, 20049, 19922, 22937, 23280, 28517, 26760, 24884, 29506, 30680, 31544, 30473, 32300, 35691, 38697, 33323, 31415, 26585, 25799, 18739, 18025, 21873, 19919, 23686, 18363, 19974, 21049, 18393, 16497, 13846, 14033, 12190, 17900, 18688, 23017, 24047, 20273, 20702, 19229, 17005, 20513, 23866, 21388, 21266, 19756, 22902, 22904, 19874, 23352, 23595]
11101B3595o278j885l523J604J847k157m829K31N135j687n272j871P55o23Q360
11086A3402N987k390j485L548k218K133P348j413L218j751l595m222J027Q424
11072B8013R02J324O93l969j571k27n459k758j107L380K80l383O15l85L359J992
11056B1699J78j134M743N335n214r2M014p409q206M795P285p28p31J558n317j323
11040A9453K362n16K118M385P321J3873J8454o643j5176n67J428P251R039o708
11026E6074j3540p073o229K51j670r99k085l359n36P935Q44j191o594n989N576
11011B1415R309J177k226o78j019j239m453J589J653l032N50J471K547N468n21
10996C2011n725o79J095j204L080O069R13l908K408N804o29l71m459j735m127
$$ y = [23595, 17317, 15432, 11909, 13513, 15360, 13203, 8374, 8605, 13740, 12053, 6781, 4910, 5665, 5042, 13402, 19389, 16999, 15514, 19062, 16844, 18977, 26325, 24912, 28130, 26379, 22784, 18562, 19589, 28013, 28915, 30239, 30932, 26963, 25392, 25165, 19706, 16948, 15841, 19221, 19501, 16118, 16733, 16348, 19707, 21699, 21877, 20743, 25486, 30821, 25607, 25515, 29529, 22120, 13914, 18709, 25994, 25266, 24535, 26093, 20776, 19453, 21815, 21299, 23417, 27802, 35123, 48996, 67450, 60807, 45631, 45064, 46492, 53743, 62782, 56074, 42534, 35461, 29232, 29483, 27813, 26814, 24729, 21370, 20834, 28769, 29613, 28422, 21828, 15839, 21415, 30724, 31901, 29675, 28997, 27978, 26739, 22286, 23875, 25528, 22496, 23046, 24517, 27064, 32532, 32011, 26286, 25607, 26702, 25498, 28578, 34647, 35560, 31652, 34060, 39864, 39235, 38864, 34405, 32670, 28543]
10981B8543j537J233L62o82K826k675l769k869Q28M522R3q03m742P39L607k123
10965B3553k41K246k824kJ0271L596m17o207l975K986K624R63M72m99J06q596
10949B4056j839M308K673J355M775N113M489m139o647q050J757M126M25l190P63
10934B9975j896m764J74N931l456o858R02M835j370L904j080N266N578K202j34
10919C9209M85k789k354j832K475l565k751M443M140N432o346k137M298m534L633
10904C7807J0722N731k023L08N59M211M595L49K102q61k620k181o894k341M553
10889E4017K516N326Q323n042j02q74j1667j0378l936r24j0221J047P002M829
10875C9916K301k213Q530O452P031R42j819L018P631P433J608J292n996o697q49
$$ y = [28543, 27006, 28239, 28601, 27919, 30745, 28070, 24301, 21432, 22260, 26782, 26875, 26072, 21330, 22069, 25676, 23553, 23312, 25558, 22734, 22732, 33003, 36599, 36182, 29975, 26000, 28986, 31610, 32573, 33045, 32546, 32652, 24056, 22217, 26525, 29198, 30553, 35328, 40441, 44930, 40791, 34144, 26094, 27851, 31977, 32402, 29212, 29975, 28079, 23315, 23489, 29420, 25964, 19106, 20008, 24843, 23473, 27377, 26297, 31563, 37141, 39343, 39209, 39694, 36905, 34551, 32719, 35194, 31629, 28878, 33321, 37461, 42893, 36547, 34410, 38708, 34174, 37807, 48529, 54260, 52237, 52545, 53104, 57315, 61910, 62259, 64361, 63500, 60880, 58699, 51805, 49464, 54017, 56533, 61859, 70182, 65140, 65038, 64164, 52497, 42119, 38183, 37259, 27038, 28085, 35087, 39916, 42217, 40004, 48534, 54986, 62017, 62959, 61140, 64158, 71789, 79222, 80830, 82122, 76126, 69429, 68580]
10860F8580P183N617J1576J6848J6346J2947J9641L8115N7697R4163J68038K89748
10848H06499M65459M80491J85400M5008k65933m78000m19983k76675j61650r8742
10838B81874n9077l2615k4551k0229j3193j3562n742p892r358j851j669l405J040
10825H9770J66k733j023j818J68J780l276N03P54j6331l120J938m019l38R14j307
10809F2028M423L302K981n144p380j236m945L053P218P74K450M311O856N558J030
10794H5279Q80N18o80l433k005k108m288m543K287p19k992m345n098K346j37N108
10778F6070J836K68k407J168J386M573P72K302R09k157m748m763l048O483P724
10763G6368k290r499o840j64l381O859K261J848l501k684L70m920k700Q163K456
$$ y = [68580, 75763, 81380, 92956, 109804, 126150, 139097, 158738, 196853, 254550, 348713, 516751, 806499, 1271958, 1752449, 1937849, 1982857, 1716924, 1238924, 818941, 542266, 380616, 281874, 222797, 190182, 165631, 145402, 132209, 118647, 112905, 105013, 95655, 93804, 92135, 88730, 89770, 89936, 87203, 86180, 84362, 84530, 86310, 83034, 83537, 84291, 67960, 64840, 66778, 62759, 62421, 63335, 62028, 66451, 69753, 72734, 67590, 60210, 58974, 54029, 57082, 64300, 65074, 67524, 71835, 78691, 84249, 85279, 86159, 86677, 85997, 82564, 80559, 78451, 74163, 69620, 71907, 71188, 68196, 63851, 58753, 61099, 60962, 66070, 67906, 68174, 65767, 66935, 68321, 72894, 73666, 75968, 76877, 74720, 69972, 65209, 62161, 68644, 76368, 74078, 64579, 57739, 57575, 54194, 61053, 63314, 65162, 61661, 58977, 59347, 54427, 51727, 59890, 62346]
10748F2346J3082P286P832Q120k059M201m820j0787p657k885j406j508R36J836
10734G4517K748N205M465K193L424L244N119M142j375k739k469m945o350J827
10720H9006J492O707R107p264k288M141M712M801k483m263o714o330m875J839
10706H7588M913J517j87L162Q479k39j43N060M520Q741J6140J9964K4729L2413
10692B16657M7073N9544K8111l762j4562n5105n2441l4949k8961j8667j0639m435
10680A27864o011n189q016k705J59M282R779J4080O629M569j025l892M009l56
10666A44177j122M461N013o042j671L492K881L350O442j169K248k291r17J0424
10652A69276J4153R436J0975O568P522P073N809R534P084j361r631o34J7045K1949
$$ y = [62346, 75428, 82714, 90546, 98666, 96607, 100808, 95988, 85201, 77544, 74659, 73253, 71745, 72681, 74517, 77265, 82470, 86935, 89128, 92552, 95796, 100915, 105057, 103682, 100943, 98474, 93529, 87179, 89006, 90498, 97205, 106312, 99048, 96760, 100901, 105613, 110414, 107931, 103668, 96954, 90624, 85749, 87588, 92501, 94018, 93831, 96993, 105472, 105233, 105090, 110150, 114670, 123411, 139551, 159515, 184244, 216657, 263730, 323274, 351385, 347623, 333061, 277956, 225515, 190566, 161605, 142938, 132299, 127864, 121853, 116664, 108648, 105943, 106102, 110384, 120163, 134243, 140872, 145441, 144416, 140524, 144533, 144177, 143055, 147516, 152529, 146487, 144816, 148308, 151189, 154539, 160981, 159812, 162060, 159769, 158852, 169276, 183429, 192865, 203840, 210408, 217930, 225003, 230812, 240346, 247430, 246069, 236438, 235804, 252849, 274798]
10638B74798J7043K1992J3768J3354K4772L6080M0980O4677R0241J42163K46982
10627I86850M09127O97619J180139J943170K057206j74273j299259q58069J99696
10618E142206J359392J045182j235191j952182j565147r41654n33100l26209j97710
10609G95587j19942p1634m8577n2100m5495l9330m0637k3663j7249j4028j5788
10598C07144j5827j1745j1123m215k428j3466k1157j8410j0656k5513k4046k1215
10586A27343j2605R58N285M315M726j004J417K974M990j79k131N070J2574J1122
10572A64855n891j9824j7334j7731k3013k0381k0887n0633n8209O1211j9030O8000
10560D1133J05248K5440J4550P367R91m73o233n636m49P796O678J1234P612J026
$$ y = [274798, 291841, 313833, 327601, 340955, 365727, 401807, 442787, 507464, 597705, 739868, 986850, 1395977, 2093596, 3273735, 5216905, 7274111, 7099838, 5800579, 4942510, 5142206, 6501598, 7546780, 6311589, 4359407, 2794260, 1852606, 1319506, 993297, 795587, 675645, 604011, 555434, 503334, 457839, 418509, 377872, 354209, 336960, 322932, 307144, 291317, 279572, 268449, 264234, 261806, 248340, 227183, 208773, 198117, 172604, 148558, 127343, 114738, 115696, 120981, 125296, 130022, 129018, 130435, 133409, 138399, 138220, 136089, 141159, 153733, 164855, 158964, 139140, 121806, 104075, 81062, 60681, 39794, -10839, -69048, -7837, -26867, 41133, 146381, 171821, 186371, 193738, 194729, 194256, 188023, 182387, 181938, 189734, 196412, 207646, 215258, 216284]
10546B16284M569P981J5682J5316O570j6993j4360q868l572O596K25j132K602
10533B30900k823j3637k2450j6689j1910j191R840J2278J0357J7823K2248K7731
10521B62477J2232O744J2397L210j10j2766j2641j9594j6239j1661K174J0558
10509B36781K0592L6066K7072J4049J2841J6636J2758K5157J9947J0139L799J5467
10497D51304K656N188K0207K1281K0383K7836J6085R900m478l222m365O18J2045
10484E75438K1454L4578L9640L6766K3714K1082J8583K2398K1156J9348K9427
10473H63584L1825L5388N0072P0205J09187J35250J49867J71287J87773K59957
10463B064395L17141L57830M15044N39592O63838M92316L34903K70631P575R4020
$$ y = [216284, 220853, 228834, 244516, 259832, 266402, 249409, 235049, 226181, 222609, 229205, 229430, 228298, 230900, 228077, 214440, 191990, 175301, 163391, 162200, 172040, 184318, 194675, 212498, 234746, 262477, 274709, 281453, 293850, 297060, 296950, 284184, 271543, 251949, 235710, 224049, 226223, 236781, 257373, 293439, 320511, 334560, 347401, 364037, 376795, 401952, 421899, 432038, 435837, 451304, 453960, 459148, 479355, 500636, 521019, 548855, 564940, 574840, 570362, 567140, 562775, 563393, 575438, 596892, 631470, 671110, 707876, 731590, 752672, 771255, 793653, 814809, 834157, 863584, 895409, 930797, 980869, 1051074, 1160261, 1295511, 1445378, 1616665, 1804438, 2064395, 2381536, 2739366, 3154410, 3694002, 4357840, 4850156, 5185059, 5455690, 5463265, 5557285]
10453E557285K94326N92854Q68441J136789J604433K125934K333535L022826M036547
10444B1572970N461955Q776360J4421793K4601598M1743944O8805091R2382519
10437B77766230N1195180J4080233j2264018p1196891q2279364o3681903l9478452
10430G4141015k2649108j3124615p814147m964582l752478k941364k722276k624153
10422A3548292k190296j666244j156133q17366n72427l36615p8124O9984k03066
10413F598005l62136n53353q29186p68367n81670m11502l11124k36743j86685
10404B357239j46401j29334j18502j29154j32429j15974j06161r6197r0129r6365
10394A196593p7558o3057n2662l3583j3450m445p242J7J7204O0304J20861K12981
$$ y = [5557285, 5851611, 6444465, 7312906, 8449695, 10054128, 12180062, 14513597, 17536423, 21572970, 27034925, 35811285, 50233078, 74834676, 116578620, 185383711, 277766230, 328961410, 343041643, 330777625, 259580734, 177301370, 113619467, 74141015, 51491907, 38367292, 30553145, 25588563, 21836085, 18894721, 16172445, 13548292, 11357996, 9691752, 8535619, 7718253, 7145826, 6809211, 6731087, 6801071, 6598005, 6235869, 5682516, 4853330, 4084963, 3503293, 3091791, 2780667, 2543924, 2357239, 2210838, 2081504, 1963002, 1833848, 1701419, 1585445, 1479284, 1383087, 1292958, 1196593, 1119035, 1055978, 1003316, 969733, 956283, 951838, 944596, 944613, 961817, 1022121, 1142982, 1355963]
10382A355963K39145J01032J202j69220k71727k48980j93856j24305q6911o2839
10372E39504m1444j6659o21j3395k2177p676m476m247N203J1728m194q473p845
10359D25228j1434k8152l4285k7029k8917k4416q453k846P104M872M048J6286
10347B92006O698J211M46l151j0012r437k2106k7299j7170n318m342N41J598l572
10333B00093m922n447j737r33J0415J6811L1351M2423O7472Q7756J03422J21739
10321F68443J13538Q1340M1781q526l5990l2493m3376m7543l5455j395L2464K9137
10309G61925j5920l5109p1554j13108r2747o5253m3358k9878j9337j0326m890
10298B60445p84k230J952j4599j1068j2616j1748q695n74J924N974O851m597j9033
$$ y = [1355963, 1595108, 1696140, 1697342, 1528122, 1256395, 1007415, 813559, 689254, 602343, 539504, 498060, 481401, 480780, 467385, 445208, 437532, 433056, 428809, 434012, 445740, 441546, 433073, 425228, 413794, 385642, 351357, 324328, 295411, 270995, 262542, 259696, 266800, 271672, 275720, 292006, 298704, 299915, 300361, 297210, 287198, 277761, 255655, 228356, 211186, 205868, 201526, 202067, 203665, 200093, 195171, 189724, 187987, 187054, 197469, 214280, 245631, 288054, 355526, 443282, 546704, 668443, 781981, 863321, 905102, 896576, 860586, 828093, 784717, 737174, 701719, 700324, 732788, 761925, 746005, 710896, 639342, 526234, 433487, 368234, 324876, 294998, 275661, 265335, 260445, 259661, 257431, 259383, 244784, 233716, 221100, 209352, 200657, 200083, 202007, 207981, 214832, 210235, 191202]
10284A91202k9743k6467j8027j5500j403M79q098j2939j2424O95P728N195n549
10271G5149j2182p810J775k839q439j0228M187J4586J6074L433J751Q308K756
10258H6521k09O509l98r592j0392j0561j5009l80J94J2223J7457O130j0R647P069
10243I9199N646n01q636q182j2084j7511q213k289K687M328o085N340R082L971
10229F6752j831N157J072j0923p505p541j0515j210M528J550n093j257n495k667
10215B5022K359L269m89L877l393L254L969Q792R004N228J843j0145n240O53R459
10200E7462Q685j244l773L479O455O14n99O97k044p202K096m753j4513q135j042
10185C6183N370R860K417j88o770o077o267m635j675O271L19m403k45P172N580
$$ y = [191202, 161459, 134992, 116965, 101465, 100062, 100541, 92443, 79504, 67080, 67775, 75503, 80698, 75149, 62967, 55157, 56932, 54093, 45654, 35426, 39613, 54199, 70273, 73706, 75457, 83765, 86521, 86312, 92821, 92423, 82831, 72439, 61878, 46869, 46489, 46683, 58906, 76363, 82493, 82483, 92130, 99199, 104845, 104344, 95708, 87526, 75442, 57931, 49718, 47429, 50116, 54444, 48359, 53699, 62781, 66752, 64921, 70078, 71150, 60227, 52722, 45181, 34666, 33456, 37984, 39534, 34441, 33184, 27689, 25022, 27381, 30650, 30161, 34038, 30645, 33899, 37868, 46660, 55664, 60892, 62735, 52590, 47350, 48003, 57462, 66147, 64903, 61130, 64609, 71064, 71678, 71079, 71776, 69732, 62530, 64626, 59873, 45360, 37225, 36183, 41553, 51413, 53830, 53642, 46872, 40795, 34528, 29893, 28218, 34489, 34808, 30405, 30160, 37332, 42912]
10170D2912P441k055o08J171k101j805r57l718j704m222Q94j259n906q121m336
10155A5626M461L648Q639Q341q44l944r771j0129l59O097k301K589L427R377L272
10140C8129l258k903P867R596j581l692m595q063m408m738j1544p430K243N177
10126A0800k736N129J412L489O042J0441R16o188o006o687l334L911N440k414
10112B0215j587j883m551k066O119O18o186j488P496p91m11K197k079K530O960
10097B5093l164l394j591K07j421n65j476p30J183j297J57k732k31k469k077K452
10081G945m93J93J824J23l945l246k953R680R795k585L875K33k447j0175L731
10066A1555J2024Q719M81P86K519L994p784o284k114k012L389k531R2l32M99J289
$$ y = [42912, 50353, 48298, 47690, 48861, 46760, 44955, 43998, 40280, 38576, 34354, 35248, 33989, 28083, 19962, 15626, 20087, 23735, 32374, 40715, 39871, 35927, 26156, 16027, 15668, 21765, 19464, 22053, 25480, 34857, 38129, 34871, 31968, 39835, 49431, 47850, 44158, 39563, 31500, 27092, 22354, 10810, 3380, 5623, 10800, 8064, 13193, 14605, 18094, 24136, 34577, 35493, 29305, 23299, 16612, 13278, 17189, 22629, 20215, 18628, 16745, 12194, 10128, 16247, 16865, 10679, 9191, 16687, 15896, 15485, 17682, 15603, 18133, 25093, 21929, 18535, 16944, 17151, 15730, 15165, 13689, 12959, 14142, 12845, 13002, 10270, 10039, 7570, 5493, 7945, 7452, 7645, 9469, 9592, 5647, 2401, -552, 9128, 18923, 16338, 20213, 20446, 17999, 7824, 11555, 23579, 32298, 32779, 33565, 36084, 40078, 32294, 26010, 23896, 21884, 25273, 22742, 22834, 22502, 23001, 24290]
10050B4290N99k076M174J742K028M892Q511k649k970K713J2020J3769K0609L4281
10036A21933O600j9933q723J730K855O319K0791K6630L7204O7871J19727K02978
10024E85982L41609N11859L86073J18243m5326l86747m69302l66356k33572j35184
10014C07279p4800l6963k2620k7302j9659j1619j2610j7581j0007r971k647k556
10002E8944K47J90M431J868l256J023n948o253q043l358n014m228o113j0116q716
9987E658q74j216l904j934K570M386K441j181m949m373M72q27r442o000K548M781
9971a1844J0386J3092N368J166n682o725O64j849Q103O683j224m101L982o31R46
9956A8334l820o755k411K343J415L689Q16M852J309n153m787q24M695M081K350
$$ y = [24290, 24889, 22813, 26987, 28729, 30757, 35649, 44160, 41511, 38541, 41254, 53274, 67043, 87652, 121933, 128533, 108600, 99877, 101607, 104462, 110781, 131572, 158202, 195406, 263277, 383004, 585982, 927591, 1439450, 1825523, 1943766, 1898440, 1511693, 1042391, 676035, 442463, 307279, 232479, 195516, 172896, 145594, 125935, 114316, 101706, 84125, 74118, 64147, 61500, 58944, 59191, 59381, 63812, 65680, 62424, 63447, 57499, 51246, 43203, 39845, 34831, 30603, 24490, 14374, 5658, 4784, 3568, -336, -2270, 300, 4686, 7127, 5946, 997, -3376, -2904, -3731, -13173, -19173, -16625, -11844, -1458, 11634, 17002, 18168, 12486, 5761, 6425, 4576, 12679, 19362, 18138, 14037, 18019, 17388, 18334, 14514, 7759, 5348, 7691, 9106, 12795, 13611, 18463, 19772, 14619, 9832, 9008, 13703, 17784, 20134]
9941B0134p471m948l932l017k451L763J943O552l124o045J832O275L329K780R90
9926A6610p666L75Q093J879p284k723K802O39J747k670o190n21N548l090N486
9911A3035K241k202m17R16K783K077N64k488k715m200Q37j048j854j142k407L41
9895D321J178o97K912j185K304L528o543n099K167O797K396k826k927k162J400
9880E564O600l86j769o67m92k03l42k440p421k260M971K622K350l49l622K055
9864D211M849L004j203m406M56j559L78j283L092M567l469m05M883k476O108K113
9848A8860m582k721q6m723k114n36K957Q421j192n737j51j790M064N979k594N122
9832A9177n2p881m155N803j639n068O1j972m592j190rK194J894P79j529m801m33
$$ y = [20134, 12663, 7715, 3783, 766, -1685, 2078, 4021, 10573, 7449, 1404, 3236, 9511, 12840, 15620, 16610, 8944, 9319, 17412, 19291, 12007, 9284, 12086, 12725, 14472, 11802, 5612, 5091, 10639, 7549, 13035, 15276, 13074, 12657, 13573, 16356, 18433, 18997, 16509, 13794, 9594, 10431, 9383, 7529, 6387, 3980, 4321, 5499, 4802, 7714, 6529, 8833, 12361, 5818, 719, 2886, 9683, 12079, 9253, 6326, 4164, 5564, 12164, 11778, 10009, 9342, 8850, 8647, 8305, 5865, -1556, -3816, 1155, 3777, 6127, 5778, 2156, 4211, 9060, 12064, 10861, 6455, 6911, 5352, 5730, 4447, 7539, 12106, 8637, 8232, 13115, 10639, 16747, 18860, 14278, 11557, 11471, 6748, 4634, 4098, 7055, 15476, 14284, 8547, 8396, 6606, 10670, 16649, 14055, 19177, 19125, 11244, 7089, 12892, 11253, 6185, 6246, 4274, -318, -1508, -1517, 677, 2571, 3350, 1821, -2980, -3413]
9815c413M892M340k515j51K871o03M132M273l992p696m51j308O54l516m326l29
9799g138M665K126J749L481j244j548N81l888r538j45N571M004N625O523R929
9784B0753o21k932l778p694K618Q11l429K117m83l387p098m537o12N877j37P36
9768a796k385l340N883P815K605J557J595r94j214p712N058l335l993M09L876
9753D029k052n615m261Q0l048M952P501K499m232m839l41M172j634R31Q79L148
9737B169K002l225L31L516K250Q19l083j352q28m677r76m381n155l534K292O015
9721g817J766l916L252N57M363J925k74n728q29J100M833J070O24N179K003l337
9705D771p532q483j837J537R069K577J816L638K440M585p501j466o34j906L062
$$ y = [-3413, 1479, 5819, 3304, 3153, 6024, 5421, 9553, 13826, 9834, 2138, 1687, 379, 1033, -2483, -6809, -7138, -2473, -347, 1402, 4883, 3639, 2091, 2672, -1216, -10754, -10899, -5328, -1324, 4301, 10824, 20753, 20132, 17200, 13422, 5728, 8346, 9157, 5728, 7845, 7362, 3975, -3123, -7660, -8272, -2395, -2532, -1796, -4181, -7521, -1638, 6177, 8782, 10339, 11934, 10940, 9726, 2014, 7072, 3737, -256, 153, 4029, 1977, -3638, -7899, -7819, -10867, -5915, 1586, 4085, -147, -4986, -5327, -1155, -2789, -1858, -979, 2169, 4171, 946, 1277, 4793, 7043, 7862, 4779, 3427, 2599, -2078, -3054, -7435, -12590, -16124, -13832, -7817, -6051, -9967, -6715, -6158, -1795, 130, -144, -5872, -6701, -5601, -768, 302, 926, 6105, 8108, 4771, -2761, -11244, -13081, -11544, -2475, 102, 1918, 5556, 7996, 12581, 5080, 3614, 2980, 1074, 4136]
9690D136J1275L646l885m512P60m096n429j351k0O231r24p65K956O055L677n250
9674A2504j197k258k226R7J427K8j589K072K982J763k061n756O26n444N73J697
9658C238k467k73j334r213J22M782N583M601n425r771K719J084Q478l540r50L41
9642b025k367m376P958K015q98o480K248K471J692O718J443k441r53l457L553
9627E101J457l106o3k289k98L308K008q51n311o646P034K524m566J832J541j190
9611D85j934N391j490n635P15j321L872N047N243q0J983k940q522q777K134j214
9595g043l81M283J492J444M381O689j317o861m430J457j261J893M507L343L947
9580A2143J850k458K29k165m36l851q68j086O870j943o757K77o97K482j381j630
$$ y = [4136, 15411, 19057, 15172, 10660, 11420, 7324, 1895, 544, 524, 6755, 5831, 5066, 8022, 14077, 17754, 12504, 11307, 9049, 6823, 6920, 8347, 8375, 6786, 8858, 11840, 13603, 11542, 5786, 6412, 968, 1541, 3238, 771, 498, -836, -10049, -9927, -5145, 438, 5039, -386, -10157, -7438, -6354, 2124, -1416, -2366, -2025, -4392, -8768, -810, 1205, 307, -6173, -3925, -1454, 238, 6956, 8399, 5958, 5005, 1548, 5101, 6558, 3452, 3389, 1100, 802, 4110, 6118, 5267, -44, -6690, 344, 2868, -1698, 134, 1675, 485, -1449, 3942, 2452, -3183, -2468, -3789, 83, 5130, 10373, 10293, 12276, 9336, 814, -7963, -5829, -7043, -7424, -3141, -1649, -205, 4176, 10865, 9548, 2687, -1743, -286, -1547, 346, 4853, 8196, 12143, 13993, 11535, 11764, 9599, 9163, 5312, 4444, 3358, 10228, 8285, 1528, 1805, 1108, 3590, 2209, 579]
9564E79m68M487j159L090L106P21L66l761P91N79j286m669k173k599K061L067
9548B732K135k657K486J61m075q32K080O23j850j414k786K498N47m151l524j144
9532i171J539J445k8J08J959k201r88k041l26K829k443k613N76L14J828l503o4
9515a2780Q40k185Q096K706M96P27m42K212L937M746k307o782m421J661J913J629
9499D6M681n73j389n67J232k462p705j326M370N377l39l398k023K89o244k490
9483a2521M419Q646j164k200K135j034Q750N702m005p91r41j521J403J515l904
9468D489k680l759R29k072K167J665l130J426P9l242m02N37M89r32n169O05O31
9451h369O37j790K267N25J9K861N931L975j114L209Q44o303L242L599M69m239
$$ y = [579, 111, 4598, 3439, 6529, 9635, 10356, 10722, 6961, 7752, 8331, 7045, 2376, 203, -2396, -335, 2732, 4867, 2210, 4696, 4857, 782, -50, 2030, 2653, 803, -611, -3397, -899, -352, -4503, -8027, -9171, -7632, -6187, -6215, -6107, -4148, -6349, -7337, -9378, -9704, -6875, -9318, -11931, -11355, -11041, -9213, -12716, -12780, -11940, -14125, -6029, -3323, -2827, -2100, -2542, -330, 3607, 8353, 6046, -736, -5157, -3496, -1583, 46, 4727, 4154, 2765, 2198, 3430, 968, -6737, -8063, -3693, 1684, 1345, -2053, -4076, -3787, -10031, -12521, -8102, 544, -620, -2820, -685, -1719, 7031, 12733, 8728, 7937, 6996, 5475, 6878, 8393, 4489, 1809, -1950, -1021, -3093, -926, 739, -2391, -965, -886, -4128, -4530, -3993, -3504, -4436, -9605, -9000, -8369, -7732, -9522, -7255, -6730, -6711, -3850, 2081, 6056, 4942, 8151, 8995, 2692, 5934, 9533, 10002, 5763]
9435E763j776R32n567J62K53q317N01K234o5k678K808O255j365L17n874l31L476
9418c272J737J0511N702n954k639m323J579l382m058K242J108O227O113K380J77
9403A4148r636p312j207K27K570M715J778J283k6r36o035M381M083k169k739p83
9387B342J764M728j271p968l193K975J605K236L949K148k355n738N10M665j506
9372D891J775j47K308m125l558K510l542L49k839o3J410j665J923J739M000K762
9356G728j413P01K763k6k105n54m575j897l481L05K032M199P51n350o977k228
9340a0127K874M498k940n33L70p89O266N399j546k116L301l649n027M41j689n09
9324e776M58m126o64P611K056j150O19N297L385n762L377J933K69p085l089r09
$$ y = [5763, 3987, 4919, -648, -486, -233, -8550, -8049, -5815, -5880, -8558, -5750, 505, -860, -543, -6417, -6748, -3272, -1535, 8976, 14678, 8724, 6085, 1762, 3341, -41, -4099, -1857, -749, 5478, 11591, 13971, 14148, 4512, -2800, -4007, -3780, -1210, 3505, 5283, 6566, 6540, 5604, -431, 3950, 8033, 5864, 3125, 2342, 4106, 8834, 7563, -405, -3598, -623, 982, 3218, 7167, 9315, 6960, 1222, 1732, 6397, 4891, 6666, 6519, 8827, 4702, 1144, 3654, 112, 461, -2378, -2441, -1031, -2696, -773, 966, 4966, 7728, 6315, 7016, 9779, 9753, 7648, 7094, 2519, 622, -2859, -2554, -522, 3677, 4428, -922, -7899, -10127, -7253, -2755, -5695, -6228, -5858, -6647, -381, 5018, 3472, 1356, 4657, 1008, -4019, -3578, -5267, -5776, -5318, -9444, -10108, -2497, -441, -1591, -972, 4325, 7710, 1948, 5325, 7258, 7527, 442, -2647, -3556]
9308c556k656J28J066L347j106k003N515N935K220n16k008p24R75M788k12l84
9292A0809J832m639k679m680m407j404M5K431L746m338L967L30j120l71l161k724
9276f363N30r27M876K736O303j700j347l439k290J878l325L753o197j482O451
9261e43j080l138P103M497q04k078m965o971l646R65J501J990j041L712P548n524
9245b474l608L321K034k836J578M015L232J869K826j099j615k544l281M21M172
9230F011M41l409n42j110J225M409m033m336k953J292L179j392K054l835j433
9215d432l131R9K44J892j559J028k034K06K710k817j383K477K596n917K194N77
9199g250K242M426j158K813o894j178L656k032o837J784L974M7J886om36M037
$$ y = [-3556, -6212, -6084, -5018, -1671, -2777, -4780, 735, 6670, 8890, 8374, 6366, 5642, 6617, 11405, 11193, 10809, 12641, 8002, 5323, 643, -3764, -5168, -5123, -2692, 1054, -3284, 683, 1013, -107, -478, -3639, -6363, -5833, -6760, -1884, 852, 7155, 5455, 4108, 669, -1621, 257, -3068, 685, -5512, -6994, -543, -1623, -4761, 2342, 6839, 6035, 3957, -1008, -7979, -11625, -10660, -9159, -7169, -8210, -4498, 3050, -2474, -6082, -2761, -727, -3563, -1985, 2030, 5262, 7131, 9957, 8858, 7243, 4699, 1418, 1839, 6011, 6452, 3043, 2501, 1391, 2616, 7025, 2992, -1344, -4297, -3005, 174, -1218, 836, -2999, -4432, -7563, -7464, -7220, -5328, -6887, -5859, -7893, -7687, -4977, -7794, -9177, -6700, -4104, -10021, -7827, -7250, -5008, -582, -1740, 1073, -5821, -6999, -3343, -5375, -12212, -10428, -6454, -6407, -4521, -4527, -4963, -926]
9183i26K804n241k031L4o90O854L845j099r48m731L2j095k873p597k141N663J778
9166h362m520j549M420J038L843O251L788M897m584j1376j068L235J343M081K101
9151C538p03J755J802k613q59m005m460K748j199P90J0982k570R1j76L184k175
9135F130k987k113j0357n212O085L094K890L168m053K70K323j430M542l896N0
9120a496N92j006k27L601k829k752N109K709M200K385J22j942K09K803m213m106
9104C159L675j318N00J383L95l839k60L979p208m873p56p322r36p72L597k666
9088a3262j664O015Q056P197J257P49m681o034m927R143M793K239K262j049j516
9073H578j827M2k152L06l756%M379M123J56j162m465o06j599J157O630k369p618
$$ y = [-926, 1878, -3363, -5394, -5360, -6050, 804, 4649, 3550, 2602, -2129, -2097, -3192, -6065, -13662, -15803, -10140, -8362, -12882, -14431, -10011, -8973, -5130, 1121, 4909, 9806, 5222, -6154, -7222, -3987, -2644, 1437, 3538, 2835, 4590, 6392, 3779, 2920, -1085, -5545, -2797, -3996, -3206, 7776, 5206, 5297, 5121, 8305, 6130, 3143, 1030, -9327, -14539, -8454, -5360, -2470, 698, -3355, -3085, -762, -2192, 2350, -1546, -1496, -904, -1910, -2137, 1464, -1365, -4117, 992, 3701, 7901, 10286, 10408, 8466, 8675, 11478, 7265, 3159, 6834, 5516, 6016, 7399, 7794, 3955, 3695, 7674, 466, -4407, -5163, -12485, -13421, -14193, -10596, -13262, -14926, -8911, -855, 6342, 7599, 8348, 3667, -2367, -7294, 1849, 6642, 8881, 11143, 10094, 8578, 6751, 6793, 4641, 4947, 1191, 1191, 5570, 9693, 9849, 8687, 4222, 3616, 2017, 3174, 9804, 7435, -183]
9056a83k176O154K194o13q256r10n13N196K662K933O13l893m189M306K928m109
9040B144K88Q685K030j549m251o591m768M83M101j085k153m347l006O48M095O057
9024G81K011n313l288l126J1M492J485K263m456l72n097n726K638K662N295M001
9008a739k239M18M736K318K30l077l456L045J678L160P14q367J263N021j99J134
8992D640r54n337K45K433m651M140N173J258j809l442N151N20J693j583j946q36
8976D695k976L010O1M79n95j161N651k341P10p362K498Q519n914o649K916J306
8960B847q82N706j355l213J169J377o14k39O70k485k357p956J720q44m47O071
8944h32L730M011j436l622J800J7m476M668K963o914l582L890m408L51L032m329
$$ y = [-183, -2359, 3795, 5989, 5376, -2880, -3790, -4303, 893, 3555, 6488, 7101, 3208, -981, 3325, 6253, 2144, 2432, 11117, 13147, 11598, 7347, 756, -4012, -3529, 572, -513, -2666, -7013, -10019, -9371, -5276, 781, 2792, -2521, -5809, -8935, -8924, -4432, -2947, -684, -5140, -5512, -10609, -16335, -13697, -11035, -5740, -1739, -3978, -3560, 1176, 3494, 3724, 647, -2809, 236, 1914, 5074, 5788, -2579, -1316, 3705, 3506, 4640, 3686, -1651, -1406, 1027, -3624, 516, 5689, 6947, 5138, 1696, 6847, 7367, 9060, 7477, 5531, 4695, 1719, 4729, 4790, 5269, 4674, 3513, 9164, 6823, 7533, 171, 2669, 11188, 5274, -1375, 1541, 2847, 1965, 7671, 6316, 3103, 4272, 5649, 5035, 4796, 5466, 2981, 624, -7332, -5612, -6456, -6903, -832, 2898, 6909, 5473, 1851, 3651, 3668, -808, 3860, 6823, -91, -3673, 217, -4191, -3840, -808, -5137]
8928e137l958J77m097L764Q223M87l207k691L979K307M639L722K628j923n522
8913C391l198J659l594m943O47O709M949o12K770K584M952q28o461l749m311l837
8897c872K874L073L608l59k839l197m537L735l078j497O757N582l541m857l884
8882f032k578J52O763N365K815j126j907N938O212R506K183j0668r548o397m825
8867d147M6N601Q092K53n519j885m38J876m79k305l369l515l895J465J946l03
8851f576R656M239k032p934l754l84M724L284K072P87o396m757J302k620J340
8836g049M996J224j790j42P639P747P286O831N057j858p926k864m686j876k9M972
8820A7532K953K593K36n997j0660r546m65J672p016K458Q616O154n963k433M83
$$ y = [-5137, -9095, -8918, -13015, -9251, -1028, -541, -3748, -6439, -2460, -153, 4486, 8208, 10836, 8913, 3391, 193, 1852, -1742, -6685, -6038, 671, 5620, 5008, 7778, 10362, 15314, 14486, 8025, 4276, -35, -3872, -998, 2075, 5683, 5324, 2485, -712, -5249, -1514, -4592, -6089, 668, 6250, 2709, -2148, -6032, -8610, -8458, -1695, 3670, 6485, 5359, 3452, 9390, 15602, 25108, 27291, 16623, 7075, 678, -4147, -4101, 1500, 9592, 9845, 4326, 2441, 2003, 3879, 3400, 1095, -2274, -5789, -9684, -8219, -6273, -6576, 3080, 7319, 5287, -2647, -6401, -6785, -2061, 1223, 3295, 4082, -2314, -7071, -5769, -8389, -7049, -2053, -829, -2619, -2761, 4878, 12625, 19911, 26742, 31799, 29941, 22015, 19151, 14465, 12589, 12560, 17532, 20485, 23078, 23314, 17317, 6657, -2889, -3354, -1682, -8698, -6240, 2376, 8530, 2567, 134, 617]
8805F17K194J61n804K308l262l012J741M106l84r226j908K891J0297K072o70j129
8789I92o19N718K019M667J0816J667o031n586o786p895n800n326O246j584J059
8774f443O956K878j997l838m561j792j682j110M480M744J942K915Q576P92m724
8759G136j0094j063O33M54N222M121K5j754m219q68N038K275k214n103k113M696
8743B172L18K632j657m344O285j630j604O80K571m447J463L423m870l255K423
8728A60K352O244k432j256K63N952l781q999O7M495l651k890k903P990J819p918
8712d488O63j223j186J086O755J926P273O58l867l912k94L438L611j439L14m346
8696D969Q28L853m109o593k028M35n881k215K642N977N613l159p261j79L293L821
$$ y = [617, 2811, 2972, -2832, -524, -3786, -6798, -5057, -951, -1335, -10561, -12469, -9578, 719, 2791, 2121, 992, 373, 6091, 8110, 12777, 23593, 25260, 19229, 13643, 6857, -1038, -6838, -12164, -5918, -7502, -6443, 513, 3391, 1394, -2444, -7005, -8797, -10479, -11589, -7109, -2365, -423, 2492, 11068, 11860, 7136, -2958, -4021, -3388, -2934, 2288, 6409, 6434, 4680, 461, -407, 4631, 6906, 4692, -411, -2524, 2172, 2490, 5122, 3465, -879, 5406, 3776, 2172, 2852, 5423, 976, 2439, 5862, 992, -2263, 160, 2512, 8756, 6324, 5068, 5331, 11283, 7502, -1497, -1430, 3065, -586, -3476, -6379, 1611, 3430, -4488, -3825, -5048, -6234, -5148, 1607, 3533, 10806, 11464, 7597, 3685, 3391, 6829, 10440, 9001, 9315, 4969, 5797, 9650, 5541, -1052, -3080, -2645, -8526, -10741, -8099, -2122, 3491, 332, -6929, -7108, -3815, 6]
8680FL047L164m100n787k792j030L09J67J392L736K850n685q15J027N660K454
8664C603J409J089l490J655L432j926l256j865m234m966K171L375N548o59k450
8649e64L952O074l917k793j590k583l04J724q29l534P1J0483P34M601L623r218
8633E930o423k269l375l86j425L704O877R99j297q15o001q55O722M83o78J459
8617B650l215M7P775k33l963k281m831P85J487k292J770P80L308j051n034K499
8601a799N184K467J402J164m55K06l167m984l548q492N232R126L200P383n606
8586G313n89O683J517J891P182n429k419O207L605L587j566o856o527k444N7J459
8570A3671r84J100L125l752J278k459o550j628L019K023K782J515m270q563k711
$$ y = [6, 3053, 6217, 2117, -3670, -6462, -7492, -7183, -7016, -5624, -1888, 962, -4723, -5538, -4511, 1149, 3603, 5012, 6101, 2611, 4266, 7698, 5772, 2516, 651, -3583, -8549, -6378, -3003, 2545, 1886, -564, 3388, 9462, 5545, 2752, 1162, -1421, -1725, -1, -830, -4364, -4293, 6190, 6924, 11525, 15148, 5930, -493, -2762, -6137, -6523, -7948, -4244, 2633, 3632, 2335, 1520, -4481, -5336, 1386, 1869, 1191, 2650, -565, -518, 7257, 7024, 3061, 780, -4051, -3266, -1779, -4071, -2301, -1521, 1787, 736, -4298, -1799, 3385, 5852, 7254, 8418, 7963, 8169, 5002, 18, -3530, -12022, -6790, 2336, 5536, 12919, 7313, 6724, 13407, 14924, 16815, 23997, 18568, 16149, 22356, 25961, 29548, 27982, 21126, 14599, 12155, 12212, 13671, 12687, 13787, 16912, 13160, 14438, 11979, 5429, 3801, 6820, 8843, 11625, 13140, 8870, 307, -2404]
8555b404K333L923j055p084l67n57Q744N662j324K150N35m484q907p664N75O727
8539c197O984M697k741j969O231K402j0711o238K670K070K892K630k547l85J37
8524B925k237k989J334K987L937l394J886O824r548q509L384M134J725J557j159
8509B857n890m484l64L916j821M655l028j948J494o08K131N645O01K866m622L78
8493A778L660L304J047p651o516P12j745j057O990K068l323L136L834k167j218
8478B852J224K299K513m372q897m075P323K396o78p809l806P080K325N17k401
8463c509P94K456o87K223O429j533J049o12k285m841k062L087K067P16l022J824
8447B094J030l608k930N37j847J459N234K90r618n681N875J0145J759M58P4k143
$$ y = [-2404, -71, 3852, 2797, -4287, -4654, -5211, 3533, 9195, 7871, 10021, 10556, 6072, -2835, -10499, -9924, -3197, 3787, 8484, 5743, 3774, 10005, 12407, 1696, -4542, -1872, 198, 3090, 5720, 3173, 2788, 2925, 688, -2301, -967, 2020, 5957, 2563, 4449, 11273, 1725, -6784, -3400, 734, 2459, 4016, 2857, -3033, -7517, -7881, -3965, -5786, -1131, -4159, -6107, -4613, -5221, -3090, 2555, 3156, 6022, 1400, 1778, 5438, 8742, 9789, 2138, -4378, -3666, -5411, -6468, 522, 2590, -733, 2403, 6237, 4070, 2852, 4076, 6375, 8888, 4516, -4381, -8456, -1133, 1263, 585, -7224, -11030, -3950, -1625, -1108, -3509, -2715, -259, -946, 1277, 7706, 6173, 7222, 6610, 4325, -516, -2578, 509, 2576, 3292, 270, 2094, 3124, -484, -3414, -2877, -4724, -3265, 1969, 2259, -7359, -13040, -7165, 2980, 4739, 5197, 5271, 3128]
8431C128m949n319M764O611N206M43m010k294n240m365J845l088P108N914p63
8416D991l467J611L182j661Q75J628J183k347j666l088o05k001q52K548K714q15
8400B230k965L772j528R9K602k438k526J152k589l687N31J836R27P560J937p14
8384F199j356k464j454L499j061M77l512m724k015J901P47k807m476k255P01J0633
8368a967R209j84k842m28p908k562N062m972o857J748k901M39O572J39j547L47
8352h652M636P38K812J249J787k8n539J466P579k2l099q955k812o87L831N974
8336B78L210L593k27J012n641j0515M844j369L75k181k763L386K783l352K865
8321c702J930L110L373o821K641L284n232k650J065L989o0L282K325n130k214
$$ y = [3128, -1821, -7140, -2376, 4235, 9441, 9884, 5874, 3580, -1660, -6025, -4180, -7268, -160, 5754, 4991, 1524, 3135, 6317, 4656, 5531, 7159, 8342, 5995, 4329, 1241, 636, -1365, -2217, 331, 3045, 2230, -735, 3037, 1509, 1608, 4210, 1772, -754, 398, -2191, -5878, -5347, -3511, -2584, 4976, 6913, 6199, 4843, 2379, 925, 4424, 3363, 3840, 328, -4396, -6411, -4510, -3763, -6570, -11046, -13301, -12600, -1967, 7242, 7058, 4216, 3788, -4120, -6682, -1620, -6592, -13449, -11701, -14602, -14163, -7591, -7452, -8999, -8652, -4016, -3278, -466, 783, 2570, 2542, -2997, -1531, 6048, 6026, 2927, -6028, -8840, -9527, -5696, 278, 3488, 7081, 6854, 7866, 2225, -8290, -3446, -4815, -4440, -6621, -9384, -5998, -3215, -6567, -3702, -1772, 1338, 4711, -2110, 531, 3815, -1417, -4067, -3002, 987, 927, 4209, 6534, 1404, -810]
8306h10k252k40q52J709o43n994l56P393K895Q14n921r4M517j596O101L847o718
8289A800o711Q975J606j858L106j597m72l279K039L952J85q259r93J946q23l283
8273c666M27J579k302l400K171J084K760j5J999r41l655K012m573o91P269O503
8257F561m942R19m522l945M245Q370J481j851j721o187q272j465M275J062J434
8242d558L893j329j826N763j499q034l890M393M435j12m972j302P032M106M775
8227F875j093p04O49j404k97k182o4K828J125l286k965j533L390M984k579k904
8211H40J181m658J333J444k60P641J0719J101k878n860J272k788l501r8M025m222
8195E291o711M273N027p492m688J337N0K937l053L832j205k105P656l442P90M222
$$ y = [-810, -3062, -3302, -4154, -2445, -3088, -9082, -9438, -2045, 850, 1664, -4257, -4351, 166, -1430, 4671, 8518, 1800, -4911, 4064, 5670, 3812, 6918, 5321, 4849, 1570, 3609, 7561, 7746, -513, -1506, 440, -383, -3666, -3239, -1660, -3962, -7362, -5191, -4107, -1347, -1362, 637, -304, -3959, -1947, -6520, -7211, 58, 6561, 1619, 2538, -1984, -5929, -1684, 6686, 8167, 6316, 4595, -1592, -9864, -11329, -7054, -5992, -4558, -665, -1994, -3820, 1943, 444, -7590, -11480, -7087, -2652, -2764, -7736, -9038, -2006, 2100, 6875, 5782, 5078, 5727, 4323, 4026, 1844, 1780, 4608, 5733, 2447, -518, -2051, 1339, 6323, 3744, 840, 2021, -2637, -1304, 140, -120, 7521, 18240, 19341, 16463, 10603, 11875, 9087, 5586, 5488, 9513, 5291, -1420, 2853, 7880, 388, -4300, -2963, -2913, 24, -3029, 803, -402, -2507, 5149, 1707, 2497, 6719]
8179F719o308q989Q94Q51R852K302m92n527L012O30l848Q25J521o335j630N32
8163e991N360N621L447J303o523l671j341M823l49K516l682o846M429P963k935
8148D124n071J463j167Q28q39l120j166J013j410L99K410p168j04J667M748Q17
8132b576J363L617L443M707J738m070m495K307J232p866l417M523N014L950j101
8117H369m608l501j368l288J553m566L495R277K583m766N3J203N116q147p425
8102f020J745l708N632O039j447l317L570k843q06O884l6o752K094K154L870J868
8086H927N66l505m311M923J148K548l206q311j754J218m338p730j232M636L369
8071g052P05m08K465L098p36K814l412n725O941O245K759m136l352P402o44l32
$$ y = [6719, 411, -8578, -7684, -6833, 3019, 5321, 4829, -698, 2314, 2944, -904, -79, 1442, -4893, -6523, -5991, -631, 4990, 8437, 9740, 3217, -454, -1795, 3028, 2679, 5195, 1513, -5333, -904, 7059, 4124, -947, 516, -651, 177, -662, -3782, -4948, -3935, -5345, -4946, -2536, -9704, -9808, -8141, -3393, -2576, -1213, 2404, 5847, 10554, 12292, 8222, 3727, 6034, 7266, -600, -4017, 506, 5520, 9470, 8369, 3761, 260, -1108, -4396, -2843, -7409, -3914, 5363, 7946, 3180, 3233, 4436, 9552, 1405, -6020, -4275, -7983, -2351, 3688, 2241, -1076, 2494, -349, -1155, 5729, 5693, -1059, 1035, 3189, 7059, 8927, 9493, 5988, 1677, 6600, 7748, 10296, 7090, -1221, -2975, -1757, -6095, -13825, -15057, -10421, -7052, -6347, -6755, -4290, -1192, -1928, 886, -2526, -8251, -1310, 4935, 7694, 3558, 206, 7608, 6964, 6632]
8055F632k843J782J985k308l787n510J126K141M06L30j931k566M568J245m86O81
8039A465j706m775l688L184J812O066q25m786j183j350K266L879N060p61l723
8024I35J375M407q79j747j051j450k134J448Q01j763j530K716O473O172m593r514
8008c34j5o07M314N54j292l767l644j892M412J509K268J421J063k28l96j682j507
7991A77L249M617q88J120N664j299q486r474J146Q391L322P0K079M491L188l135
7975A4232j044P41L07l045q16k746l260J644p26L107N531M16n453n686n06k42
7959B454L115O373L943j861l143l539j163k008L466M424N847n454l2n915m851
7944A656K149r28j212j101k680K463N688J221o76n589j640L529J533K261n662
$$ y = [6632, 3789, 5571, 7556, 5248, 1461, -4049, -2923, -782, -376, -46, -1977, -4543, 25, 1270, 784, 1465, -241, -5016, -8704, -5520, -3708, 2358, 1533, -3253, -4436, -5786, -3520, 359, 5419, 4658, 935, 2310, 6717, 5838, 4091, 3040, 1590, -544, 904, 1705, -58, -1588, 1128, 7601, 13773, 9180, -334, -349, -956, 3358, 3912, 2620, -1147, -4791, -6683, -2271, -762, 1506, 2927, 3990, 3762, 3366, 1684, 177, 3426, 8043, 7155, 8275, 13939, 12640, 4154, -5320, -4174, 4217, 7539, 7609, 9688, 14179, 17367, 14232, 13188, 13929, 14236, 11191, 10375, 7629, 4369, 6013, 5287, 8394, 13925, 14341, 8888, 3202, 2696, 2454, 5569, 11942, 15885, 14024, 10881, 7342, 6179, 4171, 7637, 12061, 17908, 12454, 12422, 6507, 1656, 3805, 2877, 1665, 564, -2116, 347, 6035, 7256, 6580, 991, -649, 2880, 4413, 6674, 1012]
7929A012j524K699n279o48J494O151J0052N187k137p593l431n76j573j384K009
7914D459N049k078l931j059J249Q433L456r47J389j562p887m792O343k083J682
7899G721J20K772J470j277j319N799K205l767l371m016l67k335k347J622J42L232
7883F284j64m460P28L9j470N642L653j479l527J625j19K237N152o855q210r33
7867a857K496n06J326J244N165k806p490l517K265J758q06K091K270k095m267
7852d729K902P203O822p026j936K661m082p972K210Q288k214l92O022J440j660
7837G537M062L785j997J030k250m418n185l253o513J80k224K718P185N80o707
7822e470j850J521j945n250L126K609j429O99Q541M174o933k489k697p554m281
$$ y = [1012, -512, 2187, -3092, -3740, -2246, 3905, 13957, 19144, 17007, 9414, 5983, 5407, 3834, 2450, 4459, 9508, 7430, 3499, 2440, 3689, 12122, 15578, 14631, 16020, 14458, 6571, 1779, 8122, 6039, 7721, 7841, 10613, 12083, 10806, 9487, 15286, 17491, 13724, 10353, 6337, 5970, 3635, 1288, 2910, 3052, 6284, 6120, 1660, 2388, 2427, 957, 6599, 10252, 8773, 5246, 6871, 6752, 8989, 14141, 7286, -924, -1857, 639, 133, 1459, 2703, 7868, 5062, -2428, -5945, -3680, -1922, -2728, -637, 1633, -462, -4729, -1827, 5376, 12198, 5172, 3236, 5897, 1815, -6157, -3947, 4341, 2127, 1735, 7757, 9197, 7537, 11599, 15384, 13387, 14417, 12167, 7749, 2564, -689, -7202, -7022, -9246, -6528, 657, 1237, -5470, -7320, -5799, -7744, -12994, -9868, -7259, -8688, -7989, 552, 4726, -2207, -4696, -7393, -14947, -19228]
7807a9228M802j224J567M450J414M748P49k542n207k4K438J276n55N639M52k277
7791c522J235Q59K917K973l542J276l095m1l55k489j537J321r26k272j784l863
7775a2845J684K971M37K886J431k065K868P62M000N887j246n75n569n141L500
7760a015m813N89K871o67L67m631J215m79m49L436J430j614O894N022l937l12
7744C907k579Q66J331n581m56K073K399l587N776M936o152l257p673l127P224
7729c900l344O57m643o372L060M330J826K567k409K837P8K45J416m883m359P3
7713a2821P223R710l475j227J722l979j717M329J80n103k583J554O878L832l710
7698H13j44j461j279J333k722K044j231K10M416K314o154k026m242J353k06J267
$$ y = [-19228, -14426, -15650, -14083, -9633, -8219, -3471, -2722, -5264, -10471, -10495, -8057, -6781, -7336, -1697, -1245, -3522, -2287, -1428, 1489, 4462, 920, 2196, -899, -940, -1295, -3784, -5321, -4000, -4926, -7198, -8982, -12845, -11161, -8190, -7753, -4867, -3436, -5501, -2633, -1871, 2129, 8016, 6770, 6195, 626, -4515, -1015, -5828, -5239, -2368, -3035, -2668, -7299, -6084, -6563, -7012, -3576, -2146, -3760, 3134, 8156, 4219, 3907, 1328, 2194, 3525, -2056, -2512, -439, 1960, -1627, 4149, 9085, 2933, -324, -7997, -11124, -3900, -7244, -6587, -11230, -17602, -14542, -10212, -8386, -5819, -8228, -5391, -5313, -5068, -3652, -8535, -12894, -12821, -5598, 4112, 637, -590, 1132, -2847, -4564, -235, -55, -5158, -7741, -6187, 691, 4523, 813, 669, -792, -2071, -738, -3460, -1416, -2647, -2437, 1979, 4293, -1861, -3887, -8129, -6776, -6982, -5715]
7682e715J506k553m523L31M60J45k401N242R867R27L374p713p08j923j672J869
7666c487l65O782r04l809J408Q644j705m141m91M765J734l834n379k037O014L544
7650F739K350k739p615n7K586Q144J216m840k313j016O49n155j539k040j981K823
7634d788M530M435j422o817K348k1J575j266k777j348K27N875J435m018o088o590
7618a4710j768j364R023N947l742J117l772L96R364J094j82M299n098r458M94
7603h360L436k59j954n170K19K278L072P160Q280L624n426m810o685n218K124
7588g689L001R457K64m974l134j721k333k105J831j65P6M753j213l147J176j665
7572g588L851l361Qj753J933M636N817L851m031n689L184k630n29K562m235l218
$$ y = [-5715, -4209, -6762, -11285, -10954, -10494, -10349, -12750, -7508, 2359, 3286, 6660, -1053, -1761, -3684, -5356, -3487, -3852, 2930, 2026, -1783, -375, 8269, 6564, 2423, 1932, 6697, 8431, 4597, -782, -2819, 3195, 6739, 9089, 6350, -1265, -1322, 1264, 9408, 10624, 5784, 3471, 2455, 3104, -2051, -3590, -5630, -7611, -4788, -258, 4177, 2755, -4062, -1714, -1735, -160, -1426, -4203, -5551, -5324, 551, 1986, -2032, -8120, -14710, -16478, -17842, -8819, -2872, -6614, -5497, -9269, -8873, 491, 1585, 1403, 5702, 604, -8854, -8360, -4924, -5183, -7137, -12307, -12088, -9810, -6738, 422, 8702, 12326, 6900, 2090, -4595, -9813, -7689, -4688, 4769, 5033, 59, -3075, -4796, -7129, -9234, -7403, -7568, -7492, -2739, -3952, -7099, -5923, -7588, -3737, -7098, -7090, -8843, -6910, -2274, 3543, 7394, 3363, -2326, 858, -1772, -2301, 261, -3974, -7192]
7556g192l75M741L581j779L61L604k581n292n247M118N838L053K088N636L009
7541A3563m302o562m624k23J653l011J860J1051m371p358q03q94J391r23j093
7526d646L941O732J356J213L977j189j764Q4L600J944q72o713j5243K104L372
7511b104Q70m751K380L233k328L082k28j385O4m875j844N254l307j626J497P722
7495A654L469q540o250M51j852M991L349j616K665R85j370L136M081j077n743
7480a667k084Q64j288L840P30l188L002j030Q25K617K080j158L915o61j851k055
7464B891J09J462k322n410o21j24R97K161l057P17l787k608M518L187K195L177
7448C485K050K804j373p841l943o28J859K516l18l514O67L121l495p05K280j555
$$ y = [-7192, -7567, -2826, 755, -1024, -663, 2941, 360, -4932, -10179, -6061, -223, 2830, 4918, 10554, 13563, 9261, 2699, -1925, -2148, -495, -3506, -1646, 9405, 5034, -2324, -3127, -4021, -2630, -3553, -4646, -705, 6027, 7383, 8596, 12573, 11384, 9620, 9704, 13304, 15248, 14376, 7663, -7580, -5476, -2104, -1234, -5985, -3605, -372, -2700, 382, 154, -1231, -1167, -6042, -7886, -2632, -5939, -7565, -6068, 1654, 5123, -3417, -9667, -9216, -11068, -6077, -2728, -4344, -1679, -694, -2064, 1072, 5153, 4076, -1667, -3751, -2887, -4175, -335, 395, -2793, 209, -821, 4, 2621, 4701, 3543, 7458, 6797, 4946, 2891, 3000, 4462, 2140, -3270, -3891, -4015, -3018, -857, -3914, -3197, -6984, -9592, -5074, -1887, 308, 3485, 5535, 8339, 6966, -875, -4818, -5446, -3587, -1071, -1389, -4903, -4236, -1115, -4610, -5315, -3035, -4590]
7432d590K01K010J60Q29m328k772L363K201J571p654n415L339N630R270K99m890
7416g76n73K812M301o44p697l77M007j472J41J442M405n073J902l915l562K702
7400b377m766K516P388K759q015n53M18M067L284J130O52j947q712n777j247N431
7384e749K305j051m976M359K559m519j19n16q0M773J194M173K696n31l788m659
7368c929J739k646n62J962N9J738k457l522P052L43r04m776J15j952m398R75j727
7351a2890l909J820o22K343M545N13K226L216O383k495k888j899O53l19j742K811
7335b254P873L680k531m123j730k869o818J958J378K263M717M958n311j649J97
7320b61R294j848m254N331J404o273l981M73k609l357o25N662O506r55l741Q32
$$ y = [-4590, -4389, -2379, -2219, -1390, -5718, -8490, -5127, -2926, -1355, -9009, -14424, -11085, -5455, 3815, 4114, -776, -1349, 1463, 5764, 5120, -2577, -2954, 1053, -419, -278, 1164, 5569, 496, 2398, -1517, -5079, -2377, -7143, -4627, 2761, 5520, -2495, -3048, -2630, 1437, 4721, 5851, 6503, 4556, -4156, -9933, -11180, -5749, -3444, -4495, -9471, -5112, -2553, -7072, -7191, -7707, -7787, -3014, -1820, 2353, 5049, 4518, 730, -3929, -2190, -4836, -5398, -3436, -3377, -1639, -4096, -7618, -566, -223, -1127, -5903, -5788, -7740, -12138, -11163, -12890, -16799, -14979, -15601, -13258, -8713, -8200, -5974, -2758, 3625, 1130, -1758, -3657, -3004, -3323, -5065, -2254, 5619, 9299, 6768, 2645, 915, -1954, -8772, -6814, -5436, -3173, 1544, 6502, 1191, -458, -261, 9033, 7185, 2931, 8262, 9666, 3393, -588, -115, -2724, -6081, -6706, -1044, 5462, 4507, 766, 1598]
7304A598O79k80M275o059q557J880K722M260J082k303L850o75r896L121M920k876
7288b259m397l782m17J991k711k173K405J080p0J769J040K689j275J192n210N32
7272i596O379K488N950n272l686J843l33O79L366J652k259m677J91K847m061l174
7256g663P00M461J902l316l469l979N691M297K125L39l078O684K678M32o244j563
7240cJ0286J257j2484l072n097j235J414K757M098O774m197l23L851k893r106
7225g973m641L090L636K185J119j171J056j232J53q34m263j680P93M483J696M549
7209I66R057m924K106p40p911k028K441P42K228O621n797n762L471l311p528M826
7193e543L581k548o06j198J741K435N28n827q34L08N41J686k670q61K949P12M2
$$ y = [1598, 2277, 1997, 6272, 213, -8344, -6464, -3742, 518, 1600, -703, 3147, 2472, -7424, -4303, 617, -2259, -6656, -10438, -10855, -8864, -11575, -13748, -11343, -10263, -10333, -8564, -7524, -4835, -6110, -4918, -10128, -9596, -3217, -729, 5221, -51, -3737, -1894, -2227, -1548, 1818, 3470, 1211, -3466, -3275, -428, -4489, -7663, -6963, -2502, -600, -3916, -7385, -11364, -5673, -1376, 749, 1088, -1990, 4694, 7372, 7804, 1560, -3, 10283, 11540, -944, -4016, -9113, -10348, -8934, -6177, -2079, 4695, 498, 175, 4026, 1133, -7973, -12614, -9524, -5888, -3703, -2584, -3755, -2699, -3931, -3778, -4612, -8875, -10555, -9762, -5279, -3583, 966, 10023, 5099, 7205, 6465, -1446, -3474, -1033, -291, 1937, 8558, 2761, -3001, 470, -2841, -10369, -5543, -1962, -4510, -5116, -6314, -4573, -2138, -1610, -7437, -8271, -7963, -7422, -5736, -8406, -9267, -6318, -5606, -5564]
7176e564P824O086j678O98N376j959m447j589m957L035J018n691j080m469p873
7161a5270L491O861K637O84K336m434q329K30J1414P639Q06l174p420N850K535
7146E856k939J223K106j033j861n251k122K19K177N418j282r280N31O624k491
7131b105R28j648k610N753k978m552Q50L889l837q79M265l51j654N18L2N57o70
7114d492q83M264O483K10q433r81L972R92J513l631n588k403k909n218L773L607
7098i724l792K193R715M888k067L22J997l829j760k505J783n224k802Q68J916
7083h021J138n671j625M410J002L193J377L762K253J959J232k735K454P81l497
7068B012l118l843k075N035n32J186n653l841L670N713L013l063J467P42M51r646
$$ y = [-5564, 2260, 8346, 6668, 7366, 12742, 10783, 6336, 4747, -210, 2825, 3843, -1848, -2928, -7397, -15270, -11779, -4918, -2281, -1597, 739, -3695, -12024, -11794, -380, 7259, 8065, 4891, -2529, 3321, 5856, 2917, 4140, 6246, 5213, 3352, -1899, -4021, -3802, -1625, 3793, 2511, -6769, -6238, 386, -2105, -1177, -2825, -5435, 318, -2660, -7212, -6362, -2473, -6310, -7189, -2924, -3275, -4929, -4411, -4379, -3822, -4492, -5375, -1111, 5372, 5582, -2851, -3832, 140, 1132, 2645, -986, -6574, -8977, -11886, -17104, -13331, -9724, -13516, -11323, -1608, 3280, 1213, 1535, 3532, -297, -2057, -4562, -2779, -8003, -10805, -9937, -8021, -6883, -12554, -14179, -9769, -8767, -5574, -4197, -435, 1818, 3777, 5009, 2274, 4728, 5509, 2012, -1106, -4949, -7024, -1989, -2521, -1335, -6988, -10829, -7159, -1446, 1567, -1496, -29, 713, 1164, -8482]
7052h482q109K851M260j071L104J525P858L423j193o743k914J196l596m398l443
7037a5732L127Q134R789r13j1047M749O628l486p878M04m04J246M532O327j167
7022D309n341n753k409j968N423O410J740l478l188L306K575K285o865m500j736
7007i190j395O452k620K442O511P198k072o429L75K010n877k261k265m89K085
6992e525n65n225M011O038J126k965M312N33m01K367n478l992j76O84p684j01
6976a3041M532P937K793o01n705j602J808l082j646k162P07o320m019l20L469
6961a7252P521O530lL273Q427N798k081l974n708J146n04k060j204q22j068k535
6945d516N184K298Q67n847l899M739K081k459P056M834l885p364o754J940K721
$$ y = [-8482, -16591, -13740, -9480, -10551, -7447, -5922, 1936, 5359, 4166, -2577, -5491, -4295, -7891, -12289, -15732, -12605, -4471, 5318, 4405, -6642, -1893, 4735, 1249, -6629, -6225, -6629, -5383, -851, 5476, 4309, -1032, -6785, -9194, -11162, -5739, 671, 2411, -1067, -4255, -949, 1626, 3911, -2954, -7454, -9190, -10585, -4133, -6753, -4311, 2200, 9398, 7326, 897, 1272, 3282, -2595, -4856, -7121, -7610, -5525, -6090, -11315, -7304, -1266, -140, -3105, 1207, 1740, 1339, 3706, -1772, -5764, -5940, -5256, -12940, -13041, -8509, -572, 2221, 1620, -4085, -5687, -3879, -6961, -8607, -10769, -10062, -16382, -20401, -20721, -17252, -9731, -3201, -3204, 69, 8496, 14294, 12213, 8239, 2531, 3677, 3173, 1113, -91, -913, -1981, -4516, 668, 2966, 3833, -2014, -5913, -1174, 907, -1552, 5504, 10338, 6453, -911, -7665, -5725, -3004]
6930c004M863j969o128L44J092K916J423j965m6j37l95K660M272J181J379q248
6914a762l349N685J795K434K152K862r280n980N932N389J733K333K549m403o554
6899A536q07m762M56m756m41K773N361p127o337n02N548K927N503J148K216k706
6883C0o049R63J478M78J87k602k021J739J429j129N45r64L485J046L569M625L571
6866A0380J567O674P798R901J00r73p451j3818k797j21r36m421L01N797M40l973
6850H468p312J787M689o356r661N257K953O450O454K669J407l473k479J449o632
6835E670r365m069O23J567j850k692N27O451J489k481k611N706J964M490k565
6820B854o36J752l990k125k610k674m17l812k431N215k967M522K957l484m427
$$ y = [-3004, 1859, -110, -6238, -5894, -4802, -1886, -463, -2428, -2474, -2611, -3006, -346, 3926, 5107, 6486, -1762, -5111, 574, 2369, 4803, 6955, 9817, 537, -5443, 489, 5878, 7611, 9944, 12493, 8090, 1536, 729, -4033, -3577, -8333, -8774, -6001, -640, -7767, -14104, -14606, -9058, -6131, -628, 520, 2736, 30, -6019, -5056, -3578, -3100, -2913, -5515, -7536, -5797, -4368, -5497, -4952, -5916, -2431, -1385, 2184, 6809, 10380, 11947, 18621, 26419, 36320, 36420, 35447, 27996, 14178, 11381, 11260, 10324, 5903, 6204, 12001, 12441, 8468, 1156, 2943, 7632, 1276, -8385, -3128, -175, 6275, 12729, 15398, 16805, 13332, 10853, 12302, 5670, -3695, -7764, -7141, -5574, -7424, -10116, -9589, -3138, -1649, -4130, -6741, -1035, 929, 5419, 2854, 2218, 3970, -20, -2145, -4755, -7429, -7846, -11658, -14089, -8874, -11841, -7319, -4362, -7846, -12273]
6805a2273O107l022M96k360K67M201k652j909L266Q604m173l213k398k355j772
6790a3186P793J197k629J826m280o467k23N078R369L779n70k533k552l500q65
6775g763p35K825K480M968l85m384J836J866N886J691m781J222l63k693l941l103
6759e374l799P638m527p950o388O82J4391k46m835K161J618O01M598N606Q982
6744A3158M086K304J2193K5145R519k0591j5213j1265q411M294l251q425n491
6731a948M094N534l663k332j896K331K936O308k355j132M369N383r49p033Q083
6716A7730J0689l818q872k811J483m006j049n85J057P975Q429k733k948n878n694
6701H969n767j870N56J44j837o584J501N72J58M418k417M368J0275M266p437j1261
$$ y = [-12273, -6166, -9188, -8692, -11052, -10785, -6584, -9236, -11145, -7879, 725, -3448, -6661, -9059, -11414, -13186, -5393, -4196, -6825, -4999, -9279, -15746, -15969, -10891, -1522, 2257, 1687, -846, -3398, -6898, -7763, -8498, -5673, -3193, 1775, 1390, -2994, -1158, 708, 6594, 8285, 3504, 4726, 4363, 1670, -2271, -5374, -9173, -1535, -6062, -14012, -20400, -19718, -5327, -5573, -10408, -8247, -6629, -6028, -1430, 4176, 13158, 17244, 19548, 31741, 56886, 66405, 45814, 30601, 19336, 10925, 15219, 11968, 3543, -1948, 2146, 7680, 4017, 1685, -211, 2120, 5056, 11364, 9009, 7877, 12246, 17629, 16680, 9647, 17730, 28419, 24601, 15729, 12918, 14401, 10395, 9346, 8761, 9818, 17793, 26222, 23489, 20541, 14663, 8969, 3202, 1332, 1888, 2032, 195, -6389, -4888, -4316, -4158, 260, -2157, 2211, 12486, 16752, 9315, -1946]
6685a946n57J806M869j788j0764K570R843L139n753M037n42q660m516j902l032
6670a3196M346K631K59N208K191k853j360j286o626n356J203p14J333O48j348
6655a4920M341J736k21M157o78q09j084L269M042P197p947k018N840M622k487
6640E040m309J82J491j488R79J857j766k252m416q645j298o13K532M571L338j773
6624f570n74L442k13j352J252O837O029k260l259j514m203L073J346N533j59q64
6608F544k749n226k433O195L692L64m323l360O08K509J70l778j236l912K292K213
6592b430J908j486p511l068L089j338N980P124R0l471n986l158N858j359K581
6577c177j512L908M657R59n452k527j093J414j43l69j990j083J07M146K073k700
$$ y = [-1946, -2503, -697, 4172, 2384, -8380, -5810, 4033, 7172, 1419, 5456, 4914, -3746, -8262, -10164, -13196, -8850, -6219, -5960, -752, 1439, -1414, -2774, -4060, -10686, -16042, -14839, -15553, -14220, -13572, -14920, -10579, -8843, -9064, -4907, -5585, -6394, -7478, -4209, -167, 7030, -917, -2935, 2905, 7527, 5040, 731, 913, 2404, 916, 1895, 3752, 1986, -266, -4682, -13327, -14625, -15238, -12706, -8135, -4797, -6570, -7144, -3702, -3915, -5267, -4015, 2822, 8851, 6591, 3332, 1818, -2385, 688, 2034, 7567, 7408, 6544, 3795, -1431, -3864, 2331, 6023, 6387, 2064, -1296, -688, 1821, 1991, -1787, -3023, -6935, -4643, -2430, -522, -2008, -9519, -12587, -9498, -10836, -4856, 2268, 2358, -1113, -7099, -10257, -4399, -5758, -3177, -4689, -781, 3876, 4835, -617, -3144, -4237, -2823, -2966, -3335, -5325, -6408, -6301, -2155, -82, -2782]
6561b782n304M334N260M288n12n468n586J372Q99K891P203J282L049j956o371
6546B599J437J304m077J960K54K121m276j249J264l185k046j159r52K625K078
6531a302K07R56j749o850l253l113j277N395j219l477K759L966P716M386n83L117
6515E679m364p683n7M326O2N58L835J06l092j0652J772O110L458k40N305L170
6499H293j431M790k599m725q782n497k986K850L67L591L742M15K79L089M316R61
6483F673j694r10k683K239L501k908N2j504K377J30o53l59J340J229q465L50P19
6466e66J057m549j007O269M650m003l097m641P79k040o089N990J616K909K047
6451f75L67P3n03M877Q77j641j920l028k232l0Q98N297M174J290l914m833L44
$$ y = [-2782, -8086, -3752, 1508, 5796, 5284, -184, -5770, -4398, -3499, -608, 6595, 7877, 10926, 8970, 2599, 4036, 5340, 1263, 3223, 3477, 5598, 1322, 73, 1337, -1848, -3894, -5053, -6005, -3380, -1302, -1095, -139, -1888, -8738, -11991, -15104, -16381, -10986, -12205, -15682, -12923, -8957, -1241, 3145, 2562, 5679, 1315, -6368, -6425, -2099, -2037, -1479, 2356, 2462, -630, -11282, -9510, -3400, 58, -182, 5123, 8293, 6862, 11652, 9053, 4328, -4454, -9951, -12937, -10087, -9720, -6129, -2387, -1972, -1693, 1396, 5712, 6673, 4979, 4069, 1386, 3625, 7126, 4218, 4270, 2766, 5143, 5273, 4620, 4261, 5601, 6830, -1635, -1285, -566, 491, -4058, -5065, 1204, 5854, 1851, -1246, -5887, -5108, -7148, -13237, -7247, -5631, -2722, -675, -308, -235, -738, 4139, 5016, 3375, 1455, -1573, -3805, -3835, -2937, 2360, 6534, 7824, 3910, -923, -579]
6434e79M119J111K512O65j816n872m138J356Q29L833J661k169J557m712q864J256
6418i251K117l021J254L807K512l483j40O805l994o087o47P080M083M651j058
6403D628n926M97L862l65k634l398J746L258K17m99m67m566m289N8L522L734k02
6386h24J261K775j353K158j844j853k538M865k117k183K626k490m460R87P101
6371B111M231O50k838j746k949m074l152J126J09N44N060l15j247J924j520l873
6355e959l256n06p72O285L091k225k291m58R56o85N11R22Q16N600l72K408J966
6338F031n32o568k179Q27K311m70l202m160K527O552K310M665M135l656o306N212
6322G497L073O59m391j763k816j219N95K577o25q333l952j527J621L157l216J751
$$ y = [-579, 3540, 4651, 7163, 7828, 6012, 140, -3998, -2642, -1813, 2020, 3681, 1512, 3069, -1643, -10507, -9251, -7134, -10155, -8901, -5094, -2582, -6065, -6205, 600, -3394, -9481, -10128, -3048, 1035, 5686, 4628, -1298, -801, 3061, 2696, 62, -3336, -1590, 1668, 1885, 1386, 919, -3647, -7936, -7878, -4356, -622, -824, 437, 3212, 1859, 4017, 2173, 320, -2218, 2647, 530, -1653, 973, -1517, -5977, -4990, 2111, 6342, 6992, 4154, 2408, -541, -4615, -7767, -6641, -6532, -5988, -928, -1243, -2490, -566, -2086, -5959, -9215, -9721, -10493, -4208, -1117, -3342, -5633, -6091, -5135, -5820, -5309, -4387, -3571, 2029, 1657, 4065, 6031, 5499, -1069, -3248, -2421, -110, -580, -3782, -7942, -5415, 1137, 3447, 8112, 12247, 8591, 2285, 7497, 10570, 11229, 6838, 5075, 2259, 1040, 1635, 4212, 3587, -4746, -8698, -10225, -8604, -5447, -8663, -6912]
6306f912M922M060K299O548j286m683q334m452k438J317L527m35q89o68O250j843
6290c017k817R14L654L615Q593J30m079m070m579l552J099K718j565J057J791
6275a08K002n74J602j743k303M94j369j85l107m880K449M35j733l765n517K468
6259a5834R813O346K337l411j378n53l693m803K123K477K02k774J102O286N764
6244D004j849j860q44K65r21J745L617l422n124n071J765L666J908j44l070q63
6228f198L475p36m300O892M878m6m133k672J767N451l789p185M136N941K893J403
6212G777o762r17j792n199J961J080L598J929l086k899K143R12m990j208L159
6197d294K606K331r84J870j487M520R68j997J838M56k84n501n546l622Q963L269
$$ y = [-6912, -1990, 2070, 4369, 10917, 9631, 4948, -3386, -7838, -10276, -8959, -5432, -5867, -6756, -7424, -1174, -3017, -5834, -4920, -1266, 2349, 10942, 11072, 6993, 2923, -1656, -5208, -4109, -1391, -2956, -1899, -108, 1894, 1320, 2922, 1179, -1124, -630, -1999, -2184, -5291, -10171, -7722, -7287, -9020, -12785, -18302, -15834, -6021, 325, 2662, -749, -2127, -2680, -6373, -11176, -9053, -6576, -6374, -9148, -8046, -1760, 4004, 2155, 295, -549, -284, -1205, 540, 4157, 735, -4389, -9460, -7695, -4029, -2121, -2265, -5335, -6198, -2723, -3459, -7759, -867, 4011, 3965, -168, -2840, -1073, 4378, 589, -6596, -2460, 3481, 6374, 7777, 1015, 98, -1694, -6893, -4932, -3852, -254, 1675, -1411, -4310, -2167, -1255, -6245, -7453, -4294, -1688, 643, -341, 1529, 42, 4562, 5530, 3533, 5371, 5827, 5543, 42, -5504, -9126, -163, 3106]
6181C106l025K47J923j0394P19O318M169K299K07n215k908j658k206O14K484M763
6165A443o655k882K441J775m805l006O869M620M215j790j747j332q18o19J355
6150i36k082J0274Q641Q94p616m173l082J806M695k127l097J060n24M217M63l438
6134D975j081N51k071j50J901m134j9N273Q61J34m573l736J5p35K553M449J876
6117F089j316l327o996L62n16K382O84J295l606J87P6M23O045K244J504n562k125
6100b157O784K497p290j118N037j482k969l620o75j609M385N39M350j862o894
6085f084j916o684K828M470M871J924K792j407k226J330j52l990k566K702Q829
6070D721j229j301n492j410J538J394J30J162m273K025k911K266M487J0359O19
$$ y = [3106, 81, 328, 2251, -8143, -7424, -1106, 3063, 5362, 5569, 354, -2554, -4212, -6418, -5804, -3320, 1443, -5212, -8094, -5653, -3878, -8683, -11689, -4820, -200, 4015, 2225, 478, -854, -1672, -2291, -936, -3018, 7256, 15897, 16791, 9175, 5002, 1920, 3726, 8421, 6294, 3197, 4257, 3733, 7950, 8413, 4975, 3894, 4445, 2374, 2224, 4125, -9, -28, 5245, 6106, 6240, 1667, -2069, -2054, -2789, -236, 4213, 6089, 4773, 1446, -5550, -5188, -5704, -3322, -2638, -1343, -4949, -4762, -4686, -4263, 1782, 4026, 5530, -32, -2157, 4627, 7124, -166, -1284, 3753, 2271, -698, -4318, -4993, -6602, -2217, -1678, 2672, 810, -6084, -8000, -14684, -11856, -7386, -2515, -591, 2201, 794, -1432, -102, -254, -4244, -6810, -4108, 4721, 3492, 2191, -3301, -4711, -3173, -1779, -1649, -487, -4760, -2735, -5646, -3380, 1107, 11466, 12085]
6055A2085j0656n178J064p80j37j7O333O347o888l542N503M54l497m765L247K685
6039B258l985P9L918R83p825l509L983Q12K776K637J662L659n405j264K939n443
6023a725k632l090o102K989P094J861L044O248j596m337r126O108M915L071k100
6008D622J508m639m5o40K709j102m186q016L839K006O436m12m164K335J523j364
5992D10J70K223k042m155k013J676M063N060m510j009j07K291k260L957m05p076
5976c727k105R61K949P462j277r130l62O820R31o67J340J072l969m568k06M311
5960a65O321M591j725j92l888k355Q98k866p312L91l24n031J538K138P154l892
5944d719K428N573J938J214l672l406k863m310k973j81K188k944J764L88N506
$$ y = [12085, 1429, -3749, -2685, -3465, -3602, -3619, 2714, 9061, 2173, -1369, 4134, 4588, 1091, -3674, -427, 2258, -1727, -1648, 2270, 3253, -4572, -8081, -4098, -3286, -510, 2127, 3789, 7448, 2043, 779, 3718, -1725, -4357, -7447, -13549, -10560, -3466, -1605, 1439, 7687, 6091, 1754, -7372, -1264, 3651, 6722, 4622, 6130, 1491, 1446, 806, 3515, 2413, -1773, -9789, -5950, -3944, 2492, 2080, -2084, 251, 1774, 410, 580, 2803, 761, -3394, -5407, -3731, 332, 5392, 882, -127, -234, 2057, -203, 3754, 3349, -3727, -5832, -4871, -1922, 5540, 4263, -4867, -5229, 1591, 2522, 1855, 3195, 4267, 298, -4270, -4476, -165, 6156, 10747, 9022, 8830, 4942, 2587, 3485, 619, -6693, -6302, -6626, -11657, -10119, -7981, -827, -4719, -2291, 3282, 5220, 6434, 2762, -644, -3507, -7817, -10790, -10971, -8783, -11727, -9963, -9575, -4069]
5929d069M611N400l035l518k16J956j383l96j392R06n878j987J74K069M858M45
5913a455o158q72q11K243Q632L814k709k064R77L157N956o295K51L863j365M9
5897G213K801k456j0694k259L307o98l303k230l33K98N84K639M242M6M043J804
5881E004K90J903k438n706m224j944N542k918o689l527O720J125j556m9K988L727
5865a752M809j222J766J429m593o129j1685L545J2461Q636J21o979m221J948N643
5850C777l324k449J594K7P096M465O95k684J06j753n382o816j126M129j142j960
5834d747r34l194k743M071K54k354K841o01l438l567r64P046j632l076J662O235
5818e141R83j11K060P782k362m279o75J695J1712L885j048m327o800n939k203
$$ y = [-4069, 542, 5942, 2907, -611, -827, 1129, -254, -650, -2042, -1136, -7014, -9001, -8827, -6758, -1900, -1455, -7613, -8485, -9296, -7053, 1579, 5393, 2684, 620, 1597, 4754, 10710, 4415, 4666, 8529, 7164, 7213, 10014, 7558, -3136, -5395, -2088, -2786, -6089, -8319, -8652, -8354, -7770, -5131, -889, -843, 3200, 5004, 5294, 7197, 4759, -947, -5171, -7115, -1573, -4491, -11180, -14707, -7987, -6862, -8418, -8467, -5479, -1752, 3057, 1835, 3601, 5030, 437, -5692, -17377, -13832, -1371, 7265, 7386, 407, -3814, -1866, 3777, 453, -1996, -402, -375, 6721, 11186, 11881, 9197, 9303, 7550, 2168, -4648, -5774, -1645, -2787, -4747, -5681, -8875, -11618, -7547, -7293, -9647, -6806, -7407, -10845, -14412, -15376, -8330, -9962, -13038, -11376, -5141, -4158, -4269, -2209, 5573, 3211, -1068, -1743, -48, 11664, 15549, 14501, 10174, 3374, -2565, -4768]
5803d768l712K557J019K390k045l582J106K63j319q68J397K937Q70l524l513M655
5787f137M997L439N324J735n842m342o661L083Q294L101r74l26k400l033n50K893
5771B601J616L047m360o696o056K781m163M359k094m12l502J928K843O566M960
5756C418j988L2j057K497o21j470j170K650M62J229r58j174j889l12P84Q162m84
5739H111j551J572k187o610N873M768j697o526r053j81O832o017l972K173L349
5724e116O53l526o206M760L409L31L600N98R068o1q357k585K130r18O73R52j579
5707b174o042J229O442K129N09k009j798K726k590q031j158M801Q207M380Q854
5692A5475o51k315q193m512L64j611m350k63J29J871J543N8K653n337j825R469
$$ y = [-4768, -8480, -5923, -4904, -2514, -4559, -8141, -7035, -6772, -8091, -8959, -7562, -4625, -3755, -7279, -10792, -6137, -1140, 2299, 7623, 9358, 3516, -826, -7487, -4404, 3890, 6991, 6017, 5691, 3291, 258, -292, 2601, 4217, 7264, 2904, -3792, -9848, -7067, -11230, -6871, -8965, -9377, -12879, -10951, -8108, -1542, 3418, 1430, 1462, 405, 2902, 2281, 811, -359, 2291, 2753, 3982, 3024, 1850, -39, -351, 433, 8595, 8111, 6560, 8132, 5945, -665, 5208, 9976, 8279, 1753, -7300, -7481, -649, -6666, -10638, -8465, -5116, -4463, -7989, -14195, -9435, -6026, -5695, -2095, -1497, 7571, 7510, -847, -3432, -1302, -2220, -1547, -595, -2174, -8216, -6987, -545, 1584, 2093, 84, -1714, 1012, -1578, -9609, -10767, -5966, 2241, 6621, 15475, 14824, 12509, 4316, -196, 168, -1443, -5793, -6056, -5927, -4056, -2513, -2455, 198, -5139, -6964, 2505]
5676B505m68K3j748j666l61j353p53M418L321n926n242k72q67K641k433j2j885
5659a0078N216N165o7J826j168m099k892O279j321q08J739k667K798l3m429L135
5643a404j136L11Q87N212P30m438q033L16L165K11j0050Q20K468J680j442J645
5627i058K793K911L767M32p23j181l533O54J322p81R68n961j369J598L169L432
5611a560L022J665L19l763o397l713L17O872K141K201N504J165r44o924k441k030
5595d566l82M548P204L621N179o859m777p491m668P183l664l432K614M360R290
5580H160L955m615j941P61j036l550n700Q79Q39P10J670l704m109l592L141m00
5564h532k860l800L646M499J841m875m391O51P037N419K784N772k209n47M943
$$ y = [2505, 2037, 2060, 312, -1354, -1715, -3068, -3821, 597, 3918, -2008, -7250, -7522, -8389, -5748, -8181, -8193, -10078, -4862, 303, 236, 2062, 894, -3205, -6097, 182, -1139, -1947, -208, -2875, -77, -110, -4539, -1404, -2540, -2229, -1342, 3870, 4600, 162, -7871, -7555, -4390, -4179, -14229, -13409, -10941, -9261, -10703, -9058, -6265, -3354, 413, 845, 122, -1059, -4592, -3938, -2616, -3397, -2429, -8390, -9759, -8161, -4992, -1560, 1462, 3127, 3446, -317, -6714, -10427, -10110, -3238, -1097, 1104, 6608, 7773, 6829, -95, -2536, -4566, -4948, -400, 6804, 10425, 15604, 8745, 3968, -3523, -8191, -1008, -4672, -8104, -5490, -1130, 8160, 12115, 7500, 5559, 6320, 5284, 1734, -3966, -3087, -2248, -1538, 132, -3572, -7681, -11273, -8132, -8532, -11392, -15192, -11546, -7047, -5206, -10081, -14472, -13821, -6784, -1365, 1419, 7191, 4982, 4435, 9378]
5549I378M807j749n006o081k103m24L93J745L41m907K98J516N199L814l254J485
5533E452J916j180k637K062l732q777R98J182j563o531L364r23K819L844N424
5518A718K107r38o62j029j485m072O52k190k275J557K883k798k699j575O72Q964
5502a170L95o83l60o528J593K159N7j684rJ36J866N268J268l493J103N24J789
5485B231L15k748l690K680K707m83m267M528j804k371m942n213P875O776L84N23
5469B501N070l089j899N243l401n071k13k801l481p09N246m868m98K049r61m997
5453a1879Q72r37K743O651P037J668L656n177q324k362O39m669L547J055J15p80
5437f145J922L865N83m157k493k631L772P560M284k919p823l927k065m038K960
$$ y = [9378, 14185, 12436, 7430, 1349, -754, -1178, -785, 960, 1301, -3606, -3308, -1792, 3407, 7221, 3967, 5452, 7368, 6188, 3551, 5613, 1881, -6896, -5898, -4716, -6279, -12810, -9446, -10369, -7550, -3706, 1718, 3825, 2887, 2225, 1196, -289, -4361, -3709, -5899, -8174, -6617, -3734, -6532, -9231, -10806, -10134, -1170, -775, -1458, -1818, -8346, -6753, -4594, -4537, -6221, -6230, -6094, -4228, 1040, 2308, -1185, -82, 442, 2231, 2546, -202, -3892, -1212, 1495, 1012, -3255, 1273, -531, -2902, -7844, -13057, -5182, 1594, 1978, 2501, 7571, 4482, 2583, 7826, 4425, -646, -859, -3660, -7141, -7850, -2604, -7472, -7970, -5921, -6882, -11879, -11007, -11944, -9201, -2550, 4487, 6155, 9811, 4634, -3690, -6052, -5413, -10082, -6535, -5480, -5365, -6145, -4223, -358, 225, -3932, -6425, -9056, -5284, 2276, 6560, 3641, -4182, -8109, -10174, -14212, -11252]
5422a1252M502j182J213j213R6J569Q63L438K484J579j712R06j356L32L877K772
5406F916k723K968k294M03p560m661m965K78J642L350M393j77k378j917l118k971
5390a2814l225J940P384O793j326j490j170k687K241l136J637q18K712N121k874
5375a712p545Q3N170P005j073n495J76K063O24J980M318n956J158j298K467j379
5359E86J567K709K760k117k953j521j664q52J655J034o857M13P31L60M31k189
5343e907O90J547L24m215j693N804P181Mo769j695L480J391q27L960J497j475
5327C297L193l462r17o292N43K969m095k71M614O000J121J570p031l587j970j875
5311f193j270k282r7Q45N886Q107k331j479n023J013N088K316m695k261l120r65
$$ y = [-11252, -6750, -7932, -6719, -7932, -7836, -6267, -5404, -1966, 518, 2097, 385, 1291, -65, 267, 4144, 6916, 4193, 7161, 4867, 5270, -2290, -6951, -11916, -11638, -9996, -6646, -2253, -2430, -4808, -6725, -9843, -12814, -16039, -14099, -6715, 78, -1248, -2738, -3908, -6595, -4354, -7490, -5853, -6671, -3959, 1162, -1712, -9257, -9174, -4004, 3001, 1928, -3567, -3391, -1328, -704, 1276, 5594, -362, 796, -502, 1965, 586, 2153, 4862, 7622, 5505, 2552, 1031, -633, -1485, 170, 1204, -5653, -5240, -4509, -4149, -3718, -5907, -5217, -3670, -3346, -7561, -9254, -3450, 3731, 3735, -3034, -4729, -1249, 142, -685, 3275, 4772, 3297, 6490, 3028, 2111, -4181, -3638, -669, -4764, -5035, -421, 5579, 6700, 8270, 1239, -2348, -4318, -6193, -7463, -9745, -9842, -8997, -3111, 4996, 2665, 1186, -3837, -2824, 2264, 4580, -115, -2376, -5496, -6461]
5295f461j821M321M848q95K86J488l771J711l039j612l405j623M918Q044n772
5280b783l842l33J476L528M370j173o653n87R61J564j715l561L966Q42K58L184
5264d98n326K424k971J901M310L063q370r51K020n220k177O089q45L797K247M885
5248D378K42n21l262n328K154K585P12k732N390O830m715n204o10M88N244n783
5232a32o099J795K526N93n52P82p00J37j764p216m300N236L594k296l13O166M716
5215B173J808K500M244k375o81M004q992q940J306O497N053l135l655k113L30
5200a976K963J014o70j080k482o6N655P370N498m58o530o708m169m798J360O833
5184A756j12n307k257l767N34j895Q640P263r187k803P982N595q97j873m737o997
$$ y = [-6461, -8282, -3961, 887, -8, 278, 1766, -2005, -294, -3333, -4945, -8350, -9973, -5055, 2989, -2783, -6625, -6958, -5482, -1954, 2416, 1243, -5410, -5997, -5036, -3472, -5187, -8748, -4782, -3940, -3682, -498, -5824, -3400, -6371, -4470, -160, 2903, -5467, -6418, -4398, -9618, -11795, -5706, -6551, -2754, -507, 4378, 4620, 4099, 837, -4491, -2337, 248, 960, -1772, 3618, 10448, 5733, 529, -81, 407, 5651, -132, -6231, -4436, -1910, -1317, -1869, -1087, -1787, -1650, -3414, -10630, -14930, -9694, -6100, -8396, -8709, -2543, 2173, 3981, 6481, 10725, 8350, 7669, 11673, 2681, -6259, -4953, 1544, 6597, 3462, -193, -2306, -1976, 987, 2001, 1331, 251, -2231, -2297, 3358, 10728, 16226, 15768, 9238, 2530, -1639, -6437, -5077, 1756, 1644, -3663, -5920, -9687, -9153, -11048, -2408, 4855, -4332, -7135, 847, 6442, 5545, 3672, -1065, -8062]
5168h062q815J514K696L358N712P39l539N023J884j27J705J49n564j625l277L677
5152d552j927J066L533m95p160K291M853n89l131m331R29K466L886R033o554o955
5136g637p50R20N591M1M02l403N949K205K050o523J991J3754K010m378k988j890
5120G344k198n73m248k445k093k228k258L135L017K12R42J393j210J668J753j882
5104C29m77K819P8q07K024l604R09M04l252k404L945l717j2949Q187R891n506
5088d130m327J506q88O178N022k452k263o541k345M214J955m746O29N704N456
5073B972N3n134J81K640J217J920o640k681j544L402M356l491l074k238r58Q37
5057h182L087M758q12j345R14N672N363m112j960J202J130R6l85q9K503p274m392
$$ y = [-8062, -16877, -15363, -12667, -9309, -3597, -2858, -6397, -1374, 510, 383, 2088, 2237, -3327, -4952, -8229, -4552, -6479, -5413, -1880, -2375, -9535, -7244, -2391, -2980, -6111, -10442, -9513, -7047, -3161, 5872, -682, -7637, -8387, -7467, -1876, -1835, -1433, -4836, 1113, 3318, 5368, -1155, 836, 14590, 16600, 12222, 9234, 7344, 5146, 4573, 325, -2120, -4213, -6441, -8699, -5564, -2547, -2335, -1393, 0, -1210, 458, 2211, 329, -148, 2671, 2749, 1942, 3966, 362, 1271, 1675, -1577, -3981, -36, -3753, -16702, -8515, 1376, -4130, -8457, -6951, -7839, -1661, 3361, 909, -1354, -7895, -10240, -6026, -4071, -8817, -8188, -2484, 2972, 3025, -2109, -1928, 712, 1929, 3849, -2791, -5472, -7016, -3614, 742, -2749, -5823, -8061, -9019, -8182, -5095, -337, -1149, -2494, -1580, 4092, 9455, 5343, 3383, 4585, 5715, 5811, 5426, 5337, 7840, 566, -3826]
5040c826L337M821J277j497m920l137K531K225l129J63L91n801J872j189k783
5025i665l161K928L265N528q7m451l593l666k38k311R539L975m736K934M778K545
5009C584K026r02M315K46j0779n125J731J686L288J280l387l270M251k34N021
4994C731M335L636k777r842l666Q13P818J035n279k073J483Q823m47m689k624
4979B77O10J414k38p62j123q50J75L925M960k477r68N078l518o298K89L62q878
4962h022J976k822k098O631M704k21l261n2J290P171j048k966o8j85k385l833
4946e189n430j78K103K403M480L036M35k241j509J964k998m280K751L052P46p116
4930g971j92o524q77J263K834O810L625K172K39n735K602Q271L76l742k999q1
$$ y = [-3826, -489, 4332, 5609, 4112, -808, -3945, -1414, 811, -2318, -2155, -1764, -7565, -5693, -6882, -9665, -12826, -9898, -6633, -1105, -1192, -5643, -9236, -12902, -13140, -15451, -5912, -1937, -6673, -3739, 1039, 3584, 5610, 4708, 9023, 9269, -1510, -6635, -4904, -3218, 70, 1350, -2037, -5307, -1056, -1290, 3731, 8066, 11702, 8925, -917, -4583, -3770, 4048, 5083, -196, -2269, -786, 8037, 7590, 2901, 277, 887, 2301, 2063, 1301, 178, -672, -497, 3428, 8388, 5911, 4943, 10021, 6503, 205, 494, 856, -8022, -6046, -8868, -10966, -4335, 369, 148, -3113, -3165, -1875, 5296, 4248, 1282, 1214, 1029, -1356, -5189, -10619, -10797, -8694, -6291, -1811, 1225, 1660, -581, -2090, -126, -3124, -7404, -4653, -1601, -855, -7971, -8163, -14687, -15564, -14301, -11467, -4657, -1032, 1140, 1379, -4356, -1754, 6517, 6893, 3151, 152, 71]
4914G1N229j784p036l166R79L015j081k401k5N62L115N510L205k740o054l155
4898e756j427P804j39k688R48j260K939R19k311p899o614J696M405k90O04L290
4882e779Q335J160l795m020r79m156O85j51N101j473k222L661M34M94l214l57
4866f276L366N385M860l380j000J043J575r9J729N150K127k146p326o774Oj274
4850c034M898K780l956k892r14O480j796J04l376m227j14P25L908L941l11j710
4834E06n499J385K017j415j16N60L946L498p180k358k64m280K08k113R220J498
4818c87m701j836K828Q842K138m066m84O54J976M801l447p187j318j503L379N82
4802B71j23o73J8J550k603o170k143O897P813J585J217M677K018j660n684n95
$$ y = [71, 5300, 3516, -3520, -6686, -5707, -2692, -3773, -6174, -6199, -5637, -2522, 2988, 6193, 3453, -2601, -5756, -7183, 621, 482, -2206, -1258, -2518, 421, 1340, -971, -8870, -15484, -13788, -9383, -9673, -9069, -5779, 2556, 3716, -79, -4099, -5078, -9234, -8549, -8700, -3599, -5072, -7294, -3633, -3199, -2705, -5919, -6276, -2910, 2475, 7335, 3955, 2955, 3998, 5573, 5474, 7203, 12353, 14480, 12334, 5008, -1766, -1760, -3034, 1864, 4644, 688, -2204, -3118, 3362, 1566, 1670, -1706, -5933, -6047, -5322, -1414, 2527, 2216, 506, -4993, -3608, -1591, -3006, -3122, -2562, 1384, 4882, -2298, -4656, -4920, -9200, -8992, -11105, -1885, -387, -5088, -6924, -4096, 4746, 6884, 2818, 2334, 2988, 4964, 9765, 6318, -869, -2187, -3690, -311, 271, 148, -525, -507, 1043, -1560, -7730, -9873, -2976, 4837, 6422, 7639, 12316, 14334, 12674, 6990, 6395]
4786F395k801o15j207J307K924j137L48l317r920R847O050j107k483n013o78J25
4770a282k813J359N263K580k372J0248K517o905l962p4k742k027L21M82J699K036
4754D328M66j615m8k713J196o14n627q149L672O201M955J555o035q99K055J329
4738E7L454M466N36o426j556J402j354L015m867k195k96j911j879P059L18p314
4722g491o060M031L908M532L630N357L897j462r666m836K71N310L753j957l781
4707e64k432l666l118J988J536j987n33j151k408M99q71Q145J683q513J221M482
4691e689L471L48k329O650J660R93k981l865o412L323L908M459l285k077L527
4676A701N41o874J113J350J577J656j015M696m946j953N863O49L63k353k243j117
$$ y = [6395, 3594, 2979, 1772, 3079, 6003, 4866, 5214, 1897, -8023, 1824, 7874, 6767, 4284, -729, -1407, -1282, -4095, -2736, 2527, 5107, 2735, 12983, 15500, 8595, 4633, 4559, 1817, -210, 111, 593, 2292, 4328, 4794, 3179, 3131, 418, 1614, 1000, -4627, -12776, -9104, -2903, 2052, 3607, -2428, -3327, -1272, 57, 3511, 7977, 8513, 2087, 531, 1933, 579, 3594, -1273, -3468, -3764, -5675, -7554, -495, -177, -7491, -13551, -9520, -5612, -1080, 2550, 7907, 11804, 10342, 676, -4160, -3889, 1421, 5174, 3217, -564, -2996, -6662, -9780, -7792, -6256, -8243, -8776, -9927, -12335, -11836, -12707, -4562, -2879, -11392, -10171, -5689, -2218, -1870, -4199, 2451, 4111, 5104, 2123, -1742, -8154, -4831, -923, 3536, 251, -1826, 1701, 2242, -4632, -3519, -2169, -592, 1064, 49, 4745, -201, -2154, 3709, 4358, 4721, 2368, 125, -992]
4660i92K142k288l947J928k040N707K722q42m854j681L272J1467M72m496O7q088
4644a451N488N083l042J595M352r587J487n58m248m055l823J422J062J0527M9
4629D301j690M838n192o376l632K53j46J777j237M243L225l963J853J856K251
4614B361m110n758m503r69o94O012O394j056J654j523J167L182o48K051k057l726
4598b223p72p03j903K21R490k288m982l206P600L172k266k544J894K738l026r49
4582B53L887k118J540k923j583q17L676L029q578o671K088M437k495q17k384J937
4566g539M212N465L716r0J688m099k420j981K546L119k412L537r617p389M108
4551g156N580j566l651L97J073N081P05J244K849L162m83m764k168j00k981m102
$$ y = [-992, 1150, -1138, -5085, -3157, -5197, 510, 3232, 2390, -2464, -4145, -873, 10594, 11066, 6570, 6637, -1451, 4037, 9120, 6078, 7673, 12025, 2438, 3925, 3367, -881, -4936, -8759, -7337, -6275, 4252, 4301, 2611, 7449, 2257, -4119, -7751, -7498, -7644, -5867, -7104, -2861, 364, -3599, -1746, 110, 2361, -1749, -7507, -12010, -12979, -13673, -7661, -1267, -2323, -669, -2192, -1025, 2157, 1509, 3560, 1503, -2223, -2995, -3698, -5601, -5380, 4110, 1822, -3160, -6366, 1234, 4406, 2140, -404, 1490, 4228, 1202, 253, 4140, 2022, 3562, 639, -944, -1761, 1915, 4944, -3634, -10305, -8217, -3780, -6275, -7092, -9476, -7539, -3327, 2138, 5854, 5764, 7452, 3353, 933, -1048, 1498, 4617, 2205, 5742, -3875, -11264, -7156, -1576, -3142, -6793, -6396, -5323, -242, 463, 1707, 4556, 7718, 7235, 2471, 303, 203, -2778, -6880]
4535f880j985M217P59j200k568j448P103M16P20M647J246J324k365L114l570m098
4519e68o061k408p22N696M031n377K861N033L572M325j810k966l051J146p24J052
4503D029J754k173N00j315r372M388O937k987L72J652L980l328M39k348L024N397
4487A0949o140M60n421q799n91O37P164K243n358P64o56M224O388k723J252J322
4471E715l199M066j4K856l269r560j0660J178M731O94J891N670M25n33l262L292
4455B1k806K003n599J421N25L724L08j465J608l88l998P775Q788j220l912j542
4439E243r54J06L330R72j0003Q92O151j383K640M73q374p39M499K197M155K22
4423I427l896p071k29K828j951j889K728Q16K407K743P874n697p470K181m80l011
$$ y = [-6880, -8865, -4648, -3889, -5089, -7657, -9105, -2002, -1586, -866, 3781, 5027, 6351, 3986, 7100, 3530, -568, -6629, -9037, -9759, -4063, -32, -5409, -2548, 2485, 6057, 10382, 8572, 5606, 2555, 3701, 2977, 4029, 5783, 3610, 4110, 2795, -6577, -2189, 4748, 1761, 2133, 3785, 7765, 4437, 4876, 2528, 5552, 10949, 4809, 5269, -152, -8951, -9542, -8905, -1741, 502, -4856, -4092, -4748, -524, 5864, 3141, 4393, 5715, 2516, 6582, 6568, 9424, 6155, -3405, -14065, -12887, -8156, -7462, -5571, 99, 524, -9, -3271, 21, -2785, -782, -6381, -4960, -4435, -711, -403, -1868, -260, -648, -4646, 3129, 11917, 10697, 6785, 5243, 4289, 4395, 7725, 8697, -1306, -414, 5737, 4354, 6994, 7467, -907, -1646, 2853, 5050, 9205, 9427, 5531, -1540, -1769, 1059, -892, -2781, -53, 763, 3170, 5913, 13787, 8090, 620, 2801, 2321, -690]
4407f90m194l923O441Q579j254o441l206M664M903L063j196j87l802q173J232
4392d184O627O434N01j881j440K621m234J209L973p83m401l656Q91K430R9l574
4376F32M011p138K159k200l172P15M06L732K768k494j197j630j841N774R080K238
4360A1843K268j271n720n90J760R66k794J626k538k297J689R59L699m566r435
4345d401k296K410J306L420r57n929J789L498L22j197J028P45m970N02Pk802p31
4328h256M783P356q29L197L879k915j552k620l740k558L16j218k437j985M70O211
4312a898N794L679m726L785O601p312n020m878M641M728o33n947n907M779Q884
4297F570m111j667l747J8K43K151L181l92L290j749k726N02J230o416M470K679
$$ y = [-690, -4884, -8807, -2366, 6213, 4959, -1482, -4688, -24, 4879, 7942, 6746, 6559, 2757, -5416, -4184, 2443, 8877, 9378, 7497, 6057, 8678, 4444, 5653, 9626, 8843, 4442, 786, 1677, 4107, 4206, 632, 4643, -2495, -336, -2536, -5708, -4993, -4587, -855, 1913, -581, -1778, -3408, -5249, 525, 9605, 11843, 14111, 12840, 7120, 6530, 8290, 9256, 6462, 8088, 5550, 3253, 4942, 5901, 9600, 5034, -4401, -6697, -4287, -2981, 439, -518, -6447, -4658, -1160, -838, -2035, -1007, -262, -5232, -4730, -4723, -7525, -8256, -3473, 3883, 3054, 6251, 10130, 7215, 5663, 3043, -697, -3255, -2939, -4157, -6594, -8579, -8109, -1898, 3896, 7575, 2849, 6634, 13235, 5923, 903, -3975, 666, 5394, 4761, -1186, -7093, -2314, 6570, 2459, 792, -2955, -2937, -2694, -543, 2638, 2246, 5536, 3787, 1061, 1563, 2793, -3623, 847, 3526]
4281C526o00n23N732O482o729m072p02r932m32O572M221N56l364j38K053P099
4265I749o03l944m734k852m710j681j430l734j065M125l419R38R193m45%L696
4249i16n61n012K054M011O504R24l661P82K978L734k400k36k496k236k633K428
4233C264j344O03O786J975l206l368j591k651j010j714m117K609j094L644j896
4218c110l797L675j184K994k12j828k144K944M579R64l281o525k716J4N632J777
4202b218L595o809o463N634P006j562L475m482j980l758L931L013k101L42K871
4187D94M161n048l865O302j460l069L237M914L320m983m496j172L131l280J2O688
4171D886J1019R57n850p102l321L547l522m994m92P424M432J952o41j608n852
$$ y = [3526, 2926, 2403, 8135, 14617, 7888, 3816, 3114, -6818, -7250, -678, 3543, 4099, 735, 597, 2650, 9749, 9146, 5202, 468, -2384, -7094, -8775, -10205, -13939, -15004, -10879, -14298, -13360, -4167, -4612, -4612, -916, -1477, -6489, -4435, -424, 6080, 7004, 3343, 4125, 7103, 10837, 8437, 8201, 5705, 3469, 836, 3264, 1920, 2523, 9309, 11284, 8078, 4710, 3119, 468, -542, -2256, -6373, -3764, -4858, -1214, -3110, -6907, -3232, -4416, -1422, -1634, -3462, -5606, -2662, 1917, 2881, -400, -6925, -9641, -9627, -3995, -2218, 1377, -5432, -11895, -6261, 745, -817, 2658, -1824, -3804, -7562, -3631, -618, -2719, -2377, 494, 4655, -393, -4258, 2044, 584, -2485, 752, 5666, 8986, 4003, -493, -1665, 1466, -1814, -1802, 4886, 15905, 16862, 11012, 3910, 589, 4136, 614, -4380, -4872, 2552, 6984, 8936, 8295, 6687, 835]
4156H35m665p98P054O338l689n252j841L648J323l08J330O031N25n101n902j845
4140b317j257m671O828M643l382l123j649p49M235L949k392n978R42K541J146
4125a234O321k534k417j528k029K525l424n913K507N745J918k276K67k164J740
4110b496j375N950m96r81J863k05J747n424M45l634j198M49N110P268Q00k709
4094E114m994L483k1k068j167P467L148o080m662L235O071j151m238M399j28o89
4078G719K086Q24q176p327k214k54K241n50L200J802N626j5k929k497o54k50L183
4061A815O119o071o759O214J558j80n452p275k153J914j39k812O501J116o84N934
4045c54m06j153K372J172n718k004l63L139j81o927n631J317L880M592M718k471
$$ y = [835, -3830, -4628, 2426, 8764, 5075, -177, -2018, 1630, 2953, 2645, 3975, 10006, 10531, 5430, -472, -2317, -3574, -8245, -1417, 3226, -156, -3279, -4928, -5677, -1442, 2507, 115, -5863, -4921, -2380, -1234, 5087, 2553, 136, -1392, -3421, -896, -4320, -10233, -7726, -1981, -63, -2339, -2072, -4236, -2496, -3871, 2079, 1583, 602, 2465, 2260, 4007, -1417, -972, -4606, -5804, -5355, -245, 7023, 7823, 5114, 120, 3603, 3582, 1514, 347, 7814, 10962, 4882, 220, 3455, 9526, 8375, 4137, 8536, 8408, 7719, 9805, 10629, 2453, -4874, -7088, -7342, -5101, -5651, -2451, -649, 4977, 4962, 2033, -464, -1118, -1368, 1815, 7934, 1863, -4896, 1318, 2876, 2696, -2756, -10031, -12184, -10270, -10409, -13221, -6720, -5604, -6288, -354, -760, -1913, 459, 1631, -4087, -6091, -6454, -3315, -3496, -10423, -16054, -14737, -10857, -6265, -1547, -4018]
4029d018M614K302R12q10K242l860k666L338J978K803m067l157q57r7P643J612
4013G912o108J829K227j752L127J234o684k438K066Q70L114n022L501j485p735
3998e344l406Q51L284N907J014j998m938j665N26j033O533L233o800n8M019L172
3982C297N289k202k123l241R73k667p02Q955N047l452n005r292l560M273N382
3967I72J329L31J071j611p266j38M822J991O26j077n9k060L112o174j691J652
3951d170K036o381j19L157R13K032J503L048M497K98n193k197l635M761N644m119
3935B075j315k515l312J343j121P174L177m567l939M510j441l855L261L807N29
3920C811J49J764j242k550L891o167l023K394N844n72l615k631N96K256K480l349
$$ y = [-4018, 596, 2898, 3810, 3000, 5242, 1382, -1284, 2054, 4032, 6835, 2768, -389, -1246, -1343, 6300, 7912, 1804, 3633, 5860, 4108, 7235, 8469, 1785, -653, 1413, 2283, 5397, 375, 3876, 2391, -5344, -8750, -7899, -4615, 1292, 2306, 308, -4630, -6295, -5769, -6802, -269, 2964, -3836, -3894, 125, 3297, 8586, 6384, 4261, 1020, 1993, -674, -1376, 7579, 12626, 9174, 4169, -5123, -8683, -4410, 972, 2301, 2632, 3703, 2092, -5174, -5312, -490, 1501, 2127, 1050, 991, -1069, 2043, -4131, -5822, -4170, -2134, -8515, -8634, -5477, -4564, -2532, -1029, 2019, 6516, 6814, 1621, -576, -4211, 550, 6194, 2075, 760, -1755, -5067, -3724, -4845, 2329, 5506, 939, -3000, 1510, 69, -3786, -525, 3282, 3811, 3960, 5724, 4482, 1932, 5823, -344, -3367, -973, 4871, 4299, 684, -1947, -1351, 905, 3385, 36]
3904C6J444l717j178l747J972N494l840j335l648Q54L8n52O94L754L663J228n31
3887F29l124N401j77n290j157k121O616O081p16N178Kq223n177J721k39J321K719
3870C444j650K448J769o715Q31p925J49N410l740K218J134n529j327N675P653
3855C845k242J783J132j238k10O40l945O97K938p1o875o954j14M422j864j366
3839i422J560K53m506N258J147l034J379K048O95O052N8k094K375K312J912l819
3823B174M36J706m57N755k346o268j125P89P344m203p650n782M691J511m14N107
3807A268L520m026j487k528o047k044K424O310R387J156j2106p734k285N623N391
3792c178k41k229l823O217M962k239o41M930R33o172j119M321k19N362j156j208
$$ y = [36, 1480, -2237, -3415, -7162, -5190, 304, -3536, -4871, -8519, -7665, -7627, -8179, -7485, -3731, -68, 1160, 629, -2495, 2906, 2729, -2561, -3718, -5839, 777, 6858, 6142, 11320, 11322, 3099, -2078, -357, -596, 725, 3444, 1794, 4242, 6011, -704, 127, -7798, -7649, -2239, -5979, -3761, -2627, -8156, -9483, -3808, 3845, 1603, 3386, 4518, 3280, 3070, 3710, -235, 462, 3400, 3329, -3546, -10500, -10614, -6192, -8056, -9422, -7862, -7609, -12115, -6857, -5710, -8744, -7365, -5317, -4622, 1430, 1488, -606, 1769, 4081, 5993, 2174, 2610, 4316, 3859, 9614, 7268, 1000, -125, 664, 8008, 3805, -3845, -9627, -4936, -3425, -3839, 1268, 4788, 762, -725, -3253, -9300, -11344, -8920, -2610, 6777, 7933, -4173, -11907, -14192, -8569, -3178, -3419, -5648, -9471, -3254, 1708, -531, -1172, 3758, 4691, -1481, -2600, 1721, 1502, 6864, 5708, 4500]
3776D500K228o071n571n132M064J967j893k619J050l20K119m184K677M117m030
3761g098K263J376j126m710m07l40j899J816j77J0328J416p955m204M161j213
3746g769N73K848l3K083l28jL74J569m023p76Q438l430n197l284M604j920j863
3729h135N126k387l37O87r77K121R588J212r74L66L717J415o501r44l61m902k94
3712a580J075Q41K859J77k069m824m396N252J395n384j326L619L031k731L1K017
3696b013O976O259m694J458m51J845k127l590p232m696j89L473O221O436k667
3681E009k015j286N29o894r78M685k370l130J422O170J683L815j601j588j716
3666A735j848n294l837K729L758p919r96K142L799O171m442j740j486l520L826
$$ y = [4500, 6728, 657, -4914, -10046, -5982, -4015, -5908, -8527, -7477, -7797, -5678, -9862, -7185, -3068, -7098, -4835, -3459, -4585, -9295, -9702, -10042, -11941, -10125, -10302, 26, 1442, -6513, -10717, -6556, -7769, -7196, -4348, -4381, -2298, -2626, -2627, -2253, -684, -4707, -5483, 2955, -475, -5672, -8956, -4352, -6272, -8135, -3009, -5396, -5733, -5046, -6023, -3902, 5686, 6898, 5924, 6290, 10007, 11422, 4921, 3977, 3616, -1286, -1580, -505, 336, 3195, 3372, 1303, -3521, -7917, -2665, -1270, -6654, -7980, -4361, -1330, -4061, -4030, -2013, 4963, 11222, 6528, 7986, 7535, 9380, 7253, 3663, -3569, -8265, -8454, -4981, 1240, 7676, 5009, 2994, 1708, 2237, -4657, -5635, -950, -3320, -6450, -5028, 1142, 2825, 6640, 5039, 3451, 1735, -113, -5407, -9244, -6515, -2757, -10676, -11672, -9530, -5731, 440, -4002, -5742, -7228, -10748, -6922]
3651f922N134M252l760K897l335l160K858K711k245j087N871M214j976l328m926
3636b802M00L9J087K095l205R436M932j806l379r12O84K038m075n306j770R003
3620F459K135j064l619q53M623p86K123m009q902j187j434k216R27O012j238q44
3604c873O062M275j926j361K932k322R63M558O760k331n408n298m659p066m417
3589a3111M726P991L216k347j373J232k310r272l512K73l50J384Q890j63L03j461
3573e884k337P453L826n312l688J429L078L075j323o554k61K263j563J563L060
3558a175J049K256J227J759K944o922p977L199J713N731N194J807J752n499m309
3543B749j036J62m548k763O178J984j498k710o522R99Q3K740K527j081m87q73
$$ y = [-6922, -1788, 2464, -1296, 1601, -1734, -4894, -2036, 675, -1570, -2657, 3214, 7428, 5452, 2124, -2802, -2402, -2363, -1276, 819, -2386, 7050, 11982, 10176, 6797, 5885, 6569, 8607, 4532, -774, -2544, 6459, 8594, 7530, 3911, 3058, 7681, 6895, 9018, 5009, -3893, -5080, -6514, -8730, -7803, -1791, -3029, -3873, 2189, 6464, 4538, 3177, 6109, 3787, 4750, 9308, 16068, 13737, 8329, 3031, -1628, -8694, -13111, -8385, -394, 2822, 475, -898, 334, -1976, -11248, -14760, -14487, -14837, -13453, -4563, -4726, -4423, -5884, -8221, -768, 3058, -2254, -5942, -4513, -1435, 1640, 317, -6237, -6498, -4235, -5798, -4235, -1175, -126, 2130, 3357, 5116, 8060, 1138, -6839, -3640, -1927, 3804, 8998, 10805, 12557, 7058, 2749, 1713, 1875, -2673, -5436, 742, 2726, 1228, -1482, -8004, -7005, -6922, -4182, -1655, -2736, -3223, -4096]
3527d096j042J049j990L938O225k74l770r78m821l552k404RP144j977j608M772
3511c375J833N661j384k161n909k926J660O145L03l80p070J298N326N695L231
3496G947q390p758n795j836N293N945j321j011j18K132O644J2367J327n455q528
3481A443q11M350j876j093k49O53m09J257j054J334Q19j233p15q42l063j065k50
3464b804m200N141O320m216o86L302J237M486p38n014m892M398N04l532m835l465
3448h994J187R862R41r70k694K87J652j777L660J301L404J886l518m220l121p123
3432h237j672L180k06J806J196O261J311L524j532k717q11Q7k43k024m449Q186
3416C660P968k0n024m930l390j064L664N974n760q395K971l603J541J605J916
$$ y = [-4096, -5138, -4089, -6079, -2141, 4084, 3810, 40, -938, -5759, -9311, -11715, -11706, -4562, -6539, -8147, -3375, -1542, 4119, 2735, 574, -5335, -8261, -6601, -456, -153, -533, -7603, -6305, -979, 4716, 7947, -443, -8201, -13996, -15832, -10539, -4594, -5915, -6926, -7044, -4912, 1732, 14099, 15426, 9971, 1443, 632, 4982, 3106, 2013, 1764, 2417, 2008, 3265, 2211, 3545, 4364, 3131, 2416, 1574, -1489, -2554, -2804, -7004, -1863, 4457, 241, -445, 2857, 4094, 8580, 7842, 2828, -2064, 2334, 2838, -694, -5529, -8994, -7807, 2055, 2996, 2026, -668, -381, 1271, -506, 3154, 4455, 7859, 9745, 6227, 2007, -1114, -8237, -9909, -6729, -6935, -5129, -3933, 2328, 3639, 7163, 5631, 2914, 2103, 2190, 1947, -77, -4526, 3660, 11628, 11608, 6584, 1654, -1736, -2800, 864, 6838, 1078, -7317, -4346, -7949, -6408, -4803, -2887]
3401b887l054j960M517N576J791O995k022o034q770j422N50O852o12J574J101
3386B195o906m336j966j206K007L002K301K685m905j490N003J258j486J861L571
3371A588m275K49M4N345k87j014O368j001n640p42j509l864J577J904K98j154
3355b113L988j438p068p238K881O377m93o280k487L763Q137k53k321J793K759
3340GQ16j550k089q63N369n62n047j827M752L381K569J860p68J194J434J744K433
3323A2853j202n777m069m199m235r99K131k01L384j033P83j814J656L004J001
3308A283J698L421K364k534l007j311L455L995m72K377Q1j608m62m869l058k699
3292a346J621N246Q37m07k980j280J901K066J18j725P85l531K517J204Q29m722
$$ y = [-2887, -5941, -7901, -3384, 2192, 3983, 10978, 8956, 2922, -5848, -7270, -6720, 132, -480, 1094, 2195, -4711, -9047, -11013, -12219, -10212, -7210, -4909, -2224, -7129, -8619, -3616, -2358, -3844, -1983, 1588, -2687, -2438, -2394, 2951, 2664, 1650, 8018, 7017, 1377, 635, -874, -4738, -3161, -1257, -959, -2113, 1875, 437, -6631, -13869, -10988, -4611, -5104, -11384, -13871, -10108, -1971, -2224, -4545, -2752, 7, 823, -727, -2816, -3679, 1690, 1128, -3919, -5746, -994, 2387, 4956, 6816, 6048, 7242, 8676, 10420, 12853, 11651, 5874, 1805, -2394, -6629, -7628, -5497, -5698, -2314, -3347, -2564, -4378, -2722, 282, 1283, 2981, 6402, 8766, 6232, 3225, 1914, 5369, 9364, 8892, 11269, 11350, 9742, 9280, 4411, 1353, -1346, 275, 5521, 6358, 5951, 2971, 1691, 3592, 5658, 5776, 4051, 4836, 1305, 3822, 5026, 5855, 1133]
3276A133j865l78L065K383l82j929L042l532j1651k550O368J813N7l001j129M930
3260c626K448j044J356j613J272L380K010m528j083K741L218j547m395P779J027
3245G395Q60l522n683L396N838k070m799l72N264O32k795r408J768P135n526j502
3229c389M589P525k270r800l300K020j643L558k616o706m133K749J2362J608m043
3214c489J84L065R175q70J229J302o395l03J374L706J637l182n647p01J231L458
3198E774l500L313J321L438L12m19m797r524j460K304k060L500o97N16l57J982
$$ y = [1133, -732, -1110, 1955, 4338, 3956, 2027, 5069, 1537, -10114, -12664, -6296, -4483, -4426, -7427, -8556, -3626, -1178, -2222, -866, -2479, -1207, 2173, 4183, -345, -1428, 1313, 4531, 2984, -1411, 6368, 7395, 8255, 4733, -950, 2446, 8284, 6214, 1415, 1043, 6307, 6939, 4144, -5264, -3496, 3639, -1887, -3389, 1200, 8725, 6455, -3345, -6645, -4625, -6268, -2710, -5326, -12032, -16165, -13416, -1054, 554, -3489, -3305, -240, 8935, 8065, 9294, 10596, 4201, 3898, 5272, 8978, 10615, 7433, 1786, 1085, 2316, 5774, 2274, 5587, 6908, 10346, 10658, 10239, 5442, -4082, -5542, -3238, -5298, -1798, -2495, -1979, -2336, -354]
$$ [...]
##END NTUPLES=NMR SPECTRUM
##END=
