##TITLE=Analysis number 329527
Compound Code cc 29716
Project Code adrs
Chemist Name fudan
##JCAMPDX= 6.0         $$ Bruker NMR JCAMP-DX V2.0
##DATA TYPE= NMR SPECTRUM
##DATA CLASS= NTUPLES
##ORIGIN= Bruker BioSpin GmbH
##OWNER= nmr
$$ XWIN-NMR		Version 3.5
$$ Tue Sep 11 10:40:02 2007 GMT Daylight Time (UT+1h)  MAYBRIDGE\nmr@NMR_250MHZ
##.OBSERVE FREQUENCY= 250.131544655141
##.OBSERVE NUCLEUS= ^1H
##.ACQUISITION MODE= SIMULTANEOUS (DQD)
##.ACQUISITION SCHEME= undefined
##.AVERAGES= 16
##.DIGITISER RES= 18
##SPECTROMETER/DATA SYSTEM= dpx250
##.PULSE SEQUENCE= zg30
##.SOLVENT NAME= CDCl3
##.SHIFT REFERENCE= (INTERNAL, CDCl3, 0, 16.4432)
##AUDIT TRAIL= $$ (NUMBER, WHEN, WHO, WHERE, WHAT)
$$ ##TITLE= Audit trail, XWIN-NMR		Version 3.5
$$ ##JCAMPDX= 5.01
$$ ##ORIGIN= Bruker BioSpin GmbH
$$ ##OWNER= nmr
$$ C:\u/data/dgb/nmr/ADRS/520/pdata/1/auditp.txt
$$ ##AUDIT TRAIL=  $$ (NUMBER, WHEN, WHO, WHERE, WHAT)
(   1,<2007-09-11 10:39:31.56 +100>,<MAYBRIDGE\nmr>,<NMR_250MHZ>,
      <created by zg, POWCHK disabled, PULCHK disabled
       configuration hash MD5:
       76 6E 9A 78 1E 09 19 81 EC 84 63 8F B0 6A 59 2D
       data hash MD5: 64K
       8E 6D 3D 42 A6 26 9A B3 A3 B0 2C D8 08 A6 2C 05>)
(   2,<2007-09-11 10:39:47.05 +100>,<MAYBRIDGE\nmr>,<NMR_250MHZ>,
      <Start of raw data processing
       ef LB = 0.3 FT_mod = 6 PKNL = 1 SI = 32K 
       data hash MD5: 32K
       D7 07 63 DF EA 5F 14 86 34 9E 4E DC 59 64 BD C1>)
(   3,<2007-09-11 10:39:51.38 +100>,<MAYBRIDGE\nmr>,<NMR_250MHZ>,
      <apk 
       data hash MD5: 32K
       97 27 74 C2 AE 50 B5 87 2B 1E C2 1C B7 B9 9D EE>)
(   4,<2007-09-11 10:39:52.98 +100>,<MAYBRIDGE\nmr>,<NMR_250MHZ>,
      <abs ABSG = 5 
       data hash MD5: 32K
       3B 29 A6 B2 76 AD 13 65 4B CF 55 64 2B 51 C5 A3>)
$$ ##END=
$$ 
$$ hash MD5
$$ 2C DA 05 CE F2 51 F3 30 4E 14 C8 DF E3 23 8C EF
##$RELAX= 
##$RELAX= 
##$RELAX= 
##$RELAX= 
##$RELAX= 
##$RELAX= 
##$RELAX= 
$$ Bruker specific parameters
$$ --------------------------
##$DU= <C:\u>
##$EXPNO= 520
##$NAME= <ADRS>
##$PROCNO= 1
##$TYPE= <nmr>
##$USER= <dgb>
##$AMP= (0..31)
100 100 100 100 100 100 100 100 100 100 100 100 100 100 100 100 100 100 
100 100 100 100 100 100 100 100 100 100 100 100 100 100 
##$AQSEQ= 0
##$AQ_mod= 3
##$AUNM= <au_zg>
##$AUTOPOS= <11 >
##$BF1= 250.13
##$BF2= 250.13
##$BF3= 250.13
##$BF4= 250.13
##$BF5= 500.13
##$BF6= 500.13
##$BF7= 500.13
##$BF8= 500.13
##$BYTORDA= 1
##$CFDGTYP= 0
##$CFRGTYP= 5
##$CHEMSTR= <none>
##$CNST= (0..31)
1 1 145 1 1 1 1 1 1 1 1 1 1 1 1 1 1 1 1 1 1 1 1 1 1 1 1 1 1 1 1 1 
##$CPDPRG= <>
##$CPDPRG1= <>
##$CPDPRG2= <>
##$CPDPRG3= <>
##$CPDPRG4= <mlev>
##$CPDPRG5= <mlev>
##$CPDPRG6= <mlev>
##$CPDPRG7= <mlev>
##$CPDPRG8= <mlev>
##$CPDPRGB= <>
##$CPDPRGT= <>
##$D= (0..31)
0 1 0 0 0 0 0 0 0 0.06 0 0 0 0 0 0 0.0002 0 0 0 0 0 0 0 0 0 0 0 0 0 0 
0 
##$DATE= 1189503570
##$DBL= (0..7)
120 120 120 120 120 120 120 120 
##$DBP= (0..7)
150 150 150 150 150 150 150 150 
##$DBP07= 0
##$DBPNAM0= <>
##$DBPNAM1= <>
##$DBPNAM2= <>
##$DBPNAM3= <>
$$ [...]
##$SUBNAM7= <"">
##$SUBNAM8= <"">
##$SUBNAM9= <"">
##$SW= 20.6930455092707
##$SWIBOX= (0..15)
0 0 3 0 0 0 0 0 0 0 0 0 0 0 0 0 
##$SW_h= 5175.983436853
##$TD= 65536
##$TD0= 1
##$TE= 298.16
##$TE2= 300
##$TE3= 300
##$TEG= 300
##$TL= (0..7)
0 120 120 120 120 120 120 120 
##$TP= (0..7)
150 150 150 150 150 150 150 150 
##$TP07= 0
##$TPNAME0= <>
##$TPNAME1= <>
##$TPNAME2= <>
##$TPNAME3= <>
##$TPNAME4= <>
##$TPNAME5= <>
##$TPNAME6= <>
##$TPNAME7= <>
##$TPOAL= (0..7)
0.5 0.5 0.5 0.5 0.5 0.5 0.5 0.5 
##$TPOFFS= (0..7)
0 0 0 0 0 0 0 0 
##$TUNHIN= 0
##$TUNHOUT= 0
##$TUNXOUT= 0
##$USERA1= <user>
##$USERA2= <user>
##$USERA3= <user>
##$USERA4= <user>
##$USERA5= <user>
##$V9= 5
##$VALIST= <valist>
##$VCLIST= <CCCCCCCCCCCCCCC>
##$VD= 0
##$VDLIST= <DDDDDDDDDDDDDDD>
##$VPLIST= <PPPPPPPPPPPPPPP>
##$VTLIST= <TTTTTTTTTTTTTTT>
##$WBST= 1024
##$WBSW= 4
##$XGAIN= (0..3)
0 0 0 0 
##$XL= 0
##$YL= 0
##$YMAX_a= 281532
##$YMIN_a= -254861
##$ZGOPTNS= <>
##$ZL1= 120
##$ZL2= 120
##$ZL3= 120
##$ZL4= 120
##$ABSF1= 16.44321
##$ABSF2= -4.249962
##$ABSG= 5
##$ABSL= 3
##$ALPHA= 0
##$AQORDER= 0
##$ASSFAC= 0
##$ASSFACI= 0
##$ASSFACX= 0
##$ASSWID= 0
##$AUNMP= <proc_1d>
##$AZFE= 0.1
##$AZFW= 0.1
##$BCFW= 0
##$BC_mod= 0
##$BYTORDP= 0
##$COROFFS= 0
##$CY= 12.5
##$DATMOD= 1
##$DC= 0
##$DFILT= <>
##$DTYPP= 0
##$F1P= 14.0000005364418
##$F2P= -0.99999901652339
##$FCOR= 0.5
##$FTSIZE= 32768
##$FT_mod= 6
##$GAMMA= 0
##$GB= 0
##$INTBC= 1
##$INTSCL= 1
##$ISEN= 128
##$LB= 0.3
##$LEV0= 0
##$LPBIN= 0
##$MAXI= 10000
##$MC2= 0
##$MEAN= 0
##$ME_mod= 0
##$MI= 0
##$NCOEF= 0
##$NC_proc= -5
##$NLEV= 6
##$NOISF1= 0
##$NOISF2= 0
##$NSP= 0
##$NTH_PI= 0
##$NZP= 0
##$OFFSET= 16.44321
##$PC= 1
##$PHC0= -65.8023
##$PHC1= 9.306013
##$PH_mod= 1
##$PKNL= yes
##$PPARMOD= 0
##$PSCAL= 4
##$PSIGN= 0
##$REVERSE= no
##$SF= 250.130019706904
##$SI= 32768
##$SIGF1= 0
##$SIGF2= 0
##$SINO= 400
##$SIOLD= 32768
##$SREGLST= <1H.CDCl3>
##$SSB= 0
##$STSI= 32768
##$STSR= 0
##$SW_p= 5175.98343685301
##$SYMM= 0
##$S_DEV= 0
##$TDeff= 65536
##$TDoff= 0
##$TI= <Analysis number 999999
Compound Code 99
Book Reference 9
Project Code 9>
##$TILT= no
##$TM1= 0
##$TM2= 0
##$TOPLEV= 0
##$USERP1= <user>
##$USERP2= <user>
##$USERP3= <user>
##$USERP4= <user>
##$USERP5= <user>
##$WDW= 1
##$XDIM= 32768
##$YMAX_p= 365365191
##$YMIN_p= -661890
$$ End of Bruker specific parameters
$$ ---------------------------------
##NTUPLES= NMR SPECTRUM
##VAR_NAME=  FREQUENCY,     SPECTRUM/REAL,   SPECTRUM/IMAG
##SYMBOL=    X,             R,               I
##VAR_TYPE=  INDEPENDENT,   DEPENDENT,       DEPENDENT
##VAR_FORM=  AFFN,          ASDF,            ASDF
##VAR_DIM=   32768,         32768,           32768
##UNITS=     HZ,            ARBITRARY UNITS, ARBITRARY UNITS
##FACTOR=    0.157963299565203, 1,           1
##FIRST=     4112.94059187467, 0,            0
##LAST=      -1063.04284497834, 0,           0
##MIN=       -1063.04284497834, -661890,     0
##MAX=       4112.94059187467, 365365191,    0
$$ Real data points
##PAGE= N=1
##DATA TABLE= (X++(R..R)), XYDATA
$$ [...]
17495G3288515J8591840K8181377K9734544J8353342M526174r28344j287771j0325474
17487A60134203j9030245j2940012O585605J9990404J5668961L568428p96612
17480A73180732j007254j1865431k7590505l3970200k7909343j7907358j0182075
17473D2748566n413999k602917p48484J306154L981951Q433618J6101829K8619599
17465I2426317M4055851M8175069K0836478k4104553m9136245m2439549k5117235
17458F4696133j2679782m514994K241853R250661J3915078Q578287o129083j7629461
17450E7728692j7752237j1618277o694686m026570k579218j820344j262346p92747
17442A1182267p55751r06340p24922m67357k52565j91434p1822k47669m44920
$$ plain form
17495 73288515 91880355 120061732 149796276 168149618 172675792 171747448 170459677 160134203
17487 160134203 141103958 128163946 134749551 154739955 170408916 173977344 173180732
17480 173180732 172173478 160308047 132717542 98747342 70837999 52930641 42748566
17473 42748566 37334567 34731650 33983166 35289320 39271271 47704889 63806718 92426317
17465 92426317 136482168 184657237 205493715 181389162 132252917 89813368 64696133
17458 64696133 52016351 47501357 49743210 58993871 72908949 81487236 75358153 57728692
17450 57728692 39976455 28358178 21663492 17636922 15057704 13237360 11975014 11182267
17442 11182267 10426516 9520176 8795254 8327897 8075332 7883898 7812076 7564407 7119487
17433G119487n52630o27633m37117j45094K7181q8938j08826j63307k07927k45572
17423D569624l14879l37550p1153m531j06161j68190j9749r1554k78127k34308
17413B943422j44132j22775j48732j68502n9415p802N4301J71496J93531P4814
17403B786206j17251l04597j34410l5837M4388k5673Q0185k9644o8766j26307
17393B068294m1074K08871J64707K12769L23161K86415L22612J65007r865j90011
17383C510886j13895n253J53003J59989o3251J06410J04540K76038J45435j58053
17373D115849j99354R7482J71241J42181K76479K64307K84246L37143M97420Q12066
17363F799060J202820J764451K604034M205757P336484J2366236K0100615K8987180
$$ plain form
17433 7119487 6566857 5939224 5502107 5357013 5384194 5295256 5186430 5023123 4815196 4569624
17423 4569624 4254745 3917195 3846042 3841511 3735350 3567160 3547411 3455857 3177730 2943422
17413 2943422 2799290 2676515 2527783 2359281 2299866 2292064 2346365 2517861 2711392 2786206
17403 2786206 2668955 2364358 2229948 2194111 2238499 2212826 2293011 2263367 2194601 2068294
17393 2068294 2027220 2236091 2400798 2613567 2936728 3223143 3545755 3710762 3700897 3510886
17383 3510886 3396991 3391738 3544741 3704730 3641479 3747889 3852429 4128467 4273902 4115849
17373 4115849 3916495 4013977 4185218 4327399 4603878 4868185 5152431 5489574 5986994 6799060
17363 6799060 8001880 9766331 12370365 16576122 23912606 36278842 56379457 85366637
17355H5366637K9061434J1461396j4154719k7419532k3196257j2210467k816706
17348D6091786N367917J5251855K7565572L6360635K7246145k690372l1828658
17341A23364880l8983196k8510046j6846694r938664o108667m028196k783683
17334A6165734j950354j279239p20952k55492K21193M07177N48543R65152J117817
17325A5219579O79785j94995r14779j170956j023927q77252l37754M05893J369543
17316A3155137K268885M005141P101768J2347077J9373633K2425144J2571303
17309I3248088o504600j8835663j6860427p593079J461806R266067J4001729J1993476
17301H0177397L945191j401132L879872J8853322L4187416L2149941M671586k9185045
$$ plain form
17355 85366637 114428071 125889467 111734748 84315216 61118959 48908492 46091786
17348 46091786 51459703 66711558 94277130 130637765 157883910 155193538 123364880
17341 123364880 84381684 55871638 39024944 29086280 22977613 18949417 16165734
17334 16165734 14215380 12936141 12215189 11959697 12180890 12588067 13136610 14101762 15219579
17325 15219579 15899364 15704369 14789590 13618634 12594707 11717455 11379701 11785594 13155137
17316 13155137 15424022 19429163 26530931 38878008 58251641 80676785 93248088
17309 93248088 86743488 67907825 51047398 43454319 44916125 54182192 68183921 80177397
17301 80177397 84122588 82721456 86601328 105454650 139642066 171792007 176463593 147278548
17293A47278548m3138671l5443401k2093300j2778288p627414m842078l044749
17286A8310647j863083j298482j206590j335882j283078j198236q28296n76819
17278H720181m60654m76348l89590j28906j02651l2879J81845N43068P18863O56532
17268I229461L40209O7280K12051P40119J137834J436698K528569M864713Q896989
17259B9453923J3327550J2627687L821045p704818j2855436r885042m904077r47177
17251B2933655K547617O579964J1482043J3441095O942375n659770j3882996j3346588
17243C1037395q586724m635778k242739r25268q0842R78038K174158L635116O162182
17234B7515538J0417340J7817598K9768181M3523238M6022128L0883651O335767
$$ plain form
17293 147278548 104139877 68696476 46603176 33824888 26197474 21355396 18310647
17286 18310647 16447564 15149082 13942492 12606610 11323532 10125296 9297000 8720181
17278 8720181 8259527 7783179 7393589 7264683 7162032 7129153 7310998 7854066 8572929 9229461
17268 9229461 9569670 9636950 9849001 10589120 11726954 13163652 15692221 20556934 29453923
17259 29453923 42781473 55409160 59230205 51525387 38669951 28784909 23880832 22933655
17251 22933655 25481272 32061236 43543279 56984374 63926749 58266979 44383983 31037395
17243 31037395 22450671 17814893 15572154 14646886 14566044 15544082 17718240 21353356 27515538
17234 27515538 37932878 55750476 85518657 129041895 175064023 205947674 212283441
17227B12283441j9872574l7579013l6134722j7595525L961697K1219886K7018732
17220A53301922J5229392j0409112l2837414l7829344k8247555j6901630j0075535
17213C2230724o278371m073598k803022k134552j707417j186106n35986j52259
17205A3359413O1805J16139m2917j3140K16513O04263J783073L731914N868237
17196B5685300P072997N705085J425555k999632m674078l285381k313799k749683
17188B3866364k420205p64159J742112N084787R963952J7771804K7656063L1771971
17180A14672689K3165799P635073r772421k5378913l0781919k3472048j2553737
17173D3514523n020158O69767P040903J5670588K4821102K5602006J1230873j1584560
$$ plain form
17227 212283441 192410867 154831854 118697132 101101607 105063304 126283190 153301922
17220 153301922 168531314 158122202 125284788 87455444 59207889 42306259 32230724
17213 32230724 25952353 21878755 19075733 16941181 15233764 14047658 13511672 13359413
17205 13359413 13421218 13537357 13494440 13481300 13697813 14302076 16085149 19817063 25685300
17196 25685300 32758297 38463382 39888937 36889305 32215227 28929846 26616047 23866364
17188 23866364 21446159 20682000 22424112 27508899 37472851 55244655 82900718 114672689
17180 114672689 137838488 145473561 135701140 110322227 79540308 56068260 43514523
17173 43514523 38494365 39164132 46205035 61875623 86696725 112298731 123529604 111945044
17165A11945044k6693689k7275494j9388833j1419613o760289m352542k983345
17158A3071239j997804j379753j055024o57844o02342n73960l97232j74084n34962
17149E698234n15875m00872k88404k99772j04755R2151Q1030p7582k84010k89666
17139C610479m87391l44548j51770k20438j95816P536M8312K5722j58522j57350
17129A976214j41336j84453j80996r5798q8263J218J41222M8929n82k6941l8821
17118A410393k00396n9638j1961O0735n086j51734n6290q8220j59541j4741J24605
17107H48126J27671J01239N8922k9323p6636n6226M6495j00778j68756q7640l1354
17096F31740m9890k036N566J8551o0365n7332M2888N9293J21543k1439r8700m0691
$$ plain form
17165 111945044 85251355 57975861 38587028 27167415 20407126 16054584 13071239
17158 13071239 11073435 9693682 8638658 7980814 7378472 6804512 6407280 6233196 5698234
17149 5698234 5182359 4781487 4493083 4193311 4088556 4180707 4261737 4184155 3900145 3610479
17139 3610479 3123088 2778540 2626770 2406332 2210516 2218052 2266364 2292086 2133564 1976214
17129 1976214 1834878 1650425 1469429 1373631 1285368 1286586 1427808 1476737 1476155 1449214 1410393
17118 1410393 1209997 1150359 1138398 1199133 1194047 1042313 986023 897803 738262 723521 848126
17107 848126 975797 1077036 1135958 1106635 1029999 973773 1020268 919490 750734 663094 631740
17096 631740 581850 579814 585380 603931 543566 486234 529122 588415 709958 688519 589819 549128
17084E49128R8148J8679j69068O021O495m7369p3250m8710N7968L6384M2098N1175
17072E27699l8174j85729Q1208Q9906l4P8472J7537r1741j09354l190N0313J8296
17060D35209p8010j8411K3381O3162N691J6621j9754J6773J9444j23155L607K7641
17048C72199P703j06018L2702Q7027J57909J17607J74180J53619Q9224j0383j04389
17037I71380j91035k110L6542L714P8765K07567K87511K21193o9739j87776r1758
17026A264254N880j25474r635L9867j23291j03123k5435m8052L1070K2590K0150
17015I48801n7588j06722j75619k66042j94239n9485K3995k993J02752O1425J15540
17004C89825M7209j62829q7234L5072M6633J9791J49811J46594P2890K02880L7830
$$ plain form
17084 549128 647276 665955 496887 502908 509403 462034 388784 340074 398042 434426 476524 527699
17072 527699 489525 303796 385004 474910 474876 553348 570885 479144 369790 366600 416913 435209
17060 435209 357199 338788 362169 425331 431022 447643 427889 444662 464106 340951 344558 372199
17048 372199 379902 273884 306586 393613 551522 669129 843309 996928 1086152 1075769 971380
17037 971380 780345 778235 814777 818491 897256 1104823 1392334 1613527 1543788 1356012 1264254
17026 1264254 1270134 1144660 1135025 1174892 1051601 948478 923043 874991 906061 928651 948801
17015 948801 891213 784491 608872 342830 148591 89106 113101 110108 212860 274285 389825
17004 389825 437034 274205 186971 222043 268676 288467 438278 584872 657762 860642 898472
16993H98472n5485K9268l6713L3814K5875O0935M6676O6041J9346o4938j74132
16982H49159o5129J47608J79434J679o5309O2740P8105j89683j95541k50876q2392
16971D69795P2456J45086K9636J9322J0200j9490l8831j5895j71520k03611j14137
16960A83011j15956p7718j22149l0989J01903P8219K5460k9477p113J5053P9634
16949I9878j169J37417J08694j7915J14444O0013p3698n7322K1023k5742j72931
16938A92692k4110L3118K58404K52727l8131j85432j26249q3236j21296o07J29631
16927B87511Q1974l3325l6751k1619m5416l1277j34287j14189n3866N4081O8758
16916B1594R828n0590j00434N3093J5033j22276k2290l877J5761J32273K8112
$$ plain form
16993 898472 842987 872255 835542 869356 895231 956166 1002842 1068883 1088229 1023291 849159
16982 849159 784030 931638 1111072 1112751 1047442 1110182 1188287 998604 803063 552187 469795
16971 469795 542251 687337 716973 736295 746495 727005 688174 672279 500759 297148 183011
16960 183011 67055 -10663 -132812 -163801 -61898 16321 41781 12304 5191 20244 99878
16949 99878 98709 236126 344820 326905 441349 501362 427664 370342 391365 365623 192692
16938 192692 168582 201700 460104 712831 674700 489268 363019 279783 158487 157880 287511
16927 287511 369485 336160 299409 277790 232374 201097 66810 -47379 -101245 -47164 21594
16916 21594 31422 -19168 -119602 -66509 -51476 -173752 -196042 -199919 -184158 -51885 -23773
16905b3773P2234n7570j8090K4526l295q5320j5423O8033P3096m759K503m7770
16893a5608j5756J24J5317r030m7926K2584J07695l6983j8896K0680J9301q4921
16881d3419j13400L6824J9821q3574o2790L170p3576K0138J03659O9492m5074
16870a68729j05195L9985J41016M864m701N5808R0633L3304k4654M361O9467N8839
16858A94998L6795n9848p8453n9910o5622J79071N5204j38143o9977k8690L4732
16847A57J28995Q2115j5885K52758K79695o942j77014j88811k9921L9470N1725
16836D16342R5378J44154J25992J7108n8055k50448o2244j73546k06272k8017
16826B0392j18943N0921J27749k199p5653j4143L108l2358J22929K3622J5100
$$ plain form
16905 -23773 48461 -9109 -27199 -2673 -5968 -91288 -106711 -38678 34418 29659 32162 -15608
16893 -15608 -31364 -31240 -15923 -24953 -72879 -50295 57400 20417 1521 22201 41502 -43419
16881 -43419 -156819 -119995 -100174 -183748 -246538 -243368 -316944 -296806 -193147 -123655 -168729
16870 -168729 -273924 -233939 -92923 -88059 -92760 -36952 53681 86985 62331 66692 136159 194998
16858 194998 231793 171945 93492 33582 -32040 147031 202235 64092 -5885 -34575 157
16847 157 129152 211267 195382 448140 727835 720893 543879 355068 325147 364617 416342
16836 416342 511720 655874 781866 798974 740919 490471 428227 254681 48409 20392
16826 20392 -98551 -47630 80119 77920 2267 -11876 -8768 -41126 81803 105425 120525
16815A20525O0466m4781j16870k2594Q5750l6281j0135l4428l0234O3151O2965
16804I7534M983j4077N5525J26792J2157o7683J61276J65216L2719j01m0822o152
16792E27367M0244J06651O9724N6908j07095r6658j9870N3105M0727K9356J14495
16781H14954q7034j10226j95306j60950k3223l9672n4418O816n8637m4028L1377
16770G9653J4064m096J0124J28752N6169m2419q5798j25292k2024J06443p5809
16759C9767J9099k58j6566L9595K3039p3818j04909N9987K2488m5205l289J34592
16747I4522J07633J6016K9984o256m1947j85694J2165O6237M3231p5825Q1606
16736A41672J26957K05332R4332J06556R0681K13088P2427J4459j42753j80853
$$ plain form
16815 120525 180991 136210 19340 -3254 82496 46215 36080 1652 -28582 34569 97534
16804 97534 102517 88440 143965 270757 282914 215231 376507 541723 574442 574341 533519 527367
16792 527367 567611 674262 743986 800894 693799 597141 577271 630376 671103 700459 814954
16781 814954 727920 617694 422388 261438 238215 198543 144125 150941 92304 48276 79653
16770 79653 93717 89621 99745 228497 284666 242247 156449 31157 9133 115576 39767
16759 39767 58866 58608 42042 81637 104676 30858 -74051 -14064 8424 -36781 -40070 94522
16747 94522 202155 218171 248155 241899 199952 14258 26423 92660 135891 60066 141672
16736 141672 268629 473961 568293 674849 765530 978618 1051045 1065504 922751 741898
16726G41898j04928p4414p9325J96806J96371M2164j36139k09502j18431m1905
16716D12595n8786j40736j49398O5J68552k1114J5034n045p3070J28020Q3178
16705C59295o1548r7763M7339L480k3611j32860m3468Q2010q991j13807q965m961
16693c850n9897J2241J26644p268q8086M1867J11293J7100Q8975J9208O2117K55639
16681E75983J87512J03234M9482j62670j70772r9875k02558j58980M6231J49236
16671C16823P1197m7028J60850J18758L7896j47413k45981o1221M7799K1336k5777
16660B47239j59202j43217J7384M0113O4442M5275K5880M2874o7574p8523M702
16649C9393J4089K1459j4427m6045L9105M5383M6726k2218j69745r7980m1739
$$ plain form
16726 741898 636970 562556 483231 680037 876408 918572 782433 572931 454500 412595
16716 412595 353809 213073 63675 63740 232292 211178 226212 221167 148097 276117 359295
16705 359295 297747 199984 247323 250803 227192 94332 50864 132874 123883 10076 1111 -3850
16693 -3850 -63747 -51506 75138 67870 -20216 21651 132944 150044 239019 258227 320344 575983
16681 575983 763495 866729 916211 753541 582769 482894 280336 121356 167587 316823
16671 316823 388020 340992 501842 620600 658496 511083 265102 203881 251680 273016 247239
16660 247239 88037 -55180 -37796 2317 66759 112034 137914 180788 113214 34691 39393
16649 39393 53482 74941 60514 14469 53574 98957 145683 123465 -46280 -144260 -185999
16638a85999N0055M9382N2745M9168N0194O5384J22375n1407K9490n5110k0632
16627A55645r2266p7832J21206N8178j1791o6388p3324K5514K8012N9900l5783
16616I1071j03024q4328j8840M2804Q971j2554k1694j31629M6941J3113m5050
16605b14219L8302J05146j6444q9734J08610O1167M3477M1118j8369p9122n005
16594b5073P2573J4439J05378n662o8566j46876P8247L8795j31742L7524P6297
16583D5334k1612j7882r38j4220j1494O4836J11554k5512o843J3252Q1967k0456
16571A97986j37621j45830n9130J22400K3711M6070O9233j24420k8480L5635k1047
16560b1493j22574J45J07937N0351k2709m0991q3970j34985j7479J0354Q4066
$$ plain form
16638 -185999 -135944 -86562 -33817 15351 65545 130929 253304 201897 231387 176277 155645
16627 155645 63379 -14453 106753 164931 153140 86752 13428 38942 66954 126854 91071
16616 91071 -11953 -96281 -115121 -72317 -63346 -75900 -97594 -229223 -182282 -169169 -214219
16605 -214219 -175917 -70771 -87215 -176949 -68339 -7172 36305 77423 59054 -20068 -25073
16594 -25073 47500 61939 167317 161655 93089 -53787 24460 63255 -68487 -30963 45334
16583 45334 23722 5840 4902 -9318 -20812 44024 155578 130066 123223 136475 218442 197986
16571 197986 60365 -85465 -144595 -22195 1516 47586 116819 -7601 -36081 -446 -21493
16560 -21493 -144067 -143922 -35985 14366 -8343 -49334 -133304 -268289 -285768 -275414 -191348
16549a91348n1187J0269J14682M6764J7471J43014N1131j3348k5778M2352K13608
16538C57630K65839l1604l05276l32956l2761J12625k6480J4239j08719q1154
16528a68617m1594O3717J72272J55891m1080k9841j36884j53639N172L0888j72698
16517c16413J04767J86991m4317j6379J56468R2652p5590j35576M5475J11452
16507A09530k4832q1847j8982j3791k9727J13124m6521k00921p5750J40119J01538
16496b8060m1168m2835j1642J24983N9790K4967q7092M4612J7253j5198O4008
16485A09618l68j60754n5429R1182M7718n0199k436k4073j95125N0551K9282P8081
16473h1952J20305o1396L6917O9388K2759p8984J5767L6995N2251j1300q5738
$$ plain form
16549 -191348 -242535 -232266 -117584 -70820 -53349 89665 140796 127448 101670 144022 357630
16538 357630 623469 591865 286589 -46367 -79128 33497 7017 21256 -87463 -168617
16528 -168617 -210211 -146494 25778 181669 140589 110748 -26136 -179775 -174603 -143715 -316413
16517 -316413 -211646 -24655 -68972 -85351 71117 163769 88179 -47397 -1922 109530
16507 109530 84698 2851 -16131 -29922 -59649 53475 6954 -193967 -269717 -129598 -28060
16496 -28060 -69228 -112063 -123705 1278 61068 86035 -1057 43555 60808 45610 109618
16485 109618 109250 -51504 -106933 -15751 31967 -18232 -20668 -44741 -239866 -189315 -160033 -81952
16473 -81952 38353 -23043 13874 83262 106021 27037 42804 79799 132050 120750 35012
16462C5012j32276k3077j4519J43077k6770o1465q753K155K3476p798n6377M166
16450a23149O5286J23584M3211j13831N847j69377o6979m6350J20952J39473p2398
16439i3731K3751j3567p2168j12510P6142J63822K0172n9943m4642k160P5668
16428c9166L9424m94O1433K8873J39022j02569K5751N1239r5867O9595R8408J0282
16416B85931j33630k7496J1183o3644p4458R9182R5419K9480K6097Q4453M3560
16405C76077p6456j23714p7165j12360j75025J5263J70561J24123R7101J85591
16395D03996K30398Q0314K78149N16712N59865J021046K323255M396731P544813
16386A7355279Q532671J300352o871946q679518m854196k503207j321047q50430
$$ plain form
16462 35012 -97264 -120341 -134860 8217 -18553 -80018 -88771 -86616 -63140 -70938 -127315 -123149
16450 -123149 -57863 65721 108932 -4899 948 -168429 -235408 -281758 -160806 -21333 -93731
16439 -93731 -69980 -83547 -155715 -268225 -192083 -28261 -8089 -68032 -112674 -114834 -39166
16428 -39166 258 -236 61197 90070 229092 126523 152274 203513 107646 177241 275649 285931
16416 285931 152301 124805 135988 72344 -2114 97068 192487 221967 248064 332517 376077
16405 376077 299621 175907 98742 -13618 -188643 -173380 -2819 121304 218405 403996
16395 403996 634394 714708 992857 1509569 2069434 3090480 5413735 9810466 17355279
16386 17355279 25887950 27188302 20316356 11636838 6782642 4279435 2958388 2107958
16378B107958m10450k07103j77685k99699k10424r3999j17585J786j16932j30783
16368C45084O2938N2776O6326l5287q6271m7857l2852j39673j171m0760N5406
16357A98659J68781K87999R5385M703j81947k51793j44578o5983l3050K5509n6742
16346D6943l7559J9767n5539J4948j2706j289j10523j4084J9776K2097J2437j1283
16334a07015J2778J21048L844p4504K0643K8209L701p4884k1226M3807q5407l7374
16322a66380J12134J26774r0604j6308r484R9526n1020l5882K4307r5566J9373
16311h3130J30479P1005r1193j54764p6945r8031M747Q6563m819P9693N5545l1002
16299a11852K0009J3734m9183l0123L9961j44580n0571J64587R8098n4041J5R2114
$$ plain form
16378 2107958 1697508 1490405 1312720 1013021 802597 708598 591013 592799 475867 345084
16368 345084 408022 460798 527124 491837 405566 357709 324857 185184 184013 143253 198659
16357 198659 367440 655439 750824 755527 573580 321787 177209 111226 78176 103685 46943
16346 46943 9384 29151 -26388 -11440 -24146 -25435 -135958 -150042 -130266 -108169 -95732 -107015
16334 -107015 -94237 26811 30655 -43849 -23206 5003 8704 -66180 -87406 -43599 -129006 -166380
16322 -166380 -54246 72528 -18076 -34384 -43868 55658 4638 -31244 -6937 -102503 -83130
16311 -83130 47349 118354 27161 -127603 -204548 -302579 -297832 -211269 -216088 -136395 -80850 -111852
16299 -111852 -91843 -78109 -127292 -157415 -117454 -262034 -312605 -148018 -49920 -103961 -103946 -11832
16287a1832J16497m4694p5455j08441K000J13138L7655o7005J6718m005P1568
16276D6144L946j13390j3816O951J7119j0181o6437l5836o3592l831J10839J87498
16264F5414J18818m1621j07055q0580O163k9582N3716q270o2275J949J37098J74783
16252B28558K55890J4362k50028j99327j26770l8824j8915O160j7825J1815J5559
16241a19345O1140l3357o9236M3107R4114L6837k0866M3114J1750o8165l4542
16230e5449M4299N6223o1616R5213P0331n6343j28102r8134R1555N6850r4560
16219g9733o2870K1093k1405j9113j3641j4170J19637L7310M4351l6944m1410
16208f6895J1912R602k5334N8576p1162p0609O644J9929j6728k5003r7414n7918
$$ plain form
16287 -11832 104665 59971 -15484 -123925 -121925 -8787 28868 -38137 -21419 -25424 46144
16276 46144 50090 -63300 -77116 -70165 -53046 -63227 -129664 -165500 -229092 -232923 -122084 65414
16264 65414 184232 142611 35556 -45024 -38861 -68443 -14727 -22997 -85272 -83323 53775 228558
16252 228558 484448 498810 248782 49455 -77315 -116139 -135054 -128894 -146719 -134904 -119345
16241 -119345 -58205 -91562 -160798 -117691 -23577 13260 -7606 35508 47258 -20907 -55449
16230 -55449 -11150 45073 -16543 78670 149001 92658 -35444 -133578 -42023 14827 -79733
16219 -79733 -142603 -121510 -142915 -162028 -175669 -189839 -70202 -32892 11459 -25485 -66895
16208 -66895 -54983 -45381 -70715 -12139 -83301 -153910 -147266 -127337 -144065 -169068 -266482 -324400
16196c24400P4654N880N853m3298L985P5621R5892J4743n5096O611P0253O5442
16184c860M4328J20777m8029r0154n3200q040M447n0338m4424m7696R3162O875
16172g6152R804N4577j9630k9868p363P694O5958l6255q3377j3011O4903K2689
16160d0031o0318l7171K8964J03783J5966L2109n2691m1952K2214p1661K6882
16149g3906P1572O8270r4717j56016o0728J30705K2898M0010j4815O8903j41120
16138a38944j00325J60371M6667j167k0253p5955J24591M9770l1076J23446J07285
16127B44410p8335j41778q2209n003j00032j24967n5768L0649Q0931J02832J7502
16116a11768R59J45352M771j14741P7637k2992p8089l8101O7396o2785r6471O5574
$$ plain form
16196 -324400 -249746 -243866 -238013 -281311 -277326 -201705 -105813 -91070 -146166 -139555 -69302 -3860
16184 -3860 40468 161245 113216 23062 -30138 -38178 -33731 -84069 -128493 -176189 -83027 -76152
16172 -76152 -66348 -11771 -31401 -61269 -68632 -60938 5020 -31235 -114612 -127623 -62720 -40031
16160 -40031 -100349 -137520 -108556 -4773 11193 43302 -9389 -51341 -29127 -100788 -73906
16149 -73906 -2334 65936 -28781 -184797 -245525 -114820 -91922 -51912 -66727 2176 -138944
16138 -138944 -239269 -78898 -32231 -33398 -53651 -129606 -5015 44755 13679 137125 244410
16127 244410 166075 24297 -57912 -62915 -162947 -287914 -343682 -313033 -232102 -129270 -111768
16116 -111768 -110809 34543 39314 -75427 2210 -20782 -98871 -136972 -69576 -132361 -228832 -163258
16104a63258N3517o5886N5568Q3972k641j36928J14016L0941Q28p2279J3874J17744
16092B9468M8648j12339n583m7243j2800n4586j37681N2148J46436O7634r853
16081c5751K6339p5323o0875O716p285j2662O061K3963L4227J13161q050k16322
16069b05801j34704K1896O7974M091P7619j1323P139J9347J32948o923j34047
16058a61784j19347R8408J56759k7684j75198l1513J12010r864R2543Q4500N6171
16047G5001q4812q9897P182r283M7504l67j40959n8361O4732m7874L1136O6039
16035a39959J5154L7798j6280p310M1769m5522O9538J66557O371j7020K8612n8025
16023H1683J0136m5321m3556k9093m2012k0450j12649J6130p097k426l2030p0700
$$ plain form
16104 -163258 -109741 -175627 -120059 -36087 -38728 -175656 -61640 -30699 -29871 -102150 -88276 29468
16092 29468 78116 -34223 -39806 -87049 -99849 -154435 -292116 -239968 -93532 -25898 -35751
16081 -35751 -9412 -84735 -145610 -138894 -146179 -158841 -152780 -128817 -94590 18571 10521 -205801
16069 -205801 -340505 -318609 -250635 -246544 -168925 -180248 -173109 -153762 -20814 -27737 -161784
16058 -161784 -281131 -182723 -25964 -53648 -228846 -260359 -148349 -158213 -65670 18830 75001
16047 75001 -9811 -99708 -92526 -101809 -54305 -54672 -195631 -253992 -189260 -237134 -205998 -139959
16035 -139959 -124805 -87007 -103287 -110597 -68828 -114350 -44812 121745 128116 111096 139708 81683
16023 81683 91819 46498 2942 -26151 -68163 -88613 -201262 -185132 -192229 -194655 -226685 -297385
16011b97385j44399R6802k6067J06278J41459O2795j0835m0362n5829J59392L7415
16000B9264p6385j03917R5963J074N909J9599M9958o5596j15726o554k6051k3196
15988b15658N0488r165L2962L3884M2332k9508n7351J007L5176K8420N2430K0360
15976a4623J18027R8339r2319j06170q1230J06236P3668o5382l5334o4548j19513
15965a82849J37629n945j09983Q2735O1229j84212j05405J14685J60491O4715
15955C3090J51673J1737p5206j77392q8029m7395j5172O4546k2552j09215J32904
15944a41011Q1659j35367k6794m2847M2928L948P8771l5451Q1795k9208N9469
15933f2108l0316n4166P9205R7549q409m4974j5099J30568o3023n9869m9211p9896
$$ plain form
16011 -297385 -441784 -344982 -371049 -264771 -123312 -60517 -71352 -111714 -167543 -8151 29264
16000 29264 -47121 -151038 -55075 -54001 -48092 -28493 21465 -44131 -159857 -166411 -192462 -215658
15988 -215658 -165170 -174335 -141373 -107489 -65157 -94665 -152016 -151009 -115833 -87413 -34983 -14623
15976 -14623 103404 201743 109424 3254 -77976 28260 101928 36546 1212 -63336 -182849
15965 -182849 -45220 -51165 -161148 -78413 -17184 -201396 -306801 -192116 -31625 33090
15955 33090 184763 196500 121294 -56098 -144127 -191522 -206694 -142148 -164700 -273915 -141011
15944 -141011 -59352 -194719 -221513 -264360 -221432 -217484 -138713 -174164 -92369 -121577 -62108
15933 -62108 -92424 -146590 -67385 30164 21755 -23219 -38318 92250 29227 -30642 -79853 -159749
15921a59749J7011N4767N8762m1511m2958L6549J22666N2834j76734q6403l1322
15910a96088J9970P5497J4462J14626K5776l3610j50837L2059Q6555j3129o518
15899c1237P111j045Q4837l4352m8162j12828o6402j094k4861j34934L0368J01344
15887b31255N1536o8395p6430J12463R5266K16135N6382n3114K9101m0705j10337
15876a9353R473J45300R413j43711j39307l2185L1796j3296m8571J24455J76494
15865A00508J188k9578K4272m7747p7717P6853q3723o0867l6768o2811l0603n2184
15853b79177j8456J44979J4115R2018R3825j09970L1436J00552K835n9442m9009
15842c6294J8920R8832J4358j29142Q090j3366o3240l6339m2538m6035k9790M4410
$$ plain form
15921 -159749 -142738 -87971 -29209 -70720 -113678 -77129 45537 98371 -78363 -164766 -196088
15910 -196088 -176118 -100621 -86159 28467 54243 20633 -130204 -98145 -11590 -24719 -31237
15899 -31237 -24126 -25171 59666 25314 -22848 -135676 -202078 -203172 -228033 -362967 -332599 -231255
15887 -231255 -179719 -248114 -324544 -212081 -116815 99320 155702 102588 131689 90984 -19353
15876 -19353 -9880 135420 144833 1122 -138185 -170370 -138574 -151870 -200441 -75986 100508
15865 100508 101696 72118 96390 48643 -29074 47779 -35944 -96811 -133579 -196390 -226993 -279177
15853 -279177 -297633 -152654 -138539 -46521 47304 -62666 -31230 69322 72157 12715 -36294
15842 -36294 -17374 81458 95816 -33326 -25236 -38602 -101842 -138181 -180719 -226754 -256544 -212134
15830b12134J05672j14683L6669Q3906L6780N4564k7009J9875P5715L250l017
15819E9588N3230n3685n9197n3958o6667Q066J13174J824m562p0795k322n3961
15807a29265M9455P9391K3481k2269O3289J2882J3612j07101j04527j3987r966
15796a45005N2021j8820J9101L8605Q578q3702j42136l3367J69329J4068K4673
15785i6655n767n085O269Q9840M0028J2257J8870L2805p3564q0522j00660J7463
15773a44721J17194k408J010j1203j5883K9580p6970O7254N3577J24281M2518
15762A84229j01226j17701r4879L5035L5957j8393K9755o897K166m822K0815m5953
15750h1914n7208J9489J36836m4780j77088j3088J31164K5748K7346N2728j0330
$$ plain form
15830 -212134 -106462 -221145 -184476 -100570 -63790 -9226 -36235 -16360 59355 62605 59588
15819 59588 112818 59133 -64 -54022 -120689 -112623 551 2375 -2187 -72982 -75304 -129265
15807 -129265 -79810 -419 23062 793 64082 76964 90576 -16525 -121052 -135039 -145005
15796 -145005 -92984 -111804 -92703 -54098 -45520 -129222 -271358 -304725 -135396 -121328 -96655
15785 -96655 -102422 -107507 -101238 -11398 28630 40887 59757 92562 18998 -61524 -162184 -144721
15773 -144721 -27527 -29935 -28925 -40128 -56011 -26431 -103401 -36147 17430 141711 184229
15762 184229 83003 -34698 -129577 -94542 -58585 -76978 -47223 -54120 -51954 -56776 -35961 -81914
15750 -81914 -139122 -119633 17203 -27577 -204665 -217753 -86589 -60841 -33495 19233 8903
15739H903j03359o576P0923p2122n5733m6463J45195K35228P4228r1775q8147
15728G0302p249l4170j41901o3865J03728m1521K9143j6093O2991N6545n7710
15717c9800K1771P0365O5659p754J0437o1055N8275J9770q2436j5710L0174q2555
15705a2859m4475j8415p1945O7646J0215L916P4065j0982j39424m7894m8395J1809
15693b26738Q1741J16147M3769m7918k3616m535P1808L5426j41216j47248N9685
15682a82695J7397J07001O473L0231M2841J27077l1083O5874N2819p9483r6898
15671E9554l5942l3778q788Q152j98289M3574m295m5360J42430J20064q2504l0777
15659f5959J7885J8119j3999j25226J11452J58754K1251j7295j6407j1511q9414
$$ plain form
15739 8903 -94456 -101032 -30109 -102231 -157964 -204427 -59232 175996 250224 158449 70302
15728 70302 63053 28883 -113018 -176883 -73155 -114676 -85533 -101626 -38635 17910 -39800
15717 -39800 -18029 52336 117995 110241 120678 59623 117898 137668 55232 39522 69696 -12859
15705 -12859 -57334 -75749 -147694 -80048 -69833 -65917 8148 -2834 -142258 -190152 -238547 -226738
15693 -226738 -144997 -28850 14919 -32999 -56615 -61150 10658 46084 -95132 -242380 -182695
15682 -182695 -165298 -58297 -51824 -21593 21248 148325 117242 183116 235935 156452 59554
15671 59554 23612 -10166 -18954 -10802 -209091 -165517 -169812 -215172 -72742 47322 -35182 -65959
15659 -65959 -48074 -29955 -43954 -169180 -57728 101026 122277 104982 88575 77064 -12350
15648a2350j07420N352J33832p4521m2218J4380j40870L7100K24055K06434j26713
15637A17061p8911M9031k8563l4835m1965k4613j42332N0042K0160J911J31802
15626A8788M7078m2761r5345k09266R7112P8714J5071n8423o1552J0337K224P701
15614a90322J227Q1301K0139M9832m9635J9710j35662o0652K6777J06577J08372
15603b2336K8323l612q8172j53135n6640O7842M9098L2171P6281J11572Q9213
15592A30605J13014r1505r7596j6598N36O932J0428l5622j18736k4544M5105m979
15580h2960j59211p26J20125J06378J00030J1632r9104n2780j18457M3791Q4877
15569d6405k7434j30700N6963Q2643M5313N5841q151N2255J6766n024n3099K9513
$$ plain form
15648 -12350 -119770 -114418 19414 -55107 -97325 -82945 -223815 -186715 37340 243774 117061
15637 117061 38150 87181 58618 23783 -18182 -42795 -185127 -135085 -114925 -113014 18788
15626 18788 65866 23105 -72240 -281506 -184394 -105680 -90609 -149032 -210584 -200247 -198023 -190322
15614 -190322 -189095 -107794 -87655 -37823 -87458 -67748 -203410 -264062 -237285 -130708 -22336
15603 -22336 5987 2375 -85797 -238932 -295572 -227730 -178632 -146461 -70180 41392 130605
15592 130605 243619 152114 54518 37920 38456 45388 55816 20194 -98542 -123086 -77981 -82960
15580 -82960 -242171 -242897 -122772 -16394 83636 95268 -3836 -56616 -175073 -131282 -46405
15569 -46405 -73839 -204539 -147576 -64933 -19620 36221 28070 80325 97091 92067 38968 68481
15557F8481m9035l4591J07834M5701l8079K789m7541j09860q371J15667Q3703
15546A36698k5802J1821r9461j10267j6283o5496J08300L4044j28144j8127l5721
15535b08438j7418J8914P4465O1742l8833j23070j8665J38094J00017o1448j07642
15524a82282L1491r5584L8692Q6993m0217q0761p0384J09770m8846J2373O3905
15513a74850Q3476l2694L6926L5836k6157M2922Q3668L794k3909K5173r9443k2262
15501f7520J00261K6433p3040j12303j8451Q1870K0591R3413j15851k6035O0248
15490c0384L5008j05261Q6466r374r9491N1558J36512k1170m5864k0986N1107
15479B8121N798L442K2975J31876J15331k4872n141j33728j48018j0572M2383
$$ plain form
15557 68481 19446 -15145 92689 138390 100311 103100 55559 -54301 -62672 52995 136698
15546 136698 110896 122717 23256 -87011 -103294 -168790 -60490 -26446 -154590 -172717 -208438
15535 -208438 -225856 -206942 -132477 -70735 -109568 -232638 -251303 -113209 -13192 -74640 -182282
15524 -182282 -150791 -246375 -207683 -120690 -160907 -241668 -312052 -202282 -251128 -238755 -174850
15513 -174850 -91374 -124068 -87142 -51306 -77463 -34541 49127 52921 29012 54185 -45258 -67520
15501 -67520 32741 59174 -13866 -126169 -144620 -62750 -42159 51254 -64597 -90632 -30384
15490 -30384 4624 -100637 -14171 -23545 -123036 -71478 65034 43864 -2000 -22986 28121
15479 28121 33919 37361 60336 192212 307543 282671 277530 143802 -4216 -14788 27595
15468B7595l2682O236L9964O3027L0823j4167K7578p819j18239j26957n9435J09612
15456e4464P2995j7216o4196N3314n9703n4145M3905Q7365P971n7206k2807Q7706
15444B3519o6967q5211j05386M8327K00555P3600q2404J4165N2572K5449j16097
15433a7878m2538r9994Q4951O2731o6404o825L5968Q871O1067M2461o2637k9325
15421b9552P606O0483o0781k9567Q3884J3083k7283m9878J519m0242n5659Q7370
15409c9017m4084n5557M6530J6086M3076L9992p005j7548K3174N1918N769p3297
15397i963J2246N8255J13042O845n8691P7336L9591j23071p8399N418o0800q9387
15385a07578l8276M8345N7019p2820J20731J52668O0306p9542j95338q1120J26690
$$ plain form
15468 27595 -5087 1149 41113 104140 134963 120796 148374 140555 22316 -104641 -164076 -54464
15456 -54464 18531 1315 -62881 -9567 -69270 -123415 -79510 7855 15826 -41380 -64187 23519
15444 23519 -43448 -128659 -234045 -185718 14837 88437 6033 20198 72770 98219 -17878
15433 -17878 -60416 -160410 -75459 -12728 -79132 -85957 -49989 -41118 19949 62410 -227 -29552
15421 -29552 -21946 38537 -22244 -51811 32073 45156 17873 -32005 -30486 -70728 -126387 -39017
15409 -39017 -83101 -138658 -92128 -76042 -32966 7026 21 -17527 5647 57565 63334 -9963
15397 -9963 2283 60538 173580 180425 121734 199070 238661 115590 37191 42609 -18191 -107578
15385 -107578 -145854 -97509 -40490 -113310 7421 160089 220395 140853 -54485 -135605 -8915
15374h915J46185q5140o1723K7620P5604O7834J28970J9348m5012r6756o8493
15363I9522P8765N5807j31884r1439l1292K2332Q9800q0380K5927K6768j0710
15352E3216j33664j01665Q9276R8746L5367m5058N9839o309o7372J18368R1266
15341A92010J71414R4228J1014k23641j74223p89J01200J26953o0453j79248p0569
15330a2104K4589O9903J9713K815J89241J06437j02352j82716j16961o6910J9212
15319d9133O3135l3525j34081k9434k617J01321L5955N5233K5256J2462k0094
15308B4478N615p4235r1189l4588J1225Q7068L784P7747K33834N4563K3435m6531
15296B75206m01j31482p1658p3868K4850k1061J8221J210p3395K1511o3800m1191
$$ plain form
15374 -8915 137270 52130 -9593 18027 93631 161465 290435 309783 264771 168015 99522
15363 99522 178287 234094 102210 10771 -20521 1811 91611 11231 37158 63926 53216
15352 53216 -80448 -182113 -92837 5909 41276 -3782 56057 49748 -17624 100744 192010
15341 192010 363424 457652 468666 245025 70802 70013 171213 298166 237713 58465 -12104
15330 -12104 12485 82388 102101 104916 294157 400594 298242 115526 -1435 -68345 -49133
15319 -49133 14002 -19523 -153604 -183038 -185655 -84334 -48379 6854 32110 44572 24478
15308 24478 30093 -44142 -135331 -169919 -158694 -71626 -67842 9905 243739 298302 321737 275206
15296 275206 274805 143323 71665 -2203 22647 1586 19807 21017 -52378 -30867 -94667 -135858
15284a35858J795L1080P1820J36432p6436j20519k8320K5040K5657M9972J09541
15273I0204P8943l5999n5961P5502j30096q2017p3280N1000p0366R7471j5896
15262g0495J42508m1941m3739L593j8403l8070k6271J61172K5670j3129m4831
15251C6064j14285k4784J4290p8422M9433O5524K2737p957N6611J27876o4234
15240H2853j42845N1696P1409o9754p3609n7605J6306m0482Q1277P8952J5706
15229A3904J9336n1037R3045O0294n0183l7802J7304r0493j29664n3710J27433
15218h1573p1850j71531K9120K36756j22763J3142R2252L4617L6306J16950K7003
15207A38429j1661n3470K6343q0499j07084K9586K04379K27368Q6747O2041O8416
$$ plain form
15284 -135858 -134063 -102983 -31163 105269 28833 -91686 -120006 -94966 -69309 -19337 90204
15273 90204 169147 133148 77187 152689 22593 -59424 -132704 -81704 -152070 -54599 -70495
15262 -70495 72013 30072 -13667 -10074 -28477 -66547 -92818 68354 94024 80895 36064
15251 36064 -78221 -103005 -88715 -167137 -117704 -52180 -29443 -37400 19211 147087 82853
15240 82853 -59992 -8296 63113 -6641 -80250 -137855 -121549 -162031 -80754 -1802 13904
15229 13904 33240 -17797 75248 135542 85359 47557 64861 -25632 -155296 -209006 -81573
15218 -81573 -153423 -324954 -295834 -59078 -181841 -168699 -76447 -41830 -5524 111426 138429
15207 138429 126768 73298 99641 19142 -87942 -58356 146023 373391 460138 522179 590595
15196E90595q5219l4706J03617K3512J366j6307k04072j82137j81343q5164N8353
15185a1505J09773R5940j8281l0659J5834J52358K30844L00721K36550J00720
15175A182295l0348J2663q2565j20178m6920j93265k15704r5979q8923l102r5088
15164B22886j28045J44079K1294p0281j8278K3291J95190J30835J05274n4157
15154E72088l375r671J2638M7405q7875k19171k54823j93751J0137O6980k7653
15143h7071J24323J70195L9468o9810j26355j7525P9537p2925N3966L4166q1250
15132D6719l0525P6200r9067j99975l5806Q6388K06519j7493r0459N4846l5843
15121c8496k9066j6644N8239j6544R5782Q3118j70755j00099p0472L4122N7326
$$ plain form
15196 590595 505376 470670 574287 597799 599165 582858 378786 196649 15306 -69858 -11505
15185 -11505 98268 194208 175927 145268 161102 313460 544304 845025 1081575 1182295
15175 1182295 1151947 1164610 1082045 961867 914947 721682 505978 409999 321076 317974 222886
15164 222886 94841 238920 260214 189933 171655 194946 390136 520971 626245 572088
15154 572088 568713 559042 571680 619085 531210 312039 57216 -136535 -126398 -59418 -87071
15143 -87071 37252 207447 246915 177105 50750 33225 112762 39837 93803 127969 46719
15132 46719 16194 92394 -6673 -206648 -242454 -156066 50453 32960 -57499 -2653 -38496
15121 -38496 -67562 -84206 -25967 -42511 53271 136389 -34366 -134465 -204937 -170815 -113489
15110a13489P6144o8934j0549k4428j1101L3166j3661j3708n174Q3025P1563n0207
15098d7353j6113l2658n5902N0052L8691J94850O0875j13190k3952q7202p0957
15087a02859n22O962M5265k0489j6336o9277K7691P2403J4864L7929M1706O115
15075D3452n0801j15388N2973J76779j6121j9457M0218j34J0335N5850K5652p5443
15063A27915q8350o2072k633k6254r9147k9499J22858N0180Q2493L4014m4020
15052F5485N992M6651L9833K072o721q5857j02679P9581K0737j5933R045p541
15040E0665k7572M7910Q6908m5887o0951k9789M260J10211r997n3162m9667p1664
15028d8735l0317M1450n653n5769J4393n4122P0365j209m5602J5554j8911P7192
$$ plain form
15110 -113489 -37345 -106279 -116828 -141256 -152357 -119191 -132852 -146560 -151734 -68709 2854 -47353
15098 -47353 -63466 -96124 -152026 -101974 -63283 131567 192442 79252 55300 -31902 -102859
15087 -102859 -103381 -96419 -51154 -71643 -87979 -157256 -129565 -57162 -42298 -4369 37337 43452
15075 43452 -7349 -122737 -69764 107015 90894 71437 111655 111521 121856 177706 203358 127915
15063 127915 39565 -22507 -25140 -51394 -150541 -180040 -57182 -7002 75491 109505 65485
15052 65485 71477 118128 157961 160033 153312 67455 -35224 44357 65094 49161 58206 50665
15040 50665 23093 71003 157911 112024 51073 21284 25544 135755 125758 72596 22929 -48735
15028 -48735 -79052 -37602 -43255 -99024 -84631 -138753 -68388 -69597 -115199 -99645 -118556 -41364
15016d1364j08292Q33N9886L060J02693J52732p4389o5854j27480q3002L785j122
15004a78514p3284P0657N6953n0654j3988K45L5037P8427R5689J00488o5387j89805
14992a34136L7710J08603M6576r706j5539R7720j4324j83170J4451J35849k77
14981H3757p7791j38484l1335M9565j53993J21394J20393r1299o1793M1899j8567
14970a56254R9298P5006j5472P9210k8068k1333L8211M1120p2856K6246o6066
14959i58Q782n4002j44444R4076m3282j38613J54167J49713m1493l6691k399j374
14947e6518k6336j7418K4873J9323O273o5931J46263J14379j09254l0463J47291
14936A52482J50979Q7044M5597J33585J845r793k22318l1125R505L370p6112n4065
$$ plain form
15016 -41364 -149656 -148823 -88937 -85877 16816 169548 95159 29305 -98175 -181177 -177392 -178514
15004 -178514 -251798 -181141 -124188 -174842 -188830 -188585 -153548 -75121 20568 121056 55669 -134136
14992 -134136 -96426 12177 58753 49047 33508 131228 116904 -66266 -51815 84034 83757
14981 83757 5966 -132518 -163853 -114288 -268281 -146887 -26494 -117793 -179586 -137687 -156254
14970 -156254 -56956 18050 2578 81788 53720 32387 70598 111718 38862 65108 -958
14959 -958 7824 -46178 -190622 -96546 -139828 -278441 -124274 25439 -16054 -52745 -55144 -56518
14947 -56518 -82854 -100272 -75399 -56076 -49803 -115734 30529 144908 35654 5191 152482
14936 152482 303461 390505 436102 569687 571532 561739 339421 308296 317801 321171 245059 190994
14924A90994m9494j78337r9842N642M8M1752M5539J94141K05185J41504R7384
14913E94516J64282j5407k18644j97894j48282j53764M755j8197q813L238q3647
14902g7857l5539P589j29773j966K05190J31758Q9717Q8851N6524N7643o570m8450
14890C37117q5393j89128j17598N3388N5578m2338m5590q4122R857J6563l1119
14879a22785j46079N9158N9094m9962m1758M3723L4861l5630O7687J14546p3994
14868i1139J0245J3509k9759m9374q7731j9676O5352p982n7259k3240J92895K9595
14856e4564r9701L9430J5302L9932Q1872l126q9511l6913Q4773k9922l2322j9002
14844a03752L0588k2935j0040m1920J8082O5644q2198m4083J49713K5573n9154
$$ plain form
14924 190994 141500 -36837 -136679 -131037 -130989 -89237 -43698 150443 355628 497132 594516
14913 594516 758798 743391 524747 326853 178571 24807 29562 11365 2552 5790 -77857
14902 -77857 -113396 -105807 -235580 -237546 -32356 99402 189119 277970 334494 392137 385567 337117
14890 337117 251724 62596 -55002 -1614 53964 11626 -33964 -118086 -108229 -91666 -122785
14879 -122785 -268864 -209706 -150612 -200574 -242332 -198609 -163748 -199378 -131691 -17145 -91139
14868 -91139 -80894 -67385 -97144 -146518 -234249 -253925 -188573 -196555 -253814 -277054 -84159 -54564
14856 -54564 -154265 -114835 -99533 -59601 22271 19145 -70366 -107279 -22506 -52428 -84750 -103752
14844 -103752 -73164 -96099 -106139 -148059 -129977 -64333 -146531 -190614 -40901 -15328 -74482
14833g4482M9494J03641L4525L0305j5412p228O122j17182O3260J05165p1379
14822A06829p5600l5169n0909o6146J46338Q5322n405j4030o9886K9653O0403
14811A11400O9449M5146k032j90313j10057j6132j6728K3141j1959o5925J9177
14800a44833R0355J11298N4857m6981l3957p3855q36M5496K7309J2979K0400J55048
14788B17280J19342j13421j07809o8225q2815M8707n1891J9189j9111l2586P7648
14777F308P5870j07436N03J22314n0657r7207J80290O9718M5001q696r6163J6411
14765A56256O8087n9706q6918l7881K6482r554n8413j3926K4429l3684K5848Q0441
14753H1461r624J1395L207o2197n9894J40191J11035l3176P4280o0453j5792P4584
$$ plain form
14833 -74482 -24988 78653 113178 143483 128071 120843 126965 9783 73043 178208 106829
14822 106829 31229 -3940 -54849 -120995 25343 110665 105260 91230 21344 50997 111400
14811 111400 180849 225995 223963 33650 -76407 -92539 -109267 -86126 -98085 -164010 -144833
14800 -144833 -54478 56820 111677 64696 30739 -43116 -43952 1544 28853 41832 62232 217280
14788 217280 336622 223201 115392 47167 -35648 13059 -38832 -19643 -38754 -71340 6308
14777 6308 82178 -25258 -24755 97559 46902 -50305 129985 199703 244704 236008 139845 156256
14765 156256 224343 164637 77719 39838 66320 56766 -1647 -15573 8856 -24828 1020 81461
14753 81461 71837 83232 86439 24242 -35652 104539 215574 182398 256678 196225 180433 255017
14741B55017k3219l4123j3276p6138M0180M6917L7559J11148J6570K8988r148
14730C80475N8185J60764j0482q8280J47479J82024K28513K96682L91514L02144
14720B049018J79916J86180L26479M10524K50719L32240M18611O06691P39844
14711E500222R15522J097095J471386K368861M007842O870285J1457745J8428303
14703E2117261K5089919K0990175M721811p318464l396507P740429P620330p119041
14695A00445913k0947995k1858419j4654825q306948m432484k057787m16441J501819
14687B9272833M037272P942360J3686836K2414382L3234080L8300382L3942331
14680A82830476K1479538L386470o309273m844533j534189p244829k4525481l9515254
$$ plain form
14741 255017 231798 197675 184399 108261 148441 195358 232917 344065 360635 389623 380475
14730 380475 438660 599424 588942 500662 648141 830165 1058678 1355360 1746874 2049018
14720 2049018 2228934 2415114 2741593 3152117 3402836 3735076 4153687 4760378 5500222
14711 5500222 6415744 7512839 8984225 11353086 15360928 22231213 33688958 52117261
14703 52117261 77207180 98197355 102919166 95600702 92204195 99944624 107564954 100445913
14695 100445913 79497918 57639499 42984674 34677726 30245242 28187455 27771014 29272833
14687 29272833 33310105 41252465 54939301 77353683 110587763 148888145 182830476
14680 182830476 204310014 207696484 201387211 196542678 195008489 187763660 163238179 123722925
14672A23722925l8907441k5077576j3828617p885572m695598k296595j83028J991332
14664C2839830M559579Q888381J5163364K2073680K1651097P963489o554382o967557
14656I9617481M084392Q441608m669642k1772327k6398263j9071821j1459356
14649B8772072o940228m240145k757496j816828j438394j252188j141842j017854
14641H167097o91456m52279k85016n19011n39663n19092m84381j65094j13799
14632D397306m13710l65541l51214k95485j49510j03707j18782R558l2972j95416
14622B380527k17724n8154L7741r9040j04184p6991j7302Q8447J64111l9536j50957
14611A906938j82291j37971j49416k4981N6766j4043j12922o849O5662o5265j49319
$$ plain form
14672 123722925 84815484 59737908 45909291 38023719 33328121 31031526 30848498 32839830
14664 32839830 37399409 46287790 61451154 83524834 105175931 113139420 106585038 99617481
14656 99617481 103701873 112143481 107473839 85701512 59303249 40231428 28772072
14649 28772072 21831844 17591699 14834203 13017375 11578981 10326793 9184951 8167097
14641 8167097 7475641 7023362 6738346 6219335 5679672 5160580 4676199 4511105 4397306
14632 4397306 3983596 3618055 3266841 2971356 2821846 2718139 2599357 2608915 2575943 2380527
14622 2380527 2162803 2104649 2142390 2043350 1939166 1862175 1844873 1933320 2097431 2057895 1906938
14611 1906938 1724647 1586676 1437260 1412279 1469045 1455002 1342080 1335231 1400893 1335628 1186309
14600A186309j71600j13097P781M5826K3189j19560j16180n9313L0579J12202
14590H26136J06899J25493%p7333j00689n3071L1471m3749j6320m8917o4606m3352
14578F41962N6629n2840j85306r9514j66N4239K2431j6750M7200l7400m1512j10687
14566B78286q034R5603Q4399l4919j10316n6396M949k2302L9619J65603L5235
14555D71727O4046p658q0719p7122j26224p1360j27799J1898J6160O4979K05m140
14543A33993M6842R648Q4965J01688j9526p7580l28l727O9254J4735q5177k4963
14531B49824J26732N4378j79156j61523N1778J53766K4063q4122j24659L9897
14521A50978P4291m6984K0378P9146l7228k1862m4948J0797L4563O1169n6043
$$ plain form
14600 1186309 1014709 901612 909393 955219 978408 858848 742668 683355 713934 826136
14590 826136 933035 1058528 1058528 981195 880506 827435 858906 815157 798837 749920 685314 641962
14578 641962 698591 645751 460445 360931 360765 415004 437435 420685 467885 430485 388973 278286
14566 278286 270252 365855 450254 415335 305019 248623 253572 231270 270889 436492 471727
14555 471727 535773 528115 447396 370274 244050 172690 44891 56789 72949 137928 138133 133993
14543 133993 180835 190483 275448 377136 357610 280030 279702 275975 345229 359964 274787 249824
14531 249824 376556 430934 251778 90255 142033 295799 319862 235740 111081 150978
14521 150978 225269 178285 198663 277809 240581 218719 173771 184568 219131 280300 224257
14510B24257j69509j69460O7047Q8304R893J842R5327R0732k746J9378p9455q5723
14498H9887r93j19921Q4391N6809l5852J11594n37o4910o9457J20456J11337j04621
14486A78183k6106J4143j28881J03169J38805k9650j97705j04875K9066N4870
14476C1019L6361J32158O7934j16548k4033o6532m3079K2976m3121k8131O3623
14465C2627K1107j09183R522K5451Q856M2289L0534l558j35795J00107J29046
14454A51003J5258o4M783p1745m9571K0963k2991L6388M7048K4359M8307K636
14442B06374J537r7480j58087n1372P9223J41744l0748p2501L6045J58978o715
14431B06998j20302o9611R296J8776O326o477Q7266K1352q5331N518Q6439K2309
$$ plain form
14510 224257 54748 -114712 -47665 40639 50532 52374 147701 238433 235687 255065 175610 89887
14498 89887 88894 -31027 53364 110173 74321 185915 185378 120468 51011 171467 282804 178183
14486 178183 152077 166220 37339 140508 279313 249663 51958 -52917 -23851 31019
14476 31019 67380 199538 267472 150924 126891 60359 17280 40256 -2865 -30996 32627
14465 32627 53734 -55449 -45927 -20476 -11620 30669 61203 57645 -78150 21957 151003
14454 151003 166261 166197 170980 99235 49664 70627 47636 84024 131072 155431 203738 206374
14442 206374 207911 110431 -47656 -99028 -19805 121939 91191 18690 54735 213713 206998
14431 206998 86696 17085 26381 45157 51483 45006 132272 153624 68293 73811 160250 182559
14419A82559J0918l7926J0315o7391q1275M8806n4281j62493j39867K8627J16033
14408a45975m7325l7364L6946J45231J41392R990l3460O0208R4861j09158l2420
14397H2926J00252L1009r2613q6673K0839L0333k907L7511L698j43846j11598
14386a31069J0200M7653K9894j8396J5617M3475M272N7355L3447K5776k5920n0212
14374D2092o9407k0282r5379n2008L6628J76047K03222j01043o5840J92n7591
14363c369N417l9484J1848Q8052l1199L6559j06482l8300Q2758m5247l4519R0670
14351A6704J43703n2601m9628r0159o3175K4004J50836J05377q774j04374Q063
14340G9976O7999N7352j9681j22792J6926J12297J7610n0967j12682L613P0546
$$ plain form
14419 182559 193477 155551 165866 98475 17200 66006 11725 -150768 -290635 -262008 -145975
14408 -145975 -193300 -230664 -193718 -48487 92905 102895 69435 129643 224504 115346 82926
14397 82926 183178 214187 121574 34901 55740 86073 83166 120677 124375 -19471 -131069
14386 -131069 -120869 -73216 -43322 -61718 -46101 -2626 1646 59001 92448 118224 92304 42092
14374 42092 -27315 -47597 -142976 -194984 -158356 17691 220913 119870 54030 54222 -3369
14363 -3369 2048 -37436 -25588 62464 31265 67824 -38658 -76958 5800 -39447 -73966 16704
14351 16704 160407 107806 58178 -31981 -95156 -71152 79684 185061 176287 71913 79976
14340 79976 147975 205327 185646 62854 79780 192077 209687 158720 46038 49651 120197
14329A20197N1956L8939n3561j06869K1016n6452k1417p2858k1512M0177J40495
14318H0111N1358r1814j03532J1813P9799Q3228o431j9612J54401M0219j04184
14307A75356J6960l5129n9665N580k2480O4400M0936L7068K1050j05084j29870
14296I122J22001N2461p3158o0944j16547l2625Q2168l7908L5559m3023K754J5840
14284d4300j1043O953P8439M8333N8456P608m2589j51125Q170J70362M0489j3326
14272A56427r5328r5985j0861J7483N745R1088n277l3033K2233J21661J72298
14261C46451K19191K09571j4451k20352k33856r8925J2361j17794j90366l7265
14251a25435L7452p416J0805J07656J7105R6545J25779k7326J1059K5093q2838
$$ plain form
14329 120197 172153 211092 157531 50662 71678 15226 -6191 -79049 -100561 -60384 80111
14318 80111 131469 39655 -63877 -52064 27735 110963 104532 84920 239321 279540 175356
14307 175356 192316 157187 97522 103102 80622 145022 185958 223026 244076 138992 9122
14296 9122 131123 183584 110426 49482 -67065 -99690 -17522 -55430 -19871 -62894 -60140 -44300
14284 -44300 -55343 -48390 30049 78382 136838 144446 101857 -49268 -41098 129264 169753 156427
14272 156427 61099 -34886 -45747 -28264 -22519 68569 63292 30259 52492 174153 346451
14261 346451 565642 775213 760762 540410 306554 207629 219990 102196 -88170 -125435
14251 -125435 -87983 -95399 -84594 23062 40167 136712 262491 235165 246224 271317 188479
14240A88479O2242j0288K7150O733M0714l7682j8523k082o0924l1071p9283J601
14228H7066J7478j8673l5404m9930K3671J37777J65986K48379R6160m4465j40555
14217D87490j59716j16666j01546M4230O5804M2667j25515l2786J04082k8425
14207A79619j3595n1132n655Q8899J21303q9679Q1803R6847N2293m1344k4247
14196C95112J6588J32593M9946r9533r3980j58273o8480K7891J4880P3861L6675
14185C27280n3683M4972J57274k737N0192J46233J20925N7325J87966K1059O5373
14174A122179m4002N5623n1251j86113r2932J1404j3090r8597o8421K5864L947
14163F64611j33205j57609p1842J31555R4987J38038J49018m4952j10578j1068
$$ plain form
14240 188479 250721 240433 267583 274316 315030 277348 258825 256743 195819 164748 85465 87066
14228 87066 104544 85871 50467 537 24208 161985 327971 576350 672510 628045 487490
14217 487490 327774 211108 109562 153792 219596 262263 136748 103962 208044 179619
14207 179619 166024 114892 109237 198136 319439 229760 311563 408410 460703 419359 395112
14196 395112 411700 544293 594239 494706 400726 242453 173973 201864 216744 290605 327280
14185 327280 273597 318569 475843 473106 523298 669531 790456 847781 1035747 1056806 1122179
14174 1122179 1078177 1133800 1082549 896436 803504 814908 801818 703221 634800 660664 664611
14163 664611 531406 373797 301955 433510 528497 666535 815553 770601 660023 648955
14153F48955J60775K28912J92383m6997j87632j00224l9123k6350j72333m0988
14143F17378j23176j15890O0297R637j80640j01470L7882M5689k800j18347j17536
14132A1024N2800L1561o4676K7698K9209m2935L3954l291o9984J19001J26128
14121B50489P198o1203r7712m8740M1286N9972J4960L8266R6520J63987J65375
14110F30398L47r7387k40272r0553o0093l9643l2941L7767p5379m7633L1428P8900
14098I4939O5219O1591m9198M2584j1193l5265n4778n1666J11097k6917n1390
14087I5023j8326N646j11075O6016J24784j1546Q2976K15363J37111q5419k03723
14076B96830j45897O0411n1998k5917J24898M6702m7179J11927l7314N7j05510
$$ plain form
14153 648955 809730 1038642 1231025 1184028 996396 896172 857049 830699 658366 617378
14143 617378 494202 378312 438609 448246 267606 166136 204018 249707 246907 128560 11024
14132 11024 63824 95385 30709 58407 87616 44681 78635 75344 5360 124361 250489
14121 250489 257687 196484 98772 50032 91318 151290 166250 204516 301036 465023 630398
14110 630398 630745 533358 293086 202533 142440 102797 69856 107623 32244 -15389 16039 94939
14098 94939 160158 221749 172551 215135 203942 168677 113899 62233 173330 146413 95023
14087 95023 76697 82343 -28732 37284 162068 150522 233498 448861 585972 500553 296830
14076 296830 150933 211344 159346 133429 258327 305029 257850 369777 332463 332520 227010
14065B27010j26391Q4180Q0124J950J48218R9867M6881j46024k13504o5318L0301
14054A67294R3158J0747K8010n0019j37238l3206N1040j6171j09986K7040J10178
14043A40847k0330p1665l4920L9560O052J6287J47486J10465j47200n4568k3558
14032A08456M8884N3394L6873M0871N9312j9834j3944j39180j76968j13612j5845
14021a31593J2543n3518k6958J04730J27282J30786L0935k04071l3492Q5728l1707
14010A0665O0372L0423l0706O0012l4680O723j09878o8355k3956l7235M7313O7391
13998b1911P3068P4024o5901m653J23201l6460m8711m4620o8506k1221j1579J8150
13986c5119J42966J32662J37252L1828q9580n0118j59983j42157l2728o7440L5183
$$ plain form
14065 227010 100619 184799 264923 266873 415091 514958 561839 415815 202311 136993 167294
14054 167294 260452 271199 299209 249190 111952 78746 129786 113615 3629 30669 140847
14043 140847 120517 48852 13932 53492 59544 75831 223317 333782 186582 132014 108456
14032 108456 157340 210734 247607 288478 347790 327956 314012 174832 -2136 -115748 -131593
14021 -131593 -119050 -172568 -199526 -94796 32486 163272 194207 -9864 -43356 42372 10665
14010 10665 71037 101460 70754 130766 96086 102809 -7069 -75424 -99380 -136615 -89302 -21911
13998 -21911 51157 125181 59280 54627 177828 141368 92657 48037 -20469 -41690 -53269 -35119
13986 -35119 107847 240509 377761 409589 320009 269891 109908 -32249 -64977 -132417 -97234
13975i7234O2783L2039L7824O3032l2101J9356m4073M1587j3807R504k0851J8702
13963G6761J19357O8389l5500j15856k5481K5400m3433n3757m703j0240j35070
13952a34133j34392O710N4014J32060J27409J75964P8794j52723j65818m9876
13942f1991l3506p9832Q6254J28772K7559M7175J2135O758j5937q6540l1783j41057
13930a41993M1793N2979L242k314k0881j47J03156J34565M1474L8656k2736j34835
13918I2959j19886P4222N6843L9296J08918R365Q0660N5394r7686j4543P5878
13907C61420O9076K7971n4800j32777O790n4604p311m1733j0900K1497R5152j6827
13895B62954q9390Q2323O6010K8993o166j41398k20735j9280J0455k6175j1156
$$ plain form
13975 -97234 -34451 -2412 35412 98444 66343 85699 41626 83213 69406 78910 58059 76761
13963 76761 196118 264507 229007 113151 87670 113070 69637 15880 11177 937 -134133
13952 -134133 -268525 -261815 -207801 -75741 51668 227632 306426 153703 -12115 -61991
13942 -61991 -95497 -175329 -89075 39697 67256 114431 126566 133324 117387 30847 -936 -141993
13930 -141993 -100200 -47221 -43979 -46293 -67174 -67321 35835 170400 211874 250530 227794 92959
13918 92959 -26927 47295 104138 143434 252352 261717 342377 397771 300085 285542 361420
13907 361420 430496 458467 403667 270890 277680 223076 215765 174032 163132 184629 279781 262954
13895 262954 173564 255887 321897 350890 344724 203326 -17409 -36689 -26234 -52409 -63565
13884f3565o3334O0324J5430n5698J07547R5049o6472l7193J03942m2277k2659
13873C1094J02597L7774J32252J86901J07947N1176j84757k62141r2483j5110
13863I5250n126l1141K344l8892n9936J4974j4457J5544J23886J29053K12530
13852D44029K28838J54651k1673l01152k20211j39468J7320J0489o9376p5058
13842B8389p9636k0044Q3299J67610L137q9790j54262K8491M7692J25798J873
13831A42557q572j23897n683N2446J52246M1882m4250j48745o9472j10380q4017
13820b05885J54704K5318L8167j8501m2259n6860K3669J52372O9828O2980K23201
13809D26734N8623j17937o7683N273M9752j58584j58300n3398J098M2152k300
$$ plain form
13884 -63565 -126899 -66575 -51145 -106843 704 95753 29281 -7912 96030 53753 31094
13873 31094 133691 171465 303717 490618 598565 649741 464984 202843 110360 95250
13863 95250 90124 58983 61327 22435 -37501 -22527 -36984 -21440 102446 231499 444029
13852 444029 672867 827518 805845 504693 284482 145014 162334 172823 103447 28389
13842 28389 -51247 -71291 12008 179618 182755 92965 -61297 -32806 14886 140684 142557
13831 142557 133985 10088 4405 56851 209097 250979 206729 57984 -11488 -121868 -205885
13820 -205885 -51181 -25863 12304 -6197 -48456 -105316 -81647 70725 140553 203533 426734
13809 426734 485357 367420 299737 305010 354762 196178 37878 -15520 -14422 27730 25430
13798B5430o910Q2565q0535j38730P5900N8486J07845J2311j25760K1017R9108
13787A30727M3833L7494j6349l1249M6581M1239k9189m2025J36538J82489j8565
13776D81524l9160n3194L5675L1983j32552j65580q0208L508m4784P810j0067
13765C4955l8009m8322J28735K5493p0363o6802M1461Q4122l9437k165o0171K5363
13753A4860J774L9671o2057o485o2886o4341O1668Q1832N2989n5138L6518J47962
13741A86367R9681j7058r5724q5835n183K2098k9673L571k7838M1789N0111j0133
13729A32173m238O0438m4136l713R3110O8263J5536P5694N0962p2698q0734j68800
13717A21857l0992J115K0097q2852J0229J70212R3588p684K6103m4872j57369
$$ plain form
13798 25430 18520 101085 20550 -118180 -42280 16206 124051 136362 10602 31619 130727
13787 130727 174560 212054 195705 164456 211037 252276 223087 181062 317600 500089 481524
13776 481524 442364 389170 424845 456828 324276 158696 78488 81996 37212 45022 34955
13765 34955 -3054 -51376 77359 102852 32489 -34313 7148 91270 51833 49668 -10503 14860
13753 14860 16634 56305 -5752 -12237 -75123 -139464 -77796 4036 57025 1887 38405 186367
13741 186367 286048 268990 173266 87431 82248 104346 74673 78244 50406 92195 142306 132173
13729 132173 127935 188373 144237 140524 233634 301897 317433 393127 444089 371391 290657 121857
13717 121857 90865 91980 112077 29225 39454 209666 303254 295570 321673 276801 119432
13706A19432j22333P608J46579P1928l3008j10228J02557J2229j40279L3572J12149
13695B00206P2425R5357J27142J65970J29169j18192k06326j46998p6073K3321
13685B66001K9043j8114r9309l1032K9491J20338K02031J13650J48553J64243
13675I24895M7825j35484k01074j47390j4500n197O5896R4408J95797K28081J54595
13664A207852J71865K03359O8038j46102k26742k89304k61783j46413r4924k4105
13654D61741R6567L51949K03258J76927J29899l3041J7254j94864k80720n6092
13644H72878L8186L9991M0441k7990k32423l00551j73610J8642m9151N9441Q5804
13633C71658p4621o0452L2674r9515m4058Q6449K0973K2775J23852O2714j7581
$$ plain form
13706 119432 -2901 4707 151286 223214 190206 79978 182535 194764 54485 88057 200206
13695 200206 272631 367988 495130 661100 790269 672077 465751 318753 242680 266001
13685 266001 295044 276930 177621 146589 176080 296418 498449 612099 760652 924895
13675 924895 972720 837236 636162 488772 474272 469075 534971 629379 825176 1053257 1207852
13664 1207852 1379717 1583076 1651114 1505012 1278270 988966 727183 580770 485846 461741
13654 461741 558308 910257 1113515 1290442 1420341 1387300 1404554 1209690 928970 872878
13644 872878 911064 951055 991496 963506 731083 430532 256922 275564 226413 285854 371658
13633 371658 297037 236585 269259 169744 125686 212135 233108 255883 379735 442449 424868
13622D24868m4399M2527P1500N8862J12919J69636M9870o6936q0724j78756k46306
13611C13061l6461J22507j28910r9960l6380m1120P8061J2145k3708j52170J3965
13600B1030J13244o2080j76686o429J22912j37492j61647o3679J48962R7640P6846
13589b7379q282k3049k3563M9227J0550q783j2902J64001J00574p1555p0836l2021
13577D5982l85L0502o5177N859o223k6111K0986m0262O0640K16293N2406p8931
13565B15579j36676l0370J3394k7169K5746J5466l1069j0195P2118m709j12626
13554a0511m7563N0329R5730l5880n2873M0051R4148O907j41582k02644J1341
13543a92547P5400n3723l1332K2137R7509p6491j07426N8576R4990J49290Q5294
$$ plain form
13622 424868 380469 422996 494496 553358 666277 835913 885783 818847 738123 559367 313061
13611 313061 276600 399107 270197 170237 133857 92737 170798 182943 159235 7065 21030
13600 21030 134274 72194 -104492 -110921 11991 -125501 -287148 -350827 -201865 -104225 -27379
13589 -27379 -35661 -58710 -82273 -33046 -22496 -31279 -44181 119820 220394 148839 78003 45982
13577 45982 45597 76099 10922 16781 10558 -15553 5433 -34829 25811 242104 294510 215579
13565 215579 78903 48533 61927 34758 60504 75970 44901 34706 106824 102115 -10511
13554 -10511 -58074 -7745 87985 52105 -768 39283 133431 140338 -1244 -203888 -192547
13543 -192547 -117147 -170870 -202202 -180065 -82556 -159047 -266473 -207897 -112907 36383 121677
13532A21677q0468p9057R2185L6873p8408n8323o7043j80R4708r2654m4698l3498
13520a88886P5733P4593n766p0655L3830M2933J77210M0479j26944j21085O0028
13509h530N3216k3366q5642j40806l852J52616J01245L8860l3470r7556j16341
13498a63626m6897J76524J35086Q9788N935N7241M6581J6310p4892o8576j03289
13487G0185P204J09604K1462J21421J9356o2377o6902J7888J4119o1079j41427
13476D9454o5812l937M2695l1358J1003m22j737R6516M8275R6467J01359k9297
13464C13206l6618N2496M9037J88352J83532L0516l7673O89Q8013r0919o8709
13453F71922j98990j34689j5277Q479q1263k7438K890j04584j41293O2963M7204
$$ plain form
13532 121677 41209 -37848 54337 91210 12802 -45521 -112564 -112744 -18036 -110690 -155388 -188886
13520 -188886 -113153 -38560 -44326 -114981 -81151 -38218 138992 179471 52527 -68558 -8530
13509 -8530 44686 21320 -64322 -205128 -208980 -56364 44881 83741 50271 -47285 -163626
13498 -163626 -210523 -33999 101087 190875 196810 254051 300632 316942 242050 173474 70185
13487 70185 77389 186993 208455 329876 349232 286855 219953 237841 251960 190881 49454
13476 49454 -16358 -20295 22400 -8958 2045 1623 -114 96402 144677 241144 342503 313206
13464 313206 276588 329084 378121 566473 750005 780521 742848 743537 831550 740631 671922
13453 671922 472932 338243 322966 331445 250182 222744 225634 121050 -20243 42720 89924
13442H9924j0370j38750M421J20343N4152r781p8319O0296J5572k585L2667J6439
13430A54009J7431j7382O2580j3355n0666k3816q049r998p0440j03880k2316K9502
13418e6380J2785Q4110O9176J14255O2857p7261n8194J9279k3822L2306N9826
13407B38937m3735M8352J09334J55176J59054J1172j82400r8489k5874j21181
13397B50346o1868O2904q7614p8167j0309j8172K1796l5477j74690L0452J17749
13386A6950J9342P6497l8519q9472p067J06282j1502l1753Q4097j03675P4415
13375I5595N3253O9644J1380j35624q2135q9382M306L9422M6210N622J5102M57
13363C3850k6326l0847m758R8709r494K4391J08312j15783j758J6126j515Q9874
$$ plain form
13442 89924 79554 -59196 -54775 65568 119720 109939 31620 91916 107488 104903 137570 154009
13430 154009 171440 154058 216638 203283 152617 128801 120752 110754 40314 -63566 -85882 -56380
13418 -56380 -43595 40515 109691 223946 286803 209542 151348 170627 146805 179111 238937
13407 238937 195202 243554 352888 508064 667118 678290 495890 397401 371527 250346
13397 250346 188478 251382 163768 85601 75292 57120 78916 43439 -131251 -100799 16950
13386 16950 36292 112789 74270 -15202 -22269 84013 72511 40758 124855 21180 95595
13375 95595 148848 218492 229872 94248 12113 -77269 -72963 -33541 12669 18291 33393 33850
13363 33850 7524 -23323 -28081 70628 61134 85525 193837 78054 76296 92422 90907 180781
13351A80781j05799j9219M1841p2845m0579l15J02713J15334r242r6264p7J11618
13339B07947O2280l2420M5045m8461Q038l4310O3756o4100j02212m579J04848
13328B05832Q0473p3656j00875r4111m559M1191N9042K9107j70605p7640K59063
13317A53262J53706l053q831j9244j30889Q173m9887M8513N1278K5510n2878j33888
13305D1772P7636K1058N659k9625N9260M2683j9244n8904p7984j7296q73O155
13293E0297L9350r139o3986p3508N8064J31929R2515o4121M6066M5425j46069
13282A06823j73654M1885J06464N068n7316O0583k8819k6654Q1902j1729r9034
13271E519n6926J13393M8854J53379R1178k020m7182L3679L0181p0718j08320
$$ plain form
13351 180781 74982 55763 97604 24759 -15820 -16135 86578 201912 192670 96406 96329 207947
13339 207947 270227 237807 282852 234391 242429 208119 271875 207775 105563 100984 205832
13328 205832 286305 212649 111774 17663 13104 54295 113337 142444 -28161 -105801 153262
13317 153262 306968 303915 295084 275840 144951 153124 103237 151750 203028 228538 175660 41772
13305 41772 119408 140466 146125 116500 175760 218443 199199 140295 62311 45015 44142 50297
13293 50297 89647 80508 16522 -56986 1078 133007 225522 161401 207467 252892 106823
13282 106823 -66831 -24946 81518 86586 29270 89853 61034 34380 116282 104553 5519
13271 5519 -51407 61986 110840 264219 355397 353377 306195 339874 370055 299337 191017
13260A91017k8713M8369P5880n5044j01606M9575O3910l1284o0927O5364o9698
13249A46843J6471Q5253k3154N3978L2364l7275j2974R088n7572L9876O1118O3825
13237C77841l0472n051N3856j7252J4947q2386j13837n4926m4740p7498P745K5993
13225E4220j6537Q5117L8014k8359j26110p4465J86730Q3034q0228N9114J17234
13214B97764Q0597q5429M2558k1057j07083m8305N2843K7869R5301K408r9073
13203B38393K1037O882q5700p8054P6370J76734Q6632L1485q6499j84381P7394
13192B80293J33507k9281L6519K2150K7475J9264q0828l6010J33063O6284Q454
13181E80890Q7113o0477k00361J8997N8970L5655J5159m8329k6783P844O4462
$$ plain form
13260 191017 162304 210673 286553 231509 129903 179478 243388 212104 151177 216541 146843
13249 146843 163314 248567 225413 279391 311755 274480 261506 270594 213022 252898 314016 377841
13237 377841 347369 342318 396174 378922 393869 311483 197646 142720 97980 20482 28227 54220
13225 54220 37683 122800 160814 132455 6345 -68120 118610 201644 121416 180530 297764
13214 297764 378361 292932 335490 314433 207350 159045 211888 239757 335058 337466 238393
13203 238393 259430 266312 180612 102558 178928 355662 442294 473779 387280 202899 280293
13192 280293 413800 384519 421038 443188 470663 489927 409099 373089 506152 572436 580890
13181 580890 668003 607526 407165 426162 485132 520787 535946 487617 460834 468678 533140
13170E33140K574P0462p675P3317j23879p2032P6483Q7555O2099j9384k7581M7354
13158G02433J7939j02056J7725O3533q045O4630J47299m2067k7722Q8429Q7091
13147A009189J42893M0126j45372j55996j13850j40510j22401l3418O0941Q5839
13137F27441Q7758N823r3628o7639l6031L4727J97700J38317L6556o012M9731
13126I74743J298j95145r9559Q6858R3962k9072q8761P0712k0996j57487m2439
13115E94114O5101L047j25573n7504P5585M6416P8067r627k1496M3021k9318r4973
13103E66860j17370L1000J21563J35608M0141l6708q8761j36538k8587O6129l1383
13092E21954L6014K4277J27098p722k1168K0183l9168q3320L1401J67156J45375
$$ plain form
13170 533140 535714 606176 598501 671818 547939 475907 552390 639945 702044 682660 655079 702433
13158 702433 720372 618316 636041 699574 691529 756159 903458 861391 833669 922098 1009189
13147 1009189 1152082 1192208 1046836 890840 776990 636480 514079 480661 541602 627441
13137 627441 715199 721022 627394 559755 523724 558451 756151 894468 931024 925012 974743
13126 974743 976041 780896 681337 768195 862157 833085 744324 815036 794040 636553 594114
13115 594114 659215 662262 536689 479185 554770 601186 679253 669626 648130 691151 661833 566860
13103 566860 449490 480490 602053 737661 777802 741094 652333 515795 487208 553337 521954
13092 521954 557968 582245 709343 701621 680453 700636 661468 578148 609549 776705 922080
13081I22080l873k5606Q3100j7612k682l8504r3008K4744J8539n9482J54228o9905
13069H92019k21115p8265Q9651P1356J22027j8400m7483M6399J47324J14456n7492
13058A060477j03868j24227o0805L694M0953N3672l9249j07837r637K3993Q4117
13047H21283R1298O023j07477J38661J67952j0376L9832r0289m1018n02r0263
13036I25124m0259N5040J19173n5133J0240J55790J40251J7784K9657J03256o828
13025A454095J060j36191j79396r5778r4105k6534P9604Q4242M9535m765o0114
13014A071653M4786J7130m9787M9448M0643q4710M4478P5889L542n8501M0504
13003A195075J59766p3933J15878Q3850J26203M4067p4734j23902j00698j6876
$$ plain form
13081 922080 918207 892601 975701 958089 955407 916903 823895 848639 867178 807696 961924 892019
13069 892019 670904 592639 682290 753646 875673 857273 809790 856189 1003513 1117969 1060477
13058 1060477 956609 832382 771577 775271 816224 869896 830647 722810 713173 737166 821283
13047 821283 912581 918604 811127 949788 1117740 1107364 1147196 1056907 1015889 1015387 925124
13036 925124 884865 939905 1059078 1003945 1014185 1169975 1310226 1328010 1357667 1460923 1454095
13025 1454095 1455155 1318964 1139568 1043790 949685 923151 1002755 1086997 1136532 1131767 1071653
13014 1071653 1116439 1133569 1083782 1133230 1173873 1089163 1133641 1209530 1213072 1154571 1195075
13003 1195075 1354841 1280908 1396786 1480636 1606839 1650906 1576172 1452270 1351572 1334696
12993A334696n8489N7674m3288K276J9104J0082J29583R3366O8689j37761j00891
12982A375041K681K4931N0340L0683n1399P9718O3511n4621q9910j8229k5646
12971A387100k7028J61906J6340q7500j20967o7527J5392Q6792P2913p487O9288
12960A499222J15753N6333n7419J8602K38329J83159j5589Q6623Q2573q855P0677
12949B269408J9146o877R870K1397m3366o8361q0653l1209J47560P2689j5691
12938B293913Q6155j7981K8989L9563J14369J59683l1199n3196p6020L7336J55531
12927B737143N4645L5448J14680J81787P7728L9518n243l1913o8527p2924l2277
12916C030065Q8875J65508Q8618J22163J91354O3356P4042P6118J09938J33904
$$ plain form
12993 1334696 1276207 1333881 1290593 1292869 1311973 1322055 1451638 1545004 1613693 1475932 1375041
12982 1375041 1377722 1402653 1452993 1483676 1432277 1511995 1575506 1520885 1430975 1412746 1387100
12971 1387100 1360072 1521978 1538318 1450818 1329851 1262324 1277716 1364508 1437421 1429934 1499222
12960 1499222 1614975 1671308 1613889 1632491 1870820 2053979 2038390 2125013 2207586 2198731 2269408
12949 2269408 2288554 2281677 2291547 2312944 2269578 2201217 2120564 2089355 2236915 2309604 2293913
12938 2293913 2380068 2362087 2391076 2430639 2545008 2704691 2673492 2620296 2544276 2581612 2737143
12927 2737143 2791788 2827236 2941916 3123703 3201431 3240949 3235706 3203793 3135266 3062342 3030065
12916 3030065 3118940 3284448 3373066 3495229 3686583 3749939 3823981 3900099 4010037 4143941
12906D143941J58751J30471J0386K5899L5287p083Q2763P4899J53787J22570J15966
12895E047637R8090J01048K27906K47265K07073P3403O3471J44257J39907J60333
12885F510390K51591K28115J92410J29758J95689K35326J72892J40878J92622
12876H249671J97871K34723M93355L87346K06732J82253L19609M37771L99136
12867A1108467L93185L79628M19281M26688M41577K68426L23039N20648O22222
12858A4903161O71510P08090O12696O93448N74766P18336O91813O41193P45184
12849B0960197P57282Q30681Q11156P57937Q62108R84561J005728Q86402R05080
12840B8761132J072372J056373R58767R13459R50663R78397J017137J117437R23946
$$ plain form
12906 4143941 4302692 4433163 4443549 4469448 4504735 4497652 4580415 4655314 4809101 4931671 5047637
12895 5047637 5145727 5246775 5474681 5721946 5929019 6002422 6065893 6210150 6350057 6510390
12885 6510390 6761981 6990096 7182506 7312264 7507953 7743279 7916171 8057049 8249671
12876 8249671 8447542 8682265 9175620 9562966 9769698 9951951 10271560 10709331 11108467
12867 11108467 11501652 11881280 12300561 12727249 13168826 13437252 13760291 14280939 14903161
12858 14903161 15574671 16282761 16895457 17588905 18163671 18882007 19573820 20215013 20960197
12849 20960197 21717479 22548160 23359316 24117253 24979361 25963922 26969650 27856052 28761132
12840 28761132 29833504 30889877 31848644 32762103 33712766 34691163 35708300 36825737 37749683
12831C7749683R38173Q88520R50732R45045J004053Q76699Q48787Q64666Q08469
12822D5874827R16182Q63886P98700Q08995O81587P00420P52271O86650P83668
12813E2867186O64571O87799N35495L09511K37206J63928J2950j18524k19458
12804E5140664l21069l38082j98291k62798m77026l99614m81078n79670o72673
12795E1410363o38940o27707n91819m76348n94873o14700q81812j001890j062563
12786D4919711j060214r90904j098784j087325r94200j113600j004359r61976
12778C6608349j168397j065827j025793j091260j082611r54215r14147r91439
12770B8314660r73117q54124p78075p63759q35354p37089o69666o93980p48939
$$ plain form
12831 37749683 38687856 39576376 40527108 41472153 42476206 43352905 44201692 45066358 45874827
12822 45874827 46791009 47654895 48453595 49262590 49944177 50644597 51396868 52083518 52867186
12813 52867186 53531757 54219556 54755051 55064562 55301768 55465696 55478646 55360122 55140664
12804 55140664 54819595 54481513 54283222 54020424 53543398 53143784 52662706 52083036 51410363
12795 51410363 50771423 50143716 49551897 49075549 48480676 47865976 46984164 45982274 44919711
12786 44919711 43859497 42868593 41769809 40682484 39688284 38574684 37570325 36608349
12778 36608349 35439952 34374125 33348332 32257072 31174461 30220246 29306099 28314660
12770 28314660 27341543 26487419 25709344 24945585 24110231 23373142 22703476 22009496 21260557
12761B1260557o51098p31958o75760n55291o45469n88626m80152n83065o48780
12752A5700358n92781m04166l60388m20831n25508l72084m07521m64500m59615
12743A1692964m24722k49217k44483l81203k50909k42059l34041k70494k72786
12734I023050k80705k94033j53435o3186j63906k69363k17756j60368n3676j15182
12724G251440j13421j16444j65002l22356k19006j32005j99595r8991o574n5125
12714E822921j05284m8684m5696R1272j8873j24523n4296n6026r2869l172q7332
12703E277438j59864o5094j13821k87320k19430j72936p8880j31495j19760m6558
12693C882280J0761P235k9464j46856n3153l7303r6350j9538j0525M6074P2328
$$ plain form
12761 21260557 20609459 19877501 19201741 18646450 18000981 17412355 16932203 16349138 15700358
12752 15700358 15107577 14703411 14343023 13922192 13396684 13024600 12617079 12152579 11692964
12743 11692964 11268242 11019025 10774542 10393339 10142430 9900371 9566330 9295836 9023050
12734 9023050 8742345 8448312 8294877 8231691 8067785 7798422 7580666 7420298 7366622 7251440
12724 7251440 7138019 7021575 6856573 6534217 6315211 6183206 5983611 5884620 5878046 5822921
12714 5822921 5717637 5668953 5623257 5714529 5695656 5571133 5516837 5460811 5367942 5364770 5277438
12703 5277438 5117574 5052480 4938659 4651339 4431909 4258973 4180093 4048598 3928838 3882280
12693 3882280 3893041 3900276 3870812 3723956 3670803 3633500 3537150 3517612 3507087 3553161 3625489
12682C625489p0496k02955j59919p5455j00212j75147Q363Q2667o5679q3912m161
12671B778583n3569j06240l5500j47204k4427N5260J6562q7499K1647M6820P4794
12660B539227o1150l7227r1924j13854K5888R8880q2342k7433j1876j33810o6668
12649B037711n4649R8260J4652j1081l169R094k4028p468J0217j56321L2057R4920
12637B040195P597Q6007N4387K870j46787j29429r5773p2343n6407k2043m0134
12626A628140q1000m4992P9653Q4924J31970p3159j67573j27942k808o6622j1179
12615A349412K1602k3890Q4022J22259O0321J44456M0889L3888M6306j47169j71419
12604A560677M4247j9366j34663K1442l0716k14841j52248R2268K6456j35247
$$ plain form
12682 3625489 3554993 3352038 3192119 3116664 3016452 2841305 2849668 2932335 2866656 2782744 2778583
12671 2778583 2725014 2618774 2583274 2436070 2411643 2466903 2483465 2395966 2417613 2464433 2539227
12660 2539227 2478077 2440850 2348926 2235072 2260960 2359840 2277498 2250065 2238189 2104379 2037711
12649 2037711 1983062 2081322 2095974 2084893 2081724 2090818 2066790 2059322 2069539 1913218 1945275 2040195
12637 2040195 2047792 2133799 2188186 2191056 2044269 1914840 1819067 1746724 1690317 1668274 1628140
12626 1628140 1547140 1502148 1581801 1666725 1798695 1725536 1557963 1430021 1427213 1360591 1349412
12615 1349412 1371014 1347124 1431146 1553405 1613726 1758182 1799071 1832959 1879265 1732096 1560677
12604 1560677 1604924 1585558 1450895 1472337 1441621 1226780 1074532 1166800 1193256 1058009
12594A058009n9915l1106k131l8153n4976L9465j06J49559J28374M1984k09364
12583A021640k00131R671L7536M8654J2107k9968o0206P1004m1902K3290J09117
12572A000812n0287r8228P3512J04004p4423j9289M8908N7254K9124m1357j5630
12561A014400M2673L2054m9661l7597k2262K3414Q8444p3195j33211J0533K3595
12550I19187j61792j67554M8720Q8907L8868J2925j7866j55338m8732J55640J847
12539G14812j4476K894K0707m5777k2165L8937J09931M8888J7889k6628j01723
12528G43289j78928p3147J28531K54772N6475K7710j27735j80303j54424o0323
12518D35917J30211J58261N8827Q9037j52785n8751r1647P9851P1733o7448l7956
$$ plain form
12594 1058009 998094 966988 964857 926704 871728 911193 911087 1060646 1189020 1231004 1021640
12583 1021640 821509 831180 868716 917370 929477 899509 839303 910307 868405 891695 1000812
12572 1000812 950525 852297 925809 1029813 955390 936101 985009 1042263 1071387 1030030 1014400
12561 1014400 1057073 1089127 1039466 1001869 979607 1003021 1091465 1018270 885059 895592 919187
12550 919187 757395 589841 638561 727468 766336 779261 761395 606057 557325 712965 714812
12539 714812 700336 703230 723937 678160 655995 694932 804863 853751 871640 845012 743289
12528 743289 564361 491214 619745 874517 930992 958702 830967 650664 496240 435917
12518 435917 566128 724389 783216 872253 719468 660717 569070 648921 720654 653206 615250
12507F15250l2753O2526m3301q8021n322Q2505J27819J5308O5251L7818m8945
12496G88135q0861j99657j31730l8264n3234n1616Q5952Q6063J0445q248J0049
12485D17034J13960Q3822Q7265J0123p849j29959q9302m7893Q4548R1944N5275
12474F68968j09040j25940m5159m102j2270J1018o1333k6939Q4385Q0854J06517
12463E66959M1167M4250J49613J49702Q3996L10852O40453R30340J253456J344945
12453E515733M87436p13168j453654j213463p05034m11437k92848j35094M1835
12444A120306j05727K7547K00281O5016K03111M89538N83501J121965J919835
12435E625373L138211L700304K662485p04162l406389l630600k402258j497322
$$ plain form
12507 615250 582497 645023 601722 513701 508379 590884 718703 734011 799262 837080 788135
12496 788135 707274 507617 375887 337623 284389 232773 318725 404788 415233 406985 417034
12485 417034 530994 614816 702081 712204 704355 574396 485094 437201 521749 613693 668968
12474 668968 559928 433988 388829 384727 372457 383475 322142 295203 379588 460442 566959
12463 566959 608126 652376 801989 951691 1035687 1346539 1986992 2917332 4170788 5515733
12453 5515733 6003169 5290001 3836347 2622884 1917850 1506413 1213565 1078471 1120306
12444 1120306 1014579 1042126 1242407 1307423 1510534 2000072 2583573 3705538 5625373
12435 5625373 8763584 12463888 15126373 14422211 11015822 7385222 4982964 3485642
12427C485642q05744m60122l44833n5244M5223n0616j9494p605J37675K35923
12417B160805M92863R79024J607881K353861K245835M12653j890347k473307j720126
12408D169142r30807m80301k79270j72138n1885o78J71679J14776J48585M4975
12398B734078O7441J63007K48905L16504L48007M04674N40387N10211L47179L44587
12388F024980N02555R02248J335655J952712K574634K650621L156028M098726
12380B3198159O088181R834440J6189805K7073029M2039375N3013026M1757400
12373B19193415J2046409n823752J720586O338005j4741856m1089809m6688290
12366A30954708l3896347j9890919j0682326n322321j723910J782497N994513
$$ plain form
12427 3485642 2679898 2219776 1874943 1819699 1864922 1814306 1794812 1787207 1924882 2160805
12417 2160805 2653668 3632692 5240573 7594434 9840269 10252922 8362575 5889268 4169142
12408 4169142 3238335 2758034 2478764 2306626 2254741 2254063 2425742 2540518 2689103 2734078
12398 2734078 2801519 2964526 3213431 3529935 3877942 4282616 4823003 5333214 5680393 6024980
12388 6024980 6527535 7429783 8765438 10718150 13292784 15943405 19099433 23198159
12380 23198159 29286340 39120780 55310585 82383614 124422989 177436015 219193415
12373 219193415 231239824 225416072 227136658 233474663 218732807 177642998 130954708
12366 130954708 97058361 77167442 66485116 61162795 59438885 61221382 67215895
12359F7215895J2261856K1791092L6630975N7843250P7345847P0332235K1944041
12352C65365191l4313237n1377464k4381759J5984621M0223941L1942395k676737
12345C40766951m3235495o5754312o2445264m4005096k6590444j4915596o445300
12338G7375444J083661Q869430J8452251K9196134L3191241J6984577j4397242
12331A70755496l5385495l3062641j9391370o474070N133993J7645147L0533860
12324A29754920L3390187J1716957k2468522m0687108l5073529k2344147j3277520
12317D1011238p986944n295366l597656k672413k145271j836591j738803j458272
12309A4279922j439535j130687r52439p13714o53157o22701m84800n14293m60419
$$ plain form
12359 67215895 79477751 101268843 137899818 195743068 273088915 343421150 365365191
12352 365365191 331051954 279674490 255292731 271277352 311501293 343443688 340766951
12345 340766951 297531456 231777144 169331880 125326784 98736340 83820744 77375444
12338 77375444 78459105 87328535 105780786 134976920 168168161 185152738 170755496
12331 170755496 135370001 102307360 82915990 76441920 81575913 99221060 129754920
12324 129754920 163145107 174862064 152393542 111706434 76632905 54288758 41011238
12317 41011238 33024294 27728928 24131272 21458859 19313588 17476997 15738194 14279922
12309 14279922 12840387 11709700 10757261 10043547 9390390 8767689 8282889 7768596 7308177
12300G308177k84751l01356k49640j04738j35814m637K72634P59029J259744J334711
12290I853359N08275r18247j757876j437711q79371n37373k90572j98427k53392
12281D088665j17228m833M1709K3127j06815J390J17861J07521K05998O60989
12271E018384J330609K180473K900181K880644J180148j187589k768676l093645
12263H440529k180895j346999p86361n15651l06657n3522m4477j53448j74297
12254B878222m0774O8412J947p0935J15838K32885M10209R43985J767661K361002
12244H668452J699696m91523k247946k234657j432959q07227m50016k97954k91963
12235B113903j24973j8467r3002n8335j48988q0915N490j29795l1242J40211R6328
$$ plain form
12300 7308177 7023426 6722070 6472430 6367692 6231878 6227241 6499875 7258904 8518648 9853359
12290 9853359 10361634 9443387 7685511 6247800 5368429 4831056 4540484 4342057 4088665
12281 4088665 3971437 3966604 4008313 4031440 3924625 3926015 4043876 4151397 4357395 5018384
12271 5018384 6348993 8529466 11429647 14310291 15490439 14302850 11534174 8440529
12263 8440529 6259634 4912635 4126274 3610623 3303966 3250444 3205967 3052519 2878222
12254 2878222 2837448 2905860 2907807 2836872 2952710 3185595 3595804 4539789 6307450 8668452
12244 8668452 10368148 9876625 7628679 5394022 3961063 3153836 2703820 2405866 2113903
12235 2113903 1988930 1970463 1877461 1819126 1670138 1589223 1594713 1464918 1433676 1573887 1670215
12224A670215n691M4813j24118j35310K1354m3792j32303l8893j63801j35959
12214I56515q4911O7562J9614J16548J16752J03846L2906j21158j19480r862m2401
12203A035931k8838r0008o8204M2047J433l6243J3442n9099L5821m2869q8476
12192G14937p5941r2131o4035N7678J23499J36847p4799p7345K8086j0193q5225
12181E81378J2031L7382O9170o4013m3567P6076P469o7978l8501j32289L3325
12170D70483J64687O1261K4251j3717k9181j4830l4887M5789O000m7687N4561
12159F86730Q2416j01897O3757Q2641j16392o6942J15897K7582j73338j51559
12149D48895o4577k7558k764K7869J36475O3459N8597P6600o3740r6532n1077
$$ plain form
12224 1670215 1664524 1709337 1585219 1449909 1471263 1427471 1295168 1256275 1092474 956515
12214 956515 871604 939166 958780 1075328 1192080 1295926 1328832 1207674 1088194 1078332 1035931
12203 1035931 1007093 917085 848881 890928 892361 856118 869560 810461 846282 803413 714937
12192 714937 638996 546865 482830 540508 664007 800854 726055 648710 676796 666603 581378
12181 581378 593409 630791 699961 635948 592381 668457 675926 607948 569447 437158 470483
12170 470483 635170 696431 720682 706965 677784 662954 628067 673856 679856 632169 686730
12159 686730 769146 667249 731006 813647 697255 630313 746210 773792 600454 448895
12149 448895 384318 356760 353996 381865 518340 581799 640396 716996 653256 556724 505647
12138E05647L3520o2847j7225O3317q567R208P536j8981j3605m0546L2380L5638
12126E25475k9350q6188o4990J2509O4278L9427K0334j4024j9652j02086N607
12115C51340l3365J01314j0339j35419M5815M9100j0555k0660r2672q7457R1348
12104B48450P6663j1630J8646N8124N5246j242j1207J3145M9094k4993J9150N0029
12092E39475Q3328m5188o1067k4140K2341L8429q3491j14334j9600j627j01638
12081B32488k7681J89036J15418j02315r2200K884j1166n0690L7757L8336J16575
12070D48442N5276j32047j69343j12780N9390M1794M2888M0978N3227l7837K7430
12059C17418P0566K457Q337q5731j09131P480M7786p419Q648m9749L1873n2612
$$ plain form
12138 505647 539167 476320 459095 522412 513845 523053 530589 511608 498003 457457 489837 525475
12126 525475 496125 409937 344947 357456 421734 461161 481495 467471 447819 345733 351340
12115 351340 317975 419289 408950 273531 319346 368446 357891 337231 244559 157102 248450
12104 248450 325113 313483 332129 390253 445499 444257 433050 446195 495289 470296 489446 539475
12092 539475 622803 577615 516548 492408 514749 553178 469687 355353 335753 334126 232488
12081 232488 204807 393843 509261 406946 314746 317630 306464 255774 293531 331867 448442
12070 448442 503718 371671 202328 89548 148938 190732 233620 274598 327825 289988 317418
12059 317418 387984 390441 398778 313047 203916 211396 259182 251763 260411 210662 242535 189923
12047A89923J2982j2974K5105j5520M5008Q8476k9887N1333k5197j82655k5484
12036A21110k4880o256N2894P1487O0735m1421P3744Q7511l8845j03676m8346
12025B04057O3162J14808m3769l0414j1133j61182J5761L0468R5329N7511r249
12014C25349O729k5641R6279Q542j05997j20446k9126m8488O6513j47427j7360
12003H927R1355Q2676J06700O9834l6540r2607n2687O3125J09828o1121r6400
11992A93090j3890L2222M9379N1530N8022p8610K1020J1668J5901o9598j6651
11981B54083j3606l8166k1208q8571J10208L4478k4144J7094j5321j08431P9108
11970A85524R8361j17808l3596o315J396L681Q0992q853o2175K5011R574j8900
$$ plain form
12047 189923 202905 189931 215036 199516 244524 333000 303113 354446 329249 146594 121110
12036 121110 96230 89974 142868 214355 275090 233669 307413 394924 356079 252403 204057
12025 204057 267219 382027 338258 307844 296711 135529 151290 181758 277087 334598 325349
12014 325349 332078 306437 402716 411258 305261 184815 155689 107201 173714 26287 8927
12003 8927 100282 182958 289658 359492 322952 230345 177658 240783 350611 289490 193090
11992 193090 179200 211422 260801 312331 370353 291743 312763 324431 340332 270734 254083
11981 254083 240477 202311 181103 92532 202740 237218 213074 230168 214847 106416 185524
11970 185524 283885 166077 132481 126166 127562 131243 212235 203382 141207 166218 175792 156892
11958A56892R290N0692p7124L8576K7312r8498M8752J0390O1622Q9638n4442P429
11946B70529j2509p8811n9128m5687R0424L6107q1245N8509P2282M0051o7862
11935B22660m6210o2182k3995m513N8278R8503M897o486M2497n3002O2137P3543
11923C66127J37835J06674r318J64780L79345L68778J63109n9022k41271l68451
11913A008586j68014k29556j96102o7589N1621M8575Q5951L6509K8025l9893J07895
11902F66008K07878J24246L22393L23071L82635L67030J29028j3201o6751q3874
11892B358463j41634k56555m35461l43854k26804r9184j60148p8417n1242p3000
11882D92164k2725R9824J01433J12725K58717K45319N5604j52335k76099j8666
$$ plain form
11958 156892 166182 216874 139750 178326 205638 107140 155892 166282 227904 317542 263100 270529
11946 270529 258020 179209 120081 74394 164818 200925 119680 178189 250471 290522 222660
11935 222660 176450 114268 90273 85760 144038 242541 247438 240952 283449 230447 292584 366127
11923 366127 503962 610636 601318 766098 1145443 1514221 1677330 1618308 1377037 1008586
11913 1008586 840572 611016 414914 347325 398946 447521 533472 569981 598006 558113 666008
11902 666008 873886 998132 1320525 1643596 2026231 2393261 2522289 2509088 2442337 2358463
11892 2358463 2216829 1960274 1524813 1180959 954155 854971 694823 616406 565164 492164
11882 492164 469439 569263 670696 783421 1042138 1287457 1343061 1190726 914627 895961
11872H95961L9136O6831J55391q9300k38996j63536q4542j19798j41721j66527
11862A52899n1929J09962N5789j6124l7169n6391n3444m2675N9347m0089N3455
11851A33631P2947q3006P3734J22352p172l8546M6639K7055j50882j24800M7660
11840A19612J3216k3774n1751j21143J33041J22685N4637l4112o4785n350L490
11829A45766j3153N7956N709j0215o7509k2319p2740n0108j2293j00087N0033
11818h8960M1384k8456L2646M5081n7372M0022k3333O7973m5433j8896J12756
11807G7412L0080O9429O007j2253q199M2400k9312j02798J4307J10773K0726m4169
11795A74403M4741j1576j4587m4418L0069J43050N4478m8486l7480q3678J9447
$$ plain form
11872 895961 935097 1001928 1157319 1068019 829023 665487 580945 461147 319426 152899
11862 152899 100970 210932 266721 250597 213428 157037 103593 60918 120265 80176 133631
11851 133631 206578 123572 197306 319658 312486 273940 320579 347634 196752 71952 119612
11840 119612 132828 109054 57303 -63840 69201 191886 246523 212411 147626 142276 145766
11829 145766 132613 190569 196278 186063 118554 96235 23495 -26613 -38906 -138993 -88960
11818 -88960 -47576 -76032 -43386 1695 -55677 -15655 -38988 28985 -16448 -35344 77412
11807 77412 107492 176921 182928 170675 162476 204876 175564 72766 87073 197846 218572 174403
11795 174403 219144 207568 192981 148563 178632 321682 376160 327674 290194 206516 225963
11784B25963p2773j28428q5880p816J25674J79984M5198k27795p1394P0214k381
11773E0566M2840K9150O169j04421K3467R3779L844j34862j45599m4203M7416
11762a31854J31684o088K502J01319Q9536L0921n9471m1389j45413p7193M150
11751a01296N7880m2087j0034M2352m3190J79754m8753j00925J07694J38411N3506
11740B33312K7651j36691o2233n2448j7844J31837K9549K4900j54242K2469R3767
11729A40027J73324n6941o9588q3068r5117P7648M1396O0937J5045K4250n7909
11718A70004j78507M5408r857J5793P4876l579q964L3034m3692o155k8641j7971
11706D1749L08O379j6368j3108L0477k2620j5084k4491j4343M687j14681M4013
$$ plain form
11784 225963 153190 24762 -61118 -68934 56740 236724 281922 54127 -17267 52947 50566
11773 50566 93406 122556 128725 24304 47771 141550 145394 10532 -135067 -179270 -131854
11762 -131854 -170 -6258 -3756 97563 187099 218020 158549 117160 -28253 -105446 -101296
11751 -101296 -43416 -85503 -95537 -53185 -96375 83379 34626 -66299 41395 179806 233312
11740 233312 260963 124272 62039 9591 -8253 123584 153133 178033 23791 46260 140027
11729 140027 313351 256410 186822 103754 8637 86285 127681 188618 203663 227913 170004
11718 170004 -8503 36905 27048 42841 117717 114138 105174 138208 94516 88361 59720 41749
11706 41749 42057 48436 32068 18960 49437 26817 11733 -12758 -27101 -22414 -137095 -93082
11694i3082O0087n0914m1965J5910J105N6287Q566P8387j283n0003k4015M2196
11682A276R9149p114o3054O408K6157J01237l7421j23496q581N357p442j14469
11670a21993q7342J13444Q4137o7079j55398N9773O9137J29523k9282j67274K2168
11659a50186J75222Q7521k4860k1083M6821J01139P2486r8463q8050O7478j5276
11648A52749o2531n4197k8497n4767L6098P7933j3427q6767k4803l5494r910N9199
11636d4414R8853j12316l3732R1884Q6973M6665N6019j05799j9327J34779r5413
11625A04172j13322J357l3086J93982J16271q1042j43693r5256L8834N7535l6059
11614I693o6313n0858O7145R3520R2377N2762N7723O8729p5199j9032L9514j53811
$$ plain form
11694 -93082 -32995 -83909 -125874 -109964 -108859 -52572 -44006 34381 33098 -16905 -40920 1276
11682 1276 100425 93311 30257 36665 62822 164059 126638 3142 -5439 -82 -7524 -121993
11670 -121993 -209335 -95891 -11754 -78833 -234231 -174458 -105321 24202 -5080 -172354 -150186
11659 -150186 25036 112557 87697 66614 113435 214574 287060 188597 100547 168025 152749
11648 152749 90218 36021 7524 -47243 -11145 66788 53361 -33406 -58209 -93703 -103613 -44414
11636 -44414 54439 -57877 -91609 275 87248 133913 189932 84133 64806 199585 104172
11625 104172 -9150 -7793 -40879 153103 269374 188332 44639 -50617 -11783 45752 9693
11614 9693 -56620 -107478 -40333 53187 145564 198326 256049 324778 249579 230547 270061 116250
11602A16250j26510l4888J6545M8787n2070l4044L6026K8612J23784K4733j22378
11591B4847J00264J06572r1065j49322M5726Q2836R319r2124j04215l6187L4152
11580f9197J5277K9941O040n815l3930J32762P1370R2133L0873j05033n5800R0169
11568A98790M711n3967O9215J24885l8569J2391k6381N9341j24407j40692l2110
11557E3207K3624L3362k9395P493M512k0125m3074P438L7691j5164n5083m4475
11545c9989j7075P4286N8162R4521O6548m4287n9043R2446r345q6139J774p8965
11533E2894r2693P3542J64653n7014q1037k3988K4029m338N2050o3347J2414M9558
11521A06723J19403n473j22870o3479N6270P1348L2614l9922J8590r5747j23924
$$ plain form
11602 116250 -10260 -45148 -28603 20184 -31886 -65930 -29904 -1292 122492 147225 24847
11591 24847 125111 231683 140618 -8704 37022 119858 129177 37053 -67162 -103349 -69197
11580 -69197 -53920 -23979 -17939 -23754 -57684 75078 146448 238581 269454 164421 108621 198790
11568 198790 203501 149534 218749 343634 305065 317456 291075 350416 226009 85317 53207
11557 53207 76831 110193 80798 88291 92803 72678 29604 37042 74733 59569 4486 -39989
11545 -39989 -57064 17222 75384 169905 236453 192166 133123 225569 216224 130085 131859 52894
11533 52894 -39799 33743 198396 141382 60345 36357 60386 56048 108098 44751 57165 106723
11521 106723 226126 220653 97783 34304 90574 161922 194536 154614 173204 77457 -46467
11510d6467j40144q6828N4318R8797Q4126n320j2373P6981R6540j03084j2646
11499C900l9797M3988J27213J02581p1886n0810K6180p4536M9602J22340l9306
11488A99469j43739k4039N9561j44726q8035m8956J75638j2296p1086j3758O7783
11477d4184J19216N3961L5732j14234O2814o3759j5163J74142J27116k0679j55539
11466A59423j35442r9020m4977N287j14522L9996J31396R3447m4650o7744p8604
11455a55410k3523J05351J44736l3400K6132J03359r6931j79922j1343P0930J63979
11444A13958j0232p8600p078N1519K3324q94o3434k4275m9443L4397O2917L6247
11432H8406j1338M1420o8015q5961k1338Q9385k6263k8722n3504k2157Q3144N9095
$$ plain form
11510 -46467 -186611 -273439 -219121 -120324 -36198 -41518 -53891 23090 119630 16546 3900
11499 3900 -35897 8091 135304 237885 165999 115189 141369 66833 116435 238775 199469
11488 199469 55730 31691 91252 -53474 -141509 -190465 -14827 -27123 -98209 -111967 -44184
11477 -44184 75032 128993 164725 50491 113305 49546 34383 208525 335641 314962 159423
11466 159423 23981 -75039 -120016 -114729 -229251 -189255 -57859 35588 -9062 -76806 -155410
11455 -155410 -178933 -73582 71154 37754 63886 167245 70314 -109608 -120951 -50021 113958
11444 113958 103726 25126 18048 69567 92891 91997 28563 4288 -45155 -10758 52159 88406
11432 88406 77068 118488 50473 -35488 -56826 32559 6296 -22426 -75930 -98087 -14943 44152
11420D4152M1705l1656P7492L7382r3076j19912M696L5740O7526Q1231j39252
11409F028j14583P9807J65709J1341j08889j71784m5488J3060J02035J28309p751
11398E7794n2951K4829j6847O0515k4759n1095j02160l5746R3430Q9629j3458
11387B9181M2692L0491q028K3223P839Q6371j7620K5780m8576k3801l1362P585
11375A23775q1726N3339O6319k05758q6379M7254P8248n4252j47877J9658P0855
11364a16544L6243Q2415m8046n1049j3175N8492J60643j3432q9035n7842q873
11353f0203n4506o480P2401M7304l5772p8301R8807L1515K912J4141L6778p030
11341F1566l4495O6821J01799k9889o6696n7681j49305J08952P8249r4016p2267
$$ plain form
11420 44152 85857 54201 131693 169075 75999 -43913 -39217 -3477 64049 145280 6028
11409 6028 -108555 -28748 136961 148302 39413 -132371 -177859 -164799 -62764 65545 57794
11398 57794 4843 29672 12825 73340 48581 -2514 -104674 -140420 -46990 42639 29181
11387 29181 71873 102364 94336 117559 125398 211769 194149 219929 171353 147552 116190 123775
11375 123775 42049 95388 161707 -44051 -130430 -83176 -4928 -59180 -207057 -187399 -116544
11364 -116544 -80301 2114 -45932 -96981 -110156 -51664 108979 95547 6512 -51330 -60203
11353 -60203 -114709 -121189 -48788 -1484 -37256 -115557 -16750 14765 17677 31818 68596 61566
11341 61566 27071 93892 195691 165802 99106 41425 -107880 1072 79321 -14695 -86962
11330h6962N3866P2524o1992l21N6366J6675N3674l5478j36786M7657j0412K9329
11318a860p3070J1773J22570n1723k28566r1701J11009J27278j4815J7128o159
11307g8136L1333J18070N7869o0833K7158j2532l4850P8848J2713r3772J9238
11296F5106j0051p2241J5350o7645l2641K1584n8032l9475o401Q0865J5887l1818
11284a19512Q8076q6617n4906L1884R5268j2251M2225K5085M0685m5052P2296
11273G7181N8603r6007m5267J9150m8007j37002M4713J12740R1563P1591r1357
11262E7901o3567K0136O1454L3664o3919q316L1335j9087j22358J21071Q7057
11251A35371m7486n1443l0914K7273K5970k9233O0268j7279N3232O1666j45992
$$ plain form
11330 -86962 -33096 39428 -22564 -22885 33481 50156 103830 68352 -68434 -20777 -31189 -1860
11318 -1860 -74930 -63157 59413 7690 -220876 -312577 -201568 -74290 -89105 -71977 -78136
11307 -78136 -46803 71267 129136 68303 95461 82929 48079 126927 139640 45868 65106
11296 65106 55055 -17186 -1836 -69481 -102122 -80538 -138570 -178045 -184446 -103581 -87694 -119512
11284 -119512 -31436 -118053 -172959 -141075 -45807 -58058 -15833 9252 49937 4885 77181
11273 77181 135784 39777 -5490 13660 -34347 -171349 -126636 -13896 77667 149258 57901
11262 57901 -5666 14470 75924 109588 45669 37353 68688 49601 -72757 48314 135371
11251 135371 87885 36442 5528 32801 58771 29538 89806 72527 125759 187425 41433
11240D1433r3128M2021Q8917k5357p864N3791N2P9694q7714m6431l1092n9683
11228d5361O4261J06281j11852p15J01477L753m5917k5712Q834n0227K2155K7530
11216E4507j04713o0873K0737P6642m134K4679j01535P4686P5034P1095J15579
11205B41704K0944k15965P755J62508J11086k6911j34763j84733r6152J25719
11195A1192N0997J3295q7715P6076M7433L817q8135k6951M7788N5262K6626o6221
11183F3464O5544L216j184Q4859n154j12377q338O6976l4043k66238j0135J23533
11171b9877l900k8612l3564m0631J65637K7114J5399J05378q6334n6980q1893
11160d8263j2378J17009k8985J0539O9564O9806L2083n5705M4224L4604j9941
$$ plain form
11240 41433 -51695 -9674 79243 53886 46022 99813 99865 179559 91845 45414 14322 -45361
11228 -45361 18900 125181 13329 12614 114091 117844 71927 46215 55049 4822 26977 54507
11216 54507 -50206 -111079 -90342 -13700 -17834 6845 -94690 -20004 55030 126125 241704
11205 241704 262648 46683 54438 216946 328032 301121 166358 -18375 -114527 11192
11195 11192 62189 75484 -12231 63845 111278 115095 26960 9 47797 103059 129685 63464
11183 63464 129008 132224 131040 215899 210745 98368 90030 157006 122963 -143275 -153410 -29877
11171 -29877 -33777 -62389 -95953 -136584 29053 56167 71566 176944 90610 33630 -48263
11160 -48263 -60641 56368 27383 37922 107486 177292 209375 153670 197894 232498 212557
11149B12557l5863k0607n8012m4895p2056k5246Q7173O5723M522J22865J015M5699
11137B82875j6913m7437n2408r7990k7594j08285M1741O5190l687Q4929l7803
11126H2618n9711m3321P5972k9127r6379J41465j2313m8394N9427r6352m1708
11115f7823J6589m1360M7428J14851P9029r9145q6624L9348J00381J85245J30441
11104D18360P511j32709l9807O4854n3829J4032k6871j24129L5211J12617J45558
11093D20798J18455j26364k05087q1683K6583Q1677q2445j01191m7605K2647j39298
11082a13513j3320J11034j9026p6123K6355M974R6200K4609Q6771N1608j8026
11071A61543J8188j48560m5778j9017l2321l8382J72213K17476j8754J9326k8875
$$ plain form
11149 212557 176694 156087 98075 53180 -18876 -44122 43051 108774 113296 236161 237176 282875
11137 282875 265962 218525 166117 68127 40533 -67752 -26011 39179 35492 120421 82618
11126 82618 22907 -20414 55558 26431 -69948 71517 59204 10810 70237 -26115 -67823
11115 -67823 -51234 -92594 -45166 69685 148714 49569 -37055 2293 102674 287919 418360
11104 418360 425871 293162 253355 318209 264380 278412 251541 127412 162623 275240 420798
11093 420798 539253 412889 207802 126119 152702 234379 151934 50743 3138 25785 -113513
11082 -113513 -126833 -15799 -34825 -110948 -84593 -79619 16581 41190 127961 179569 161543
11071 161543 179731 31171 -14607 -33624 -65945 -104327 67886 285362 266608 285934 257059
11060B57059j23182j1932j4614j8343j07380q537N2982L7668r4952p0039K2756
11049g8514K4924L7586P7877M14P443Q7916N0234n8624o0680K4990o619j56626
11037d9679o1193Q6865J4887k9358k8043N0383k0237j17195o4384J35308K23418
11026A40772M5651j64337o5642J7255n7974K9817j22062o5449J07443J39804O2975
11015F8253k6876r1637o8103J2504j5221L5051j1598R7450J16378j19453j39077
11004a42329P9012j0202m3611l471j5476L5220M3500J21259o6450L4963L8572
10993G0987n994J6651R6022J5897n3709L8095Q3017P1379j00171p0237j6929L6394
10981A81402J13938p6136p6350L235J07318R191j49402j31616p3518J12942O9942
$$ plain form
11060 257059 133877 121945 107331 88988 -18392 -26929 26053 63721 -31231 -101270 -78514
11049 -78514 -53590 -16004 61873 62287 69730 157646 207880 149256 88576 113566 106947 -49679
11037 -49679 -110872 -24007 -9120 -38478 -66521 -16138 -36375 -153570 -217954 -82646 140772
11026 140772 186423 22086 -43556 -26301 -84275 -54458 -176520 -241969 -134526 5278 68253
11015 68253 41377 -50260 -118363 -105859 -121080 -86029 -97627 -177 116201 -3252 -142329
11004 -142329 -63317 -73519 -117130 -120601 -136077 -100857 -57357 63902 -2548 32415 70987
10993 70987 64993 81644 177666 193563 139854 177949 260966 332345 232174 161937 145008 181402
10981 181402 295340 219204 142854 146089 253407 262598 113196 -18420 -91938 21004 90946
10970I0946J00793K606p4120j1022o5169o4811l2111O8388l4569j15835M0206
10959i4698R8267K8895J73194M9848J18651O897o4372q3377l4849Q6773L5660
10948C20889m336n0999j19910j31933p7138l9844M3434J2449k1781l8915R2870
10937a5214M9952L9566m9238j887J42222J45898j22952j04052o3426N1819P043
10926G9731J0708m7758k2589J38751J08825m5216J637k2866j8441P2289j0096
10915B44975j81562j09038n9068R5605J31231r955l0001K2011o3027k3466o5349
10904d7644R624j8201n6119o1778J05388J150n5541K5260N7092q002N3096J71512
10892A75837O9698l1305R7946L0518k3435J4075Q9996m9666q6844J3971j0312
$$ plain form
10970 90946 191739 194345 120225 109203 44034 -20777 -52888 15500 -19069 -134904 -94698
10959 -94698 3569 32464 205658 255506 374157 381054 316682 233305 198456 285229 320889
10948 320889 316553 265554 145644 13711 -63427 -103271 -59837 -47388 -69169 -108084 -15214
10937 -15214 34738 74304 25066 23179 165401 311299 188347 84295 20869 72688 79731
10926 79731 90439 42681 20092 158843 267668 222452 224089 201223 182782 255071 244975
10915 244975 63413 -45625 -104693 -9088 122143 112188 82187 104198 41171 17705 -47644
10904 -47644 -38020 -56221 -112340 -174118 -68730 -67580 -123121 -97861 -40769 -48771 4325 175837
10892 175837 245535 214230 312176 342694 319259 333334 423330 373664 286820 300791 290479
10881B90479j28458m617M940q3108N364K8514M179j38667q511P4516J53465R5399
10869B93495k4650j23940j88705J16488J04411K9529L4874j85934L437J37596
10859A96601J9023r6768L8072Q255o2708K1229M9966J65053O8422r7408q3244
10848B26493j37865j10346N169N3143p5006l0754n6186N2135n010l2121N9749
10837e0599J16595J57390j10675n747M4769R0219M362r0446P3164p678r2013l4238
10825I5103o6836r7188J9773Q6447J3716K3165M0363o296j43309q5496j5848L6310
10813a00096p11J05972m6213l2900o3154M6472J7191J05717o335m4911k3180Q9698
10801D7550O1017j1651Q0169q4412o2058L3051J26219L9273K9440J4019q1393
$$ plain form
10881 290479 162021 157404 162344 79236 84600 113114 117293 -21374 -29885 44631 198096 293495
10869 293495 268845 144905 -43800 72688 177099 206628 241502 55568 59005 196601
10859 196601 215624 118856 156928 165183 102475 123704 173670 338723 407145 309737 226493
10848 226493 88628 -21718 -16549 36594 -38412 -69166 -125352 -73217 -78227 -110348 -50599
10837 -50599 65996 223386 112711 106964 151733 241952 246314 155868 229032 221354 129341 95103
10825 95103 28267 -68921 -49148 37299 51015 74180 114543 108247 -35062 -120558 -136406 -100096
10813 -100096 -100807 5165 -41048 -73948 -137102 -90630 -73439 32278 25943 -18968 -42148 47550
10801 47550 108567 96916 177085 92673 30615 63666 189885 229158 258598 272617 191224
10790A91224q8307j4569m9140O8442K0054L6627j9351q2148O1185R064k126P6341
10778B07296j2148Q1847k3187o6251j73442K1868K9807j5056j27997o1521P5349
10767f3435q744m6642j6069k1282K73232P5044o2777l3183P031o1449R3096Q1017
10755B15839n4248J341q0415n3653L915p8415m7362l2542O5895n9281Q6014M5718
10743A2806J5059n3315L0854M9938k2017k4695j21911q3689L7478J19728M6802
10732G038o285j1434J31872k104r7118k651l7164n894J8092j2728k6881J4577
10720c0680P7765K734j06560k1607K6184J09629L3814j17594k4419J68928j19279
10709a085j07540l9900O936R0249L2809K7749l7660j0186q537q389P6314p455
$$ plain form
10790 191224 102917 88348 39208 107650 127704 164331 144980 62832 124017 133081 130955 207296
10778 207296 195148 276995 253808 187557 14115 35983 65790 50734 -77263 -138784 -63435
10767 -63435 -72179 -118821 -134890 -156172 117060 192104 129327 96144 103175 41726 134822 215839
10755 215839 161591 162932 82517 28864 32779 -45636 -92998 -125540 -59645 -118926 -32912 12806
10743 12806 27865 -25450 5404 55342 33325 8630 -113281 -196970 -159492 -39764 7038
10732 7038 753 -10681 121191 119087 21969 19318 -17846 -23740 -5648 -18376 -45257 -30680
10720 -30680 47085 49819 -56741 -78348 -52164 57465 91279 -26315 -50734 118194 -1085
10709 -1085 -108625 -148525 -141589 -51340 -18531 9218 -28442 -38628 -47165 -55554 20760 13305
10697A3305K0662Q2459N5067o0348K6015o9485k7050o4544N009k9032l8697M3880
10685d2759m8744j3032k2459m1534J24916N8661j01127p1900R1184J41012k6074
10674D8144n6301L7532m4735J7780L5640l5890j8376J09079J21398j857r3929
10663A18485j48501l6105Q8428N9943M9635L473k0949L8354J2142K5379m7450
10652A42834J79148l729n1395l5310o6140p0658j27582o2850l3556J14837N9016
10641D4615L125M713l6037j01724p1469Q3565J73016J11948k1030j31824p795
10630E1103j73M161N11P7680n369K7756o0434m1431n2211r7500r2607J5644O7870
10617a05000L2401o1634J13256J31326j3067j2364p1015l6480k9741N1461M3555
$$ plain form
10697 13305 33967 116426 171493 111145 137160 67675 40625 -23919 -18910 -47942 -86639 -42759
10685 -42759 -91503 -104535 -126994 -168528 -43612 15049 -86078 -157978 -66794 74218 48144
10674 48144 -8157 29375 -15360 2420 38060 2170 -16206 92873 214271 212414 118485
10663 118485 -30016 -66121 22307 82250 131885 135358 114409 152763 164905 190284 142834
10652 142834 321982 318253 266858 231548 165408 94750 -32832 -95682 -129238 -14401 44615
10641 44615 47740 52453 16416 -85308 -156777 -73212 99804 211752 190722 58898 51103
10630 51103 50930 55091 55602 133282 127913 155669 95235 53804 1593 -95907 -188514 -172870 -105000
10617 -105000 -72599 -134233 -20977 110349 97282 84918 13903 -22577 -52318 -857 42698
10606D2698Q346Q2769J1528n5173l9637p076L9009R0631M1148l4900p5698p009
10594I6636j35276m5057J05902k3006j20060n317K6008O5269M0904J01399N3491
10583A60893j85664l3378O5093n2065j02488J55203L4743n8947l814M9041P8265
10572A06882P0756K1620N4224j6382M8656m5832n9856j4077p4617p2964n0496
10561c2086J18584j1278k9460P1025K0727J05631m4173m2448M6185n4071R3071
10550B41707J36493p7427j59805j81490k8241K3741O3667Q6375j28095l6120M7590
10539a1605J36819P6491J0747j18545n3093j29847n457J09138J309J26186J22490
10528B64633j21217k33326o0616J50536J68131K3229N3212o998J05870N8161Q0330
$$ plain form
10606 42698 51044 133813 145341 90168 50531 43455 82464 173095 214243 179343 103645 96636
10594 96636 -38640 -83697 22205 -801 -120861 -126178 -100170 -34901 6003 107402 160893
10583 160893 -24771 -58149 6944 -45121 -147609 7594 42337 -16610 -20424 28617 106882
10572 106882 177638 199258 253482 237100 285756 239924 180068 165991 91374 18410 -32086
10561 -32086 86498 75220 45760 116785 137512 243143 198970 156522 202707 148636 241707
10550 241707 378200 300773 140968 -40522 -68763 -45022 18645 105020 -23075 -59195 -11605
10539 -11605 125214 201705 212452 93907 40814 -89033 -94490 14648 15957 142143 264633
10528 264633 143416 -89910 -150526 10 168141 191370 244582 237584 343454 401615 481945
10517D81945q8107j44880o6897N3385l8596r4054p3548M69O6216L1891P660o8708
10505F6776m0942K2187P8323j54302K6360J16655Q9723q8409r4136M622J34355
10494A61212j3432K8100l2245j55887l5552Q6739l1108r3064m188J54342J22038
10483A86955Q336n3218l0899j23377j22416R060o0726N7732n3729p5260j31025
10472c88567J68712K45576K2272j33506q81L8710n9934M2893k5275L35J26066
10461C6401P1524Q8593m9586o9090j7577o7226n6511L9816M5807o3778m998N9852
10449A3227O5138k6078j15522j2125J24203P229J6892R352K7668K5198p2210j7989
10437D4983m7882k2901Q5393N0896m0348K3790m7887j6313J510K002M9102n188
$$ plain form
10517 481945 393838 248958 182061 235446 196850 102796 29248 29717 95933 127824 135484 66776
10505 66776 25834 48021 126344 -27958 -1598 115057 204780 116371 22235 26857 161212
10494 161212 147780 175880 143635 -12252 -47804 38935 7827 -85237 -89425 64917 186955
10483 186955 195291 142073 111174 -12203 -134619 -125559 -186285 -128553 -182282 -257542 -388567
10472 -388567 -219855 25721 47993 -85513 -86394 -47684 -107618 -64725 -90000 -89665 36401
10461 36401 107925 196518 146932 77842 60265 -6961 -63472 -23656 22151 -41627 -46625 13227
10449 13227 78365 52287 -63235 -75360 48843 56072 72964 82316 109984 135182 62972 44983
10437 44983 -2899 -25800 59593 110489 70141 93931 46044 29731 31241 33243 82345 77157
10425G7157k0760l3027k8917J53064R0783L6934O5217q5815j70826n5451P5609
10414A03968J8426l5687n5269m4749n0006l2516L2959R0181N0404r5134j65928
10403a83351J6062J12795P5969K762k10562m300J29352N369Q110K5037J06564
10392H3807K569l9826m6146O2631J24926n1947m5315N1802N3917l5957l3273P8591
10380B05779N1648n001k8573O227O6903l8547l4963M3075p2880j58138k5467J16069
10368A26132M6690Q6855q5875j40448L182p1510j9063Q7082k7268r4363o3709
10357a52295R6411J01592m213K1395o06o8148k2505n306M7972O4581l5411K4874
10345F8341M286J32008q7008k0497q040j1057n0673K2954L4868Q4153j07040K7517
$$ plain form
10425 77157 56397 23370 -5547 147517 238300 275234 340451 254636 83810 28359 103968
10414 103968 122394 86707 31438 -13311 -63317 -95833 -62874 27307 77711 -17423 -183351
10403 -183351 -167289 -54494 21475 24237 -186325 -190625 -61273 -55904 -47794 -22757 83807
10392 83807 86376 46550 404 63035 187961 136014 90699 142501 196418 160461 127188 205779
10380 205779 257427 252426 223853 230080 296983 258436 223473 266548 193668 35530 10063 126132
10368 126132 172822 259677 173802 33354 36536 -34974 -54037 33045 5777 -88586 -152295
10357 -152295 -55884 45708 41495 62890 62284 -5864 -28369 -33675 14297 78878 43467 68341
10345 68341 72627 204635 117627 97130 89090 78033 27360 50314 85182 169335 62295 89812
10333H9812Q5185p938j04240q322K982J12015k4052m7786r7386M4881R9337L5609
10321A80097l7106n5127j2222m5282k7207O5558J9471j35807l3451N2904N0604
10310B2432P694R1727r1481J7053K5877N8815M3125K4768J2109o3088o4665k4888
10298E9478j9105M9695o9696n2828L4701J21198L2216M0542j52249n3250N8491
10287D9193o5420J1838j2256R1784R4437j2558p4652k0117R3207M9175j9914j07237
10275G7480j27496o8652j6020q2845J9468J83461P2886n1413O8560N3829n1016
10264G8242K6648N3124R431q8210r4433j13014n5645N8990k8932r708K9188J14130
10252b0189m523K065M4768M9938m7957n0026N2206o1511j50434p6335O8111J45480
$$ plain form
10333 89812 174997 167059 62819 54497 57479 169494 145442 97656 270 45151 144488 180097
10321 180097 142991 87864 75642 30360 3153 68711 88182 -47625 -81076 -28172 22432
10310 22432 30126 121853 30372 47425 73302 132117 175242 200010 212119 149031 84366 59478
10298 59478 40373 90068 20372 -32456 2245 123443 155659 196201 43952 -9298 49193
10287 49193 -16227 -4389 -16645 75139 169576 157018 82366 62249 155456 204631 184717 77480
10275 77480 -50016 -118668 -134688 -217533 -198065 -14604 58282 6869 75429 129258 78242
10264 78242 104890 158014 167445 79235 -15198 -128212 -183857 -124867 -153799 -163507 -134319 -20189
10252 -20189 -24712 -22647 22121 72059 24102 -25924 26282 -35229 -185663 -261998 -193887 -48407
10240d8407j5391O273J4516N4078Q2797j7850j05899l6501r0143J4458p944Q2327
10228f7686j716J13075j04260l7217R3445K6660M922J3594p6332o8847K0216M1717
10216d2429P0000P925K3919p9719m1602J57469n4264j21207J8636M7052P0135
10205E5915P580O9200p0318m3958K0825m8532k7483P0809P1548K8349j34523l4953
10193c5541R9281m181r7811n1336j0399J449O1954P5894J6725L948J4275K890
10181G7148O2696J9551p0774j15776Q5958K5244q5014J9614M0114L0830j24906
10170c5315O9839p1624j01230K7778n2163M4309Q4456P3973j07483n318l2796
10159a05574M9202l4994K9798M6623J8230j2926r046O822p9665J35591J64928
$$ plain form
10240 -48407 -63798 -57525 -43009 11069 93866 76016 -29883 -66384 -156527 -142069 -150013 -67686
10228 -67686 -69402 43673 -60587 -97804 -4359 22301 27223 40817 -35515 -104362 -84146 -42429
10216 -42429 27571 35496 59415 -20304 -61906 95563 41299 -79908 -61272 -14220 55915
10205 55915 63495 132695 62377 18419 39244 -9288 -36771 34038 105586 133935 -588 -35541
10193 -35541 63740 59559 -38252 -89588 -99987 -98538 -36584 39310 56035 59983 74258 77148
10181 77148 139844 159395 88621 -27155 58803 84047 -967 18647 58761 89591 -35315
10170 -35315 34524 -37100 -138330 -110552 -162715 -118406 -33950 40023 -67460 -72778 -105574
10159 -105574 -56372 -91366 -61568 -14945 3285 -9641 -18687 -11865 -91530 44061 208989
10148B08989K1585k04356p8382Q3508L3044l900J0526j42340j37888J6391O944
10137a85879M2625K7336O1297l252r2897N8231N0603J31310J12799j33471m1097
10126B7605M52r736J8915Q4250k0143j33177j89379K9306O9777O8599K0254L9235
10114E958J20756M2061J1869K9158n4528j18297o9428j974O6157Q1554q7373k08272
10102a82359j12122O2099O3394j214Q2233L9528n3938M2618P9977J10957J00195
10091B31368o3534q3125o9945j6907P6677K6605p8875j37557J9191M5144M2554
10080h404o6302L7073J9998m2045r6398N4310K3065N9882Q05K9169L408p6771
10068f2210k0295J7884l449K1387Q2928M5112J50765J7383o5360j53743j3960
$$ plain form
10148 208989 230574 26218 -52164 31344 64388 60488 71014 -71326 -209214 -192823 -185879
10137 -185879 -143254 -115918 -54621 -57873 -150770 -92539 -41936 89374 202173 68702 27605
10126 27605 28057 18321 37236 121486 101343 -31834 -221213 -191907 -122130 -53531 -33277 5958
10114 5958 126714 168775 180644 209802 155274 36977 -32451 -34425 31732 113286 25913 -182359
10102 -182359 -294481 -232382 -168988 -170202 -87969 -48441 -102379 -59761 20216 131173 231368
10091 231368 167834 84709 14764 -2143 74534 101139 22264 -115293 -96102 -50958 -8404
10080 -8404 -74706 -37633 -17635 -59680 -156078 -101768 -78703 -18821 -18016 11153 14561 -62210
10068 -62210 -82505 -64621 -68070 -46683 36245 81357 232122 249505 184145 30402 16442
10057A6442p9837K5813L7028L7272Q5664l0474o7109m1742L884j7108o125P5389
10045C9097J3121P5464P3550r7942q3751J12532o8770q1958r4167Q278M2247l0216
10033i2515m7038P2568O4798P4709Q1971O6524J05990K3498m7390J8938j44106
10022A77947k09878m7558K0147P973N8905n799p6704j17338n1949J46964J64608
10011F7318O2145j38485n9923n713n9886J2701L4621m6472M8712R9744M1604m5284
9999A1082p4498q7208K6634J02075J46761l2130q4973k3641J10351l8267j24275
9988f8089Q7009L6898N520j52297l2208k4835k6352J21509J10027l0827k2449
9977C906Q8844K1083k6522q8004k1200o9691L898L1613L6917q3938o4033J09038
$$ plain form
10057 16442 -63395 -37582 -554 36718 122382 91908 24799 -16943 -13059 -30167 -36292 39097
10045 39097 52218 127682 201232 103290 19539 132071 63301 -18657 -112824 -104546 -62299 -92515
10033 -92515 -139553 -66985 -2187 72522 154493 221017 327007 350505 303115 322053 177947
10022 177947 -31931 -79489 -59342 -51369 7536 1737 -74967 -192305 -244254 -97290 67318
10011 67318 129463 -9022 -68945 -74658 -134544 -121843 -87222 -133694 -84982 14762 56366 11082
9999 11082 -63416 -150624 -123990 -21915 124846 92716 7743 -15898 94453 56186 -68089
9988 -68089 18920 55818 61338 -90959 -123167 -148002 -174354 -52845 57182 26355 3906
9977 3906 92750 113833 87311 -693 -21893 -91584 -87686 -56073 -19156 -103094 -167127 -58089
9965e8089J24056J08456J4326q3176K4120J33145k7045j20285j18119K4745k1811
9954C23j09286j84062n1365J03293J34672j00363J2852K06524J12852k4062j07117
9943e739p0l9388q3204k5393n8376r7223O1452J36308P8501l580K4523L9717q5658
9930e8130l7614r843m956L5513K2594J97622R8226j2404k4803j38707o8423j03418
9918a04343N1042J11360P98m1355j0554J8896l4273K2561l4980K3402Q9759Q9088
9906A81401Q3585m184j6487O5712m8934j18839r2200j03639p796M0680k0644j6691
9894e8036m9315j17358M8359J1322k7329l694m3838O5284P6352M1199j3366P137
9882f3283M1010m5252M7486O6379n3034r7176K2368q718J43400K106j84447P7776
$$ plain form
9965 -58089 65967 174423 188749 105573 129693 262838 235793 115508 -2611 22134 323
9954 323 -108963 -293025 -344390 -241097 -106425 -206788 -193936 12588 125440 101378 -5739
9943 -5739 -5809 -45197 -128401 -153794 -212170 -309393 -247941 -111633 -33132 -36712 -12189 27528 -58130
9930 -58130 -95744 -105587 -110543 -75030 -52436 145186 243412 231008 206205 67498 -925 -104343
9918 -104343 -53301 58059 58857 17502 6948 25844 -8429 14132 -20848 2554 92313 181401
9906 181401 264986 260802 244315 310027 261093 142254 50054 -53585 -61381 -20701 -41345 -58036
9894 -58036 -107351 -224709 -176350 -165028 -192357 -196051 -239889 -174605 -98253 -57054 -70420 -63283
9882 -63283 -22273 -67525 -20039 46340 -6694 -103870 -81502 -90220 53180 55286 -129161 -51385
9870e1385K58747n4511j69172j936N5081L1557M3828J12416R6908o354k0927j15703
9858A78549M5078J65939J91870J69109K0872k81365j77263j61899q5240N2724
9848A18374n0742j056k4252K2994P046j46949r8413L1329M389M8152P722n9082
9836a40488j25698Q3175K01272M6462l9712p3102K5948K1236O5462j16032l2717
9825h4194J42181k59O0770n1127L6183k623r4487o9902k1164O1480J10506k6607
9813F0757O712r7707r4081p7337N2795J41258l5288J6903P4195N0815r3922J2025
9801A7125n0488j11058N4515J05725M1474J43989M7308j30319o3616M3205j4206
9790H3654Q563J18622Q2731j06386j38378K8606N6903j04950k4720P1985L8911
$$ plain form
9870 -51385 207362 152851 -16321 -18257 36824 68381 112209 224625 321533 315179 294252 178549
9858 178549 223627 389566 581436 750545 771417 490052 312789 150890 65650 118374
9848 118374 67632 66576 42324 65318 72364 -74585 -172998 -141669 -137280 -89128 -81406 -140488
9836 -140488 -266186 -183011 18261 64723 25011 -48091 -22143 -907 64555 -51477 -84194
9825 -84194 57987 57728 118498 67371 103554 100931 6444 -63458 -84622 -23142 87364 60757
9813 60757 67469 -30238 -124319 -201656 -148861 -7603 -42891 -25988 48207 99022 5100 17125
9801 17125 -33363 -144421 -89906 15819 57293 201282 248590 118271 54655 97860 83654
9790 83654 92217 210839 293570 187184 48806 77412 134315 29365 4645 76630 115541
9779A15541k6249p8112l7379K8433Q3116J9928K5675O1567l5236j23570n5808
9768b2094J1039m5974O9417k3205L4194J4243n5329K3479j5476m2921l7550p9202
9756a69379n116J23464N0613N4486N8775j612m9536o3501o2136n8467O2735K9031
9744c0643M6567l805j01235K5733m1015K7859M8939K0798q747J0664n0309r6519
9732a51713m6090R1624N6932m4315L4832O3338j65185o1552J08007l5625l5760
9721a85507j2243K7432P8614P1739J309k5602Q0645J9551P3764L8582m8257L106
9709A23133m1202J2536m6609l524O7950M9228M0272o4799j42185m5036n8257j03919
9697b12412M463J09113j8669K0272R4544p1667j10323m132J24245J45099N865
$$ plain form
9779 115541 89292 11180 -26199 2234 85350 105278 130953 192520 157284 33714 -22094
9768 -22094 -11055 -57029 12388 -10817 23377 37620 -17709 5770 -9706 -52627 -90177 -169379
9756 -169379 -174495 -51031 -418 54068 112843 111231 61695 -1806 -63942 -122409 -59674 -30643
9744 -30643 15924 12119 -89116 -63383 -104398 -76539 -27600 -6802 -15549 -4885 -55194 -151713
9732 -151713 -197803 -106179 -49247 -93562 -58730 4608 -160577 -222129 -114122 -149747 -185507
9721 -185507 -197750 -170318 -91704 -19965 -18656 -44258 36387 55938 129702 168284 120027 123133
9709 123133 81931 94467 47858 44334 112284 161512 201784 136985 -5200 -50236 -108493 -212412
9697 -212412 -207949 -98836 -117505 -97233 -2689 -74356 -184679 -188811 -64566 80533 86398
9686H6398O5787J4629j64156o0556K1160R0493O6364L6972j14166p2020m2820
9675g1915o596K5468J6832M4869n063l8177O8562k0423r6380J4021N6820Q3814
9663G1832j6582l7381l6799l8427K2518J36159O7683J0391r8191l6280j23351
9652g8428N4446R162M7125J5404P1379r0206k0493Q0633J30944o7768r6951L3309
9640H8556r3689N6750N6448M8294n3309J506p9946j6303K8924j3060J7297J0357
9628E1825M927k131r7896r9238K1157P0705O785Q0779J29616J7023L8771j09252
9616A13071n1637l2404J3676k2497J45469J4677n0839p7962p5652r2111O9916
9605d6293J46601l1601p0964n851L6904L2716j29761m9886R2143j42633j1878
$$ plain form
9686 86398 152185 166814 2658 -57898 -36738 53755 120119 157091 42925 -29095 -71915
9675 -71915 -78511 -53043 -36211 8658 3595 -34582 33980 13557 -82823 -68802 -11982 71832
9663 71832 55250 17869 -18930 -57357 -34839 101320 169003 179394 81203 44923 -78428
9652 -78428 -23982 -14820 32305 47709 119088 28882 8389 89022 219966 152198 55247 88556
9640 88556 -5133 51617 108065 156359 103050 104556 24610 8307 37231 24171 41468 51825
9628 51825 56752 54621 -43275 -142513 -121356 -50651 -43866 36913 166529 183552 222323 113071
9616 113071 61434 29030 42706 20209 165678 180355 129516 51554 -24098 -116209 -46293
9605 -46293 100308 68707 -2257 -8108 28796 61512 -68249 -118135 -25992 -168625 -180503
9594a80503R7118P2420P9180J7197M7787n6348j11414L0234P5152M4406M4631
9583A59860J2691j06758p136l1974R4298J0159o7597q158p3244N7976p0131M1824
9571A1810N2290j4686N1037l3564N9441R4326J3112l7527j23216j43144N8758
9560a1363J73018P390l8602k7793n4825J33J0340J6777r4048l7249L9287O1767
9548D4832J7533K463J6446L3059R0233m846j25172j7730k5201j04801M6027K40413
9536B13256J6943r6774k11982j09953J72892J48651J09909n7340p0397M8619J36832
9525C00656k9547o1484J4888r3042n426J595M1150K9356r2778r992l8171j38675
9513h1470j6838Q8444l7064o366o7392N2558O6071k4487j9908J43622P1681r1343
$$ plain form
9594 -180503 -83385 -10965 68215 85412 133199 76851 -34563 -4329 70823 115229 159860
9583 159860 172551 65793 58657 26683 120981 131140 63543 55385 -17859 40117 -30014 11810
9571 11810 64100 49414 100451 66887 126328 220654 233766 196239 73023 -70121 -11363
9560 -11363 161655 169045 130443 102650 47825 47958 58298 75075 -18973 -56222 -16935 44832
9548 44832 62365 64828 81274 114333 204566 199720 74548 56818 31617 -73184 -27157 213256
9536 213256 230199 133425 -78557 -188510 -15618 133033 242942 185602 115205 163824 300656
9525 300656 271109 209625 224513 131471 126045 127640 168790 198146 105368 95376 57205 -81470
9513 -81470 -98308 -9864 -46928 -53294 -120686 -68128 -2057 -26544 -46452 97170 168851 77508
9501G7508J1944M2412J4832J13360N0470r2603q3242k8344J53878J42854p9912
9490C23157q6994k4408j1761o2593M7583N5307O6926k4229j32861j52273l9442
9479d1588K5875N358L3149o0855J5143l8410L6207K5068P7910K8293m0903Q9030
9467A54277r1218M8217M665m7586o7856k4461l6309J34970Q9680l2765j14577
9456A7037Q505N4801k9770N2694J1772o8039k4388p3029l5465L9413o8539O131
9444a08877N695k8869M3681P5123Q7407O6309N1804l1039M1576j9087n5505N3404
9432A81622j4126N4598N893m4508j9235p0161L7953k6761o2069q5113P0540R7061
9420A25694L1616p8941M8624N1002n3580l1818Q2610L2683n1410q7049j22208
$$ plain form
9501 77508 89452 131864 146696 260056 310526 217923 134681 106337 260215 403069 323157
9490 323157 236163 211755 199994 137401 184984 240291 307217 282988 150127 -2146 -41588
9479 -41588 -15713 -10355 22794 -38061 -22918 -61328 -25121 -53 77857 106150 65247 154277
9467 154277 63059 111276 115941 68355 499 -23962 -60271 74699 164379 131614 17037
9456 17037 25542 80343 50573 103267 115039 47000 22612 -50417 -85882 -46469 -115008 -108877
9444 -108877 -103182 -132051 -88370 -13247 74160 140469 192273 161234 202810 183723 128218 181622
9432 181622 167496 222094 227987 183479 164244 94083 132036 105275 43206 -41907 28633 125694
9420 125694 157310 78369 126993 177995 124415 92597 175207 207890 156480 69431 -52777
9409e2777o9438n5358P130Q2381P7796P9913L9800J850o8487p2430m8208J15379
9397C7551J05591m1671m3N5105j5322l8385p6178o8792j2428P7099M4946P1144
9385A38617O2940q0532q0822j46693q55R1417J284m3782l3491k0436P3003K6257
9373a3093r2211L2281P2352j1072M9079J02916L6573n2805m177K1371j14298j2052
9361A4864M9589K1689K1862J53939O35j08421r5492j33291L3110m3675k7029J18929
9349F709Q3234j2969M5428J9612K3559K0890k4950J0343j4697r1769L4630n4928
9337D5092J09085J36679K3577M5243l7834J6885j6471n9460n1063L7265k3611
9326B25387j00364P4108l1148l6435k4234J9091r295k4606l379m8441L1929q7580
$$ plain form
9409 -52777 -122215 -177573 -170443 -88062 -10266 69647 109447 111297 42810 -29620 -77828 37551
9397 37551 143142 101471 101428 156533 141211 102826 26648 -42144 -54572 22527 67473 138617
9385 138617 201557 121025 40203 -106490 -107345 -15928 -14644 -58426 -91917 -112353 -39350 -13093
9373 -13093 -105304 -73023 -671 -11743 37336 140252 176825 124020 119843 141214 26916 14864
9361 14864 64453 86142 108004 261943 262578 154157 58665 -74626 -41516 -85191 -112220 6709
9349 6709 89943 76974 122402 142014 165573 186463 161513 171856 157159 65390 100020 45092
9337 45092 154177 290856 314433 359676 321842 338727 322256 262796 211733 248998 225387
9326 225387 125023 199131 167983 131548 107314 126405 117110 92504 89125 40684 72613 -14967
9314a4967o6450J34722J31227Q3354m1930r3163p9864n2412J630P7059P8030L6689
9302A93925J4897n3760n8028l4612M386J14133j4809M991l3342n774L6795J928
9290A70730R3195L9250m3252r1231r1633l5854k672l8085J46504m187j1366p3490
9278E7909L498o1985N4503J03812J43480Q4219N8844n4317j44725j23704L7645
9267A59179j7390p3862p8054L7150J4047J48857R3012l6993k4777J0221L628j22756
9255A12262L7819J37984l3207r4489K1383K0352p5728j7501j9692Q4947Q6186
9244B60316J0657m7091R6128l1366j03821j27688l0732J64208J27338k5314j91469
9233A01166N7694L2953j023K9646N3309N7617p436j29113p5502q1293P227R010
$$ plain form
9314 -14967 -81417 53305 184532 267886 225956 132793 52929 517 2147 79206 157236 193925
9302 193925 208822 155062 97034 62422 66808 180941 166132 171123 137781 132007 168802 170730
9290 170730 263925 303175 259923 168692 77059 41205 38533 448 146952 142765 131399 57909
9278 57909 61407 -578 53925 157737 301217 385436 444280 389963 245238 121534 159179
9267 159179 141789 67927 -10127 27023 41070 189927 282939 245946 221169 231390 235018 112262
9255 112262 150081 288065 254858 160369 181752 202104 126376 108875 89183 174130 260316
9244 260316 270973 223882 320010 288644 184823 57135 26403 190611 317949 292635 101166
9233 101166 158860 191813 190790 220436 273745 331362 323926 194813 119311 38018 45245 54255
9221E4255O6968J28582R4913J0507j69915j7175O1132k0303n7815n1059J90045
9210B90135N4675j26804j22512P0765P5060l7372J05414Q9432K5120o508o6145
9199C51260j08436n0797r9125k1603J06476K9720m9547R5418O1056L1225q8036
9188B57611K7831J87792r1520j70011r4459L0013J00361j8910o0720m4759M5830
9177A69059P659L5281k3151j4109l6499L8158J03635l6428n7079N9576J74218
9166D20320J43289l9183p5922k20618q9033M7153O9360l0399K0659O1457K257
9155C09340j9290n0131L5674N2699k1062K1175o4714J0067R7030P0970j37348
9144C04410K958R8536M166q5630L7182K2076L1197K9879r2002n7767j8337P6126
$$ plain form
9221 54255 121223 249805 344718 355225 185310 168135 229267 208964 151149 100090 290135
9210 290135 344810 218006 95494 166259 241319 203947 309361 398793 423913 417405 351260
9199 351260 242824 192027 92902 71299 177775 207495 157948 253366 314422 345647 257611
9188 257611 285442 473234 381714 211703 117244 147257 247618 228708 167988 123229 169059
9177 169059 176718 211999 188848 174739 138240 176398 280033 243605 186526 246102 420320
9166 420320 563609 524426 448504 227886 138853 186006 255366 224967 245626 307083 309340
9155 309340 290050 239919 275593 328292 307230 328405 263691 273758 370788 441758 304410
9144 304410 307368 405904 410070 324440 361622 383698 414895 444774 352772 295005 276668 352794
9132C52794J57885m699j441Q5681l7664l5694P1494N1942j01089k9861M6776j13170
9120D42954q5824N7837P5032M8158k4018k3928R752j10826r6736L6203J29112
9109D57716L3608m588Q1496r3651k4340O1516O4073K5359M8712j947K1205N7566
9097G26725Q7622J4598N7184J18114L3278L5740J08752J8611M4663M3369J97974
9086A486630K76071K27041M38187M01996M21261N19284Q32972J172475J752025
9077G527942K714429M239441P112954J1898293J8059855K0014889Q681257r780803
9069G0468257j9846882j6993370j0556569o344805l986857k821755j999362j272430
9061F646227j041510q63042o43156m60110k65955j88921j70463k32531r4711k31356
$$ plain form
9132 352794 510679 505980 504539 590220 552556 516862 588356 640298 539209 509348 556124 442954
9120 442954 357130 414967 489999 538157 514139 490211 499963 389137 292401 328604 457716
9109 457716 491324 486736 568232 474581 450241 511757 575830 601189 649901 647954 669159 726725
9097 726725 814347 828945 886129 1004243 1037521 1073261 1182013 1200624 1245287 1288656 1486630
9086 1486630 1762701 1989742 2427929 2829925 3251186 3770470 4603442 5775917 7527942
9077 7527942 10242371 14481812 21594766 33493059 51552914 71567803 80249060 70468257
9069 70468257 50621375 33628005 23071436 16726631 12739774 9918019 7918657 6646227
9061 6646227 5604717 4741675 4098519 3638409 3372454 3183533 3013070 2780539 2685828 2454472
9051B454472m25045j77583p5519j06393j21035p2576r1637R3673j06205r9164
9041A272988J4755j72706j65940j31202J3632Q9206m628K2559k17409k00631O9429
9030E90053L3921q9484k4337Q9787N3285J9889N0518j4080m3831L8872p1334j0417
9018F22842k4599P3069J59016M8829k01470j93420j7478Q5877M8672J15792J5881
9007G33011r7847k7026R8224r0271p9033K5084k2970p7868J2163J38446M6894
8996F58807J688m5699j08690j00047r9728m3738Q262n7628J9177p2434j35468
8985B4502j6125Q3884R1231J32272m5495j01734J2191L6525N5786m801j61790
8974A06446j17446R1909J02324j24080j8203J79684k4075k1754p8474J26140P6119
$$ plain form
9051 2454472 2029427 1851844 1776325 1669932 1548897 1476321 1384684 1478357 1372152 1272988
9041 1272988 1287743 1115037 949097 817895 831527 920733 916105 938664 721255 520624 590053
9030 590053 623974 534490 510153 599940 653225 673114 723632 709552 665721 704593 633259 622842
9018 622842 598243 671312 830328 879157 677687 484267 466789 552666 601338 717130 733011
9007 733011 635164 608138 706362 616091 537058 562142 539172 461304 473467 611913 658807
8996 658807 660495 614796 506106 406059 306331 262593 270855 213227 232404 159970 24502
8985 24502 8377 92261 183492 315764 270269 168535 180726 217251 273037 268236 106446
8974 106446 -11000 80909 183233 59153 40950 220634 196559 174805 96331 222471 298590
8963B98590J23720J0918j72551K3987Q1201j20673p5874m7855P1778N0667N46
8952B44454K7138O0785O3738q9622L5494q7817k3370k7943l9908l3116J7790m0731
8940A06892N34J0860Q8743O1847l6423j14980k3173j27521l9132Q825J19316J19886
8928A75674Q147j7051N6698J58691j2713j97319m4592l2103o9901L7012J25616
8917A88159N2440j1461p6706j09066L550O1852k3218J14974L7823r152N1431O9975
8905C50601n7158k9950O9527J6297o296n5427l9927j01422k8861Q7993L8329j30024
8893A13682j04911m5081J47915J35289q1141p9288k4444m8836J20572J54897R2671
8882C81325o5300q2611j1252J91704j6200m2598j38652j37851K0311K0826K507
$$ plain form
8963 298590 422310 433228 260677 284664 365865 245192 169318 121463 193241 243908 244454
8952 244454 271592 332377 396115 306493 341987 254170 230800 202857 162949 129833 147623 106892
8940 106892 107426 118286 207029 268876 232453 117473 94300 -33221 -72353 -63528 55788 175674
8928 175674 183821 166770 223468 382159 369446 172127 127535 95432 25531 62543 188159
8917 188159 240599 229138 152432 43366 46916 108768 85550 200524 238347 229195 280626 350601
8905 350601 293443 263493 333020 349317 343021 287594 247667 146245 117384 205377 243706 113682
8893 113682 8771 -36310 111605 246894 165753 86465 62021 13185 133757 288654 381325
8882 381325 316025 233414 222162 413866 397666 355068 216416 78565 98876 119702 122209
8871A22209j3316R809j0283N2438o4993l5580N3971J4725k1373m910M9452Q0654
8859B32803J5423q7787j43373k0789M3490p3085j5765M8397N1438J14021M5912
8848B10685j0238m7382l8820j20430l9788Q3869j7225L9547j6851j1370L0708
8837F2705j5657L1009N7938K3902N4767m8023j8247p8366n8871Q3386R1500K6599
8825B12642J3498N480M4751j36163j7593J04440n5973m2974l3558k7347N9228
8814A26431r1842n5118Q069J6151J6226K1997k644K4724k6632M2287L1178j11399
8802e72k3042L5882K3767R5387J50795m9345j42307m0620L917n905o954j6984
8790B4019Q3331L2406K677J3219O363j805j49550q5911K5200K0079k0298O5433
$$ plain form
8871 122209 108893 118702 108419 160857 95864 60284 114255 128980 107607 102697 152149 232803
8859 232803 248226 160439 17066 -3723 39767 -33318 -49083 -686 50752 164773 210685
8848 210685 200447 153065 114245 -6185 -45973 37896 20671 60218 43367 31997 62705
8837 62705 47048 78057 135995 159897 214664 166641 148394 70028 11157 94543 186043 212642
8825 212642 226140 231620 276371 140208 122615 227055 171082 128108 94550 67203 126431
8814 126431 34589 -20529 -12460 3691 19917 41914 39270 63994 37362 79649 110827 -572
8802 -572 -23614 12268 36035 131422 282217 232872 90565 49945 53862 47957 41003 24019
8790 24019 107350 139756 142433 155652 162015 160210 10660 -75251 -50051 -29972 -50270 15163
8778A5163k9567j2591N6600m8579M3723J9749o4067J8383J09386q9014n6464J65136
8766A27858o7022n2427R6717K1022k1920o269M0196J03025m2158r2357O3087P3455
8754B43207r0493o9465K8313J20207R582n1643p328J4510N3270j39338k00821
8743h9999n0298K4197O6080O7590l2117m65J48758J0389O0403J2508m1978O38
8731A75706j6206o3221j18304k3410L5974J5395q3756p810K855L9576j8691L1087
8719c0805k7248j2217P3058R0074K6777l5339m1495O7355J24266k39177n6024
8708f0775J40548L642n806l0141p6151j31820l3969J07479J13909l4193j34752
8697a42029J0565J54380M9944K8643Q2432L7411j12328J1534K43751N1670j21736
$$ plain form
8778 15163 -14404 -26995 29605 -18974 24749 44498 -19569 -1186 108200 19186 -37278 127858
8766 127858 60836 8409 105126 126148 104228 97959 138155 241180 199022 106665 169752 243207
8754 243207 152714 83249 111562 231769 241351 189708 182380 196890 250160 110822 -89999
8743 -89999 -140297 -116100 -50020 17570 -14547 -15012 133746 144135 204538 217046 175068 175706
8731 175706 159500 96279 -22025 -45435 -9461 5934 -77822 -85632 -82777 -43201 -61892 -30805
8719 -30805 -58053 -70270 2788 92862 119639 84300 42805 110160 234426 -4751 -60775
8708 -60775 79773 83415 77609 47468 -28683 -160503 -194472 -86993 26916 -7277 -142029
8697 -142029 -131464 22916 72860 101503 183935 221346 109018 120552 364303 415973 294237
8686B94237q8978K4737n4740j47812j1054J16841M7549n293m3447m9899N5086
8675A37227m6032p0686o0301j8620l2059l3951P5036R4615J05654j0815l1149
8664A08919m9173N2845M0998J55880j806j40294l6948M7181k7539N2877J30944
8653C33884l7205r74k0664j45489m7278J11681Q6839k8860k7050R7456m4548o1167
8641B16625n6931P3309O5590p9218l9387J8839L2606K3463L9187M5674K5160N4640
8629D19557k8740j14521J9481J40112L5250Q8073N2070k2138o9113m9014l7437
8618D33580O1212L7629J23269N4042K00424K79885K16865L32769K37976K931P7408
8607B057990J14780P3108n6263k49430l74662k60803j94014k20043j67143r2184
$$ plain form
8686 294237 205259 229996 175256 27444 16390 133231 180780 175487 132040 82141 137227
8675 137227 91195 20509 -39792 -58412 -90471 -124422 -49386 45229 150883 140068 108919
8664 108919 59746 112591 153589 309469 307663 167369 130421 177602 150063 202940 333884
8653 333884 296679 295705 275041 129552 82274 193955 280794 251934 224884 322340 277792 216625
8641 216625 159694 233003 298593 219375 179988 198827 231433 254896 294083 339757 364917 419557
8629 419557 390817 276296 295777 435889 471139 559212 611282 589144 520031 471017 433580
8618 433580 494792 532421 655690 709732 910156 1190041 1406906 1739675 1977651 1980582 2057990
8607 2057990 2172770 2245878 2189615 1940185 1565523 1304720 1110706 890663 723520 631336
8597F31336j74165k17533o8510q2443P9214O1443J2691R0194K7619j56681p3021
8586A30144n0105L203J32545M4006M2243M8922K2301j34277k5319L800o7373m9632
8574A00458P4147J5870K363L5385n5761j08295L3368J58731R291m0989l0417o2095
8562A32056j31213N0159J59132j2563J2819l6167L7471J49334r7207o3525j04956
8551I5340k6911j2458j4219o44m0521m0257O8456O6185N0330k7032j26612j16076
8539a24419r2679J07517J35084O3440l0373l5860n644R6855P3454o368j19087
8528F1920l2998l3573j6665Q1835Q6312m4544P40P5261J0831q4505N295R3630
8516B03539O0845j13234k5669n239Q0957j25712k4904L00n8768o8163J34695k7919
$$ plain form
8597 631336 457171 239638 171128 88685 167899 229342 242033 332227 359846 203165 130144
8586 130144 80039 83242 215787 259793 302036 350958 373259 238982 213663 217463 150090 100458
8574 100458 174605 190475 192838 228223 172462 64167 97535 256266 265557 224568 194151 132056
8562 132056 843 51002 210134 197571 210390 174223 211694 361028 263821 200296 95340
8551 95340 68429 55971 41752 41108 587 -39670 28786 94971 145301 118269 -8343 -124419
8539 -124419 -217098 -109581 25503 88943 58570 22710 17066 113921 187375 181007 61920
8528 61920 28922 -4651 -21316 60519 146831 102287 103027 178288 189119 104614 109909 203539
8516 203539 264384 151150 125481 120242 201199 75487 50583 50883 -7885 -76048 58647 30728
8504C0728j43190p0940o5227K3064J18767P162J3273l5129R1308O4005L0875j20403
8492e5707j24818J12138J30859k4604n6194n3799N0958L8601L3958J15647k1890
8481A45149J14514J11147N5469k3098R684J1234K9821J8794j03880j62330l3042
8470A73462M6744L5962j13429o9973l1007L6619P3608l8980l3778m1681M3360
8459H0907N7962j12359J9960l3309m380r0063q3117j10824M5428J04884R8954
8448b5957P8636L2270m9210O8729j07083l806j9910K5160M7778J8836q1824O0171
8436D3790j7477J12720R9302J46448L31808J46877p5594j64069j15926r6853q7975
8425C23051j67195p1426j25069l8045L2766l9149N845J14839R5515M5477j16008
$$ plain form
8504 30728 -112462 -183402 -248629 -225565 -106798 -99636 -86363 -121492 -30184 33821 64696 -55707
8492 -55707 -180525 -68387 62472 37868 -18326 -72125 -21167 17434 51392 167039 145149
8481 145149 259663 370810 426279 403181 412865 424099 453920 472714 368834 206504 173462
8470 173462 220206 256168 142739 72766 41759 78378 151986 113006 79228 37547 80907
8459 80907 138869 26510 46470 13161 8781 -81282 -164399 -275223 -229795 -124911 -25957
8448 -25957 52679 84949 35739 104468 -2615 -6421 -26331 -1171 46607 65443 -16381 43790
8436 43790 26313 139033 238335 384783 716591 863468 787874 623805 507879 411026 323051
8425 323051 155856 84430 -40639 -78684 -45918 -85067 -79222 35617 131132 176609 60601
8414F0601j20252N3202L5049P0716K2959j06306j8225J07339L3696M1639j9566
8403A60852J3359L4796k6992K4720J1232N088J644k2785M3573N0338j35514j8627
8391A41684J01725l9289j2268J5612J22045P3927P5530m214J3465p4075j12292
8380C01850j28869k5750m7640o4286n3325k5775K6695J3979p058N2202o4426k5190
8368d7593j09535L8183J85437l3498O981j53502p160n6693q5894k4199J59769
8357a27704J03243o6996R99K8946J40360j7254q2217N3542P3848m3331k5015l1356
8345G065m0813j130R0128J28177k0421o1041q6081j57114O2720L8094k30105L2689
8333b37832L5532Q1762J04694Q8739L9107q0971n1455N9597p6511j5162j4635
$$ plain form
8414 60601 -59651 -6449 28600 99316 122275 15969 -2256 105083 138779 180418 160852
8403 160852 174211 209007 182015 206735 217967 223055 224699 201914 245487 295825 160311 141684
8391 141684 243409 204120 191852 207464 329509 403436 478966 474752 488217 414142 301850
8380 301850 172981 147231 99591 35305 -18020 -43795 -17100 -3121 -10179 42023 -22403 -47593
8368 -47593 -157128 -118945 66492 32994 39975 -113527 -120687 -177380 -263274 -287473 -127704
8357 -127704 -24461 -91457 -90458 -61512 78848 61594 -20623 32919 106767 63436 38421 7065
8345 7065 -33748 -34878 55250 183427 163006 101965 15884 -141230 -78510 -40416 -270521 -237832
8333 -237832 -202300 -120538 -15844 72895 112002 31031 -20424 39173 -37338 -52500 -67135
8322f7135j5550M4912p295K874Q4340L1578m9621k6495j81596j16185k8431R620
8310c18984K007R8647k4265J33491J42314M5695j13848n7679j09458K7586Q7445
8299h7049J6632P2429M3265j5941J0868m4011j16933k6487m2053J7106J19575
8288e2599o2092r314J36084O6184l9585K8848p7100K1799j4177M1085o76n1799
8276a3342r0566O116J63798Q2433n5190K6425j02834r0043O1901n5805j1600o6253
8264a44960L8855Q7335o8314O364J35341J79192M4984m1406j58936n2423J659
8253B7691M2854J16147p4820p0697o9345l1971j34758K0045J89896m6144j33226
8242a64328K0760L7378J08174Q6412L239k4624K0876l9182R1358l7583k2403l3414
$$ plain form
8322 -67135 -82685 -37773 -45068 -42194 42146 73724 24103 -2392 -183988 -300173 -328604 -318984
8310 -318984 -316977 -218330 -242595 -109104 33210 78905 -34943 -92622 -202080 -174494 -87049
8299 -87049 -70417 2012 45277 29336 40204 -3807 -120740 -147227 -189280 -172174 -52599
8288 -52599 -114691 -124005 12079 78263 38678 67526 -9574 12225 -1952 39133 38457 -13342
8276 -13342 -103908 -97792 66006 148439 93249 119674 16840 -73203 -11302 -67107 -78707 -144960
8264 -144960 -106105 -18770 -87084 -80720 54621 233813 278797 237391 78455 26032 27691
8253 27691 70545 186692 111872 41175 -28170 -60141 -194899 -174854 15042 -31102 -164328
8242 -164328 -143568 -106190 1984 88396 91635 67011 87887 48705 140063 102480 80077 46663
8230D6663p5078N1280M4065o2804k2337j3837q292L8379l6704P825j0668k5066
8218f6574O0785O6619O8519m236j8994j04829n1003j7210K342J9440J3968M134
8206b7039o4075N8739l332M9330J11291J9690j36093j38008o2609R5282J24316
8195B7492j0704j0912K5979J3652M4487j6737m1139o2665J17081K940m199O6609
8183A51884j50017o9451q5697Q179J00888L040o0490j3288m3507l1543L5015R6193
8171e8794M9089m2455j14514N2254M5428K8205P992K8840J4918N4453N8132j51278
8159b7730j5438N7670l3650l345m6490n7067O0799R7164j00460m9015L4566J75659
8147I2663R4175o8166o7795p6634o3700K6847M2053R4240J4244j45948o6288P2666
$$ plain form
8230 46663 -28415 22865 66930 4126 -18211 -32048 -40340 -1961 -38665 -30840 -41508 -66574
8218 -66574 -5789 60830 129349 125113 106119 1290 -49713 -66923 -64581 -45141 -31173 -27039
8206 -27039 -91114 -32375 -35707 13623 124914 144604 8511 -129497 -192106 -96824 27492
8195 27492 16788 5876 31855 45507 89994 73257 32118 -30547 86534 89474 85275 151884
8183 151884 1867 -67584 -153281 -145102 -44214 -41174 -101664 -114952 -158459 -190002 -154987 -58794
8171 -58794 -9705 -52160 -166674 -114420 -68992 -40787 -32795 -3955 10963 65416 123548 -27730
8159 -27730 -43168 14502 -19148 -22493 -68983 -126050 -65251 31913 -68547 -117562 -82996 92663
8147 92663 186838 118672 50877 -25757 -89457 -62610 -20557 73683 87927 -58021 -124309 -51643
8135e1643J15295K5001J9524k2492q7724r4218p4318j03882l3697P7470J83994
8124d6690R11J9689P4673j32372K3419M0933M6624J0828l9985m5201r570k0246
8112g6987J9291M1576N7747L9465j5462k4599j03P1856j9027J3013m9000m2777
8100A4993K8748k7876q8701n4250k5288r199J66585N1149k7101l0249p9869N8357
8088b2701J24734L2855j81149l3102r972J9251R8169j2035n8904o1280N8814J38171
8076I2851N9444n9159j5196Q3169n5504k7311j10445Q341k3824M8946j12606q6798
8064a98092J7518J05173m523k7113L6287O6341O4963J780l6797l715l7067L874
8052a1371J633l0786O6037L2209m2943L672M4327J2257K0476p6804M9496J0479
$$ plain form
8135 -51643 63652 88653 108177 85685 -2039 -96257 -170575 -274457 -308154 -230684 -46690
8124 -46690 -45779 -26090 48583 -83789 -60370 -19437 27187 38015 -1970 -47171 -56741 -76987
8112 -76987 -57696 -16120 41627 81092 65630 41031 40928 112784 93757 106770 57770 14993
8100 14993 43741 15865 -72836 -127086 -152374 -161573 5012 56161 29060 -1189 -81058 -22701
8088 -22701 102033 134888 -46261 -79363 -89335 -70084 28085 16050 -42854 -104134 -45320 92851
8076 92851 152295 93136 77940 161109 105605 78294 -32151 -23810 -47634 1312 -111294 -198092
8064 -198092 -180574 -75401 -79924 -107037 -70750 -4409 60554 62334 25537 21822 -15245 -11371
8052 -11371 -9738 -40524 25513 57722 14779 18451 62778 75035 95511 18707 68203 78682
8040G8682n0478K567r217l2296K8807L5353J23656j2173n3397j09824o694R7160
8028I2146N8720q5502j9496R5175l9814j48906L6967o4120n3579J19657J03647
8017I4895n8707R8351R1659q6526l1352j8328n5603r8423m4929P760L7648J5087
8005d8468m4608R612O3395J06063L946N9991l8687k8603j29502n7216Q7130k5295
7993d2242l0089L8972o6710o7951J0158P9520J68483J55381R585k21947j01120
7982f7960j39996k7732J59532J20476l899q8368O2109q552k0700M6966J73950
7971B05826P9299m8260o4706o7295R1430m3166m3154L7526m0655k0135l7951j7008
7959C1751n950j26934K2566M4659n3337m6846K8154M3690l3833j17613P6658P7362
$$ plain form
8040 78682 28204 30771 21554 -10742 18065 53418 177074 164901 111504 1680 -5014 92146
8028 92146 150866 65364 45868 141043 101229 -47677 -10710 -74830 -128409 -8752 94895
8017 94895 36188 134539 226198 139672 108320 89992 34389 -64034 -108963 -101203 -63555 -48468
8005 -48468 -93076 -83464 -20069 85994 89940 149931 111244 82641 -46861 -104077 -16947 -42242
7993 -42242 -72331 -33359 -100069 -168020 -157862 -78342 90141 245522 255107 33160 -67960
7982 -67960 -207956 -235688 -76156 44320 40421 -47947 14162 5610 -15090 31876 205826
7971 205826 285125 236865 172159 104864 196294 153128 109974 147500 106845 86710 48759 31751
7959 31751 25801 -101133 -78567 -33908 -87245 -134091 -105937 -62247 -96080 -213693 -137035 -59673
7947e9673j7253r878L6326N5926L481j12172j03822J6605J10048O4468n6584j20188
7935a92716N8717L7613L8276j4262M7403K2099p858O3816R708J5902N5740K8301
7923A62739o0178j76326K7641J27261j6246N4480O6545k5428j50313n7486Q698
7912c8613m147K7380p7862K8380K7667k4036k5026J44069R2779l0939K670K5257
7900A47579p724r6196j6761k5709N9330j8786l2649J9326k3190m6601j53741R1794
7888a03328l0246o1284n6708r9871J17954J47611K1068J04579K3530Q5362n2304
7877I6363N1349k8958M51n7305Q4790L33R6851m2717o0015P2763K2484j65763
7865G0626O3630R9688p3252j94625K9818J16843q0749r2901n8048N420J6056p1699
$$ plain form
7947 -59673 -76926 -86804 -50478 5448 8929 -103243 -207065 -190460 -80412 -15944 -72528 -192716
7935 -192716 -133999 -96386 -58110 -72372 -24969 -2870 -10728 53088 62796 78698 134438 162739
7923 162739 102561 -73765 -46124 81137 64891 119371 185916 160488 10175 -47311 -38613
7912 -38613 -42760 -15380 -93242 -64862 -37195 -61231 -86257 57812 150591 119652 122322 147579
7900 147579 139855 43659 26898 1189 60519 41733 9084 28410 5220 -41381 -195122 -103328
7888 -103328 -133574 -194858 -251566 -351437 -233483 -85872 -64804 39775 63305 148667 96363
7877 96363 147712 118754 119205 61900 146690 147023 243874 201157 141142 213905 236389 70626
7865 70626 134256 233944 160692 -33933 -4115 112728 31979 -60922 -118970 -113550 -97494 -169193
7853a69193r903M4000m3998N6658L8919j1518j7860q0001N8046P0421M7708L4319
7841A7598J7968Q386m0880j27803O3318M7973o5842L6751M3307k4951j89026m0234
7829b53435P4087P3075M9487K4697J5162K9943m4685N436K0440l1901m7939P8416
7817g217M5587p5923j04473Q0729n0374m5830n0760P9054L9775j27886J04331
7806a12987R912o2829m8596J4871K4403L4389q7073J7395Q7735J20979q2127j03419
7794a87347j5024J64860m6052q1948p4685O0387R8507L0593j26515l817k9899
7783b10940R9943J35986J6106q4191L4690n420J0027o8813m4199P3584J37947
7772I4720m010j35978k724K7382K0756q067k4729n1193o6564l038j1704l589O8902
$$ plain form
7853 -169193 -179096 -135096 -179094 -122436 -83517 -95035 -112895 -192896 -134850 -64429 -16721 17598
7841 17598 35566 43952 3072 -124731 -61413 -13440 -79282 -42531 776 -24175 -213201 -253435
7829 -253435 -179348 -106273 -56786 -32089 -16927 13016 -31669 -26233 -5793 -37694 -85633 -7217
7817 -7217 38370 -37553 -142026 -61297 -111671 -157501 -208261 -129207 -89432 -217318 -112987
7806 -112987 -103075 -165904 -214500 -199629 -175226 -140837 -227910 -210515 -122780 -1801 -83928 -187347
7794 -187347 -202371 -37511 -83563 -165511 -240196 -179809 -81302 -50709 -177224 -181041 -210940
7783 -210940 -110997 24989 41095 -43096 -8406 -13826 -3799 -72612 -116811 -43227 94720
7772 94720 90710 -45268 -47992 -20610 146 -7921 -32650 -83843 -150407 -153445 -165149 -168738 -99836
7759i9836n159l5247N0357O7719O7147q6755n414m8740l9308n6576Q5689J05365
7747g58m1572j5324J709N9969M8329P4446m410n0555j43329K0764R0291p6999
7735c7439O162k4667o910L2493l5577o3771l8361L9739J11797J4560r1435k6313
7723a19722K4725J55182o5309j40537m8914m3876r1290n3833J3152J57469J4233
7712a98720n092M5871p6088q5855N1421J14561J00623q7750j31586L2110p833
7701b48338K3563Q9707J7521J22914J45479l969o1607m3306p4848M1481j5145
7690f548p7552j00251m3581J01951O4168K802Q1012n2636r8207m4295N1663J51343
7678B9869n3592R845K5540J31385k7435m610j22687l8907Q5774K5088J714K5515
$$ plain form
7759 -99836 -104995 -140242 -89885 -22166 44981 -41774 -47188 -95928 -135236 -191812 -106123 -758
7747 -758 -42330 -57654 -55945 4024 52353 126799 122389 71834 -71495 -50731 39560 -37439
7735 -37439 -31277 -55944 -62854 -30361 -65938 -129709 -168070 -128331 -16534 -1974 -93409 -119722
7723 -119722 -94997 60185 -5124 -145661 -194575 -238451 -329741 -383574 -370422 -212953 -198720
7712 -198720 -203812 -157941 -234029 -319884 -268463 -153902 -53279 -141029 -272615 -240505 -248338
7701 -248338 -224775 -135068 -117547 5367 150846 146877 85270 41964 -32884 8597 -6548
7690 -6548 -84100 -184351 -227932 -125981 -61813 -59011 22001 -30635 -128842 -173137 -121474 29869
7678 29869 -23723 -13878 11662 143047 115612 111002 -11685 -50592 35182 60270 61984 87499
7666H7499j47612k1719Q719K7905Q3997J5634m5355o5226p5973m055Q6975P3426
7654B4215o0262L6477K6478R7817p5632J0198K7916m0037k457q0684j35490q292
7642a79753N6628J46212O5451q6241j24420l1621m3452P2778J06073M7659L2204
7631F1518N8742q3343k0831J613P7914J7363q1198k06149m9013j2617j7922k0993
7619b74916J33137P4620j6513R9213l6673N6987N5136j14395P778o0863j21657
7608a98146N2651n4028m1105O0101N0051l4472j9364j8208J8038P4817L1894N5612
7596b2159k6796k8794J6828J00626N1371m7549l1953r3198l2631k8697M3787P1906
7584b7259R5924r0206o7175j3939j12959p803J4823j3346K30040K1150r0802P568
$$ plain form
7666 87499 -60113 -81832 -73113 -45208 38789 54423 9068 -56158 -132131 -136186 -49211 24215
7654 24215 -36047 430 26908 124725 49093 59291 87207 47170 44713 -35971 -171461 -179753
7642 -179753 -123125 23087 88538 2297 -122123 -153744 -197196 -124418 -18345 29314 61518
7631 61518 120260 36917 16086 17699 95613 112976 31778 -174371 -223384 -236001 -253923 -274916
7619 -274916 -141779 -67159 -83672 15541 -21132 35855 90991 -23404 -15626 -76489 -198146
7608 -198146 -145495 -199523 -240628 -180527 -130476 -164948 -184312 -202520 -184482 -109665 -77771 -22159
7596 -22159 -48955 -77749 -60921 39705 91076 43527 11574 -81624 -114255 -142952 -99165 -27259
7584 -27259 68665 -21541 -88716 -102655 -215614 -223417 -208594 -221940 8100 29250 -61552 -53984
7572e3984Q1025M5129k0386j2039P4592J0033j40179O9450O9286n60O2473j10714
7560G4126m8546l3786o3965j01254J44747L5072k8602n1528N2102J12863j6436
7549G4793p4342j3422N4430k4467j1306o1738n5688N2842L8375J1037J3251o758
7537b993n6783j05303O4032J26159J19173m6334q0397L2179J3160k234O2245L6666
7525A59570j49044o7414n5048q5928J7688N4640p2409l4935L7294J04208O5361
7514b6017j55205l5005M7752R1507J11412k8859o7820j8034n7973p9181L4071
7503a83352K5590M839k9419n2515N4184R2960l3334j0607K140N5045m2431K9474
7491h7426J10172j09520j25005O9787N5293J5249n7189L0170J85972M69l3981
$$ plain form
7572 -53984 27041 72170 51784 39745 114337 124370 -15809 53641 122927 122367 184840 74126
7560 74126 25580 -8206 -72171 -173425 -28678 6394 -22208 -73736 -21634 91229 74793
7549 74793 451 -12971 41459 16992 5686 -56052 -111740 -58898 -20523 -9486 3765 -2993
7537 -2993 -59776 -165079 -101047 25112 144285 97951 17554 49733 62893 60659 122904 159570
7525 159570 10526 -56888 -111936 -197864 -180176 -125536 -197945 -232880 -195586 -91378 -26017
7514 -26017 -181222 -216227 -168475 -76968 34444 5585 -62235 -80269 -138242 -217423 -183352
7503 -183352 -157762 -152923 -182342 -234857 -180673 -87713 -121047 -131654 -129514 -74469 -116900 -87426
7491 -87426 22746 -86774 -211779 -141992 -86699 -71450 -128639 -98469 87503 87972 53991
7480E3991m011k7376k3839p8440o6381k187m8402J07308k1369j0867Q621k2122
7468a35074M4400J06906L6013M2826j38079L7053k5783J3453J4340N3157p4932
7457b5720P6819J00753m4602j6303m761j34792o501o6556N7611Q3920m1312J3428
7445h016J801j8329k1202j35979l2332J46760m8918m4928K1514k5256M0004o3614
7433a88495J46855J5644K3523o3573p1842p6047M6165p7209k936J35998J72368
7422F0451j62152j5958Q7698K23856J58475k2434r1985k59701j48899L7122K5577
7411a07950o4598J4849q650k2937Q0975K4019J8968M9187L6996j2631j15296j40729
7399b47797M2947R8696M2810m5528J8314P7846L7660K9626p5549J028M8311M0774
$$ plain form
7480 53991 49980 22604 -1235 -79675 -146056 -148243 -196645 -89337 -110706 -121573 -112952 -135074
7468 -135074 -90674 16232 52245 95071 -43008 -5955 -31738 -18285 -3945 49212 -25720
7457 -25720 51099 151852 107250 90947 86186 -48606 -55107 -121663 -64052 19868 -21444 -8016
7445 -8016 -6215 -24544 -45746 -181725 -214057 -67297 -116215 -161143 -139629 -164885 -124881 -188495
7433 -188495 -41640 -25996 -2473 -66046 -137888 -213935 -167770 -244979 -247915 -111917 60451
7422 60451 -101701 -117659 -29961 193895 352370 329936 237951 -21750 -170649 -133527 -107950
7411 -107950 -172548 -157699 -166349 -189286 -108311 -84292 -65324 -16137 20859 8228 -107068 -247797
7399 -247797 -204850 -106154 -63344 -108872 -90558 -12712 24948 54574 -20975 -19947 28364 69138
7387F9138P6260J20075l088p4034o1628o6218k1970P2058R5398r1038j63890r1248
7375a40185r2841O9223L8664l2207M1428M673k1746k0417M4673M8318p7427P855
7363a29989j0252J25075K5261j61676J08262L6304q1559o4000J6333P2923O1576
7352a742J13978j3558M274j08863l1680j34188O9366R6404M648k1967p6064P9
7340i9313N796O5467k3480N7856O1214j17543j01348k6803l132M3982J3102P7584
7328d6618R35N0399l8249K1524L6061j7151q9761K8976o8781r1913p8451J02245
7316a90784Q7355J42009j4966j03457j2624O8452N2017j34460K8265M5388m6402
7305g9207N5320M6934m318n0641n3449M6580l2656p3740q8270k9751J21151L0117
$$ plain form
7387 69138 145398 265473 262385 188351 126723 60505 38535 110593 205991 114953 -48937 -140185
7375 -140185 -233026 -163803 -125139 -157346 -115918 -111245 -132991 -153408 -108735 -60417 -137844 -129989
7363 -129989 -140241 -15166 10095 -151581 -43319 -7015 -88574 -152574 -136241 -63318 -1742
7352 -1742 112236 98678 102952 -5911 -37591 -171779 -102413 -6009 -1361 -23328 -99392 -99313
7340 -99313 -93517 -28050 -51530 6326 67540 -50003 -151351 -178154 -181286 -137304 -124202 -46618
7328 -46618 -45683 4716 -33533 -12009 24052 6901 -82860 -53884 -122665 -214578 -293029 -190784
7316 -190784 -103429 38580 23614 -79843 -92467 -24015 28002 -106458 -78193 -32805 -79207
7305 -79207 -23887 23047 18729 -31912 -85361 -38781 -71437 -145177 -233447 -263198 -142047 -111930
7293a11930J0799k1308l1894l341L6896m4329j25826K0649J39890R8505J7874
7282a4015j9801J9149J05084k8966l0207K6762k0750J1224L5588j03689K7457
7271G836J57540l8434j44160N3472K7229j36007m5010R9642j03946o9350M8157
7260a43031Q599L9442P2521n7228j20152p3113l8571J1269J07853J8682N7283
7249a16446J63923p75q5637l2959R2329p437r466R2512J4653j9033M8970K1858
7237A62492o166r6691r4317j0657J423O150J01333k0199l1338m9295j19114n5363
7225b11742M4059J02592l3363K9012n8635n631O4083P349N902L450q204M0238
7213b0890K9777l7161n7203P4556O4682j59915j12814L5425R4653J3882q1545
$$ plain form
7293 -111930 -101131 -122439 -154333 -157674 -120778 -165107 -290933 -270284 -130394 -31889 -14015
7282 -14015 -33816 -14667 90417 61451 31244 58006 37256 48480 84068 -19621 7836
7271 7836 165376 126942 -17218 36254 63483 -72524 -117534 -17892 -121838 -191188 -143031
7260 -143031 -134432 -94990 -22469 -79697 -199849 -272962 -311533 -300264 -192411 -173729 -116446
7249 -116446 47477 46702 -38935 -71894 20435 12998 3532 96044 110697 91664 140634 162492
7237 162492 156326 59635 -34682 -45339 -43916 -37766 63567 43368 12030 -37265 -156379 -211742
7225 -211742 -167683 -65091 -98454 -69442 -128077 -133708 -69625 -62276 -56374 -52924 -61128 -20890
7213 -20890 8887 -28274 -85477 -10921 53761 -106154 -218968 -183543 -88890 -75008 -156553
7202a56553o5971q9974j3005m759P6255P8935O3924M7901n5937m271L3325q3478
7190a73608n0380P6104M9352J17336m9967p8068L2059K4034j16760L6177K24031
7179I0310q5094m3146j41974m5166M6039O5861j6367l6096r3119J083Q5799J4122
7167a57748k5222O6501p1433N1568L6917k8081M5098o0275M9386o1471L6307Q1874
7155c6579r365m761N0907l4464o7412N8474J07515j32723o4728q7214K6713M2270
7143a51367K2484j8085r881J4754O1565N8619J8194m1966p8093n8248R7902N7591
7131b6531l8966j2158K5N0015j07652o8553J41377R3219l8866j11260n6164K9754
7119a45760q0881J85354Q5711Q653o1887R1212l9733j35313p527O3525n2999j30060
$$ plain form
7202 -156553 -222524 -312498 -325503 -330262 -254007 -175072 -111148 -63247 -119184 -123455 -90130 -173608
7190 -173608 -223988 -147884 -98532 18804 -31163 -109231 -77172 -53138 -169898 -133721 90310
7179 90310 5216 -37930 -179904 -225070 -179031 -113170 -129537 -165633 -258752 -257669 -171870 -157748
7167 -157748 -182970 -116469 -187902 -136334 -99417 -127498 -82400 -142675 -93289 -154760 -118453 -36579
7155 -36579 -45944 -50705 202 -34262 -101674 -43200 64315 -68408 -133136 -220350 -193637 -151367
7143 -151367 -128883 -146968 -156849 -142095 -80530 -21911 -3717 -45683 -123776 -182024 -84122 -26531
7131 -26531 -65497 -77655 -77630 -27615 -135267 -203820 -62443 30776 -8090 -119350 -175514 -145760
7119 -145760 -226641 -41287 44424 53077 -8810 82402 42669 -92644 -100171 -36646 -89645 -219705
7107b19705o8297N5579l4369J15376Q6143M1418L0017n2179N6509J6165p538O6326
7095H5445J14336j25894j14381k4302m9092j23344P59Q3393Q0878k1816Q865M8449
7083c6704L4844j05556J9113J78908J57102k0943m6970j61178j72463L6952M2732
7072g4163Q9583J04151R0763m2323j32086q4327M5767p1549p4252N3433M3420
7061e1583q9440j5593R8818L6370N3374j4028J5154m2067J1130j8243K6675O124
7049A6691k1133Q8057M4526k1960j24526o0801m7739Q1740l6244n2892L8034R959
7037h6288m6082J2024m4986N2767J41999N8173n342k6570l0723K6174N007o4300
7025h147q2704P494K8618k04O0826N1816j5714j79885j34860j50998J9989O7744
$$ plain form
7107 -219705 -288002 -232423 -266792 -151416 -65273 -23855 6162 -46017 10492 26657 19119 85445
7095 85445 199781 73887 -40494 -64796 -113888 -237232 -236473 -153080 -72202 -94018 -85153 -36704
7083 -36704 -1860 -107416 -88303 90605 247707 226764 179794 18616 -153847 -116895 -74163
7072 -74163 15420 119571 210334 168011 35925 -48402 -2635 -74184 -148436 -95003 -51583
7061 -51583 -141023 -156616 -57798 -21428 31946 17918 33072 -8995 2135 -16108 10567 16691
7049 16691 -4442 83615 128141 106181 -18345 -79146 -126885 -45145 -81389 -134281 -96247 -86288
7037 -86288 -132370 -120346 -165332 -112565 29434 87607 82265 55695 24972 51146 56153 -8147
7025 -8147 -90851 -83357 -54739 -54943 5883 57699 41985 -137900 -272760 -423758 -403769 -336025
7013c36025n7496J09426P9588J07902p2767j4888O9376K8352n0431k2818J32737
7002b7044M2435J6289J8512M880o4334j9042l6323m9994r0223p5077M5249J60188
6990g4484J9754j0779q313J32061R4701L6595j02782j15398j44295J15128Q5649
6979B7837k2976m8563O7119O9377l8499K3547q1485m7237k3462k0104K6573m1837
6967a09710k8260k694N8151K6293P3133k6063j01475n0032J26546L0050J21872
6956A17811l6526j63075M6267L7931j06532L6408O3242p8870K8767J00473j0258
6945C5638r5290R8513L8554j2067p5466J6436R0607k2177m1901m4407j7244J2410
6933a6394J2933L7396q7734p4933l2952k9050K5271L7981k6445r4402P22L9567
$$ plain form
7013 -336025 -393521 -284095 -204507 -96605 -169372 -184260 -114884 -86532 -136963 -159781 -27044
7002 -27044 15391 31680 50192 55072 -9262 -28304 -64627 -114621 -204844 -279921 -234672 -74484
6990 -74484 -54730 -65509 -73822 58239 152940 189535 86753 -28645 -172940 -57812 27837
6979 27837 4861 -43702 23417 92794 54295 77842 -3643 -50880 -74342 -94446 -67873 -109710
6967 -109710 -137970 -140664 -82513 -56220 16913 -9150 -110625 -160657 -34111 -4061 117811
6956 117811 81285 -81790 -35523 2408 -104124 -67716 -4474 -83344 -54577 45896 35638
6945 35638 -59652 38861 77415 65348 -10118 6318 96925 74748 32847 -11560 -28804 -16394
6933 -16394 -3461 33935 -53799 -128732 -161684 -190734 -165463 -127482 -153927 -248329 -247607 -208040
6921b08040L7599J39226Q0908K500o5195M8454j2449j6325o0655K3704J1905J2804
6909e564l7131j27827J6598P2136K9629K2016P2397q98q4303N779r0496q4581
6897b12245R1493J57249M0787j41415O5J66451p159k38720L8348P0594o5227m9151
6885a48930p4838K6690N2448J2469L3453p0074J13777P5149J2088j04332j49684
$$ plain form
6921 -208040 -170441 -31215 49693 52193 -13002 35452 23003 6678 -53977 -30273 -18368 -5564
6909 -5564 -42695 -170522 -153924 -81788 -52159 -30143 42254 41356 -42947 -37168 -127664 -212245
6897 -212245 -120752 36497 77284 -64131 -64066 102385 95226 -143494 -105146 -34552 -99779 -148930
6885 -148930 -223768 -197078 -144630 -132161 -98708 -168782 -55005 20144 32232 -72100 -221784
$$ [...]
##END NTUPLES=NMR SPECTRUM
##END=
