##TITLE=Analysis number 329784
Compound Code cc 30001
Project Code adrs
Chemist Name aci
##JCAMPDX= 6.0         $$ Bruker NMR JCAMP-DX V2.0
##DATA TYPE= NMR SPECTRUM
##DATA CLASS= NTUPLES
##ORIGIN= Bruker BioSpin GmbH
##OWNER= nmr
$$ XWIN-NMR		Version 3.5
$$ Thu Sep 27 11:36:18 2007 GMT Daylight Time (UT+1h)  MAYBRIDGE\nmr@NMR_250MHZ
##.OBSERVE FREQUENCY= 250.131544655141
##.OBSERVE NUCLEUS= ^1H
##.ACQUISITION MODE= SIMULTANEOUS (DQD)
##.ACQUISITION SCHEME= undefined
##.AVERAGES= 16
##.DIGITISER RES= 18
##SPECTROMETER/DATA SYSTEM= dpx250
##.PULSE SEQUENCE= zg30
##.SOLVENT NAME= DMSO
##.SHIFT REFERENCE= (INTERNAL, DMSO, 0, 16.522)
##AUDIT TRAIL= $$ (NUMBER, WHEN, WHO, WHERE, WHAT)
$$ ##TITLE= Audit trail, XWIN-NMR		Version 3.5
$$ ##JCAMPDX= 5.01
$$ ##ORIGIN= Bruker BioSpin GmbH
$$ ##OWNER= nmr
$$ C:\u/data/dgb/nmr/ADRS/2640/pdata/1/auditp.txt
$$ ##AUDIT TRAIL=  $$ (NUMBER, WHEN, WHO, WHERE, WHAT)
(   1,<2007-09-27 11:35:58.64 +100>,<MAYBRIDGE\nmr>,<NMR_250MHZ>,
      <created by zg, POWCHK disabled, PULCHK disabled
       configuration hash MD5:
       76 6E 9A 78 1E 09 19 81 EC 84 63 8F B0 6A 59 2D
       data hash MD5: 64K
       88 D7 2C 9F DB 0E 73 3B F7 E6 69 70 09 5E 6D 65>)
(   2,<2007-09-27 11:36:10.34 +100>,<MAYBRIDGE\nmr>,<NMR_250MHZ>,
      <Start of raw data processing
       ef LB = 0.3 FT_mod = 6 PKNL = 1 SI = 32K 
       data hash MD5: 32K
       2C 1E EC 5C 31 AA 83 39 CA D0 36 FB 73 B3 B0 DB>)
(   3,<2007-09-27 11:36:12.01 +100>,<MAYBRIDGE\nmr>,<NMR_250MHZ>,
      <apk 
       data hash MD5: 32K
       79 0E 62 67 B3 36 6D 1E C6 76 69 CA 52 9B 04 1B>)
(   4,<2007-09-27 11:36:12.81 +100>,<MAYBRIDGE\nmr>,<NMR_250MHZ>,
      <abs ABSG = 5 
       data hash MD5: 32K
       F1 73 A7 2B 64 06 FB 56 F0 35 B4 8B F3 6B B3 2C>)
$$ ##END=
$$ 
$$ hash MD5
$$ 4E 35 B8 6E BC F7 D8 F7 C0 FB 5B D2 67 74 E8 F4
##$RELAX= 
##$RELAX= 
##$RELAX= 
##$RELAX= 
##$RELAX= 
##$RELAX= 
##$RELAX= 
$$ Bruker specific parameters
$$ --------------------------
##$DU= <C:\u>
##$EXPNO= 2640
##$NAME= <ADRS>
##$PROCNO= 1
##$TYPE= <nmr>
##$USER= <dgb>
##$AMP= (0..31)
100 100 100 100 100 100 100 100 100 100 100 100 100 100 100 100 100 100 
100 100 100 100 100 100 100 100 100 100 100 100 100 100 
##$AQSEQ= 0
##$AQ_mod= 3
##$AUNM= <au_zg>
##$AUTOPOS= <1 >
##$BF1= 250.13
##$BF2= 250.13
##$BF3= 250.13
##$BF4= 250.13
##$BF5= 500.13
##$BF6= 500.13
##$BF7= 500.13
##$BF8= 500.13
##$BYTORDA= 1
##$CFDGTYP= 0
##$CFRGTYP= 5
##$CHEMSTR= <none>
##$CNST= (0..31)
1 1 145 1 1 1 1 1 1 1 1 1 1 1 1 1 1 1 1 1 1 1 1 1 1 1 1 1 1 1 1 1 
##$CPDPRG= <>
##$CPDPRG1= <>
##$CPDPRG2= <>
##$CPDPRG3= <>
##$CPDPRG4= <mlev>
##$CPDPRG5= <mlev>
##$CPDPRG6= <mlev>
##$CPDPRG7= <mlev>
##$CPDPRG8= <mlev>
##$CPDPRGB= <>
##$CPDPRGT= <>
##$D= (0..31)
0 1 0 0 0 0 0 0 0 0.06 0 0 0 0 0 0 0.0002 0 0 0 0 0 0 0 0 0 0 0 0 0 0 
0 
##$DATE= 1190889357
##$DBL= (0..7)
120 120 120 120 120 120 120 120 
##$DBP= (0..7)
150 150 150 150 150 150 150 150 
##$DBP07= 0
##$DBPNAM0= <>
##$DBPNAM1= <>
##$DBPNAM2= <>
##$DBPNAM3= <>
$$ [...]
##$SUBNAM7= <"">
##$SUBNAM8= <"">
##$SUBNAM9= <"">
##$SW= 20.6930455092707
##$SWIBOX= (0..15)
0 0 3 0 0 0 0 0 0 0 0 0 0 0 0 0 
##$SW_h= 5175.983436853
##$TD= 65536
##$TD0= 1
##$TE= 296.16
##$TE2= 300
##$TE3= 300
##$TEG= 300
##$TL= (0..7)
0 120 120 120 120 120 120 120 
##$TP= (0..7)
150 150 150 150 150 150 150 150 
##$TP07= 0
##$TPNAME0= <>
##$TPNAME1= <>
##$TPNAME2= <>
##$TPNAME3= <>
##$TPNAME4= <>
##$TPNAME5= <>
##$TPNAME6= <>
##$TPNAME7= <>
##$TPOAL= (0..7)
0.5 0.5 0.5 0.5 0.5 0.5 0.5 0.5 
##$TPOFFS= (0..7)
0 0 0 0 0 0 0 0 
##$TUNHIN= 0
##$TUNHOUT= 0
##$TUNXOUT= 0
##$USERA1= <user>
##$USERA2= <user>
##$USERA3= <user>
##$USERA4= <user>
##$USERA5= <user>
##$V9= 5
##$VALIST= <valist>
##$VCLIST= <CCCCCCCCCCCCCCC>
##$VD= 0
##$VDLIST= <DDDDDDDDDDDDDDD>
##$VPLIST= <PPPPPPPPPPPPPPP>
##$VTLIST= <TTTTTTTTTTTTTTT>
##$WBST= 1024
##$WBSW= 4
##$XGAIN= (0..3)
0 0 0 0 
##$XL= 0
##$YL= 0
##$YMAX_a= 279385
##$YMIN_a= -360590
##$ZGOPTNS= <>
##$ZL1= 120
##$ZL2= 120
##$ZL3= 120
##$ZL4= 120
##$ABSF1= 16.522
##$ABSF2= -4.171173
##$ABSG= 5
##$ABSL= 3
##$ALPHA= 0
##$AQORDER= 0
##$ASSFAC= 0
##$ASSFACI= 0
##$ASSFACX= 0
##$ASSWID= 0
##$AUNMP= <proc_1d>
##$AZFE= 0.1
##$AZFW= 0.1
##$BCFW= 0
##$BC_mod= 0
##$BYTORDP= 0
##$COROFFS= 0
##$CY= 12.5
##$DATMOD= 1
##$DC= 0
##$DFILT= <>
##$DTYPP= 0
##$F1P= 14.0000005364418
##$F2P= -0.99999901652339
##$FCOR= 0.5
##$FTSIZE= 32768
##$FT_mod= 6
##$GAMMA= 0
##$GB= 0
##$INTBC= 1
##$INTSCL= 1
##$ISEN= 128
##$LB= 0.3
##$LEV0= 0
##$LPBIN= 0
##$MAXI= 10000
##$MC2= 0
##$MEAN= 0
##$ME_mod= 0
##$MI= 0
##$NCOEF= 0
##$NC_proc= -3
##$NLEV= 6
##$NOISF1= 0
##$NOISF2= 0
##$NSP= 0
##$NTH_PI= 0
##$NZP= 0
##$OFFSET= 16.522
##$PC= 1
##$PHC0= 151.6995
##$PHC1= 11.40564
##$PH_mod= 1
##$PKNL= yes
##$PPARMOD= 0
##$PSCAL= 4
##$PSIGN= 0
##$REVERSE= no
##$SF= 250.13
##$SI= 32768
##$SIGF1= 0
##$SIGF2= 0
##$SINO= 400
##$SIOLD= 32768
##$SREGLST= <1H.DMSO>
##$SSB= 0
##$STSI= 32768
##$STSR= 0
##$SW_p= 5175.98343685301
##$SYMM= 0
##$S_DEV= 0
##$TDeff= 65536
##$TDoff= 0
##$TI= <Analysis number 999999
Compound Code 99
Book Reference 9
Project Code 9>
##$TILT= no
##$TM1= 0
##$TM2= 0
##$TOPLEV= 0
##$USERP1= <user>
##$USERP2= <user>
##$USERP3= <user>
##$USERP4= <user>
##$USERP5= <user>
##$WDW= 1
##$XDIM= 32768
##$YMAX_p= 335089537
##$YMIN_p= -259076
$$ End of Bruker specific parameters
$$ ---------------------------------
##NTUPLES= NMR SPECTRUM
##VAR_NAME=  FREQUENCY,     SPECTRUM/REAL,   SPECTRUM/IMAG
##SYMBOL=    X,             R,               I
##VAR_TYPE=  INDEPENDENT,   DEPENDENT,       DEPENDENT
##VAR_FORM=  AFFN,          ASDF,            ASDF
##VAR_DIM=   32768,         32768,           32768
##UNITS=     HZ,            ARBITRARY UNITS, ARBITRARY UNITS
##FACTOR=    0.157963299565203, 1,           1
##FIRST=     4132.6476996994, 0,             0
##LAST=      -1043.33573715361, 0,           0
##MIN=       -1043.33573715361, -259076,     0
##MAX=       4132.6476996994, 335089537,     0
$$ Real data points
##PAGE= N=1
##DATA TABLE= (X++(R..R)), XYDATA
$$ [...]
14554a7766j878J8424J3196K856P219P943q619K4533k831k0278l2510K3432K5251
$$ -17766 -19644 -1220 11976 14832 22051 29994 21375 45908 43077 22799 -9711 13721 38972
14541C8972k2384q223k5954M547Q494J2805n580J5136L7900k9415m3026k7963
$$ 38972 16588 8365 -17589 -13042 -4548 8257 2677 17813 55713 26298 -16728 -44691
14529d4691Q382R212r584J387K321N0771K5105K0245k4015J2283k0317j2380l3268
$$ -44691 -36309 -27097 -36681 -35294 -32973 17798 42903 63148 39133 51416 31099 18719 -14549
14516a4549j4603j167k3528J1430L9130J0328K8977K2233M881p4049k8244L7809
$$ -14549 -29152 -30319 -53847 -42417 -3287 7041 36018 58251 63132 -10917 -39161 -1352
14504a352l108J1561j3376n591L9286J9818J3386k4398l5550n743L0468J8112
$$ -1352 -4460 7101 -6275 -11866 27420 47238 60624 36226 676 -5067 25401 43513
14492D3513K239r596k8873L1314J7247l4573j508J807m16k571L5831J4400j2493
$$ 43513 45752 36156 7283 38597 55844 21271 19763 21570 21154 18583 54414 68814 56321
14479E6321l732K4876n451m4175j0696r381n771K5384r655J2001N017o9708l0260
$$ 56321 52589 77465 72014 27839 17143 7762 1991 27375 17720 29721 34738 -34970 -65230
14466f5230J3154M420M5201J4506o526k3680j4388K1800J8228N872j6948Q954
$$ -65230 -52076 -47656 -2455 12051 5525 -18155 -32543 -10743 7485 13357 -3591 5363
14454E363O880L7613l884K9L5389m1254n7321Q445J6912j1578R862q741J5729
$$ 5363 12243 49856 45972 46001 81390 40136 -17185 -8740 8172 -3406 6456 -2285 13444
14441A3444l654r888N727K2227M0911K81J3143K2479K311k1828j4944q517J0372
$$ 13444 9790 -98 5629 27856 68767 69048 82191 104670 106981 85153 70209 61692 72064
14428G2064k6801j5146K4404L3596Q115k9596m0466j3100k0978N211L6374K6096
$$ 72064 45263 30117 54521 88117 96232 66636 26170 13070 -7908 -2697 33677 59773
14416E9773k4678j4595L4831j6758r848k0597o399n457l529k163j1093q200n094
$$ 59773 35095 20500 55331 38573 28725 8128 1729 -3728 -7257 -9420 -20513 -28713 -33807
14403c3807J6255K2333K9728k858k8603O338J6608K4406n4019j7043M1756K5627
$$ -33807 -17552 4781 34509 31651 3048 9386 25994 50400 -3619 -20662 21094 46721
14391D6721O1691j0285j4501m5157o7745m1213K5919J1832r767j3537k874j0920
$$ 46721 108412 98127 83626 38469 -29276 -70489 -44570 -32738 -42505 -56042 -58916 -69836
14379f9836M5300P0267l4342L38J1546j6712J2973J2605j1386k1536J2518N3722
$$ -69836 -24536 45731 11389 11727 23273 6561 19534 32139 20753 -783 11735 65457
14367F5457l4652k5959r095R472m9431J6062K7459L6647J9261M376q144k4219
$$ 65457 30805 4846 -4249 5223 -44208 -28146 -687 35960 55221 59597 51453 27234
14355B7234j1594L6175N293J5252n366j9824J0443l1220m277m452J7906K5466
$$ 27234 15640 51815 57108 72360 66994 47170 57613 26393 22116 17664 35570 61036
14343F1036k4394l2668j218N800K6833j6224m9154P472J3635j1016J6568M412
$$ 61036 36642 3974 2756 8556 35389 19165 -29989 -22517 -8882 -19898 -3330 1082
14331A082L4112Q188j0113K183J9000K170L0077N614N233J386k3543j8800M807
$$ 1082 35194 43382 33269 35452 54452 56622 86699 92313 97546 98932 75389 56589 61396
14318F1396J619m4366k7697j3950K306Q144O950K4889K6698J1453K5124k3450
$$ 61396 63015 18649 -9048 -22998 -20692 -12548 -5598 19291 45989 57442 82566 59116
14306E9116m5975k2322m6690L575O3942L2443K7923p055K873O118O583M85k4218
$$ 59116 13141 -9181 -55871 -52296 11646 44089 72012 64957 67830 73948 80531 81016 56798
14293E6798p5065r683J8402K0765K7862m42q812j3051l1869N901k8030J4709K4759
$$ 56798 -18267 -27950 -9548 11217 39079 38637 29825 16774 -15095 -9194 -37224 -22515 2244
14280B244O943K6008L4239l8288k9716m4365Q869L8100J9264M4242N640m7141
$$ 2244 9187 35195 69434 31146 1430 -42935 -34066 4034 23298 67540 73180 26039
14268B6039j2476p742J4869P978Q637K2666r383m5690k316j6649O145k4357K3723
$$ 26039 13563 5821 20690 28668 37305 59971 50588 4898 2582 -14067 -7922 -32279 -8556
14255h556L2640j4887j1142J9197j6446M790m195n48N541K486l3068J9647L4353
$$ -8556 24084 9197 -1945 17252 806 5596 1401 853 6394 8880 -24188 -4541 29812
14242B9812j9263J2306j1346j9546K7652q370J6506Q748p425o695n3584n061l769
$$ 29812 10549 22855 11509 -8037 19615 11245 27751 36499 29074 22379 -31205 -36266 -40035
14229d0035K7490P1603L3851L1893q205n8860k1656k5965Q944o462m678l1523
$$ -40035 -12545 59058 92909 124802 116597 57737 36081 10116 19060 12598 7920 -23603
14217b3603n833J7697Q505K2695Q335k6455j5346k5267j2826J3781l146J8493
$$ -23603 -29436 -11739 -3234 19461 27796 1341 -14005 -39272 -52098 -38317 -41463 -22970
14205b2970N8802J1618n1232J5089K371l8149k34n230M1587r382l248l014l4855
$$ -22970 35832 47450 -3782 11307 13678 -24471 -24705 -29935 11652 2270 -978 -3992 -38847
14192c8847j6119M706K896L3458k2438R050N272p916n893N875K4708N10j2938
$$ -38847 -54966 -50260 -47364 -13906 -36344 -27294 -22022 -29938 -35831 -29956 -5248 -4738 -17676
14179a7676J4909J1466K9449j5394q596J0921k1800l7472K2477K8228K7806R553
$$ -17676 -2767 8699 38148 22754 14158 25079 3279 -34193 -11716 16512 44318 53871
14167E3871q619j2703K3536j944m5301j1773l5667o645M932K8176k558J5355q220
$$ 53871 45252 32549 56085 54141 8840 -2933 -38600 -45245 -40313 -12137 -14695 660 -7560
14154g560N932J7403J6796K2858R971j6220k6987j8868J228q853j8368j2231K6797
$$ -7560 -1628 15775 32571 55429 65400 49180 22193 3325 4553 -4300 -22668 -34899 -8102
14141h102P1313L0302r714p1107R313K2347m3524j3896j0132Q042N4017q4N921
$$ -8102 63211 93513 83799 12692 22005 44352 828 -13068 -23200 -15158 38859 38775 44696
14128D4696j6109Q91j8531l6527J8228L5747L3240l5754Q519J32K5752l5463r849
$$ 44696 28587 29478 10947 -25580 -7352 28395 61635 25881 34400 34532 60284 24821 14972
14115A4972J2353j3812l7322N925j4585J8746J8638N9733j0331k4193j847o2636
$$ 14972 27325 13513 -23809 -17884 -32469 -13723 4915 64648 54317 30124 28277 -34359
14103c4359l9864J0505L7689K8311j6395l656P025R973J9596J4328l798m5115
$$ -34359 -74223 -63718 -26029 2282 -14113 -17769 -10744 -771 18825 33153 29355 -15760
14091a5760l1361N6519K6804l1485Q993K0233k4797L2350K0393k1412N656N1445
$$ -15760 -47121 9398 36202 4717 13710 33943 9146 41496 61889 40477 46133 97578
14079I7578o3758o8528l7031j9655K3448K236j0208K8866K7300M6165R293J1576
$$ 97578 33820 -34708 -71739 -91394 -67946 -65710 -75918 -47052 -19752 26413 35706 47282
14067D7282K6233k0307p111J3085J0402j6354k3768n474l2414m9759M730M5939
$$ 47282 73515 53208 46097 59182 69584 53230 29462 23988 -8426 -58185 -53455 -7516
14055g516j124k471J0366R521M186j1594K244L7683J2629l0546p928K7347l0078
$$ -7516 -8640 -11111 -745 8776 12962 1368 3612 41295 53924 23378 15450 42797 12719
14042A2719l3352n7788L4237P3015L7466K0891j0212m0256m3019m7283J7174K2275
$$ 12719 -20633 -78421 -44184 28831 66297 87188 76976 36720 -6299 -53582 -36408 -14133
14030a4133J7066j5232l5386j5758K6905L1206K5218l30J3505j641L5515J9542
$$ -14133 2933 -12299 -47685 -63443 -36538 -5332 19886 19556 33061 31420 66935 86477
14018H6477l7633K0168J4031j8143j8113l0407j2164K378j9722J312k3833j3996
$$ 86477 48844 69012 83043 64900 46787 16380 4216 6594 -13128 -11816 -35649 -49645
14006d9645q420K8402k8851R716K105J3804N8210J8164l8436N070n378K7238K4318
$$ -49645 -58065 -29663 -58514 -48798 -46693 -32889 25321 43485 5049 10119 4741 31979 56297
13993E6297j762m8278k0279n910J407K6127L306J0920J5803k4648J9497j5030
$$ 56297 54535 6257 -14022 -19932 -18525 7602 10908 21828 37631 12983 32480 17450
13981A7450k0002k6161j9894q636K7597M2583J0859J9043K5666n8402r102N6171
$$ 17450 -2552 -28713 -48607 -57243 -29646 12937 23796 42839 68505 10103 1001 57172
13969E7172P386J0122J5212k5311j5554j2689J4135o151J0161K3032n903M219
$$ 57172 64558 74680 89892 64581 49027 36338 50473 44322 54483 77515 71612 75831
13957G5831J0183k0449j8459r232j1035N2987K834l6405L1218j6942l5532j8271
$$ 75831 86014 65565 47106 37874 26839 79826 82660 46255 77473 60531 24999 6728
13945F728k6685K8808M3987N4959L4621k6188m8548j7797J7234j4033n4416j5550
$$ 6728 -19957 8851 52838 107797 142418 116230 67682 49885 67119 53086 -1330 -16880
13933a6880L890k297R856j3199P131j371J7022K426R37L716k4987j5195k7068
$$ -16880 -12990 -15287 -5431 -18630 -11499 -12870 4152 6578 7515 11231 -13756 -28951 -56019
13920e6019m400J7313N7372k3436L8256O900m2394K8152k8690j7969K2321j2177
$$ -56019 -60419 -43106 14266 -9170 29086 35986 -6408 21744 -6946 -24915 -2594 -14771
13908a4771J5956o143J6458J6798k3243K4512K0028l2061J0146o623j2391N734
$$ -14771 1185 -4958 11500 28298 5055 29567 49595 17534 27680 21057 8666 14400
13896A4400r088J6724l0824o3895K6258J9922j6603N2019L999K3292l9814j893
$$ 14400 5312 22036 -8788 -72683 -46425 -26503 -43106 8913 12912 36204 -3610 -5503
13884e503O773J3945J9557j9860l0495j2774L1842L356r496q359J423J4874N021
$$ -5503 1270 15215 34772 14912 -15583 -28357 3485 6841 -2655 -11014 -9591 5283 10304
13871A0304L7350M2839K7200m4496m2630M322j3382J4933J6712J7938N0576j8536
$$ 10304 47654 90493 117693 73197 30567 34889 21507 36440 53152 71090 121666 103130
13859A03130j5978j8341k0569l6296j6358J1830q613O967P516K1271O1817R829
$$ 103130 87152 68811 48242 11946 -4412 7418 -1195 5772 13288 34559 96376 106205
13847A06205l2290l0230J2596j201J7187l4142l5165k261J9407J6881K5512j7655
$$ 106205 73915 43685 56281 55080 72267 38125 2960 699 20106 36987 62499 44844
13835D4844l252L1802O846o62m9361K3479k1046J0134R95m2791j3774l470O9411
$$ 44844 41592 73394 80240 79578 30217 53696 32650 42784 43779 988 -12786 -16256 53155
13822E3155L2711J4171k1125m7193k9820j8213K1295J8967L1193r010k8181J4055
$$ 53155 85866 100037 78912 31719 1899 -16314 4981 23948 55141 46131 17950 32005
13810C2005L5593K3847J1768q2601n8552R753j2210K1525J1504P1158L3497j8412
$$ 32005 67598 91445 103213 20612 -37940 -28187 -40397 -18872 -7368 63790 97287 78875
13798G8875o331r332k0650j9854J0143k2916j2077j2792K13k731L1983N140k0231
$$ 78875 72544 63212 42562 22708 32851 9935 -2142 -14934 -14721 -17452 14531 19671 -560
13785e60J5505M8220L1625n325k8304l4732K3456J2382m992R280Q082k6768o446
$$ -560 14945 63165 94790 89465 61161 26429 49885 62267 57275 66555 74637 47869 41423
13772D1423o71L2369O715N417J1398k8230k9972m2674l7970j2751j5386M365L3555
$$ 41423 40752 73121 79836 85253 96651 68421 38449 -4225 -42195 -54946 -70332 -65967 -32412
13759c2412L1120o973K6779M0755j8470m951j2466l839J7390N528k8822j5407
$$ -32412 -1292 -8265 18514 59269 40799 35848 23382 19543 36933 42461 13639 -1768
13747a768J3080L3332J4534j2469j6656k3206J9216L6259j9215k1904K9905r300
$$ -1768 11312 44644 59178 46709 30053 6847 26063 62322 43107 21203 51108 41808
13735D1808M5921Q054o0566j0956K4935J405j0775J8489P302j6244K6007m7087
$$ 41808 87729 95783 35217 24261 49196 50601 39826 58315 65617 49373 75380 28293
13723B8293k8344k2796R26M0206r773j0838L8243r696n604l2222k7026J6834N9505
$$ 28293 -51 -22847 -21921 18285 8512 -2326 35917 26221 20617 -11605 -38631 -21797 37708
13710C7708L4102M0557o561l7200J4093q840k2027J3869L4717L4604k3228r792
$$ 37708 71810 112367 105806 68606 82699 73859 51832 65701 100418 135022 111794 102002
13698A02002R220k0870l7150o987N684L1784J9845k4179J3752J7384k8066L82
$$ 102002 111222 90352 53202 46215 51899 83683 103528 79349 93101 110485 82419 82801
13686H2801l4291o9323M2213K5730l7668O512J0554R563k2282J5813J8002P481
$$ 82801 48510 -20813 21400 47130 9462 15974 26528 36091 13809 29622 47624 55105
13674E5105J9145L8957l8691m0744k1919k7926L8061J1374K6494J9484N992m3267
$$ 55105 74250 113207 74516 33772 11853 -16073 21988 33362 59856 79340 85332 42065
13662D2065k2455N2602J587m8195J2336o415K3190K5094O349p391j4776K7017
$$ 42065 19610 72212 73799 25604 37940 31525 54715 79809 86158 78767 63991 91008
13650I1008O388q864o759N429J0440j6434k366l4009l8780K3932O8346k2140l8077
$$ 91008 97396 88532 81773 87202 97642 81208 78842 44833 6053 29985 98331 76191 38114
13637C8114M239L2846j7840O707J0216n213m9340j7999M9375K5321J0185L853
$$ 38114 42353 75199 57359 64066 74282 69069 19729 1730 51105 76426 86611 90464
13625I0464l8298l9827k3011J8626K3012k3810j7518J1379J8836K6039N5537j1264
$$ 90464 52166 12339 -10672 7954 30966 7156 -10362 1017 19853 45892 101429 90165
13613I0165k4034J1750j5038k0647J4570p278P654J7530j7135j5547m663n6220
$$ 90165 66131 77881 62843 42196 56766 49488 57142 74672 57537 41990 37327 -18893
13601a8893L2877J1465p243L167k449j7616J947m798K4431N4501R924j5039k9690
$$ -18893 13984 25449 18206 21373 18924 1308 3255 -1543 22888 77389 87313 72274 42584
13588D2584j9431o11J2771K471K1638r971J7600q292J1321j7883j5910J2005K947
$$ 42584 23153 22542 35313 37784 59422 49451 67051 58759 70080 52197 36287 48292 51239
13575E1239k8519L7253N9101K746r328k141l4881M12K038k8446L996m3385l7440
$$ 51239 22720 59973 119074 121820 112492 110351 75470 75882 77920 49474 53470 10085 -27355
13562b7355N790M8181L699J0347L117M348j0688J8846m401j6833K6003J8559J0547
$$ -27355 -21565 26616 30315 40662 43779 48127 37439 56285 51884 35051 61054 79613 90160
13549I0160j9299K4588r155j868J2470J5513O335k7215o760R960j0279l234p987
$$ 90160 70861 95449 86294 84426 96896 112409 118744 91529 84769 94729 84450 81216 73229
13536G3229j6813M8889K072n6435l2460k7909l481O3588L5591P722J669j8696
$$ 73229 56416 105305 107377 50942 18482 -9427 -12908 50680 86271 93993 95662 76966
13524G6966J4284k3155l1927l6040L316J7294j8811L3487N0299m2257m3691N4384
$$ 76966 91250 68095 36168 128 3444 20738 1927 35414 85713 43456 -235 54149
13512E4149p290m9754L848j2853o257P668O845K7396K7867L0559J2346J6824K6396
$$ 54149 46859 -2895 953 -11900 -18157 -10489 -3644 23752 51619 82178 94524 111348 137744
13499A37744l1065n4699J1923q519K5491N8163N783l2711Q908J7732j2369n7778
$$ 137744 106679 51980 63903 55384 80875 139038 144821 112110 121018 138750 126381 68603
13487F8603j077L9828j7389l8340j2250K4982L8779j654o155k7910k0331k6679
$$ 68603 67526 107354 89965 51625 39375 64357 103136 101482 95327 67417 47086 20407
13475B0407J8045K5595j858k2521Q815L4509J446m456L8528j2872m6172q432k3301
$$ 20407 38452 64047 62189 39668 48483 82992 84438 79982 118510 105638 59466 51034 27733
13462B7733k9032q259M7049K2791k0653l0259k4053K5603K9968J3742L838m2471
$$ 27733 -1299 -9558 37491 60282 39629 9370 -14683 10920 40888 54630 58468 15997
13450A5997l0680L7552K2626o93p512k8522l2269J7547M3154K2187K038O385o944
$$ 15997 -14683 22869 45495 44802 37290 8768 -23501 -5954 37200 59387 61425 67810 60866
13437F0866j1629J1851M6140j9728n2638m422J3959l2703L1059M1657j0188J25
$$ 60866 49237 61088 107228 87500 34862 30440 44399 11696 42755 84412 74224 74349
13425G4349j3761n2608k8024O5869K7603l5772l0424M1302l313J1512q594j7297
$$ 74349 60588 7980 -20044 45825 73428 37656 7232 48534 45221 56733 48139 30842
13413C0842L1969p490j7625L3407J0350L0273K6594q421K5581j1826p0888k9344
$$ 30842 62811 55321 37696 71103 81453 111726 138320 129899 155480 143654 72766 43422
13401D3422K1844k0280k6293O973O2309L1879l4411N505k875Q879J2352j8716
$$ 43422 65266 44986 18693 25666 87975 119854 85443 90948 88073 96952 109304 90588
13389I0588p90m613J0638N0365n1503l2324j9582k6670J0156K6660J4076Q035
$$ 90588 89798 85185 95823 146188 94685 62361 42779 16109 26265 52925 67001 75036
13377G5036j0789M1172l3636n5055k7428M4860J7448O604J2768O353l767k3537
$$ 75036 64247 105419 71783 16728 -10700 34160 51608 58212 70980 77333 73566 50029
13365E0029l0053K5739K667L9408M124j0529K297J5410K1928j9041Q287K74k1246
$$ 50029 19976 45715 48382 87790 91914 81385 83682 99092 121020 101979 110266 110540 89294
13352H9294K699m3226k4432q725L6538J9158J086n5835l369R187j2053K5984P3932
$$ 89294 91993 48767 24335 15610 52148 71306 72392 16557 13188 22375 10322 36306 110238
13339A10238o748m0054k6917j6277J9868K1161J3432j3137k3404m326M2749j1606
$$ 110238 103490 63436 36519 20242 40110 61271 74703 61566 38162 33836 76585 64979
13327F4979n321p561Q827q262J6614J3804j5961L6506K1945j8288J0769J2821
$$ 64979 59658 52097 60924 52662 69276 83080 67119 103625 125570 107282 118051 130872
13315A30872m4691J5553J1803l4726m536J0086j6956J4756o274k6511l2230L5212
$$ 130872 86181 101734 113537 78811 74275 84361 67405 82161 75887 49376 17146 52358
13303E2358J6383L3342L5166n166J1032K3432J8170m4220l9752J2870n1992n1269
$$ 52358 68741 102083 137249 132083 143115 166547 184717 140497 100745 113615 61623 10354
13291A0354j0607P3692J2194K167J900k563n333P476n794K685K3716j6962j4736
$$ 10354 -253 73439 85633 87800 89700 87137 81804 89280 83486 86171 109887 92925 78189
13278G8189l640j1314j2401m501K8574J960l1627O968j1500L2013R282k1394J0826
$$ 78189 74549 63235 50834 46333 74907 76867 45240 52208 40708 72721 82003 60609 71435
13265G1435k1071k8691L5015P097j418j3561k2551N487K7355M242J6832K0277
$$ 71435 50364 21673 56688 63785 62367 48806 26255 31742 59097 63339 80171 100448
13253A00448L2744M625k6585k439j5671q710l6177J814J4602j9830M091K1116
$$ 100448 133192 137817 111232 108793 93122 84412 48235 50049 64651 44821 48912 70028
13241G0028J7969O2706J2999o2974j9968K3094K77M600O939M2j2610J4776k9649
$$ 70028 87997 150703 163702 100728 80760 103854 104131 108731 115670 115712 103102 117878 88229
13228H8229k8145K6869m0591l7243R177P1443K5223M658l2371q229P9406l782
$$ 88229 60084 86953 46362 9119 18296 89739 114962 119620 87249 79020 158426 154644
13216A54644k0656M8552j2924j1520j7317k2122l8591m1828R280K0437J5095l865
$$ 154644 133988 182540 169616 158096 140779 118657 80066 38238 47518 67955 83050 79185
13204G9185J0716J8634j6106m17j3202j6558M221q160J9854L9476J0850M338j9804
$$ 79185 89901 108535 92429 92012 78810 62252 66473 58313 78167 117643 128493 132831 113027
13191A13027K63J4910m8823q38M760j3668J3004L463j0331M8898J9139P551K1662
$$ 113027 113290 128200 79377 78539 83299 69631 82635 86098 75767 124665 143804 151355 173017
13178A73017j6099m2991l7358k3859n529O7818K8924j1322n225o754l9327J869
$$ 173017 156918 113927 76569 52710 47181 114999 143923 132601 127376 120622 81295 83164
13166H3164L1346k1979k1367j2564j1873J9043q452k7405J8051L4566M091J8493
$$ 83164 114510 92531 71164 58600 46727 65770 57318 29913 47964 82530 86621 105114
13154A05114m045J6560r562N948K1899l447m0634L394J560Q18j5286k2459l7232
$$ 105114 101069 117629 108067 114015 135914 132467 91833 95227 96787 97605 82319 59860 22628
13141B2628j7896L8658J3252o326L3021K5600J2498k6295j8360k4831k852J2143
$$ 22628 4732 43390 56642 50316 83337 108937 121435 95140 76780 51949 49097 61240
13129F1240K1777p551J7591J2650k6229k7496n362L5707J9156K343m0873p963
$$ 61240 83017 75466 93057 105707 79478 51982 46620 82327 101483 103826 62953 54990
13117E4990l6028L1270j3522j199K8352J726J6297O826L3834K3820N409n653l2418
$$ 54990 18962 50232 36710 35511 63863 65589 81886 88712 122546 146366 151775 146122 113704
13104A13704j8239K1911N069l3096j1881L4551K2294k2736P429L9142q787M596
$$ 113704 95465 117376 122445 89349 77468 112019 134313 111577 119006 158148 149361 153957
13092A53957L813m4190n837L3601J3621j0927k1069j0664K1446j4145J2345j9973
$$ 153957 157770 113580 107743 141344 154965 144038 122969 112305 133751 119606 131951 111978
13080A11978k808j2140k3120J5991J5286J2179j6243q750L942j8947j233L4123
$$ 111978 109170 97030 73910 89901 105187 117366 101123 92373 96315 77368 76135 110258
13068A10258n15Q701q30K0013j5598m3151k6687N663J410j0457K9831J9302l332
$$ 110258 109743 118444 117614 137627 122029 78878 52191 57854 59264 48807 78638 97940 94608
13055I4608K6144J8630L126P632J7499k2290j6662j3942J3054K219k7982L464
$$ 94608 120752 139382 142508 150140 167639 145349 128687 114745 127799 130018 102036 105500
13043A05500m14l0052n464L1025P629k7470L4543K6730o721o944m4993n099O569
$$ 105500 105086 75034 69570 100595 108224 80754 115297 142027 135306 128362 83369 78270 84839
13030H4839M6047P418p929O864J6843j0534j2802M023K4752j7823m7203Q117M3967
$$ 84839 130886 138304 130375 137239 154082 143548 130746 134769 159521 141698 94495 102612 146579
13017A46579J3583k677n0243k3450J9548J4338J935j7086J5767m4N490l836m5909
$$ 146579 160162 157485 107242 83792 103340 117678 119613 102527 118294 118250 123740 119904 73995
13004G3995k4938N4572j1615j4431J8936K0805M475J800l5022l1719R803J3688
$$ 73995 49057 103629 92014 77583 96519 117324 121799 123599 88577 56858 66661 80349
12992H0349J8636r000K8463k0742K412P118L9615n0707j5599L9499L1747J067
$$ 80349 98985 89985 118448 97706 100118 107236 146851 96144 80545 120044 151791 152858
12980A52858r964k7882j8572M1777k931m5285O128j28K446L2047k1852j5592L0747
$$ 152858 142894 115012 96440 138217 135286 90001 96129 96001 98447 130494 108642 93050 123797
12967A23797J1771k8071k894N927J5013K4651l057m028K7833L812K0066l3827
$$ 123797 135568 107497 104603 110530 125543 150194 147137 143109 170942 174754 194820 160993
12955A60993k504N638k4685m0796M001K010J6016j3235j9619M8390K9918J3175
$$ 160993 158489 164127 139442 98646 102647 104657 120673 107438 87819 136209 166127 179302
12943A79302k3324n5487j2955Q403M5465j398j4059M6413K4043o506j1530j5542
$$ 179302 155978 100491 87536 95939 141404 140006 125947 172360 196403 189897 178367 162825
12931A62825J2626p241j2422k5517j5285L0377J8861p962l7109r531L0498L2799
$$ 162825 175451 168210 155788 130271 114986 145363 164224 156262 119153 109622 140120 172919
12919A72919M199k6346j8376L597J9650j2490j9652p904j5331J0274K636J8363
$$ 172919 177118 150772 132396 135993 155643 143153 123501 115597 100266 110540 113176 131539
12907A31539P6050p01q274k3102j5388J0366L836j5741K1836J8891L9579k782
$$ 131539 207589 206888 198614 175512 160124 170490 174326 158585 180421 199312 238891 236109
12895B36109m5339J4662k0288j3264p082k1795j8674l7852o871J6062K5166L9469
$$ 236109 190770 205432 185144 171880 164798 143003 124329 86477 79606 95668 120834 160303
12883A60303J1462K5318K4718r509m236k7378j1176j7976J3440M6474j8504j1398
$$ 160303 171765 197083 221801 212292 208056 180678 169502 151526 164966 211440 192936 181538
12871A81538K8912J8130n49n3836L6900L7628j4852N369k2249m7040r088K3105
$$ 181538 210450 228580 228031 174195 211095 248723 233871 239240 216991 169951 160863 183968
12859A83968J7445k2673J277N874r938j3600L2840J0052l8395Q279K1748K6808
$$ 183968 201413 178740 180017 185891 175953 162353 195193 205245 166850 175129 196877 223685
12847B23685K1523J8774n02n7154m3388n360K4125L877J5572k4417j8459N4571
$$ 223685 245208 263982 263480 206326 162938 157578 181703 185580 201152 176735 158276 212847
12835B12847K9779q720k7990j0246J0482n9113q509J6844k0780J0378j0544p361
$$ 212847 242626 233906 205916 195670 206152 147039 138530 155374 134594 144972 134428 127067
12823A27067J261j5086K2158L8731M0631j048q312k3469K4875J2051n200L831
$$ 127067 128328 113242 135400 174131 214762 213714 205402 181933 206808 218859 213659 217490
12811B17490k4354J5484r000r147l1427l4078p902j7190m3839j8475L5809O993
$$ 217490 193136 208620 199620 190473 159046 124968 117066 99876 56037 37562 73371 80364
12799H0364M6637K7285J4966p523J709J2994k3741K2933k5723k3161Q505L7744
$$ 80364 127001 154286 169252 161729 163438 176432 152691 175624 149901 126740 135245 172989
12787A72989J459O424K5220l9512J0531K697K3798m2072k5385r329N3756K353
$$ 172989 174448 180872 206092 166580 177111 179808 203606 161534 136149 126820 180576 182929
12775A82929Q038J8012J5975m8699m1028M2327J3923J3429l794k3138j6832m955
$$ 182929 190967 208979 224954 176255 135227 177554 191477 204906 201112 177974 161142 156187
12763A56187l2884k006P703J2722M0886J8681K1402N5673n851m5494P205n5800
$$ 156187 123303 121297 129000 141722 182608 201289 222691 278364 272513 227019 234224 178424
12751A78424Q229O0395j0398K69j2414n0488L690J4353o099o519K2015r262m2383
$$ 178424 186653 247048 236650 236919 224505 174017 177707 192060 185961 179442 201457 192195 149812
12738A49812l5380J9489j9943J106K8183K7255j6050k5441m4885j0267M7088N6174
$$ 149812 114432 133921 113978 115084 143267 170522 154472 129031 84146 73879 120967 177141
12726A77141J5745P867L0215k1725q824O5096J2257n6577m9063k5706J7989j1697
$$ 177141 192886 200753 230968 209243 200419 265515 277772 221195 172132 146426 164415 152718
12714A52718j213J3553o334k8400J4358L104r653K4701N0690j1794l734K1615
$$ 152718 151505 165058 158724 130324 144682 147786 138133 162834 213524 201730 197996 219611
12702B19611j6128j002j2870J0544J5007j2860J9459M8337q040j5617k8253j5786
$$ 219611 203483 202481 189611 200155 215162 202302 221761 270098 262058 246441 218188 202402
12690B02402j4248L743L5609Q999j9501m1782M9583M1059k6780j8675L3034K3730
$$ 202402 188154 191897 227506 236505 217004 175222 224805 265864 239084 220409 253443 277173
12678B77173l293j02037k4702o334J9795N6991J3950K0650l627k5658n1374K5227
$$ 277173 273880 171843 147141 140807 160602 217593 231543 252193 248566 222908 171534 196761
12666A96761N3030k3923k3773K612l253j2700p323K4724J274O548N130J3859K7850
$$ 196761 249791 225868 202095 204707 201454 188754 181431 206155 207429 213977 219107 232966 260816
12653B60816J1424J2273m1514q500N8787J1204l6244j9468l52j6818k2373J7131
$$ 260816 272240 284513 242999 234499 293286 304490 268246 248778 248426 231608 209235 226366
12641B26366L4776J1024Q402J3401k6233j9848k4701l5625m6660Q47L0895K1121
$$ 226366 261142 272166 280568 293969 267736 247888 223187 187562 140902 141749 172644 193765
12629A93765L4569M7345K5719K1502m8158m8753R652P767J3345N948K1572k2049
$$ 193765 228334 275679 301398 322900 274742 225989 235641 243408 256753 262701 284273 262224
12617B62224J2858L433k9330k2090L0819O031o3221j8302K6985N6362l0673m0773
$$ 262224 275082 278515 249185 227095 257914 263945 200724 182422 209407 265769 235096 194323
12605A94323k5751J4214N9902k394K0812j8353n824m7469l6394j4330k102K0505
$$ 194323 168572 182786 242688 240294 261106 242753 236929 189460 153066 138736 136634 157139
12593A57139K5105O6981J0592K6681p055j0529j1880m3349n0221J2319M9452O1550
$$ 157139 182244 249225 259817 286498 279443 268914 257034 213685 163464 175783 225235 286785
12581B86785J6840j8746Q208J8376o670N181j2128m0847j5904K3215K8809K071
$$ 286785 303625 284879 293087 311463 304793 309974 297846 256999 241095 264310 293119 295190
12569B95190o884j622J2528J526j3455O691K1247k8361O4307L2004l0104J8591
$$ 295190 288306 286684 299212 300738 287283 293974 315221 286860 351167 383171 353067 371658
12557C71658J4726K7802j2048m0984o2529k6003K2518J5436k440K065K7786K1577
$$ 371658 386384 414186 402138 361154 298625 272622 295140 310576 308136 310201 337987 359564
12545C59564L4071M759n5360l1814J3691K0416j3701P64K1856L8914L3716L9604
$$ 359564 393635 398394 343034 311220 324911 345327 331626 332390 354246 393160 426876 466480
12533D66480M299p010n0591k3488p997j0415j5602j15o815p981N461N870L6600
$$ 466480 470779 463769 413178 389690 381693 371278 355676 355561 348746 340765 346226 352096 388696
12520C88696L5552j4113m3106k4993L9158K6253j3548o517P229q094j3355K47
$$ 388696 424248 410135 367029 342036 381194 407447 393899 387382 394611 386517 373162 373409
12508C73409o453J7810m568j1534J6241R182j2140L274M611J3474o843n2544l1311
$$ 373409 366956 384766 380198 368664 384905 394087 381947 385221 389832 403306 396463 343919 312608
12495C12608J8166J5054J264k589k3152P642J103k2854n840J7418j7202j205N913
$$ 312608 330774 345828 347092 344503 321351 328993 330096 307242 301402 318820 301618 300413 306326
12482C06326r535l170L0392m433n4367l5611M8354J3400r164k6035M3133K1174
$$ 306326 296791 293621 324013 319580 265213 229602 277956 291356 282192 256157 299290 320464
12470C20464k2495j8043q762M372M6j6744m068J2891M9839M0714j8161o960K3459
$$ 320464 297969 279926 271164 275536 275582 258838 254770 267661 317500 358214 340053 333093 356552
12457C56552k1772j5530J495K7199o852J2938K7504Q132l7370l330K3140k1111
$$ 356552 334780 319250 320745 347944 341092 354030 381534 389666 352296 348966 372106 350995
12445C50995J719j0473M529q993Q573R666j8925k0444j1469n509m564L1580j3758
$$ 350995 352714 342241 346770 337777 346350 356016 337091 316647 305178 299669 295105 326685 312927
12432C12927p135k0098K0241K1757L746l4890k2205K902M9485P334M190M839j1743
$$ 312927 305792 285694 305935 327692 331438 296548 274343 277245 326730 334064 338254 343093 331350
12419C31350M673j4089K521J6320L0637k704k3071l6409m3190q007M1390P2720
$$ 331350 336023 321934 324455 340775 371412 368708 345637 309228 266038 258031 299421 372141
12407C72141K1480l8832o530M2017K782o699l7281l8421j9500l6455J8707M6012
$$ 372141 393621 354789 348259 390276 393058 386359 349078 310657 291157 254702 273409 319421
12395C19421N9647J9157q722k5814L6305J6409q552j7060r142r416j7765J6157
$$ 319421 379068 398225 389503 363689 399994 416403 407851 390791 381649 372233 354468 370625
12383C70625l2683k1123O2923P982j2026j0546m0870Q742L2805J1886k311L3879
$$ 370625 337942 316819 379742 387724 375698 365152 324282 333024 365829 377715 375404 409283
12371D09283Q940m6766M106j2143k4452K8682J4033m3194k7342L522J5850q205
$$ 409283 418223 371457 375563 363420 338968 367650 381683 338489 311147 314669 330519 322314
12359C22314k5097M4676L4588p361r819k3594J741J2543n696m0271J2337L5221
$$ 322314 297217 341893 376481 369120 359301 335707 337448 349991 344295 304024 316361 351582
12347C51582J920q561l198O7940K5387o184j9944P965M258q5413K3543o287k4319
$$ 351582 353502 344941 341743 409683 435070 428886 408942 416907 421165 335752 359295 353008 328689
12334C28689M1528j7919l237K2950r52r789q432J1561K7630m4191p1476K8643
$$ 328689 370217 352298 349061 372011 371059 361270 352838 364399 392029 347838 276362 305005
12322C05005M2195L0681n105k9526K6731J4263J3274K3459r24l9382m1320j6282
$$ 305005 347200 377881 372776 343250 369981 384244 397518 420977 420053 380671 339351 323069
12310C23069j0522j7329K9281K3648K7683p174k4727l549P985J1141J9993K0783
$$ 323069 312547 295218 324499 348147 375830 368656 343929 340380 348365 359506 379499 400282
12298D00282K5019j2125j4504O499J7187N378l284l0406j629L9599L2295m486
$$ 400282 425301 413176 398672 405171 422358 427736 424452 394046 392417 432016 464311 459825
12286D59825j8549l0504n1924j6044L5900O1272j4181j3855K1869K7596j4232
$$ 459825 441276 410772 358848 342804 378704 439976 425795 411940 433809 461405 447173
12275D47173N083P2185K8633j902j0305p970j5835m0237k2168K1277n483K3378
$$ 447173 452256 524441 553074 551172 540867 532897 517062 476825 454657 475934 470451 493829
12263D93829O8536k0752m2304j7334j8311J4579K2732N6437Q730K4091J3303j488
$$ 493829 562365 541613 499309 481975 463664 478243 500975 557412 566142 590233 603536 602048
12251F02048J117N146M936p861l0833o657p140P344l1258j9649j13M3948P536
$$ 602048 603165 608311 613247 605386 574553 567896 560756 568100 536842 517193 517080 561028 568564
12238E68564k8J3307k0437k4801l9726J9902j759Q910J9968J6952K2479p15l1958
$$ 568564 568536 581843 561406 536605 496879 516781 515022 523932 543900 560852 583331 582616 550658
12225E50658k1560J2226o16J4468q059n3443K9455N1789Q19l864L5699N2982j7407
$$ 550658 529098 541324 540708 555176 547117 493674 523129 574918 575737 571873 607572 660554 643147
12212F43147j909j1688k1126j472k48K6749J6199k5868J8419L8543j4232K0851
$$ 643147 641238 629550 608424 606952 606704 633453 649652 623784 642203 680746 666514 687365
12200F87365r685m4619K1793R200j8168j4374K9615L2356j7168Q965K687j7808
$$ 687365 677680 633061 654854 664054 645886 631512 661127 693483 676315 685280 687967 670159
12188F70159m057l708k6808M2468K6507J8556J2165J264J0049J0738L0138o673
$$ 670159 666102 662394 635586 678054 704561 723117 735282 736546 746595 757333 787471 780798
12176G80798M382K6006L0211L8723J2971k0111J7225L7980M4077j3550P0515N5927
$$ 780798 785180 811186 841397 880120 893091 872980 890205 928185 972262 958712 1029227 1085154
12164A085154M039J9909R761N6564Q4043J9255N1650M4861O5814Q5251R6799N5481
$$ 1085154 1089193 1109102 1118863 1175427 1259470 1278725 1330375 1375236 1441050 1526301 1623100 1678581
12152A678581R3850J07598J04360J52626J75792J81106J85558J33103K23966K60531
$$ 1678581 1772431 1880029 1984389 2137015 2312807 2493913 2679471 2812574 3036540 3297071
12142C297071L22057L38238M17555M19098M79566N85684O50348P73310Q00591
$$ 3297071 3619128 3957366 4374921 4794019 5273585 5859269 6509617 7282927 8083518
12133H083518R15498R99939J015120R85960R64037Q78609O70146M28552K17374
$$ 8083518 8999016 9998955 11014075 12000035 12964072 13842681 14512827 14941379 15158753
12124A5158753Q183r2765k20103l47877l40827l53985l09375k51837k02523j01323
$$ 15158753 15166936 15074171 14854068 14506191 14165364 13811379 13502004 13250167 13047644 12946321
12114A2946321O8410J94365L65637N22849O42681P72338Q98265J060878J144456
$$ 12946321 13014731 13209096 13574733 14097582 14740263 15512601 16410866 17471744 18616200
12105A8616200J111807J091602J059944R87798Q97894P20662N39348L39557J75776
$$ 18616200 19728007 20819609 21879553 22867351 23765245 24485907 25025255 25364812 25540588
12096B5540588O4467q9534k94940l90402m34659m75017n31877n32820m82923m08119
$$ 25540588 25605055 25515521 25220581 24830179 24395520 23920503 23388626 22855806 22372883 21964764
12086B1964764l30043j29102m4233r23J4334j819j5521j55866j96938l12495l96122
$$ 21964764 21634721 21505619 21461386 21460463 21474797 21472978 21457457 21301591 21104653 20792158 20396036
12075B0396036l75763l77713l30477k67135j02217J04001K84925M81293O58294
$$ 20396036 20020273 19642560 19312083 19044948 18942731 19046732 19331657 19812950 20471244
12066B0471244P83017Q97312R05433Q17160O68356L72644N3640m00878p63205
$$ 20471244 21254261 22151573 23057006 23874166 24542522 24915166 24968806 24567928 23804723
12057B3804723j077103j364915j516514j570657j588182j483567j399652j293833
$$ 23804723 22727620 21362705 19846191 18275534 16687352 15203785 13804133 12510300
12049A2510300j133515j025564q84669q26211p15575o10548n82077m84946m54538
$$ 12510300 11376785 10351221 9466552 8640341 7924766 7314218 6732141 6247195 5792657
12040E792657l77082l62582l17822k78831k62712k07549j86100k01264j66630
$$ 5792657 5415575 5052993 4735171 4456340 4193628 3986079 3799979 3598715 3432085
12031C432085j38105j36799j32153j35418j40156r6036j01545r9098n6863m8220
$$ 3432085 3293980 3157181 3025028 2889610 2749454 2653418 2551873 2452775 2395912 2347692
12021B347692j02245j08636p0316q2428n9653m3844k9981k3021k3873J6031j0166
$$ 2347692 2245447 2136811 2066495 1984067 1924414 1880570 1850589 1827568 1803695 1819726 1809560
12010A809560o9025j08840j14661m2725Q585R7l4817J0444k8986o9511k2635q474
$$ 1809560 1740535 1631695 1517034 1474309 1482894 1482991 1448174 1458618 1429632 1360121 1337486 1329012
11998A329012J5654k994o9360m1368L574K955k6443l0262k4143k3878K7903J2238
$$ 1329012 1344666 1341672 1272312 1230944 1234518 1237473 1211030 1180768 1156625 1132747 1160650 1172888
11986A172888k4266k9206L1073J989k3985O0167Q487j7807n1298n0372N9J6798
$$ 1172888 1148622 1119416 1150489 1152478 1128493 1188660 1197147 1179340 1128042 1077670 1077729 1094527
11974A094527K4406K6519M0914J5575M7236J4404K5244O8808L4471k0310l3999
$$ 1094527 1118933 1145452 1186366 1201941 1249177 1263581 1288825 1357633 1392104 1371794 1337795
11963A337795k5814M363j5471l5695q9716o5397j0957k8150j100J229m3883l3780
$$ 1337795 1311981 1316344 1300873 1265178 1175462 1110065 1099108 1070958 1069858 1071087 1027204 993424
11951I93424K562n1910n7081k6913J9274P060L5512L7105K5774J9388J4248J060
$$ 993424 995986 944076 886995 860082 879356 886416 921928 959033 984807 1004195 1018443 1019503
11939A019503J2894J3279K1166M7477J7988O1020K3178j4174L839p103l2675k7207
$$ 1019503 1032397 1045676 1066842 1114319 1132307 1193327 1216505 1202331 1206170 1199067 1166392 1139185
11927A139185o0665l3456l8621j196m675k9705k0219n1367o5285J3152J7575q746
$$ 1139185 1078520 1045064 1006443 1005247 1000572 970867 950648 899281 833996 847148 864723 855977
11915H55977J9173K8976P79l5180j8815j2310L638j4339K3023L3728r316n7658
$$ 855977 875150 904126 904905 869725 850910 838600 842238 827899 850922 884650 875334 817676
11903H17676p823K6599K2026J5311K7116K0772N6344K591r853k0703M9752L2848
$$ 817676 809853 836452 858478 873789 900905 921677 978021 980612 970759 950056 999808 1032656
11891A032656M4714K3372M561l733m181o612J1771P339J7366K8231k6095N2830
$$ 1032656 1077370 1100742 1105303 1101570 1097389 1090777 1102548 1109887 1127253 1155484 1129389 1182219
11879A182219N0565k1420L747J02413R0563P9894M8429M2046Q1602O1726P8316
$$ 1182219 1232784 1211364 1215111 1317524 1408087 1487981 1536410 1578456 1660058 1721784 1800100
11868A800100Q3898R1897M9994J03472J24587J48637J85009J17801J50841K29176
$$ 1800100 1883998 1975895 2025889 2129361 2253948 2402585 2587594 2705395 2856236 3085412
11858C085412K38316K94106L40027L79947M05249M52761N34273O30067O93388
$$ 3085412 3323728 3617834 3957861 4337808 4743057 5195818 5730091 6360158 7053546
11849G053546P81485R69159J137915J332737J529328J653883J785911J836681
$$ 7053546 7835031 8804190 9942105 11274842 12804170 14458053 16243964 18080645
11841A8080645J862246J794261J539478J138572O36399J02521l50943p23190r37433
$$ 18080645 19942891 21737152 23276630 24415202 25051601 25154122 24803179 24079989 23142556
11832B3142556j060587j109218j041794q93622o51745m69937k11888J6632K15058
$$ 23142556 22081969 20972751 19930957 19037335 18385590 17915653 17703765 17720397 17935455
11823A7935455L80739N22382O04316O22947N68656M78273K48648O0039r9603j31200
$$ 17935455 18316194 18838576 19442892 20065839 20634495 21112768 21361416 21421455 21321852 21190652
11813B1190652j07180R99Q8337K87254M74691O12404P33611Q63335Q43943P60720
$$ 21190652 21083472 21084471 21172808 21460062 21934753 22547157 23280768 24144103 24988046 25748766
11803B5748766O27259M33402K45102l1661k13433l68927n00383o41197q60968
$$ 25748766 26376025 26809427 27054529 27022868 26809435 26440508 25940125 25298928 24437960
11794B4437960r90257j177932j219145j202476j221525j176348j078236r50218
$$ 24437960 23447703 22269771 21050626 19848150 18626625 17450277 16372041 15421823
11786A5421823p56898n84796m34500k97483j16395J2204J09502K48685L64311
$$ 15421823 14664925 14080129 13645629 13348146 13231751 13243955 13353457 13602142 13966453
11777A3966453M22642N12828N85286N42850M50289L09630R0882j83096m52592
$$ 13966453 14389095 14901923 15487209 16030059 16480348 16789978 16880860 16697764 16245172
11768A6245172o25834q78233j033558j041398j071082j041002r58257q32675q06092
$$ 16245172 15619338 14741105 13707547 12666149 11595067 10554065 9595808 8763133 7957041
11759G957041p09718o01943n54091m68290m24971l76033k86395k67625k66351
$$ 7957041 7247323 6645380 6091289 5622999 5198028 4821995 4535600 4267975 4001624
11750D001624k70611k33982k16742j50804j02297j45873j38345j15135o2347p3662
$$ 4001624 3731013 3497031 3280289 3129485 3027188 2881315 2742970 2627835 2565488 2491826
11740B491826j14151q2700p5616p6178q9234j01346l6758l1262l8208m9871m0546
$$ 2491826 2377675 2294975 2219359 2143181 2053947 1952601 1915843 1884581 1846373 1796502 1755956
11729A755956m1339n6256k5398k7596l9674j1325k8513k9942m7965n8727K0935
$$ 1755956 1714617 1658361 1632963 1605367 1565693 1554368 1525855 1495913 1447948 1389221 1410156
11718A410156j1269l6504l9437j3159K3048j7594j6089p236l897k6493k4008k7928
$$ 1410156 1398887 1362383 1322946 1309787 1332835 1315241 1299152 1291916 1288019 1261526 1237518 1209590
11706A209590n1851k3832R633j0943K5657O997j1848K963l912k3408j9490l244
$$ 1209590 1157739 1133907 1143540 1132597 1158254 1165251 1153403 1156366 1152454 1129046 1109556 1106312
11694A106312k9810k1293m2783k8871q058p000M664j7353j6652J0017K818K1099
$$ 1106312 1076502 1055209 1012426 983555 975497 968497 973161 955808 939156 949173 951991 973090
11682I73090M408n2509k1288M571J2938M328o022k5197q733L2254l0719L356R537
$$ 973090 977498 924989 903701 908272 921210 925538 919516 894319 885586 917840 887121 890477 900014
11669I00014Q306k5289o2507N1121K4775m769k5137P332L6681k0688n4430j1116
$$ 900014 908320 883031 820524 871645 896420 891651 866514 873846 910527 889839 835409 824293
11657H24293J3263k1907l6097J3713J6393L5217L7766M912l5596n3348N642k5311
$$ 824293 837556 815649 779552 793265 809658 844875 882641 887553 851957 798609 804251 778940
11645G78940j8001L4167K9142K5325L5903l4562q2345k637J3236q108K2847J1191
$$ 778940 760939 795106 824248 849573 885476 850914 768569 765932 779168 771060 793907 805098
11633H05098m0944n8726k8308j3781L0709L5107k0087k2198j1916o908o4562j8801
$$ 805098 764154 705428 677120 663339 694048 729155 709068 686870 674954 668046 603484 584683
11621E84683N5013M9768J3164j9338J1528J8334K6832J6976k3364J5244R53l5785
$$ 584683 639696 689464 702628 683290 694818 713152 739984 756960 733596 748840 749793 714008
11609G14008n2223m2699j1047K7869J2665o549L7954K1540k6428j1227Q72j3353
$$ 714008 661785 619086 608039 635908 648573 642024 679978 701518 675090 663863 664735 651382
11597F51382l1023k5113o4294O387L0212K3560j6744r33K2001N57l1131p561k2447
$$ 651382 620359 595246 530952 537339 567551 591111 574367 573434 595435 595992 564861 557300 534853
11584E34853M334J4335J8189k2787k6484O916K9153K2097J6913L3501k3721k0549
$$ 534853 539187 553522 571711 548924 522440 529356 558509 580606 597519 631020 607299 586750
11572E86750j2796l5662n00L1768L848k9645M915j5731L6919J8786J3916j360
$$ 586750 573954 538292 537792 569560 573408 543763 548678 532947 569866 588652 602568 601208
11560F01208j5234J706J3160k0142J302j0053k1828R71K368J2332n1004k1305
$$ 601208 585974 587680 600840 580698 582000 571947 550119 551090 553458 565790 514786 493481
11548D93481L4488l376K1336o014N214k0156m8255J0230O7342l891l0048L534
$$ 493481 527969 524593 545929 539915 545129 524973 476718 486948 554290 550399 520351 523885
11536E23885j194l6956J3693P60K496N699l9329j4527K4533K0845Q128L387J5122
$$ 523885 522691 485735 499428 500188 502684 508383 469054 454527 479060 499905 508033 511420 526542
11523E26542j7435m0487j6265K0039k2756L9845K0339l0608l1442q754L2645M3912
$$ 526542 509107 468620 452355 472394 449638 489483 509822 479214 447772 439018 471663 515575
11511E15575O39m8235o4084j7028K9653L9956J2981l2576R339k2434n009J2061
$$ 515575 516214 467979 403895 386867 416520 456476 469457 436881 446220 423786 418777 430838
11499D30838k2191k6835M0118K8817j3014j0710j2049K0872O527m072L2196J9029
$$ 430838 408647 381812 421930 450747 437733 427023 414974 435846 442373 438301 470497 489526
11487D89526o687j9274Q416n3754l7350m900r915k9982k5447L2516O812L1021
$$ 489526 482839 463565 471981 418227 380877 375977 366062 336080 310633 343149 349961 380982
11475C80982j1087j7556n4504Q99P3953L6854j4095j8904l2630p576J7511L1543
$$ 380982 369895 352339 297835 298734 372687 409541 395446 376542 343912 336336 353847 385390
11463C85390m413j3662j518j0369N4372M7798j5418m1819m0871R133p78m1101
$$ 385390 380977 367315 365797 355428 409800 457598 442180 400361 359490 368623 367845 326744
11451C26744k4559L5750L2708L0077n27j3640m6931l809M2052J4365j2077l0643
$$ 326744 302185 337935 370643 400720 400193 386553 339622 335813 377865 392230 380153 349510
11439C49510L6170K6193l443k2861j991j5374K0298j2895l3307l682o3877q933
$$ 349510 385680 411873 408430 385569 383578 368204 388502 375607 342300 338618 274741 265808
11427B65808P5149L0574J3801l7527n4462O0141M9185J239N40n5828l2843J3317
$$ 265808 340957 371531 385332 347805 293343 353484 402669 403908 404448 348620 315777 329094
11415C29094K3921q212j6824K0241J7950m325N439K6819k4085M4707K4518k2593
$$ 329094 353015 344803 327979 348220 366170 361845 367284 394103 370018 414725 439243 416650
11403D16650k7711k5790L3794M6126L3247J2958m5145n2746J7099Q816j9189k064
$$ 416650 388939 363149 396943 443069 476316 489274 444129 391383 408482 417298 398109 396045
11391C96045J6410K5704L2373k2291m5510j0288J385p101R05m745K4656L890K0157
$$ 396045 412455 438159 470532 448241 402731 392443 393828 386727 387632 382887 407543 411433 431590
11378D31590J99K7847L4572m1196K852J887j5203j6166P337k4473n2731K178K7651
$$ 431590 431789 459636 494208 453012 455864 457751 442548 426382 433719 409246 356515 358693 386344
11365C86344N8003K5958m286q054k6339k5484L1154J0207l7931l2707j6413j8407
$$ 386344 444347 470305 466019 457965 431626 406142 437296 447503 409572 376865 360452 342045
11353C42045k9670J8350j359j27Q557O192K1423q583j1127k8535L8380N0197J4570
$$ 342045 312375 330725 329366 329239 337796 343988 365411 356828 345701 317166 355546 405743 420313
11340D20313m6867j2636l2922M627K5237J9279L7704J5448j2472M538j1321k3149
$$ 420313 373446 360810 327888 332515 357752 377031 414735 430183 417711 422249 410928 387779
11328C87779m6846m0303k2571K9876o034J806J8969K6134L4660J7887o1697m0945
$$ 387779 340933 300630 278059 307935 301901 303707 322676 348810 383470 401357 339660 298715
11316B98715l1189k3638j4509j9482k871N191K7092L4149Q667l7554L361l2937
$$ 298715 267526 243888 229379 209897 207026 212217 239309 273458 282125 244571 247932 214995
11304B14995q286K0977J4533Q111j6923J1445J1372j4428j4238j7238L091O145
$$ 214995 206709 227686 242219 250330 233407 244852 256224 241796 227558 210320 213411 219556
11292B19556r122K2505K5621J6029j9211m9051j0408N9701O0470m8462k6704j7432
$$ 219556 210434 232939 258560 274589 255378 206327 195919 255620 316090 267628 240924 223492
11280B23492k7908l452O4494R263o280k1566J4154M3976K6063n0095m5907P377
$$ 223492 195584 192132 256626 265889 259609 238043 252197 296173 322236 272141 226234 233611
11268B33611K0306P503J5975o0293R923N5693r556K6890n067p514j1259k3408
$$ 233611 253917 261420 277395 217102 227025 282718 273162 300052 294985 287471 276212 252804
11256B52804K1199K5871j8292j9702K5994l1326k5322l7259J4516O2631L316k6948
$$ 252804 274003 299874 281582 261880 287874 256548 231226 193967 208483 271114 274430 247482
11244B47482K6580k162K1523k2597n6588l6639J0494K0124K6073K0167j3652n0738
$$ 247482 274062 271900 293423 270826 214238 177599 188093 208217 234290 254457 240805 190067
11232A90067J0960M5398j1203J0689k1397L210j1246j5597J2647l242O4147K6418
$$ 190067 201027 246425 235222 245911 224514 227724 216478 200881 213528 210286 274433 300851
11220C00851j6545o0080m8046m5344N2346M7294l4936j093L5202m2733o472J3248
$$ 300851 284306 224226 176180 130836 183182 230476 195540 194447 229649 186916 180444 193692
11208A93692M9526K6895M107l4227j0019j386k6270m348n2195K1064J1359K2538
$$ 193692 243218 270113 274220 239993 229974 228588 202318 197970 145775 166839 178198 200736
11196B00736J9767J3567j1999l627p894J9693J0383k6946n427j9721m4311m6968
$$ 200736 220503 234070 222071 218444 210550 230243 240626 213680 208253 188532 144221 97253
11184I7253K3173K2545L4676K1364M783N612m339J0905J2215k2925m2457l8901
$$ 97253 120426 142971 177647 199011 203794 209406 205067 215972 228187 205262 162805 123904
11172A23904M1354J2191J8859m056k8462O684J4538K1435l1612j1446K6589K6368
$$ 123904 165258 177449 196308 192252 163790 170474 185012 206447 174835 163389 189978 216346
11160B16346l5076j0377j2852j371O575L533K2049J0731m6054o777l899O21L587
$$ 216346 181270 170893 158041 156670 163245 166778 188827 199558 153504 146727 142828 143449 147036
11147A47036K726L2004L1993j150k9861j4814j5829k9539p968L0873K3135l38
$$ 147036 149762 181766 213759 212609 182748 167934 152105 122566 114598 145471 168606 168268
11135A68268n971q337K264l0950j0995J7946K1692J9191l7397o660L3655N330
$$ 168268 162297 153960 156224 125274 114279 132225 153917 173108 135711 129051 162706 168036
11123A68036L0812N203j9447Q646o439l5270j407J8390k4841J4027J9233j4673
$$ 168036 198848 204051 184604 193250 186811 151541 150134 168524 143683 157710 176943 162270
11111A62270j9442J1111j3750j0415k0600p557K6103J0469o018L2977N0679N879
$$ 162270 142828 153939 140189 129774 109174 101617 127720 138189 132171 165148 215827 221706
11099B21706r906o8336k1453j0429K1604L4657j6634r988K0880J0532j425k1706
$$ 221706 211800 143464 122011 111582 133186 167843 151209 141221 162101 172633 171208 149502
11087A49502k9943k6558O123L3638K9414j8755k8568l9556k3598J0068L077J1543
$$ 149502 119559 93001 99124 132762 162176 143421 114853 75297 51699 61767 64844 76387
11075G6387l6885M0819N4504N075j0816j844J5499K5897j6029K5248K4749K4652
$$ 76387 39502 80321 134825 139900 129084 127240 142739 168636 152607 177855 202604 227256
11063B27256k1033p0302Q017l2523j4892M9120N1495j7944j0272J8027K8862J6428
$$ 227256 206223 135921 143938 111415 96523 145643 197138 179194 168922 186949 215811 232239
11051B32239k8217m5619K2842L3320K8302j2623k7430J7811M0933p0113O35L4090
$$ 232239 204022 158403 181245 214565 242867 230244 202814 220625 261558 191445 192080 226170
11039B26170J9216O1834M0755L1189M2190Q197R55p8317k7231N1n985J5647P8244
$$ 226170 245386 307220 347975 379164 421354 429551 430506 352189 324958 325009 319024 334671 412915
11026D12915M4285L7139Q479L4929K7589o0668l6619k2587l2553k8680m1601J1304
$$ 412915 457200 494339 502818 537747 565336 504668 468049 445462 412909 384229 342628 353932
11014C53932N1075N7293K8653j1740k9443k9370o4927o1809k8437k6853O103l76
$$ 353932 405007 462300 490953 479213 449770 420400 355473 293664 265227 238374 244477 244101
11002B44101J908N5664R066o2915m4368k0906m532j2493j9845j1385K2463K548
$$ 244101 246009 301673 310739 247824 203456 182550 178018 165525 145680 134295 156758 159306
10990A59306n4822k6272K4498K6845o80N396m4047l600l3788P881L4273J7058
$$ 159306 104484 78212 102710 129555 128875 134271 90224 86624 52836 60717 94990 112048
10978A12048K2885J4735m6802k9241j012n954J2364l234R9J1969l708M866r115
$$ 112048 134933 149668 102866 73625 72613 66659 79023 75789 75888 87857 84149 89015 79900
10965G9900q1712l0209j6857n13N1150L9831l44J8287M9578Q129k5268K1268M939
$$ 79900 -1812 -32021 -48878 -49391 1759 41590 41246 59533 109111 117240 91972 113240 118179
10952A18179k7619n041l2041l0202j0819q654J6662M9181J3257p863L911L566
$$ 118179 90560 85519 53478 23276 12457 3803 20465 69646 82903 75040 78951 82517
10940H2517k9081p032R23j069M1913M0057k0601k2899j7231N140J6314o4787j7924
$$ 82517 53436 46404 47327 46258 88171 128228 107627 84728 67497 72637 88951 24164 6240
10927F240K3291L4623J9008k9613j5436K6845j27n142J1986J6047j510l4189J639
$$ 6240 29531 64154 83162 53549 38113 64958 64831 59689 71675 87722 86212 52023 53662
10914E3662j069j2252J6661O831J5730K4272Q870m53j732j7725O53j5542o339
$$ 53662 52593 40341 57002 63833 79563 103835 112705 112252 110520 92795 93448 77906 71567
10901G1567l6091n0086N6801M5899L0546l879k8117n469J3281K1573m7256j7535
$$ 71567 35476 -14610 42191 88090 118636 114757 86640 81171 94452 116025 68769 51234
10889E1234N1652K2715n5492j1615j3875j7377J583o517M623P183K4825N3180
$$ 51234 102886 125601 70109 58494 44619 27242 28825 22308 26931 34114 58939 112119
10877A12119k9815n1552L104J3201J0794j1158J065K2780j1017j7961J5328j18
$$ 112119 82304 30752 33856 47057 57851 46693 47758 70538 59521 41560 56888 56770
10865E6770n0755j3157J9133J9309j1237j1306J5462J9389O039j6427K0114j4871
$$ 56770 6015 -7142 11991 31300 20063 8757 24219 43608 49647 33220 53334 38463
10853C8463l1235n913K6938J7381L6459p886P317o3559l6608M7720N8040p701
$$ 38463 7228 1315 28253 45634 82093 74207 81524 17965 -18643 29077 87117 79416
10841G9416m1823J5667k1040K4611j295j6606l4702O61K9003K181J830k7684m2191
$$ 79416 37593 53260 32220 56831 55536 38930 4228 4889 33892 36073 37903 10219 -31972
10828c1972j3054O7522J5898k8093k1403k0923j1322J4144M9748j0504K4883K9173
$$ -31972 -45026 22496 38394 10301 -11102 -32025 -43347 -29203 20545 10041 34924 64097
10816F4097K830n0684k4510k601K3464M2080j749k191k6497k1051K3416Q391q126
$$ 64097 66927 16243 -8267 -10868 12596 54676 52927 50736 24239 3188 26604 34995 26869
10803B6869l1777n3003K3048J5516j3575O087J5085K5824N2975r510j2274K211
$$ 26869 -4908 -57911 -34863 -19347 -32922 -26835 -11750 14074 67049 57539 45265 47476
10791D7476k3133K2410J7721k1315j9781o17p86O190K0693J1318R53j5870n8820
$$ 47476 24343 46753 64474 43159 23378 22761 21975 28165 48858 60176 61129 45259 -13561
10778a3561o876K5097l4580k9374n062R935N4064J3682m5085j8372N0896o025
$$ -13561 -20437 4660 -29920 -59294 -64356 -54421 -357 13325 -31760 -50132 764 -5261
10766e261K3065K8589k9306m8669j5675L2689p77K5214J9799K922k9308j5647
$$ -5261 17804 46393 17087 -31582 -47257 -14568 -15345 9869 29668 32590 3282 -12365
10754a2365j0095J0355k1043K8647L7671j1269K3964k1128j0052j8267l654k2307
$$ -12365 -22460 -12105 -33148 -4501 33170 21901 45865 24737 14685 -3582 -7236 -29543
10742b9543l148k8870R586M8686r490k3065j304J2734l163k2148l1557J3101N0268
$$ -29543 -32691 -61561 -51975 -3289 -12779 -35844 -37148 -24414 -27577 -49725 -81282 -68181 -17913
10729a7913N243n6390r979Q123j092M809J1147j2660p747m572k8568q548J2343
$$ -17913 -12670 -69060 -79039 -70916 -72008 -67199 -56052 -68712 -76459 -81031 -109599 -118147 -105804
10716a05804K2105m742M3035L301p1849j4839j8837J173J1057M0845N1526K9430
$$ -105804 -83699 -88441 -45406 -42105 -113954 -128793 -147630 -146457 -135400 -94555 -43029 -13599
10704a3599l8635o1980j387R0l788j140j0421q618L9431J9851l0756J563j3080
$$ -13599 -52234 -114214 -115601 -115511 -119299 -120439 -130860 -139478 -100047 -80196 -110952 -109389 -122469
10691a22469k82K8479P791j2508m2084m387L1414N765L005R451M077K6062K0564
$$ -122469 -122751 -94272 -86481 -98989 -141073 -145460 -114046 -108281 -105276 -95825 -91748 -65686 -45122
10678d5122j3676j2915J4841L4915j5627j0813n1515n7931K4555k956k1242j2135
$$ -45122 -58798 -71713 -56872 -21957 -37584 -48397 -99912 -157843 -133288 -136244 -157486 -169621
10666a69621K4028J2750K258L1392L6550j4309r9250k7732J4905L6756N7668j3524
$$ -169621 -145593 -132843 -130585 -99193 -62643 -76952 -176202 -203934 -189029 -152273 -94605 -108129
10654a08129j0117L2357J3637j8473L9950M3612K0757K9504p481o37K5820k6760
$$ -108129 -118246 -85889 -72252 -90725 -50775 -7163 13594 43098 35617 34980 60800 34040
10642C4040P112K3539N6220J15997R9964J12572R7322J28994J69198J50291J27679
$$ 34040 41152 64691 120911 236908 336872 449444 546766 675760 844958 995249 1122928
10631A122928J20768J64860K21643K38818L63041M75326O98620R49680J344187
$$ 1122928 1243696 1408556 1630199 1869017 2232058 2707384 3406004 4355684 5699871
10622E699871J837404K553735L291170M016558M150605L134066J236449l17457
$$ 5699871 7537275 10091010 13382180 17398738 21549343 24683409 25919858 25602401
10614B5602401j029318r24016k65862Q20219K239633M054706O238193Q125068
$$ 25602401 24573083 23649067 23383205 24203424 26443057 30497763 36735956 44861024
10606D4861024Q276049N298839K96114l396595m522619l914007k391960l46977
$$ 44861024 53137073 58435912 58732026 55335431 50812812 46898805 44506845 44159868
10598D4159868K096614M964572Q067633J0408890R874507M776744k650357p636894
$$ 44159868 46256482 51221054 59288687 69697577 79572084 84348828 81698471 74061577
10590G4061577q812288p778260n895879l657008j165120J379758L796007N306734
$$ 74061577 65249289 57471029 51575150 47918142 46753022 48132780 51928787 57235521
10582E7235521M616102Q88325l992168o906036p244904o252783m788742l251950
$$ 57235521 61851623 62739948 58747780 51841744 44596840 38344057 33555315 30303365
10574C0303365j798384m23320O94120J167734O59798q45339k626738l675826l811396
$$ 30303365 28504981 28081661 28775781 29943515 30603313 29757974 27131236 23455410 19644014
10565A9644014l432841k809326k277280j796367j379508j057531q43295o98500
$$ 19644014 16211173 13401847 11124567 9328200 7948692 6891161 6047866 5349366
10557E349366n36105m70078m01741l06480k49960k16448j78250j88434j71386
$$ 5349366 4813261 4343183 3941442 3634962 3385002 3168554 2990304 2801870 2630484
10548B630484j46485j51843j44363j19015j14106q0103o7651q4661r4708p0282
$$ 2630484 2483999 2332156 2187793 2068778 1954672 1874569 1806918 1722257 1627549 1557267
10538A557267n4743o3196m4632k4664J3010M60q395p5577r4400m4882j023j3443
$$ 1557267 1502524 1439328 1394696 1370032 1383042 1383502 1375107 1299530 1205130 1160248 1159225 1145782
10526A145782n2089j0148j9465m4434n091l1846m0797k4715M3239N754q9683p0213
$$ 1145782 1093693 1083545 1064080 1019646 1014555 982709 941912 917197 960436 966190 876507 806294
10514H06294J4437j0185j5886m5300m1970J0592L5853m9032o103Q487q367k9945
$$ 806294 820731 810546 794660 749360 707390 717982 753835 704803 698700 707187 698820 668875
10502F68875k077n224j3546q193l1648k6941N8955M563j8838J288m2932j9499
$$ 668875 666798 661574 648028 639835 608187 581246 640201 644764 625926 627214 584282 564783
10490E64783k653r689K8438K5908j317k1467k5268k8812l4142J1584m252k0698
$$ 564783 562130 552441 580879 606787 605470 584003 558735 529923 495781 507365 503113 482415
10478D82415Q671l2216j4298K3061K2118L2020j3479q682P891r004j928J1898
$$ 482415 491086 458870 444572 467633 489751 521771 508292 499610 507501 498497 496569 508467
10466E08467j3121k9318l7816j5695o517l613K0343L294m4293L826K4814j7707
$$ 508467 495346 466028 428212 412517 406000 402387 422730 426024 381731 385557 410371 392664
10454C92664k2614n511j6285m9693L7807K7056M128N5344J727P74q905o9796k3797
$$ 392664 370050 364539 348254 298561 336368 363424 367552 422896 424623 425397 416492 346696 322899
10441C22899j2340k9569k2400J6578N30l6015J5607Q671M8990j4134n3458J4388
$$ 322899 310559 280990 258590 275168 275698 239683 255290 263961 312951 298817 245359 259747
10429B59747r812j8374K1267j3790j1091J6138j976K0404J0299J8113m1237k1542
$$ 259747 249935 231561 252828 239038 227947 244085 242109 262513 272812 290925 249688 228146
10417B28146P976j4318P911K2385j8154J6380J5436j1635o182k1057N609R220
$$ 228146 236122 221804 229715 252100 233946 250326 265762 254127 247945 226888 232497 241717
10405B41717m4873O739J2686l023k7401M8710N5371R941m0925p191M9014J3826
$$ 241717 196844 203583 216269 213246 185845 234555 289926 299867 258942 251751 300765 314591
10393C14591N959k5025j9583L677Q074R040k2715l1578j8272O3095P697J5010
$$ 314591 320550 295525 275942 279619 287693 296733 274018 242440 224168 287263 294960 309970
10381C09970m3938l2286j5082j9399J5070J4642R327k9339K1717K6865J2963l7533
$$ 309970 266032 233746 218664 199265 214335 228977 238304 208965 230682 257547 270510 232977
10369B32977M466M997k5101J287J7265M480J541m7436k0996J6597M6534J863O233
$$ 232977 237443 242440 217339 218626 235891 240371 241912 194476 173480 190077 236611 238474 244707
10356B44707r218m9854K345l2532L4183K9040O523L698M4841j4364l6680n1426
$$ 244707 235489 185635 187980 155448 189631 218671 225194 228892 273733 259369 222689 171263
10344A71263J1760k301N6338M5061Q74k7520K4639K7173j9634l9052P79m6185
$$ 171263 183023 180722 237060 282121 282995 255475 280114 307287 287653 248601 249380 203195
10332B03195l0831q695j4482J118J4066j2815j245P1629K8386j0345k9674k0278
$$ 203195 172364 163669 149187 150305 164371 151556 150311 221940 250326 239981 210307 190029
10320A90029L2237k0948m3826J7919J7683J2074j8174m8420n3983L7646M7431
$$ 190029 222266 201318 157492 175411 193094 205168 186994 138574 84591 122237 169668
10309A69668l2917J7022l0816l8234l5962j8040J4094L5901q181M1065M6113L0338
$$ 169668 136751 153773 122957 84723 48761 30721 44815 80716 72535 113600 159713 190051
10297A90051j889k7718N038l0628j979L1079k3126J5903K8467l0787J2991J2594
$$ 190051 188162 160444 165482 134854 132875 163954 140828 156731 185198 154411 167402 179996
10285A79996k5268k9329K7426q151j5518k6239m6719k1152J7022O7658M2202J210
$$ 179996 154728 125399 152825 144674 129156 102917 56198 35046 52068 119726 161928 163138
10273A63138l4676k6854J2305K2555N05J5101n4177L2892L6295k592o0359k6898
$$ 163138 128462 101608 113913 136468 136973 152074 97897 130789 167084 164492 104133 77235
10261G7235P990K6875k3978K2175K4517j7518k4519J0282K180J4592L0099k0983
$$ 77235 85225 112100 88122 110297 134814 117296 92777 103059 105239 119831 149930 128947
10249A28947n0657L5477J7464K4857J7651n6493j1489p060J3262K932l900k9497
$$ 128947 78290 113767 131231 156088 173739 117246 105757 98697 111959 114891 110991 81494
10237H1494k0174L0858M2044K3346l368j5886j157k616M7668K4304r617k2817
$$ 81494 61320 92178 134222 157568 154200 138314 137157 134541 182209 206513 196896 174079
10225A74079l5688o004k8757m8464P388Q576M8232K2059k1244j2449K1760j9017
$$ 174079 138391 132387 103630 55166 62554 71130 119362 141421 120177 107728 129488 110471
10213A10471L851J9505j5517r955j8573L6547m563j0904J5048N906K0067j8019
$$ 110471 114322 133827 118310 108355 89782 126329 121766 110862 125910 131816 151883 133864
10201A33864l1556K7886L57m1351j8537N3809k2755m01J5624k0461k2229J0440
$$ 133864 102308 130194 130551 89200 70663 124472 101717 101316 116940 96479 74250 84690
10189H4690j1861N397L1958L7440K5150J4354j923M596J9544J7254J8948L0761
$$ 84690 72829 78226 110184 147624 172774 187128 185205 189801 209345 226599 245547 276308
10177B76308k0756m3983n988K6176K431L4414O4539P8708K8591K7844k7646k7365
$$ 276308 255552 211569 205581 231757 234188 268602 333141 411849 440440 468284 440638 413273
10165D13273j696j9858R187M3292J2369j404k4329M8444N3281L4750K0307q310
$$ 413273 411577 391719 400906 444198 456567 455163 430834 479278 532559 567309 587616 579306
10153E79306m5600p2650k0555p633K8471j8780Q694K1278p763j0651k7794l3669
$$ 579306 533706 461056 440501 432868 461339 442559 451253 472531 464768 454117 426323 392654
10141C92654m2791m4684m7612n6560O4873Q1610k8373n2585k5010j0179J965k1727
$$ 392654 349863 305179 257567 201007 265880 347490 319117 266532 241522 231343 233308 211581
10129B11581L956n6091j06971q468K2716M6441P517O819J2434n4985l9955K8814
$$ 211581 215537 159446 52475 44007 66723 113164 120681 127500 139934 84949 44994 73808
10117G3808R470q165j6591M7011q710j5273N077r604k4440L3669M5906q340o5056
$$ 73808 83278 75113 58522 105533 96823 81550 86627 77023 52583 86252 132158 123818 58762
10104E8762k5944J104J3886K4024N188K1812j9037m0186L0435J8963J1583k4390
$$ 58762 32818 33922 47808 71832 77020 98832 79795 39609 70044 89007 100590 76200
10092G6200m9295J3209p064M261M7064J0985M579R333j6776l5385L4881M6133
$$ 76200 26905 40114 33050 37311 84375 95360 99939 109272 92496 57111 91992 138125
10080A38125l0303N232O384r947o4212m5032J0314o989J5867m143O949j350Q812
$$ 138125 107822 113054 119438 109491 45279 247 10561 3572 19439 15296 22245 20895 29707
10067B9707O867l1867k575j100K9947J4040k6056o670J015R321m8274k9403M1615
$$ 29707 36574 4707 2132 1032 30979 45019 18963 12293 13308 22629 -25645 -55048 -13433
10054a3433J8435l353k658O651L645J575k20M342M6295J9497k5115J7767O5114
$$ -13433 5002 1649 -1009 5642 9287 10862 10642 14984 61279 80776 55661 73428 138542
10041A38542j1989j98j314l7363J2071l873l0209m5734P3970j2026J1532M0886
$$ 138542 126553 126355 125041 87678 99749 95876 65667 19933 93903 81877 93409 134295
10029A34295m8502m6430Q448L157n185J0101J1567J4520q835j9861j2728l1726
$$ 134295 85793 39363 47811 50968 45783 55884 67451 81971 73136 53275 40547 8821
10017H821j9161O2789L2300m6010j9761n5438j5145r062J5326J9419j3715J7765
$$ 8821 -10340 52449 84749 38739 18978 -36460 -51605 -60667 -45341 -25922 -39637 -21872
10005b1872J0499k1101J2347m5935k1241L5804K5022J5090j3615k8887L5526P2625
$$ -21872 -11373 -32474 -20127 -66062 -87303 -51499 -26477 -11387 -25002 -53889 -18363 54262
9993E4262j6283l3203J3879R64m286K6205J7399m233n3269j4534K1983L7547K1254
$$ 54262 37979 4776 18655 19619 15333 41538 58937 54704 1435 -13099 8884 46431 67685
9980F7685J1536k3526M4568M0845j5303k2473j0122j5655l9323j0161p848J1142
$$ 67685 79221 55695 100263 141108 125805 103332 93210 77555 38232 28071 20223 31365
9968C1365L7908p025n1827Q045M1899J8798o081J5006l3725l7751J5252Q989j7212
$$ 31365 69273 62248 10421 18466 60365 79163 73082 88088 54363 16612 31864 40853 23641
9955B3641l6914K2211K3848P591J9347R943L754j15o942j4206j4722O763m808
$$ 23641 -13273 8938 32786 40377 59724 69667 73421 73306 66364 52158 37436 44199 39391
9942C9391N83r772j5987J2209R421K7668l2661l801l640L45m3041J373N273N7710
$$ 39391 39974 30202 14215 26424 35845 63513 30852 27051 23411 23756 -19285 -17912 -12639 45071
9928D5071j8542k3529j2170M9676J7206J419L5870j1852n758j9652L807K9201
$$ 45071 26529 3000 -9170 40506 57712 59131 95001 83149 77391 57739 61546 90747
9916I0747M815j0465L149J9143k3081m5205l3226j0069j1424N78m1192K0072O0096
$$ 90747 95562 85097 88246 107389 84308 39103 5877 -4192 -15616 -15038 -56230 -36158 23938
9903B3938L6496M0988m9029k4669J8520O959K201l1956j8741N1775M058o1722
$$ 23938 60434 101422 52393 27724 46244 53203 55404 23448 4707 56482 60540 -1182
9891a182k7263j2211L8300L6013K7454J9353k0744n0771O125k4001j7545Q5182
$$ -1182 -28445 -40656 -2356 33657 61111 80464 59720 8949 15074 -8927 -26472 58710
9879E8710L9569J2587J1984k7922k5819L532j6528j9712l9086o581P8j0334J9217
$$ 58710 98279 110866 122850 94928 69109 72641 56113 36401 -2685 -9266 -9188 -19522 -305
9866c05K4138M933J4661J2297J1000M993j012m961l1983j9561J2997k6106J3315
$$ -305 23833 28766 43427 55724 66724 71717 70705 65744 33761 14200 27197 1091 14406
9853A4406M9757K3517n660j9767k5101j8786k2228j5936l1238K9823N3036o493
$$ 14406 64163 87680 82020 62253 37152 18366 -3862 -19798 -51036 -21213 31823 25330
9841B5330q525K8550K674O027j2290j7065o4593j2751L7334M4K7956k7481p0793
$$ 25330 16805 45355 48029 54056 41766 24701 -39892 -52643 -15309 -15265 12691 -14790 -85583
9828h5583o976j894K0436J3619K3879O6120o877N926K73o137q006q909j1220L4620
$$ -85583 -92559 -94453 -74017 -60398 -36519 29601 22724 28650 28923 22786 14780 5871 -5349 29271
9814B9271m937k5705O968M5057J9712M755p812J0255K5895q0002k6266K5756l2082
$$ 29271 24334 -1371 5597 50654 70366 75121 67309 77564 103459 23457 -2809 22947 -9135
9801i135j8003J6376K4869L9153k8202k7921J8401O436J4070j1607P462j69l1782
$$ -9135 -27138 -10762 14107 53260 25058 -2863 15538 21974 36044 24437 31899 31730 -52
9788e2j2656L7988K4936J4735j4769l6676j4935n8035R584N1867L402j2456L4723
$$ -52 -12708 25280 50216 64951 50182 13506 -1429 -59464 -49880 1987 5389 -7067 27656
9775B7656n690m022J6281l1869j3039M6988N428j8050J1878J0759m5407j1064
$$ 27656 21966 17944 34225 2356 -10683 36305 41733 23683 35561 46320 913 -10151
9763a0151N829r316l144L0862L8457j6667k2137p7705R841L0785l460r178M854
$$ -10151 -4322 -13638 -16782 14080 52537 35870 13733 -63972 -54131 -23346 -26806 -35984 -31130
9750c1130k8010q353O0778J7745l11k0929n08N339K9042J1720j1335n3553m737
$$ -31130 -59140 -67493 -6715 11030 10719 -10210 -10718 -5379 23663 35383 24048 -29505 -34242
9737c4242o782J4263J420l125K0769J0921O925j9278j051J7923K90R804N2839
$$ -34242 -41024 -26761 -25341 -28466 -7697 3224 10149 -9129 -10180 7743 8033 17837 70676
9724G0676j8858j1082J1746j0233j3317J6473K0028k6770J3821k8244j6313K275
$$ 70676 51818 40736 52482 42249 28932 45405 65433 38663 52484 24240 7927 10202
9712A0202k0790j7741n969L6558J0592l0653K8031m4201L674K9242m4358k6481
$$ 10202 -10588 -28329 -34298 2260 12852 -17801 10230 -33971 -30297 -1055 -45413 -71894
9700g1894J2674K9783M1598J803J3552J8158j2495j9463J316k1061J6781K3339
$$ -71894 -59220 -29437 12161 13964 27516 45674 33179 13716 15032 -6029 10752 34091
9688C4091k0563J4155L5660k4173n2378l0462K1861K4340j2289o622L7290j557
$$ 34091 13528 27683 63343 39170 -13208 -43670 -21809 2531 -9758 -16380 20910 19353
9676A9353o614L6023k3909k5147O930j9773j3599j9353K6319K3004n938j8487
$$ 19353 12739 48762 24853 -294 6636 -13137 -26736 -46089 -19770 3234 -2704 -21191
9664b1191J5043o792o137q984p489M1552O8951O775n1094J6078M0762K0741J2351
$$ -21191 -6148 -12940 -19077 -28061 -35550 6002 74953 81728 30634 46712 87474 108215 120566
9651A20566K4160L6117J7967N401k5980j087O0809J19986R2522Q3423J00713J00348
$$ 120566 144726 180843 198810 204211 178231 177144 237953 357939 450461 533884 634597 734945
9639G34945K08948L98808O17739J018414J737137K544855K432527p0412k119403
$$ 734945 943893 1342701 1960440 2978854 4715991 7260846 9693373 9622961 7503558
9630G503558j903427j395431j076554q10580n33561l97919l13479j99336j40289
$$ 7503558 5600131 4204700 3128146 2317566 1784005 1386086 1072607 873271 732982
9621G32982j28697q3881q6006n4283l0061O230m0260p1981k2309J707l8243J8645
$$ 732982 604285 520404 434398 380115 350054 356284 316024 244043 221734 223441 185198 203843
9609B03843m463m1217k8491j3788p565k2491j4126K3065M0787j4586l0021k6582
$$ 203843 199380 158163 129672 115884 108319 85828 71702 94767 135554 120968 90947 64365
9597F4365k0894R86j0476K41j7419p34K2039n9263k1086L8238j4702K5987J1538
$$ 64365 43471 44457 33981 34222 16803 16069 38108 -21155 -42241 -4003 -18705 7282 18820
9584A8820l9423o076j5212J3966L5457N0965J0986l2792m4220K16K9911J5540
$$ 18820 -20603 -26679 -41891 -27925 7532 58497 69483 36691 -7529 -7313 22598 38138
9572C8138K4332k1354j3777J1206K674K038n8177l5464k4160L7479l6147j5131
$$ 38138 62470 41116 27339 38545 41219 43257 -14920 -50384 -74544 -37065 -73212 -88343
9560h8343N4396J1762J9644k333l0612J4852k322J7216J5937N2912o257k054M027
$$ -88343 -33947 -22185 -2541 -4874 -35486 -20634 -22956 -5740 10197 63109 56852 54798 58825
9547E8825k5130k7250l8591k2587L5658L7050J7819K581n005l2173j9254J1652
$$ 58825 33695 6445 -32146 -54733 -19075 17975 35794 38375 33370 1197 -18057 -6405
9535f405L2049j6420k4069m279K9856k448j9180P770K6352J3698k3422m2718m683
$$ -6405 25644 9224 -14845 -19124 10732 8284 -10896 -3126 23226 36924 13502 -29216 -33899
9522c3899M9516K0807R171L9j6295O893j4702M437k0368j4065K1223j8544j9628
$$ -33899 15617 36424 45595 45634 29339 36232 21530 25967 5599 -8466 12757 -5787 -25415
9509b5415j6235k8053k121L0008O793R559J166r367L7498O0616J3881l8835l0262
$$ -25415 -41650 -69703 -71824 -41816 -35023 -25464 -24298 -33665 3833 64449 78330 39495 9233
9496I233n297O40R921q385Q710o816j0479o785J0682R015J9987O595m9686J0058
$$ 9233 3936 4576 14497 6112 14822 8006 -2473 -9258 1424 10439 30426 37021 -12665 -2607
9482b607L6264l6835k0054O661j2415O292j1855q423J5639J1222L3282j8160O052
$$ -2607 33657 -3178 -23232 -16571 -28986 -22694 -34549 -42972 -27333 -16111 17171 -989 5063
9469E063P362r201j0127J9711j5674K0627N2611o00R691j266m1913N779P894J0956
$$ 5063 12425 3224 -6903 12808 -2866 17761 70372 69772 79463 78197 36284 42063 49957 60913
9455F0913m3254n511j759J1867l5704p6333j5650J4822M2498J7923J7978J7687
$$ 60913 17659 12148 10389 22256 -13448 -89781 -105431 -90609 -48111 -30188 -12210 5477
9443E477J4514N049n8050J4334k1116j2733K6928p237l516j9694K6563L3065R594
$$ 5477 19991 25040 -33010 -18676 -39792 -52525 -25597 -32834 -36350 -56044 -29481 3584 13178
9430A3178l7724j318J585k1774J5704J1279Q635j8325K1341N402l3878l9045P3022
$$ 13178 -24546 -25864 -24279 -46053 -30349 -19070 -10435 -28760 -7419 -2017 -35895 -74940 -1918
9417a918L5974l3092k8013j7832j4335l514j1421J5153K8867r286m0525j2655
$$ -1918 34056 964 -27049 -44881 -59216 -62730 -74151 -58998 -30131 -39417 -79942 -92597
9405i2597J9589P295M669k859L35m1164L5912O580L5571n6200o331K6154N2349
$$ -92597 -73008 -65713 -61044 -63903 -63568 -104732 -68820 -62240 -26669 -82869 -89200 -63046 -10697
9392a0697K6005l4094j7116K7281J2550j9813l5974l524J2346O082L0489j4790
$$ -10697 15308 -18786 -35902 -8621 3929 -15884 -51858 -55382 -43036 -36954 -6465 -21255
9380b1255k6433Q383L3478k4676l9163j2283L0423M5838k9664L598l568R698J3615
$$ -21255 -47688 -39305 -5827 -30503 -69666 -81949 -51526 -5688 -35352 -31754 -35322 -25624 -12009
9367a2009m4047J3249J0014K5311J0439m9624j1444K9241M359l7611k0620l048
$$ -12009 -56056 -42807 -32793 -7482 2957 -46667 -58111 -28870 -24511 -62122 -82742 -85790
9355h5790M783M4496J1083p16M697k6725k7107N618j9734j6672o621L1436M5511
$$ -85790 -81007 -36511 -25428 -26144 -21447 -48172 -75279 -69661 -89395 -106067 -112688 -81252 -35741
9342c5741j5967j0262J4592Q617j713J8415l999m398L2505l0136k0466l5039o2406
$$ -35741 -51708 -61970 -47378 -38761 -40474 -22059 -26058 -30456 2049 -28087 -48553 -83592 -145998
9329a45998l0291K7267M8217M4991P372r729k7925j1207K4783L3696o33j5410
$$ -145998 -176289 -149022 -100805 -55814 -48442 -58171 -86096 -97303 -72520 -38824 -39457 -54867
9317e4867m2262o69M8923L7100R91j0712M7751R790m958l9274l0540k4113J6082
$$ -54867 -97129 -97798 -48875 -11775 -10784 -21496 26255 36045 31087 -8187 -38727 -62840 -46758
9304d6758k069K9478O3614J6410j8429l0587k4326k6718J0357K1174m921J4444
$$ -46758 -48827 -19349 44265 60675 42246 11659 -12667 -39385 -29028 -7854 -12775 1669
9292A669M2915K2689N8492L2342L8560P5534R7845O8292P5068J19435J19989Q7911
$$ 1669 44584 67273 125765 158107 196667 272201 370046 438338 513406 632841 752830 840741
9280H40741P7431N2463M2612K2817m1195o3237n2403m1484p7999j12367n6942
$$ 840741 918172 970635 1013247 1036064 994869 931632 879229 837745 759746 647379 590437
9269E90437l9798j37209j04963p0327p5920l2453o532J4629K059r284r177m2032
$$ 590437 550639 413430 308467 238140 162220 129767 123235 137864 139923 130639 121462 79430
9257G9430p1759l2733r935P179K5354J4908m5959o209N9549n426J6938j5153l7059
$$ 79430 7671 -25062 -34997 -27818 -2464 12444 -33515 -39724 19825 14399 31337 16184 -20875
9244b0875l3562q222k0554k4985J4828J9290J2400O184m3954k0471m472J9451
$$ -20875 -54437 -62659 -83213 -108198 -93370 -74080 -61680 -55496 -99450 -119921 -124393 -104942
9232a04942L6519J3155j1203L888K3227J3156J2882M8310q223p0176l7325j3944
$$ -104942 -68423 -55268 -66471 -62583 -39356 -26200 -13318 34992 26769 -43407 -80732 -94676
9220i4676K2486j2120J0533J6380K1330j7828k7623k3978J4849J865M5569L6713
$$ -94676 -72190 -84310 -73777 -57397 -36067 -53895 -81518 -105496 -90647 -88782 -43213 -6500
9208f500k7792L0718q276m3453j1835J9102k5938k5055J5487N292M682J813k6769
$$ -6500 -34292 -3574 -11850 -55303 -67138 -48036 -73974 -99029 -83542 -78250 -73568 -71755 -98524
9195i8524j6260m4328R967N0067J4286J1220K718R724l0184J6756L4073N2892
$$ -98524 -114784 -159112 -149145 -99078 -84792 -73572 -70854 -61130 -91314 -74558 -40485 12407
9183A2407L6097n774k1326k8370l4069J1931J5572l8411m7993l1303J7269K2379
$$ 12407 48504 42730 21404 -6966 -41035 -29104 -13532 -51943 -99936 -131239 -113970 -91591
9171i1591J8040L796n899l3657j362J7553L8091K0458l6820J521N168k3261o91
$$ -91591 -73551 -69755 -75654 -109311 -110673 -93120 -55029 -34571 -71391 -69870 -64702 -87963 -88654
9158h8654J8595q481R713r546n249K4666N801K3583m1789l2105M2012K1872k6382
$$ -88654 -70059 -78540 -68827 -78373 -83622 -58956 -53155 -29572 -71361 -103466 -61454 -39582 -65964
9145f5964l9893m813R792J0684k3938m536M7999M1418N2889J3451Q458J2235L9473
$$ -65964 -105857 -110670 -100878 -90194 -114132 -118668 -70669 -29251 23638 37089 45547 57782 97255
9132I7255m0176m1068n0302o35q435k3730J7567J6737l9982k7709j9366K5994
$$ 97255 57079 16011 -34291 -34926 -43361 -67091 -49524 -32787 -72769 -100478 -119844 -93850
9120i3850k310K817j325m574j4704J0818k103N069o614J3413j0470k4353j886
$$ -93850 -96160 -93343 -94668 -99242 -113946 -103128 -105231 -100162 -106776 -93363 -103833 -128186 -130072
9107a30072J2445L2396K938J2502J5892J7704r210o2446m6115m5838k3825l3935
$$ -130072 -117627 -85231 -82293 -69791 -53899 -36195 -45405 -107851 -153966 -199804 -223629 -257564
9095b57564j512N0249Q3457L2494J7120q815l7390M0171J2480n3241m298j6276
$$ -257564 -259076 -208827 -125370 -92876 -75756 -84571 -121961 -81790 -69310 -122551 -126849 -143125
9083a43125q27J1814j7754n939l179L2140L7587M546r771k4384k2776k7880N132
$$ -143125 -143952 -132138 -149892 -155831 -159010 -126870 -89283 -84737 -94508 -118892 -141668 -169548 -164416
9070a64416M7596M8426m266Q145L4013L9374K6174j1417k0536n2611k8531J4941
$$ -164416 -116820 -68394 -72660 -64515 -30502 8872 35046 23629 3093 -49518 -78049 -63108
9058f3108L9349l2290k0618N1688J7961q0398m7870r295M1698M5159n067k7377
$$ -63108 -23759 -56049 -76667 -24979 -7018 -87416 -135286 -144581 -102883 -57724 -62791 -90168
9046i0168j1576n2686j7747K2934q283K1116K5731P5973M9475K4481M9356J6607
$$ -90168 -101744 -154430 -172177 -149243 -157526 -136410 -110679 -34706 14769 39250 88606 105213
9034A05213J890o1098j0142j3606p030p1262n6583K7740J676m0709j1318p098
$$ 105213 107103 46005 35863 22257 15227 -56035 -112618 -84878 -83202 -123911 -135229 -142327
9022a42327j1267J2427k1518J1115m2517k4043K9432J4939J750O1602N6587j056
$$ -142327 -153594 -141167 -162685 -151570 -194087 -218130 -188698 -173759 -172009 -110407 -53820 -54876
9010e4876J9952M0514L9831M61J2451l2539o0676l8456j8357p52J9028J4325K5791
$$ -54876 -34924 5590 45421 45882 58333 25794 -34882 -73338 -91695 -92447 -73419 -59094 -33303
8997c3303l9224p825N73r526n042m408J7685n0011j9221l8685M049L5810K5941
$$ -33303 -72527 -80352 -79779 -89305 -94347 -98755 -81070 -131081 -150302 -188987 -184938 -149128 -123187
8984a23187q879j982M0185P884k324J8591k0645k8485q531L0076L4600K5654m949
$$ -123187 -132066 -134048 -93863 -85979 -88303 -69712 -90357 -118842 -127373 -97297 -62697 -37043 -41992
8971d1992j4459j3982K5475l2971l7135j7584J2762J3714M7384M0454M5012M3027
$$ -41992 -56451 -70433 -44958 -77929 -115064 -132648 -119886 -106172 -58788 -18334 26678 69705
8959F9705j9672Q259K6076k1007j3425J0907k4104N489M3122j2295k606k3844
$$ 69705 50033 58292 84368 63361 49936 60843 36739 42228 85350 73055 70449 46605
8947D6605n209J4824N9287L9129K2022k585N2968P7611O7929M2619L631l9110
$$ 46605 41396 56220 115507 154636 176658 174073 227041 304652 372581 415200 418831 379721
8935C79721l1689J1870O8729O2080K8463M859J9174R7950J01594K3593N4421R0727
$$ 379721 348032 359902 428631 490711 519174 524033 543207 641157 742751 766344 820765 911492
8923I11492O0499J13493J61403J28632J50075J13840J20773J37241J58175J60717
$$ 911492 971991 1085484 1246887 1375519 1525594 1639434 1760207 1897448 2055623 2216340
8913B216340J90093K22689K68834K81447L06953L76264L61083L92407M81666N52403
$$ 2216340 2406433 2629122 2897956 3179403 3486356 3862620 4223703 4616110 5097776 5650179
8903E650179O46501P59223Q99314J075776J285578J570870J872685K240899K688661
$$ 5650179 6296680 7055903 7955217 9030993 10316571 11887441 13760126 16001025 18689686
8894A8689686L108017L503459M014758M730627N968022P923295J0822617J5038031
$$ 18689686 21797703 25301162 29315920 34046547 40014569 47937864 58760481 73798512
8886G3798512K1280207L0199498M1952098N4360068N9765899M5438949Q294306
$$ 73798512 95078719 125278217 167230315 221590383 281356282 326795231 335089537
8879C35089537k9089571m5851701m6318977m0660645l3523424k6615651k0706486
$$ 335089537 305999966 260148265 213829288 173168643 139645219 113029568 92323082
8872I2323082j5890916j2125413r196077p080643n608044m573527l978161l562053
$$ 92323082 76432166 64306753 55110676 48030033 42421989 37848462 33870301 30308248
8864C0308248l183705k833640k409207k056694j851467j597639j405034j277721
$$ 30308248 27124543 24290903 21881696 19825002 17973535 16375896 14970862 13693141
8856A3693141j091165r28298q23846p27330o54832n68951n13033m73614l78629
$$ 13693141 12601976 11673678 10849832 10122502 9467670 8898719 8385686 7912072 7533443
8847G533443l38937l95018l39840l06621k62532k87263k86043k33676j87920j80587
$$ 7533443 7194506 6799488 6459648 6153027 5890495 5603232 5317189 5083513 4895593 4715006
8837D715006j77051j35703r5485j48776j52068q8485q3919o8395k9964o0189j14653
$$ 4715006 4537955 4402252 4306767 4157991 4005923 3917438 3833519 3765124 3735160 3674971 3560318
8826C560318j14732j28947j60309j66785p2931r211o0030o4724o2279j10750r9083
$$ 3560318 3445586 3316639 3156330 2989545 2916614 2907403 2847373 2782649 2720370 2609620 2510537
8815B510537p1484o2286k3183m4540o8936q7207p3195l9271o8787r8182n5529
$$ 2510537 2439053 2376767 2353584 2309044 2240108 2152901 2079706 2040435 1971648 1873466 1817937
8804A817937m1247m2745j2443l981l8435p1548k4365o1692o278J4929j4884q503
$$ 1817937 1776690 1733945 1721502 1717521 1679086 1607538 1583173 1521481 1515203 1530132 1515248 1506745
8792A506745J4131J1133l9277m3603k1454k8710l5585j9001q200k3313l9053j4787
$$ 1506745 1520876 1532009 1492732 1449129 1427675 1398965 1363380 1344379 1336179 1312866 1273813 1259026
8780A259026k5016j5097l7398j3110J7895J6141L1626K514m5740k4140j3226n6730
$$ 1259026 1234010 1218913 1181515 1168405 1186300 1202441 1234067 1236581 1190841 1166701 1153475 1096745
8768A096745m1250m0469j7624n19L3332J4921l1603P278l8724J0193n312j207
$$ 1096745 1055495 1015026 997402 996883 1030215 1045136 1013533 1020811 982087 992280 986968 985761
8756I85761l9626k2247k3177n5956n6164K4812L6576L9313l5735j9964m010k0814
$$ 985761 946135 923888 900711 844755 788591 813403 849979 889292 853557 833593 829583 808769
8744H08769K1408l0952j3597J5079j1323P428M977j8988k6164k6140k1109j8002
$$ 808769 830177 799225 785628 800707 789384 796812 801789 782801 756637 730497 709388 691386
8732F91386k2082p9379p6676j4451j7337J6549J8020L7417j7723Q138o220o781
$$ 691386 669304 589925 513249 498798 481461 498010 516030 553447 535724 543862 537642 530861
8720E30861K3455R127k0467Q990L2770L4421j4817p348q458l255j5349k2713K8897
$$ 530861 554316 563443 542976 551966 584736 619157 604340 596992 588534 585279 569930 547217 576114
8707E76114j5166k083j851l3701k2010L628K0045m3407j9949K1734k1955k5352
$$ 576114 560948 558865 557014 523313 501303 504931 524976 481569 461620 483354 461399 436047
8695D36047k6781M5392p381J6289l596J3773L6201l236L3470k5319k918L0573
$$ 436047 409266 454658 447277 463566 459970 473743 509944 506708 540178 514859 511941 542514
8683E42514P426j6111l1846o513k0508J1140L2215Q269K1574l0171k0111k2223
$$ 542514 549940 533829 501983 495470 474962 486102 518317 526586 548160 517989 497878 475655
8671D75655l9829L6533R192j1815j8516M013J2941k1203k0220K0608K7154K2477
$$ 475655 435826 472359 481551 469736 451220 455233 468174 446971 426751 447359 474513 496990
8659D96990L7851l4798r709J2540k4898j9970k5776L7701L516j6854n9472k9991
$$ 496990 534841 500043 490334 502874 477976 458006 432230 469931 473447 456593 397121 367130
8647C67130j6174K613K3531K1200j9692n0432q147K4926J9442M679M676M919K003
$$ 367130 350956 353569 377100 398300 378608 328176 320029 344955 364397 369076 373752 378671 380674
8634C80674j4225J8403K4746K4568j1853p612R100j711K363n669l6841j5187J3789
$$ 380674 366449 384852 409598 434166 422313 414701 423801 422090 424453 418784 381943 366756 380545
8621C80545K7496j9672L778J6269l4308K8047K3515O778K3506l230l6160j4518
$$ 380545 408041 388369 392147 408416 374108 402155 425670 432448 455954 452724 416564 402046
8609D02046n2366l3813Q513j8529K1517L0813J7453K1645j5870j7228m0230k417
$$ 402046 349680 315867 324380 305851 327368 358181 375634 397279 381409 364181 323951 321534
8597C21534P664M8996M3526r797m2173k0945r669k459K2599K8811k5803j4457
$$ 321534 329198 378194 421720 411923 369750 348805 339136 336677 359276 388087 362284 347827
8585C47827J074j5764j0588l1502m0937J4335q695j0771j7629J1520M4123N4465
$$ 347827 348901 333137 322549 291047 250110 264445 255750 244979 227350 238870 282993 337458
8573C37458K7264j4911n0472j2702N6698R555l5123n9800J908K6871P6198n300
$$ 337458 364722 349811 299339 286637 343335 352890 317767 257967 259875 286746 362944 357644
8561C57644P273l5075k7353Q112l873j9785p727l069M705L4885J6571l1104l5197
$$ 357644 364917 329842 302489 310601 306728 286943 279216 276147 280852 315737 332308 301204 266007
8548B66007o469M5488J6949q919l109O355L6561l5551o1093q452r821K1634M7361
$$ 266007 259538 305026 321975 313056 309947 316302 352863 317312 256219 247767 237946 259580 306941
8535C06941l0281j174M3001O684k7285n5881l542J3555K702K8782J2718O618l339
$$ 306941 276660 275486 318487 325171 297886 242005 238463 252018 254720 283502 296220 302838 299499
8522B99499j2241N172m220J2746j5811J776L2397j0666L3430J6305n362J895k3636
$$ 299499 287258 292430 288210 300956 285145 286921 319318 308652 342082 358387 353025 354920 331284
8509C31284j1756J1121r296l0348k8615l752J0235K9381L6108J1307n384l966
$$ 331284 319528 330649 321353 291005 262390 258638 268873 298254 334362 345669 340285 336319
8497C36319k7810J5523O7730N8792j587l470K1690K3909j3605O82R1325P8303
$$ 336319 308509 324032 391762 450554 448967 445497 467187 491096 477491 478173 569498 647801
8485F47801N8191P6687N7567J02163J25773J18951J36565J07035O022J1833l7223
$$ 647801 705992 782679 840246 942409 1068182 1187133 1323698 1430733 1436755 1448588 1411365
8474A411365o9341q4676j20928j17068q7366p6156q1979r9887p7175m2794n649
$$ 1411365 1342024 1257348 1136420 1019352 931986 855830 773851 673964 596789 553995 548346
8463E48346k0689m4077m0335J2824j6807n5355n5246R47O04m081K3326J0413N3878
$$ 548346 527657 483580 443245 456069 439262 383907 328661 329608 330212 326131 349457 359870 413748
8450D13748J8760k9419j6426l1734q085M380m6254k7282K3272p538l7833J6638
$$ 413748 432508 403089 386663 354929 346844 351224 304970 277688 300960 293422 255589 272227
8438B72227O811k119M7008J1032m4243p711Q929k1916Q928k2103K866K3113R213
$$ 272227 279038 276919 323927 334959 290716 283005 291934 270018 278946 256843 259709 282822 292035
8425B92035l8174k8979J9356N8011j2982l3513L67K2761J2295m991k9540N58M2497
$$ 292035 253861 224882 244238 302249 289267 255754 256121 278882 291177 286186 256646 257204 299701
8412B99701N3263M1566J8776j1670n0332l2807K089k0722k2846k5057L3319p662
$$ 299701 352964 394530 413306 401636 351304 318497 320586 299864 277018 251961 285280 277618
8400B77618j2647J7944J317k8159p088J9217J0256J1821j041j9328k994l036k6301
$$ 277618 264971 282915 284232 256073 248985 268202 278458 290279 289238 269910 266916 263880 237579
8387B37579M0723K339j954j4501p3j7770l0481Q2621M4596o996j7399n653o4650
$$ 237579 278302 280641 278687 264186 264113 246343 215862 298483 343079 336083 318684 313031 248381
8374B48381m2466J5747j3646k3791J2588L7778N6754k198l870l5931l4011K874
$$ 248381 205915 221662 208016 184225 196813 234591 291345 289147 285277 249346 215335 218209
8362B18209J7639l0184k392J9097l6575M77j3789K0882O6230O68l3384k3034p128
$$ 218209 235848 205664 203272 222369 185794 186271 172482 193364 259594 260262 226878 203844 196716
8349A96716O2654M6003K0611P4636k6864k9634L1960l7512M428l742m9438m7711
$$ 196716 259370 305373 325984 400620 373756 344122 376082 338570 342998 339256 289818 242107
8337B42107n10j1112J9887O7491n0215n9990P312r00j3027L3799L1308l3620m359
$$ 242107 241597 230485 250372 317863 267648 207658 214970 214070 201043 234842 266150 232530 228171
8324B28171p174q74J803n3533O1665L8690m04m7831j4197K4002Q310J5288J4567
$$ 228171 220997 220123 221926 168393 230058 268748 268344 220513 206316 230318 238628 253916 268483
8311B68483O2243K4678m5529p6421K4205Q0J7168L5491Q5655N5549J3826m6450
$$ 268483 330726 355404 309875 233454 257659 257739 274907 310398 396053 451602 465428 418978
8299D18978m6025n3749l3017o835K4075l2210l622N2646K3446m9026j4930k6653
$$ 418978 372953 319204 286187 279352 303427 271217 267595 320241 343687 294661 279731 253078
8287B53078m367O196m0940l6L3570K2059K9493K5112n5777l3247N459k5196J6051
$$ 253078 248711 254907 213967 213931 247501 269560 299053 324165 268388 235141 240600 215404 231455
8274B31455K0592J6905M736K0644M851j6005j7478k013n335M991j5557q689k501
$$ 231455 252047 268952 273688 294332 299183 283178 265700 263687 258352 263343 247786 239097 236596
8261B36596K1728M2090j3326j486J9042o5048J9527O1578K1566j6032m9264k1949
$$ 236596 258324 300414 287088 285602 304644 239596 259123 320701 342267 326235 276971 255022
8249B55022k8726m6954P692J8734J9114K6517P786l5741k573k6860k3581L7295
$$ 255022 226296 179342 187034 205768 224882 251399 259185 223444 220871 194011 170430 207725
8237B07725K9577k129K8396j377j9023J5592K9076j9404k0110j367k4400o148
$$ 207725 237302 235173 263569 262192 243169 258761 287837 268433 248323 246956 222556 216408
8225B16408O758N8832L922k8672m1510L214L4973K0348o237J7286j4418j6268
$$ 216408 223166 281998 285920 257248 215738 218952 253925 274273 268036 285322 270904 254636
8213B54636l190j8968J9101K7342K269k246j1866j1079k0333m875j7404m3959
$$ 254636 251446 232478 251579 278921 281190 278944 267078 255999 235666 230791 213387 169428
8201A69428Q941J2139J9353j120K0570J8154K1731j01l1646k2309j3340J5653
$$ 169428 178369 190508 209861 208741 229311 247465 269196 269095 237449 215140 201800 217453
8189B17453J1060K7123j4643k3615L442M625L9528P341j8636l1204j4397J7928
$$ 217453 228513 255636 240993 217378 220820 225445 264973 272314 253678 222474 208077 226005
8177B26005L3936j1858K891j7267O003N3379k5379n1712O267P94q13j864J019
$$ 226005 259941 248083 250974 233707 239710 293089 267710 215998 222265 223059 222246 220382 221401
8164B21401j0438m548O969j1205j2846L0797l1824k1951N393J6589L4065q5j8251
$$ 221401 210963 206415 213384 202179 189333 220130 188306 166355 171748 188337 222402 222317 204066
8151B04066l5518k3270K2731k3041l2796L599N859L1959l342l074M311j3657K1480
$$ 204066 168548 145278 168009 144968 112172 115771 121630 153589 150247 147173 151484 137827 159307
8138A59307N9645J6657J9415j0612l2481l7650l5783j2834L2422j2554L6968M0059
$$ 159307 218952 235609 255024 244412 211931 174281 138498 125664 158086 145532 182500 222559
8126B22559K2111L7271j5098p0120l9388n5349q358K151K6384K8372j4909R337
$$ 222559 244670 281941 266843 196723 157335 101986 93628 95779 122163 150535 135626 144963
8114A44963J4789k8278k3890R460J6638M543l572j4002j3683R962k2227M0667
$$ 144963 159752 131474 107584 117044 133682 138225 134653 120651 106968 116930 94703 135370
8102A35370K2965j4865m3686j8451K2960K0353o267r248m8155J3309M2814j4809
$$ 135370 158335 143470 99784 81333 104293 124646 118379 109131 60976 74285 117099 102290
8090A02290l1382j2208K2336J6819L5240K9421k5182j8704N301J0846k8966J6085
$$ 102290 70908 58700 81036 97855 133095 162516 137334 118630 123931 134777 105811 121896
8078A21896J2430j149K205L6203j3440j1884M1844j1862n5283o699M9362m723
$$ 121896 134326 133177 135382 171585 158145 146261 188105 176243 120960 114261 163623 158900
8066A58900K309j8690j4628k3341j6241l0337J9273K9386N420k429O235J7895
$$ 158900 161209 142519 127891 104550 88309 57972 77245 106631 112051 109622 115857 133752
8054A33752M577o47q480j9062m4808J4761M2190O962m759J5095q159q994K51M809
$$ 133752 138329 137682 129202 110140 65332 80093 122283 129245 124486 139581 131422 122428 122679 127488
8040A27488j3310R623j025k0876l941J7542j9932N563L7055J3955J3039L5973
$$ 127488 114178 123801 122776 101900 97959 115501 95569 101132 138187 152142 165181 201154
8028B01154J5417m3081k3257L5684p589k8549R318j7854J5008n356l8047N1422
$$ 201154 216571 173490 150233 185917 178328 149779 159097 141243 156251 150895 112848 164270
8016A64270K2220j2656k8453m434k480o937N308j6115j5332k6914k6659k2578
$$ 164270 186490 173834 145381 140947 138467 131530 136838 120723 105391 78477 51818 29240
8004B9240O656O6632N735O864J4474P095K0059j6793l1595q03N540K4909K636
$$ 29240 35896 102528 108263 115127 129601 136696 156755 139962 108367 107564 113104 138013 140649
7991A40649O484K3189K3268k0512o5132j6851M2405O676l01L6311j3090j6350
$$ 140649 147133 170322 193590 173078 107946 91095 133500 140176 139875 176186 163096 146746
7979A46746j9873k5287o9944n1733N8131O6975O367k2682j0645k398K2183R237
$$ 146746 126873 101586 31642 -20091 38040 105015 111382 88700 78055 75657 97840 107077
7967A07077J3070m1976j3553J2112K7184J9143m820K0191m2456l0762R536M4064
$$ 107077 120147 78171 64618 76730 103914 123057 118237 138428 95972 65210 74746 118810
7955A18810M5353J4070l8171n3456J0796k2665l1183M3445o045l5044l046L3863
$$ 118810 164163 178233 140062 86606 97402 74737 43554 86999 80954 45910 42864 76727
7943G6727j7133L8118N4830P554k2544m5773j8107J8767O285R631l5652k0299
$$ 76727 59594 97712 152542 160096 137552 91779 73672 92439 98724 108355 72703 52404
7931E2404K3586L2574k779p694L9300o019k1955j7006K2932L0860l1839l6083
$$ 52404 75990 108564 105785 98091 137391 131372 109417 92411 115343 146203 114364 78281
7919G8281N273j218j8506M170L7374K0301J1937q442j5404l251J4115K8476m4146
$$ 78281 83554 82336 63830 68000 105374 125675 137612 129170 113766 110515 124630 153106 108960
7906A08960l5045l1439m6222M275M5686K5261Q483k3450J065n785K0824k8942
$$ 108960 73915 42476 -3746 529 46215 71476 79959 56509 57574 51789 72613 43671
7894D3671L2682J9903J294J0339n35j210P125p762J7896L376j2146j434k2546
$$ 43671 76353 96256 97550 107889 107354 106144 113269 105507 123403 126779 114633 113199 90653
7881I0653j2132l0503r916j89K6389L2409m6944m2290L8772K467k7176J2383N036
$$ 90653 78521 48018 38102 37913 64302 96711 49767 7477 46249 48716 21540 33923 38959
7868C8959j6150K9564N7678K1988j4755J5967j3994Q743k7084l295R363R861r177
$$ 38959 22809 52373 110051 132039 117284 133251 119257 128000 100916 97621 106984 116845 107668
7855A07668l3553j8762K1497k4333j3526N5645J334k503n090j1501l5340K7136
$$ 107668 74115 55353 76850 52517 38991 94636 95970 93467 88377 76876 41536 68672
7843F8672M0759j7022j2137L4980J0758j4139p963m3733J8441J9314k8318j0294
$$ 68672 109431 92409 80272 115252 126010 111871 103908 60175 78616 97930 69612 59318
7831E9318j3805J7805M1931n39k194q710K6227n604K107j8389n2388K6841J8613
$$ 59318 45513 63318 105249 104710 102516 93806 120033 114429 116536 98147 45759 72600 91213
7818I1213n8879l2735K2134j3414J8532m566k256J9574J6272J9211N6306J0328
$$ 91213 32334 -401 21733 8319 26851 22285 20029 39603 55875 75086 131392 141720
7806A41720m180o6332m2064K3326M3960j5586j3783r619K1190l44k6534m0319
$$ 141720 137540 71208 29144 52470 96430 80844 67061 57442 78632 78288 51754 11435
7794A1435N026K1023J0802L6146L3059l67J4956k9382J0267M239N712n1553L77
$$ 11435 16461 37484 48286 84432 117491 117124 132080 102698 112965 117204 122916 71363 71740
7781G1740P149j4195O508L479J9969Q606Q759j1207J6540l191M5309k1061l6775
$$ 71740 78889 64694 71202 74681 94650 103256 112015 100808 117348 114157 159466 138405 101630
7768A01630j047N129J969R94R418k0284j7206k9214K2820M7943j6013k2656J2927
$$ 101630 100583 105712 107681 108675 118093 97809 80603 51389 74209 122152 106139 83483 96410
7755I6410j0092L3603j155J0703L3842j9788n5448l1708j6279j4069j5098J4111
$$ 96410 86318 119921 118766 129469 163311 143523 88075 56367 40088 26019 10921 25032
7743B5032k3200q19K0086q171n926j4650j0701N4045M4873N4102l9192j9401K917
$$ 25032 1832 1013 21099 12928 7002 -7648 -18349 35696 80569 134671 95479 76078 78995
7730G8995q549j1852k1920J8481K4364K2619r674m209n3855k5681M2504L3443
$$ 78995 70446 58594 36674 55155 79519 102138 92464 88255 34400 8719 51223 84666
7718H4666P491K4662j4957o715q699l1081k3495p643j3002J5965J0514K4389j9783
$$ 84666 92157 116819 101862 95147 86448 55367 31872 24229 11227 27192 37706 62095 42312
7705D2312K3850k0381k1461J6476K4379j0986o128r134K515r373J4208K121K5127
$$ 42312 66162 45781 24320 40796 65175 54189 48061 38927 41442 32069 46277 48398 73525
7692G3525J0639j7258o836j8226l131p692P336K9630m8948k0181O4073L4886j5399
$$ 73525 84164 66906 60070 41844 38713 31021 38357 67987 19039 -1142 62931 97817 82418
7679H2418l9166P076M693O846o460K3165R965n0370l2016K0952J7747j6540j280
$$ 82418 43252 50328 55021 61867 55407 78572 88537 38167 6151 27103 44850 28310 27030
7666B7030n452P164m937p668n398J1243j5544L2270K9108m686K8920O269J5896
$$ 27030 21578 28742 23805 16137 10739 21982 6438 38708 67816 63130 92050 98319 114215
7653A14215J0012p42K1482l3332j4101L5464J4212k0685k6897r898J5905L7381
$$ 114215 124227 123485 144967 111635 97534 132998 147210 126525 99628 89730 105635 143016
7641A43016J7526K1598m861m5817l1840K153j4474j1273j3222r129J406M9960
$$ 143016 160542 182140 177279 131462 99622 101775 87301 76028 62806 53677 55083 105043
7629A05043M1566j6500k4798l2189l8893M7385L6305j2191k9467j2328m675j5374
$$ 105043 146609 130109 105311 73122 34229 81614 117919 105728 76261 63933 59258 43884
7617D3884L2390L7414r503j2680M3922L3489k405k8677k5086l2231N817K001J3402
$$ 43884 76274 113688 104185 91505 135427 168916 166511 137834 112748 80517 86334 88335 101737
7604A01737L1647j6596l0266J943L6166l4370l6854K2191m422l382J9244K8371
$$ 101737 133384 116788 86522 88465 124631 90261 53407 75598 71176 67794 87038 115409
7592A15409J8719M503m2467l1097M0397J7888J3151p780O004m7967n522k0073
$$ 115409 134128 138631 96164 65067 105464 123352 136503 128723 134727 86760 81238 61165
7580F1165J2315J7198K8562j413k9626r739K6028m859o8850n3239L0399K5206
$$ 61165 73480 90678 119240 117827 88201 78462 104490 99631 30781 -22458 7941 33147
7568C3147L4661L1299j104k588j3235O861K3988K2085k0751P802k6200L7352l968
$$ 33147 67808 99107 98003 95415 82180 89041 113029 135114 114363 122165 95965 133317 129349
7555A29349n5941k3670K341k2852J4252l039K9394K9447k5807l2497j375L5223
$$ 129349 73408 49738 52079 29227 43479 40440 69834 99281 73474 40977 39602 74825
7543G4825j3147n2L3760j3195k6205r644k3429m892K4522l930l7733L3102N2785
$$ 74825 61678 61626 95386 82191 55986 46342 22913 18021 42543 38613 880 33982 86767
7530H6767j9800o076l2102j5044K2709K6809J943J1849J1076k1138n2575j0922
$$ 86767 66967 60891 28789 13745 36454 63263 65206 77055 88131 66993 14418 3496
7518C496N7644K241r141j9753k5845l8530N9151M0704K0972p621l4844O385J1874
$$ 3496 61140 63381 54240 34487 8642 -29888 29263 69967 90939 83318 48474 54859 66733
7505F6733j947j3644j1078k5221r882J8663L9297k0211k8205M269J9787K3234
$$ 66733 64786 51142 40064 14843 4961 23624 62921 42710 14505 18774 38561 61795
7493F1795j5647J8528N3613K0412l3733q64R619m205l4071R897j2633k5908K4445
$$ 61795 46148 64676 118289 138701 104968 104104 113723 109518 75447 85344 72711 46803 71248
7480G1248j959j2304l0106L6024L6522j9140N505M3925k7068j959K8686J0596
$$ 71248 69289 56985 26879 62903 99425 80285 85790 129715 102647 100688 129374 139970
7468A39970l8128j9261J1313J3111k5977m0978p332j4473M1120M7733k1092m7264
$$ 139970 101842 82581 93894 107005 81028 40050 32718 18245 59365 107098 86006 38742
7456C8742J9544j9473M409K4864P898K0772k6902M72l3782l8900j2430L9992K9600
$$ 38742 58286 38813 43222 68086 75984 96756 69854 70326 36544 -2356 -14786 25206 54806
7443E4806j1306P851r958k0772l825N0866o268l933O812l0053m7592O862J8431
$$ 54806 43500 51351 41393 20621 16796 67662 61394 57461 64273 34220 -13372 -6510 11921
7430A1921M888n224K2315L4198L7689J993k1535k8690m8769K313M7011J8587m3881
$$ 11921 16809 11585 33900 68098 105787 107780 86245 57555 8786 11099 58110 76697 32816
7417C2816l5313N886L3881K4947l1306m2065L6429J9982k672L464k2809k3735
$$ 32816 -2497 3389 37270 62217 30911 -11154 25275 45257 42585 46049 23240 -495
7405d95Q34o783j8149k6576r771O0247K1744n159o534j7266k4825K6614k935J586
$$ -495 339 -6444 -24593 -51169 -60940 -693 21051 15892 9358 -7908 -32733 -6119 -9054 -7468
7391g468K7652O6793n910N840J026j2812M386K6017l4751p710l5959K9943K3184
$$ -7468 20184 86977 81067 86907 87933 75121 79507 105524 70773 63063 27104 57047 80231
7378H0231K1716O814k4178l4043k1282J7208J3696k29l0731N031P163R907j806
$$ 80231 101947 108761 84583 50540 29258 46466 60162 59933 29202 34233 41396 51303 49497
7365D9497Q954k9454R253K9733J3289k3285l1154N610q300K6711r46J5110J8013
$$ 49497 58451 28997 38250 67983 81272 57987 26833 32443 24143 50854 49908 65018 83031
7352H3031j3408n482m5289o141J1086O245L1644K3280K1680K7718l1329q8089
$$ 83031 69623 64141 18852 12711 23797 30042 61686 84966 106646 134364 103035 14946
7340A4946m9991J7418L3565K0973n9182J8193K9953K1408k9394J8730K3060k1594
$$ 14946 -35045 -17627 15938 36911 -22271 -4078 25875 47283 17889 36619 59679 38085
7328C8085M906K4448J4307l8399j0155j4741J5259k3176m4160J851M9856l463
$$ 38085 42991 67439 81746 43347 33192 18451 33710 10534 -33626 -31775 18081 14618
7316A4618k2658Q057J8824J8341j1632L048J7561J6372K1801k3275j7771j4999
$$ 14618 -8040 17 18841 37182 25550 28598 46159 62531 84332 61057 43286 28287
7304B8287K7723p294J9041Q130j7105j2516j1937j9374k0610l024J8075Q357M9483
$$ 28287 56010 48716 67757 75887 58782 46266 34329 14955 -5655 -8679 9396 17753 67236
7291F7236Q499l3159k2142J5245K204o564k4995J5494L3229n6519l0641N8076
$$ 67236 75735 42576 20434 35679 37883 31319 6324 21818 55047 -1472 -32113 25963
7279B5963j5569K2315N101J5919N318n4583j9958K6204P8753K4632m3581l3731
$$ 25963 10394 32709 37810 53729 59047 4464 -15494 10710 89463 114095 70514 36783
7267C6783o599J520o352J9789j9472o3674K298N0770L2422k9616m0619M380Q447
$$ 36783 30184 31704 25352 45141 25669 -38005 -35707 15063 47485 17869 -22750 -18370 -9923
7254i923P662K0152n911l754R086l5761L036N924k0908j6236J9905M6982M7069
$$ -9923 -2261 17891 11980 8226 17312 -18449 -15413 -9489 -30397 -46633 -26728 20254 67323
7241F7323L9243j9352k8266k0193k1475J1607K3635n07k997K9646l4135n9665
$$ 67323 106566 87214 58948 38755 17280 28887 52522 52015 49018 78664 44529 -15136
7229a5136K6588N6059R666n874j3138k6776j4027j1495L0910K977J3418j5059
$$ -15136 11452 67511 77177 71303 58165 31389 17362 5867 36777 39754 53172 38113
7217C8113J0685k7202J1307K8658j4903j6308J3244K027J7764L192N066J2189
$$ 38113 48798 21596 32903 61561 46658 30350 43594 45621 63385 66577 71643 83832
7205H3832K4994l8643K0044m863p7373n3231n443M9306J9466j9469J2824J9849
$$ 83832 108826 70183 90227 85364 7991 -45240 -50683 -1377 18089 -1380 11444 31293
7193C1293J5170j9224p069K981k3048k3975L3904n5302J1605J5625M8435J3414
$$ 31293 46463 27239 20170 23151 103 -23872 10032 -45270 -33665 -18040 30395 43809
7181D3809L1877J4362k7423n1430L3446M009l1553p051J4790J5561j4833J7198
$$ 43809 75686 90048 62625 11195 44641 48650 17097 10046 24836 40397 25564 42762
7169D2762K2005k1165k1296k2605K2712J4999l0903N929N839K7879m548n0113
$$ 42762 64767 43602 22306 -299 22413 37412 6509 12438 18277 46156 41608 -8505
7157h505n452L9591K2248l2538K1538J3954L932l9524n0982M0987M3677j2717
$$ -8505 -13957 25634 47882 15344 36882 50836 54768 15244 -35738 5249 48926 36209
7145C6209R648M94J277k2365M2480k0950k3758K6345k6131J58o014o3565J1844
$$ 36209 45857 46351 47628 25263 67743 46793 23035 49380 23249 23407 17393 -46172 -34328
7132c4328M3062q389K2907K8037K2416K4527l1286k8608l9733r941j6440L7738
$$ -34328 8734 345 23252 51289 73705 98232 66946 38338 -1395 -11336 -27776 9962
7120I962M1846k3949m3371O54M489J4459j3557l3325K629J9573R085j9378m0885
$$ 9962 51808 27859 -15512 -14858 -10369 4090 -9467 -42792 -40163 -20590 -11505 -30883 -71768
7107g1768p769O714J5078K8807O6405q449p8773J3705L3281K160L005j5831K397
$$ -71768 -79537 -72823 -57745 -28938 37467 29018 -49755 -36050 -2769 -609 2396 -13435 -11038
7094a1038R035J3580k2214p424K3427J2392K1120l9054J0899j0572P835J1792
$$ -11038 -2003 11577 -10637 -18061 5366 17758 38878 -176 10723 151 7986 19778
7082A9778J1216j2342L078p329q556O31k797J7875L2388J220m4145m216l035k5863
$$ 19778 30994 18652 21730 14401 5845 6476 3679 21554 53942 55162 11017 6801 3766 -22097
7068b2097J5975L1988J1334p441J0262k8080m8485J671R052J5409K1546K7492
$$ -22097 -6122 25866 37200 29759 40021 11941 -36544 -34873 -25821 -10412 11134 38626
7056C8626q002q369n2401l3756j1207J0033P263J024J1919j2375J2700j3844k4442
$$ 38626 30624 22255 -30146 -63902 -75109 -65076 -57813 -56789 -44870 -57245 -44545 -58389 -82831
7043h2831n334M8613L8742%J4511j5968J8260n417o679L914r102l588K7930o56
$$ -82831 -88165 -39552 -810 -810 13701 -2267 15993 10576 3897 7811 -1291 -4879 23051 22395
7029B2395K7896N908o0477n2078J6374L2383M9112j4229m3219k4938K2749j4816
$$ 22395 50291 56199 -4278 -56356 -39982 -7599 41513 27284 -15935 -40873 -18124 -32940
7017c2940N7159K2923n0630j4193M1567K1517J7512O114n5401k7647J0108j593
$$ -32940 24219 47142 -3488 -17681 23886 45403 62915 69029 13628 -14019 -3911 -5504
7005e504j8930N7845J5737J7455J4755p7753j6366j0834K5016M5581m267k9855
$$ -5504 -24434 33411 49148 66603 81358 3605 -12761 -23595 1421 47002 42735 12880
6993A2880k4039J709K8408M3363J5808J0719J8728j4832l1539m4339n5277K2516
$$ 12880 -11159 -9450 18958 62321 78129 88848 107576 92744 61205 16866 -38411 -15895
6981a5895L1110K4961j8109M561j1403j4712M2176K7672l013k2905l0054J7650
$$ -15895 15215 40176 22067 26628 15225 513 42689 70361 67348 44443 14389 32039
6969C2039K1308p195K6786l894m2254j6116J4723J1121p916K1444K4672j4061
$$ 32039 53347 46152 72938 69044 26790 10674 25397 36518 28602 50046 74718 60657
6957F0657k4584K305L165j9398L616L968m949J753j3290R099J5021K8656J24k896
$$ 60657 36073 38378 41543 22145 25761 29729 24780 26533 13243 22342 37363 66019 66143 63247
6943F3247q597K695O511l3684j7024K7538K9373J5703K239k1256m6727j7209J8253
$$ 63247 54650 57345 63856 30172 13148 40686 70059 85762 88001 66745 20018 2809 21062
6930B1062K7835j1948J2238K8217k6913o7553k0947N567k7844K1145M992M1605
$$ 21062 48897 36949 49187 77404 50491 -17062 -38009 -32442 -60286 -39141 -34149 7456
6918G456Q2370j0834l7006j1056j972j7994l5449K3224k9167k8623L6495J9518
$$ 7456 89826 78992 41986 30930 28958 10964 -24485 -1261 -30428 -59051 -22556 -3038
6906c038J8692k9640j9286J2201M116M5749N2215j4843l7015k414J7613J6427
$$ -3038 15654 -13986 -33272 -21071 -16955 28794 81009 66166 29151 26737 44350 60777
6894F0777m425l5451r77M8936J4828k1012n5208r661j9830J8568O464O051K3443
$$ 60777 56352 20901 19924 68860 83688 62676 7468 -2193 -22023 -3455 3009 9060 32503
6881C2503k4898j6807L335J9858L328l883j3896k3636n0188l0658K1755J1554
$$ 32503 7605 -9202 -5867 13991 17319 13436 -460 -24096 -74284 -104942 -83187 -71633
6869g1633M580J8623J7882K1326K9911j8408j1264K306J6778K5467L6806l981
$$ -71633 -67053 -48430 -30548 -9222 20689 2281 -8983 -6677 10101 35568 72374 68393
6857F8393j1255m9012j3077Q035m32J6723n802J8669J1247J5177J1993k8974J470
$$ 68393 57138 8126 -4951 3084 2652 19375 13573 32242 43489 58666 70659 41685 43155
6844D3155R791k1833k5022q788N148J6877k0254J902l627j1512J7361k4362J8099
$$ 43155 52946 31113 6091 -2697 2451 19328 -926 976 -2651 -14163 3198 -21164 -3065
6831c065J2740j3693J8416M992j2963J687K0516K4107j3765K2956O623m041n185
$$ -3065 9675 -4018 14398 19390 6427 8114 28630 52737 38972 61928 68551 64510 59325
6818E9325q072j7555l4892k4983J3045J9219K8976m697j0519j9666k0255j0132
$$ 59325 51253 33698 -1194 -26177 -13132 6087 35063 30366 19847 181 -20074 -30206
6806c0206q608J2140L2387L1898R259j3962l7719l803M450M7246L6297n6612l3192
$$ -30206 -38814 -26674 5713 37611 46870 32908 -4811 -8614 -4164 43082 79379 22767 -10425
6793a0425j8648M288Q484J3695P253n642K3490q321m628j8215k9626k3799k3232
$$ -10425 -29073 -24785 -16301 -2606 4647 -995 22495 14174 9546 -8669 -38295 -62094 -85326
6780h5326N599K8665M9889Q035J995k0459m106l644q995r263L5400K4566l8833
$$ -85326 -79727 -51062 -1173 6862 8857 -11602 -15708 -19352 -28347 -37610 -2210 22356 -16477
6767a6477L279j7910K1560k1762J2330K2310k337K0035N913k3295m125m1697M858
$$ -16477 -13198 -31108 -9548 -31310 -18980 3330 993 21028 26941 3646 -479 -42176 -37318
6754c7318L3332M1591k3075m2011m450J0181K8830k4989l177K5293l4347K222
$$ -37318 -3986 37605 14530 -27481 -31931 -21750 7080 -17909 -21086 4207 -30140 -27918
6742b7918j5053l9244N502M7004K5566k3388o713O664m477N937J0886Q703l0175
$$ -27918 -42971 -82215 -76713 -29709 -4143 -27531 -34244 -27580 -32057 -26120 -15234 -6531 -36706
6729c6706L1736O9435m830j3198k9807o455J5232L259j7882k4878r343j7939k2977
$$ -36706 -4970 64465 59635 46437 16630 10175 25407 28666 10784 -14094 -23437 -41376 -64353
6716f4353L6434M7069J043j2851k1991N754o568r201l3963K1712N4645m6610n3359
$$ -64353 -27919 19150 20193 7342 -14649 -8895 -15463 -24664 -58627 -36915 17730 -28880 -82239
6703h2239K1971M8735K1115j0920l4606K1980M3662L3488r099l1222Q056M7504
$$ -82239 -60268 -11533 9582 -1338 -35944 -13964 29698 63186 54087 22865 30921 78425
6691G8425K3473j7115j4775m2520j2150N6839L0771l9595l3802p588p442j7158
$$ 78425 101898 84783 70008 27488 15338 72177 102948 63353 29551 21963 14521 -2637
6679b637q053J5668L8588j0820l4029j2732m076n274j7225J9582K4544K5823n188
$$ -2637 -10690 4978 43566 32746 -1283 -14015 -18091 -23365 -40590 -21008 3536 29359 24171
6666B4171m503J9647l937L541k3417j3953K9906J346q737k9723j1328J5252J3550
$$ 24171 19668 39315 35378 38919 15502 1549 31455 32801 24064 -5659 -16987 -1735 11815
6653A1815K1093l829O265l136j2540k2873l899N08j3864K748J5586L9614L791
$$ 11815 32908 29079 35344 32208 19668 -3205 -7104 -6596 -20460 -17712 -2126 37488 41279
6640D1279l5011j5945R120R724m999j7862n110K8911J8020j6747J6713O158p539
$$ 41279 6268 -9677 -557 9167 4168 -13694 -18804 10107 28127 11380 28093 34251 26712
6627B6712l2683l3543k579j4774J0994J5087L5371K5490P130M2207K800p9197
$$ 26712 -5971 -39514 -42093 -56867 -45873 -30786 4585 30075 37205 79412 82212 3015
6615C015k3397L1095j4303k5397o875j1226L207J8956K0086K6144L7002k3941
$$ 3015 -20382 10713 -3590 -28987 -35862 -47088 -43881 -24925 -4839 21305 58307 34366
6603C4366Q068J302M273j8790m606K1751r251k2406m652O3194k9920j8014R444
$$ 34366 42434 43736 48009 29219 24613 46364 37113 14707 10055 73249 43329 25315 34759
6590C4759j3759K5237J3827j6880m4983k360j331k6502k8132K3813L4471M1090
$$ 34759 21000 46237 60064 43184 -1799 -4159 -5490 -31992 -60124 -36311 -1840 39250
6578C9250J8893j2013n5499j5634K7357J2018j4406k0612j1462o437o149K4102
$$ 39250 58143 46130 -9369 -25003 2354 14372 -34 -20646 -32108 -38545 -44694 -20592
6566b0592L1991j679L4275l1037k0066P45J2622K1756j4795k7404n84j4547j6173
$$ -20592 11399 9720 43995 12958 -7108 -6363 6259 28015 13220 -14184 -14768 -29315 -45488
6553d5488j680L062J7670J1218J9986L4595Q424l2266k5217Q543j1586k1938N697
$$ -45488 -47168 -44106 -26436 -15218 4768 39363 47787 15521 -9696 -1153 -12739 -34677 -28980
6540b8980O698K0605n980j9235O617k0073K5216Q739k0274j7007L8863L2729k0436
$$ -28980 -22282 -1677 -7657 -26892 -20275 -40348 -15132 -6393 -26667 -43674 -4811 27918 7482
6527G482j0198p429P330L7910K8194o88K9497p649k3277l4842k2314Q574L4l6537
$$ 7482 -2716 -10145 -2815 35095 63289 62601 92098 84449 61172 26330 4016 12590 12624 -23913
6513b3913R660K885l745J1481o240N888J7635P303j7082j6734K3201P3109K4222
$$ -23913 -14253 -11368 -15113 -3632 -9872 -3984 13651 20954 3872 -12862 10339 83448 107670
6500A07670j7826o3905m6285l7142n136M6143M0956L537k80j6820K1972k0462
$$ 107670 89844 25939 -20346 -57488 -62624 -16481 24475 28012 27732 10912 32884 12422
6488A2422o90l132J4950k528m7286k5369Q033N153J9447K8670K3603j5713m0672
$$ 12422 11732 8600 23550 21022 -26264 -51633 -43600 -38447 -19000 9670 33273 17560 -23112
6475b3112J686J0420M9972j1680k0896j274k964j5008M841q621m302K2015q362
$$ -23112 -21426 -11006 38966 27286 6390 5116 2152 -12856 -8015 -16636 -20938 1077 -7285
6462g285R538k0692L1873k5999j4787n306j564L0227J8139J834K1215k5730R724
$$ -7285 2253 -18439 13434 -12565 -27352 -32658 -34222 -3995 14144 15978 37193 11463 21187
6449B1187R931l7625j5765K4537j2552n5424o210Q892J1514J9128M012N40M8043
$$ 21187 31118 -6507 -22272 2265 -10287 -65711 -71921 -63029 -51515 -32387 -28375 -27835 20208
6436B0208L1242j357m690k3399q419j320K420j4808l7801k2869K4153j8993l4833
$$ 20208 51450 50093 45403 22004 13585 12265 14685 -123 -37924 -60793 -36640 -55633 -90466
6423i0466M0949M6673L0658j8538q516J6065P973P400k9462l6679q428Q191M0612
$$ -90466 -49517 -2844 27814 9276 760 16825 24798 32198 2736 -33943 -42371 -34180 6432
6410F432K5017n8175m3246M219J3169K1246J9190p290j5112M4026Q761j0997M230
$$ 6432 31449 -26726 -69972 -65753 -52584 -31338 -12148 -19438 -34550 9476 18237 7240 11470
6397A1470K5993j9111L2309j203J1953R762j3014l0428l6124j6638O840K9408
$$ 11470 37463 18352 50661 49458 61411 71173 58159 27731 -8393 -25031 -18191 11217
6385A1217q40k1885m8826q600K231K2798L6324K6354m2824o882J164M0060j5311
$$ 11217 10377 -11508 -60334 -68934 -66703 -43905 -7581 18773 -24051 -30933 -29769 10291 -5020
6372e020j4603K1129K5014o8144k164K5847k0970K3887k2914M861M0538K2088
$$ -5020 -19623 1506 26520 -41624 -43788 -17941 -38911 -15024 -37938 -33077 7461 29549
6360B9549m2665m6501o432O9414J0356l9838k6572K1027l107J5547K8248j0452
$$ 29549 -13116 -59617 -66049 3365 13721 -26117 -52689 -31662 -34769 -19222 9026 -1426
6348a426p363L41K5823n735J7155j4921j2358l3381K1823l707j4104Q350O277
$$ -1426 -8789 -8448 17375 11640 28795 13874 1516 -31865 -10042 -13749 -27853 -19503 -13226
6335a3226L7885K6225k9650o0959m6900O237M6486k6730m40L3591N4433j8576
$$ -13226 24659 50884 21234 -39725 -86625 -80388 -33902 -60632 -61072 -27481 26952 8376
6323H376l4063J6983J7402k3370J2246p187O826J6019k7383j7913J9299p494l996
$$ 8376 -25687 -8704 8698 -14672 -2426 -9613 -2787 13232 -14151 -32064 -12765 -20259 -24255
6310b4255K1346J9721k1730r317K2809K9979Q086j2794o4715l994J9414J4620
$$ -24255 -2909 16812 -4918 -14235 8574 38553 46639 33845 -30870 -34864 -15450 -830
6298h30l0695J346L7749J564k0213J7333N101k3934j0928K6332q274m682K0097
$$ -830 -31525 -30179 7570 9134 -11079 6254 11355 -12579 -23507 2825 -5449 -10131 9966
6285I966j9450m806J5189j1505Q800J4529l8678M06L9103k4330m4869j1000J7728
$$ 9966 -9484 -14290 899 -10606 -1806 12723 -25955 -25549 13554 -10776 -55645 -66645 -48917
6272d8917j2777M5784K7778k0749j2281K1515j6109N156j8250l64J0919l654N220
$$ -48917 -61694 -15910 11868 -8881 -21162 353 -15756 -10600 -28850 -29214 -18295 -21949 -16729
6259a6729J4553q856J7519k0114k6748k3836K6346O440k2985J9561M1395l1642
$$ -16729 -2176 -11032 6487 -13627 -40375 -64211 -37865 -31425 -54410 -34849 6546 -25096
6247b5096K756J5988L983J1112l4258j0066R906r260P820K5086J1921K7567m43
$$ -25096 -22340 -6352 -2369 8743 -25515 -35581 -25675 -34935 -27115 -2029 9892 37459 37016
6234C7016l4344Q148q863J8504J7471k5257m5369J1762P103m3076j6895K0550
$$ 37016 2672 10820 1957 20461 37932 12675 -32694 -20932 -13829 -56905 -73800 -53250
6222e3250L9203J7383k251j0331j027l1290p989q703K5096L1186J4183m700j6549
$$ -53250 -14047 3336 1085 -9246 -10273 -41563 -49552 -58255 -33159 -1973 12210 7510 -9039
6209i039j562Q793M345K1147M9022j046q4656m2201M3796J1156J1174M323l6935
$$ -9039 -10601 -1808 2537 23684 72706 71660 -12996 -55197 -11401 -245 10929 15252 -21683
6196b1683l605K513J5605J7971m3323J3012J1851k8771J8389K7243k0598l3988
$$ -21683 -25288 -22775 -7170 10801 -32522 -19510 -7659 -36430 -18041 9202 -11396 -45384
6184d5384l7167K7319K4636J0058J9926K6467m3327m8328K0306K7999J6567j2496
$$ -45384 -82551 -55232 -30596 -20538 -612 25855 -17472 -65800 -45494 -17495 -928 -13424
6172a3424J9443J0473m9556m5420J5762J3733J6685K3264M620J9637k2605J5479
$$ -13424 6019 16492 -33064 -78484 -62722 -48989 -32304 -9040 -4420 15217 -7388 8091
6160H091L1681l8519J2781J8001r944l8607l3601k2069Q790M1275J655j6331J7138
$$ 8091 39772 1253 14034 32035 22091 -16516 -50117 -72186 -63396 -22121 -20466 -36797 -19659
6147a9659j4571J8536l782j9754l8374K9877M6613K8456j5229l1988j6039L0949
$$ -19659 -34230 -15694 -19476 -39230 -77604 -47727 -1114 27342 12113 -19875 -35914 -4965
6135d965L3526J1977j8015l3301r532O570Q098j412l4342O035l9923J0510M1966
$$ -4965 28561 40538 22523 -10778 -20310 -13740 -5642 -7054 -41396 -35361 -75284 -64774 -22808
6122b2808k0453j5097M8390O882j3961n843J9069j527p689r018j2014L9079J0222
$$ -22808 -43261 -58358 -9968 -3086 -17047 -22890 -3821 -5348 -13037 -22055 -34069 5010 15232
6109A5232k8476j2946k9607j8777J197j6977L3858K8388J9949n173j696k031J5849
$$ 15232 -13244 -26190 -55797 -74574 -73377 -90354 -56496 -28108 -8159 -13332 -15028 -17059 -1210
6096a210k717l5441J6170j6923J004J3385J2263k2011l5223J7035R299K501K267
$$ -1210 -3927 -39368 -23198 -40121 -39117 -25732 -13469 -35480 -70703 -53668 -44369 -41868 -39601
6083c9601K6533k5053p329O157l4044J2518M1022J3362Q803Q775J8507k7850k7667
$$ -39601 -13068 -38121 -45450 -39293 -73337 -60819 -19797 -6435 2368 11143 29650 1800 -25867
6070b5867N675Q947l0817n02J8805P434k8196m3732j4522O658L5387M6894R982
$$ -25867 -20192 -11245 -42062 -42564 -23759 -16325 -44521 -88253 -102775 -96117 -60730 -13836 -3854
6057c854L2276m4344k4269R556K5623N81p753Q742k0345J1172K0474K4701k0835
$$ -3854 28422 -15922 -40191 -30635 -5012 -4431 -12184 -3442 -23787 -12615 7859 32560 11725
6044A1725l3106j6437J6339j6777k4792K8159J6493L053Q150q67l3034M803j7005
$$ 11725 -21381 -37818 -21479 -38256 -63048 -34889 -18396 -15343 -7193 -8060 -41094 -36291 -53296
6031e3296L5644J033p633N8708n5074n9341M0946L3252M072K6523j4933R278R250
$$ -53296 -17652 -16619 -24252 34456 -20618 -79959 -39013 -5761 -1689 24834 9901 19179 28429
6018B8429l7635k5359K6023q324O109L4647K0574k5558j9948L2920J033J0735
$$ 28429 -9206 -34565 -8542 -16866 -10757 23890 44464 18906 -1042 31878 32911 43646
6006D3646R80l7974p044K0946j9447l7252l0874K2651J4293j3968n836L8397N0391
$$ 43646 44626 6652 -392 20554 1107 -36145 -67019 -44368 -30075 -44043 -49879 -11482 38909
5993C8909L2337j3346o1936k1290J4106L2111K4012q271L436O662k3681k2727
$$ 38909 71246 57900 -4036 -25326 -11220 20891 44903 36632 40068 46730 23049 322
5981C22j087K5192M860j4803n2608k2989P64L7666L3808j0545j6309J8665L8766
$$ 322 -765 24427 29287 14484 -38124 -61113 -60349 -22683 11125 580 -15729 2936 41702
5968D1702l955k2452l8254J8877K5412Q099P554q88j9286P844L880q368j1228
$$ 41702 37747 15295 -22959 -4082 21330 29429 36983 36095 16809 24653 28533 20165 8937
5955H937J4318L017m999l8358J7315N344K0699K0799k3147k5247O1589l8705l4578
$$ 8937 23255 26272 21273 -17085 230 5574 26273 47072 23925 -1322 60267 21562 -13016
5942a3016m8392r341J6828M2799L9028K1210m5675n3099K8812l0493R017J3942
$$ -13016 -61408 -70749 -53921 -11122 27906 49116 3441 -49658 -20846 -51339 -42322 -28380
5930b8380m4152L4347N0773K1226M943L371q141k8545o555k220l220k8880k1818
$$ -28380 -72532 -38185 12588 33814 38757 42128 33987 5442 -1113 -3333 -6553 -35433 -57251
5917e7251L1064N6107l094l3049P81j4083k2405k2180k072o577p220m3622k242
$$ -57251 -26187 29920 26826 -6223 -5442 -19525 -41930 -64110 -66182 -72759 -79979 -123601 -125843
5904a25843M3352M1794O208J5002L1489o601k4672k2505O276K0344l0420P990
$$ -125843 -82491 -40697 -34489 -19487 12002 5401 -19271 -41776 -35500 -15156 -45576 -37586
5892c7586K5044J1820m2857m786K1096J7543r190j2667P425P672J5650R756k1021
$$ -37586 -12542 -722 -43579 -48365 -27269 -9726 -18916 -31583 -24158 -16486 -836 8920 -12101
5879a2101l0343K4842J8760J3440m949o5724k6901L1064J7042J4577J5309j4814
$$ -12101 -42444 -17602 1158 14598 9649 -56075 -82976 -51912 -34870 -20293 -4984 -19798
5867a9798j3187K5119L9020j9378J4348j4653l2635K222O1335j0283j3374J4393
$$ -19798 -32985 -7866 31154 11776 26124 11471 -21164 -18942 42393 32110 18736 33129
5855C3129n170K5158j2504k410l815k9017m989N3966K8542l4362p9549j9950l2323
$$ 33129 27959 53117 40613 38203 34388 5371 382 54348 82890 48528 -31021 -50971 -83294
5842h3294M3560N8208M2534j9291J808q736j8221k7116k9652p520L1248j8512
$$ -83294 -39734 18474 61008 41717 43525 34789 16568 -10548 -40200 -47720 -16472 -34984
5830c4984K7911l402l1814l831j7361Q98M5516L1220j3890j7010l5153K7818K3082
$$ -34984 -7073 -10475 -42289 -46120 -63481 -62583 -17067 14153 263 -16747 -51900 -24082 -1000
5817a000l9358P024L9477N8636p813p565j4399j3914m5045R042M3768l5681k5678
$$ -1000 -40358 -33334 6143 64779 56966 49401 35002 21088 -23957 -14915 28853 -6828 -32506
5804c2506r222k6802L4406M0685K322Q358l329L3150J7969j3939l7956l7748J2984
$$ -32506 -41728 -68530 -34124 6561 8883 17241 13912 47062 65031 51092 13136 -24612 -11628
5791a1628P833k4357m6259O0435M0232k4109j3106K2756l5166k8089J7469l580
$$ -11628 -3795 -28152 -74411 -13976 26256 2147 -10959 11797 -23369 -51458 -33989 -37569
5779c7569k7185k474K6779M9274k341l4965K0970M606j6626J2685j2515J8519
$$ -37569 -64754 -67228 -40449 8825 6484 -28481 -7511 -2905 -19531 -6846 -19361 -842
5767h42j3263k8051k2357j3651J3324k2108j533L9659j8303J650P218J2006L6383
$$ -842 -14105 -42156 -64513 -78164 -64840 -86948 -88481 -48822 -67125 -65475 -58257 -46251 -9868
5754i868M821N548J6517l5597K2049J560p590J3633m727j2014j0478j0228j514
$$ -9868 -5047 501 17018 -18579 3470 5030 -2560 11073 6346 -5668 -16146 -26374 -27888
5741b7888j3715K8671L3848j6449n3845k787k3917j9562Q471K7519M9653j1593
$$ -27888 -41603 -12932 20916 4467 -49378 -52165 -76082 -95644 -87173 -59654 -10001 -21594
5729b1594p754m7673j1728J4320M4985n964l181k7883k6546j6831J8434M8963
$$ -21594 -29348 -77021 -88749 -74429 -29444 -35408 -38589 -66472 -93018 -109849 -91415 -42452
5717d2452L3669J4795j816m9551P337K2800N302j4407J9548q492o521j8598l5835
$$ -42452 -8783 6012 4196 -45355 -38018 -15218 -9916 -24323 -4775 -13267 -19788 -38386 -74221
5704g4221R083L1151L0783j2296k2782L3704J9656J3741L3769L5129k7704k0575
$$ -74221 -65138 -33987 -3204 -15500 -38282 -4578 15078 28819 62588 97717 70013 49438
5692D9438j9559k4143j9408R471l7938m3764J0982J0462k152j788J8344L5082
$$ 49438 29879 5736 -13672 -4201 -42139 -85903 -74921 -64459 -66611 -68399 -50055 -14973
5680a4973L7602j8569m5201l525L6496K5077l2328N957M921l2803K0726Q744L3815
$$ -14973 22629 4060 -41141 -44666 -8170 16907 -15421 -9464 -4543 -37346 -16620 -7876 25939
5667B5939L8720r501k3124l4641k6423O825J9664q867j4674j3580L1075j6940
$$ 25939 64659 55158 32034 -2607 -29030 -22205 -2541 -11408 -26082 -39662 -8587 -25527
5655b5527n190j7734J9227M788R855K085j9978J7472j9128L0564M6287j2484o519
$$ -25527 -30717 -48451 -29224 -24436 -14581 -12496 -32474 -15002 -34130 -3566 42721 30237 23718
5642B3718l872n3622l1146k857M2329k0842o34N92j0009R062J4593K8856K6004
$$ 23718 19846 -33776 -64922 -67779 -25450 -46292 -46926 -46334 -56343 -47281 -32688 -3832 22172
5629B2172k6938r895O646j2592M7458L17K118K2293m39m4029L3659j2030o9123
$$ 22172 -4766 -14661 -8015 -20607 26851 27168 29286 51579 51140 7111 40770 28740 -40383
5616d0383j7673o598L4830l4859O580J2922k1021L4809N0986L5277j6447m9115
$$ -40383 -58056 -64654 -29824 -64683 -58103 -45181 -66202 -31393 19593 54870 38423 -10692
5604a0692M2475M0201o4686l2364J3914K8m2623K689L8771L5374j3140l1519j9155
$$ -10692 31783 71984 7298 -25066 -11152 -11124 -53747 -51058 -12287 23087 9947 -21572 -40727
5591d0727j1137J2080k895O821M2678k0957l5529j7076P150L1077O3369J4173
$$ -40727 -51864 -39784 -42679 -35858 6820 -14137 -49666 -66742 -59592 -28515 34854 49027
5579D9027l7376k4701l8762K5704M1217J4481j8012O872j2168P15k6319m4780
$$ 49027 11651 -13050 -51812 -26108 15109 29590 11578 18450 6282 6997 -19322 -64102
5567f4102K6616J7303q364l750j2744l6662L9696M70N1701k4164O683J4799N139
$$ -64102 -37486 -20183 -28547 -32297 -45041 -81703 -42007 -41537 10164 -14000 -7317 7482 12621
5554A2621k7357J094r965j6501K908k8305j1793J5827K6221p185J366N7378J2394
$$ 12621 -14736 -13642 -23607 -40108 -37200 -65505 -77298 -61471 -35250 -42435 -41069 16309 28703
5541B8703k1240j281o51K607k8341J1749J9482j829K4605j5606l3056J029k3583
$$ 28703 7463 6182 5531 8138 -20203 -8454 11028 9199 33804 18198 -14858 -13829 -37412
5528c7412j5578N3967N9184l0807J427q321n970k0265N364l4085O874p775l5326
$$ -37412 -52990 977 60161 29354 30781 22460 16490 -3775 1589 -32496 -25622 -33397 -68723
5515f8723j2095k814K6683L111j1602J8591K795k9143K986J9291K7503J7964m3873
$$ -68723 -80818 -83632 -56949 -53838 -65440 -46849 -44054 -73197 -70211 -50920 -23417 -5453 -49326
5502d9326L5400P1634J8389l3725l3761K1303l1487k3852j6720K7024m231j8927
$$ -49326 -13926 57708 76097 42372 8611 29914 -1573 -25425 -42145 -15121 -19352 -38279
5490c8279O964J8621k507k0444j4541K6282k206k1208j534K8253J3987L5367k7853
$$ -38279 -31315 -12694 -15201 -35645 -50186 -23904 -26110 -47318 -48852 -20599 -6612 28755 902
5477I02p1251K7016O6173o875l7523J7866J6395k0943j327K9121J0910m255l39
$$ 902 -70349 -43333 22840 15965 -21558 -3692 12703 -8240 -9567 19554 30464 26209 25870
5464B5870l3243j4422j0851K2813l2534k729K4969m11k3033M427K7497k0615l169
$$ 25870 -7373 -21795 -32646 -9833 -42367 -45096 -20127 -20538 -43571 -39144 -11647 -32262 -35431
5451c5431M3297l647L678J4669J3456j7228k7096P829O995J5762n409l5869K480
$$ -35431 7866 4219 7897 22566 36022 18794 -8302 -473 6522 22284 16875 -18994 -16514
5438a6514J3285O130j4805J4054l780k6297J688O9557K2429n692k3978k9769j2639
$$ -16514 -3229 2901 -11904 2150 -1630 -27927 -26239 43318 65747 60055 36077 6308 -6331
5425f331L2921k9475r337J9287j9623m2086j2599K6833M4341J0616Q556l7100
$$ -6331 26590 -2885 -12222 7065 -12558 -54644 -67243 -40410 3931 14547 23103 -13997
5413a3997k0830Q760P33k1641K3937L6937K2371Q954l0091J8939K2657k4798J2843
$$ -13997 -34827 -26067 -25334 -46975 -23038 13899 36270 45224 15133 34072 56729 31931 44774
5400D4774M1238o580p3726M057r285K2296m77N972k5649q004J483o123l3488j9248
$$ 44774 86012 79432 5706 9763 478 22774 22297 28269 2620 -5384 -3901 -10024 -43512 -62760
5386f2760L6608O615l6373l8393m37M0853l0371k7422M5395K6696p623K379K9318
$$ -62760 -26152 -19537 -55910 -94303 -94740 -53887 -84258 -111680 -66285 -39589 -47212 -44833 -15515
5373a5515M9227l584k7218j9290L7040L532p3233j8292N683J5769k1763J9770
$$ -15515 33712 30128 2910 -16380 20660 24192 -49041 -67333 -61650 -45881 -67644 -47874
5361d7874J8106o69j2365J5005P701K6280J7581J7997L7181M99o4729k9359n412
$$ -47874 -29768 -30437 -42802 -27797 -20096 6184 23765 41762 78943 79442 14713 -14646 -20058
5348b0058j0169K5169k3888k2952M8389n969K5697R334L7489m796Q38n498R106
$$ -20058 -30227 -5058 -28946 -51898 -3509 -9478 16219 25553 63042 58246 59084 53586 62692
5335F2692o756k2519k5518L63j7227j4820J4222j6510K5844j968j7948l8815l7994
$$ 62692 55936 33417 7899 8262 -8965 -23785 -9563 -26073 -229 -2197 -20145 -58960 -96954
5322i6954K6662N5841J3379k3691o43O079K269j2748k0239m6152n343J1056L2579
$$ -96954 -70292 -14451 -1072 -24763 -25406 -19327 -17058 -29806 -50045 -96197 -101540 -90484 -57905
5309e7905K0535n669l1817J0641k937M4P089j0693j649m635j8770L6517P621j9193
$$ -57905 -37370 -43039 -74856 -64215 -67152 -67108 -60019 -70712 -72361 -76996 -95766 -59249 -51628 -70821
5295g0821o848n480L1600K869j3384J9397M019K661Q931L1716k6092J873J073
$$ -70821 -77669 -83149 -51549 -48680 -62064 -42667 -38648 -35987 -27056 4660 -21432 -19559 -18486
5282a8486k2943j1740j1906K5262J3167j7718J3384K4762Q531J4885J1502n310
$$ -18486 -41429 -53169 -65075 -39813 -26646 -44364 -30980 -6218 2313 17198 28700 23390
5270B3390j3483K291k6090l1266J0970K2369k028J9541j1524k9898l79K6010k8860
$$ 23390 9907 12198 -13892 -45158 -34188 -11819 -13847 5694 -5830 -35728 -36107 -10097 -38957
5257c8957r108K0052O736j0415k1489M988o821L5300M2147l8383l032o055L315
$$ -38957 -48065 -28013 -21277 -31692 -53181 -48193 -55014 -19714 22433 -15950 -18982 -25037 -21722
5244b1722J585j4151l039L2278k793r967L111O09M6189j4308m1948M2299j5417
$$ -21722 -20137 -34288 -37327 -5049 -7842 -17809 -14698 -14089 32100 17792 -24156 18143 2726
5231B726j8328J930o0468j3251L629k7077O0858M3018Q173k0148j4061K8916J2341
$$ 2726 -15602 -13672 -74140 -87391 -83762 -110839 -49981 -6963 1210 -18938 -32999 -4083 8258
5218H258N10K6865j2964k8213n555m220k9618M5207L5328L168J4313n75k848o253
$$ 8258 8768 35633 22669 -5544 -11099 -15319 -44937 270 35598 38766 53079 52504 49656 43403
5204D3403n5642l7400J7074j4877K390J3151J2745n0441M4774j1447j9432J0582
$$ 43403 -12239 -49639 -32565 -47442 -45052 -31901 -19156 -69597 -24823 -36270 -55702 -45120
5192d5120K2030K3876j4847M231K5038l4661J5884j9386R166L1835l56j1823K0659
$$ -45120 -23090 786 -14061 -9830 15208 -19453 -3569 -22955 -13789 18046 17690 5867 26526
5179B6526q603J1926j9116r824K5229k0187j8335K7002O73m128L8585J0933l2593
$$ 26526 17923 29849 10733 909 26138 5951 -12384 14618 15291 11163 49748 60681 28088
5166B8088k0768j7732K5485p970n8956k0103J5897N5479j4855j8461k09k1979
$$ 28088 7320 -10412 15073 7103 -51853 -71956 -56059 -580 -15435 -33896 -34105 -56084
5154e6084o881M5648K2560k465L7558J3228k0723L2876l2690J187J4169P40q625
$$ -56084 -62965 -17317 5243 2778 40336 53564 32841 65717 33027 34214 48383 49123 40498
5141D0498l7157k8953L5846Q427M286j835k5522M189K4534K2947M830q629l540
$$ 40498 3341 -25612 10234 18661 22947 21112 -4410 -221 24313 47260 52090 43461 39921
5128C9921J8365R58l8490q113j4767j108q286m563j4585N9791R327n5371m154
$$ 39921 58286 59244 20754 12641 -2126 -3234 -11520 -16083 -30668 29123 38450 -16921 -21075
5115b1075j1584O465J5816L0987k0977N527k5170j5485J3743L5920J8927j7774
$$ -21075 -32659 -26194 -10378 20609 -368 5159 -20011 -35496 -21753 14167 33094 15320
5103A5320j1541J5718N901L2451l5123l0032J2443M8227j8759m3623K4294j475
$$ 15320 3779 19497 25398 57849 22726 -7306 5137 53364 34605 -9018 15276 13801
5091A3801j7066p105j6711l6146M8770J6542N873P362L0877j714J1913o295K436
$$ 13801 -3265 -10370 -27081 -63227 -14457 2085 7958 15320 46197 44483 56396 50101 52537
5078E2537k7134k8435J088l7692l1007k7951r39L541j6104J0689J3036L599L1473
$$ 52537 25403 -3032 -1944 -39636 -70643 -98594 -99533 -95992 -112096 -101407 -88371 -84772 -53299
5065e3299M4807j6187q707L9817r552l9803j9849J7115M565L7839L4708K8060
$$ -53299 -8492 -24679 -33386 6431 -3121 -42924 -62773 -45658 -41093 -3254 31454 59514
5053E9514l432r563l0850R62J7781K4250L009k5468l393l8462n0646J1026J1366
$$ 59514 56082 46519 15669 16631 34412 58662 61671 36203 32810 -5652 -56298 -45272 -33906
5040c3906p96j3271R542J9055J8984K5820k530J2330J9052l6975P362O35n018
$$ -33906 -34702 -47973 -38431 -19376 -392 25428 22898 35228 54280 17305 24667 25302 20284
5027B0284l844o266j4566j8315L6743l5982p878J6458L4701j4697l0113k6555
$$ 20284 16440 10174 -4392 -22707 14036 -21946 -29824 -13366 21335 6638 -23475 -50030
5015e0030J050J5636R995J9371p250m6846O777M4068Q631J7907L215J5783l8708
$$ -50030 -48980 -33344 -23349 -3978 -11228 -58074 -51297 -7229 1402 19309 22524 38307 -401
5002d01m3813o243p503j136k566l3017K1648K393K5359K8741k4304k0358J6910
$$ -401 -44214 -50457 -57960 -59096 -61662 -94679 -73031 -70638 -45279 -16538 -40842 -61200 -44290
4989d4290j6393J9356K0351k8259q151N99N502o310K8008j1549j8001K8862K478
$$ -44290 -60683 -41327 -20976 -49235 -57386 -56787 -51285 -57595 -29587 -41136 -59137 -30275 -27797
4976b7797K2342K0902M1133K0508j288m8825l6996k6870n297n756q382J1183L3843
$$ -27797 -5455 15447 56580 77088 75800 26975 -10021 -36891 -42188 -47944 -56326 -45143 -11300
4963a1300N973l611O76k8129j875o890o283m343J3265R025m894K3718J1681p309
$$ -11300 -5327 -8938 -8262 -36391 -38266 -45156 -51439 -55782 -42517 -33492 -38386 -14668 -2987 -10296
4949a0296K8005Q260k7994j4486m8029l40L4245P451L1082j0238j6958j2372o243
$$ -10296 17709 25969 -2025 -16511 -64540 -64880 -30635 -23184 7898 -2340 -19298 -31670 -37913
4936c7913N736j4270L2861m3195M15K5687L8000N418q25o345l2680m8222j2277
$$ -37913 -32177 -46447 -13586 -56781 -56366 -30679 7321 12739 11914 5569 -27111 -75333 -87610
4923h7610L9384N4900q80o8895l6089J428J464M6411M8064k9309n1966k434L7811
$$ -87610 -48226 6674 5794 -63101 -99190 -97762 -96298 -49887 -1823 -31132 -83098 -85532 -47721
4910d7721L2022n328R336j7565J5040N384J875j0076k5402J4293j4899j5366q47
$$ -47721 -15699 -21027 -11691 -29256 -14216 -8832 -6957 -17033 -42435 -28142 -43041 -58407 -59254
4897e9254K2181J463q564J765J0142L1840N4771P624m0505l680J374j6111J0786
$$ -59254 -37073 -35610 -44174 -42409 -32267 -427 54344 61968 21463 17783 19157 3046 13832
4884A3832K4518l0870m9311j3102J1658J1284l305J2932O860K8984k3056k938
$$ 13832 38350 7480 -41831 -54933 -43275 -31991 -35296 -22364 -15504 13480 -9576 -12514
4872a2514j4159k4851L2827k2823J4101o708j7759O392M5469O4913k429l6773
$$ -12514 -26673 -51524 -18697 -41520 -27419 -34127 -51886 -45494 -25 64888 62459 25686
4860B5686m7252k6575J4469j0457n384j2505K6439j0624J6517O170J2624J2918
$$ 25686 -21566 -48141 -33672 -44129 -49513 -62018 -35579 -46203 -29686 -23516 -10892 2026
4848B026j6653J8005K0368M35k8896k5807N192L6644j1988l0317j2312k1669m4011
$$ 2026 -14627 3378 23746 24181 -4715 -30522 -25330 11314 -674 -30991 -43303 -64972 -108983
4835a08983L3676M1594J8102j5806l2018n431l4693K548O5273K4136n5802L0438
$$ -108983 -75307 -33713 -15611 -31417 -63435 -68866 -103559 -101011 -35738 -11602 -67404 -36966
4823c6966M6915j0886m4433m136K4853K7065K9101O687P594p624k7387l8411O891
$$ -36966 9949 -937 -45370 -49506 -24653 2412 31513 38200 45794 38170 10783 -27628 -20737
4810b0737j0043O551N2749j3012r534o614J1388J3688J774L34k3522l2132j0396
$$ -20737 -30780 -24229 28520 15508 5974 -640 10748 24436 26210 26544 3022 -29110 -39506
4797c9506N2050K6952j1089o4047k0731K8177K6390R781R068m1984k602N455Q200
$$ -39506 12544 39496 28407 -35640 -56371 -28194 -1804 7977 17045 -24939 -27541 -22086 -13886
4784a3886P698K1943L3757J3613k2977p7551k9580q043L4613L1619M2316J5523
$$ -13886 -6188 15755 49512 63125 40148 -37403 -66983 -75026 -40413 -8794 33522 49045
4772D9045n3807k9887l5661j7405p39O2871l704k4401j4493J135L2884K2619K4071
$$ 49045 -4762 -34649 -70310 -87715 -88454 -25583 -29287 -53688 -68181 -67046 -34162 -11543 12528
4759A2528l7885K2788L0242J8428j8275p0761l0591O421O819L1963K0041j4146
$$ 12528 -25357 -2569 27673 46101 27826 -42935 -73526 -67105 -60286 -28323 -8282 -22428
4747b2428L5319j0242L579k0801k4384k2726O410J5729M8820J9730K5853k3122
$$ -22428 12891 2649 6228 -14573 -38957 -61683 -55273 -39544 9276 29006 54859 31737
4735C1737n2428N48j1350J7346J055k671K7939l8964J6133J3872k4460K669k928
$$ 31737 -20691 -20143 -31493 -14147 -13092 -15763 12176 -26788 -10655 3217 -21243 -18574 -21502
4722b1502K562l3242K3467J256n279N251K0913l3039j7674j4012M8756N5872k5135
$$ -21502 -18940 -52182 -28715 -27459 -32738 -27487 -6574 -39613 -57287 -71299 -22543 33329 8194
4709H194O788j0703K9735P751O03O869j4511k4321k6865P031R186P7005K6378
$$ 8194 14982 4279 34014 41765 42368 49237 34726 10405 -16460 -9429 -243 76762 103140
4696A03140k8567j50j2580k7845k6366q072l3755k2783P192J5237P739Q925M989
$$ 103140 74573 74423 61843 33998 7632 -440 -34195 -56978 -49786 -34549 -26810 -17885 -12896
4683a2896q173l3483j6028K8484k2827J3360J6628nK8645J6394k1915j3752L6443
$$ -12896 -21069 -54552 -70580 -42096 -64923 -51563 -34935 -34940 -6295 10099 -11816 -25568 10875
4670A0875j0149Q753l2733o0160L1601P067J3401L3252J501j5067k1978J7339
$$ 10875 726 9479 -23254 -83414 -51813 -44746 -31345 1907 3408 -11659 -33637 -16298
4658a6298J2873J4165Q811q289p975j9247j1273j1948k1699k4972j5722L0441
$$ -16298 -3425 10740 19551 11262 3287 -15960 -27233 -39181 -60880 -85852 -101574 -71133
4646g1133J8125k2691k0562N8089k8402k6874K2943k816J1109P34L4462O082r872
$$ -71133 -53008 -75699 -96261 -38172 -66574 -93448 -70505 -73321 -62212 -61478 -27016 -20934 -30806
4633c0806J8679R67j4337M7190M1197k4682m4569j6621k406k7635k799K8307N1001
$$ -30806 -12127 -11160 -25497 21693 62890 38208 -6361 -22982 -25388 -53023 -55822 -27515 23486
4620B3486r73m7561k6497M4260N0666l4362j0175k375p3185K957J0431M7993J1311
$$ 23486 22513 -25048 -51545 -7285 43381 9019 -1156 -3531 -76716 -73759 -63328 -15335 -4024
4607d024p469j9225j6824K7156L6131O284k1235l3138J1813M0245L0406k7950
$$ -4024 -11493 -30718 -47542 -20386 15745 22029 794 -32344 -20531 19714 50120 22170
4595B2170j4799K678m8396k1957q946P832K5602J7694k0610k4123J8078J3588
$$ 22170 7371 10049 -38347 -60304 -69250 -61418 -35816 -18122 -38732 -62855 -44777 -31189
4583c1189p026j7604j1338K4177K1502n869k7991n0616J060P5248L9441l897q018
$$ -31189 -38215 -55819 -67157 -42980 -21478 -27347 -55338 -105954 -104894 -29646 9795 5898 -2120
4570b120k1300J4113j4116l8461R973M9631L6390K4319k0550j3532l894j5697
$$ -2120 -23420 -9307 -23423 -61884 -51911 -2280 34110 58429 37879 24347 20453 4756
4558D756J2168j0500k5697O716K37j1704l459O546j2669J8839R712N432K3021
$$ 4756 16924 6424 -19273 -12557 -12320 -24024 -27483 -20937 -33606 -14767 -5055 377 23398
4545B3398L100o380j6383J6066n653m9404K1681K2212L873k0473J7635J3313o655
$$ 23398 26498 20118 3735 19801 14148 -35256 -13575 8637 12510 -7963 9672 22985 16330
4532A6330l9972k219N638J013q2r154k3696q340J6591l539K6781J8219N420k2329
$$ 16330 -23642 -25861 -20223 -19210 -19292 -28446 -52142 -60482 -43891 -47430 -20649 -2430 2990 -19339
4518a9339j3566j160K371J2708N601m267K2128m046J5054M6071J8385m6695m2403
$$ -19339 -32905 -34065 -31694 -18986 -13385 -17652 4476 430 15484 61555 79940 33245 -9158
4505i158J8689k4979K813J5379j611j4372N777J6029J568K592j3926n5125J7748
$$ -9158 9531 -15448 -12635 2744 1133 -13239 -7462 8567 10135 12727 -1199 -56324 -38576
4492c8576L8246j6781j2627O898L105O241o069p9p087j446r408L780J5202P802
$$ -38576 -330 -17111 -29738 -22840 -19735 -13494 -19563 -19642 -26729 -28175 -37583 -33803 -18601 -10799
4478a0799K878j2130l6015n0753Q301J4739R691L6776j4147J0924K4524k3372
$$ -10799 -7921 -20051 -56066 -106819 -98518 -83779 -74088 -37312 -51459 -40535 -16011 -39383
4466c9383J1123j9922j0251j6520m568P6248L373j7713j803K0000K4497M434m8042
$$ -39383 -28260 -48182 -58433 -74953 -79521 -3273 100 -17613 -19416 584 25081 29515 -18527
4453a8527k9690J6705L4868O63n393l8600n7937J7762N2210K444K9478j1092l703
$$ -18527 -48217 -31512 3356 4019 -1374 -39974 -97911 -80149 -27939 -25495 3983 -7109 -10812
4440a0812m256J8923k90l4291l6536j3273N0680O3624J6881n5694l7246L5700
$$ -10812 -15068 3855 3565 -30726 -67262 -80535 -29855 33769 50650 -5044 -42290 -6590
4428f590L7771k914j7437q651j8958P91K3255L4007l4862l0408m0252P774k773
$$ -6590 31181 28267 10830 2179 -16779 -15988 7267 41274 6412 -23996 -64248 -56474 -59247
4415e9247J2275K5907o340k4630K6895k4207l6846K1641J5741j9032L0977M3371
$$ -59247 -46972 -21065 -27405 -52035 -25140 -49347 -86193 -64552 -48811 -67843 -36866 6505
4403F505q089r077Q441k1885L550M1417M643K5320J2129L5l2579n0305M7798K5550
$$ 6505 -1584 -10661 -2220 -24105 -20555 20862 25505 50825 62954 62989 30410 -19895 27903 53453
4389E3453j1719l0310L264k7701n6909r758L5647K5387N3797O544k6841j396Q505
$$ 53453 41734 11424 14688 -13013 -69922 -79680 -44033 -18646 35151 41695 14854 13458 21963
4376B1963j3307J0022k0342N904N094q715J0354L770j2396J286o540n618q46j8134
$$ 21963 8656 18678 -1664 4240 9334 619 10973 14743 2347 3633 -2907 -8525 -9371 -27505
4362b7505j5201J1508N7848J1934j5569j8902L3732j6521m0226J4714j4153J374
$$ -27505 -42706 -31198 26650 38584 23015 4113 37845 21324 -18902 -4188 -18341 -16967
4350a6967L4362k3327l9532j9931R729M6263K9067K4327n188l2400K3952l2117
$$ -16967 17395 -5932 -45464 -65395 -55666 -9403 19664 43991 38803 6403 30355 -1762
4338a762K4258M098j9385K401n83M990l2586R863K9444K101P11j2196l711N400
$$ -1762 22496 26594 7209 9610 9027 14017 -18569 -8706 20738 22839 23550 11354 7643 13043
4324A3043j4307j6726L8618j2296L709K2300l2889K927l5416k2504m233O2383
$$ 13043 -1264 -17990 20628 8332 12041 34341 1452 4379 -31037 -53541 -57774 4609
4312D609Q000j7445K3221J9713k1265J2952m017J6088m072j9434k0729M154J6401
$$ 4609 12609 -4836 18385 38098 16833 29785 25768 41856 37784 18350 -2379 1775 18176
4299A8176K917J3051l9036q478P772j6490n248J6029J8699R983K976j1632K9608
$$ 18176 21093 34144 -4892 -13370 -5598 -22088 -27336 -11307 7392 17375 20351 8719 38327
4286C8327K0892l0250m5026j7029p261j6013k511M5638K8007p58m4346o1398J1065
$$ 38327 59219 28969 -16057 -33086 -40347 -56360 -58871 -13233 14774 14016 -30330 -91728 -80663
4273h0663N949J1572K8037k1521L5941K5572k8648j2735l4645L6284K2135K631
$$ -80663 -74714 -63142 -35105 -56626 -20685 4887 -23761 -36496 -71141 -34857 -12722 -10091
4261a0091l7171J9341K8778l5874P60L6611L893R491k810K2625k5141n260J7071
$$ -10091 -47262 -27921 857 -35017 -34257 2354 6247 15738 12928 35553 10412 5152 22223
4248B2223p606J3562J5528l6269j6515r017k1506k3803m731o859J0951L8087K827
$$ 22223 14617 28179 43707 7438 -9077 -18094 -39600 -63403 -68134 -74993 -64042 -25955 -23128
4235b3128L6812j0602l8932j0606J5996n243j733j8262k0871j9702J0433J7368
$$ -23128 13684 3082 -35850 -46456 -30460 -35703 -37436 -55698 -76569 -96271 -85838 -68470
4223f8470o38L445k8923K748N001K7629L0027K2350J5498J874L4204N547j4541
$$ -68470 -69108 -65663 -94586 -91838 -86837 -59208 -29181 -6831 8667 10541 44745 50292 35751
4210C5751n6337K4300K6404k7651j7326m131K7646L1917M881J227k1950J5522
$$ 35751 -20586 3714 30118 2467 -14859 -18990 8656 40573 45454 46681 24731 40253
4198D0253J058k131m122k1565m9592j3084L7673n999J5986j4175n1362K2561K1710
$$ 40253 41311 39180 35058 13493 -36099 -49183 -11510 -17509 -1523 -15698 -67060 -44499 -22789
4185b2789n1923P354O388N0212L8228J2514l0769k2141N0415j2180l9411m6238
$$ -22789 -74712 -67358 -60970 -10758 27470 39984 9215 -12926 37489 25309 -14102 -60340
4173f0340J0194J8554L7834J5864j0001J7204j9426l1672j3462L9994L5141J3239
$$ -60340 -50146 -31592 6242 22106 12105 29309 9883 -21789 -35251 4743 39884 53123
4161E3123l911l0114j220m6997k7545j0489J9630K5820l432k680L1241J5928m604
$$ 53123 49212 19098 17878 -29119 -56664 -67153 -47523 -21703 -25135 -27815 3426 19354 14750
4148A4750k6763k0694R901J8348K1056j7712O313n9330l2812K7884K7338Q104
$$ 14750 -12013 -32707 -22806 -4458 16598 -1114 5199 -54131 -86943 -59059 -31721 -23617
4136b3617n250l0348k9481r331L4002O0139l9582j6705q804k0404j093N431P2996
$$ -23617 -28867 -59215 -88696 -98027 -64025 -3886 -43468 -60173 -68977 -89381 -90474 -85043 -12047
4123a2047N2141j3782k1888j1784R177j1748j2225K1090m44j6706k6372j2363
$$ -12047 40094 26312 4424 -7360 1817 -9931 -22156 -1066 -1510 -18216 -44588 -56951
4111e6951k536K2232L7070J790k2321J5398K5150K0280n6760j1877k3034k6102
$$ -56951 -59487 -37255 -185 1605 -20716 -5318 19832 40112 -16648 -28525 -51559 -77661
4099g7661J625K3458M9399K0883o002m6773j9415J3029L4384L9790k0222o514
$$ -77661 -76036 -52578 -3179 17704 11702 -35071 -54486 -41457 -7073 32717 12495 5981
4087E981J7190j6035j1257m3951m0797L4965K6127l7106k2047M5642M7635J8173
$$ 5981 23171 7136 -4121 -48072 -88869 -53904 -27777 -64883 -86930 -41288 6347 24520
4075B4520j683l0333k0874J6071J4904J1478q978J3099j8151l0504M207k799J335
$$ 24520 22837 -7496 -28370 -12299 2605 14083 5105 18204 53 -30451 -26244 -29043 -27708
4062b7708j6724J7650k7158K8373k5043P165L7521q553j6863n958m0112J2676
$$ -27708 -44432 -26782 -53940 -25567 -50610 -43445 -5924 -14477 -31340 -37298 -77410 -64734
4050f4734K1605k7931j6468P1230O540R501K2623L0797J1150p999k2190M800n271
$$ -64734 -43129 -71060 -87528 -16298 -9758 -257 22366 53163 64313 56314 34124 38924 33653
4037C3653m8942j8842m4203O31l3839j7157L2102M8527M6463k2662l6013J178
$$ 33653 -15289 -34131 -78334 -77703 -111542 -128699 -96597 -48070 -1607 -24269 -60282 -59104
4025e9104L3150p662m1358k1680j1450M8757N1511j9783J0418N8480K3025N96
$$ -59104 -25954 -33616 -74974 -96654 -108104 -59347 -7836 -27619 -17201 41279 64304 64900
4013F4900j9886j613N120j4356k0000j7374J3218n607k3213j8653j6818M6010
$$ 64900 45014 43401 48521 34165 14165 -3209 10009 4402 -18811 -37464 -54282 -8272
4001h272L5202K5881l562j1139n0215k6981j4185J3168K4985K548J2375L620j7414
$$ -8272 26930 52811 49249 38110 -12105 -39086 -53271 -40103 -15118 -12570 -195 3425 -13989
3988a3989O718K8130l006j600o094j7486K865m4619k6490k0764J4282L8209K5307
$$ -13989 -7271 20859 17853 16253 10159 -7327 -4462 -49081 -75571 -96335 -82053 -43844 -18537
3975a8537O818p850j6044J8624p652K9431K9514l1165k7718L3076L0799j5917
$$ -18537 -11719 -19569 -35613 -16989 -24641 4790 34304 3139 -24579 8497 39296 23379
3963B3379l1830K116J4489k6922k5206q224J7996q108k3880K9034K6919K4867
$$ 23379 -8451 -6335 8154 -18768 -43974 -52198 -34202 -42310 -66190 -37156 -10237 14630
3951A4630N724o107J1551k1385k6640K6780J0990L918L4592j1859k0582k4458
$$ 14630 20354 14247 25798 4413 -22227 4553 15543 19461 54053 42194 21612 -2846
3939b846n7492k3276j4843k018J6999K6181K1545J5186K0135K1548K2773J33n7309
$$ -2846 -60338 -83614 -98457 -100475 -83476 -57295 -35750 -20564 -429 21119 43892 44025 -13284
3926a3284J4508R995j54l1619j2889o257j8521J7418K5997J63j4085j5416L91
$$ -13284 1224 11219 11065 -20554 -33443 -39700 -58221 -40803 -14806 -14643 -28728 -44144 -43753
3913d3753N2986L8782L3299k9526m0642m9789M806M6514j2152K2610M286K0935
$$ -43753 9233 48015 81314 51788 11146 -38643 -33837 12677 525 23135 27421 48356
3901D8356O363l2313P70j1851J1744m5096J5215L3481N576k1013m1093m2366l2876
$$ 48356 54719 22406 23176 11325 23069 -22027 -6812 26669 32245 11232 -29861 -72227 -105103
3888a05103J7946K1173J9869k4141j2586O0776J7114J4870l264m182O609J2220
$$ -105103 -87157 -65984 -46115 -70256 -82842 -22066 -4952 9918 6654 2472 9081 21301
3876B1301r419m2074o6037J0457K4208J4679l933r835l1147K486j5146M8938M0958
$$ 21301 11882 -30192 -96229 -85772 -61564 -46885 -50818 -60653 -91800 -89314 -104460 -55522 -14564
3863a4564j0598K2724j3387l5290K1156l2275j5248J4267m3252k8210K3297N4285
$$ -14564 -25162 -2438 -15825 -51115 -29959 -62234 -77482 -63215 -106467 -134677 -111380 -57095
3851e7095L3185j5615l6861Q582P15m839M2200j353l1863K7753n819m829K7802
$$ -57095 -23910 -39525 -76386 -67804 -67089 -71928 -29728 -31081 -62944 -35191 -41010 -45839 -18037
3838a8037J1617k1913m742J6617J4802m1071p1493J4198N4071j2040K611L4241
$$ -18037 -6420 -28333 -33075 -16458 -1656 -42727 -114220 -100022 -45951 -57991 -55380 -21139
3826b1139R953r193J2544J2897l7852l3618K7923J1522l1513L4331O4846l0697
$$ -21139 -11186 -20379 -7835 5062 -32790 -66408 -38485 -26963 -58476 -24145 40701 10004
3814A0004k8012n4627k7226L6445N7085J1952K5019m064m9394N781P3276k0553
$$ 10004 -18008 -72635 -99861 -63416 -6331 5621 30640 26576 -22818 -17037 56239 35686
3802C5686k3697k426M0225k3962k2071k8979j7828j0765J5855M9930j243p926
$$ 35686 11989 9563 49788 25826 3755 -25224 -43052 -53817 -37962 11968 10725 2799
3790B799l205j4458L5506o884L55j7936j1127l250p341K4695L0529K3791Q877
$$ 2799 -406 -14864 20642 13758 14113 -3823 -14950 -18200 -25541 -846 29683 53474 62351
3777F2351m4880n8679J4072L942j4030L0344K3408K3054p449J857l370k5079M521
$$ 62351 17471 -41208 -27136 -23194 -37224 -6880 16528 39582 32133 33990 30620 5541 10062
3764A0062l2955k326J9497J6595K415K1256l6657L8497j0793p1219l4351J8394
$$ 10062 -22893 -25219 -5722 10873 13288 34544 -2113 36384 25591 -45628 -79979 -61585
3752f1585L6848J6191j7852q858J0531K7014J85o722j9959k6178M0256M2128n352
$$ -61585 -24737 -8546 -26398 -35256 -24725 2289 2474 -4248 -24207 -50385 -10129 31999 26647
3739B6647M666m5695Q737M5796J6680l6866k6858J5127Q717k8749p551M7601J5738
$$ 26647 31313 -14382 -5645 40151 56831 19965 -6893 8234 16951 -11798 -19349 28252 43990
3726D3990l7801r606j9255k402j3185M8433M14l0793l9581k2603L9765L0079N901
$$ 43990 6189 -3417 -22672 -25074 -38259 10174 10588 -20205 -59786 -82389 -42624 -12545 -6644
3713f644j2493J6324K8856K2281j671l781n2421m8685k0639l1326Q636N4561J8977
$$ -6644 -19137 -2813 26043 48324 46653 42872 -9549 -58234 -78873 -110199 -101563 -47002 -28025
3700b8025m4570R406L4901L1290J4060p193k9396j0805L2147l2955k6969J8687
$$ -28025 -72595 -63189 -28288 3002 17062 9869 -19527 -30332 1815 -31140 -58109 -39422
3688c9422R488j2716J2876k0952r902k0524j7942K1932J1067J2965O7792M5666
$$ -39422 -29934 -42650 -29774 -50726 -60628 -81152 -99094 -77162 -66095 -53130 14662 60328
3676F0328l1692J7230J0951l0035j1003n798J5517M865j7180j4118m9247p368
$$ 60328 28636 45866 56817 26782 15779 9981 25498 30363 13183 -935 -50182 -57550
3664e7550M223L6416J9152K8319K4474k8379j7037k0150j828J1128j4710L0101
$$ -57550 -53327 -16911 2241 30560 55034 26655 9618 -10532 -12360 -1232 -15942 14159
3652A4159R30P348j1451k9975K4063r195p672M559p303j2209j4803K8183O5771
$$ 14159 15089 22437 10986 -18989 5074 -4121 -11793 -7234 -14537 -26746 -41549 -13366 52405
3639E2405N690l0572l1153j7323O8301J3498l5419l5125J7306K4816l8235l2332
$$ 52405 58095 27523 -3630 -20953 47348 60846 25427 -9698 7608 32424 -5811 -38143
3627c8143k4636R699L0344M2661J4669k6280l987J3361k9954n1974K4573M9780
$$ -38143 -62779 -53080 -22736 19925 34594 8314 4327 17688 -12266 -64240 -39667 10113
3615A0113j1295J3019M4215P759k6247K603k8497k0095j6212R631L1359J0081
$$ 10113 -1182 11837 56052 63811 37564 40167 11670 -8425 -24637 -15006 16353 26434
3603B6434N698q811k7396l1640l3565j7588L4548J2651L6592K1095j7385p24J0068
$$ 26434 32132 23321 -4075 -35715 -69280 -86868 -52320 -39669 -3077 18018 633 -91 9977
3590I977M427M545O203M655n5260l4024j4734J4607O3174K2807k747J418j5046
$$ 9977 14404 18949 25152 29807 -25453 -59477 -74211 -59604 3570 26377 23630 25048 10002
3577A0002k9301J3793K643k8951k8049K4148r098L8020P008n1178J357J2173J7589
$$ 10002 -19299 -5506 -2863 -31814 -59863 -35715 -44813 -6793 215 -50963 -49606 -37433 -19844
3564a9844L6757L5829q410n1497j1627J3282J6651P532L4586o1907RL5050m0246
$$ -19844 16913 52742 44332 -7165 -18792 -5510 11141 18673 53259 -8648 -8639 26411 -13835
3551a3835o2L9858O326l5768j301l2021l2587M6664J8358J7488P130j2091K7687
$$ -13835 -13897 25961 32287 -3481 -4782 -36803 -69390 -22726 -4368 13120 20250 8159 35846
3538C5846M63j3344m0829R321K9955j7998N149R278J7116k024j041J3976q973
$$ 35846 36309 22965 -17864 -8543 21412 3414 8563 17841 34957 32933 31892 45868 36895
3525C6895l4764m4913l5208O498L1776m133l5170o259j1461N4025K5332J9658
$$ 36895 2131 -42782 -77990 -71492 -39716 -43849 -79019 -85278 -96739 -42714 -17382 2276
3513B276O850J3883l4126n594M833k4531j0997K9914l208M975M4094K72K2759
$$ 2276 9126 23009 -11117 -16711 -11878 -36409 -47406 -17492 -20700 -15725 28369 28641 51400
3500E1400j487J7685J2805m8785n4016J0496J0536l5212J1884L7168j3627K2839
$$ 51400 49913 67598 80403 31618 -22398 -11902 -1366 -36578 -24694 12474 -1153 21686
3488B1686n1170k1653K7181N324J5710N7649P778o438l371k2268N038p86j0907
$$ 21686 -29484 -51137 -23956 -18632 -2922 54727 62505 56067 52696 30428 35466 34680 23773
3475B3773J447M759j8739m0598j3762r170K7887J1062j3279k1718N2297K1298
$$ 23773 25220 29979 11240 -29358 -43120 -52290 -24403 -13341 -26620 -48338 3959 25257
3463B5257k0061j8064M1679p827l2626j4356J7102m141j3726L7906M8633J1612
$$ 25257 5196 -12868 28811 20984 -11642 -25998 -8896 -13037 -26763 11143 59776 71388
3451G1388o5096l289P683k8812K1598l3242R681L265j0222J0425j2787p138r006
$$ 71388 6292 3003 10686 -18126 3472 -29770 -20089 -16824 -27046 -16621 -29408 -36546 -45552
3438d5552j5625J0801Q644r472J2818R819K8616J6134j5030Q720l7297l2576p427
$$ -45552 -61177 -50376 -41732 -51204 -38386 -28567 49 16183 1153 9873 -27424 -60000 -67427
3425f7427N474M2769K8489j0340O497m912J1612j5188k8710K428J5615K4821N285
$$ -67427 -61953 -19184 9305 -1035 5462 550 12162 -3026 -31736 -29308 -13693 11128 16413
3412A6413j2993l3288j5170K2080l0284o0906j6385P0651K1395k8295K3566k406
$$ 16413 3420 -29868 -45038 -22958 -53242 -114148 -130533 -59882 -38487 -66782 -43216 -45622
3400d5622R120k222m7402j1719K889P754K362J6153J6794O9738N5680k8445l5443
$$ -45622 -36502 -38724 -86126 -97845 -94956 -87202 -84840 -68687 -51893 17845 73525 45080 9637
3387I637j9596m7080J0452q893R565K5914L449k304N149P651l1300j3139j1665
$$ 9637 -9959 -57039 -46587 -55480 -45915 -20001 -16552 -18856 -13707 -6056 -37356 -50495 -62160
3374f2160l4766J142L1146M3073J0969L819K267k2287k3138k0082l196K7183L1304
$$ -62160 -96926 -95784 -64638 -21565 -10596 -6777 -4510 -26797 -49935 -70017 -73213 -46030 -14726
3361a4726M4301J3007k280P87k2418l5110l2256p397L3197k3370n121L2843K5561
$$ -14726 29575 42582 40302 41089 18671 -16439 -48695 -56092 -22895 -46265 -51386 -18543 7018
3348G018k3773N658N0228Q623l3682k5709J0238M55Q312k7532j7781J1489L3979
$$ 7018 -16755 -11097 39131 47754 14072 -11637 -1399 -944 7368 -20164 -37945 -26456 7523
3335G523J9585j0213j6990L6574j0943k1521J1421O763j0827j5576J1221j7785
$$ 7523 27108 16895 -95 36479 25536 4015 15436 22199 11372 -4204 7017 -10768
3323a0768m0031J8385J1887k9331M184m1796L2823J6676K167J0661J8883Q079
$$ -10768 -50799 -32414 -20527 -49858 -45674 -87470 -54647 -37971 -35804 -25143 -6260 1819
3311A819j7739m9898k300J2971N9190j9026l332k4499K4522N0738m433k9096k7772
$$ 1819 -15920 -65818 -68118 -55147 4043 -14983 -18315 -42814 -18292 32446 28013 -1083 -28855
3298b8855M3171J9119j5747n791J1709q581j9269l2486j6339L6232M4163R981
$$ -28855 14316 33435 17688 11897 23606 15025 -4244 -36730 -53069 -16837 27326 37307
3286C7307l3160K4504J6501k0195l1019j6362m3557r902L8715k2388j7615M272
$$ 37307 4147 28651 45152 24957 -6062 -22424 -65981 -75883 -37168 -59556 -77171 -72899
3274g2899K3106P120O453L809r872N344k702J7804J0895m964l226J6666M1575
$$ -72899 -49793 -42673 -36220 -32411 -42283 -36939 -39641 -21837 -10942 -15906 -19132 -2466 39109
3261C9109K0241p315J7673j4314J0922J0324J596k5823j6197l8879j9674j9436
$$ 39109 59350 52035 69708 55394 66316 76640 78236 52413 36216 -2663 -22337 -41773
3249d1773J4815J2768o959k8378J0858O1513j9722j1218M927J3566K845j2991
$$ -41773 -26958 -14190 -21149 -49527 -38669 22844 3122 -8096 -3169 10397 13242 251
3237B51j2637m6499n7687m1257k583q850P5520L6568K1645m1456j3213P091n930
$$ 251 -12386 -58885 -116572 -157829 -160412 -169262 -93742 -57174 -35529 -76985 -90198 -83107 -89037
3224h9037K1120L7712K2715K3201J2834j3963M024k1754l0506o44L3639n573j8578
$$ -89037 -67917 -30205 -7490 15711 28545 14582 18606 -3148 -33654 -34298 -659 -6232 -24810
3211b4810K5839k2349L8279N781j0743l9426l8720l0391L0905M0529L2598J7342
$$ -24810 1029 -21320 16959 22740 11997 -27429 -66149 -96540 -65635 -25106 7492 24834
3199B4834K2432p298j8458J6731k8749l704k1961j8282M012k0301k480M6331j4446
$$ 24834 47266 39968 21510 38241 9492 5788 -16173 -34455 -30443 -50744 -53224 -6893 -21339
3186b1339k1566j5369j0752k8542m696L9315L9375J7176m3488k844M7654K0884
$$ -21339 -42905 -58274 -69026 -97568 -102264 -62949 -23574 -6398 -49886 -52730 -5076 15808
3174A5808J6389n279m4567n407l656J1934q744N141L7448K8720L3847m7667m7675
$$ 15808 32197 26918 -17649 -23056 -26712 -14778 -23522 -18381 19067 47787 81634 33967 -13708
3161a3708m2346n3794M0892J0698K2495L1774n767j3941Q218J5375k3040J198
$$ -13708 -56054 -109848 -68956 -58258 -35763 -3989 -9756 -23697 -15479 -104 -23144 -21946
3149b1946J1343R431K258l4719l200N396L0187P858J5913J3133j5357J1400Q651
$$ -21946 -10603 -1172 1086 -33633 -36833 -31437 -1250 6608 22521 35654 20297 31697 40348
3136D0348k4583l7328K4639J3778j7650l0624J1903l68q235K680K3555J0537k0871
$$ 40348 15765 -21563 3076 16854 -796 -31420 -19517 -19885 -28120 -25440 -1885 8652 -12219
3123a2219J7522M4Q502p124j0029l635R494LK261q704r22k7966J4653O2019M2888
$$ -12219 5303 5347 13849 6725 -3304 -6939 2555 2558 4819 -3885 -4807 -32773 -18120 43899 86787
3108H6787j2109l0317k0083N182j1029M6954p089p2844k3419J4031L406j2361
$$ 86787 74678 44361 24278 29460 18431 65385 58296 -14548 -37967 -23936 -20530 -32891
3096c2891j2543j3496P315L0460q21l713j8406k2148r122K4592K8897M9548k9133
$$ -32891 -45434 -58930 -51615 -21155 -21976 -25689 -44095 -66243 -75365 -50773 -21876 27672 -1461
3083a461J3702L8051j8539j5171j3505k2971L0864L5313l965k2967k1850k7506
$$ -1461 12241 50292 31753 16582 3077 -19894 10970 46283 42318 19351 -2499 -30005
3071c0005j8751j15M7908K4785K2797j0870n4146l0218P27J750K2389L351l1441
$$ -30005 -48756 -48871 -963 23822 46619 35749 -18397 -48615 -47888 -46138 -23749 -20398 -51839
3058e1839j7876O690k3873m1138k9591q479N4735n544P6586L1402M0575L108k944
$$ -51839 -69715 -63025 -86898 -128036 -157627 -166106 -111371 -116915 -40329 -8927 31648 34756 31812
3045C1812N05j5867L2273m915m0948m108M878n908K8022J400o118K326L1638m0978
$$ 31812 32317 16450 48723 43808 2860 -1248 3630 -2278 25744 27144 21026 23352 54990 14012
3031A4012m2022J3045J0229j2765m2626k9463J9300K568J3473J7715K1154K3723
$$ 14012 -28010 -14965 -4736 -17501 -60127 -89590 -70290 -67722 -54249 -36534 -15380 8343
3019H343M469o803K200J6917m0848J1135L5181J1583O701j6751l9558j7421L99
$$ 8343 12812 6009 8209 25126 -15722 -4587 30594 42177 48878 32127 -7431 -24852 -24453
3006b4453k9341q156K6756M724L787J5166J5502Q118l503j9814Q266j5676l5786
$$ -24453 -53794 -61950 -35194 -30470 -26683 -11517 3985 12103 8600 -11214 -2948 -18624 -54410
2993e4410J6184P5803K1997j40m2485k9496K408L5953O426m972j6709j222P392
$$ -54410 -38226 37577 59574 59434 16949 -12547 -10139 25814 32240 27268 10559 9337 16729
2980A6729J6918k1609J9499J5021j8652J0904J8109m3475k1766L155P88L045Q767
$$ 16729 33647 12038 31537 46558 27906 38810 56919 13444 -8322 -5167 -4379 -1334 7433
2967G433O90j1497n4684l65M366L6422L5889Q197j9779K473J4923l0457j1276
$$ 7433 8123 -3374 -58058 -58423 -54057 -17635 18254 26451 6672 9145 24068 -6389 -17665
2954a7665L3022j291m421o787r335J5552J6981m62l5747j9500O438r735p785q782
$$ -17665 15357 14066 9645 2858 -6477 9075 26056 25594 -10153 -29653 -23215 -32950 -40735 -49517
2940d9517N70M7446M1881j0571k7331m217k6576M024M0440j0061j2662J9684K7430
$$ -49517 -48947 -1501 40380 29809 2478 -1739 -28315 -24291 16149 6088 -6574 13110 40540
$$ [...]
##END NTUPLES=NMR SPECTRUM
##END=
