##TITLE=Analysis number 329219
Compound Code cc 30609
Project Code adrs
Chemist Name fudan
##JCAMPDX= 6.0         $$ Bruker NMR JCAMP-DX V2.0
##DATA TYPE= NMR SPECTRUM
##DATA CLASS= NTUPLES
##ORIGIN= Bruker BioSpin GmbH
##OWNER= nmr
$$ XWIN-NMR		Version 3.5
$$ Mon Aug 13 11:03:14 2007 GMT Daylight Time (UT+1h)  MAYBRIDGE\nmr@NMR_250MHZ
##.OBSERVE FREQUENCY= 250.131544655141
##.OBSERVE NUCLEUS= ^1H
##.ACQUISITION MODE= SIMULTANEOUS (DQD)
##.ACQUISITION SCHEME= undefined
##.AVERAGES= 16
##.DIGITISER RES= 18
##SPECTROMETER/DATA SYSTEM= dpx250
##.PULSE SEQUENCE= zg30
##.SOLVENT NAME= CDCl3
##.SHIFT REFERENCE= (INTERNAL, CDCl3, 0, 16.522)
##AUDIT TRAIL= $$ (NUMBER, WHEN, WHO, WHERE, WHAT)
$$ ##TITLE= Audit trail, XWIN-NMR		Version 3.5
$$ ##JCAMPDX= 5.01
$$ ##ORIGIN= Bruker BioSpin GmbH
$$ ##OWNER= nmr
$$ C:\u/data/dgb/nmr/ADRS/460/pdata/1/auditp.txt
$$ ##AUDIT TRAIL=  $$ (NUMBER, WHEN, WHO, WHERE, WHAT)
(   1,<2007-08-13 11:02:50.31 +100>,<MAYBRIDGE\nmr>,<NMR_250MHZ>,
      <created by zg, POWCHK disabled, PULCHK disabled
       configuration hash MD5:
       76 6E 9A 78 1E 09 19 81 EC 84 63 8F B0 6A 59 2D
       data hash MD5: 64K
       0A AC 42 10 70 77 F6 46 16 ED 40 ED 0F D7 86 85>)
(   2,<2007-08-13 11:03:04.81 +100>,<MAYBRIDGE\nmr>,<NMR_250MHZ>,
      <Start of raw data processing
       ef LB = 0.3 FT_mod = 6 PKNL = 1 SI = 32K 
       data hash MD5: 32K
       B8 E7 64 DC 28 89 D3 35 A7 BD B6 DB 0E 22 7A B9>)
(   3,<2007-08-13 11:03:06.43 +100>,<MAYBRIDGE\nmr>,<NMR_250MHZ>,
      <apk 
       data hash MD5: 32K
       D3 66 48 11 92 95 DD 5A 11 E2 65 B5 21 E3 96 53>)
(   4,<2007-08-13 11:03:07.14 +100>,<MAYBRIDGE\nmr>,<NMR_250MHZ>,
      <abs ABSG = 5 
       data hash MD5: 32K
       F3 43 57 6B DD 09 04 1B 72 7E E0 B8 37 F8 8B 5B>)
$$ ##END=
$$ 
$$ hash MD5
$$ B2 CD 35 66 B2 43 C9 E5 49 EB 1D 0B BF 31 33 0A
##$RELAX= 
##$RELAX= 
##$RELAX= 
##$RELAX= 
##$RELAX= 
##$RELAX= 
##$RELAX= 
$$ Bruker specific parameters
$$ --------------------------
##$DU= <C:\u>
##$EXPNO= 460
##$NAME= <ADRS>
##$PROCNO= 1
##$TYPE= <nmr>
##$USER= <dgb>
##$AMP= (0..31)
100 100 100 100 100 100 100 100 100 100 100 100 100 100 100 100 100 100 
100 100 100 100 100 100 100 100 100 100 100 100 100 100 
##$AQSEQ= 0
##$AQ_mod= 3
##$AUNM= <au_zg>
##$AUTOPOS= <12 >
##$BF1= 250.13
##$BF2= 250.13
##$BF3= 250.13
##$BF4= 250.13
##$BF5= 500.13
##$BF6= 500.13
##$BF7= 500.13
##$BF8= 500.13
##$BYTORDA= 1
##$CFDGTYP= 0
##$CFRGTYP= 5
##$CHEMSTR= <none>
##$CNST= (0..31)
1 1 145 1 1 1 1 1 1 1 1 1 1 1 1 1 1 1 1 1 1 1 1 1 1 1 1 1 1 1 1 1 
##$CPDPRG= <>
##$CPDPRG1= <>
##$CPDPRG2= <>
##$CPDPRG3= <>
##$CPDPRG4= <mlev>
##$CPDPRG5= <mlev>
##$CPDPRG6= <mlev>
##$CPDPRG7= <mlev>
##$CPDPRG8= <mlev>
##$CPDPRGB= <>
##$CPDPRGT= <>
##$D= (0..31)
0 1 0 0 0 0 0 0 0 0.06 0 0 0 0 0 0 0.0002 0 0 0 0 0 0 0 0 0 0 0 0 0 0 
0 
##$DATE= 1186999369
##$DBL= (0..7)
120 120 120 120 120 120 120 120 
##$DBP= (0..7)
150 150 150 150 150 150 150 150 
##$DBP07= 0
##$DBPNAM0= <>
##$DBPNAM1= <>
##$DBPNAM2= <>
##$DBPNAM3= <>
$$ [...]
##$SUBNAM6= <"">
##$SUBNAM7= <"">
##$SUBNAM8= <"">
##$SUBNAM9= <"">
##$SW= 20.6930455092707
##$SWIBOX= (0..15)
0 0 3 0 0 0 0 0 0 0 0 0 0 0 0 0 
##$SW_h= 5175.983436853
##$TD= 65536
##$TD0= 1
##$TE= 296.16
##$TE2= 300
##$TE3= 300
##$TEG= 300
##$TL= (0..7)
0 120 120 120 120 120 120 120 
##$TP= (0..7)
150 150 150 150 150 150 150 150 
##$TP07= 0
##$TPNAME0= <>
##$TPNAME1= <>
##$TPNAME2= <>
##$TPNAME3= <>
##$TPNAME4= <>
##$TPNAME5= <>
##$TPNAME6= <>
##$TPNAME7= <>
##$TPOAL= (0..7)
0.5 0.5 0.5 0.5 0.5 0.5 0.5 0.5 
##$TPOFFS= (0..7)
0 0 0 0 0 0 0 0 
##$TUNHIN= 0
##$TUNHOUT= 0
##$TUNXOUT= 0
##$USERA1= <user>
##$USERA2= <user>
##$USERA3= <user>
##$USERA4= <user>
##$USERA5= <user>
##$V9= 5
##$VALIST= <valist>
##$VCLIST= <CCCCCCCCCCCCCCC>
##$VD= 0
##$VDLIST= <DDDDDDDDDDDDDDD>
##$VPLIST= <PPPPPPPPPPPPPPP>
##$VTLIST= <TTTTTTTTTTTTTTT>
##$WBST= 1024
##$WBSW= 4
##$XGAIN= (0..3)
0 0 0 0 
##$XL= 0
##$YL= 0
##$YMAX_a= 412883
##$YMIN_a= -497151
##$ZGOPTNS= <>
##$ZL1= 120
##$ZL2= 120
##$ZL3= 120
##$ZL4= 120
##$ABSF1= 16.522
##$ABSF2= -4.171173
##$ABSG= 5
##$ABSL= 3
##$ALPHA= 0
##$AQORDER= 0
##$ASSFAC= 0
##$ASSFACI= 0
##$ASSFACX= 0
##$ASSWID= 0
##$AUNMP= <proc_1d>
##$AZFE= 0.1
##$AZFW= 0.1
##$BCFW= 0
##$BC_mod= 0
##$BYTORDP= 0
##$COROFFS= 0
##$CY= 12.5
##$DATMOD= 1
##$DC= 0
##$DFILT= <>
##$DTYPP= 0
##$F1P= 14.0000005364418
##$F2P= -0.99999901652339
##$FCOR= 0.5
##$FTSIZE= 32768
##$FT_mod= 6
##$GAMMA= 0
##$GB= 0
##$INTBC= 1
##$INTSCL= 1
##$ISEN= 128
##$LB= 0.3
##$LEV0= 0
##$LPBIN= 0
##$MAXI= 10000
##$MC2= 0
##$MEAN= 0
##$ME_mod= 0
##$MI= 0
##$NCOEF= 0
##$NC_proc= -3
##$NLEV= 6
##$NOISF1= 0
##$NOISF2= 0
##$NSP= 0
##$NTH_PI= 0
##$NZP= 0
##$OFFSET= 16.522
##$PC= 1
##$PHC0= 164.0156
##$PHC1= 3.39481
##$PH_mod= 1
##$PKNL= yes
##$PPARMOD= 0
##$PSCAL= 4
##$PSIGN= 0
##$REVERSE= no
##$SF= 250.13
##$SI= 32768
##$SIGF1= 0
##$SIGF2= 0
##$SINO= 400
##$SIOLD= 32768
##$SREGLST= <1H.CDCl3>
##$SSB= 0
##$STSI= 32768
##$STSR= 0
##$SW_p= 5175.98343685301
##$SYMM= 0
##$S_DEV= 0
##$TDeff= 65536
##$TDoff= 0
##$TI= <Analysis number 999999
Compound Code 99
Book Reference 9
Project Code 9>
##$TILT= no
##$TM1= 0
##$TM2= 0
##$TOPLEV= 0
##$USERP1= <user>
##$USERP2= <user>
##$USERP3= <user>
##$USERP4= <user>
##$USERP5= <user>
##$WDW= 1
##$XDIM= 32768
##$YMAX_p= 355159971
##$YMIN_p= -28870
$$ End of Bruker specific parameters
$$ ---------------------------------
##NTUPLES= NMR SPECTRUM
##VAR_NAME=  FREQUENCY,     SPECTRUM/REAL,   SPECTRUM/IMAG
##SYMBOL=    X,             R,               I
##VAR_TYPE=  INDEPENDENT,   DEPENDENT,       DEPENDENT
##VAR_FORM=  AFFN,          ASDF,            ASDF
##VAR_DIM=   32768,         32768,           32768
##UNITS=     HZ,            ARBITRARY UNITS, ARBITRARY UNITS
##FACTOR=    0.157963299565203, 1,           1
##FIRST=     4132.6476996994, 0,             0
##LAST=      -1043.33573715361, 0,           0
##MIN=       -1043.33573715361, -28870,      0
##MAX=       4132.6476996994, 355159971,     0
$$ Real data points
##PAGE= N=1
##DATA TABLE= (X++(R..R)), XYDATA
$$ [...]
16653b0452P387K264N373J063k375l411m272M85J884o417m706k436J798N468K411
16638a5936k86j62k927L461Q808j503j482J720K568K912L003m365n261m676J217
16623a2909j74j852J904n134L870P869J061o180K062L339r94K180j104J821k51
16608d492R88k911m410M251O258L380J545J922m466q279k531J807J163J685K782
16593a308P71l805Q9K303N99m072M209j437p310k516M705N922k476o347L853P958
16577A138l510o424l223k790j999L233j106l769K71L521L120P95L265j676K323
16562f831R086j233l626l772L769M372n15j440o079n528q22m803N774P387j998
16547f259o13Q252M073n680m297m849n505N770K014j224m365K114J982L107Q99
$$ y = [-20452, -13065, -10801, -5428, -4365, -6740, -10151, -14423, -13938, -12054, -18471, -23177, -25613, -23815, -18347, -15936, -16222, -16384, -19311, -15850, -7042, -8545, -10027, -8307, -5739, -2827, 176, -4189, -9450, -14126, -12909, -13083, -14935, -13031, -18165, -14295, -6426, -5365, -11545, -9483, -6144, -7138, -4958, -6062, -4241, -4492, -3504, -6415, -10825, -6574, -316, 3064, 4609, 6531, 2065, -6214, -8745, -6938, -5775, -4090, -1308, -537, -4342, -4253, -1950, -1351, -5423, -1214, -2651, -9961, -12477, -7772, -1850, -4326, -10673, -6820, 1138, -2372, -8796, -12019, -14809, -16808, -13575, -14681, -18450, -18179, -14658, -11538, -10743, -7478, -9154, -6831, 2255, 1022, -2604, -6376, -2607, 1765, 1250, -190, -6269, -11797, -12619, -17422, -11648, -4261, -6259, -6872, 1380, 5453, -227, -4524, -9373, -14878, -9108, -7094, -8318, -12683, -10569, -8587, -5480, -4581]
16532d581J93J687o322j831K180j13P75J230J441P32l0j635M456M093J952m708
16516d81j835j039Q46q36K02k25J456j024j33n036j85j351o363N815R53j314K497
16499h053L119J497q900M896O979K221O43q859l708k483N045N120J386m393J436
16484d054k019j273p25r23j869o378J940N774j057k138l626l240p65Q091J0034
16469b228k549M93J234l24j840j02q96l67r964p99K238P898k44M205l41r5r663
16452a3344l826L133L675j120o88l380l09K476Q600M380k704j042k176l236L554
16437f007m185K044J381m896l574J684j541J227N52M459j256P58m506J661K821
16422i378J289m202k615K448N5N253N482O374n639m49K032m716k533Q64M211j401
$$ y = [-4581, -4388, -2701, -9023, -10854, -8674, -8787, -8012, -6782, -5341, -4609, -4639, -6274, -1818, 2275, 4227, -481, -2316, -3355, -2509, -3345, -3143, -3368, -1912, -2936, -3069, -8105, -8290, -9641, -16004, -10189, -9236, -10550, -8053, -4934, -3437, -12337, -7441, -462, 1759, 2402, -6457, -10165, -12648, -7603, -2483, -1097, -5490, -4054, -6073, -7346, -8071, -8994, -10863, -17241, -15301, -9527, -10584, -12722, -16348, -19588, -20353, -12262, -2228, -4777, -4284, -3050, -3374, -5214, -5316, -6212, -6579, -16543, -17342, -15104, -7206, -7450, -3245, -3586, -3681, -13344, -17170, -14037, -10362, -11482, -12170, -15550, -15859, -13383, -4783, -403, -3107, -4149, -6325, -9561, -6007, -10192, -8148, -6767, -11663, -15237, -13553, -15094, -13867, -13315, -8856, -10112, -9354, -13860, -12199, -9378, -8089, -12291, -14906, -12458, -12403, -7150, -1668, 4706, -933, -1382, 650, -4066, -6599, -5735, -1524, -2925]
16406b925O02n253o241P153K789R23k199l778j039l041n34M76M615M459K20Q3
16390c690r398m19N899Q908j691m504K704L402j087p359n608M988l378l898O578
16375h553P75M616j671n033m74p240j849J662L684R379O416J439n077j3140m298
16360a9364J731L485k22O845M695K711j776p17K152K556l911M232k785k378L967
16345A221n686O00O63k565R45k840J203J992k340J26J168j679J940l907o31m696
16329a4486M526O739J703j812m313K167J8J408J391k091n831q474p364k032N75
16314b7876M062Q247M196L808L292L041L180P24m073J279j594o114n90k409L980
16299f847P567q71n252k937o36N404L336k881Q53O31j3355p870O277N863k748
$$ y = [-2925, -2323, -7576, -13817, -6664, -3875, -2952, -5151, -8929, -9968, -13009, -13543, -13067, -8452, -3993, -3773, -3690, -13088, -13507, -7608, 1300, -391, -4895, -2191, 1211, 124, -7235, -12843, -7855, -11233, -15131, -8553, -7778, -3162, -4833, -9866, -10340, -17580, -19429, -17767, -14083, -4704, 1712, 3151, -1926, -15066, -19364, -17633, -14148, -14370, -7525, -2830, -119, -1895, -2612, -460, 2096, -1815, 2417, -368, -2746, 1221, -4465, -3865, -3202, -5767, -4822, -7662, -6459, -4467, -6807, -6681, -5513, -7192, -5252, -9159, -9790, -14486, -9960, -3221, -1518, -3330, -7643, -5476, -5458, -4050, -2659, -4750, -10581, -19055, -26419, -28451, -27876, -23814, -15567, -11371, -7563, -4271, -1230, 1950, 2674, -1399, -120, -1714, -7828, -8418, -10827, -6847, 720, -151, -5403, -8340, -8976, -3572, -236, -3117, -2264, -1633, -14988, -22858, -16581, -10718, -13466]
16284a3466L100L252k107M331J470K406j720J21J673J370j716l503l628p626M479
16269a1564P235K661L127p66L718J506N02p197p781k160K097O085L125q347K527
16254e232m353l463l289K61P598L437o57n857l591J93K005m67p219l83K546N899
16238a2572R544J30j791k416l859J73l387J209j2p033L317M299q35k045J572P323
16222f383M114P727M464p237m332m798l124M107m194j697L684q10j980O197M549
16207B87j426p439K894L562k716K425K06j877l612j070l165l019k065P761K484
16192f770J976P147k079m457l301n615m776K111M410L71K563K904k445L656M092
16177b13M143l263k773M99l965k875L585J030o129o267J147L317l588K596N331
$$ y = [-13466, -10366, -7114, -9221, -4890, -3420, -1014, -2734, -2613, -940, 430, -1286, -4789, -8417, -16043, -11564, -4329, -1668, 1459, 693, 4411, 5917, 6419, -778, -8559, -10719, -8622, -2537, 588, -7759, -5232, -9585, -13048, -16337, -16076, -8478, -5041, -5698, -11555, -15146, -14953, -12948, -13415, -20634, -21017, -18471, -12572, -3028, -2898, -4689, -7105, -10964, -10791, -14178, -12969, -12981, -20014, -16697, -12398, -13233, -15278, -13706, -6383, -2269, 5458, 9922, 2685, -1647, -6445, -9569, -5462, -9656, -11353, -7669, -8479, -10459, -4262, 287, -1139, -8578, -5684, -2122, -4838, -2413, -2207, -4084, -7696, -8766, -11931, -14950, -17015, -9254, -6770, -4794, 2353, 274, -4183, -7484, -13099, -17875, -15764, -11354, -10983, -8420, -5516, -7961, -4305, -213, 3930, 667, -2106, -1607, -5572, -8447, -4862, -3832, -9961, -16228, -15081, -11764, -15352, -12756, -7425]
16162g425K776n23K112l421m988K50o1K324m449K226J738j580Q82k154m115N523
16146a0885J2938J854p475k953K546L489K472O427K511n855n078J737k656l191
16132d119k716k161K464l025l253O372O317j376R99K886o833p829k796O437N410
16117c223N023M116n839n427j313k147o818K98N652J307k01j56L98m94J822L192
16101c810J037L247Q741j086p540k29j955m059m800o96l489j2N409k910p137O831
16085a2458P552p61m075J889m018p949l241J779Q345N936k181k267K175L408M88
16070e378l740j734K808P8J884M42N94L107k293R66J160k863j501J82l363m01
16054a0052j776k445j237L089N959l465j629k54M312P359l682j895m302J369L644
$$ y = [-7425, -4649, -5172, -3060, -6481, -11469, -11219, -11280, -8956, -13405, -11179, -9441, -11021, -10139, -12293, -16408, -10885, 2053, 3907, -3568, -6521, -3975, -486, 1986, 8413, 10924, 5069, -9, 1728, -928, -4119, -6835, -8996, -6532, -9557, -12810, -6438, -121, -1497, -498, 2388, -4445, -12274, -15070, -8633, -3223, 1800, 5916, 77, -5350, -6663, -8810, -15628, -15330, -9678, -8371, -8572, -8728, -8330, -8824, -7002, -3810, -2773, 474, 9215, 8129, 589, 360, -1595, -5654, -10454, -11150, -14639, -14651, -9242, -12152, -19289, -12458, -4906, -5667, -9742, -7853, -11871, -19820, -23061, -21282, -12937, -7001, -9182, -11449, -9274, -5866, -5378, -9118, -10852, -8044, -7966, -6082, -5640, -5046, -1939, -4232, -3266, -2106, -4969, -6470, -6288, -9651, -10052, -11828, -14273, -15510, -12421, -6462, -9927, -11556, -11810, -7498, -139, -3821, -5716, -10018, -8649, -5005]
16039e005J774k03K052L733m863K715J61M049o1o584m3P954m795m957K3J529q051
16022a0572r765j151L931P209M651j003K635J125Q025J125l063n06J214j1519
16008g664k785M65N201L140N97K455K817k136n435j589N060p92L663M564n206
15993B355r231k070J125j587l251L957Q967N487j351m013J890K682k849k745L05
15978c29L810o0k030K137O88k678k295o90N25J972P63J412m427P27J447m875L018
15961h85P04p310k397J253L312l681L19M558M212n131j807J389n1j197L570M918
15945A776n65l060l749l305l0j855J798N199Q898K796n649n895J419L20m303n607
15929a1812k83M843L59R83n87K308P837M306l78o909l391o4l99K072n362m094
$$ y = [-5005, -3231, -3434, -1382, 2351, -2512, 203, 364, 4413, 4352, -2232, -2275, 5679, 884, -4073, -4050, -2521, -10572, -20337, -21488, -17557, -10348, -5697, -6700, -4065, -2940, 5085, 6210, 3147, 2641, 3855, -7664, -10449, -9984, -4783, -1643, -1046, 1409, 4226, 2090, -3345, -4934, 126, -666, 2997, 7561, 2355, -6876, -8946, -7821, -9408, -12659, -8702, 265, 5752, 4401, 388, 2278, 4960, 2111, -634, -329, 3481, 3421, 1391, 3528, 4216, 1538, -757, -1447, -922, 1050, 1813, 3225, -1202, -475, 972, -3903, -885, -181, -7491, -9888, -8635, -5323, -9004, -8685, -4127, 85, -5046, -6853, -5464, -5515, -6712, -3142, 1776, 1211, -1849, -5598, -8903, -8933, -10788, -8990, -3791, 5107, 7903, 2254, -3641, -2222, -1902, -6205, -11812, -12095, -7252, -6893, -5910, -6497, -4189, 3648, 7954, 7576, 667, -2724, -2788, -3187, -1115, -6477, -10571]
15913a0571r38K157J744n315k395M067M005N043k23l933N49J315K140j4Q341r39
15897E033n907N97n23K721j226m124j0548M396Q648R961q52n978k719P83r81k450
15881c169q35m338O265P026M431j300r121l919L83K274j177R81j558J940N206
15866C089n22o677n173L017O318l562n086R8M169M02J63K6o740j574O89K252O168
15849b943K106p392m380L638L735M285m167o406P15J449J711N40m996l370P719
15834g756J1722j839m612k781l809J79j248k162m292L629Q452O193r92J515j459
15819G40K577K578l443m643K804O12K9j766p170K447R937P361l733P16P059k447
15803A3658p388m269R78r71L893N550J077j1429j344J854J843o308L540J064o797
$$ y = [-10571, -11509, -9352, -7608, -12923, -15318, -11251, -7246, -2203, -2426, -6359, -5810, -4495, -2355, -2369, 5972, 5033, -874, -277, -800, 1921, 695, -3429, -13977, -9581, -933, 9028, 8176, 2198, -521, 262, -719, -3169, -4004, -8342, -2077, 4949, 9380, 8080, -1041, -4960, -4577, -2303, -3480, -2499, -4057, -2117, 3089, 2567, -4110, -9283, -6266, 52, -3510, -8596, -8498, -4329, -3927, -3764, -3738, -10478, -12052, -11363, -9111, -2943, -837, -8229, -12609, -8971, -5236, -951, -5118, -11524, -10809, -9360, -7649, -7109, -12105, -15475, -7756, 3966, 2127, -2485, -5266, -9075, -8896, -10144, -12306, -16598, -12969, -4517, 1676, 684, 2199, 740, 3317, 5895, 2452, -2191, 613, 1225, 1254, -512, -7682, -5235, 4702, 12063, 8330, 9046, 16105, 13658, 6270, 2001, 2979, 2008, 5901, 11451, 12528, 1099, -245, 1609, 3452, -2856, 684, 1748, -5049]
15788e049n681j017K994K927M326l937o245r09N579J0766k678j230Q23k611K303
15773C61n537L99K429P0K678p00m838L901J555j520o314J889M256j150m099J650
15757d970O991N02o591M766M632N580j239k916j526m408j02O033j869m684k568
15742b369j392K271j706M049L147o464l456l14Q108N914K884j244k259j809L248
15727H608k234o436q608l423J075O28l467P766J3820K85o597J04J16o02r26m938
15711d829l70L030M940k715k518J04K457j281M241NK653L169n461o475r201o042
15695a8293K444K172J655m13J226O098M087j425n814k542P623l26K644L407j743
15680H00n125l689l470J723l32R58L135P70J823K696j517L058M716O4l296m126
$$ y = [-5049, -10730, -11747, -8753, -5826, -1500, -5437, -11682, -12591, -7012, 3754, 1076, -154, 669, -1942, 361, -5176, -4777, -2348, -2278, 400, -300, -5138, -1237, 318, -1202, -7516, -5627, -1371, -2521, -6620, -4970, 2021, 2523, -4068, 698, 5330, 10910, 9671, 6755, 5229, 821, 719, 6752, 4883, 199, -2369, -3761, -1490, -3196, 853, 4000, -2464, -5920, -6234, 1874, 7788, 10672, 9428, 7169, 5360, 8608, 6374, -62, -8670, -12093, -11018, -10390, -13857, -6091, 7729, 8014, 1417, 1521, 1637, 1035, 109, -4829, -5199, -2169, 2771, 56, -2462, -2358, 99, -1182, 3059, 3064, 5717, 8886, 3425, -3050, -12251, -18293, -15849, -13677, -12022, -12435, -11209, -5111, -1024, -2449, -8263, -10805, -3182, -3508, -864, 2543, 800, -4325, -8014, -11484, -9761, -10093, -9135, -6000, -5230, -3407, -711, -2228, 830, 5546, 5610, 2314, -1812]
15664a812k599J827J688J909q280n168R532P226p71j920o047l198N248M042k166
15649d89k088L894K83P287O19l855o000J206m490m596m439M81J10j108K309j00
15633a0976N515M458L469k561n6l092R83o344n698P75M057K154N156o28L560l36
15617D36J134j75j167n807k325l97L850M973J447J817J429J998q039l120m152
15602h098L460O65Q13k30n787O904N410n843n431k864j921M164M794K85n733m623
15586a4035m46M310O236M189k331n324K231J492p703k830M21M344m847j531J3243
15571b581R027K249K073r03L453J713P793l977j2081m540j977j822l398O130J116
15556B275l090r767j064J863m48J418K377r81Q65K103P63L297L801N08M4l249
$$ y = [-1812, -4411, -2584, -896, 1013, -7267, -12435, -2903, 4323, 3552, 1632, -4415, -7613, -2365, 1677, -489, -2577, 1317, 1600, 8887, 9506, 5651, -349, 857, -3633, -8229, -12668, -12187, -12077, -13185, -10876, -10976, -5461, -1003, 2466, -95, -151, -3243, -2260, -8604, -14302, -13527, -9470, -7316, -2160, -2788, 772, 436, 1570, 1395, 228, -5579, -7904, -8301, -4451, 522, 1969, 3786, 5215, 7213, -826, -3946, -8098, -4638, -3973, -3160, -3390, -9177, -2273, 3137, -2706, -8137, -11001, -12922, -8758, -3964, -3679, -9412, -14035, -14481, -10171, -3935, 254, -2077, -7401, -5170, -3678, -11381, -14211, -13790, -9446, -14293, -15824, -2581, 6446, 8695, 10768, 9865, 13318, 15031, 22824, 18847, 6766, 2226, 249, -1573, -4971, 1159, 2275, -815, -10582, -11646, -9783, -10231, -8813, -6436, -7417, -6552, -4449, -3686, -389, 3412, 3920, 3964, 715]
15540G15K158j411k51J293P146j440r652j350K857K785k674M390M905p387j0192
15525h108j979q47k877N33O650Q746j248n284m810M575Q623L821K356l864l367
15510B920P15k931r40m170o330P972M419j539l177r440N836J1037j8j340l025
15495a1j887l913m597J074J311L177L499l466j742K972K512j186j261J717k425
15480d226j674M046j180o001O291Q141J564k598m616j106Q24K520o3k93k434K371
15464A566M694L850j361q474j540J710O359Q26l101m309j638J681J186K043L713
15449G205k842M831K52o270k011O11J196J865L111K258j893l501N036M562M355
15434A8765q208q998j107J058L617J098k099l586l496k170L166O706L786n668
$$ y = [715, 2873, 1462, 1211, 2504, 9650, 8210, -1442, -2792, 65, 2850, 176, 4566, 9471, 2084, -8108, -10087, -10934, -13811, -13278, -6628, 2118, 870, -4414, -9224, -4649, 3974, 7795, 10151, 6287, 2920, 3635, 704, -236, -4406, -10736, -2764, 1655, 116, -3061, -12501, -6665, 4372, 4354, 3014, -11, -1898, -5811, -10408, -9334, -8023, -4846, -1347, -4813, -6555, -3583, -1071, -2257, -3518, -1801, -4226, -5900, -1854, -3034, -9035, -2744, 5397, 6961, 4363, -253, -1359, -535, 1985, 1922, 1629, -805, 1566, 6260, 10110, 8749, 275, -1265, 445, 6804, 7630, 4529, 220, -1418, 263, 1449, 3492, 7205, 4363, 9194, 9446, 3176, 1165, 1776, 2972, 4837, 7948, 10206, 8313, 4812, 9848, 14410, 18765, 10557, 1559, 452, 1510, 5127, 6225, 4126, 540, -2956, -5126, -1960, 4746, 8532, 2864]
15420B864J405k916L973M290J08n570l341Q86N046N124l981m384k646j019m944
15405e105O267N490K394j669l092k935p83n365R1M513M16k143k608j157l560l087
15389a2333k118M550N956j42m578K093k889J787P63K607M021J1431L636n063n866
15374C855r068N104N298k843p04J777l058q003P52M99k127M475K80j129m956L553
15358f295J063k231P85P519P36p592L49M764M491J157m918L786n26l319N796P964
15342A3529l603q382o784M44N680j083n58O479n03j648Q09j868j468K787M885
15327H716L121j729J329k233l478Q43p693o656M697L063K17qp71L537l154j240
15311a439P76L280R24L104m987m093K399J0390k097j335N685j090J422Q207J21
$$ y = [2864, 4269, 1353, 5326, 9616, 9724, 4154, 813, 1699, 6745, 11869, 7888, 3504, 858, -161, -5105, 1162, 6652, 9046, 7377, 4285, 1350, 567, -4798, -4707, -194, 222, -1921, -4529, -5686, -9246, -12333, -14451, -9901, -3945, -4087, -8665, -6572, -9461, -7674, -6911, -4304, -283, 11148, 14784, 9721, 3855, -5213, -109, 5189, 2346, 1642, 3419, 361, -7642, -6890, -6391, -8518, -4043, -3763, -4892, -9848, -6295, -5232, -7463, -6678, 841, 1577, -6015, -5666, -902, 3589, 4746, -172, 3614, 3088, -231, 5565, 13529, 9926, 1544, -5240, -4796, 884, -199, -757, 5722, 5219, 3571, 4380, 2512, 1044, 3831, 8716, 11837, 10108, 11437, 9204, 5726, 6569, -1124, -7780, -3083, -20, 197, 189, -582, 2955, -199, -1439, -663, 2617, 3541, 6645, 1658, -2435, -36, 10354, 8257, 6922, 12607, 11517, 12939, 21146, 21267]
15296B1267o531q554n25m396j410K95L283J719l29k439K868j039k716l439k398
15281d344K034Q199K442n289p009R8O748K92k666K461O340Q246n479m307J0769
15266A8535k263m549n745q24l20n737P287j483k338K56K503L021O950L418p760
15251A0951k915L74R3Q09l246n698j236R79k232J253J3124K451j626m617p425
15236A039m032K398N377Q254l53m18k436o717j91m338N298Q034K274k160m799
15221G230M18K401k334l33l409p672J32M158K750l86l613P948K631k134K579N533
15205A5899O027p273n781m551Qj431K627J308L946L471M20k969j1947l201M547
15190A100P73L003P098N47l149L582P43M40q96o564k121j311K285k896k221N373
$$ y = [21267, 14736, 6182, 5657, 1261, -149, 146, 3429, 5148, 4819, 2380, 5248, 4209, 1493, -1946, -4344, -2310, 5889, 8331, 3042, -3967, -3869, 2879, 3171, 505, 2966, 9306, 17552, 12073, 7766, 18535, 16272, 11723, 5978, 5154, 4834, -903, 6384, 4901, 2563, 2819, 5322, 8343, 15293, 18711, 10951, 8036, 8410, 8503, 9312, 6066, 368, -868, 111, -2121, -868, 12256, 14707, 13081, 8464, 1039, -2993, -595, 4782, 13036, 12683, 12265, 9829, 3112, 2921, -1417, 3881, 11915, 14189, 12029, 7230, 7648, 10049, 7715, 7382, 3973, -3699, -3567, 591, 3341, 2955, -658, 7290, 9921, 7787, 10366, 15899, 21926, 14653, 8872, 4321, 4329, 2898, 5525, 6833, 10779, 14250, 14670, 11701, -246, -3447, 1100, 1873, 4876, 11974, 12521, 9372, 12954, 13697, 14137, 13241, 6677, 4556, 3245, 5530, 2634, 413, 5786]
15174E786O55k031k120r57N363L925O11k533k583k37l146k601K546J435k174m55
15158A484l199n453k469R927J348q52L516L625L533m846q01J872l42L17j721J216
15142G155N971p479p258K026Q068J163j672M070o099m476L834K496l385j675k248
15127D91k601J421K588J058o241K843O588L595J744n130j894p82J196l787k648
15112a559j76k885K126N482n538j160Q072Q892N621l208m436j998k800l031L941
15097G343Q612R54q49l869m207K131J911p35o247o228k10M347L744K983o58k970
15081F052L017N855J396K16m133p354j529q89N036M091j988o785j968M944K579
15066H540K788J145j606j858k534j904K950j269m688l544l077L796J0377N091
$$ y = [5786, 6441, 4410, 2290, 1333, 6696, 10621, 11232, 8699, 6116, 5879, 2733, 132, 2678, 4113, 1939, 1484, -1715, -7168, -9637, 290, 1638, 786, 4302, 7927, 11460, 6614, 5813, 7685, 7343, 7660, 5939, 7155, 13126, 5647, -1611, 415, 8483, 9646, 7974, 12044, 5945, 1469, 5303, 7799, 4414, 2739, 491, -2110, -689, 1899, 2957, -3284, -441, 6147, 9742, 11486, 6356, 4462, 3680, 4876, 1089, -1559, -1735, -4620, -2494, 2988, -2550, -3710, 4362, 13254, 18875, 15667, 11231, 9233, 6433, 3402, 7343, 15955, 16909, 16060, 12191, 7984, 10115, 12026, 11291, 5044, -1184, -1394, 2953, 6697, 9680, 9022, 6052, 9069, 14924, 16320, 16536, 12403, 5049, 3520, 2631, 7667, 11758, 9770, 2985, 1017, 5961, 8540, 11328, 12473, 10867, 9009, 6475, 4571, 7521, 6252, 1564, -1980, -5057, -1261, 9116, 14207]
15052A4207o995J67N059K905n805K978Q147k546m638l461n014j945M173J425M366
15037A3023K02J002J217K616m557n803J759p86M89o0N910R57n548k234M495O54
15021A3336k970J724J355o146N368P218k383r212q045N743L929L191j4N267m003
15006A4358k853p662O684P925K458L14k964p727o045k745L517O476L607k728m650
14991G965O55k138j306M819j022j099j309j004j511k649K09K81L070K881l356
14976D486K346n471k616O46N29L714K683l773j474O159K816J637l865J042k704
14961F155J635R46q26R63M26J450O75j009L47l029n867m70m58J961M409k783l468
14944A057J030L316N414l217p46M587O356j691q450j682J532l67o441m611P791
$$ y = [14207, 7212, 7379, 12438, 15343, 9538, 12516, 20663, 18117, 13479, 10018, 5004, 3059, 7232, 8657, 13023, 13225, 14227, 15444, 18060, 13503, 7700, 9459, 8673, 9162, 9102, 15012, 15969, 10421, 8187, 12682, 13336, 10366, 12090, 13445, 7299, 12667, 19885, 17502, 8290, 245, 5988, 9917, 13108, 13094, 18361, 14358, 11505, 3843, 10527, 18452, 20910, 21224, 18260, 10533, 4488, 1743, 5260, 11736, 15343, 12615, 7965, 8620, 6482, 5176, 9995, 8973, 7874, 6565, 5561, 4050, 1401, 1610, 1891, 4961, 7842, 4486, 6832, 1361, -1255, -609, -80, 3634, 6317, 2544, 1070, 7229, 10045, 11682, 7817, 8859, 6155, 7790, 8736, 7910, 8873, 9299, 10749, 11424, 10415, 10762, 7733, 1866, 1396, 938, 2899, 7308, 4525, 1057, 2087, 5403, 10817, 7600, 6854, 11441, 17797, 16106, 7656, 5974, 7506, 7139, 698, -3913, 3878]
14929C878Q921k997o157J531j405n48Q174J155o960n930N00N322L532Q38K941
14914A2795k38j591J623n116K626N840k591j440L159J534q153m97J845k132m091
14899C573L095L588J823K112J68k092j375j58J773o663L506J759o238k931J163
14884C103P478L323o637L62K198q31m102n688l712R071N500J466l564r66K285
14869I286Q18K194M214K224o67j697o415k985K911K029M79j791k222K523J213
14854A2114J856j143j874r02k581o32J718K823k492j561k14m2N550q38L743M822
14838B0347J117K355o50M641J520K27p084m040n11M482m164j755J912K93Q198
14823B6888o42o865l088j915k363M68K485m615l346J597N435O378l31q553l975
$$ y = [3878, 12799, 9802, 3645, 5176, 3771, 3223, 11397, 12552, 5592, -338, 162, 5484, 9016, 9854, 12795, 12557, 10966, 12589, 7473, 10099, 15939, 13348, 11908, 15067, 16601, 8448, 7951, 9796, 7664, 3573, 6668, 10256, 12079, 14191, 14359, 12267, 10892, 10734, 12507, 5844, 9350, 11109, 4871, 1940, 3103, 10581, 13904, 7267, 7629, 9827, 8996, 4894, -794, -4506, 4565, 10065, 11531, 7967, 7001, 9286, 10104, 12298, 16512, 18736, 18069, 16372, 9957, 6972, 9883, 11912, 12391, 10600, 8378, 10901, 12114, 13970, 12827, 10953, 10051, 7470, 6838, 8556, 11379, 8887, 7326, 7112, 7070, 12620, 11782, 15525, 20347, 21464, 23819, 23169, 27810, 29330, 29557, 22473, 18433, 17922, 22404, 18240, 16485, 18397, 18690, 26888, 26246, 19381, 16293, 14378, 12015, 12483, 14968, 10353, 7007, 8604, 14039, 20417, 20086, 11533, 7558]
14808G558N905K937M788k119j168L711l358M673J444J50k332O983O759r242q473
14793A8216q3o14O22q35r89N74l995K128P437J228K905Q96o030o117M5K779j34
14776A8033k832N174J767q63n072r44Q505k53r170m923M093J387K612L934L066
14761B4514L781k313n863l822J778K485K964r02p020m325L340N440M615O560K73
14746C1505k025m307n904p391m835Q86J800N809O652L896J438p12o987p575L066
14731A5316L502K562p86j097M279N583q048m286J567o33J731L448O909l570l667
14716B2810N094J667K280k452n844Q75k789j494n199j446j66J708N053N64k776
14701A7885J016L546M732J339L249L96n351p403k011J12k318N115K705L315K556
$$ y = [7558, 13463, 16400, 21188, 19069, 17901, 21612, 18254, 22927, 24371, 24521, 22189, 29172, 35931, 26689, 18216, 18133, 17519, 18141, 17306, 16317, 16891, 12896, 15024, 22461, 23689, 26594, 27490, 21460, 15343, 15388, 18167, 18033, 15201, 20375, 22142, 21279, 16207, 15263, 23768, 23515, 14345, 9422, 13515, 14902, 17514, 21448, 24514, 28295, 25982, 20119, 16297, 18075, 20560, 23524, 22622, 15602, 11277, 14617, 20057, 24672, 31232, 31505, 29480, 25173, 19269, 11878, 7043, 7929, 9729, 15538, 22190, 26086, 27524, 26812, 19825, 12250, 15316, 18818, 21380, 20594, 19497, 23776, 29359, 21311, 17025, 18592, 17959, 19690, 23138, 30047, 26477, 22810, 27904, 29571, 31851, 29399, 23555, 24430, 21641, 20147, 14948, 13502, 13336, 15044, 20097, 20661, 17885, 18901, 22447, 27179, 28518, 31767, 32163, 26812, 19409, 17398, 17510, 15192, 20307, 23012, 26327, 28883]
14686B8883K711l67j656O53K3L904m844n985J394K937L908j40M840l177n846L109
14670C0347j286p41P42J510J110k174l784N10l906r00O827M52m930N191j805k718
14654B4445n795l116l514n80N869N067R618K223o85n105J80K67L750M703L934
14639D1261k297L373j1o321n345n31p13L260M39k702q83N966l2l7N606J248j820
14622D0461R27L545K78r004J209N896N773j915n597l908P1m063n782j573O213
14607C2531l34P063N87L18M371n49n67m032K214P081J0059L886K92L683Q243p92
14591G4054M66l356l860o248o589j018m36K883P735K147J511K294r82m200j227
14576F3174J011K58O010M202L729K939m23J646K904M794J3711N637J569K120N176
$$ y = [28883, 31594, 31227, 29571, 30224, 30247, 34151, 29307, 23322, 24716, 27653, 31561, 31421, 36261, 33084, 27238, 30347, 29061, 28320, 29062, 30572, 31682, 29508, 25724, 26234, 22328, 21428, 28255, 28707, 23777, 28968, 27163, 24445, 18650, 15534, 12020, 11440, 17309, 22376, 31994, 34217, 33532, 28427, 28607, 28874, 32624, 37327, 41261, 38964, 42337, 42326, 36005, 30660, 30129, 29416, 32676, 33115, 30413, 29530, 35496, 35464, 35427, 41033, 42281, 40461, 41388, 44933, 45211, 36207, 37416, 43312, 49085, 47170, 41573, 37665, 37736, 33673, 27891, 26318, 32531, 32197, 39260, 39847, 40165, 44536, 43987, 43420, 39388, 41602, 48683, 58742, 62628, 62920, 66603, 74846, 74054, 74520, 71164, 67304, 61056, 54467, 53449, 53013, 55896, 63631, 65778, 67289, 69583, 68601, 64401, 63174, 64185, 64443, 70453, 74655, 78384, 81323, 80900, 82546, 85450, 90244, 103955, 109592, 111161, 113281, 118457]
14561A18457N313J5608K2354P963J0941P356J6114K0944K4721K1503J9114K2017
14549C12405J6611J9099K3810J9295J8471J3696J9739J7300J0636J7700J4354
14538E03116Q598J0712J0037Q461K939m937M488M048K737n041j903p227o009l160
14524E26859j0564j6716j7075j9422j7265j3205j8257k3928k2752j4712k2761
14513C30202k0399k0618j7777j5357j3964j3112j3782j0972j2640j1460j2659
14502A67462j7905m249p001r315m431L931j518q600j1099q358j864m043l74K616
14488I5252j063n349o063q123J243L62M723j692p754k834M058r86m469k91k529
14473F4485O60M53K80m642p086l60M743J154l451M520l198m939L32l163J760R009
$$ y = [118457, 123770, 139378, 161732, 169695, 180636, 187992, 204106, 225050, 249771, 271274, 290388, 312405, 329016, 348115, 371925, 391220, 409691, 423387, 443126, 460426, 471062, 488762, 503116, 511714, 522426, 532463, 540924, 543863, 538926, 543414, 547462, 550199, 545158, 543255, 536028, 530019, 526859, 516295, 499579, 482504, 463082, 445817, 432612, 414355, 390427, 367675, 352963, 330202, 309803, 289185, 271408, 256051, 242087, 228975, 215193, 204221, 191581, 180121, 167462, 149557, 145308, 138307, 128992, 124561, 128492, 126974, 118374, 107275, 98917, 97053, 93010, 92636, 95252, 94189, 88840, 82777, 74654, 75897, 76259, 80982, 79290, 71536, 68702, 72760, 71774, 67305, 67014, 64485, 65145, 65598, 65878, 61236, 54150, 53790, 58533, 59687, 56236, 60756, 57558, 52619, 52951, 49788, 51548, 60557]
14457F0557M917l882r527n680O790N142J331j045l107O16P88M840o95j851n01
14442E8693J761M658J375m518M213J079m653J772p90n167n603N283L587N342O42
14427F7674p199k82Q805m330j0960J088K325K13L49m707k674N319O238k530p63
14412E8566L733p921n879M841l778j998q33m12J0546Q732J364p823j873l7o471
14397E0757k868n801L705M530O190k591k76n3M768N586k218k804L517n008N618
14382F3052M21k293N162K985j012k15m15N290J21J86R88K131K286L744L062N92
14366H6085J451j249N3m711l265N891N146J223J636j56J0070Q793k241p86L680
14351A11620K876l498j706K61K099J709L78j455O268N013j009J483k755K583M406
$$ y = [60557, 65474, 61592, 52065, 46385, 53175, 58317, 59648, 58603, 55496, 56112, 56900, 61740, 61045, 59194, 58693, 60454, 65112, 66487, 61969, 66182, 67261, 62608, 64380, 63590, 58423, 52820, 58103, 61690, 67032, 67674, 60475, 60193, 68998, 64668, 53708, 54796, 57121, 57334, 57683, 52976, 50302, 55621, 61859, 59329, 58566, 62299, 54378, 48499, 53340, 49562, 47564, 46731, 46319, 56865, 65597, 66961, 59138, 57265, 57228, 50757, 47889, 42088, 45793, 50323, 56513, 53922, 53646, 53593, 58361, 63947, 61729, 58925, 62442, 57434, 63052, 63473, 61180, 66342, 69327, 68315, 68100, 67685, 72975, 73096, 73282, 74270, 76401, 78687, 82431, 85493, 86085, 87536, 86287, 86340, 81629, 78364, 84255, 89401, 90624, 92260, 92104, 102174, 110967, 108726, 107940, 111620, 114496, 110998, 109292, 109553, 111652, 113361, 113739, 112284, 118552, 123565, 122556, 124039, 121284, 123867, 128273]
14336A28273N945N298O576l058k682O199K331k950K51j868J545O254P43n873L15
14321A47299j598j44r573l327l189k331n32m87n277n121J763O481M375n411n796
14306A17132n211o293k863L498L282L328n606p604l442j367K975M317J194j276
14292A02064q97k576J126J03O814L918j533k929k73j115K525L560N459K556J25
14277A18927k867p558j607P931P911L269q90l730L23L770K715j349K411J223P31
14262A31210K292N532l244l148L657j352K474R012r62j941P734P096O388o165
14248A58583j1962p5M057O095Q184K321O65m375l418J079K462N603j75j210j573
14233A66261K607l537k526J606L732K569o218l875N706J723o37o16R238M619p125
$$ y = [128273, 134218, 139516, 146092, 143034, 140352, 146551, 148882, 145932, 146183, 144315, 145860, 152114, 152857, 146984, 147299, 145701, 145557, 135984, 132657, 129468, 127137, 126605, 126118, 120841, 115720, 117483, 123964, 128339, 122928, 117132, 111921, 105628, 102765, 106263, 109545, 112873, 107267, 99663, 96221, 94854, 97829, 102146, 103340, 102064, 101167, 98591, 99717, 99820, 106634, 110552, 109019, 106090, 105817, 104702, 107227, 110787, 116246, 118802, 118927, 116060, 108502, 106895, 114826, 122737, 126006, 125116, 121386, 121709, 125479, 128194, 126845, 129256, 130479, 131210, 133502, 139034, 135790, 132642, 136299, 134947, 137421, 146433, 145471, 143530, 151264, 158360, 164748, 158583, 146621, 146546, 150603, 156698, 164882, 167203, 167868, 163493, 160075, 161154, 163616, 169219, 169044, 167834, 166261, 168868, 165331, 162805, 164411, 168143, 170712, 164494, 160619, 166325, 168048, 167411, 166795, 176033, 180652, 173527]
14218A73527N16M452P389Q557R25O425O565L555K73K36Q986M11j000P176L181
14203B31174L662N193R716Q791R347L446l572K126N176N140L596R489J6333J1681
14189C21298K1O030J3970Q979n006Q332O862J0632J1484J0684R864J3825J8064
14176D35039J0328J5163J0646Q480J4934N974O615J3756K1191J9676J7032K3785
14164F02619K1768J9347K7154L0012J8174K1809L0145L2176L8308L6773L0055
14153I08340M5603M6854M2955M5237N4041N7509O3214O5545P2322Q1817Q1195
14142A564632Q5717R2699J04218J00777J09217J23208J26620J32838J42727J49308
14132B731961J55366J65233J73812J89141J99974K14172K26576K42700K55645
$$ y = [173527, 174043, 178495, 185884, 194441, 195366, 201791, 208356, 211911, 212184, 212420, 221406, 221817, 220817, 227993, 231174, 234836, 240029, 249745, 258536, 267883, 271329, 267757, 269883, 275059, 280199, 283795, 293284, 309617, 321298, 321319, 327349, 341319, 350298, 345292, 353624, 360486, 371118, 382602, 393286, 403150, 416975, 435039, 445367, 460530, 471176, 479656, 494590, 500564, 507179, 520935, 542126, 561802, 578834, 602619, 624387, 643734, 670888, 700900, 719074, 740883, 771028, 803204, 841512, 878285, 908340, 953943, 1000797, 1043752, 1088989, 1143030, 1200539, 1263753, 1329298, 1401620, 1483437, 1564632, 1650349, 1743048, 1847266, 1948043, 2057260, 2180468, 2307088, 2439926, 2582653, 2731961, 2887327, 3052560, 3226372, 3415513, 3615487, 3829659, 4056235, 4298935, 4554580]
14123D554580K80575L02677L34212L63498L98228M39811M90476N47070N99835
14114H310962O68081P49695Q35304R37774J053867J181512J316043J480018J655334
14105A8188590J832393K041519K262934K487210K720734K965771L197720L412805
14097C9109676L611852L780373L899682L976775L998598L947119L849948L701782
14089F9875805L492502L241251K963977K653373K341612K054711J745764J452649
14081H9821644J186001R34324P08619M89792K70779O3619j61380m02613o56390
14072I2254395r25526j221422j551714j884674k222866k562258k873350l168104
14064G5844481l416015l617437l773220l863035l897339l880478l796562l676464
$$ y = [4554580, 4835155, 5137832, 5472044, 5835542, 6233770, 6673581, 7164057, 7711127, 8310962, 8979043, 9728738, 10564042, 11501816, 12555683, 13737195, 15053238, 16533256, 18188590, 20020983, 22062502, 24325436, 26812646, 29533380, 32499151, 35696871, 39109676, 42721528, 46501901, 50401583, 54378358, 58376956, 62324075, 66174023, 69875805, 73368307, 76609558, 79573535, 82226908, 84568520, 86623231, 88368995, 89821644, 91007645, 91941969, 92650588, 93140380, 93411159, 93474778, 93313398, 92910785, 92254395, 91328869, 90107447, 88555733, 86671059, 84448193, 81885935, 79012585, 75844481, 72428466, 68811029, 65037809, 61174774, 57277435, 53396957, 49600395, 45923931]
14056D5923931l522243l340022l141901k928209k713864k502181k294455k106125
14048B3374931j920282j752240j588016j440365j306628j188552j082413r83918
14040A2112517q89050q12398p35677o71246o09885n59186n19107m63129m24418
14031F428421l90825l64099l26205l05621k78382k55172k39042k28834k11038
14022C829203j92468j84787j75421j52094j45773j34573j27900j25996j16695
14013B473496j09921r8789r0634r2088q4161p8670p8721p7566p3194o9688o4716
14002A555348n7769o0607n4099m8791m1171m0629m5679m3398m0368l2255l1040
13991A059542l3316l7257l7117l5508k3816k3294k2486k4104k6031k2506j8347
$$ y = [45923931, 42401688, 39061666, 35919765, 32991556, 30277692, 27775511, 25481056, 23374931, 21454649, 19702409, 18114393, 16674028, 15367400, 14178848, 13096435, 12112517, 11223467, 10411069, 9675392, 9004146, 8394261, 7835075, 7315968, 6852839, 6428421, 6037596, 5673497, 5347292, 5041671, 4763289, 4508117, 4269075, 4040241, 3829203, 3636735, 3451948, 3276527, 3124433, 2978660, 2844087, 2716187, 2590191, 2473496, 2363575, 2264786, 2174152, 2082064, 1997903, 1919233, 1840512, 1762946, 1689752, 1620064, 1555348, 1497579, 1436972, 1382873, 1334082, 1292911, 1252282, 1206603, 1163205, 1122837, 1090582, 1059542, 1026226, 988969, 951852, 916344, 892528, 869234, 846748, 822644, 796613, 774107, 755760]
13980G55760j8205j8022j8910j5487j4418q913j1424j0553j6720j4320j1667q482
13968E88639m271j6396j0180p989j2133q000r910m455j0910n063j879o438m569
13955D86446p893p773o789n003p302q341j0657m647k876l755l740o796r736r711
13941C91427p496j1082j1494p014l706j843j3877j2566j5110n826j0634j5339
13929B75440j2783j6277o880l959r287p150p597p094r121m860p794l092j580o233
13915A71733n879j5124j2958J339j777o434m590n212n995q350J418N87R83j411
13901A08330n704n764K81M133n318o396n179O360K741p440q112j621j757j362
13887G3192n865Q38M015k600OJ173k000k622m691M61j279k521k091m159r307K763
$$ y = [755760, 737555, 719533, 700623, 685136, 670718, 661805, 650381, 639828, 623108, 608788, 597121, 588639, 584368, 567972, 557792, 549803, 537670, 529670, 519760, 515305, 504395, 499332, 497453, 491015, 486446, 478553, 470780, 463991, 458988, 451686, 443345, 432688, 428041, 425165, 421410, 417670, 410874, 401138, 391427, 383931, 372849, 361355, 354341, 350635, 348792, 334915, 322349, 307239, 301413, 290779, 275440, 262657, 246380, 239500, 235541, 226254, 219104, 211507, 204413, 195292, 190432, 182638, 179546, 177966, 171733, 165854, 150730, 137772, 139111, 137334, 130900, 126310, 121098, 115103, 106753, 108171, 108758, 109741, 108330, 102626, 96862, 97143, 101276, 95958, 89562, 84383, 90743, 93484, 86044, 77932, 76311, 74554, 73192, 67327, 68165, 72180, 69580, 69586, 70759, 68759, 66137, 61446, 61907, 60628, 58107, 56016, 51857, 42550, 45313]
13871D5313j258j084N449N703K835m157k46j903o811m956k901k590J371j400M15
13856C3780R234K717p725r703K18J033j097P929M957R15m38o26j274J498l741
13841C7677n365M801k633J651K311j628k000o985o667l449K566Q77k847K243J114
13826B1666m157l680J591J548J559J0825R54r711o947N781j318M124L559l025
13812B2769n646m970l030k645K826m442p020j089N207J878k121M18k431j721k84
13797b301M225R68k455j650l518k625m046o054K114N162J784R342r21q126m358
13782a2459K312K381N737J571m838K061R78J308o027k73O955N5J11J466j427N799
13766E710O151n380m404n327j899M716L551J982m277j328O9m949k14Q74O265K016
$$ y = [45313, 44055, 42971, 48420, 54123, 56958, 52801, 52555, 50652, 43841, 38885, 35984, 33394, 34765, 33365, 33780, 43014, 45731, 38006, 28303, 28521, 29554, 28457, 36386, 41343, 42258, 41820, 41194, 39920, 41418, 37677, 32312, 37113, 34480, 36131, 38442, 36814, 34814, 27829, 21162, 17713, 20279, 21156, 18309, 20552, 21666, 17509, 13829, 15420, 16968, 18527, 29352, 30306, 20595, 13648, 19429, 18111, 22235, 25794, 22769, 17123, 12153, 9123, 6478, 9304, 4862, -2158, -3247, 1960, 3838, 1717, 2135, -296, -2017, -2301, 1924, 2892, 437, -1213, -4731, -7356, -11402, -17456, -15342, -10180, -8396, 946, 25, -8101, -12459, -10147, -7766, -2029, -458, -5296, -3235, -2257, -949, -6976, -7249, -294, -239, -128, 1338, -89, 5710, 11861, 6481, 2077, -3250, -5149, -433, 3118, 5100, 823, -505, -436, -5385, -5599, -4725, 1540, 3556]
13750C556m602m777K645R649o57p412k467P97J266K854j926K616M750l860k891
13735d59K43j565J113n696N562L254k50N921M10q671o60k23l324m381K718j018
13719g026K149L68K374L45l362K224l80M621N402j393o988l673k973j00L107l2
13703e337J730l376l632K328M887L148m797k303P906j21q191j506P546L467J875
13688C624k26n944m360l630l241L216K825L124n74j628L029j503k712L036M77
13673d487K975j037l686j925k232K744Q459R483L778m628n683m070K915R65L386
13658F957R10L430M109k480l694K765P823Q996Q238M895J1263M239K392O501J1593
13643G7937J4991J2379O894J4971K2929K0354K3944J6887J2575J4656J5871J8193
$$ y = [3556, -1046, -5823, -3178, 6471, 5814, -1598, -4065, -3268, -2002, 852, -1074, 1542, 6292, 2432, -459, -216, -1781, -668, -6364, -802, 2452, 2202, 8123, 8533, -138, -798, -1021, -4345, -8726, -6008, -7026, -4877, -4509, -2135, -1790, -5152, -2928, -3308, 1313, 6715, 5322, -1666, -5339, -8312, -8412, -5305, -5337, -3607, -6983, -10615, -8287, -3400, -252, -5049, -7352, 554, 433, -7758, -9264, -1718, 1749, 3624, 3398, -2546, -6906, -10536, -13777, -10561, -7736, -4612, -5186, -6814, -3785, -5288, -8000, -4964, -4487, -1512, -2549, -6235, -8160, -10392, -7648, 811, 10294, 14072, 9444, 3761, -309, 2606, 3571, 6957, 7867, 11297, 15406, 12926, 9232, 11997, 19820, 28816, 37054, 41949, 53212, 57451, 59843, 66344, 77937, 92928, 105307, 112201, 127172, 150101, 170455, 194399, 211286, 223861, 238517, 254388, 272581]
13631B72581K8304K8296K5395J9463J4542J5499J2295J3887P888J5442J8353J3725
13619D85670J233L703R817K704K378P003Q7K067K805k136r205j7425j8363j1261
13605D59077j4479k0279k2780j9155j8820j7587j9025j7998k4480k4001j7107
13594B43366j5610k3819k2607j4012j6478j2148j7000q531n698r722m469l160
13582I0112k957q826j2536n34o405o876m06m605k828k679p691j0227M604O00k416
13567B6330j291r662q740K134J154m505L025Q322k716m697J581J234p296p647
13553b774Q24K614l480l202P223J336k698m157l388M640N175k80J580R654j904
13538A1163n956o996n769j124J548P71O020k286p816k432k159M045M729L963m493
$$ y = [272581, 300885, 329181, 354576, 374039, 388581, 404080, 416375, 430262, 438150, 453592, 471945, 485670, 486903, 490606, 500423, 503127, 505505, 512508, 512595, 514662, 517467, 515331, 506126, 488701, 470338, 459077, 444598, 424319, 401539, 382384, 363564, 345977, 326952, 308954, 284474, 260473, 243366, 227756, 203937, 181330, 167318, 150840, 138692, 121692, 113161, 107463, 97741, 93272, 90112, 87155, 78329, 65793, 65259, 58854, 51978, 51572, 46967, 44139, 41460, 33769, 23542, 28146, 28746, 26330, 25039, 15377, 6637, 8771, 9925, 5420, 8445, 16767, 14051, 9354, 10935, 12169, 4873, -2774, -1950, 664, -2816, -6018, 1205, 2541, -157, -4314, -7702, -3062, 2113, 1833, 3413, 13067, 11163, 5207, -1789, -7558, -8682, -7134, -6363, -343, -2629, -10445, -12877, -15036, -10991, -6262, -2299, -6792]
13523f792m0n97L117o685o023O360L077j865N134j711Q6N82l117o303k906P046
13507a0637J353K24Rn069l636L933M398L684l017n987l844N618J0696M361M33
13492B519J842n183o733n941k810K096L259r51N107N300j771l313K059J091k743
13477f172k770r16j876m839K620k40j478L817n64l81J79L405Q22K195L106K558
13461e34k35p043p908L287j25M758L522j090k277J025j443k471J576L381O360
13446G83M184o531k922m609K454R207l389o329j117K132l695K852J568k229l872
13431a1513m970k098O909j243J692M784J736m269n97j165L767k296n194m407M037
13416a4827J974k47K790m205P42L166j991K500K098l353k797m901Q80M653N806
$$ y = [-6792, -6832, -7429, -4312, -10997, -17020, -10660, -7583, -9448, -4314, -6025, -5939, -5357, -8474, -14777, -17683, -10637, -9284, -9060, -9051, -14120, -17756, -13823, -9425, -5741, -8758, -14745, -18589, -12971, -2275, 2086, 2519, 4361, -822, -7555, -13496, -16306, -14210, -10951, -11902, -6795, -1495, -3266, -6579, -4520, -3429, -6172, -8942, -9858, -11734, -16573, -13953, -14193, -15671, -11854, -12418, -12799, -12620, -9215, -8393, -6198, -3092, -534, -769, -7812, -15720, -12433, -12558, -7800, -4278, -5368, -7645, -6620, -8063, -10534, -8958, -5577, 783, 4967, -1564, -4486, -9095, -6641, 2566, -823, -7152, -8269, -6137, -9832, -6980, -5412, -7641, -11513, -16483, -18581, -11672, -12915, -11223, -6439, -4703, -8972, -9569, -10734, -6967, -9263, -14457, -18864, -14827, -12853, -13100, -10310, -14515, -13773, -10607, -12598, -10098, -8000, -11353, -14150, -19051, -18171, -13518, -7712]
13401g712K138o796J193k351J192J484L157l910q699L21l210K430O600j126l598
13386a8887k629n26L126l105K918M630j540m206P049P46J064k782j115r72J199
13371a5030k958l638L988n4k170J115K473m952J584J0233j496o720j705k643K129
13356a9844N425Q26M14m24J7P151N19o200J177o94K07p54L417J066k409l358k585
13339a6049R4Q54M823j067p79M375K257L231K387j348j751q314j480K0j271K081
13323a1937J825j177l7j034K254j266l691o112O151L805j574J414K822N16K075
13308e966m116q39M334K517o065k892K350k201K899M797J724n674l565j253J245
13293a2705K309L946K79l453m90M576n49l871n146p73P34j269L095P530R144P85
$$ y = [-7712, -5574, -12370, -11177, -13528, -12336, -10852, -7695, -11605, -20304, -19983, -23193, -20763, -14163, -15289, -18887, -21516, -22042, -18916, -22021, -19103, -14473, -16013, -20219, -13170, -12424, -11360, -14142, -15257, -16229, -15030, -17988, -21626, -17638, -17692, -19862, -18747, -16274, -21226, -19642, -9409, -10905, -17625, -19330, -21973, -19844, -14419, -13593, -13179, -13603, -13586, -6435, -5916, -12116, -10939, -11633, -11426, -12180, -8763, -7697, -10106, -13464, -16049, -15955, -15101, -10278, -11345, -12124, -7749, -5492, -2261, 126, -1222, -2973, -11287, -12767, -12747, -14018, -11937, -10112, -11289, -11326, -12360, -10106, -11372, -15063, -21175, -15024, -11219, -12793, -11379, -8557, -8041, -5966, -10082, -10921, -6587, -4070, -10135, -13027, -10677, -12878, -9979, -5182, -3458, -9132, -12697, -13950, -12705, -10396, -6450, -6171, -9624, -10114, -5538, -6087, -9958, -15104, -15877, -15143, -16412, -13317, -5787, 3357, 4142]
13277D142p269m775L275l939P330L645m972m290L432K979l688n4L95j784O33l680
13261h620n028k03j245q67M19R19J825J728k82m521L016N208l94m620K611L346
13245f708m003k065J869k653j504J626L61N749L794O68m68Q95J494k244j302o19
13229e110l79L609Q752m021q59m697n531O05k713M593J007k180j710K763M219
13214a652k921o32k381j883L743J913o748M697O343j728K503n629l906L017q46
13199f110N851L885m747m129M896Q98o267k899M47l981m056K010M150j021k082
13184a3155K719K917J432J885K921K990k431r80q66m756j456q43P07Q780k270
13169b406m413J114M242k611L490J838o59j934K372l373j949k104L578K652m422
$$ y = [4142, -3127, -7902, -4627, -8566, -1236, 2409, -2563, -6853, -3421, -442, -4130, -4184, -3789, -5573, -4940, -8620, -13648, -13851, -15096, -15963, -15544, -14625, -12800, -11072, -11354, -15875, -12859, -7651, -8045, -12665, -10054, -6708, -10711, -12776, -10907, -13560, -15064, -13438, -13077, -7328, -3534, -2866, -3334, -2439, -945, -3189, -4491, -5110, -5489, -1880, 6872, 2851, 1992, -2705, -8236, -7631, -10344, -5751, -4744, -6924, -8634, -5871, -1652, -4573, -5205, -7586, -9469, -5726, -3813, -10561, -5864, 479, -1249, 1254, -4375, -8281, -5264, -6110, -259, 3626, -1121, -5250, -354, 544, -5723, -8622, -8175, -12156, -16212, -14202, -10052, -11073, -13155, -10436, -7519, -6087, -4202, -1281, 1709, -722, -1702, -2568, -7324, -8780, -9623, -8916, -136, -2406, -6819, -5705, -1463, -4074, -584, 1254, 595, -1339, 1033, -2340, -4289, -6393, -2815, -163, -4585]
13154d585l617K0P159R56J750l421K660L137l047k034J16j174J069k824J682n959
13138h112l258K178n288j688M065K466Q08K396O769J370n496K72l43k303k830
13123h994k304Q19J483j352K117J908R2M401m98K720J271o708Q21J957M911l059
13107d15k163K039k860l092l704l855P220K319K56K969n75J965P05J249m148n406
13091g496J870j127j068J691k69j942J33n265L396O33J111J606L080q45m022j01
13075h615j165N837M719j419m563j111L769M3j437O56Q43m705K194q26K174j119
13059d725r501j172J477k638J836K014L048o40J395j20M43J8J872K3j254J919
13043f005N058K697m433l230j20M271M164k456L431l376o249n874j403N653K280
$$ y = [-4585, -8202, -8182, -1023, -67, 1683, -1738, 922, 4059, 1012, -1022, -906, -2080, -1011, -3835, -2153, -8112, -11370, -9192, -14480, -16168, -12103, -9637, -8829, -6433, 336, 1706, -3790, -3518, -3861, -6164, -8994, -11298, -10479, -8996, -10348, -8231, -6323, -6231, -1830, -2328, 392, 1663, -5045, -4224, -2267, 2644, -415, -2578, -539, -3399, -6491, -10195, -14050, -6830, -4511, -4255, -1286, -1861, 104, 809, 2058, -2090, -7496, -5626, -6753, -7821, -6130, -6399, -8341, -8208, -13473, -10077, -9444, -8333, -6727, -3647, -4492, -8514, -8615, -9780, -3943, 776, -643, -5206, -6317, -2548, -2505, -3942, -3286, -2443, -7148, -4954, -5780, -3606, -4725, -14226, -15398, -13921, -16559, -14723, -12709, -9661, -10301, -8906, -9026, -8583, -8565, -6693, -6670, -7924, -6005, -947, 1750, -2683, -5913, -6033, -1762, 2402, -54, 3377, 1, -6248, -12122, -13525, -7872, -5592]
13028e592P297R607l336k387M063j392m038j0799N00k413M174M453l463j174o49
13013e149J477l001L453L922r25o007p856J253N573M323N44j576n716L277o704
12998a3112l991L393L823M389P350o34o711k366K855j771m158K853N068O789j619
12983B158J19R082m296k976m0k143N145L405m763p871P83O195q855n045M052J082
12967c968j472j187K211o20n42l948k025M373j481J12N10J627L480k441K311K235
12951h25J647j812l008j731Q686P23n353Q77l418r21N173K498K023j566J402n663
12935a268k797J246L120N953o848m435j410J018M960O232o018J344P557J594j245
12920I003L202K452j051J361l801l530k362k908J32L354M578m805M348L450k000
$$ y = [-5592, 1705, 11312, 7976, 5589, 9652, 8260, 4222, -6577, -6077, -8490, -4316, 137, -3326, -4500, -5149, -3672, -6673, -3220, 702, -223, -6230, -14086, -12833, -7260, -2937, -2393, -3969, -9685, -6408, -13112, -17103, -13710, -9887, -5498, 1852, 1218, -5493, -7859, -5004, -6775, -10933, -8080, -3012, 3777, 2158, 2277, 11359, 7063, 4087, 4047, 1904, 7049, 10454, 5691, -2180, -1397, 4798, -4057, -9102, -5050, -3968, -5440, -6627, -4416, -5036, -5578, -9526, -11551, -7178, -8659, -8547, -8037, -6410, -2930, -5371, -3060, -825, 822, -990, -3998, -5729, 2957, 3680, -1673, -796, -4214, -5135, 38, 2536, 4559, 2993, 4395, -1268, -4065, -2819, 301, 6254, -594, -5029, -6439, -5421, -461, 5771, -247, 1097, 8654, 10248, 9003, 12205, 14657, 13606, 14967, 11166, 7636, 5274, 2366, 2498, 5852, 10430, 5625, 9973, 13423, 11423]
12905A1423l4m868m257l413J856j869J234K009K953l848K261j447k83J442j653
12890A506k966o45L689Q14N435P86o386n41j163l213K927N828M812m441l168J670
12874D944l621o167L348m64K459k61K574M071M124j261l212N372o11K852K348
12859A6495k11Q58J045l253n508j127m732J548K40k164k53p73n728k476R29k635
12843g745Q242J0053M743M58j2878o693J570k469J037k250l006r43n690P791L078
12828d702L411K73O524K091m09j4j005k493m4n35M058M534N146m765k721N205
12812A4554j080o638m30M163l413N831O074l366p805q249n355P006J532N249K969
12797A1042q66L18l1n912n819k936Q726J876L014k107l902m191o528o9P369Q588
$$ y = [11423, 11389, 6521, 2264, -1149, 707, -1162, 72, 2081, 5034, 1186, 3447, 2000, 1717, 3159, 1506, -1460, -2105, 1584, 2398, 7833, 8619, 2233, 1692, 529, -2684, 243, 6071, 10883, 6442, 3274, 4944, 1323, -4844, -1496, -1960, 499, 238, 2812, 6883, 11007, 9746, 6534, 11906, 11295, 14147, 16495, 16284, 17142, 18187, 14934, 9426, 8299, 3567, 5115, 5355, 3191, 2938, 2165, -3563, -6039, -5110, -7745, 497, 10550, 15293, 15751, 2873, -3820, -2250, -4719, -3682, -5932, -8938, -9881, -15571, -7780, -4702, -1291, -1018, 5506, 7597, 7188, 7174, 6169, 3676, 3632, 3097, 7155, 11689, 16835, 12070, 9349, 14554, 13474, 6836, 6406, 10569, 7156, 12987, 19061, 15695, 7890, -359, -5714, 1292, 2824, 8073, 11042, 10176, 10494, 10463, 4551, -1268, -4204, 4522, 6398, 9412, 7305, 3403, -788, -7316, -7385, -16, 8572]
12781H572k897k258L19N5K33K13L937Q62r04n092q29j886K365j901M414J04r9
12764E208P689M375O8k004J835M82m480p447J280l993k594M312J212K269J126
12749I338j707o553k183R279K467l799K31J336J322j016K221K865Q40m048j503
12734I090j72M521L725k0J652n412n19N520J8186R226k39q087j1445o837l178
12719A6011R09l234j390j659M598J898l970j442L740L736O393m364j870p72K314
12704B0898l243J421n982l030j163o15q32r33M32n183l175m491L843R429K188
12689I564j566L848J803R63m91l44L166P925J947n593q486k61J815P130m76j868
12673A9076J756N914k298k106k459r227o241M471k781k927O383Q127l536p642
$$ y = [8572, 5675, 3417, 3736, 3791, 4024, 4237, 8174, 9036, 8132, 3040, 2211, 325, 2690, 789, 5203, 5307, 5208, 12897, 17272, 17340, 15336, 17171, 17653, 13173, 5726, 7006, 3013, 419, 4731, 5943, 8212, 9338, 7631, 1078, -1105, 8174, 10641, 6842, 7073, 8409, 9731, 8715, 10936, 13801, 14641, 10593, 9090, 8918, 13439, 17164, 17144, 18796, 13384, 12865, 18385, 36571, 45797, 45558, 37471, 26026, 19189, 16011, 16920, 13686, 12296, 10637, 15235, 17133, 13163, 11721, 15461, 19197, 25590, 21226, 19356, 18584, 20898, 17655, 19076, 13094, 10064, 8901, 8286, 7454, 6521, 6953, 1770, -1405, -5896, -2053, 7376, 9564, 7998, 11846, 13649, 14612, 14121, 13777, 16943, 24868, 26815, 21222, 12736, 12475, 14290, 21420, 20944, 19076, 20832, 26746, 24448, 22342, 19883, 10656, 4415, 8886, 6105, 3178, 9561, 17688, 14152, 6510]
12659F510N08q77M152K426R525O152J047J814m93n378J255l267n803m831O816
12644A9556J760Q639k42r25M218n8O531O684l199p738J237Q42K473O135O002N815
12628E7730j176J381L747l376q86r13O962K18l402k879m839o381l069k304Q83
12613D1696M853k139l257l85L952O00o305M338L782L987l528N792K902K957Q015
12598F7260N952P071N599l998J122K969j845O743J041R9L320L260m085q978o732
12583G8798M404K979m533r291m586L260N249M1N63r69j0330n485m933K618J3m29
12567E7369r68n350k973Q668J813J363K905L990J903k025K755P349J0939J7174
12553A04912J4192P772j381M517k995j0232j0927Q41M529p091m693p330q256m312
$$ y = [6510, 7018, 6141, 10293, 12719, 22244, 28396, 29443, 31257, 30764, 25386, 26641, 23374, 17571, 12740, 19556, 21316, 29955, 29713, 28788, 33006, 32948, 39479, 46163, 42964, 35226, 36463, 37305, 39778, 45913, 51915, 57730, 56554, 57935, 61682, 58306, 57420, 56507, 63469, 63687, 60285, 57406, 52567, 46186, 43117, 40813, 41696, 46549, 44410, 41153, 40768, 44720, 45320, 39015, 43353, 47135, 51122, 47594, 53386, 56288, 59245, 67260, 73212, 80283, 85882, 81884, 83006, 85975, 84130, 90873, 91914, 92013, 95333, 98593, 94508, 85530, 78798, 83202, 86181, 81648, 72357, 67771, 71031, 76280, 76321, 76884, 75915, 65585, 60100, 55167, 57785, 57798, 57369, 56401, 51051, 48078, 56746, 58559, 59922, 62827, 66817, 68720, 66695, 69450, 76799, 87738, 104912, 119104, 126876, 125495, 130012, 127017, 116785, 105858, 106699, 111228, 104137, 99444, 92114, 83858, 79546]
12539G9546o31k09k631L12M97k230l363j35j82q191K405P678R418P622K056p353
12523H4609Q15J996J699J570N736O588N842L569J842J0759K6318L8806L0795J5161
12509B36105o297j2916k2578k8150k0612r446o963o927r108j0069q843k306P642
12496I9532K339P139l65l594l153L773L805K513R662M376k895P253N155k766m101
12481A28673l910o457j3758n403N178N035J3431R823R579J72K665J3182J4779
12468A72989L710l476p664r255r959p741p401p06n1K663k616K489L173j097m748
12453A30310k961L95L243l517l177j054o605K84n917o131n355n698k330j379j297
12438H8811L089M035k205l673l978O39L214J573R081m560j0973j217K268J411
$$ y = [79546, 78915, 78706, 76075, 76387, 76884, 74654, 71291, 71156, 70974, 62783, 65188, 72866, 82284, 89906, 91962, 84609, 85424, 87420, 89119, 90689, 96425, 103013, 108855, 112424, 114266, 125025, 151343, 190149, 220944, 236105, 229808, 216892, 194314, 166164, 145552, 136106, 129143, 122216, 113108, 103039, 94196, 91890, 99532, 101871, 109010, 108645, 105051, 101898, 105671, 109476, 111989, 121651, 126027, 123132, 130385, 135540, 132774, 128673, 124763, 118306, 104548, 99145, 104323, 109358, 122789, 132612, 142191, 142363, 145028, 158210, 172989, 176699, 173223, 165559, 156304, 146345, 138604, 131203, 130497, 130446, 133109, 130493, 132982, 136155, 135058, 130310, 127349, 127744, 130987, 127470, 124293, 123239, 116634, 116918, 111001, 104870, 99515, 93817, 91487, 90108, 88811, 91900, 95935, 93730, 90057, 86079, 86718, 89932, 91505, 100586, 96026, 85053, 83836, 86104, 87515]
12424H7515O322p18n501m632k939n690m497P07O450K821Q48o320L946N71J224
12409H0107M742J641k789l824r54O903J1754J26j709j426J924m623L042N264N696
12394A05874J06Q628O188N90L582N056M798R748J8951J1732J3593J6652J9017
12381B24515J7714K6980K7185L6209L4455K5670J9940Q196P326N643k773r301
12369D21759j4144p322p714o029J20O596N552M575J0875P970J2005M239O906P163
12355D52551O406J6819K1711J8064P738P248J2672J1273K1262K8109L6009L7648
12343F77510L9451M7250M3532L7775L0500K0245N705j2831k5070l2130l7966l5579
12331G58392m4089l4194k2121k7166k4526j8920j8850j3247j2483k2120j9929
$$ y = [87515, 93837, 93119, 87618, 82986, 80047, 74357, 69860, 70567, 77017, 79838, 80686, 74366, 78312, 78883, 80107, 84849, 86490, 83701, 79877, 78923, 85826, 97580, 97706, 95997, 94571, 96495, 91872, 94914, 100178, 105874, 105980, 114608, 120796, 121386, 124968, 130024, 134822, 144570, 163521, 175253, 188846, 205498, 224515, 242229, 269209, 296394, 332603, 367058, 392728, 412668, 420864, 428190, 433833, 431060, 421759, 407615, 400293, 392579, 386550, 386670, 393266, 398818, 403393, 414268, 422238, 434243, 438482, 445388, 452551, 458957, 475776, 497487, 515551, 523289, 530537, 543209, 554482, 575744, 603853, 639862, 677510, 716961, 764211, 807743, 845518, 876018, 896263, 901968, 889137, 864067, 831937, 793971, 758392, 714303, 680109, 657988, 630822, 606296, 587376, 568526, 555279, 542796, 520676, 500747]
12320E00747j9283r194l656j2084j4284j5269j1663j1253r536o883n36J779L925
12307C92810O234N545N389M354P642J0986J539j3811j4097k3098l0580l1551k9202
12294B92160k3040k3619j9632j4952j2094j4546j2728j4358q423o118r023k148
12282A31479o654r733j0103m93J294m615m631n087p594j3456l176N315L536K604
12268G8686p636j916k020j959k003j104j359m806n151k61N023j574l083J100n100
12253D6837j282M20M851k404k098M10j841O9n782r79R21k783m157o465j488R158
12237C3387M196r12m112l470M93Q046K206J122P044j900p978m014J340L102j128
12222C7422L264J82o624l830O72J493m645j478M799p91M110J949M32L693l137
$$ y = [500747, 481464, 472270, 468614, 456530, 442246, 426977, 415314, 404061, 394525, 387642, 387106, 388885, 392810, 399044, 404589, 409978, 414332, 421974, 432960, 434499, 420688, 406591, 383493, 352913, 321362, 292160, 269120, 245501, 225869, 210917, 198823, 184277, 171549, 157191, 148768, 142650, 133627, 131479, 124825, 115092, 104989, 104496, 105790, 101175, 96544, 91457, 83863, 70407, 67231, 72546, 76082, 78686, 71050, 69134, 67114, 65155, 63152, 62048, 60689, 55883, 50732, 50471, 55494, 53920, 50837, 51937, 46837, 45555, 45975, 50826, 48422, 46324, 46734, 44893, 44962, 39180, 38201, 39122, 36339, 32182, 25717, 24229, 33387, 37583, 36671, 32559, 29089, 29582, 37628, 39834, 40956, 48000, 46100, 38122, 34108, 35448, 38550, 37422, 40686, 40868, 34244, 30414, 31086, 32579, 27934, 26456, 31255, 30464, 34574, 36523, 36955, 40648, 37511]
12207C7511j210P57q119k094J721M366j714J552J809N13M401o049q54j872J380
12192C2098L570J228k868k453Q082O484k535K973n6n896k133j109J850P345l147
12177D3433K502l969m954N884k979q286Q91J983K427M691J765p963r340N554K34
12162C1873J44k072k026j590K71K587n73O09J91M270L012m902p467m126r77L174
12146B2398J136K532m966n992J380M621J924Q63k107Q589O46p217J963K168L642
12131C1580j756m756l115j59j767l613Q12K660M620O306M952j558R97P45j0170
12116B5778p597j417O894K172l934m009q95K970l854K608p20o79M124j590l945
12101A5906J664K655j152K117Q59P600j891J683L871n598o239n134K466L233k127
$$ y = [37511, 36301, 37058, 28939, 26845, 28566, 32932, 31218, 32770, 34579, 35092, 39493, 33444, 32590, 30718, 32098, 35668, 36896, 34028, 31575, 39657, 46141, 43606, 46579, 46523, 40627, 38494, 37385, 39235, 46580, 43433, 45935, 41966, 37012, 42896, 39917, 31631, 32522, 34505, 36932, 41623, 43388, 35425, 26085, 31639, 31873, 32017, 29945, 27919, 26329, 26600, 29187, 28614, 29223, 29414, 33684, 36696, 31794, 24327, 20201, 19224, 22398, 23534, 26066, 21100, 15108, 16488, 21109, 23033, 23896, 21789, 30378, 31024, 23807, 25770, 27938, 31580, 29824, 25068, 21953, 21794, 20027, 16414, 17226, 19886, 24506, 30812, 35764, 34206, 35203, 35948, 25778, 18181, 16764, 23658, 25830, 21896, 17887, 16992, 19962, 16108, 18716, 17996, 17317, 21441, 19851, 15906, 17570, 20225, 19073, 21190, 22049, 29649, 27758, 29441, 33312, 27714, 21475, 16341, 18807, 22040, 19913]
12086A9913j366j3J57m50L86k82L168l601k062l442k439K980O836k179K209j460
12070A8355j411N338j062n748j648J124j295L913m278j026m073k068M120L844
12056A4085L124l102l493m502P707L156L054k474o906n085L254O53k479j940l318
12041A734M43K419Q784J689N078p29m159k077j623N080P09m602J789J45M010m746
12025A3944j86L232j759m931P46L45j918n37N298P813L517m569n229m113K691
12010A4344n716n669P659l435o59ML212K482L2P01M049M353J853k028k701M308
11994B2789j12K7K056J248o985n215Q69K091K917p449k829k596M097O057O927
11979B3892j330l395J439J473p289j473L888p34K053k618m098L800L893L778N624
$$ y = [19913, 18547, 18534, 18691, 18241, 18627, 18345, 21513, 17912, 15850, 12408, 9969, 12949, 19785, 17606, 19815, 18355, 16944, 22282, 21220, 15472, 13824, 14948, 13653, 17566, 13288, 12262, 8189, 6121, 10241, 14085, 17209, 14107, 10614, 6112, 13819, 16975, 20029, 17555, 10649, 5564, 8818, 9471, 6992, 5052, 1734, 2177, 4596, 13380, 15069, 20147, 19418, 15259, 13182, 11559, 16639, 17348, 12746, 14535, 14680, 18690, 13944, 13758, 16990, 15231, 10300, 11046, 11391, 9473, 8936, 14234, 22047, 25564, 20995, 15766, 11653, 14344, 8628, 2959, 10618, 7183, 6524, 6528, 9740, 12222, 12254, 12955, 17004, 21357, 23210, 21182, 18481, 22789, 22677, 22704, 24760, 26008, 19023, 13808, 14677, 16768, 19685, 12236, 9407, 6811, 10908, 16965, 23892, 22562, 19167, 20606, 22079, 14790, 13317, 17205, 16471, 18524, 15906, 11808, 15608, 19501, 23279, 28903]
11964B8903l199p306n633K437L266K051O128j514n690n252Q91Q53k629j218L053
11949A5141P269o264m504l87M580M962M738m123l937Q706k225J574O937j973k909
11934B7585k299k965j626P106J753P15N885j288j460q68K552J346K07j931n131
11919B9581k244q09O41K64k604j222m403K098L889r67p693N115L746M352L286
11904C3030k641k359l842j752N237n610q44O90K471N853L907P76l32J767O542
11889D2893m934n602j761N614j377p186m352P381O364L044J043M322m581j0817
11875C0051j281p7L962L107m444q853n726K355L409M387J15M909k837J260J776
11860C2113q38L635J025m9O759N28n634n676j983k360q18j082K900J44l528L175
$$ y = [28903, 25704, 18398, 12765, 15202, 18468, 20519, 26647, 25133, 19443, 14191, 15082, 15935, 13306, 12088, 15141, 22410, 16146, 11642, 11255, 15835, 20797, 25535, 21412, 17475, 26181, 23956, 25530, 32467, 30494, 27585, 25286, 22321, 20695, 27801, 29554, 30269, 36154, 34866, 33406, 32538, 35090, 36436, 36643, 34712, 29581, 27337, 26528, 27169, 27433, 24829, 23607, 19204, 21302, 25191, 24224, 16531, 21646, 25392, 29744, 33030, 30389, 28030, 24188, 22436, 27673, 22063, 21219, 21909, 24380, 30233, 34140, 34916, 34584, 36351, 42893, 37959, 32357, 30596, 36210, 34833, 27647, 23295, 30676, 37040, 40084, 41127, 45449, 40868, 30051, 28770, 28693, 32655, 35762, 31318, 22465, 16739, 19094, 22503, 26890, 27005, 31914, 29077, 30337, 32113, 31275, 34910, 35935, 35886, 42645, 43173, 37539, 31863, 29880, 27520, 26702, 25620, 28520, 28664, 25136, 28311]
11844B8311R281O515k986j296j188j119k954r543k568j870K762K398L298M071
11830C3112L764m861n303q11M09R50M965J459L242n511l921J493Q23K846Q53M681
11814C8190m305J924K487j036m739n037l910l262N482N208J492K517j079l721
11800C0211k786L603L150o054m737K8L198l538J609p860L83M301j48l887M737
11785B2210J855J050L369l110j901J335j439L237K669K36L706j301l950n418K528
11770B5076K794L417k073j256K812M56l116K665o897O824N0j0473j044o299L013
11755A5949Q178J228m878p77M010K11L23M52j632M754J334j005N597J836n602
11740B9978l155K805L779j761l801k818k976P55j098k399J451l88K258J201M939
$$ y = [28311, 37592, 44107, 41121, 39825, 38637, 37518, 34564, 25021, 22453, 20583, 23345, 25743, 29041, 33112, 36876, 32015, 26712, 25901, 26310, 27260, 32225, 33684, 36926, 31415, 27494, 28987, 29810, 32656, 33509, 38190, 33885, 35809, 38296, 37260, 32521, 27484, 23574, 20312, 25794, 31002, 32494, 35011, 33932, 30211, 27425, 31028, 34178, 28124, 23387, 23415, 26613, 23075, 24684, 16824, 17207, 21508, 21360, 17473, 22210, 24065, 25115, 28484, 25374, 23473, 24808, 23369, 26606, 29275, 29511, 33217, 31916, 27966, 22548, 25076, 27870, 31287, 29214, 27958, 30770, 31226, 28110, 30775, 23878, 30702, 30752, 20279, 19235, 12936, 15949, 24127, 25355, 20477, 19700, 23710, 23921, 24244, 24696, 23064, 27818, 29152, 28147, 33744, 35580, 29978, 26823, 29628, 33407, 31646, 27845, 25027, 22051, 22806, 21708, 19309, 20760, 20372, 22630, 23831, 28770]
11725B8770m80n381J565j44j10l371R06M660N84l118l878k720M513J448L240K239
11709B8723m463K83J493j608L105K985J055O86m816p200n001M1K564M326K121
11694B4294j336J1385j051k798J866l256l212L954L446r44m65q802j272M736J735
11679B8280l195l872K158N308k097n683L10J876o31P90L491l404p332p201m151
11664D647P661J0383P523p398o220l885K637N871J648M732l18L925K669n299j343
11649B7233J26J921rJ730M21n426N8J588l280k307M4j468M195K171K542K668n1
11632C2156j906l816K356N32k110J836J159K844k512n029J863R79O697K709n19
11617C7239l944j507m512l994l005q7L371K719M149K653K509l31K367m080o883
$$ y = [28770, 28290, 22909, 24474, 24330, 24220, 20849, 21755, 26415, 26999, 23881, 20003, 17283, 21796, 23244, 26484, 28723, 24260, 24543, 26036, 24428, 27533, 30518, 31573, 32259, 27443, 20243, 15242, 15283, 17847, 22173, 24294, 22958, 34343, 33292, 30494, 32360, 29104, 25892, 29846, 33292, 32348, 31883, 23081, 21809, 26545, 28280, 25085, 21213, 23371, 28679, 26582, 20899, 21209, 23085, 22454, 23244, 26735, 23331, 15999, 8798, 4647, 12308, 22691, 30214, 22816, 16596, 12711, 15348, 21219, 22867, 27599, 27281, 31206, 33875, 28576, 27233, 27359, 29280, 29271, 31001, 31422, 25996, 26054, 27642, 24362, 22055, 22099, 20631, 24826, 26997, 29539, 32207, 32156, 30250, 26434, 28790, 29322, 27212, 29048, 30207, 33051, 30539, 25510, 27373, 28352, 35049, 37758, 37239, 33295, 31788, 27276, 23282, 20277, 20190, 23561, 26280, 30429, 33082, 35591, 35260, 37627, 33547, 26664]
11602B6664l190L399M746l638J139q7M183J715o646l518l986J906k018m38L628
11587B3859J498j840j422L867M223J535R87J087j15L236j32m573n709N903R88
11572C3392n429L552m891l089J327P183m552q370k58j74k328L411R191K006n116
11557B5855k039j703m380K162N594M737N138m021J935K393Q42J413J357K276k37
11542D1322J819K094k804N831j899r494j319j051Q57J115L167P0M60j834r59p57
11526C6618O782L385l820o720p302j189L856N255J747m205m729M6N544Q279L631
11511D7178k949j022N01j552k135l995q423K369P573j48R47n755o48R01N778L475
11495D2095m179r387L24k329R913K144k867N186K472k194l521j096j535J118J747
$$ y = [26664, 23474, 26873, 31619, 27981, 29120, 29033, 33216, 34931, 28285, 24767, 20781, 22687, 20669, 20231, 23859, 25357, 23517, 22095, 25962, 30185, 31720, 32707, 33794, 33679, 36915, 36783, 32210, 26501, 32404, 33392, 27963, 31515, 26624, 23535, 24862, 32045, 27493, 19123, 18865, 18691, 16363, 19774, 28965, 30971, 25855, 23816, 22113, 17733, 19895, 25489, 30226, 35364, 31343, 33278, 35671, 36513, 37926, 39283, 41559, 41322, 43141, 45235, 42431, 48262, 46363, 36869, 35550, 34499, 35356, 36471, 39638, 39708, 40168, 38334, 37375, 36618, 43400, 46785, 42965, 36245, 28943, 27754, 31610, 36865, 38612, 34407, 29678, 29724, 35268, 43547, 47178, 44229, 43207, 43708, 42156, 40021, 36026, 27603, 29972, 37545, 37397, 38344, 32589, 31941, 32842, 38620, 42095, 37916, 28529, 28853, 26524, 36437, 38581, 35714, 40900, 43372, 41178, 37657, 36561, 35026, 36144, 37891]
11480C7891m589k177k052O16M073j291r26L860J564P547o68o053m227O472l222
11465C6818k149k67K382o260J443M868K638K126k081Q83o66n98n19l481l240N814
11449C7711N869M40k39k270j100l450N57k077j904j145R63O918n327p75P33J347
11433C6251K750k363m01L386q159m806j412J992JK507J288K330K948l914l45K963
11417C5016j45n234K067K761j0853j345J0271L399J354k929J768J008k64k834
11403C4040o795m181n99N401K899M198N10k846m079L887L475l049P2O787O235
11388D5955j35n046m42L072l451m379j914O892P570r13m8j470q049J807L923m010
11372C9362J439P33J931N485K906J809p265o223l381K265J747p59r86p51K247
$$ y = [37891, 33302, 31125, 29073, 29689, 33762, 32471, 31545, 35405, 36969, 44516, 43848, 37795, 33568, 40040, 36818, 34669, 34402, 36784, 30524, 31967, 36835, 39473, 41599, 39518, 40401, 39735, 39137, 38618, 35137, 31897, 37711, 43580, 44020, 43781, 41511, 40411, 36961, 37518, 35441, 33537, 32392, 33355, 40273, 34946, 34171, 34904, 36251, 39001, 36638, 36237, 39623, 31464, 26658, 25246, 27238, 27239, 29746, 31034, 33364, 36312, 32398, 32053, 35016, 34871, 29637, 31704, 34465, 23612, 22267, 32538, 35937, 37291, 34362, 36130, 37138, 36874, 34040, 27245, 23064, 22465, 27866, 30765, 34963, 35473, 32627, 28548, 32435, 35910, 32861, 32933, 39720, 45955, 45820, 40774, 40332, 43404, 39953, 35574, 33660, 40552, 48122, 47209, 47161, 45691, 37642, 39449, 43372, 39362, 40801, 41534, 43465, 48950, 51856, 53665, 46400, 40177, 36796, 39061, 40808, 40049, 39063, 38312, 40559]
11357D0559j358M851o90l455J240o91M222j443P12l043J523J288J905K918m092
11342D4446r38L988P321j754q395m70O27l846L138j64k493O85J288K743L537K782
11326E2495L26n780l003L804K120L016L20L111k311l081N46R36k136p24M124m523
11310D9240j2955L835N279J0395P129j72q053n097O16Q68R67j0042M780K852n15
11295D9127J535K127K809K509l416n84R01N60n301J698J017p426n81J495M273
11280E0743L270j148n752k921K62K126l542J050j730P87m01K057q28K878N994
11265E2845O938n011k309N703K809K167q391m204j381n5J725M172K415k519j317
11250E3587j021l838j607j65N319k721n55J427r51J675l532j366O413Q466J33
$$ y = [40559, 39201, 44052, 43362, 39907, 41147, 40456, 44678, 43235, 43947, 40904, 42427, 43715, 45620, 48538, 44446, 43508, 47496, 54817, 53063, 44668, 44198, 44825, 40979, 44117, 43953, 41460, 42145, 43433, 46176, 49713, 52495, 52821, 47041, 44038, 47842, 49962, 52978, 53298, 56409, 54098, 51017, 51563, 52499, 50363, 49639, 53763, 49240, 36285, 40120, 45399, 55794, 62923, 62751, 54698, 49601, 50217, 51085, 52052, 42010, 46790, 49642, 49127, 50662, 52789, 55598, 58107, 54691, 54107, 55008, 55568, 50267, 51965, 52982, 45556, 44975, 46470, 50743, 54013, 52865, 47113, 44192, 44454, 46580, 43038, 44088, 42358, 43145, 42744, 44801, 43973, 46851, 52845, 59783, 54772, 52463, 58166, 60975, 63142, 54751, 50547, 49166, 49111, 50836, 55008, 57423, 54904, 53587, 52566, 48728, 47121, 46956, 52275, 49554, 48999, 50426, 49475, 51150, 47618, 46252, 52665, 61131, 61264]
11235F1264p136J603n870r25J583r48J880K512m5Q617L987l556N38L605N665l366
11219F9408m401J396l742J885k127r783m963R340J218p839l764K784m48J619k278
11204D8305O09M648N720k605j083K575J570p14r11K056j352n713j476j086K344
11189E2887J584R04L24J704L249O62K420L926J8K644j156m9K10k035l561K569
11173F6300L849J102l207p317k073K676L582j191M595L625N07K370j1750n85M725
11158F7208P59j073M435M90m089j587L921K718l784q08N663K088l06m631j204
11143F9800N572J227M714N76k975M137j849o120m197M271N377k106m188O34N088
11128G9961L150j462L100L282K471o729n050N717R47k172O046l467j177N546P021
$$ y = [61264, 54128, 55731, 49861, 48936, 50519, 49571, 51451, 53963, 53918, 62535, 66522, 62966, 63504, 67109, 72774, 69408, 65007, 66403, 62661, 64546, 62419, 52636, 47673, 57013, 58231, 50392, 46628, 49412, 48964, 50583, 48305, 48914, 53562, 59282, 56677, 55594, 58169, 59739, 59025, 58114, 60170, 58818, 53105, 51629, 50543, 52887, 54471, 55375, 55699, 57403, 60652, 61314, 63734, 67660, 67678, 70322, 69166, 69117, 69327, 67292, 63731, 66300, 70149, 71251, 68044, 60727, 58654, 61330, 64912, 63721, 68316, 71941, 72448, 74818, 63068, 62483, 67208, 67967, 66894, 71329, 71819, 67730, 66143, 70064, 72782, 68998, 68190, 73853, 75941, 75635, 71004, 69800, 75372, 76599, 81313, 81889, 78914, 83051, 81202, 75082, 70885, 75156, 80533, 78427, 74239, 74873, 79961, 83111, 81649, 84749, 88031, 90502, 83773, 78723, 84440, 85387, 83215, 89261, 85794, 84617, 90163, 97184]
11113I7184K812K690O41L841l098J1j777n405n28j707R6j501M640K834P085K528
11097A10346L125l78K98k287K547K052J274j609j365K622J202L798N058n096J881
11082A23468N956l076J563j719N08N67L392r36Q085k343l959j947J901L42L059
11067A34861N097J091J133j604m840L178R3l208j312M622N003Q379j890J877J440
11052A53920K382L915J883j420m050j378N671J1241J071l469L302M517j252K576
11038A78909J164J188N613j738K792O144R51k05m079M262J484K02O524k938j75
11023B00098Q35J727M155N292l172j0278l686N129L440M772r68L385O251M567
11009B21547L605l919k381o9j058l653K479P639j695l752K506L098k567j37k080
$$ y = [97184, 99996, 102686, 103327, 107168, 104070, 104081, 102304, 96899, 96371, 94664, 94760, 93259, 97899, 100733, 107818, 110346, 113471, 113093, 113391, 111104, 113651, 115703, 116977, 115368, 114003, 116625, 117827, 121625, 126683, 121587, 123468, 129424, 126348, 127911, 126192, 126700, 127267, 130659, 129723, 137808, 135465, 131506, 129559, 131460, 131802, 134861, 139958, 141049, 142182, 140578, 135738, 138916, 139009, 135801, 134489, 139111, 144114, 152493, 150603, 152480, 153920, 156302, 160217, 162100, 160680, 156630, 155252, 160923, 172164, 173235, 169766, 173068, 177585, 176333, 178909, 180073, 181261, 186874, 185136, 187928, 194072, 195023, 194818, 190739, 195001, 196485, 196687, 203211, 200273, 200098, 200933, 202660, 206815, 212107, 208935, 198657, 194971, 200100, 203540, 208312, 207344, 210729, 216980, 221547, 225152, 221233, 218852, 218783, 217725, 214072, 216551, 224190, 222495, 218743, 221249, 224347, 221780, 221643, 219563]
10994B19563m25M868L122N032O99l596n388l4o202J032K504o35O05N509K658M637
10978B33949M05l398q627k656J407O417J938q502k317m554J558R43K51J025J946
10963B19785l676k159K291l803q196J52J395r91L000N930k527p938p002o262q26
10948A89173k914K540l295J571L043J717L678R010l723j0092j417P7j801J00K260
10933A89927r428j472O996K240m847K20l349k337J671R47K159Q108p858q047k666
10918A72264j463R44j92o840l861K265K341L429K378p045l310K867l960m394N271
10903A60694P155M803j650m999K23k727k058J978p104m970M850j178J127R981
10889A66125Q306J574p164l014k850j24L513L742k366O845M989N328L378L999
$$ y = [219563, 219138, 224006, 227128, 232160, 232859, 229263, 223875, 223841, 217639, 218671, 221175, 220540, 221145, 226654, 229312, 233949, 234354, 230956, 222329, 219673, 221080, 227497, 229435, 220933, 218616, 214062, 215620, 216563, 216814, 217839, 219785, 216109, 213950, 216241, 212438, 204242, 204394, 205789, 204798, 207798, 213728, 211201, 203263, 196261, 189999, 189173, 186259, 188799, 185504, 187075, 190118, 191835, 195513, 204523, 200800, 190708, 189291, 189368, 187567, 187667, 189927, 180499, 179027, 186023, 188263, 183416, 183636, 180287, 177950, 179621, 180568, 182727, 190835, 182977, 174930, 172264, 170801, 171745, 171553, 164713, 160852, 163117, 165458, 168887, 171265, 164220, 160910, 163777, 159817, 155423, 160694, 167849, 172652, 171002, 166003, 166226, 163499, 161441, 163419, 156315, 151345, 156195, 155017, 156144, 166125, 174431, 176005, 168841, 165827, 162977, 162853, 166366, 170108, 167742, 174587, 179576, 184904, 188282, 192281]
10875A92281m198o677o607J796Q50J599M483j489L986R711j556p588n085J210
10861A82716K339O341J432j301P577n77k456K260k143k941M472L043P062M693
10847B12517P2J052l595J912Q632K835o707o23J1052M518l120L607p35n17N024
10832B35924Q369m927L35K475J105M657M512K772O28K10k95j569J862J1102O613
10817B73773l068L393k416m702JL11j663R740J4049M611l52O24l63L496N350J312
10801C04096M468O906O841m699n033N348J29p94J737N491q62j733R81J130J499
10786C25505j593L01J993J360j436P234R71o772l939L226J339K489m174k254J813
10771C26063j387p000m741k108M10K233Ll972j723n67L356O850K979J243J360
$$ y = [192281, 188083, 181406, 174799, 176595, 177445, 179044, 183527, 182038, 186024, 195735, 194179, 186591, 181506, 182716, 185055, 191396, 192828, 191527, 199104, 198527, 196071, 198331, 196188, 193247, 197719, 200762, 207824, 212517, 212589, 213641, 210046, 211958, 220590, 223425, 216718, 216095, 227147, 231665, 228545, 232152, 231417, 230900, 235924, 244293, 239366, 239701, 242176, 243281, 247938, 252450, 255222, 255850, 256060, 255765, 254196, 256058, 267160, 273773, 270705, 274098, 271682, 266980, 266981, 267292, 265629, 275369, 289418, 294029, 293677, 294301, 293938, 297434, 302784, 304096, 308564, 315470, 322311, 317612, 312579, 317927, 318056, 317262, 318999, 324490, 323628, 321895, 322876, 324006, 325505, 323912, 324213, 326206, 327566, 326130, 333364, 334335, 327563, 323624, 326850, 328189, 330678, 326504, 324250, 326063, 324676, 317676, 312935, 310827, 311237, 313470, 313473, 309501, 307778, 307211, 310567, 317417, 320396, 321639, 322999]
10756C22999k396k284N77J420n63M932l733K16J481M86k182J509n951m043P238
10741C19706r50p057p28J953N223K190o973j704o53p506M377J38l805n827K618
10726C01002M551K380q313K754M144m556K644K948j683P643J608k976n241j829
10712C05076L960O768K270J989j75J181k77L125k57m84M201L789N779J138m773
10697C33310j344P37P524k061p085M236k015J260j523K144K977M387M674J590
10683C48811q8J226J038R838J4151J908l861J204Q674M864M310Q15k571p21O685
10668C96283L369j492P653O607j806p5P24R034K800L870K146L486M417K261Q994
10653D48271J3092Q364N328R107K259J723R621J8018K4119K8576Q426L820O509
$$ y = [322999, 320603, 318319, 318896, 320316, 319753, 324685, 320952, 321168, 322649, 323135, 320953, 322462, 316511, 312468, 319706, 318756, 311699, 310971, 312924, 318147, 320337, 313364, 311660, 311007, 303501, 307878, 308016, 304211, 298384, 301002, 305553, 307933, 299620, 302374, 306518, 301962, 304606, 307554, 305871, 313514, 315122, 312146, 306905, 305076, 309036, 315804, 318074, 320063, 319888, 321069, 320792, 323917, 323660, 323176, 327377, 331166, 336945, 338083, 333310, 331966, 332703, 340227, 338166, 331081, 335317, 333302, 334562, 333039, 335183, 338160, 342547, 347221, 348811, 348723, 349949, 350987, 360825, 374976, 376884, 373023, 374227, 382901, 387765, 392075, 392890, 390319, 389598, 396283, 399652, 398160, 405813, 412420, 410614, 410539, 411263, 420297, 423097, 426967, 429113, 432599, 437016, 439277, 448271, 461363, 469727, 475055, 484162, 486421, 488144, 497765, 515783, 539902, 568478, 576904, 580724, 587233]
10640E87233J783j436O42l985P136J3186J1594R715J0297J0798P752J0209J2334
10627F77258J3269J4197J1243P724J4047J3923K6831K5979J6171J3285J8037J7428
10615H69392J9705K7281L4055K8178K4478K5586K9847L1681L1524K9157L5701
10604A186585M5436M5696M4292M0010M2196N1502N8654N4690O2023O9015O8905
10593A769004P4922P6003Q2841R3832R4854R9631J04456J10753J26977J33048
10583B766321J36698J48036J65074J73275J80214J96928K12372K32568K41000
10574D452486K61313K71035K88513L09343L18958L42052L64795L76138L85922
10565G370555M15749M23894M36496M53434M69436M93972N36244N92731O86020
$$ y = [587233, 589016, 587580, 588222, 584237, 591373, 604559, 616153, 625868, 636165, 646963, 654715, 664924, 677258, 690527, 704724, 715967, 723691, 737738, 751661, 778492, 804471, 820642, 833927, 851964, 869392, 889097, 916378, 950433, 978611, 1003089, 1028675, 1058522, 1090203, 1121727, 1150884, 1186585, 1232021, 1277717, 1322009, 1362019, 1404215, 1455717, 1514371, 1569061, 1631084, 1700099, 1769004, 1843926, 1919929, 2002770, 2096602, 2191456, 2291087, 2395543, 2506296, 2633273, 2766321, 2903019, 3051055, 3216129, 3389404, 3569618, 3766546, 3978918, 4211486, 4452486, 4713799, 4984834, 5273347, 5582690, 5901648, 6243700, 6608495, 6984633, 7370555, 7786304, 8210198, 8646694, 9100128, 9569564, 10063536, 10599780, 11192511, 11878531]
10556A1878531P96890Q07982P54742O93317N32203M03488M44915N33830N33691
10547A7379589N44914N36687M01002K75188K69861L09496L85721N06957O16683
10538B1226098P04163P73138Q31219Q99287R33799R72527R98667J016062J012965
10529B9367925R89923R43261Q68960P69976O52367N03634L35934J60298k9090
10520C4563188k14944l89476n40986o71437p85155q76453r35235r78589r91081
10511B8179832r92253r81397r59563r23780q80406q42711q10550p61044p19886
10502B0308242o81534o42545o07558n85408n63234n30810n16640n06770m87751
10493A5185992m80910m71527m65997m64769m67473m66823m66248m58855m49282
$$ y = [11878531, 12675421, 13483403, 14238145, 14931462, 15463665, 15867153, 16312068, 16845898, 17379589, 17924503, 18461190, 18862192, 19137380, 19407241, 19716737, 20102458, 20609415, 21226098, 21930261, 22703399, 23534618, 24433905, 25367704, 26340231, 27338898, 28354960, 29367925, 30357848, 31301109, 32170069, 32940045, 33592412, 34096046, 34431980, 34592278, 34563188, 34348244, 33958768, 33417782, 32746345, 31961190, 31084737, 30149502, 29170913, 28179832, 27187579, 26206182, 25246619, 24322839, 23442433, 22599722, 21789172, 21028128, 20308242, 19626708, 18984163, 18376605, 17791197, 17227963, 16697153, 16180513, 15673743, 15185992, 14705082, 14233555, 13767558, 13302789, 12835316, 12368493, 11902245, 11443390, 10994108]
10484A0994108m49862m48565m41351m37654m31340m17129m04061l91977l75279
10475G196890l55767l42809l31628l22801l08128k87433k70152k57501k36651
10466D484020k25033k14700j97181j86221j73895j72422j63174j42372j31966
10457B877056j25984j23085j14819j06069j06268r4669r2619q8770p9821p4567
10447A870385o4011o8830o8101o1950n4636m7327m6006l5105m1213l1412k4208
10436A327586l3997k5204l452J6331K5162J3500j2245l7864n7072o6019p3691
10425A073035o3763m1134l5850k9953k7142j7871k0782j0785l360p989n976l156
10413H05274J479J063m906k998k577j1940l459l209m990k056j81P2j2084k0869
$$ y = [10994108, 10544246, 10095681, 9654330, 9216676, 8785336, 8368207, 7964146, 7572169, 7196890, 6841123, 6498314, 6166686, 5843885, 5535757, 5248324, 4978172, 4720671, 4484020, 4258987, 4044287, 3847106, 3660885, 3486990, 3314568, 3151394, 3009022, 2877056, 2751072, 2627987, 2513168, 2407099, 2300831, 2206162, 2113543, 2024773, 1944952, 1870385, 1806374, 1737544, 1669443, 1607493, 1552857, 1505530, 1459524, 1424419, 1383206, 1351794, 1327586, 1293589, 1268385, 1264933, 1281264, 1306426, 1319926, 1307681, 1269817, 1212745, 1146726, 1073035, 1009272, 968138, 932288, 902335, 875193, 857322, 836540, 825755, 822395, 814406, 808430, 805274, 806753, 807816, 802910, 799912, 797335, 785395, 781936, 778727, 773737, 771681, 771500, 771572, 759488, 738619]
10399G38619o991j2568j9316j1120p641p942j5937k2293k6702j9442j2867j5367
10387E60433j6102j8942j9246j4900j4253j2583j0899j8299j3193j3249q292n438
10375C95037l619q642r817q629j2641q935j764Q267Q552J2528P971M181L303N382
10361C91174M461P929L969K788J2090L991n986r327r353o678o730r361j6275j7211
10347C45481r520k568l601l135J552K862J2196J6055L524L236Q823P799M105P46
10333C87555l308p380n536R29Q58O057Q481L286p46k51N092k478n666j2815j1636
10318C62442k908q09l602o166J004L29K006J1193M458P563M311l142j95J35O441
10303C83060N218L513Q696M797j679p217o857n940j0843m69K756k326m075k371
$$ y = [738619, 731628, 719060, 699744, 688624, 680983, 673041, 657104, 634811, 608109, 588667, 575800, 560433, 544331, 525389, 506143, 491243, 476990, 464407, 453508, 435209, 422016, 408767, 400475, 395037, 391418, 382776, 372959, 364330, 351689, 342754, 340990, 349257, 357809, 370337, 378308, 382489, 385792, 391174, 395635, 403564, 407533, 410321, 422411, 426402, 420416, 411089, 401736, 395058, 388328, 378967, 362692, 345481, 335961, 333393, 329792, 326657, 328209, 331071, 343267, 359322, 362846, 366082, 374905, 382704, 386809, 387555, 384247, 376867, 371331, 372260, 373118, 379175, 387656, 390942, 390196, 389945, 395037, 392559, 386893, 374078, 362442, 359534, 358725, 355123, 348957, 349961, 350290, 352296, 363489, 367947, 375510, 379821, 376679, 376484, 376619, 383060, 388278, 391791, 400487, 405284, 403605, 396388, 389531, 383591, 372748, 372279, 375035, 372709, 368634, 366263]
10289C66263j8010j8614j1919k989l47O429j170Q80m007j7956L81K1294J4245
10276C34480K6179L6748J2910J043P503J2612K2249K6201L3662J7978J3888J4560
10264E60013J3582K949o38k833j495o624p249m135K215P089O649P606l226o559
10250E67344l129L489j404r39P335J4850J1152J5605J0153J0845J1718J8704K4455
10237F90178J7039J3060J0199J5998J8449J3089J2734J5080K3006K7083L5576
10226H91491L6736K9355K1806K0172J4316O972M670K057j1201p771j625q906r351
10213I88721n216Q283J9901L2021L1274L3616L8911M2431M9436M7017N6970O9282
10201A412647O6658O0336N8980O4134N8585O6230P8628O4875N6807O3303P1090
$$ y = [366263, 348253, 329639, 317720, 314731, 314384, 320813, 319643, 320523, 316516, 298560, 298941, 320235, 334480, 360659, 397407, 410317, 411360, 418863, 431475, 453724, 479925, 513587, 531565, 545453, 560013, 573595, 576544, 575906, 573073, 571578, 564954, 557705, 553570, 555785, 562874, 569523, 577129, 573903, 567344, 564215, 567704, 566300, 565361, 572696, 587546, 598698, 614303, 624456, 635301, 647019, 665723, 690178, 707217, 720277, 730476, 746474, 764923, 778012, 790746, 805826, 828832, 855915, 891491, 928227, 957582, 979388, 999560, 1013876, 1020848, 1025518, 1027575, 1016374, 1008603, 1006978, 998072, 988721, 983505, 991788, 1011689, 1043710, 1074984, 1108600, 1147511, 1189942, 1239378, 1286395, 1343365, 1412647, 1479305, 1539641, 1598621, 1662755, 1721340, 1787570, 1866198, 1931073, 1987880, 2051183, 2122273]
10190B122273R2824J23351J48393J75237J83682J91207J93609K10424K46679K86080
10180C973759L22705L87163M71773O00251Q19178J046567J108269J055033R51807
10171A0736505P94598P65299J044011J376004J650679J921935K111445K378646
10163B2779122L051371M326715O428718J0194585J7170198L0107939M9989396
10156A44048044O3757525N6624384M5538038L0669650Q49341j4160082r17779
10149C26409121R467191O807081R758785K717793k6653871m8313275n1894947
10142B28297878n3874847m8513980l3285923k0317608j2881508q706773o122310
10135D4594929m484297l548816l012102k765838k644146k420890k131700j923879
$$ y = [2122273, 2215097, 2338448, 2486841, 2662078, 2845760, 3036967, 3230576, 3441000, 3687679, 3973759, 4296464, 4683627, 5155400, 5755651, 6574829, 7621396, 8729665, 9784698, 10736505, 11531103, 12296402, 13340413, 14716417, 16367096, 18289031, 20400476, 22779122, 25830493, 30157208, 36585926, 46780511, 63950709, 94058648, 144048044, 207805569, 264429953, 309967991, 340637641, 341486982, 327326900, 326409121, 335876312, 342683393, 352442178, 355159971, 328506100, 280192825, 228297878, 174423031, 125909051, 92623128, 72305520, 59424012, 50717239, 44594929, 40110632, 36561816, 33549714, 30783876, 28139730, 25718840, 23587140, 21663261]
10127B1663261j770425j654110j622013j618520j528186j373852j204074r71560
10119I920521p50151o13021n12631m22886l45664k53369j02573N9035J40093J05214
10109G224568m2039k58183m38353n34790n48084m79465l62041k45189j25186K1835
10099D213073K40021N64040P05190L52082o7339j90084l11922l18351P2883L78783
10089E638376J01323k66143l94714n90086p66050o43233m18929k64838j82470
10080B213236j27164r1464q1467p4135o4082o5928o8125n2598l4772k4591k7561
10069A501349m6349n6118o9105o6613n5303n3535m5186m5267m7519l4463k8242
10058I53649l1762k5881k1569r106J820n247k2621j8786k3290k8457j8078j0956
$$ y = [21663261, 19892836, 18238726, 16616713, 14998193, 13470007, 12096155, 10892081, 9920521, 9170370, 8557349, 8044718, 7621832, 7276168, 7022799, 6920226, 6979261, 7119354, 7224568, 7182529, 6924346, 6485993, 5951203, 5403119, 4923654, 4561613, 4316424, 4191238, 4213073, 4453094, 5017134, 5722324, 6074406, 6007067, 5816983, 5505061, 5186710, 5259593, 5638376, 5739699, 5473556, 5078842, 4488756, 3722706, 3079473, 2660544, 2395706, 2213236, 2086072, 1994608, 1913141, 1839006, 1774924, 1708996, 1640871, 1588273, 1553501, 1528910, 1501349, 1455000, 1398882, 1329777, 1263164, 1207861, 1154326, 1109140, 1063873, 1016354, 981891, 953649, 921887, 896006, 874437, 865331, 867151, 861904, 839283, 820497, 797207, 768750, 750672, 739716]
10046G39716j5734j9051k0707j5413O082K8005J3344j7440k3072l4720n4927l6071
10034E50012j3371P758K2331K2873K3075J9038J5617J6939J8099K8117K4811J1429
10022G46728J0400K84p500k2056k8108l4140l3351l1350l7476l2870k9952l0226
10010D70383k5357j8711j6521k1822k1334j7995p694r337k0439j2774j6775j6447
9998B65177j3708j338O031L518k541r998j3620l366K96l093p316k149p337q450
9984B02106j1197m742j3101q434n719p954j4937j9053j7088j0790n427K095P721
9971I3480Q406K972m777j247m822m413J0552J2658J6776J5295J3615K917o914
9958A54498k279J33n987p859r516q058j0967j4143j1911j5506j0023o161k479
$$ y = [739716, 723982, 704931, 684224, 668811, 674893, 702898, 716242, 698802, 675730, 641010, 586083, 550012, 536641, 544399, 566730, 589603, 612678, 631716, 647333, 664272, 682371, 710488, 735299, 746728, 757128, 757412, 749912, 727856, 699748, 665608, 632257, 600907, 563431, 530561, 500609, 470383, 445026, 426315, 409794, 387972, 366638, 348643, 340949, 331612, 311173, 298399, 281624, 265177, 251469, 250131, 256162, 259680, 257139, 247141, 233521, 230155, 230451, 227358, 220042, 217893, 210556, 202106, 190909, 186167, 173066, 164632, 158913, 150959, 136022, 116969, 99881, 89091, 83664, 85759, 93480, 101886, 104858, 100081, 98834, 94012, 89599, 100151, 112809, 129585, 144880, 158495, 161412, 154498, 152219, 152352, 146365, 138506, 128990, 120932, 109965, 95822, 83911, 68405, 58382, 52221, 49742]
9945D9742n360m66m465n328M413J2995R477J536L282Q177J0068R783N803R732
9931A09389Q780N880L804L722l049p762J92m38L87k024m682m991Q73j29j0594
9916I9358o859j016m751n270p191j75M336L797L943Q858P477P111J1326J2728
9902A33672K146J0877J1206O134J110P535J1042J7703K5522K6370M8100R1112
9890C92529J38300K09638K24698J60521N8597j9523n9567m3063L1857R3025O6916
9879A253928k2793j06290j68605j96990j84529j38175r4629n5263k9610k1177
9869B35867j6515j1797p457n763o531r107j0582p685j348K314K47K622J3187N427
9855A82879k244K231N772K888K900L508L821P671J914J609P617M069J0175J0410
$$ y = [49742, 44382, 43916, 39451, 34123, 38536, 51531, 61008, 62544, 65826, 74003, 84071, 93854, 99657, 109389, 118169, 124049, 127853, 131575, 128526, 120764, 120956, 120518, 120905, 118881, 114199, 109208, 110081, 109952, 99358, 92499, 91483, 86732, 81462, 74271, 74096, 78432, 82229, 86172, 95030, 102507, 109618, 120944, 133672, 135818, 146695, 157901, 164035, 165145, 172680, 183722, 201425, 226947, 253317, 301417, 392529, 530829, 740467, 965165, 1125686, 1184283, 1164760, 1105193, 1062130, 1093987, 1187012, 1253928, 1231135, 1124845, 956240, 759250, 574721, 436546, 341917, 286654, 257044, 235867, 219352, 207555, 200098, 194335, 187804, 178697, 168115, 160430, 159082, 161396, 161643, 164265, 177452, 182879, 180635, 182866, 188638, 191526, 194426, 197934, 201755, 209426, 211340, 212949, 220566, 224635, 234810, 245220]
9841B45220J2514J9757J2012J4831M798P156J6011J0414N933J3413R468N785J4454
9828C91766J4404J1717J4601J8948K3942K4490K6339K7828K7743K9947K7258L2100
9816F71083K8190L2643M1996M3929M7234M4646M5020N5125N8867N7427N6263N9457
9804A241880O2540O0688O1218N9043N2837M0840M3741L9239L1876K4885J6383
9793A735170M643j6055k2225k4269l5862l7717m4260n4118m9401n3302o1549o5311
9781A275744n8420n3750n3304m8651m8436n5085n6528m4816m3065m2749m2911
9770G28029l3820k5885k6303k4776k0288k6999j7113j7920j2430m548j1166j1250
9758D95531k44k21J2827K8005N7893J09976K14765L24747L35877K86414K14969
$$ y = [245220, 257734, 277491, 289503, 304334, 309132, 316288, 332299, 342713, 348646, 362059, 371527, 377312, 391766, 406170, 417887, 432488, 451436, 475378, 499868, 526207, 554035, 581778, 611725, 638983, 671083, 699273, 731916, 773912, 817841, 865075, 909721, 954741, 1009866, 1068733, 1126160, 1182423, 1241880, 1304420, 1365108, 1426326, 1485369, 1538206, 1579046, 1622787, 1662026, 1693902, 1718787, 1735170, 1739813, 1723758, 1701533, 1677264, 1641402, 1603685, 1559425, 1505307, 1455906, 1402604, 1341055, 1275744, 1217324, 1163574, 1110270, 1061619, 1013183, 958098, 901570, 856754, 813689, 770940, 728029, 694209, 668324, 642021, 617245, 596957, 569958, 552845, 534925, 522495, 517947, 506781, 495531, 495287, 495066, 507893, 535898, 593791, 703767, 918532, 1243279, 1579156, 1865570, 2080539]
9747B080539O7169o9102m2352L6193L8532L6850J6941j31459k80402l18534l17631
9736A116744k93220k05433j22546p9285n1592l4500l5429k9104j5468j5571k1025
9725B13571j8642j3637j9115j2984j0805r758o237k276j09k164r134r02j608m862
9711A01338m664q403q357M619J576m343p608l587m346q967j372m075o812K363
9697D7362L327m191K010L953j293m044P75n348R09M559O659J063j212Q4k693p728
9681D4192N986J312k381p059n021k354p168q665j845L72K982j857m140n55K674
9666A6473o85r95j240M17m159l779j898k442K975K380N621M271o756n39J265n858
9650E051N506q06J359j332J312N640m164j294M686k218P37K636r432P73L494j569
$$ y = [2080539, 2147708, 2078606, 2036254, 2072447, 2110979, 2147829, 2164770, 2033311, 1752909, 1434375, 1116744, 823524, 618091, 495545, 416260, 364668, 330168, 294739, 265635, 250167, 234596, 213571, 194929, 181292, 162177, 149193, 138388, 128630, 122393, 120117, 120008, 117844, 108710, 107808, 106200, 101338, 96674, 88271, 79914, 84533, 86109, 81766, 74158, 70571, 66225, 57258, 55886, 51811, 44999, 47362, 50689, 46498, 48508, 52461, 51168, 47124, 47899, 42551, 43460, 48019, 54678, 55741, 54529, 54613, 51920, 44192, 50178, 51490, 49109, 42050, 37029, 34675, 27507, 18842, 16997, 17369, 20351, 18494, 14354, 13799, 16473, 15788, 14793, 13553, 13970, 9811, 6032, 4134, 1692, 4667, 7047, 12668, 16939, 10183, 9644, 10909, 5051, 10557, 9751, 11110, 9778, 11090, 16730, 12566, 11272, 15958, 13740, 14477, 17113, 7681, 8454, 11948, 10379]
9634A0379q114n363n012O35O397l05O204L246J413J271J282m91M48j979M84J0954
9618B1449l226m052k041L459J259J484k352k671N445J818K859m615j1221l456
9604D139L533j470R28J92l187j976m169p528l624L545R039P567j0866l449N450
9589a876N858m761k541KL338M234l287Q223J1121N821P748R559J5810Q035l297
9574F3987K763J358j0192n786k447j1177j2705j2417p769O763J5551O927L332
9561C8188M760M838K373P282Q237n0M939L241k742p934l218J1514J2947J1921
9547I6296J2909L205r555j3071j0914L01O418K2319J7646J5929K2489K9799K4895
9534B18666O919n825j8333l2255l9102l3832k3713j7986j2641l126p24K958O78
$$ y = [10379, 2265, -3098, -8110, -7475, -1078, -1383, 4821, 8067, 9480, 10751, 12033, 11542, 11990, 10011, 10495, 21449, 18223, 14171, 12130, 15589, 16848, 18332, 15980, 13309, 18754, 20572, 23431, 18816, 7595, 4139, 7672, 6202, 7130, 7322, 4135, 2159, -2010, -9538, -13162, -9617, -578, 6989, -3877, -7326, -1876, 3982, -779, -3320, -3318, 20, 4254, 967, 9190, 20311, 26132, 33880, 43439, 59249, 67284, 63987, 66750, 68108, 57916, 52130, 49683, 38506, 25801, 13384, 5615, 12378, 27929, 34856, 38188, 42948, 47786, 50159, 57441, 65678, 65628, 70567, 73808, 71066, 63132, 59914, 71428, 84375, 96296, 109205, 112410, 102855, 89784, 78870, 79171, 85589, 107908, 125554, 141483, 163972, 193771, 218666, 225585, 219760, 201427, 169172, 130070, 96238, 72525, 54539, 41898, 38772, 38048, 41006, 41684]
9521D1684L759J335m065q082J50Q811R140R649j495j522k592L910O389o514j6067
9506D4490j4691j0620o741j067L336O432m7K147M207R047J3480O267M514O439
9492F7193M344o757j3630q756N37o865r265j0958n140J474J979M564M850l221
9478B0349R62j297j0004p745n080k615M118L872J468m035m126l371n331L132L412
9463f291j981M148K722N84L361k84J33L202J977l701P68O779M803J26n337J35
9447A1144N974o056q027m066l229K882n8n329k815l604n395L389L063N941N121
9432a065K535L829J550j33q480M412M397j84P501J0248k108l649L555P116J0171
9417C9695N311M34j499m583k917o295p794m598k941J083L287j112n061M96p324
$$ y = [41684, 45443, 46778, 42713, 34631, 34781, 43592, 52732, 62381, 60886, 59364, 56772, 60682, 67071, 60557, 44490, 29799, 19179, 12438, 11371, 14707, 21139, 21092, 23239, 27446, 36493, 49973, 56240, 60754, 67193, 71537, 64780, 51150, 42394, 42931, 36066, 26801, 15843, 10703, 12177, 14156, 18720, 23570, 20349, 21311, 20014, 10010, 2265, -2815, -5430, -1312, 2560, 4028, -7, -4133, -7504, -12835, -9703, -6291, -8272, -4124, -1402, -818, 2543, 2259, 2392, 5594, 7571, 3870, 4638, 11417, 16220, 16346, 11009, 11144, 17118, 11062, 3035, -1031, -4260, -1378, -1436, -6765, -9580, -13184, -18579, -15190, -12127, -6186, -1065, 1470, 5299, 6849, 6716, -1764, 2648, 7045, 6861, 14362, 24610, 22502, 18853, 22408, 29524, 39695, 45006, 45440, 43941, 39358, 36441, 30146, 22352, 17754, 14813, 15896, 19183, 18071, 13010, 13506, 6182]
9402F182L703o355l136n065k866n169K251P247o568j319M515O854M963N460j821
9387H876n88J1330J0699J3659J2887O123r433j2618p910l694o881o719k762M485
9373A7454L098o019p676o347L391k193P80J018l090n480n934P49N740Q642Q284
9358A2417L986L452q57J290J247r30O620Q232J4033J4066J036K705j388m708l397
9343E7804o148m844j539j3242o742o333o071j988J88m76n380l374o853N101j933
9328a830k401J741j605P1J196M938K940j423j821K890j190L953L387q22l66k188
9312G470P044J2961Q694J2575J0827K5194K7352J3238j813m541j8118k9212j8220
9299E3451o303q274l733m956j606R90J198%K574k439k29l381l355J093K247N358
$$ y = [6182, 9885, 3530, 394, -4671, -7537, -12706, -10455, -3208, -9776, -11095, -6580, 274, 5237, 10697, 8876, 8288, 19618, 30317, 43976, 56863, 62986, 53553, 40935, 33025, 29331, 22450, 15731, 12969, 17454, 20552, 14533, 6857, 510, 3901, 1708, 2488, 3506, 416, -5064, -10998, -10249, -4509, 4133, 12417, 16403, 19855, 18998, 20288, 21535, 20605, 27225, 35457, 49490, 63556, 64592, 67297, 65909, 61201, 57804, 51656, 46812, 45273, 32031, 25289, 18956, 12885, 10897, 11085, 10609, 5229, 1855, -4998, 103, -1830, -4231, -2490, -4095, -4024, -2828, 2110, 5050, 3627, 1806, 4696, 3506, 7459, 10846, 10024, 9658, 7470, 14514, 27475, 36169, 48744, 59571, 84765, 112117, 125355, 123542, 119001, 100883, 71671, 53451, 47148, 38874, 35141, 30185, 28579, 29569, 30767, 30767, 33341, 30902, 30673, 27292, 23937, 25030, 27277, 32635]
9283C2635K756n65M419n860n499j11m547j1495n727J329K274N929J182n770N974
9268A6924P973M057P727J1422P859J51L126O370L78O672R14m036k840P6o585m143
9252E6045q791o696L221k788L915J415j0420o10l466o929L922R108J068r33N13
9237C8574J2073P08j020O421R544K941J678N140P538P463K3314L7393N7369Q5534
9223B94670R9543J10420Q9814L2124k7152n8250q3138r3076p7045m5203k7138
9212B15569j7054J279J4242L3591N4934O4026P1168O6847M7750K2904k273j1315
9200E61668j4235k6118l3018k2822k1760j3039j6482o544m82P419K0337N3816
9188D88740J11663J73254K36138K76316K24390Q7167n2521j54878k38771k51095
$$ y = [32635, 35391, 34826, 39245, 33385, 27886, 27775, 23228, 11733, 6006, 7335, 9609, 15538, 16720, 10950, 16924, 24897, 28954, 36681, 48103, 55962, 56113, 59239, 65609, 65987, 72659, 73573, 69537, 66697, 66773, 60188, 56045, 47254, 40558, 43779, 40991, 44906, 46321, 35901, 35291, 31825, 24896, 28818, 37926, 38994, 38061, 38574, 50647, 51355, 50335, 56756, 66300, 69241, 70919, 76059, 83597, 91060, 114374, 151767, 209136, 294670, 394213, 504633, 594447, 626571, 599419, 541169, 458031, 364955, 287910, 242707, 215569, 198515, 199794, 214036, 247627, 302561, 366587, 437755, 504602, 552352, 575256, 572983, 561668, 547433, 521315, 488297, 465475, 443715, 430676, 414194, 407650, 407168, 414587, 434924, 488740, 600403, 773657, 1009795, 1286111, 1510501, 1597668, 1545147, 1390269, 1151498, 900403]
9178I00403j98463j31229o8983l6969k0120j0975n381P387J9521J8796K4920K7710
9166E26617K8799L2250K5101J3266j1118m2699o5088p4758p2336n8412m4184l1544
9154B25894j4881k391K0661L5128O1843R1450J06259P9979K3257j5310n8818j07612
9142D45459j03543p7518n6422l8931l1165j9661j3268j8663p928m664q126n797
9130E9773m310n493m746J791J155l656k392m175n969n07n327R09O532R89K04l528
9114C1250p776K099L583K555K046J0892J0931J213O44J418K295r531p881j1027
9100C2711p674J079O12O685K152j43j88m765j70j034J838J09l722N106M283n336
9084C1543q33k229K048K431M545R47r475j5006r557O661J6632J0025p997o563
$$ y = [900403, 701940, 570711, 501728, 464759, 444639, 433664, 428283, 435670, 455191, 473987, 498907, 526617, 555416, 587666, 612767, 626033, 614915, 572216, 507128, 432370, 360034, 301622, 257438, 225894, 211013, 208622, 229283, 264411, 326254, 417704, 523963, 603942, 627199, 611889, 553071, 445459, 341916, 264398, 207976, 169045, 137880, 118219, 104951, 86288, 78360, 73696, 65570, 59773, 55463, 49970, 45224, 47015, 48170, 44514, 42122, 37947, 31978, 31471, 26144, 27053, 33585, 34574, 34778, 31250, 23474, 25573, 29156, 31711, 33757, 44649, 55580, 56793, 57437, 58855, 61150, 51619, 43738, 32711, 25037, 26116, 26728, 33413, 35565, 35422, 35234, 30469, 30299, 29265, 31103, 31212, 27490, 32596, 36879, 31543, 30710, 28481, 30529, 32960, 37505, 38452, 28977, 13971, 4414, 11075, 27707, 37732, 29735, 23172]
9070B3172k56J962n874n516N611N925o05K278m961p528M69K703k330j019j425
9055A2606J067n269L479L395j515M373m32j106l385K11K785k437K506j034o00
9040A4644K33k565N633L616j546j186J169k966P8m656p10J014o667j373L202o32
9024G288J133m35L940J954L52l16j891n136m836l047R68M439K974j301k247Q38
9008D677k125M115O33j356M027j378l832l418L78q65j06K73L359J834k260j240
8992B716n47K687o320m762N31j816M138J048l013n353K654O219L140j031M614
8977D905K877j142k162k947m616J299M872n712j178l78J049r49K517M419K952
8962E806m761K94k238N572J802k828k137k227k812K074J481j899l382j547L473
$$ y = [23172, 22916, 24878, 19004, 13488, 19099, 25024, 24419, 26697, 21736, 14208, 14677, 17380, 15050, 14031, 12606, 13673, 8404, 11883, 15278, 13763, 18136, 17704, 16598, 13213, 13424, 16209, 13772, 16278, 15244, 14644, 14877, 12312, 17945, 21561, 20015, 18829, 19998, 17032, 17110, 12454, 11744, 12758, 6091, 4718, 7920, 7288, 8421, 7986, 11926, 13880, 14232, 13916, 12025, 6889, 2053, -994, -26, 4413, 7387, 6086, 3839, 4677, 2552, 6667, 7300, 5944, 9971, 8593, 4761, 1343, 1721, 856, 750, 1023, 4382, 6216, 3956, 2716, 2169, 4856, -1464, -6226, -5695, -7511, -3373, -2325, -5338, -10691, -8037, -1818, 1322, 291, 4905, 7782, 6640, 4478, 1531, -3085, -1786, 3086, -2626, -3804, -4182, -3133, -4082, -1565, 2854, 5806, 1045, 1339, -899, 4673, 6475, 3647, 1510, -717, -3529, -1455, 26, -1873, -5255, -6802, -3329]
8947c329K403K663N918O56J426l573L51Q70K460L208j495o013j72J948j775O93
8931F239n076J20L184R75k531K913p47R29L669L487J802L721J772R83j615m580
8915A5245j093M410O045K595Q030J38L211R197Q070J1959J7529L5807O8232J08446
8901B97821J39566Q3856J111l2048o2902r6463q9338o9249m0182l1953j5729j1103
8889G3387j3180q151p905J822n77K855o064o569r119k459q720j216O728k941j499
8874A6392l922M027k591j896K987j970k004o76O90M171P23p303j842O202q92p20
8858A1376k836n266M85M417M379n610L54O48n442J088P946K581J564J79q301p220
8842C42J77M536m15j179N72N079K637n205n48o58p895j049M149K665P917P644
$$ y = [-3329, -926, 1737, 7655, 8311, 9737, 6164, 6515, 7385, 9845, 13053, 11558, 5545, 5373, 7321, 5546, 6239, 1163, 1283, 4467, 5442, 2911, 5824, 5077, 6006, 9675, 13162, 14964, 18685, 20457, 21440, 19825, 15245, 14152, 18562, 24607, 27202, 35232, 35370, 38581, 47778, 55848, 67807, 85336, 121143, 189375, 297821, 437387, 521243, 522354, 490306, 427404, 330941, 241603, 172354, 132172, 100219, 84490, 73387, 60207, 52056, 44151, 45973, 45396, 48251, 42187, 35618, 26499, 24040, 15320, 14104, 20832, 17891, 16392, 12470, 16497, 13906, 12010, 14997, 13027, 11023, 10347, 11037, 15208, 15931, 8628, 6786, 12988, 12096, 11376, 8540, 3274, 3759, 8176, 12555, 6945, 7299, 7947, 2505, 3593, 11539, 14120, 15684, 15863, 7562, 342, 519, 5055, 4640, 3461, 4033, 9112, 11749, 6544, 5996, 5338, -2557, -3606, 543, 3208, 11125, 18769]
8826A8769m59m337L516l899p148k102p98j061O686J144k589j372p964R77J435
8811G98n929m10M769m623k050M421O661n69L188P16m84O686M519l884O20K512
8795A6941k845r27j539M548L250l613o401k14N545J824o265k663j561N946K820
8780A4846P46l69J130j589K691M128l445n213m275j348P50O635o01l448p027R30
8764D541j556q236J111O158Q021N233l161n687q41O997j489o279l029k821P162
8749F124M080l774L257Q943J0279R6o794o398m445l495o839N268O890J025k526
8734A1691m713j355O922M865P492K648m542j546o286k700J104N584K229m06K187
8719B3174m38R36k391j498j508R8J115J798O0l794j024j565k56n89l32M808J1801
$$ y = [18769, 18310, 13973, 17489, 13590, 6442, 4340, 3542, 2481, 9167, 10311, 7722, 6350, -1614, -637, 798, -5131, -5541, -772, -5395, -7445, -3024, 3637, 3068, 6256, 6972, 6488, 13174, 17693, 13809, 14429, 16941, 14096, 13169, 11630, 16178, 19428, 15815, 9414, 9200, 14745, 16569, 10304, 7641, 6080, 12026, 14846, 15592, 15223, 16353, 14764, 17455, 21583, 18138, 12925, 8650, 7302, 8052, 14687, 14086, 10638, 3611, 4541, 2985, -5251, -4140, 2018, 10039, 15272, 12111, 6424, 5583, 12580, 11091, 4812, 1783, -1038, 6124, 10204, 6430, 9687, 18630, 28909, 29005, 22211, 15813, 11368, 7873, 1034, 6302, 13192, 14217, 11691, 6978, 5623, 12545, 17410, 24902, 27550, 23008, 21462, 15176, 12476, 13580, 19164, 21393, 20987, 23174, 22736, 23672, 21281, 19783, 18275, 18373, 19488, 21286, 21346, 17552, 16528, 14963, 14707, 14118, 13786, 18594, 30395]
8702C0395K284K11j191j392k828q896Q07M504N031l225j071k912m709K102J189
8687B0299l091J45R167O508j191m38n934l986N365O087J487n700m510j512Q681
8672C1377M668j881N29o373m95N725N555J356k539J16P337J401n809l692K083
8657C9358J596O37l946J465L783J281K582P073K028Q90j181N362J004n85L383
8642F4730P02M181M540L026Q345N503l013L373R796J0302J1089J4421j009K030
8628A38016N157Q223J838n732p768j2285j9227j1289o316j6722n086n206r16O992
8614F9679N4o140n147N418L169o101k341O917M934R08J598n761n192l033o914
8599E2048j343J421M356l875L081k571l493K938J2154J3877O454n117k8K848J5732
$$ y = [30395, 32679, 32890, 31699, 30307, 27479, 18583, 19390, 23894, 28925, 25700, 24629, 21717, 17008, 19110, 20299, 17208, 17353, 26520, 33028, 31837, 31399, 25465, 21479, 26844, 32931, 34418, 28718, 24208, 22696, 31377, 36045, 34164, 34693, 28320, 27825, 33550, 39105, 40461, 37922, 38038, 45375, 46776, 40967, 37275, 39358, 40954, 41591, 37645, 39110, 42893, 44174, 46756, 53829, 55857, 56747, 55566, 60928, 61932, 61347, 64730, 65432, 69613, 74153, 77179, 85524, 91027, 88014, 91387, 101183, 111485, 122574, 136995, 135986, 138016, 143173, 151396, 153234, 147502, 139734, 127449, 108222, 96933, 90617, 73895, 68809, 63603, 62687, 69679, 69733, 63593, 58446, 63864, 67033, 60932, 58591, 65508, 70442, 71350, 72948, 67187, 61995, 58962, 52048, 50705, 52126, 56482, 52607, 55688, 53117, 49624, 52562, 64716, 78593, 85047, 79930, 79902, 82750, 98482]
8584I8482K6541L3441J1531N57n433l5976l1588j4045o808p161k112j57l495m449
8570E9328l202j1493j601K720L764O400O27j756O46N765K961l79o034j0290n549
8555D1907R61K882k627k16O204M228m48J266j984L740k237N121J5091K0068K8720
8540A22676M5572P1515M2632M4j1183k9542o0138m3233k2341j1442j2064k756
8528H9740J461J0893J8799J0674J4363P411l709j1024j4748j2065m891l891n070
8515I7943J407n865m207M445k341o790j249q021m073j971J461J0591M355K248
8501H7933r68J908j629M939J5646K2798L9873L9714J4683M610J509n601j4386
8488B11029k6587j7599k2550k7050j4103q720j5340j1047l339J136l675k157p44
$$ y = [98482, 125023, 158464, 169995, 170552, 165119, 129143, 97555, 83510, 76702, 69541, 67429, 67272, 63777, 59328, 56126, 44633, 43032, 45752, 49516, 55916, 56543, 54787, 55433, 61198, 64159, 63780, 57746, 47456, 41907, 42868, 45750, 43123, 42907, 49111, 53339, 52891, 54157, 52173, 55913, 53676, 58797, 73888, 93956, 122676, 168248, 239763, 282395, 282439, 271256, 241714, 181576, 138343, 116002, 104560, 92496, 89740, 91201, 102094, 120893, 131567, 145930, 153341, 149632, 138608, 123860, 111795, 106904, 103013, 97943, 99350, 93485, 89278, 93723, 91382, 84592, 83343, 75322, 71249, 69278, 70739, 81330, 85685, 87933, 86965, 88873, 87244, 92183, 107829, 130627, 170500, 210214, 224897, 229507, 231016, 225415, 211029, 184442, 166843, 144293, 117243, 103140, 94420, 79080, 68033, 64694, 65830, 62155, 59998, 59254]
8475E9254m79J552N826J4353O411K96l909j0879o796o022K840J294J780l244j125
8460F1152O157K083q043p514m006N498O526Q20n701j493j648J836K743l372r4
8445E4944Q97m170l818N353O189j650J782n301j118l79k601n167o315k382L267
8430C9531L667l123l16J214o26l131J706K931J931Q437J490m163k587m728o095
8415C6138J139N177o01K39J532K800J745k066M201N867K750K423J6359K3449L9678
8400A40830M5543J3049p328j5250k6717l1771l1264j9207j0360q220n258J382
8388D5429J124k528o150p686l52M298K334K75J541j250p598p832K933P16R73q27
8372B5400J181L681J582r43K573R18K676Q524P549J2700J7363K6597M9856K9017
$$ y = [59254, 58775, 60327, 66153, 80506, 86917, 87213, 83304, 72425, 65629, 59607, 62447, 63741, 65521, 62277, 61152, 67309, 69392, 61349, 53835, 49829, 55327, 61853, 62673, 56972, 55479, 53831, 55667, 58410, 55038, 54944, 55841, 51671, 47853, 53206, 59395, 57745, 59527, 54226, 53108, 52729, 50128, 44961, 38646, 36264, 39531, 43198, 40075, 39759, 40973, 40347, 37216, 38922, 41853, 43784, 52221, 53711, 49548, 46961, 42233, 36138, 37277, 42454, 41853, 42092, 43624, 46424, 48169, 46103, 50304, 56171, 58921, 61344, 77703, 101152, 140830, 186373, 199422, 192094, 176844, 150127, 118356, 87092, 67885, 57525, 49305, 44047, 45429, 46553, 44025, 37875, 30189, 29837, 34135, 36469, 36744, 38285, 37035, 29437, 21605, 24538, 25254, 26227, 25400, 26581, 30262, 31844, 30901, 33474, 34392, 37068, 45592, 53141, 65841, 83204, 109801, 159657, 188674]
8358A88674o157j5848k8533l2827k5900j3053q009q170p299Q92m297m637l792
8345C1044l770J357J780L991N660Q15j164J17l758n097r989j644O418K611J37
8330B8508L934N076K187q022l545M153k908q955n077L395M240K660k525n048j374
8315A6699K725N265n663l870L807l079L223Q785P858k881q7o59K799J398p29m566
8299C1025l398r33K061o43l808K082R54J038J812k033o085k215N247L816l847
8284B5073K972L279M24L18m676k754j163k115L4K501k413J729O151M601j280l499
8268B9182l001l532k930L466K486J946k825L127L862l624l974K194J039k576J744
8253B6584L188K713J28m801r483J876K289K488J584L343J345J320N41N3l487r429
$$ y = [188674, 182517, 166669, 138136, 105309, 79409, 66356, 58347, 50177, 42878, 43770, 39473, 34836, 31044, 27274, 28631, 30411, 34402, 40062, 40877, 39713, 39830, 36072, 30975, 20986, 19342, 25760, 28371, 28508, 32442, 37518, 39705, 31683, 28138, 32291, 29383, 20428, 15351, 18746, 22986, 25646, 23121, 18073, 16699, 19424, 24689, 19026, 15156, 18963, 15884, 19107, 27892, 35750, 32869, 32782, 32123, 34922, 36320, 35591, 31025, 27627, 26694, 28755, 28112, 24304, 26386, 27340, 28378, 30190, 28157, 22072, 19857, 25104, 28920, 25073, 28045, 31324, 31748, 32066, 27390, 24636, 23473, 21358, 21392, 23893, 21480, 23209, 29360, 33961, 32681, 29182, 26181, 22649, 19719, 23185, 25671, 27617, 24792, 27919, 31781, 28157, 24183, 26377, 27416, 24840, 26584, 29772, 32485, 32613, 27812, 18329, 20205, 22494, 24982, 26566, 29909, 31254, 32574, 33115, 33168, 29681, 20252]
8237B0252j739O744m057L359Q799M572r07j892K092K193j595l399L536K651m00
8222D0209L601L479q895j863R9Q36O894L171l523m240j468r91j569J912M74O356
8206D4482M97q323m168O35N84N535M386N139m49q442J031Q490Q53j167k875L372
8190D9580J01q247j0144J245j49N693P456J721L884J553m287J398K187r78o284
8175D4729l844M959J384Q45q08N409M121N95q31n160l339J783L509j661J09o855
8159D4945n602R56L576k956M035M625o82M610M30J166O491L10k345J379P490L835
8143G2263J012o64K748k080k061k212l457j402M22K143N149M233M275M054q553
8128G5870j4846l309L956L268M94m825N855L686j133P135K405N41Q23K747l887
$$ y = [20252, 18513, 25257, 21200, 24559, 33358, 37930, 37023, 35131, 37223, 39416, 37821, 34422, 37958, 40609, 40209, 43810, 47289, 38394, 36531, 36630, 37466, 44360, 47531, 44008, 39768, 38300, 37309, 35740, 37652, 38126, 44482, 44979, 36656, 32488, 33123, 33707, 39242, 43628, 48767, 48318, 39876, 40907, 49397, 50250, 49083, 46208, 49580, 49681, 41434, 31290, 32535, 32386, 38079, 45535, 47256, 51140, 52693, 48406, 49804, 51991, 51013, 44729, 40885, 45844, 47228, 48073, 47265, 52674, 56795, 57390, 56559, 51399, 48060, 49843, 53352, 51691, 51800, 44945, 39343, 40299, 43875, 40919, 44954, 49579, 48897, 53507, 53937, 55103, 61594, 61904, 59559, 60938, 68428, 72263, 73275, 72611, 75359, 73279, 71218, 69006, 65549, 64147, 64569, 66712, 71861, 76094, 80369, 84423, 75870, 61024, 57715, 61671, 64939, 65433, 60608, 66463, 70149, 69016, 76151, 78556, 79097, 79920, 82667, 78780]
8113G8780j049J141L747r80l514P772O714J583k035M174Q559O574J606Q93J3976
8098A27941J8641L0453N7523R0374R0858M3916J434l2157n9501p5096n5623l9683
8086A99080k8390j1415j1326o372k289j355J384K794L6K322j066m330k946p88
8072A35339m3j24p05q623k729N171M690K747J1541N849J850M819J0127O54J738
8057A72301M241K2398L7747O3688Q5411P1350K9344j4051m2773o1088o5619n4943
8045B48006l1913j5507j0215q606p073J947m885O390P440N760n972m294p274n153
8031A68651L349Q28J28J805n088L11J436J0129K1603K9247M0244N3933O8003O6746
8017D61325K7979r526l1085n5653o5814n2862l0186j8787j2946j4903j2830j0789
$$ y = [78780, 77731, 78872, 82619, 81639, 78125, 85897, 92611, 94194, 92159, 96333, 104892, 111466, 113072, 113965, 127941, 146582, 177035, 234558, 324932, 415790, 459706, 461140, 428983, 369482, 294386, 238763, 199080, 170690, 159275, 147949, 141577, 139288, 137933, 139317, 142111, 142147, 144469, 143403, 139073, 136127, 135339, 135296, 135172, 134467, 125844, 123115, 128286, 132976, 135723, 147264, 153113, 154963, 159782, 169909, 170563, 172301, 176542, 198940, 236687, 300375, 385786, 457136, 486480, 472429, 429656, 368568, 302949, 248006, 216093, 200586, 190371, 181765, 174692, 176639, 171754, 178144, 185584, 191344, 185372, 181078, 173804, 168651, 172000, 172828, 172956, 174761, 169673, 169984, 171420, 181549, 203152, 232399, 272643, 326576, 394579, 461325, 489304, 479778, 448693, 393040, 327226, 274364, 244178, 225391, 212445, 197542, 184712, 173923]
8005A73923p773m058r213r752J029L814P05P327L807r159o339k501m880l70K360
7990A38920P397O52l232J095J361q051l549n497j779P164M804J0710J7087K6965
7976A94047M7718O4494P0105M7723P838k4141m7996n9835n1530l8248k8017k4166
7964A57992j7827o071n815o510o814p377j033m373O086Q42o136q142o900l616
7950H4306r387q907j524P340P435O056o402q489j709j914L831j696l338m05k382
7935F2815j66l153n290n766k43j327k777r736k701O561O739k062k273j627Q51
7920C9845L38N095r33n496N551K33q99o706p54q6m443j690K50O140k339p28k085
7903C1293n77K312L724K511l958n520K460P743n790q863j214M835m311n77k351
$$ y = [173923, 166150, 162092, 152879, 143127, 144156, 147970, 148675, 156002, 159809, 150650, 144311, 141810, 136930, 136560, 138920, 146317, 146969, 143737, 144832, 146193, 138142, 134593, 129096, 127317, 134481, 139285, 149995, 167082, 194047, 241765, 306259, 376364, 424087, 431925, 407784, 359788, 299953, 248423, 210175, 182158, 157992, 140165, 134094, 128279, 121769, 114955, 107578, 106545, 102172, 108258, 109100, 102964, 94822, 87922, 84306, 74919, 66012, 64488, 71828, 79263, 85319, 78917, 70428, 68719, 66805, 70636, 68940, 65602, 65197, 62815, 62649, 59496, 54206, 48440, 48197, 46870, 44093, 34357, 31656, 38217, 44956, 42894, 40621, 38994, 39845, 40183, 45278, 44345, 38849, 44400, 44633, 43734, 37028, 36274, 36188, 31745, 30055, 30305, 36445, 34106, 33378, 31293, 30716, 33028, 36752, 39263, 35305, 29785, 32245, 39988, 34198, 25335, 24121, 28956, 24645, 24068, 21717]
7888B1717m766j468O58K836O840l531o515O177J4461L256l86j0694o738l363n591
7873A2893K2M533L062L256K59l703m112L550J026n61O57q579k004R08J017M329
7857A6553O75n895Q2L399K643m579j15N341l359m21J673L771J638m68K580l608
7841A9910o151K198m038l436M762L147K709o242K802P225O269J366p105n148p063
7826A1205j0060L495O976M757p222k058j940n83M733k744j95p76k221J365N628
7811A0360R05j904n35k375j473N519o18k135k13L781r15m638k478N55m59p148
7795c771K940N748N376R62q70n133m020K030m64j305k125M74K818M86p39j997
7779D10Q42K52J315L300L65m67m918J275K779l633j0429J19M301L045k110n86
$$ y = [21717, 16951, 15483, 16141, 18977, 25817, 22286, 15771, 21948, 36409, 39665, 39279, 28585, 21847, 18484, 12893, 12915, 17448, 20510, 23766, 24025, 20322, 16210, 19760, 20786, 20225, 20882, 12303, 10299, 11207, 12224, 16553, 17228, 11333, 11415, 14814, 17457, 12878, 12763, 18104, 14745, 14324, 15997, 19768, 21406, 20938, 23518, 19910, 13759, 15957, 11919, 8483, 13245, 16392, 19101, 12859, 15661, 22886, 29155, 30521, 23416, 18268, 11205, 1145, 4640, 11616, 16373, 9151, 7093, 5153, 4570, 9303, 6559, 6364, 5588, 3367, 4732, 10360, 11265, 9361, 8826, 6451, 4978, 10497, 9879, 7744, 7531, 11312, 10397, 5759, 3281, 3836, 3377, -3771, -831, 4917, 10293, 11255, 10385, 5252, 1232, 3262, 2798, 1493, -632, -158, 2660, 3146, 2407, 410, 1252, 1504, 2819, 6119, 6484, 6017, 1099, 2374, 5153, 1520, -8909, -8790, -4489, -1444, -3554, -4140]
7763d140K223o200k734j062Q54m09m57O556n5o9l934L543k445k515P162M786J023
7746B127m914p68l53k98J047l289k754j662k951N02L309P846M888K706l327k780
7730f71p50M699J921L270o033k926q699j1167O890O646j773O95M230m78o790k612
7714a3548K163K058J101J647L663K164P72r37J828j557R47J632m771m67N579o15
7698A659L877L468q014n980j199p217L51K663L884P308O12M058r39m169j148l192
7682c978p797Q10P80O170O507M253p496n287M413K865q627n513k67K391N665L454
7666a657q315N34K488l408n357o432M201J1020J518m509q35L39m418L996P123
7651c712K119m168p018k670p88J0065L352m226J506j998k104N03l996L472m428
$$ y = [-4140, -1917, -8117, -10851, -11913, -11059, -11468, -11925, -5369, -5424, -5493, -9427, -5884, -8329, -10844, -3682, 1104, 2127, -2787, -3555, -3908, -4206, -3159, -6448, -9202, -10864, -13815, -13313, -10004, -2158, 2730, 5436, 2109, -671, -1421, 3278, 5199, 8469, 2436, -490, -9189, -20356, -13466, -6820, -8593, -7898, -3668, -4146, -10936, -13548, -11385, -9327, -8226, -6579, -2916, -752, 20, -917, 911, -646, 301, 1933, -2838, -3305, 2274, 1659, 5536, 9004, 990, -4990, -6189, -13406, -13055, -10392, -6508, 800, 1412, 5470, 4531, 362, -786, -3978, -11775, -10965, -10185, -4015, 2492, 6745, -751, -6038, -1625, 1240, -7387, -12900, -13167, -10776, -5111, -1657, -9972, -9438, -6950, -10358, -15715, -22147, -17946, -6926, -5408, -9917, -10752, -10413, -14831, -10835, -3712, -1593, -5761, -12779, -15449, -16237, -6172, -2820, -7046, -5540, -7538, -9642, -9139, -13135, -9663, -14091]
7636a4091j794p77K682M1M693J96o769M61O563J257L692O78K504p842n786J24
7620a4168P854M229r015R63M639k273N36L553K489K423m922j968l239n476j0531
7605b4906L712R290L16M985n97o043N075M498K948L693O70J293o740r63k175m044
7589h988K492m39n423j060M395j232r668J337M519J791J121l494o72Q27K632L775
7573h087M270p60l962O94p72K669R06P9Q66J674l681p808l841J505M80j548O52
7556a6664L509n003J139%J117K284L443J153p242K497N563p37J590M154o403M42
7540i158N46P49R40m721k85J220P384L499p532n418j686M002P104l211P78J58
7524e631j670n814n881k429j770K192k06J870K070j252K745M207M597l87k125
$$ y = [-14091, -15885, -16662, -13980, -13939, -9246, -9050, -15819, -15358, -8795, -7538, -3846, -3168, -664, -8506, -14292, -14168, -6314, -2085, -11100, -10137, -5498, -7771, -7235, -3682, -1193, 1230, -3692, -5660, -8899, -14375, -24906, -21194, -11904, -11588, -6603, -7200, -13243, -8168, -3670, -722, 2971, 3641, 4934, -1806, -2769, -4944, -8988, -6496, -6935, -12358, -13418, -9023, -10255, -19923, -18586, -14067, -12276, -11155, -14649, -15321, -14494, -11862, -8087, -3817, -4577, -8539, -7845, -8617, -5948, -5042, -4963, -4097, -2423, -6104, -13912, -17753, -16248, -15768, -17316, -16664, -13155, -18158, -17019, -17019, -15902, -13618, -10175, -9022, -16264, -13767, -8204, -8941, -7351, -3197, -9600, -9158, -8612, -7863, -6923, -11644, -11929, -10709, -3325, 174, -7358, -12776, -14462, -10460, -3356, -6567, -5789, -5631, -7301, -13115, -18996, -21425, -23195, -21003, -21209, -19339, -17269, -18521, -15776, -11569, -6972, -7359, -9484]
7509i484M793K228q154o666m339O079J1588M183k586r42p341k894M51k450o87
7494a6221q25N29j800L549J180J368M48j660J60L746L387N96j956l278m09L680
7478g506j723n573L338R219j048J76L155m060j609k530j091k538J49k581q887
7463b3109N200J1401K485m515k671j352k941Q81J601O022J718n378r28K730K289
7448f567m990J513J0449O938o476q553k759n94R248n66p983k853N895L805K701
7433g92L944o07j883K468k567j499p181l999M698K94q128n03L697o73K203K231
7417h297l579K539O870N978J632o514r237n386J20O060J193J931j586m671J79
7402a2768m800r88K821M393K840k62K051P050K818M109o507q641j767Q290P662
$$ y = [-9484, -4691, -2463, -10617, -17283, -21622, -15543, -3955, 228, -2358, -3300, -10641, -13535, -13084, -15534, -16221, -17046, -16517, -18317, -14768, -13588, -12220, -11772, -13432, -13272, -9526, -6139, -5543, -7499, -10777, -11186, -7506, -9229, -14802, -11464, -2245, -3293, -3117, 38, -4022, -5631, -8161, -9252, -11790, -11641, -14222, -23109, -17909, -6508, -4023, -8538, -11209, -12561, -15502, -14621, -13020, -6998, -5280, -10658, -11586, -8856, -6567, -11557, -10044, 405, 7343, 867, -7686, -10445, -11039, -1791, -2357, -10340, -13193, -7298, -3493, -792, 3152, 2545, 662, 3130, 563, -936, -8117, -12116, -7418, -7124, -15252, -15755, -12058, -12731, -10528, -8297, -11876, -9337, -2467, 3511, 5143, -1371, -10608, -15994, -15874, -9814, -8621, -6690, -8276, -12947, -12768, -17568, -18556, -15735, -11342, -8502, -8764, -6713, 337, 3155, 7264, 757, -7884, -9651, -1361, 6301]
7387F301J99m025k145j164l423M011k111j645l16q063J023O46n26J245k333m046
7371a6372N592R10J439N341j547n734k289J779K522J651j615m293r65K103P094
7356d384o4l123l713L998k21J810l840l440K199j402J859j802m97k031J60K171
7340a2320J99K112P96m372O78l240p870O88L490L268m58K182K298J92J145M178
7324g034J59J385J027j013N67j194K220l850n744J107M763K298R93j457p313J757
7308a1329J301j047l411o49K31K902J209J712N70o009k115O806o003j146N662
7293a1316k250o024k840M896K678P09K081L371l197l529K766K106K102K902L23
7278e222j614k320k22K709M612k364k111l911j1l719m454L637o58M632j16K723
$$ y = [6301, 6500, 2475, 330, -834, -4257, -246, -2357, -4002, -4318, -12381, -11358, -10712, -11238, -9993, -12326, -16372, -10780, -9870, -8431, -3090, -4637, -10371, -12660, -10881, -8359, -6708, -8323, -12616, -13581, -11478, -4384, -4448, -7571, -11284, -7286, -7507, -5697, -9537, -12977, -10778, -12180, -10321, -12123, -12620, -14651, -14491, -12320, -12121, -10009, -9213, -13585, -12907, -16147, -24017, -23329, -19839, -16571, -17029, -14847, -12549, -12357, -11212, -7034, -6875, -5490, -4463, -5476, -4909, -6103, -3883, -7733, -13477, -12370, -7607, -5309, -4316, -5773, -13086, -11329, -10028, -11075, -14486, -15135, -14904, -12002, -10793, -9081, -8511, -14520, -16635, -9829, -15832, -16978, -11316, -13566, -19590, -22430, -17534, -14856, -14147, -12066, -8695, -11892, -15421, -12655, -10549, -8447, -5545, -5222, -6836, -9156, -9378, -6669, -2057, -4421, -6532, -10443, -10454, -14173, -18627, -14990, -15648, -11016, -11132, -8409]
7262h409O107q391r059L806L922k184Q741l680l756M433K054m174k707J307L123
7247h867L256R36k137k109K12m674O020k86k173J072m271m181M138K782N412m690
7231i560j431J25l57m83J473m183j313n123o775O652N054k407p668M139P125K320
7215a2412L277O631j514n980K207M146M438L73j2235j797M229M203K035l801m957
7200a1157J239P96J143K594J069M80K416j871m713l679P31j709o09J254O46k783
7184a4153L024K236p343l380m691J496Q627M64K891M32M183K253P05l572L31J286
7168e211o37m224o878L043J165K858K884L736J452l004o38j215q317l509M443
7153a4052Q466K340p916m03M321K01m146l355k992k854M200N200K203q137q052
$$ y = [-8409, -2302, -10693, -19752, -15946, -12024, -14208, -5467, -9147, -12903, -8470, -6416, -10590, -13297, -11990, -8867, -5611, -4675, -6812, -8921, -8709, -13383, -7363, -7649, -9822, -8750, -13021, -17202, -13064, -10282, -4870, -9560, -10991, -10866, -11223, -11706, -10233, -14416, -15729, -20852, -27627, -20975, -15921, -18328, -25996, -21857, -14732, -12412, -9135, -2504, -4018, -9998, -7791, -3645, 793, 1166, -11069, -12866, -8637, -4434, -2399, -6200, -11157, -9918, -9122, -7979, -5385, -4316, -3836, -1420, -3291, -8004, -11683, -10952, -12661, -13270, -12016, -11370, -14153, -11129, -8893, -16236, -19616, -24307, -22811, -14184, -13720, -10829, -10397, -6214, -3961, -3256, -6828, -6497, -5211, -5848, -10072, -16950, -13907, -12742, -9884, -7000, -3264, -1812, -4816, -5454, -6669, -14986, -18495, -14052, -5586, -3246, -11162, -11565, -7244, -7043, -11189, -14544, -17536, -20390, -16190, -10990, -8787, -16924, -24976]
7138b4976Q914O562L573K87m535m974k63j506l540j528k080m804J539J2005J0595
7123d731M889P180J984L473q210o384m21l490l907J528m218n611m076M410K723
7108a4861k310Q09k395l04L323N608M964K346n1R27j876j1947n038N634K274M73
7092a2424J855L09P09j334J090L39O95m180q03L462J767k241r348J835K825N211
7076a0233J212k87m957O389R239K789k725o019j170K108m246o278q33j129K978
7061a3162L656L014K5m481l361J400R68j688J930l831K53O087L540n811Q44j146
7045a1763R11o19k747J209N410j299q69o92M840L525n24n663m040O407k25K192
7029c947j149n025p50m768N15K843M851q80l477k38L765j521o21k16K856L306
$$ y = [-24976, -16062, -9500, -5927, -5640, -10175, -15149, -15412, -16918, -20458, -21986, -24066, -28870, -27331, -15326, -4731, 158, 7338, 9322, 12795, 4585, -1799, -2220, -5710, -9617, -8089, -12307, -17918, -21994, -17584, -14861, -17171, -16362, -18757, -19061, -15738, -10130, -5166, -2820, -2871, -1944, -3820, -15767, -20805, -15171, -12897, -12424, -10569, -10260, -9551, -10885, -9795, -9456, -8761, -12941, -13744, -10282, -8515, -10756, -20104, -18269, -15444, -10233, -9021, -9308, -14265, -7876, 1363, 4152, 1427, -4592, -5762, -3654, -7900, -14178, -15011, -16140, -13162, -9506, -6492, -6467, -10948, -14309, -12909, -11941, -13629, -11699, -15530, -15277, -9190, -5650, -11461, -10617, -11763, -10852, -11471, -14218, -13009, -7599, -8898, -9767, -10459, -5619, -2094, -2618, -8281, -12321, -5914, -6139, -3947, -5096, -10121, -10871, -15639, -15124, -12281, -7430, -8310, -11787, -12025, -8260, -9781, -10402, -10618, -7762, -4456]
7013d456M61p29q131l842L69k642O861L215j148j810L275R09K828j06m485p027
6997a6458o046J1736J654k956l404j60N037K940j623N30p75m244P73n26K978L794
6981f750p947l865J313k25P73O04j524m168m761O116L070O772P54N908L654p980
6965h256j325j49j960l64j366l604n677P22L363M947N092O543N160k601m520k206
6949f201J222j183J221M091k085k504l186m147L423P166j1360l740J493K9k267
6934a8028K79J58O364M925l085l663m531J42j012q12k451J400Q944L22j019r83
6918a3050J340o02k784K653L449j904K648j508k186j362K726J613M004N487l24
6903B00J027j395L523n915j266k444k678P28p62O864l727K153K518k902r38m165
$$ y = [-4456, -3995, -4724, -12855, -16697, -16328, -18970, -12109, -8894, -10042, -11852, -8577, -7668, -4840, -4946, -9431, -16458, -22504, -10768, -9114, -12070, -15474, -15634, -10597, -7657, -9280, -8750, -9525, -13769, -12996, -13522, -10544, -6750, -14697, -18562, -17249, -17474, -16701, -16097, -17621, -21789, -26550, -20434, -17364, -10592, -9838, -3930, -276, -8256, -9581, -9730, -11690, -12054, -13420, -17024, -22701, -21979, -18616, -13669, -8577, -2034, 3126, 525, -3995, -6201, -4979, -6162, -4941, -850, -2935, -5439, -8625, -12772, -9349, -2183, -13543, -17283, -15790, -15761, -18028, -17749, -17591, -11227, -6302, -9387, -13050, -17581, -17439, -18451, -19263, -21714, -20314, -11370, -11048, -12067, -13050, -11710, -12312, -15096, -12443, -8994, -10898, -8250, -9758, -11944, -13306, -10580, -8967, -4963, 524, 200, 1227, -168, 3355, -2560, -3826, -6270, -8948, -8220, -8982, -2118, -5845, -3692, -1174, -4076, -5014, -9179]
6887i179m156l333j915J913L689j320j144j899k488O215O45p049K902M793J625
6872a0701P705K139n238o055l330J239P578M399p64N02Q79K692K703M36j477j907
6856H00L377l922o680l075j038N359O15K955M317k756o109m74J930k202m353M390
6840f866N024M511o714n875K572P296J372j0163r18L367M764L25J009L86l418
6825c328n062J998N58r31k90K377K113M705k327n094l139M526J669j973k20M467
6809D9k732K331q259k100N281J645P09j30o27N74M376K087q28m869j611j578o62
6792f344K70k178n446j305J721N753J268k531L414N993L242l230M323P59n008
6777G01n171k761L332K860o737l077L857j522K214l319K737M445K711r71P91M33
$$ y = [-9179, -13335, -16668, -18583, -16670, -12981, -14301, -15445, -17344, -19832, -13617, -12972, -20021, -17119, -12326, -10701, -2996, -857, -6095, -12150, -15480, -14241, -6663, -2264, -3028, -2526, -1647, 1045, 3748, 4184, 2707, 800, 4177, 255, -6425, -9500, -10538, -5179, -4564, -1609, 2708, -48, -6157, -6631, -4701, -6903, -11256, -6866, -1842, 2669, -4045, -9920, -7348, -52, 1320, -8843, -9761, -6394, -1630, -1305, -296, 90, -3328, -8390, -6392, -5834, -6765, -7055, -4678, -2565, 2140, -187, -5281, -8420, -3894, -2225, -4198, -4418, 49, -2683, -352, -8611, -10711, -5430, -3785, -3076, -3206, -3833, -3259, 1117, 3204, 2376, -2493, -4104, -5682, -6344, -6074, -8252, -13698, -15003, -13282, -7529, -6261, -8792, -5378, 615, 3857, 627, 4950, 5709, 701, -4470, -7231, -3899, -1039, -7776, -10853, -6996, -8518, -6304, -9623, -6886, -2441, 270, -701, 90, 523]
6761E23m555j885J049l435k973j969l879k302N447O922J200J118n347k139J349
6746a0876j675J759n842l732P49l39k00L661k337L180J442Q70j990l778M332K394
6730a2382k579p37P64k449L118M847L39k088j27M812j198J272K864m210q408O43
6714a5519k84L851J881J0288J261p240n07l009J522j538j128J541J844K334L625
6699a078Q08k759J318L89J549l192o067K155M295J180L098m072n363O015K533
6684H09k600ol840j262l405l31L02l258l51r12k69L293K415j461L62J540L874
6667e100L222m942m909m695J456L779Q14Q75k202K313m154K837M532l616j353
6652a1143M714N165J142Q72L757l293m924m137L847L415O62p074m406L079k92
$$ y = [523, -4032, -5917, -4868, -8303, -11276, -13245, -17124, -19426, -13979, -7057, -5857, -4739, -10086, -12225, -10876, -12551, -10792, -16634, -20366, -19617, -19956, -20156, -16495, -18832, -15652, -14210, -13340, -15330, -19108, -14776, -12382, -14961, -15698, -14934, -17383, -14265, -9418, -9079, -11167, -11294, -6482, -7680, -6408, -3544, -7754, -16162, -15519, -15803, -11952, -10071, 217, 1478, -5762, -6269, -9278, -7756, -9294, -10422, -8881, -7037, -4703, -1078, -270, -3029, -1711, -1322, 227, -2965, -9032, -6877, -2582, -1402, 1696, -2376, -7739, -1724, 809, -1791, -1797, -5637, -6899, -10304, -10635, -10333, -13591, -13942, -14854, -15123, -11830, -9415, -10876, -10514, -8974, -5100, -1878, -6820, -11729, -16424, -14968, -11189, -10375, -9500, -11702, -9389, -13543, -10706, -6174, -9790, -11143, -6429, -1264, -122, 750, 4507, 1214, -3710, -7847, -4000, -585, 77, -6997, -11403, -8324, -8616]
6637h616r24j277K113J517k974K757K096j928m435k250j501O21J275L547N933
6622d046Q71l351m057M155j011k80K350o62L97J775L725k215l233K068l488j249
6606h251M609L460N505k705k42p03k263J672k558p593k912J362O296K345n178
6591g156J837r49k705l239l68O60k730J84Q285O839K629o732m586p729p892j148
6575b4800J2234N604J427J989K384r75j90m990o621J747L127k997n833L296L139
6560a1459O310M142j539m647j299N413J041M368j860m108l935o46M109n052m857
6545a4019L241N483K277n304o595l854o70Q109R993p9l728J393l376L09O80j296
6529g436J438J399J194J788l0K740m74o707k075m242N127r5m179L036L074j593
$$ y = [-8616, -9540, -10817, -8704, -7187, -10161, -7404, -5308, -7236, -11671, -13921, -15422, -14801, -13526, -9979, -4046, -3175, -6526, -10583, -6428, -7439, -7719, -5369, -6031, -5634, -3859, -134, -2349, -5582, -3514, -7002, -8251, -3642, -182, 5323, 2618, 2376, 1673, -590, 1082, -1476, -9069, -11981, -10619, -4323, -1978, -7156, -5319, -6268, -8973, -12212, -12580, -11920, -14650, -14466, -6181, 658, 3287, -3445, -8031, -15760, -23652, -24800, -12566, -6962, -5535, -3546, -1162, -2137, -2327, -7317, -13938, -12191, -9064, -12061, -17894, -14598, -11459, -5149, -1007, -2546, -7193, -8492, -3079, -2038, 2330, 470, -3638, -7573, -8219, -4110, -9162, -14019, -10778, -5295, -3018, -8322, -14917, -18771, -19441, -11332, -1339, -1418, -5146, -3753, -7129, -6820, -6140, -7436, -5998, -4599, -3405, -1617, -1647, 1093, 619, -6088, -8163, -12405, -7278, -7373, -11552, -8516, -5442, -7035]
6513g035L542N403K524j913q38L034k378o401l607Q40j682p009J953N369k0o12
6497h830M972J900Q772Q14q407p290k186L815r62J706o56m747O599J177J782J149
6481c92n885n039l05M02m129m022K482Q137M005k410k868m32M149J758O76k294
6465f167l643o425m602J197K843M573L289j52j773l532m960l348k586J1089L810
6450a0387j251M685J241P291N001r00N01l966r288m898J958p8N2j709O084K327
6434c337J371J705m755m977r86N03L761j374J834K801k046k549j791m301J108
6419a3033M982N133J608k807l824j24j563p03O888K332o258m267R097k618n868
6404a1025M909O230K909j769p769k997L56L297Q55N810j879j778O155K1J220j975
$$ y = [-7035, -3493, 1910, 4434, 2521, 1683, 4717, 2339, -4062, -7669, -6829, -8511, -15520, -13567, -8198, -8218, -8830, -3858, -1958, 6814, 7628, -779, -8069, -10255, -6440, -7402, -5696, -6352, -11099, -4500, -3323, -1541, -392, -6277, -11316, -11621, -11219, -15348, -19370, -16888, -8751, -4746, -7156, -10024, -10456, -6307, -4549, -3873, -6167, -9810, -16235, -20837, -19640, -16797, -12224, -8935, -9087, -10860, -14392, -19352, -22700, -25286, -14197, -10387, -11638, -6953, -5712, 1579, 6580, 5680, 6181, 2215, -7073, -11971, -10013, -10091, -10039, -11748, -5664, -3337, -1966, -261, -5016, -9993, -10979, -10476, -6715, -8089, -6255, -3454, -5500, -8049, -9840, -14141, -13033, -8051, -2918, -1310, -4117, -7941, -8065, -9628, -10331, -3443, -1111, -7369, -11636, -2539, -5157, -11025, -6116, 114, 3023, 1254, -6515, -9512, -9156, -5859, -5004, 806, -1073, -2851, 3304, 3325, 4545, 2570]
6388B570p745l855J383k878j534l338n328j200K108L340O191J61o432j093K901
6373a4749N111K240K731J365k591M219L284n051M544J04p784J508K430m581l27
6358g547K331j364M14l654k702M1P000p18j125l50P24j38k605l736O725N210l498
6341d992o457L722J870p103K0P087K905j357J424k695n074K54L094m521J50L531
6325h142k128L069J105m583k018M658L231L199k859l414N399K299n29j52K705
6310A840K556m650p896m017L809M884K843r50N31N342k242n513J167m181k738
6295i215M941O243K908k670q175J337K999O8N057j883m689o911q533l362R734
6280a2151O602L699L214m375n407k74k394n472N169M435n436l312M255M172j70
$$ y = [2570, -5175, -9030, -7647, -10525, -12059, -15397, -20725, -21925, -19817, -16477, -10286, -10125, -16557, -17650, -14749, -9638, -7398, -4667, -3302, -5893, -1674, 1610, -3441, 1103, 1207, -6577, -5069, -2639, -7220, -7547, -5216, -6580, -6166, -9820, -12522, -12481, -5481, -6199, -7324, -7674, -6950, -7088, -9693, -13429, -6704, -1494, -4992, -11449, -7727, -5857, -12960, -12940, -5853, -2948, -4305, -2881, -5576, -10650, -10396, -7302, -11823, -11673, -8142, -10270, -7201, -6096, -10679, -12697, -8039, -4808, -1609, -4468, -7882, -2483, -184, -713, -865, 1840, 4396, -254, -8150, -12167, -8358, -3474, -631, -1581, -1050, 4292, 2050, -3463, -2296, -6477, -9215, -4274, 1969, 4877, 2207, -5968, -4631, -1632, -1564, 3493, 1610, -3079, -9990, -18523, -21885, -12151, -5549, -1850, 1364, -3011, -8418, -8692, -11086, -16558, -11389, -6954, -12390, -15702, -11447, -7275, -7445]
6265g445K72l356l705J673P457Q31o31J029N909J741o400l696k738m144K181l47
6249a1369j744N570L130L832l62K74j763l227n189K045P220l4q10l103N797O035
6233F302l103n139R29P168k709m557P352L942k555k754M933M793J263j273m286
6218A0306j0841r51P234K311n053m87L337N260p344l471M568k895j616l265R26
6203a981l920j440P68j608q358l78Q542R33l948K275J866p597O584J1973m512
6188h01m703K372M023l074R41L009k371k871o867j581O794K581q28o72o538j369
6172a1955k970o29j160M840J919k101j801K086L632L665l698l360k28K63k597
6157a4094O782M329n874l273J384k788k606o163M102K063j191L299P87n005M130
$$ y = [-7445, -7173, -10529, -14234, -12561, -5104, -4273, -4904, -3875, 2034, 3775, -2625, -6321, -9059, -13203, -11022, -11369, -13113, -7543, -4413, -581, -943, -669, -2432, -5659, -10848, -8803, -1583, -1617, -2427, -5530, 267, 6302, 3199, -1940, -1011, 6157, 3448, -1109, 6243, 10185, 7630, 4876, 9809, 14602, 15865, 14592, 10306, -535, -1486, 5748, 8059, 3006, 2519, 5856, 11116, 3772, 301, 4869, 1974, 358, -2907, -1981, -5901, -7341, -6573, -8181, -16539, -16917, -8375, -7442, -11390, -9115, -7249, -14846, -8262, 3711, -801, -5504, -3132, 891, -2183, -1242, 1767, -604, -3475, -10342, -11923, -5129, -2548, -3376, -4048, -10586, -11955, -14925, -15554, -16714, -11874, -9955, -12056, -13857, -11771, -8139, -4474, -8172, -11532, -11760, -11497, -14094, -7312, -2983, -8857, -12130, -10746, -13534, -16140, -22303, -18201, -16138, -17329, -14030, -13243, -18248, -14118]
6142a4118mK452M440J044N32j341L325N737M257k616M27k978j114k955p9K687
6126c04j320M988J835l174R12qm161k877M040m517J085j997m990M139O447N38
6110F36J552n724o575M669M161J051k956L275K10p736J526N84l449m795M284N476
6094c811k159j206M856m64O41M78k575q81m589m026N510j97K600M098R19j098
6078a904J907k665O51q004l135L152L943N718L539o55n43J22J047Q81J152n476
6062b70k186j096k406L900L065J201j855l499k414q8N224o20L131J180k149p568
6046f450p342q09J661J951J265L05L646M781L528J614M443M715o235n295n068
6031c290j558P88k424n592L025P582J212j25j756K618l118j665m345L898O422
$$ y = [-14118, -14122, -11670, -7230, -6186, -5654, -6995, -3670, 2067, 6324, 3708, 4135, 1157, 43, -2912, -2991, -304, -1624, 3364, 5199, 2025, 2937, 2929, -1232, -4109, -69, -4586, -3501, -5498, -10488, -6349, 98, 636, 2188, -3536, -10111, -5442, -1281, -230, -3186, 89, 299, -7437, -5911, -5327, -8776, -13571, -9287, -3811, -5970, -7176, -2320, -2784, -2143, -1665, -4240, -5121, -9710, -13736, -8226, -8423, -5823, -1725, -806, -1904, 3, -2662, -2011, -10015, -13150, -9998, -6055, -337, 3202, 2547, 2004, 2126, 3173, 4054, 5206, -270, -2456, -3552, -5958, -2058, 1007, 2208, 353, -3146, -5560, -5648, -424, -1044, 2087, 3267, 1118, -6450, -13792, -14601, -12940, -10989, -9724, -9419, -5773, -992, 2536, 4150, 8593, 13308, 7073, 1778, -3290, -4848, -4060, -6484, -12076, -9051, -1469, -257, -382, -2138, 480, -2638, -4303, -8648, -4750, 1672]
6016A672j423m888N03k745K071L452K941q116m180m29L217J983J315o88p35M395
6000a655N287o322k666K771l06O36m918k602L012j089J340K709K990N27l351R00
5984b737l227Q53J1322n34l426L115M394k434j4931n790N064r60j459j162L101
5969h811n77r54K989K499k443j136L086K207j1855l834O074N138K698l001l646
5954a1566R61K698N763j263Q28l35J190n605k121N232N089O558L583N9l937o841
5938B93O2L023J582m546n956K911o012K87k526L738R727P861m868j849j275J722
5922D174M013M159m969l423j945o906l785K103K40j827K934L998J188K171p586
5907e461p656j363K603n23k804p48N709J400L462N38K471J875l17n943P728P365
$$ y = [1672, 249, -4639, -4136, -6881, -4810, -1358, 1583, -6533, -10713, -11142, -7925, -5942, -4627, -5315, -6050, -1655, 3632, -2690, -5356, -2585, -2891, -2255, -7173, -9775, -6763, -7852, -6512, -3803, -813, -286, -3637, -2737, -5964, -5111, 6211, 5677, 2251, 5366, 9760, 7326, -7605, -13395, -8331, -9291, -10750, -11912, -8811, -9388, -10342, -7353, -4854, -7297, -8433, -5347, -3140, -14995, -18829, -12755, -7617, -4919, -7920, -11566, -10605, -7907, -2144, -3407, -2579, -2914, -1724, -7329, -9450, -4218, 871, 7429, 11012, 11071, 7134, 293, 355, 3378, 4960, 414, -5542, -2631, -8643, -8356, -10882, -7144, 2583, 10444, 5576, 3727, 2452, 4174, 8187, 12346, 7377, 3954, 2009, -4897, -8682, -6579, -6339, -8166, -5232, -1234, -46, 2125, -5461, -13117, -14480, -11877, -12400, -15204, -15952, -10243, -8843, -5381, -4843, -2372, -497, -814, -6757, 971, 8336]
5891H336l099n495l268n516p105o75R34J396L588J987j718j549J246M352N357
5876a229Q438M907r908o390M165L739n281l915J507p365m185L259Q110Q08n108
5861h448m748L890J838M41M442L905q50o118o021K282O98p46M824j521k958j24
5845i214k898j507J880J484O356j455n954j192Q274J123n47m00J381O428L675
5830G434l793m337J188j776k402m967o297K035O238N307J32o65j727K272m060
5815e418J450J610l566J371L242r1r77K991k74J375l720l266j186L62k33K383
5799c947N791L131O72K108n382l44K170m661n800j15J412j112n751k15M593L169
5783d281L91j301J860M251K375j861n831J762O530j652p475p391j234M982M008
$$ y = [8336, 5237, -258, -3526, -9042, -16147, -16822, -15888, -14492, -10904, -8917, -10635, -12184, -10938, -6586, -1229, 7209, 12116, 2208, -4182, -17, 3722, -1559, -5474, -3967, -11332, -15517, -12258, -4148, -3340, -8448, -13196, -9306, -7468, -7027, -2585, 1320, 470, -5648, -11669, -9387, -8689, -9435, -4611, -6132, -9090, -9214, -12112, -13619, -11739, -10255, -3899, -5354, -11308, -12500, -4226, -3103, -3650, -4050, -2669, 3759, 7434, 3641, -696, 492, -1284, -3686, -8653, -14950, -12915, -6677, -1370, -1238, -1903, -3630, -1358, -5418, -3968, -2358, -5924, -4553, -1311, -1402, -2379, 612, 338, 1713, -2007, -5273, -6459, -6097, -6330, -3947, 1844, 4975, 5647, 7755, 2373, 2029, 4199, -462, -6262, -6377, -4965, -6077, -11828, -12043, -7450, -4281, -3890, -5191, -3331, 920, 3295, 1434, -4397, -2635, 3895, 2243, -5232, -12623, -13857, -8875, -4867]
5768d867L896k247j396o19N490J710r119k317o244p9N560M257N974J382j920n213
5752e752k909J783K333M41J683L646l483M474J9m161L273l304K590k599m991o73
5736g630k164J530L055K116J830N36m830k012N291q94J455K327k155m884l091
5721i520O174J390m63p974n482L380M632J277j83J710K915J433p73j953N96k112
5705d953k671K001k17l190Q131k669M33O724K087k838m447m99M393L810j926p093
5689b924l943J999P2K110J392j074k955L382k499m607k683j709R68M083O470l845
5673e763M089L554m114m110M054p094R07L856m073M517L588J535k636M71n82J82
5657a619l179O150J957q399k46K467j656j031o180j324R268O483k517m012O6O860
$$ y = [-4867, -971, -3218, -4614, -5233, 257, 1967, -7152, -9469, -15713, -15792, -10232, -5975, -1, 1381, -539, -5752, -8661, -6878, -4545, -4104, -2421, 1225, -2258, 2216, 2235, -1926, 1347, -1957, 633, -1966, -6957, -7630, -9794, -8264, -5209, -3093, -1263, -727, -5557, -7569, -2278, -3172, -1717, 610, -1545, -6429, -9520, -3346, -1956, -2419, -10393, -15875, -12495, -7863, -6586, -6769, -5059, -2144, -711, -1484, -3437, -2841, -4953, -7624, -5623, -5840, -9030, -899, -3568, -3135, 3589, 5676, 2838, -1609, -2108, 2285, 6095, 4169, -2924, -6867, -4868, -4796, -2686, -1294, -2368, -5323, -1941, -4440, -9047, -11730, -13439, -12471, -8388, -1918, -5763, -1674, 1880, -2234, -6344, -2290, -9384, -8477, -4621, -8694, -4177, -589, 946, -1690, -1219, -1801, -1619, -4798, 1352, 3309, -5090, -5336, -2869, -4525, -5556, -11736, -13060, -3792, 2691, 174, -3838, -3772, 3088]
5641C088j199k170j146P88j209n214K263J354j813j224p27r229m251M936O474
5626i279P739N201K535j720K825r58q86j124l025j012j38K163q04n665O27N525
5610B004r9j429j282k05O423n13p771j2j888R430K530j138j57R39p453n793K484
5593c930L293R10m441J124N610M692n180k612O30k407l534j496m731l136J002
5578a4206J3101R536N419m948r692n139N105M543j751P70m818Q81j370K707J09
5563B47k168L578L154j025k407K497m66K611j0207n699R52j023R75M876J2382
5548H277L40o282K348M728N46J241n065m209m871O700N044k644p76K765k972m252
5532I18Rl786n687n130K783O180J0370L14k193l587m78j076L53J861n632k934
$$ y = [3088, 1889, -281, -1427, -639, -1848, -7062, -4799, -3445, -5258, -6482, -7209, -16438, -20689, -15753, -9279, -1540, 3661, 6196, 4476, 7301, 6343, 5457, 4333, 1308, 296, 158, 2321, 1517, -4148, -3521, 2004, 1905, 476, -806, -1011, 5412, 4899, -2872, -2884, -4772, 4658, 7188, 6050, 5893, 6832, -621, -6414, -3930, -637, 273, -4168, -3044, 2566, 7258, 2078, -534, 96, -2311, -5845, -7341, -12072, -15208, -14206, -1105, 8431, 13850, 8902, -790, -5929, -824, 3719, 1968, 2738, -2080, -1199, -2569, 138, 247, -1921, 1657, 4811, 3786, 1379, 3876, 3410, 6021, -4186, -9885, -8933, -9956, -8981, -4105, 8277, 8617, 2335, 4683, 9411, 9957, 11198, 6133, 1924, -2947, 3753, 8797, 6153, 5377, 8142, 5170, 918, 927, -2859, -8546, -13676, -10893, -4713, 5657, 5971, 3778, 191, -287, -1363, -1010, 851, -4781, -7715]
5516g715L560o77L295Rn754q87N26q20M995K308M24k2j578J328L338O77n549n667
5498h209J95o4O29K792P43L787N42l812j020n103M013q09j144l645L375K389j12
5481e453O115K08k426m787Q075M832q829K285N549m722n16j692L44J132K975L435
5465F525k571m369k802j39k240J87k235J208J266J255j015o53n70l447p14N250
5449e064K186M656n03l426k998k673J203R81n26k165K126N208K802p48J991l373
5433c23m091P647j158m982j170K554M426L898L220n21J959m379o758j109J745
5418I58j503j895n234M683L98j082q33Q41J175n408l199J094R40j75J099Q07l415
5401a0749j502n46L59M650M600M261j861q770M11L587N86k699n62P88L259N731
$$ y = [-7715, -4155, -4832, -1537, -1528, -7282, -8169, -7643, -8463, -3468, -1160, -736, -758, -2336, -1008, 2330, 3007, -2542, -8209, -8014, -8078, -7449, -4657, -3914, -127, 415, -3397, -4417, -9520, -5507, -6316, -7460, -11105, -7730, -5341, -5453, 662, 870, -1556, -6343, 1732, 6564, -2265, 20, 5569, 847, 331, -1361, -1017, 115, 3090, 6525, 3954, -415, -3217, -3356, -5596, -5409, -7644, -6436, -5170, -3915, -4930, -5583, -6153, -9600, -10314, -5064, -2878, 1778, 1275, -2151, -5149, -7822, -6619, -5638, -6164, -8329, -6203, -995, 1807, 1059, 3050, -323, -4414, 3233, 2075, -2907, -4077, -1523, 2903, 6801, 10021, 9500, 11459, 7080, 322, -787, 958, -545, -2440, -7674, -2991, -2593, -3675, -4508, -3667, -2492, -7900, -11099, -10005, -9065, -9240, -8141, -7334, -10749, -12251, -12797, -12438, -7788, -3188, 1073, -788, -9558, -9147, -5560, -4974, -7673, -8235, -7447, -4188, 1543]
5385A543J662j923L316j938p54n742k504K293m349l039j406L961M464K128k358
5370d646M154J911m320K722N83l712N465J722k979m117m899q60L001M006K255
5355B86k813j14K93L522P691m024n517o554Q07J0194J294j000O29N896k641l819
5339D130o765j487M030j544Q78j3o467k058K807N287J330k199k264j189q16K976
5323c364k032k559J886j597n126l165L796P363k945K678J483R03j631J776M451
5308A917K477o604o659J0272M050q469k877N373O480K746j993l247k776J462q124
5293e972j513L804J310L283O146K182M282n605r892m478L664M45K823m531K348
5278a704j996K522k352j069l971P67L261k095M874L828j980k052l46q5L662K513
$$ y = [1543, 3205, 1282, 4598, 2660, 1906, -3836, -6340, -4047, -8396, -11435, -12841, -8880, -4416, -2288, -4646, -492, 1419, -2901, -179, 404, -3308, 2157, 3879, 900, -3217, -8116, -8976, -5975, -1969, 286, -2527, -2641, -2348, 1174, 8865, 4841, -676, -7230, -6423, 3771, 5065, 4065, 4694, 10590, 7949, 4130, -2635, -4122, -92, -1636, -758, -771, -7238, -9296, -6489, -1202, 128, -2071, -4335, -5524, -6340, -3364, -5396, -7955, -6069, -7666, -12792, -15957, -12161, -4798, -7743, -5065, -3582, -2679, -4310, -2534, 1917, 4394, -2210, -8869, 1403, 5453, -3016, -5893, -520, 5960, 8706, 6713, 3466, 690, 2152, -5972, -7485, -3681, -2371, 912, 7058, 9240, 13522, 7917, -1975, -6453, -2789, -2344, 479, -4052, -1704, -3700, -1178, -3530, -4599, -8570, -7803, -4542, -6637, -1763, 2065, 85, -1967, -2313, -2398, 1264, 3777]
5262C777k114R81j801p691J518K544L765J990L594o004O65O007j056l35K23o237
5246a74n197n312M33j47K327k2O318M119l46K064J08n176o615j889J1025L777
5230E293K098L71j61j571K016m679k058M943K434L45l648o668m354K307M499L061
5214D228M611m141N07p96M86p090p8q31J241J548K171J276k014K77j271K271p16
5197A679l852L431l946j397J0612k657p594J23l178K06k134J208P03K559k817
5182g054j430M872N368K705r64l827K491M093q48q166K043J144m249J840l2N89
5166a425J954K53o816Mj342L996M283j654K418k037j0166k563K570J312n99k731
5150a2543M753M361P243l066m948K215m23L43J7L386k924J523j0240p023p16P576
$$ y = [3777, 1663, 2644, 843, -6848, -5330, -2786, 979, 2969, 6563, 559, 1224, 7231, 6175, 5840, 6063, -174, -5371, -10683, -10250, -10397, -8070, -8092, -1774, 2345, 1999, 4063, 4171, -1005, -7620, -9509, 1516, 5293, 7391, 7762, 7601, 6030, 8046, 3367, 1309, 6252, 8686, 9031, 5383, -1285, -5639, -3332, 1167, 4228, 8839, 4698, 5205, 4409, 4895, -2195, -2273, -3104, -1863, -315, 1856, 3132, 1118, 1395, 124, 2395, 1679, -2173, 1258, -2688, -4085, 6527, 3870, -3724, -3601, -6779, -6573, -8707, -7499, -6796, -4237, -7054, -8484, -3612, 1756, 4461, 3497, -330, 2161, 6254, 5406, -2760, -717, 427, -3822, -1982, -2014, -1425, 529, 782, -6034, -6030, -7372, -3376, 907, -747, 1671, -366, -10532, -13095, -10525, -9213, -9812, -12543, -7790, -3429, 3814, 748, -4200, -1985, -2408, -2065, -2048, 1338, -1586, -63, -10303, -17326, -18042, -10466]
5134a0466O903N06M52L05k048L83j602N276N447n518o846l971l533j925n74M561
5118a2650O340J790j520n82O266M703L3n297l206K174L495k14l251m103K548J477
5102a997q127J280Q654O433N063J423j577m112m25j222P06j552l893j507m887
5087e740j459j930m95K465J011M70j557O41J839J406k54m056k634J888K308M126
5071a971K469N849k269l78L18j963n823n72k812N433j270o446j048L777L877P441
5055D612n426j090l300o690n815k019O878Q280Q048j145k877m046l88j498R29
5040e547j393L823K620L95r20J456K248J299p52k185j218j45m472n735N640Q660
5024C774j677j728J444m772k878J912M235k031j483m160k106O44M674K857J863
$$ y = [-10466, -3563, -3057, -2605, -2300, -4348, -3965, -5567, -291, 5156, -362, -7208, -11179, -14712, -16637, -17211, -12650, -6310, -4520, -6040, -6622, -356, 4347, 4380, -917, -4123, -1949, 1546, 1332, -1919, -6022, -3474, -1997, -10124, -8844, -190, 6243, 11306, 12729, 11152, 7040, 6615, 5393, 6099, 4547, 654, -853, -5740, -7199, -9129, -9624, -7159, -6148, -5678, -7235, -6594, -4755, -3349, -3603, -7659, -10293, -8405, -6097, -1971, 498, 6347, 4078, 3700, 4018, 2055, -3768, -4340, -7152, -1719, -2989, -9435, -10483, -6706, -2829, 4612, -814, -1904, -5204, -11894, -17709, -19728, -12850, -4570, 3478, 2333, -544, -4590, -4978, -6476, -5547, -6940, -3117, -497, -102, -1022, 434, 2682, 3981, 3229, 1044, -174, -319, -4791, -10526, -4886, 3774, 2097, 369, 1813, -2959, -5837, -3925, 310, -1721, -3204, -7364, -9470, -8826, -4152, -1295, 568]
5009E68O94m178l506J076J622J416K375K437j172P6K069k935N804R11j359N571
4993A1469m036r169r829p41P718P615o440M709L393n198M29K374M935J128o369
4978A988m741M674J853K425r00j506M617J961j612n558l842l655n402j78Q799
4963a077K033k898j620L886j198j934J153J144L698J79k172L67l541J399j567
4948b148K689J050o497m36O270M542M733J175o168j643j755j749M999n20J375
4933E917K96p290K092K029K884Q798O76m075k376o430J923L055m619m968J630
4918d58m573o142j693J0811P838N504M007M83j897n861l826k969L271J171l046
4903B620J156q74k902m514L772N890K747J380p555n085q69n542o26N441M856j381
$$ y = [568, 1262, -2916, -6422, -5346, -3724, -2308, 67, 2504, 1332, 1408, 3477, 542, 6346, 7257, 5898, 11469, 7433, -1736, -11565, -12306, -4588, 3027, -3413, 1296, 4689, -509, -80, 2294, 7229, 8357, 1988, -2753, 1921, 3774, 6199, 5299, 3793, 8410, 10371, 8759, 3201, -641, -4296, -9698, -9876, -1077, 956, -1942, -3562, 324, -874, -2808, -1655, -511, 3187, 3366, 1194, 1561, -1980, -581, -2148, 541, 1591, -4906, -5342, 928, 5470, 10203, 11378, 5210, 3567, 1812, 63, 5062, 4542, 5917, 6213, -1077, 1015, 3044, 5928, 14726, 15402, 11327, 8951, 2521, 4444, 7499, 2880, -2088, -458, -5031, -11173, -12866, -2055, 5783, 11287, 15294, 15777, 13880, 8019, 4193, 1224, 4495, 5666, 2620, 3776, 2902, 0, -4514, -742, 5148, 7895, 9275, 1720, -3365, -4234, -9776, -10402, -4961, -105, -1486]
4887a486l11k786R27M47j49k80p53L344J928L504m287J891r4m227j791K013R75
4870a135j108k101l775O011j885k441K188L452L766J474M051K462m670p38K676
4855H227l36J940j580k243L307R31l917M601P293n19k605q022q698k157l488K790
4839d476l856l699N816P204L744m186n047j06N081N802J34m65k808q56q43j352
4823H7N55q47K238P159j248r1l350l685N400J496q507j182L009L762k946j737
4807A13k880N872N361l106k438L157N804o281k474M242N814R422k621n470j018
4792A3497j592p86k66m943L345n87j2536n014R370P227L953o252J856o942m960
4777d630L357O1o9J21J3062K056o920O081o205j0948r07M448J424j777M80k358
$$ y = [-1486, -1797, -4583, -3656, -3209, -3358, -3638, -4391, -1047, 881, 4385, 98, 1989, 1895, -2332, -4123, -2110, -1135, -2243, -4344, -8119, -2108, -3993, -6434, -4246, -794, 2972, 4446, 8497, 10959, 6289, 5551, 8227, 7891, 9831, 8251, 6008, 9315, 10246, 6329, 10930, 18223, 17704, 15099, 7077, -1621, -3778, -7266, -4476, -8332, -12031, -6215, 989, 4733, 547, -4500, -4606, 475, 6277, 6411, 5946, 3138, 2282, 1439, 87, 642, -205, 2033, 9192, 7944, 7853, 4503, 818, 6218, 7714, -793, -1975, 1034, 4796, 1850, 113, -2767, 3105, 8466, 5360, 2922, 6079, 11883, 5602, 3128, 7370, 13184, 22606, 19985, 14515, 13497, 11905, 11119, 10853, 5910, 9255, 8668, -3868, -8882, 488, 7715, 11668, 5416, 7272, 330, -4630, -1273, -1212, -1281, -1160, 11902, 13958, 7038, 13119, 6914, -4034, -4941, -493, 931, -846, -366, -2724]
4761b724l505J245m14k275P69m257K112R54O118L473p071p343l14l478P100L164
4745f446j975j130O248K583p73K059J123K065m25k092m582j665P162N659p419
4730C92l764K500k411k409R52J271L68k72M28l167k468k818L441J797k64M518
4714a906q60K42q49O90J0246N663j3800o601K259R014k344k826q586N300J0578
4699F220J591q74p393p340L639O605m600r5l348M59K262l800O28M930r36l641
4683e693M404O546q203n761J018j058J920L577l700J138L283M046K9j838J050
4668G58K88l069k957L219j011J738j209N08L031K621M0l01m731m92j223j799k020
4651f609o39K515J338k294m224P446P212J233n521o256j265N064K657L1k70o822
$$ y = [-2724, -6229, -4984, -5398, -7673, -6904, -11161, -9049, -8095, -1977, 1496, -5575, -12918, -13232, -16710, -9610, -6446, -8421, -9551, -3303, -720, -1493, 566, 1689, 3754, 3329, 1237, -3345, -5010, 2152, 7811, 392, -3372, -872, -3283, -5692, -4740, -3469, -3101, -3373, -2945, -6112, -8580, -11398, -7957, -6160, -6424, -1906, -2766, -2524, -3373, -2683, 7563, 13226, -574, -7175, -4916, 4098, 1754, -1072, -9658, -4358, 6220, 7811, 6937, -456, -7796, -4157, 2448, -2152, -2247, -5595, -5136, -2874, -6674, -6046, -1116, -2052, -5693, -1289, 5257, -2946, -8707, -7689, -8747, -6827, -3250, -6950, -5812, -2529, 1517, 1546, -292, 758, 1046, -2023, -4980, -1761, -2772, -1034, -2243, -1735, 1296, 3917, 3957, 3656, -1075, -1567, -2790, -4589, -6609, -7248, -4733, -3395, -5689, -9913, -2467, 4745, 5978, 457, -5799, -7064, -2000, 657, 688, 418, -6404]
4635f404J200L729o36j877j052K716r45M83L662K809k078p180L046L153J785k779
4619c68l917j26N943J557l643k690j999n545M771M268O5N396k139o41L264K366
4603F562O88l56Lm615n462L427O140K932o16P78n171n442K448n94k471o17M451
4586B085J28k708j118J8l324K765j403l456J771N480M452l430l372O253K399j499
4570E041m401m956N931J758L26L010k721p087J03K451O21J739k759J979k036j04
4554a105K010j679o77M287J357k818j613J936J226R41o50l186L822k582Q54N665
4538G788k179p151K121M878j64J461j992n26J302N259l014j214n388l889j436
4523d144M724L868K169N163l494l819n585n692J55J439L408K673k030M854K702
$$ y = [-6404, -5204, -1475, -2111, -3988, -5040, -2324, -3269, -2786, 876, 3685, 1607, -5573, -2527, 626, 2411, -368, -4285, -4411, 1532, 3089, -554, -3244, -5243, -10788, -6017, -1749, -1684, 3712, 1573, 932, 4196, 6562, 7250, 6894, 6897, 2282, -3180, 247, 6387, 9319, 8703, 9481, 4310, -1132, 1316, 722, -1749, -2366, 2085, 2213, -495, -1613, -1595, -4919, -2154, -3557, -7013, -5242, 238, 4690, 1260, -2112, 4141, 6540, 5041, 640, -4316, 1615, 3373, 3699, 6709, 3988, -3099, -2996, -545, 76, 1815, -944, 1035, -1001, -1105, 905, -774, -1451, 2836, 4193, 1375, -238, 1698, 2924, 3865, 3215, 29, 3851, 1269, 2123, 7788, 5609, -1542, 579, 5457, 5293, 6754, 4762, 4236, 5538, 10797, 7783, 6569, 1181, -2708, -4144, 580, 4448, 6617, 11780, 8286, 4467, -1118, -6810, -6655, -5216, -1808, 865, -1165, 3689, 6391]
4508F391L508K285j505m526r073j185Q15N66K187j16L151R0n789J028L452J126
4492B405j843P094M856o348o214l506P455J099J973Q670j693r421j755K258m665
4477C65k103J625m955n835Q502N604k72m851j283M299k998J988L925j599K075
4462D487j15m085J608n588p331j578L893M413K401O103M619m021p907p835Q299
4447b637L247r69l165m227J160M467N560k735l161M047J97R70n60p61j010n47
4431a24k904L067l4j602J641O39j278j563J967m502j216N589K500J868J170j827
4415C391J04k559K83l722O31O610j874l051N4K926l461j820L800L812o10q40m364
4398f90j905m745r77M773K445m623k95K625n91L578J009j13M906K652p85p45j056
$$ y = [6391, 9899, 12184, 10679, 6153, -2920, -4105, -3290, -2724, -537, -653, 2498, 2588, -3201, -2173, 1279, 2405, 562, 7656, 12512, 6164, -50, -3556, 3899, 4998, 6971, 15641, 13948, 4527, 2772, 5030, 365, -1738, -113, -5068, -10903, -2401, 3203, 2931, -1920, -3203, 1096, -1902, 86, 4011, 2412, 4487, 4372, 287, 1895, -3693, -11024, -12602, -8709, -4296, -1895, 4208, 8827, 4806, -3101, -10936, -2637, 610, -359, -3524, -7751, -6591, -2124, 3436, 701, -2460, 1587, 1784, 2754, 2194, 1433, 423, -124, -3028, 39, 5, -1597, 44, 683, -595, -2158, -191, -4693, -5909, -320, 2180, 4048, 5218, 3391, 3495, 936, 1219, -2503, -1872, 4738, 2864, -187, -133, 2793, -668, -2488, 1312, 5124, 4514, 3674, -690, -2595, -7340, -8317, -3544, -1099, -5722, -6017, -3392, -3983, -405, 604, 491, 5397, 8049, 7264, 6519, 5463]
4381E463p602m872J1820O2l281L109L589j506j946L314j923k543o512J227p02
4366b303J181P361J823M339J009l702n428O877N398l657m441j490j99j794j291
4351C683j925n690J710j703m274k839j677P003N203K155l318q75M20J873J652
4336A398L081n74k296N335j426r012j835L050k016l987L581M046j197P18L131
4321A997n12J178L286N511m274n567J191Q96M705J788K156o477R4j037M373j388
4305G920K606l376m299k645K056K669l39k239q05K104J126J602l667l127m75o40
4289a529l401J3R380j91l3K011m92j735K347j304L736m000J310N244k73L36K139
4272A3558n324n552l505r433n802L123Q086N184K480Q06k479p606P13J148O774
$$ y = [5463, -2139, -7011, 4809, 4871, 1590, 4699, 8288, 6782, 4836, 8150, 6227, 3684, -2828, -1601, -2303, -1122, 6239, 8062, 12401, 13410, 9708, 4280, 11157, 16555, 12898, 8457, 6967, 6768, 4974, 3683, 1758, -3932, -2222, -3925, -8199, -11038, -12715, -5712, -509, 1646, -1672, -2547, -2127, -254, 1398, 4479, 3905, 1609, 6944, 5518, -3494, -5329, -2279, -4295, -8282, -4701, -655, -1852, -1134, 1997, 1485, 2663, 5949, 11460, 7186, 1619, 2810, 3706, 8411, 10199, 12355, 5878, 5972, 4935, 9308, 7920, 10526, 7150, 2851, 206, 2262, 4931, 4592, 2353, 1548, 3652, 4778, 6380, 2713, -414, -889, -1529, -4930, -4917, 4463, 4272, 4239, 6250, 5758, 4023, 6370, 5066, 8802, 4802, 6112, 11356, 11083, 11419, 13558, 8234, 2682, -823, -10256, -16058, -12935, -4849, 335, 2815, 3621, 1142, -6464, -5751, -4603, 2171]
4257B171K62n677k932j015k379P164K947k019l618o557L023j671o10K724M014
4242d173N490n003n16j282j613R209N335l01M4j289j950k780k588K408r67J560
4226A584J303L334M408N255m268j953m410L361J995j069l427k091K502J230k020
4211E734m956j570o118n644O174P004m601q78n62M099N809M151j70N845l330K0
4195A1007j174n483m844M877J006k300l126k16J313J368j785o484r550K055J805
4180a1531J873L320m292L081K931L065L730N362l476k481K123l85l081P30K646
4165C615O055O62k78k452p742p993L175J735N232J000l302l329j375k47J317k534
4149f461O257P99l955P537K166K266k485p273j031N901M863m42q155o172J161
$$ y = [2171, 2433, -3244, -6176, -7191, -9570, -2406, 541, -1478, -5096, -11653, -8630, -10301, -10911, -8187, -4173, 1317, -3686, -4202, -5484, -7097, 2112, 7447, 7146, 7190, 5901, 3951, 1171, -1417, 991, 24, 1584, 2887, 6221, 10629, 15884, 11616, 9663, 5253, 8614, 10609, 9540, 6113, 4022, 6524, 7754, 5734, 778, -792, -6910, -12554, -6380, 624, -3977, -4855, -5417, -1318, 4491, 8642, 8472, 14317, 10987, 11007, 9833, 4350, -494, 4383, 5389, 3089, -37, -253, 1060, 2428, 643, -5841, -15391, -13336, -11531, -9658, -6338, -10630, -7549, -4618, -1553, 2177, 7539, 4063, 1582, 3705, 3320, 239, 969, 3615, 9670, 10332, 10054, 7602, -140, -8133, -4958, -3223, 2009, 3009, -293, -3622, -4997, -5244, -3927, -6461, -204, 595, -3360, 4177, 6343, 8609, 6124, -1149, -2180, 3721, 8584, 8142, -13, -6185, -5024]
4134e024M022L851k407m101k370K570J221q16J015N237J240J641j800m764l311
4119c796n117M135m340j941N844k05l205M151R549L487n481k220K116k747m596
4104d366P16j835m377o24k92M743N212M576k100K086K850m405l46j620l657k526
4088e965O536O322J485L212M833l677j0665o720N44Q145O101m867l567K664k754
4073A627J814k455Q39O638n46n800l510P01M066J076o226P33K070k960j465m492
4057g890K818P663K410j010m382j63l54J241N881m55m129J537j324l13q540m418
4041a1428L983M541J533k087R46M341J770n555J376K447K183j107J782N324m003
4026F046k832J700k985k003N316k613o710R767J2119k76l697o056p735K117M874
$$ y = [-5024, -1002, 2849, 442, -3659, -6029, -3459, -2238, -3054, -2039, 3198, 4438, 6079, 4279, -485, -3796, -8913, -4778, -9118, -11059, -5215, -5420, -8625, -4474, 5075, 8562, 3081, 861, 2977, 230, -4366, -3650, -5485, -9862, -10486, -10778, -6035, -823, 3753, 1653, 3739, 6589, 2184, 1838, 218, -3439, -5965, 571, 6893, 8378, 11590, 16423, 12746, 2081, -4639, -4095, 4050, 10151, 5284, 1717, 4381, 1627, 3441, 986, 1825, 8463, 7917, 2117, -1393, -692, 3374, 4450, -1776, -1043, 1027, -1933, -3398, -7890, -5072, 2591, 5001, 3991, -391, -554, -908, 333, 6214, 5759, 1630, 3167, 1843, 1530, -7010, -11428, -7445, -2904, -1371, -3458, -2512, 1829, 3599, -1956, -580, 1867, 4050, 2943, 4725, 10049, 6046, 3214, 4914, 1929, -74, 5242, 2629, -4081, 5686, 17805, 17529, 13832, 7776, 41, 2158, 7032]
4011G032P89l349k375J76k901p136l251J0321O393M023p39m570j370M279m067
3996C255m109J934l920l735L422K501K763J516n30k511N301o398m818N528L057
3981C256L07j568J530M7m124k776O708N655k645l775K522p02p33J399l691l166
3965a756O134N297n945p556J574p37P264M918l69j379R67n242m897n23K906O855
3949G511j283Q56K039l877P48O750l162n698l592O526J03m224K079o684k344K826
3933a426L888M481j681q13m367K860N069N67K644j0920k125j973l513K736K830
3918a743o496k336j63J2370O923K818l001j921l087m517q648K049N847P422r72
3903D545N815J838K783k678o868K390j380k70J274l197n117n254N363L579M144
$$ y = [7032, 7821, 4472, 2097, 2273, -628, -7764, -11015, -694, 5699, 9722, 8983, 4413, 3043, 7322, 3255, -854, 1080, -2840, -6575, -3153, -652, 2111, 3627, 3097, 586, 5887, -511, -5329, 199, 3256, 3563, 1995, 3525, 3572, -552, -3328, 3380, 9035, 6390, 2615, 5137, 4435, 3702, 5101, 1410, -1756, 4378, 9675, 3730, -3826, -2252, -2989, 4275, 9193, 8824, 7445, 8412, 3170, -1727, -2250, 656, 7511, 6228, 7084, 9123, 5246, 5994, 12744, 9582, 3884, 292, 6818, 6921, 2697, 4776, -1908, -4252, -1426, 2462, 6943, 5262, 4449, 82, 2942, 8011, 8578, 11222, 302, -1823, -3796, -7309, -4573, -1743, -8239, -10575, -10738, 1632, 8555, 11373, 8372, 6451, 3364, -1153, -9801, -7752, -1905, 5517, 4545, 10360, 12198, 14981, 12303, 5435, 7825, 6445, 6175, 7449, 4252, -865, -6119, -756, 2823, 6967]
3888F967k57n75k919k631J79J719j909K378j313q272N29J604j453N789J640Q74
3872B350M809k196j857m45j070L612J804l590m126K06q61J538M677K492J317J991
3856A0651n127j157p449m145M475L933L936l672M599o61Q10j031K860K87q332
3841b3M474M888q60l246Q79l788q161R18K854K572p68k755k902N536M950l40j156
3824C072J571K212M227m18l736O31O22p79o197l261l73N15J771p71k140L649J351
3807A946k550J141m645k814N513j519k836k657o25L757k218n407L100N922O206
3792B314m244n662j282M213K886N676L52J506O24j14R04K76L448j323r062r148
3776h636N80Q884L761l53k122l428M480l870m947Q88N860N005l476n916J645O518
$$ y = [6967, 6710, 6135, 3216, 585, 764, 2483, 574, 2952, 1639, -6633, -6104, -4500, -5953, -164, 1476, 2350, 7159, 4963, 3106, 2661, 1591, 5203, 7007, 3417, -709, -503, -1364, 174, 4851, 7343, 8660, 10651, 5524, 4367, -3082, -7227, -2752, 1181, 5117, 1445, 6044, 5383, 6193, 5162, 8022, 8309, -23, 4451, 9339, 8479, 5233, 6112, 2324, -5837, -4919, -2065, 507, -261, -3016, -5918, -382, 4568, 4228, 3072, 4643, 6855, 11082, 10664, 6928, 7559, 8181, 7402, 1205, -2056, -2429, -1914, -143, -914, -3054, 595, 1946, -604, 537, -4108, -6922, -1409, -2928, -5764, -8421, -9046, -5289, -7507, -12914, -9814, -3892, 2314, -1930, -7592, -8874, -4661, -1775, 3901, 4253, 5759, 6383, 6269, 7173, 7449, 10897, 9574, 512, -8636, -8056, 828, 4589, 4236, 2114, -1314, 3166, -704, -5651, -4763, 1097, 6102, 2626, -3290, -1645, 4873]
3760D873j752k726O336L891L046K862K129o892p192j1605J209Q581J778N54l63
3745D729o593P06P325N177J713J208l233R60P74j1016n244j209j190J0830P201
3730A2138O21m74N82m229n066J586p073p19J996j753m085K057K679r191l43Q314
3714b960Q470j73k558k658j791j34m876J850L947P319r24L899p79J342J418q35
3698A0557j763J270q726k274l27K023O967K112l020n677n712L592m888j463m008
3683a1337Q307R219p368o038K659j831k320O616J2204j926j0775j355N54L292
3669i9J869O155L729r27n072l350J756L299L561j003n057p22o43o24q40n284N48
3652b704o61l117J547O692l633l810N874M828k173n882o40L703q99R17M452L325
$$ y = [4873, 3121, 395, 6731, 10622, 13668, 16530, 18659, 11767, 4575, -7030, -5821, 2760, 4538, 5092, 4729, -1864, -1158, 6167, 11344, 13057, 14265, 11032, 11992, 12766, 1750, -3494, -4703, -5893, 4937, 12138, 12759, 12285, 12867, 8638, 3572, 5158, -1915, -2634, -638, -2391, -6476, -4419, -1740, -10931, -11274, -2960, 5510, 5337, 2779, 121, -1670, -1804, -6680, -4830, -883, 6436, 5512, 9411, 8632, 9974, 11392, 10557, 8794, 10064, 1338, -936, -1263, 760, 7727, 9839, 6819, 1142, -4570, -978, -5866, -7329, -11337, -3030, 6189, -1179, -7217, -4558, -6389, -8709, -2093, 10111, 8185, -2590, -3945, -3391, -99, 1770, 7925, 11654, 10727, 5655, 2305, 4061, 7360, 10921, 9918, 4861, 4139, 3496, 2872, 2032, -3252, -2704, -3365, -6482, -4935, 1757, -1876, -5686, 188, 5016, 2843, -3039, -3679, 24, -875, 42, 4494, 7819]
3636G819l521O94j36l302k991O549L221m495J60M025J489k563j808L536M08k131
3620F954l262M790L010m102P76L582k659J386m3k318m157k708J505J03j339l251
3604a733O46K895n92N43K056J543Q88m60K029J816p520l046J151J297K99M397
3588F209P785m652r289j138Q51N112K646K408l50n420n299n660p44Q333R328l410
3572F710p598n676K474N053R484K422m988n295r28J351K819l293K034K720M281
3557A1570p23p713J0660q64k002J001l636o604J637O68n048O186K911j230L94
3542G207l178n631L95J283L911l86k553J568o181j557j525K103M389L462r02k886
3526d81L024m808j765n35K724N124q9o534n780k176O441M580J510J316j780n786
$$ y = [7819, 4298, 4992, 4856, 1554, -1437, 5112, 8333, 3838, 3998, 8023, 9512, 6949, 5141, 8677, 9085, 6954, 3692, 8482, 11492, 7390, 8166, 11748, 9089, 10475, 10432, 8114, 3957, 1249, 2754, 2857, 1518, -1733, -1087, 1808, 1216, 1759, 3815, 5358, 6246, 5786, 7815, 9631, 2111, -935, 216, 1513, 1812, 6209, 13994, 9342, 53, -1085, -234, 4878, 7524, 9932, 9582, 4162, -1137, -6797, -7541, 792, 10120, 6710, -888, -6564, -4090, 963, 10447, 12869, 7881, 2586, 1658, 3009, 5828, 2535, 4569, 7289, 11570, 10847, 3134, 13794, 12930, 10928, 11929, 8293, 1689, 3326, 3994, -1054, 5132, 8043, 6813, 7207, 4029, -1602, -1207, 76, 3987, 3601, 1048, 2616, -3565, -5122, -6647, -4544, -155, 3307, 2405, -481, 2543, -2265, -4030, -4565, -1841, 3283, 3194, -3340, -9120, -11296, -4855, -275, 1235, 2551, 771, -5015]
3510e015K033l42O540L779J318K67O83l720p377K032N848k098p353O5Q977N540
3494A1177r49j343N91l098m213O243R606n527k630R87m376n561l373m750N035
3479b181N240J986j430N44J326n263j618O795M653Q00J457Rk813K028m96p97l81
3462I859m143k841p88m090J739K379l247j864M475L101N379n413N01O5l839L339
3446D612Q247m872p190J542P62N66M650J45k355k332Q70n53l916J345l956K024
3430d11K093N487K821p419l657j469j203M140J0734M222m333o187l299N219M046
3415A0784J820q241l407K873K653M9n556m586O498K122m20n435L211P325L640
3400A3330j91j0791k753N888n472l776K248l863K266Q709l574l811j513o1o128
$$ y = [-5015, -2982, -3324, 3216, 6995, 8313, 8580, 9263, 5543, -1834, 198, 6046, 3948, -3405, -3340, 5637, 11177, 10228, 8885, 9476, 6378, 2165, 8408, 18014, 12487, 9857, 10844, 6468, 907, -2466, -7216, -2181, 3059, 5045, 3615, 4159, 5485, 222, -1396, 5399, 10052, 10852, 12309, 12318, 9505, 11533, 11037, 10240, 9859, 5716, 2875, 2087, -2003, -264, 2115, -1132, -2996, 1479, 4580, 9959, 4546, 5047, 5112, 1273, 4612, 12859, 7987, 797, 2339, 3101, 3667, 8317, 8462, 6107, 3775, 4645, 4092, 176, 1521, -2435, -411, 1682, 7169, 9990, 2571, -1086, -2555, -3758, 382, 11116, 15338, 11005, 4818, 1519, 6738, 10784, 12604, 4363, 956, 3829, 6482, 6531, 975, -3611, 2887, 5009, 4589, -846, 2365, 9690, 13330, 13139, 2348, -405, 5483, 11, -3765, -1517, -5380, -3114, 5595, 2021, -1790, -3303, -3364, -9492]
3385i492k214R746P605L371Q58l597l391k404N317K136m126m639K53N852m74L427
3369H228N163n527o709L279j411J510j783o29o570K093K208K156K246O468J918
3354A2640o50n80M32p684n083m001k868Q95M435M008N966J241n446J971K205m115
3338C366q83M80L893N55L660q644P14R386j663L176R96m185n642j373k661m24
$$ y = [-9492, -11706, -1960, 5645, 9016, 9874, 6277, 2886, 482, 5799, 7935, 3809, -830, -577, 5275, 4801, 8228, 13391, 7864, 1155, 4434, 3023, 4533, 2750, 2121, -4449, -2356, -148, 2008, 4254, 10722, 12640, 11990, 11410, 11842, 4158, -925, -4926, -7794, -6899, -2464, 1544, 7510, 8751, 3305, 5276, 7481, 3366, 2483, 2963, 6856, 7411, 11071, 2427, 3141, 12527, 10864, 14040, 15036, 10851, 5209, 3836, 1175, 751]
$$ [...]
##END NTUPLES=NMR SPECTRUM
##END=
