##TITLE=Analysis number 329663
Compound Code cc 30714
Book Reference 437/88
Project Code adrs
Chemist Name wendyb
##JCAMPDX= 6.0         $$ Bruker NMR JCAMP-DX V2.0
##DATA TYPE= NMR SPECTRUM
##DATA CLASS= NTUPLES
##ORIGIN= Bruker BioSpin GmbH
##OWNER= nmr
$$ XWIN-NMR		Version 3.5
$$ Fri Sep 21 13:07:48 2007 GMT Daylight Time (UT+1h)  MAYBRIDGE\nmr@NMR_250MHZ
##.OBSERVE FREQUENCY= 250.131544655141
##.OBSERVE NUCLEUS= ^1H
##.ACQUISITION MODE= SIMULTANEOUS (DQD)
##.ACQUISITION SCHEME= undefined
##.AVERAGES= 16
##.DIGITISER RES= 18
##SPECTROMETER/DATA SYSTEM= dpx250
##.PULSE SEQUENCE= zg30
##.SOLVENT NAME= CDCl3
##.SHIFT REFERENCE= (INTERNAL, CDCl3, 0, 16.522)
##AUDIT TRAIL= $$ (NUMBER, WHEN, WHO, WHERE, WHAT)
$$ ##TITLE= Audit trail, XWIN-NMR		Version 3.5
$$ ##JCAMPDX= 5.01
$$ ##ORIGIN= Bruker BioSpin GmbH
$$ ##OWNER= nmr
$$ C:\u/data/dgb/nmr/ADRS/2150/pdata/1/auditp.txt
$$ ##AUDIT TRAIL=  $$ (NUMBER, WHEN, WHO, WHERE, WHAT)
(   1,<2007-09-21 13:07:23.53 +100>,<MAYBRIDGE\nmr>,<NMR_250MHZ>,
      <created by zg, POWCHK disabled, PULCHK disabled
       configuration hash MD5:
       76 6E 9A 78 1E 09 19 81 EC 84 63 8F B0 6A 59 2D
       data hash MD5: 64K
       9D 21 C4 0B F9 4E 5F 03 1C 66 C0 46 D1 19 2C 52>)
(   2,<2007-09-21 13:07:38.07 +100>,<MAYBRIDGE\nmr>,<NMR_250MHZ>,
      <Start of raw data processing
       ef LB = 0.3 FT_mod = 6 PKNL = 1 SI = 32K 
       data hash MD5: 32K
       A5 5A FC 65 AD 99 FD 68 C3 E3 AA 94 38 55 F5 0B>)
(   3,<2007-09-21 13:07:39.74 +100>,<MAYBRIDGE\nmr>,<NMR_250MHZ>,
      <apk 
       data hash MD5: 32K
       8E 8B D8 57 B0 5D C3 2D 13 B3 83 37 10 5A B4 04>)
(   4,<2007-09-21 13:07:40.46 +100>,<MAYBRIDGE\nmr>,<NMR_250MHZ>,
      <abs ABSG = 5 
       data hash MD5: 32K
       E9 AE 1F B8 92 CF 3C 33 DA D0 0C 0A B5 73 96 B3>)
$$ ##END=
$$ 
$$ hash MD5
$$ A8 B3 8E F6 E4 92 20 82 D8 17 42 D6 5D BE 1A 97
##$RELAX= 
##$RELAX= 
##$RELAX= 
##$RELAX= 
##$RELAX= 
##$RELAX= 
##$RELAX= 
$$ Bruker specific parameters
$$ --------------------------
##$DU= <C:\u>
##$EXPNO= 2150
##$NAME= <ADRS>
##$PROCNO= 1
##$TYPE= <nmr>
##$USER= <dgb>
##$AMP= (0..31)
100 100 100 100 100 100 100 100 100 100 100 100 100 100 100 100 100 100 
100 100 100 100 100 100 100 100 100 100 100 100 100 100 
##$AQSEQ= 0
##$AQ_mod= 3
##$AUNM= <au_zg>
##$AUTOPOS= <22 >
##$BF1= 250.13
##$BF2= 250.13
##$BF3= 250.13
##$BF4= 250.13
##$BF5= 500.13
##$BF6= 500.13
##$BF7= 500.13
##$BF8= 500.13
##$BYTORDA= 1
##$CFDGTYP= 0
##$CFRGTYP= 5
##$CHEMSTR= <none>
##$CNST= (0..31)
1 1 145 1 1 1 1 1 1 1 1 1 1 1 1 1 1 1 1 1 1 1 1 1 1 1 1 1 1 1 1 1 
##$CPDPRG= <>
##$CPDPRG1= <>
##$CPDPRG2= <>
##$CPDPRG3= <>
##$CPDPRG4= <mlev>
##$CPDPRG5= <mlev>
##$CPDPRG6= <mlev>
##$CPDPRG7= <mlev>
##$CPDPRG8= <mlev>
##$CPDPRGB= <>
##$CPDPRGT= <>
##$D= (0..31)
0 1 0 0 0 0 0 0 0 0.06 0 0 0 0 0 0 0.0002 0 0 0 0 0 0 0 0 0 0 0 0 0 0 
0 
##$DATE= 1190376442
##$DBL= (0..7)
120 120 120 120 120 120 120 120 
##$DBP= (0..7)
150 150 150 150 150 150 150 150 
##$DBP07= 0
##$DBPNAM0= <>
##$DBPNAM1= <>
$$ [...]
##$SUBNAM7= <"">
##$SUBNAM8= <"">
##$SUBNAM9= <"">
##$SW= 20.6930455092707
##$SWIBOX= (0..15)
0 0 3 0 0 0 0 0 0 0 0 0 0 0 0 0 
##$SW_h= 5175.983436853
##$TD= 65536
##$TD0= 1
##$TE= 297.16
##$TE2= 300
##$TE3= 300
##$TEG= 300
##$TL= (0..7)
0 120 120 120 120 120 120 120 
##$TP= (0..7)
150 150 150 150 150 150 150 150 
##$TP07= 0
##$TPNAME0= <>
##$TPNAME1= <>
##$TPNAME2= <>
##$TPNAME3= <>
##$TPNAME4= <>
##$TPNAME5= <>
##$TPNAME6= <>
##$TPNAME7= <>
##$TPOAL= (0..7)
0.5 0.5 0.5 0.5 0.5 0.5 0.5 0.5 
##$TPOFFS= (0..7)
0 0 0 0 0 0 0 0 
##$TUNHIN= 0
##$TUNHOUT= 0
##$TUNXOUT= 0
##$USERA1= <user>
##$USERA2= <user>
##$USERA3= <user>
##$USERA4= <user>
##$USERA5= <user>
##$V9= 5
##$VALIST= <valist>
##$VCLIST= <CCCCCCCCCCCCCCC>
##$VD= 0
##$VDLIST= <DDDDDDDDDDDDDDD>
##$VPLIST= <PPPPPPPPPPPPPPP>
##$VTLIST= <TTTTTTTTTTTTTTT>
##$WBST= 1024
##$WBSW= 4
##$XGAIN= (0..3)
0 0 0 0 
##$XL= 0
##$YL= 0
##$YMAX_a= 371888
##$YMIN_a= -420206
##$ZGOPTNS= <>
##$ZL1= 120
##$ZL2= 120
##$ZL3= 120
##$ZL4= 120
##$ABSF1= 16.522
##$ABSF2= -4.171173
##$ABSG= 5
##$ABSL= 3
##$ALPHA= 0
##$AQORDER= 0
##$ASSFAC= 0
##$ASSFACI= 0
##$ASSFACX= 0
##$ASSWID= 0
##$AUNMP= <proc_1d>
##$AZFE= 0.1
##$AZFW= 0.1
##$BCFW= 0
##$BC_mod= 0
##$BYTORDP= 0
##$COROFFS= 0
##$CY= 12.5
##$DATMOD= 1
##$DC= 0
##$DFILT= <>
##$DTYPP= 0
##$F1P= 14.0000005364418
##$F2P= -0.99999901652339
##$FCOR= 0.5
##$FTSIZE= 32768
##$FT_mod= 6
##$GAMMA= 0
##$GB= 0
##$INTBC= 1
##$INTSCL= 1
##$ISEN= 128
##$LB= 0.3
##$LEV0= 0
##$LPBIN= 0
##$MAXI= 10000
##$MC2= 0
##$MEAN= 0
##$ME_mod= 0
##$MI= 0
##$NCOEF= 0
##$NC_proc= -2
##$NLEV= 6
##$NOISF1= 0
##$NOISF2= 0
##$NSP= 0
##$NTH_PI= 0
##$NZP= 0
##$OFFSET= 16.522
##$PC= 1
##$PHC0= 150.2881
##$PHC1= 9.624731
##$PH_mod= 1
##$PKNL= yes
##$PPARMOD= 0
##$PSCAL= 4
##$PSIGN= 0
##$REVERSE= no
##$SF= 250.13
##$SI= 32768
##$SIGF1= 0
##$SIGF2= 0
##$SINO= 400
##$SIOLD= 32768
##$SREGLST= <1H.CDCl3>
##$SSB= 0
##$STSI= 32768
##$STSR= 0
##$SW_p= 5175.98343685301
##$SYMM= 0
##$S_DEV= 0
##$TDeff= 65536
##$TDoff= 0
##$TI= <Analysis number 999999
Compound Code 99
Book Reference 9
Project Code 9>
##$TILT= no
##$TM1= 0
##$TM2= 0
##$TOPLEV= 0
##$USERP1= <user>
##$USERP2= <user>
##$USERP3= <user>
##$USERP4= <user>
##$USERP5= <user>
##$WDW= 1
##$XDIM= 32768
##$YMAX_p= 327524486
##$YMIN_p= -55748
$$ End of Bruker specific parameters
$$ ---------------------------------
##NTUPLES= NMR SPECTRUM
##VAR_NAME=  FREQUENCY,     SPECTRUM/REAL,   SPECTRUM/IMAG
##SYMBOL=    X,             R,               I
##VAR_TYPE=  INDEPENDENT,   DEPENDENT,       DEPENDENT
##VAR_FORM=  AFFN,          ASDF,            ASDF
##VAR_DIM=   32768,         32768,           32768
##UNITS=     HZ,            ARBITRARY UNITS, ARBITRARY UNITS
##FACTOR=    0.157963299565203, 1,           1
##FIRST=     4132.6476996994, 0,             0
##LAST=      -1043.33573715361, 0,           0
##MIN=       -1043.33573715361, -55748,      0
##MAX=       4132.6476996994, 327524486,     0
$$ Real data points
##PAGE= N=1
##DATA TABLE= (X++(R..R)), XYDATA
$$ [...]
15126B987Q121J267Q321K555J662m681j0405P041J516j4984k2683j3928J6705
15113a6506K0944L083j0053K142O816M554k99j390Q329M248j3116j755m346j0599
15099g948M739M694j9138J2908k577j2677P327Q656m461K482K003J1832J277j820
15085G297j316m826r42p009q883K102J7377P815J848p832j171J812j688j1890
15071g306j1686O397O921J0265j1769j4709j0150O525p017M220J0990P470n715
15058a5564M911n194J3245m960p499P857J2618l188p942q261p492M996J392K148
15044a2933Q996K462r73J0281L543O722K000j7424j2924J0156j540J911o029M718
15030a034R886q760j5211n40M907J545p854o191j257k618N864R294k383m04K577
$$ y = [2987, 11108, 12375, 20696, 23251, 24913, 20232, 9827, 16868, 18384, 3400, -19283, -33211, -16506, 4438, 7521, -2532, -390, 6426, 10980, 10681, 9291, 17620, 21868, 8752, 6997, 2651, -7948, -3209, 1485, -17653, -4745, -7322, -19999, -12672, -4016, -8477, -5995, -3992, 7840, 9117, 7297, 5981, 1155, 213, -6796, -15679, -13577, 3800, 11615, 13463, 5631, 4460, 6272, 4584, -7306, -18992, -12595, -5674, 4591, -7178, -21887, -32037, -25512, -32529, -28309, -17319, -9849, -15564, -10653, -15847, -2602, -7562, -15061, -7204, 5414, 2226, -5716, -13977, -21469, -16473, -15081, -12933, -3937, -1475, -2448, 7833, 11376, 18098, 20098, 2674, -10250, -94, -1634, 277, -5752, -1034, 8852, 92, -15119, -15659, -10752, -9207, -17061, -23252, -24509, -27127, -21263, -11969, -14352, -14756, -12179]
15015a2179J683n761N624j440J9983L627k2400j3965J564J5794Q239p52n784q473
15001a4240p767J5010M650L647m19l168n973o993l322J7876l543j7190o241L646
14987b4027j008R457m103o998J0229J3453O825M695k1150J484J5487l907m558
14974d121l922k399N052P288m125J0891L582k130k690j4733j15L172J5041m179
14960F612k2930L618P106k265k064J105L362k0957l532Q432P41J143J0240R42
14946h447J98R784L05n329n574k895J2123N381N548l354o993l331N870O672j2520
14931b562j3165J1380m279R257L205L010m121r591J6650R117k525L306j1359j1879
14917c556K914J3314j621j3405l581LQ393O907l067r722K50j0660o479J534Q783
$$ y = [-12179, -10496, -16257, -10633, -12073, 7910, 11537, -10863, -24828, -23264, -7470, 769, 17, -5767, -14240, -22007, -6997, -2347, 1300, 881, -2287, -8260, -15253, -18575, -699, -4242, -21432, -27673, -24027, -25035, -15578, -19681, -26679, -16450, -2997, 3828, 8523, -12627, -11143, 4344, 437, -4121, -8043, -10442, -5390, 1898, -2227, 8664, 12246, 10116, 7426, -7307, -7422, -4250, 10791, 6612, -16318, -12700, -5594, -7859, -9923, -8818, -5456, -26413, -29945, -21513, -20772, -19629, -9389, -8447, -8249, 1535, 1840, -3489, -9063, -11958, 165, 5546, 11094, 7740, 747, -2584, 3286, 9958, -2562, -15727, -4347, -8626, 631, 3836, 6846, 2725, -6866, 9784, 18901, 16376, 19682, 8323, -3556, -642, 12672, 11051, -2354, -5935, -5932, 2461, 9368, 6301, -3421, -3171, -13831, -20310, -18776, -9993]
14902i993p251j2837N907J9368N096n346k2925J3771J6470k484m2P806J1690p86
14888A8444q868k2447j1068P463J4994L512o889l18J416m907o429M966n326M544
14874a0913O302J2125J861j8518n860J5846M52o578M86O475o924m924J165j060
14860a0065p931n266R222J165j168O870j251k2806N710J5003J0786l405N943N290
14846H097K167j209k5149O673J1047l705M520K030j424k205L102L896N749O544
14832B0133k030M672J208L919O68r854k549N405p465j6028o694M769k362L460
14818b748J186J6215J3717q103r879O345k521L51O489j533j6118o955J8802l789
14804A1459k0372q729K0305q557j5194p738N612R28J0853K914J5408L029j3556
$$ y = [-9993, -17244, -30081, -24174, -4806, 290, -5056, -27981, -14210, 2260, -224, -266, 7540, 19230, 18444, 9576, -12871, -23939, -16476, -1482, 2030, -4859, -5177, -3761, -8668, -15097, -10131, -15457, -10913, -4611, 7514, 9375, -9143, -15003, 843, 1295, -5283, -4797, 1678, -5246, -10170, -9005, -10065, -17996, -23262, -14040, -12875, -14043, -7173, -8424, -31230, -25520, -10517, 269, -3136, 2807, 8097, 10264, 9055, -16094, -9421, 1626, -2079, 2441, 4471, 3047, 842, 3944, 7840, 13589, 20133, 18103, 22775, 23983, 27902, 28570, 18716, 16167, 21572, 14107, -1921, -8615, -3846, -6208, -2748, -1562, 14653, 28370, 20267, 10388, 16733, 14212, 14563, 21052, 19519, 3401, -3554, 15248, 11459, -8913, -17642, 2663, -5894, -21088, -28826, -23214, -22286, -11433, -8519, 6889, 9918, -3638]
14791c638j140J0115J576m320P65M720P24J429m105j4862J1611J3597J956n223
14777A3205j2343n661q854q889m393J0326P628m718Q730R976J7556J304j2855
14764A1012n179L164Q987Q190k542r357q693l19N384P093K313j5728Q948o151
14750G122q904P848M875j8499p690r42k789Q011J3347J2047J7563k317j5804q697
14736E171j3089q574J146R069M128p208J549J0838q10q649m519P19o430q555J3306
14721a1908K0131J2950m454j8746j1938J1764O76j2723J0164J590M560J0750m508
14708H308o584N137J3123L120j8612q163o861M301N638O725M983k825j9192r054
14694a9956p07N123L564J0790N171O802J5792j0620j4165P6j738J092j355o069
$$ y = [-3638, -4778, 5337, 6913, 2593, 3358, 8078, 8802, 10231, 6126, -8736, 2875, 16472, 18428, 13205, 862, -4799, -13653, -22542, -26935, -16609, -8981, -13699, -4969, 5007, 22563, 23867, 11012, 5833, 8997, 17984, 26174, 23632, 14275, 5582, 5263, 10647, 17740, 20053, 4325, 13273, 7122, -1782, 6066, 10941, -7558, -15248, -16190, -18979, -10968, 2379, 14426, 31989, 29672, 13868, 5171, -7918, -16492, -15346, -6277, -2149, -9357, -7808, 3030, 2220, -6429, -10948, -10229, -16659, -25214, -11908, 8223, 21173, 16719, -2027, -13965, -2201, -1525, -14248, -4084, -2494, 2066, 12816, 8308, 1724, 6861, 19984, 23104, 4492, -3671, -10532, -6231, -593, 6132, 11115, 8290, -10902, -19956, -20663, -15540, -11976, -1186, 3985, 10787, 26579, 15959, 1794, 1870, 132, 1224, -131, -6200]
14680f200n45p911K843Q184j4728L24k855j1339J0260O651J443P188K195m756
14666i246K995J0037R392p661r141m551m191j1318p478J3754J2285l113J8236
14653A0000O899r682n361k983l036N183K52q114m941n888L990J6233m058j0393
14639a1899L021J0326J0930m255L47q6k2598k328K4267J009l040k084L99k965
14625A044R215m168n727R750K368K020j0198P598J9431q51j3370r058j4096m304
14611a0346P692L151J3258M258j0083j5290o677j1666o682J3283K18j0557p077
14598c6518r276N023J9527P550m906J3173L653m456N676J6318L789q462m476j7521
14584a0906j5785K994O700M267p982J0148J0808o209j440o85J5463J423M266j4987
$$ y = [-6200, -6745, -14656, -11813, -3629, -18357, -18033, -20888, -32227, -21967, -15316, -13873, -6685, -4490, -9246, -6251, 3786, 13178, 5517, -3624, -8175, -12366, -23684, -31162, -17408, -5123, -8236, 10000, 16899, 7217, 1856, -1127, -4163, 1020, 1272, -6842, -11783, -17671, -13681, 2552, -1506, -11899, -8878, 1448, 12378, 8123, 8470, 8384, -14214, -16542, 7725, 8734, 5694, 3610, 4009, 1044, 10259, 6091, 364, 10114, 12482, 14502, 4304, 11902, 31333, 30482, 17112, 8054, -6042, -10346, -2654, 497, 13755, 18013, 7930, -7360, -14037, -25703, -32385, -19102, -18884, -29441, -36518, -45794, -40771, -21244, -13694, -18600, -5427, -1774, -6230, -554, 15764, 19553, 11091, 6615, -10906, -26691, -23697, -16997, -12730, -20712, -10564, 244, -5965, -7405, -8090, 7373, 8796, 13062, -1925]
14570a925j0444J0390P066N692K957q653N686J3383n154j3210k920j083m342J2156
14556I599l407j4857p185K436N014K489l961m789J0917J4392M83J021j427r470
14542A255J324L680P780n892m586r049N848J7248J517o079p636M210J038l524
14528G134J703n50n626j1310j0567J591J4761J3533M159L336J7252m575l0084
14515G57n516j625k349K104P376n763KK71P353Q456m163j4970k326P325J0133
14500G065l813N2n358n462L184J0355j370j1621o610q36Q122K342l082J7217j2799
14485b614J060n273K107M814k913k506r625n141R970O63j272j565m627M830N909
14470f183j6350p178q136P136J4442N360M015O478j3636M295j808P814J7128N161
$$ y = [-1925, -12369, -1979, 5087, 10779, 13736, 5083, 10769, 24152, 18998, 5788, 2868, 1785, -2557, 9599, 6192, -8665, -15850, -13414, -8400, -5911, -9872, -14661, -3744, 10648, 11131, 12152, 10725, 1255, 2579, 6259, 14039, 8147, 3561, -5488, 360, 17608, 19125, 13046, 5410, 9620, 10658, 7134, 8837, 8287, 2661, -8649, -19216, -17625, -2864, 10669, 14828, 18164, 35416, 30841, 757, -4759, -6384, -8733, -6629, 747, -5016, -5014, -4743, 2610, 11066, 6903, -8067, -10393, -3068, 7065, 3252, 3304, -2054, -7516, -4332, 6023, 4653, -6968, -13578, -14414, -6292, -3950, -7032, 10185, -2614, -1554, -6827, -4720, 94, -2819, -5325, -14950, -20091, -10121, -9458, -10730, -12295, -16922, -12092, -6183, -22533, -29711, -37847, -30711, -16269, -10909, -6894, -416, -14052, -9757, -11565, -3751, 13377, 18538]
14456A8538j4702j2442j1159J0219Q649J601l906q635n823K722O109k980o293
14443a8102j032N486J6199M946r470k024J934J079P971r190n62J2520J508o117
14429E146k6J4184p703k8872m779J069M957J7211k602N470L61q531j1609j662
14415a7386O540J6437K665j024P935j366j5414m192O199J3822M089n193j4998
14402a886m719P231o057J4234o320L644L438L02j1615l163J336q67J9410J2488
14388B7456j3336J94L813j1634n686R043R359N354j3114m624j0927n045P388n944
14374g703m572L367O029k69J1437K747L412q328R438j6918Q54N925p887M984k69
14359B247k74R959N275j0960j1775R011j5975m861M600J1824N616J450J995j0225
$$ y = [18538, 3836, -8606, -19765, -9546, -897, 704, -3202, -11837, -17660, -14938, -8829, -11809, -18102, -19134, -13648, 2551, 7497, -1973, -3997, -2063, -984, 6987, -2203, -2765, 9755, 11263, 5146, 5120, 19304, 11601, -17271, -22050, -20981, -16024, 1187, -1415, 4055, 4416, -4115, -15724, -17386, -10846, 5591, 8256, 7232, 15167, 13801, -1613, -5805, 394, 14216, 18305, 13112, -1886, -6605, 626, -5431, 8803, 2483, 6127, 9565, 9867, -1748, -4911, -3575, -4442, 14968, 27456, 14120, 14314, 18127, 6493, 807, 9850, 19209, 24563, 11449, 6825, -4102, -9147, -1759, -7703, -12275, -8908, -2879, -3148, 8289, 11036, 14448, 6120, 15558, -1360, -506, 5419, -2468, 2516, 2247, 1973, 11932, 17207, 6247, -5528, 3483, -12492, -17353, -12753, -929, 4687, 6137, 8132, -2093]
14345b093o740P196j2366l142j2356N996M902J3911J013p625K633j2605R26J4137
14331f213Q462p292R588M279n032n624q676K464R381J8794L827M55o64j2966k6896
14316a6113q968O056Q753Q783N295k743l719J220M274j4627j4390P102J6284k329
14302e122q907j196N046J0445J297J409k950j5007Q950J7857o170j2952K995r023
14288a3328m736m9o948l533J0138N797J0656m571p702M980l752P995L1R469m545
14273i8O374K0154j410k4265k2760J1178M196j078R292o169J688J0259O749l368
14259A0742j6432k0072m03Q975K2678O117M589j4739n813j2793J659J0652N286
14246D46j214L05P571n366l0198j5706K555J2957J4737k339j0345L4J5633J7181
$$ y = [-2093, -8833, -1637, -14003, -17145, -29501, -23505, -18603, -4692, -3679, -11304, -8671, -21276, -20350, -6213, 2249, -5043, 4545, 8824, 3792, -1832, -10508, -8044, 1337, 20131, 23958, 24413, 23749, 10783, -16113, -25081, -19025, -10272, -1489, 3806, 1063, -2656, -1436, 2838, -11789, -26179, -19077, -2793, -5122, -14029, -15225, -10179, 266, 1563, 2972, 22, -14985, -6035, 11822, 5652, -7300, -4305, -13328, -18064, -18113, -25061, -28594, -18456, -12659, -2003, -6574, -14276, -9296, -13048, -5053, -5022, 4447, -98, 6276, 26430, 25020, 755, -22005, -10827, -6631, -7709, 1583, -4586, -2898, 7361, 14110, 10742, -5690, -25762, -26165, -17190, 5488, 11605, 16194, 1455, -4358, -17151, -15492, -4840, 446, -768, -463, 7108, 1742, -28456, -44162, -41607, -28650, -13913, -16252, -26597, -26563, -10930, 6251]
14232F251M602q605q868j3244J797K9474J3844j7253o017N180L17n709r158N594
14218a795L99L163K16K768Q187N902l694j2066l607j0576l110L963J6251L507
14204I508o872r721m392M308J9472K916K39j5531j196K442J3841j0143j9257P275
14190g111M141J8578Q709O173O117o653P892N531k0270j3420j1989o916j3155
14177b2373J0883R539J4952R936l734j0762j3220m027L670J2361J0613Q33L533
14164B2204p809o643M91l30J4241n341k5465L056N493N301r583j449O648J593
14150B407o220n19J7222J538m29P743P914q995j2772n086j3637M248K705J2567
14136H686R412l97m182l686k435j6798j3116J6527P109o682N849j434P9j0373
$$ y = [6251, 10853, 2248, -6620, -19864, -18067, 11407, 25251, 7998, 1981, 7161, 7478, 1769, -7389, -1795, -1396, 1767, 1983, 4751, 12938, 18840, 15146, 3080, -527, -11103, -14213, -10250, 6001, 9508, 2636, -7085, -11477, -7169, 12303, 15219, 15458, -73, -1269, 1173, 15014, 4871, -14386, -7111, -2970, 15608, 24317, 30490, 36607, 29954, 37846, 43377, 23107, 9687, -2302, -9218, -22373, -11490, -1951, 13001, 22937, 19203, 8441, -4779, -8806, -5136, 7225, 17838, 18671, 22204, 14395, 7752, 8243, 7913, 22154, 16813, -8652, -5596, -103, 5198, -4385, -5834, 814, 2407, -3813, -4332, 12890, 14428, 13999, 21742, 29656, 20661, 7889, 2803, -10834, -6586, -3881, 8686, 18098, 17701, 13519, 9833, 7398, -9400, -22516, -5989, 1120, -5562, 287, -1147, -1068, -11441]
14122a1441P289K828M789k730l784j215r562J0523R631J4319j958r874l15R000
14108A7500M168l607L161l434j9016l730J2301J2439L229j5613M408N999O38n616
14094A2827m620M049q342P853p94j4321N114n244j787J773M935j140J1931M736
14080A6970j1391Q852j322k423N635m291j0468j18P746M075o446k525Q593l289
14066I598Q459j4667o959j241j246K034L460j1168j211L163K195J1669l803J582
14052A865k825n619N236j36j1742R61R769J7284j0077R26j4044k451P16L353q898
14037a5682K129J3983p877M635R858j943o133M339P141o864l865K478L833j560
14023D472r718q475m630J6138j743j4249m153J0518J9395N659q647r091M006M119
$$ y = [-11441, -4152, -1324, 3465, 735, -3049, -4264, -13826, -3303, 6328, 20647, 18689, 8815, 8500, 17500, 21668, 18061, 21222, 17788, -1228, -4958, 7343, 19782, 23011, 7398, 11806, 17805, 18443, 12827, 8207, 12256, 3914, 11767, 10973, -3348, 1766, -3478, -5265, -3492, 1443, 303, 12234, 16970, 5579, 14431, 13109, 10686, 16321, 12030, 1562, 1444, 9190, 13265, 6819, 4294, 12887, 9598, 18057, 3390, -3569, -4810, -6056, -4022, -562, -11730, -12941, -9778, -7583, 4086, 283, 1865, -960, -6579, -1343, -1479, -13221, -12260, -2491, 14793, 4716, 5642, -8402, -10853, -10137, -6784, -15682, -13553, 430, -7447, -2812, 7046, 5103, -1030, 3309, 10450, 3586, -279, 2199, 6032, 4472, -5246, -13721, -18351, -2213, -3956, -18205, -22358, -11840, 7555, 13214, 4567, -4524, -518, 3601]
14009C601Q301m371Q868N837j0115n377O194K634l018J298k998j1058J316J1093
13995A2205J8689j3799j4232j1830j428Q394Q177j0079M4J382J2523P687R935
13982B7668j5501p965o711q896o347j119K0207K639J063j276L619K104Q477M498
13968B2460p50N002J111j2044n564P801J0631j1401q408o848j2375j799M252l615
13954a1547Q312J7443K053j2004J2182p059q471R237l780p064O153N919R25N051
13940A7350P413J918m910L956n386k2866r160J3283K2436O665p677k9372j2889
13927a9239O61K238r772j7L893O618K91N541r75R039O131n942j2619L9L464J0008
13911f41M957j687k125L938O035R945o462l880k359q681j29M371l293R078o457
$$ y = [3601, 11902, 7531, 16399, 22236, 12121, 6744, 12938, 15572, 12554, 13852, 10854, -204, 1112, 12205, 30894, 17095, 2863, -8967, -10395, -2001, 6176, -3903, -3859, -2477, 10046, 17733, 27668, 12167, 4202, -2509, -11405, -17752, -18871, 1336, 3975, 5038, 3762, 7381, 9485, 17962, 22460, 21710, 26712, 27823, 15779, 10215, 18016, 28647, 17246, 8838, 1990, -10385, -12184, -7932, -11547, -3235, 14208, 16261, 4257, 16439, 9380, 909, 10146, 6366, -698, 5455, 11374, 12299, 17350, 24763, 26681, 21771, 25727, 20341, -2525, -11685, 1598, 24034, 30699, 23022, -6350, -19239, -18578, -16340, -26112, -26129, -22236, -15618, -15327, -9786, -10761, -1722, 4409, -1533, -14152, -14113, -10649, -641, 4316, 2629, 504, 4442, 10477, 20422, 13960, 10080, 7721, -960, -1089, 3282, -11, 9067, 2610]
13896B610J2536K2163j4600l356r413p352r811l082K511Q502Q270L749m723o514
13882A490P03q464K187m718O44L568R185k082m331j2639O338Q993l86j967K958
13867A479m518j0297j3830J265l220P592J8478j0559j2854k105J6676K0546q267
13854C86L679o88K116J0424k554j2991L93j95J4791j515p977m867j7778J336K309
13839a3131m165J0564J9258j917o79N823k83j0821J1187l555l649n84l730k697
13825A621j365J949J0217j090l02j165j860m029k315l172nK3381O670J415j74
13810B9776j1310Q00J6391j861r770m31j224L77k453j0523Q853n591n232n49O119
13795A3372j0181n014q951j00J3826j261J0425P780j2831p702M390l217J993J4706
$$ y = [2610, 15146, 37309, 22709, 19353, 9940, 2588, -7223, -10305, -7794, 708, 8978, 12727, 8004, 1490, 2193, -6271, -4084, -8802, -8158, -4590, 4595, 2513, -1818, -14457, -8119, 874, 488, -1479, 1479, -3039, -13336, -27166, -25901, -29121, -21529, -3051, -13610, -26464, -28569, -11893, 8653, 386, 4065, 3377, 5493, 15917, 13363, 372, 765, 570, 15361, 13846, 5869, 1002, -16776, -15440, -13131, -17296, -6732, 12526, 10609, 9930, 15753, 15470, 4649, 15836, 12281, 8632, 8048, 4318, 1621, 256, 2205, 12422, 11332, 11030, 9865, 8005, 3976, 1661, -1511, -1516, 21865, 28535, 29950, 29776, 18466, 19266, 35657, 33796, 24026, 23595, 22371, 22748, 20295, 9772, 18625, 13034, 7802, 7253, 13372, 3191, -1823, -10774, -10874, 2952, 1691, 12116, 19896, 7065, -637, 3753, 536, 2529, 17235]
13781A7235R623m81J733N964M338N965k1114m426Q722J051K747j4049j845J5710
13767C1173j2n514O06j0967K170J801j1607p493L77J1558R386J1718M274k933
13753C4537k909j0264k779k239o420P287J0653J6925j0549j3178K424r176m795
13740I517l727N879L431p510j1296p692o819P656J4877J0067j596K863J0413O490
13726C2553O565p016j9506l461k7094k250O361P437Q006k57m70l066J1740Q06
13712A0348j0397J3136J0105N044P037p782j8525j0318K225J231M884J0364J1467
13699B8819J9744J6293n010j3939j2707p669l009k76j635K003j0377N464j304
13686A6397j5918k0534J3474J2964o072J754Q513R600j797j0989o407k75M377
$$ y = [17235, 26858, 26377, 28110, 34074, 38412, 44377, 23263, 18837, 27559, 28610, 31357, 17308, 15463, 31173, 31161, 25647, 26253, 15286, 17456, 19257, 7650, 157, 534, 12092, 21478, 33196, 37470, 34537, 31628, 21364, 18585, 16346, 9926, 17213, 27866, 44791, 34242, 21064, 23488, 14312, 9517, 5790, 11669, 15100, 7590, -3706, -11398, -18217, -10561, 4316, 14383, 12787, 15650, 26063, 32553, 39118, 32102, 12596, 9135, -17959, -20209, -13848, -6411, 1595, 1338, 868, -2198, 9542, 10348, -49, 13087, 23192, 28236, 35273, 27491, 8966, -1352, 873, 2104, 6988, 17352, 28819, 48563, 64856, 59846, 45907, 33200, 25531, 22522, 22246, 20611, 22614, 12237, 17701, 16397, 479, -20055, -6581, 6383, 311, 2065, 10578, 20178, 18381, 7392, 985, 710, 5087]
13673E087k5640N243J4350Q500j6365j263j436J6958K4218J221j323j3010Q678
13660B5218j0821o960R343k416q598k467j731r36J938O884M536j8117m677K1246
13646A2442N790j1138m480o5l637J5517J5336j1688j0936m005j1827l859k68o016
13632a8834Q790K6691O490p828p964Q145p903K809P852r399j8934L680Q506Q423
13618A0524k885j273J6524M575j0112r70K154m511J2974q165O188N109L344P767
13604D1243M742L21j7542q844r558K938l805p39j490n784j096N460P32q379l970
13589e771O771O74j093N88J5513O747j0265J3057O646j4830j6843M728L186n117
13575C991Q129J652m729N300N742q465j8614o788J1267J2390K100M280j2777o864
$$ y = [5087, -20553, -15310, -960, 7540, -8825, -10088, -11524, 5434, 29652, 30873, 29550, 16540, 25218, 14397, 7437, 16780, 14364, 5766, 3299, 1568, 632, 2570, 9454, 13990, -4127, -8804, 12442, 18232, 7094, 2614, 2549, -1088, 14429, 29765, 18077, 7141, 3136, -8691, -12550, -12818, -18834, -10044, 16647, 23137, 15309, 7345, 15490, 7587, 10396, 18248, 8849, -10085, -6405, 2101, 10524, 7639, 6366, 22890, 27465, 17353, 16383, 18537, 14026, 27000, 18835, 25023, 30132, 33476, 41243, 45985, 46306, 28764, 19920, 10362, 13300, 9495, 8756, 7266, 1482, 386, 5846, 6578, -1801, -5771, 1000, 1674, 581, 1169, 16682, 23429, 13164, 26221, 32867, 18037, 1194, 5922, 9108, 3991, 12120, 13772, 9043, 14343, 20085, 11620, -6994, -13782, -2515, 9875, 11975, 16255, 3478, -3386]
13561c386n092J4781R476J0646j568J350m936j0375j0229l786R538N026Q574k128
13547A7891n132J2198L011O083k309j8844j3658r445N958N768j3227J0541J3194
13534A2029k555J4675P59J637N115M512m992j6021J48L396J0382n609j4434P946
13520A6988K4458L776r884l375j0346q307M72L677q08l952n921K62O394J5O297
13505A9746J1430L54K804J222j1343L182J7434m929j669O18j4553n174p256K574
13491A4440p870l878M214l54K836J1779J0955J507O001m418j1120P595j2667n765
13477A3255Q658L224o780J76J345q107j530o737O628k223j6390n09l02K1182Q578
13462B0468q090m550m066P33Q117J3302j4833j3960J7414J8947n285j5711j639
$$ y = [-3386, -8478, 6303, 15779, 26425, 24857, 26207, 21271, 10896, 667, -3119, 6419, 11445, 20019, 17891, 12759, 24957, 27968, 34051, 31742, 12898, -760, -10205, -4247, 1521, -11706, -1165, 12029, 9474, 24149, 24908, 26545, 31660, 36172, 31180, 15159, 15307, 18703, 29085, 23476, 9042, 16988, 41446, 45222, 35338, 31963, 21617, 13310, 13782, 17459, 16651, 12699, 6778, 7040, 13434, 13449, 19746, 31176, 31530, 34334, 35556, 24213, 27395, 44829, 39900, 38231, 38849, 24296, 19122, 11866, 14440, 6570, 2692, 6906, 6552, 9388, 21167, 32122, 33629, 39630, 35212, 24092, 31687, 19020, 13255, 21913, 25137, 18357, 18533, 19878, 11771, 10241, 3504, 10132, 7909, -8481, -8990, -9292, 11890, 20468, 12378, 7828, 3762, 4495, 12612, 25914, 11081, -2879, 14535, 33482, 28197, 12486, 10847]
13449A0847J0575K475j1168N353n138q799P634M926N466o791o141J3503Q323j1134
13435A9931J2505j3550j2171q113J977j33k996Q01P861L966l367k953J3061N499
13421B2318N143K948j0840j2472O98J1170K0069J3043p364k6024k0374j0279J501
13408a0463L442L121J1894J6313m729J179l943O438m656p842Q335K2970N160j4621
13394C2598q903K649J3469J0361m134j0852M12k304j5322O649R175j6904Q944
13381B5838q945K236Q740p987l861l345J031k893K235Q892k79O386K4570L07k1918
13366C1007j1863N031M857o197p998K708L261J0576J4646j4672k5081R401J8727
13353C4403P789o109J3208R106k4485j2476p83l909N202Q190l868k397J0352M324
$$ y = [10847, 21422, 23897, 12729, 18082, 12944, 4145, 11779, 16705, 22171, 15380, 9239, 22742, 31065, 19931, 32436, 18886, 6715, -1398, 579, 446, -2550, -1749, 6112, 10078, 6711, 3758, 16819, 22318, 27461, 30409, 19569, 7097, 7795, 18965, 39034, 52077, 44713, 18689, -1685, -11964, -10463, -7021, -3900, 7994, 24307, 19578, 20757, 16814, 23252, 18596, 10754, 19089, 42059, 47219, 32598, 23695, 26344, 39813, 50174, 46040, 35188, 35600, 33296, 17974, 24623, 33798, 16894, 25838, 16893, 19129, 27869, 19882, 16021, 12676, 13707, 10814, 13049, 21941, 21662, 28048, 52618, 52925, 31007, 19144, 24175, 29032, 22835, 14837, 17545, 20806, 31382, 46028, 31356, 6275, 15676, 34403, 42192, 36083, 49291, 58397, 33912, 21436, 20653, 16744, 21946, 30136, 26268, 23871, 34223, 38547]
13339C8547N181Q071k624q336l294k416p600J2869J1597j1665q674R672N356M343
13325E1027o851n576j558k037J889P359N905Q691j8230r503O229J0143l671N444
13311D9261m0j740p407Q11J0554j960q457L41L457n336l704k370m129K686J790
13296C3757n272K560m770Q596k904P212l262J2690J3454j8585O06Q290L316L783
13282E9471j5748J728J2704r733j0163M275k548j207n56R511L937m920k121K056
13268D6686M587K638M520m470L104L305j153j3659p912J619J4981q241j7920k940
13254B5145l980l560J1234O244O646j4211j2391J6053M028J2499M445o327l14
13241D5511P091l521L407K405R523q341j3478j434J5292J5183K422j8525k940
$$ y = [38547, 43728, 51799, 49175, 40839, 37545, 35129, 27529, 40398, 51995, 40330, 31656, 41328, 46684, 51027, 44176, 38600, 37042, 35005, 36894, 44253, 50158, 58849, 40619, 31116, 37345, 47488, 43817, 49261, 49221, 47481, 40074, 40885, 51439, 49479, 41022, 41363, 44820, 39484, 35780, 33410, 29281, 31967, 33757, 28485, 31045, 26275, 34871, 31967, 39179, 35917, 48607, 62061, 43476, 44082, 52372, 55688, 59471, 43723, 45451, 58155, 48422, 38259, 42534, 39986, 38779, 38223, 47734, 51671, 46751, 44630, 46686, 51273, 53911, 58431, 53961, 57065, 60370, 59217, 45558, 37646, 39265, 54246, 46005, 28085, 25145, 21165, 17605, 28839, 35083, 41729, 27518, 15127, 31180, 35208, 47707, 52152, 45825, 45511, 52602, 49081, 52488, 54893, 64416, 56075, 42597, 41163, 56455, 71638, 74060, 55535, 52595]
13228E2595L022q349L348N019l852O810k3866J488N047J7471J3619j907J9069
13215H9514L395q081N515J570j7492j2446L104j007N950j2008k481J0031j1894
13202E3670m081K1637N433j0274j1693n62Q602K079J1766J1942N866j1241p521
13189G5623K109m112j4635j301L143k919O12J1881k08l571q33J8578K0655L404
13175A08426o725p769j4986N811J356Q773l206Q318J2622K0388O807o118j5480
13162A18217j5725m193K6143r525p531Q666K072k044Q073l322m347Q508J1437
13149A36429K1418p894J5424K787m509j7690j8769P790M433j111k116K798M484
13136A43474l064k362j9272P48p656J5601J4158K923n961j5696N74J959L13r005
$$ y = [52595, 55617, 47268, 50616, 55635, 51783, 58593, 34727, 36215, 41262, 58733, 72352, 70445, 89514, 92909, 84828, 90343, 91913, 74421, 61975, 65079, 64072, 70022, 58014, 55533, 65564, 53670, 49589, 71226, 76659, 66385, 54692, 54130, 62732, 64811, 76577, 88519, 94385, 83144, 75623, 77732, 73620, 58985, 57684, 60827, 57908, 58520, 70401, 70193, 66622, 65789, 84367, 105022, 108426, 101701, 93932, 78946, 84757, 86113, 94886, 91680, 99998, 112620, 133008, 139815, 133697, 118217, 102492, 98299, 124442, 114917, 107386, 116052, 118124, 116080, 124153, 120831, 116484, 124992, 136429, 157847, 149953, 165377, 168164, 163655, 145965, 127196, 134986, 139419, 138308, 136192, 138990, 143474, 140410, 138048, 118776, 119524, 111868, 127469, 141627, 144550, 138589, 122893, 123467, 125426, 125739, 116734]
13122A16734k507M198R657J2483m36j0253j2310O899Q580l506J3926j10M885J544
13108A49784J4006L984L008o899o274M658K344K638L924M69j462k375l683R616
13094A73738m80Q859p213l456r68o270M930O668o763J061K739M816K0j461N891
13079A82111L310J1543L03Q660K768j8475K789n74q516r59j995J264K4452J4121
13065B20802Q410m207o223J8029k533j0554L566j208l008q054K491J7021K0522
13052B55054m254k5249k91J3142J4001K1955Q455q222J2546K771j657R796K363
13039C00410n43J0400Q962K453M577N140j0806J3587M477J1326J8835M974r834
13026C63958J170Q421K7502R587m542J082J3111Q508J4034R137J110j0247k195
$$ y = [116734, 114227, 118425, 128082, 140565, 140129, 129876, 117566, 124465, 133045, 129539, 143465, 143355, 148240, 149784, 163790, 167774, 170782, 163883, 157609, 162267, 164611, 167249, 171173, 171642, 170180, 167805, 164122, 173738, 173258, 182117, 174904, 171448, 170480, 164210, 169140, 175808, 169045, 170106, 172845, 177661, 177681, 176220, 182111, 185421, 196964, 197267, 205927, 208695, 190220, 193009, 192435, 183919, 182960, 180965, 182229, 206681, 220802, 229212, 225005, 218782, 236811, 234278, 223724, 227290, 226082, 223074, 215020, 217511, 234532, 255054, 250800, 225551, 225260, 238402, 252403, 274358, 282813, 274591, 287137, 289908, 288251, 298047, 300410, 299867, 310267, 319229, 321682, 326259, 331399, 320593, 334180, 338657, 349983, 368818, 373792, 363958, 365128, 373549, 401051, 410638, 406096, 407178, 420289, 428797, 442831, 451968, 453078, 442831, 440636]
13013D40636J2374J3264J3642O293J5340J6206l547r531m823K5881K7563R054
13001E62352N686J3335J5578O634L345P665J7691J1857J4589K5119J1099J3241
12989G08191L6558J0872M684O923K178K9469L6091J9172K0904J1745K3746J4399
12977I24932J9792L2031L7162J4746K9337K4031J9406L0329J3640K7701N0600
12966A223707M2263L5330L2208N1642L8381K1223K6308M8698O5453O0972M9174
12955A695359M5898N2022O9709N9441N2707P4555P1201O8860Q3184R8582R6772
12944B468290Q6696R2724R4066R8220R8564J25227J26567J25803J22456J42474
12934C581087J48569J40995J49148J57617J61779J70947J70023J71087J94320
$$ y = [440636, 453010, 466274, 479916, 486209, 501549, 517755, 514208, 504677, 499854, 525735, 553298, 562352, 568038, 581373, 596951, 603585, 606930, 614595, 632286, 644143, 658732, 683851, 694950, 708191, 744749, 755621, 760305, 767228, 769406, 798875, 834966, 854138, 875042, 886787, 910533, 924932, 944724, 976755, 1013917, 1028663, 1058000, 1082031, 1101437, 1131766, 1145406, 1173107, 1223707, 1265970, 1301300, 1333508, 1385150, 1423531, 1444754, 1471062, 1519760, 1585213, 1646185, 1695359, 1741257, 1793279, 1862988, 1922429, 1975136, 2049691, 2120892, 2189752, 2272936, 2371518, 2468290, 2554986, 2647710, 2741776, 2839996, 2938560, 3063787, 3190354, 3316157, 3438613, 3581087, 3729656, 3870651, 4019799, 4177416, 4339195, 4510142, 4680165, 4851252, 5045572]
12925E045572J98307J92233K02208K05542K10944K04923J99196K00026J95988
12916F854939K17412K11284J85150J78837J63788J46383J23102J03736P9677O1085
12906H325393M4788L7662O389l0681m5260o0206r6981j16341j31112j56949j61819
12895G614883j58517j76228k05728k11782j88475j89746k03418k04050k26629
12886E850310k09182j84751j88819k01282j80917j62443j65333j80679j58457
12877D218447j46368j53741j32519j40169j44157j17542j10358j08646j30578
12868C034369j04441j10808r3483q4381r3923q2195p9385n9169q0664q2092n6589
12857B107239o9659p5252o7513n2722n4236n0159m5089m7509m9683n2022l6717
$$ y = [5045572, 5243879, 5436112, 5638320, 5843862, 6054806, 6259729, 6458925, 6658951, 6854939, 7072351, 7283635, 7468785, 7647622, 7811410, 7957793, 8080895, 8184631, 8264308, 8325393, 8370181, 8407843, 8414232, 8383551, 8338291, 8278085, 8181104, 8064763, 7933651, 7776702, 7614883, 7456366, 7280138, 7074410, 6862628, 6674153, 6484407, 6280989, 6076939, 5850310, 5641128, 5456377, 5267558, 5066276, 4885359, 4722916, 4557583, 4376904, 4218447, 4072079, 3918338, 3785819, 3645650, 3501493, 3383951, 3273593, 3164947, 3034369, 2929928, 2819120, 2725637, 2641256, 2547333, 2465138, 2385753, 2326584, 2245920, 2163828, 2107239, 2037580, 1962328, 1894815, 1842093, 1787857, 1737698, 1692609, 1645100, 1595417, 1543395, 1506678]
12846A506678m3783m2996m1778l5804l7203l4536j7995k4682l8069l2625l6292
12835A120915l7172l2724j7173j5186k0191p962j2203k5820k1639q931j712j6077
12823I04125j9999j8643j1963l6810k7074k2702j0739k4106p698L425j5418j4792
12811F97606j9461p412k1657j3866l153q092r039j946r745k4345j5273r783J829
12798E55663n621j0417j580L793j1447j6476j2029J953J4320j6665j7661j9280
12786D64553k0511M585M809k137j2667N97j6192n494J4025M196j5808r309M504
12773D15151q973j8483j1072J278Q737o272k2982p866J4312r449l858L333J1024
12760C64880M518l289j8440j1310J527J726J2942j7391j5262m875p593j721k030
$$ y = [1506678, 1462895, 1419899, 1378121, 1342317, 1305114, 1270578, 1252583, 1227901, 1189832, 1157207, 1120915, 1083743, 1051019, 1033846, 1018660, 998469, 990507, 978304, 952484, 930845, 921914, 920202, 904125, 884126, 865483, 853520, 816710, 789636, 766934, 756195, 732089, 724391, 727816, 712398, 697606, 678145, 670733, 649076, 635210, 632057, 623965, 614926, 612980, 603235, 578890, 563617, 553834, 555663, 550042, 539625, 538045, 541838, 530391, 513915, 501886, 503839, 518159, 501494, 483833, 464553, 444042, 448627, 453436, 451299, 438632, 439229, 423037, 417543, 431568, 435764, 419956, 410647, 415151, 406178, 387695, 376623, 377901, 386638, 380366, 357384, 349518, 363830, 354381, 350523, 353856, 364880, 369398, 366109, 347669, 336359, 337886, 339612, 352554, 335163, 319901, 315026, 307433, 305712, 303682]
12747C03682N165J0315p71j1854K096J5739L79j6640J2006r4j7677j8347p896
12734B76103l736m618J258N808J2923j39l336o370J1659l985O139m322k982O580
12720B90982L149J764j2014o19K861n312j512q134n384q741j557J3941j744n375
12706B62305R83L100p749M440M403N050O485o8m539m608q49P086r248j7086j0093
12691B39612l019K631P785k720K134J0105J9749k187m603N089k919o527j4290
12678B50840m766j0165J3705K67j9668P204J4993J097J2552R406j093j8690L816
12665B59498o305Q40m516j0390P463J0748J3371K715J617j8405j419M799O004
12652B66020j1537j8282O840o691m477J5016M643o696j6186M86J4751m088k0738
$$ y = [303682, 308847, 319162, 318391, 306537, 308633, 324372, 324751, 308111, 320117, 320023, 302346, 283999, 276103, 272367, 267749, 269007, 274815, 287738, 287599, 284263, 277893, 289552, 285567, 291706, 287384, 284402, 290982, 294131, 295895, 283881, 283262, 286123, 280811, 279299, 271165, 265781, 257040, 255483, 269424, 267680, 262305, 263288, 266388, 258639, 263079, 267482, 272532, 279017, 278949, 274410, 269802, 268953, 276039, 266791, 249705, 239612, 236593, 239224, 247009, 244289, 246423, 256528, 276277, 274090, 269487, 274576, 271657, 265130, 250840, 246074, 235909, 249614, 249881, 230213, 237417, 252410, 253507, 266059, 275465, 274372, 255682, 259498, 253193, 254033, 249517, 239127, 246590, 257338, 270709, 273424, 275041, 256636, 255217, 260016, 266020, 254483, 236201, 243041, 236350, 231873, 246889, 251532, 244836, 228650, 229136, 243887, 239799, 219061]
12639B19061j2194o82k713p457j0250q997l812N121J892J0470J1948j464p28j0030
12625A90165o919M036J5334M113p66p884M662K729q501j7912r356Q149J1136R753
12611A98739q675K102j914J1431J6610M721j3710M603j2530K12M858k350M928
12598B09025q226j9J175m357p387k788Q473K5595O884P453l496j4692K60Q744
12584B26644J0180O779Q614J6992p910N959J6833R597J3592P427J2562J1303R860
12571C48432k0653r726k3261j7755j2074j2670J29K576K102j4909j0638P646k24
12558B38975j05P753J6062j0020l344j159J7339J6323N335j7643j9371P837J4957
12545B72939K8016Q258j4225R14J0172L2933J6477K8381Q199J7268K7618K0798
$$ y = [219061, 206867, 206185, 203472, 196015, 185765, 176768, 172956, 178077, 179969, 190439, 202387, 200923, 200195, 190165, 183246, 187282, 202616, 206729, 205963, 198079, 202741, 205470, 196969, 179057, 169701, 177850, 188986, 198739, 190064, 192166, 190252, 201683, 218293, 223014, 209304, 213907, 201377, 201589, 206447, 204097, 209025, 200799, 200780, 201955, 197598, 190211, 187423, 195896, 221491, 228375, 235828, 232332, 217640, 217900, 226644, 236824, 243603, 252217, 269209, 261299, 267258, 284091, 293688, 307280, 314707, 327269, 338572, 348432, 327779, 318053, 294792, 277037, 264963, 252293, 252422, 254998, 257100, 242191, 231553, 239199, 238975, 238870, 246623, 262685, 252665, 249321, 248162, 265501, 281824, 287159, 269516, 250145, 257982, 272939, 300955, 309213, 294988, 295902, 306074, 339007, 355484, 383865, 392064, 409332, 436950, 457748]
12533D57748K4846K3790M1017M8198K3666N673M095q547k1681l8094l5469l6369
12521D88873l3471k3989l3322k3237r800q809j4401o241J935P511l011k0991k0653
12508C00394J2471Q990p702j667Q645J1680L328K963q499K356r807N93J2600J4690
12494C51035K1239K0677J1909K4559L0035L3711L8194M2809M1662K6232J2551
12483F54613K013K752m655l8822m2324k7225k1123l4272k5039k2463j5409o5m333
12470D23648N213M500j8351j5403j2105o05l090j6676q19O55p975j773J6372J1670
12456C85261o926Q416J834p240K878J4467J3256k15N19L1783J1470J848P751J9667
12442D84769K1395J6805K8304K3278J932J788n263j2484j5014j1553j1993j7340
$$ y = [457748, 482594, 506384, 547401, 595599, 619265, 624938, 629033, 620486, 598805, 560711, 525242, 488873, 455402, 431413, 398091, 374854, 365054, 356245, 341844, 335603, 337538, 345049, 342038, 321047, 300394, 312865, 321855, 314153, 312486, 321131, 332811, 336139, 339102, 330603, 332959, 323152, 323745, 336345, 351035, 372274, 392951, 404860, 429419, 459454, 493165, 531359, 574168, 615830, 642062, 654613, 656626, 659378, 654723, 615901, 573577, 546352, 525229, 490957, 465918, 443455, 428046, 427981, 423648, 428861, 433361, 415010, 399607, 387502, 386897, 383807, 367131, 366312, 366967, 358992, 357219, 373591, 385261, 378335, 386751, 388585, 381345, 384223, 398690, 411946, 411731, 412250, 444033, 455503, 457351, 465102, 484769, 506164, 522969, 551273, 574551, 576483, 578271, 573008, 560524, 545510, 533957, 521964, 504624]
12430E04624K079Q0J2006L014p672J7997o166j0115P047N087J669j755J2021J8143
12416E58059j0646q04j0487j977J6612K1979J2134J9606J5758J757k930K068J1146
12403F32275o68m6O678R00L226J6104K2269Q185J8046J1215K1958M323n79L402
12389G47288o596J4647J4641J2571Q825M19J4344K3013J2987J0270q263J702J8163
12376H64011K9885K0279J6980K7991J6043R199K0797J8985J8156J3073J7120L3970
12364A106489J7853p538J616K1793L1269R925J9487L4277L2582K1527J7437L6031
12352A342748J9678K6732K8614L7536L6302K3352K6814L2425L9072M1905M6595
12341A701773L8360K0449K5401M9850L7356M0999O1441M8997L6425N6820O2541
$$ y = [504624, 506703, 506783, 518789, 521803, 514131, 532128, 525962, 515847, 522894, 527981, 529650, 527895, 539916, 558059, 547413, 546609, 536122, 534145, 550757, 572736, 584870, 604476, 620234, 621991, 619061, 621129, 632275, 631607, 631561, 638239, 639139, 642365, 658469, 680738, 688923, 706969, 718184, 740142, 744465, 743886, 747288, 740692, 755339, 769980, 782551, 791376, 791795, 806139, 829152, 842139, 852409, 844146, 845848, 864011, 893896, 914175, 931155, 959146, 975189, 984388, 1005185, 1024170, 1042326, 1055399, 1072519, 1106489, 1124342, 1116804, 1118420, 1140213, 1171482, 1181407, 1200894, 1235171, 1267753, 1289280, 1306717, 1342748, 1362426, 1389158, 1417772, 1455308, 1491610, 1514962, 1541776, 1574201, 1613273, 1655178, 1701773, 1740133, 1760582, 1785983, 1835833, 1873189, 1914188, 1975629, 2024626, 2061051, 2117871, 2180412]
12330B180412L8047M8554N6229N7641O2993P9289O7743O0870O2791P0623Q8214
12319B873406P9138P1355R4155R0433P3524R2221J19619J05513R6199J17906J04829
12308C918298P9562R0322J30547J43516J42324J25181J33803J37564J42348J36472
12298E179937J36590J47537J31491J42245J53927J50347J59863J59509J60866
12289F522312J40839J47609J33782J29765J31923J31165J39320J23849J27747
12280G728311J23374R5856J00898J14891J09801J24886J09829J02314J03385J01184
12270H814729J03673R3914P4790P0434O7242R0232P3551N5930M5166M3977M7891
12259I581529K6100J0546J3495J1059J7491J2810R524J3442J5018k806j2625j4114
$$ y = [2180412, 2218459, 2267013, 2323242, 2380883, 2443876, 2523165, 2590908, 2651778, 2714569, 2785192, 2873406, 2952544, 3023899, 3118054, 3208487, 3282011, 3374232, 3493851, 3599364, 3695563, 3813469, 3918298, 3997860, 4088182, 4218729, 4362245, 4504569, 4629750, 4763553, 4901117, 5043465, 5179937, 5316527, 5464064, 5595555, 5737800, 5891727, 6042074, 6201937, 6361446, 6522312, 6663151, 6810760, 6944542, 7074307, 7206230, 7337395, 7476715, 7600564, 7728311, 7851685, 7947541, 8048439, 8163330, 8273131, 8398017, 8507846, 8610160, 8713545, 8814729, 8918402, 9012316, 9087106, 9157540, 9224782, 9315014, 9388565, 9444495, 9489661, 9533638, 9581529, 9607629, 9618175, 9631670, 9642729, 9660220, 9673030, 9682554, 9695996, 9711014, 9708208, 9695583, 9681469]
12247I681469j2123n023j2663k3144j7713l1161m5824l8191l9180n3667p1327
12236I331453o0482o8680p4248o1525p3122r3332j04978j11082j02911r4179r3927
12225H392987r7697j02384j08318j18092j18055j03161j11400j18423j13287j29354
12215G272816j40111j27806j13641j29613j39474j44258j36470j48390j49875
12206F043178j36263j23753j39533j43489j46794j49803j23269j36032j31996
12197D812246j25063j33501j12420j10012j09273j09577j02519j11456j07050
12188C791375r9428r4485j04352r0061p8346r4145q3845q3623r0979o7259o5417
12177B839435o7809n4635m0562o2699o4190o6789o9855n5048m9279o0892m6521
$$ y = [9681469, 9669346, 9664323, 9651660, 9628516, 9610803, 9579642, 9533818, 9495627, 9456447, 9402780, 9331453, 9270971, 9202291, 9128043, 9066518, 8993396, 8900064, 8795086, 8684004, 8581093, 8486914, 8392987, 8295290, 8192906, 8084588, 7966496, 7848441, 7745280, 7633880, 7515457, 7402170, 7272816, 7132705, 7004899, 6891258, 6761645, 6622171, 6477913, 6341443, 6193053, 6043178, 5906915, 5783162, 5643629, 5500140, 5353346, 5203543, 5080274, 4944242, 4812246, 4687183, 4553682, 4441262, 4331250, 4221977, 4112400, 4009881, 3898425, 3791375, 3691947, 3597462, 3493110, 3403049, 3324703, 3230558, 3146713, 3063090, 2972111, 2904852, 2839435, 2771626, 2716991, 2676429, 2613730, 2549540, 2482751, 2412896, 2357848, 2308569, 2247677, 2201156]
12166B201156m5258m7251m9182m3373n0319m4846m3978n0765m2255m1073l7689
12155A705167k6974l2962j8736l2316m8837l7435k4282j2778l6479l6028k8874
12144A369466k4444L38q042k5656j5061j8477j8934k4105l2953k4747k270j3957
12132A161158k9291l1280l8876j7573Q85q764j7620j4468j9716k1310j3979j1300
12120I37866j5274j4653j432N3R740j2019k963r06j1340K51o347j4873j493j0522
12106H56088j9237j5700j6905j7416k1721K695l359j0980k1106q954m923j3633
12094G04849P138K571j2103j2486p838j0536r291k491j3024n213o050K82k068
12081F33740k896j2174O172N848o571r17p176L216m046M362k146j0377j4693j9827
$$ y = [2201156, 2155898, 2108647, 2059465, 2016092, 1965773, 1920927, 1876949, 1826184, 1783929, 1742856, 1705167, 1678193, 1645231, 1626495, 1594179, 1545342, 1507907, 1483625, 1470847, 1434368, 1398340, 1369466, 1345022, 1345360, 1337318, 1311662, 1296601, 1278124, 1259190, 1235085, 1202132, 1177385, 1175115, 1161158, 1131867, 1100587, 1061711, 1044138, 1045023, 1036259, 1018639, 1004171, 984455, 963145, 949166, 937866, 922592, 907939, 906507, 906560, 916300, 904281, 901318, 900412, 889072, 889323, 882976, 868103, 866610, 856088, 836851, 821151, 804246, 786830, 765109, 767804, 764445, 753465, 732359, 723405, 718482, 704849, 711987, 714558, 702455, 689969, 682131, 671595, 662304, 659813, 646789, 641576, 635526, 635808, 633740, 630844, 618670, 624842, 630690, 624119, 623202, 616026, 619242, 615196, 619558, 617412, 607035, 592342, 572515]
12067E72515J117K342J2590k017J572K985Q04j808L903o458o171j0669j6494N119
12053E59330P96j9074j8422j1426n883j4465o899n047o344j3846j745R803k042
12040D64736R06P776K1856R173r457j2943o499r583m349k106l010n364O898L649
12026D61683O788p41l692Q25n981R206K1082j85k718J2007N853J4799R221J1226
12012E39373L7k3593l7978l3696j3030R305K080j0813o401j1912k0531Q779M261
11999D05881j1930q547J4808k084R526J301q201j0053p169j363r691J1090N748
11986C89316J0918P624P205M063R17J705q078N774J051k3476k9224k305j168q
11972C64314j106k4871r664q683n451j911j3947r088J989O918m353o515n507l546
$$ y = [572515, 573632, 575974, 588564, 586547, 588119, 591104, 591908, 590100, 594003, 587545, 581374, 570705, 554211, 559330, 560126, 541052, 522630, 511204, 505321, 490856, 483957, 478910, 472566, 458720, 456975, 466778, 464736, 465642, 473418, 495274, 504447, 494990, 482047, 475548, 465965, 461616, 459510, 456500, 451136, 458034, 461683, 468471, 467730, 464038, 464863, 458882, 468088, 489170, 488985, 486267, 498274, 504127, 518926, 528147, 539373, 539410, 515817, 477839, 444143, 431113, 440418, 442498, 431685, 425284, 413372, 392841, 401620, 405881, 393951, 385404, 400212, 398128, 407654, 408955, 400754, 390701, 383532, 382169, 372478, 383568, 389316, 400234, 407858, 415063, 419126, 420043, 421748, 413670, 419444, 420495, 397019, 367795, 365490, 364322, 364314, 363208, 338337, 328673, 319990, 314539, 312628, 298681, 289593, 291582, 298500, 294147, 287632, 282125, 278579]
11958B78579j592o09O802j143l649O421K3240Q617J408n055R430l177j425m896
11944C12951r785j4553j6667j0116n341O325K326N980O238j1141N58r262k3390
11931B34123n696k6119L115m227m058q25P130K183O949m5J1759l703j595L921
11917B22912N071K0576J5781L149j3542n911j6503q974j264P379P952k761j3904
11904B19961L10o978m170P661J4796J7854M436j0522r729j4014k3036p628j2218
11891A76723j392R309r859r688P610J082j04N83r946k919m366N191J5859J1206
11877A89289k485n086m146r551O96j1436r190J6320R077n658Q907j1153n315j2452
11863A47817K802K683n697r632M419m070k30Q395p06m999r322j2972J2986M72
$$ y = [278579, 276987, 276378, 283180, 282037, 278388, 284809, 308049, 316666, 318074, 313019, 322449, 319272, 317847, 312951, 303166, 288613, 271946, 261830, 256489, 262814, 265140, 271120, 277358, 266217, 266775, 257513, 234123, 228427, 202308, 205423, 201196, 197138, 196313, 203443, 205626, 212575, 212530, 224289, 220586, 218991, 222912, 227983, 248559, 264340, 267489, 253947, 248036, 231533, 222559, 221295, 228674, 236626, 233865, 219961, 220271, 213293, 209123, 216784, 231580, 249434, 253870, 243348, 233619, 219605, 196569, 188941, 176723, 175331, 184640, 174781, 165093, 172703, 173785, 173681, 174264, 164318, 161399, 157033, 162224, 178083, 189289, 186804, 181718, 177572, 168021, 168717, 157281, 148091, 164411, 173488, 167830, 176737, 165584, 160269, 147817, 150619, 153302, 147605, 137973, 142392, 138322, 138092, 146487, 145781, 140782, 131460, 118488, 131474, 131946]
11849A31946j2409q132Q158j893Q445J1770Q461l178n9j7316P215J6430J729J7908
11835A69075n660j2849m938K102j140j1098m304L325L518R086P416j044p464p409
11821A38616J2490K190r154J385L482j2524l78m193Q267J2247J2649p908r572
11808A47597j1700j3328L633R731J9456p855j2491p319J131l42j778J1855j785
11795A36805j6361Q639P093m57p384J0407K218j4133p402m266q415k879J7175
11782A21040J7626p947K787J805Rj4724j6474l938k515J1078Q777K71N427M812
11768A28034o591L662J312j5608m227K500k774j5203j622L141N175L488j838j701
11754I7748J4334m025j2009p76j8482m378L525J2812m92M688l476J5690k544j7523
$$ y = [131946, 119537, 111405, 119563, 117670, 126115, 137885, 146346, 143168, 143109, 125793, 133008, 149438, 151167, 169075, 163415, 150566, 145628, 147730, 146590, 135492, 131188, 134513, 138031, 147117, 154533, 153489, 146025, 138616, 151106, 153296, 144142, 145527, 149009, 136485, 136107, 131914, 140181, 152428, 165077, 157169, 147597, 135897, 122569, 126202, 135933, 155389, 147534, 135043, 127724, 128855, 128513, 126735, 138590, 136805, 120444, 129083, 136176, 135719, 128335, 138742, 140960, 126827, 119425, 115159, 106744, 103865, 121040, 138666, 130719, 133506, 135311, 135320, 120596, 104122, 100184, 97669, 108747, 117524, 117795, 123222, 128034, 121443, 125105, 126417, 110809, 106582, 109082, 106308, 91105, 89483, 92624, 97799, 101287, 99449, 97748, 112082, 108057, 96048, 95272, 76790, 72412, 75937, 88749, 88257, 92945, 89469, 105159, 102615, 85092]
11740H5092r684K680q204P825M022j0732N50j576n25J3143l284k328M422J5571
11726I6972J867m817j5426m383P388N316J0813j0335k493r823O87P69k668J670
11712G5537l471L540N232j3364j1035L410J2562p719K44L492j847k247l689m414
11698E6231N845P003j0467r756R707M016O360J0092j3685l602J3186K573O642
11685H4145n699j1431O81o638K614J805j7252p897J9644m029j3009k289J412J
11671D2058j207l956M831L969O159J839j0400K563J2575J597P004j575j0826M182
11657E8813Q546l696m449m733J1229n327K576J1821k973j3764J5485M022n928
11644G1622n531L127j1552K165l781r905Q668P936K905J0038n637q602R890P255
$$ y = [85092, 75408, 78088, 69884, 77709, 81731, 70999, 71549, 69973, 69448, 82591, 79307, 76979, 81401, 96972, 98839, 94022, 78596, 74213, 81601, 86917, 97730, 87395, 84902, 75079, 75766, 76535, 73867, 75537, 72066, 75606, 80838, 67474, 56439, 59849, 72411, 64692, 64936, 68428, 66581, 64334, 60645, 56231, 62076, 69079, 58612, 48856, 58563, 62579, 68939, 79031, 65346, 61744, 74930, 77503, 84145, 78446, 67015, 67696, 61058, 63672, 65477, 48225, 40328, 59972, 55943, 42934, 40645, 42057, 42058, 40851, 36895, 41726, 45695, 51854, 53693, 43293, 45856, 58431, 60028, 67032, 65457, 54631, 58813, 67359, 63663, 59214, 54481, 65710, 60383, 62959, 74780, 71807, 58043, 73528, 77550, 71622, 66091, 69218, 57666, 59831, 56050, 46145, 54813, 62749, 65654, 75692, 70055, 61453, 71343, 78598]
11630G8598J922p296l78N713j975j3196N847o323l2812q23J5233l196P533M949
11616E3796J224L221n197J8224J6241n354l349o11J2984Q754p219O078j1678M60
11602H7574N907O462J7195j792j585N002R753J2686R038K217o065j2376Q975P999
11588A50990M150m569r811q952J1430p908p891J708O605k17R818J82q476q521
11574A28538r807M693m731l07J1224o056P836J3474R660J5092J7709o574j407
11561A79344l863n108k0021k8717K373N966L057O953O695j379q013r097j1320
11548A16870o271k105J4986K864j5683r934m025J6178K811N030J735j715R944
11535A30685m458l590j822L763L116j1655l0109n36N737O606j8167q082j41M566
$$ y = [78598, 80520, 73224, 72846, 78559, 76584, 63388, 69235, 62912, 30100, 29277, 44510, 41314, 48847, 53796, 55020, 58241, 53044, 71268, 87509, 82155, 78806, 78195, 91179, 99933, 92714, 98792, 87114, 87574, 93481, 99943, 117138, 115346, 113761, 118763, 128516, 141202, 150240, 152457, 146392, 134016, 142991, 150990, 155140, 150571, 140760, 131808, 143238, 135330, 127439, 129147, 135752, 135535, 145353, 145535, 137059, 128538, 118731, 123424, 118693, 118386, 129610, 123554, 131390, 144864, 154524, 169616, 187325, 180751, 179344, 175481, 170373, 150352, 121635, 124008, 129974, 133031, 139984, 146679, 145300, 137287, 128190, 116870, 110599, 108494, 123480, 126344, 110661, 100727, 96702, 112880, 115691, 120721, 122456, 120741, 130685, 126227, 122637, 120815, 124578, 127694, 116039, 85930, 85394, 91131, 97737, 79570, 71488, 71347, 75913]
11521G5913n885q423j0384N811J6167M032M422q397j5119m569J4382Q54k2034
11508D6770m189J3128J1537l284m438k579k478j984o414j5654K031j0265j190
11495B0991o849j0671R913N66J2581K4047J3049k454j2705k3789Q542J1472K213
11482D6906P126P211p298k363j1084P35j456q220J7331P437q13K216m503j2112
11468D1113j3146K931J6674j0650q647J1895N63m358J5557l258m059k167K287
11455D4735j7061O388Q289K873l421o706j0239J0962K4935n868k1343j4004L062
11442B2602K4209J2827o762j139P243M962m41j0643j8293n085l134p434J05J6297
11428C5314N547J476J087p02q946j0047J3641J6776M584J0338J826o774K5j0263
$$ y = [75913, 70028, 61605, 51221, 57032, 73199, 77231, 81653, 73256, 58137, 53568, 67950, 68804, 46770, 42581, 55709, 67246, 63962, 59524, 56945, 54467, 52483, 46069, 30415, 32446, 22181, 20991, 14142, 3471, 13384, 13950, 26531, 50578, 63627, 61173, 48468, 24679, 33221, 44693, 46906, 54032, 61243, 53945, 51582, 40498, 41233, 39777, 31557, 48888, 56325, 55512, 57728, 53225, 41113, 27967, 30898, 47572, 36922, 28275, 40170, 40733, 36375, 51932, 48674, 44615, 42448, 44735, 27674, 34062, 42351, 45224, 41803, 35097, 24858, 35820, 60755, 54887, 33544, 19540, 22602, 46811, 59638, 52876, 51737, 58980, 63942, 63501, 52858, 34565, 29480, 26346, 18912, 19017, 35314, 40861, 42337, 43424, 42722, 33776, 23729, 37370, 54146, 58730, 69068, 70894, 64120, 64145, 53882]
11414E3882k411j173J2971R686P543k0238M44o309l199n448j1968J9352j0884
11401D2248j082M631J834j589J7931Q666k096r26K989l682j8463L041j965M007
11387E5544J6705J1011J1405p738k2535j3904J8329J4752q297j2735o139M797
11375F1195J0404M586J1573Q196l729j8176l720N160l794j495j931J480Q107J4971
11361I2827L66o919K120m695r340J3748J2144j4864K823j240J2531k473j3950
11348H3078Q516L134j0978r831k531r057M361l107K452M468N335L199j473n474
11334G2092L320Q762J5910J642J1861o492j0741M282K855O725J7039n55m185j193
11320A21322j137l85M238l488K295j332n830j237J1096O855P7p55K177K1293p526
$$ y = [53882, 51471, 50298, 63269, 72955, 80498, 60260, 60704, 54395, 51196, 45748, 33780, 53132, 42248, 41166, 45797, 47631, 46042, 63973, 72639, 70543, 69617, 72606, 68924, 50461, 53502, 51537, 55544, 72249, 83260, 94665, 86927, 64392, 50488, 68817, 83569, 75272, 62537, 56398, 61195, 71599, 76185, 87758, 95954, 92225, 74049, 70329, 75489, 71695, 70200, 68269, 69749, 77856, 92827, 93193, 86274, 88394, 83699, 74359, 88107, 100251, 85387, 88210, 86970, 99501, 97028, 83078, 91594, 94728, 83750, 73919, 71388, 62331, 66692, 63585, 66037, 70505, 75840, 79039, 77566, 72092, 75412, 84174, 100084, 101726, 113587, 107095, 96354, 100636, 103491, 110216, 127255, 126700, 122515, 121322, 120185, 119800, 124038, 120550, 122845, 121513, 115683, 114446, 125542, 132397, 132474, 131719, 133896, 155189, 147663]
11305A47663p923O600L550J3126J4439l772J9170L3086L1452N6273N9934L8289
11293D11887K1852L51l7700o2602n7990l3170k3956k5721k768J7737j0987j5126
11281A81807j3682j1635m776M923J1511P745k416p593O360L941J3086J4527r486
11268A94312J558K707o902N039O190J909J548J550j1601l124J5213L820R158J0201
11254B31578O384J1274l551L130P597m780M588J9497L410j016M440L41n81O750
11240B89061K317O571R516N796J1079L025P562L696J4105O196J1618J8244K3001
11227D11787J3340K83r63J3269K933J0898R433K2008K3698M866J4424J3784L0653
11214E70413L0979K5181N472J7958L3443K8430J2633K9110K8438K9671L5968K4443
$$ y = [147663, 139740, 146340, 149890, 163016, 177455, 173683, 192853, 225939, 257391, 313664, 373598, 411887, 433739, 434090, 396390, 333788, 275798, 242628, 218672, 192951, 190183, 207920, 196933, 181807, 168125, 156490, 151714, 156637, 168148, 175893, 173477, 165884, 172244, 176185, 189271, 203798, 194312, 195870, 198577, 191675, 196714, 202904, 204813, 206361, 207911, 196310, 193186, 208399, 212219, 221377, 231578, 237962, 249236, 245685, 248815, 256412, 251632, 256220, 275717, 279127, 278111, 282551, 282892, 282311, 289061, 291378, 297949, 307465, 313261, 324340, 327365, 334927, 338623, 352728, 358924, 370542, 388786, 411787, 425127, 425410, 424447, 437716, 440649, 451547, 460980, 482988, 506686, 511552, 525976, 539760, 570413, 601392, 626573, 632045, 650003, 683446, 711876, 724509, 753619, 782057, 811728, 847696, 872139]
11202H72139M8166M2433M8954M4615L8209N6204O7545O9451O1966Q1530R9993
11191A531205R7903J09649J08668J29369J47943J68475K16842K52834K73814K79130
11181C315832K98927L54955L80012M09695M48590N00704N76006O75833P91325
11172G751879Q77339R64767J031421J041828J049034R52529P89469N86406L02147
11163A5346819R565k63436m80922o31450p02016p11682o84445n99996n12354m12482
11153A0357601k93124j73048n0016N9685J63989K71424L80286M93269O00880P17316
11143A2528262Q44194R51439J035270J121041J185467J177558J164356J050288
11135B1057875Q82717O44135L55198M3361k70216n57892q17355j004196j106268
$$ y = [872139, 920305, 962738, 1011692, 1056307, 1094516, 1150720, 1218265, 1287716, 1349682, 1431212, 1531205, 1629108, 1738757, 1847425, 1976794, 2124737, 2293212, 2510054, 2762888, 3036702, 3315832, 3614759, 3969714, 4349726, 4759421, 5208011, 5708715, 6284721, 6960554, 7751879, 8629218, 9593985, 10625406, 11667234, 12716268, 13668797, 14458266, 15044672, 15346819, 15356384, 15092948, 14612026, 13980576, 13278560, 12566878, 11882433, 11282437, 10770083, 10357601, 10064477, 9891429, 9841413, 9901098, 10065087, 10336511, 10716797, 11210066, 11810946, 12528262, 13372456, 14323895, 15359165, 16480206, 17665673, 18843231, 20007587, 21057875, 21940592, 22584727, 22939925, 22983286, 22713070, 22155178, 21337823, 20333627, 19227359]
11126A9227359j176964j177846j150326j065883r76235q78238p83754o67732n41086
11117A0809295m33590l58164k51612j50207m7886O6934J53586K36225L22431L93748
11107A0740760M66194N00508N06374M68608L87606K49011P2263j30816l44175
11098A2916333n14441o60316p52988q23572q27951p92875p50524o99030o55684
11089F438952n86220n16634m57023m07722l71458l36088k66944k40363k36210
11080C020290k10732j96085j64833j43534j30785j17894j03134j06938r5730q1604
11070A669021o7081p5955p8355p1985n5149m1319m1430m7632l5564k4117l0031
11059A100403k2962k4512l5240n7278n0765l4590j5839r815j7778k3492k4020
$$ y = [19227359, 18050395, 16872549, 15722223, 14656340, 13680105, 12801867, 12018113, 11350381, 10809295, 10375705, 10017541, 9765929, 9615722, 9567836, 9634770, 9788356, 10024581, 10347012, 10740760, 11206954, 11707462, 12213836, 12682444, 13070050, 13319061, 13391324, 13260508, 12916333, 12401892, 11741576, 10988588, 10165016, 9337065, 8544190, 7793666, 7094636, 6438952, 5852732, 5336098, 4879075, 4471353, 4099895, 3763807, 3496863, 3256500, 3020290, 2809558, 2613473, 2448640, 2305106, 2174321, 2056427, 1953293, 1846355, 1750625, 1669021, 1601940, 1525985, 1447630, 1375645, 1320496, 1279177, 1237747, 1190115, 1154551, 1130434, 1100403, 1077441, 1052929, 1017689, 960411, 909646, 875056, 859217, 849402, 831624, 808132, 784112]
11048G84112k5394k4985j7820m574j3397l3021k3587n555k0041k1633j3046R99
11036E82058j2114j6873o159k9062n113O08K421J0182j1006j468k1410j7670j8159
11023D56235r828k3413k2241j0433j1849l636j9364j4684O999P134l763q837j7789
11010C24531n772O092k359k0160n321j4297j0276J2579R879P593j1572l050k62
10997B87605p619k521r281p148j7183j830M491q542k2582j9459j5017J0171J4790
10984B05875j1637r020N322N03O995O176M294j4103p943m868N828m761n822k981
10970A73858j1273r727Q146K1576Q027r829k0407r028Q734N970j0265j6667j0015
10957A29100j5410P613J5088J0753J309m251m938n018J9482J8281j0614k1097
$$ y = [784112, 758718, 733733, 715913, 711339, 697942, 664921, 641334, 635779, 615738, 594105, 581059, 582058, 569944, 553071, 546912, 517850, 512737, 513345, 515766, 525948, 514942, 513474, 492064, 474394, 456235, 446407, 422994, 400753, 390320, 378471, 374835, 355471, 340787, 347786, 354920, 351157, 342320, 324531, 318759, 324851, 322492, 302332, 297011, 282714, 272438, 285017, 294896, 302489, 290917, 287867, 287605, 279986, 277465, 268184, 261036, 243853, 242023, 246514, 237972, 215390, 195931, 180914, 191085, 205875, 194238, 185218, 190540, 191043, 198038, 204214, 208508, 194405, 186462, 181594, 187422, 182661, 176839, 173858, 162585, 152858, 161004, 182580, 190607, 180778, 160371, 151343, 160077, 166047, 155782, 139115, 129100, 113690, 121303, 136391, 147144, 148453, 144202, 139264, 134246, 153728, 172009, 161395, 140298]
10945A40298q75o622J016J9310J5449R58l743n698p944O764J3376r489j2242J710
10931A52268J104o410q967J968M348p681r010j4040j1106J1648M941r662j2116
10918I7285o265K416n594N757k498j1384J2792Q182K56O81j3270K045L589Q254
10904A02246j4602j1465N825Q232J166j4869p64J2170j863k613o958J3376J852
10891I1733l134q52m421L527J0401R166k1839K411P406P872r812j4288P253J9747
10877A05170P398K17O114o222q246l2420j2230J2827O848P237R786n73p453r349
10863G9104L857N815J2070J2519p790j2134P446P89j2037j7064k932J3535Q040
10850I1218L0743j0404j8386J904J7886J8212J1590P47K4290J8173J1899M2759
$$ y = [140298, 139423, 132801, 133817, 153127, 168576, 169534, 165791, 160093, 152149, 158913, 172289, 162800, 150558, 152268, 153372, 146962, 137995, 139963, 144311, 136630, 127620, 113580, 102474, 114122, 119063, 109401, 97285, 91020, 93436, 87842, 93599, 91101, 79717, 92509, 100691, 100947, 101628, 88358, 90403, 93992, 102246, 87644, 76179, 82004, 90236, 91402, 76533, 75769, 87939, 86076, 83463, 76505, 89881, 91733, 88599, 87747, 83326, 86853, 97254, 106420, 84581, 86992, 94398, 102270, 92458, 78170, 85423, 105170, 112568, 112785, 118899, 112677, 104431, 72011, 59781, 72608, 79456, 86693, 96479, 95906, 88453, 79104, 82961, 88776, 100846, 113365, 105575, 93441, 100887, 101676, 89639, 72575, 69643, 83178, 91218, 121961, 111557, 93171, 95075, 112961, 131173, 142763, 143510, 167800, 185973, 197872, 240631]
10838B40631O2731P1626J11269J58324K57592M63225P23262P35361J69302m25290
10828B568033o56174o10179m42026k70095j58865q6648n6978m5915l7755l7026
10818A66372m142O296j1642n071o902j7469k0430m294P394j6851j2296j223L572
10805H3314j3983j7460r658j760j106O381M899J473L420J0667Q406p929L855J6405
10791H6924J0856J0637P207L0713M6550J4624k1540l1368k4173k5817k1195j4446
10779F8972r305j376r373p303M611J2316J9411N52p788m698p728J057n867j870
10765E1611M811m379M778p626n323R763M592m127m909j6691j695K2761O97J2476
10751F6739K234m079J0636J3226n343q453J4721Q339k337k655p440j1254j875
$$ y = [240631, 303362, 374988, 486257, 644581, 902173, 1365398, 2088660, 2824021, 2993323, 2568033, 1911859, 1301680, 859654, 589559, 430694, 344046, 287068, 241153, 203398, 166372, 162230, 168526, 156884, 151813, 144911, 127442, 107012, 102718, 110112, 93261, 80965, 79742, 83314, 69331, 51871, 42213, 40453, 39347, 45728, 50627, 52100, 55520, 66187, 74593, 66664, 70519, 86924, 97780, 108417, 115624, 146337, 192887, 207511, 185971, 154603, 130430, 104613, 83418, 68972, 59667, 58291, 48918, 41615, 46226, 58542, 77953, 78505, 70717, 66019, 58291, 59348, 53481, 51611, 56422, 52043, 56821, 49195, 43872, 53635, 58227, 54100, 49191, 32500, 30805, 53566, 54263, 66739, 68973, 64894, 75530, 88756, 83413, 74960, 89681, 98020, 95683, 93028, 85588, 74334, 72459]
10738G2459J2442Q900K2125O222k2029N400M929J5735O516L983p179j941j106
10725A26456p148j5764k0260q57P240J661j3250L20o086J49n238J0303J7536j1100
10711H3962J772J7512J0798L820L787M174O319m319m381J2263J0759Q445j379
10698A53532R27l940r018P445P759o942j6425j8295J0193r822j0441N423r598
10685A00798R109L272r757j4245k2458l217j086j6387O744J5616Q455o568Q491
10672G8767R986L143P493q322l587P950p992n712L866M114j5224j1006L035O114
10658G2625n073j446r963K137N502N998p556P686N909j511j0093j0756M63j6452
10644C7470j6403M142P22R247M074j432j552k185J7292J5709j9227L262k048k3118
$$ y = [72459, 84901, 93801, 115926, 122148, 100119, 105519, 110448, 126183, 132699, 136682, 129503, 127562, 126456, 119308, 103544, 83284, 82427, 89667, 91328, 78078, 78398, 72312, 72461, 67223, 77526, 95062, 83962, 85734, 103246, 114044, 117864, 121651, 125825, 132144, 127825, 123444, 135707, 146466, 154911, 153532, 154459, 150519, 141501, 148946, 156705, 149763, 133338, 115043, 125236, 115414, 104973, 110396, 100798, 109907, 113179, 103422, 89177, 66719, 63502, 62416, 46029, 52773, 68389, 76844, 70276, 78767, 88753, 91896, 99389, 91067, 87480, 95430, 87438, 81726, 85592, 89706, 74482, 63476, 66511, 72625, 67552, 66106, 56143, 58280, 63782, 69780, 62224, 69910, 75819, 74308, 64215, 53459, 53922, 37470, 21067, 25209, 25931, 35178, 39252, 37820, 36268, 34083, 51375, 67084, 47857, 51119, 49071, 25953]
10630B5953M880L48J1944p805k0632J219Q256J3871k371k274J3471J1467j4613
10617D3714j5186o76r550L668J9171J1440m895J221q440k795J1899P139n902J648
10603E2456O903j9082R925P589n650n045p687r900L525k84q775L96L970k202K166
10588B8305J904O397J8141n772n534J7899N811k2301j4487J2174R32J026K303
10575D6798o057L437P173m52O1n259K354P772L523j6257r486K965o407k012n904
10560B2249J1857K81J180P504L000l566N402M997j38L398j493O296K088o323k564
10545E4168J2247m333j3836j6080R40Q756o842J9746l517o737j080J28K073M999
10531E0632N580j859r85j806K081r918K460k312q572n23j949l130N768k0038q687
$$ y = [25953, 30833, 31181, 43125, 35320, 14688, 15907, 24163, 38034, 35663, 33389, 46860, 58327, 43714, 28528, 27852, 18302, 21970, 41141, 52581, 47686, 48907, 40467, 37672, 49571, 56710, 50808, 52456, 59359, 40277, 50202, 57791, 52141, 47096, 39409, 29509, 33034, 32750, 23975, 24371, 28341, 26139, 28305, 30209, 36606, 54747, 48975, 43441, 61340, 67151, 44850, 30363, 42537, 43469, 44495, 46798, 40741, 44178, 51351, 50899, 50960, 45701, 48055, 55827, 59350, 43093, 33607, 36572, 30165, 28153, 22249, 34106, 34387, 35567, 43071, 46071, 42505, 47907, 52904, 52766, 56164, 54671, 60967, 63055, 56732, 54168, 66415, 62082, 48246, 32166, 33106, 41862, 35020, 54766, 51249, 44512, 43432, 43560, 45633, 50632, 56212, 54353, 53368, 51562, 53643, 43725, 46185, 43873, 35301, 34778, 32829, 29699, 35467, 15429, 6742]
10516F742N724Q510q027l607J8906J8603J435N087n11j0172J0718P565N190j5966
10502E0197j0384J00j0779K4486O53j9848r555k239R288R86j6847o420Q759J5317
10488C3714J444l319O058Q562p009m719M168l662q148j0436L585P639m070m827
10474A8980K775J2726n590p188p317P211R900j859O351J4577J2374J1214L043
10461G7197o520m915R68M190J5963l65j4825j8285j3376m12L061r68N830J162
10447D8705m362r170k399L531R373O482j72n456Q23N848q955M121N244K26j8833
10432C5006k730l024o017N389J6960p248j1328O559o303O585R720j7087j3548
10419A2934Q877J2387J4207j6214j0580P559N645l896q373M509K072o48j0924
$$ y = [6742, 12466, 20976, 12949, 9342, 28248, 46851, 48286, 53373, 52862, 42690, 53408, 60973, 66163, 50197, 39813, 39913, 29134, 53620, 54273, 34425, 24870, 22631, 31919, 32905, 16058, 9638, 18397, 33714, 35158, 31839, 37897, 46459, 39450, 34731, 38899, 35237, 27089, 16653, 20238, 27877, 23807, 18980, 21755, 34481, 28891, 21703, 14386, 21597, 31497, 29638, 35989, 50566, 62940, 74154, 77197, 70677, 65762, 66730, 70920, 86883, 86518, 71693, 53408, 40032, 39620, 42681, 41713, 47543, 48705, 44343, 35173, 32774, 36305, 45678, 52160, 51988, 46532, 47355, 53203, 44248, 48369, 53613, 53839, 35006, 32276, 29252, 23235, 28624, 45584, 38336, 27008, 33567, 27264, 33849, 43569, 26482, 12934, 21811, 34198, 48405, 32191, 21611, 29170, 34815, 30919, 22546, 27055, 29127, 28479, 17555]
10406A7555n306p60K121J8150P750O518K156P489M48n765j2551o069P448n292
10392C3892m444J3958Q544L371j4065r408R043Q996j0124J555L498O470P796j6064
10378D3018j7151M329O505j0230m07J431l183K233J194j0174n089L00r17O996
10364A8855J28J774M723p772R368Q183P760J714K918k308K286m852j3873n657
10350B3247K232M451J0910R821j2066r387P948P825k584j357P219j896l200Q742
10336E1905o975r044j5044L058N651M920K189j6094q429P369J1063j436K58R244
10322C8635P188n67j3654J088r423n524r91j403L930J3543L345J94p044j2435
10308A6882o102p61K392K567M645j1088M373Q98O232k544o205m428M629J0158
$$ y = [17555, 12249, 11489, 13610, 31760, 39510, 46028, 48184, 55673, 56121, 50356, 37805, 31736, 39184, 33892, 29448, 43406, 51950, 55321, 41256, 31848, 40891, 49887, 39763, 41318, 44816, 51286, 59082, 43018, 25867, 30196, 36701, 26471, 26064, 27495, 24312, 26545, 27739, 17565, 12476, 12776, 11859, 18855, 18983, 20757, 25480, 17708, 27076, 35259, 43019, 44733, 47651, 45343, 47629, 42777, 28904, 23247, 25479, 29930, 40840, 50661, 38595, 29208, 37156, 44981, 42397, 41040, 48259, 46363, 43163, 51905, 44930, 35886, 20842, 23900, 29551, 34471, 36660, 20566, 12137, 19506, 30569, 29133, 29391, 38635, 45823, 45256, 31602, 32690, 23267, 17743, 16752, 15349, 19279, 32822, 36167, 36361, 29317, 16882, 10780, 10019, 12411, 14978, 19623, 8535, 12908, 13806, 20038, 17494, 11289, 6861, 11490, 21648]
10294B1648M905o683m09o317l201R797L279J4807J3892L594o138j8824j391n266
10280B3693J2351R044j794J575l042N179O081j7261p194J5038j4649J0800P444
10267D7265m02j0059J297o00L696J3828O547L123N963r28m493j4622J2767K218
10253F5600K338M610J6442P095p036j6198r69n886j4099j892k533L554n040q279
10239C7707J162J1468N61k335k121q938p187L826J0922J185n435j0220m244J6649
10225D3000J4290M3o453p978N366L350j0219o670l904J246O321M213J673k741
10211D1537K063j6312q903o924L136J7806N65r625K50K157k174K659m452M937
10197B6720L81k715r909R5J2218K68k500O439j7067O640K251l535j4180j2515
$$ y = [21648, 26553, 19870, 19461, 13144, 9943, 19740, 23019, 37826, 51718, 55312, 49174, 30350, 28959, 23693, 36044, 45088, 43294, 44869, 41827, 47006, 53087, 35826, 28632, 43670, 29021, 39821, 47265, 46863, 36804, 38101, 37501, 41197, 55025, 61572, 64695, 70658, 69730, 65237, 50615, 63382, 65600, 67938, 72548, 88990, 96085, 89049, 72851, 71882, 65996, 51897, 50005, 47472, 51026, 45986, 37707, 38869, 50337, 50898, 48563, 46442, 37504, 30317, 34143, 45065, 46250, 40815, 30595, 26351, 43000, 57290, 57333, 50880, 42902, 48268, 51618, 41399, 34729, 30825, 32071, 38392, 42605, 44278, 41537, 43600, 27288, 18385, 11461, 14597, 32403, 32968, 23343, 23593, 25750, 23576, 26235, 21783, 26720, 27101, 24386, 14477, 14572, 26790, 27058, 24558, 30997, 13930, 20570, 22821, 19286, 5106, -7409]
10183g409J230O736P362J2710J1338M622l501L811o598j240P043l471k367L83
10169C0649j663Q773q023n566p15l934p4o773j7582r96O635R896P352L392LO012
10153B7386J1843R03o98j0468m459m776L281l285j121O70j5665o532j604k70J5869
10138A1074M879Q016k519r519Q19O875Q705J6417l738j683R294L708j1659j1485
10124B9184j1366k097K677j7271L62J9068R510L674p512J126p50n805j1077J3231
10110B2954J658q854K671p827N260j3731J2861J3847k139k722m282p460m722j299
10096F215L907j836L701k641K149Q784j2511q5j553p36N068J258J0396K610P805
10081C2531L118N411k227N491p280L023n698j2228p771J472J399m72l14J91J549
$$ y = [-7409, -6179, 557, 7919, 20629, 31967, 36589, 33088, 36899, 30301, 29061, 36104, 32633, 30266, 30649, 28986, 37759, 29736, 24170, 23455, 19521, 19447, 12674, -4908, -5904, 731, 10627, 17979, 21371, 21374, 27386, 39229, 40132, 39434, 28966, 24507, 19731, 23012, 19727, 18606, 19276, 3611, -2921, -4525, -4795, 11074, 15953, 23969, 21450, 11931, 12750, 19625, 28330, 44747, 41009, 39326, 48620, 52328, 40669, 29184, 17818, 15721, 18398, 1127, 1489, 20557, 30067, 33741, 26229, 27355, 26605, 20800, 9723, 22954, 24612, 15758, 18429, 10602, 15862, 2131, 14992, 28839, 26700, 23978, 19696, 12236, 7514, 6215, 10122, 8286, 11987, 9346, 11495, 20279, 7768, 7683, 6130, 5394, 10462, 11720, 22116, 24726, 32531, 35649, 41060, 38833, 44324, 37044, 40067, 34369, 22141, 14370, 15842, 17241, 16769, 16455, 16646, 18195]
10066A8195R31P786j4970J2995J704o111j3996o138Q939m095j424J0185J4598
10053B8599N554J0179L369P692j7659j9381J695M116k064p840r749N432N417R410
10039B4770P938N416l566j6554n358K835J74k057J0156Q249l591r426k703o886
10025I397r70J1064O522K446o749j9212j0907J0123L630R69l587J5622o758j062
10011A0528M331P407o742o033o720j927l860L567O434O916m234j85J0752l208
9997A7026q042j214r488n84P716Q887J0814j003J1249K090o668j9770j6339j318
9983f644J5834M31k010R802J3541j286j9165N192P472m21np470k941P004r44n325
9967A3065P960J1401J0687o893l312J103M820O038l911j3472O632O287j4433N726
$$ y = [18195, 19126, 26912, 11942, 24937, 26641, 20530, 6534, 396, 9335, 5240, 3816, 14001, 28599, 34153, 44332, 47701, 55393, 37734, 18353, 20048, 24164, 22100, 14260, 4511, 9943, 15360, 24770, 32708, 38124, 34558, 18004, 12646, 15481, 15655, 13598, 23754, 32003, 28412, 18986, 16283, 9397, 8427, 19491, 26013, 28459, 21710, 2498, -8409, 1714, 5344, 6313, 2726, 18348, 11590, 10528, 14859, 22266, 15524, 9491, 2771, 844, -3016, 551, 6985, 13901, 9667, 9482, 20234, 17026, 8984, 7770, -1718, -2302, 5414, 14301, 25115, 24112, 35361, 37451, 30783, 11013, -5326, -6644, 9190, 9621, 7611, 17413, 30954, 29668, 10503, 15695, 23167, 22746, 22741, 15271, 12330, 19334, 18390, 13065, 21025, 32426, 43113, 36220, 32908, 34011, 38831, 44869, 40958, 27486, 34118, 40405, 25972, 31698]
9953C1698O975k1603j4992J1710J9440o69P956j4086j6956n498J1289J240j7196
9940f92R510k912j2284Q511M67P03O307k135O480j0340j4130q752L449R962J0727
9925D871N496l267N5j248j0722J4095J0300L665m797Q903K587K374l904l687o381
9910A8340J825O264j6961n996o825N789J4512K0659J368j2418N780O314J162j1054
9896B8759r507k227P324l92j7650j986P481O691J3717J3901p261k1372l437q1
9882A3960Q716J548j1299Q416M547O937j1366j0457j0701l482K269L350k051P151
9868G538N821J1742J840J90q513p37K3463J3282m498j7765o961r868r355j5977
9854i798O211J9747m742L357N757o207j2908l122L093k576k74K74O959J1602l34
$$ y = [31698, 38673, 17070, 2078, 13788, 33228, 32559, 40515, 26429, 9473, 3975, 15264, 16504, -692, 8818, 5906, -6378, 2133, 2600, 3303, 9610, 7475, 13955, 3615, -10515, -19267, -15818, -5856, 4871, 10367, 7100, 7155, 5907, -4815, 9280, 19580, 23245, 18448, 27351, 29938, 32312, 28408, 24721, 18340, 20165, 26429, 9468, 3472, -3353, 2436, 16948, 37607, 38975, 26557, 32337, 38651, 39813, 28759, 19252, 17025, 24349, 23957, 6307, 4321, 11802, 18493, 32210, 46111, 38850, 17478, 14041, 13960, 22676, 24224, 12925, 21341, 25888, 32825, 21459, 11002, 301, -3181, -912, 2438, 387, 7538, 13359, 25101, 26941, 27131, 18618, 17881, 41344, 54626, 50128, 32363, 25402, 15534, 6179, -9798, -3587, 16160, 11418, 14775, 20532, 14325, 1417, -1705, 1388, -1188, -1462, -1188, 5771, 17373, 17039]
9839A7039r671k907Q423M27n568j560K262k213L51L146j592j0245O384J2145p460
9824H961p218J6948J7935m633O48M317m900o483j4502n319j422O369k351J297
9810I647o022j3442P961j0471r713K118J4712Q560J3324o51j5944k132M174J4005
9796A6126J8293n084k2439q655o843P971m343k177R135J4929K402Q86l612l517
9782A3072l120j4703J7291J5573l430p505q653K619J1636Q942J3944n644j5432
9769B4590j6291K398k343K649J427r299M137P34J0756K819l567n408J4665R920
9755C7187j1439r247p322l41p360k564M004R419N065r27r726J6007L840j5464
9741A1132K69P786l457j1209l146Q860J176N956o261j5242q155N795J8216O227
$$ y = [17039, 7368, 4461, 12884, 13311, 7743, 6183, 8445, 6232, 6583, 9729, 8137, -2108, 4276, 16421, 8961, 1743, 18691, 36626, 31993, 32641, 36958, 32058, 25575, 11073, 5754, 4332, 10701, 8350, 9647, 3625, -9817, -1856, -12327, -22040, -19922, -5210, 3350, 16674, 16023, 79, -2053, 2121, 16126, 34419, 29335, 6896, -1759, -8602, -631, -4974, -7151, 1984, 16913, 19315, 20201, 16589, 13072, 9952, -4751, 12540, 28113, 24683, 17178, 8525, 11144, 22780, 31722, 45666, 40022, 24590, 8299, 10697, 8354, 11003, 12430, 3131, 7268, 8002, 18758, 21577, 18010, 12602, 27267, 37187, 25748, 16501, 9179, 8838, 1478, -1086, 2918, 12337, 17402, 16475, 6749, 22756, 26596, 11132, 11401, 19187, 15730, 4521, 1375, 10235, 11411, 17367, 11106, -4136, -12291, -6496, 11720, 17947]
9727A7947j6431O463J3427p890p508j2986q041L138n822Q543J3864O237j166l769
9713F006J151J4276o223p375j0307m912K089k978Q157Q973J9072J0586l147o780
9699B8588j4411p084J0232L777j0760O636m885j3150j4143N831J3836j1619R078
9686A926K4403L854j4444Q185k260o942O925j705k0603r442J2978R958N593M149
9672B2575p932q696M81r556O435R504k272M039L078j879q724n096o291j946O584
9657C04O328J2095J3531l73j9097j2378k59J3264N516n563p81M771Q10P68P879
9642B6815Q29q204j1094j819J6956m1o156J2255J6963k747M409j139j0125k2210
9628A4692j2291j261J1354M27M373j080o650L247J0767N863J170Q80j6901k153
$$ y = [17947, 1516, 7979, 21406, 13516, 6008, -6978, -15019, -11881, -17703, -9160, 4704, 10941, 9775, 6006, 7157, 21433, 15210, 7835, -2472, -7384, -5295, -8273, -116, 8857, 27929, 38515, 35368, 28588, 14177, 7093, 17325, 21102, 10342, 16978, 12093, -1057, -15200, -9369, 4467, -7152, 1926, 26329, 30183, 15739, 23924, 21664, 14722, 21647, 19942, -661, -10103, 2875, 12833, 18426, 22575, 14643, 5947, 6428, -3128, 3307, 12811, 10539, 14578, 17656, 15777, 7053, 1957, -4334, -6280, 304, 6632, 18727, 32258, 31885, 12788, 410, 151, 13415, 18931, 13368, 12587, 17358, 18168, 18936, 26815, 27644, 19440, 8346, 6527, 23483, 23442, 17286, 29541, 46504, 43757, 48166, 47027, 36902, 14692, 2401, 1140, 12494, 12921, 17294, 16214, 9564, 12811, 23578, 29441, 30611, 31491, 14590, 12437]
9614A2437M679J591N587q523k923M678r032r010j1179J3610q349k620J3607K0021
9600B4574O187j2112k670J3444K2938M640n046N206n161o327l39R601k688q755
9586D3492Q198K27n698n000q667J100M591j454N136j509Q061j0697p798O684J786
9571C8452Q431M101j4215j8622P6J1510K3567o675j8484k3407N46N739l361Q940
9557A6598j86j480m729L631o51O926o626R199m228N266o779O733J5458j424j7578
9542B0130P805J1770o110l930L993m117P567J297M091k707K817p506R470P258
9528E1828m696n410L849N628j570j7254p229O734j1250j073J9025J5900Q576q456
9514E4602r519N879o801k524j39L146k326n599M702j4307K132J3049J0186l80
$$ y = [12437, 17116, 18707, 24294, 15771, 12848, 17526, 8494, -516, -11695, 1915, -6434, -9054, 4553, 24574, 30761, 18649, 15979, 29423, 52361, 57001, 51955, 57161, 52000, 45673, 45334, 54935, 52247, 43492, 51690, 51917, 46219, 41219, 32552, 33652, 38243, 36789, 41925, 40416, 48477, 37780, 29982, 36666, 38452, 46883, 50984, 36769, 18147, 18223, 29733, 53300, 46625, 28141, 4734, 5280, 11019, 7658, 16598, 16412, 14932, 10203, 13834, 13183, 20109, 13483, 22682, 18454, 23720, 16941, 23674, 39132, 37708, 20130, 27935, 39705, 33595, 29665, 33658, 29541, 37108, 38405, 42496, 39789, 42606, 35100, 44570, 51828, 47132, 41722, 45571, 51199, 49629, 32375, 25146, 31880, 20630, 19557, 38582, 54482, 63058, 54602, 45083, 50962, 44161, 41637, 41498, 44644, 42318, 36719, 41421, 27114, 29246, 42295, 52481, 52101]
9500E2101L773n274l079m079j45K437o934l694K549m461k470J7039O296M452r865
9485D8646Q488N790J668j212l199j896L74J2172l303l016K901l294r451m49q45
9470E3374k59m501J0824K7640p87m947j1963M854L837l617m10p324j4569L752
9456E5904J7737l156k2555j6276M60K646M974K1991R134j5586j5997J6444K343
9443E8063l237J1556l502m098N078j045m404l810K034P510j261N122Q873k033
9429G4846l20j25k101m665k805p197p726n25p169j597K652J5300J3711q155r028
9414E5096l879Q352P694J963Q136P412k736j1056o479N907k642q090J138J0177
9400G0993J3941Q217J776o638j1071J3729M574M72p055q40o704m556J1737R813
$$ y = [52101, 55874, 50600, 47521, 43442, 43297, 45734, 38800, 35106, 37655, 33194, 30724, 47763, 54059, 58511, 48646, 57134, 62924, 64592, 63380, 60181, 58285, 58659, 70831, 67528, 64512, 67413, 64119, 54668, 54219, 53374, 53115, 48614, 59438, 87078, 86291, 81344, 69381, 74235, 78072, 74455, 74045, 66721, 52152, 55904, 73641, 70485, 47930, 31654, 32114, 34760, 39734, 61725, 70859, 55273, 39276, 55720, 58063, 54826, 66382, 62880, 58782, 63860, 62815, 58411, 54601, 56635, 64145, 62884, 68006, 76879, 74846, 74526, 74401, 72300, 67635, 64830, 57633, 49907, 49382, 42213, 40616, 43268, 58568, 72279, 64124, 55096, 51217, 59569, 67263, 69226, 77362, 84774, 82038, 70982, 64503, 70410, 67768, 59678, 60816, 70993, 84934, 93151, 94927, 88289, 77218, 90947, 95521, 95993, 88938, 88098, 81394, 76838, 88575, 98388]
9386I8388O532J4660J2907J0909K8715K0748L5461L7945M5986O2556Q4448R0021
9374E49276R5738J30877J10235Q2718P5171M8191q94m6239q4528j11329j18595
9363G30621j10051j08540r7887o3127n0524n5998k3047k1456j7458K494o721p34
9351A77572j7590j6285j1121q525j9388j77q21j905p936m999P567l52Q804Q358
9337A13202J2j6518j7324N015Q008J1719k727L807q554k545q85n133M70m118N133
9322H9562L42n106j2751k408M351Q029J4419o698k206J301l774p012n014J4214
9308H7249K157J2224N45j1125l526K4077n15k3317k6911O719K5286R737M205M893
9294A11698k1176P50L861J1739J368r968k672J1553m975J740O247J0568q3j98
$$ y = [98388, 104920, 119580, 132487, 143396, 172111, 192859, 228320, 266265, 312251, 374807, 459255, 549276, 645014, 775891, 886126, 968844, 1044015, 1092206, 1091312, 1045073, 960545, 849216, 730621, 620570, 512030, 414143, 351016, 300492, 244494, 221447, 199991, 182533, 185027, 178306, 177572, 159982, 143697, 132576, 124051, 104663, 104486, 103665, 101760, 93824, 88825, 96392, 96040, 104844, 113202, 113214, 96696, 79372, 84387, 92395, 104114, 101387, 105194, 96640, 94095, 93210, 88077, 88547, 84429, 89562, 89904, 84798, 72047, 69639, 73990, 82019, 96438, 89740, 87534, 88835, 85061, 78049, 73035, 87249, 89406, 101630, 102175, 91050, 87524, 111601, 111086, 87769, 60858, 67577, 92863, 102600, 106805, 111698, 90522, 91272, 95133, 106872, 108240, 98272, 95600, 107153, 102178, 103918, 110165, 120733, 120650, 120452]
9280A20452j1074q122j1737p774J701l47j409n890k858q058L650O17J6214j4104
9266G1261p776J4417M285J4724R152p420N141Q952L498j873l636l880R996K444
9252A19285M50Q618j584j041q83J4358O808l518J938L477O254r067K686N781J3390
9237A66952J2696r693o606J3236J8350L2768L185O592J1354K3905M0701N8859
9225C72299N4070J6149j5227k8192m3726m4650k6419l401M803m432P22L211q083
9212B77124j303J0933Q460J6799M332m941N237K461K196m819m190k318L122r044
9198C04049J4362J7553r23j1762j292J4926J6949J3624J6542Q188J2589N166J339
9185D11310J2607O276J6953J820J244J6359j870r318R16M523R436J1966J6831
$$ y = [120452, 109378, 101256, 89519, 81745, 83446, 83099, 81690, 75800, 72942, 64884, 68534, 69151, 85365, 71261, 63485, 77902, 82187, 96911, 106063, 98643, 103784, 112736, 116234, 114361, 110725, 106845, 116841, 119285, 119735, 128353, 126769, 125728, 124845, 139203, 146011, 142493, 144431, 147908, 154162, 145095, 147781, 153562, 166952, 179648, 169955, 163349, 176585, 194935, 227703, 230888, 237480, 248834, 272739, 313440, 372299, 426369, 442518, 427291, 399099, 355373, 310723, 284304, 280903, 285706, 281274, 281996, 285207, 277124, 275821, 286754, 295214, 312013, 316345, 311404, 316641, 319102, 321298, 316479, 312289, 309971, 313093, 304049, 318411, 335964, 335041, 323279, 321987, 336913, 353862, 367486, 384028, 392216, 404805, 409971, 411310, 423917, 430193, 447146, 448966, 450210, 466569, 464699, 455381, 456297, 460820, 470256, 482222, 499053]
9172D99053J4541J4269J0539l107J1263Q438R623J2153J0130P800Q414K12j0094
9159E93234P427K787k1312k177Q103J1903Q200m84o220n743n029l987K385Q634
9145E97721j438m01R11j0763J989J6175q63L366r199j5518K129L256j4437j6922
9131E56006O17m68K869r092N930L2974R575l817j1248o86N088M168j0462N278
9117E86732j2214k2693o513k0876j4416j1340j2028j4263J1971J8104k19j9214
9105D83031j3463P902K1960J763L467L767j329k2050m1233l5699J064p33j2889
9092C95558n959j643j421o892j7095k7627j7668J0112Q96L55p862o165q898q679
9078B97012K6406J7285k170r702j2472o274J2129J6972P071o819K278l121P61
$$ y = [499053, 513594, 527863, 538402, 535295, 546558, 554996, 564619, 576772, 586902, 594702, 603116, 603328, 593234, 600661, 603448, 582136, 579959, 588062, 599965, 608165, 607681, 601461, 595718, 590689, 586702, 589087, 597721, 596283, 595882, 596793, 586030, 588019, 604194, 603331, 606697, 597498, 581980, 584109, 587365, 572928, 556006, 556623, 556155, 559024, 549932, 555862, 588836, 598411, 594594, 583346, 582660, 587748, 591916, 581454, 586732, 574518, 551825, 545312, 524436, 510020, 498680, 486652, 472389, 484360, 502464, 502245, 483031, 469568, 477470, 499430, 501193, 504660, 508427, 507098, 485048, 443815, 408116, 409180, 408447, 395558, 389599, 387956, 386535, 379643, 362548, 334921, 317253, 327365, 328261, 328616, 320754, 314589, 305691, 297012, 323418, 340703, 338533, 328831, 316359, 310085, 322214, 339186, 346257, 339438, 341716, 338595, 339356]
9065C39356J848r858j8417M454J3317n714K156j1194N328J5328K736N875J7831
9052C63046J770J2648p367J940R768J8912o159l2343n227O554M465J5858l223
9039C80642j294K762J9067J9912P558J8821J0792L1222M218j1874k4563K06K1406
9026D78875L8438K3060M887K2500L7506L7038L2534K7999L9539N7486N1677M8155
9014H99694N8126P0964N9750N7248N8011O9411O8909O3532L6915M8454P7889J13294
9002A682197J31059J49313J68157J77996J88985K15127K20605K49526L38575M12653
8992C934193M99711N97206P15941Q59139J070932J369300J703861K048960K427994
8983A5227237K707252K977827L656877M907452O921629R932768J4318766K1100442
$$ y = [339356, 341204, 331346, 312929, 317383, 330700, 324986, 327142, 315948, 321276, 336604, 339340, 345215, 363046, 364816, 377464, 370097, 372037, 381805, 400717, 394558, 362215, 356988, 363542, 368007, 383865, 380642, 379348, 382110, 401177, 421089, 428647, 447468, 458260, 489482, 493700, 481826, 457263, 457469, 478875, 517313, 540373, 545260, 567760, 605266, 642304, 674838, 702837, 742376, 799862, 851539, 899694, 957820, 1028784, 1088534, 1145782, 1203793, 1273204, 1342113, 1405645, 1442560, 1491014, 1568903, 1682197, 1813256, 1962569, 2130726, 2308722, 2497707, 2712834, 2933439, 3182965, 3521540, 3934193, 4433904, 5031110, 5747051, 6606190, 7677122, 9046422, 10750283, 12799243, 15227237, 17934489, 20912316, 24569193, 29476645, 36398274, 46331042, 60649808, 81750250]
8975H1750250L1867836M8334478O7735361O9992489K7844072k7793765n7923657
8968B41807064o2988874n2069442l6356232k3772986j5711174j0668440p293220
8961C2946696m968633l435770k409818j787673j617446j642351j505002j271444
8953A4308559j175348j379431j470392j367942j145411r14431p02759o01856n04868
8944E046121m22346l47918k83957k38053j93320j57754j20220r4949r5980n8165
8934C033459q658O0889J81471K62310J10994q2488j58373j96635k23778j76399
8924B802792r6454o3382m3201k5165k3987K2092J00006J22415L071j82989k85180
8913B330018l21360k63364k08993j46726r6722q1822n3362m1758j9151l3486k9159
$$ y = [81750250, 113618086, 161952564, 229687925, 299680414, 327524486, 299730721, 241807064, 178818190, 126748748, 90392516, 66619530, 50908356, 40239916, 32946696, 27978063, 24542293, 22132475, 20344802, 18727356, 17085005, 15580003, 14308559, 13133211, 11753780, 10283388, 8915446, 7770035, 6855604, 6152845, 5550989, 5046121, 4623775, 4275857, 3991900, 3753847, 3560527, 3402773, 3282553, 3187604, 3091624, 3033459, 3024801, 3085690, 3267161, 3529471, 3640465, 3557977, 3399604, 3202969, 2979191, 2802792, 2706338, 2642956, 2599755, 2574590, 2550603, 2572695, 2672701, 2795116, 2798187, 2615198, 2330018, 2008658, 1745294, 1536301, 1389575, 1292853, 1211031, 1157669, 1115911, 1096760, 1063274, 1034115]
8902A034115m2364l1539k9584j8777k5587k1052k1681k5482j7436j8660j8489
8891G63464j2566k1827k3199j7332j6823l578j632j1855j0517K197j1147k0250
8879F14935m576p843k4645j2361k694j3686q827j340j9367j2594j8199p053k792
8866D78958m342O121K0068k800l905k897k0290j1640j751p997j0525j2302K65
8853D26963j060n245l685n104n459J0831J5486K6132P084j5579k6308l3711l0383
8840C59962k2341k5027j8013J984j0274R80J1130J357r281L049M188o055j5047
8827B76612j2862o41L245m891j8147n08m986K929P600o357j1607p936J9036K8610
8813B70097j692m217R459M367j4888j3444L563n082K046L749p912j3589n922M753
$$ y = [1034115, 991751, 960212, 930628, 911851, 886264, 865212, 843531, 818049, 800613, 781953, 763464, 750898, 729071, 705872, 688540, 671717, 668139, 666507, 654652, 644135, 646332, 635185, 614935, 610359, 602516, 577871, 565510, 562816, 549130, 540303, 538963, 519596, 507002, 488803, 481750, 478958, 474616, 480737, 500805, 498005, 494100, 491203, 470913, 459273, 457522, 449525, 439000, 426698, 426963, 425903, 420658, 416973, 411869, 406410, 417241, 432727, 458859, 465943, 450364, 424056, 390345, 359962, 337621, 312594, 294581, 296565, 286291, 287271, 298401, 299758, 290477, 293526, 297714, 291659, 276612, 263750, 263109, 266354, 261463, 243316, 242808, 237822, 240751, 248351, 241994, 230387, 222451, 241487, 270097, 268405, 264188, 273647, 278014, 263126, 249682, 253245, 248163, 250209, 253958, 246046, 232457, 226535, 231288]
8799B31288m242j0949q801j569P491m152j0759j73N060m859k1041O093j0888j8428
8785A54071q631j1489m222j623q326q984j143J2270L904P106O276n93P132k091
8771A43657K552p199J038J4374M863M799L880j0452R847K750p343q8q085k3046
8757A31547J21m079j303k948r048j734J3783O437Q742k891k986J2118J7842L767
8743A69368j3720k1972j7473N723L038J3558L867P746J261N383L450K040l947
8730A58322j0278r371P904L351j2295j1614q954J8752K0921J2059j581N366r335
8717A63247L959j491j3884m747j4707j4485L865P13j549R779J5046J0511O007
8704A62264P727j1428o328j373j1801n403J0739P135Q090k922P263J3717L056
$$ y = [231288, 227046, 216097, 207296, 205727, 213218, 209066, 198307, 198134, 203194, 198335, 177294, 183387, 172499, 154071, 145440, 133951, 129729, 128106, 119780, 110796, 109653, 121923, 125827, 132933, 139209, 138616, 145748, 143657, 146209, 139010, 140048, 154422, 159285, 164084, 167964, 157512, 167359, 170109, 162766, 162678, 154593, 131547, 131668, 127589, 126286, 123338, 114290, 112556, 126339, 132776, 141518, 138627, 135641, 147759, 165601, 169368, 155648, 133676, 116203, 121926, 124964, 138522, 142389, 150135, 151396, 156779, 160229, 162269, 158322, 148044, 138673, 146577, 149928, 137633, 126019, 117065, 135817, 156738, 168797, 167216, 172582, 163247, 167206, 165715, 151831, 147084, 132377, 117892, 121757, 122470, 120921, 130700, 145746, 156257, 162264, 169991, 158563, 152235, 150862, 139061, 133658, 144397, 151532, 159622, 156700, 163963, 177680, 180736]
8691A80736J7769J6908P085m338k5854j0936j7780j2798l927O141R410Q481L272
8678A74169K949k914m910P959j922K65Q693P242m799q400P236Q107M295j3172
8664A84798j8415j0451q577j247L046k1565K83J5608j778l645J2639j1673o790
8651A32233k70r65J1411J2020L0770L0461L8902J7407k8883k2771j4669k0954
8639A84692j0923P010Q166N574r620M051K9968M0102N0237P7051R5942J38646
8627F20896J61499J16537n753j19461j42555j28508j13713q0628l0034k4915k7145
8616B26220k2427o455j99n334o261k670N713r7k718J6646J86j3650k968N855L0626
8601B22467J8797l418J838l859j4237N2j4979P876J2495K3581K5660K4166K8617
$$ y = [180736, 198505, 215413, 222498, 218160, 192306, 181370, 163590, 150792, 146865, 153006, 162416, 170897, 174169, 177118, 174204, 169294, 177253, 175331, 175596, 184289, 191531, 186732, 178332, 185568, 193675, 197970, 184798, 166383, 155932, 147355, 146108, 149154, 127589, 127872, 143480, 141702, 138057, 150696, 139023, 132233, 131963, 130998, 142409, 154429, 185199, 215660, 254562, 271969, 243086, 220315, 205646, 184692, 173769, 180779, 188945, 194519, 184899, 188950, 218918, 259020, 309257, 386308, 482250, 620896, 782395, 898932, 893179, 773718, 631163, 502655, 388942, 308314, 278280, 253365, 226220, 203793, 197338, 197139, 191805, 185544, 182874, 188587, 188490, 185772, 202418, 202604, 188954, 185986, 191841, 222467, 241264, 237846, 239684, 235825, 221588, 221640, 206661, 214537, 227032, 250613, 276273, 300439, 329056]
8588C29056M7841O2351J06164J70975K53582L47556L40752J13383j38030k60519
8578A373111k63328j91413r4684m0477P102O9600R0318P6503O1900N8620M1588
8567A188840J6477k0607o5038q0608j14861j16385j18549j04452p5554o9325o3732
8556C76206m6962k8476k6734k1355j6562j4789j7125p47O100M106J6180K0521
8544B50363J3215K0695L2296N8544J04048J37620J67007J06983k9303j24876j50412
8533E86180j18485q0396p9225n4691k0639k0464l0171j1414J278J4088J745j6178
8521A71628j0376j5458j5439j7522r506m546M958l270m871L266J321L709P473
8508A11367j5598j8959R562o77P773J3944K879k335N83q67r982m724J0988J0524
$$ y = [329056, 376897, 439248, 545412, 716387, 969969, 1317525, 1658277, 1771660, 1633630, 1373111, 1109783, 918370, 823686, 783209, 790311, 859911, 950229, 1026732, 1088632, 1147252, 1188840, 1205317, 1184710, 1119672, 1039064, 924203, 807818, 689269, 584817, 509263, 439938, 376206, 329244, 300768, 274034, 252679, 236117, 221328, 204203, 203456, 209556, 213662, 229842, 250363, 263578, 284273, 316569, 375113, 479161, 616781, 783788, 890771, 861468, 736592, 586180, 467695, 387299, 308074, 253383, 232744, 212280, 182109, 170695, 171973, 186061, 187806, 171628, 161252, 145794, 130355, 112833, 103327, 98781, 103739, 100469, 95598, 98864, 100185, 103894, 111367, 95769, 76810, 86372, 85695, 93468, 107412, 110291, 107956, 108539, 107672, 97690, 92966, 103954, 114478]
8494A14478q633m603o746j1418Q264J0276m376j7874j9275l34J2914R234L62j1960
8480G0309j1559k496J9799R489k857j802m301J281K0182K1610P020j4728k5987
8467H5960j8736J5566K7254r654j9875k683K138o510L132K71J60M811j9430j1246
8453E1158K0304P468r189L674J6049O880o634j9453M349K9860L230j3124j6062
8440G8510j2071j736p162N973J5974l88l541m202j1499L13O004m782j907O726
8426F6212l007L688o15Q165N94L852o769j0084J1905r10L022O129M117N114k560
8411H8853m956q168m28J279j2315o921o050r25J0108k574k598J0180Q53k076J762
8396F6024m299j8628J1537o478N72M2k510K917J0297L026L11k778N864J3361j0590
$$ y = [114478, 105845, 101242, 94496, 83078, 91342, 101618, 97242, 79368, 60093, 59759, 72673, 81907, 82269, 70309, 58750, 56254, 76053, 85542, 82685, 80883, 76582, 77863, 98045, 119655, 126675, 111947, 85960, 67224, 82790, 110044, 100390, 80515, 77832, 79970, 73460, 76592, 76863, 77023, 81834, 62404, 51158, 71462, 78930, 69741, 73415, 89464, 96344, 89710, 70257, 74606, 104466, 107696, 94572, 78510, 66439, 64703, 57541, 63514, 79488, 79100, 75559, 71357, 59858, 60171, 66175, 61393, 59486, 66212, 63205, 66893, 66278, 74443, 75037, 78889, 72120, 62036, 73941, 73031, 76053, 82182, 86299, 91413, 88853, 83897, 75729, 75301, 76580, 64265, 57344, 51294, 50369, 60477, 57903, 55305, 65485, 66338, 64262, 66024, 61725, 43097, 54634, 48156, 48728, 48770, 46260, 49177, 59474, 62500, 62811, 60033, 65897, 79258, 68668]
8381F8668j9465j5886j6434q0Q430J3367P028M467j6347Q075J5890P93l006O295
8367F1795j2571m192J375o488J279J3957j5875j3355L212N091N173L800O252r524
8353C9929r457J9542J9003J4052M274r119J203L159o386m518j3553R062L585j9525
8339E1251j2961N637l557m893n051J0260Q445o745r686M975r78m244k945q577
8325B0931j0054O024J927R24M180J4775N185K445P710j5248k55J1458l06J241
8311E0937j0274N648k137r037J0636J155K005N313L2m453j4767K960R631m608
8297D3041K076l556J378J270r95p271J623K624n2k150p943j2184j0681K384r310
8282B54J3676J9560J7231K328j1653O495o631j6503p020J0755M551o185q603J067
$$ y = [68668, 49203, 33317, 16883, 16803, 25233, 38600, 45628, 50095, 33748, 41823, 57713, 58506, 55500, 61795, 49224, 45032, 46407, 39919, 41198, 55155, 39280, 25925, 29137, 34228, 39401, 43201, 49453, 39929, 30472, 50014, 69017, 83069, 87343, 78224, 79427, 82586, 76200, 71682, 58129, 67191, 70776, 51251, 38290, 43927, 40370, 35477, 30426, 40686, 49131, 42386, 32700, 37675, 36697, 32453, 29508, 20931, 10877, 16901, 18828, 19752, 23932, 38707, 43892, 46337, 54047, 38799, 38544, 50002, 49696, 50937, 40663, 46311, 44174, 35137, 45773, 46928, 48933, 54246, 54278, 49825, 35058, 38018, 47649, 43041, 45117, 41561, 42939, 44209, 43214, 35943, 37566, 40190, 40138, 37988, 30045, 17861, 7180, 9564, 254, 13930, 33490, 50721, 53049, 41396, 47891, 41260, 24757, 17737, 28492, 33043, 26858, 18255, 19322]
8268A9322o06k0012K393J0172m08O415J1032O911j243J1352J066L987j0402j5535
8254B4444Q945O420Q128n160j2823p224O470K808k823J9107O62j5167j4319Q35
8240B0303P971o557r880J1061J971m604j3191J0723J0593q408j2943J53J1777
8227A8969r102k718j151k60R990K5073J2075j0874k6356M106J3434R056m817q150
8213B9275n524p019K953L003M982k946O23O803N546j595k370J4967m774n296j3456
8198B5172r927K38J3306P126J512Q378j059r104p143j8754K615O466J2421l350
8184B7897k2806l712j449q06J8544k95j0909Q56k369q630O795N465m438p272J2070
8169H941K8073P132j2997m353j050k1238Q358P377J132k124R824k978j3494Q15
$$ y = [19322, 18716, -1296, 1097, 11269, 10861, 17276, 28308, 35219, 33976, 45328, 46394, 50381, 39979, 24444, 33389, 39809, 47937, 42777, 29954, 22730, 29200, 32008, 29185, 48292, 48954, 33787, 19468, 20303, 28274, 21717, 11837, 22898, 24869, 20265, 7074, 17797, 28390, 19982, 7039, 7192, 18969, 9867, 7149, 5998, 5738, 15728, 40801, 52876, 42002, 15646, 19752, 33186, 42242, 37425, 29275, 23751, 16732, 19685, 22688, 27670, 24724, 25347, 32150, 37696, 36101, 33731, 48698, 43924, 38628, 25172, 15245, 15483, 28789, 35915, 37427, 45805, 44746, 35642, 28499, 9745, 12360, 18826, 31247, 27897, 5091, 1379, -70, -876, 17668, 17373, 6464, 7320, 4951, -3679, 3116, 8581, 4143, -3129, 8941, 37014, 44146, 31149, 26796, 25746, 4508, 12866, 20243, 21375, 19251, 29075, 26097, 12603, 13418]
8155A3418N843R854Q466K069j0325j3908j3792o512Q058J478j630L057N253J769
8141A3098j640P79R486o588o506O132R117N109M310L522L286M726m802j914k836
8126C5279m299j2521m762j0244J34j3554L787R301J0246K229L506n420k97n096
8112H289m506J736P602J4809q94r525j002R948M232J1902q242j7214N593Q156
8098C0884o604l457N566R506j8838r933R4J9987J3310p823j5602m408J0146k765
8084B0063L15Q836J0167K514N347k4869p100P606l239n279J1020L337q25o290
8070B1603L934j9312R350j059r156K153J8089Q277N049K103J712o155j6938K012
8056B1662p131n074j6492q387J9944J1337m59O025j607q748J050M698L601K818
$$ y = [13418, 19261, 29115, 37581, 39650, 29325, 15417, 1625, -4887, 3171, 4649, 3019, 6076, 11329, 13098, 11458, 12237, 21723, 15135, 8629, 14761, 23878, 28987, 33297, 36819, 40105, 44831, 40029, 38115, 35279, 30980, 18459, 13697, 3453, 3587, -9967, -6180, 3121, 13367, 15596, 19102, 13682, 13385, 8289, 3783, 5519, 13121, 27930, 27036, 17511, 16509, 26457, 30689, 42591, 34349, 17135, 22728, 30884, 24280, 20823, 26389, 35895, 17057, 7124, 7218, 27205, 40515, 32692, 17090, 12682, 22828, 20063, 20378, 29214, 39381, 41895, 47242, 22373, 15273, 22879, 19640, 14361, 25381, 28718, 27893, 21603, 25537, 6225, 15575, 14516, 5360, 7513, 25602, 33879, 38928, 41031, 42743, 36588, 19650, 21662, 14531, 9457, -7035, -15422, 4522, 15859, 15400, 21425, 19818, 11070, 12120, 16818, 20419, 23237]
8042B3237r007j3057j268J8788N969j8515J2536M611P029L51p958J232K781r754
8028A6975j2457j6571j183n254l994J8932J9306Q268o013J1797J7836l942j375
8015D2325j4597m072j234N138r250J0002Q482j1166n647M337Q059m996m107Q127
8001C1401l049j363j2839j0224O900R133J3617N610O979j3947q004J0746L470
7988C8430J18p830j025R048J917n639m738q394L127L193r21J092Q401N132j009
7973D0902J090o232m709j074L79n940j1986o434R990P793N646l024j5094p039
7959D268m633M736J2934R054J2627k633o144J218R47j6447l367k434n08n76m677
7944D365J2577k853O546n105J3260k6P897M602q088k075r618j7804J797r50L636
$$ y = [23237, 14230, 1173, -95, 18693, 24662, 6147, 18683, 23294, 30323, 30674, 22716, 23948, 26729, 16975, 4518, -12053, -13236, -18490, -22484, -3552, 15754, 24022, 18009, 29806, 47642, 43700, 42325, 27728, 23656, 22422, 27560, 18310, 28312, 36794, 25628, 19981, 24318, 32377, 27381, 23274, 31401, 28352, 26989, 14150, 3926, 10826, 19959, 33576, 39186, 46165, 32218, 24214, 34960, 38430, 38548, 30718, 29693, 38741, 40658, 35019, 30281, 21887, 25014, 28207, 27286, 28378, 36779, 41911, 40902, 41992, 35760, 31051, 29977, 30356, 24416, 12430, 5996, 15986, 23779, 29425, 26401, 11307, 4268, -365, 4371, 17305, 26359, 38986, 36353, 30209, 31427, 32374, 15927, 12560, 10126, 9618, 9042, 4365, 16942, 14089, 20635, 15530, 28790, 28764, 36661, 41263, 33175, 31100, 21482, 3678, 5475, 4525, 8161]
7929H161K390J4676O456m484k494l799j2291m16Q925p257n031j012q832L813J893
7914F98K715N021L291k214j2130O889J3673K058j1600j5515N385O593n118k967
7900c221K950J4338K6115O382j4426p224j5141p574O879R914l682J5336J411q129
7886B3928o695J811P441m994P559P195R815j0151k5233j9332J5565J3601J186
7873B1696o555r29K303M741r35Q119J858r164k0782k0527l649J3356J1337J353
7859B222J1729j542j1156J8021J3523P502n080j9185j4291J0380m13R756J2227
7846C3693r3m603l550p952k678L09p818j3199n690J1151P743j7973J3381J0882
7832A3603j0845L375m43k027j664l981R736Q177l270r834J1012J423j142J1830
$$ y = [8161, 10551, 25227, 31683, 27199, 24705, 20906, 8615, 8199, 17124, 9867, 4836, 3824, -5008, -1195, 698, 3413, 8434, 11725, 9511, -2619, 4270, 17943, 20001, 8401, -7114, -1729, 4864, -254, -3221, -271, 14067, 40182, 46564, 32138, 24914, 9773, 2199, 9078, 18992, 15310, 30646, 32057, 23928, 17233, 19044, 26485, 21491, 29050, 36245, 46060, 35909, 10676, -8656, 6909, 20510, 21696, 15141, 14212, 16515, 21256, 20321, 28440, 30298, 21134, 352, -20175, -23824, -10468, 869, 2222, 13951, 12409, 1253, 19274, 32797, 40299, 35219, 16034, 1743, 12123, 11710, 21466, 33693, 33600, 28997, 25447, 17495, 14817, 15126, 7308, -5891, -11581, -430, 7313, -10660, 2721, 13603, 2758, 6133, 5690, 3663, 1999, -1982, 7754, 15931, 12661, 2827, 13839, 15262, 14120, 25950]
7818B5950j3263r708J205R836p136m011J6609L720J7344k056j3608j4074j3711
7805b903k315P880K60M825k807p799J571J766l471j7426l199J9487J4770o001
7791D638n221J364n344L662J2760K0668R06K782j5165o092J0356K19k0559n74
7777D400J3565J711p418j792L52Q132J1545j8144j1057Q63O840N37p737K681q019
7762c541K810O391J1002M42l517p281J885O88m078j3140j780J2985J5311N537
7748B3714j1636M983R886j7258j4332N320J9574N06m005m852K623k759J144q49
7734A2059j107J223N3k3K45l049J756q510M717r53L183l086j709R925j105j6291
7718b672q93J2450J0909j8559j0047o47j4080J8584O714N297k129M712l270n840
$$ y = [25950, 12687, 2979, 4184, 14020, 6884, 2873, 19482, 23202, 40546, 38490, 24882, 10808, -2903, -5218, 2662, 2922, 7747, 4940, -2859, -1288, 478, -2993, -20419, -23618, -4131, 10639, 4638, -583, 781, -4563, -901, 11859, 32527, 33433, 36215, 21050, 14958, 25314, 25533, 4974, 4400, 17965, 19676, 12258, 10466, 10818, 18950, 30495, 12351, 1294, 2157, 8997, 9534, 1797, 4478, -3541, -731, 5660, 16662, 17104, 13587, 6306, 8191, 8879, 4801, -8339, -10119, 2866, 18177, 23714, 12078, 17061, 26947, 9689, -4643, 677, 20251, 20757, 16752, 11900, 14523, 11764, 12908, 12059, 10952, 12175, 12228, 12205, 12450, 9401, 11157, 2647, 7364, 6411, 9594, 6508, 4799, 14724, 13619, -2672, -3565, 8885, 19794, 1235, -8812, -9459, -23539, -4955, 1759, 7056, 4927, 9639, 6369, 529]
7704E29o261k416k487O034k490K79J0382L85o187p947Q335Q013L938q797j882
7689e72j4762m598J5921J2427o968L712Q156j1321p146m264o984l282Q10J2417
7675f454N336p113L985K2315k314m792p297N449N252n718j5980O370R91K447N254
7660G731O422J624J113j0525N217O540L511n609j193K142j251j3642p294Q923
7646C709L324N428O772l329r294j3871J4232J3336J8690Q45j1468n689n007o194
7632A1484r638j9634R405K2947O847j678k602M92j915q453n328J319L197J9099
7618B5542j2648j4212J311K558Q664o622j0007j5903Q559J6592J0605p767r44
7605E728M240M578J2577N149j1046n372j0817p162p673R045N613J9196J4372m992
$$ y = [529, -5732, -8148, -10635, -4601, -7091, -6812, 3570, 3955, -2232, -10179, -1844, 6169, 10107, 1310, -572, -15334, -19932, -4011, 8416, 1448, 5160, 13316, 1995, -5151, -9415, -16399, -19681, -18871, -6454, -1118, -8231, -4246, 18069, 15755, 10963, 3666, 9115, 14367, 8649, -7331, -961, 30, 2477, 7731, 14153, 15777, 16890, 6365, 11582, 18122, 21633, 16024, 14831, 16973, 15722, 2080, -5214, 3709, 7033, 12461, 19233, 15904, 6610, -7261, 6971, 20307, 38997, 39842, 28374, 22685, 17678, 11484, 1846, -17788, -8383, 14564, 21411, 19733, 17131, 17623, 15708, 7255, 1927, 3246, 6443, 25542, 12894, -1318, -7, 2551, 11215, 4593, -5414, -21317, -12758, 3834, 14439, 6672, 5728, 9968, 14546, 27123, 32272, 21226, 15854, 5037, -2125, -9798, -753, 4860, 24056, 38428, 33436]
7591C3436j7156m095j619P4R384J07L116k0475p796L777J781L806J3182M819j7628
7576D713n612K445r60M899n987o6M590l055l568l70l325J556L771o992J2724J154
7560E917K717K358L36n377N180l948o143N902J096n416n361J4317K3044q947l876
7545B1799r016j005P185M275r774j699j0954J6790O983n382j1167k605P535k587
7531A0378k428m167j0731R914O919J5987P991j0624j821l081j536o399m182j0423
7517d203O687J4143j103o983O723O882o885k17j6912q654m315J148J7098L659
7503G068o98j928j134O594j4197j1402R888J7420J5711l296l977L363k0100k949
7489C63J952Q213r220r449n890O750K976L261j32Q947j6386N806J0303p594L150
$$ y = [33436, 16280, 12185, 10566, 10640, 20024, 20131, 23247, 2772, -5024, -1247, 534, 4340, 17522, 22341, 4713, -899, 1546, 586, 5485, -502, -568, 4022, 967, -2601, -2971, -6296, -4740, -969, -7961, 4763, 5917, 8634, 10992, 11328, 5951, 11131, 7183, 1040, 6942, 8038, 2622, -2739, 11578, 34622, 25675, 21799, 12783, 11778, 18963, 23238, 13464, 11765, 811, 17601, 24584, 19202, 8035, 5430, 12965, 10378, 7950, 3783, -6948, 2966, 9885, 25872, 33863, 23239, 21418, 18337, 16801, 10402, 6220, -4203, 2484, 16627, 15524, 8541, 15264, 22146, 15261, 15044, -1868, -10522, -14837, -13689, 3409, 7068, 6370, 4442, 3308, 9902, -4295, -15697, -5809, 11611, 27322, 24026, 20049, 23412, 3312, 363, 2315, 10528, 1308, -8141, -14031, -7281, -4305, -1044, -1176, 7771, -8615, -2809, 7494, -100, 3050]
7474C050J3650J802r220j358L181n499m372J887q944R146P547o923j4841L424
7460g470J9701J0474r831Q190O442p198n263J133l635K242m026o042l865j4042
7446a3190j0223J2565m822Q776N466M16n457K535M297M060J7271p013L639P91
7432A9111j3055j3150p760l614R307o420Q079R897N491J32M872j514P801P612
7418B6789n306o647K219l859j1956J32J4335j1120M901m913l477K45P753R803
7404A8899J6336O12p600j0503j6186n548r467J4179L533J1308O832o137m502q509
7390C247j0500j7304p319J0860R702J7688j782l329N252J3272q862q256p192j7313
7376b1836J2794J7359L991k843M77n939k634L363J3106M596J6409o946r050p678
$$ y = [3050, 16700, 18502, 9282, 7924, 11105, 5606, 1234, 3121, -5823, 3323, 10870, 3947, -10894, -7470, 12231, 22705, 12874, 21064, 27506, 20308, 15045, 16178, 12543, 14785, 10759, 4717, 852, -13190, -23413, -10848, -15670, -6894, -1428, -1012, -6469, -3934, 363, 4423, 21694, 14681, 18320, 19111, 6056, -7094, -14854, -18468, -9161, -15581, -7502, 2395, 7886, 8018, 12890, 11376, 19177, 26789, 21483, 14836, 17055, 13196, 1240, 1372, 15707, 4587, 9488, 4575, 1098, 1343, 9096, 18899, 35235, 35847, 28247, 17744, 1558, -3990, -13457, 722, 4255, 15563, 22395, 16258, 11756, 3247, -7253, -24557, -31876, -21016, -11314, 6374, 4592, 1263, 6515, 19787, 10925, 2669, -4523, -21836, -9042, 8317, 12308, 9465, 9942, 4003, 1369, 4732, 17838, 22434, 38843, 31897, 22847, 15169]
7362A5169k950m165n07Q628j558j0475R39m989p508r373J5791K945j17p76J935
7347B989p254r304k698O107O30P401J2297p905m146J858J486M273j8057j4965
7333b7288N715M913J3746L014n77L993J2580p509j0060j3196O277P081J270P19
7319F78q802J793J5682m66j269n872m801J399J496Q125n287j977L624J2552N614
7304B2489j5236q152j051P578L754L112L673Q830M037p892k0919j0713J3631M494
7290G635j1697l448Q824P362K891m155M420l182R311R54j5112q045J7594J329
7276A4681k3254M874Q096m38n441J762N244J454j4444l027J3183J016j3945l406
7262a3645J5854r11L594j3048j1454L675J2980K878J0616Q332M402k466r952k50
$$ y = [15169, 12219, 8054, 7547, 16175, 14617, 4142, 5081, 92, -7416, -16789, -998, 1947, 1830, 1054, 2989, -4265, -13569, -16267, -10160, -9530, -2129, 10168, 2263, -1883, -25, 1461, 5734, -12323, -27288, -21573, -16660, -2914, 100, -477, 3516, 16096, 8587, -1473, -14669, -8392, -1311, -41, 678, -8124, -6331, 9351, 8885, 7616, 1744, -3057, -1658, -162, 7963, 2676, 699, 4323, 16875, 22489, 7253, -899, -1950, 5628, 9382, 12494, 16167, 24997, 29034, 21142, 223, -10490, 3141, 7635, -4062, -7510, 1314, 8676, 11567, 7412, 11832, 8650, 17961, 18915, 3803, -4242, 13352, 14681, -8573, -3699, 4397, 3959, -1482, 280, 5524, 6978, -7466, -10493, 2690, 3706, -10239, -13645, 2209, 1298, 4892, -8156, -19610, -15935, -2955, -77, 10539, 18871, 23273, 20807, 10855, 10605]
7248A0605j1056j116n346J4310J790K308J934j0914r987j1761L380J5071J4359
7235A3577P900j1817j430q782j415J5062M604j5850o142k328j3531p881O266J3647
7221h120Q119K750J5150M441j5194k1010r675K213K984p131Q851n550J967j201
7207b1406K2330Q949k075M030m460q444j0701q575J616J6152J4766N046j3099
7194D129j6933q707P927R0q10N490J1192K5095K580j749j1535n446j9195j1511
7180a9383N345R125R069Q542n374N803l86k1996M550L875J2371Q276q302o305
7166E210q217N391J6111O155k526J3657q183j1362J615N210l814j0083n191j789
7152B184k729k137j262O733k654J023J4938k231k519J782j90j7824R291R201J4096
$$ y = [10605, -451, -1567, -6913, 7397, 9187, 11495, 13429, 2515, -7472, -19233, -15853, -782, 13577, 21477, 9660, 8230, -552, -1967, 13095, 17699, 1849, -4293, -6621, -20152, -28033, -21767, -8120, -1, 2749, 17899, 22340, 7146, -13864, -23539, -21326, -18342, -25473, -16622, -22172, -20205, -21406, 924, 9873, 7798, 11828, 7368, -1076, -11777, -20352, -18736, -2584, 12182, 17228, 4129, -12804, -21511, -13584, -13494, -14304, -8814, 2378, 27473, 30053, 28304, 16769, 11323, -7872, -19383, -14038, -4913, 4156, 12698, 7324, 13127, 12741, -9255, -4705, -830, 11541, 19817, 11515, 5210, -3007, 2384, 18495, 24650, 22124, 35781, 27598, 16236, 17851, 23061, 19247, 9164, 3973, 2184, -545, -2682, -3944, 2789, 135, 1158, 16096, 13865, 11346, 13128, 12938, -4886, 4405, 13606, 27702]
7137B7702n96k611K611L293j3515q322L829J560O589o395j4907j3993R114j799
7123g440J0024N575J7572J2474j0759k1146j3519l154J0621j43j947N169O602
7110I929k288k558l21j0111m705l668O571J741j6238j477R581L835L37O023o836
7095a0185O607J2759P11o702J649P011R583r434o397l674M157n672o545l723m03
7080a0258q59J1290N798J101p918k50J1323M573k2811m868Q251j205j236m013
7066a1082m473O212Q78r22R831M241o449m4O548j2032q992J2223R654O855l060
7051I388m557J6j5463j3477J1511J091m485l541J4990K6633O988j4899j1649o232
7037c686M039J675n463o134O097Q841N015o041k2254j0744k975J3753J6658J0000
$$ y = [27702, 27106, 24495, 27106, 30399, 16884, 8562, 12391, 13951, 20540, 14145, -762, -14755, -5641, -7440, 2584, 8159, 25731, 38205, 27446, 6300, -7219, -10373, 248, 105, -1842, 3327, 9929, 7641, 5083, 4762, -5349, -10054, -13722, -7151, -5410, -21648, -23125, -13544, -9709, -9372, -3349, -10185, -3578, 9181, 9892, 3190, 4839, 11850, 21433, 11999, 5602, 1928, 6085, 413, -6132, -9855, -10258, -11117, 173, 5971, 7072, -846, -1096, 10227, 14800, -8011, -12879, -4628, -5833, -7069, -11082, -15555, -9343, -8465, -9387, 444, 4685, -1764, -1808, 4740, -7292, -16284, -4061, 5593, 12448, 9388, 4831, 4847, -10616, -24093, -12582, -11491, -15976, -19517, -4527, 22106, 29094, 14195, 2546, -3686, 353, 2028, -3435, -9569, -3472, 5369, 10384, 4343, -17911, -28655, -31630, -17877, -1219, 8781]
7023H781o426j0042k065R098Q549m582M973o389m022K482L102K182J4747N06j5500
7008E394j3299p443N416l047J1550J273r292J8388l956K803K570r416r970k229
6994a1258l186J3017J5318l872j5195j7358J83J0436q88P315k659k370N017l143
6980h643J4788R503k262j8059k313L939j398q524j545j195J0151J324L108N367
6966D241J2219N092p549k384j958k281J095K324k767j4995q449N027j941q625
6952b0951j13O331J4135n313m810J3356J173O13J0541R735k3334j4979l832M12
6938a7036R59j1038N849R465Q921M574L662o977O720k15j3116j4809L808O485
6924a2748J7034O594J479j9949j331K891k1143J3340L306J1543M415o034Q940
$$ y = [8781, 2355, -7687, -9752, -654, 7895, 3313, 8286, 1897, -2125, 357, 3459, 5641, 20388, 20894, 5394, -7905, -15348, -9932, -12979, -1429, -156, -9448, 8940, 4984, 7787, 10357, 941, -9029, -11258, -14444, -1427, 13891, 10019, -5176, -22534, -22351, -11915, -12803, -5488, -8147, -10517, -5500, -8643, 6145, 15648, 13386, -4673, -6986, -3047, -4445, -12969, -14514, -15709, -5558, -4234, -1126, 4241, 16460, 21552, 14003, 11619, 9661, 7380, 8475, 10799, 8032, -6963, -15412, -10385, -12326, -20951, -21064, -14733, -598, -5911, -10721, 2635, 3808, 4421, 14962, 24697, 1363, -13616, -17448, -17036, -16077, -27115, -21266, -11801, -2880, 1694, 5356, -1621, 5099, 4884, -8232, -23041, -19233, -12748, 4286, 10880, 12359, -7590, -8921, -6030, -27173, -13833, -10527, 1016, 5431, -603, 8337]
6911H337J660j0740j1814K0553J0033L860p945q308q239M288M998r02k356k299
6897A126j9043L258J1947m73n063J1520o925j3670j120J0791M787k0815R359J3476
6883h45P007J861P525j4522j0462J940o100J2088K451R378M437k0522k0409o342
6869c2515J0476p58J2822K22n068J6082M220o488q344k010m356J2382J2622K888
6855A2175n762r174L876m631j2690Q644j58r750j8941J7298o205P199R974N218
6841b927J088J1219k343j4452K273O007n876J704l400R827J4577j6676M855J0485
6827A6361P116p477l690k369l542q395m141M140K693l987o431j610M035Q684K821
6812D208r281J5073Q61j072J443l696j988N119K048J4269q571k093j9241n074
$$ y = [8337, 9997, -743, -12557, 7996, 18029, 21889, 13944, 5636, -2603, 1685, 6683, 5781, 3425, 1126, -17917, -14659, -2712, -3185, -8248, 3272, -3653, -17323, -18443, -7652, -2865, -23680, -14321, -845, 6162, 8023, 15548, 1026, -9436, -7496, -13596, -1508, 943, 10321, 14758, -5764, -26173, -32515, -22039, -22797, -9975, -9753, -14821, 1261, 5481, -1007, -9351, -11361, -15717, -3335, 9287, 12175, 6413, -2761, 1115, -3516, -16206, -7562, -7720, -17470, -36411, -19113, -25318, -18119, -8145, -2927, -1839, 9380, 7037, -7415, -5142, 865, -5011, -3307, -6707, 3120, 17697, 1021, 5876, 16361, 23477, 16000, 12310, 9941, 6399, -1996, -6137, -1997, 696, -3291, -9722, -11332, -7297, 1387, 4208, -5073, 10000, 10861, 9789, 11232, 7536, 5548, 10667, 12715, 26984, 18413, 16320, -2921, -7995]
6798g995N00M47J0107J4926O241J8309p664j8605j5049l278m760N402j3134K06
6784a4347J5673j514l186j4689J474N148o458J427J6454Q149r879j1780J048m526
6770a7006p901J6770p14j1348j585J7793q61k545j081L224K79P493J4488j2430
6756D576k1029j1719J5062J4804P191L10J5907k252o43r003P184k12Q097j394
6742B6879j7155j8377j1548L119Q921o211k300P324J8366J3698R79m700n913P371
6728B0453K4156Q15j736J8345O45j556j2975k0540k5821j3652j106M289J3277
6715D594R35j5119L695J4809Q842j6232k91M713O764l547j0463O96O84l648j968
6700e536k617o80R871R792K318O831j027R760k422n271k3042p278M621J2015l718
$$ y = [-7995, -7495, -7048, 3059, 17985, 24226, 42535, 34871, 16266, 1217, -2061, -6821, -1419, -14553, -14347, 1326, -188, -3374, -18063, -16589, -11441, -17899, -16472, -18, 8131, -1748, -13528, -12480, -17006, -24907, -8137, -8851, -20199, -21784, -3991, -4852, -7397, -8478, -5254, -4975, 2518, 17006, 4576, -16453, -28172, -13110, 1694, 8885, 9195, 25102, 22850, 22207, 13204, 20388, 20176, 28273, 26879, 9724, -8653, -20201, -17082, -8161, -14372, -16672, -9348, 9018, 22716, 23695, 18995, 13082, 20453, 44609, 45424, 43688, 62033, 62678, 61122, 48147, 27607, 1786, -11866, -12972, -8683, 4594, 5529, -9590, -5895, 8914, 17756, 1524, 1233, 5946, 12710, 9163, -1300, -604, 80, -3568, -5536, -8153, -8833, 1038, 10830, 13148, 19979, 18952, 28712, 26290, 21019, -2023, -9301, -4680, 7335, 3617]
6685C617P967M331R341o472j6189O395R988j516j9373L2M333n083j0668n014l505
6670b1816P83R659J5008J4054O933K011j2747o544j645L535l946j3841J364J5190
6656G998M952J1126r457n196j3796r392k980K291l36R892R179P675o613k0587
6642a5244m64J3355Kq358m846p668l076J4901N148L177o058J101K934p752l779
6627a6627j758J2810n943M472k908Q604J4774j52J647q121j2503R51o751k269
6613a3774Q870o09n360J979n331L892J543p199L220J40J765r282q497q726J6718
6598b0651L795J2683J1883N240M343j1525l014N663m274m985q006j86M892Q349
6584D207R945p652p17r397p774N021J5709M472j6719m824P25M656N479J173q322
$$ y = [3617, 11584, 15915, 25256, 18784, 2595, 8990, 18978, 17462, -1911, -1879, 2454, -2629, -13297, -18311, -21816, -21033, -11374, 3634, 17688, 24621, 26632, 13885, 7341, 5696, 9231, 5285, -8556, -7192, 7998, 12950, 24076, 14619, 9423, -4373, -13765, -16745, -14454, -14790, -4898, 4281, 11956, 5343, -15244, -15708, -2353, -2351, -10709, -15555, -23223, -26299, -11398, -6250, -3073, -9131, -8030, -5096, -12848, -16627, -18385, -5575, -11518, -7046, -9954, -1350, 13424, 13272, 14919, 6798, -5705, -4754, -11505, -13774, -4904, -5513, -10873, -8894, -14225, -10333, -8790, -15989, -12769, -12629, -10864, -20146, -28643, -37369, -20651, -16856, -4173, 7710, 12950, 17293, 5768, 2754, 8417, 4143, -842, -8848, -9034, -4142, 4207, 14152, 6500, 5783, -3614, -11388, -6367, 9342, 13814, -2905, -7729, -7004, -2348, 3131, 4304, -4018]
6569d018o820j5878R579J8508K5k601n163O99L358K0185J606l230j2147j2387
6555h284o642Q285j402R495K774o839j5606K584J6689L701J1180J1302j4093k791
6541A0353L40R86P370j9241m278J3002K239o425p452K061j939j3829O679R992
6527a42k747m111n148l772L074l28Q128L151N730L529j714p317P694P053j331
6512A1749N848J267j4504j1258n874Q662k0N700l588j5250k25P801j798p089J8206
6497c73J4253N196J084l769j2890m168p038J339N621j0038O14k0121J515J0284
6483a8491J1339k771K434O28j0499j0039j479R39K098J4587O994j9951M945K2840
6469C574M175j5255q758J1245R950K463J3361O740R49O509n841j2900p712n278
$$ y = [-4018, -10838, -26716, -17137, 1371, 1396, -1205, -6368, -5669, -2311, 17874, 19480, 16250, 4103, -8284, -14926, -6641, -8043, 1452, 4226, -2613, -18219, -15635, 1054, 4755, 15935, 27237, 13144, 10353, 10693, 11679, 19049, -192, -4470, 8532, 10771, 4346, -3106, -1045, -2984, -16813, -10134, -142, -2889, -7000, -12148, -15920, -12846, -13174, -5046, -1895, 3835, 7364, 5650, -1667, 6027, 13080, 11749, 17597, 18864, 4360, -6898, -12772, -4110, -4130, 1570, -2018, -17268, -17493, -9692, -11490, -18579, -373, 13880, 19076, 20160, 16391, 3501, -667, -7705, -6366, -745, -10783, -10169, -30290, -28775, -18491, -7152, -9923, -7489, -6861, -17360, -27399, -28878, -27939, -25841, -11254, -4260, -24211, -19266, 3574, 7749, -7506, -16264, -5019, 4931, 7394, 20755, 27495, 28444, 34953, 29112, 16212, 8500, 3222]
6455C222l226j176j0096M654J5355l813k1971J599R707K753J0812N746m964O07
6441I209k239j4210j2139l801J7802J1064M850j6384j0103J1450M014M685J2307
6428A6505n659j8860j7163Q823K2213L142J1164O30j0269j2062j0673l51P126
6415e434j459J1291M767M702j749P90O39q691p444J0635P926k69j3203j1994l713
6400a3206O316j1124l973n977J1424M794M715J7962J618R16N021P172o11O231
6386C1278p079r331q246j2602R427o232m49k648M902Q528k693o828R33j834J2979
6371A0105J1512m121j7821o220k747M204j5885j4535J052O229Q521O386j216o604
6357b1140j0578K7500P396j2125O32n538k078J2444n283j4164K557J9030R27o727
$$ y = [3222, -4, -1180, -11276, -6622, 8733, 4920, -17051, -15452, -5745, -2992, 7820, 13566, 8602, 9209, 6970, -7240, -19379, -23180, -5378, 5686, 10536, -5848, -15951, -4501, -487, 4198, 16505, 10846, -8014, -25177, -16354, 5859, 9001, 20165, 20795, 10526, -1536, -12209, -12560, -5434, -6893, 4398, 9165, 13867, 12118, 12908, 13547, 4856, -2588, 8047, 15973, 15704, 2501, -9493, -13206, -6890, -18014, -21987, -27964, -16540, -11746, -7031, 10931, 12549, 13465, 18486, 25658, 25047, 31278, 24199, 14868, 6622, -5980, 3447, -2785, -3234, -5882, -980, 7548, 4855, -1973, -1040, -2874, 10105, 21617, 17496, -325, -6545, -9292, -5088, -20973, -35508, -34456, -28227, -19706, -13320, -14536, -21140, -31718, -4218, 3178, -8947, -8315, -13853, -15931, -3487, -8770, -22934, -20377, -1347, -420, -7147]
6343g147p13j4294J943K2755J7584K103j764k5887p631J1073N680p149m956J541
6329f862l981j666J605R276K254L297m831P69L207q16l82j771j878l490j4268
6314a9537j0823J5247M515q661L068J1422N795O353r631J141Q299K766j4262l908
6300h216j0045Q25o155J1050P202l458J556L120l58k471L047M982J115k217L956
6285C933q930q272j4177L322Q414m179j694J1781K590O908K430k0162j7281J7881
6271a7436J0458o437L858J0655j5334r400J7885N664l739o423N638J6686M618
6258A6693J92m462K404j496q616j307o22q1j9986k19J2631J920l331q69J8907
6243A1758k3583j3103J6221J2035k311p293J272J4841l120J780k607j4298j1405
$$ y = [-7147, -7860, -22154, -20211, 2544, 20128, 22231, 20467, -5420, -13051, -1978, 3702, -3447, -8403, -6862, -10843, -12509, -10904, -1628, 626, 3923, -908, -139, 3068, 2252, 1870, 99, -1779, -5269, -19537, -30360, -15113, -10598, -19259, -16191, -4769, 1026, 7379, -2252, -1111, 7188, 9954, -4308, -8216, -18261, -17436, -23591, -12541, -5339, -8797, -7241, -4121, -4479, -6950, -3903, 1079, 2194, -23, 3933, -4997, -13269, -27446, -24124, -15710, -19889, -21583, -9802, -7212, -304, 2126, -18036, -35317, -17436, -6978, -13415, -9557, 1098, -14236, -23636, -5751, -87, -3826, -10249, -4611, 12075, 16693, 16885, 12423, 14827, 13331, 4715, 3408, 2786, 2705, -17281, -17500, -4869, -2949, -6280, -7149, 11758, -11825, -24928, -8707, 3328, 1017, -6276, -5004, 9837, 6717, 8497, 5890, -8408, -19813]
6230a9813R017J7586o071K89P216l27O021R88p161l894o708K122m630k720m842
6215a2927l456l310O952l703N685J082n806m894N325o727k161j912K142l298J2817
6200a4191K830K011J0733K118Nk813O147J595k440l300J7557k1873j2758K412
6186a1967M043K463m044p717j7085K62R32Q581O464m1K1901j948j3527K406M348
6171d929J114n960N644n813K147J3935O929j7025O91P88O147j404j6642l847n82
6156a8807K161j0842q469O106l630N113l282M672J700J8319J5871J807j1007n527
6142e815q950M57R761l467p373L058J2103L951j5163k147M841M861m42Q15j3329
6127a6839L5K2589K937p141j2681P396n479j932K60n235O949N212j1350q72J3804
$$ y = [-19813, -10796, 6790, 719, 1008, 8224, 7897, 13918, 14906, 7745, 3851, -2857, -735, -5365, -8085, -12927, -16383, -19693, -12741, -16444, -10759, -9677, -15483, -20377, -15052, -21779, -23940, -25852, -23710, -27008, -14191, -11361, -9350, 1383, 3501, 3506, 693, 6840, 8435, 5995, 2695, 20252, -1621, -14379, -11967, -7924, -5461, -9505, -17222, -34307, -34045, -33113, -24532, -18068, -18109, 3792, 1844, -11683, -9277, -4929, -3815, -9775, -4131, -9944, -7797, 6138, 13067, -3958, -3267, -2479, 3668, 2264, -14378, -18225, -18807, -16646, -27488, -35957, -29851, -33481, -28368, -31650, -26978, -25278, -6959, 8912, 10719, -288, -5815, -14765, -14308, -4547, -8014, -15387, -12329, -226, 3725, -11438, -13585, -8744, -3883, -4325, -3510, -16839, -16804, 5785, 8722, 1581, -11100, -3704, -9183, -11115, -10855, -16090, -9141, -3929, -15279, -16151, -2347]
6112b347P142j3458k2809l666L516J6956Q669m699p149J47j951M381N137J2575
6098B444J1399R012o849J0913q063j5418q923p774j363J7159Q809j6694o482J2768
6084I38J1103L014r078r522o359p029K652J8697J3494O494O779j5294k6010j3516
6070b3637L56J2883L020j4357m310R983J0922J1213m677j114J3027M430o199L69
6056A1909r955n156J0196L868q81l637l640o940m307r964k996J0137K0338M558
6042A3530r367j0501K617j942K512P610J1362O127j5192J985K284o755m705N369
6028D934Q27k0277o388O71k697J1198N657L754R599j510l054n390R000j0518j066
6013e260j8k095J4718q5m983m531j7587K188J865l1Q218P704p505o951J8524M189
$$ y = [-2347, 4795, -8663, -31472, -35138, -31622, -14666, -5997, -10696, -17845, -17698, -19649, -15268, -10131, 2444, 13843, 22855, 16006, 26919, 18856, 3438, -5485, -13259, -14622, 2537, 11346, -5348, -11830, 938, 12041, 15055, 5977, -3545, -9904, -16933, -14281, 4416, 17910, 24404, 31183, 15889, -10121, -23637, -23281, -10398, -7378, -21735, -26045, -16062, -5140, 6073, 1396, 282, 13309, 17739, 11540, 11909, 1954, -3202, 6994, 10862, 9981, 6344, 2704, -4236, -8543, -18507, -21503, -11366, 8972, 13530, 4163, -6338, -3721, -5663, -3151, 4459, 15821, 21948, 6756, 8741, 11025, 4270, -435, 4934, 5761, -14516, -20904, -20233, -22930, -11732, -6075, -2321, 7278, 5768, 2714, -2676, 6324, -4194, -5260, -5278, -7373, 7345, 7260, 2277, -2254, -19841, -17653, -15788, -15819, -7601, 103, -7402, -14353, 4171, 8360]
5997H360r962j1209O765j345p452l869M231N491L881n052j1756J7710J0651R145
5983A5589J1924m90O333m142n768j5135j7363N207J2221p245q634J2613L556n80
5969H086L316p396j7088L184m783M351J3742m089q508m575M299j891j3774K670
5955b2456J4218k27j867J1550k790O288p016k0074Q394n57j0159Q944J132j790
5941a6410l146N169J6389k030J781L198j6834L516P163j3348Q287j715n373q556
5927b1909J597J3519k253J108J3859j3443m765O57K176P732K566j8965k3297L725
5913c7693J5512o051l32M784k224P611J0012J2332m863O173N192M876p50l730
5899A0849k026m377J376K464L25P243J1575J239k5539j9629q967Q842J5287O038
$$ y = [8360, -1602, -12811, -6046, -7391, -14843, -18712, -14481, -8990, -5109, -10161, -21917, -4207, 6444, 15589, 27513, 27023, 33356, 29214, 23446, 8311, -9052, -3845, 8376, 1131, -7503, 5110, 8666, 8086, 11402, 4006, -13082, -9898, -14681, -10330, 3412, -677, -9185, -13760, -9461, -11352, -25126, -22456, -8238, -8465, -10332, 1218, -1572, 4716, -2300, -22374, -13980, -14537, -24696, -15752, -14620, -16410, -19556, -14387, 2002, -28, 1753, 4951, -11883, -8367, -1204, -14552, -6265, -7980, -13353, -21909, -20312, -6793, -9046, -7938, 5921, -7522, -12287, -11630, -9454, -1722, 844, -18121, -41418, -37693, -22181, -28232, -28564, -23780, -26004, -18393, -8381, 3951, -912, 5261, 10453, 15329, 14579, 10849, 8823, 4446, 5822, 8286, 8611, 15854, 27429, 28668, 3129, -16500, -25467, -16625, -1338, 4700]
5885D700O859jj955k834j3342m254K0492J91n397J052Q587m870o517j1941K456
5870f774K430o955n742K004J8466K0037o155J679l755k2804n792Q094l962P706
5856a523K3481L190k128Q69j4246j0658j896n098P745Q573p521j3496P00J709
5842a0299L586m118n51K043o816O088J3196j967r476o059J4089l582N08J444n562
5827g476j5936o588M281P097m428j091m11Q056P990L133R264O798m435p862k514
5812d122q108N01K971M176M080q722o858N812L237M825P299k699o344M446J0965
5797A1459o537m373Q282J866o763P067n45l614K031K094n833k790J4073J4050
5783C0467j8860r891Q171N711j1820j221l92j0108j6190K068J534j973N71l655
$$ y = [4700, 11559, 11558, 9603, 6769, -6573, -10827, 9665, 9856, 4459, 5511, 14098, 9228, 2711, -9230, -6774, -4344, -11299, -17041, -15037, 3429, 23466, 17311, 18990, 15235, -7569, -13361, -5267, -9229, -1523, 21958, 25148, 23020, 23889, 9643, -1015, -2911, -8009, -264, 8309, 788, -12708, -12008, -10299, -6713, -10831, -11382, -9339, -16155, -10067, 3129, 1162, -8314, -14373, -284, -3866, -3358, -1914, -7476, -23412, -30000, -25719, -18622, -23050, -24141, -24552, -16496, -8506, -5373, 3891, 10689, 6254, -1608, -4122, -12230, -11729, -8758, -4582, -502, -9224, -16082, -10270, -7033, -2208, 5091, 2392, -3952, 494, 11459, 4922, 549, 8831, 10697, 3934, 11001, 10456, 6842, 8873, 10967, 5134, 2344, 16417, 30467, 11607, 1716, 9887, 15598, 3778, 2557, 2165, -7943, -24133, -22065, -20531, -22504, -21933, -25588]
5769b5588Q8Q632P626J7260l999l50R736j1865j5254P160J0530M921o409L38L412
5754F238p538k206q013l012r58N63L725o08q15k648N930O236O952j3112k627J3655
5738A762j4458j5377J7626J2336O053Q971j1215p381P126J2662j3975j2855J133
5725g592K21K734j1693n490M943o660p793n6L707o42J0711J9087J6351o494j8290
5710f956J433k228q37r463J636o987p599J9357J0001o545m678l279q689O535P435
5695a0864m99j2091Q820J0229N09P400j4229q570l133J0328J0239K885L079j4578
5681a0475k3731n809J7041K6169J3561K479L191r827l175j6328K212j958j4536
5668b1186j1189P556J6584j705k316l850P722o6q901j747J6294P247k613k148
$$ y = [-25588, -25500, -16868, -9242, 8018, 4019, 3669, 13405, 1540, -13714, -6554, 3976, 8897, 2488, 2826, 6238, -1300, -3506, -11519, -14531, -15489, -14926, -11201, -11809, -12624, -15272, -9342, -3106, 3846, -9266, -11893, 1762, -12696, -28073, -10447, 1889, 7942, 16913, 5698, -1683, 5443, 18105, 4130, -8725, -7592, -7371, -4637, -16330, -21820, -16877, -23537, -31330, -31386, -27679, -28321, -17610, 1477, 17828, 11334, -6956, -5523, -7751, -8588, -18051, -16415, -23402, -31001, -11644, -1643, -8188, -12866, -16145, -24834, -18299, -10864, -11363, -23454, -14634, -4405, -3896, 3504, -10725, -19295, -22428, -12100, -1861, 1024, 4103, -10475, -34206, -40015, -22974, 3195, 16756, 19235, 22426, 12599, 9424, -6904, -4692, -6650, -21186, -32375, -24819, -8235, -9940, -12256, -16106, -8384, -8450, -17351, -19098, -2804, 4443, 1830, -318]
5654c18R61L82J662l092j0435j0669j1478R687R475o161o129J5874L769L728J59
5639b585n330J2769J2516P783q002p892J0139J3113L38j5343j4042j3192o116
5626a5844k797K395n597j2334N998J5589J0825j3973L081M144M135P035J0004
5613A2661n481M80j669j473j5278n214j3774J3818J1485o384O022n03M450J4330
5599A3470j0533L298j3254M077N982M10L664m529k523j2874m009R522K0026J3474
5585B6201k968j8692j2590R552m665j3019k482J6567J8341q438j2584q328J880
5572a1225Q993n511j1430j4456j184M175P313J8787k225o28L48j005J022J2517
5558E491J344M43m47j0096n447l225k978m192N374nj0565M446L389q646l469O959
$$ y = [-318, 643, 1025, 2687, -405, -10840, -21509, -32987, -23300, -13825, -19986, -26115, -10241, -6472, -2744, -2585, -7915, 4854, 17370, 25153, 17151, 9259, 19398, 32511, 32849, 17506, 3464, -9728, -15844, -18641, -16246, -21843, -34177, -28179, -12590, -1765, -15738, -12657, -8513, -4378, 2657, 12661, 7180, 7660, 5991, 4518, -10760, -15974, -29748, -15930, -4445, -10829, -4807, -5310, -860, 13470, 2937, 6235, -7019, -2942, 3040, 3450, 7114, 2585, 62, -12812, -16821, -7299, 12727, 26201, 23233, 4541, -8049, 1503, -3162, -16181, -18663, -2096, 16245, 7807, -4777, -13105, -11225, -2232, -7743, -19173, -33629, -34813, -30638, -23325, -4538, -6763, -7391, -7043, -8048, -7026, 5491, 6835, 7278, 6831, -3265, -8712, -11937, -14915, -19107, -13733, -13738, -24303, -19857, -16468, -25114, -28583, -21624]
5542b1624J5509K9208l535m479j0574l278l663O511J5602p87p169j8479o578J723
5528a1613n176J1359O116J4570l032k0427O250l664O566j3352j0456o338J3639
5515a5558J2841J0474j655k3112L955O111Q890q30L276m958k1954p832P925n82
5501b3009j8039p06P347J1378N45k987j493Q000J9040o402p733j3019j792L43
5487b8527O412J7327R941J881n805l602k644K381L831R360j4737j4524N36L07
5473a7863n551J472L208o975n482J4310J0049J357L794k024q941N778K847n225
5459i246r367r482k547J2516J6111N619J830j2319o95m121j79J1844L341r795
5445f490r327L579J9674m612k3052j2368L810Q109J0746j0901j5549O544Q96J2543
$$ y = [-21624, -6115, 23093, 19558, 15079, 4505, 1227, -2436, 4075, 19677, 18890, 11721, -6758, -13336, -11613, -16789, -5430, 686, 15256, 12224, -8203, -1953, -5617, 949, -12403, -22859, -29197, -15558, -2717, 7757, 6102, -17010, -13055, -6944, 1946, 1116, 4392, -566, -22520, -30352, -22427, -23009, -41048, -41754, -34407, -23029, -22484, -25471, -26964, -18964, 76, -6326, -14059, -27078, -28870, -28527, -22115, -4788, 5153, 7034, 1229, -2373, -5017, -2636, 1195, 10555, -4182, -18706, -18170, -17863, -23414, -21942, -18734, -25709, -31191, -16881, -6832, -5475, -1681, -3705, -12646, -6868, -4021, -9246, -18613, -28095, -30642, -18126, -2015, 3604, 5434, -6885, -7580, -11701, -11880, -36, 3305, -6490, -15817, -12238, 7436, 2824, -20228, -32596, -28786, -20677, -9931, -20832, -36381, -29837, -28941, -16398]
5431a6398J0541P439L868O868r13j2826K714p420j7700r43K650P97K717J634R590
5416g382J0536J237k0022j0863Q275J324j72j1324Q880J6804O375q151J5448p15
5402A0250P786n984k2923O309r77l817p282L536R658q010L638M747j4676N194
5388a2551J7295m258j0785p728k529q062L255J2276o975J8873N968J1373J7420
5375C3572j3981r999J1428j0871P01j1693j1878q747P592L9M108n823O292j4195
5361b3455j1254K422J4971k229K470O781J1891j924m73r105r26j0519o301R207
5347a8444P574O769J2116O20k903j0520q07L873m658l184K208K295N311K189n773
5332c334O936J5487k667j4105j253j4384l088J676L826M21q078p906K962m594
$$ y = [-16398, -5857, 1582, 5450, 12318, 11405, -1421, 1293, -6127, -23827, -24770, -22120, -21323, -18606, -16972, -7382, 3154, 4391, -15631, -26494, -18219, -16895, -17067, -28391, -19511, -2707, 3668, -4483, 10965, 10250, 18036, 12052, -10871, -4562, -5539, -9356, -16638, -13102, -3444, -11454, -7816, -3069, -17745, -12551, 4744, 486, -10299, -18027, -20556, -28618, -25363, -13087, -20062, -1189, 4779, 16152, 33572, 19591, 9592, 21020, 10149, 10850, -843, -12721, -21468, -13876, -13837, -9729, -15552, -9260, -23455, -34709, -32287, -17316, -19545, -17075, -10294, 1597, -327, -800, -9905, -10831, -21350, -27651, -18444, -10870, -4101, 8015, 8635, 5732, -4788, -5595, -1722, -6380, -9564, -7356, -5061, 250, 2439, -3334, 3602, 19089, 16422, 2317, 1064, -13320, -16408, -14732, -10906, -10485, -18563, -26469, -23507, -28101]
5318b8101J1265J1294R83J0838N943J0358N448q038P370j049q649n507K580j2504
5304B231j5797m995L943J4803l815j5211J0264O079N761m021k45l261j1319j4614
5290c0197Q19J2096J3302L812l125j433O05k47q050k539p30M504M976k620k470
5275a1297J871P335k54O167j3783r380K2193J0685j0548j11o122K715l303n818
5261i650p58o804o72P221L388Q240J3202o005j2406j1525L737L858m257j1153
5247b3584J3428M126j7750p768k00L890J4528M576k656J0844Q967J897j3087j4949
5233a7738J281N479q64N995n009k281M257J4342M48j1967o815o492R813N771N424
5218A644j4949j1565L674p739P832J3702m611n776J7604J8942j1808j2485k470
$$ y = [-28101, -16836, -5542, -4559, 6279, 12222, 22580, 28028, 19990, 27360, 26311, 17662, 12155, 14735, 2231, -13566, -18561, -14618, 185, -3630, -18841, -8577, -2498, 3263, -758, -1003, -4264, -15583, -30197, -29378, -17282, -3980, -168, -3293, -4726, -4121, -4368, -12418, -14957, -15687, -11183, -6207, -8827, -11297, -9426, -2091, -2345, 3822, -9961, -19341, 2852, 13537, 2989, 2878, -3244, -529, -3832, -9650, -10408, -17212, -17884, -10663, -7275, 965, 14167, 8162, -4244, -15769, -12032, -8174, -12431, -23584, -10156, -6030, -23780, -31548, -31748, -27858, -13330, -8754, -11410, -566, 8401, 10298, -2789, -17738, -16457, -10978, -11842, -5847, -10856, -13137, -8880, 5462, 5910, -6057, -12872, -19364, -9551, -3780, 1644, -13305, -24870, -21196, -28935, -21103, -7401, -12012, -17788, -184, 18758, 6950, -5535, -8005]
5205h005P22J1559J012j5839j2249q615J6055J1991L971J5310j1858j8474n439
5192a9859j73N952J569M363J488o768n236R511N098J0805K020j3076l37K404O635
5177D396J0210l895k471j0875M913R827l36m439j303j8528j917M824M303Q386
5163C095L214o736p066k647l150N481M244n505Q269P46M677r360j2014J5061k685
5148d376j0873J649K858j703O39j716K12n957R910l905j8951P451M116J251J5993
5133c402J857j4940p818P708L374R370q203l670n26k950N819K1293L487o852O997
5118A1544n068j7431k196K652n536J478J486o25J12r653p991J412M151N19p951
5103c3097j846J59N978L422m804M339J5574J625r815K404n735J36L965J3994J027
$$ y = [-8005, -7283, 4276, 5288, -10551, -22800, -31415, -15360, -3369, 602, 15912, 4054, -14420, -19859, -20032, -14080, -12511, -8148, -6660, -13428, -18664, -9153, -4055, 6750, 8770, -4306, -4643, -2239, 4396, 14606, 10711, 8240, -2635, 2278, 12105, 11769, 7330, 6027, -12501, -14418, -9594, -5291, 3095, 6309, -427, -7493, -10140, -13290, -7809, -3565, -9070, -801, -55, 4622, -4738, -16752, -1691, -4376, -15249, -13600, -10742, -12445, -11806, -13522, -13310, -19267, -9357, -13262, -32213, -24762, -20646, -19395, -3402, -1545, -16485, -24303, -16595, -13221, -3851, -12054, -15724, -16250, -19200, -13381, 7912, 11399, 4547, 11544, 6476, -10955, -13151, -10499, -16035, -14557, -13071, -13696, -13584, -23237, -31228, -29816, -25665, -25146, -33097, -34943, -34784, -28806, -25384, -30188, -25849, -10275, -8650, -18465, -16061, -21796, -21660, -17695, -3701, -2674]
5088b674J4025J2824j9164r652P949l372l614n259o402J1103R339l496j575P143
5074G175l732m558M690m076L223n044j2321j752J0980J1808J736j562k23J818
5060H162j2339o318L39M247M369j0390k11L921J2178J1449j123j3948m552m128
5046h344n544N234j884P658l691j083J1335M371j499J2478L613o552K624m647
5032A4069k4523j1970O821J993P92M728J7199k213r849K381K145p891n164k52
5018a1734j745k181r70Q567M502J376P03p373J524Q42j1390N683m393m785j2213
5003c3587J3967K4412P206j6462o10j4497o994r69j0779J064J5997J0112N842
4990e298J5631P779j3765J968J5542J0242j0682j8632r671J91J1240O426j1037
$$ y = [-2674, 11351, 24175, 5011, -4641, 3308, -64, -3678, -8937, -15339, -4236, 5103, 1607, 32, 7175, 3443, -1115, 3575, -501, 2722, -2322, -14643, -16395, -5415, 6393, 8129, 6567, 6344, 8162, -4177, -10495, -10156, -5909, -1540, -11930, -12141, -8220, 3958, 15407, 14284, 336, -4216, -8344, -13888, -8654, -10538, -2880, -6571, -7654, 3681, 8052, 6553, 19031, 22644, 16092, 18716, 14069, -10454, -22424, -15603, -13610, -12818, -8090, 9109, 6896, -2953, -572, 1573, -6318, -11482, -11734, -13479, -15660, -16630, -8063, -3561, -2185, -1482, -8855, -7331, -6489, -17879, -12196, -16589, -21374, -33587, -19620, 4792, 11998, -4464, -5074, -19571, -26565, -27534, -38313, -37249, -21252, -11140, -5298, 10333, 18112, 4347, 6315, 21857, 32099, 21417, 2785, -6886, -6695, 4545, 10971, -66]
4977f6r244r61l804N163j204M305J0684J9331j976j0291j3742r936n306M491o54
4962a3210J0266K520Q874j4543l286P523M539J960J4906m659j0936Q810j605j0457
4948G02K218r014o929j172P523R350j577j203o592m089Q764J2877K96o840j0615
4933f301j6849J902l775J1724P092K69l081J535l752p427K966n236k793K0097
4919c629O958J112L787j936L940J6554Q535k6676k8719r204J708j380J2488R514
4905f948j5525n421J5750M577L738n421k3048j4821M765P615M020Q176J4282J486
4891f775J1797J552j028M378j4922p972L631j2287R987M845k712Q2o743k526R525
4876i168L23j1088J701M903R282M124q276q869M688l369O793k348p309n455K631
$$ y = [-66, -9310, -10271, -14075, -8912, -10116, -5811, 4873, 24204, 22228, 11937, -1805, -11741, -17047, -12556, -13210, -2944, -424, 8450, -6093, -9379, -1856, 2683, 4643, 19549, 14890, 3954, 12764, 11159, 702, 2920, -6094, -13023, -14195, -6672, 2678, 1101, -102, -6694, -10783, -2019, 10858, 11154, 4314, -6301, -23150, -21248, -25023, -13299, -6207, -5938, -9019, -7484, -11236, -18663, -15697, -20933, -23726, -3629, 3329, 4441, 8228, 6292, 10232, 26786, 35321, 8645, -20074, -29278, -27570, -28950, -16462, -6948, -22473, -27894, -12144, -7567, -3829, -9250, -32298, -47119, -42354, -34739, -30719, -22543, -8261, -6775, 5022, 6574, 5546, 9924, -4998, -12970, -9339, -21626, -11639, -6794, -9506, -9424, -16167, -18693, -9168, -8845, -19933, -18232, -13329, -4047, 77, -8199, -17068, -12380, -15749, -8956, -11304, -18613, -24068, -21437]
4861b1437J423k989o935J7823K2622K849n111j7238O78r417L162J1821k538L5
4847e252K426J892j556K995N980n153o412l65J2589n054m425Q892j7215L111J6616
4832I069Q079j848j7232p694P450p152j720L665N693J599l823J1072j2976m911
4818a0729P204k596r136N424L318J0519Q484k377j705q922k463l628J2660P785
4804A3838m995j2865j0487n197J0654J3984O45m056l746Q176M903j2267o812P04
4790g521k541j0632J165J1014J5196l647j698o344n694q476J5854Q219k974j8185
4776a6264j0506P588L321j1837J0691P216N159m268q517m314P625Q280m699n501
4762a6026N843L029M596j163N169J2064q54k6971o626K4621J6812m664j5355r894
$$ y = [-21437, -20014, -23003, -29938, -12115, 10507, 13356, 8245, -8993, -8315, -17732, -14570, -2749, -5287, -5252, -2826, -934, -2490, 505, 6485, 1332, -5080, -5445, 7144, 2090, -2335, 6557, -10658, -7547, 9069, 17148, 15300, -1932, -9626, -2176, -9328, -11048, -7383, -1690, -91, -3914, 7158, -5818, -10729, -3525, -6121, -15257, -9833, -6515, 4004, 12488, 10111, 8406, -516, -2979, -6607, 6053, 13838, 8843, -4022, -14509, -19706, -9052, 4932, 5577, 1521, -2225, 5951, 10854, -1413, -8225, -7521, -10062, -20694, -19529, -8515, 6681, 3034, 1336, -5008, -10702, -19178, -3324, 4895, 1921, -16264, -26770, -19182, -15861, -27698, -17007, -9791, -4632, -8900, -17417, -21731, -14106, -5826, -10525, -16026, -10183, -7154, -2558, -3721, 1448, 13512, 12658, -14313, -20939, 3682, 20494, 15830, 475, -9419]
4748i419m788J4141Q521O150j3896j6842n160J06J9378J9166N52n788k012n769
4734D340r491k3176l20J7593L924M298o152J90M793J3639k979m462k415J642k365
4719i41q9j5390J0602L684P843l803O118L481O292o545p112j1585q397l754o745
4704b6341M768p471o99J1734J3810j7139k138J2240J5997q396P679M139J336k577
4690F942j1096o082l772K5578j196j914R56o344M470j369O26Q437m973m201m047
4675B015M583l521n806l099j4864j1338N572J2578n77O421j0872m912J3693L720
4661f407L883L77k121n84O906j2106j3167j668P538N10k4285j0282Q506L424J3105
4646b6371L495J5380J9620l870j8154r503L541j0731N482J2027J0398n754Q730
$$ y = [-9419, -14207, -66, 8455, 14605, 709, -16133, -21293, -21187, -1809, 17357, 17909, 12121, 10109, 4340, -5151, -28327, -28647, -11054, -7130, -2832, -8984, -8794, -4001, 9638, 6659, 2197, -218, 1424, -941, -1030, -16420, -5818, -2134, 5709, 1906, 8024, 11505, 17797, 11252, 4140, -7445, -15842, -19596, -26341, -21573, -29044, -29743, -18009, -4199, -21338, -23476, -11236, 4761, -3635, 4044, 8183, 9519, 6942, -4154, -10236, -14008, 11570, 10374, 8460, 9416, 3072, 7542, 6173, 6799, 15236, 10263, 6062, 2015, 6598, 3077, -2729, -5828, -20692, -32030, -26458, -13880, -14457, -8036, -18908, -23820, -10127, -6407, -2524, -2147, -4268, -4852, 2054, -10052, -23219, -24887, -17349, -16839, -41124, -51406, -42900, -39476, -26371, -22876, -7496, 12124, 8254, -9900, -19403, -15862, -26593, -21111, -9084, 1314, -4440, 4290]
4633D290M386j1800J831M976m90j4015r629Q542P428m84p147L675J758j940j5162
4618b3781j0738P489J1923R279P095m491J730o545r772r41N457J6670n742j026
4604c393P510J849j0297k676K739O48p349J5252L491r413o266k130J72n238O378
4589h723J0626L34o822O266J1289r066J6200J308j0559j458O050K845J4691p632
4575B5349j5418K212l468M426N291K368j0087j6670O168l719j602Q776m739R515
4561H402Q837j386L564K912q943o163L041p72p026j3500l688J099l493m1l297
4546b0454j592K851J289p764K69o647k034J4727P785Q377O630r20J0478j4042
4532a047J134Q721p042j0297o207K175K517N874j977R16J1957R168r185j3290
$$ y = [4290, 8676, -3124, -1293, 3683, 3193, -10822, -20451, -11909, -4481, -4965, -12112, -8437, -6679, -8619, -23781, -34519, -27030, -15107, -5828, 1267, -3224, -1494, -8039, -17811, -18752, -13295, 3375, -2367, -3393, 4117, 5966, -4331, -7007, -4268, -3620, -10969, 4283, 7774, -1639, -7905, -10035, -9863, -15101, -8723, 1903, 2237, -4585, 1681, 12970, 3904, 20104, 21412, 10853, 9395, 15445, 18290, 32981, 25349, 9931, 12143, 8675, 13101, 18392, 20760, 10673, -5997, 171, -3548, -5150, 3626, -1113, 8402, 17239, 15853, 19417, 22329, 13386, 7223, 10264, 9492, 2466, -11034, -14722, -13623, -17116, -17157, -20454, -22046, -19195, -17906, -25670, -25401, -32048, -34082, -19355, -11570, -3193, 3437, 2517, 12995, -1047, 87, 8808, 1766, -8531, -14738, -12563, -10046, -4172, -6149, -5233, 6724, 15892, 6707, -6583]
4518f583N293J0802M135j3062j327J6707P35o715J774n722p126q935K681o452
4504a3795q915l420j246m613k968Q389j591O630Q458N093P642K588o127q245Q395
4489c725J1273r294j3473P268O697o022n947p525K0113Q570q609l910j292J7691
4475A1815K1251k1117j5888j862Q406M302j250k313j0816O440M379J707q488m03
4461c837N661M109m850j6245j9907j4751L145K921O724K1676K098p050J0172J1102
4447I68j658j035q703L534m923K5237N7j4656J653O813j074j6692J888K158l681
4432a0114P634o015O716N752k360j3498n160j463Q069j572m898k433k09O428J5455
4417B332J918J499q271k783o39M781r48J267J9249M418j2959P710q98p500J1842
$$ y = [-6583, -1290, 9512, 13647, 585, -742, 15965, 16700, 9985, 11759, 6037, -1089, -10024, -7343, -13795, -22710, -26130, -27376, -31989, -34957, -26568, -28159, -21529, -13071, -7978, -336, 2252, -3875, -12120, -3725, 7548, -1746, -15219, -7951, -1254, -7276, -13223, -20748, -635, 7935, -674, -4584, -5876, 11815, 33066, 11949, -3939, -5801, 2605, 6907, 5657, 3344, -7472, -1032, 3347, 5054, -3434, -3837, 1824, 5933, 1083, -15162, -35069, -49820, -46675, -43754, -37030, -15354, -13256, -20306, -10134, 968, -690, -1725, -10428, -6894, -11817, 13420, 13477, -1179, 474, 7287, 6213, -10479, -8591, -6433, -10114, -2480, -8495, -1779, 3973, 1613, -11885, -17045, -18508, -10439, -12011, -16909, -19342, -19551, -13123, 2332, 4250, 5749, -2522, -5305, -5944, -1163, -2111, -844, 18405, 22823, 9864, 17574, 16676, 9176, 21018]
4402B1018q224q931q380M050m759N319m982p048m202J191N422j418O032J2889
4388G977R669O142m593q320p381p1N711k553j0871r057l808J5354p121L600K046
4373c276r22R062m145j2802J204J6632N246l543o194n294j3554K407J6209J1052
4359A2082K570p881p866n121K857L428J3551P209j505j0543K283k948P675m060
4345A1731j060j2983L039K566k046k716j5253o309J4179L59m863n91J6195q262
4331f014k287O588l203M060r2j623J776M108L625l866k018R434j942p886j8640
4316a7980l389J28J1190k17R064J5621q70k428q63l691q665q836O500N213o357
4301e580r24K205R193l880j5746P712l093o17M595n959j0044J1158J5116R457
$$ y = [21018, 12794, 3863, -4517, -467, -5226, 93, -4889, -11937, -16139, -14948, -9526, -10944, -4912, 7977, 17646, 23788, 19195, 10875, 3494, 3423, 9134, 6581, -4290, -13347, -17155, -1801, -8922, -5322, -3276, -4198, 4864, 719, -12083, -10879, 5753, 10999, 7456, 1262, -4032, -17586, -15179, 1030, 12082, 14652, 6771, -1095, -6216, -3359, 69, 13620, 20829, 19324, 8781, 11064, 8116, 15791, 11731, 10671, -2312, 727, 3293, 1247, -1469, -16722, -23031, -8852, -8493, -13356, -13947, 2248, -6014, -8301, -1713, -4916, -856, -948, -2571, -795, 3313, 6938, 3072, 1054, 10488, 8546, 660, -17980, -21369, -21241, -10051, -10268, -1204, 14417, 13547, 11119, 10256, 6565, -2100, -10936, -4436, 777, -5580, -6504, -4299, 4894, 1014, -14732, -7020, -10113, -10730, -6135, -12094, -22138, -10980, 4136, 13593]
4287A3593n514q375j1831R296q609K3587J3301k4250k6464M796R724o341m661
4274b1748M332J4786j098j4032k944n964k606l539J6092J9024m582l258j321Q338
4260A480M607j2964Q146M737n599m028m999J3294O835K968l197j5485j0949L891
4246a1263K10J0083J5328q347k89m191L611L991J1920o777k353O844n396n386
4232G985j0473P377O527P42r180N546P25m49Q686r193K769Q138r926k960N845
4217A2159j5562q097l054K117N165J188l608J0636O236K428J096l675j4144k312
4203i427J2909m560j8712K05J1618M74k711j4221K731R447J3369K671k768m965
4189c940k329r05M198R007n71q979j4523k324J1915j0096j3930p493q703o26J9912
$$ y = [13593, 8079, -296, -12127, -2831, -11440, 12147, 25448, 1198, -25266, -20470, -10746, -17087, -21748, -17416, -2630, -3728, -17760, -20704, -26668, -29274, -32813, -16721, 2303, -2279, -5537, -6858, 1480, 6087, -6877, 1269, 6006, 407, -3621, -8620, 4674, 11509, 14477, 11280, -4205, -15154, -11263, -11053, -970, 14358, 6011, 5722, 1531, 5142, 9133, 21053, 14276, 11923, 18767, 13371, 7985, -2488, 4889, 11416, 12158, 2978, 8524, 9249, 8800, 17486, 8293, 11062, 19200, 9274, 6314, 12159, -3403, -11500, -14554, -12437, -7272, -6084, -9692, 944, 7180, 9608, 10704, 7029, -7115, -9427, 3482, -1078, -19790, -19585, -7967, -7493, -10204, -24425, -21694, -12247, 1122, 3793, 1025, -3940, -6269, -7174, -2976, 6031, 5460, -3519, -18042, -20366, -8451, -18547, -32477, -39970, -48673, -49299, -29387]
4174b9387J6267J467j574k46r909p825J172J8207J880l779j1701Q24K5741O921
4160H058K71p105r792j1479L831Q658P7j3300k999l756j8k639q218J0711P477
4145b0223J2010M661L392j4115R56J3401J0275o43j2343j1415J5030J0812j75
4132A1623N264j563r564p690m131M292j0401k152N767l589l62n126k0635m031
4118d2298K5280J9935Q356K74k117j1780J120j9331o847L120O998Q314K711L058
4104c207j3359k241j1776J184L947K3124Q956n480M455M946q028q895n027j1958
4090b3359P591J0724L27k374N042n09k141j7815P428K3675k25o848n147J1950
4076H319j191o232j0183j186J7797J3751o4j8755j1414l162K146M867O200N119
$$ y = [-29387, -13120, -11653, -13227, -13473, -23382, -31207, -30035, -11828, -9948, -13727, -25428, -24604, 1137, 8058, 8329, 1224, -8568, -20047, -16216, -7558, -7481, -20781, -23780, -27536, -27554, -30193, -38411, -27700, -20223, -8213, -3552, -160, -14275, -13319, 82, 10357, 9714, -2629, -14044, 986, 11798, 11623, 16887, 15324, 5760, -1930, -6061, -1769, -12170, -14322, -8555, -12144, -12506, -17632, -38267, -42298, -17018, 2917, 11273, 11547, 9430, -2350, -1230, -20561, -27408, -24288, -17290, -8976, -6265, -3207, -16566, -18807, -30583, -29399, -25452, -2328, 6628, 1148, 5603, 10549, 2521, -6374, -11401, -23359, -15768, -5044, -4717, -7091, -2049, -2558, -4699, -22514, -15086, 8589, 8364, 1516, -3631, 8319, 7128, 896, -9287, -10473, 7324, 21075, 21011, 2256, -9158, -12320, -10174, -5307, 893, 6012]
4062F012j894P907q193k2316l815L892L506Q417L074Q134j636j3636j0318P150
4048a3716J0498j1374k611Q437j0411o637N156J6370m140k715j759p846k424O603
4034a6569O165N2n88J4253j0241r490J0521l203M353L293n065m592p817N222J6414
4019B708J688j113m374m104J404j1388k1798l721J8943J3077Q579n946j0265k619
4005a8929J367m456P050M996J087Q039j1858k175J0751J4656l828k021n013n071
3991e405Q73M994L97J2727N832J057j5785o120M504k316M8L416J5272K5725m164
3976D1055p316j6155j2893j8519n332q819J2343L266N246N48m769M970j700R1
3962g984Q798j1394j1302P028J7186N966r557o485l804J8041k355p476K340j423
$$ y = [6012, 4118, 12025, 3832, -18484, -22299, -18407, -14901, -6484, -3410, 4724, 3088, -10548, -20866, -13716, -3218, -14592, -17203, -8766, -19177, -25814, -20658, -4288, -8428, -11143, -12902, -20748, -23172, -16569, -10404, -10352, -10940, 3313, -6928, -16418, -5897, -9100, -4747, -1454, -6519, -11111, -18928, -13706, 2708, 4396, 3283, -1091, -5195, -3791, -15179, -36977, -40698, -21755, -8678, -99, -6045, -16310, -18929, -17562, -22018, -14968, -9972, -8885, -846, -12704, -14879, -4128, 10528, 6700, 4679, -334, -5405, -4532, 462, 859, 13586, 19418, 20475, 4690, -1430, 3074, 758, 806, 4222, 19494, 45219, 41055, 33739, 17584, 4691, -13828, -19160, -27979, -15636, -12370, -7124, -6576, -11345, -6375, -8075, -7984, 814, -10580, -21882, -14854, 2332, 8298, -1259, -7744, -11548, 6493, 4138, -3338, -998, -2421]
3948b421J1645O980j0032k1857P84j105R918K391R187N922j1064j1351J039J2566
3934B602m433p77J2804o52l859p415l535K417K697N624j0031j3632J116M230J9619
3919F775R466l62k425j1571n205k37R362j928J836o326n151J4459J2251j924K727
3904B1747j0276r013j065J0040R96j2179q636p870M384J4500Q906J2675j6754
3891G455k1273j0711J4428J1767N790j2065n944J0390R603j6650k0921k498j306
3878c1935m54p19O687J0657J4535j2737O603J5680j617j6520m038Q284J2941O173
3864A3540J0188k754j1419l364n29R768n121j3485J4417l989j3579J5256L917
3851A2846P278J812q093j996k072q658p608J829J106J043N960J1494q176o414
$$ y = [-2421, 9224, 16204, 6172, -15685, -14901, -16006, -6088, -3697, 5490, 11412, 348, -11003, -9964, 2602, -1831, -2608, 10196, 9544, 5685, -1730, -5265, -2848, -151, 5473, -4558, -18190, -17074, -12844, 6775, 16241, 15879, 13454, 1883, -3322, -3559, 5803, 3875, 5711, -615, -5766, 8693, 20944, 19020, 21747, 11471, 2458, 1393, 11433, 12429, 250, -8386, -16256, -11872, 2628, 11534, 24209, 7455, -13818, -24529, -10101, 1666, 7456, -4609, -10553, -163, 9440, -7210, -28131, -30629, -31935, -32389, -33108, -26421, -15764, -1229, -13966, -7363, 8317, 6700, -9820, -13858, -5574, 7367, 13540, 23728, 20974, 9555, 6191, 5662, 15430, 10309, -3176, 11241, 7252, -6327, 8929, 12846, 20124, 21936, 13843, 11847, 9775, 1117, -6491, -4662, -3556, -2513, 3447, 14941, 6765, 351]
3837C51J828Q079j764j2275j6479J179K0538J4491j34o908j0542O09K803O416
3823H192q557R767P996K335j9778j3866Q689l62r100M129K488L984k541Q56P559
3808A791J763m610o365R208j2876p619j3497r2K0411O949J1432J7762j517j3641
3794I099J845m896K508R267k293j1962j1314k572J857p259n038l509j0133j552
3780c5952Q193R61R522N942M725N566J845q30j0648M105j190j1527o301P304R70
3765a7315J4439J8818m472k6582J961P140J3339L434n224q314p789m016j6613
3752c1194J4518L683Q896K903Q588J5952k331j5267k989J3517k210j5517O355
3739D904K512K134j0209K861M048k247N438o736J991P520M549l888p677j6937
$$ y = [351, 2179, 10258, 8494, -3781, -20260, -19081, 1457, 15948, 15814, 8906, -1636, -1027, 1776, 8192, -365, 9402, 17398, 19733, -45, -13911, -5222, -5584, -14684, -10555, -8067, -4083, -6624, -5768, 1791, 3554, -1056, -7421, 1787, -11089, -18708, -32205, -32297, -11886, -4937, 6495, 24257, 22740, 9099, 10944, 6048, 8556, 17823, 15530, 3568, -7746, -10318, -8461, -15720, -20758, -24267, -34400, -35952, -27759, -26798, -17276, -11334, -6609, -1043, 802, -28, -10676, -6571, -7761, -19288, -25589, -18285, -17315, -2876, 15942, 11470, -15112, -13151, -6011, 7328, 10762, 5538, -2776, -10565, -14581, -31194, -16676, -12993, -4097, -1194, 7394, 23346, 21015, 5748, 2759, 16276, 14066, -1451, 4904, 7416, 9550, -659, 2202, 6250, 4003, 9441, 2705, 4696, 12216, 16765, 12877, 5200, -11737]
3725a1737J0671M352j3283j9132J3967J1501q913j37K0030J04r170P904J668J0822
3711A8647L243m394j2352j2393j3309P797L657K913j2057j625K184m489J748m152
3697b4582R562J9548M506j912R825N128j0540k1526q270K2047O471j8071j5055
3684b2869L633J6238m463p757m530q353J394j3559M271R306J4046L079L9K900
3670f625k183j2940M457K3310J6783o399j9641l560N528p87J2677Q712j2794P879
3656A4417L972j7525o882j838J3951N500q934q147n361l826R02Q729p930P447
3642e525J7752J0257Q160j5508j7589J325N280l887n836j1092j425N617K903M553
3628e015J635k475n562j7279m187J4238P458M171j885j0552n357J3464J6716M175
$$ y = [-11737, -1066, 3286, -9997, -29129, -15162, -3661, -12574, -12711, 7319, 7423, -1747, 6157, 7825, 18647, 21890, 17496, 5144, -7249, -20558, -12761, -9104, -6191, -18248, -19873, -17689, -22178, -20430, -24582, -15020, 4528, 9034, 7122, 16947, 22075, 11535, -9991, -18261, 3786, 10257, -7814, -22869, -19236, -2998, -7461, -15218, -19748, -28101, -26707, -40266, -35995, -26689, -12643, -9564, -9525, -6625, -8808, -21748, -17291, 6019, 22802, 16403, -3238, -6798, -1270, -2057, 10620, 19332, 6538, 14417, 18389, 864, -6018, -7856, 6095, 11595, 2661, -5486, -10847, -14673, -13771, -5042, -12972, -5525, 12227, 22484, 30644, 15136, -2453, -1128, 4152, 265, -5571, -16663, -18088, -12471, -9568, -5015, -3380, -5855, -11417, -28696, -32883, -18645, -11187, -7016, -8901, -19453, -24810, -11346, 5370, 9545]
3614I545k278j425M929J3557j476n472j3699j4396k350K850J473j51K294J8190
3600A1591Q149o387N85j832p425p534m711Q947J460j0831j8848j3751J0564J258
3586b8765O369j267o310O537J7897j0856j0836p090k227J3483N565J952O270J4509
3572E231j3085k2813m891K1507L391k414J2703k383l859K462k721N705n428J1169
3558D574m340j839N53O609l620R40m777p530j218l632O082L240q145M816Q72r359
3542a6774N879j2898l135J3797K748m737L639N545q175J0337J278q201L926j936
3528h707m035J0392j314M429Q932l964q687q036j2492J4852K6221J0583j4490
3515A3684j4414K0323j211j1036p624K530L749k623O766M625j3463L24K133O276
$$ y = [9545, 7267, 5842, 10771, 24328, 22852, 17380, 3681, -10715, -13065, -10215, -8742, -8893, -6599, 11591, 19740, 13353, 13938, 12106, 4681, -2853, -7564, 1383, 2843, -7988, -26836, -40587, -30023, -28765, -22396, -23663, -29973, -23436, -5539, -16395, -27231, -34321, -36548, -23065, -17500, -15548, -9278, 5231, -7854, -30667, -35558, -14051, -10660, -13074, -371, -2754, -6613, -4151, -6872, -1167, -6595, 4574, 234, -1605, -1052, 5557, 1937, 2877, -1900, -9430, -10648, -14280, -8198, -4958, -13103, -8287, -7415, -16774, -10895, -23793, -26928, -13131, -10383, -15120, -11481, -5936, -14111, -3774, -2496, -10697, -6771, -8707, -12742, -2350, -3664, 765, 9697, 5733, -2954, -10990, -23482, -8630, 17591, 28174, 13684, -730, 19593, 18382, 7346, -278, 2252, 6001, 3378, 10144, 14769, 1306, 1630, 3763, 10039]
3501A0039k132j3050k2815j9243P411Q065K0917Q907P526j823n702j111n770R590
3487H09L918o833K914q29J445J2290J8449k713p403j2354j2463J3498L402L241
3473A7371J134K228O582K638k962k1090j5896R971N582n766K731o88l88l297k226
3458d076M212J182K328O267O02M918O437P645P034j3115q696l814j2081r778q769
3443a9704p963m86J2061M18m374n892J7081J9172P672j3025o691L0j5416l953
3429b1070K1631J9693R192r118k0775O17O852j3135l095R856m935o713k660L17
3415a3343L206J3675Q398j6110o809j080p002KJ551Q145n214p298K2003J9584
3401A9708M386K17j3357j6413j4480N187J9948J87J2017K939q010j2794J300o517
$$ y = [10039, 7907, -5143, -27958, -47201, -39790, -31725, -10808, -1901, 5625, 3802, -1900, -3011, -8781, 809, 4727, -2106, 808, -21, 1424, 13714, 32163, 29450, 22047, 9693, -2770, 10728, 14130, 17371, 18505, 20733, 27315, 29953, 26991, 5901, -9995, -24, 5558, -208, 2523, 1835, 1447, -1850, -4076, 136, 1318, 3646, 9913, 10515, 15433, 21870, 29515, 36549, 23434, 14738, 10924, -1157, -10935, -19704, -27667, -28153, -16092, -15674, -20048, -25940, -8859, 10313, 17985, 4960, -1731, -1701, -17117, -21070, 561, 20254, 29446, 20328, -447, 170, 7022, -6113, -9208, 648, -4287, -11000, -13660, -13343, -10137, 3538, 11936, -4174, -10983, -12063, -19065, -19063, -17512, -9367, -14581, -21879, 124, 19708, 24094, 24311, 10954, -5459, -19939, -14752, 5196, 5383, 17400, 20339, 12329, -465, 835, -5682]
3387e682m272j5062M131M814O043n05p960j2172J1273M959K635J2647J6379l229
3373A3999k039k339j9249L481q791j1660J848J729O177M333J1716N509N270L334
3359A3318L546J229K329q758j856J0276j584j4811q607o467J727k197N82n68r724
3344b1565N240J0802j067j2160K691n039N095J2770J7174M819Q59r325p391p456
3330d553m505P162J5266N492N138l224j2939k5784n646J5734J241j478n625j0290
3316b4011j601R651J2271J970n236l386N244M771j603P446k993j5203o527J6521
3302b686R832k237k149l83j6618n332J771K3J4088J2550j336R524j6901m830N262
3287E78k432L366j596n361N987O593J786J8220j3589j6092K3821O755r122N160
$$ y = [-5682, -9954, -25016, -20885, -16071, -10028, -10533, -18493, -30665, -19392, -14433, -11798, 849, 17228, 13999, 11960, 9621, -9628, -6147, -14938, -26598, -24750, -23021, -16844, -12511, -795, 4714, 9984, 13318, 16864, 18093, 20422, 11664, 9808, 20084, 18500, 3689, -4918, -11385, -9658, -11855, -11273, -11841, -21565, -16325, -5523, -6590, -18750, -16059, -21098, -16003, -3233, 13941, 18760, 19619, 10294, 2903, -4553, -9058, -1896, 13370, 18862, 24000, 20776, 7837, -17947, -23593, -7859, -6618, -8096, -13721, -24011, -25612, -15961, -3690, -1720, -6956, -10342, -5098, -327, -1930, 5516, 2523, -12680, -19207, -2686, 7146, 4909, 2760, 2377, -14241, -19573, -17802, -17779, -3691, 8859, 7523, 17047, 146, -4684, 578, -1854, 1512, -84, -5445, 542, 7135, 8921, 27141, 13552, -2540, 21281, 28036, 18914, 24074]
3273B4074j4037J999J0538K629J1462j4805p164j37J627p310O33N615q456O267
3259A2935j588j3276N72j1446m760l419L331Q09j921m543o175K5795J9923n755
3245A0482k597j3572K853k543N155k599j5495J5044K7571q597j88o788p821J801
3231B706k126l435J1725N61J701N164p49m311K907J524j5588K975m427p448N08
3216h313K277k73R694l464q144K287k667J617r5o515j746M885Q939J0891K160
3201A1533l951q241j1922j1286N957J6210m045M455J2992n626j9534L839J3233
3188C614k150M869q916o652l39k947m38k979J523P83n033j0502o470J8146J6016
3173a475J2944N898j0747o796m090N245m65m066j1444r815o582J0517J3885J3141
$$ y = [24074, 10037, 12036, 22574, 25203, 36665, 21860, 14696, 14559, 16186, 8876, 9509, 15124, 6668, 12935, 11347, -1929, -1357, -12803, -17563, -20982, -17651, -16842, -18763, -23306, -29481, -3686, 16237, 10482, 7885, -5687, -2834, -5377, -222, -2821, -18316, -3272, 24299, 15702, 15514, 8726, 905, 2706, 580, -2855, 8870, 9431, 11132, 16296, 15547, 11236, 14143, 15667, 79, 3054, -1373, -8821, -8313, -6036, -6309, 3385, -79, -8223, -5936, -8603, -6986, -7081, -13596, -15342, -10457, -1518, 9373, 11533, 7582, -659, -12581, -23867, -17910, -1700, -5745, -1290, 11702, 6076, -13458, -9619, 3614, 1464, 6333, -2583, -9235, -9574, -12521, -12959, -15938, -14415, -13632, -18665, -29167, -35637, -17491, -1475, 11469, 17367, 6620, -176, -4266, 979, 514, -3552, -14996, -24811, -31393, -20876, -6991, 6150]
3159F150N635J529j096N843r966p314M72q273j4930P63O774N930p814n075o87
3144b2059o073p347q892J9694J2295N2k052q728J1311j0370j8270l637J944Q537
3130c3595K0724M121K012R996j293m470j0261j4409J5246J0664p204J274P004
3117a91O780P466n57r252j8271j0906J3081N91J820N96J4607M783M482P761k4781
3102a991j7572N447L94K53N649M003k164k234M139r122N40J1973j4062O925J8771
3087A0949J0350N772j0496m651K787J538j6666p818q360J2470J3089m135r456
3074d627r84N938m237j024j0034o552R870o841p66L102m31O292J0234R852j08
3059I684k447J163n239j886N983j3211R232K423q372j1347k086J2426m583l083
$$ y = [6150, 11785, 13314, 12218, 18061, 8095, 781, 1253, -7020, -21950, -21187, -14413, -8483, -16297, -21372, -22059, -28132, -35479, -44371, -24677, -12382, -12330, -14382, -23110, -11799, -22169, -40439, -44076, -42132, -33595, -12871, -8750, -6738, 3258, 1965, -2505, -12766, -27175, -11929, -1265, -8469, -7195, -191, 6589, 14055, 13498, 4246, -14025, -24931, -11850, -11259, -9439, -8843, 5764, 10547, 15029, 22790, -1991, -19563, -14116, -13722, -13469, -7820, -3817, -5981, -8215, -4076, -13198, -12658, -685, -14747, -7822, 10949, 21299, 27071, 16575, 11924, 14711, 16249, -417, -8235, -16595, -4125, 8964, 4829, -4627, -5611, 327, -3910, -4934, -14968, -21520, -11650, -18491, -19257, -16155, -16586, -10294, -60, 9792, 9684, 7237, 8400, 3161, 1275, 7258, -5953, 3279, 5702, -2670, -14017, -16103, -3677, -8260, -11343]
3045a1343n668J7458J7417J471j8414o280j0574J2628P501R705P429j6735j6500
3032a1905J407L085J272J0421K631q405p414J7526j6576j8659r412L889J2405
3019a9735K2822O889j5512K32J6082j216o967j2371k819Q582M329p639p50J6878
3005H805O599k0169j6194M892J5221q440M389O707Q828p661J130O937K0048j73
2991C0919q143j0004k717o544k466q591n956m886J0034N948M031l99J834J049
2977D109K52J2663j0303j1655M905J5017n647O755q541j2701j013j8782o027j374
2963c2342L230l007K318R503J6359J5719p34j9209k0088Q13r644J504K2004M716
2949h858j3535m86j83J3888k478L981K220L785J1885P158j5247j8535j442P850
$$ y = [-11343, -17011, 447, 17864, 19335, 921, -5359, -15933, -3305, 4196, 13901, 21330, 4595, -11905, -10498, -7413, -6141, 4280, 6911, -1494, -8908, 8618, -7958, -26617, -36029, -32140, -19735, 3087, 9976, -5536, -5304, 10778, 9562, 2595, -9776, -12595, -4013, 316, -7323, -8073, 8805, 15404, -4765, -20959, -16067, -846, -9286, -4897, 1810, 10638, 2977, 4107, 11044, 31092, 30919, 22776, 12772, 10055, 3511, 1045, -7546, -13502, -18388, -8354, -2406, 1625, 1226, 3060, 4109, 4361, 17024, 6721, -4934, -29, 14988, 9341, 16096, 7555, -5146, -6159, -24941, -30968, -32342, -29112, -32119, -29801, -20298, -3939, 11780, 11046, -8163, -28251, -27438, -37082, -35578, -13574, -8858, -22393, -22879, -23062, -9174, -11652, -7671, -5451, -1666, 10219, 17377, 2130, -16405, -17847, -9997]
2935i997P131n055N365Q36N705J0209R419N746m246k2784l555nJ1810n843q00
2920C936N075o357J775N476p099K349j0l86j5107O915k182n200J4682N910K143
2905A1920j3349q078J4017L797o301N990j046o646j687Q261N014o234p458n640
2891g440k4719L273o16l7l505K0052K3994j58r665j474q89K169Q452J1686N873
2876B6996N082p665j0332j5340m840O740M783p346L577k90k3749j7969K0270J0627
2862i456Q09J0118j4264qP677N752M26J4242P381j0734o247K297j0243p653K49
2847i654n789J6012M479Q632m367j2338L714J2731r74j4099m08Q752j2481j1821
2833a7611p775J8201M522J3631O44o480L957J733J890J311n15o606n872j130Q513
$$ y = [-9997, -2866, -7921, -2556, -1720, 3985, 14194, 23613, 29359, 25113, 2329, -1226, -1231, 10579, 4736, 3936, 9011, 2654, 4429, 9905, 2806, 5155, 5145, 4759, -10348, -3433, -5615, -10815, 3867, 9777, 11920, -1429, -9507, 4510, 8307, 2006, 7996, 6950, 304, -1383, 6878, 11892, 5658, -1800, -7440, -32159, -28886, -29502, -29539, -33044, -12992, 11002, 10844, 1179, -295, -1184, 985, 9437, 21123, 26996, 32078, 24413, 14081, -1259, -6099, 641, 5424, -1922, 1655, 1365, -22384, -40353, -20083, -9456, -8647, 1471, -12793, -12801, -5124, 628, 1054, 15296, 22677, 11943, 5696, 7993, -2250, -9903, -9654, -15443, 569, 5048, 13680, 9313, -3025, 689, 13420, 12446, -1653, -2061, 6691, -5790, -17611, -25386, -7185, -2663, 10968, 11612, 5132, 9089, 10822, 12712, 14023, 13508, 6902, 1030, -100, 8413]
2818H413L315O754q884j5340Q814M728p577K392r631N023j0150M000R23M73O112
2803f35N453Q780j5696j4310k003Q49J413O681L572j565M675K906R701R400n905
2788A3316p463O717j074p192q290J968J0763m64m396K443J4479M569o044j9216
2774A16r663J1437r744k137J8579o064r819n442l353O196Kk81P266j1388L373
2759a0922K0501J915r290j1988o995J2547J5150M221K633o719k714J0448p381
2746A1406n549m623j5412l446J1317R855m070M693L887J6848n203j0581k2458
2733a3336O259P117R65O403j273q67Nm695K478p869q086K0134j501m230O792n366
2717B930k414N422j1893j3737m137J3518q067J6555P575N215N693j8128r141M282
$$ y = [8413, 11728, 18482, 9598, -5742, 3072, 7800, 223, 2615, -7016, -1993, -12143, -8143, -7220, -6747, -635, 4818, 13598, -2098, -16408, -18411, -17562, -16149, -9468, -5896, -7461, -2786, 120, 9821, 19221, 13316, 5853, 12570, 11496, 4304, -3986, -2018, 8745, 8281, 3885, 6328, 20807, 25376, 19332, 116, -9547, 1890, -7854, -9991, 8588, 2524, -7295, -12737, -16090, -9894, -9892, -10173, -2907, -14295, -10922, 9579, 11494, 2204, -9784, -16779, -4232, 10918, 15139, 17772, 11053, 8339, 18787, 11406, 5857, 1234, -14178, -17624, -6307, 3548, -522, 4171, 8058, 24906, 19703, 9122, -13336, -7077, 40, 1005, 7408, 6135, 5268, 5273, 578, 3056, -4813, -12899, 7235, 5734, 1504, 8296, 2930, 516, 5938, -5955, -19692, -23829, -10311, -18378, -1823, 5752, 10967, 16660, -1468, -10609, -6327]
2703f327N388J259n937n650J0018L569k576L002j1971j6458N888L339k435L251
2689a5640J1099p750k566M044N802J5568L124q765j1587r1L755J836O10R319j2925
2674d167k453J1488n184J0139k310j1724J6302J4246n008o738k2598j8102P546
2661a8563J3097J8850r715m141j274N77O900L237j2494k719J3308n09m996Q159
2647I717k494L536R543j7494j6397p426Q838J360N628l794J620J7796r15R68Q734
2632A9220p105j0177K840L51o934o419n444j5499m910R047M1117K2230j1218k628
2618B4471k680j1029k4624j3332P573J1294j0295j728j569p64J3437J936L012
2605d298L227J3333J0011k6192j5821O888n117J7655n298j2826M699M033n988
$$ y = [-6327, -939, 320, -5617, -11267, -1249, 2320, -256, 2746, -9225, -25683, -19795, -16456, -18891, -15640, -4541, -12291, -14857, -10813, -5011, 10557, 13681, 4916, -6671, -6762, -3007, -1171, -561, 8758, -4167, -6620, 4868, -316, 9823, 7513, -4211, 12091, 26337, 21329, 14591, -8007, -26109, -18563, -5466, 13384, 3669, -472, -1746, -1169, 5731, 8968, -3526, -6245, 7063, 6554, 1558, 9717, 7223, 10759, 20302, 2808, -13589, -21015, -12177, -10817, -5189, -8983, -7363, 10433, 9518, 10486, 19220, 12115, 1938, 4778, 5129, -1805, -8224, -13668, -29167, -34077, -25030, 16087, 38317, 27099, 24471, 21791, 10762, -13862, -27194, -19621, -8327, -18622, -20350, -21919, -22683, -9246, -7310, -4298, -1071, 12262, 22273, -3919, -19740, -12852, -17969, -314, -5612, -18438, -13739, -9706, -15694]
2592a5694p353Q257J2777o80L52q806m542J770n0O470L376K736q739j155L509
2577g772m498n727M544J1400J0893J0027J1322o275p041q284k863j0703m78j5868
2563b1323L513J561R896O596J7755j2055q035j2131j402l271P14o459J2616R647
2549b378O516j3559N783Q803q737J758L27L156J0161k426Q007j2051j9042Q168
2535e514k338n812N595j729N736J5295J986j0147j0577M265J3128Q583j9087r504
2521a0120M779M796L273L954l932P600L133p851j2608k0786j0654J7437J8232
2508b747J2305J4694j7361j9616L157J7834l322q568j0424j3510l56P410J0805
2495i699P944N518p441J766j2982n572Q734K929j7253L194K0203Q673p311n339
$$ y = [-15694, -23047, -14790, -2013, -2693, -2341, -11147, -15689, -13919, -13969, -7499, -4123, -1387, -10126, -11281, -7772, -12270, -17997, -13453, -2053, 8840, 18867, 30189, 23914, 16873, 8589, 5726, -4977, -5455, -21323, -17810, -16249, -6353, 243, 17998, 5943, -2092, -14223, -15625, -18896, -18182, -24641, -12025, -2378, 4138, -9421, -3638, 5165, -3572, -1814, -1487, 1669, 11830, 9404, 17411, 5360, -13682, -5514, -7852, -13664, -8069, -9798, -4062, 11233, 13219, 3072, -7505, -3240, 9888, 18471, -616, -10120, -5341, -545, 2728, 6682, 2750, 10350, 13483, 5632, -6976, -27762, -38416, -20979, -2747, 9558, 24252, 6891, -12725, -9568, 8266, 4944, -3624, -14048, -27558, -27914, -20504, -9699, -1755, 3763, -3678, -1912, -14894, -20466, -11732, -8803, -26056, -22862, -2659, 6014, -1297, -6636]
2481f636Q189J0223q63l118l088m764j599l308N320J1431k764L44q302m801N37
2466c199J725m745L259k504j0848R107J5071J9905M79j4063O03J9530j0877k1314
2452B129n731P655M623p388M402o3n211J2798M795j2876Q852R735p025k3414k468
$$ y = [-6636, 1553, 11776, 10913, 7795, 4707, -57, -1656, -4964, 356, 11787, 9023, 9367, 1065, -3736, -3199, -1474, -6219, -2960, -5464, -16312, -7205, 7866, 27771, 28250, 14187, 14790, 34320, 23443, 2129, -3602, 4053, 8676, 1288, 5690, 5627, 416, 13214, 18009, 5133, 13985, 23720, 16695, -6719, -9187]
$$ [...]
##END NTUPLES=NMR SPECTRUM
##END=
