##TITLE=Analysis number 329318
Compound Code cc 32601
Project Code adrs
Chemist Name ugmt ltd
##JCAMPDX= 6.0         $$ Bruker NMR JCAMP-DX V2.0
##DATA TYPE= NMR SPECTRUM
##DATA CLASS= NTUPLES
##ORIGIN= Bruker BioSpin GmbH
##OWNER= nmr
$$ XWIN-NMR		Version 3.5
$$ Mon Aug 20 19:18:46 2007 GMT Daylight Time (UT+1h)  MAYBRIDGE\nmr@NMR_250MHZ
##.OBSERVE FREQUENCY= 250.131544655141
##.OBSERVE NUCLEUS= ^1H
##.ACQUISITION MODE= SIMULTANEOUS (DQD)
##.ACQUISITION SCHEME= undefined
##.AVERAGES= 16
##.DIGITISER RES= 18
##SPECTROMETER/DATA SYSTEM= dpx250
##.PULSE SEQUENCE= zg30
##.SOLVENT NAME= DMSO
##.SHIFT REFERENCE= (INTERNAL, DMSO, 0, 16.522)
##AUDIT TRAIL= $$ (NUMBER, WHEN, WHO, WHERE, WHAT)
$$ ##TITLE= Audit trail, XWIN-NMR		Version 3.5
$$ ##JCAMPDX= 5.01
$$ ##ORIGIN= Bruker BioSpin GmbH
$$ ##OWNER= nmr
$$ C:\u/data/dgb/nmr/ADRS/930/pdata/1/auditp.txt
$$ ##AUDIT TRAIL=  $$ (NUMBER, WHEN, WHO, WHERE, WHAT)
(   1,<2007-08-20 19:17:26.23 +100>,<MAYBRIDGE\nmr>,<NMR_250MHZ>,
      <created by zg, POWCHK disabled, PULCHK disabled
       configuration hash MD5:
       76 6E 9A 78 1E 09 19 81 EC 84 63 8F B0 6A 59 2D
       data hash MD5: 64K
       58 BA 95 DC 6B 57 C6 63 BB 67 C4 F2 D2 CE F5 A2>)
(   2,<2007-08-20 19:17:54.74 +100>,<MAYBRIDGE\nmr>,<NMR_250MHZ>,
      <Start of raw data processing
       ef LB = 0.3 FT_mod = 6 PKNL = 1 SI = 32K 
       data hash MD5: 32K
       9A 5D 26 0A 71 CF 46 10 B8 B7 C1 36 89 B2 AA 55>)
(   3,<2007-08-20 19:18:01.88 +100>,<MAYBRIDGE\nmr>,<NMR_250MHZ>,
      <apk 
       data hash MD5: 32K
       EE 62 12 05 05 9F 21 33 BD F0 C1 A4 58 12 A0 02>)
(   4,<2007-08-20 19:18:07.21 +100>,<MAYBRIDGE\nmr>,<NMR_250MHZ>,
      <abs ABSG = 5 
       data hash MD5: 32K
       43 E4 4E E1 C7 07 48 36 40 F4 78 E6 C8 70 4F AA>)
$$ ##END=
$$ 
$$ hash MD5
$$ 18 68 0F 54 97 4D A6 D8 83 8A 62 11 F3 10 98 0A
##$RELAX= 
##$RELAX= 
##$RELAX= 
##$RELAX= 
##$RELAX= 
##$RELAX= 
##$RELAX= 
$$ Bruker specific parameters
$$ --------------------------
##$DU= <C:\u>
##$EXPNO= 930
##$NAME= <ADRS>
##$PROCNO= 1
##$TYPE= <nmr>
##$USER= <dgb>
##$AMP= (0..31)
100 100 100 100 100 100 100 100 100 100 100 100 100 100 100 100 100 100 
100 100 100 100 100 100 100 100 100 100 100 100 100 100 
##$AQSEQ= 0
##$AQ_mod= 3
##$AUNM= <au_zg>
##$AUTOPOS= <20 >
##$BF1= 250.13
##$BF2= 250.13
##$BF3= 250.13
##$BF4= 250.13
##$BF5= 500.13
##$BF6= 500.13
##$BF7= 500.13
##$BF8= 500.13
##$BYTORDA= 1
##$CFDGTYP= 0
##$CFRGTYP= 5
##$CHEMSTR= <none>
##$CNST= (0..31)
1 1 145 1 1 1 1 1 1 1 1 1 1 1 1 1 1 1 1 1 1 1 1 1 1 1 1 1 1 1 1 1 
##$CPDPRG= <>
##$CPDPRG1= <>
##$CPDPRG2= <>
##$CPDPRG3= <>
##$CPDPRG4= <mlev>
##$CPDPRG5= <mlev>
##$CPDPRG6= <mlev>
##$CPDPRG7= <mlev>
##$CPDPRG8= <mlev>
##$CPDPRGB= <>
##$CPDPRGT= <>
##$D= (0..31)
0 1 0 0 0 0 0 0 0 0.06 0 0 0 0 0 0 0.0002 0 0 0 0 0 0 0 0 0 0 0 0 0 0 
0 
##$DATE= 1187633844
##$DBL= (0..7)
120 120 120 120 120 120 120 120 
##$DBP= (0..7)
150 150 150 150 150 150 150 150 
##$DBP07= 0
##$DBPNAM0= <>
##$DBPNAM1= <>
##$DBPNAM2= <>
##$DBPNAM3= <>
$$ [...]
##$SUBNAM7= <"">
##$SUBNAM8= <"">
##$SUBNAM9= <"">
##$SW= 20.6930455092707
##$SWIBOX= (0..15)
0 0 3 0 0 0 0 0 0 0 0 0 0 0 0 0 
##$SW_h= 5175.983436853
##$TD= 65536
##$TD0= 1
##$TE= 296.16
##$TE2= 300
##$TE3= 300
##$TEG= 300
##$TL= (0..7)
0 120 120 120 120 120 120 120 
##$TP= (0..7)
150 150 150 150 150 150 150 150 
##$TP07= 0
##$TPNAME0= <>
##$TPNAME1= <>
##$TPNAME2= <>
##$TPNAME3= <>
##$TPNAME4= <>
##$TPNAME5= <>
##$TPNAME6= <>
##$TPNAME7= <>
##$TPOAL= (0..7)
0.5 0.5 0.5 0.5 0.5 0.5 0.5 0.5 
##$TPOFFS= (0..7)
0 0 0 0 0 0 0 0 
##$TUNHIN= 0
##$TUNHOUT= 0
##$TUNXOUT= 0
##$USERA1= <user>
##$USERA2= <user>
##$USERA3= <user>
##$USERA4= <user>
##$USERA5= <user>
##$V9= 5
##$VALIST= <valist>
##$VCLIST= <CCCCCCCCCCCCCCC>
##$VD= 0
##$VDLIST= <DDDDDDDDDDDDDDD>
##$VPLIST= <PPPPPPPPPPPPPPP>
##$VTLIST= <TTTTTTTTTTTTTTT>
##$WBST= 1024
##$WBSW= 4
##$XGAIN= (0..3)
0 0 0 0 
##$XL= 0
##$YL= 0
##$YMAX_a= 326993
##$YMIN_a= -194044
##$ZGOPTNS= <>
##$ZL1= 120
##$ZL2= 120
##$ZL3= 120
##$ZL4= 120
##$ABSF1= 16.522
##$ABSF2= -4.171173
##$ABSG= 5
##$ABSL= 3
##$ALPHA= 0
##$AQORDER= 0
##$ASSFAC= 0
##$ASSFACI= 0
##$ASSFACX= 0
##$ASSWID= 0
##$AUNMP= <proc_1d>
##$AZFE= 0.1
##$AZFW= 0.1
##$BCFW= 0
##$BC_mod= 0
##$BYTORDP= 0
##$COROFFS= 0
##$CY= 12.5
##$DATMOD= 1
##$DC= 0
##$DFILT= <>
##$DTYPP= 0
##$F1P= 14.0000005364418
##$F2P= -0.99999901652339
##$FCOR= 0.5
##$FTSIZE= 32768
##$FT_mod= 6
##$GAMMA= 0
##$GB= 0
##$INTBC= 1
##$INTSCL= 1
##$ISEN= 128
##$LB= 0.3
##$LEV0= 0
##$LPBIN= 0
##$MAXI= 10000
##$MC2= 0
##$MEAN= 0
##$ME_mod= 0
##$MI= 0
##$NCOEF= 0
##$NC_proc= -6
##$NLEV= 6
##$NOISF1= 0
##$NOISF2= 0
##$NSP= 0
##$NTH_PI= 0
##$NZP= 0
##$OFFSET= 16.522
##$PC= 1
##$PHC0= -95.33731
##$PHC1= 100.0439
##$PH_mod= 1
##$PKNL= yes
##$PPARMOD= 0
##$PSCAL= 4
##$PSIGN= 0
##$REVERSE= no
##$SF= 250.13
##$SI= 32768
##$SIGF1= 0
##$SIGF2= 0
##$SINO= 400
##$SIOLD= 32768
##$SREGLST= <1H.DMSO>
##$SSB= 0
##$STSI= 32768
##$STSR= 0
##$SW_p= 5175.98343685301
##$SYMM= 0
##$S_DEV= 0
##$TDeff= 65536
##$TDoff= 0
##$TI= <Analysis number 999999
Compound Code 99
Book Reference 9
Project Code 9>
##$TILT= no
##$TM1= 0
##$TM2= 0
##$TOPLEV= 0
##$USERP1= <user>
##$USERP2= <user>
##$USERP3= <user>
##$USERP4= <user>
##$USERP5= <user>
##$WDW= 1
##$XDIM= 32768
##$YMAX_p= 463203382
##$YMIN_p= -40845888
$$ End of Bruker specific parameters
$$ ---------------------------------
##NTUPLES= NMR SPECTRUM
##VAR_NAME=  FREQUENCY,     SPECTRUM/REAL,   SPECTRUM/IMAG
##SYMBOL=    X,             R,               I
##VAR_TYPE=  INDEPENDENT,   DEPENDENT,       DEPENDENT
##VAR_FORM=  AFFN,          ASDF,            ASDF
##VAR_DIM=   32768,         32768,           32768
##UNITS=     HZ,            ARBITRARY UNITS, ARBITRARY UNITS
##FACTOR=    0.157963299565203, 1,           1
##FIRST=     4132.6476996994, 0,             0
##LAST=      -1043.33573715361, 0,           0
##MIN=       -1043.33573715361, -40845888,   0
##MAX=       4132.6476996994, 463203382,     0
$$ Real data points
##PAGE= N=1
##DATA TABLE= (X++(R..R)), XYDATA
$$ [...]
23863b39060q285M0368q293j1731J98277N3997O7011R3017L8516j57461o3907
23852B449q8440j54795J26839J42925k13761j24332j03825j8602L8024J10002
23842b83516N9211k06428K7004J96622P5149k05424J4311j5630k19372J03655
23832d54418J07197K69103M3450k55060K8953R3680N2140K28679L6391k35170
23822h5055K0171q6921J00009n713M0020L3067M7228j20175k87505p1670Q3929
23811c32615K28278J49016P2003j8460K35480M841k61057n5432q0205O7424J493
23800A0766n9983M3748k5138o8434J3507M0109N2993j59204m4765K1549k07590
23789c82442j06149Q4930N3647M1523J30405J44054K18982q868j71247M6068J30038
$$ plain form
23863 -239060 -247345 -206977 -215270 -227001 -28724 25273 92284 185301 223817 66356 2449
23852 2449 -85991 -240786 -113947 28978 -184783 -309115 -412940 -431542 -393518 -283516
23842 -283516 -224305 -430733 -403729 -207107 -131958 -337382 -323071 -338701 -558073 -454418
23832 -454418 -347221 -78118 -34668 -289728 -260775 -167095 -114955 113724 150115 -85055
23822 -85055 -64884 -151805 -51796 -57509 -17489 15578 62806 -57369 -344874 -416544 -332615
23811 -332615 -104337 44679 116682 98222 333702 338543 77486 22054 -58151 9273 10766
23800 10766 -49217 -5469 -30607 -99041 -85534 -45425 7568 -151636 -196401 -174852 -382442
23789 -382442 -488591 -403661 -350014 -308491 -178086 -34032 184950 176082 4835 50903 180941
23778A80941j28524P8251K46037j70778j80395j6322q6978p4728R1080L9489q1038
23767a02965P5198J43765j03036o1025J97557J60514o5695k50819j81117K6289
23757a61334J70514j44904j00215L97663J03139j58019q6559Q3875M3815j42903
23747E072k67073K3139O8474j90097J31312K3584j41068L6009J61009L27735L0524
23736B08620k27464N921J23834j00291n2140J06435k81238q7986k3374q426J68939
23725a67170J52517M8288K9067k09872J98331K49453n6072l69701k73904J21184
23715b77879O1667J7965J17457o7711r4941j39571j09232K90954J70216K06017
23705A74942R9565O7549k29398k15987o98j21676j24882J62034J86195J5541J11315
$$ plain form
23778 180941 52417 130668 376705 205927 25532 9210 -77768 -152496 -61416 -21927 -102965
23767 -102965 -27767 115998 12962 -48063 149494 310008 244313 -6506 -187623 -161334
23757 -161334 9180 -135724 -235939 161724 264863 106844 20285 104160 147975 5072
23747 5072 -262001 -238862 -170388 -360485 -229173 -205589 -346657 -310648 -149639 178096 208620
23736 208620 -18844 -12923 110911 10620 -41520 64915 -216323 -304309 -327683 -336109 -167170
23725 -167170 -14653 33635 62702 -147170 51161 300614 244542 -125159 -399063 -277879
23715 -277879 -216212 -198247 -80790 -148501 -243442 -383013 -492245 -201291 -31075 174942
23705 174942 274507 342056 112658 -103329 -104027 -225703 -350585 -188551 -2356 13185 124500
23694A24500J21055k5902k72717l07893k41395K30147K33104O5615J10257j10726
23684g3955k92370j06589p1375J21708J37635O40R4139q9913R6212J75900N5596
23673D7628m4917j01940j26951J26756P3479j20034K22335j12818j42644q1820
23663b60926N0241J0105J40268N643J69486n2022j33676O6682M2462M2764R5076
23652A76103p4226j56693q3250L0434p3641J83298J09045j62531j07773q9594
23642b48828K01896J47890Q9898j02447o5310o1420l10003o4976o2849L35096
23632a41053M85887J08446j31829j23736j64345p5894k28549j55568N2335K48879
23622a25427J55218q7857j65615l9226K27759j10599j67633o5571J90215L1255
$$ plain form
23694 124500 245555 219653 -53064 -360957 -602352 -372205 -139101 -73486 36771 -73955
23684 -73955 -366325 -472914 -544289 -422581 -284946 -284306 -190167 -280080 -183868 -7968 47628
23673 47628 2711 -99229 -226180 -99424 -25945 -145979 76356 -36462 -179106 -260926
23663 -260926 -210685 -200580 -60312 -54669 114817 62795 -70881 -4199 38263 81027 176103
23652 176103 101877 -54816 -138066 -107632 -181273 2025 111070 -51461 -159234 -248828
23642 -248828 -46932 100958 190856 88409 23099 -38321 -348324 -413300 -476149 -141053
23632 -141053 344834 453280 321451 197715 33370 -42524 -271073 -426641 -374306 -125427
23622 -125427 29791 -58066 -223681 -262907 -35148 -145747 -313380 -378951 -188736 -157481
23612a57481j8286o6505J89087J23061o3009k44582j57491K8190k4303J81989
23602b09330L10881j39554j41659J48604j19359M0026m3865l84561j18298J43833
23592e13282J99710j45277j61260J3845L51668L232j30912J15015L5902J15113
23582a16246j40274p9488R7588J57199p5663j21312k63410J32581L70605q0682
23572a19102P8213K42210m9605j47243J78887J20631J43R9328M1840J68947j20633
23561D93616k02904j02134j57759J08561j46226J55806M168m7858p9179k42146
23551b16055N9138K67422K89074m2854k0877k95460l5656q8281j24874K8550R5746
23540h4127P3893K6169N1399J13042j69682l37119K9827J8298K07685N8123k5670
$$ plain form
23612 -157481 -175767 -242272 -53185 69876 6867 -237715 -395206 -367016 -391319 -209330
23602 -209330 101551 -38003 -179662 -31058 -150417 -110391 -154256 -538817 -657115 -513282
23592 -513282 -313572 -458849 -620109 -606264 -254596 -251364 -382276 -267261 -231359 -116246
23582 -116246 -256520 -336008 -238420 -81221 -156884 -278196 -541606 -409025 -38420 -119102
23572 -119102 -40889 201321 151716 4473 183360 303991 304134 403462 445302 614249 493616
23561 493616 290712 188578 30819 139380 -6846 148960 153128 105270 26091 -216055
23551 -216055 -156917 110505 399579 356725 335848 40388 4732 -83549 -208423 -179873 -84127
23540 -84127 -10234 15935 67334 180376 10694 -326425 -296598 -278300 -70615 -12492 -38162
23529c8162P8759r8822q2115j69483p1070K48101L8725K8156L6775k09167j61917
23518d00220q9409K62737K41142q5648k33336P6495J98860L7468n9412q0474j65730
23507b97527k3700j26857r9254K23330m6839R6197r3554O6701K49608p4805r251
23496a35951K5312J00687M8045j00088J51725r0372J9039o1524l56142p2599J19725
23485c52143N1593J20251J04693J81176l789q5503r4057p8350O1157J25833o7947
23474c7086j36601j76427J86400P1669R8502J18496m5132j24567O1041K38713
23464B55008k18879k42682r8774K38574J13761K2359j19094j32511q7037K78681
23454I406m4521N0487J28274J41719j57348j87625m1038j55582p079l148O6530
$$ plain form
23529 -38162 40597 -58225 -140340 -309823 -380893 -132792 -94067 -65911 -29136 -238303 -400220
23518 -400220 -489629 -226892 14250 -71398 -304734 -228239 -29379 8089 -51323 -131797 -297527
23507 -297527 -321227 -448084 -547338 -324008 -370847 -274650 -368204 -301503 -51895 -126700 -135951
23496 -135951 -110639 -9952 38093 -61995 89730 -642 18397 -43127 -399269 -471868 -352143
23485 -352143 -300550 -180299 -75606 105570 101781 16278 -77779 -156129 -94972 30861 -37086
23474 -37086 -173687 -350114 -163714 -92045 6457 124953 79821 -44746 16295 255008
23464 255008 36129 -206553 -305327 -66753 47008 69367 -49727 -182238 -269275 9406
23454 9406 -35115 15372 143646 285365 128017 -59608 -100646 -256228 -263307 -266455 -199925
23443a99925m1702J17730K03010j1505j28113J8958N1866n0926J55l765J61797
23432A17580J35550j88936j22051J31320N2097k21216k15697J15397q7053j00517
23422c83526J39299K52824J23972k38208O798P1625m3074J18887K42479l22543
23412c1467j94063K3013J01751K0396N9808j86570n7667r947K2346J04747l8373
23401a86026p6218J11045j66402j41826o9697K0711K17217L49115J60955o1405
23391A57469Q2338k57915j08807j66733j03513j50192J20535J06030M0423o537
23381b86902l1919P405j13556R3086p9554j73704J30257Q0879L5592J84094N0812
23370a03510J41149P2999k66205j07629J03683L7480J77553l4525J86177J50255
$$ plain form
23443 -199925 -241627 -123897 79113 67608 -60505 -41547 10319 -40607 -40452 -44217 117580
23432 117580 253130 64194 -57857 73463 125560 -95656 -311353 -195956 -283009 -383526
23422 -383526 -244227 8597 132569 -105639 -98841 -27216 -70290 48597 291076 -31467
23412 -31467 -225530 -202517 -100766 -80370 -20562 -207132 -264799 -274746 -252400 -147653 -186026
23401 -186026 -262244 -151199 -317601 -459427 -529124 -508413 -291196 57919 218874 157469
23391 157469 239807 -18108 -126915 -293648 -397161 -547353 -426818 -320788 -280365 -286902
23381 -286902 -318821 -311416 -424972 -331886 -411440 -585144 -454887 -374008 -338416 -154322 -103510
23370 -103510 37639 110638 -155567 -263196 -159513 -122033 55520 20995 207172 357427
23360C57427M8472j11690k76524k02804j5576M6183j01120L3155K00946q6363
23350a07894K40171K22694n2743J6458k53058k19795J7086J56240M1996P3178
23340A34333Q5140J30612L024k1436m6334j26250j93612k02586M3254q1346j79647
23329d54848r9251J80578J96310L7466n3529l8995k5263p6995n250J02782J36528
23318a00467J0524L4156j48681L2853j48233j64972J39833j4139J61105K35374
23308C7353k30806m7492J48556L4390Q8935K3586p6573l37943r8770L6672k42
23297d22334K05007J47948j12429P5062j0505M4427J50435j00096q5750j14506
23287b22741k3086j81344j29062K51289L67223o4128j7992J97999p0721m3320
$$ plain form
23360 357427 405899 294209 17685 -185119 -200695 -154512 -255632 -222477 -21531 -107894
23350 -107894 132277 354971 302228 318686 65628 -154167 -137081 19159 61155 134333
23340 134333 219473 350085 353109 331673 285339 159089 -34523 -237109 -193855 -275201 -454848
23329 -454848 -554099 -373521 -177211 -139745 -193274 -232269 -257532 -334527 -339777 -236995 -100467
23318 -100467 -89943 -55787 -204468 -171615 -319848 -484820 -344987 -359126 -198021 37353
23308 37353 -193453 -240945 -92389 -57999 30936 54522 -22051 -359994 -458764 -422092 -422334
23297 -422334 -217327 -69379 -181808 -106746 -117251 -72824 77611 -22485 -108235 -222741
23287 -222741 -245827 -427171 -556233 -304944 62279 -1849 -19841 178158 107437 64117
23277F4117P1383q038l68149n0732j34710j05594M6387J22087L44285J04077j76550
23266i1437p1334k31140k37969M1015J57277J14790P7483L79165M5302r4303p926
23255H0923L83721J56999j87934l8474J5500k25057o5906O6689j65576k03852
23245a82967m0345j431J31694n1828j25728k6525o5006k4161q3203K01764J89789
23234g7947J07903K09987L7017j24771n7207J63932j19859M7410k7130m2941p1562
23223D4832O3861j60503k01541k1522j01655J17532J53846L7309J60171k6001
23213F6329j82286M6840j53760O5650j10078j30732j0970L1022q4927K47322J28295
23202h7295j2945p1273m8612o7693N6394K91806K47068l9279m3633L5304J80506
$$ plain form
23277 64117 135500 127462 -240687 -291419 -426129 -531723 -485336 -363249 -18964 85113 -91437
23266 -91437 -162771 -393911 -631880 -590865 -433588 -318798 -241315 137850 183152 88849 80923
23255 80923 464644 621643 433709 395235 410735 185678 119772 186461 20885 -182967
23245 -182967 -223312 -224743 -93049 -144877 -270605 -297130 -362136 -386297 -469500 -267736 -77947
23234 -77947 29956 239943 276960 152189 94982 258914 139055 186465 159335 116394 44832
23223 44832 108693 -51810 -253351 -274873 -376528 -258996 -105150 -67841 92330 66329
23213 66329 -115957 -69117 -222877 -157227 -267305 -398037 -409007 -377985 -462912 -215590 -87295
23202 -87295 -100240 -171513 -220125 -287818 -231424 60382 307450 268171 224538 259842 440348
23191D40348l4311k78053m6519r886j32662l17246k4669J45636J0439j58418J06259
23180b99082Q7944p8585o4856o6001J28168J28097J70112q1500k85728m4883J139
23169d05175R9075P4505r5717q568K20818J8967N2259j0373O4003o3348J7592
23158c5962r9242j8882J70800m0644l8846o0376r0892O1816O9913J7440M6417
23147a8458n785K01683N7876l0324j02040k82149j83100J70809L88588J09739
23137C06839J1432k54849p5787o8509j39945N9310L4246k05883J72632K34829
23127G4315j0427k24743j70144k25797M740R0488K31242M356J07867K7372j3045
23116a03776O4903J03584N5829k0731M1677K59533m0938k33831j55520J81646
$$ plain form
23191 440348 406037 127984 81465 71579 -61083 -378329 -402998 -257362 -246923 -405341 -299082
23180 -299082 -211138 -289723 -354579 -420580 -292412 -164315 5797 -75703 -361431 -406314 -405175
23169 -405175 -306100 -231595 -327312 -335880 -115062 -96095 -43836 -54209 9794 -53554 -35962
23158 -35962 -135204 -154086 16714 -23930 -62776 -123152 -214044 -152228 -82315 -64875 -18458
23147 -18458 -24243 177440 235316 204992 102952 -179197 -362297 -191488 197100 306839
23137 306839 318271 63422 -12365 -80874 -220819 -161509 -127263 -333146 -160514 74315
23127 74315 63888 -160855 -330999 -556796 -552056 -461568 -230326 -225970 -118103 -90731 -103776
23116 -103776 -38873 64711 120540 99809 141486 401019 360081 126250 -29270 152376
23106A52376J039K3965j08901j14138j76765j32947K64762J83018j3952r1904
23096a3447k3441J9322l18902j22404J7948K61797J1524n3621m2968K34054J42716
23085A12578r6968j95029k32j14013j26146J34907K25865j18843R4944K13446
23075A30509M8715l19710N7061K09227P0646o91j33603j20994L445k5522N744
23064g5173k29682q4708K6047J70464J40846K9666L15303j06598l10003m4063
23054a67901J23674n081j32782p927j50810j5632K9096n1053o2234O1563j25362
23043e04449K13865J70394J68329m952k1323k483Q3817j61348k48925j66341O4628
23032d08788J59729j75121N8295K05418P4523r5321M5017q3625j66513K25912
$$ plain form
23106 152376 153415 177380 68479 -45659 -222424 -355371 -90609 92409 78457 -13447
23096 -13447 -36888 -17566 -336468 -458872 -440924 -179127 -167603 -221224 -264192 -30138 112578
23085 112578 15610 -179419 -179651 -293664 -419810 -284903 -59038 -177881 -82937 130509
23075 130509 179224 -140486 -83425 125802 196448 195757 62154 -58840 -55395 -80917 -75173
23064 -75173 -304855 -389563 -363516 -193052 -52206 -22540 292763 186165 -123838 -167901
23054 -167901 -44227 -49308 -182090 -190017 -340827 -356459 -327363 -378416 -440650 -379087 -504449
23043 -504449 -290584 -120190 48139 43187 21864 19381 103198 -58150 -307075 -473416 -408788
23032 -408788 -249059 -424180 -365885 -160467 -85944 -181265 -136248 -219873 -386386 -160474
23022a60474l5577L4785R706L7562j06940N7084j00531j07492L5012L8084J93966
23011a04815M7628K47381J67690n6158j98241n8096j61038J81989J16112l8111
23001A44341j53292k28500j09107m6964n126J06619k1252Q358K22587K5230J52192
22990I5086K27788k4631o8911n7782k0526m8189j690j63863q8057M4244j40326
22979b46857J77973J67633J58972r3204k21426m7562K5421J59723J7573m1695
22969E6551Q7326K05292o9479J7105o1185k28887p1672m8726p1984j2115Q0005
22958a17769m6699j28292J22722Q7920O1404L0622j47273J74287j26548q9898
22948a79524P8171j77573Q78K06832q7764O6046n3092o9978J5273K8803p3503
$$ plain form
23022 -160474 -196051 -161266 -151560 -113998 -220938 -163854 -264385 -371877 -336865 -298781 -104815
23011 -104815 -57187 190194 357884 301726 103485 45389 -115649 66340 182452 144341
23001 144341 -8951 -237451 -346558 -393522 -398648 -292029 -313281 -304923 -82336 -57106 95086
22990 95086 322874 298243 229332 171550 151024 102835 101145 -62718 -150775 -106531 -246857
22979 -246857 -68884 98749 257721 164517 -56909 -104471 -79050 80673 98246 56551
22969 56551 143877 349169 279690 296795 235610 6723 -64949 -113675 -185659 -197774 -117769
22958 -117769 -164468 -292760 -170038 -82118 -20714 9908 -137365 36922 -89626 -179524
22948 -179524 -101353 -278926 -278048 -71216 -158980 -92934 -146026 -216004 -200731 -171928 -245431
22937b45431r476k46738k20755L2668J727K37461J24628J09727q7881p3852J5995
22926c61927J46657P6565J26922n6911k28943k7525J19584j38422l16269n2987
22916g13256K67956K07108J76801L7154l6578n626l4962J74673m4237j6122j94393
22905a81482j53738J36702J91645J45348k58421K8059j81965j73529l179j53175
22895f03735k50257K60542J48484k4436p7924J9372j1893J50858p6289J10625
22885c54653J30551j9674L38617L56941J28090k45744m01844l49687o5269J30384
22875c52288l1463J68793R3429m6003L69M8451N3315p5142j41939n6418L04447
22864c4449K06094j53168M921k4205M6185o3957L3521L9665J28588j7197n1600
$$ plain form
22937 -245431 -254907 -501645 -722400 -689732 -688005 -450544 -325916 -216189 -304070 -377922 -361927
22926 -361927 -215270 -138705 -11783 -68694 -297637 -325162 -205578 -344000 -660269 -713256
22916 -713256 -445300 -238192 -61391 -24237 -60815 -66441 -101403 73270 29033 12911 -181482
22905 -181482 -335220 -198518 -6873 138475 -119946 -91887 -273852 -447381 -450560 -603735
22895 -603735 -853992 -593450 -444966 -469402 -547326 -527954 -539847 -388989 -465278 -354653
22885 -354653 -224102 -243776 94841 451782 579872 334128 -67716 -417403 -482672 -352288
22875 -352288 -383751 -214958 -121529 -167532 -167163 -118712 -65397 -140539 -282478 -338896 -34449
22864 -34449 171645 18477 23398 -807 45378 -18579 14942 54607 183195 165998 114398
22853A14398j67770P0644o7621p3678l1548j39079o536P6225R3625K15793J53360
22842B37813K38551k91812j68053p9463J02069j05587K8199Q6984j39650J06510
22832A5561j05387J9763j07348k32305J02525J87523k09177o4483K65856k8347
22822a55819j10779j15652K65045o7827m729N7692o9580O7392p2745J47742J08475
22811D9215K8765K6460K587R4947j05908k31720n8541J86971J97957k13357j82217
22800b04841k7163p7517k22052N4225J04853O0182j47888j28276n7686L22146
22790c24017K56863n0637R3286J00814n6269J55912n4527j91381m4218n379J46790
22779B7237J5357n4721m5312j18751r7735j17345m573P9724K64069K60272j33733
$$ plain form
22853 114398 -53372 17272 -50349 -124027 -155575 -294654 -301190 -224965 -131340 84453 237813
22842 237813 476364 184552 16499 -62964 39105 -66482 -38283 48701 -90949 15561
22832 15561 -89826 -70063 -177411 -409716 -307191 -119668 -328845 -393328 -127472 -155819
22822 -155819 -266598 -382250 -117205 -185032 -189761 -132069 -201649 -134257 -207002 -59260 49215
22811 49215 77980 104440 107027 201974 96066 -135654 -194195 -7224 190733 -22624 -204841
22800 -204841 -232004 -309521 -531573 -477348 -372495 -312313 -460201 -588477 -646163 -324017
22790 -324017 -67154 -117791 -24505 76309 20040 175952 121425 -69956 -114174 -119553 27237
22779 27237 42594 -12127 -57439 -176190 -273925 -391270 -395843 -316119 -52050 208222 74489
22768G4489j80582l8762L8570j44302J89033P4963q0145j22005p3226o8911K13363
22757a17515K8443q4912j09494l77987p9301L12954L54285R1115m6667J9781j16503
22746a25801l18754K8939K049Q5256P3912J52142K05244M7089j20015j97361J3628
22735a53672R1230k9266q6596j4153k1882n4426Q755J69911J14542j96437k37433
22724d09427K37198J96935j772k83362k9129l0734j03J84637J82388M48816j64600
22713C30847l26084j87243j82875Q8597M1757n6433l5950K67630K170o380j42141
22702b06105J27606R663p9931p385J13983O3326L3989j44242m5372l7418o7567
22691b39453m5034J13378K2555M8989n7027j08304k7953J0286j00003j18151j41613
$$ plain form
22768 74489 -106093 -144855 -106285 -250587 -61554 13409 -66736 -188741 -261967 -330878 -117515
22757 -117515 -89072 -173984 -283478 -661465 -740766 -427812 -73527 17588 -29079 -9298 -125801
22746 -125801 -444555 -415616 -413567 -328311 -254399 -102257 102987 150076 30061 -167300 -153672
22735 -153672 -62442 -91708 -178304 -192457 -214339 -268765 -260010 -90099 24443 -171994 -409427
22724 -409427 -172229 24706 22934 -260428 -289557 -320291 -320394 -135757 46631 495447 330847
22713 330847 4763 -182480 -365355 -276758 -235001 -291434 -327384 -59754 -57584 -63964 -206105
22702 -206105 -78499 -68836 -148767 -156152 -42169 21157 55146 -89096 -134468 -171886 -239453
22691 -239453 -284487 -171109 -148554 -99565 -156592 -264896 -292849 -282563 -382566 -500717 -642330
22680f42330K23141K66981Q4802k91444l18810K24538K72819J23832J22102j72657
22670a07026j78061O9650q0151m5914j60375k09011r2017L27474O5280k43085
22660f53236m6667m2933J0009Q3424J58083J28528k5477J80529L6199m1982q2882
22649b96405o4693j86630j47134K18507j8886N5439J42523j95742j43636K35595
22639d01062J55521M7843L11266q5955R7029J8114L0962j54611j11060P729m0039
22628a24263m1546o198j41009J99999q0308j08963j73429j2935P5221m0706K28134
22617b26003J32205j49808p792L97505l3677l07534N7099N0749R4353J02716j6581
22606I3232n1215j73618r6449J26559L2493O6375k03095k04834n3103O0845q5223
$$ plain form
22680 -642330 -419189 -152208 -67406 -358850 -677660 -453122 -180303 -56471 65631 -107026
22670 -107026 -285087 -215437 -295588 -341502 -501877 -710888 -802905 -475431 -410151 -653236
22660 -653236 -699903 -742836 -732827 -649403 -491320 -362792 -388269 -207740 -171541 -213523 -296405
22649 -296405 -361098 -547728 -694862 -476355 -495241 -439802 -297279 -493021 -636657 -401062
22639 -401062 -245541 -197698 113568 27613 124642 142756 173718 19107 -91953 -84224 -124263
22628 -124263 -165809 -172007 -313016 -113017 -193325 -302288 -475717 -488652 -413431 -454137 -226003
22617 -226003 -93798 -243606 -251398 146107 112430 -195104 -138005 -87256 7097 109813 93232
22606 93232 42017 -131601 -228050 -101491 -68998 -2623 -205718 -410552 -463655 -402810 -488033
22595d88033k41352J12005J27511J49985O8699J44523P755J12391q3774j29068
22585b19358J35820K76900k11640m3360O8690n9176R9472O2769N614j85584j52414
22574b22267j7183l175j52692j35663L5086Q4189K27143K42844j40032j10524
22564a92274J28900m2034O2077N2209R3022k35728k50485o6733j33444N1702K05033
22553c27755K12890J29242l1030J3726q6511k5494J2660L7895k3820m956j25619
22542b18772j25556j08606J560K21113K077J73978J29038J32343j18000j34898
22532d5723k44379J47531j9513k1549o1835J38676l4586j05164J09460j7381J1192
22521a43271J83378O8197j93816m0664j41425p4154j24285K83762K67117l10857
$$ plain form
22595 -488033 -729385 -617380 -489869 -339884 -271185 -126662 -118907 -6516 -90290 -219358
22585 -219358 -83538 193362 -18278 -61638 7052 -52124 47348 110117 115731 -69853 -222267
22574 -222267 -239450 -242625 -395317 -530980 -495894 -411705 -184562 58282 -81750 -192274
22564 -192274 -63374 -105408 -43331 8878 101900 -133828 -384313 -451046 -584490 -532788 -327755
22553 -327755 -114865 14377 -16653 -2927 -89438 -114932 -102272 -64377 -88197 -93153 -218772
22542 -218772 -344328 -452934 -451374 -230261 -228184 -54206 74832 207175 89175 -45723
22532 -45723 -290102 -142571 -162084 -183633 -245468 -106792 -141378 -246542 -137082 -154463 -143271
22521 -143271 40107 108304 -85512 -126176 -267601 -341755 -466040 -182278 84839 -226018
22511b26018L5313j4710K19726M3386N3108Q2483n9365j38732j83320j01461p3524
22500c63114J58622K79432j06069r2157M0338k11360j38646Q0685k467L8883n5426
22489c71279j19910j24104N2357M02625m778J09088J57879r8042M2521J4608o7855
22478f890j67217r2092Q8198L00358k5945k80086j80192R5707M095j99931J25750
22467c38245J84464p1236l02505r1913K33303K04648n7086q3382L6005K74781
22457a1166K12386J01417j23076k97019J80731K4341j33968n9699O0032r3688
22447a39709j44783K213L9536j69080j27644k37478M5789K89060J52183J44249
22437a45664p62N3031Q3718p1409j43200j71728K0982J62670K50407O5124M4873
$$ plain form
22511 -226018 -190705 -205415 14311 57697 110805 193288 133923 -4809 -188129 -289590 -363114
22500 -363114 -204492 74940 -31129 -123286 -82948 -294308 -432954 -352269 -354736 -315853 -371279
22489 -371279 -491189 -615293 -562936 -160311 -165089 -56001 101878 3836 46357 60965 -6890
22478 -6890 -174107 -266199 -178001 122357 96412 -183674 -363866 -268159 -264064 -463995 -338245
22467 -338245 -153781 -225017 -527522 -619435 -386132 -181484 -238570 -321952 -285947 -11166
22457 -11166 201220 302637 179561 -117458 63273 87614 -46354 -106053 -46021 -139709
22447 -139709 -284492 -282279 -242743 -411823 -539467 -776945 -731156 -442096 -289913 -145664
22437 -145664 -146426 -93395 -9677 -81086 -224286 -396014 -375032 -212362 38045 103169 148042
22426A48042j3504m644J31825K3320P250l4399L0513k4562j89386j61103K2003
22415f4645j21046L0454M7624l15653P1099K2359J15249m3588k7969J85474j32583
22404b33225q0606L55878J2463j23744k00337j5263O5140N6889O7320r1749J50134
22393c7100J36458K6810k5607j66694m2958J2965K99801k38737l76347J17220
22383b94189J24503K46384L2711m6300p8725k9423j10404j07378P7293J3666k64295
22372d36157m9280J0424j72763m1385J87265J69392J72395k2443L8902R2338k7889
22361g9201k5082Q0181J15336K05978P5157K4495j43510k06855O2706O756P1675
22350A87636l3541l77266j87490j7937J37353M7362L24279K05135l00907m29237
$$ plain form
22426 148042 134538 129894 261719 285039 292289 257890 288403 263841 74455 -86648 -64645
22415 -64645 -185691 -155237 -107613 -423266 -352167 -329808 -214559 -258147 -286116 -100642 -233225
22404 -233225 -313831 42047 54510 -69234 -269571 -284834 -219694 -162805 -95485 -187234 -37100
22393 -37100 99358 126168 100561 -66133 -109091 -96126 203675 -35062 -411409 -294189
22383 -294189 -169686 76698 109409 63109 -15616 -45039 -155443 -262821 -185528 -171862 -436157
22372 -436157 -485437 -475013 -647776 -689161 -501896 -332504 -160109 -182552 -143650 -51312 -79201
22361 -79201 -104283 -24102 91234 297212 372369 396864 253354 46499 109205 115961 187636
22350 187636 154095 -223171 -410661 -428598 -291245 -243883 80396 285531 -15376 -444613
22340d44613M1463K80940Q9990N4042j58782L065J1182K3125j82005k3071o4400
22329c69064L0330J42239J29672j09289j03263j4542J41462K02083p2384j27318
22319a50074N7153j05816j164K25564K57740J3111m0675j77882j20296j71782
22309b14121k9493J52379K03739j98206j70628Q3864P9953L5566R4361J86389
22299B23803j20695R0121o4675j47338q7101j31481j43017K4511J14624J0633
22289b30615J16112p3976J19433j56650q7861L5978P4857J47383j70115k74037
22279d99491J92604J32600K10652k68939j10906j36048J26644m8773j92542J22039
22269d72160n4046J17360J00615L59664P2943P340r8401j41124L4932j32408K51925
$$ plain form
22340 -444613 -403150 -122210 -32220 21822 -136960 -133895 -122713 -99588 -281593 -304664 -369064
22329 -369064 -338734 -196495 -66823 -176112 -279375 -293917 -152455 49628 -22756 -150074
22319 -150074 -92921 -198737 -199901 25663 283403 296514 255839 77957 -42339 -214121
22309 -214121 -243614 -91235 112504 -85702 -256330 -172466 -92513 -56947 37414 223803
22299 223803 103108 193229 128554 -18784 -105885 -237366 -380383 -355872 -241248 -230615
22289 -230615 -114503 -188479 -69046 -225696 -313557 -277579 -202722 -55339 -225454 -499491
22279 -499491 -306887 -174287 36365 -232574 -343480 -479528 -352884 -401657 -594199 -472160
22269 -472160 -526206 -408846 -308231 51433 124376 131716 33315 -107809 -72877 -205285 46640
22258D6640L48420k73657j38150j84732J79937J09665k24205o4702Q2938K1401
22248i6445o187j50440p2123j12535j745j45631K141K78985J74835J38524j6350
22237f971J77161j17267n3212L61j13708o9562K8608o3223J88724J24396J26863
22226B22170k66476j21795Q1077O9846r8743k62561J25875J94666M5018M8964
22216C8041N7316j62350j2142J68055p8956j20205M195j25577n9339M716J73122
22205a13124N0989j23772j36429J52520j15056j13190K21564N1840n4140J36357
22195d2441N9312r1468j25799q3252j03763M8016j6597j44038J75243K8897L2369
22184b63521j89342K56510K3156l09879r7323R8792J01711m4247o2480K31326
$$ plain form
22258 46640 395060 121403 -16747 -201479 -21542 88123 -136082 -200784 -117846 -96445
22248 -96445 -102632 -253072 -325195 -437730 -439475 -585106 -582965 -303980 -129145 9379 -6971
22237 -6971 170190 52923 -289 72 -113636 -183198 -154590 -217813 -29089 95307 222170
22226 222170 -44306 -166101 -85024 -15178 -113921 -376482 -250607 -55941 -10923 38041
22216 38041 95357 -66993 -79135 88920 9964 -110241 -106046 -231623 -290962 -286246 -113124
22205 -113124 -62135 -185907 -322336 -169816 -284872 -398062 -176498 -124658 -178798 -42441
22195 -42441 16871 -74597 -200396 -283648 -387411 -339395 -355992 -500030 -324787 -295890 -263521
22184 -263521 -452863 -196353 -173197 -483076 -580399 -481607 -379896 -424143 -486623 -255297
22174b55297K44291r5888j64794m7373j15183P2835m9945J21446J5166l5871r048
22163c19661j18450k05632q7729J912o7297L13207L61039J30802j82153j11303
22153b85265K73425J08956j64308m9015K2568J16743k24192J68169J24523R464
22143A01068j44567r991J26512j77683J4402l1491j00099K3951l83602L1045K00183
22132c50272J9882q9974r4348J49857K48919L0332J38049j5510j26326k96655
22122c86046L7958K75654J55486L5934J78281p3112j9240j27252l9626k17344
22112a79307p9900j2365J69362j52307l876Q7758j286O5777j55938j82237R4015
22101c50304R2933M3080q9447J30764M0615K4023L3720p8970k8810J6890j46579
$$ plain form
22174 -255297 -11006 -106894 -271688 -319061 -434244 -361409 -411354 -289908 -274742 -310613 -319661
22163 -319661 -438111 -643743 -731472 -729560 -796857 -483650 -122611 8191 -173962 -285265
22153 -285265 -11840 97116 -67192 -116207 -93639 23104 -201088 -32919 91604 101068
22143 101068 -43499 -53490 73022 -104661 -90259 -121750 -221849 -197898 -581500 -550455 -350272
22132 -350272 -330390 -420364 -514712 -364855 -115936 -85604 52445 36935 -89391 -386046
22122 -386046 -348088 -72434 83052 118986 297267 224155 204915 77663 38037 -179307
22112 -179307 -259207 -271572 -102210 -254517 -258393 -170635 -171921 -106144 -262082 -444319 -350304
22101 -350304 -257371 -214291 -303738 -172974 -132359 -108336 -74616 -153586 -182396 -165506 -312085
22090c12085j91690Q4620L7414K09155Q0742l167K63344Q3884N7862O5872N8832
22079D34783j9674o4256k18604P6800Q6079k10460j99716J1340j73669k25343
22069e02720j9071M9551J80744J07501j0432J56482R0619M3543J34376K46174
22059D76767j90334j81162p4479J04120K74079j3238l221m361j63997j23537o5211
22048C5426j09184j90460P851K4073j8393R7384M8805l1568P0950j5957K7296
22037e3777m9853q8756J12040J08673l9587J21800J288j65923J16396J63323j1265
22026B14359j84528j4538J29100n9949P7816L1416L5003K49656o1304k31358j84220
22015A453k44509k09360N5267L22528K31022J08790j70782Q6745N1605k23539
$$ plain form
22090 -312085 -503775 -419155 -381741 -172586 -91844 -95011 168333 252217 310079 375951 434783
22079 434783 415109 350853 132249 209049 295128 84668 -115048 -103708 -277377 -502720
22069 -502720 -521791 -472240 -291496 -183995 -194427 -37945 52674 96217 230593 476767
22059 476767 286433 105271 30792 134912 408991 395753 392532 388171 224174 100637 35426
22048 35426 -73758 -264218 -256367 -232294 -250687 -153303 -104498 -136066 -65116 -81073 -53777
22037 -53777 -103630 -192386 -80346 28327 -11260 110540 111828 -54095 62301 225624 214359
22026 214359 29831 15293 144393 84444 162260 193676 228679 478335 417031 185673 1453
22015 1453 -243056 -452416 -397149 -74621 156401 265191 94409 181154 232759 9220
22005I220n0783j91849j15834L49619J47822m4958j05094k16100m9354K24933
21995d2378j1315j32721l33549r510K80122p7323j40495j84680Q4860K62567J52543
21984a51879p620P8533q3418k09686j03570K7966J40086Q0133k0396J35539M84551
21973C70239J3751k6810O5995n0756m07722l63864q5310O288K56430J61485J7988
21962d2286J0099J43557K20692j16978k16014j37476O8299K62736j20024o9569
21952C036j84021j06531R921j16272J92709J18320N3500q095J38500J32441k40924
21941g416l53788j41925r0964o2563M060l038J46566K12330J8595m3768J53132
21930a68779l5289M9172R5602j19515p5576l519n2433k3928n2381J98395P9497
$$ plain form
22005 9220 -41563 -233412 -349246 373 148195 103237 -1857 -217957 -267311 -42378
21995 -42378 -53693 -186414 -519963 -529473 -249351 -326674 -467169 -651849 -566989 -304422 -151879
21984 -151879 -159499 -80966 -164384 -374070 -477640 -449674 -309588 -229455 -249851 -114312 370239
21973 370239 383990 357180 423175 372419 -35303 -399167 -484477 -478189 -221759 -60274 -42286
21962 -42286 -32187 111370 332062 215084 -930 -138406 -70107 192629 72605 3036
21952 3036 -180985 -287516 -277595 -393867 -201158 -82838 -29338 -37433 101067 233508 -7416
21941 -7416 -361204 -503129 -594093 -656656 -652596 -655634 -509068 -296738 -278143 -321911 -168779
21930 -168779 -204068 -154896 -59294 -178809 -254385 -257904 -310337 -334265 -386646 -188251 -108754
21919a08754n2689M416k9351M392K10909Q6820l6410j71973N560R9918l9757J30656
21907A03737J36379l9453j13264k4489J02641j03985p1990J33288J47994J2595
21897B83453k39400j58523Q2552j16447k44623L6888j33771j2587J39713P5496
21887b87249j75377J00513K83343J48871j3083j87358o5235k04478J26446J28965
21877a44642o8952J10012l68015r0473K26468N6375j91449j54717M12024K64338
21867E0969j91806m5948K19107P3042R705k2578l0591N6515j52070j41871m342
21856a79868m0650k7778k3177j06021J0026K34375K07250L8282j53151r867K34060
21845A83481J14684j37733j71213k10704j03364j06628o3326K2274J11150q5419
$$ plain form
21919 -108754 -161443 -157027 -186378 -181986 28923 115743 79333 -92640 -87080 12838 -26919 103737
21907 103737 240116 200663 87399 62910 165551 61566 -10424 122864 270858 283453
21897 283453 44053 -114470 -31918 -148365 -392988 -356100 -489871 -502458 -362745 -287249
21887 -287249 -462626 -362113 -78770 70101 57018 -130340 -195575 -400053 -273607 -144642
21877 -144642 -213594 -103582 -471597 -562070 -335602 -279227 -470676 -625393 -213369 50969
21867 50969 -140837 -186785 32322 105364 115069 92491 61900 118415 -33655 -175526 -179868
21856 -179868 -220518 -248296 -271473 -377494 -367468 -133093 74157 112439 -40712 -50579 183481
21845 183481 298165 160432 -10781 -221485 -324849 -431477 -494803 -472529 -361379 -446798
21835d46798K61590L17213J08731k11975k54538o0465K6891M6283P3170k94860
21825d34758r0263K91565L27865J08180K0691J48991L1272j95919k7627n828o7838
21814A06331k09225j31659K13697k3968n9982K6918M4016O2131j28507j06782
21804b07030J54932Q1169Q1547L2708k24078l09381k6000J48031O5855l3823j15854
21793c51924K15019M7304m1691M1169J12431Q9128o482j14502m4593J18218r5658
21782c1581l5520R158K3191j70777j68139L2623K05679J29963l5332R3920k45387
21771a92202J29712M09348r4977r1954m4095k57616j30479k08245J44945J87074
21761a48489m910o0377K01401M2245k4391j53004j44918J6613q8846K55620k3392
$$ plain form
21835 -446798 -185208 132005 240736 28761 -225777 -286242 -259351 -213068 -139898 -434758
21825 -434758 -525021 -233456 94409 202589 223280 372271 403543 207624 179997 174169 106331
21814 106331 -102894 -234553 -20856 -44824 -104806 -77888 -33872 28259 -100248 -207030
21804 -207030 -52098 29071 110618 143326 -80752 -390133 -416133 -268102 -202247 -236070 -351924
21793 -351924 -136905 -89601 -131292 -90123 22308 111436 104954 -9548 -54141 64077 -31581
21782 -31581 -67101 -57943 -34752 -205529 -373668 -341045 -135366 -5403 -40735 53185 -192202
21771 -192202 -62490 346858 251881 159927 115832 -141784 -272263 -480508 -335563 -148489
21761 -148489 -153399 -213776 -12375 29870 5479 -147525 -292443 -275830 -364676 -109056 -132448
21750a32448L6892j13349K17683q8454m3900k81477j20729j5074Q6426K25763
21740b28667M3793j18678Q0124K09327Q9984K19729J54206k01933o4203p6434
21730A07248j66576k20956o5108J9802r4641J4629K02715q9342P2467k39388J30534
21719c28616L39520M6397k52055m0253J5272M6107l7776k02649J3878K35043J36966
21708b8166M4256l49416L1262L38617L043j88311j53367M5128k62970R2484K46470
21697a80970K9763Q338K2273j40481k65834j42107K96408K30515j9943m5883J35494
21686g2427J37888K35828R8160j71335k08187p2764P3549p7739j8860j89394P6655
21675a88626K05968J39832o6013l09396j27202r6408O1778K43442J06120J26084
$$ plain form
21750 -132448 -95556 -208905 8778 -79676 -123576 -405053 -525782 -540856 -454430 -228667
21740 -228667 -184874 -303552 -223428 -14101 75883 295612 449818 247885 183682 107248
21730 107248 -59328 -280284 -345392 -325590 -420231 -405602 -202887 -292229 -219762 -459150 -328616
21719 -328616 10904 57301 -194754 -235007 -219735 -173628 -211404 -414053 -400175 -165132 -28166
21708 -28166 16090 -333326 -302064 36553 39596 -148715 -302082 -256954 -519924 -427440 -180970
21697 -180970 -151207 -142869 -120596 -261077 -526911 -669018 -372610 -142095 -162038 -207921 -72427
21686 -72427 65461 301289 399449 228114 19927 -52837 20712 -57027 -75887 -265281 -188626
21675 -188626 17342 157174 91161 -218235 -345437 -441845 -380067 -136625 -30505 95579
21665I5579l0552o9791R5272J00295L6725J8581K1757J41927n1002j68209j50908
21654C9674n6904L5584M446j10668K17091J38916k30130q2711n2462j06595K12977
21643I218J76288k43167J1776l7735J93313J08896l13126p3491p6903J7031K43435
21632A5535P6990j76634n9781K20428j15522J01989J04328j06380p9075j41867
21622a59989k2162j29158p2211o4437p2693J08745j2772K71351j831k18187l3657
21611d07001m5099L3102J50580L2615j70416j45662K12256O8053o5283m0086K16843
21600a60098J95748J37765j72599R3597J51401r7492k45758J4374L3979q6407
21590a35490r1832j14271m6648j02945j09033K17919L29722j5173j09671L8046
$$ plain form
21665 95579 65027 -4764 90508 190803 227528 246109 267866 409793 358791 190582 39674
21654 39674 -17230 18354 22800 -87868 129223 268139 38009 -44702 -97164 -203759 9218
21643 9218 185506 -57661 -45885 -83620 109693 218589 -94537 -168028 -244931 -227900 15535
21632 15535 92525 -84109 -143890 76538 -38984 63005 167333 60953 -18122 -159989
21622 -159989 -182151 -311309 -383520 -447957 -520650 -411905 -424677 -153326 -155157 -373344 -407001
21611 -407001 -452100 -418998 -268418 -235803 -406219 -551881 -339625 -271572 -336855 -376941 -160098
21600 -160098 35650 173415 816 94413 245814 148322 -97436 -83062 -49083 -135490
21590 -135490 -227322 -341593 -388241 -491186 -600219 -382300 -52578 -67751 -177422 -139376
21580a39376P0287J71616j4804k75873n6905K45389k8476j54105j79896o2956
21570d25099J21269K6987J05469j13478j82543j62957J34287J20362N8711M3708
21560b73284m8140k38089J99085J21351N885j46216k30772J32247M77190J97189
21550A96446n5640j47694P6327j12702j12457q8707P4857J31138J76731N8244
21540A96543J17492M2030k64216N5723j52450j16345O7571j25674j1072j09702
21530c00100j14710O6762J05336j20464J89187q8318j87432J50509P9593J3697
21520b05940j67870j04561j20144K01989Q7027j44577K46900J54361r9174j81422
21510c33411m3217O4539J00471k7990k06426m0823j2385J28460L3836N0674Q1179
$$ plain form
21580 -139376 -69089 102527 87723 -188150 -245055 334 -28142 -182247 -362143 -425099
21570 -425099 -303830 -276843 -171374 -284852 -467395 -630352 -496065 -375703 -316992 -273284
21560 -273284 -321424 -559513 -360428 -239077 -233192 -379408 -610180 -477933 -743 196446
21550 196446 140806 -6888 69439 -43263 -155720 -244427 -169570 -38432 138299 196543
21540 196543 314035 356065 91849 147572 -4878 -121223 -53652 -179326 -190398 -300100
21530 -300100 -414810 -348048 -242712 -363176 -173989 -262307 -449739 -299230 -219637 -205940
21520 -205940 -373810 -478371 -598515 -396526 -309499 -454076 -207176 -52815 -151989 -333411
21510 -333411 -376628 -312089 -211618 -239608 -446034 -486857 -499242 -370782 -336946 -286272 -205093
21499b05093L5911o1567p3169j51648N4741R5815K5202m0641o1750R1313R7736
21488a93150k496J25877k25232N3958J938m0295q80k61974J47287J46328m16985
21477f65624J01610L85176J94556l7465l20430m2867K51277K51163J9208J7953
21467A54557j61114N4282j05264J5637K94226O6340M1045n591k28596j38984r2043
21456a05505m4050m0715O7462J19521k64479n2710K09180K7789r6745o6801K55187
21445H134L61674n8169r6481j76011l32044j4594k9039L01904J62284N6849J04454
21434B88961k21206j41355k8017l6312q4065p3132J05684L36198J52728j18863
21424A80621j58236l85718k58093Q1394R0287j26251l737j5198L20727K5153j62217
$$ plain form
21499 -205093 -169182 -230749 -303918 -455566 -400825 -305010 -279808 -320449 -382199 -290886 -193150
21488 -193150 -195646 -69769 -295001 -241043 -239105 -279400 -280280 -542254 -394967 -248639 -665624
21477 -665624 -564014 -178838 15718 -21747 -342177 -385044 -133767 117396 136604 154557
21467 154557 -6557 47725 -57539 -41902 252324 318664 359709 354118 125522 -13462 -105505
21456 -105505 -149555 -190270 -122808 -3287 -267766 -320476 -111296 -83507 -180252 -247053 8134
21445 8134 369808 311639 215158 39147 -292897 -307491 -336530 -34626 127658 184507 288961
21434 288961 67755 -73600 -101617 -137929 -221994 -295126 -189442 146756 299484 180621
21424 180621 22385 -363333 -621426 -540032 -449745 -575996 -579733 -594931 -274204 -249051 -411268
21413d11268R4736N4696k48836k66924R9052J34717J49235P3181j00021J57851
21403b63581R6990j03382r0983L68108K10011j58395j39133J77716q5734L5427
21393D7044K6662O0799K02197j52672m4456j54102r302Q6569K3563j6960J15986
21382A85328K33045L3616Q3177j17117j12820j06592j33887j85127M4859P9049
21372C531k1593j22670j05140r6605M7784K7418l0285J21333J84150N6427j70669
21361a06319R2983j51413q5085J09590P2434j10477p0629L3922R9328J04289j89463
21350b00840m9791K6871m2831K029M33472L91969o6036k46717l8078l742J61138
21339C67444j39262j61532K3637J21305j843j25720r8355O5670j61617j51984
$$ plain form
21413 -411268 -316532 -261836 -510672 -777596 -678544 -543827 -394592 -321411 -421432 -263581
21403 -263581 -166591 -269973 -360956 7152 217163 58768 -80365 97351 11617 47044
21393 47044 73706 134505 336702 184030 139574 -14528 -23830 62739 86302 69342 185328
21382 185328 418373 451989 535166 418049 305229 198637 64750 -120377 -75518 3531
21372 3531 -18062 -140732 -245872 -342477 -294693 -267275 -297560 -176227 7923 64350 -106319
21361 -106319 -13336 -164749 -249834 -140244 -67810 -178287 -248916 -214994 -115666 -11377 -200840
21350 -200840 -250631 -223760 -266591 -264562 168910 560879 494843 248126 210048 206306 367444
21339 367444 228182 66650 90287 211592 209749 84029 -14326 51344 -110273 -262257
21329b62257L00586K18003r1352j96036K8374L3072k36157n771Q8039l6560j8118
21318a78177J80953J12577k9781j12359j62178k09018l6446K80290J21073J6985
21308a6081q376j57574L408M9839k7359j63693r7681K37575Q4619J13092J06192
21297A23961n8418k6616m5619K49458N163j12322j32312j33622K03680N5291L275
21286A31919Q1255m4454o3456j71962m9123N2317o1022o8330J33974r9614K09608
21275E1112j3081k00764J31057J7086m8004n0055j73982O2337J13271J04872J14619
21264A08468j63234K2065j85658n4968K49472J35665R9900n2393k15721Q2377
21254B5973j70744j29086j48393j28761j5877O5872j21194l3559J56539J93929
$$ plain form
21329 -262257 38329 256332 164980 -31056 -2682 30390 -205767 -211538 -123499 -160059 -178177
21318 -178177 2776 115353 85572 -26787 -188965 -397983 -434429 -154139 -33066 -16081
21308 -16081 -24457 -182031 -178623 -128784 -156143 -319836 -417517 -179942 -95323 17769 123961
21297 123961 65543 38927 -6692 242766 247929 135607 3295 -130327 73353 128644 131919
21286 131919 213174 168720 105264 -66698 -115821 -63504 -124526 -192856 -58882 -158496 51112
21275 51112 38031 -162733 -31676 -14590 -62594 -112649 -286631 -224294 -111023 -6151 108468
21264 108468 -54766 -32701 -218359 -273327 -23855 111810 211710 159317 -56404 25973
21254 25973 -144771 -273857 -422250 -551011 -566888 -501016 -622210 -655769 -499230 -305301
21244c05301J89370j09369l05741j59644J58415K68091K53443K2734n7480J12956
21234F7474j66464j88092q72J3255J77662Q3956j41167Q1161q3993k08851L8735
21223c27196j60516j29931J53581N7262J96388J37227l7225p1218K06819k5882
21213f91J79880N5580j10118j50056o9480K89391K13860j34278j38118j37075
21203a105q7470J83061Q1841k30867M2221o9184J41176n1115j16271J27274J6868
21192C6429M079k0879r6239o2836j5706J57699K05467j68238q9437N4110J28195
21181A32644K2714o065j32468P4964K9301j70646k74962L5795K13395o0192q8335
21170b23855K1351j23853O0074k8450J99143L68642j29468l81531k70629p0333
$$ plain form
21244 -305301 -115931 -225300 -531041 -690685 -532270 -264179 -10736 11998 -45482 67474
21234 67474 -98990 -287082 -287954 -274699 -97037 -13081 -154248 -73087 -157080 -365931 -327196
21223 -327196 -487712 -617643 -464062 -406800 -210412 -73185 -110410 -181628 25191 -691
21213 -691 179189 234769 124651 -25405 -94885 194506 408366 274088 135970 -1105
21203 -1105 -88575 94486 176327 -54540 -12319 -81503 59673 8558 -107713 19561 36429
21192 36429 40508 19629 -76610 -139446 -155152 2547 208014 39776 -49661 4449 132644
21181 132644 155358 149293 16825 91789 121090 -49556 -324518 -288723 -75328 -135520 -223855
21170 -223855 -202504 -326357 -266283 -294733 -95590 273052 143584 -237947 -508576 -578909
21160e78909K95121J5091j62274J869K2971K9633L9981J28695p3665j86566J78065
21149b89988J92474j02311J14124k0034J59525J081r6277j8231L5651O365l3282
21138e0903j19470k73082O1552J62408J43607K35965J96156N9986j35543k84666
21128c990o131K0998o6822j15593Q7609p4597L7928N0832p6223J12821J15023
21117H1855k97220j15272K55349N2294K56871k87869l28956j2037L4590J68322
21107a92073J84572P9305P1342o0728M5356j81802j33469k17295J21178J11440
21097a72174R0339r6036J60892N3440l3274j00055L7932k38270L1509J53515L08198
21086A96016R5990j27720q0529j44062j81131J14760J09899J13399M8589J08390
$$ plain form
21160 -578909 -283788 -268697 -430971 -429102 -406131 -376498 -336517 -207822 -281487 -468053 -289988
21149 -289988 -97514 -199825 -85701 -105735 53790 54871 -41406 -59637 -23986 -17621 -50903
21138 -50903 -170373 -443455 -381903 -219495 -75888 160077 356233 416219 280676 -3990
21128 -3990 -10121 10877 -55945 -171538 -83929 -158526 -120598 -69766 -145989 -33168 81855
21117 81855 -215365 -330637 -75288 -22994 233877 -53992 -382948 -394985 -360395 -192073
21107 -192073 -7501 71804 143146 82418 127774 -54028 -187497 -404792 -283614 -172174
21097 -172174 -81835 -177871 -16979 36461 3187 -96868 -58936 -297206 -265697 -112182 196016
21086 196016 292006 164286 83757 -60305 -241436 -126676 -16777 96622 145211 253601
21076B53601j94921m4489J10976J73537J04831k19437j40175Q0580m6213J94185
21066B72475o0006l6853j09414k6122j7160K58657K5794n4826m0506L2498j57587
21055H6950j94654k17964K04905K39707J21358n538j51446l41617k1088J16409
21045a62978m8021J91548L0886L734j82281k14556j54602J26056J05958m09133
21035g13389j27449L14749M07586J15682j19525l39358j9212N3155q8371j7691
21025e33823J56589J82261j8492j76918n2214L243m356O5506J39518J42049K34772
21014A38135J42936j45622k01772r4666k55729J1571R9268J90390J80219L38396
21004D03126j252j75011k27110j26089K4325J39576l2721m4323J73645J86895
$$ plain form
21076 253601 58680 14191 125167 298704 403535 184098 43923 124503 78290 272475
21066 272475 212469 175616 66202 40080 22920 281577 307371 252545 212039 244537 86950
21055 86950 -107704 -325668 -120763 118944 240302 234764 83318 -258299 -279387 -162978
21045 -162978 -210999 -19451 11435 15169 -167112 -381668 -536270 -410214 -304256 -713389
21035 -713389 -840838 -526089 -118503 -2821 -122346 -461704 -480916 -427761 -516132 -533823
21025 -533823 -377234 -194973 -213465 -390383 -442597 -439354 -443710 -378204 -238686 -96637 138135
21014 138135 281071 135449 -66323 -160989 -416718 -405147 -305879 -115489 64730 403126
21004 403126 401874 226863 -247 -126336 -102011 37565 4844 -39479 134166 321061
20994C21061r6259j3394j10260j23851p3870K17531j53945q7173J73246l7582
20984A5504k49270l0876L6409n1413p5894j56200j87466L62332K55588J02533
20974B1247P9547J10267k38192n8745r4909L7596J38617L46740m8824k09351j25474
20963d1481L6055J54576p5615j37J0128Q8542J22495j6086q4208J5452p5583j89117
20951e4979K24460q4831k44143J46701N1455N9284M2898j08022J09228k05781
20941f3730k2592m0846j73394m7801p2783J24008J8055m2119J03297J56714r3125
20930a54316l0376J6243K34182k4631K1173K06037j468q7972m7311R3662j59364
20919F5859k90991M6922Q0090J18327k1351j85895j8550P7568j85902p6645l0059
$$ plain form
20994 321061 224802 211408 101148 -22703 -96573 120958 -32987 -120160 53086 15504
20984 15504 -233766 -264642 -228233 -279646 -355540 -511740 -699206 -336874 -81286 21247
20974 21247 100794 211061 -27131 -85876 -180785 -143189 -4572 342168 293344 83993 -41481
20963 -41481 -5426 149150 73535 73398 83526 172068 294563 278477 194269 209721 134138 -54979
20951 -54979 169481 84650 -159493 -12792 38663 97947 140845 32823 142051 -63730
20941 -63730 -86322 -127168 -300562 -348363 -421146 -297138 -279083 -321202 -217905 -61191 -154316
20930 -154316 -184692 -168449 65733 41102 62275 268312 266844 178872 131561 225223 65859
20919 65859 -225132 -178210 -98120 20207 -1144 -187039 -205589 -128021 -313923 -390568 -420627
20908d20627J20899O2902m3459j17666J24523J94210j65140n2461R9447L10719
20898A13347Q7760j87841L4850q1660Q0830J4569N5632L5845n5984r0567m8967
20887d2186k8817P4106o3450j29013K83735K59648p9057k49345j78354O7687m5292
20876a30338J98314j93239j51165Q348q730j1167j1344o4899K50834L4233J0994
20865f8159O4067N9691J66492o7132l84067j65473J41733J81323m4209j04256
20855b19990j03111J17946K28232k4311J40301J78151o5753j5879l222k47860
20845a5496j57432J34774m4447j79179L5590J5452j76004J06880J81556L5152
20835f3154K0889K7764l1285l7492j0265j11528N6478J73675J56526o6631p4098
$$ plain form
20908 -420627 -299728 -236826 -280285 -397951 -273428 -79218 -244358 -296819 -197372 113347
20898 113347 201107 13266 48116 -33544 47286 61855 117487 153332 97348 6781 -42186
20887 -42186 -71003 3103 -60347 -189360 94375 354023 274966 25621 -152733 -85046 -130338
20876 -130338 67976 -125263 -276428 -268080 -276810 -287977 -299321 -364220 -113386 -79153 -68159
20865 -68159 -4092 55599 222091 154959 -229108 -394581 -252848 -71525 -115734 -219990
20855 -219990 -323101 -205155 23077 -1234 139067 317218 251465 235586 232364 -15496
20845 -15496 -172928 -38154 -82601 -261780 -226190 -210738 -386742 -279862 -98306 -63154
20835 -63154 -42265 -14501 -45786 -83278 -93543 -205071 -148593 25082 181608 114977 40879
20824D0879N8339j90102K6816J97127J53590K13856k01936m5051j44028K3466
20814A32956Q549N4668m6925r5375J32317K6542k78749l22156J0565L153J32921
20803b41534J19705J82704L69767K1023j49975k08680J61303K3203n6343j35241
20793H5932O1541j9954k74087k57740j00998l6311m050L06620K10211J66608j14860
20782B2912j884j15755M1394M18330J87056n2886j18995k28506j4937M017J07424
20771B48170J07845J43440j25646p2786q2801j57484k07620J58658M4030k6389
20761B9417K3113P5306K93647k56218J20406L2689j2408k1620j96575p1447k5422
20750i112N5775J27816N339k74785k06647K51330J82440M4729j5375j03148j06652
$$ plain form
20824 40879 99218 -90884 -64068 133059 286649 500505 298569 253518 109490 132956
20814 132956 141505 196173 149248 53873 186190 212732 -66017 -388173 -377608 -374455 -241534
20803 -241534 -121829 60875 430642 451665 301690 93010 254313 277516 221173 85932
20793 85932 147473 127519 -146568 -404308 -505306 -541617 -545667 -239047 -28836 137772 22912
20782 22912 21028 -94727 -53333 364997 552053 499167 380172 151666 136729 140746 248170
20771 248170 356015 499455 373809 301023 218222 60738 -146882 11776 55806 29417
20761 29417 52530 127836 421483 165265 285671 318360 305952 284332 87757 16310 -9112
20750 -9112 46663 174479 179818 -94967 -301614 -50284 132156 176885 161510 58362 -48290
20739d8290k99175q7265J60229K48895j30321Q9957Q1791J3517k72663k03347
20729d46672K27397K52919j44132J78153K04538k7558K1932k09931k7974J32784
20719A61456O3992r7250j49020j32097J06176l6640J0523p2206R4912Q2237J8466
20708E0549m3346j1441j73172r0675K7674J94192J83236n2061L2709J17191L6160
20697B71016k57690l04760k7894J23366K09103j44129j9924J72641j9832j28007
20687a26110K36360O3135j46552q1547K32726J26755P0878m9295k05560k10295
20677h9505j21453J48349K5874L7844p1J16137l7160P9045J59578Q3060k05745
20666A95953n5319R1476J71584L9768n8190p5538n2612L52500J35361J01524k48222
$$ plain form
20739 -48290 -347465 -434730 -274501 -25606 -155927 -65970 15821 29338 -243325 -446672
20729 -446672 -219275 33644 -110488 67665 272203 244645 266577 56646 28672 161456
20719 161456 225448 128198 -20822 -152919 -46743 -83383 -72860 -145066 -50154 32083 50549
20708 50549 7203 -4238 -177410 -268085 -240411 -46219 137017 84956 117665 234856 271016
20697 271016 13326 -291434 -319328 -195962 13141 -130988 -150912 21729 1897 -126110
20687 -126110 110250 173385 26833 -54714 178012 304767 375645 326350 120790 -89505
20677 -89505 -210958 -62609 -36735 1109 1038 117175 80015 159060 318638 401698 195953
20666 195953 140634 232110 403694 443462 385272 309734 257122 609622 744983 846507 598285
20655E98285l01600k55890m9596K93528J52442k72134k1501q7899k36090j33431
20645c13886j12466n9143L0814m5218J22252J71154J21803O9173n0306K38610
20635A72787l9999l31106q4680R4616K91107N3200J1483Q9018k46123j71796m3738
20624b05231j72963K50976J17656J66668K45197J7691j81628K35119K56442k38482
20614D91445r2703k49789j37058n870N7537m7771j7241m6681r8536K88836N9944
20603B02113j17510K02794Q1312p3501k49425j10535j38527k00753P1573j8168
20593c50627r2728K01299K72698L98333J46230k60038j99382k5838N0950J91293
20583C32190O0444k69681M4483P742r355O5864K08301l8953m6417J42586J46152
$$ plain form
20655 598285 296685 40795 -8801 284727 437169 165035 143534 55635 -180455 -313886
20645 -313886 -426352 -485495 -454681 -499899 -377647 -206493 -84690 -15517 -65823 172787
20635 172787 132788 -198318 -282998 -188382 102725 155925 167408 256426 10303 -161493 -205231
20624 -205231 -378194 -127218 -9562 157106 402303 419994 238366 473485 729927 491445
20614 491445 398742 148953 11895 6025 63562 15791 -1450 -48131 -146667 142169 202113
20603 202113 84603 287397 368709 295208 45783 -64752 -203279 -404032 -332459 -350627
20593 -350627 -443355 -242056 30642 428975 575205 315167 115785 89947 140897 332190
20583 332190 392634 122953 167436 175178 165823 231687 439988 401035 354618 497204 643356
20572F43356j16078j33230l56698k72876j5334K09075J90501m1721l18319o9580
20562b80904M7699j33422K02118J65626Q9035j71491q1800j1664J01467j80318
20552b53654j92208L80704M87362K56301j27762k62305j7097m0850j76011j6985
20542C7495q1486k56560K54417L74730o4752l01657k29655j06166M47767L38300
20532D12433R5333j09426R1630j80519j28435j19441k08419j49256N4687K05024
20522c6389J66580J68081o392r5018l49633K29228J63017J4873N8305m9254j95521
20511F7877p2469m9353K6607J63965K88994K17042K47429l5347j89683j58671
20501E06391k60074n0171K39406n7891n4170p8936k0702k0115Q317J63121J10843
$$ plain form
20572 643356 527278 394048 37350 -235526 -250860 -41785 148716 106995 -211324 -280904
20562 -280904 -233205 -366627 -164509 1117 90152 -81339 -163139 -174803 -73336 -253654
20552 -253654 -445862 -65158 422204 678505 550743 288438 271341 230491 54480 37495
20542 37495 -43991 -300551 -46134 328596 263844 -37813 -267468 -373634 74133 412433
20532 412433 507766 398340 489970 309451 181016 61575 -146844 -296100 -241413 -36389
20522 -36389 130191 298272 291880 196862 -152771 76457 239474 254347 312652 263398 67877
20511 67877 -4592 -53945 -27338 136627 425621 642663 890092 854745 665062 506391
20501 506391 246317 196146 435552 377661 323491 244555 223853 203738 212055 375176 486019
20490D86019R5935l2415l00670k84217j6055M8059j51346o916K97770p8048l10413
20479b52297O5433J27993K17974J20472J66316J1462p2725j08818q5941J18541
20469C08410L8461O7057Q0181n7434j57985k34323j07932Q7417r5331j41347J32026
20458h0800L78063M7567o3507J782Q3944L6234j59143O058O608j8634j30163o1910
20446D6099N486p6092J20673K48071j0118K5566k37282j93887j6639Q089p9867
20435a59901K47812J48485J32798K7171j06296j754J29466J71174J16362q843
20425F96474k74248j30549m3348Q1802o5410j86646K7509j1783o2309J09675o0138
20414H1029p4702J00605J96657j6216n8071l205q7715R4174j48989J25845J63614
$$ plain form
20490 486019 581954 549539 248869 -35348 -51403 -3344 -154690 -161606 136164 58116 -252297
20479 -252297 -186864 -58871 159103 279575 445891 457353 384628 275810 189869 308410
20469 308410 346871 413928 494109 436675 278690 44367 -63565 23852 -71479 -212826 -80800
20458 -80800 297263 344830 281323 283105 367049 403283 244140 250198 256806 238172 108009 46099
20446 46099 51585 -24507 96166 344237 334119 359685 122403 -71484 -88123 -80034 -159901
20435 -159901 87911 236396 369194 396365 290069 288315 417781 588955 705317 696474
20425 696474 422226 291677 248329 330131 264721 78075 105584 93801 31492 141167 81029
20414 81029 6327 106932 303589 287373 229302 226097 138382 232556 83567 209412 373026
20403C73026J04947K11825l11732n0927K39640r0709J55659L85978Q8801J12391
20393A218899K24382J52037J6470n4591J21349K4933j4922K58915M21609K13976
20383B583057j73353l53009m61657l42339J0386N0734m6212q9107q1753k90830
20373H05917l19365j84703j7334j51682M2679l1819M078M9503M8338p2997l5504
20362A37111o3709k09329L7497K3231J77257J34751J19916j06409k2423j62743
20352F5150k04212O2742K98041O4559j62005Q8102j13261j18062J79201j07781
20342E2474k86074R7732K56857P7504q108j32055j21691r2538J27214o8880M3818
20331e3747L41445K62828o5473p2483k7298J02897k03983j31392o329O2244J47121
$$ plain form
20403 373026 477973 689798 378066 327139 566779 476070 631729 1017707 1106508 1218899
20393 1218899 1443281 1595318 1611788 1557197 1678546 1703479 1688557 1947472 2369081 2583057
20383 2583057 2409704 2056695 1595038 1252699 1263085 1313819 1267607 1178500 1096747 805917
20373 805917 486552 301849 284515 132833 175512 143693 147771 197274 245612 172615 137111
20362 137111 73402 -135927 -98430 -75199 102058 236809 356725 250316 227893 65150
20352 65150 -139062 -76320 221721 286280 124275 212377 99116 -18946 160255 52474
20342 52474 -233600 -135868 120989 198493 190385 58330 -63361 -155899 -28685 -97565 -53747
20331 -53747 287698 550526 485053 412570 385272 488169 284186 152794 146465 208709 355830
20320C55830J54154k39380R2672R2639O6023k76498k54913L35949J14639m2779
20310C98336k36k31967j32262m6947J16655k1037k7636j66076J95788K10922k55421
20299D0119k04709L03939K65495p0813j80287k75414Q2182J18539P4739J81749
20289C35539K647q2669m2284M396p8982j03911N0580L7344j0568M0431L11K45144
20277C97978K70797j15434k23910k11500n1512M24477J80153r0410l63467K3445
20267B40617O1441j15248M1338r9867m7282J67111Q0506j68746j29243R0094K4096
20256A44817Q8456J03663j2778R9620K83065L6615j38503M3246l9501k06475j18238
20245B83987J99403J53477J52704j42351N1601J19787q6207j59947l1725j1423
$$ plain form
20320 355830 509984 270604 363276 455915 521938 245440 -9473 326476 441115 398336
20310 398336 398100 166133 33871 -13076 103579 82542 54906 -111170 84618 295540 40119
20299 40119 -164590 139349 404844 334031 153744 -121670 -39488 79051 153790 335539
20289 335539 338186 255517 213233 217629 138647 34736 85316 122660 112092 152523 152834 397978
20277 397978 668775 553341 329431 117931 66419 490896 671049 580639 217172 240617
20267 240617 302058 186810 228148 128281 80999 248110 328616 159870 30627 120721 144817
20256 144817 233273 336936 324158 423778 706843 743458 604955 648201 608700 402225 283987
20245 283987 483390 636867 789571 647220 698821 818608 732401 572454 540729 529306
20235E29306j56994j07089K58530K01122j67846k03313k13660K55010J31583q8756
20225D37893k16785K29701K22918k29967o6718J76431L887j2681J30176L30766
20215A005621M106j94760j08534l03818m19400Q3769J23840R5949J51996J0025
20205D48794o2519R1904n9762L3368P9026j87316L2507n8626p6096j05624j52078
20194a6422j67416R2445K69940J57798r7183k55618M7939J98115Q9409r9871j10708
20183A08428l8843J41966Q6036J22257M1428n8084k457k52596j38597J18962K09942
20172C38442L67552J03151j4929p9982k53124p3912J33560J5545J91014j09851
20162F17466j54699j52804J49765K23788j00723J5305j73949o2718L33112J51770
$$ plain form
20235 529306 372312 265223 523753 724875 557029 353716 140056 395066 526649 437893
20225 437893 221108 450809 673727 443760 377042 553473 557360 544679 674855 1005621
20215 1005621 1009727 814967 706433 402615 -16785 66984 190824 286773 438769 448794
20205 448794 386275 478179 418417 451785 530811 343495 376002 317376 241280 135656 -16422
20194 -16422 -183838 -91393 178547 336345 239162 -16456 31483 229598 319007 219136 108428
20183 108428 69585 211551 297587 419844 461272 403188 400731 148135 9538 128500 338442
20172 338442 705994 809145 794216 714234 461110 387198 520758 536303 727317 617466
20162 617466 462767 309963 459728 683516 582793 598098 424149 361431 694543 846313
20152H46313O1215N0302J53651k2529Q3953k60430k1334J7043p4999J31901j74253
20141G90833j90003K40429O3617q1428p4526k26720j74114l45383P8697J79523
20131B60925K57696J73675P4193j05353J04822p2709l271K27444J2438P4201M7980
20120A052041j5566j86859k84386j36062k23374m2966J88150R3279Q3821J09024
20110F37102n8254J08299J50571R5233k21194l67337j8683L19991o8774j01809
20100D75145Q8175j02756k51730J70155K19883J6016r445Q5404j33241O2704k3110
20089E97200K4529r7542j71976J57187J06863Q9077J19084n0045l59849k14719
20079A99809K0940O8161J35557j55206K8883K6276O4286M1643q0252O9008j796
$$ plain form
20152 846313 907528 957830 1111481 1088952 1172905 912475 891141 908184 833185 965086 790833
20141 790833 600830 841259 904876 823448 748922 522202 348088 2705 81402 260925
20131 260925 518621 692296 766489 661136 765958 693249 689978 917422 929860 1004061 1052041
20120 1052041 1036475 849616 565230 429168 205794 162828 350978 444257 528078 637102
20110 637102 578848 687147 837718 932951 711757 344420 325737 645728 576954 475145
20100 475145 563320 460564 208834 378989 598872 614888 605443 690847 557606 620310 597200
20089 597200 621729 524187 352211 509398 616261 705338 824422 774377 414528 199809
20079 199809 220749 288910 424467 269261 298144 324420 388706 430349 350097 419105 417309
20068D17309J1563K55362k1970k03546K0224n5006j4488J85218P2010j70330r6529
20057C99817J6630J77510l858r999K27019J64985l82351j77327k04254J68584
20047C76756L78544O4846R8222n5320R9054j9757j82440K5895K07149J66548J80108
20036A339605l8777j68986k26958O3471O8345j6684j29213j062k4995J58684R9406
20025A122836p2713N2201r8332k02953J76683J52564j24636m8774j29037k52685
20015E75154l3155l25642q385P6285l2090J68098K49801J82997l566N0587j60245
20004G39839M3426O5661j23212o7225Q0207J54804K35233J16j13850m0046J01432
19993A076385j96869K2135K10372O5035O4030k4602o3693J4513j04635r7327N061
$$ plain form
20068 417309 428872 684234 662264 458718 478942 423936 409448 594666 666676 496346 399817
20057 399817 416447 593957 590099 580100 807119 972104 589753 412426 208172 376756
20047 376756 755300 820146 918368 863048 962102 942345 759905 785800 992949 1159497 1339605
20036 1339605 1300828 1131842 904884 968355 1036700 1020016 890803 889741 864746 1023430 1122836
20025 1122836 1050123 1102324 1003992 801039 977722 1130286 1005650 956876 827839 575154
20015 575154 541999 216357 207972 284257 252167 420265 670066 853063 849497 900084 739839
20004 739839 783265 848926 725714 658489 738696 893500 1128733 1128849 1014999 974953 1076385
19993 1076385 879516 901651 1112023 1177058 1241088 1216486 1152793 1167306 1062671 965344 970405
19982I70405P5878p0761j3612N7512J31370j26732k02497k2564j32654N2375P1415
19971G90135J68325J9442P3227M902j08791J86447K95409K18887j30758k58600
19961A258625k33953J12529J31117j29307n3560j46796k72003l797m280J36837
19951G95412R200R6986K27749n5966j77013J57118J31639j29382k60285j02874
19941F92584K71601J15222J77248J87084o8777r772J14261k57996k03186j83494
19931H34775J40029K55547J00471n0521k14601K0774j5152N168P654K58963q9591
19920A253516j28203J29375L43390L10158J35470J4608q7819k29011Q7992P0677
19910A900153j68452N3627m9811m8944J37598p597l1438k8981Q0277M8950q4452
$$ plain form
19982 970405 1046283 975522 961910 1019422 1150792 1024060 821563 798999 666345 718720 790135
19971 790135 958460 977902 1051129 1056031 947240 1133687 1429096 1647983 1517225 1258625
19961 1258625 1024672 1137201 1268318 1139011 1085451 938655 666652 662855 658575 795412
19951 795412 804612 901598 1129347 1073381 896368 1053486 1185125 1055743 795458 692584
19941 692584 964185 1079407 1256655 1443739 1374962 1365190 1479451 1221455 1018269 834775
19931 834775 974804 1230351 1330822 1280301 1065700 1086474 1071322 1076490 1084144 1343107 1253516
19920 1253516 1125313 1254688 1598078 1908236 2043706 2058314 1970495 1741484 1829476 1900153
19910 1900153 1731701 1785328 1735517 1686573 1824171 1816574 1785136 1756155 1836432 1885382 1800930
19899A800930o1481q5500J55076J08943J21977J59006L02222j85205k23632J25707
19889B218043K93507M3398j24528J64079K50311K2673q7862P2076L05698J70621
19879C328016O6264J61656L4754L50962L21638K26706r5729M1038K99662K31050
19869D966017J21553K99434K02585j73932l25323r1507p15j54891L09159L43560
19859E495940k22062l21222j92922l49205m64382m43017j20100K66939j3548k35902
19849C400519l25781n6757K154k62717k65491n3188K9233j74875r1401K41330
19839B443026j36164m2611K97357l0711o2045p0629j07870p0221N478j36523K9990
19828B119077L5797j83215J70802Q0061Q7413J46378J68870K4j93692L1012L3508
$$ plain form
19899 1800930 1739449 1653949 1809025 1917968 2039945 2198951 2501173 2315968 2092336 2218043
19889 2218043 2511550 2554948 2430420 2594499 2844810 2867483 2779621 2851697 3157395 3328016
19879 3328016 3394280 3555936 3590690 3941652 4263290 4489996 4394267 4435305 4734967 4966017
19869 4966017 5087570 5387004 5589589 5415657 5090334 4998827 4998112 4843221 5152380 5495940
19859 5495940 5273878 4952656 4759734 4410529 3946147 3503130 3383030 3649969 3636421 3400519
19849 3400519 3074738 3017981 3020135 2757418 2491927 2438739 2467972 2293097 2201696 2443026
19839 2443026 2306862 2264251 2561608 2530897 2468852 2398223 2290353 2220132 2225610 2089087 2119077
19828 2119077 2154874 1971659 2142461 2222522 2309935 2456313 2625183 2625207 2431515 2462527 2496035
19817B496035q7168r6281j38152N6643J80356J42755J4678J72664M2139k7726
19807B755943q64J23298k3677m4759l0570L42181p1632l54088J72828K94140N4130
19796C216930j6413J66706J81105N3246K6487k16328J11009L70207R5265K524
19786C990738n7342M5021L61434K44008r2099j8015l08656k32878l7235K91779
19776D186755N52052K74943J9524L50927m5861J58754K15120J90191L38423O30122
19766F870950N37172M31077M45200N16740N67291J99339J63887J95951O67439
19757A0595046N09130K43805L32556L40148M87027L34852M16513Q19944Q80944
19748A4959965P13270N04636N50815Q99950J289184J468646J579145K218581K640063
$$ plain form
19817 2496035 2408867 2312586 2174434 2231077 2411433 2554188 2568866 2741530 2783669 2755943
19807 2755943 2755079 2878377 2854700 2809941 2779371 3121552 3049920 2695832 2868660 3162800 3216930
19796 3216930 3200517 3367223 3548328 3601574 3628061 3411733 3522742 3892949 3988214 3990738
19786 3990738 3933396 3978417 4339851 4583859 4491760 4473745 4165089 3932211 3894976 4186755
19776 4186755 4738807 5013750 5033274 5384201 5338340 5497094 5712214 5902405 6240828 6870950
19766 6870950 7408122 7839199 8284399 8801139 9368430 9567769 9731656 9927607 10595046
19757 10595046 11104176 11347981 11680537 12020685 12507712 12842564 13259077 14079021 14959965
19748 14959965 15673235 16177871 16728686 17628636 18917820 20386466 21965611 24184192 26824255
19739B6824255L190358L708858M895531O671589R162343J2857823J8828108K8730211
19731A14869076M1728862N1513232M4794764J6241664j0728819q899581J6192858
19724B65712056M2824920M9797242L0637266L248833j9865030m2898164n0900592
19717B78556531l2372009l214575J3252832R86550l3125986n5646560n1373354
19710A17063429l5545234k2348599j4632810r745005o862665n013033l587995
19703A9328088k847695k340917j862209j306096j310799j045888n77894q84146
19695G152444q31672k53408k96519n06425j60609j64441j86769j73015K2058P714
19685D609358k69435l19794k51108m28005o15737n20420k37004O0140p3866j24575
$$ plain form
19739 26824255 30014613 33723471 38619002 45290591 54452934 67310757 86138865 114869076
19731 114869076 156597938 208111170 252905934 269147598 258418779 249519198 265712056
19724 265712056 308536976 358334218 388971484 392220317 372355287 329457123 278556531
19717 278556531 246184522 242969947 256222779 257209329 224083343 168436783 117063429
19710 117063429 81518195 59169596 44536786 34791781 27929116 22916083 19328088
19703 19328088 16480393 14139476 12277267 10971171 9660372 8614484 8036590 7152444
19695 7152444 6320772 6067364 5770845 5264420 5103811 4939370 4752601 4579586 4601644 4609358
19685 4609358 4339923 4020129 3769021 3341016 2725279 2204859 1967855 2027995 1954129 1829554
19675A829554m68907m05214j67484j62471j56102m83747j93549M4106j37097o238
19665c07149J63978O5473P7593r9563J3010J19948R410k02049J69399J99669M941
19654B14660q8079j99594l87616m2256J24165M4637N2773J78775J0169J81040
19644H8674J12604p3672o5888p5285l22966J4244K9887j70992P5757n5870k00081
19633f43588M6319J28278J51250M0688N0560K39380K23997L7077K9371J64585
19623D67917j06937j38354q7375j6956r677J48981K05087R3193J93504J96271
19613I45654j89627L4397q1078j22579Q8973Q1364J18184m8145j36069k05186
19603D85888J3193J18349n3458j25990K67500J5956J36644q9846k56136n0942
$$ plain form
19675 1829554 1360647 955433 787949 625478 469376 -14371 -207920 -163814 -300911 -307149
19665 -307149 -143171 -77698 -105 -99668 -86658 33290 42700 -159349 10050 209719 214660
19654 214660 126581 -73013 -460629 -502885 -378720 -334083 -281310 -102535 -92366 88674
19644 88674 201278 127606 61718 -13567 -336533 -322289 -292402 -463394 -387637 -443507 -643588
19633 -643588 -597269 -468991 -317741 -277053 -226493 12887 236884 273961 303332 467917
19623 467917 360980 222626 135251 118295 108618 257599 462686 555879 749383 945654
19613 945654 756027 790424 709346 586767 675740 757104 875288 827143 691074 485888
19603 485888 499081 617430 563972 437982 705482 721438 858082 768236 512100 461158
19593D61158m8295K21265P8179r9749j98124O6126J87247n6706j66424q8572j12196
19582B43909j63502J4022K4257p885l0773M97129J15948k69434Q9496K6087k6635
19571E12619j35403j81186J5733J06852K90027j70430m3887j23838j36311j64695
19561c0519J4276L30096R436J3160k9053J06448R744O3405k3512J4121r7572q0468
19549B99562N5321J94139L332m5052l4202K90079J81510J58608K28364K82818
19539A614479K43995P8092m03448k15519K78834N37677K74849J99280J48070J7884
19529B774193k96913k64057j15410m6937m874p4411j52658N5913J5755j38019
19519A752582j00524J68894K15482j26192J2804o5775k82984j87184K6267j30111
$$ plain form
19593 461158 412863 634128 712307 612558 414434 480560 667807 611101 444677 356105 243909
19582 243909 80407 94429 118686 110801 80028 577157 693105 423671 513167 539254 512619
19571 512619 377216 196030 211763 318615 608642 438212 394325 270487 134176 -30519
19561 -30519 -16243 313853 323289 336449 307396 413844 423588 486993 463481 477602 380030 299562
19549 299562 354883 549022 552354 507302 473100 763179 944689 1103297 1331661 1614479
19539 1614479 1858474 1936566 1533118 1317599 1596433 2134110 2408959 2608239 2756309 2774193
19529 2774193 2477280 2213223 2097813 2050876 2046002 1971591 1818933 1874846 1890601 1752582
19519 1752582 1652058 1820952 2036434 1910242 1923046 1857271 1574287 1387103 1413370 1283259
19509A283259J90304K76453j6318K28370L16023K57427L06695P8146j51237j69494
19499B599628m4973l6373P31j06344N9299J73386R4566k2259l7586n3955j80562
19488B445558j78236j08817K98444O1414K8904J07012k19257j63761k06157P6337
19478B141441j22388l02043k79910O3565M21930K94282k3681r0430l2128J8976
19468B089614p7083j51926M1352j97350k66115r5682o5917j00539J77508J21524
19458A475386L5383J10353q9081N2131P4516Q5291J47840N3292q3549J32573J68608
19447B162743R7306q2086j49185J7034p7315Q4468J80283N8328K7991J22224K82062
19436B723853N6552K1427J5789J32924r2538J18943n5053K857J61032R1014n5641
$$ plain form
19509 1283259 1473563 1750016 1733698 1962068 2278091 2535518 2842213 2920359 2769122 2599628
19499 2599628 2554655 2518282 2519013 2412669 2471968 2645354 2739920 2717661 2680075 2626120 2445558
19488 2445558 2267322 2158505 2456949 2518363 2547267 2654279 2435022 2271261 2065104 2141441
19478 2141441 2019053 1717010 1437100 1500665 1922595 2216877 2193196 2102766 2070638 2089614
19468 2089614 2012531 1860605 1901957 1704607 1438492 1342810 1276893 1176354 1353862 1475386
19458 1475386 1510769 1621122 1532041 1584172 1658688 1743979 1891819 1945111 1861562 1994135 2162743
19447 2162743 2260049 2177963 2028778 2045812 1968497 2052965 2233248 2291576 2319567 2441791 2723853
19436 2723853 2780405 2801832 2817621 2950545 2858007 2976950 2921897 2924754 3085786 3176800 3121159
19425C121159k4405N069m6279L9252J68947K09473J12397J22357J23523N47770
19415D379263J76557K7940J31181J69181J09604K61770L70138L23266K47563L18642
19405F515105L01565O48747N81573O52610L48991L77047N94037R10603J025530
19396A1955808J072536J269154J540815J494970J980209K433782K759542L377329
19388B7884145M870116O700973R676256J3841772J9844635K6307280K9346498
19381A38471675K4886927J6141348Q174982j605368j2968464j4299098k737879
19374A56064123J2531886K2503336K1210847J2527555O361486L769562J71757
19367B35140552m78908j30773m312408q446607j1507574j7616883k0832745j2322289
$$ plain form
19425 3121159 3096754 3101823 3055544 3094796 3263743 3473216 3585613 3707970 3831493 4379263
19415 4379263 4555820 4583760 4714941 4884122 4993726 5255496 5625634 5948900 6196463 6515105
19405 6515105 6816670 7465417 8046990 8699600 9048591 9425638 10019675 10930278 11955808
19396 11955808 13028344 14297498 15838313 17333283 19313492 21747274 24506816 27884145
19388 27884145 32754261 39455234 49131490 62973262 82817897 109125177 138471675
19381 138471675 163358602 179499950 187674932 186069564 173101100 158802002 156064123
19374 156064123 168596009 191099345 212310192 224837747 231199233 234968795 235140552
19367 235140552 234661644 234530871 230218463 221771856 210264282 192647399 171814654 159492365
19359A59492365M062956J7688869J8255208M337020j0665181j8181298k5140369
19352A49849570l2192012l1381585k3527419j5677695j0505156p262001n134485
19345B4169217l852283k806160k209084k058823j706701j128854j045499r21625
19337H440188j097659j055471o21767j88408n29429n10850k83543l60250m91250
19328C301561m16574k18680k15091m72964l01058p1158r1394r3460l8069J1572
19318A394685l70047q0778k79836j62197n8755J57646J88155j15556j58776k67723
19308B46818M1579J80767k59774j06579k40962J01919P5952l51787m5531k08045
19298e65643K2482J80660J91581K98705J24191j48487j14007q391J24304J17255
$$ plain form
19359 159492365 163555321 181244190 199499398 203836418 193171237 174989939 149849570
19352 149849570 117657558 86275973 62748554 47070859 36565703 29303702 24169217
19345 24169217 20316934 17510774 15301690 13242867 11536166 10407312 9361813 8440188
19337 8440188 7342529 6287058 5665291 5476883 4947454 4436604 4153061 3792811 3301561
19328 3301561 2884987 2666307 2451216 1978252 1677194 1606036 1514642 1421182 1383113 1394685
19318 1394685 1024638 943860 664024 501827 443072 600718 788873 673317 514541 246818
19308 246818 288397 469164 209390 102811 -138151 -36232 39720 -312067 -357598 -565643
19298 -565643 -543161 -362501 -170920 127785 251976 103489 -10518 -18909 105395 222650
19288B22650P2764J37316K5356j81223K0316j73402j12976m0080J76943L54728
19278E02392L31074N0732L5424j45667j24714j6017K2167R3516J90788K85271
19268A224966m0788j49961l5554M9925J93599J72204k64768j57844N300J10797
19258A107876Q0741L42561L10145r918j30646l8716j20848k30435k15662j66196
19248I28902J20138L157l8467J92310J3196O206M2889M6147o7180L6548k47491
19237A036355L7067J16796N2600r770J16019L60240K56719J11995L56287K10477
19227B644785O4193p8518K4729K53290J24806L15212K41155M6631K79206k12771
19217C702718l68762j51903m0200J22007L38502L55713j51217k61321j43670k53716
$$ plain form
19288 222650 295414 432730 458086 276863 297179 123777 10801 -29279 147664 502392
19278 502392 833466 884198 919622 773955 649241 633224 655391 748907 939695 1224966
19268 1224966 1184178 1034217 998663 1048588 1242187 1414391 1149623 991779 997079 1107876
19258 1107876 1188617 1531178 1841323 1831405 1700759 1662043 1541195 1310760 1095098 928902
19248 928902 1049040 1052197 1013730 1206040 1219236 1225442 1268331 1314478 1247298 1283846 1036355
19237 1036355 1073422 1190218 1242818 1233048 1349067 1709307 1966026 2078021 2434308 2644785
19227 2644785 2708978 2630460 2655189 2908479 3033285 3348497 3589652 3636283 3915489 3702718
19217 3702718 3333956 3182053 3141853 3263860 3602362 3958075 3806858 3545537 3401867 3148151
19207C148151p2912k23210j43762P5236o4219m69606k70950K5488R7161q0196
19197B021181K5591K23082J50265L37514K31774j05420m5817j44748r7253R5965
19187B692134O6592M9986J33760L16656P22017L91403K51466M77020K15435O429
19177E322898k37945Q6253J37040M29700N94971L89053N49561P60112K07695J51226
19167H390564K48208K07832L44891L11689M14559P79663Q31647Q37552O68794
19158A3035399Q74866J508181J974717K626362M196155O279163R136625J3580559
19150E3212027J9003242K2318986J7465282K941133q980967q366822J895956J5557735
19142A15046572K7837138L0990349J7785076n642031k4381235k9997967k4151568
$$ plain form
19207 3148151 3075239 2852029 2708267 2783503 2719284 2249678 1978728 2004216 2101377 2021181
19197 2021181 2046772 2269854 2420119 2757633 2989407 2883987 2838170 2693422 2596169 2692134
19187 2692134 2758726 2808712 2942472 3259128 3981145 4372548 4624014 5101034 5316469 5322898
19177 5322898 5084953 5171206 5308246 5737946 6332917 6721970 7271531 8031643 8239338 8390564
19167 8390564 8638772 8846604 9191495 9503184 9917743 10697406 11529053 12366605 13035399
19158 13035399 13910265 15418446 17393163 20019525 24215680 30494843 39631468 53212027
19150 53212027 72215269 94534255 111999537 114940670 105959703 97592881 99488837 115046572
19142 115046572 142883710 173874059 191659135 186017104 161635869 131637902 107486334
19135A07486334j2266501r2719R371540J0940690p12000j7835697k4676937k0328017
19127E1886693j3194207q212503n236993l489714k180671j411383j096307q15481
19119A6249434o96862m48795k38300J16345L39837N23366P04288M45210Q48019
19110A7842542J077318J383779J880381L165162M325406O072036R284513J4124601
19102E9155738K0914813K6945179K4671180Q921969q794159j2373499j654607
19095A17786614J2979160K6357069L3173463K6004207N591316j8721168l4638653
19088A68532008l3564266k0050477m369714P599429J1333347J547461j6795352
19081A14232436k7418822k4353659j6290487j0572310p125540n018398l704153
$$ plain form
19135 107486334 95219833 95127114 104498654 115439344 114727344 96891647 72214710 51886693
19127 51886693 38692486 30479983 25242990 21753276 19572605 18161222 17064915 16249434
19119 16249434 15552572 15103777 14865477 14981822 15321659 15845025 16549313 16994523 17842542
19110 17842542 18919860 20303639 22184020 25349182 29674588 35746624 45031137 59155738
19102 59155738 80070551 107015730 131686910 140608879 131814720 119441221 117786614
19095 117786614 130765774 157122843 190296306 216300513 221891829 203170661 168532008
19088 168532008 134967742 114917265 110547551 118146980 129480327 131027788 114232436
19081 114232436 86813614 62459955 46169468 35597158 28471618 23453220 19749067
19074A9749067k762631j994677j588164j039552n54737k66304N5223k58864p77057
19065A0562304j380717j431124p59161m59771Q7970N41023N65014L17651k36178
19056G807011o50424o75326p58149k55021p9134Q9778J04984J94833k60308o15683
19046D902561n38136o91603l35845k00524l50371n78138l92329k02213j51375
19037A462027l38419k61633j52926J90935K16414J29315k02428j25116J32356
19028A050525J58900p5399k75267q9843J83628L49457J15435j72426j56823k625
19018A085562J35020J1720j53144j29220j5441R6863K34947j36050j98150M2421
19008I74528j2146Q2897J159J47979K62263o5653K8136M39982K34421k747n20211
$$ plain form
19074 19749067 16986436 14991759 13403595 12364043 11809306 11543002 11598225 11339361 10562304
19065 10562304 9181587 7750463 6991302 6531531 6619501 7160524 7725538 8043189 7807011
19056 7807011 7156587 6481261 5723112 5468091 5388957 5478735 5583719 5778552 5518244 4902561
19046 4902561 4364425 3672822 3336977 3136453 2786082 2207944 1815615 1613402 1462027
19037 1462027 1123608 861975 709049 899984 1116398 1245713 1043285 918169 1050525
19028 1050525 1209425 1134026 858759 768916 952544 1302001 1417436 1245010 1088187 1085562
19018 1085562 1220582 1232302 1079158 949938 934497 1031360 1266307 1130257 932107 974528
19008 974528 962382 1045279 1046438 1194417 1456680 1391027 1419163 1859145 2093566 2090819 1570608
18997A570608l44872K17466K70123k357m6633J27264j4517J91463N0733o088J55274
18986B168464N7227Q8022k01950j19863K16587K28949J12785N7011L63415M03290
18976C373937K11920K51108J70766q9231p7967n840P8091K86278N81912O01145
18966E382119L76340L91631K83391J42719R4178M38189J023745J168879R72148
18957A0273339O97342N94213J22181J36255N42850O97847J264763K060405K185277
18948A8574472K303385K220417K325018K928456M299847O805297J0235937J5534495
18940F5227324K4385188L7922311N3275782N5740018K5078700k1633765m0482738
18933A99512820k4007458M336181L4665262O8505559R5814229Q1859140K517649
$$ plain form
18997 1570608 1225736 1443202 1713325 1710968 1664335 1791599 1777082 1968545 2019278 2013190 2168464
18986 2168464 2225691 2313713 2111763 1991900 2208487 2437436 2550221 2607232 2970647 3373937
18976 3373937 3585857 3836965 4007731 3918500 3840533 3834693 3912784 4199062 4780974 5382119
18966 5382119 5758459 6150090 6433481 6576200 6670378 7108567 8132312 9301191 10273339
18957 10273339 10970681 11564894 11687075 11823330 12366180 13064027 14328790 16389195 18574472
18948 18574472 20877857 23098274 25423292 28351748 32651595 39456892 49692829 65227324
18940 65227324 89612512 127534823 180810605 236550623 261629323 239995558 199512820
18933 199512820 175505362 179841543 214506805 283012364 378826593 460685733 463203382
18926D63203382q3223799j02581672o9128860l0971008j171900K3613795L7277763
18919B37017701K2420573k2791128n7610483n6188385l7433221k2770623j4618341
18912D8026093r529432o640582m611848l389292k214559j879689j566093j123024
18904A7071574r74865j174259j352905p31897n65032k46092M9922J25674J56205
18895A2358325R594m0749k7435J06346l426K63021R71640J520841J953396K655034
18885A9766587M037824N887494Q778133J3142274J7087118J7919624J0806853
18878I7425907j967684r898124p988646J80648Q835272J4009369J0847068k347104
18870A09096706j4600251j5723410q651534K13208P636408J1345692R112602l62523
$$ plain form
18926 463203382 379979583 277397911 208269051 177298043 176126143 199739938 237017701
18919 237017701 259438274 236647146 179036663 122848278 85415057 62644434 48026093
18912 48026093 38496661 31856079 27244231 23854939 21640380 19760691 18194598 17071574
18904 17071574 16096709 14922450 13569545 12837648 12272616 12026524 12076446 12202120 12358325
18895 12358325 12367919 12327170 12299735 12406081 12402655 12665676 13637316 15158157 17111553 19766587
18885 19766587 23804411 29691905 38470038 51612312 68699430 86619054 97425907
18878 97425907 95458223 85560099 77571453 77752101 86587373 100596742 111443810 109096706
18870 109096706 94496455 78773045 70121511 70334719 77971127 89316819 98429421 98066898
18862I8066898r236719j0195977m363453L642609J0107216R663520j9489j3136264
18854H4528341j9722680j6805718j1358840p063818m491587k879722j888617j064281
18846A9253078n73818l90687j08484n20259n9861M11197R81274J138826J281633
18837B1412899J790737L079946M490577O626939R961453J4910051K1614427K6855686
18829A10742715K4481358Q929279j0088497j6531404r572076K174074J1532084
18822A21667533J3573109M839236r806167j7599644j3707429l711132P735764
18815A02991270J7385896K0108229R826051q646693k0044343j6288312n091657
18808A00240441N722321J1145274O280688q768755k1841096k3868880j8599110
$$ plain form
18862 98066898 88830179 78634202 74270749 77913358 88020574 97684094 97664605 84528341
18854 84528341 64805661 47999943 36641103 29577285 25085698 22205976 20317359 19253078
18846 19253078 18679260 18288573 18180089 17659830 17599969 18011166 18992440 20131266 21412899
18837 21412899 23203636 26283582 30774159 37401098 47362551 62272602 83887029 110742715
18829 110742715 135224073 144153352 134064855 117533451 107961375 110135449 121667533
18822 121667533 135240642 140079878 130273711 112674067 98966638 95255506 102991270
18815 102991270 120377166 140485395 150311446 141664753 121620410 105332098 100240441
18808 100240441 105962762 117108036 123388724 114619969 92778873 68909993 50310883
18801E0310883j2554778q283476n578214m050500l024698k009705j161697j143136
18793A2504679j198575j003912q24673p12821q16510p14725q39634r47654p21529
18784D724646p27965n51960m70144m41214m03916l67999P75p5974k32738j28287
18774A325224j40132j86416m28733k05332k17486j99101q19J34830j25216K872
18764d0309l7049M4425o1635N9570K56057K69757q1116l29573j82247o5859K5200
18753a42779K05587r1084j78605n3050R6093O3309J33992K01142L64106J29922
18743G28633j19163Q0503N5933J27164J35234m08474m09393l63112m4115n343
18733b22133j49472K42538j11300m76927k59556j56757K00230K32980K02319J13440
$$ plain form
18801 50310883 37756105 29472629 23894415 19843915 16819217 14809512 13647815 12504679
18793 12504679 11306104 10302192 9477519 8764698 7948188 7233463 6393829 5446175 4724646
18784 4724646 3996681 3444721 2974577 2533363 2129447 1761448 1762223 1686249 1453511 1325224
18774 1325224 1185092 998676 569943 364611 147125 -51976 -52795 82035 -43181 -40309
18764 -40309 -77358 -32933 -94568 -34998 221059 490816 409700 80127 -102120 -167979 -142779
18753 -142779 62808 -28276 -206881 -259931 -163838 -100529 33463 234605 598711 728633
18743 728633 609470 689973 745906 873070 1008304 599830 190437 -172675 -216790 -222133
18733 -222133 -371605 -129067 -240367 -717294 -976850 -1133607 -933377 -700397 -498078 -384638
18723c84638N8284j68162j72885k27154L8835l1822J69972O1517j8681j59490
18713h34224n1408R4849j41960J22120J46548j05507p1319Q4116l1500K85379
18703e02906P5233J18420j38832j80897m9411M1813p372K01597N7913l9334j8242
18692d42018j39083K2230l0573K55777J48272j67563j88773k6077K2774J5562
18682e29472J9355N4691j61520J17669m1311J2184J37813O4700Q389N357q0788
18671c92933P8974j6031N8839K02530K29524k42863k45654J90331K23540J24586
18661B10843K00336m2596k27774l20558j64908n4775J31243J51752O1120n233
18651f0550k2495k9131p8703M4925O1734o2244K50526K78578j85992j46018p8086
$$ plain form
18723 -384638 -326354 -494516 -667401 -894555 -855720 -887542 -717570 -656053 -674734 -834224
18713 -834224 -885632 -790783 -932743 -810623 -664075 -769582 -840901 -756785 -788285 -502906
18703 -502906 -427673 -309253 -448085 -628982 -678393 -636580 -643952 -442355 -384442 -423776 -442018
18692 -442018 -581101 -558871 -589444 -333667 -185395 -352958 -541731 -567808 -545034 -529472
18682 -529472 -510117 -455426 -616946 -499277 -540588 -528404 -390591 -325891 -317502 -312145 -392933
18671 -392933 -313959 -329990 -271151 -68621 160903 -81960 -327614 -137283 86257 210843
18661 210843 411179 368583 140809 -179749 -344657 -399432 -268189 -116437 -55317 -60550
18651 -60550 -83045 -112176 -190879 -145954 -84220 -146464 104062 382640 196648 50630 -27456
18640b7456O7211o7230J62261Q5814O1141J05423J63761o6929q148j23017L74935
18629G27766K07885J19989J21776J54448J89697J06665L450K82374N08519L11980
18619B734549K09397L74361L78969J22128J13113L23960J27628N6004q4592j91700
18609D163817K49468O67293K80981K80939N79530Q84519J042363J337185J755354
18600A1241449K002934K329087L529721M975106O979567J0306697J5455119K2924323
18592G9744003L2356630L8278841L2830607J6453439R30586j1806663k6712632
18585A62074811l6809846l4663775k5092333j6602298j0764325p250039n130887
18578B5761308l752196k849299k303526j837163j339527q62790m18106k83406
$$ plain form
18640 -27456 39755 -27475 134786 220600 281741 387164 550925 483996 475848 352831 727766
18629 727766 935651 1055640 1177416 1331864 1521561 1628226 1631676 1914050 2422569 2734549
18619 2734549 2943946 3318307 3697276 3819404 3932517 4256477 4384105 4440109 4355517 4163817
18609 4163817 4413285 5080578 5361559 5642498 6222028 7106547 8148910 9486095 11241449
18600 11241449 13244383 15573470 19103191 24078297 31057864 41364561 56819680 79744003
18592 79744003 112100633 150379474 183210081 199663520 200594106 188787443 162074811
18585 162074811 125264965 90601190 65508857 48906559 38142234 30892195 25761308
18578 25761308 22009112 19159813 16856287 15019124 13679597 12816807 12398701 12115295
18570A2115295q212K9690k48098k65152j91643Q1928K9829k29128k26008l18914
18560A0769587L8686K40882K07472K96483N78214Q56419J021780J707942K289312
18551A8006777K754991L566900N165664P119155J0079912J5030197K2495421L3341721
18543A17560738M5105032M9872120M3841650L1198648J2413438j2987929l3922614
18536B53081083m4194148m7272902m3520932l2749640k1892465j4535029j0276593
18529C8639374o916677m973369m016466l026202k547848j845192j406744j201538
18521A2705338j001671q21120m69084K7478J02578j8363k07391n62819m19471
18512I335475k14807m56829l89168m42258l34560O7292N0560K05771J87958L55140
$$ plain form
18570 12115295 12107083 12136773 11888675 11623523 11431880 11513808 11543637 11314509 11088501 10769587
18560 10769587 10808273 11049155 11256627 11553110 12131324 12987743 14009523 15717465 18006777
18551 18006777 20761768 24328668 29494332 36613487 46693399 61723596 84219017 117560738
18543 117560738 162665770 212537890 256379540 287578188 299991626 287003697 253081083
18536 253081083 208886935 161614033 118093101 85343461 63450996 48915967 38639374
18529 38639374 31722697 26749328 22732862 19706660 17158812 15313620 13906876 12705338
18521 12705338 11703667 10882547 10413463 10440941 10543519 10525156 10317765 9754946 9335475
18512 9335475 9120668 8663839 8274671 7832413 7497853 7565145 7615705 7821476 8009434 8364574
18502H364574O52754J006849J441968K029938K846749M387862O536687J0311733
18494C7579114J5578136K1719834K4815713J9503790Q341414o01648q812355j9618197
18486I8505801k5237039k1612256j4618041r379352o119594m115415l049101k251805
18478A2123198j774436j268616j262428j223652r90380p74280m67207l88123m23574
18469C550502m50064j71145l9500K0390J02785k01129k51607j56871K5772k77032
18459B152101j73832j47060k25125j66262l37670l22514l49072j91342O1204M8035
18449C48463j1404j25584j29915j99487k7556J94845M03100l4784k17859L0887
18439B30706j10251j60599M5422j13420O329J13943j30377P3472r798p7121J22178
$$ plain form
18502 8364574 9017328 10024177 11466145 13496083 16342832 20730694 27267381 37579114
18494 37579114 53157250 74877084 99692797 119196587 127538001 126936353 118123998 98505801
18486 98505801 73268762 51656506 37038465 27659113 21539519 17424104 14375003 12123198
18478 12123198 10348762 9080146 7817718 6594066 5603686 4829406 4362199 3974076 3550502
18469 3550502 3100438 2929293 2889793 2910183 3012968 2811839 2560232 2403361 2429133 2152101
18459 2152101 1978269 1831209 1606084 1439822 1102152 779638 430566 239224 300428 348463
18449 348463 337059 211475 81560 -117927 -145483 49362 452462 417678 199819 230706
18439 230706 120455 -40144 5278 -108142 -101813 12130 -118247 -44775 -54573 -131694 -9516
18428i516N1642j54089k90948j91079J06883l513k6108J07209J42481R5528K88716
18417A17206o188Q2142J39772J94794m30450m98538k39914j26460P1061Q8490
18407f08085q7128J10263K89920J93490r7101k70751j04039J14171R7072K1283
18397c40905Q2679L7856j66161o3203n1285r5242k29645j92444l7400J94780q4829
18386i45799O5781K9017N4956R8947L3005J910K33797n7519j70926O5460k1665
18375f13036R4571P3088L8060k47702l9302K41692L46460L3781j51454k14297
18365d38139j59863j16394K32718L2763j5890K25567L31191R5407J13874J4295
18355C15529l63549j64642o0748J25184j4062j17024J64917L58845l33310J9318
$$ plain form
18428 -9516 42126 -111963 -402911 -593990 -487107 -490620 -516728 -409519 -267038 -171510 117206
18417 117206 111018 193160 332932 527726 97276 -401262 -641176 -767636 -696575 -608085
18407 -608085 -695213 -584950 -295030 -101540 -198641 -469392 -573431 -459260 -362188 -340905
18397 -340905 -258226 -220370 -386531 -449734 -501019 -596261 -825906 -1018350 -1055750 -860970 -945799
18386 -945799 -880018 -851001 -796045 -697098 -664093 -662183 -428386 -485905 -656831 -591371 -613036
18375 -613036 -518465 -445377 -407317 -655019 -694321 -452629 -106169 -72388 -223842 -438139
18365 -438139 -598002 -714396 -481678 -448915 -464805 -239238 91953 187360 301234 315529
18355 315529 -48020 -212662 -273410 -148226 -162288 -279312 -114395 244450 -88860 -69542
18345f9542J50450m1577J52436j66185j6269J0468Q2993m9103k01733L5288J80813
18334F8039j23708K2711J38707P1926j48978K9383N2057J36463L68784K95083
18324I10467n6283r7308r9612J92442R891L60L03711K88488L7040m10927k57621
18313H20648l06077l07500m1496M39630K18552P3290j57320l09791l11631r9525
18303A8780j08740J3783j44789n7614J56820r6797M3260j02361j23936K95387
18293a06207j87665k55339j55551M6107J66553o947k26792N6358J39696N3884
18283d75903j5954j44791m9068j05315Q5234L12157q2412k65273m0969K0159m1385
18272h03520J83249K4017j59593J62535R3092r0502k00033J81043J44097l48065
$$ plain form
18345 -69542 80908 39331 191767 25582 9313 19781 102774 53671 -148062 -112774 68039
18334 68039 -55669 -32958 105749 177675 28697 58080 110137 246600 615384 910467
18324 910467 854184 756876 657264 849706 859597 859957 1163668 1452156 1489196 1078269 820648
18313 820648 514571 207071 165575 605205 823757 897047 739727 429936 118305 18780
18303 18780 -89960 -76177 -220966 -278580 -121760 -218557 -175297 -277658 -401594 -106207
18293 -106207 -293872 -549211 -704762 -658655 -492102 -499049 -725841 -669483 -529787 -475903
18283 -475903 -491857 -636648 -685716 -791031 -705797 -393640 -476052 -741325 -782294 -762135 -803520
18272 -803520 -620271 -596254 -755847 -593312 -500220 -590722 -790755 -609712 -465615 -813680
18262h13680l07124P0626J01270P9352k4519K7220P5745R003J35994r8340J08418
18251f36035Q7694J170N4878j04459j27846N7900K5525l7976O5789Q7606o21j34686
18239f61061j92797r3870J79734Q3101M2571J67555J78719K65117J14246p1653
18229A1662j3704p9564j41789k13333r0049J7331L6829M2510j23329Q4426m4927
18218e13937j66112k7471O1035j91660l05136L32368L32384J22098p768j00102
18208d64301l5219o1142n5550j34987M1658K55143j5206L3689J4127o1276j45041
18197f28105q1068k19575L58911K61429k08080j45051O9560P413O8152J08727
18187d07687m0481R0433j83982k12579N8127J24502k7775J14084l9824J10034
$$ plain form
18262 -813680 -1120804 -1050178 -948908 -869556 -894075 -866855 -791110 -782107 -646113 -744453 -636035
18251 -636035 -548341 -547171 -492293 -596752 -724598 -666698 -641173 -679149 -613360 -525754 -526375 -661061
18239 -661061 -853858 -947728 -767994 -684893 -642322 -474767 -296048 -30931 83315 11662
18229 11662 -2042 -81606 -223395 -436728 -526777 -509446 -472617 -430107 -553436 -469010 -513937
18218 -513937 -680049 -707520 -646485 -838145 -1143281 -810913 -478529 -356431 -364199 -464301
18208 -464301 -499520 -560662 -616212 -751199 -709541 -454398 -469604 -435915 -421788 -483064 -628105
18197 -628105 -709173 -928748 -569837 -308408 -516488 -661539 -591979 -584566 -516414 -407687
18187 -407687 -448168 -357735 -541717 -754296 -696169 -571667 -599442 -485358 -525182 -415148
18177d15148l4149R915K39610m0303J7007L8850o1394k10860L6096J92666P4936
18166a52774K40940L59001K55482K39928k522R6060N405n4605J64872M90634N07369
18155B149790J47757o7367j16629l92001l39408m79010k65017j07829K52614K66793
18145A049693R7785m50892j02217j23998j92826J57531J20180Q444l394J40150
18135G00456J92681M13420P1960L92171K82713M6878k7767l88373k09669j51431
18125A323039j83643m872L5971K88358O63253P24158J130047J123521O81298K30315
18115F011445q0727j46515O0973P31998J050286Q01425J41239q80573j193271
18106F496280q63232l58768K52361P35469Q34534l12314r20412r36922q99484
$$ plain form
18177 -415148 -449297 -439382 -199772 -240075 -223068 -184218 -245612 -456472 -420376 -227710 -152774
18166 -152774 88166 447167 702649 942577 940055 1036115 1041520 986915 1151787 1642421 2149790
18155 2149790 2297547 2230180 2113551 1721550 1382142 903132 638115 530286 782900 1049693
18145 1049693 1147478 696586 594369 470371 277545 435076 555256 563700 560306 700456
18135 700456 893137 1306557 1378517 1770688 2053401 2100279 2072512 1684139 1474470 1323039
18125 1323039 1139396 1134524 1170495 1458853 2122106 2846264 3976311 5099832 5781130 6011445
18115 6011445 5930718 5784203 5845176 6577174 7627460 8428885 8570124 7689551 6496280
18106 6496280 5633048 5274280 5526641 6262110 7096644 6784330 5863918 4926996 4027512
18097D027512q98332r22705m88305k8767J16262J82524J61584M46298M70802Q8225
18087C155098j70018j47686Q2994J13041r0554L14630O57741R2317j17505k14586
18077C675472l94367o55974m54543k5295J36770q4800P4072O00354J108618J968745
18067E949052K189643J795829O53289m4059o38550q85362p05549o61140p68973
18058F884180r55085j224113r95437m03705k18712m66167n87767m55855l73230
18049A204109m83118k73015K5968P8242o0440J05408K3853m80366k21992J94551
18039A13200J88650N4420j30762k38742q6764j1497J64004J63524J72453K94342
18029F82828J80996J67602M7769J67752L41625J76862J08968K39408O0903L83025
$$ plain form
18097 4027512 3129180 2206475 1718170 1689403 1805665 1988189 2149773 2596071 3066873 3155098
18087 3155098 2985080 2837394 2920388 3033429 2942875 3257505 3915246 4007563 3890058 3675472
18077 3675472 3281105 2625131 2170588 2145293 2282063 2197263 2271335 2871689 3980307 5949052
18067 5949052 8138695 9934524 10587813 10543754 9905204 9019842 8314293 7653153 6884180
18058 6884180 5929095 4704982 3709545 3305840 3087128 2620961 2033194 1577339 1204109
18049 1204109 720991 447976 473944 552186 491746 597154 621007 140641 -81351 113200
18039 113200 301850 356270 225508 -13234 -99998 -111495 52509 216033 388486 682828
18029 682828 863824 1031426 1079195 1246947 1588572 1765434 1874402 2113810 2174713 2557738
18019B557738O25565Q07383M57499K36695j6798N57071Q81680O64950K15430L59551
18009G346764O58403J186715Q90307N24615M61700P22637P43187j33921r00205
18000A1500202m31948j45125q13433j519967j181962r74037r04875q86083q41954
17991C800818m95242J26998K67503M34446M91802M42588J07231j22237J65672
17982E219579J15643k72683l00160n2423j85378q7760r6432k36563p4735J3191
17972D042279K14949J55734j66271j68605N49911M91756K62052O9435j64898j19121
17962E167221L26672K36402O7070K62416K31048J0366j69364l42590l16367J4471
17952E487345L53478N08272K88593k81420l34382j10130j2792j27063k92115J29363
$$ plain form
18019 2557738 3183303 3990686 4448185 4684880 4668082 5225153 6106833 6771783 6987213 7346764
18009 7346764 8005167 9191882 10082189 10606804 11068504 11791141 12534328 12400407 11500202
18000 11500202 11068254 10923129 10109696 8589729 7407767 6433730 5528855 4642772 3800818
17991 3800818 3305576 3432574 3700077 4134523 4626325 5068913 5176144 5053907 5219579
17982 5219579 5335222 5062539 4762379 4709956 4524578 4436818 4340386 4103823 4029088 4042279
17972 4042279 4257228 4412962 4246691 4078086 4627997 5119753 5381805 5451240 5286342 5167221
17962 5167221 5493893 5730295 5797365 6059781 6290829 6301195 6131831 5789241 5472874 5487345
17952 5487345 5840823 6349095 6637688 6356268 6021886 5911756 5898964 5771901 5479786 5609149
17942E609149K59962K50251K5680M57829P92302P35298N76293L24090K30479M24587
17932I685920O24166N34306p8547m02221l65181m88875n00240k38192j80813j58624
17922H431699j48047L1810j41777r1157j46503K27443J72232J23662M02604M59575
17912I321541R28612J214411J575022J835486K539247L343197N162461P535399
17904C3455376J1204772J8072936L0012146M6415905O0947135N4662483J7193344
17897B71964097j8402027j5660267J6884364M8932665N6326169L2863727M956487
17890C97865215j7523766m4341472n4637448l1802053L447853K2674699N125940
17883B80808968l8277352o3092403n4472552l5206441k1908178j4186464r784704
$$ plain form
17942 5609149 5869111 6119362 6145042 6602871 7395173 8130471 8706764 9030854 9261333 9685920
17932 9685920 10310086 10844392 10765845 10363624 9998443 9509568 9009328 8771136 8590323 8431699
17922 8431699 8283652 8315462 8173685 8082528 7936025 8163468 8335700 8459362 8861966 9321541
17912 9321541 10250153 11464564 13039586 14875072 17414319 20757516 25919977 33455376
17904 33455376 44660148 62733084 92745230 139161135 200108270 254770753 271964097
17897 271964097 253562070 237901803 254786167 303718832 360045001 392908728 397865215
17890 397865215 380341449 335999977 281362529 249560476 253008329 275683028 280808968
17883 280808968 242531616 179439213 124966661 89760220 67852042 53665578 43880874
17876D3880874o946264n075183m129342l239795k671730k262107j741055j514328
17868A6301070j083701o43503q16174p66749p04954q47140p45271l74290m23185
17859I896103j85055j62003m51777m70804m00936n04712j98319k06919l98910
17850F916668k57132m69891n68196k22679j21115L2887J60728n2947k89988l48905
17840D779430k84190o5153j5062l3749Q3249k6529p6450l57636k14751L6591L2506
17829C858256k77889n76172k57979j76859l20699l79055k46391r2300L175l55483
17819A178604K3566K92537k58583j27978K0252J51939J5455k14758N1881J20195
17809A253110j08905j27059L7949m7750j15046l8666j54541j53054O1051N8073
$$ plain form
17876 43880874 36934610 31859427 27730085 24490290 21818560 19556453 17815398 16301070
17868 16301070 15217369 14573866 13757692 12990943 12285989 11438849 10693578 10319288 9896103
17859 9896103 9711048 9549045 9097268 8626464 8225528 7720816 7522497 7315578 6916668
17850 6916668 6659536 6189645 5621449 5398770 5277655 5310542 5471270 5418323 5128335 4779430
17840 4779430 4495240 4430087 4415025 4381276 4464525 4437996 4361546 4003910 3789159 3825750 3858256
17829 3858256 3580367 3004195 2746216 2569357 2248658 1869603 1623212 1530912 1534087 1178604
17819 1178604 1202170 1494707 1236124 1108146 1128398 1280337 1295792 1081034 1132915 1253110
17809 1253110 1144205 1017146 1055095 1007345 892299 853633 699092 546038 607089 665162
17799F65162p7535Q6990l30863J1702M74004O236O8612n1421j50101M4711J14665
17788H62162j36461j84986j96598J952J7254J83841j70257j32763J85160R0160
17778E19464o3461j41821N8453K12044J56958n627n3923k08722q3216K10079R5920
17767F96148K1383M0682J20377R8086o8450k03748k7473K0270O4682j63875k33978
17756C64104j40805j36934o6666J7808M8674o5327J39380O1943K34611j2730J11904
17745E55962p7480q2982J00625P368k64325j51526Q8713Q5452j7978R3341l562
17734C33608j47518l5259j80207l87546j0634J27843m8382K52829K60642J87849
17724C53225K90975L5615j75782j37872l4645j41162j70492p290L8691l62m3110
$$ plain form
17799 665162 587627 674617 343754 355456 829460 835696 904308 852887 702786 747497 862162
17788 862162 725701 540715 344117 346069 363323 547164 376907 244144 429304 519464
17778 519464 456003 314182 372635 584679 741637 736010 682087 473365 390149 600228 696148
17767 696148 717531 758213 878590 976676 908226 704478 677005 697275 761957 598082 364104
17756 364104 223299 86365 19699 37507 86181 20854 160234 222177 456788 444058 555962
17745 555962 478482 395500 496125 503493 239168 87642 176355 261807 243829 337170 333608
17734 333608 186090 150831 -29376 -416922 -427556 -299713 -348095 -95266 165376 353225
17724 353225 644200 679815 504033 366161 331516 190354 19862 12572 51263 50901 7791
17713G791K31287r6034j54004k46282Q9016J27912n8489l3940J51939K7067M5818
17702I2081l358k07575N700J20614L52562K6376o1495l2144j20274j07714J34348
17691A99121J79789k20793k27618J33650Q514n7179L43985M7079j02924n6184
17681B47440k21506q1444j76822J71879K08554j13236O6609n7481J61281K31552
17671D36826k68698q4172J61559p6683P330J93587K9431r7688k74090L7373q2135
17660a7360j61707p3012n0789L7625j07725j29557J63113K72698J70362r7590
17650F058j0591R8331r1091l34538k78277L2656L22046J41265L0531j42686N7655
17639a68641J38187p2255O7095k9636J681O5415K02883j24581k54805j82496k3616
$$ plain form
17713 7791 239078 143044 -10960 -257242 -168226 -40314 -98803 -132743 19196 46263 92081
17702 92081 88723 -118852 -113152 7462 360024 386400 324905 292761 172487 64773 199121
17691 199121 378910 158117 -69501 64149 72663 15484 359469 406548 303624 247440
17681 247440 25934 -55510 -232332 -60453 148101 34865 101474 43993 205274 436826
17671 436826 168128 83956 245515 168832 176162 369749 399180 301492 27402 64775 -17360
17660 -17360 -179067 -252079 -302868 -265243 -372968 -502525 -339412 -66714 103648 6058
17650 6058 -4533 93798 2707 -331831 -610108 -577452 -255406 -114141 -83610 -226296 -168641
17639 -168641 -30454 -102709 -35614 -65250 -63569 1846 204729 80148 -174657 -357153 -380769
17628c80769M04988k0065j71811P2459K81479K53385J78632r8040k19310l7764
17618B63184k09692j32957N4629o4396K3283L56123K3966p2510q542k83291k49788
17607b99991L99826N45714J46364J88371M4807q357l60343j16397j81079L0234
17597C89149o9771j55976q1073K30078j70069p4153j42647q1143O3716L2564O9772
17586A0447K25917L8643k6093m0569p660k76113k15386k2175K50768K95368L7297
17575B70444j80637P3974J04662P2961J6818j2033j84114k20416j95186M01954
17565A48427J01277j3298n391Q8774R5665J76255J06485J11333q1l16291j78665
17554C14490k78968j37466J91468k32328k01435J40753L02936K57614P4273L6496
$$ plain form
17628 -380769 24219 4154 -167657 -95198 186281 439666 618298 520258 300948 263184
17618 263184 53492 -79465 -24836 -89232 -65949 290174 314140 241630 233088 -50203 -299991
17607 -299991 99835 645549 791913 980284 1025091 1016734 656391 539994 358915 389149
17597 389149 319378 163402 82329 312407 142338 68185 -74462 -155605 -91889 -59325 10447
17586 10447 236364 275007 248914 208345 200685 -75428 -290814 -312989 -62221 233147 270444
17575 270444 89807 163781 268443 341404 358222 346189 162075 -58341 -253527 148427
17565 148427 249704 236406 231015 319789 415454 591709 698194 809527 809446 493155 314490
17554 314490 35522 -101944 89524 -142804 -344239 -203486 99450 357064 431337 467833
17544D67833N2470j76719k30079O0504j30445N3365J60934n7834k55729m21845
17534d77545Q1512P5602J43123P6180j2799N3126M1645J20852j16134j19390j4621
17523a48449K67113P3317k33791R021p2514j90013r0217k51248P9916K18181J52419
17512a86265L24212L6987j98963k61745K33241J41516q7927j90116J67739R1779
17502G0458j55623m3445O0369Q6124q2235P0496R889p8772k062r7436k6971r0204
17490b79412P4194J14798Q3299J20037K1410R2261k49287o0937M2640J81531p4102
17479F6432k01735j24031J4170m928k5871K10010J59491K915j64184j81467J31787
17468a17411J50772P2576n6472P0384o1436j23585n7182k57107J0789J45374J76510
$$ plain form
17544 467833 520303 343584 113505 174009 43564 96929 257863 200029 -55700 -477545
17534 -477545 -396033 -320431 -177308 -101128 -113927 -60801 -19156 101696 -14438 -133828 -148449
17523 -148449 118664 191981 -41810 -32789 -105303 -295316 -385533 -636781 -556865 -338684 -186265
17512 -186265 137947 174934 -24029 -285774 -52533 88983 1056 -189060 -21321 70458
17502 70458 -85165 -128610 -68241 17883 -64352 6144 16033 -62739 -64801 -162237 -189208 -279412
17490 -279412 -205218 -90420 -7121 112916 134326 226587 -22700 -83637 -40997 140534 66432
17479 66432 -135303 -259334 -245164 -250092 -275963 -65953 93538 96453 -67731 -249198 -117411
17468 -117411 33361 105937 49465 119849 58413 -65172 -122354 -379461 -368672 -223298 -46788
17457d6788j89968j45173J60807N7848L1343R0007K26944j701J8421k9197p5541
17446I7002J41681R9961j40995j39780k49980j70650K14821J69813L3404j87394
17436a32117J4474J0429J20061p6578k72665K51074M08893j72439k20990p070
17426g6928K00390o0289R815j92634n8464J88749o247L0657j54055j04921k6069
17415b49996Q573Q0106p8791k43704o0771L3286K03233J95583j69018k49688L01110
17404b30077J06740J51071J08868o5222k9976o684J95894j611j1890j24431k20459
17393a27777M6829k7957J37204J58403j33415p5383O0286j03170j59133l1756
17383b55869K32550K5909J2053R543j21506j8317N2937n0749K9011k8868q2405
$$ plain form
17457 -46788 -236756 -381929 -221122 -163274 -131931 -41924 185020 183319 201740 172543 97002
17446 97002 238683 338644 197649 57869 -192111 -362761 -147940 21873 55277 -132117
17436 -132117 -117643 -107214 12847 -63731 -336396 -85322 323571 151132 -69858 -76928
17426 -76928 123462 63173 72988 -119646 -178110 10639 4392 35049 -119006 -223927 -249996
17415 -249996 -241423 -161317 -240108 -483812 -544583 -511297 -308064 -112481 -281499 -531187 -230077
17404 -230077 -123337 27734 136602 71380 41404 34720 230614 229003 217113 92682 -127777
17393 -127777 -80948 -108905 28299 186702 53287 -22096 38190 -64980 -224113 -255869
17383 -255869 -23319 2590 14643 24186 -97320 -115637 -62700 -113449 -84438 -113306 -195711
17372a95711J14876j79959q4847j8189J24937M3589o2181J26642M0540Q3116M32199
17361D25012R1724j93138j40230N3715j81314Q6524K9672l1911p8532j56980M7591
17350d7867J31976O5054k79793j15319j7667R9645Q3717l9529o4670M0339K93975
17339A49861k968m5900r9466J62643J0403l19408R714P5225J4157K03851J47414
17328C05526j74589n7994Q3463r4531L017J14594o9079O4643p8787p8301L01825
17317C19787J28465l80559j13316J67368J74515K3526r0095K5020k6824N4359
17307B82246K45933j33919k56525J2608K53306K3006J33578J58778K22250K24526
17297A165787K35266l3858k00791K6798j5333J2548K27418K5971J317q1607k90952
$$ plain form
17372 -195711 -80835 -260794 -345641 -363830 -238893 -195304 -257485 -130843 -90303 -7187 425012
17361 425012 516736 323598 183368 237083 55769 142293 171965 140054 61522 -95458 -47867
17350 -47867 84109 149163 -130630 -245949 -263616 -163971 -80254 -119783 -184453 -144114 149861
17339 149861 146893 100993 1527 164170 174573 -144835 -135121 -59896 -45739 158112 305526
17328 305526 130937 72943 156406 61875 64892 179486 110407 175050 96263 17962 319787
17317 319787 448252 67693 -45623 121745 296260 319786 229691 254711 227887 282246
17307 282246 528179 394260 137735 150343 403649 426655 560233 719011 941261 1165787
17297 1165787 1401053 1367195 1166404 1193202 1177869 1190417 1417835 1443806 1445123 1363516 1072564
17286A072564K2636J89192m6790k28646N7753K1816j10602k49781k03141m1437
17276D83564n9390j39798j27358K06667q106N258j67708k06163n2141o8462Q823
17265a24814o5788n0801R9870K60008N5238k59131k72064k02419j02945L8472
17255f24374J54755K75611L94237k1026l50531p0375K045J03499J1054j39994
17245b65099k47453j343K92117J57140P0103P1813p8953r1156Q1612K31793K20509
17234D41083j33279k97952R4122J41647j88801k71915p2426K55536J93051r1061
17224G0005j40832R9489m9859j49935O0622L924r464K04827N9799j04225l19831
17213b75480j09874J00202J67507J49649J7286j13207J3793j6686J04273J17789
$$ plain form
17286 1072564 1095200 1284392 1237602 1008956 1066709 1088525 977923 728142 525001 483564
17276 483564 424174 284376 157018 363685 355579 360837 193129 -13034 -65175 -133637 -124814
17265 -124814 -190602 -241403 -141533 118475 173713 -85418 -357482 -559901 -662846 -624374
17255 -624374 -469619 -194008 200229 179203 -171328 -241703 -239658 -136159 -125105 -265099
17245 -265099 -512552 -513895 -221778 -64638 5465 77278 -1675 -92831 -11219 220574 441083
17234 441083 307804 9852 103974 245621 56820 -215095 -287521 -31985 161066 70005
17224 70005 -70827 28662 -21197 -171132 -110510 -106586 -116050 88777 148576 44351 -275480
17213 -275480 -385354 -285152 -117645 32004 49290 -63917 -50124 -66810 37463 155252
17203A55252j05412o8977J15716J48019p794k49544O329N4806M8976K0859k3502
17192I4728n9720k9460j63054k82625P8229j79295p1567L39868M09219j64707
17182b8384J2563l2525q5803J54008r750l6632j4509k17807L9504J19662j02095
17171b01768j46820R9900j15627J93904Q6240K68340R6523j95961k03000J94201
17161G5932l493p3345J36130N7096j43800j10196Q2661J40950j39788r3114p4574
17150a45541L8936J88156k6203m0168M7822R3215P026k39652j43319l3426M5943
17139b07211J72446k27927j06884J79323J97351J53892K3202Q0156j65631l3738
17129F4979j02802J15726O0927p9169j91460J13774q6123n6629P5953Q8533J17066
$$ plain form
17203 155252 49840 -19137 96579 244598 236804 -12740 -6411 48395 97371 118230 94728
17192 94728 35008 5548 -157506 -440131 -361902 -541197 -612764 -272896 136323 -28384
17182 -28384 -15821 -48346 -134149 19859 10109 -26523 -41032 -258839 -219335 -99673 -201768
17171 -201768 -348588 -248688 -364315 -170411 -84171 184169 280692 84731 -118269 75932
17161 75932 72439 -906 135224 192320 48520 -61676 20985 161935 22147 -70967 -145541
17150 -145541 -106605 81551 55348 15180 63002 156217 163243 -76409 -219728 -253154 -207211
17139 -207211 -34765 -262692 -369576 -190253 7098 160990 184192 264348 98717 64979
17129 64979 -37823 77903 138830 59661 -131799 -18025 -104148 -160777 -84824 3709 120775
17118A20775j14147P5332n4957k1887p4166O7632J99489K91615j06286k42789
17108A40611p5133j29649j57973J49037J82405J9523L1493j35522J4883m4808
17098e133j23302p5921O2228L46846Q9503k11284N5440M4352o0552n8176j78400
17087a14399j81725P3373K71389j39764q2549J23490j8624O7013J85981j19636
17077F4549k40676k10472Q1689J58185J94803R1709K21498j3013k16763R1827
17067B23336o7472j0430j85970K410K39605n7363o3246O2247Q2191p5218r9943
17056E0147j90822j39433J04608K33016O6483m5487o4925j30090J45194L9306
17046F7997j33346n7935m0744J60758Q6201J28100p3808M3011J1603j31040N6175
$$ plain form
17118 120775 6628 81960 27003 5116 -69050 -1418 198071 489686 383400 140611
17108 140611 65478 -64171 -222144 -73107 109298 128821 160314 24792 39675 -5133
17098 -5133 -128435 -204356 -142128 204718 294221 82937 138377 182729 122177 64001 -114399
17087 -114399 -296124 -222751 48638 -91126 -173675 -50185 -68809 -1796 184185 64549
17077 64549 -176127 -386599 -304910 -146725 48078 139787 361285 348272 131509 223336
17067 223336 155864 145434 -40536 -38126 201479 144116 80870 143117 225308 150090 50147
17056 50147 -140675 -280108 -175500 57516 123999 78512 13587 -116503 28691 67997
17046 67997 -65349 -123284 -164028 -3270 82931 211031 137223 180234 191837 60797 116972
17035A16972N1117J28438r8255p3086j47002K3141r3180j08606L8233J9120L04520
17024A61412j05641l0800J80949o7169Q0251j2601j11350j35619q3587o8378k3511
17013b16044p8147M1831R5014o1072j20278K10374J32736p8396p2438m4631j51573
17002c42624r4924K70331J77078L9893J44881M0642K48641J20042n1963l15979
16992B36018l1832J42112k54829j79804N7871J75963j9470r7081J12204j7381
16982A23771k5566j49604J40263P3514j02873K31279J04105R9190k04883o7817
16972B21379l4198j71384j08576j29599J81027J96882R7582j09549K0207q4855
16962G8916k8080Q8656j10552Q4981k0870o3317j22777J28665j85173P2768J82183
$$ plain form
17035 116972 168089 296527 198272 125186 -21816 1325 -91855 -200461 -162228 -143108 161412
17024 161412 55771 24971 205920 138751 219002 206401 95051 -40568 -124155 -192533 -216044
17013 -216044 -294191 -252360 -157346 -218418 -338696 -128322 4414 -73982 -146420 -191051 -342624
17002 -342624 -437548 -167217 9861 49754 194635 235277 483918 603960 551997 236018
16992 236018 204186 346298 91469 -88335 -30464 145499 126029 28948 141152 123771
16982 123771 98205 -51399 88864 162378 59505 290784 394889 494079 289196 221379
16972 221379 187181 15797 -92779 -222378 -41351 155531 253113 143564 163771 78916
16962 78916 50836 139492 28940 113921 93051 29734 -93043 35622 -149551 -76783 105400
16951A05400r1297j62681N6751K2224M0871m6648J178K30833j36685n5017o2933
16940i8004n5054J89372J24050l7144j44236J26987M9836P2496j99722k2513k0135
16929a4067r5663j79165J4429J87722P4650m7310J76079O9520j81056j88216j61581
16918c44658K75611K14673o4213m090J64301r4391l6498N4983q823q1548l5222
16907D0125J38220J43590j02849j91683n3436k9730l6824P9581P3555L4836k5151
16896G0234L1292O9904K02715j93102J4719Q713o6474j16116p2927J42450K74939
16885C66347K88455R1012l38358q2832J79518P1295j36981k94380j56637L9649
16875B7088O1349j92533J27884K01507J8446j27265k117J50958k55378R555J0874
$$ plain form
16951 105400 14103 -148578 -91827 -69603 -28732 -75380 -74202 156631 19946 -35071 -98004
16940 -98004 -153058 36314 160364 123220 -21016 105971 155807 228303 28581 6068 -14067
16929 -14067 -109730 -288895 -274466 -86744 -12094 -59404 116675 186195 5139 -183077 -344658
16918 -344658 -69047 145626 81413 77323 241624 147233 110735 165718 156895 75347 40125
16907 40125 178345 321935 219086 27403 -26033 -55763 -92587 -13006 60549 95385 70234
16896 70234 101526 171430 374145 181043 195762 204475 138001 21885 -51042 91408 366347
16885 366347 654802 745814 407456 324624 504142 575437 438456 144076 -12561 27088
16875 27088 88437 -104096 23788 225295 243741 116476 114359 265317 9939 19494 30368
16864C0368j10151L19172L8299j04870j96200r3631k02338j47272k2788K81442
16854b07969K86523n6051j55176J21458q1603l8016M8184J56307J62009j22208
16844A13458l35580k4475J09595M9382m5775J18020K51663m3737j72484O8590
16834H8657J25112j0118j90609k2813J33326Q9181L8138J42074j88951l32417
16824a28420p1262O9714K39614j45294q8245J45878K59902N0786r9074j81635
16814E1964N8470p6001o9439J4248M9140R7163J27817L20480p0018j61006P8908
16803D21726J89407l90361R422R1196O3096O4895R2786p5006j22032r0028Q187
16792B63288j39785J05146j01111k08732m7571Q5937K58256J14581J67231o1640
$$ plain form
16864 30368 -79783 239389 277688 172818 -23382 -117013 -319351 -466623 -489411 -207969
16854 -207969 78554 22503 -132673 -11215 -92818 -130834 -82650 73657 235666 113458
16844 113458 -222122 -246597 -137002 -87620 -133395 -15375 236288 192551 20067 88657
16834 88657 213769 203651 13042 -9771 123555 212736 250874 392948 203997 -128420
16824 -128420 -199682 -129968 109646 -35648 -123893 21985 281887 332673 233599 51964
16814 51964 110434 34433 -35006 -20758 28382 125545 253362 573842 503824 342818 421726
16803 421726 611133 220772 230194 321390 384486 449381 542167 467161 345129 255101 263288
16792 263288 123503 228649 127538 -81194 -128765 -42828 215428 330009 497240 435600
16782D35600j25298j36221j03271r2320J26331j41537k08117J5869P8576J85747
16772C5359j09697r7080J25946J07645k44L11713J02603m8767n5622j236k57092
16761A13528k20443j18666K54454K21505J20901p4407k94569O6176R8534j35171
16751C1842k2278N4154M5889p7435k73773K2981M9714K14737j9341j96009j21388
16740b90907K35616K26462n1833j14268m5462O3640Q6960J25736r2951M6816l7327
16729A52482p2635R0635J30891J81739j34210n2842k51120l1656J65947n7870
16719A21361m497j0290m2973J88672K032j03118N1587O9299j26933J69359j9049
16708B95450j1274r5009m5553K7256P9678L8572J58103J26814L672j99395j66519
$$ plain form
16782 435600 310302 174081 70810 -21510 104821 -36716 -244833 -228964 -150388 35359
16772 35359 -74338 -171418 -45472 62173 61929 373642 476245 427478 371856 370620 113528
16761 113528 -106915 -225581 28873 250378 371279 296872 2303 68479 167013 31842
16751 31842 9564 63718 109607 32172 -241601 -218620 -168906 45831 26490 -169519 -290907
16740 -290907 -55291 171171 119338 5070 -40392 23248 110208 235944 142993 189809 152482
16729 152482 79847 170482 301373 483112 348902 296060 44940 13284 179231 121361
16719 121361 116864 106574 63601 252273 254305 151187 202774 272073 145140 314499 295450
16708 295450 284176 189167 143614 170870 250548 289120 447223 574037 577709 378314 211795
16697B11795R4808j15536k15329j58294L9045L29104J72929J0098K05723j12658
16687D61685k11666j4715o6789N3066K73260J48385R502k13471j33036j80047
16677A26174j7479J19500L0049J1076J6764j96227j63339o0682J34879K72960
16667B73675J70316K46636j10274N5478j11604j26600r0879K4130n670R6002j1452
16656D09758o5155j52614j4594J56788K01839N4209j4951k00782P7490O8320k78401
16645B41907P8203m6447J00434K44211N5013j10630k55218n5078J0729K70360
16635E33484R0341j81987q3757K66005k3434k30275j56135J21206P0397J29861
16625E35706p0431L8921M6856J38914o4080l2290o8456J3437J54755j36261j86701
$$ plain form
16697 211795 306603 191067 -24262 -182556 -143511 185593 358522 368620 574343 461685
16687 461685 250019 235304 168515 221581 494841 643226 652728 439257 306221 126174
16677 126174 108695 228195 258244 269320 286084 89857 -73482 -134164 715 273675
16667 273675 443991 690627 580353 635831 524227 397627 306748 330878 325208 421210 409758
16656 409758 344603 191989 177395 334183 536022 590231 575280 374498 451988 520308 241907
16645 241907 320110 273663 374097 618308 673321 562691 307473 252395 263124 533484
16635 533484 623825 441838 358081 624086 600652 370377 214242 335448 405845 535706
16625 535706 465275 504196 551052 689966 625886 593596 525140 538577 693332 557071 370370
16614C70370L3400K39866n2637k18284j20096R580K37978M0153k92425l341k5309
16603B19255j15099k13072m5973J88718J57614J36288J56404p24J89537j1495
16593F61453l8095L5539j32609j40345J76349j43957l8076j31057o3260J22376
16583C08318K92531m0976k06183M7053N1833j79650L6410J40492J492m3126p4478
16572C33716L9233J06611P5111R0352L9092j60161k6368j53242n9785O0429K0053
16561C65041j74616l7592K42234L9064m6936N027P9327j94314K06193K9451r8438
16550D14441j26134r570j25473M5615o3265k27217J21538J96786J48508l30623
16540D4606o2961K70095k8479K69057J31569j60549j03506L8691l1107J02187
$$ plain form
16614 370370 403770 643636 590999 372715 252619 262199 500177 540330 247905 244564 219255
16603 219255 104156 -108916 -154889 33829 191443 327731 484135 483411 672948 661453
16593 661453 623358 658897 526288 385943 562292 418335 380259 249202 185942 308318
16583 308318 600849 559873 353690 400743 452576 272926 309336 449828 451320 408194 333716
16572 333716 372949 479560 554671 645023 684115 523954 497586 344344 284559 344988 365041
16561 365041 190425 152833 395067 434131 387195 392222 471549 277235 483428 512879 414441
16550 414441 288307 278737 153264 198879 135614 -91603 29935 226721 375229 44606
16540 44606 -18355 251740 223261 492318 623887 463338 359832 398523 367416 469603
16530D69603q2945K33662J24417l77468o5590J49204R8179m6903j2015j51570
16520C38574J59646p9222l6518K99582l6695l22779j43422K66730J30686K1588
16510E98170j21067N9222J11722J94023M3487k36897Q8679J11825q6205q4114
16500F78845k38338q543M5784N5434R4325j5546j79159J24732m3700J22372P0771
16489G06977m8453k66642j66576j02705N2093l2910n9410R3101J13234j15K05226
16478D93820L05073K6510k72162k11370L1399J18571J22345k76834q8320P7779
16468C26811J61231j44577J1617K5971O7673J28895n2413q8795o8208j0502n9837
16457B97866J42329K49371k4640l11468p2437O5640N4369j30078J40229P182k01093
$$ plain form
16530 469603 386658 620320 744737 367269 301679 450883 549062 502159 490144 338574
16520 338574 498220 418998 382480 682062 645367 322588 179166 445896 576582 598170
16510 598170 477103 536325 648047 842070 885557 648660 737339 849164 762959 678845
16500 678845 440507 431964 477748 533182 627507 611961 432802 557534 513834 636206 706977
16489 706977 658524 391882 225306 122601 174694 141784 82374 175475 288709 288594 493820
16478 493820 798893 825403 553241 341871 373270 491841 614186 337352 249032 326811
16468 326811 488042 343465 355082 381053 448726 577621 525208 436413 368205 357703 297866
16457 297866 440195 689566 664926 353458 281021 346661 401030 270952 411181 418363 217270
16446B17270j94227K93227K39271J05774J34981k1806j37833j40530J2819j17386
16436C91560j20746K33565L8002j09472r4569j33211n131K33106J88477l0204
16426E91377j17P9666r7756K01317J81301L9586j29123k66906m2034o0997j87061
16415C09253J82026K8168J5589o2620P2912J45073J60026L0445p4402J9643l07793
16404E18320o5701M3148n7044J24996n2076J302P0071M6182j77356j4234J0223
16393D47831J16443N4301Q9986k7238p5120P9452k3996p745N540J73674J10059
16382I43187m039M5942j38783m9166m0994l5560j31502m3657j19526o3119j06404
16371B56379N8976J38436J14452j36426M4155J64189J28087J70003L5680j14263
$$ plain form
16446 217270 23043 316270 555541 661315 796296 774490 636657 496127 508946 391560
16436 391560 270814 504379 542381 432909 338340 205129 199998 433104 621581 591377
16426 591377 591260 670926 573170 774487 955788 995374 866251 599345 557311 496314 309253
16415 309253 491279 519447 535036 472416 545328 690401 850427 880872 806470 826113 518320
16404 518320 452619 495767 438723 563719 511643 512945 583016 629198 451842 437608 447831
16393 447831 564274 618575 708561 681323 606203 685655 661659 653914 659454 833128 943187
16382 943187 939148 985090 846307 797141 756147 720587 589085 545428 425902 362783 256379
16371 256379 315355 453791 568243 431817 475972 640161 768248 938251 973931 859668
16361H59668l4580m336Q822k31889J4079p8823j48683l0178J96578N5746J00439
16350G06843j02716m0091K50054J69738J6914K15613q4363p6744l6985J5690p8022
16339I55931k42398j49236O5888q0247R4393R9751r1979J21881P4612j03760k29088
16328E15748J53557J68496j56654j42603j65115m1671Q0542N8882R5358N6796
16318F23336Q2369O1196o3945J72691j07907k12129l53799Q1320K03726P8521
16308E65379K08882r0228k88652r1533L04858K06317r0068J5741j18942k21336
16298D00418l5580J81051L06447J40530n2693j86998k40215j29913R1989J08741
16288E83777J11091J14488J00868J69200K42098O6759k99818k47669k84211L3144
$$ plain form
16361 859668 825088 820752 829574 597685 611764 532941 384258 354080 550658 606404 706843
16350 706843 604127 564036 814090 983828 1000742 1216355 1131992 1055248 1018263 1033953 955931
16339 955931 713533 564297 630185 549938 644331 744082 652103 773984 848596 744836 515748
16328 515748 669305 837801 681147 538544 373429 331758 412300 471182 566540 623336
16318 623336 705705 766901 702956 875647 767740 555611 201812 283132 486858 565379
16308 565379 774261 684033 395381 303848 608706 815023 724955 740696 621754 400418
16298 400418 364838 545889 852336 992866 940173 753175 512960 383047 475036 583777
16288 583777 694868 809356 910224 1079424 1321522 1388281 1088463 840794 556583 589727
16278E89727j32282k5939N9345O3656j11334j70442j20943O5118M82445j42165
16268E57186k67703J70033J50507J12190L5925q1314O7701j28458j12774K1521
16258E24814P0397r9128J41059J80215N558k01949k68769k52841J39209N31850
16248G70415J77510J4236P0007k2112l51400j33042j73678L4816J67334L2048
16238E86134J33625R9943K00376K1338Q5443j11099k34722o3634r7533K9491L7791
16227F87153k22542j0554J66393K1208p6827J64750J21413O9378j23537j46943
16217F49892M9440N4319k06187k42171O1070L66409O9833J04847J06805j74532
16207H39725q62J10577o4306R9545Q6607j94712k37705r6254n2124J09025O5543
$$ plain form
16278 589727 457445 431506 490851 554507 443173 272731 151788 216906 699351 557186
16268 557186 289483 459516 610023 722213 758138 676824 744525 616067 503293 524814
16258 524814 595211 496083 637142 817357 822915 620966 352197 99356 238565 770415
16248 770415 947925 962161 1032168 1010056 658656 525614 351936 386752 554086 586134
16238 586134 719759 819702 1020078 1041416 1126859 1015760 781038 717404 619871 649362 687153
16227 687153 464611 454057 620450 641658 564831 729581 850994 920372 796835 649892
16217 649892 699332 753651 547464 305293 366363 732772 802605 907452 1014257 839725
16207 839725 838863 949440 885134 984679 1071286 876574 638869 542615 490491 599516 665059
16196F65059n4410K8639K34434K9085p4299k35981k67037J34409K72669J32437
16186H65005J29604o8910l81095j50122m3534K88498J68588n0625M1882K7561
16176H26852j21172J92864K40169P404j44857k5411m5030j02726o9834O2124J15381
16165I35764m9375j32784j39269J39952J20543J80356N8951k19496r6590P3982
16155H72034K31366N6407j82741j74117J18257L4948k6885J06773k4259j225j08603
16144I01955k9311K5545L9103k15192j96958J64418K06104l4518j28213k293K0846
16133G51486j84262k69914n6545R8147J69239L6901K26497J30226l00j22864R5125
16122H73736q858J97424j03142l57143r6563J78837L22724q2287P8369l10006
$$ plain form
16196 665059 610649 639288 873722 902807 828508 592527 325490 459899 732568 865005
16186 865005 994609 925699 544604 394482 350948 639446 808034 757409 799291 826852
16176 826852 705680 898544 1138713 1146117 1001260 975849 930819 828093 758259 820383 935764
16165 935764 886389 753605 614336 754288 874831 1055187 1114138 894642 798052 872034
16155 872034 1103400 1159807 977066 802949 921206 956154 929269 1036042 1011783 1010558 901955
16144 901955 872644 898189 937292 722100 525142 689560 895664 861146 732933 730640 751486
16133 751486 567224 297310 240765 338912 508151 545052 771549 901775 901475 778611 873736
16122 873736 864878 1062302 959160 602017 505454 684291 1007015 924728 1003097 693091
16112F93091j34411J45795J45744j5297K3799q2821M5135Q1392Q7015q5760j14831
16101G88851q312L31855R526j1279M6868o0505k260P1362j41905o4025J61213
16090A121389j25874j68459q8839J30214p6288J41231J77421j93306K19211J53967
16080A290667r6159K6526k2090k88161j29252J38859M8605q9480m1077J84569
16070A023007J44608J01733N0188k74240O755K25920k2864l36862j51501L1866
16060G98610q6015J4545J63319l3146J4523O5206k3657j59076L3959J20229k5249
16049H83248k6080k11780j58859N5393K02863q4626R4331l1580q1711O3907n7021
16038F48085L9028J18394J35848M7537J5162M8711l57654k53353K8439J72930
$$ plain form
16112 693091 558680 704475 850219 834922 858721 775900 821035 902427 989442 903682 788851
16101 788851 780539 1112394 1121920 1110641 1157509 1097004 1094744 1166106 1024201 960176 1121389
16090 1121389 995515 827056 738217 868431 792143 933374 1110795 917489 1136700 1290667
16080 1290667 1194508 1221034 1198944 910783 781531 920390 968995 879515 838438 1023007
16070 1023007 1167615 1269348 1319536 1045296 1052051 1277971 1255107 918245 766744 798610
16060 798610 712595 727140 890459 857313 871836 937042 913385 754309 788268 908497 883248
16049 883248 857168 645388 486529 541922 744785 660159 754490 722910 641199 705106 648085
16038 648085 687113 805507 941355 988892 1004054 1052765 695111 441758 470197 643127
16028F43127K56467K69983k03851r6702N5331J01447j58100M4614O3802J19483
16018A095601j6210k02448M4735k4978j4074O6467J8656j93787J1959L17976j35295
16007I68602n5301J29844l0858J87578j52515p8198N2048N2286J53741J69046
15997A396273O8128p293j94905k15626j16592K3883O424N0962J04273j58458j47178
15986H09891J91936j55744p0632o2176O089K96861K12953J2279j07251r2382L3358
15975A075182j25693J92617j3065M456k27748k02485n0386J27407m2938K2179
15965G59526J51170K27172j67712k98282o0783K1444J87604K09167J99266J55945
15955A384517n7409k14942j53499L0515j43498J83146L45138r2502k61415j34072
$$ plain form
16028 643127 899594 1169577 965726 869024 924355 1025802 867702 912316 976118 1095601
16018 1095601 1079391 876943 921678 896700 882626 949093 967749 773962 785921 1103897 968602
16007 968602 913301 1043145 1012287 1199865 1047350 969152 1021200 1073486 1227227 1396273
15997 1396273 1464401 1457108 1262203 1046577 929985 953868 960292 1011254 1115527 957069 809891
15986 809891 1001827 846083 775451 713275 719364 1016225 1229178 1241457 1134206 1041824 1075182
15975 1075182 949489 1142106 1129041 1133497 905749 703264 652878 780285 737347 759526
15965 759526 910696 1137868 970156 671874 611091 632535 820139 1029306 1228572 1384517
15955 1384517 1327108 1112166 958667 989182 845684 1028830 1373968 1281466 1020051 885979
15945H85979o4161O1144L2778j4624J42110p8548j16137o7675L9515K14262L7354
15934A071997j45964m18613q548P6169Q4429J10534J10196K36898m7713L35228
15924A404613j13522l03389k5859l9373k66710p0453K97703J85673J85893J3222
15914A267798J44193j6819k3591m7756P6272O0750l56167j88053K0201j21392
15904H15436J46540K34224j92054K1148j5197j4190o5252K31334K65456R7420
15894A524865j9442o3j53105j56428K4614Q2056j45092N0995o8242q57L1838O6538
15882A237677K7411L2930J61343l3184J7525l94532l13827J23019J43511m0273
15872I61600k70569n744K08406k5751p8718K25043P6855R5145J27848J88694O4230
$$ plain form
15945 885979 821818 882962 915740 901116 1043226 964678 848541 780866 820381 1034643 1071997
15934 1071997 926033 507420 498872 575041 659470 770004 880200 1117098 1069385 1404613
15924 1404613 1291091 987702 961843 922470 655760 585307 883010 1068683 1254576 1267798
15914 1267798 1411991 1395172 1371581 1323825 1400097 1460847 1104680 916627 936828 815436
15904 815436 961976 1196200 1004146 1025294 1010097 995907 930655 1161989 1427445 1524865
15894 1524865 1505423 1505360 1352255 1195827 1220441 1302497 1157405 1208400 1140158 1139301 1171139 1237677
15882 1237677 1265088 1298018 1459361 1426177 1443702 1049170 735343 858362 1001873 961600
15872 961600 691031 685287 893693 867942 789224 1014267 1091122 1186267 1314115 1502809 1567039
15861A567039o7147n0519r3479j3409j26985j02925J44819k28129k54447J31756
15851I06574J04664J26885J89555j16179j8087j54768p4806J51014K41743J42740
15841A499335N5865k81227o1676J76451j4266J72610n9032k72457L2229n1813
15831A196019O3811K12885r591L8747P6503o7385j26123J9231q8083m117j22201
15820A189696j28354j07264J28084M20627N9110m58995j4727j33584n0285K72142
15810A176450j76504k00765J06639J28759R07J97936p9536P046K46900j35337
15800A272495j19568j00978Q1827n5080N1778k7079m9406n1268J76208j45066
15790A033863j00124K28776L78484j53521j87571n4360j03283J48451Q5328k33522
$$ plain form
15861 1567039 1499892 1449373 1355894 1342485 1215500 1112575 1257394 1029265 774818 906574
15851 906574 1011238 1138123 1327678 1211499 1193412 1038644 963838 1114852 1356595 1499335
15841 1499335 1555200 1273973 1212297 1388748 1374482 1547092 1488060 1215603 1247832 1196019
15831 1196019 1259830 1472715 1463124 1501871 1578374 1510989 1384866 1404097 1316014 1311897 1189696
15820 1189696 1061342 954078 1082162 1502789 1561899 1102904 1088177 954593 904308 1176450
15810 1176450 999946 799181 905820 1034579 1035486 1233422 1153886 1160932 1407832 1272495
15800 1272495 1152927 1051949 1133776 1078696 1130474 1103395 1053989 1002721 1178929 1033863
15790 1033863 933739 1162515 1540999 1387478 1199907 1145547 1042264 1190715 1276043 1042521
15780A042521N9063k5066Q6335k3178N6234J72471j4367o7933J8076M8076m0904
15769A311328j97558k04480J48983o3152o963J73856J95510j36413P6575J39047
15759A436733j99669k66118J67417n1867j25172K7767P941J36733J20186j68370
15749A085581q6254K00939J89344m3301m9911J66838J83290J5769N0041L7610
15739A749946O2538N4869j68102k13318J08274P428j05594L6981o9499J5510J0059
15728A489092J37788l727L1831m9570l42448o8097Q3070j71706q1779O6888K52877
15717A344219J52821Q1629k44380k99616J84024J42823j25021o2682K68005K04133
15707A645955N7689l02904k5797Q6716j57040k09386J47255K02017J35516J23159
$$ plain form
15780 1042521 1101584 1076518 1162853 1139675 1195909 1368380 1354013 1286080 1304156 1352232 1311328
15769 1311328 1113770 909290 1058273 995121 988158 1162014 1357524 1221111 1297686 1436733
15759 1436733 1237064 970946 1138363 1086496 961324 989091 997032 1133765 1253951 1085581
15749 1085581 999327 1200266 1389610 1346309 1296398 1463236 1646526 1662295 1712336 1749946
15739 1749946 1812484 1867353 1699251 1485933 1594207 1601635 1496041 1533022 1463523 1479033 1489092
15728 1489092 1626880 1623153 1654984 1605414 1262966 1194869 1277939 1106233 1024454 1091342 1344219
15717 1344219 1497040 1578669 1334289 1034673 1218697 1361520 1236499 1173817 1441822 1645955
15707 1645955 1703644 1400740 1374943 1461659 1304619 1095233 1242488 1444505 1580021 1703180
15697A703180J1652J10272j70812j03151j65439l6221J87320M3873O4804K6793
15687A672271k074j22289j80295r8413l9057J13870J22220L1525j17722r6619
15677A283417j0727J06343j64341r8121L8399J52898J44473p4545R1239J83158
15667A652193j3410L2408K977j0998O3623O3321J28537J6225k9982j42799J50943
15656A913038m2029k17504K0894k7791j48905l47612j92763K05561L96978J17463
15646A677330j45828k52942P2616J74592N030n5285M3838J29084k18273l41174
15636A088988j2146J84011J15194k47136l39382K48170M84240J13954j99269O3030
15626A499654P4063j46440J65455n2984j52413j20252J85712M954J65764K98448
$$ plain form
15697 1703180 1714832 1825104 1654292 1551141 1385702 1349481 1536801 1580674 1645478 1672271
15687 1672271 1670197 1547908 1367613 1269200 1230143 1344013 1466233 1497758 1380036 1283417
15677 1283417 1272690 1379033 1214692 1116571 1154970 1307868 1452341 1377796 1469035 1652193
15667 1652193 1638783 1671191 1674168 1663170 1726793 1790114 1918651 1934876 1904894 1762095 1913038
15656 1913038 1871009 1653505 1674399 1646608 1497703 1150091 957328 1162889 1559867 1677330
15646 1677330 1531502 1278560 1351176 1525768 1530798 1475513 1519351 1648435 1430162 1088988
15636 1088988 1076842 1260853 1376047 1128911 789529 1037699 1521939 1635893 1436624 1499654
15626 1499654 1573717 1427277 1592732 1539748 1387335 1267083 1452795 1457749 1623513 1921961
15616A921961L061n6213j33504j31231o976q5018r067J44872P7041r3199J79301
15605A811028R8853k2790j41379r4925M8196q4399j51777P3285j10446N956J15843
15594A547445K9663J70893K2117j39137O7171M4108n7829j21993j28488k35155
15584A198795J70249J82761P225j96650J97541R2866k34095j00195M3179K8487
15574A390163J59836j81562m9180r7621J55075J58947J27410m6259K6116J58658
15564A801583L49530p7201k46024k64079n18341j9848K29928J96215L45296M4116
15554A841175R4276j74261l32754J02226M9371J62202q0995J3347J08115Q5272
15544A867974r5413M6055l9885J533Q4123K31784j43778k85067p29j7233j07704
$$ plain form
15616 1921961 1925022 1868809 1735305 1604074 1597098 1512080 1503013 1647885 1724926 1631727 1811028
15605 1811028 1909881 1887091 1745712 1650787 1698983 1614584 1462807 1536092 1425646 1431602 1547445
15594 1547445 1577108 1748001 1770118 1630981 1698152 1742260 1684431 1562438 1433950 1198795
15584 1198795 1369044 1551805 1559030 1362380 1559921 1652787 1418692 1318497 1361676 1390163
15574 1390163 1549999 1368437 1319257 1221636 1376711 1535658 1663068 1616809 1642925 1801583
15564 1801583 2151113 2073912 1827888 1563809 1045468 1025620 1255548 1451763 1797059 1841175
15554 1841175 1935451 1761190 1428436 1530662 1580033 1742235 1661240 1674587 1782702 1867974
15544 1867974 1772561 1818616 1778731 1780264 1864387 2096171 1952393 1667326 1666597 1649364 1541660
15533A541660L38458J61368K4356N6015r3403l39622j44240J60574R6535O5512
15523A867213L3370Q1430r025k9755R5966n7753k25391M7835J43755N4882m6688
15512A955839o2903k21834L7333Q2858J07406l2199n991J61575j79086k97043
15502A545955j02201L6935J61975J06705J82587m9771r3635M3854J29338r483
15492A952259L4936l359j99691j71009K20009J09087n9169n1096o5791r558J44808
15481A901426o133k96749J10592J55671j20168L7895q5962K73668K23490O7065
15471B260795l09556j49086j19155L48622j04467k57617L3407J69188J22117k14724
15461A779524k07748j09067p9895K12538K5276J29947J19111j45073j55345o1114
$$ plain form
15533 1541660 1880118 2041486 2065842 2121857 2028454 1688832 1544592 1705166 1801701 1867213
15523 1867213 1900583 1982013 1972988 1943233 2039199 1981446 1756055 1803890 1947645 2002527 1955839
15512 1955839 1892936 1671102 1708435 1791293 1898699 1866500 1860509 2022084 1842998 1545955
15502 1545955 1443754 1480689 1642664 1749369 1931956 1882185 1788550 1832404 1961742 1952259
15492 1952259 1987195 1983836 1784145 1613136 1833145 1942232 1883063 1831967 1766176 1756618 1901426
15481 1901426 1895293 1598544 1709136 1864807 1744639 1782534 1696572 1970240 2193730 2260795
15471 2260795 1951239 1802153 1682998 2031620 1927153 1669536 1702943 1872131 1994248 1779524
15461 1779524 1571776 1462709 1382814 1595352 1620628 1750575 1869686 1724613 1569268 1508154
15451A508154K24043K43414j31492P1599J70940K06778l3684n5885q7445j25010
15441A991412N0013j43996l76918O0021K39715q3085r6258K41795j42134L1114
15431A771679J67541m4895l2448K94122K0705k4760J12283J01645l7627k80530
15421B047715j90160J04793J03553j2015j08366o7825L16432J16837l43862p7320
15411A889782J15552R0572K26687J2546j26971j77094L32569O4639j98551M9858
15401B279589r5081j66641q8903N4264J95292J76621L7266P098j96182k58757
15391A944566j1243q4745l51338J43132L90672K03871j15683j0890J24504R2753
15381B325599j80553q0904J50221P2753j07489j78618j55412K6560j4933k48677
$$ plain form
15451 1508154 1732197 1975611 1844119 1915718 2086658 2293436 2259752 2203867 2116422 1991412
15441 1991412 2041425 1897429 1520511 1580532 1820247 1737162 1640904 1882699 1740565 1771679
15431 1771679 1939220 1894325 1861877 2155999 2176704 2151944 2264227 2365872 2328245 2047715
15421 2047715 1857555 1962348 2065901 2053886 1945520 1877695 2194127 2310964 1967102 1889782
15411 1889782 2005334 2095906 2322593 2335139 2208168 2031074 2363643 2428282 2229731 2279589
15401 2279589 2184508 2017867 1928964 1983228 2178520 2355141 2392407 2399505 2203323 1944566
15391 1944566 1933323 1848578 1497240 1640372 2031044 2234915 2119232 2108342 2232846 2325599
15381 2325599 2145046 2064142 2214363 2287116 2179627 2001009 1845597 1872157 1857224 1608547
15371A608547Q0619J34263M1536M0365k51885L8116K92711K44729j7034j74889
15361B037078K94976J06455j9219j18113L7380l2042o7450j39268M9520K5742
15351B175059J49230O6975l9264p1522j50200k6188O4635P6412N2550q6346k12385
15340A998956l2319r4659n0718k47653J46264K42259K47243K77656j33565l22379
15330B031085j08155R7473J81156J34921J7387j5807J0699j55225k43233L4326
15320A984627J60441l6449q2599M13027J85348O5991K30l96736n5576R0512J03335
15309B432151n5545j30630j15995o7514N8567J63839n2091j22680r7193l8372
15299A974537Q8093J2011j33409J19504j04304O2246K33316J01319J0058l8524
$$ plain form
15371 1608547 1689166 1823429 1864965 1905330 1653445 1691561 1984272 2229001 2211967 2037078
15361 2037078 2332054 2438509 2419290 2301177 2338557 2306515 2239065 2099797 2149317 2175059
15351 2175059 2324289 2391264 2352000 2280478 2130278 2104090 2168725 2245137 2297687 2211341 1998956
15340 1998956 1966637 1871978 1821260 1573607 1719871 1962130 2209373 2487029 2353464 2031085
15330 2031085 1922930 2020403 2201559 2336480 2353867 2338060 2348759 2193534 1950301 1984627
15320 1984627 2145068 2108619 2026020 2439047 2624395 2690386 2690616 2293880 2238304 2328816 2432151
15309 2432151 2376606 2245976 2129981 2062467 2121034 2284873 2232782 2110102 2012909 1974537
15299 1974537 2062630 2074641 1941232 2060736 1956432 2018678 2251994 2353313 2363371 2324847
15289B324847P9466j31870O0047n0907k47907K1072J3404J32224P9312J1002J58679
15278B449369j19580R600K02091O7218J22089K1977k51064j80747j29521L9496
15268B230928J0932j54094K76763r4606j76934M2152M2549R6417K9852J10916
15258B414875j23769Q0579q8773m0850o3288J67937K00069M3673m07995k53293
15248A929165J03274J28987M7698J43544N0788M4073N51M8380K666P9236l12889
15237B265473j2703K07934l1155j43781K6962j50532M1663J67886j19721k79994
15227A972032J67047N0298L4490L2822j59268J7767P2985K20632M1573N8887k9761
15216B479504j08862J19875j16035q9327j96485M9874J15362p2682J4593K56989
$$ plain form
15289 2324847 2404313 2272443 2332490 2281583 2033676 2054748 2068152 2200376 2279688 2290690 2449369
15278 2449369 2329789 2339389 2541480 2608698 2730787 2752764 2501700 2320953 2191432 2230928
15268 2230928 2241860 2087766 2364529 2269923 2092989 2135141 2177690 2274107 2303959 2414875
15258 2414875 2291106 2371685 2282912 2242062 2178774 2346711 2546780 2590453 2182458 1929165
15248 1929165 2032439 2161426 2209124 2352668 2403456 2447529 2448080 2496460 2499126 2578362 2265473
15237 2265473 2252770 2460704 2429549 2285768 2312730 2162198 2203861 2371747 2252026 1972032
15227 1972032 2139079 2189377 2223867 2256689 2097421 2115188 2188173 2408805 2450378 2509265 2479504
15216 2479504 2370642 2490517 2374482 2285155 2088670 2138544 2253906 2181224 2195817 2452806
15206B452806L41809o6830m39228m6980K90846J26803L6409k98895k21001J38287
15196B314026J80064J87385j26418o3314l9057r0160j5397J17680p6344l07453
15186B081012N4353K00821K86493q9807q2568J54990j17627j46107r3637k1814
15176B226109L9830N8870J94018M1357j26578j65101R2614L58222K07380j77470
15166B749251k98460l25213J71699J81285j55060J43270J46408j67805m595P0053
15156B510833K7316l9709j6290m976J9605N1324J29645k9630m1634m8502m1871
15145B516111O6834J36066j43232j05269K55745J85426k50517N1033P0813M0399
15135B823409J27851j29571q9925k2368k8110O7636K06319k1967j02901j63293
$$ plain form
15206 2452806 2794615 2727785 2288557 2241577 2532423 2659226 2695635 2396740 2175739 2314026
15196 2314026 2494090 2681475 2555057 2491743 2452686 2362526 2347129 2464809 2388465 2081012
15186 2081012 2135365 2336186 2622679 2532872 2450304 2605294 2487667 2341560 2247923 2226109
15176 2226109 2265939 2324809 2518827 2560184 2433606 2268505 2361119 2719341 2926721 2749251
15166 2749251 2450791 2125578 2297277 2478562 2323502 2466772 2613180 2445375 2440780 2510833
15156 2510833 2538149 2498440 2482150 2477174 2496779 2548103 2677748 2648118 2606484 2557982 2516111
15145 2516111 2582945 2719011 2575779 2470510 2726255 2911681 2661164 2712197 2783010 2823409
15135 2823409 2951260 2821689 2731764 2709396 2681286 2748922 2955241 2933274 2830373 2667080
15125B667080P180j05308M0474O5938J86983O0307j03380m7004j15877p8572j25801
15114B452020j49521O9314k6652j16158J56405L57186J7997m1284J13206Q5357
15104B917870J49990j57800j96899j48710P1226J6639n9297J51043J04371Q1366
15094B929799O6011k45888k98975J08659J91635k3197R5057K29639j69711l984
15084B879045q3404l1300j1967Q3463K91045q6094j63945o2211J10059P2334k3695
15073B973330o5251J41498l2509j00277J19629j11413m2299J83977j57444q6577
15063B822664M4674N6889j64591j01534K1497K75885K55142J40718j04559p0998
15053C175787j05463k25855k81554L2434J67779m247p3031n4316j46194j79148
$$ plain form
15125 2667080 2674260 2568952 2609426 2675364 2862347 2922654 2819274 2772270 2656393 2577821 2452020
15114 2452020 2302499 2371813 2345161 2229003 2385408 2742594 2760591 2719307 2832513 2917870
15104 2917870 3067860 2910060 2713161 2564451 2635677 2652316 2593019 2744062 2848433 2929799
15094 2929799 2995810 2749922 2450947 2559606 2751241 2728044 2823101 3052740 2883029 2879045
15084 2879045 2795641 2764341 2752374 2835837 3126882 3040788 2876843 2814632 2924691 2997025 2973330
15073 2973330 2908079 3049577 3017068 2916791 3036420 2925007 2882708 3066685 2909241 2822664
15063 2822664 2867338 2924227 2759636 2658102 2679599 2955484 3210626 3351344 3246785 3175787
15053 3175787 3070324 2844469 2562915 2595349 2763128 2758881 2685850 2631534 2485340 2306192
15043B306192J08539J15571Q3737K1220M2621r1743j50825m1688J43789J00308
15033B637721K50098J95075p1310j16958m1816q3588j30394n9324j970J3350m9910
15022B540974j43246j26094J41263J70292R0551P6979J12733J91016Q8481o0903
15012C082046j54920O3047n1035P1666K9597K2794n313j46518l1582j30374K3783
15001B773191Q3692k05281j55808J166K42989K31723J19070K4138r9751j83298
14991B831831O9232J82693J36986j45153j53126N7607o678q6946k524p5833j52991
14980B655098m0074J13752L11122R3242q5696m5481N0516J29376J43599j13478
14970C211976j78743J0811K29995J44454K7461j64183j90590j60091k14080K59528
$$ plain form
15043 2306192 2414731 2530302 2614039 2635259 2677880 2586137 2435312 2393624 2537413 2637721
15033 2637721 2887819 3082894 3011584 2894626 2852810 2769222 2638828 2579504 2577534 2590884 2540974
15022 2540974 2397728 2271634 2412897 2583189 2673740 2750719 2863452 3054468 3142949 3082046
15012 3082046 2927126 2990173 2939138 3010804 3040401 3063195 3057882 2911364 2879782 2749408 2773191
15001 2773191 2856883 2651602 2495794 2496960 2739949 2971672 3090742 3114880 3015129 2831831
14991 2831831 2901063 3083756 3220742 3075589 2922463 2980070 2973392 2886446 2883922 2808089 2655098
14980 2655098 2615024 2728776 3039898 3133140 3047444 3001963 3052479 3181855 3325454 3211976
14970 3211976 3033233 3044044 3274039 3418493 3445954 3281771 3091181 2931090 2717010 2976538
14960B976538K45404k2182j21187r1294j28095p9082L5877j84894J34574K96240
14950C061899m5314j53534K26068L81078M7909l2861j22427r125O5926l2315K8396
14939C415700K78201m1157j09862K7723k18697K8552K6053m6358n8612j40812
14929C160731n4199j35985j0482K13108K54453p0952m6084N84j02395l9616K6672
14918C195835j94774K8783J04804m6779p5007J36366J64553k32017j905k15007
14908B864852o5912K19657j68554r9321o5507P8919L61261J72947j29627k17787
14898B950928n6972q1229J19123j8376r1728O9653K88768J76514m2102j06485
14888C208094k69989j83970M05153K25652o6167j92153J2412j56714K9975J01206
$$ plain form
14960 2976538 3221942 3199760 3078573 2987279 2859184 2780102 2815979 2631085 2765659 3061899
14950 3061899 3016585 2863051 3089119 3470197 3518106 3485245 3362818 3353693 3419619 3387304 3415700
14939 3415700 3693901 3652744 3542882 3570605 3351908 3380460 3406513 3360155 3301543 3160731
14929 3160731 3106532 2970547 2960065 3173173 3427626 3356674 3310590 3311174 3208779 3169163 3195835
14918 3195835 3001061 3029844 3134648 3087869 3012862 3149228 3313781 3081764 3079859 2864852
14908 2864852 2798940 3018597 2850043 2750722 2685215 2764134 3125395 3298342 3168715 2950928
14898 2950928 2893956 2812727 2931850 2913474 2821746 2891399 3180167 3356681 3314579 3208094
14888 3208094 2938105 2754135 3159288 3384940 3318773 3126620 3139032 2982318 3012293 3113499
14878C113499P9056J74497o2049j15139K09681J7850j10998J5315J16508m6518
14868C391702l6785J13997O3979K773N5848m4765l40447n8826J17908J7823j93738
14857C089469p9022J71522M0140J5384m9508J78297J91965n2611j82418M3872
14847C367090j4142k15053j41578k0032L6139J39680J06121k05437n3313K39931
14837C239406j8419q725K20403M0880l6139K6714k71430j66877N538Q7859L15548
14826C434758J8396j14246k02130k05497J14390J13566Q3319j78334j4567j56977
14816B892678R0670J68328l6826R5255J04806K75092p776J89152J30661k39226
14806C662814L5595k3720j75282m07028K9565L24027J67039J60901n3043j5762
$$ plain form
14878 3113499 3192555 3367052 3305003 3189864 3399545 3417395 3306397 3321712 3438220 3391702
14868 3391702 3354917 3468914 3532893 3535666 3591514 3546749 3206302 3147476 3265384 3283207 3089469
14857 3089469 3010447 3181969 3222109 3237493 3187985 3366282 3558247 3505636 3323218 3367090
14847 3367090 3352948 3137895 2996317 2976285 3012424 3152104 3258225 3052788 2999475 3239406
14837 3239406 3220987 3212262 3432665 3473545 3437406 3464120 3192690 3025813 3031351 3119210 3434758
14826 3434758 3453154 3338908 3136778 2931281 3045671 3159237 3242556 3064222 3049655 2892678
14816 2892678 2983348 3151676 3114850 3210105 3314911 3590003 3582227 3771379 3902040 3662814
14806 3662814 3698409 3674689 3499407 3092379 3121944 3445971 3613010 3773911 3720868 3705106
14796C705106l56138k39912O8593K89476J8026k41315j04902K79374J78541O4519
14786C661368o1257k18267j93069M1821Q1076K6778j88373J54697q7920M9058
14776C265912J60383K29580K37479j31078n5371K904M7706j61209P3323M4114
14766C713743j53407r7662j7811K5239J87568K99793j19364l46543k7074o4766
14756C399716J63478j04345j33321k4434O4732m9825q2034p535O2329J10006J36106
14745C534873J17618n1981j33091N6662K3107J47992K44498L8036O5577j84195
14735C859096n06894l25579p5291J26313J14621l9277J91969m454J85512J57301
14725C683317j92281k57386J9759k4636R1345K99308j85413j24558J50224J30111
$$ plain form
14796 3705106 3348968 3109056 3177649 3467125 3485151 3243836 3138934 3418308 3596849 3661368
14786 3661368 3600111 3381844 3188775 3230596 3311672 3338450 3150077 3304774 3216854 3265912
14776 3265912 3426295 3655875 3893354 3762276 3706905 3709809 3757515 3596306 3669629 3713743
14766 3713743 3560336 3462674 3444863 3470102 3657670 3957463 3838099 3491556 3464482 3399716
14756 3399716 3563194 3458849 3325528 3301094 3365826 3316001 3233967 3226432 3288761 3398767 3534873
14745 3534873 3652491 3600510 3467419 3524081 3547188 3695180 3939678 3977714 4043291 3859096
14735 3859096 3352202 3026623 2951332 3077645 3192266 3152989 3344958 3340504 3526016 3683317
14725 3683317 3491036 3233650 3253409 3228773 3320118 3619426 3434013 3309455 3459679 3589790
14715C589790j01584j33500Q855K48730J94850k14462j64223K05069j36960k16772
14705C279793K29803Q6923k06625j28547n5466J82634K60931j6598k35830J1034
14695C408052L9318q6657R0515Q0827j12626Q1225M9469j44012M5979J20500L5834
14684C608424j15280K1375K42387l678j73376N4703j1826J00189l4853J19159
14674C807224j23216J28037m1306k6704K582j07331l25410j63383k9271q7467
14664C033755L22812L07103R2796o3535j0532m164j80727M3979M3734J46289J55581
14653C887091O9799k13865j04432K12348k4786o2321j94200K00079L2080l1149
14643C770644Q911J0361N9220o541M9848l25594l87951K02198J79735M68785Q2718
$$ plain form
14715 3589790 3488206 3354706 3363561 3612291 3807141 3592679 3428456 3633525 3496565 3279793
14705 3279793 3509596 3596519 3389894 3261347 3205881 3388515 3649446 3632848 3397018 3408052
14695 3408052 3447370 3360713 3451228 3532055 3419429 3500654 3550123 3406111 3452090 3572590 3608424
14684 3608424 3493144 3514519 3756906 3753228 3579852 3634555 3622729 3722918 3688065 3807224
14674 3807224 3684008 3812045 3770739 3744035 3746617 3639286 3313876 3150493 3121222 3033755
14664 3033755 3356567 3663670 3756466 3692931 3682399 3678235 3497508 3541487 3585221 3731510 3887091
14653 3887091 3956890 3743025 3638593 3850941 3826155 3763834 3569634 3769713 3801793 3770644
14643 3770644 3779555 3789916 3849136 3842595 3892443 3566849 3178898 3381096 3560831 4029616 4112334
14632D112334p9352j84694j69651M3365k9626L7167M0270J77419J63301L1178
14622D141711j23449o3128p2145J79151k5909k09775k09582K17134J74293l65236
14612C643065j36188p8442J36507J59380M6178R8777K30023j9088J39105R1521
14602D310838j72220k31206N3196K9023k03724k12015L04666J70886K70133J32996
14592D452573k15288k73632j5621j3972p9543p5692O2518O8990o4000n9807K22792
14581D009318J86220j44618k6280j54356m59116O3582L79258M7073K9109O051
14571C936241j55116j35232J45383j17497R3825L38687K8406K4324J10375j5897
14561D253499k62182k00301r9256j0874R2425j62487l1625K19042J62787n788
$$ plain form
14632 4112334 4032982 3848288 3678637 3722002 3692376 3729543 3769813 3947232 4110533 4141711
14622 4141711 4018262 3955134 3882989 4062140 4036231 3826456 3616874 3834008 4008301 3643065
14612 3643065 3506877 3428435 3564942 3724322 3770500 3869277 4099300 4080212 4219317 4310838
14602 4310838 4138618 3907412 3960608 3989631 3785907 3573892 3878558 4049444 4319577 4452573
14592 4452573 4237285 3963653 3948032 3934060 3854517 3778825 3841343 3910333 3846333 3786526 4009318
14581 4009318 4195538 4050920 4024640 3870284 3411168 3474750 3854008 3901081 3930190 3936241
14571 3936241 3781125 3645893 3791276 3673779 3767604 4106291 4134697 4159021 4269396 4253499
14561 4253499 3991317 3791016 3691760 3680886 3773311 3610824 3579199 3798241 3961028 3955240
14551C955240m7201Q6336Q7300k27342r6385j6942J52376j3521m2714L957o0246
14540C780858O2656J36708K03214O040o3944J12455J8159k88975l4329J75618
14530D108460L16264o1641l44543k05153r3701J940J24356r3074n8353J79307
14520C873862K15824k082m1845l3743r0655o708J13524k9383K18195M26489j37897
14509D505581j96607l9451N101m0234l3314o5751j4772L5895j4624j63308l2907
14498C945609K09318p761j34159N1325K59852N9399j33581k13582J43785n2185
14488D128020r5376j48779p5591J06091j11631j45656R8950J45024p2365j8426
14478C810261L11176J66419J33571N9710J00837k19239l25386j77808P974Q2008
$$ plain form
14551 3955240 3908039 3994375 4081675 3854333 3757948 3741006 3893382 3879861 3837147 3841104 3780858
14540 3780858 3843514 3980222 4183436 4189476 4125532 4237987 4256146 3967171 3932842 4108460
14530 4108460 4424724 4363083 4018540 3813387 3719686 3721626 3845982 3752908 3694555 3873862
14520 3873862 4089686 4087604 4045759 4012016 3921361 3914653 4028177 3998794 4216989 4643478 4505581
14509 4505581 4308974 4269523 4274624 4234390 4201076 4135325 4120553 4156448 4141824 3978516 3945609
14498 3945609 4154927 4147166 4013007 4064332 4324184 4383583 4250002 4036420 4180205 4128020
14488 4128020 4032644 3883865 3808274 3914365 3802734 3657078 3756028 3901052 3828687 3810261
14478 3810261 4121437 4287856 4421427 4481137 4581974 4362735 4037349 3859541 3867515 3949523
14468C949523Q5451j24178m7006m3332J77842K91704J76007J7164N2858k70037
14458D265996n3846l1147L3886J45812r9867k48226j88837k5949O2679o4844p8806
14447C716851K25220J87252N8643J40370K7311j38192J36572P6384o6242L3406
14437D397575J14226j85117k30722l70212l08051K40224L25185m1703m4994K46488
14427D142899K78999k00111j25385J69513j48006J9166N4333K43516j54138l4898
14417D245888j10860k13062J2747k806q240k37j15076J68845J49391K75325J46197
14406D548112p7227J46523j96776k2313J15215k28882N4995J32643r4530k33173
14396D144587k02851M033K20162J63256K18526l5675p6394r69k79009p0104L24312
$$ plain form
14468 3949523 4034974 3910796 3863790 3820458 3998300 4290004 4466011 4483175 4536033 4265996
14458 4265996 4212150 4181003 4214889 4360701 4260834 4012608 3823771 3797822 3860501 3795657 3716851
14447 3716851 3942071 4129323 4187966 4328336 4355647 4217455 4354027 4430411 4364169 4397575
14437 4397575 4511801 4326684 4095962 3725750 3417699 3657923 3983108 3941405 3896411 4142899
14427 4142899 4421898 4221787 4096402 4265915 4117909 4137075 4191408 4434924 4280786 4245888
14417 4245888 4135028 3921966 3934713 3931907 3923667 3923430 3808354 3977199 4126590 4401915 4548112
14406 4548112 4470885 4617408 4420632 4398319 4513534 4284652 4339647 4472290 4377760 4144587
14396 4144587 3941736 3945769 4165931 4329187 4547713 4512038 4435644 4434675 4155666 4085562 4409874
14385D409874M9500k34691j69438j01572M342J30076M9319o7660q5847K25980
14375D209883K98786K11058k09692j35821J41363o5565j04490p9785K8914j56605
14365D138046J6587J64369r424n7784J98160J48998l8718J16907P8175J4154j37330
14354D632140L7883N8755r5042j1538j69669M0478j01059L8172R578j24498K27441
14343D542641K7253O2378J56144J1879l79266k06997J31681K37311R6450k7273
14333D652201j23902j43702n2829J20481K27711r4671l0205M1455k13008l4271
14323D349260J20120l63713K0342K97056L5437k03598M8277K7846m108p6979j37450
14312D112490r1155n8814L33192J31874j89412k37363m8811k4232L5246J0707
$$ plain form
14385 4409874 4459374 4224683 4055245 3953673 3958015 4088091 4137410 4069750 3983903 4209883
14375 4209883 4508669 4719727 4510035 4374214 4515577 4450012 4345522 4265737 4294651 4138046
14365 4138046 4154633 4319002 4309578 4251794 4449954 4598952 4560234 4677141 4755316 4769470 4632140
14354 4632140 4670023 4728778 4633736 4622198 4452529 4493007 4391948 4430120 4439698 4315200 4542641
14343 4542641 4569894 4632272 4788416 4800295 4421029 4214032 4345713 4583024 4679474 4652201
14333 4652201 4528299 4384597 4331768 4452249 4679960 4585289 4555084 4596539 4383531 4349260
14323 4349260 4469380 4105667 4126009 4423065 4458502 4254904 4303181 4331027 4326919 4249940 4112490
14312 4112490 4021335 3962521 4295713 4427587 4238175 4000812 3952001 3927769 3963015 3973722
14302C973722K36331K17640Q927K44293J85885j92027n6775j02308l90754l8627
14292D086307R0114M15555K38317l09081j89077K1971N9465p7550k0087J76187
14282D492121r283J22092N6854k71153j08564N952j33585R4006o6093l6947p3439
14271D071961j75274J68766K44859k4874n6692J60322R0353K3954j15428J101
14261D389048J62897N9789j6936o4542O6432K2176o4040M670l3776l56664j63367
14250D005687n3109J1870K14684J49060N7595J45056K06806R7115j7583j27562
14240D689619J16873k19501Q6336R7921J31950j57674k23460M2295Q6315R385
14230D660059j04096p745m8976P2033K8984M4735O2687K9061p2896M8392K414
$$ plain form
14302 3973722 4210053 4427693 4436620 4680913 4866798 4674771 4617996 4515688 4124934 4086307
14292 4086307 4176421 4591976 4830293 4521212 4332135 4354106 4413571 4336021 4315934 4492121
14282 4492121 4482838 4604930 4661784 4390631 4282067 4288019 4154434 4248440 4182347 4145400 4071961
14271 4071961 3896687 4065453 4310312 4285438 4228746 4389068 4479421 4503375 4387947 4389048
14261 4389048 4551945 4611734 4594798 4530256 4596688 4618864 4554824 4559494 4525718 4169054 4005687
14250 4005687 3952578 3964448 4179132 4328192 4385787 4530843 4737649 4834764 4817181 4689619
14240 4689619 4806492 4586991 4673327 4771248 4903198 4745524 4522064 4564359 4650674 4660059
14230 4660059 4555963 4548218 4499242 4571275 4600259 4644994 4707681 4736742 4663846 4712238 4714652
14219D714652j78780j59118L2091J96479P1433k79676k37395M2022J90800J26517
14209D519025N7140r9869j65376j61904l6848J69513J80902L43378K2206Q5753
14199D913920J7351n4203n5419n0730j16200o2824q1844j36451J23593p2831M5139
14188D469501j13633j45259J45708L9796Q0361k86230n7976J979P4461k5756j29076
14177D053876K74737J36921k8233k6776O9240K30095J2982r2570p2250K3813r9263
14166D482572l8503j17276q2545J6048P7835o1476J99118Q9408J87368j2168r3873
14155D646508j42326J37956N9937l60880j21555J65448R5101o162R2965K8306
14145D595298p4690j6993p601J69779O7983k58406j74129J58489J91304O787j66154
$$ plain form
14219 4714652 4535872 4376754 4408845 4605324 4676757 4397081 4159686 4201708 4392508 4519025
14209 4519025 4576165 4476296 4310920 4149016 4112168 4281681 4462583 4805961 4828167 4913920
14199 4913920 4931271 4877068 4821649 4770919 4654719 4591895 4510051 4373600 4497193 4424362 4469501
14188 4469501 4355868 4210609 4356317 4396113 4476474 4190244 4132268 4134247 4208708 4182952 4053876
14177 4053876 4328613 4465534 4437301 4410525 4479765 4709860 4722842 4630272 4558022 4581835 4482572
14166 4482572 4444069 4326793 4244248 4260296 4338131 4276655 4475773 4565181 4752549 4740381 4646508
14155 4646508 4504182 4642138 4702075 4341195 4219640 4385088 4480189 4474027 4566992 4595298
14145 4595298 4520608 4503615 4496014 4665793 4733776 4475370 4301241 4459730 4651034 4657821 4491667
14134D491667j44083j04443q7518K12982K48564J14015J19247p1232n2285o7956
14124D658958k93411j76653J7965K2097P305j05107K9765J50872J83380r3555
14114D401616k2054J20456K03581p0446k9070p8593j23316k25428O4553Q3327
14104D324626j81341j12690J19204L53876J81614K8294j07278j84451L2608k6657
14094D427805J78222p3339k30965n6639j30897r314K35868K19445Q4643j70352
14084D474477m6328J3151r2579j30444J55006N9325N8836k43579j66350J45915
14074D227430K53065K48908j03629k36061R8093O7952J21489j62973o5432q5233
14064D363609Q1428p0764m9269n6461P3463l706M8716j8743n9623K12060P7098
$$ plain form
14134 4491667 4347584 4243141 4155623 4368605 4617169 4731184 4850431 4779199 4726914 4658958
14124 4658958 4365547 4188894 4206859 4228956 4236261 4131154 4160919 4311791 4495171 4401616
14114 4401616 4379562 4500018 4703599 4633153 4604083 4525490 4402174 4176746 4241299 4324626
14104 4324626 4143285 4030595 4149799 4503675 4685289 4713583 4606305 4421854 4454462 4427805
14094 4427805 4606027 4532688 4301723 4245084 4114187 4104873 4340741 4560186 4644829 4474477
14084 4474477 4428149 4441300 4348721 4218277 4373283 4432608 4491444 4247865 4081515 4227430
14074 4227430 4480495 4729403 4625774 4389713 4487806 4555758 4677247 4514274 4448842 4363609
14064 4363609 4445037 4374273 4325004 4268543 4342006 4338300 4387016 4368273 4308650 4520710 4597808
14053D597808J78860J83935j32682r7934n0497Q2116r5741k35522j27028k47955
14043D055360N4726J58203J31615J45440M4372J9104o6771j46917M5913j45821
$$ plain form
14053 4597808 4776668 4960603 4827921 4729987 4679490 4761606 4665865 4430343 4303315 4055360
14043 4055360 4110086 4268289 4399904 4545344 4589716 4608820 4542049 4395132 4441045 4295224
$$ [...]
##END NTUPLES=NMR SPECTRUM
##END=
