##TITLE=Analysis number 329661
Compound Code cc 33502
Book Reference 437/86
Project Code adrs
Chemist Name wendyb
##JCAMPDX= 6.0         $$ Bruker NMR JCAMP-DX V2.0
##DATA TYPE= NMR SPECTRUM
##DATA CLASS= NTUPLES
##ORIGIN= Bruker BioSpin GmbH
##OWNER= nmr
$$ XWIN-NMR		Version 3.5
$$ Fri Sep 21 12:55:17 2007 GMT Daylight Time (UT+1h)  MAYBRIDGE\nmr@NMR_250MHZ
##.OBSERVE FREQUENCY= 250.131544655141
##.OBSERVE NUCLEUS= ^1H
##.ACQUISITION MODE= SIMULTANEOUS (DQD)
##.ACQUISITION SCHEME= undefined
##.AVERAGES= 16
##.DIGITISER RES= 18
##SPECTROMETER/DATA SYSTEM= dpx250
##.PULSE SEQUENCE= zg30
##.SOLVENT NAME= CDCl3
##.SHIFT REFERENCE= (INTERNAL, CDCl3, 0, 16.4478)
##AUDIT TRAIL= $$ (NUMBER, WHEN, WHO, WHERE, WHAT)
$$ ##TITLE= Audit trail, XWIN-NMR		Version 3.5
$$ ##JCAMPDX= 5.01
$$ ##ORIGIN= Bruker BioSpin GmbH
$$ ##OWNER= nmr
$$ C:\u/data/dgb/nmr/ADRS/2140/pdata/1/auditp.txt
$$ ##AUDIT TRAIL=  $$ (NUMBER, WHEN, WHO, WHERE, WHAT)
(   1,<2007-09-21 12:54:56.00 +100>,<MAYBRIDGE\nmr>,<NMR_250MHZ>,
      <created by zg, POWCHK disabled, PULCHK disabled
       configuration hash MD5:
       76 6E 9A 78 1E 09 19 81 EC 84 63 8F B0 6A 59 2D
       data hash MD5: 64K
       0F E0 52 94 86 6D 07 8F 7B 2B 9B B2 BB 65 3A 2F>)
(   2,<2007-09-21 12:55:08.49 +100>,<MAYBRIDGE\nmr>,<NMR_250MHZ>,
      <Start of raw data processing
       ef LB = 0.3 FT_mod = 6 PKNL = 1 SI = 32K 
       data hash MD5: 32K
       83 58 8F 30 35 F4 AD 26 34 10 74 F5 D9 13 D0 BC>)
(   3,<2007-09-21 12:55:10.05 +100>,<MAYBRIDGE\nmr>,<NMR_250MHZ>,
      <apk 
       data hash MD5: 32K
       63 14 D6 E4 98 CB E8 76 21 A0 66 E8 6F DF D3 71>)
(   4,<2007-09-21 12:55:10.75 +100>,<MAYBRIDGE\nmr>,<NMR_250MHZ>,
      <abs ABSG = 5 
       data hash MD5: 32K
       B9 3F D9 C7 1D 09 AD 97 32 9D A0 C2 C2 03 C6 1E>)
$$ ##END=
$$ 
$$ hash MD5
$$ C8 86 5A 2A 24 81 A9 67 CD 61 8A 78 1B 3F 99 EB
##$RELAX= 
##$RELAX= 
##$RELAX= 
##$RELAX= 
##$RELAX= 
##$RELAX= 
##$RELAX= 
$$ Bruker specific parameters
$$ --------------------------
##$DU= <C:\u>
##$EXPNO= 2140
##$NAME= <ADRS>
##$PROCNO= 1
##$TYPE= <nmr>
##$USER= <dgb>
##$AMP= (0..31)
100 100 100 100 100 100 100 100 100 100 100 100 100 100 100 100 100 100 
100 100 100 100 100 100 100 100 100 100 100 100 100 100 
##$AQSEQ= 0
##$AQ_mod= 3
##$AUNM= <au_zg>
##$AUTOPOS= <21 >
##$BF1= 250.13
##$BF2= 250.13
##$BF3= 250.13
##$BF4= 250.13
##$BF5= 500.13
##$BF6= 500.13
##$BF7= 500.13
##$BF8= 500.13
##$BYTORDA= 1
##$CFDGTYP= 0
##$CFRGTYP= 5
##$CHEMSTR= <none>
##$CNST= (0..31)
1 1 145 1 1 1 1 1 1 1 1 1 1 1 1 1 1 1 1 1 1 1 1 1 1 1 1 1 1 1 1 1 
##$CPDPRG= <>
##$CPDPRG1= <>
##$CPDPRG2= <>
##$CPDPRG3= <>
##$CPDPRG4= <mlev>
##$CPDPRG5= <mlev>
##$CPDPRG6= <mlev>
##$CPDPRG7= <mlev>
##$CPDPRG8= <mlev>
##$CPDPRGB= <>
##$CPDPRGT= <>
##$D= (0..31)
0 1 0 0 0 0 0 0 0 0.06 0 0 0 0 0 0 0.0002 0 0 0 0 0 0 0 0 0 0 0 0 0 0 
0 
##$DATE= 1190375694
##$DBL= (0..7)
120 120 120 120 120 120 120 120 
##$DBP= (0..7)
150 150 150 150 150 150 150 150 
##$DBP07= 0
##$DBPNAM0= <>
##$DBPNAM1= <>
$$ [...]
##$SUBNAM7= <"">
##$SUBNAM8= <"">
##$SUBNAM9= <"">
##$SW= 20.6930455092707
##$SWIBOX= (0..15)
0 0 3 0 0 0 0 0 0 0 0 0 0 0 0 0 
##$SW_h= 5175.983436853
##$TD= 65536
##$TD0= 1
##$TE= 297.16
##$TE2= 300
##$TE3= 300
##$TEG= 300
##$TL= (0..7)
0 120 120 120 120 120 120 120 
##$TP= (0..7)
150 150 150 150 150 150 150 150 
##$TP07= 0
##$TPNAME0= <>
##$TPNAME1= <>
##$TPNAME2= <>
##$TPNAME3= <>
##$TPNAME4= <>
##$TPNAME5= <>
##$TPNAME6= <>
##$TPNAME7= <>
##$TPOAL= (0..7)
0.5 0.5 0.5 0.5 0.5 0.5 0.5 0.5 
##$TPOFFS= (0..7)
0 0 0 0 0 0 0 0 
##$TUNHIN= 0
##$TUNHOUT= 0
##$TUNXOUT= 0
##$USERA1= <user>
##$USERA2= <user>
##$USERA3= <user>
##$USERA4= <user>
##$USERA5= <user>
##$V9= 5
##$VALIST= <valist>
##$VCLIST= <CCCCCCCCCCCCCCC>
##$VD= 0
##$VDLIST= <DDDDDDDDDDDDDDD>
##$VPLIST= <PPPPPPPPPPPPPPP>
##$VTLIST= <TTTTTTTTTTTTTTT>
##$WBST= 1024
##$WBSW= 4
##$XGAIN= (0..3)
0 0 0 0 
##$XL= 0
##$YL= 0
##$YMAX_a= 117173
##$YMIN_a= -232794
##$ZGOPTNS= <>
##$ZL1= 120
##$ZL2= 120
##$ZL3= 120
##$ZL4= 120
##$ABSF1= 16.44776
##$ABSF2= -4.245413
##$ABSG= 5
##$ABSL= 3
##$ALPHA= 0
##$AQORDER= 0
##$ASSFAC= 0
##$ASSFACI= 0
##$ASSFACX= 0
##$ASSWID= 0
##$AUNMP= <proc_1d>
##$AZFE= 0.1
##$AZFW= 0.1
##$BCFW= 0
##$BC_mod= 0
##$BYTORDP= 0
##$COROFFS= 0
##$CY= 12.5
##$DATMOD= 1
##$DC= 0
##$DFILT= <>
##$DTYPP= 0
##$F1P= 14.0000005364418
##$F2P= -0.99999901652339
##$FCOR= 0.5
##$FTSIZE= 32768
##$FT_mod= 6
##$GAMMA= 0
##$GB= 0
##$INTBC= 1
##$INTSCL= 1
##$ISEN= 128
##$LB= 0.3
##$LEV0= 0
##$LPBIN= 0
##$MAXI= 10000
##$MC2= 0
##$MEAN= 0
##$ME_mod= 0
##$MI= 0
##$NCOEF= 0
##$NC_proc= -4
##$NLEV= 6
##$NOISF1= 0
##$NOISF2= 0
##$NSP= 0
##$NTH_PI= 0
##$NZP= 0
##$OFFSET= 16.44776
##$PC= 1
##$PHC0= 160.4451
##$PHC1= 0.1652759
##$PH_mod= 1
##$PKNL= yes
##$PPARMOD= 0
##$PSCAL= 4
##$PSIGN= 0
##$REVERSE= no
##$SF= 250.130018567258
##$SI= 32768
##$SIGF1= 0
##$SIGF2= 0
##$SINO= 400
##$SIOLD= 32768
##$SREGLST= <1H.CDCl3>
##$SSB= 0
##$STSI= 32768
##$STSR= 0
##$SW_p= 5175.98343685301
##$SYMM= 0
##$S_DEV= 0
##$TDeff= 65536
##$TDoff= 0
##$TI= <Analysis number 999999
Compound Code 99
Book Reference 9
Project Code 9>
##$TILT= no
##$TM1= 0
##$TM2= 0
##$TOPLEV= 0
##$USERP1= <user>
##$USERP2= <user>
##$USERP3= <user>
##$USERP4= <user>
##$USERP5= <user>
##$WDW= 1
##$XDIM= 32768
##$YMAX_p= 349142566
##$YMIN_p= -720237
$$ End of Bruker specific parameters
$$ ---------------------------------
##NTUPLES= NMR SPECTRUM
##VAR_NAME=  FREQUENCY,     SPECTRUM/REAL,   SPECTRUM/IMAG
##SYMBOL=    X,             R,               I
##VAR_TYPE=  INDEPENDENT,   DEPENDENT,       DEPENDENT
##VAR_FORM=  AFFN,          ASDF,            ASDF
##VAR_DIM=   32768,         32768,           32768
##UNITS=     HZ,            ARBITRARY UNITS, ARBITRARY UNITS
##FACTOR=    0.157963299565203, 1,           1
##FIRST=     4114.07842121545, 0,            0
##LAST=      -1061.90501563756, 0,           0
##MIN=       -1061.90501563756, -720237,     0
##MAX=       4114.07842121545, 349142566,    0
$$ Real data points
##PAGE= N=1
##DATA TABLE= (X++(R..R)), XYDATA
$$ [...]
$$ plain form
25789 -250282 -329828 -137945 291537 295646 315333 348992 230175 80653 10600 -60477 -202064
25778 -202064 -260771 -65739 -3253 105470 61781 -64321 -63570 96964 -47579 -293425 -297313
25767 -297313 -175949 40989 163857 106778 43358 82084 101392 -81384 -175358 -48368
25757 -48368 47404 -41018 -50168 106997 127980 -11095 -15530 84432 -47899 -32491 45546
25746 45546 -59626 -37665 -89112 -19392 16727 191668 123345 -77969 -195341 -233666 -292867
25735 -292867 -269742 -172176 -230255 -178330 -156098 -134752 -245933 -331820 -299824 -148314 -82685
25724 -82685 -147648 -227218 -198045 -231328 -169216 -169730 -181707 -9289 61192 -43290 -109175 -140093
25712 -140093 -77170 65810 74136 173740 163256 37554 9979 125953 167674 172662 113326
$$ packed form
25789b50282p9546J91883M29482M109J9687L3659j18817j49522p0053p1077j41587
25778b02064n8707J95032O2486J08723m3689j26102P51J60534j44543k45846l888
25767b97313J21364K16938J22868n7079o3420L8726J9308j82776r3974J26990
25757d8368R5772q8422r150J57165K0983j39075m435R9962j32331J5408P8037
25746D5546j05172K1961n1447O9720L6119J74941o8323k01314j17372l8325n9201
25735b92867K3125R7566n8079N1925K2232K1346j11181q5887L1996J51510O5629
25724h2685o4963p9570K9173l3283O2112n14j1977J72418P0481j04482o5885l0918
25712a40093O2923J42980Q326R9604j0484j25702k7575J15974M1721M988n9336
$$ plain form
25701 113326 149351 30430 -114019 56010 -53852 -198706 -137429 -48058 -73308 -47214
25691 -47214 -80442 -210417 -361357 -308016 -223605 -266869 -190360 -157123 -218092 -141874 -11636
25680 -11636 98116 50644 36614 23246 98708 109284 70035 -9280 -283713 -181670 21005
25669 21005 182445 286467 215392 175222 103995 20407 -174772 -165173 -87290 -85164 -102623
25658 -102623 -182943 -152765 -42836 94023 268012 332691 224720 75842 -120538 -323885
25648 -323885 -264695 -114409 39754 208901 124600 68177 56379 -44673 46986 56130 -55646
25637 -55646 -135569 -73111 -70455 -39852 -66694 67640 190567 149888 151300 154761 205825 359088
25625 359088 415288 235842 167678 130980 -16361 -248436 -191207 -156351 -89572 -85053 -117040
$$ packed form
25701A13326L6025j18921j44449J70029j09862j44854O1277Q9371k5250K6094
25691d7214l3228j29975j50940N3341Q4411m3264P6509L3237o0969P6218J30238
25680a1636J09752m7472j4030j3368P5462J0576l9249p9315k74433J02043K02675
25669B1005J61440J04022p1075m0170p1227q3588j95179R599P7883K126j7459
25658a02623q0320L0178J09929J36859J73989O4679j07971j48878j96380k03347
25648c23885N9190J50286J54163J69147q4301n6423j1798j01052R1659R144j11776
25637e5646p9923O2458K656L0603k6842J34334J22927m0679J412L461N1064J53263
25625C59088N6200j79446o8164l6698j47341k32075N7229L4856O6779M519l1987
$$ plain form
25614 -117040 -136793 -127194 -19955 127503 96168 11660 -36970 32033 -54492 -139732 -77012
25603 -77012 14426 -202036 -122119 -135597 -224140 -110762 -167779 -63812 129502 247647 107920
25592 107920 64678 65087 88928 40411 100556 123553 61602 122738 116478 53855 116990 -31914
25580 -31914 58346 -50386 -122090 -199770 -24759 24783 142150 20115 -24920 192766 53492
25569 53492 -135804 -41047 -101801 -152960 -160105 -133013 -54320 92988 83324 159624 306854
25558 306854 241518 352547 415909 207102 177725 30548 10248 1026 109960 258567 50516
25547 50516 27140 56920 -14268 103612 73963 31241 94745 185325 41201 -212829 -307931
25536 -307931 -471360 -333732 -104674 -119234 -80779 -33721 51552 155907 112875 69130 -47502
$$ packed form
25614a17040j9753R599J07239J47458l1335q4508m8630O9003q6525q5240O2720
25603g7012R1438k16462P9917j3478q8543J13378n7017J03967J93314J18145j39727
25592A07920m3242M09K3841m8517O0145K2997o1951O1136o260o2623O3135j48904
25580c1914R0260j08732p1704p7680J75011M9542J17367j22035m5035K17686j39274
25569E3492j89296R4757o0754n1159p145K7092P8693J47308r664P6300J47230
25558C06854o5336J11029O3362k08807k9377j47177k0300r222J08934J48607k08051
25547E0516k3376K9780p1188J17880k9649m2722O3504R0580j44124k54030r5102
25536c07931j63429J37628K29058j4560L8455M7058Q5273J04355m3032m3745j16632
$$ plain form
25525 -47502 -39521 -59652 -189865 -103481 -108117 -86247 -73525 -32587 -85143 87490 126220 136285
25513 136285 26777 -69126 -72508 -273617 -185971 -143169 -202701 -258991 -10770 96760 -78640
25502 -78640 -17854 87074 -35200 -68011 -159839 -147811 -177280 -290351 -196200 -205596 -265261
25491 -265261 -74813 -62700 -64469 -53461 -95198 -83713 -89766 -84318 4241 111816 160018 222296
25479 222296 230503 83014 -54397 13570 51480 -40917 -69490 -114703 165503 334466 312627
25468 312627 289885 224249 45846 -58090 35738 78197 74250 15283 -170973 -184448 -94839
25457 -94839 24826 -30242 50330 -30281 21704 75640 -71757 -179678 -35131 169021 255980
25446 255980 218041 215610 13528 3803 38056 22259 -19891 58367 225488 190881 57638
$$ packed form
25525d7502P981k0131j30213Q6384m636K1870J2722M0938n2556J72633L8730J0065
25513A36285j09508r5903l382k01109Q7646M2802n9532n6290K48221J07530j75400
25502g8640O0786J04928j22274l2811r1828J2028k9469j13071R4151r396n9665
25491b65261J90448J2113j769J1008m1737J1485o053N448Q8559J07575M8202O2278
25479B22296Q207j47489j37411O7967L7910r2397k8573m5213K80206J68963k1839
25468C12627k2742o5636j78403j03936R3828M2459l947n8967j86256j3475Q9609
25457i4839J19665n5068Q0572q0611N1985N3936j47397j07921J44547K04152Q6959
25446B55980l7939k431k02082r725L4253j5797m2150P8258J67121l4607j33243
$$ plain form
25435 57638 -11419 21435 48111 123324 122430 22247 -27615 131425 50717 -62123 -41636
25424 -41636 -55611 -125194 -201921 -246040 -84758 14334 113121 83779 83134 59745 31873 20807
25412 20807 -77665 -77319 -104572 78906 41631 -69244 -68051 -83101 -117617 -119589 -291918 -292098
25400 -292098 -255790 -67158 114261 116023 14926 -65007 29273 70481 130039 145521 12573
25389 12573 -71772 -162805 -180977 -138299 28348 148393 280278 383329 555627 499153 400076
25378 400076 266033 -11090 40997 134634 99438 63945 159365 60369 -93230 -111457 -76256
25367 -76256 -82130 29118 189791 407646 258928 -123152 -299810 -202691 -35868 -60481
25357 -60481 -10414 -129885 -68524 -86221 -84457 78540 5935 122457 187934 -29012 -25613
$$ packed form
25435E7638o9057L2854K6676P5213q94j00183m9862J59040q0708j12840K0487
25424d1636j3975o9583p6727m4119J61282R9092R8787k9342o45k3389k7872j1066
25412B0807r8472L46k7253J83478l7275j10875J193j5050l4516j972j72329j80
25400b92098L6308J88632J81419J762j01097p9933R4280M1208N9558J5482j32948
25389A2573q4345r1033j8172M2678J66647J20045J31885J03051J72298n6474r9077
25378D00076j34043k77123N2087R3637l5196l5493R5420r8996j53599j8227L5201
25367g6256n874J11248J60673K17855j48718l82080j76658R7119J66823k4613
25357f0481N0067j19471O1361j7697J764J62997p2605J16522O5477k16946L399
$$ plain form
25346 -25613 206290 297491 277360 299306 297571 158862 13491 91000 4833 -85042 -49144
25335 -49144 -79601 74759 -7125 66420 98164 -84317 297 48417 252508 414801 364191
25324 364191 221397 140641 95959 183507 185177 175136 3477 -212829 -351205 -201545 -80869
25313 -80869 -93348 -100598 54903 117006 -31602 -260317 -309992 -167655 1855 86386 221517
25302 221517 223423 -58251 -53889 8547 118172 85251 -16871 65146 334162 255597 153048
25291 153048 -29564 -186168 -323289 -288838 -110553 76067 -9602 -33260 142270 291686
25281 291686 218754 36020 -52458 -87473 -115672 -149347 -142984 -56253 -129143 -118429 -289094
25270 -289094 -441886 -212803 -85368 -209418 -306852 -222629 -68236 -138484 -227272 -252874
$$ packed form
25346b5613K31903R1201k0131K1946j735j38709j45371P7509q6167q9875L5898
25335d9144l0457J54360q1884P3545L1744j82481Q4614M8120K04091J62293n0610
25324C64191j42794q0756m4682Q7548J670j0041j71659k16306j38376J49660J20676
25313h0869j2479p250J55501O2103j48608k28715m9675J42337J69510Q4531J35131
25302B21517J906k81674M362O2436J09625l2921j02122Q2017K69016p8565j02549
25291A53048j82612j56604j37121L4451J78285J86620q5669k3658J75530J49416
25281B91686p2932j82734q8478l5015k8199l3675O363Q6731p2890J0714j70665
25270b89094j52792K29083J27435j24050r7434Q4223J54393p0248q8788k5602
$$ plain form
25260 -252874 -157259 -189778 -188143 -187035 21005 75688 -118277 -163485 -22218 41344 43894
25249 43894 8224 -103841 -43514 -81261 -65608 131823 306250 326981 99381 125796 118201
25238 118201 179846 133106 121342 -4432 -35373 169132 140555 122066 172319 -35039 186241
25227 186241 227675 87167 -111133 -22945 -13677 5777 -174644 -124734 -32880 -3967 -11238
25216 -11238 -121877 -139562 -335730 -237559 -340969 -284504 -192335 -275846 -40346 -3354 -12282
25205 -12282 65436 91623 120228 98016 85771 13781 18163 12023 -97662 -212123 -68142
25194 -68142 104417 167117 88377 73780 -38942 87655 193886 334679 322981 260586 177429
25183 177429 227502 57213 -129880 -54428 45685 -40053 -129879 -93415 105317 387333
$$ packed form
25260b52874R5615l2519J635J108K08040N4683j93965m5208J41267O3562K550
25249D3894l5670j12065O0327l7747J5653J97431J74427K0731k27600K6415p595
25238A18201O1645m6740j1764j25774l0941K04505k8577j8489N0253k07358K21280
25227A86241M1434j40508j98300Q8188R268J9454j80421M9910R1854K8913p271
25216a1238j10639j7685j96168R8171j03410N6465R2169q3511K35500L6992q928
25205a2282P7718K6187K8605k2212j2245p1990M382o140j09685j14461J43981
25194f8142J72559O2700p8740j4597j12722J26597J06231J40793j1698o2395q3157
25183A77429N0073j70289j87093P5452J00113q5738q9826L6464J98732K82016
$$ plain form
25173 387333 252372 183349 -20129 -43992 -14880 -150553 -229328 -170351 154705 291604
25163 291604 108211 378 -105423 -224440 -87920 -41223 -156135 -166574 -64704 17445
25153 17445 193137 411535 470209 369837 491774 356523 194765 58513 111828 105463
25143 105463 -13288 -122906 -181047 -16049 -31218 -33733 -157385 -212539 -44125 -89289 -120196
25132 -120196 41707 115763 111617 40330 51139 113133 -81527 -142667 -71623 -71430 -59529 -50186
25120 -50186 -125758 -41830 -145882 -226312 -285146 -68091 -12251 11044 141762 59380 -201171
25109 -201171 -220731 -175921 -41139 93031 47650 -9629 -95957 -170721 -72043 60204 58646
25098 58646 112989 19549 43459 174134 155342 84739 -59637 -124928 -141722 -63848 -79584
$$ packed form
25173C87333j34961o9023k03478k3863K9112j35673p8775N8977L25056J36899
25163B91604j83393j07833j05801j19017J36520M6697j14912j0439J01870Q2149
25153A7445J75692K18398N8674j00372J21937j35251j61758j36252N3315o365
25143A05463j18751j09618n8141J64998j5169k515j23652n5154J68414m5164l0907
25132a20196J61903P4056m146p1287J0809O1994j94660o1140P1044J93J1901R343
25120e0186p5572Q3928j04052q0430n8834K17055N5840K3295J30718q2382k60551
25109b01171j9560M4810J34782J34170m5381n7279q6328p4764R8678J32247j558
25098E8646N4343r3440K3910J30675j8792p0603j44376o5291j6794P7874j5736
$$ plain form
25087 -79584 -136220 -74536 62418 93514 235900 320999 186263 48781 107678 151884 46461
25076 46461 102321 310745 336841 249770 361087 172118 -10146 -64323 91707 174846 88496
25065 88496 66956 -73976 -309321 -476900 -341001 -197761 -80557 -107471 -117466 -35121 -29964
25054 -29964 -142228 31566 139398 65050 -29405 -117809 -235887 -363643 -260608 -123157
25044 -123157 -18046 49286 71491 149264 124614 21113 30948 82362 127987 47844 206572
25033 206572 292179 177816 227626 301793 166759 90769 39605 -2684 45471 64949 208989
25022 208989 408439 524037 333427 22517 60270 2596 129116 218166 174320 159069
25012 159069 89783 79127 2269 29911 -23477 11753 -96346 -127115 115072 127281 148120
$$ packed form
25087g9584n6636O1684J36954L1096J42386Q5099j34736j37482N8897M4206j05423
25076D6461N5860K08424K6096q7071J11317j88969j82264n4177J56030Q3139q6350
25065H8496k1540j40932k35345j67579J35899J43240J17204k6914r995Q2345N157
25054b9964j12264J73794J07832p4348r4455q8404j18078j27756J03035J37451
25044a23157J05111O7332K2205P7773k4650j03501R835N1414M5625q0143J58728
25033B06572Q5607j14363M9810P4167j35034p5990n1164m2289M8155J9478J44040
25022B08989J99450J15598j90610l10910L7753n7674J26520Q9050m3846j5251
25012A59069o9286j0656p6858K7642n3388L5230j08099l0769K42187J2209K0839
$$ plain form
25001 148120 170805 100172 -34450 43440 184466 222528 129556 43068 80899 57427 25932
24990 25932 -67204 -90028 -180631 -184503 -219342 3360 -107256 -263931 -296880 -231618 -140797
24979 -140797 -94346 -138263 -252801 -368388 -326628 -77522 -12528 -108914 -65816 -35205 46946
24968 46946 -41635 -46576 61910 203902 102017 -54981 464 13590 -131384 -101376 -70992
24957 -70992 -141839 -282263 -319583 -365921 -282453 -321723 -220124 15251 -49163 -202903 -291932
24946 -291932 -220376 -138002 -145527 -45516 -69892 -72756 -104298 -239737 -189429 -67521 -168479
24935 -168479 -104876 52442 -6834 -64459 -63792 71578 15171 20101 -27778 -196057 -163416
24924 -163416 37819 92916 81294 143403 -92730 -133736 155096 179296 172867 105374 -35059
$$ packed form
25001A48120K2685p0633j34622P7890J41026L8062r2972q6488L7831k3472l1495
24990B5932r3136k2824r0603l872l4839K22702j10616j56675l2949O5262R0821
24979a40797M6451m3917j14538j15587M1760K49106O4994r6386M3098L0611Q2151
24968D6946q8581m941J08486J41992j01885j56998N5445J3126j44974L0008L0384
24957g0992p0847j40424l7320m6338Q3468l9270J01599K35375o4414j53740q9029
24946b91932P1556Q2374p525J00011k4376k864l1542j35439N0308J21908j00958
24935a68479O3603J57318n9276n7625O67J35370n6407M930m7879j68279L2641
24924a63416K01235N5097j1622O2109k36133m1006K88832K4200o429o7493j40433
$$ plain form
24913 -35059 -44950 105373 174864 -12604 -89654 -62930 4470 -73092 -191459 -192907 -125681
24902 -125681 -92030 147247 247351 114573 77624 36169 -90141 -233133 -148269 -121806
24892 -121806 -19518 -59252 -176397 -145756 -184985 -62998 78212 93269 96461 183822 253032
24881 253032 162381 -13624 -173847 -47715 -54178 52178 39483 458 -73318 59587 51179
24870 51179 -48399 69307 17762 41420 -19180 -22174 58418 78459 47102 -29371 -49570 -106533
24858 -106533 -207063 -148040 -229911 -218106 -136678 -54543 167054 187913 141895 -60738 -89686
24847 -89686 -34823 -16175 -110260 -256181 -387272 -277227 -189286 40618 115384 -29601 -93089
24836 -93089 44761 293889 215476 49234 -20726 45687 196838 106942 85482 5396 -58847
$$ packed form
24913c5059r891J50323O9491j87468p7050K6724O7400p7562j18367j448O7226
24902a25681L3651K39277J00104j32778l6949m1455j26310j42992Q4864K6463
24892a21806J02288l9734j17145L0641l9229J21987J41210J5057L192Q7361O9210
24881B53032r0651j76005j60223J26132o463J06356j2695l9025p3776J32905q408
24870E1179r9578J17706n1545K3658o0600k994Q0592K0041l1357p6473k0199n6963
24858a06533j00530N9023q1871J1805Q1428Q2135K21597K0859m6018k02633k8948
24847h9686N4863J8648r4085j45921j31091J10045Q7941K29904P4766j44985o3488
24836i3089J37850K49128p8413j66242o9960O6413J51151q9896k1460q0086o4243
$$ plain form
24825 -58847 33673 9569 -50894 -148247 -50278 117922 156192 213998 170281 241862 335696
24814 335696 184986 110852 136780 105934 214073 4490 -67879 21816 54954 34574 624
24803 624 -129790 -116625 54454 -27583 -78060 84943 72258 11212 -25401 -115741 -88025
24792 -88025 22872 40821 -63263 -27588 -108644 -101221 -124128 -19301 3162 -42088 -7393
24781 -7393 -11847 -26443 -57295 3361 103881 182865 137903 170476 46908 -77657 -79207 -38002
24769 -38002 -19612 143341 37251 -46261 -11750 -145545 52440 198264 206392 201646 144106
24758 144106 225274 396988 398991 294339 176692 27975 90526 291174 197460 123954 93748
24747 93748 -25103 -69985 -27944 -191897 -264211 -216876 -217594 -64676 24871 -10233 -67054
$$ packed form
24825e8847R2520k4104o0463r7353R7969J68200L8270N7806m3717P1581R3834
24814C35696j50710p4134K5928l0846J08139k09583p2369Q9695L3138k0380l3950
24803F24j30414J3165J71079q2037n0477J63003j2685o1046l6613r0340K7716
24792h8025J10897J7949j04084L5675q1056P423k2907J04827K2463m5250L4695
24781g393m454j4596l0852O0656J00520P8984m4962L2573j23568j24565j550M1205
24769c8002J8390J62953j06090q3512L4511j33795J97985J45824Q128m746n7540
24758A44106Q1168J71714K003j04652j17647j48717O2551K00648r3714p3506l0206
24747I3748j18851m4882M2041j63953p2314M7335p18J52918Q9547l5104n6821
$$ plain form
24736 -67054 -219049 -174460 -158805 -243290 -176322 -37933 89956 116314 -149315 -152858 -135230
24725 -135230 4864 10614 -132990 -93056 -9311 65848 341523 231967 64228 124761 214695
24714 214695 197630 228509 265525 224327 256434 146125 183945 222610 143866 77525 123865
24703 123865 173570 132730 112372 64873 116185 -24568 -44271 -99685 -1317 150293 219702
24692 219702 168764 242728 220166 127732 -38933 -170419 -87091 240312 181950 149556 163227
24681 163227 218087 154127 65921 123904 48050 93592 41177 -92236 -170084 9816 83317
24670 83317 173343 196075 108812 -70143 -227150 -87303 -50013 -147118 -251841 -174532 -22277
24659 -22277 129727 238048 84567 -139430 -307370 -197434 -143667 -115911 -144542 -41451
$$ packed form
24736f7054j51995M4589J5655q4485O6968J38389J27889K6358k65629l543J7628
24725a35230J40094N750j43604L9934Q3745P5159K75675j09556j67739O0533Q9934
24714B14695j7065L0879L7016m1198L2107j10309L7820L8665p8744o6341M6340
24703A23865M9705m0840k0358m7499N1312j40753j9703n5414R8368J51610O9409
24692B19702n0938P3964k2562r2434j66665j31486Q3328L27403n8362l2394J3671
24681A63227N4860o3960q8206N7983p5854M5542n2415j33413p7848J79900P3501
24670H3317R0026K2732q7263j78955j57007J39847L7290r7105j04723P7309J52255
24659b2277J52004J08321j53481k23997j67940J09936N3767K7756k8631J03091
$$ plain form
24649 -41451 24451 58197 -51313 23205 292218 188128 255599 432024 358487 266736 157843
24638 157843 25282 93926 61237 -14494 -11104 148887 234992 247963 71771 9296 179764
24627 179764 198823 176381 159096 92101 32084 68234 46819 9434 40594 3212 -42641
24616 -42641 -123454 -33068 -10099 -93500 -168951 -54781 82801 112060 124244 140962 176887
24605 176887 247220 288616 212863 101071 7506 -35742 159729 311922 121331 -74006
24595 -74006 -15976 -31597 -28418 34548 81153 33884 -31245 -46379 51183 101696 -18331 -181110
24583 -181110 -224107 -65059 47776 44849 139401 143993 73149 -10661 -129894 -117828 -138269
24572 -138269 -144714 -176374 -115359 2334 -988 -112646 -91290 7336 27275 83937 137844
$$ packed form
24649d1451O5902L3746j09510P4518K69013j04090O7471J76425p3537r1751j08893
24638A57843j32561O8644l2689p5731L390J59991Q6105J2971j76192o2475J70468
24627A79764J9059k2442j7285o6995o0017L6150k1415l7385L1160l7382m5853
24616d2641q0813R0386K2969q3401p5451J14170J37582K9259J2184J6718L5925
24605A76887P0333M1396p5753j11792r3565m3248J95471J52193j90591j95337
24595g4006N8030j5621L179O2966M6605m7269o5129j5134R7562N0513j20027j62779
24583a81110m2997J59048J12835k927R4552M592p0844q3810j19233J2066k0441
24572a38269o445l1660O1015J17693l322j11658K1356R8626J9939N6662N3907
$$ plain form
24561 137844 -2176 -155190 -88942 -14380 -73403 -219816 -74146 63563 36708 -64551
24551 -64551 -114725 -11780 -51743 -46403 123931 189287 126785 145956 206960 196693 308729
24540 308729 225411 258798 121711 42956 -140460 -130164 68552 15105 -69574 -9757 129281
24529 129281 291312 333991 228447 36491 -142689 -300790 -251779 -224840 -271736 -57285
24519 -57285 -45302 9658 115024 103721 254308 151440 135364 139660 86275 87339 134899
24508 134899 236131 185138 97353 74991 11073 -42023 71675 289555 292010 239975 164682
24497 164682 71410 218620 436130 252820 95586 27490 -40148 -62437 47334 103010
24487 103010 140731 159569 167942 67631 -106440 -78327 -18635 -31385 -52870 -67340 -66193
$$ packed form
24561A37844j40020j53014O6248P4562n9023j46413J45670J37709k6855j01259
24551f4551n0174J02945l9963N340J70334O5356o2502J9171O1004j0267J12036
24540C08729q3318L3387j37087p8755j83416J0296J98716n3447q4679N9817J39038
24529A29281J62031M2679j05544j91956j79180j58101M9011K6939m6896K14451
24519e7285J1983N4960J05366j1303J50587j02868j6076M296n3385J064M7560
24508A34899J01232n0993q7785k2362o3918n3096J13698K17880K455n2035p5293
24497A64682r3272J47210K17510j83310j57234o8096o7638k2289J09771N5676
24487A03010L7721J8838Q373j00311j74071K8113N9692j2750k1485j4470J147
$$ plain form
24476 -66193 65655 95713 37125 15933 -79157 -107088 -203582 -408109 -272034 -70306 25339
24465 25339 63434 -60063 -88782 -28601 -22138 101635 37215 108645 45001 -51421 -140959
24454 -140959 -204220 -73168 82963 171715 119463 154410 75044 128664 185707 -340 -55407
24443 -55407 99909 -72157 -31149 23045 37369 174539 252155 227032 112979 -69406 -39536
24432 -39536 -61532 46761 -30036 2592 -106358 -145012 -56138 120144 112917 -19125 -97894
24421 -97894 -166507 -272130 -201205 -51622 -79088 -217318 -234262 -164765 41657 151391 336473
24410 336473 258776 209733 49410 148605 180906 92370 156545 342744 254498 -4030 -250628
24399 -250628 -369045 -322923 -160766 -135880 -247549 -55329 -122238 -254163 -22333 183466
$$ packed form
24476f6193J31848L0058n8588k1192r5090k7931r6494k04527J36075K01728R5645
24465B5339L8095j23497k8719O0181O463J23773o4420P1430o3644r6422q9538
24454a40959o3261J31052J56131Q8752n2252L4947p9366N3620N7043j86047n5067
24443e5407J55316j72066M1008N4194J4324J37170P7616k5123j14053j82385K9870
24432c9536k1996J08293p6797L2628j08950l8654Q8874J76282p227j32042p8769
24421i7894o8613j05623P0925J49583k7466j38230j6944O9497K06422J09734J85082
24410C36473p7697m9043j60323R9195L2301q8536O4175J86199q8246k58528k46598
24399b50628j18417M6122J62157K4886j11669J92220o6909j31925K31830K05799
$$ plain form
24389 183466 76122 6854 59476 -72479 -40400 -29611 96787 191343 92060 -247938 -351969
24378 -351969 -295990 -162205 -67068 -11414 199795 239416 258079 206696 76382 59991 209101
24367 209101 136225 -28923 -96580 29100 -2738 -203213 -43159 46760 -31887 -176923
24357 -176923 -82680 104355 -11785 -249597 -351488 -334346 -301878 -146555 -73239 -178120
24347 -178120 -222898 -320624 -382226 -270441 -187380 -184993 -124247 -66275 -115022 723 36105
24336 36105 197885 135522 -21833 -78443 -86070 -2107 170133 126429 179707 220809 284730
24325 284730 379526 519082 420882 288903 135235 -16739 -74208 -70425 49930 102966 -187299
24314 -187299 -162244 38058 186146 109431 142281 -136464 -124148 -33852 -168982 -251348 -128053
$$ packed form
24389A83466j07344o9268N2622j31955L2079J0789J26398R4556r9283l39998j04031
24378c51969N5979J33785R5137N5654K11209L9621J8663n1383j30314j6391J49110
24367B09101p2876j65148o7657J25680l1838k00475J60054Q9919p8647j45036
24357a76923R4243J87035j16140k37812j01891J7142L2468J55323P3316j04881
24347a78120m4778r7726o1602J11785Q3061K387O0746N7972m8747J15745L5382
24336C6105J61780o2363j57355n6610p627Q3963J72240m3704N3278M1102O3921
24325B84730R4796J39556r8200j31979j53668j51974n7469L783J20355N3036k90265
24314a87299K5055K00302J48088p6715L2850k78745J2316R0296j35130q2366J23295
$$ plain form
24303 -128053 -119503 -75164 191450 117922 188475 174107 42736 -78337 -140813 -160353 296
24292 296 125549 199294 183791 102965 -22993 33818 81218 -30891 -242273 -281414 -252811
24281 -252811 -193135 -22200 55490 35837 106261 180691 168936 121901 167995 215154 158626
24270 158626 65970 -24990 78992 278509 258290 63060 -56038 94883 200991 7841
24260 7841 -106318 -8218 43880 93677 -6269 -122984 -210875 -109839 -18017 39521 66234
24249 66234 -26790 -190581 -309156 -103088 30665 153852 149120 -29202 -38308 -80253 -39131
24238 -39131 -83652 -197850 -165322 -147408 -121381 -75091 -30343 23120 144 -154648 -74356
24227 -74356 -23109 196504 155721 -28665 24229 183451 62180 -81136 27171 60362
$$ packed form
24303a28053Q550M4339K66614p3528P0553j4368j31371j21073o2476j9540J60649
24292B96J25253P3745j5503q0826j25958N6811M7400j12109k11382l9141K8603
24281b52811N9676J70935P7690j9653P0424P4430j1755m7035M6094M7159n6528
24270A58626r2656r0960J03982J99517k0219j95230j19098J50921J06108j93150
24260G841j14159R8100N2098M9797r9946j16715q7891J01036R1822N7538K6713
24249F6234r3024j63791j18575K06068J33753J23187m732j78322r106m1945M1122
24238c9131m4521j14198L2528J7914K6027M6290M4748N3463k2976j54792Q0292
24227g4356N1247K19613m0783j84386N2894J59222j21271j43316J08307L3191
$$ plain form
24217 60362 -44280 10789 56904 41577 -45812 -61957 -132360 -122686 -42092 -63349 16029 65291
24205 65291 65449 6472 -86724 -5679 160806 151705 126513 17952 11450 257884 207922 4922
24193 4922 -33276 -71823 -26549 38458 25557 51282 55465 -27811 19312 135005 31600 136209
24181 136209 163148 -6242 114544 231726 289365 345051 310994 39048 -142842 -106688
24171 -106688 -111537 27830 -10271 -88371 -40086 -169167 -242923 -205420 -300323 -315698 -166089
24160 -166089 -159518 -207648 89747 188597 68130 -58619 35169 125490 263477 275091 44392
24149 44392 -172315 -212283 -221173 -172736 -55480 -74424 -48586 154550 436361 452004 221179
24138 221179 25780 40678 118583 40317 -67112 25487 -84480 -197163 -206770 -187352 -12827
$$ packed form
24217F0362j04642N5069M6115j5327q7389j6145p0403R674Q0594k1257P9378M9262
24205F5291J58n8977r3196Q1045J66485r101k5192j08561o502K46434m9962k03000
24193D922l8198l8547M5274O5007j2901K5725M183q3276M7123J15693j03405J04609
24181A36209K6939j69390J20786J17182N7639N5686l4057k71946j81890L6154
24171a06688m849J39367l8101p8100M8285j29081p3756L7503r4903j5375J49609
24160a66089O571m8130K97395R8850j20467j26749R3788R0321J37987J1614k30699
24149D4392k16707l9968q890M8437J17256j8944K5838K03136K81811J5643k30825
24138B21179j95399J4898P7905p8266j07429R2599j09967j12683r607J9418J74525
$$ plain form
24127 -12827 66569 119864 95456 133997 -33246 -252678 -203012 -176234 -133609 -28594 142196
24116 142196 215289 272897 260295 166844 -84233 -279051 -129378 -39156 -77334 -76307 20729
24105 20729 205424 227453 197152 190064 163627 71197 147575 118938 -31312 -94193 -102615 -89998
24093 -89998 -28703 40524 -67693 -82005 -18943 73146 188796 208843 114819 -121354 -54139
24082 -54139 67120 133690 14848 -43917 25274 192302 269488 106892 127084 166040 180458
24071 180458 117645 55217 56969 129866 172970 86440 120230 106112 190473 254717 219415 54440
24059 54440 -9226 -14955 -53422 -99269 -112797 -47969 -50823 66303 234340 302271 291528 143276
24047 143276 115911 37189 -26231 55263 -53835 -153663 -296901 -287842 -179262 -86028 -65748
$$ packed form
24127a2827P9396N3295k4408L8541j67243k19432M9666K6778M2625J05015J70790
24116A42196P3093N7608j2602r3451k51077j94818J49673R0222l8178J027R7036
24105B0729J84695K2029l0301p088k6437r2430P6378k8637j50250o2881q422J2617
24093h9998O1295O9227j08217j4312O3062R2089J15650K0047r4024k36173O7215
24082e4139J21259O6570j18842n8765O9191J67028P7186j62596K0192L8956J4418
24071A80458o2813o2428J752P2897M3104q6530L3790j4118Q4361O4244l5302j64975
24059E4440o3666n729l8467m5847j3528O4828k854J17126J68037O7931j0743j48252
24047A43276k7365p8722o3420Q1494j09098r9828j43238R059J08580R3234K0280
$$ plain form
24036 -65748 -72895 -7795 -95787 -114247 -91010 -48433 -119166 -116786 -210905 -240594 -136983 -28679
24024 -28679 -116924 -116566 -21675 -12518 -105113 -174080 -140061 -155865 -286500 -176358 -84987 -89804
24012 -89804 -183423 -174412 -247851 -351159 -229310 40032 181867 125752 111017 154186 172312
24001 172312 284448 278276 103635 -76771 -233209 -309904 -242199 -98555 -99085 -176969 -73044
23990 -73044 -95182 -56222 212792 307927 189477 86003 16899 218322 298011 294553 347731
23979 347731 424333 436845 55047 -175647 -262661 -198356 -38692 53769 43070 91756 44473
23968 44473 127773 21846 -156668 -28793 20580 -4453 40968 -93068 -256240 -202845 -10515
23957 -10515 90763 122261 76443 49738 -37015 56424 177610 82295 77081 137728 139194 5626
$$ packed form
24036f5748p147O5100q7992j8460K3237M2577p0733K380r4119k9689J03611J08304
24024b8679q8245L58R4891R157r2595o8967L4019j5804j30635J10142R1371m817
24012h9804r3619R011p3439j03308J21849K69342J41835n6115j4735M3169J8126
24001A72312J12136o172j74641j80406j56438p6695O7705J43644n30p7884J03925
23990g3044k2138L8960K69014R5135j18450j03474o9104K01423P9689l458N3178
23979C47731P6602J2512l81798k30694q7014O4305J59664R2461j0699M8686m7283
23968D4473Q3300j05927j78514J27875M9373k5033M5421j34036j63172N3395J92330
23957a0515J01278L1498m5818k6705q6753R3439J21186r5315n214O0647J466j33568
$$ plain form
23945 5626 59992 52924 198895 203059 214263 59320 -136875 -142188 -140742 -257622 -69885 182
23933 182 1511 54724 279110 342104 279116 199474 119542 48134 139687 156527 189582 177101
23921 177101 177228 82529 43116 157460 19539 -100072 -79570 -105628 36133 117055 116499
23910 116499 24314 45898 60501 60888 -46970 -204345 -303159 -107286 20726 152867 -27186
23899 -27186 -115002 -58601 11773 -24898 48330 -88566 -172194 -7749 -37349 -205168 -293654
23888 -293654 -120959 -225308 -135586 -121154 -400697 -560788 -427667 -172000 -4229 96443
23878 96443 79451 34569 29363 -265 42036 -31093 -139106 -284074 -237745 -192880 -313297
23867 -313297 -225903 -350188 -250304 -176925 -144633 -154239 1840 -38609 -69753 175259 173270
$$ packed form
23945E626N4366p068J45971M164J1204j54943j96195n313J446j16880J87737P0067
23933A82J329N3213K24386O2994o2988p9642p9932p1408R1553J6840L3055j2481
23921A77101J27r4699l9413J14344j37921j19611K0502k6058J41761Q0922n56
23910A16499r2185K1584J4603L87j07858j57375r8814J95873J28012J32141j80053
23899b7186q7816N6401P0374l6671P3228j36896q3628J64445k9600j67819q8486
23888b93654J72695j04349Q9722J4432k79543j60091J33121K55667J67771J00672
23878I6443j6992m4882n206k9628M2301p3129j08013j44968M6329M4865j20417
23867c13297Q7394j24285R9884P3379L2292r606J56079m0449l1144K45012j989
$$ plain form
23856 173270 123401 -8433 -95973 -52902 -70554 -182264 -196678 -23437 9397 -3477 40268
23845 40268 75345 -16374 -150876 -255830 -235332 -20707 92689 18301 131882 262640
23835 262640 217824 141418 -2592 -172144 -187387 -188040 -223193 -267388 -259699 -291269 -388071 -329320
23823 -329320 -179834 -51593 -47436 150110 202802 261936 138261 92146 191946 68262 -161870
23812 -161870 -223906 -235948 -105452 91964 122931 -75605 -56592 -44934 -242880 -257805 -196314
23801 -196314 -169273 -184034 28855 144819 169506 45905 140235 -7053 -197916 -155345
23791 -155345 104735 63202 -52722 -75296 93060 -101922 -232212 -149629 -133204 -193318
23781 -193318 -115900 -107099 -47966 -25987 -37708 -94004 -54675 166270 190368 139007 237709
$$ packed form
23856A73270m9869j31834q7540M3071j7652j11710j4414J73241L2834j2874M3745
23845D0268L5077r1719j34502j04954K0498K14625J13396p4388J13581J30758
23835B62640m4816p6406j44010j69552j5243o53l5153m4195P689l1570r6802N8751
23823c29320J49486J28241M157J97546N2692N9134j23675m6115R9800j23684k30132
23812a61870o2036j2042J30496J97416L0967j98536J9013J1658j97946j4925O1491
23801a96314K7041j4761K12889J15964K4687j23601R4330j47288j90863M2571
23791a55345K60080m1533j15924k2574J68356j94982j30290Q2583J6425o0114
23781a93318P7418Q801N9133K1979j1721n6296L9329K20945K4098n1361R8702
$$ plain form
23770 237709 214233 187359 143815 -58909 -199113 -184226 -74070 -75300 -46239 -133467 -121930
23759 -121930 -24676 85739 259010 231459 33288 -72485 -180847 74705 81872 99492
23749 99492 51514 -41579 -189160 8649 156123 218498 218384 82043 68630 74395 -34190
23738 -34190 -136929 12240 58152 -157756 -246065 -255127 -347190 -369669 -109369 33181 24047
23727 24047 164107 124538 -51868 697 139004 189496 -99340 -247280 -146941 15327
23717 15327 79226 -22177 -94930 -49507 152611 -56742 -138978 -39323 -64633 -70379 30399
23706 30399 -66012 -152350 -69983 -130527 -24201 146300 190965 110126 92621 94341 -50544
23695 -50544 -201620 -288749 -274081 -50287 67951 95226 90311 133454 141229 46824 -92016
$$ packed form
23770B37709k3476k6874m3544k02724j40204J4887J10156j230K9061q7228J1537
23759a21930R7254J10415J73271k7551j98171j05773j08362K55552P167J7620
23749I9492m7978r3093j47581J97809J47474O2375j14j36341j3413N765j08585
23738c4190j02739J49169M5912k15908q8309r062r2063k2479K60300J42550r134
23727B4047J40060l9569j76406N2565J38307N0492k88836j47940J00339J62268
23717A5327O3899j01403p2753M5423K02118k09353q2236R9655k5310n746J00778
23706C0399r6411q6338Q2367o0544J06326J70501M4665q0839j7505J720j44885
23695e0544j51076q7129J4668K23794J18238K7275m915M3143P775r4405j38840
$$ plain form
23684 -92016 -77658 82513 261527 277666 253704 232022 127360 -44585 -165722 -136049 -114501
23673 -114501 5046 190901 -12845 -115096 -160067 -177935 -143037 -118657 189169 108974
23663 108974 11903 -185344 -283404 -242388 -140743 -2079 -399 99098 113288 236472 169936
23652 169936 -9805 50056 138224 222675 95706 64518 86349 290870 130184 -140506
23642 -140506 -328388 -322114 -265391 -29320 95453 112022 141612 179288 249542 256641 104765
23631 104765 2806 -47316 -83428 -117299 -151240 -131327 -13724 -25921 -13392 364 58976
23620 58976 50623 -57221 -58147 125676 47199 133560 178772 138445 47718 12105 -81872 -51040
23608 -51040 -120113 -110522 -63532 -4978 278784 325330 370707 279634 34267 -143296 -202468
$$ packed form
23684i2016J4358J60171J79014J6139k3962k1682j04662j71945j21137K9673K1548
23673a14501J19547J85855k03746j02251m4971j7868L4898K4380L07826q0195
23663A08974r7071j97247r8060M1016J01645J38664J680R9497J4190J23184o6536
23652A69936j79741N9861Q8168Q4451j26969l1188K1831K04521j60686k70690
23642a40506j87882O274N6723K36071J24773J6569K9590L7676P0254P099j51876
23631A04765j01959n0122l6112l3871l3941J9913J17603j2197J2529J3756N8612
23620E8976q353j07844r26J83823p8477Q6361M5212m0327r0727l5613r3977L0832
23608e1040o9073R591M6990N8554K83762M6546M5377r1073k45367j77563n9172
$$ plain form
23597 -202468 -113122 -75547 -75031 -76336 -172622 -199953 -226825 -229998 -82904 -89429 -106253 -116102
23585 -116102 915 106762 73072 146298 39560 -51780 -23109 -4895 -111934 -43176 -128626
23574 -128626 -89495 -70710 -60444 31249 128447 108014 -10263 -26050 2512 1428 110819
23563 110819 122587 56718 45411 154739 214581 125252 -46446 -222420 -100229 -33736 65053
23552 65053 145513 157906 244570 45824 -43151 -2053 85027 92768 -35261 -326484 -484312
23541 -484312 -395391 -245158 -99698 -84764 -110264 -128662 -78997 -169970 -121046 -79426 -202471
23530 -202471 -195732 -135481 -161156 -210662 -312196 -155093 -57144 -55466 -107529 -29342 153279
23519 153279 85092 64849 151096 134324 128532 140768 73722 215209 169826 26396 73871
$$ packed form
23597b02468Q9346L7575N16j305r6286k7331k6872l173J47094o525j6824r849
23585a16102J17017J05847l3690P3226j06738r1340K8671J8214j07039O8758q5450
23574a28626L9131J8785J0266R1693R7198k0433j18277j5787K8562j084J09391
23563A10819J1768o5869j1307J09328N9842q9329j71698j75974J22191O6493R8789
23552F5053Q0460J2393Q6664j98746q8975M1098Q7080P741j28029k91223j57828
23541d84312Q8921J50233J45460J4934k5500j8398M9665r0973M8924M1620j23045
23530b02471O739O0251k5675m9506j01534J57103R7949J678n2063P8187J82621
23519A53279o8187k0243Q6247j6772n792J2236o7046J41487m5383j43430M7475
$$ plain form
23508 73871 49428 -82121 -172223 -189009 -108858 -83452 -5297 -29335 -54002 -60818 -46585 -9279
23496 -9279 131221 116383 -212762 -194611 -215566 -189538 -258153 -251352 -61469 9335 79774
23485 79774 265630 224606 99249 -28632 1622 -25553 -154151 3629 58917 -70708
23475 -70708 -12863 107004 165972 125225 2300 50022 110540 -60505 -215202 -104528 145084
23464 145084 174244 52897 -19572 13703 -41856 -44468 -66491 -167500 -30711 95674 59553
23453 59553 -41463 -159311 -179560 -39854 -9493 77762 13665 57322 68802 83721 58805
23442 58805 142459 223384 37671 8705 -67720 -104021 -65585 -56726 18430 35983 -36942 -168441
23430 -168441 -169119 -172973 -186240 -31925 167055 250684 378155 308379 115108 -142161 -189883
$$ packed form
23508G3871k4443j31549r0102j6786Q0151K5406P8155k4038k4667o816J4233L7306
23496i279J40500j4838l29145J8151k0955K6028o8615O801J89883P0804P0439
23485G9774J85856m1024j25357j27881L0254k7175j28598J57780N5288j29625
23475g0708N7845J19867N8968m0747j22925M7722O0518j71045j54697J10674K49612
23464A45084K9160j21347p2469L3275n5559k612k2023j01009J36789J26385l6121
23453E9553j01016j17848k0249J39706L0361Q7255o4097M3657J1480J4919k4916
23442E8805Q3654Q0925j85713k8966p6425l6301L8436Q859P5156J7553p2925j31499
23430a68441o78l854j3267J54315J98980Q3629J27471o9776j93271k57269m7722
$$ plain form
23419 -189883 -106918 -154434 -69462 -81135 -44162 -17993 103989 -16315 -61692 -217308 -299521
23408 -299521 -211151 -123315 43919 144339 145876 -67069 -4331 272756 132140 56923 87692
23397 87692 51107 7807 -76287 -140087 -157878 -97114 -657 130337 44228 9624 40395
23386 40395 -29291 -78212 -299674 -391859 -522761 -481860 -207461 -83799 -20453 10349 -138339
23375 -138339 -168802 -32795 -17820 -179847 -203670 -32713 175828 282835 157787 46198
23365 46198 -166957 -237750 -302521 -270898 -243503 -242214 -462539 -438247 -294303 -200665 -205506
23354 -205506 -215142 -215620 -171847 -197793 -28959 -41582 -15061 128346 167049 198378 179537 37787
23342 37787 52699 -56501 -144078 -162724 -37319 191151 130212 -21998 -104934 4923 -73711
$$ packed form
23419a89883Q2965m7516Q4972j1673L6973K6169J21982j20304m5377j55616q2213
23408b99521Q8370Q7836J67234J00420J537k12945O2738K77087j40616p5217L0769
23397H7692l6585m3300q4094o3800j7791O0764R6457J30994q6109l4604L0771
23386D0395o9686m8921k21462r2185j30902M0901K74399J23662O3346L0802j48688
23375a38339l0463J36007J4975j62027k3823J70957K08541J07007j25048j11589
23365D6198k13155p0793o4771L1623K7395J289k20325K4292J43944R3638m841
23354b05506r636m78M3773k5946J68834j2623K6521J43407L8703L1329j8841j41750
23342C7787J4912j09200q7577j8646J25405K28470o0939j52210q2936J09857p8634
$$ plain form
23331 -73711 -205995 -175640 -267317 -151347 -179691 -126854 -215715 56181 144504 -35101 131294
23320 131294 194603 203947 215239 187935 183366 36704 -71039 114241 170362 -30806 -111880
23309 -111880 -69256 25568 303771 371287 271467 63632 -24758 -106075 -316512 -156916 -76966
23298 -76966 39724 49433 47584 -19176 -33811 32081 -64295 -116148 40107 105179 300512
23287 300512 336076 71540 -6079 -3599 -149239 -168054 -104792 -120849 -124835 -54579 18055
23276 18055 -15216 20000 -98737 -174828 -322677 -364361 -183713 -47365 -39151 -105276 -139813
23265 -139813 -47483 229493 246330 354589 277256 172463 -49879 -113662 -80401 27022
23255 27022 -45544 -43 -107376 -19781 -118558 -65353 -105820 -155731 -320390 -316748 -212112
$$ packed form
23331g3711j32284L0355r1677J15970k8344N2837q8861K71896Q8323j79605J66395
23320A31294O3309R344J1292k7304m569j46662j07743J85280N6121k01168q1074
23309a11880M2624R4824K78203O7516r9820k07835q8390q1317k10437J59596P9950
23298g6966J16690R709j849o6760j4635O5892r6376n1853J56255O5072J95333
23287C00512L5564k64536p7619K480j45640j8815O3262j6057l986P0256P2634
23276A8055l3271L5216j18737p6091j47849m1684J80648J36348Q214o6125l4537
23265a39813R2330K76976J6837J08259p7333j04793k22342o3783L3261J07423
23255B7022p2566M5501j07333Q7595r8777N3205m0467m9911j64659L642J04636
$$ plain form
23244 -212112 -15383 135080 11596 44723 96667 114867 74783 114036 -27517 -86064 81619
23233 81619 193444 213722 95093 48775 -75615 -78566 65724 92261 118844 74309 12402
23222 12402 -65589 -14650 107590 126379 112391 46627 108850 -5322 -143656 -101418 -128608
23211 -128608 -34970 -57417 -70161 -64736 -132208 -105465 -8345 31045 9264 -47628 -126911 -100870
23199 -100870 -18444 53571 -81822 -99950 52035 69270 -63037 -148578 -109697 -69370 -167324
23188 -167324 -209798 -294263 -291684 -260288 -145397 -101637 -96405 39854 -14501 -104762 -89684
23177 -89684 46615 -9805 114577 186470 144039 2815 -64529 -48661 -63070 -236410 -259496
23166 -259496 -323756 -397137 -352062 -355965 -242051 -239754 -347474 -374674 -153202 -60724 71177
$$ packed form
23244b12112J96729J50463j23484L3127N1944J8200m0084L9253j41553n8547J67683
23233H1619J11825K0278j18629m6318j24390k951J44290K6537K6583m4535o1907
23222A2402p7991N0939J22240J8789j3988o5764O2223j14172j38334M2238k7190
23211a28608R3638k2447j2744N425o7472K6743R7120L9390k1781n6892p9283K6041
23199a00870Q2426P2015j35393j8128J51985J7235j32307q5541L8881M0327r7954
23188a67324m2474q4465K579L1396J14891M3760N232J36259n4355r0261J5078
23177h9684J36299n6420J24382P1893m2431j41224o7344J5868j4409j73340k3086
23166b59496o4260p3381M5075l903J13914K297j07720k7200K21472R2478J31901
$$ plain form
23155 71177 153835 134653 -15259 -72977 -31836 -93640 -78946 -83019 -135632 -179249 -329410
23144 -329410 -332032 -145595 -16980 50073 -11919 -35091 -44657 -32710 169057 266132 125880
23133 125880 -39583 -136308 -59948 12071 133881 231529 178555 -1 -72729 -41002 -115287
23122 -115287 -121633 -238639 -274431 -316525 -229527 -23182 73773 168003 224258 135426 145707
23111 145707 207379 142398 111206 27011 -24058 180915 274436 126210 93694 115737 88501
23100 88501 -89000 -245651 -225207 -321056 -380203 -168962 -132072 -68749 6567 10558 30100
23089 30100 748 -52588 66737 15515 -103715 -143178 -215326 -172676 -118684 -196288 -175782
23078 -175782 -119973 -173565 -137284 -37628 -36075 -104019 -81636 9486 65619 -191522 -311288
$$ packed form
23155G1177Q2658j9182j49912n7718M1141o1804J4694m073n2613m3617j50161
23144c29410k622J86437J28615O7053o1992k3172r566J1947K01767R7075j40252
23133A25880j65463r6725P6360P2019J21810R7648n2974j78556p2728L1727p4285
23122a15287o346j17006l5792m2094Q6998K06345R6955R4230N6255q8832J0281
23111A45707O1672o4981l1192q4195n1069K04973R3521j48226l2516K2043k7236
23100H8501j77501j56651K0444r5849n9147K11241L6890O3323P5316L991J9542
23089C0100k9352n3336J19325n1222j19230l9463p2148M2650N3992p7604K0506
23078a75782N5809n3592L6281R9656J553o7944K2383R1122N6133k57141j19766
$$ plain form
23067 -311288 -273447 -182118 -211953 -188565 -201388 -293106 -270963 -243814 -116083 -5146 -22927
23056 -22927 139027 180192 99302 45539 -27456 -120138 -16635 167374 14069 -150958 13813
23045 13813 241319 241114 168568 88577 -14188 151945 73454 7028 -129139 -209093 -450059
23034 -450059 -553491 -401789 -158393 -35456 -9443 77344 208340 252424 277204 172615
23024 172615 17506 -27956 -32177 -163665 -367517 -352942 -395972 -303651 -82717 -5448 86252
23013 86252 203207 153685 -29528 -134553 75610 201252 58058 -54434 -206438 -156837
23003 -156837 -173318 52921 223954 286385 204060 33430 -99759 -70142 -23121 -130268
22993 -130268 -303788 -298996 -245721 -199730 -49103 113574 192458 21358 -42236 40706 162609
$$ packed form
23067c11288L7841R1329k9835K3388j2823r1718K2143K7149J27731J10937j7781
23056b2927J61954M1165q0890n3763p2995r2682J03503J84009j53305j65027J64771
23045A3813K27506k05p2546p9991j02765J66133p8491o6426j36167p9954k40966
23034d50059j03432J51702K43396J22937K6013Q6787J30996M4084K4780j04589
23024A72615j55109m5462m221j31488k03852J4575m3030R2321K20934P7269R1700
23013H6252J16955m9522j83213j05025K10163J25642j43194j12492j52004M9601
23003a56837j6481K26239J71033O2431q2325j70630j33189K9617M7021j07147
22993a30268j73520M792N3275M5991J50627J62677P8884j71100o3594Q2942J21903
$$ plain form
22982 162609 134775 32594 43000 160652 59549 -115039 -216379 -178919 -37944 -33791
22972 -33791 131308 21034 -32084 -62410 -4755 20383 -70135 -141895 -288699 -270991 -231822
22961 -231822 -137641 -43374 130308 227769 156201 121388 102745 264196 222273 147764 -34971
22950 -34971 -240117 -234005 -120467 -80399 -147069 -184906 -124721 -84170 47750 96912 59352
22939 59352 62832 98007 82611 -112574 -74881 72141 130907 90326 241872 379562 204001
22928 204001 -7528 32781 161757 115489 -5350 -28376 -3413 -143423 -276051 -195945
22918 -195945 -193228 -171204 1903 12292 -67073 -161973 -129268 58235 204598 96548 102572
22907 102572 96010 10801 -287293 -383094 -300386 -156323 -131210 -123635 -179056 -160901 -78190
$$ packed form
22982A62609k7834j02181J0406J17652j01103j74588j01340L7460J40975M153
22972c3791J65099j10274n3118l0326N7655K5138r0518p1760j46804J7708L9169
22961b31822R4181R4267J73682R7461p1568l4813j8643J61451m1923p4509j82735
22950c4971k05146O112J13538M0068o6670l7837O0185M0551J31920M9162l7560
22939E9352L480L5175j5396j95185L7693J47022N8766m0581J51546J37690j75561
22928B04001k11529M0309J28976m6268j20839k3026K4963j40010j32628Q0106
22918a95945K717K2024J73107J0389p9365r4900L2705J87503J46363j08050O024
22907A02572o562q5209k98094r5801Q2708J44063K5113P575n5421J8155Q2711
$$ plain form
22896 -78190 -155606 -2944 118929 100963 -14686 -170714 -257585 -192316 38676 91329 81238
22885 81238 103864 54670 39729 99285 43966 -31168 27977 91550 122206 31846 55647 10162
22873 10162 -68839 -70089 59666 167525 108722 108098 232089 403661 444657 139847 -45513
22862 -45513 4699 -63202 -21960 -121875 -303561 -338261 -446214 -454657 -180669 -178607 -208603
22851 -208603 -81645 31315 12092 123506 213548 323864 176916 -15486 -172097 -156056
22841 -156056 -48966 171606 191370 104300 121613 190959 70000 -132761 -306791 -142652
22831 -142652 -12668 -120821 -89412 47726 5003 111353 229600 127262 92420 175604
22821 175604 219390 283107 248900 159589 177529 180422 139137 96757 91725 -88582 -196015
$$ packed form
22896g8190p7416J52662J21873j7966j15649j56028q6871O5269K30992N2653j0091
22885H1238K2626m9194j4941N9556n5319p5134N9145O3573L0656r0360K3801m5485
22873A0162p9001j250J29755J07859n8803o24J23991J71572M0996l04810j85360
22862d5513N0212o7901M1242r9915j81686l4700j07953q443K73988K062k9996
22851b08603J26958J12960j9223J11414R0042J10316j46948j92402j56611J6041
22841a56056J07090K20572J9764q7070J7313O9346j20959k02761j74030J64139
22831a42652J29984j08153L1409J37138m2723J06350J18247j02338l4842Q3184
22821A75604M3786O3717l4207q9311J7940K893m1285m2380n032j80307j07433
$$ plain form
22810 -196015 -366113 -261614 -127902 -90703 -84374 -86542 -129728 -238278 -141668 -57544 10753
22799 10753 1778 -210552 -245768 -114758 -83585 -223168 -175356 -179722 -245292 -189333 -110556
22788 -110556 -82615 -97744 -177793 -122664 -166049 -102689 -13929 -254830 -358177 -298126 -229910
22777 -229910 -83470 11683 -51649 -73438 -22764 206892 279890 247737 -5820 -117129 -140514
22766 -140514 -213482 -215928 -136671 -250398 -213976 10261 103204 11893 -142777 -110890 20901
22755 20901 156742 72675 -44551 -58454 -79541 -169574 -86724 -161460 -68828 -38820 76902
22744 76902 158866 243190 -18383 -48312 11022 33047 -454 -35738 -89168 -163963 -239626
22733 -239626 -198793 -158069 -35779 -72683 -253002 -180896 150376 98133 35131 21949 -163925
$$ packed form
22810a96015j70098J04499J33712L7199O329k168m3186j08550R6610Q4124O8297
22799A0753q975k12330l5216J31010L1173j39583M7812m366o5570N5959P8777
22788a10556K7941j5129q0049N5129m3385O3360Q8760k40901j03347O0051O8216
22777b29910J46440R5153o3332k1789N0674K29656P2998l2153k53557j11309k3385
22766a40514p2968k446P9257j13727L6422K24237R2943r1311j54670L1887J31791
22755B0901J35841q4067j17226j3903k1087r0033Q2850p4736R2632L0008J15722
22744G6902Q1964Q4324k61573k9929N9334K2025l3501l5284n3430p4795p5663
22733b39626M0833M0724J22290l6904j80319P2106L31272n2243o3002j3182j85874
$$ plain form
22722 -163925 -304180 -195839 -244090 -202343 19250 50325 6950 -23708 -153366 -123834 -92075
22711 -92075 -22725 -631 -48876 -82751 -135540 -327491 -273645 -142672 27009 26083 30925 -62425
22699 -62425 224 -55701 -185882 -175754 -133294 -52002 42636 105609 96507 68379 61638 36750
22687 36750 37222 -12600 30179 70284 -28922 -51504 -42163 74850 138656 85578 10073 -29365
22675 -29365 1710 31675 -11276 -27355 73433 134969 92976 34640 -139189 -301637 -235707
22664 -235707 -145689 -179418 -168963 -111912 -75175 -229663 -175717 -96355 -77748 -56881 -99348
22653 -99348 -168740 10392 231298 165930 71327 69193 -29697 -50499 10711 27325 35990 113376
22641 113376 273631 253070 135235 121440 38157 -72547 -176939 -346293 -278345 -200143
$$ packed form
22722a63925j40255J08341m8251M1747K21593L1075m3375l0658j29658K9532L1759
22711i2075O9350K2094m8245l3875n2789j91951N3846J30973J69681r26M842r3350
22699f2425O2649n5925j30181J0128M2460Q1292R4638O2973r102k8128o741k4888
22687C6750M72m9822M2779M0105r9206k2582R341J17013O3806n3078p5505l9438
22675b9365L1075K9965m2951j6079J00788O1536m1993n8336j73829j62448O5930
22664b35707R0018l3729J0455N7051L6737j54488N3946P9362J8607K0867m2467
22653i9348o9392J79132K20906o5368r4603k134r8890k0802O1210J6614Q665P7386
22641A13376J60255k0561j17835j3795q3283j10704j04392j69354O7948P8202
$$ plain form
22631 -200143 -134303 -54806 -200018 -168123 -19816 178583 343167 194439 -32166 -49052
22621 -49052 45553 126827 265174 187895 62362 103975 159520 159575 65268 34365 85107 107104
22609 107104 -69610 -1420 -68980 -192278 -44484 -26270 -57174 -142900 -198443 -21609 117187
22598 117187 130901 98644 -43766 -68185 -149669 -94789 19162 19057 -102614 20898 164061
22587 164061 89669 -2101 -55412 1363 104589 -47748 -71880 -25200 112179 148774 62180
22576 62180 225847 235177 353817 273969 -40725 -142923 -128264 -99276 5122 -77847 -60347
22565 -60347 -150010 -277528 -189854 -247338 -254669 -180481 -119726 -98427 -129805 -258937 -218281
22554 -218281 -202744 -80509 -881 -20373 -64639 -61407 48395 197446 220323 293479 175297
$$ packed form
22631b00143O5840P9497j45212L1895J48307J98399J64584j48728k26605j6886
22621d9052R4605Q1274J38347p7279j25533M1613N5545N5r4307l0903N0742K1997
22609A07104j76714O8190o7560j23298J47794J8214l0904q5726n5543J76834J38796
22598A17187J3714l2257j42410k4419q1484N4880J13951j05j21671J23512J43163
22587A64061p4392r1770n3311N6775J03226j52337k4132M6680J37379L6595q6594
22576F2180J63667R330J18640p9848l14694j02198J4659K8988J04398q2969J7500
22565f0347q9663j27518Q7674n7484p331P4188O0755K1299l1378j29132M0656
22554b18281J5537J22235P9628j9492m4266L232J09802J49051K2877P3156j18182
$$ plain form
22543 175297 95036 69411 35415 23369 -5965 -157729 -173199 -145498 -153855 -259450 -51815
22532 -51815 -53079 -45144 -218898 -297195 -287888 -288000 -232380 -308206 -390179 -272475 -210170 -307638
22520 -307638 -252768 -93094 -156938 -114060 -14475 -4076 -179584 -295497 -296443 -297674 -214475
22509 -214475 -114407 -60391 57544 234319 394214 414778 492551 455016 340718 360373
22499 360373 315142 194863 85325 -115204 -160644 3655 59089 63893 90833 109428 74562
22488 74562 -85755 -93530 96813 9341 -30814 -122642 11493 235992 170905 93940 50034
22477 50034 142463 11341 -40636 101683 88086 53030 -3307 -115618 -91586 57475 -19497
22466 -19497 2239 -65700 -113014 -171025 25163 277107 165719 -30597 -71399 -122269 -208140
$$ packed form
22543A75297q0261k5625l3996j2046k9334j51764j5470K7701q357j05595K07635
22532e1815j264P935j73754p8297R307j12N5620p5826q1973J17704O2305r7468
22520c07638N4870J59674o3844M2878R9585J0399j75508j15913r46j231Q3199
22509b14475J00068N4016J17935J76775J59895K0564P7773l7535j14298J9655
22499C60373m5231j20279j09538k00529m5440J64299N5434M804K6940J8595l4866
22488G4562j60317p775J90343q7472m0155r1828J34135K24499o5087p6965m3906
22477E0034R2429j31122n1977J42319j3597l5056n6337j12311K4032J49061p6972
22466a9497K1736o7939m7314n8011J96188K51944j11388j96316m0802n0870q5871
$$ plain form
22455 -208140 -92000 214624 363552 238507 83621 28222 225111 143988 -44306 -72065
22445 -72065 -7951 8418 -15030 -133087 -281987 -153773 -33984 169791 200443 252143 291988
22434 291988 382914 163810 103476 128386 -12838 -63382 -133369 27021 77984 113925 119955
22423 119955 -78789 -231087 -95525 4930 -36792 -42420 -133540 -113116 -63656 -72045 -85382
22412 -85382 -348706 -451921 -229052 -194344 -88299 -22776 -136456 -97323 121885 262669
22402 262669 134478 -14423 -88291 -20546 64767 44142 -100310 -182399 -67952 106114
22392 106114 232295 261558 234276 277046 283247 478508 578505 466208 311962 258149 155277
22381 155277 114306 166251 195899 264640 263296 217842 120281 55853 -35216 -27395 33479 -103062
$$ packed form
22455b08140J16140L06624J48928j25045j54886n5399J96889q1123j88294k7759
22445g2065O4114J6369k3448j18057j48900J28214J19789K03775L0652N1700L9845
22434B91988R0926k19104o0334K4910j41224n0544o9987J60390N0963L5941O030
22423A19955j98744j52298J35562J00455m1722n628r1120K0424M9460q389j3337
22412h5382k63324j03215K22869L4708J06045O5523j13680L9133K19208J40784
22402B62669j28191j48901p3868O7745Q5313k0625j44452q2089J14447J74066
22392A06114J26181K9263k7282M2770O201J95261R9997j12297j54246n3813j02872
22381A55277m0971N1945K9648O8741j344m5454r7561o4428r1069P821O0874j36541
$$ plain form
22369 -103062 26417 133419 186042 199617 36089 -37647 -20006 -21727 -27359 -89619 -78442
22358 -78442 -124159 -218542 -377274 -333413 -245436 -153039 50579 60804 64250 36985 -12125
22347 -12125 -207336 -222044 -115993 -133350 -139611 59883 16688 66356 107687 215500 118203
22336 118203 -69310 -202904 -241988 -181951 -154129 -93320 -89242 -137862 -37015 -19153 -70164
22325 -70164 -99030 -105514 -27786 -47543 -168174 -223912 -195256 -34076 -173069 -219621 40811
22314 40811 116717 27400 74971 220222 357695 411704 268891 -55752 -108959 -84966 17167
22303 17167 78538 225545 94697 -43484 33167 17422 155336 184149 258004 301421 255259
22292 255259 93182 161914 111702 87571 143488 44434 -3896 -57273 -148682 -229524 -178432
$$ packed form
22369a03062J29479J07002N2623J3575j63528p3736J7641j721n632o2260J1177
22358g8442m5717r4383j58732M3861Q7977R2397K03618J0225L446k7265m9110
22347a2125j95211j4708J06051j7357o261J99494m3195M9668M1331J07813r7297
22336A18203j87513j33594l9084O0037K7822O0809M078m8620J00847J7862n1011
22325g0164k8866o484P7728j9757j20631n5738K8656J61180j38993m6552K60432
22314D0811P5906q9317M7571J45251J37473N4009j42813l24643n3207K3993J02133
22303A7167O1371J47007j30848j38181P6651j5745J37914K8813P3855M3417m6162
22292B55259j62077O8732n0212k4131N5917r9054m8330n3377r1409q0842N1092
$$ plain form
22281 -178432 22922 173808 6258 -56496 -60695 122476 219160 68784 -67103 -138761
22271 -138761 -147383 -294796 -267985 -385170 -484944 -367588 -282583 -156118 -334449 -399053 -253722
22260 -253722 -225909 -89102 99605 156218 82833 -50846 -176888 -119293 -106373 -168505 -229245
22249 -229245 -66949 -2272 -224002 -180944 -230075 -22372 100300 74915 -89150 -205051
22239 -205051 -198073 -10944 8705 62012 38007 6207 20966 -40586 -189735 -116529 -79284
22228 -79284 -273150 -382506 -338031 -149055 40426 -17234 -61389 -85008 -157689 -214579 -168196
22217 -168196 -122304 89850 -67487 -222259 -254468 -272533 -257714 -374794 -385384 -335936 -269763
22206 -269763 -303161 -241788 -106270 68133 163934 123785 42050 32156 -146175 -76235 -48056
$$ packed form
22281a78432K01354J50886j67550o2754m199J83171R6684j50376j35887p1658
22271a38761q622j47413K6811j17185r9774J17356Q5005J26465j78331o4604J45331
22260b53722K7813J36807J88707N6613p3385j33679j26042N7595J2920o2132o0740
22249b29245J62296O4677k21730M3058m9131K07703J22672k5385j64065j15901
22239b05051O978J87129J9649N3307k4005l1800J4759o1552j49149P3206L7245
22228g9284j93866j09356M4475J88976J89481n7660m4155k3619p2681n6890M6383
22217a68196M5892K12154j57337j54772l2209j8065J4819j17080j0590M9448O6173
22206b69763l3398O1373J35518J74403R5801m0149q1735r894j78331O9940K8179
$$ plain form
22195 -48056 -42457 -27430 -234801 -351411 -122093 -82061 -51704 -24897 -62652 -152989 -67266
22184 -67266 -29026 -169026 -97166 131517 171391 179684 62580 -57377 -205390 -55757 -191673
22173 -191673 -411252 -408477 -282154 -192636 -301949 -400661 -424268 -315273 -225304 -235459 -246957
22162 -246957 -219342 -174866 -151969 -46271 -59414 -83138 -58673 -151727 -121272 -4458 -48694
22151 -48694 -135551 -108603 39107 -4319 -65145 61726 161189 173263 158137 91019 35108
22140 35108 43642 153234 106404 165405 148274 -3536 -75326 -145863 -83996 -45533 -26615
22129 -26615 -38592 71383 54235 30981 -37647 -108367 -152100 -125131 -178130 -368727 -307850
22118 -307850 -87857 -19286 30017 33821 -30212 -134810 -345009 -328146 -111543 -213296 -311022
$$ packed form
22195d8056N599J5027k07371j16610K29318M0032L0357K6807l7755r0337Q5723
22184f7266L8240j40000P1860K28683L9874Q293j17104j19957j48013J49633j35916
22173a91673k19579K775J26323Q9518j09313r8712k3607J08995Q9969j0155j1498
22162b46957K7615M4476K2897J05698j3143k3724K4465r3054L0455J16814m4236
22151d8694q6857K6948J47710m3426o0826J26871R9463J2074j5126o7118n5911
22140C5108Q534J09592m6830N9001j7131j51810p1790p0537O1867L8463J8918
22129b6615j1977J09975j7148k3254o8628p0720m3733K6969n2999j90597O0877
22118c07850K19993O8571M9303L804o4033j04598k10199J6863K16603j01753r7726
$$ plain form
22107 -311022 -347545 -254257 -156328 -57352 35087 80084 -64651 -74889 113242 73945 -129173
22096 -129173 -126789 -61965 -65622 -43892 -33712 56120 33110 -584 53768 64915 51551 -26572
22084 -26572 -62796 -145121 14398 285268 296491 65479 -87320 -126979 -97451 -149954 -197691
22073 -197691 -143207 -167235 -175786 -137931 -6933 55963 86461 126824 184787 162191 127084
22062 127084 27831 81954 90822 139973 213383 79684 94855 133132 185460 255769 343281
22051 343281 299526 195347 176309 109402 -2874 -126722 -249279 -160835 -85381 -210857
22041 -210857 -211863 -196390 -167435 -226104 -173487 -93152 3963 129209 130841 84948 55809 34778
22029 34778 75861 157289 83833 -173301 -202823 -127046 -149038 -244426 -192197 -127317 6401
$$ packed form
22107c11022l6523R3288R7929R8976R2439M4997j44735j0238J88131l9297k03118
22096a29173K384O4824l657K1730J0180Q9832k3010l3694N4352J1147j3364p8123
22084b6572l6224q2325J59519K70870J1223k31012j52799l9659K9528n2503m7737
22073a97691N4484k4028q551L7855J30998O2896L0498M0363N7963k2596l5107
22062A27084r9253N4123Q868M9151P3410j33699J5171L8277N2328P0309Q7512
22051C43281m3755j04179j9038o6907j12276j23848j22557Q8444P5454j25476
22041b10857j006J5473K8955n8669N2617Q0335R7115J25246J632m5893k9139k1031
22029C4778M1083Q1428p3456k57134k9522P5777k1992r5388N2229O4880J33718
$$ plain form
22018 6401 51387 92796 102750 -4482 -186687 11843 191280 224259 207483 271011 269741
22007 269741 128106 -48560 -133019 -164743 -147664 -51145 -95221 -152982 -138562 -114696 -201435
21996 -201435 -132509 -30007 -42318 45221 35881 33767 94910 164547 226033 250893 112635
21985 112635 86421 156118 406 -227679 -111913 2533 29264 -99378 -2419 85918
21975 85918 36264 -27562 59528 8474 852 58267 9492 130331 174584 123734 137717 169141
21963 169141 240291 89066 74730 53685 158092 302630 129987 31011 98208 195537 139939
21952 139939 -33306 -44493 -76548 -133866 -170384 -157505 -78521 5783 56560 127941 14648
21941 14648 -84692 -126623 -136046 -148371 -44400 58775 9924 168858 108389 25022 24057 135871
$$ packed form
22018F401M4986M1409R954j07232j82205J98530J79437L2979j6776O3528j270
22007B69741j41635j76666q4459l1724J7079R6519m4076n7761J4420K3866q6739
21996b01435O8926J02502j2311Q7539r340k114O1143O9637O1486K4860j38258
21985A12635k6214O9697j55712k28085J15766J14446K6731j28642R6959Q8337
21975H5918m9654o3826Q7090n1054p622N7415m8775J20839M4253n0850J3983L1424
21963A69141P1150j51225j4336k1045J04407J44538j72643r8976O7197R7329n5598
21952A39939j73245j1187l2055n7318l6518J2879P8984Q4304N0777P1381j13293
21941A4648r9340m1931r423j2325J03971J03175m8851J58934o0469q3367r65J11814
$$ plain form
21929 135871 50037 21832 75713 118802 115344 15786 -48072 -111545 -179857 -166155 -201538 -231842
21917 -231842 -100123 -66314 -76820 -11147 56233 -14265 -50894 25666 13013 182636 271307
21906 271307 324324 433853 425148 387724 286358 61441 -9104 -53255 -30322 -128828 -37138
21895 -37138 -30450 -139329 -194710 -139263 51951 14446 -53154 -264392 -269944 -172958 -198942
21884 -198942 -60470 -107824 -177787 -234825 -245577 -304276 -145048 22101 -1813 -73910 -55458
21873 -55458 46898 52409 164585 290310 96320 74485 -78096 -192587 -77608 -61856
21863 -61856 -75199 -9364 91571 79603 -74827 -127626 -166235 -95182 -135335 -147565 -260549
21852 -260549 -87377 167321 283088 94346 23779 12203 43164 48434 107318 -7440 -275097
$$ packed form
21929A35871q5834k8205N3881M3089l458r9558o3858o3473o8312J3702l5383l0304
21917b31842J31719L3809j0506O5673O7380p0498l6629P6560j2653J69623Q8671
21906B71307N3017J09529q705l7424j01366k24917p0545m4151K2933r8506R1690
21895c7138O688j08879n5381N5447J91214l7505o7600k11238n552R6986k5984
21884a98942J38472m7354o9963n7038j0752n8699J59228J67149k3914p2097J8452
21873e5458J02356N511J12176J25725j93990k1835j52581j14491J14979J5752
21863f1856j3343O5835J00935j1968j54430n2799l8609P1053m0153j2230j12984
21852b60549J73172K54698J15767j88742p0567j1576L0961N270N8884j14758k67657
$$ plain form
21841 -275097 -327879 -364097 -310168 -218384 -286999 -225347 -51219 68401 -99158 -371326 -296725
21830 -296725 -140271 -76752 -141059 -89658 -78973 -11395 117057 123484 42692 -85932 -89654
21819 -89654 83148 229437 165436 80991 162519 166562 261324 191575 60109 -84796 27760
21808 27760 231851 236387 102606 59094 18344 70243 132730 170775 166735 188148 115250 -119949
21796 -119949 -324806 -262477 -236978 -262784 -187327 -226610 -275702 -326307 -341714 -130159 -19895
21785 -19895 -185007 -194784 -207222 -213042 -255357 -158447 -207944 -110110 106064 44891 137875 90876
21773 90876 -47310 -127385 -42140 3198 -44267 21323 -6038 23701 -10311 -109980 -73185
21762 -73185 -33386 134198 60621 17448 -13210 -2277 53455 64666 121666 -4538 -168044
$$ packed form
21841b75097n2782l6218N3929R1784o8615O1652J74128J19620j67559k72168P4601
21830b96725J56454O3519o4307N1401J0685O7578J28452O427q0792j28624l722
21819h9654J72802J46289o4001q4445Q1528M043R4762o9749j31466j44905J12556
21808B7760K04091M536j33781m3512m0750N1899O2487L8045m040K1413p2898k35199
21796a19949k04857O2329K5499k5806P5457l9283m9092n0605j5407K11555J10264
21785a9895j65112r777j2438n820m2315R6910m9497R7834K16174o1173R2984m6999
21773I0876j38186q0075Q5245M5338m7465O5590k7361K9739l4012r9669L6795
21762g3185L9799J67584p3577m3173l0658J0933N5732J1211N7000j26204j63506
$$ plain form
21751 -168044 -140422 -146375 -94552 -21949 -91159 -58254 13145 58130 174752 274682 389597
21740 389597 292899 10442 33855 131896 213999 266633 362784 356004 279893 134678 112959
21729 112959 192672 133433 -32753 -27758 -76134 -51606 -30231 -110222 -270101 -202484 56606
21718 56606 182367 170969 1465 62504 103158 20905 51275 170517 97545 74919 101529
21707 101529 228746 232337 76290 -107964 -125459 -14706 160611 262533 289727 165886
21697 165886 -61457 -98513 -61530 102094 34552 -71172 -2801 -100335 -314672 -307753 -186350
21686 -186350 -210918 -306061 -160791 -72558 -98826 -147349 -122898 -99195 -71999 -38831 -69054
21675 -69054 -169292 -220779 -230864 -185980 16646 32464 -47462 -64487 89010 167259 119387
$$ packed form
21751a68044K7622n953N1823P2603o9210L2905P1399M4985J16622R9930J14915
21740C89597r6698k82457K3413R8041Q2103N2634R6151o780p6111j45215k1719
21729A12959P9713n9239j66186M995m8376K4528K1375p9991j59879O7617K59090
21718E6606J25761j1398j69504O1039M0654q2253L0370J19242p2972k2626K6610
21707A01529J27217L591j56047j84254j7495J10753J75317J01922K7194j23841
21697A65886k27343l7056L6983J63624o7542j05724O8371r7534k14337O919J21403
21686a86350k4568r5143J45270Q8233k6268m8523K4451K3703K7196L3168l0223
21675f9054j00238n1487j0085M4884K02626J5818p9926j7025J53497P8249m7872
$$ plain form
21664 119387 26825 82512 -3711 87360 29258 -124427 -228778 -149650 -201688 -263952 -209900
21653 -209900 -105551 -49155 -145310 -211535 -243709 -306634 -134318 -46405 -15041 -44124 43775
21642 43775 179496 195351 27227 121687 132108 -53114 498 111048 67389 -116120 -150596
21631 -150596 -201526 -226134 -155677 -211256 -256222 -250177 -238620 -252963 -305898 -237457 -256016 -333897
21619 -333897 -367327 -259542 -264326 -186258 -124885 -155726 -132317 -109683 -43441 -199033 -354621
21608 -354621 -339497 -187026 112057 260702 157728 -62057 -120328 38742 153855 241766
21598 241766 87035 -98324 -321063 -331269 -287846 -200660 -89854 -63439 -171168 -128463
21588 -128463 44583 196789 309864 353897 108087 -45802 -52919 -138472 10668 183262
$$ packed form
21664A19387r2562N5687q6223R1071n8102j53685j04351P9128n2038o2264N4052
21653b09900J04349N6396r6155o6225l2174o2925J72316Q7913L1364k9083Q7899
21642D3775J35721J5855j68124R4460J0421j85222N3612J10550m3659j83509l4476
21631a50596n0930k4608P0457n5579m4966O045J1557j4343n2935O8441j8559p7881
21619c33897l3430J07785m784P8068O1373l0841K3409K2634O6242j55592j55588
21608c54621J5124J52471K99083J48645j02974k19785n8271J59070J15113Q7911
21598B41766j54731j85359k22739j0206M3423Q7186J10806K6415j07729M2705
21588a28463J73046J52206J13075M4033k45810j53889p117q5553J49140J72594
$$ plain form
21578 183262 43599 114423 146809 72248 32045 -131133 -121774 -120363 -263104 -165252 64616
21567 64616 108534 176467 280535 115984 -115587 -83687 -99324 -114368 -156626 -181945 12863
21556 12863 50134 47050 237984 227104 152701 45500 -8660 61220 -62969 -87110 -191852
21545 -191852 -241688 -259580 -244790 -214384 -208698 -216121 -154637 69311 -74943 -366752 -243878
21534 -243878 -173783 -222990 -307125 -133384 -7772 28137 -90900 -139620 -114320 -149646 -5807
21523 -5807 145919 127155 161671 89297 -70511 -164139 -169905 -53465 -135705 -379738 -368504
21512 -368504 -368784 -197935 -58953 -13700 -111804 28786 55066 -11393 32313 57040 4039
21501 4039 -2012 30555 -53150 -97932 -258770 -308438 -287767 -328545 -200577 8719 54198
$$ packed form
21578A83262j39663P0824L2386p4561m0203j63178R359J411j42741R7852K29868
21567F4616M3918O7933J04068j64551k31571L1900j5637j5044m2258k5319J94808
21556A2863L7271l084J90934j0880p4403j07201n4160O9880j24189k4141j04742
21545a91852m9836j7892J4790L0406N686p423O1484K23948j44254k91809J22874
21534b43878P0095m9207q4135J73741J25612L5909j19037m8720K5300l5326J43839
21523e807J51726j8764L4516p2374j59808r3628n766J16440q2240k44033J1234
21512c68504k80J70849J38982M5253r8104J40590K6280o6459M3706K4727n3001
21501D039o051L2567q3705m4782j60838m9668K0671m0778J27968K09296M5479
$$ plain form
21490 54198 -71085 -70754 -174902 -299872 -246496 -62173 141167 226951 240080 181862 102229
21479 102229 22930 -65206 -189581 -385445 -218275 -84542 -48861 5068 15511 105674 -11007
21468 -11007 -253086 -401427 -267556 -234488 -307934 -190659 -130457 -39107 31918 -2043 -22385
21457 -22385 9960 -217236 -449215 -364369 -366197 -133363 -93772 -146197 -121078 -62012 -114114
21446 -114114 -132949 -293748 -371087 -345418 -315348 -209431 92772 94600 28900 -160086 -275796
21435 -275796 -177408 -86220 -89815 19084 135406 -9990 -136953 -209719 -179715 -9631 42013
21424 42013 -77932 -132606 -147862 -10639 -54251 -229507 33721 50232 -56834 -102503 -245437
21413 -245437 -305166 -162049 -66006 97492 3516 -126270 -65842 -170228 -281640 -256952
$$ packed form
21490E4198j25283L31j04148j24970N3376J84323K03340Q5784J3129n8218p9633
21479A02229p9299q8136j24375j95864J67170J33733L5681N3929J0443R0163j16681
21468a1007k42079j48341J33871L3068p3446J17275O0202R1350P1025l3961k0342
21457b2385L2345k27196k31979Q4846j828K32834L9591n2425K5119N9066n2102
21446a14114j8835j60799p7339K5669L0070J05917L02203J828o5700j88986j15710
21435b75796R8388R1188l595J08899J16322j45396j26963p2766L0004J70084N1644
21424D2013j19945n4674j5256J37223m3612j75256K63228J6511j07066m5669j42934
21413b45437n9729J43117R6043J63498r3976j29786O0428j04386j11412K4688
$$ plain form
21403 -256952 -182350 -227565 -178598 -206349 -91525 -123565 -79130 -38899 54283 67273 -69565
21392 -69565 -60052 -59684 -7577 56260 23147 -77741 -150247 -131713 5742 123100 225643
21381 225643 70573 -40885 -129600 -281230 -421774 -269187 14409 194553 76227 -18310
21371 -18310 3938 -22866 -23570 87699 -30735 -57769 -60295 -104638 -342439 -110347 98920
21360 98920 56016 -113887 -84529 -169678 -241125 -98726 -75296 -237200 -161725 -110694 -128822
21349 -128822 -123489 -19055 229939 120262 -52486 17140 134789 108196 -12670 -189060
21339 -189060 -229495 -134094 -29494 -156470 -344525 -247014 -140934 -127353 -11818 48408
21329 48408 -123473 -380619 -314202 -168138 -131973 17503 16533 -51559 -72362 -101111 -201132
$$ packed form
21403b56952P4602m5215M8967k7751J14824l2040M4435M0231R3182J2990j36838
21392f9565R513L68N2107O3837l3113j00888p2506J8534J37455J17358J02543
21381B25643j55070j11458q8715j51630j40544J52587K83596J80144j18326r4537
21371a8310K2248k6804p04J11269j18434k7034k526m4343k37801K32092K09267
21360I8920m2904j69903K9358q5149p1447J42399K3430j61904P5475N1031j8128
21349a28822N333J04434K48994j09677j72748O9626J17649k6593j20866j76390
21339a89060m0435R5401J04600j26976j88055R7511J06080J3581J15535O0226
21329D8408j71881k57146O6417J46064L6165J49476r70o8092k0803k8749j00021
$$ plain form
21318 -201132 -162834 -169092 -312172 -329098 -247942 -180288 -122757 -89772 16610 48123 61127
21307 61127 172278 124660 49729 -136054 -242797 -243194 -313157 -263493 -177151 10396 171399
21296 171399 25256 -38017 -135143 -181010 -99246 -80796 -159565 -151981 -170997 17739 80823
21285 80823 76646 -177993 -269242 -106799 -16104 -63464 -135673 -171008 -117612 -61518 -175584
21274 -175584 -174299 -71439 -89004 -265240 -175576 36972 -61304 -103542 -82002 -73465 15025
21263 15025 46660 -58064 -186550 -325212 -215449 -353116 -315558 -130797 3321 34799
21253 34799 49435 12716 -148156 -311447 -281202 -366808 -140275 -40759 -29284 3460 -10930
21242 -10930 24079 -24942 -100508 -122954 -190357 -316433 -214562 -150413 -165449 -171552 -128719
$$ packed form
21318b01132L8298o258j43080j6926Q1156O7654N7531L2985J06382L1513J3004
21307F1127J11151m7618p4931j85783j06743l97o9963M9664Q6342J87547J61003
21296A71399j46143o3273r7126m5867Q1764J8450p8769P584j9016J88736O3084
21285H0823m177k54639r1249J62443R0695m7360p2209l5335N3396N6094j14066
21274a75584J285J02860j7565j76236Q9664K12548r8276m2238K1540Q537Q8490
21263A5025L1635j04724j28486j38662J09763j37667L7558J84761J34118L1478
21253C4799J4636l6719j60872j63291L0245q5606K26533R9516J1475L2744j4390
21242a0930L5009m9021p5566k2446o7403j26076J01871O4149j5036o103M2833
$$ plain form
21231 -128719 -122861 -137750 -247791 -342361 -439195 -386795 -284409 -169539 -297582 -184431 9151
21220 9151 154274 97278 -27576 -127616 -191120 -287038 -269231 -180679 -151026 -158191 -2476
21209 -2476 -100229 -76655 -37452 -64372 40319 42828 50045 202473 200257 255339 231039 126566
21197 126566 -33954 -133605 -217356 -97434 -23747 -142194 -187750 -180240 -120905 -149276 101777
21186 101777 236320 156338 120787 240456 188786 251707 210889 129761 -6452 -62526 13997
21175 13997 -4359 131936 252723 141439 26664 -131223 -89891 -25140 87123 -23556
21165 -23556 -49342 -34070 -53807 -255671 -290992 -138822 -165999 -267699 -112885 -119324 -94870
21154 -94870 -60883 -85645 -92655 -15294 -67882 -139357 -196244 -241605 -178451 -144044 -223602 -80886
$$ packed form
21231a28719N858j4889j10041r4570r6834N2400J02386J14870j28043J13151J93582
21220I151J45123n6996j24854j00040o3504r5918J7807Q8552K9653p165J55715
21209b476r7753K3574L9203k6920J04691K509P217J52428k216N5082k4300j04473
21197A26566j60520r9651q3751J19922P3687j18447m5556P510N9335k8371K51053
21186A01777J34543p9982l5551J19669n1670O2921m0818q1128j36213n6074P6523
21175A3997j8356J36295J20787j11284j14775j57887M1332O4751J12263j10679
21165b3556k5786J5272j9737k01864l5321J52170k7177j01700J54814o439K4454
21154i4870L3987k4762p010P7361n2588p1475n6887m5361O3154L4407p9558J42716
$$ plain form
21142 -80886 -17441 -34991 -108017 -91920 42907 55147 -857 -75497 29074 -76058 -139557
21131 -139557 -165106 -222101 -157018 -56270 -15465 63971 62240 71226 263613 144718 55637
21120 55637 147892 183626 262297 368342 278583 194846 228826 313802 296631 293857 342720 518847
21108 518847 595113 776056 866297 1165724 1337193 1356262 1382203 1174575 890645 624326
21098 624326 335495 252619 436904 435222 308527 75352 71307 128171 62200 25324 -118188
21087 -118188 -206105 -315480 -398355 -278086 -241852 -252699 -177734 -145908 -183682 -128095 -19948
21076 -19948 -145926 -323775 -353800 -265921 -80019 96023 220490 184620 -13255 -16549 -28157
21065 -28157 9232 -62514 -117084 -44217 5294 80479 27093 94181 -50820 -413939 -477604
$$ packed form
21142h0886O3445j7550p3026J6097J34827J2240n6004p4640J04571j05132o3499
21131a39557k5549n6995O5083J00748M0805P9436j731Q986J92387j18895q9081
21120E5637R2255L5734P8671J06045q9759q3737L3980Q4976j7171k774M8863J76127
21108E18847P6266J80943R0241K99427J71469J9069K5941k07628k83930k66319
21098F24326k88831q2876J84285j682j26695k33175m045N6864o5971l6876j43512
21087a18188q7917j09375q2875J20269L6234j0847P4965L1826l7774N5587J08147
21076a9948j25978j77849l0025Q7879J85902J76042J24467l5870j97875l294j1608
21065b8157L7389p1746n4570P2867M9511P5185n3386O7088j45001l63119o3665
$$ plain form
21054 -477604 -383183 -193987 -22826 2079 -43261 -236035 -279157 -68108 -36467 -177451
21044 -177451 -182661 -228723 -246349 -125373 -49731 -70775 -48393 -105557 -56899 143 59598
21033 59598 -23725 -117792 -228354 -142044 -116640 -48890 125222 84226 -122788 -185821 -354796
21022 -354796 -212780 -164002 -138766 -208653 -281006 -135465 -170178 -155989 -28252 -62034 -78903
21011 -78903 -29996 97546 82162 -14800 -139661 -178891 -293049 -135421 -5237 43217 245666
21000 245666 356878 324939 243661 149849 -38777 -78351 -64849 -46070 86493 27724 -81834
20989 -81834 -39856 -3354 112499 149769 16360 -100411 -122733 -163275 -67772 42412 364
20978 364 -41068 48022 150259 128061 136373 83868 101060 145214 -20613 -4775 -57237 -73176
$$ packed form
21054d77604R4421J89196J71161K4905m5340j92774m3122K11049L1641j40984
21044a77451n210m6062j7626J20976P5642k1044K2382n7164M8658N7042N9455
21033E9598q3323r4067j10562Q6310K5404O7750J74112m0996k07014o3033j68975
21022c54796J42016M8778K5236o9887p2353J45541l4713J4189J27737l3782j6869
21011g8903M8907J27542j5384r6962j24861l9230j14158J57628J30184M8454K02449
21000B45666J11212l1939q1278r3812j88626l9574J3502J8779J32563n8769j09558
20989h1834M1978L6502J15853L7270j33409j16771k2322m0542R5503J10184m2048
20978C64m1432Q9090J02237k2198Q312n2505J7192M4154j65827J5838n2462j5939
$$ plain form
20966 -73176 51856 82555 8605 -73069 -14402 -4123 -23253 -35782 -55720 11318 14074 62261
20954 62261 -165953 -312551 -173945 -160372 -105486 -48926 -227069 -407337 -489440 -296488
20944 -296488 -231657 -83796 52709 18928 15326 2462 -109749 -199677 -153645 -13665 56077
20933 56077 94527 152659 113565 84635 -8785 -74203 -124561 -179420 -85799 132192 238657
20922 238657 113125 182651 377695 329658 101042 -46287 -148221 -71341 -107888 21664
20912 21664 109826 198691 169842 34641 -134826 -19654 -34938 -115018 -66039 54923 176525
20901 176525 253304 93688 18699 -122289 72397 213465 27132 -100435 -44523 720
20891 720 44194 3287 -71492 -66004 -47157 -58489 -47054 -183279 -189429 -67473 -57291 -120080
$$ packed form
20966g3176J25032L0699p3950q1674N8667J0279j9130j2529j9938O7038K756M8187
20954F2261k28214j46598J38606J3573N4886N6560j78143j80268q2103J92952
20944b96488O4831J47861J36505l3781l602j2864j12211q9928M6032J39980O9742
20933E6077L8450N8132l9094k8930r3420o5418n0358n4859R3621K17991J06465
20922B38657j25532O9526J95044m8037k28616j47329j01934P6880l6547J29552
20912B1664Q8162Q8865k8849j35201j69467J15172j5284q0080M8979J20962J21602
20901A76525P6779j59616p4989j40988J94686J41068j86333j27567N5912M5243
20891G20M3474m0907p4779N488J8847j1332J1435j36225o150J21956J0182o2789
$$ plain form
20879 -120080 -113087 -86897 85435 28954 72039 -5361 161949 350735 489226 493871 565959
20868 565959 684495 711552 528510 461560 291796 251898 290608 401333 485337 569567 466181
20857 466181 537265 628622 495749 487213 311426 69805 75502 155879 128576 150351 182514
20846 182514 266616 325561 221430 180445 174025 204802 63315 195179 313903 331274 366741
20835 366741 259558 154963 97571 -40674 19994 31930 -83367 -150871 -248547 -61609
20825 -61609 -10641 30717 -165624 -303082 -122776 66785 91166 11980 128550 226587 224531
20814 224531 247555 232747 58827 -64495 -33693 -45596 39203 74132 168424 302887 267194
20803 267194 162996 -32862 -180032 -132532 -70937 -141782 -104569 -138963 -11391 -4554 76155
$$ packed form
20879a20080O993K6190J72332n6481M3085p7400J67310J88786J38491M645P2088
20868E65959J18536K7057j83042o6950j69764l9898L8710J10725Q4004Q4230j03386
20857D66181P1084R1357j32873q536j75787k41621N697Q0377k7303K1775L2163
20846A82514Q4102N8945j04131m0985o420L0777j41487J31864J18724J7371L5467
20835C66741j07183j04595n7392j38245O0668J1936j15297o7504r7676J86938
20825f1609N0968M1358j96341j37458J80306J89561K4381p9186J16570R8037k056
20814B24531K3024j4808j73920j23322L0802j1903Q4799L4929R4292J34463l5693
20803B67194j04198j95858j47170M7500O1595p0845L7213l4394J27572O837Q0709
$$ plain form
20792 76155 30974 58080 14149 -60050 -163189 -162451 -88521 -68773 -137754 -59460 47923 -124763
20780 -124763 -255662 -312105 -281248 -250206 -33516 -48512 -18546 53259 -7805 -108357 -136049
20769 -136049 -22584 -59335 53535 108052 52755 -58184 -104376 20984 74436 -82611
20759 -82611 -66967 -19906 -41408 58610 62665 27602 16771 -59685 -62952 -16553 -142567 -169429
20747 -169429 17416 159249 34900 -64132 82173 139650 69300 138192 87358 223333
20737 223333 191692 158777 187645 175605 50392 60132 70426 150221 203850 68204 138687
20726 138687 55332 98920 147528 -25321 -31089 -26485 -45738 -94276 5861 110789 128985
20715 128985 78234 139992 71035 128015 -62457 -81282 -134832 -344178 -215452 -36464 -13353
$$ packed form
20792G6155m5181K7106m3931p4199j03139P38P3930J9748o8981P8294J07383j72686
20780a24763j30899n6443L0857L1042K16690j4996K9966P1805o1064j00552k7692
20769a36049J13465l6751J12870N4517n5297j10939m6192J25360N3452j57047
20759h2611J5644M7061k1502J00018M055l5063j0831p6456l267M6399j26014k6862
20747a69429J86845J41833j24349r9032J46305N7477p0350O8892n0834J35975
20737B23333l1641l2915K8868j2040j25213R740J0294P9795N3629j35646P0483
20726A38687q3355M3588M8608j72849n768M604j9253m8538J00137J04928J8196
20715A28985n0751O1758o8957N6980j90472j8825n3550k09346J28726J78988K3111
$$ plain form
20704 -13353 -100622 -74295 34606 40988 114269 140948 95158 135701 21840 -48298 133470
20693 133470 175115 227131 233615 148859 18105 -12472 -19584 -41917 -172123 -291522 -269664
20682 -269664 -28883 10144 -76843 -83923 -49671 90210 269758 262424 150251 93854 28735
20671 28735 -31438 -40645 -78073 -66770 -1066 52661 130429 171132 254929 336216 346980 267484
20659 267484 162543 89501 162988 114666 189657 179734 153040 130819 6051 153944 183435
20648 183435 85563 109113 154331 183590 103752 245580 300708 253763 330178 576932 739347
20637 739347 846192 1097929 1496549 1773022 1878348 1895404 1822893 1624448 1449738 1097672
20627 1097672 925971 790663 684628 774039 1172935 1714292 1840630 1926408 2085649 1850992
$$ packed form
20704a3353q7269K6327J08901O382P3281K6679m5790M0543j13861p0138J81768
20693A33470M1645N2016O484q4756j30754l0577p112k2333j30206j19399K1858
20682b69664K40781L9027q6987p080L4252J39881J79548p334j12173n6397o5119
20671B8735o0173r207l7428J1303O5704N3727P7768M0703Q3797Q1287J0764p9496
20659B67484j04941p3042P3487m8322P4991r923k6694k2221j24768J47893K9491
20648A83435r7872K3550M5218K9259p9838J41828N5128m6945P6415K46754J62415
20637G39347J06845K51737L98620K76473J05326J7056p2511j98445j74710l52066
20627A097672j71701j35308j06035Q9411L98896N41357J26338Q5778J59241k34657
$$ plain form
20617 1850992 1617078 1312022 883507 688055 657094 485841 357821 302343 78425 -161631
20607 -161631 -259527 -97261 134790 76689 83681 176529 107887 109008 113539 81710 84650 119169
20595 119169 141124 126359 91524 132285 -14091 -105975 -86050 -83560 -17491 183131 136914
20584 136914 163142 106446 25957 67096 -41707 -64007 -13405 -19878 181714 300010 159928
20573 159928 88371 93800 302445 259398 187656 132724 156899 100736 90696 259793 281355
20562 281355 126851 -116175 -156267 -55520 3623 73759 341863 544981 221737 85761
20552 85761 220493 236322 284933 422001 548250 437641 379263 615888 765806 805585
20542 805585 749231 756897 837230 1214970 1488753 1820093 2263712 2745844 3201272 3584839
$$ packed form
20617A850992k33914l05056m28515j95452l0961j71253j28020n5478k23918k40056
20607a61631r7896J62266K32051n8101O992R2848o8642J121M531l1829K940L4519
20595A19169K1955j4765l4835M0761j46376r1884J9925K490O6069K00622m6217
20584A36914K6228n6696q0489M1139j08803k2300N0602o473K01592J18296j40082
20573A59928p1557N429K08645m3047p1742n4932K4175n6163j0040J69097K1562
20562B81355j54504k43026m0092J00747N9143P0136K68104K03118l23244j35976
20552H5761J34732J5829M8611J37068J26249j10609n8378K36625J49918L9779
20542H05585n6354P666Q0333L77740K73783L31340M43619M82132M55428L83567
$$ plain form
20532 3584839 3594644 3511542 3445461 3254103 3168833 3434128 4048831 4425083 4987205 5609344
20522 5609344 6453612 7428867 9199039 12035316 16695110 23279774 32163588 44897556
20514 44897556 66109681 105566971 169589265 219535110 233806035 246900509 238703026
20507 238703026 190472518 134228657 87771498 57427152 40315300 30004068 23088166
20500 23088166 18364801 15134199 12993149 11563863 10050008 8915471 8010323 7023771
20492 7023771 6113835 5396732 5189158 5298106 5272726 5421378 5317691 4732119 4242343 3607613
20482 3607613 2981590 2545650 2134078 1796399 1575709 1355355 1291810 1327319 1154654 1057011
20472 1057011 1029018 1007042 1161380 1150490 1055403 975988 1047365 991903 847674 793347 628751
$$ packed form
20532C584839R805q3102o6081j91358q5270K65295O14703L76252N62122O22139
20522E609344Q44268R75255J770172K836277M659794O584664Q883814J2733968
20514D4897556K1212125L9457290O4022294M9945845J4270925J3094474q197483
20507B38703026m8230508n6243861m6457159l0344346j7111852j0311232o915902
20500B3088166m723365l230602k141050j429286j513855j134537r05148r86552
20492G023771r09936p17103k07574J08948k5380J48652j03687n85572m89776o34730
20482C607613o26023m35940m11572l37679k20690k20354o3545L5509j72665r7643
20472A057011k7993k1976J54338j0890r5087p9415P1377n5462j44229n4327j64596
$$ plain form
20461 628751 601181 534794 728018 750275 806878 782177 771019 600496 457811 369068 502614
20450 502614 641694 648927 316012 334784 511738 544322 659941 603294 514200 519470 608925
20439 608925 458544 119725 141342 281314 352224 401504 210335 122870 267408 209834
20429 209834 52370 138459 148121 192870 378452 276090 113526 205153 184031 96806 96027
20418 96027 33360 120852 33417 -112383 -52466 19734 13586 155337 149684 152426 218704 135623
20406 135623 85177 167097 288052 338420 324390 193664 109473 74639 126623 333321 396842
20395 396842 461771 463041 392613 148674 88460 261310 189181 361379 474884 477885 366236
20384 366236 388550 396153 382369 212047 139412 152931 -12932 -60107 -3472 -20366 13619
$$ packed form
20461F28751k7570o6387J93224K2257N6603k4701j1158j70523j42685q8743J33546
20450E02614J39080P233l32915J8772J76954L2584J15619n6647q9094N270Q9455
20439F08925j50381l38819K1617J39972P0910M9280j91169q7465J44538n7574
20429B09834j57464Q6089R662M4749J85582j02362j62564R1627k1122q7225p79
20418I6027o2667Q7492q7435j45800N9917P2200o148J41751n653K742O6278q3081
20406A35623n0446Q1920J20955N0368j4030j30726q4191l4834N1984K06698O3521
20395C96842O4929J270p0428k43939o0214J72850p2129J72198J13505L001j11649
20384C66236K2314P603j3784j70322p2635J3519j65863m7175N6635j6894L3985
$$ plain form
20373 13619 47890 -144 -16061 45551 194026 225705 252792 215734 270471 434829 347749
20362 347749 316829 408230 420932 563137 711103 808169 977680 988510 1215226 1292055 1246305
20351 1246305 1314349 1598118 1794821 1951024 1999216 2001058 2294233 2651747 3010325 3573663
20341 3573663 4093346 4483257 5267046 6415200 7397294 9098477 11793898 15406155 20476576
20332 20476576 28801035 44197364 70965446 98579416 107378607 108746394 117101049 115792755
20324 115792755 95705453 72606443 54905246 46062585 45641897 54910676 76960009
20317 76960009 104035369 114203759 113216477 117665213 115883040 95404606 69047131 46290171
20309 46290171 31048905 22256140 17157996 13849015 11671751 10172528 8829031 7641555
$$ packed form
20373A3619L4271m8034j5917O1612J48475L1679K7087l7058N4737J64358q7080
20362C47749l0920R1401J2702J42205J47966R7066J69511J0830K26716P6829m5750
20351A246305O8044K83769J96703J56203M8192J842K93175L57514L58578N63338
20341C573663N19683L89911P83789J148154R82094J701183K695421L612257N070421
20332B0476576Q324459J5396329K6768082K7613970Q799191J367787Q354655j308294
20324A15792755k0087302k3099010j7701197q842661m20688R268779K2049333
20317G6960009K7075360J0168390r87282M448736j782173k0478434k6357475k2756960
20309D6290171j5241266q792765n098144l308981k177264j499223j343497j187476
$$ plain form
20301 7641555 6822529 6025599 5493768 5071380 4508371 3984085 3614865 3285605 3006719
20292 3006719 2674642 2311189 2182655 2179477 2045421 1850349 1648196 1388139 1337044 1299075
20282 1299075 1280498 1096311 1160755 1107792 955375 821377 829752 808743 817161 826372 884194
20271 884194 807875 700855 690055 794117 646782 626401 558982 636370 647838 591436 557356
20260 557356 671963 713097 568299 432644 445246 622550 756197 786551 845493 1033603
20250 1033603 1304597 2058424 2978426 3752200 4074924 4421286 4307466 3431264 2566085
20241 2566085 1733103 1164805 838454 650275 764042 829496 552661 232321 294488 404044
20231 404044 343497 336529 375570 234929 144162 417528 479174 544702 583991 535770 543315
$$ packed form
20301G641555q19026p96930n31831m22388n63009n24286l69220l29260k78886
20292C006719l32077l63453j28534l178j34056j95072k02153k60057n1095l7969
20282A299075j8577j84187O4444n2963j52417j33998Q375k1009Q418R211N7822
20271H84194p6319j07020j0800J04062j47335k0381o7419P7388J1468n6402l4080
20260E57356J14607M1134j44798j35655J2602J77304J33647L0354N8942J88110
20250A033603K70994P53827R20002P73774L22724L46362j13820q76202q65179
20241B566085q32982n68298l26351j88179J13767O5454k76835l20340O2167J09556
20231D04044o0547o968L9041j40641r0767K73366O1646O5528L9289m8221P545
$$ plain form
20220 543315 362226 208023 122091 -143958 -100079 77405 105568 20870 80044 208813
20210 208813 318259 435748 330549 316451 323701 191319 182513 329198 287128 29180 -177306
20199 -177306 -131092 -27358 125590 263692 245702 195242 241752 232716 129822 -27468 -178871
20188 -178871 -114029 -40051 -223108 -404596 -221469 -17865 42131 117322 85183 231035
20178 231035 78905 -34360 2677 -23625 25329 121792 159251 69625 43608 140512 148281
20167 148281 185719 113506 133243 349930 465991 476747 283912 67240 34490 108960 103216
20156 103216 166842 331982 295095 78159 199746 293944 251454 331258 385600 284981 210394
20145 210394 136121 15141 214530 445528 454883 391931 409130 302266 67760 169456
$$ packed form
20220E43315j81089j54203q5932k66049M3879J77484K8163q4698N9174J28769
20210B08813J09446J17489j05199j4098P250j32382q806J46685m2070k57948k06486
20199a77306M6214J03734J52948J38102j7990n0460M6510r036j02894j57290j51403
20188a78871O4842P3978j83057j81488J83127K03604N9996P5191l2139J45852
20178B31035j52130j13265L7037k6302M8954R6463L7459q9626k6017R6904P769
20167A48281L7438p2213J9737K16687J16061J0756j92835k16672l2750P4470n744
20156A03216O3626J65140l6887k16936J21587R4198m2490P9804N4342j00619p4587
20145B10394p4273j20980J99389K30998R355o2952J7199j06864k34506J01696
$$ plain form
20135 169456 279303 208044 102889 98628 -10344 4167 68166 122830 29094 -78225 -236803
20124 -236803 -297830 -197666 -72089 -72488 -88510 -106552 -220582 -190335 -145177 -124670 -99319
20113 -99319 167265 285967 178695 -31637 3696 -12437 28306 116464 132873 -63771 -138396
20102 -138396 -127876 -106436 59188 69989 -139315 -173803 -233222 -308892 -223269 -174127 -63870
20091 -63870 -89028 -152111 -157413 18439 91728 53008 53497 49251 -159045 -233549 -92307 133568
20079 133568 13119 -70728 17143 -65149 16515 40019 33870 28720 -52323 -107359 -88686 10188
20067 10188 -715 -2793 32158 -4552 10421 -6731 -18000 73567 90230 4466 -58426 -55371
20055 -55371 178550 187263 33670 104881 211797 256821 192617 72310 -123805 -105828 42457
$$ packed form
20135A69456J09847p1259j05155m261j08972J4511O3999N4664r3736j07319j58578
20124b36803o1027J00164J25577l99j6022j8042j14030L0247M5158K0507K5351
20113i9319K66584J18702j07272k10332L5333j6133M0743Q8158J6409j96644p4625
20102a38396J0520K1440J65624J0801k09304l4488n9419p5670Q5623M9142J10257
20091f3870k5158o3083n302J75852P3289l8720M89m246k08296p4504J41242K25875
20079A33568j20449q3847Q7871q2292Q1664K3504o149n150q1043n5036J8673R8874
20067A0188j0903k078L4951l6710J4973j7152j1269R1567J6663q5764o2892L055
20055e5371K33921Q713j53593P1211J06916M5024o4204j20307j96115J7977J48285
$$ plain form
20044 42457 46827 -137565 -278945 -117002 -13547 87553 127068 100833 -47189 -102042 116869
20033 116869 232687 52382 11240 20270 -139666 -199320 -205149 -157244 -209317 -142571 1268
20022 1268 -17483 -12815 -311336 -306543 -183474 -40068 198189 204743 -61736 -139326 12833
20011 12833 145320 277168 143400 -101094 -100479 -72268 -87022 -148244 -235983 -102331 -24231
20000 -24231 36525 188107 206269 8573 40807 194167 161854 197649 176541 77499 87639
19989 87639 139846 160292 134590 28608 182084 254652 150367 -30529 -16200 -49438 -23484
19978 -23484 -153710 -222930 -146407 -32179 54476 -5271 -15895 19907 -17799 -53981 -140
19967 -140 -117590 -62003 -121034 -161481 -23371 45673 -102140 -177800 -118856 38869 -75790
$$ packed form
20044D2457M370j84392j41380J61943J03455J01100L9515k6235j48022n4853K18911
20033A16869J15818j80305m1142R030j59936n9654n829M7905n2073O6746J43839
20022A268j8751M668k98521M793J23069J43406K38257O554k66479p7590J52159
20011A2833J32487J31848j33768k44494O15K8211j4754o1222q7739J33652P8100
20000b4231O0756J51582J8162j97696L2234J53360l2313L5795k1108r9042J0140
19989H7639N2207K0446k5702j05982J53476P2568j04285j80896J4329l3238K5954
19978b3484j30226o9220P6523J14228Q6655n9747j0624L5802l7706l6182N3841
19967a40j17450N5587n9031m0447J38110O9044j47813p5660N8944J57725j14659
$$ plain form
19956 -75790 -85570 77453 -136881 -99742 -53567 -31976 27886 44853 -48822 -47072 -78636 83315
19944 83315 260318 115141 101990 122763 31581 -114407 -208974 -248323 -107859 24473 -118299
19933 -118299 -47600 150926 150034 78514 100046 126576 248760 94328 -53641 -76589 30508
19922 30508 57934 218014 307092 125946 4964 84409 -119925 -16693 136803 160337
19912 160337 496950 837356 1040578 1222796 1461947 1375973 948088 592243 434421 196377
19902 196377 138680 234429 216023 232242 119797 159796 77271 -30221 -9119 -51832 -71151
19891 -71151 -110673 -202220 -98759 28059 135807 100749 248483 279582 98209 143434 184650
19880 184650 50399 -185427 -226808 -269098 -201787 -207927 -147382 -108276 32773 137093 -2894
$$ packed form
19956g5790r780J63023k14334L7139M6175K1591N9862J6967r3675J750l1564J61951
19944H3315J77003j45177j3151K0773r1182j45988r4567l9349J40464J32332j42772
19933a18299P0699J98526q92p1520K1532K6530J22184j54432j47969k2948J07097
19922C0508K7426J60080Q9078j81146j20982P9445k04334J03232J53496K3534
19912A60337L36613L40406K03222J82218K39151q5974m27885l55845j57822k38044
19902A96377n7697R5749j8406J6219j12445L9999q2525j07492K1102m2713j9319
19891g1151l9522r1547J03461J26818J07748l5058J47734L1099j81373M5225M1216
19880A84650j34251k35826m1381m2290O7311o140O0545L9106J41049J04320j39987
$$ plain form
19869 -2894 -236778 -192038 -211773 -147958 -15427 95137 98716 108579 59937 -25493 -30027 -16552
19857 -16552 -166826 -191299 -274682 -362700 -165348 -36466 116032 47077 -148742 -302696
19847 -302696 -330096 -333509 -163223 -54188 -40490 -57197 -27549 164689 247026 156128 193799
19836 193799 82506 48129 5164 55503 -29415 -191187 -223218 -129611 -95004 -82206 -24075
19825 -24075 12289 -91449 -150117 -204200 -177209 -12953 97056 74129 -259341 -303556 -154830
19814 -154830 -29662 132960 134250 -37397 -102987 -153640 -258402 -243007 -253613 -239567 -247045
19803 -247045 -162606 -59262 -6161 20005 79230 130400 23827 -158928 -175599 -72970 142986
19792 142986 199523 -32886 -110011 -73590 40548 202617 393589 395305 225900 290824 644621
$$ packed form
19869b894k33884M4740j9735O3815J32531J10564L579R863m8642q5430m534J3475
19857a6552j50274k4473q3383q8018J97352J28882J52498o8955j95819j53954
19847c02696k7400l413J70286J09035J3698j6707K9648J92238Q2337r0898L7671
19836A93799j11293l4377m2965N0339q4918j61772l2031R3607L4607J2798N8131
19825b4075L6364j03738n8668n4083K6991J64256J10009k2927l33470m4215J48726
19814a54830J25168J62622J290j71647o5590n0653j04762J5395j0606J4046p478
19803b47045Q4439J03344N3101K6166N9225N1170j06573j82755j6671J02629K15956
19792A42986N6537k32409p7125L6421J14138J62069J90972J716j69405O4924L53797
$$ plain form
19781 644621 839378 666725 650584 640685 480050 309263 187117 75113 192788 468798
19771 468798 668944 540698 506015 584610 778358 766417 585629 447649 239491 158268
19761 158268 236603 193100 23862 -49743 38015 16581 -106210 -103434 -196491 -408116 -264417
19750 -264417 -214100 -394507 -254563 -252442 -212962 -355707 -383558 -392403 -289675 -62588 16169
19739 16169 92953 65308 -30223 -39005 -33536 24962 -2890 6242 90489 37300 -71729 1652
19727 1652 -57135 -189594 -169820 -241020 -203852 27368 132845 21999 -137736 -136169 -164573
19716 -164573 -138584 -143117 -115853 247075 225436 213596 188698 185481 83744 -58365 -132800
19705 -132800 60294 153062 107390 9181 -24712 44677 18176 80913 -54854 -126878 67439
$$ packed form
19781F44621J94757j72653j6141r899j60635j70787j22146j12004J17675K76010
19771D68798K00146j28246l4683P8595J93748j1941j80788j37980k08158q1223
19761A58268P8335m3503j69238p3605Q7758k1434j22791K776r3057k11625J43699
19750b64417N0317j80407J39944K121L9480j42745k7851q845J02728K27087P8757
19739A6169P6784k7645r5531q782N469N8498k7852R132Q4247n3189j09029P3381
19727A652n8787j32459J9774p1200L7168K31220J05477j10846j59735J567k8404
19716a64573K5989m533K7264L62928k1639j1840k4898l217j01737j42109p4435
19705a32800J93094R2768m5672r8209l3893O9389k6501O2737j35767p2024J94317
$$ plain form
19694 67439 61161 -39148 -110958 -21616 1698 -4287 -96979 -122991 -40700 -15456 -55240 -60048
19682 -60048 -137045 -59458 109381 120477 82419 142790 89990 -192902 -339196 -406909 -259697
19671 -259697 -134741 -122799 -44490 59984 72469 141165 112534 67554 41408 -133644 -189714
19660 -189714 -124168 -96145 -210453 -214480 -165634 -334920 -80745 13488 -48646 -70027 -180766
19649 -180766 -284571 -243594 -34433 88162 64603 5090 -31311 17824 -21369 -253611 -334207
19638 -334207 -221728 -120805 -133577 -254054 -128529 -266279 -318216 -146565 132423 119468
19628 119468 49691 108344 169147 175582 280835 270259 -50140 -311641 -269725 -225263 -220615
19617 -220615 -168179 -68624 -219320 -380268 -301054 -48225 33290 -4690 127431 82371 -134085
$$ packed form
19694F7439o278j00309p1810Q9342K3314n985r2692k6012Q2291K5244l9784m808
19682f0048p6997P7587J68839J1096l8058O0371n2800k82892j46294o7713J47212
19671b59697J24956J1942P8309J04474J2485O8696k8631m4980k6146j75052n6070
19660a89714O5546K8023j14308m027M8846j69286K54175R4233o2134k1381j10739
19649a80766j03805M0977K09161J22595k3559n9513l6401M9135l9193k32242q0596
19638c34207J12479J00923j2772j20477J25525j37750n1937J71651K78988j2955
19628A19468o9777N8653O0803O435J05253j0576l20399k61501M1916M4462M648
19617b20615N2436R9555j50696j60948P9214K52829Q1515l7980J32121m5060k16456
$$ plain form
19606 -134085 -209567 -189216 -186417 -43622 -92843 -211889 -149794 -173926 -325119 -255721 -129278
19595 -129278 -67374 -36430 -146338 -181041 -180249 -96525 -33528 -136105 -214650 -73287 -8598
19584 -8598 -155140 -115877 -4667 -71714 -95311 50332 10910 -158434 -67777 40823 192285
19573 192285 125932 -5689 -63057 -97615 -137621 -139612 94665 211646 298664 272069 60355
19562 60355 9214 169009 21346 -15752 93770 167488 128652 -35338 -80803 -184722 -146216
19551 -146216 -116281 -129495 -123276 41212 238899 141619 104106 55635 -37794 -10998 86951
19540 86951 -31977 -124524 -157980 -57484 -91973 -121836 -61083 -54623 -86811 -104509 25076
19529 25076 62197 84713 -82130 -164086 -31055 51028 -62643 -186927 -99976 -101806 -199717
$$ packed form
19606a34085p5482K0351K799J42795m9221j19046O2095k4132j51193O9398J26443
19595a29278O1904L0944j09908l4703P92Q3724O2997j02577p8545J41363O4689
19584h598j46542L9263J11210o7047k3597J45643l9422j69344R0657J08600J51462
19573A92285o6353j31621n7368l4558m0006j991K34277J16981Q7018k6595k11714
19562F0355n1141J59795j47663l7098J09522P3718l8836j63990m5465j03919L8506
19551a46216K9935j3214O219J64488J97687r7280l7513m8471r3429K6796R7949
19540H6951j18928r2547l3456J00496l4489k9863O0753O460l2188j7698J29585
19529B5076L7121K2516j66843q1956J33031Q2083j13671j24284Q6951j830r7911
$$ plain form
19518 -199717 -303370 -438517 -349112 -219954 -268969 -125346 -35167 28651 -19256 -156805
19508 -156805 -169857 -271806 -197998 6816 36985 127286 174600 58490 -34258 -1541 54132
19497 54132 114152 -13881 -118517 -116986 -142136 -129307 -160216 -120124 12255 13248 -79172 -61611
19485 -61611 -91338 -162544 -75830 16471 8625 -9978 -15325 -19992 -17731 159457 94660 41739
19473 41739 -13880 -184731 -63754 -30952 -112206 -48315 -35333 55988 98501 -18778 -127537
19462 -127537 -184567 89790 255247 229672 141232 219201 212636 136625 94264 150783 157969
19451 157969 94154 95458 21413 -115353 -101001 4001 50374 41144 7523 35246 38077 63999
19439 63999 -57267 -33721 85834 158957 134563 218676 258738 460927 669528 818501 840277
$$ packed form
19518a99717j03653j35147Q9405J29158m9015J43623R0179O3818m7907j37549
19508a56805j3052j01949P3808K04814L0169R0301M7314j16110r2748L2717N5673
19497E4132O0020j28033j04636J531k5150J2829l0909M0092J32379R93r2420J7561
19485f1611k9727p1206Q6714R2301p846j8603n347m667K261J77188o4797n2921
19473D1739n5619j70851J20977L2802q1254O3891J2982R1321M2513j17279j08759
19462a27537n7030K74357J65457k5575q8440P7969o565p6011m2361N6519P186
19451A57969o3815J304p4045j36766J4352J05002M6373r230l3621K7723K831K5922
19439F3999j21266K3546J19555P3123k4394Q4113M0062K02189K08601J48973K1776
$$ plain form
19428 840277 725454 606408 546150 353071 255620 110991 81251 90084 198146 203541 111515
19417 111515 97876 15458 -200640 -163373 46068 107210 153157 187190 201132 124106 124240
19406 124240 23392 -883 121317 65490 -63745 51150 71281 114840 27974 55336 65001
19395 65001 156411 154474 28971 13083 -113576 -120132 -59948 177467 238632 79112 17172
19384 17172 -47390 -46800 -84852 -36149 184684 304241 291030 203078 484850 783715 810740
19373 810740 753228 632230 330960 111800 2061 -153022 -208087 -282806 -241274 -89545
19363 -89545 -47896 -93993 -58547 58753 59059 -47390 -193438 -195629 -189799 -262267 -315485 -213604
19351 -213604 -93983 3207 -32129 -85071 -105723 -105611 -160727 -43141 -53234 -8919 56204
$$ packed form
19428H40277j14823j19046o0258j93079r7451j44629k9740Q833J08062N395r2026
19417A11515j3639q2418k16098L7267K09441O1142M5947L4033J3942p7026J34
19406A24240j00848k4275J22200n5827j29235J14895K0131M3559q6866K7362R665
19395F5001R1410j937j25503j5888j26659o556O0184K37415O1165j59520o1940
19384A7172o4562N90l8052M8703K20833J19557j3211q7952K81772K98865K7025
19373H10740n7512j20998l01270k19160j09739j55083n5065p4719M1532J51729
19363h9545M1649m6097L5446J17300L06j06449j46048k191N830p2468n3218J01881
19351b13604J19621R7190l5336n2942k0652J12n5116J17586j0093M4315O5123
$$ plain form
19340 56204 175241 143856 3170 95859 32445 44355 -58937 -157005 -29263 161711 79571
19329 79571 5101 -50430 -2373 66275 102743 130953 -74861 -31841 40360 65353 -25028
19318 -25028 7549 11737 72144 25227 -46345 44863 119413 31141 -64191 -54961 -154036 -110270
19306 -110270 -1691 157560 187702 245507 338683 370550 234221 5368 75584 115748 62258
19295 62258 -90649 -96181 85550 154255 -42290 14918 60582 26916 93588 -39740 -187179
19284 -187179 -105877 144877 234805 -31764 -108507 -160093 -52260 -58812 -82766 -25266 77388
19273 77388 56619 -166486 -26911 118863 149710 248573 175477 60292 75684 135432 179585
19262 179585 73008 13129 80856 241611 198852 40543 -37811 -78048 26531 243315
$$ packed form
19340E6204J19037l1385j40686R2689o3414J1910j03292r8068J27742J90974q2140
19329G9571p4470n5531M8057O8648L6468K8210k05814M3020P2201K4993r0381
19318b5028L2577M188O0407m6917p1572R1208P4550q8272r5332R230r9075M3766
19306a10270J08579J59251L0142N7805R3176L1867j36329k28853P0216M0164n3490
19295F2258j52907n532J81731O8705j96545N7208M5664l3666O6672j33328j47439
19284a87179Q1302K50754Q9928k66569p6743n1586J07833o552k3954N7500J02654
19273G7388k0769k23105J39575J45774L0847R8863p3096j15185J5392N9748M4153
19262A79585j06577n9879O7727J60755m2759j58309p8354m0237J04579K16784
$$ plain form
19252 243315 198106 193827 122589 -7117 16489 11543 22447 10820 -25097 -182208 -154972
19241 -154972 -14498 -157809 -161777 -74717 19066 59822 110022 235027 105668 95684 112712
19230 112712 -92825 -91269 28170 140104 103334 28672 -74870 -134165 -27893 -25349 -89408
19219 -89408 -4809 289517 265127 200866 154429 237748 150959 -38184 -102139 -76849 -1060
19208 -1060 -64830 -96491 -32264 -29427 109614 265660 158639 143846 1903 2022 322301
19197 322301 427139 381989 382599 169375 102633 152787 -28753 -136589 24633 250780 160569
19186 160569 194582 364053 351509 146968 -63556 76595 312961 205569 -76682 -249484
19176 -249484 -256583 -100800 21640 151691 200097 261042 118747 -17641 70227 109258 88174
$$ packed form
19252B43315m5209m279p1238j29706K3606m946J0904j1627l5917j57111K7236
19241a54972J40474j43311l968Q7060R3783M0756N0200J25005j29359r984J7028
19230A12712k05537J556J19439J11934l6770p4662j03542n9295J06272K544o4059
19219h9408Q4599K94326k4390o4261m6437Q3319q6789j89143o3955K5290P5789
19208a060o3770l1661O4227K837J39041J56046j07021j4793j41943J19L20279
19197C22301J04838m5150O10k13224o6742N0154j81540j07836J61222K26147r0211
19186A60569L4013J69471j2544k04541k10524J40151K36366j07392k82251j72802
19176b49484p099J55783J22440J30051M8406O0945j42295j36388Q7868L9031k1084
$$ plain form
19165 88174 73388 -17925 -94605 3295 42240 -26486 -115983 -57841 65219 251581 450315
19154 450315 500829 488811 447170 293288 202603 103199 252021 430594 446908 518713 465968
19143 465968 436283 298660 281270 194034 144357 126603 -13366 -11065 180577 283565 343775
19132 343775 276215 253132 303195 99694 97956 319793 392559 388337 386292 308670 218311 205783
19120 205783 33499 -66733 10439 89777 120607 65544 109623 70435 -6106 -74710 -202905
19109 -202905 -77778 33370 60280 143797 -53213 -128664 78904 209319 260174 161162
19099 161162 12257 21157 -1266 35009 112931 130690 328921 368760 101820 -157193 -215205
19088 -215205 -266314 -307484 56431 122296 -9434 -209918 -313080 -371948 -207541 -51406
$$ packed form
19165H8174j4786r1313p6680R7900L8945o8726q9497N8142J23060J86362J98734
19154D50315N0514j2018m1641j53882r0685r9404J48822J78573J6314P1805n2745
19143D65968k9685j37623j7390q7236m9677j7754j39969K301J91642J02988O0210
19132C43775o7560k3083N0063k03501j738K21837P2766m222k045p7622r0359j2528
19120B05783j72284j00232P7172P9338L0830n5063M4079l9188p6541o8604j28195
19109b02905J25127J11148K6910Q3517j97010p5451K07568J30415N0855r9012
19099A61162j48905Q900k2423L6275P7922J7759J98231L9839k66940k59013n8012
19088b15205n1109m1170L63915O5865j31730k00484j03162n8868J64407J56135
$$ plain form
19078 -51406 -15785 -9010 -57431 112748 237846 316670 261170 277209 191244 139499 194776
19067 194776 219069 320795 271556 51374 45455 325718 388892 275315 405794 378348 306255
19056 306255 217961 165087 23565 2651 112091 89565 70701 63776 172970 258454 127154
19045 127154 84299 143820 371416 305116 235659 -68390 -111354 2678 195121 291238 174820
19034 174820 172629 269873 312711 290044 107454 315 -91320 -85375 -6780 117835 112174
19023 112174 204526 365108 303058 87095 -27230 111333 274058 204349 62363 73884
19013 73884 44297 213670 187959 114562 33215 -38833 -144897 -206714 -76993 28011 91761
19002 91761 58839 10684 -195267 -173530 -152441 -87500 35652 -15617 91216 254362 268083
$$ packed form
19078e1406L5621O775m8421J70179J25098P8824n5500J6039q5965n1745N5277
19067A94776K4293J01726m9239k20182n919K80263O3174j13577J30479k7446p2093
19056C06255q8294n2874j41522k0914J09440k2526j8864o925J09194Q5484j31300
19045A27154m2855N9521K27596o6300o9457l04049m2964J14032J92443R6117j16418
19034A74820k191R7244M2838k2667j82590j07139r1635N945P8595J24615n661
19023A12174R2352J60582o2050k15963j14325J38563J62725o9709j41986J1521
19013G3884k9587J69373k5711p3397q1347p2048j06064o1817J29721J05004O3750
19002I1761l2922m8155k05951K1737K1089O4941J23152n1269J06833J63146J3721
$$ plain form
18991 268083 271547 267658 430159 248065 128613 60359 -37970 -43705 196107 250800 329101
18980 329101 260355 263454 71753 153767 506500 683505 787112 948925 1337362 1411425
18970 1411425 1306729 1440021 1561044 1232528 927467 756532 695371 544991 403524 172511
18960 172511 101997 97404 124442 180921 106263 2268 127780 177479 325418 345370 143214
18949 143214 3090 39543 226242 208580 288683 496298 633452 798407 811864 797371
18939 797371 840384 782983 860610 1003714 970849 923612 866591 1023861 1039979 1171629 1328879
18928 1328879 1343455 1316357 1374567 1360460 1514879 1717097 1966486 2200371 2776699 3641297
18918 3641297 4922690 6148358 7440389 9467740 12193740 15678076 20948636 30687416
$$ packed form
18991B68083L464l889J62501j82094j19452o8254r8329n735K39812N4693P8301
18980C29101o8746L099j91701Q2014L52733J77005J03607J61813L88437P4063
18970A411425j04696J33292J21023l28516l05061j70935o1161j50380j41467k31013
18960A72511p0514m593K7038N6479p4658j03995J25512M9699J47939J9952k02156
18949A43214j40124L6453J86699j7662Q0103K07615J37154J64955J3457j4493
18939G97371M3013n7401P7627J43104l2865m7237n7021J57270J6118J31650J57250
18928A328879J4576k7098N8210j4107J54419K02218K49389K33885N76328Q64598
18918C641297J281393J225668J292031K027351K726000L484336N270560R738780
$$ plain form
18910 30687416 49027132 75959425 85897113 84229221 88620931 92465031 76541741 56021149
18902 56021149 37310854 24848051 17601940 13143001 10114952 8021879 6657604 5504710
18894 5504710 4633994 4148156 3797885 3335041 3050809 3118479 3176342 3124559 3226754 3178367
18884 3178367 3007243 2642100 2325389 2110018 2026354 2042546 2093624 2370285 2590444 2733947
18874 2733947 2798492 2906877 3090533 3058003 3048120 3074721 3195836 3242348 3572778 4104980
18864 4104980 4861529 5959446 7581951 10039391 13647052 18510982 25309608 36673748
18856 36673748 57140260 93317164 128899177 131724183 131472448 141669113 134107470 103752130
18848 103752130 72402933 47492329 32089436 23088165 17430207 13582836 10832028
$$ packed form
18910C0687416J8339716K6932293R937688j667892M391710L844100j5923290k0520592
18902E6021149j8710295j2462803p246111m458939l028049k093073j364275j152894
18894E504710q70716m85838l50271m62844k84232O7670N7863n1783J02195m8387
18884C178367j71124l65143l16711k15371q3664J6192N1078K76661K20159J43503
18874B733947O4545J08385J83656l2530r883K6601J21115M6512L30430N32202
18864D104980P56549J097917J622505K457440L607661M863930O798626J1364140
18856C6673748K0466512L6176904L5582013K825006k51735J0196665p561643l0355340
18848A03752130l1349197k4910604j5402893r001271n657958l847371k750808
$$ plain form
18841 10832028 8768940 7265206 6153802 5056550 4347573 3815080 3495056 3318650 3359571
18832 3359571 3249969 2874645 2592000 2374590 1971113 1607565 1537430 1501760 1433668 1273299
18822 1273299 1246772 1384522 1475569 1372404 1476681 1528201 1292332 1084759 904120 662269
18812 662269 485293 453952 345680 417560 604599 767114 655428 585334 472847 525265
18802 525265 590036 487383 306547 454419 601832 349712 73378 116257 315584 258917
18792 258917 387475 553853 484395 438652 519838 472272 370768 243466 174142 281201
18782 281201 400121 319154 265188 203603 271898 293842 227998 269202 229280 208867 371185
18771 371185 613254 737049 921795 1344821 1886855 1742547 1247741 908077 621960 308524
$$ packed form
18841A0832028k063088j503734j111404j097252p08977n32493l20024j76406M0921
18832C359571j09602l75324k82645k17410m03477l63548p0135l5670o8092j60369
18822A273299k6527J37750R1047j03165J04277N1520k35869k07573j80639k41851
18812F62269j76976l1341j08272P1880J87039J62515j11686p0094j12487N2418
18802E25265O4771j02653j80836J47872J47413k52120k76334M2879J99327n6667
18792B58917J28558J66378o9458m5743Q1186m7566j01504j27302o9324J07059
18782B81201J18920q0967n3966o1585O8295K1944o5844M1204l9922k0413J62318
18771C71185K42069J23795J84746M23026N42034j44308m94806l39664k86117l13436
$$ plain form
18761 308524 75009 88871 88933 144159 -14396 -54869 100833 138759 85032 86008 -1012 -84322
18749 -84322 -49134 -7971 54856 186813 266384 231108 185007 232558 200557 275464 327140
18738 327140 309910 340237 308692 220456 189707 267044 438833 469530 385258 421101 408468
18727 408468 311072 114963 308281 251538 116734 -62268 28255 -83932 -232774 -237779
18717 -237779 -103782 82936 159562 271262 272755 459988 321916 115052 -32050 137827
18707 137827 201629 218297 364974 389810 357339 383769 224659 271017 401290 440037 425629
18696 425629 375909 547171 773789 833370 824338 870971 785100 636549 794438 1125822 1295043
18685 1295043 1490828 1857418 2352993 2731428 3020324 3119539 2978004 2975149 3040375 3022372
$$ packed form
18761C08524k33515J3862O2N5226j58555m0473J55702L7926n3727R76q7020q3310
18749h4322L5188M1163O2827J31957P9571l5276m6101M7551l2001P4907N1676
18738C27140j7230L0327l1545q8236l0749P7337J71789L0697q4272L5843j2633
18727D08468r7396j96109J93318n6743j34804j79002R0523j12187j48842n005
18717b37779J33997J86718P6626J11700J493J87233j38072k06864j47102J69877
18707A37827O3802J6668J46677K4836l2471K6430j59110M6358J30273L8747j4408
18696D25629m9720J71262K26618N9581r032M6633q5871j48551J57889L31384J69221
18685A295043J95785L66590M95575L78435K88896R9215j41535k855O5226j8003
$$ plain form
18675 3022372 3022574 3411069 4091043 5297663 6870909 8878672 11454823 14696213 19661257
18666 19661257 28100040 43506052 64216175 72488012 75371572 79721106 71491322 55890246
18658 55890246 41571414 31945494 27703107 27972975 32902104 45100288 64097822 73602270
18650 73602270 75045922 78305538 71286721 54642481 38255479 25585171 17744336 13155192
18642 13155192 10381288 8557244 7195521 6084237 5226598 4575647 4221232 3897201 3670953
18633 3670953 3441936 3471472 3542430 3430551 3303511 3354693 3498367 3573070 3457404 3196823
18623 3196823 2993897 2903879 2917999 3120430 3609266 4231420 5053858 5911985 6872243 8520191
18613 8520191 11171226 15119550 21966832 34110495 45400572 47539491 50165148 50939555
$$ packed form
18675C022372K02L88495O79974J206620J573246K007763K576151L241390M965044
18666A9661257Q438783J5406012K0710123Q271837K883560M349534q229784j5601076
18658E5890246j4318832r625920m242387K69868M929129J2198184J8997534R504448
18650G3602270J443652L259616p018817j6644240j6387002j2670308p840835m589144
18642A3155192k773904j824044j361723j111284q57639o50951l54415l24031k26248
18633C670953k29017K9536P0958j11879j27040N1182J43674P4703j15666k60581
18623C196823k02926r0018J4120K02431M88836O22154Q22438Q58127R60258J647948
18613H520191K651035L948324O847282J2143663J1290077K138919K625657P74407
$$ plain form
18605 50939555 42074605 31812268 23654064 19068009 17781075 19268550 24317196 34696583
18597 34696583 46277612 48439054 49758788 50606888 41873102 30547510 20498978 13602001
18589 13602001 9644405 7200799 5778231 4757671 4092100 3540854 3009934 2643451 2282213
18580 2282213 2030807 1821474 1847975 1874218 1768968 1692483 1515162 1312315 1003269 872047
18570 872047 878350 940452 854270 797967 704354 543083 379224 609352 621761 617067 610985
18559 610985 543086 660168 670824 506581 373254 373551 479119 389200 218888 117554 169836
18548 169836 303889 239439 196550 206843 115322 112124 381689 553730 422123 399436 399304
18537 399304 242440 278337 349345 256778 324988 104256 107717 286283 351676 305816 229580
$$ packed form
18605E0939555q864950j0262337q158204m586055j286934J487475N048646J0379387
18597C4696583J1581029K161442J319734Q48100q733786j1325592j0048532o896977
18589A3602001l957596k443606j422568j020560o65571n51246n30920l66483l61238
18580B282213k51406k09333K6501K6243j05250p6485j77321k02847l09046j31222
18570H72047O303O2102q6182n6303r3613j61271j63859K30128J2409m694o082
18559F10985o7899J17082J0656j64243j33327K97J05568q9919j70312j01334N2282
18548A69836J34053o4450m2889J0293r1521l198K69565J72041j31607k2687j32
18537C99304j56864L5897P1008r2567O8210k20732L461J78566O5393m5860p6236
$$ plain form
18526 229580 182796 203780 433376 447142 162456 48816 99717 205351 97476 31955
18516 31955 27585 68676 120909 68597 205055 254583 298503 314600 259407 151419 -98703
18505 -98703 -125949 -113340 -81733 -20015 52373 146642 106559 50206 103482 86887 144695 98735
18493 98735 -21588 -53559 198861 162995 151860 231508 306088 303029 198582 220437 214084
18482 214084 123630 133316 95338 157259 234455 276216 160432 64313 -81067 -100350 -27140
18471 -27140 43677 14363 47306 -55701 -180929 -181965 -236418 -349759 -202518 8206 63710
18460 63710 3357 8565 14497 -41498 24184 2774 -236726 -233404 -148235 -250057 -276046 -288315
18448 -288315 -189215 102 2477 37484 122196 69749 -21503 -128787 -116943 -187412 -14600
$$ packed form
18526B29580m6784K0984K29596J3766k84686j13640N0901J05634j07875o5521
18516C1955m370M1091N2233n2312J36458M9528M3920J6097n5193j07988k50122
18505i8703k7246J2609L1607O1718P2388R4269m0083n6353N3276j6595N7808m5960
18493I8735j20323l1971K52420l5866j1135P9648P4580l059j04447K1855o353
18482B14084r0454R686l7978O1921P7196M1761j15784r6119j45380j9283P3210
18471b7140P0817k9314L2943j03007j25228j036n4453j13341J47241K10724N5504
18460F3710o0353N208N932n5995O5682k1410k39500L322Q5169j01822k5989j2269
18448b88315R9100J89317K375L5007Q4712n2447r1252j07284J1844p0469J72812
$$ plain form
18437 -14600 177564 263646 286187 218707 107386 165128 143117 54550 -96047 -166544 -69980
18426 -69980 -303 160173 4424 71495 224093 118727 -181486 -368375 -366504 -274743 -167669
18415 -167669 -102717 -11322 109315 120424 110805 158200 -27284 26634 -11203 -45439 -49620
18404 -49620 -103749 -89519 -56185 -250400 -232432 -214321 -279107 -291005 -231670 -180340 -51489
18393 -51489 -20477 -159545 -10354 130065 16154 -52800 -43021 -128002 -29260 -22768 -53075
18382 -53075 -12336 -86701 53636 145577 145014 -241 70671 380328 516273 704423 834865
18371 834865 846027 911746 709852 430872 541509 578148 396209 238303 249264 344186
18361 344186 391176 321465 142139 -61984 -520 53096 49109 -71550 -97293 -103792 -137306
$$ packed form
18437a4600J92164Q6082K2541o7480j11321N7742k2011q8567j50597p0497R6564
18426f9980O9677J60476j55749O7071J52598j05366l00213j86889J871R1761J07074
18415a67669O4952R1395J20637J1109r619M7395j85484N3918l7837l4236m181
18404d9620n4129J4230L3334j94215J7968J8111o4786j1898N9335N1330J28851
18393e1489L1012j39068J49191J40419j13911o8954R779q4981R8742O492l0307
18382e3075M0739p4365J40337R1941n63j45255P0912L09657J35945J88150J30442
18371H34865J1162O5719k01894k78980J10637L6639j81939j57906J0961R4922
18361C44186M6990o9711j79326k04123O1464N3616l987j20659k5743o499l3514
$$ plain form
18350 -137306 33627 -52182 241 4969 47172 219743 273933 287325 162958 -61011 -61115
18339 -61115 -33910 60091 74409 -25929 -23134 66662 144011 40792 -80655 66223 66839
18328 66839 -158531 -230575 -201139 -281950 -287658 -25845 217686 19451 167544 510135 621310
18317 621310 527274 442529 573563 515414 189426 185942 233687 83646 29847 -54785 -34938
18306 -34938 98481 151592 287325 440289 480494 311512 169392 127881 255755 178202
18296 178202 96776 118663 99265 30721 188138 317432 234835 274734 250931 290181 359773
18285 359773 341254 298602 259688 235086 173265 153250 -25544 -125203 -169021 11447 11723
18274 11723 39745 67815 110254 99143 77051 -4771 -28187 23692 134162 163813 99322
$$ packed form
18350a37306J70933q5809N2423M728M2203J72571N4190J3392j24367k23969j04
18339f1115K7205R4001J4318j00338K795Q9796P7349j03219j21447J46878O16
18328F6839k25370p2044K9436q0811n708K61813K43531j98235J48093L42591J11175
18317F21310r4036q4745J31034n8149l25988l484M7745j50041n3799q4632J9847
18306c4938J33419N3111J35733J52964M0205j68982j42120m1511J27874p7553
18296A78202q1426K1887j9398o8544J57417J29294q2597L9899k3803L9250O9592
18285C59773j8519m2652l8914k4602o1821k0015j78794r9659m3818J80468K76
18274A1723K8022K8070M2439j1111k2092q1822k3416N1879J10470K9651o4491
$$ plain form
18263 99322 95444 53735 -165726 -291716 -364993 -370358 -283585 -203832 -231198 -240100 -118336 -225789
18251 -225789 -249674 -101525 163625 250349 146209 181940 181785 337825 333572 314825 305946
18240 305946 225602 72190 28641 209987 168530 -3714 65121 79315 18597 -15029 -115528
18229 -115528 -227271 -145980 -125338 -98506 64442 149786 76569 131501 236642 256970 143147
18218 143147 22145 84259 17191 -135581 -160886 -39767 -18990 63563 18696 -129777 -182341
18207 -182341 -102785 -54724 690 94017 159807 196855 267883 48239 -158089 -137247 -208697
18196 -208697 -96497 96817 90530 113622 212299 178423 -37798 -27541 -37521 -64167 9156
18185 9156 -57314 -159191 -152448 55396 154586 153128 173565 301555 145480 71029 -24722
$$ packed form
18263I9322l878m1709k19461j25990p3277n365Q6773P9753k7366q902J21764j07453
18251b25789k3885J48149K65150Q6724j04140L5731j55J56040m253j8747q879
18240C05946q0344j53412m3549J81346m1457j72244O8835J4194o0718l3626j00499
18229a15528j11743Q1291K0642K6832J62948Q5344p3217N4932J05141K0328j13823
18218A43147j21002O2114o7068j52772k5305J21119K0777Q2553m4867j48473n2564
18207a82341P9556M8061N5414R3327O5790L7048P1028k19644k06328K0842p1450
18196b08697J12200J93314o287K3092R8677l3876k16221J0257r980k6646P3323
18185I156o6470j01877O743K07844R9190j458K0437J27990j56075p4451r5751
$$ plain form
18174 -24722 -128975 -48520 15676 -134779 -169025 -226748 -147872 16809 -64770 -152337 -44950
18163 -44950 191474 308960 63533 55387 181011 164062 63799 89755 254114 353720 367187
18152 367187 401440 462101 493782 444244 320929 217456 340541 598395 637656 628224 591328
18141 591328 667141 757886 774094 762329 987700 1260948 1331478 1388198 1567624 1599464 1564743
18130 1564743 1665293 1864802 2217665 2526626 2843259 2964751 3297488 3812115 4728712
18121 4728712 5646059 6804277 8828668 11756398 15903887 22325086 31134928 42074061
18113 42074061 58097647 86852566 147764039 266302929 349142566 291889333 205495963
18106 205495963 125419039 75782726 49718244 35434124 26676595 20689459 16563087
$$ packed form
18174b4722j04253Q0455O4196j50455l4246n7723P8876J64681q1579q7567J07387
18163d4950K36424J17486k45427q146J25624j6949j00263K5956J64359R9606J3467
18152C67187L4253O0661L1681m9538j23315j03473J23085K57854L9261r432l6896
18141E91328P5813R0745J6208j1765K25371K73248P0530N6720J79426L1840l4721
18130A564743J00550J99509L52863L08961L16633J21492L32737N14627R16597
18121D728712R17347J158218K024391K927730M147489O421199Q809842J0939133
18113D2074061J6023586K8754919O0911473J18538890Q2839637n7253233q6393370
18106B05495963q0076924m9636313k6064482j4284120q757529n987136m126372
$$ plain form
18099 16563087 13994611 11891865 10006992 8496108 7076086 5882868 4958432 4271518
18091 4271518 3752616 3538253 3377659 2954899 2451784 2247562 2151277 1855613 1699048 1612989
18081 1612989 1551630 1530540 1292337 1232658 1253050 1108922 1099481 1184576 1340789 1360951 1352471
18070 1352471 1316995 1202696 1203851 1060710 1169061 1208359 1411798 1475160 1322485 1419940
18060 1419940 1442738 1463609 1338571 1127838 864870 836829 891515 861684 864824 600665 512545
18049 512545 592858 604435 629637 496600 419747 273059 348357 503312 716769 480613
18039 480613 451530 679020 581990 358752 292293 283339 305363 235220 156681 219377 365216
18028 365216 279721 88324 107042 96689 2947 48629 123438 110567 193526 112890 183873
$$ packed form
18099A6563087k568476k102746j884873j510884j420022j193218r24436o86914
18091D271518n18902k14363j60594m22760n03115k04222r6285k95664j56565q6059
18081A612989o1359k1090k38203n9679K0392j44128r441Q5095J56213K0162q480
18070A352471l5476j14299J155j43141J08351L9298K03439O3362j52675R7455
18060A419940K2798K0871j25038k10733k62968k8041N4686k9831L140k64159q8120
18049E12545Q0313J1577K5202j33037p6853j46688P5298J54955K13457k36156
18039D80613k9083K27490r7030k23238o6459q954K2024p0143p8539O2696J45839
18028C65216q5495j91397J8718j0353r3742M5682P4809j2871Q2959q0636P0983
$$ plain form
18017 183873 367475 235112 241908 215831 75442 22411 24017 189240 382796 338751 346607
18006 346607 448127 564514 576025 674734 704101 802526 812872 877860 995262 945118 998206
17995 998206 1012490 1004193 888813 761153 869537 903684 797131 753231 781012 894538 878827
17984 878827 785015 519630 430187 315850 180517 121077 29175 -28654 -186818 -200302 -38567
17973 -38567 7283 -46884 246333 190924 6556 -138916 -383615 -317036 -32554 91673
17963 91673 73339 149017 182454 134367 182893 241031 206571 79456 161286 263952 161062
17952 161062 189189 158138 280678 371060 469750 440853 477079 412492 409164 382925 443121
17941 443121 481848 363940 299627 253875 296723 391021 391644 405590 304128 242909 190886
$$ packed form
18017A83873J83602j32363O796k6077j40389n3031J606J65223J93556m4045P856
18006C46607J01520J16387J1511R8709K9367R8425J0346O4988J17402n0144N3088
17995I98206J4284q297j15380j27660J08384L4147j06553m3900K7781J13526j5711
17984H78827r3812k65385q9443j14337j35333n9440r1902n7829j58164j3484J61735
17973c8567M5850n4167K93217n5409j84368j45472k44699O6579K84482J24227
17963I1673j8334P5678L3437m8087M8526N8138l4460j27115Q1830J02666j02890
17952A61062K8127l1051J22540R0382R8690k8897L6226o4587l328k6239O0196
17941D43121L8727j17908o4313m5752M2848R4298O23J3946j01462o1219n2023
$$ plain form
17930 190886 199482 240488 186786 128291 191078 372365 441685 274697 150859 61622 -67491
17919 -67491 -29143 -22641 100859 91969 271071 296377 109547 71254 109326 132750 -24319
17908 -24319 -103283 4044 97424 141269 -21161 -98872 -49827 -494 169348 131259 104897
17897 104897 149161 123355 81469 146668 237540 201079 12944 -83052 -48021 -12821 41203
17886 41203 85591 20851 -82862 -86127 -65923 -154735 -189370 -201886 -279629 -126024 34774
17875 34774 -63743 -149029 -70788 -92503 33017 -63718 -69965 83233 -1875 -45285 34201
17864 34201 154513 99221 89535 126831 55499 22173 8661 17373 166790 294666 160628
17853 160628 -1687 -139967 -39204 -25779 47802 11782 -69277 -163059 -685 57822 -40332
$$ packed form
17930A90886Q596M1006n3702n8495O2787J81287O9320j66988j23838q9237j29113
17919f7491L8348O502J23500q890J79102K5306j86830l8293L8072K3424j57069
17908b4319p8964J07327R3380M3845j62430p7711M9045M9333J69842l8089k6362
17897A04897M4264k5806m1886O5199R0872l6461j88135r5996L5031L5200N4024
17886D1203M4388o4740j03713l265K0204q8812l4635j2516p7743J53605J60798
17875C4774r8517q5286P8241k1715J25520r6735o247J53198q5108m3410P9486
17864C4201J20312n5292r686L7296p1332l3326j3512Q712J49417J27876j34038
17853A60628j62315j38280J00763J3425P3581l6020q1059r3782J62374N8507r8154
$$ plain form
17842 -40332 -81395 -101261 -132492 -152839 -53663 -110840 -28473 36720 -35982 41187 81259 19074
17830 19074 32968 185567 219883 274717 222760 123142 103983 117100 104593 -68318 -62501
17819 -62501 -85094 -87721 -85181 -63517 59041 105743 32695 -2969 -32106 26521 138863 17829
17807 17829 -31068 -32934 -156964 -157564 -26611 134140 66469 -27082 390 -46640 -161272
17796 -161272 -165502 84157 102519 90420 277525 367574 228841 154248 226404 164674 134627
17785 134627 237403 241429 163302 252847 274251 146808 981 -24532 72058 54078 -15863
17774 -15863 -41425 63613 178953 99458 59992 114081 187111 80934 -69809 -253366 -178247
17763 -178247 -202280 -138979 -123152 -89097 52442 -141094 -167470 -71190 -95603 75736 109582
$$ packed form
17842d0332m1063j9866l1231k0347R9176n7177Q2367O5193p2702P7169M0072o2185
17830A9074J3894J52599L4316N4834n1957r9618j9159J3117j2507j72911N817
17819f2501k2593k627K540K1664J22558M6702p3048l5664k9137N8627J12342j21034
17807A7829m8897j866j24030o00J30953J60751o7671r3551K7472m7030j14632
17796a61272m230K49659J8362j2099J87105R0049j38733p4593P2156o1730l0047
17785A34627J02776M026p8127Q9545K1404j27443j45827k5513R6590j7980o9941
17774a5863k5562J05038J15340p9495l9466N4089P3030j06177j50743j83557P5119
17763a78247k4033O3301J5827L4055J41539j93536k6376R6280k4413J71339L3846
$$ plain form
17752 109582 36073 41232 282746 251411 217566 153088 155068 64581 71439 -63000 -236180
17741 -236180 -346315 -444813 -297745 -18443 65940 -71548 -191691 -181888 -190746 -147621 -161330
17730 -161330 -50899 -7811 122700 199646 264597 174508 19003 -58808 -7999 -113789 -42098
17719 -42098 -21033 -15697 30598 108875 32171 -192824 -306894 -391814 -218323 -170464 -216193
17708 -216193 -189469 -89527 -1685 -147036 -242439 -177467 -2080 -66672 -150679 -60458 32566
17697 32566 -61090 -168718 -85789 61908 51205 -30344 11869 29071 55318 32608 -17018
17686 -17018 -35514 -34563 -59110 -154145 -193806 -281749 -362769 -286119 -268889 -261838 -145903 -39607
17674 -39607 36628 16408 -108620 -54274 144407 107068 40323 -44574 -145447 -185936 -199094
$$ packed form
17752A09582p3509N159K41514l1335l3845o4478J980r0487O858j34439j73180
17741b36180j10135r8498J47068K79302Q4383j37488j20143R803q858M3125j3709
17730a61330J10431M3088J30511P6946O4951r0089j55505p7811N0809j05790P1691
17719d2098K1065N336M6295P8277p6704k24995j14070q4920J73491M7859m5729
17708b16193K6724R9942Q7842j45351r5403O4972J75387o4592q4007R0221R3024
17697C2566r3656j07628Q2929J47697j0703q1549M2213J7202K6247k2710m9626
17686a7018j8496R51k4547r5035l9661q7943q1020P6650J7230P051J15935J06296
17674c9607P6235k0220j25028N4346J98681l7339o6745q4897j00873m0489j3158
$$ plain form
17663 -199094 -150319 -129912 -150586 -77631 -36009 51314 32910 88220 86151 102744 130835 231998
17651 231998 103133 -122021 -18188 44103 107574 124321 -115783 -164811 -116332 -66071 -246828
17640 -246828 -170098 -188186 -195074 -138252 -19770 -10971 7661 -154455 -404664 -505401 -477678
17629 -477678 -266769 -130357 -169656 -247409 -288215 -364925 -335152 -294754 -267530 -235382 -308915
17618 -308915 -298687 -336606 -336234 -260426 -202340 -134460 -149824 -315323 -185770 -146672 -217127
17607 -217127 -226748 -152851 -50992 39894 93779 153404 160157 91065 150519 246808 55096
17596 55096 -77825 -104159 -111285 -99437 -100792 -116708 -217260 -343337 -312723 -72174 -128898
17585 -128898 -106282 -105799 -146851 -214066 -140419 -131083 -35420 73613 43916 123618 97082 49275
$$ packed form
17663a99094M8775K0407k0674P2955M1622Q7323j8404N5310k069J6593K8091J01163
17651B31998j28865k25154J03833O2291O3471J6747k40104m9028M8479N0261j80757
17640b46828P6730j8088o888N6822J18482Q799J8632j62116k50209j00737K7723
17629d77678K10909J36412l9299p7753m0806p6710K9773M0398K7224L2148p3533
17618c08915J0228l7919L72P5808N8086O7880j5364j65499J29553L9098p0455
17607b17127r621P3897J01859R0886N3885N9625O753o9092N9454R6289j91712
17596E5096j32921k6334p126J1848j355j5916j00552j26077L0614K40549n6724
17585a28898K2616M83m1052o7215P3647R336R5663J09033k9697P9702k6536m7807
$$ plain form
17573 49275 185585 99405 81147 105020 139049 48433 26636 142683 153875 35458 -96953
17562 -96953 -173685 -179458 34536 171611 6342 -40512 6894 -132504 -281855 -335812 -297743
17551 -297743 -234740 -165859 -173568 -207413 -264510 -196183 -26064 -101031 -214778 -91026 -73149
17540 -73149 -177853 -134058 -252136 -199135 -50522 -66814 -174400 -55196 -10537 -71618 -84927
17529 -84927 89230 252645 79022 -21394 -142247 -102947 -130438 -252257 -280903 -242515
17519 -242515 -157557 -61072 -162436 -7851 63747 135950 121716 230937 93963 -10780
17509 -10780 9980 -73776 -277503 -266435 -63761 -10826 -83529 -140365 -137217 -2742 6311
17498 6311 32388 115803 129743 -59317 -57522 78006 119900 180922 -76564 -232262 -240161
$$ packed form
17573D9275J36310q6180j8258K3873L4029r0616k1797J16047J1192j18417j32411
17562i6953p6732n773K13994J37075j65269m6854M7406j39398j49351n3957L8069
17551b97743O3003O8881p709l3845n7097O8327J70119p4967j13747J23752J7877
17540g3149j04704M3795j18078N3001J48613j6292j07586J19204M4659o1081j3309
17529h4927J74157J63415j73623j00416j20853L9300k7491j21819k8646L8388
17519b42515Q4958R6485j01364J54585P1598P2203j4234J09221j36974j04743
17509a0780K0760q3756k03727J1068K02674N2935p2703n6836L148J34475R053
17498F311K6077Q3415J3940j89060J795J35528M1894O1022k57486j55698p899
$$ plain form
17487 -240161 -129189 -84592 -151400 -59519 -117735 -130236 -169512 -122582 -95044 -174506 -56045
17476 -56045 -57034 -85991 -15662 -28803 -33669 -16459 71747 36901 25249 -61457 -43334 -118181
17464 -118181 -112136 -75302 -40420 145309 226546 171607 202220 229770 361079 375480 166807
17453 166807 -39322 -126446 -74138 -74195 29623 180289 75305 307561 843750 1351668 1845321
17442 1845321 1478438 1108052 711628 324220 52671 28635 66167 43834 40925 181830
17432 181830 117761 -86490 -4105 -9594 83550 6136 -14250 -76015 16217 117580 187693
17421 187693 377220 209258 18802 156242 209543 248775 232916 35365 69546 108784
17411 108784 143969 211855 151314 120801 63619 53976 55725 -30847 -90423 -4393 36714 129483
$$ packed form
17487b40161J10972M4597o6808R1881n8216j2501l9276M6930K7538p9462J18461
17476e6045r89k8957P0329j3141m866J7210Q8206l4846j1652q6706J8123p4847
17464a18181O045L6834L4882J85729Q1237n4939L0613K7550J31309J4401k08673
17453A66807k06129q7124N2308n7J03818J50666j04984K32256N36189N07918M93653
17442A845321l66883l70386l96424l87408k71549k4036L7532k2333k909J40905
17432A81830o4069k04251Q2385n489R3144p7414k0386o1765R2232J01363P0113
17421A87693J89527j67962j90456J37440N3301L9232j5859j97551L4181L9238
17411A08784L5185O7886o0541l0513n7182r643J749q6572n9576Q6030M1107R2769
$$ plain form
17399 129483 338490 306157 140026 120989 33607 -84472 -59719 -105467 -134751 -262538 -272260
17388 -272260 -257690 -98026 11130 55116 27611 -41022 -186057 -129789 -100154 27933 -185249
17377 -185249 -315582 -205396 -232846 -407111 -215106 -81372 44052 67527 -12305 -48518
17367 -48518 -61571 -21858 137054 -34718 -187975 -219374 -218131 -208525 -160191 18997 -10964
17356 -10964 55100 221692 169894 -26382 60729 16583 -9607 -124535 -40375 110784 68654
17345 68654 112036 -46516 -317795 -303419 -151544 -66295 -88199 -205401 -313853 -193738
17335 -193738 -239781 -346668 -266611 -129473 -73843 37223 161809 48147 2837 3721 -108462
17324 -108462 -243639 -256593 -282183 -364995 -295024 -211322 -255109 -156376 51340 -62580 -177987
$$ packed form
17399A29483K09007l2333j66131j9037q7382j18079K4753m5748k9284j27787r722
17388b72260J4570J59664J09156M3986k7505o8633j45035N6268K9635J28087k13182
17377a85249j30333J10186k7450j74265J92005J33734J25424K3475p9832l6213
17367d8518j3053L9713J58912j71772j53257l1399J243R606M8334J79188k9961
17356a0964O6064J66592n1798j96276Q7111m4146k6190j14928Q4160J51159m2130
17345F8654M3382j58552k71279J4376J51875Q5249k1904j17202j08452J20115
17335a93738m6043j06887Q0057J37138N5630J11066J24586j13662m5310Q84j12183
17324a08462j35177j2954k5590q2812O9971Q3702m3787R8733K07716j13920j15407
$$ plain form
17313 -177987 -184792 14976 81632 123090 116812 -25153 -62024 -79350 -169035 -215834 -154829
17302 -154829 7018 51785 225721 299732 264150 143552 42370 -64011 -86891 -42988
17292 -42988 168111 276269 341838 306374 107088 -8422 44516 66966 68576 41977 -41387
17281 -41387 -208549 -350699 -303046 -146746 -79282 -31037 69158 168760 32854 11339 -43422
17270 -43422 -58910 -188696 -381195 -524528 -478383 -249458 -98366 -163074 -314567 -190408
17260 -190408 213 31822 66114 -17964 4217 111692 88286 33434 -128644 -283079 -344436
17249 -344436 -336149 -318436 -200545 -177672 -137242 -121990 -283227 -355882 -310068 -176782 -56813
17238 -56813 -68929 -95317 -122596 -162377 -40513 60493 30158 26248 -108136 -212316 -78479
$$ packed form
17313a77987o805J99768O6656M1458o278j41965l6871j7326q9685m6799O1005
17302a54829J61847M4767J73936P4011l5582j20598j01182j06381k2880M3903
17292d2988K11099J08158O5569l5464j99286j15510N2938K2450J610k6599q3364
17281d1387j67162j42150M7653J56300O7464M8245J00195R9602j35906k1515n4761
17270d3422j5488j29786j92499j43333M6145K28925J51092o4708j51493J24159
17260a90408J90621L1609L4292q4078K2181J07475k3406n4852j62078j54435o1357
17249c44436Q287J7713J17891K2873M0430J5252j61237p2655M5814J33286J19969
17238e6813j2116k6388k7279l9781J21864J01006l0335l910j34384j04180J33837
$$ plain form
17227 -78479 152086 126246 100407 -14577 -67350 -124587 -3005 109368 24086 -124972 -32624
17216 -32624 100988 254699 255893 68068 -108588 -116767 3579 -3989 101817 129849 -38971
17205 -38971 -266901 -385195 -251796 -225204 -191743 1812 169768 186681 91529 -8342 -24404
17194 -24404 132616 197478 234017 215720 96819 -33397 -92903 -94187 -135046 -183020 -137436
17183 -137436 -10208 -73509 -239411 -288857 -109082 10798 104584 109289 490 -58361 -69302
17172 -69302 -41270 134026 166612 107799 166331 101967 47291 -59892 -161528 -118352 -197858
17161 -197858 -279389 -313494 -197350 -54953 -30891 -29961 21941 255 -157253 -224778 -149004
17150 -149004 -125661 -153640 -210523 -207282 -220153 -48103 32389 7461 -73888 -155932 -126080
$$ packed form
17227g8479K30565k5840k5839j14984n2773n7237J21582J12373q5282j49058R2348
17216c2624J33612J53711J194j87825j76656q179J20346p568J05806K8032j68820
17205c8971k27930j18294J33399K6592L3461J93555J67956J6913r5152r9871j6062
17194b4404J57020O4862L6539j8297j18901j30216n9506j284m0859m7974M5584
17183a37436J27228o3301j65902m9446J79775J19880R3786M705j08799n8851j0941
17172f9302K8032J75296L2586n8813N8532o4364n4676j07183j01636M3176p9506
17161a97858q1531l4105J16144J42397K4062R30N1902k1686j57508o7525P5774
17150a49004K3343k7979n6883L241j2871J72050Q0492k4928q1349q2044K9852
$$ plain form
17139 -126080 -52241 -8847 -13510 61295 54143 52392 57626 -162843 -254595 -188927 -28625 -52023
17127 -52023 -158253 -194229 -7936 -122371 -272607 -256533 -422615 -396164 -328901 -270174 -133648
17116 -133648 -243397 -186973 -195173 -204633 -101581 -131833 -249468 -274545 -173314 -244563 -100561
17105 -100561 34825 180325 152413 178280 44093 -30920 27726 86225 171118 164687 187113
17094 187113 67262 -45134 -83835 944 -50653 -135620 -177851 -187033 -302811 -370122 -369170
17083 -369170 -360387 -345405 -226784 -146803 -130841 4232 152145 246433 300158 288527 327437
17072 327437 386852 327125 152209 143075 168076 91945 173167 280365 254523 210600 64789
17061 64789 -17252 82586 94712 109959 103241 62421 -49850 -89667 -136195 -75463 79940
$$ packed form
17139a26080P3839M3394m663P4805p152j751N234k20469r1752O5668J60302k3398
17127e2023j06230l5976J86293j14435j50236J6074j66082K6451O7263N8727J36526
17116a33648j09749N6424q200r460J03052l0252j17635k5077J01231p1249J44002
17105a00561J35386J45500k7912K5867j34187p5013N8646N8499Q4893o431K2426
17094A87113j19851j12396l8701Q4779n1597q4967m2231r182j15778o7311R52
17083c69170Q783J4982J18621P9981J5962J35073J47913R4288N3725j1631L8910
17072C27437N9415n9727j74916r134K5001p6131Q1222J07198k5842m3923j45811
17061F4789q2041R9838J2126J5247o718m0820j12271l9817m6528O0732J55403
$$ plain form
17050 79940 -100342 -177388 -153270 -112611 -117575 -92555 -96391 -250009 -260919 -55002 190834
17039 190834 276195 135361 -14256 -34095 11468 46542 107974 105775 54753 47289 281828
17028 281828 249649 62094 -9565 -102299 -303 95633 -7451 -65215 -148417 -360863 -211741
17017 -211741 -163827 -89163 62812 -76072 -91805 -80385 -107328 -102118 -80859 124819 35823
17006 35823 -180765 -302183 -192078 69980 138774 127737 -183210 -221080 -97224 -177716
16996 -177716 -284767 -325990 -181244 -23842 -35369 -87099 -130358 -273262 -308297 -215684 -246016
16985 -246016 -97721 187263 212593 162513 -66342 -77962 -149202 -280292 -277976 -425783 -520755
16974 -520755 -394230 -249617 -376948 -329720 -212403 -215231 -255766 -122401 -12521 -17346 -103251
$$ packed form
17050G9940j80282p7046K4118M0659m964K5020l836j53618j0910K05917K45836
17039A90834Q5361j40834j49617j9839M5563L5074O1432k199n1022p464K34539
17028B81828l2179j87555p1659r2734J01996R5936j03084n7764q3202k12446J49122
17017b11741M7914P4664J51975j38884j5733J1420k6943N210K1259K05678q8996
17006C5823k16588j21418J10105K62058O8794j1037l10947l7870J23856q0492
16996a77716j07051m1223J44746J57402j1527n1730m3259j42904l5035R2613l0332
16985b46016J48295K84984K5330n0080k28855j1620p1240j31090K316j47807r4972
16974e20755J26525J44613j27331M7228J17317k828m0535J33365J09880m825q5905
$$ plain form
16963 -103251 -330905 -246875 -79604 -7640 7935 3879 -43073 -95975 -239227 -300672 -164151
16952 -164151 102599 301995 357094 198484 174172 13983 -70961 47621 57842 -50069
16942 -50069 -49430 151742 185027 6720 -233462 -269504 -201015 -67083 -52669 -7252 226116
16931 226116 333455 167223 -32284 -18855 51097 197573 250801 153272 83023 162361 212648
16920 212648 158733 64265 -83914 -160348 -123601 38838 104996 -71596 -63777 -12439 -26691
16909 -26691 133382 193417 231442 73712 155865 262692 184311 136263 79866 72596 75534
16898 75534 1538 83331 37267 32507 102795 219531 351963 353749 310591 186492 132108
16887 132108 84985 192671 91761 -63082 -99967 -15207 -36149 -34086 -29346 -4375 -28594
$$ packed form
16963a03251k27654Q4030J67271P1964J5575m056m6952n2902j43252o1445J36521
16952a64151K66750J99396N5099j58610k4312j60189q4944J18582J0221j07911
16942e0069O39K01172L3285j78307k40182l6042O8489J33932J4414M5417K33368
16931B26116J07339j66232j99507J3429O9952J46476N3228r7529p0249P9338N0287
16920B12648n3915r4468j48179p6434L6747J62439O6158j76592P819N1338j4252
16909b6691J60073O0035L8025j57730Q2153J06827p8381m8048n6397p270K938
16898G5534p3996Q1793m6064m760P0288J16736J32432J786m3158j24099n4384
16887A32108m7123J07686j00910j54843l6885Q4760k0942K063M740K4971k4219
$$ plain form
16876 -28594 -17820 -7997 -66015 -153196 -131781 -11011 -39900 -105810 85636 375130 374981 196738
16864 196738 -46083 -78471 -122859 -131114 12605 -51629 -86220 -104869 63322 138048 153829
16853 153829 115942 194127 123825 -35478 -197285 -332952 -400473 -324459 -207195 -104254
16843 -104254 27220 27956 17324 51428 107137 18378 -98995 -197546 -205589 -174155 -208149 -157140
16831 -157140 -134376 -51888 -11163 115769 130264 49088 -71917 -71585 -88543 -4385 -125755
16820 -125755 -110592 -39289 -99701 -90015 -36358 -106248 -213716 -351127 -221341 102437 181369
16809 181369 134654 100596 -47096 -120292 -12551 -234114 -302467 -287033 -292439 -259145 -232757
16798 -232757 -223466 -196344 -121842 -55122 -105216 -221012 -261556 -325680 -149889 -25129 -115264
$$ packed form
16876b8594J0774R823n8018q7181K1415J20770k8889o5910J91446K89494j49j78243
16864A96738k42821l2388m4388q255J43719o4234l4591j8649J68191P4726J5781
16853A53829l7887P8185p0302j59303j61807j35667o7521P6014J17264J02941
16843a04254J31474P36j0632L4104N5709q8759j17373r8551q043L1434l3994N1009
16831a57140K2764Q2488M0725J26932J4495q1176j21005L32j6958Q4158j21370
16820a25755J5163P1303o0412R686N3657o9890j07468j37411J29786L23778P8932
16809A81369m6715l4058j47692p3196J07741k21563o8353J5434n406L3294K6388
16798b32757R291K7122P4502O6720n0094j15796m0544o4124J75791J24760r0135
$$ plain form
16787 -115264 -304644 -309572 -230899 -214870 -208781 -405540 -438718 -263185 -293601 -204426 -136362
16776 -136362 28998 -22866 134496 69615 -65902 -71050 -5286 -40966 -122804 -5958 -10232
16765 -10232 -43501 42667 5946 -66124 -172036 -117102 191 170672 -17587 -103714 54073
16754 54073 -12985 -151088 -328657 -246397 -241466 -248888 -300518 -241791 -155750 -185160 -261355 -291087
16742 -291087 -117776 -8523 70814 41936 3921 -96639 -39698 99216 19694 42245 -210089
16731 -210089 -319069 -187585 -214834 -122106 35701 43369 166064 96352 -2246 -26828 14373
16720 14373 30510 34146 -67409 -39570 37315 25331 -73836 -130466 -96373 69508 131687
16709 131687 15052 -65872 -93320 -109376 100684 209542 386777 334535 198600 107117
$$ packed form
16787a15264j89380m928P8673J6029O089j96759l3178J75533l0416Q9175O8064
16776a36362J65360n1864J57362o4881j35517n148O5764l5680q1838J16846m274
16765a0232l3269Q6168l6721p2070j05912N4934J17293J70481j88259q6127J57787
16754E4073o7058j38103j77569Q2260M931p422n1630N8727Q6041k9410p6195k9732
16742b91087J73311J09253P9337k8878l8015j00560N6941J38914p9522K2551k52334
16731b10089j08980J31484k7249R2728J57807P668J22695o9712r8598k4582M1201
16720A4373J6137L636j01555K7839P6885j1984r9167n6630L4093J65881O2179
16709A31687j16635q0924k7448j6056K10060J08858J77235n2242j35935r1483
$$ plain form
16699 107117 -12749 -195325 -284235 -191753 -130945 -203592 -193295 -190743 -144422 -35781 -41405
16688 -41405 -72845 -92684 -137284 -120067 -242108 -334893 -249166 -252759 -127591 -72303 66530
16677 66530 71154 5088 54391 53128 62230 -79300 -203192 -51632 -26012 -86866 -259452
16666 -259452 -311142 -256168 -219037 -185173 -47005 -131454 -435170 -456709 -423168 -519211 -511515
16655 -511515 -380751 -436521 -331122 -76349 64101 -9844 -1148 94373 19740 -20890 27073
16644 27073 -40744 -167284 -180513 -190635 -191843 -208591 -217781 -219326 -77192 117263 213671 174856
16632 174856 28882 -180563 -159311 -151098 -121307 -159447 -141233 -92474 -204709 -230507 -85960
16621 -85960 46423 -33199 -64860 -158499 -192563 -172476 -141860 -174307 -37443 45749 -53278
$$ packed form
16699A07117j19866j82576q8910R2482O0808p2647J0297K552M6321J08641n624
16688d1405l1440j9839m4600J7217j22041r2785Q5727l593J25168N5288J38833
16677F6530M624o6066M9303j263R102j41530j23892J51560K5620o0854j72586
16666b59452n1690N4974L7131L3864J38168q4449l03716k1539L3541r6043P696
16655e11515J30764n5770J05399K54773J40450p3945Q696R5521p4633m0630M7963
16644B7073o7817j26540j3229j0122j208j6748r190j545J42134J94455R6408l8815
16632A74856j45974k09445K1252Q213K9791l8140J8214M8759j12235k5798J44547
16621h5960J32383p9622l1661r3639l4064K0087L0616l2447J36864Q3192r9027
$$ plain form
16610 -53278 -234549 -230887 -127791 40148 144780 21267 -102532 -185507 -139247 -106485 -142571
16599 -142571 33416 48998 113097 273019 253018 207689 197257 49975 -109233 -62293 -147277
16588 -147277 -270712 -230742 -48029 4410 -217268 -277403 -251664 -320051 -393208 -304653 -305495
16577 -305495 -195048 -77766 -43964 78069 38108 -7367 -74629 -140212 -245360 -174551 -172706
16566 -172706 -210333 -99448 -68950 16047 48000 24020 161267 44294 -174633 -297388
16556 -297388 -177204 -158558 -131077 -75895 -129530 -14027 108749 156459 63969 69973 75455
16545 75455 40066 -31008 -119200 -46802 -99465 -201145 -64063 -28513 137217 389477 403279
16534 403279 270774 128058 39988 129290 200840 164533 150374 104197 82897 -118037 -46887
$$ packed form
16610e3278j81271L662J03096J67939J04632j23513j23799q2975M6260L2762l6086
16599a42571J75987J5582O4099J59922k0001m5329j0432j47282j59208M6940q4984
16588a47277j23435L9970J82713N2439k21678o0135K5739o8387p3157Q8555q42
16577c05495J10447J17282L3802J22033l9961m5475o7262o5583j05148P0809J845
16566a72706l7627J10885L0498Q4997L1953k3980J37247j16973k18927j22755
16556b97388J20184J8646K7481N5182n3635J15503J22776M7710r2490O004N482
16545G5455l5389p1074q8192P2398n2663j01680J37082L5550J65730K52260J3802
16534D03279j32505j42716q8070Q9302P1550l6307j4159m6177k1300k00934P1150
$$ plain form
16523 -46887 -20875 -29834 48529 31915 107142 45176 -31287 110545 224832 133356 31878
16512 31878 95435 -2511 -133315 -194913 -186515 -247713 -179014 -94417 42018 -127052 -351250
16501 -351250 -358899 -172029 -32259 -53323 -236066 -324282 -330902 -448314 -387500 -186159 -57578
16490 -57578 -10207 -113130 -76859 -3983 -153167 -163724 59423 234161 152546 64646 -71783
16479 -71783 -93266 -183944 -197410 -99364 -22222 206362 214828 202674 58462 -250942 -334185
16468 -334185 -238247 -13305 -50759 -158318 -308775 -349807 -105756 -27707 -2957 149436
16458 149436 65388 1907 66482 -46627 -202242 -183811 51631 -50917 -253565 -173943
16448 -173943 -152850 -273623 -173424 -24312 -7663 -105341 -65452 54030 -104778 61177
$$ packed form
16523d6887K6012q959P8363j6614P5227o1966p6463J41832J14287r1476j01478
16512C1878O3557r7946j30804o1598Q398o1198O8699Q4597J36435j69070k24198
16501c51250p649J86870J39770k1064j82743q8216o620j17412O0814K01341J28581
16490e7578M7371j02923L6271P2876j49184j0557K23147J74738q1615q7900j36429
16479g1783k1483r0678j3466R8046P7142K28584Q466j2154j44212l09404q3243
16468c34185R5938K24942l7454j07559j50457m1032K44051P8049K4750J52393
16458A49436q4048o3481O4575j13109j55615J8431K35442j02548k02648P9622
16448a73943K1093j20773J00199J49112J6649r7678L9889J19482j58808J65955
$$ plain form
16438 61177 -5128 -204363 -227521 3611 146676 74224 102702 92483 108621 72365 -58511
16427 -58511 -262525 -217668 -232329 -153249 -19672 -30076 -263030 -203807 -231088 -221648 -153420
16416 -153420 -95375 -102447 -238154 -223902 -102407 -126273 -27665 552 -185256 -218199 -53811
16405 -53811 70270 -58639 -173968 2232 96751 119143 70835 20880 -4995 131947 259140
16394 259140 112717 -159050 -347745 -371883 -334503 -244195 -104161 -4266 -72158 -86685 -38374
16383 -38374 11755 111509 76915 107389 108785 121957 65862 65228 242212 299499 227232 309284
16371 309284 331248 165705 -130038 -130760 -167607 -261257 -187899 -11399 43237 252120 156381
16360 156381 -8090 46112 -8933 -139856 -75445 23145 -434 22011 73000 95394 95690
$$ packed form
16438F1177o6305j99235k3158K31132J43065p2452K8478j0219J6138l6256j30876
16427e8511k04014M4857j4661P9080J33577j0404k32954N9223k7281R440O8228
16416a53420N8045p072j35707J4252J21495k3866R8608K8217j85808l2943J64388
16405e3811J24081j28909j15329J76200R4519K2392m8308m9955k5875J36942J27193
16394B59140j46423k71767j88695k4138L7380R0308J40034R9895o7892j4527M8311
16383c8374N0129R9754l4594L0474J396J3172n6095o34J76984N7287p2267Q2052
16371C09284K1964j65543k95743p22l6847r3650P3358J76500N4636K08883r5739
16360A56381j64471N4202n5045j30923O4411R8590k3579K2445N0989K2394K96
$$ plain form
16349 95690 51332 31717 55506 49124 -12862 -97893 -155994 -142882 -16441 140199 -56066
16338 -56066 -132578 -101289 -63036 27036 6589 55683 125947 199508 59070 -51654 -131686
16327 -131686 25683 173399 51904 -47665 -44866 -81454 -119179 -105266 -83058 -60111 25082
16316 25082 6135 -197994 -185142 -36750 -5797 -18982 -63819 -32058 -49974 -107643 -117983
16305 -117983 7078 205427 24223 -152470 -134588 55548 27077 77394 29260 -34076
16295 -34076 63491 142774 139831 39427 -49324 -68790 1246 -38060 -110615 -127762 31724
16284 31724 57592 41832 -114491 -113463 -59592 -39986 -79782 -127961 -73032 19155 -84974
16273 -84974 -179088 -414850 -308933 -239933 -242643 -128724 -102507 -91757 -10114 -144422 -191160
$$ packed form
16349I5690m4358j9615K3789o382o1986q5031n8101J3112J26441J56640j96265
16338e6066p6512L1289L8253R0072k0447M9094P0264P3561j40438j10724q0032
16327a31686J57369J47716j21495r9569K799l6588l7725J3913K2208K2947Q5193
16316B5082j8947k04129J2852J48392L0953j3185m4837L1761j7916n7669j0340
16305a17983J25061J98349j81204j76693J7882J90136k8471N0317m8134o3336
16295c4076R7567P9283k943j00404q8751j9466P0036l9306p2555j7147J59486
16284C1724K5868j5760j56323J028N3871J9606l9796m8179N4929R2187j04129
16273h4974r4114k35762J05917O9000k710J13919K6217J0750Q1643j34308m6738
$$ plain form
16262 -191160 -245264 -159927 -69967 52406 97575 -17641 -108621 -160739 -155003 -30481 118159
16251 118159 128020 40117 78095 -78565 -195252 -133525 -23540 -24185 -63077 5936 29203
16240 29203 15428 146453 127223 82823 141213 68409 -71326 -57916 -30511 -29851 23062 103223
16228 103223 -51366 -184012 -243550 -276474 -225615 -58329 13756 -69889 -69493 -114270 -133274
16217 -133274 -110149 -11686 82728 107167 7198 -218838 -327134 -101812 66181 195231
16207 195231 152218 -64990 -162495 -151873 -145058 -166091 -93098 -99452 -131514 -217438 -157582 -44214
16195 -44214 -34086 43537 121630 48671 28551 27322 33620 -58822 -87851 -56038 5393 -51575
16183 -51575 -106886 53086 263024 268477 17935 -72202 -126319 -68339 47499 44957 -167761
$$ packed form
16262a91160n4104Q5337Q9960J22373M5169j15216r0980n2118N736J24522J48640
16251A18159R861q7903L7978j56660j16687O1727J09985o45l8892O9013K3267
16240B9203j3775J31025j9230m4400N8390p2804j39735J3410K7405O60N2913Q0161
16228A03223j54589j32646n9538l2924N0859J67286P2085q3645L96m4777j9004
16217a33274K3125R8463R4414K4439r9969k26036j08296K25322J67993J29050
16207A95231m3013k17208r7505J0622O815k1033P2993o354l2062q5924N9856J13368
16195d4214J0128P7623P8093p2959k0120j229O298r2442k9029L1813O1431n6968
16183e1575n5311J59972K09938N453k50542r0137n4117N7980J15838k542k12718
$$ plain form
16172 -167761 -161723 -97430 -120981 -171175 -78382 -121329 -268366 -426947 -304101 -136953 -34504
16161 -34504 13167 -75802 -212923 -147889 -126108 -259867 -368739 -173194 -67580 -93544 -28984
16150 -28984 22403 58882 101367 184908 241498 86744 77129 -156730 -170647 9334 -8376
16139 -8376 -105347 -124493 -163749 -50063 -43411 -45759 -145919 -78359 -98397 -203542 -86164
16128 -86164 107779 168801 87138 184102 108968 -14307 -181524 3120 95779 95393 173185
16117 173185 133206 169830 180859 39812 -11117 22049 42546 131832 29399 -77328 -188147
16106 -188147 -206998 -142174 -127802 -75884 -5404 -147939 -363094 -378713 -236368 -6655 170944
16095 170944 137374 282183 286085 166808 7525 53644 -17041 -81383 -155962 -173960 10346
$$ packed form
16172a67761O038O4293k3551n0194R2793m2947j47037j58581J22846J67148J02449
16161c4504M7671q8969j37121O5034K1781j33759j08872J95545J05614k5964O4560
16150b8984N1387L6479M2485Q3541N6590j54754r615k33859j3917J79981j7710
16139h376r6971j9146l9256J13686O652k348j00160O7560k0038j05145J17378
16128h6164J93943O1022q1663R6964p5134j23275j67217J84644R2659l86P7792
16117A73185l9979L6624J1029j41047n0929L3166K0497Q9286j02433j06727j10819
16106a88147j8851O4824J4372N1918P0480j42535k15155j5619J42345K29713J77599
16095A70944l3570J44809L902j19277j59283M6119p0685o4342p4579j7998J84306
$$ plain form
16084 10346 -6817 -91289 -89468 -199339 -378087 -184857 -198299 -252179 -227019 -142401 138314
16073 138314 140474 -53987 -159876 -111409 12522 6199 -52853 -35601 39294 -14635 -78511
16062 -78511 -107559 -172488 -312354 -127640 -185498 -276998 -130114 84061 -47075 34465 170572
16051 170572 61055 -7852 -9243 -88295 -220374 -101151 -89712 -95562 -89713 -74432 -15346
16040 -15346 -15800 18740 174968 48525 -76262 -81642 -86534 -25405 183882 204507 146718 105760
16028 105760 -46386 50127 183394 220980 234112 264981 357965 198033 217418 311010 306466
16017 306466 130634 -51067 -92200 -77295 -101514 -93228 -33135 27691 -178472 -166960 73759
16006 73759 130827 127230 37022 144649 176526 149288 -18336 -119159 -91138 12276 39367
$$ packed form
16084A0346j7163q4472J821j09871j78748J93230j3442n3880K5160Q4618K80715
16073A38314K160j94461j05889M8467J23931o323n9052J7252P4895n3929o3876
16062g8511k9048o4929j39866J84714n7858r1500J46884K14175j31136Q1540J36107
16051A70572j09517o8907j391p9052j32079J19223J1439n850N849J5281N9086
16040a5346m54L4540J56228j26443j24787n380m892O1129K09287K0625n7789m0958
16028A05760j52146R6513J33267L7586J3132L0869R2984j59932J9385R3592m544
16017C06466j75832j81701m1133J4905k4219Q286O0093O0826k06163J1512K40719
16006G3759N7068l597r0208J07627L1877k7238j67624j00823K8021J03414K7091
$$ plain form
15995 39367 -94076 -75578 6437 -115590 -196839 -211753 -228520 -239426 -208385 -157059 -42871
15984 -42871 4727 102562 51347 41291 -1321 -5854 -120909 -187146 99250 176631 167298 26498
15972 26498 -94957 -108449 -97097 -45928 203855 427774 243726 118312 25862 -26917 -97539
15961 -97539 -50200 27539 -32974 -91967 -111912 27909 112630 180436 133043 112615 136760
15950 136760 263656 247438 191549 311200 243886 231208 106042 31114 168113 54665
15940 54665 -12272 19907 -27120 -42006 -10369 -72232 45856 252794 436059 471259 440827
15929 440827 222317 -47093 -91905 22934 42983 -13307 -12994 -12354 -65070 102000 113135
15918 113135 115179 2678 27217 246512 430454 302180 -12133 -266013 -173212 -76638
$$ packed form
15995C9367j33443J8498Q2015j22027q1249j4914j6767j0906L1041N1326J14188
15984d2871M7598R7835n1215j0056m2612m533j15055o6237K86396P7381r333j40800
15972B6498j21455j3492J1352N1169K49783K23919j84048j25414r2450n2779p0622
15961i7539M7339P7739o0513n8993j9945J39821Q4721O7806m7393k0428K4145
15950A36760J26896j6218n5889J19651o7314j2678j25166p4928J36999j13448
15940E4665o6937L2179m7027j4886L1637o1863J18088K06938J83265L5200l0432
15929D40827k18510k69410m4812J14839K0049n6290L13O40n2716J67070J1135
15918A13135K044j12501K4539K19295J83942j28274l14313k53880R2801R6574
$$ plain form
15908 -76638 3298 70508 57542 -82787 -158150 -32166 -55296 -102360 -128242 34746 209127
15897 209127 251747 106510 -61433 -73891 59481 151524 92030 40811 88342 87651 10315
15886 10315 -19825 160366 328957 282274 7005 -143334 -64456 -49488 -49912 19676 65239
15875 65239 121136 88504 123096 104429 121877 163151 173969 231854 5344 -231319 9115
15864 9115 111155 125670 44042 102067 -23008 -108355 -179493 -150805 -66242 -36180 27980
15853 27980 187791 106146 102856 194726 108658 58111 84477 -18736 116137 207852 77528
15842 77528 64227 41068 2299 168248 328713 164553 -47327 -9127 8851 -40098 -167978
15831 -167978 -241594 -9435 43708 -245396 -154397 -27810 69584 190754 143649 186946 174180
$$ packed form
15908g6638P9936O7210j2966j40329p5363J25984k3130m7064k5882J62988J74381
15897B09127M2620j45237j67943j2458J33372R2043n9494n1219M7531o91p7336
15886A0315l0140J80191J68591m6683k75269j50339P8878J4968m24O9588M5563
15875F5239N5897l2632L4592j8667J7448M1274J0818N7885k26510k36663K40434
15864I115J02040J4515q1628N8025j25075q5347p1138K8688Q4563L0062O4160
15853B7980J59811q1645l290R1870q6068n0547K6366j03213J34873R1715j30324
15842G7528j3301k3159l8769J65949J60465j64160k11880L8200J7978m8949j27880
15831a67978p3616K32159N3143k89104R0999J26587R7394J21170m7105M3297j2766
$$ plain form
15820 174180 56736 133963 126854 275756 242936 252898 119339 116488 38590 -48442 -217609
15809 -217609 -77246 -90065 -71719 19901 76060 -80306 -108899 -151100 -160773 -8288 -77624
15798 -77624 9616 65137 -20042 -62373 88026 182279 238795 222334 83436 132062 140899
15787 140899 177513 159341 120113 -18571 -95479 -166346 -108541 -84204 -128917 1328 55369
15776 55369 81380 -13421 -132047 -164563 -189626 -234355 -222016 -165727 -95744 50539 -37172
15765 -37172 -109070 -220539 -214031 -164974 -201340 -163302 -286051 -86761 111163 107029 32997
15754 32997 132811 232828 233091 153813 184583 204671 87454 -19997 -77494 -59990 -7597
15743 -7597 -183508 -387699 -409704 -204220 -163260 -101547 -209928 -230430 -89704 -96247 -248845
$$ packed form
15820A74180j17444P7227p109J48902l2820R962j33559k851p7898q7032j69167
15809b17609J40363j2819J8346R1620N6159j56366k8593m2201r673J52485o9336
15798g7624Q7240N5521q5179m2331J50399R4253N6516j6461j38898M8626Q837
15787A40899L6614j8172l9228j38684p6908p0867N7805K4337m4713J30245N4041
15776E5369K6011r4801j18626l2516k5063m4729J2339N6289O9983J46283q7711
15765c7172p1898j11469O508M9057l6366L8038j22749J99290J97924m134p4032
15754C2997R9814J00017K63p9278L0770K0088j17217j07451n7497J7504N2393
15743g597j75911k04191k2005K05484M0960O1713j08381k0502J40726o543j52598
$$ plain form
15732 -248845 -294127 -197417 -50489 209132 203512 36141 19957 80624 86296 156487 192780
15721 192780 141629 -24759 58424 9627 -56271 -39794 -41951 -155354 -232980 -261190 -185132
15710 -185132 -141096 -132022 -27398 -47925 14404 2869 -69365 -151774 -53500 18891 29589
15699 29589 55311 58020 -48444 45370 -16329 -46532 57999 161289 299624 187583 -39183
15688 -39183 -26514 53148 57396 -78225 -136723 53702 145396 96283 -67909 -25851 29214
15677 29214 175060 165929 40214 59428 38685 124851 138971 103501 41395 -27231 -87084
15666 -87084 28422 104462 7317 83549 -3433 17292 -67517 114168 193669 43385 64617
15655 64617 119612 28342 -91352 29214 187975 3722 -116138 -65359 41197 49565 -18400
$$ packed form
15732b48845m5282R6710J46928K59621n620j67371j6184O0667N672P0191L6293
15721A92780n1151j66388Q3183m8797o5898J6477k157j13403p7626k8210P6058
15710a85132M4036R074J04624k0527O2329j1535p2234q2409R8274P2391J0698
15699B9589K5722K709j06464R3814o1699l0203J04531J03290J38335j12041k26766
15688c9183J2669P9662M248j35621n8498J90425R1694m9113j64192M2058N5065
15677B9214J45846r131j25715J9214k0743Q6166J4120l5470o2106o8626n9853
15666h7084J15506P6040r7145P6232q6982K0725q4809J81685P9501j50284K1232
15655F4617N4995r1270j19694J20566J58761j84253j19860N0779J06556Q368o7965
$$ plain form
15644 -18400 -43810 16110 55168 38735 -32568 -117149 -129995 -57050 -126859 -147955 -289936
15633 -289936 -197922 -91945 -61118 17585 110181 19480 -180799 -193016 -86431 -35262 52919
15622 52919 44285 170043 40644 -1078 73775 192823 72541 137695 132040 -40885 -131859
15611 -131859 -265753 -122374 -22787 -9697 -32542 -102507 53668 62625 53232 -91389 -68738
15600 -68738 -74514 -125820 -104105 126527 212567 85954 65006 -47816 -212198 -101553 -90869
15589 -90869 -36494 12596 -5359 -68614 -128439 -224547 -339696 -298482 -360889 -345572 -156718
15578 -156718 -16043 222814 177857 114304 91095 214872 232623 153622 -55127 -72441 -91072
15567 -91072 90517 150722 162507 111059 21411 -35018 27031 46706 50045 -50355 24377
$$ packed form
15644a8400k5410N9920L9058j6433p1303q4581j2846P2945o9809k1096j41981
15633b89936R2014J05977L0827P8703R2596r0701k00279j2217J06585N1169Q8181
15622E2919q634J25758j29399m1722P4853J19048j20282O5154n655j72925r0974
15611a31859j33894J43379R9587J3090k2845o9965J56175Q957r393j44621K2651
15600f8738n776n1306K1715K30632Q6040j26613k0948j12822j64382J10645J0684
15589i0869N4375M9090j7955o3255n9825r6108j15149M1214o2407J5317J88854
15578a56718J40675K38857m4957o3553k3209J23777J7751p9001k08749j7314j8631
15567i1072J81589O0205J1785n1448q9648n6429O2049J9675L339j00400P4732
$$ plain form
15556 24377 228606 191478 33598 9241 -107785 -140754 -120396 -70374 -26096 -12460 85909
15545 85909 -34346 -48737 -87111 -195353 -233375 -231303 -128940 -52774 -113430 -145234 -196255
15534 -196255 -56296 -23599 -150696 -254850 -165605 -249511 -290940 -253574 -134088 4001
15524 4001 -837 -99725 -158745 -201600 -239446 -225882 -72438 93407 119032 21112 143303
15513 143303 131607 -53999 -149457 -112834 -133095 -86518 -8056 -83955 -193571 -140503 -31911
15502 -31911 -35596 -136297 -110399 -94093 -293628 -214419 -44005 43351 -20559 -79101 -44575
15491 -44575 67885 7640 -74494 -43692 -9544 -29371 -158453 -258353 -326440 -131223 215906
15480 215906 303784 305880 273604 292637 274137 157125 21819 -46548 -78284 -36921 -83562
$$ packed form
15556B4377K04229l7128j57880k4357j17026l2969K0358N0022M4278J3636R8369
15545H5909j20255j4391l8374j08242l8022K072J02363P6166o0656l1804n1021
15534a96255J39959L2697j27097j04154Q9245q3906m1429L7366J19486J38089
15524D001m838r8888n9020m2855l7846J3564J53444J65845K5625r7920J22191
15513A43303j1696j85606r5458L6623k0261M6577P8462p5899j09616N3068J08592
15502c1911l685j00701K5898J6306j99535P9209J70414Q7356o3910n8542L4526
15491d4575J12460o0245q2134L0802L4148j9827j29082r9900o8087J95217L47129
15480B15906Q7878K096l2276J9033j8500j17012j35306o8367l1736M1363m6641
$$ plain form
15469 -83562 5848 -40449 -160114 -161977 -51832 -95993 22844 73096 53341 -67224 35587
15458 35587 26139 -113745 37747 93837 252615 288097 138627 140327 142273 95406 -31
15447 -31 57732 221300 167598 -50801 -65701 -54144 -72144 -22414 51816 -35456 -284582 -347944
15435 -347944 -173419 -169223 -210635 -176455 -298303 -200091 -42495 -64764 -167417 -163054 -128825
15424 -128825 -70995 -133638 176902 338769 223608 97127 20536 -179714 -205406 -124446
15414 -124446 3487 245946 361497 228984 44245 -20357 8444 195558 86614 173537
15404 173537 230376 215953 177330 121206 133668 -53601 -212753 -29090 -33504 46498 19551
15393 19551 -4734 133854 183079 160441 186091 149109 185004 136107 210967 154424 108682
$$ packed form
15469h3562Q9410m6297j19665j863J10145m4161J18837N0252j9755j20565J02811
15458C5587r448j39884J51492N6090J58778L5482j49470J700J946m6867r5437
15447c1N7763J63568n3702k18399j4900J1557j8000M9730P4230q7272k49126o3362
15435c47944J74525M196m1412L4180j21848R8212J57596k2269j02653M363L4229
15424a28825N7830o2643L10540J61867j15161j26481p6591k00250k5692Q0960
15414a24446J27933K42459J15551j32513j84739o4602K8801J87114j08944Q6923
15404A73537N6839j4423l8623n6124J2462j87269j59152J83663m414Q0002k6947
15393A9551k4285J38588M9225k2638K5650l6982L5895m8897P4860n6543m5742
$$ plain form
15382 108682 1435 72402 38542 53861 134165 96470 -70614 -108393 -227771 -284900 -252640
15371 -252640 -296520 -251553 -74360 150450 190726 205652 108667 37904 45914 70972 147871
15360 147871 2244 117047 293126 205125 175559 97129 11424 -146135 -2871 112937
15350 112937 87930 3790 -111205 -166492 8420 92731 59053 23321 21132 105720 121678
15339 121678 212032 301889 157086 168447 220619 197241 40962 -10370 -162240 -197112 -150843
15328 -150843 -131366 -150654 -125323 -21436 83472 35699 -1056 -149526 -96978 50308 260249
15317 260249 200258 150290 42605 114604 133942 134053 -31017 -84857 -91463 -152608 15288
15306 15288 83267 106181 110879 60748 -2308 67054 -69673 -126323 -243849 -262374 -86802
$$ packed form
15382A08682j07247P0967l3860J5319Q0304l7695j67084l7779j19378n7129L2260
15371b52640m3880M4967J77193K24810M0276J4926r6985p0763Q010K5058P6899
15360A47871j45627J14803J76079q8001k9566p8430q5705j57559J43264J15808
15350A12937k5007q4140j14995n5287J74912Q4311l3678l5732k189Q4588J5958
15339A21678R0354Q9857j44803J1361N2172k3378j56279n1332j51870l4872M6269
15328a50843J9477j9288K5331J03887J04908m7773l6755j48470N2548J47286K09941
15317B60249n9991m9968j07685P1999J9338J11j65070n3840o606o1145J67896
15306A5288O7979K2914M698n0131o3056O9362j36727n6650j17526j8525J75572
$$ [...]
##END NTUPLES=NMR SPECTRUM
##END=
