##TITLE=Analysis number 329789
Compound Code cc 33913
Project Code adrs
Chemist Name ugmt
##JCAMPDX= 6.0         $$ Bruker NMR JCAMP-DX V2.0
##DATA TYPE= NMR SPECTRUM
##DATA CLASS= NTUPLES
##ORIGIN= Bruker BioSpin GmbH
##OWNER= nmr
$$ XWIN-NMR		Version 3.5
$$ Thu Sep 27 12:15:10 2007 GMT Daylight Time (UT+1h)  MAYBRIDGE\nmr@NMR_250MHZ
##.OBSERVE FREQUENCY= 250.131544655141
##.OBSERVE NUCLEUS= ^1H
##.ACQUISITION MODE= SIMULTANEOUS (DQD)
##.ACQUISITION SCHEME= undefined
##.AVERAGES= 16
##.DIGITISER RES= 18
##SPECTROMETER/DATA SYSTEM= dpx250
##.PULSE SEQUENCE= zg30
##.SOLVENT NAME= CDCl3
##.SHIFT REFERENCE= (INTERNAL, CDCl3, 0, 16.522)
##AUDIT TRAIL= $$ (NUMBER, WHEN, WHO, WHERE, WHAT)
$$ ##TITLE= Audit trail, XWIN-NMR		Version 3.5
$$ ##JCAMPDX= 5.01
$$ ##ORIGIN= Bruker BioSpin GmbH
$$ ##OWNER= nmr
$$ C:\u/data/dgb/nmr/ADRS/2690/pdata/1/auditp.txt
$$ ##AUDIT TRAIL=  $$ (NUMBER, WHEN, WHO, WHERE, WHAT)
(   1,<2007-09-27 12:14:46.82 +100>,<MAYBRIDGE\nmr>,<NMR_250MHZ>,
      <created by zg, POWCHK disabled, PULCHK disabled
       configuration hash MD5:
       76 6E 9A 78 1E 09 19 81 EC 84 63 8F B0 6A 59 2D
       data hash MD5: 64K
       F1 EB 17 3B F6 E5 32 DD E1 30 96 19 4C 8D 03 9F>)
(   2,<2007-09-27 12:15:00.35 +100>,<MAYBRIDGE\nmr>,<NMR_250MHZ>,
      <Start of raw data processing
       ef LB = 0.3 FT_mod = 6 PKNL = 1 SI = 32K 
       data hash MD5: 32K
       38 8A 84 9D 57 83 A0 E8 15 39 8E 86 6B 5E DB 13>)
(   3,<2007-09-27 12:15:02.45 +100>,<MAYBRIDGE\nmr>,<NMR_250MHZ>,
      <apk 
       data hash MD5: 32K
       0F BB 73 08 50 13 F5 C1 5C F0 32 DC FC 14 40 56>)
(   4,<2007-09-27 12:15:03.45 +100>,<MAYBRIDGE\nmr>,<NMR_250MHZ>,
      <abs ABSG = 5 
       data hash MD5: 32K
       1B D7 53 CA 2F B1 1C C9 D2 A7 20 01 08 81 AE 46>)
$$ ##END=
$$ 
$$ hash MD5
$$ F8 D9 64 95 15 06 1D C8 81 48 A1 D4 BA 34 3B 42
##$RELAX= 
##$RELAX= 
##$RELAX= 
##$RELAX= 
##$RELAX= 
##$RELAX= 
##$RELAX= 
$$ Bruker specific parameters
$$ --------------------------
##$DU= <C:\u>
##$EXPNO= 2690
##$NAME= <ADRS>
##$PROCNO= 1
##$TYPE= <nmr>
##$USER= <dgb>
##$AMP= (0..31)
100 100 100 100 100 100 100 100 100 100 100 100 100 100 100 100 100 100 
100 100 100 100 100 100 100 100 100 100 100 100 100 100 
##$AQSEQ= 0
##$AQ_mod= 3
##$AUNM= <au_zg>
##$AUTOPOS= <6 >
##$BF1= 250.13
##$BF2= 250.13
##$BF3= 250.13
##$BF4= 250.13
##$BF5= 500.13
##$BF6= 500.13
##$BF7= 500.13
##$BF8= 500.13
##$BYTORDA= 1
##$CFDGTYP= 0
##$CFRGTYP= 5
##$CHEMSTR= <none>
##$CNST= (0..31)
1 1 145 1 1 1 1 1 1 1 1 1 1 1 1 1 1 1 1 1 1 1 1 1 1 1 1 1 1 1 1 1 
##$CPDPRG= <>
##$CPDPRG1= <>
##$CPDPRG2= <>
##$CPDPRG3= <>
##$CPDPRG4= <mlev>
##$CPDPRG5= <mlev>
##$CPDPRG6= <mlev>
##$CPDPRG7= <mlev>
##$CPDPRG8= <mlev>
##$CPDPRGB= <>
##$CPDPRGT= <>
##$D= (0..31)
0 1 0 0 0 0 0 0 0 0.06 0 0 0 0 0 0 0.0002 0 0 0 0 0 0 0 0 0 0 0 0 0 0 
0 
##$DATE= 1190891685
##$DBL= (0..7)
120 120 120 120 120 120 120 120 
##$DBP= (0..7)
150 150 150 150 150 150 150 150 
##$DBP07= 0
##$DBPNAM0= <>
##$DBPNAM1= <>
##$DBPNAM2= <>
##$DBPNAM3= <>
$$ [...]
##$SUBNAM7= <"">
##$SUBNAM8= <"">
##$SUBNAM9= <"">
##$SW= 20.6930455092707
##$SWIBOX= (0..15)
0 0 3 0 0 0 0 0 0 0 0 0 0 0 0 0 
##$SW_h= 5175.983436853
##$TD= 65536
##$TD0= 1
##$TE= 296.16
##$TE2= 300
##$TE3= 300
##$TEG= 300
##$TL= (0..7)
0 120 120 120 120 120 120 120 
##$TP= (0..7)
150 150 150 150 150 150 150 150 
##$TP07= 0
##$TPNAME0= <>
##$TPNAME1= <>
##$TPNAME2= <>
##$TPNAME3= <>
##$TPNAME4= <>
##$TPNAME5= <>
##$TPNAME6= <>
##$TPNAME7= <>
##$TPOAL= (0..7)
0.5 0.5 0.5 0.5 0.5 0.5 0.5 0.5 
##$TPOFFS= (0..7)
0 0 0 0 0 0 0 0 
##$TUNHIN= 0
##$TUNHOUT= 0
##$TUNXOUT= 0
##$USERA1= <user>
##$USERA2= <user>
##$USERA3= <user>
##$USERA4= <user>
##$USERA5= <user>
##$V9= 5
##$VALIST= <valist>
##$VCLIST= <CCCCCCCCCCCCCCC>
##$VD= 0
##$VDLIST= <DDDDDDDDDDDDDDD>
##$VPLIST= <PPPPPPPPPPPPPPP>
##$VTLIST= <TTTTTTTTTTTTTTT>
##$WBST= 1024
##$WBSW= 4
##$XGAIN= (0..3)
0 0 0 0 
##$XL= 0
##$YL= 0
##$YMAX_a= 541348
##$YMIN_a= -433235
##$ZGOPTNS= <>
##$ZL1= 120
##$ZL2= 120
##$ZL3= 120
##$ZL4= 120
##$ABSF1= 16.522
##$ABSF2= -4.171173
##$ABSG= 5
##$ABSL= 3
##$ALPHA= 0
##$AQORDER= 0
##$ASSFAC= 0
##$ASSFACI= 0
##$ASSFACX= 0
##$ASSWID= 0
##$AUNMP= <proc_1d>
##$AZFE= 0.1
##$AZFW= 0.1
##$BCFW= 0
##$BC_mod= 0
##$BYTORDP= 0
##$COROFFS= 0
##$CY= 12.5
##$DATMOD= 1
##$DC= 0
##$DFILT= <>
##$DTYPP= 0
##$F1P= 14.0000005364418
##$F2P= -0.99999901652339
##$FCOR= 0.5
##$FTSIZE= 32768
##$FT_mod= 6
##$GAMMA= 0
##$GB= 0
##$INTBC= 1
##$INTSCL= 1
##$ISEN= 128
##$LB= 0.3
##$LEV0= 0
##$LPBIN= 0
##$MAXI= 10000
##$MC2= 0
##$MEAN= 0
##$ME_mod= 0
##$MI= 0
##$NCOEF= 0
##$NC_proc= -4
##$NLEV= 6
##$NOISF1= 0
##$NOISF2= 0
##$NSP= 0
##$NTH_PI= 0
##$NZP= 0
##$OFFSET= 16.522
##$PC= 1
##$PHC0= 6.692156
##$PHC1= 4.863731
##$PH_mod= 1
##$PKNL= yes
##$PPARMOD= 0
##$PSCAL= 4
##$PSIGN= 0
##$REVERSE= no
##$SF= 250.13
##$SI= 32768
##$SIGF1= 0
##$SIGF2= 0
##$SINO= 400
##$SIOLD= 32768
##$SREGLST= <1H.CDCl3>
##$SSB= 0
##$STSI= 32768
##$STSR= 0
##$SW_p= 5175.98343685301
##$SYMM= 0
##$S_DEV= 0
##$TDeff= 65536
##$TDoff= 0
##$TI= <Analysis number 999999
Compound Code 99
Book Reference 9
Project Code 9>
##$TILT= no
##$TM1= 0
##$TM2= 0
##$TOPLEV= 0
##$USERP1= <user>
##$USERP2= <user>
##$USERP3= <user>
##$USERP4= <user>
##$USERP5= <user>
##$WDW= 1
##$XDIM= 32768
##$YMAX_p= 273146051
##$YMIN_p= -56155
$$ End of Bruker specific parameters
$$ ---------------------------------
##NTUPLES= NMR SPECTRUM
##VAR_NAME=  FREQUENCY,     SPECTRUM/REAL,   SPECTRUM/IMAG
##SYMBOL=    X,             R,               I
##VAR_TYPE=  INDEPENDENT,   DEPENDENT,       DEPENDENT
##VAR_FORM=  AFFN,          ASDF,            ASDF
##VAR_DIM=   32768,         32768,           32768
##UNITS=     HZ,            ARBITRARY UNITS, ARBITRARY UNITS
##FACTOR=    0.157963299565203, 1,           1
##FIRST=     4132.6476996994, 0,             0
##LAST=      -1043.33573715361, 0,           0
##MIN=       -1043.33573715361, -56155,      0
##MAX=       4132.6476996994, 273146051,     0
$$ Real data points
##PAGE= N=1
##DATA TABLE= (X++(R..R)), XYDATA
$$ [...]
18721B91891m2737l6734m0708l5437l3162j3258m658J5591k962m506n738l218
18709H4364j2649j5936j8000j5103r324p991O734n66o142K852R301Q181Q72r929
18695A6664j971Q044l400q869l420J2078J227J6590J3229j1825L372J1910J7266
18682G0895K1302R070j98l12j324O313q081j601J4968L1937N6089M9147L6479
18669B84684K9345J6848r565l4129m8874n6304m6127m4263k2651r040r740r303
18657D0881q749j1404l582J2673N005J067j527K964j5707q731Q952Q951K637k4472
18643H958q093m889r977J597k930o31j1340p21K151L950J344J7891O588J949j2830
18628f983r124R940Q388l695K23O704k67L830J0666O341r54k238k4758n558R133
$$ plain form
18721 291891 249154 212420 171712 136275 103113 89855 85197 100788 97826 93320 87582 84364
18709 84364 71715 55779 37779 22676 13352 5361 12095 11529 5387 8239 17540 25721 26593 16664
18695 16664 14693 22737 19337 10468 7048 19126 20353 36943 50172 38347 41719 53629 70895
18682 70895 92197 101267 101069 100757 99433 105746 97665 96064 111032 142969 199058 248205 284684
18669 284684 314029 330877 321312 287183 238309 182005 135878 91615 68964 59924 50184 40881
18657 40881 32132 20728 17146 29819 34824 35891 34364 37328 21621 12890 21842 30793 33430 8958
18643 8958 865 -4024 -14001 -12404 -15334 -15965 -27305 -28026 -25875 -21925 -20581 -2690 3898 5847 -6983
18628 -6983 -16107 -6167 2221 -1474 -1251 5453 5186 9016 19682 26023 25069 22831 -1927 -7485 1648
18613A648Q463K316L033j834j320M484O71j3661r466j2657l271O119J8922J1215
18599A4662j6913j0420l791O375J0757L834L05j522k991O614P462P935j358L798
18585B4747L043J941o858j8132J7289k443j2825L034Q889J0736N244p942m921
18572B1802p337r161j0103K121O365n171M538q585j258R542j777J472J748j747
18558B449k858m630k52L57l986M842Q973O824p759m689L034n408K046J1326m976
18543E293Q455M303K962m214l428K068o849j1238j498P59Q831L485M477J2021
18529B5427K403j1454j2101P281J3680m637j6333L433J4280J3382K4402J9989
18517G9752J3269J0814J6782M6519K1346K0972R581K3347K0354J3444J1453p40
$$ plain form
18613 1648 10111 12427 15460 13626 12306 16790 17461 3800 -5666 -18323 -21594 -15475 3447 14662
18599 14662 -2251 -12671 -16462 -10087 670 4504 4809 3287 296 6910 14372 22307 20949 24747
18585 24747 27790 29731 22873 4741 22030 19587 6762 9796 18685 29421 34665 26723 21802
18572 21802 14465 5304 -4799 -2678 3687 -1484 3054 -5531 -6789 2753 976 2448 4196 2449
18558 2449 -409 -5039 -5291 -4934 -8920 -4078 4895 11719 3960 -729 2305 -3103 -1057 10269 5293
18543 5293 13748 18051 21013 16799 13371 15439 8590 -2648 -4146 -3387 5444 8929 13406 25427
18529 25427 27830 16376 4275 11556 25236 20599 4266 7699 21979 35361 59763 79752
18517 79752 93021 103835 120617 167136 188482 209454 219035 242382 262736 276180 287633 286893
18505B86893o033j3902N767p909n742P183L4311K8160N826J1441J2065J2152j4316
18492C55896k1696k3207k5503j6051k3535j6724p305P958J737j6591k3509k3944
18480A67526j4781r321l3197l1681j9015j5658r586R271J1650M840Q190J6562
18468H4800J9085J9673J4532M047M637J6238J1172n884k295P72J5278K3123K5067
18455B30245J6027K4811L7656M6854L4742J6147R377j481j144J714k1493k7433
18443C66022o341k947q500O419j520r617k2488j5280k5155k7924p570k2594k7588
18430A94917l1661k5674j3390j3666j0653q119n706n619j9012j4724j8619L055
18418C1129p310j7333J432J8897Q462r687K663n483J733P055k476Q259M475l625
$$ plain form
18505 286893 280860 266958 272725 264816 259074 266257 300568 328728 334554 345995 358060 370212 355896
18492 355896 334200 310993 285490 269439 245904 229180 221875 229833 231570 214979 191470 167526
18480 167526 152745 143424 110227 78546 59531 43873 34287 43558 55208 60048 68238 84800
18468 84800 103885 123558 138090 142137 146774 163012 174184 168300 166005 166777 182055 205178 230245
18455 230245 246272 271083 308739 355593 390335 406482 415859 414378 413234 414948 393455 366022
18443 366022 359681 356734 348234 354653 353133 343516 321028 305748 280593 252669 245099 222505 194917
18430 194917 163256 137582 124192 110526 99873 91754 86048 80429 61417 46693 28074 31129
18418 31129 23819 6486 7918 26815 35277 25590 28253 22770 24503 31558 29082 37341 41816 38191
18404C8191n447K604o149O114Q021M42j133m664k0875j0754L412Q178j260l403
18390A3277j1913O023J5372r130K950L218K757j504m413k850J240J0880J068M028
18376C1003j2448j7005P149J4899R344k0635k7640j3895J4756K4444N678K014
18364A7664k721Q278P969K04q01J276n122j1044k038M619j5274j680q76J214k230
18349e62Q450k808n280Q87L694q947Q567O814J769k429l813r886n323K791P843
18334A767j629K193J116Q139K938j3364j0545k941L71J3617J1972q018o704q511
18320i599j214R480M667M160K200R615J3683O661J1262k322q772J403L236L079
18306D7539n976q922p794n027L143R195M761j0663j5120K971J1425N759K067K535
$$ plain form
18404 38191 32744 35348 29199 35313 43334 43776 42643 37979 17104 6350 9762 17940 16680 13277
18390 13277 1364 7387 22759 13629 16579 19797 22554 21050 16637 13787 15027 25907 26975 31003
18376 31003 18555 1550 8699 23598 32942 12307 -15333 -29228 -14472 9972 15650 17664
18364 17664 14943 23221 31190 31394 30593 31869 26747 15703 13665 18284 3010 1330 454 1668 -562
18349 -562 7888 5080 -200 687 4381 -4566 4001 10815 12584 10155 6342 -3544 -8867 -6076 1767
18334 1767 138 2331 3447 11586 14524 1160 -9385 -12326 -11955 1662 13634 5616 -1088 -9599
18320 -9599 -10813 -1333 3334 7494 9694 19309 32992 39653 50915 48593 39821 41224 44460 47539
18306 47539 41563 32641 24847 19820 22963 32158 36919 26256 11136 14107 25532 31291 33358 35893
18292C5893k158J2892J3239j02r625k4976J394J316j1515R814M697L508o260k1321
18278F796J696Q820m06n7J4318J8360K804J1935J3755P518k745J670O401K804
18264I3669J225L561m415j2330j2375J1696Q235M577j1655m143N362p956j7089
18251E8362o672R004P885j532j3967j5983Q247J443J0509q76J1513M481j1886
18238F0528o150r637j7905p355R307m390J057L207k510O454J7557N901j948k521
18224E1595J1708J2772j1284m053k809J1240J9718J9940Q46M187j044q393J081
18211A05504m217J0479J696K414M048q973P48j14k0523k2898j840l08l591N902
18197F8327Q325O446o802j1754m996P12m934K589k780p73J834q501o098N29M948
$$ plain form
18292 35893 33735 46627 59866 59764 50139 25163 26557 27873 16358 26172 30869 34377 28117 6796
18278 6796 8492 17312 16906 16849 31167 49527 52331 64266 78021 85539 82794 84464 90865 93669
18264 93669 94894 98455 94040 81710 69335 81031 89266 93843 82188 78045 83407 75451 58362
18251 58362 51690 60694 68579 67047 53080 37097 45344 46787 57296 56420 67933 72414 60528
18238 60528 54378 44741 26836 19481 28788 24398 25455 28662 26152 32606 50163 56064 54116 51595
18224 51595 63303 76075 64791 60738 57929 69169 88887 108827 109673 113860 112816 104423 105504
18211 105504 101287 111766 113462 115876 119924 110951 111699 111585 91062 68164 66324 66016 62425 68327
18197 68327 76652 83098 76296 64542 59546 60258 55324 57913 55133 54360 56194 47693 41595 42124 47072
18182D7072J0599M347o873O852N295P51n645P831J6339j0448J0350J000p725r256
18168G0489l991M370K08p282K47j522m953j4588k068J103J5043J5866M887m647
18154G3162P18J268k443l248k103O735Q703R621n678l495j958n815K672k868M468
18139G9739J5849Q562j3413L418J2782J4568J1276J4770J3449K3008L2232K5533
18127B41773K3511J9836Q907K6832M0057O0404Q9534J16093J44773J87595K72890
18116A232205L90841O14320J079807K148658L958128N635744N903849J586481
18108B2550033l635945n681739m907511k852755j637492j030471o93929m68148
18100A642043l26209k24572j36536p7091n3674m7999o4333n7106l8378m6631l8409
$$ plain form
18182 47072 57671 62018 55145 61997 67292 68043 62398 70229 86568 76120 86470 87470 79745 70489
18168 70489 66498 70868 71076 63794 64041 62519 57566 42978 40910 42013 57056 72922 77809 73162
18154 73162 73880 75148 72705 69457 67354 74089 82792 92413 86735 83240 81282 75467 78139 75271 79739
18139 79739 95588 104150 90737 94155 106937 121505 132781 147551 161000 184008 216240 241773
18127 241773 265284 285120 294027 320859 360916 421320 510854 626947 771720 959315 1232205
18116 1232205 1623046 2237366 3317173 5465831 9423959 15059703 20963552 22550033
18108 22550033 18914088 13232349 8324838 5472083 3834591 2804120 2110191 1642043
18100 1642043 1315834 1091262 954726 877635 823961 775962 711629 654523 616145 569514 531105
18089E31105k6758r43J0708O79M075O140j650o123j648j322r633n433k4963k6108
18075D48126k3389j8007q865P682R06R898P125Q863R665J7159j439J0244J758
18062D69726P470J2187J9168J7305L0960K5310L9785N5093K8257M4051M8043P2525
18050H69880Q9494J12521J43876J55679J53651J75323J97574J98793K19615K87800
18040B604206L78449M84780O04281P79635R53765J050440J022414R87766J007951
18031I873687Q21922K98854j33060k62271k02646j15339P4791M58023J115773
18022A1929734K025956L422597N529784Q233676J0872090J2216525J2259822J2661234
18014G9151418J2577146Q791936J678527l460237n874815p704319j0336827j1298357
$$ plain form
18089 531105 504347 503404 514112 514791 518866 525006 523356 517233 515585 514263 504630 499197 474234 448126
18075 448126 424737 406730 397865 405547 406453 416351 423476 432339 442004 459163 457724 467968 469726
18062 469726 477196 489383 508551 525856 556816 582126 621911 677004 705261 749312 797355 869880
18050 869880 959374 1071895 1215771 1371450 1525101 1700424 1897998 2096791 2316406 2604206
18040 2604206 2982655 3467435 4071716 4851351 5805116 6855556 7877970 8865736 9873687
18031 9873687 10695609 10994463 10861403 10599132 10396486 10281147 10355938 10813961 11929734
18022 11929734 13955690 17378287 22908071 31141747 42013837 54230362 66490184 79151418
18014 79151418 91728564 100520500 102199027 98738790 92863975 85159656 74822829 63524472
18006F3524472r817183o965084m501731k760257j499048l52959K53860m84824
17998C7397246k122860l235417l606746l729144l863452l663811l031915k203326
17990A1940575j492667r75260n89499l64147k45464j39971k9529O1730J80359
17981H346127M14063Q45251J487496K326167L258593M038628M318195M275147
17973B9309667M256923L831946K320178M43511l67142K7017J084204K618492N002497
17964D8527293Q250192J2092951J5129416J5374934J2678456J0571039Q217515
17957A30841796K034584p664548j3607921j5227921j5304503j5853863j5007837
17950E0209787j2252316q666256n686803l586528k055629r44026k55007L5988
$$ plain form
18006 63524472 53707289 46742205 42240474 39480217 37981169 37628210 37882070 37397246
17998 37397246 35274386 32038969 28432223 24703079 20839627 17175816 14143901 11940575
17990 11940575 10447908 9472648 8883149 8519002 8273538 8133567 8104038 8165768 8346127
17981 8346127 8760190 9605441 11092937 13419104 16677697 20716325 25034520 29309667
17973 29309667 33566590 37398536 39718714 40162225 39795083 39822100 40906304 43524796 48527293
17964 48527293 56777485 68870436 83999852 99374786 112053242 122624281 130841796
17957 130841796 132876380 125211832 111603911 96375990 81071487 65217624 50209787
17950 50209787 37957471 29291215 23604412 20017884 17962255 17018229 16763222 16799210
17942A6799210K11140L46853J55701o45883j358918j630257j610952j669132j691849
17933H905913j495911j150114q52195o64762n32696m27212l49812l17502k90176
17924B825533k56303k17691j89018j54182j30914r8362r1662p5327o8592n3630
17914A489852m1676o3542p1513p1961q2402o6169m9999m7359n2910m8780m9710
17903H43831l8796k3709l0415l2068j9859l481k9285l5566j3577r370j2845l720
17891E91140j4629m437r7k3716j3037P00j078n225O566m258k5996j951j2133l1417
17877D60432j1296j5820j3584R43j242L792J3725j1253o85N473n138j31q028l117
17863D14071p912k0151k206p775r038M629L030N043p478j8193j6956j4143j3307
$$ plain form
17942 16799210 17010350 17357203 17512904 16867021 15508103 13877846 12266894 10597762 8905913
17933 8905913 7410002 6259888 5407693 4742931 4210235 3783023 3433211 3115709 2825533
17924 2825533 2569230 2351539 2162521 2008339 1877425 1779063 1687401 1612074 1543482 1489852
17914 1489852 1448176 1384634 1313121 1241160 1158758 1092589 1042590 995231 942321 893541 843831
17903 843831 805035 781326 750911 718843 698984 695503 666218 630652 617075 607705 594860 591140
17891 591140 576511 572074 571977 548261 535224 535924 534846 529621 536187 531929 505933 503982 491849 460432
17877 460432 449136 433316 419732 420675 419433 423225 436950 425697 425012 430485 425347 425216 417188 414071
17863 414071 406159 386008 383802 376027 366989 371618 374648 379691 372213 354020 337064 322921 309614
17850C09614m769K1133l275p057L73o73Q552K989M972J2362Q767J6016J8154n304
17836C81854Q783P809j988j0482j9977O487O560p463j3011j1226K228J739j3683
17823C37630j9421k4895q126j2433j8480j3415q913j3852J0126J1116j4282j5728
17811B09327L578p554R04j7443J1756O250j1007j2150q962j3445K491K385P228
17798A73358M57l373L945k188J519P391j187j2260K313J4917J0058p775q128J0868
17784A89915J5341J1048N666k505p984j1743L407M062q583r506J127j8045j9824
17771A52376k244j8953o011K071n324N503n609j0145k2351n476N992K0169J6614
17758A26612p017j8152O006p390j923m410k896j176j3050L809m42O204j211j986
$$ plain form
17850 309614 304845 325978 322703 315646 316019 315346 323898 326887 331859 344221 352988 369004 387158 381854
17836 381854 390637 398446 396458 385976 365999 372486 379046 371583 358572 347346 349574 351313 337630
17823 337630 318209 293314 285188 272755 254275 240860 231947 218095 228221 239337 225055 209327
17811 209327 212905 205351 206255 188812 200568 206818 195811 183661 174699 161254 163745 166130 173358
17798 173358 173815 170442 174387 172199 173718 181109 179922 167662 169975 184892 194950 187175 179047 189915
17784 189915 205256 216304 221970 219465 211481 199738 203145 207207 198624 189118 190245 172200 152376
17771 152376 150132 131179 125168 127239 121915 127418 121809 111664 89313 83837 89829 109998 126612
17758 126612 119595 101443 107449 100059 98136 93726 90830 89654 76604 80413 79971 86175 84964 82978
17744H2978M475J2514J4615J4337k948q677m019Q857j732r574j3173k2930l652
17731G1071P853N354j550q94N482O115j817j7551j5606j489J2404J0033Q016J210
17717H8631o018m113J863l443J1880Q761J1945Q828l697L045J0476J5217K090
17704A45465m110m089j7164j539Q491q200J8961M531j1859j940N383j867k556
17691A29507j948M492l637K382J301j3172N66J0460O411k972o045p704m349L043
17677A18335o251o293n20O582M972M263J0494K6541K6526P693Q998J873r990j862
17663A91361N033J4346R61J70N387M871M765O342J3125J3665J0416R866J9611
17650B99919O723L406J1508M204l828J2540J4900R092J503j0499J9444K1842R668
$$ plain form
17744 82978 87453 99967 114582 128919 125971 117294 113275 122132 120400 110826 97653 74723 71071
17731 71071 78924 84278 82728 81834 87316 93431 91614 74063 58457 56968 69372 79405 87421 88631
17717 88631 82613 78500 80363 76920 88800 97561 109506 118334 114637 117682 128158 143375 145465
17704 145465 141355 137266 120102 118563 127054 118854 137815 142346 130487 128547 133930 132063 129507
17691 129507 127559 132051 128414 130796 132097 118925 119491 129951 136362 133390 127345 119641 115292 118335
17677 118335 112084 105791 105271 111853 116825 121088 131582 158123 184649 192342 201340 203213 193223 191361
17663 191361 196394 210740 211701 211871 217258 222129 226894 233236 246361 260026 270442 280308 299919
17650 299919 306642 310048 321556 325760 321932 334472 349372 358464 359967 349468 368912 390754 400422
17637D00422k046j0205K126P630R425J4566J2655J8634K4420K6401K7024L6527
17625E67579L3312M8369O2471O1244N1486O3336O7157P5782R1232J08144J41375
17614A371487J65057J90429K39130K89016L45311L94477M93224O62819R28537
17605E079487J318117J808330K268364K521069K276758J469619L02434p87722
17597A6256456j415187j408383r43398k33070N48467J380864K416472L886636
17589B0488857O102401R542363J4410887K0014294K4470923K5200099K0364827
17582A40594651J0372446j665770j1955126j8090339j9917908j8653956j5655109
17575F5028889j1891576p915352m120238q14136J594249K611947J940548k05524
$$ plain form
17637 400422 398376 388171 390297 397927 407352 421918 434573 453207 477627 504028 531052 567579
17625 567579 600891 649260 711731 772975 824461 887797 954954 1030736 1121968 1230112 1371487
17614 1371487 1536544 1726973 1966103 2255119 2600430 2994907 3488131 4150950 5079487
17605 5079487 6397604 8205934 10474298 12995367 15272125 16741744 17044178 16256456
17597 16256456 14841269 13432886 12489488 12256418 12804885 14185749 16602221 20488857
17589 20488857 26591258 36133621 50544508 70558802 95029725 120229824 140594651
17582 140594651 150967097 149301327 137346201 119255862 99337954 80683998 65028889
17575 65028889 53137313 45221961 41101723 40287587 41881836 44493783 46434331 46228807
17567D6228807k962619n220777o255163o028823n046148l852772k772051j974284
17559A2116170j419295j027419p55389n49540l87998k13804l7516J08033K84269
17550H117511M69391P02265J039132J518797K280250L291022M475929N384204
17542B7278501N444493M326820K182138k70683j963566k261337j104893J149625
17534C4781098M073910P255689J0430285J3231729J5144336J5254698J2443438
17527A12615183O158681k612378j1298073j7085329j8678707j6765454j3130433
17520C9203490r429787o477449m383230k972316k005707j290551p04668j50255
17512A1789527L63226O81568O92037L19410l40435j005784j428425j560277j406725
$$ plain form
17567 46228807 43266188 38045411 31790248 25761425 20715277 16862505 14090454 12116170
17559 12116170 10696875 9669456 8914067 8364527 7976529 7762725 7725209 7833242 8117511
17550 8117511 8586902 9289167 10328299 11847096 14127346 17418368 21894297 27278501
17542 27278501 32722994 37049814 39231952 38961269 36997703 34736366 33631473 34781098
17534 34781098 38855008 46110697 56540982 69772711 84917047 100171745 112615183
17527 112615183 118773864 116161486 104863413 87778084 69099377 52333923 39203490
17520 39203490 29773703 23296254 18913024 15940708 13935001 12644450 11939782 11789527
17512 11789527 12152753 12834321 13526358 13845768 13505333 12499549 11071124 9510847 8104122
17503H104122j153005r19500p18821n80241m81415l97332l41933k99771k62567
17494B949537k27793j99477j73722j62741j52256j38739j28409j06098j04608
17485A555694j05243p8006o7734p4750o4251o1153m9335k9071j9090k3269j3380
17474I70412j7774k5911l1683m1332m9573l8785k5211k0151k1527j2147o373p762
17462F72183j2049k689O95J9708J1950J5232J7390O506l378j7755k0030k9547
17450F58216l0642j3694q300q921j701K09K0508J6394l656l2259m2456m4484k8915
17437D80299r303n795r398j0396l0709k2837j5817q130n928K564L759k1925j1181
17424C35203J0333L238N289J1385o216j9951k632m073j3750j1474j3840r133R692
$$ plain form
17503 8104122 6951117 6031617 5312796 4732555 4251140 3853808 3511875 3212104 2949537
17494 2949537 2721744 2522267 2348545 2185804 2033548 1894809 1766400 1660302 1555694
17485 1555694 1450451 1372445 1304711 1229961 1165710 1104557 1055222 1026151 1007061 983792 970412
17474 970412 952638 926727 895044 853712 804139 765354 740143 719992 698465 686318 679945 672183
17462 672183 660134 657445 658140 677848 689798 705030 722420 728926 725548 707793 687763 658216
17450 658216 627574 613880 605580 596659 594958 595167 615675 632069 628413 596154 553698 509214 480299
17437 480299 470996 465201 455803 445407 414698 391861 376044 367914 361986 364550 368309 346384 335203
17424 335203 345536 348774 354063 365448 359232 339281 336649 332576 318826 307352 293512 284379 294071
17411B94071J707n893m434m551Q11q192k5639n847N390Q7K672j338J266N559m141
17396B51528j6935j2731K878p031j1735n642M967j7369j2964j5129j3960O282
17384A52159Q355R434n02M377R175k867j3690L637o390j0490j754Q927n30j239
17370A58602q309j1432K221q962J687L120K563r602O575J2017J909j8819j712
17357A29858K06M074p268k247k311m335o382K923O68j544J402j1485j1924M336
17343I5971j613n410J1279J2069l465j0129j1983o054l266Q457N669l501n63N618
17329I3079K278K189k329l674J3492p574j3141Q415L254M224j2248p180j1755
17316F9030P910k82j3714L565j193o750L671O977L703j580q084L830K214l15r105
$$ plain form
17411 294071 295778 289885 285451 280900 281711 273519 247880 242033 247423 247510 250182 248844 250110 255669 251528
17396 251528 234593 221862 224740 217709 205974 200332 205299 187930 174966 159837 145877 152159
17384 152159 160514 169948 169446 173823 182998 180131 166441 170078 163688 153198 151444 160371 159841 158602
17370 158602 150293 138861 141082 132120 133807 136927 139490 129888 136463 148480 150389 131570 129858
17357 129858 130064 134138 126870 124623 122312 117977 111595 114518 115186 113642 115044 103559 91635 95971
17343 95971 94358 88948 100227 112296 108831 98702 86719 80665 77399 85856 91525 88024 87461 93079
17329 93079 95357 97546 95217 91543 105035 97461 84320 92735 95989 100213 87965 80785 69030
17316 69030 76940 76658 62944 66509 65316 58566 62237 69214 72917 71337 63253 67083 69297 68982 59877
17301E9877j7924r813J3086J5723k647L352m287n198J341l693l250O936M788j2080
17287D6211o214p702K891k044K321J1105o55N915q634P263M406N957P584R439
17273G7843l948j3313j2202o772p390j560J086j0823q90J1424j332k605Q149L280
17259D0947O380J4538nj6136m577p73P9n862j7515L816J5472k465j1111p824J4079
17244B9043j0819m031P507M294O052j2702l818R295J1182L640N22n443j1789r299
17230A3634K284j960L076l572m387O438M442l11J574Q318R511n299l51r57k1449
17215A0991j5638K170Q430J4618K1708J4060J6808j6489k0653J873K951Q124K363
17202E1316l640j1444K118N975J2563L183k327k0613j1025Q18Q042m456Q585O213
$$ plain form
17301 59877 41953 32140 45226 60949 58302 61654 57367 52169 53510 49817 46567 53503 58291 46211
17287 46211 39997 32295 35186 33142 35463 46568 45913 51828 43194 50457 54863 60820 68404 77843
17273 77843 73895 60582 48380 41608 34218 32658 33744 22921 22031 33455 32123 29518 37667 40947
17259 40947 47327 61865 61860 45724 41147 40374 40453 34591 17076 20892 36364 33899 22788 14964 29043
17244 29043 18224 14193 21700 25994 32046 19344 15526 24821 36003 39643 40165 34722 22933 13634
17230 13634 15918 13958 17034 13462 9075 15513 19955 19644 21218 29536 39047 33748 33397 32440 10991
17215 10991 -4647 -2477 5953 20571 42279 56339 73147 56658 36005 37878 40829 48953 51316
17202 51316 47676 36232 38350 44325 56888 60071 57744 37131 26106 26924 34966 30510 39095 45308
17188D5308L875M727j223j1653M756P044O723j7899j2301N507j379q760L697N734
17174C4156k967k270m088K609J905L355J870M188J1527L818k961j779l725p342
17160C8296o556q164k429k528J2061o040n108J2028K504N918O39o295q307J3930
17146C9949P612j2643j9635o83M218M090J3781J488p209l909K489J33M98r991
17132B0188j8130Q6O463J4920P607j0995l267O281J0521K652L99n470j259Q417
17118C8413Q437K165M214j2494j5929K59J4986K466K1709R675O335pm258l663
17104G2308n346J0621P43L1099L9652M4352K6065M3141M2161M3297K6071K0736
17092C94900R96P258N93j0146l8745k8745k5205k5484j762K0224K8162O1765N5477
$$ plain form
17188 45308 49183 53910 52687 41034 45790 52834 59557 41658 29357 34864 33485 24725 28422 34156
17174 34156 31189 28919 24831 27440 29345 32700 34570 38758 50285 54103 51142 49363 45638 38296
17160 38296 31740 23576 21147 18619 30680 24640 19532 31560 34064 39982 40621 34326 26019 39949
17146 39949 47561 34918 15283 14600 18818 22908 36689 38177 30968 27059 29548 29681 30179 20188
17132 20188 2058 2144 8607 23527 31134 20139 16872 23153 33674 36326 36725 31255 29996 38413
17118 38413 46850 49015 53229 40735 24806 25065 40051 42517 64226 73901 80236 80229 75971 72308
17104 72308 66962 77583 78326 109425 149077 193429 219494 262635 304796 348093 374164 394900
17092 394900 395896 403154 403747 393601 354856 326111 300906 275422 273660 293884 322046 383811 439288
17079D39288J7882n680k9268n2133n6543m1736m6002l9462k7385j6619j0297r454
17067A22591n888k107L64J9080N733l838r456P162q223j0235o99j962k2966j0315
17053G9241p483O636q62K1081M1782L6616L8293N1046N4646K6980J8046J6644
17041C82666K4205K4837K3461p71l1493m1948o1781m8027n0458m1384k2385l2159
17029A24763J863K2751J8634K8771M1772N1384M4139K9316K2881J8198k6008l0968
17017C47496m4379n3807m3160l0239m9931m3579p181m91q866N591N511l593j5667
17004E7705Q34P628k516r554o720J3394p230j3781M155K756r544l071j3022l328
16990A7706J3099j540J3858J2773J347k0825j2043j3851R580Q636J0554L039K834
$$ plain form
17079 439288 457170 451490 422222 370089 313546 271810 225808 186346 158961 142342 132045 122591
17067 122591 116703 114596 114960 134040 139773 135935 126479 133641 125418 115183 114484 112522 89556 79241
17053 79241 71758 78394 77532 98613 140395 177011 215304 266350 320996 347976 366022 382666
17041 382666 406871 431708 455169 454398 422905 380957 319176 271149 220691 179307 156922 124763
17029 124763 126626 149377 168011 196782 238554 289938 334077 363393 386274 404472 378464 347496
17017 347496 303117 249310 206150 175911 125980 82401 75220 74729 65863 71454 76965 73372 57705
17004 57705 58539 66167 63651 54097 47377 60771 53541 39760 43915 46671 37127 34056 21034 17706
16990 17706 30805 29265 43123 55896 57243 36418 24375 10524 20104 28740 39294 42333 45167
16977D5167r845O832N130l019q467j4510N630Q545L642L379O498O375j0512r777
16963C5068j5852J14m918q747P24J0806k859J7115Q143n613J937L46l905J0883
16949D3242l218p404J533J365m748n74j1011Q972O884N45m5q864n23M179L504
16934C3837o305j2450q116L71J923r077N746J2857M352r048j0362k979N771l716
16920B804O59J0441J5372P218j559j4491K995K1403l764o780j8525j2786q124
16907e137n68O036q695N715R543O229m948q202P27N357M554n897p719J473k729
16892d261P122O144K783J702k2634l21J9586J3515j0322p933o480q232O967k52
16878b616k733k363L347j0485j0276R734K1484m260J850O011j145o255O205J5418
$$ plain form
16977 45167 35322 42154 47284 44265 35798 21288 26918 35463 39105 42484 48982 55357 44845 35068
16963 35068 19216 19330 14412 5665 6389 17195 14336 31451 39594 33981 35918 36264 32359 43242
16949 43242 40024 32620 34153 35518 30770 30196 19185 28157 35041 35586 35541 26677 26154 30333 33837
16934 33837 27532 15082 6966 7337 9260 183 5929 18786 23138 14090 3728 749 6520 2804
16920 2804 3463 13904 29276 36494 34935 20444 23439 44842 41078 34298 15773 2987 -5137
16907 -5137 -5705 331 -8364 -2649 6894 13123 8175 -27 700 6057 10611 4714 -3005 -1532 -4261
16892 -4261 2861 9005 11788 13490 -9144 -9465 10121 23636 13314 5381 -1099 -9331 -2364 -2616
16878 -2616 -5349 -7712 -4365 -14850 -25126 -15392 6092 1832 3682 9693 8548 2293 8498 23916
16864B3916P470m168o990l426j896l293k2303q10J50J204Q219J7816p779j4504
16850f394O273o986K580k14M013O87j5725j3121O846l745k951K4363Q17j2210
16836a5767J615Q552j497j729J3826L394j8376n296j5117P259J1100J2861n747
16823d922J666L772l162m891K1505J318j9470k888J2265o967M082K822p045P60
16809a155J6385K745j2426j0586O202P369J590m10l450o057j4532l92k891k001
16795a9609R628m194p063N270j889J2566R153j861n043l265k56M437j000Q187
16781E061j448j4209k4J07J6404O422n655M715o848j3417l902J3677R673m08m356
16766E792m835m400l837l939P740P191n77Q179m878m664q919L339J137j359p31
$$ plain form
16864 23916 31386 27218 20228 16802 14906 11613 -10690 -11500 -11350 -10146 -1927 15889 8110 -6394
16850 -6394 -121 -7107 -4527 -4741 -728 -41 -15766 -28887 -22041 -25786 -28737 -4374 -3557 -15767
16836 -15767 -14152 -5600 -7097 -8826 5000 8394 -9982 -15278 -30395 -23136 -12036 825 -4922
16823 -4922 -3256 516 -2646 -7537 13968 15286 -4184 -7072 5193 -1774 2308 5130 -1915 -1155
16809 -1155 15230 17975 5549 -5037 1165 8534 10124 9714 6264 207 -14325 -14717 -17608 -19609
16795 -19609 -9981 -14175 -21238 -15968 -17857 -5291 3862 2001 -3042 -6307 -6563 -2126 -3126 5061
16781 5061 3613 -10596 -10620 -10513 5891 12313 6658 11373 4525 -8892 -12794 883 10556 10148 5792
16766 5792 957 -3443 -7280 -11219 -3479 3712 3135 11314 6436 1772 -7147 -3808 -2671 -4030 -4761
16751d761L28N232k049J185O458L309j2048j538P62p163k184O869M40J948J0764
16736G552P513n167j8144J681J2208m50r205j9574m742R711J5880r79M149J3344
16722A3777Q588j2148j8933p786k047r429o328J2404P893J6600Q271l995p008
16709a41j3962k462L93k258P606J3104R552J0996m977k2595n387M816m670j266
16695a1251M904P71J428L295P079K988m330l964M781K433j1732M240J1482K763
16681A4887r843p940P481J1852R467M820o926j1634l255P696l149j2016k380J8
16667i22L224r074l994J1594J7254K2090j0026k2172j0475j0276m898K4088J3191
16654A9604K0575L859k0812j0948j2133m303r29K506K771M198J1083n581o496
$$ plain form
16751 -4761 -4433 799 -1250 -65 6393 9702 -2346 -3884 -3122 -10285 -12469 -5600 -5160 -3212 7552
16736 7552 15065 9898 -8246 -6565 5643 5193 -4012 -23586 -28328 -18617 -2737 -3716 433 13777
16722 13777 22365 10217 -8716 -16502 -18549 -27978 -34306 -21902 -14009 2591 10862 6867 -141
16709 -141 -14103 -16565 -16172 -18430 -10824 2280 11832 22828 17851 -4744 -10131 -5315 -9985 -11251
16695 -11251 -6347 -5576 -4148 -853 6226 9214 4884 920 5701 8134 -3598 642 12124 14887
16681 14887 5044 -2896 4585 16437 25904 30724 23798 12164 8909 16605 13456 1440 -940 -922
16667 -922 2302 -6772 -10766 828 18082 40172 30146 7974 -2501 -12777 -17675 6413 19604
16654 19604 40179 44038 23226 12278 145 -4158 -5087 -2581 190 4388 15471 9890 3394
16641C394o524j47l39J581k271L27N405J917k033r075P463Q410N23j941o298N502
16625E894J389n346j2246k019O186L802k976o240n01L098M914k716j8490o165
16611c1416J2182N85o361N8K0172R463J1938l221q573N403j5513j5077p26j4035
16597c5121n703P198R442K940N818m301o28R237O972l568q308r212j627L20Q460
16582a8081J8183J1139J6447L446j0763q050p204L081l832R872O625j3965r142
16569b244K1370j65o369l771j1124k063L976R989j899l747O740P406J28j0498
16555G729L340R738j2021j544J4124r8M32j5429j4911q81l596J153j494n416l174
16540b2048l013R908k748K194N277O169R007N710m582r971k37J944L38R93K326
$$ plain form
16641 3394 -3130 -3277 -3616 -2035 -4306 -3979 1426 3343 1310 -7765 -302 8108 8631 6690 392 5894
16625 5894 7283 1937 -10309 -12328 -6142 -2340 -5316 -11556 -12057 -8959 -4045 -6761 -25251 -31416
16611 -31416 -19234 -18649 -25010 -24952 -4780 4683 16621 13400 4827 10230 -5283 -20360 -21086 -35121
16597 -35121 -40824 -33626 -24184 -21244 -15426 -19727 -20355 -11118 -4146 -7714 -16022 -25234 -26861 -26541 -18081
16582 -18081 102 11241 27688 31134 20371 12321 5117 8198 4366 14238 20863 6898 -2244
16569 -2244 19126 18961 12592 8821 -2303 -4366 -390 9599 7700 3953 10693 18099 18227 7729
16555 7729 11069 20807 8786 7242 21366 21268 21700 6271 -8640 -9521 -13117 -11964 -13458 -18874 -22048
16540 -22048 -25061 -15153 -17901 -15707 -10430 -4261 4746 10456 5874 -4097 -4334 -2390 -2052 -1059 1267
16525A267n59M617J2650J6873J0266k01j1163r077j5295k690L087J1909m243n353
16511A2088J1570m362j2242R989l116M059j305j0132n280L392J233j3444l087
16498a0637J0824Q966J606k420j1265o553P871j4063k0161J25R018J3447J3169
16485g3r0J1528n908n098m549k081O202J463j0184l218Q776j3058m022l503p910
16470c1725l611K10J5752P901J5492J3118n697q221J73J1027L089r382j5332q523
16456a5729L395M992j47K88R917L852L710j3449L18p703j0801N283j2883j2120
16442d1077J230J5858J1720J2669j8126J184O84r49O338k384P563J4619N71J132
16428A1032q809K789m038p604o141j552q12J2767J6075O312p086M9L221j4301
$$ plain form
16525 1267 708 5325 17975 34848 45114 44913 33750 24673 9378 6688 9775 21684 17441 12088
16511 12088 23658 19296 7054 17043 13927 17986 16681 6549 1269 4661 5894 -7550 -10637
16498 -10637 187 9153 10759 8339 -2926 -9479 -1608 -15671 -35832 -35707 -26689 -13242 -73
16485 -73 -163 11365 5457 359 -4190 -6271 -69 1394 -8790 -12008 -3232 -16290 -20312 -23815 -31725
16470 -31725 -35336 -35126 -19374 -11473 4019 17137 11440 3219 3392 14419 17508 8126 -7206 -15729
16456 -15729 -12334 -7342 -7489 -7201 2716 6568 10278 -3171 -2853 -10556 -21357 -16074 -28957 -41077
16442 -41077 -39847 -23989 -12269 400 -17726 -16542 -15858 -16807 -10469 -12853 -5290 9329 9900 11032
16428 11032 2223 5012 974 -6630 -12771 -14323 -15135 -2368 13707 20019 12933 12982 16203 1902
16414A902p986O797J2748J2095l112j9234J144O732k367j3508j0136J2075P956
16401E106L748k05q508M073J2621q530j5138J7050P857j3584N22O767m158n976
16387A645R92P213J4503o744l379m777N048m617j3323p568O566r591k152o672
16373b2856n028J3263J3811N742J1511J603K8o956j4045j592j451L761J0689m773
16359C707o816j636n167P403M152r221J669k702j891O653L13L076j1625j750L53
16344a3482M183j196o822R901K0190J50o137m3j4332r787L855K876m128J1303
16330c469n46J6103R165j6768q062N062K1744J2856o010k1197l0l631r696j0299
16316a4778l428M174R750l077L453k401q144m04M895r90r351K701K0453Q717K447
$$ plain form
16414 1902 -6084 713 13461 25556 22444 3210 4354 11086 8719 -4789 -14925 -2850 5106
16401 5106 8854 8649 141 4214 16835 8305 -6833 10217 18074 4490 5012 11779 7621 1645
16387 1645 2637 9850 24353 17609 14230 9453 14501 9884 -3439 -11007 -4441 -14032 -16184 -22856
16373 -22856 -27884 -14621 -810 4932 16443 18046 18074 11118 -2927 -4519 -5970 -2209 8480 3707
16359 3707 -3109 -4745 -9912 -2509 1643 -7578 -5909 -8611 -10502 -3849 -3536 -460 -12085 -13835 -13482
16344 -13482 -9299 -10495 -17317 -7416 12774 12924 6787 6744 -7588 -17375 -13520 -10644 -14772 -3469
16330 -3469 -4015 12088 21253 4485 -3577 1485 23229 36085 30075 8878 8848 5217 -4479 -14778
16316 -14778 -18206 -14032 -4282 -7359 -3906 -6307 -14451 -14855 -9960 -10950 -20301 -17600 2853 11570 14017
16301A4017o483j669j2074M13m047k758R932K787o873m769r572o167J0530o684
16287b3417o384M813o401q650m308J1273P679O999j06q44M730j249j0145M717
16273b1293Q618M207l581n913j2084Q939R338Q87R877K164r379l404o376n648
16259b3648N973J1310j852L025J0508K37p32m646l804r406L330j945j1862k185
16245b5697J98K1381J807j9309k0631Q698J3843K587k745K0067K595J0611o546
16232F859k969l697k541O349o309p187K836J2953K496L530J362M776J4130p160
16218B5428j5814j7687l732N996J823j440q708p139J2185O068N873K42p439J4035
16204I691j3051o836o334o713M178N866M397N493J1973m729K857K530L362L506
$$ plain form
16301 14017 7534 5865 -6209 -5796 -9843 -12601 -2669 118 -6755 -11524 -21096 -27263 -16733 -23417
16287 -23417 -29801 -24988 -31389 -40039 -44347 -33074 -25395 -18396 -18502 -19346 -14616 -15865 -26010 -21293
16273 -21293 -12675 -8468 -12049 -17962 -30046 -21107 -11769 -10882 -1005 1159 -8220 -11624 -18000 -23648
16259 -23648 -17675 -6365 -8217 -5192 5316 5553 4821 175 -3629 -13035 -9705 -11650 -23512 -25697
16245 -25697 -25499 -4118 -2311 -21620 -42251 -33553 -19710 -17123 -19868 199 2794 13405 6859
16232 6859 3890 193 -2348 4001 -2308 -9495 -6659 6294 8790 12320 13682 18458 32588 25428
16218 25428 9614 -8073 -11805 -5809 -3986 -5426 -14134 -21273 -9088 -3020 2853 3095 -4344 9691
16204 9691 -3360 -10196 -16530 -23243 -19065 -13199 -8802 -3309 8664 3935 6792 9322 12684 16190
16190A6190j2482j0018Q546R220m087j6437m457Q168J1258j6672n960m307m596
16177b5634J598J036R986R317J330J9979o511j1816n827O330J311l710j0872o017
16163a9500O734n615n166N97O925N635p033P155r670l993J0712J0122j0203j8508
16149c1808R7P606K926n147j778q489k777J6943R172J2555L876J5407r370j193
16135H020j0711j3332l477J3771P101Q415q774k377q135n552K007l365q021r027
16121c3457J1818P822k573l013J4469J1557k96o434J2694K193J81J1844L462l315
16107B6952r921n47M41m060j8896k1337O135J4833k68J5406r769j4723r144k240
16093b7138o378J1846J5333M848o87K439j2660q415N828o492n799L116Q350N73
$$ plain form
16190 16190 3708 -6310 2236 11456 7369 -9068 -13525 -5357 5901 -10771 -16731 -21038 -25634
16177 -25634 -24036 -23000 -13014 -3697 -2367 17612 11101 -715 -6542 -212 1099 -2611 -13483 -19500
16163 -19500 -12766 -18381 -23547 -22950 -16025 -10390 -17423 -10268 -19938 -23931 -13219 -3097 -13300 -31808
16149 -31808 -31711 -24105 -21179 -26326 -28104 -36593 -39370 -22427 -13255 -700 3176 18583 9213 8020
16135 8020 -2691 -16023 -19500 -5729 1372 9787 1013 -1364 -9499 -15051 -13044 -16409 -24430 -33457
16121 -33457 -21639 -13817 -16390 -19403 -4934 6623 6327 -107 12587 14780 14961 26805 30267 26952
16107 26952 17031 16484 16925 12865 -6031 -27368 -21233 -6400 -6668 8738 -1031 -15754 -24898 -27138
16093 -27138 -33516 -21670 -6337 -1489 -2176 263 -12397 -20812 -14984 -21476 -27275 -24159 -15809 -15236
16079a5236N351k704m212Q152P077J2054j2046q993N143j4983J2036K138j2950
16066a9173R34K090p505J0690J3395Q149J0024j7480l305K354J1670J2334n968
16053A8209o183n515n916o781p274J666Q077K403N504L125n316P471j0445q373
16039i348P928j68N270O775j273j038J7548j453r27m81l377K144q030j0624Q132
16024A1078L916k673m155K097R015J1739j248k7124j9446O508N449K449K931L080
16010C616n203j5106J296J6726K771o915N880K820n154K479K917P89Q622L909
15996A9447L541J281j1908q716m543o566o010k322p497K642Q678N43M687R1j4859
15981b1511Q246j0661R906K1409n822j552K580K74l755l557k88k3003L239P605
$$ plain form
16079 -15236 -9885 -12589 -16801 -8649 -1572 10482 -1564 -10557 -5414 -20397 -8361 -6223 -19173
16066 -19173 -18239 -16149 -23654 -12964 431 8580 18604 1124 -2181 173 11843 24177 18209
16053 18209 12026 6511 595 -6186 -13460 -11794 -3717 -1314 4190 7315 1999 9470 -975 -9348
16039 -9348 -1420 -1588 3682 10457 9184 8146 25694 24241 23314 22833 19456 21600 13570 2946 11078
16024 11078 14994 12321 8166 10263 19278 31017 29769 2645 -16801 -10293 -4844 -2395 536 3616
16010 3616 -1587 -16693 -15397 1329 4100 -2815 3065 5885 731 3210 6127 6916 15538 19447
15996 19447 22988 24269 12361 3645 -898 -7464 -13474 -15796 -23293 -20651 -11973 -11430 -6743 -6652 -21511
15981 -21511 -13265 -23926 -14020 7389 1567 15 2595 2869 -886 -4443 -4731 -27734 -24495 -16890
15967a6890l752M092M931L121M554K482l386P539j0578K645l149r975j716J0573
15953i509O102j2280q352J750J720J123N312J1356Q672K533J376l050m547q312
15939f106j979L569O530K418l805N9L458O575J890r535j2984k72q393j630J5516
15924d689J1754J303q47M014q420j1616q228J0872J1238k025L217Q944Q930n89
15910B3858p563q441q435l696n096q981k529L062J1960P969r867N112J1237R474
15896A8064K5J4288j4332j2785m493q992o344k145J0845K388J972J3719N261n990
15882A1481j4989k4367p153J7974J0736J2649R005N380m51k098l519k010j4114
15869a476j3461k932j1081p178N866J1855J2192K996r673j0305o387o17J6190
$$ plain form
15967 -16890 -20642 -16550 -11619 -8498 -3944 -1462 -4848 2691 -7887 -5242 -8391 -18366 -20082 -9509
15953 -9509 -3407 -15687 -24039 -22289 -20569 -19446 -14134 -2778 5894 8427 9803 6753 2206 -6106
15939 -6106 -8085 -4516 2014 4432 627 686 4144 10719 12609 3074 -9910 -10182 -18575 -20205 -4689
15924 -4689 7065 8368 7521 11535 3115 -8501 -16729 -5857 5381 3356 6573 15517 24447 23858
15910 23858 16295 7854 -581 -4277 -9373 -18354 -20883 -17821 -5861 2108 -7759 -2647 8590 18064
15896 18064 18089 32377 18045 5260 767 -8225 -14569 -16714 -5869 -3481 -1509 12210 17471 11481
15882 11481 -3508 -27875 -35028 -17054 -6318 6331 15336 20716 20265 18167 14648 12638 -1476
15869 -1476 -14937 -17869 -28950 -36128 -30262 -18407 -6215 -3219 -12892 -23197 -29584 -30201 -14011
15856a4011Q884r2j945j0679j913O506P742Q256j481r312r806J795O848J0007
15842G99J9490Q898k336j5438j8139k1888M488J7474J6689j6906L589k239K736
15829b783r526j683p244K499p783j057P964O392M926J565j048R995K284j4164
15815i663L883J5955R990Q420j9091j1166K708j080m032o161J0993k319n984r57
15801h504q361L016J0390R315r396m862M028l331K023J673l847K769j261p781
15787a4129R641n56m864p888j810O872j205O942J60l717m319j23L985K580Q561
15772A30j1092j895N117K60l443l485L644N99K139r648K452L803J4684J4630r029
15757H866M56j2434j4318Q403R625Q264k870O252j773o123r062M626J1931Q358
$$ plain form
15856 -14011 -5127 -5219 -7164 -17843 -19756 -13250 -5508 2748 1267 -8045 -17851 -16056 -9208 799
15842 799 20289 29187 26851 11413 -6726 -28614 -24126 -6652 10037 -6869 -3280 -5519 -2783
15829 -2783 -12309 -13992 -21236 -18737 -26520 -27577 -19613 -13221 -8295 -6730 -7778 2217 4501 -9663
15815 -9663 -5780 10175 20165 28585 9494 -1672 1036 -44 -4076 -10237 756 -1563 -7547 -8504
15801 -8504 -16865 -13849 -3459 5856 -3540 -8402 -4374 -7705 -5682 -4009 -7856 -5087 -6348 -14129
15787 -14129 -4488 -5044 -9908 -17796 -19606 -12734 -13939 -6997 -6837 -10554 -14873 -14996 -11011 -8431 130
15772 130 -10962 -12857 -7740 -7480 -10923 -14408 -10764 -10165 -8026 -17674 -15222 -11419 3265 17895 8866
15757 8866 9322 -3112 -17430 -9027 598 8862 5992 12244 10471 4348 -4714 -88 11843 20201
15743B0201j3108l828j0637r116Q521n161j814J437r108M19M979j039n331j187
15729b4772Q68P272O237M217J5318n523l857O686k402k349J075P628N655j120
15715A4933K534r228r612n707K966m150p806J6160n1o427j0156k736n878Q239
15701a6919O344O99n627O666K750j789O83K812J298K857q026r485q061K195m098
15686b7701Q856R745k238r246K903J0461j0946P611P151p633o122Q892L760J6203
15672A1696J5156J278j9223j6133M508j1048j931P340J7513L52j7009p214N576
15659i139k67l282J137o718J995k057j047J2379J7100j0366j0817J1034J932O156
15645H040l439j2801m545O617J857M02L581j2237j0157P967J1331K036j509n391
$$ plain form
15743 20201 7093 3265 -7372 -16488 -7967 -13128 -14942 -13505 -22613 -22194 -17215 -18254 -23585 -24772
15729 -24772 -23904 -16632 -10395 -6178 9140 3617 -240 6446 4044 1695 2770 10398 16053 14933
15715 14933 17467 8239 -1373 -7080 -4114 -8264 -16070 90 39 -6388 -16544 -19280 -25158 -16919
15701 -16919 -10575 -9876 -15503 -8837 -6087 -7876 -7193 -4381 -3083 -226 -8252 -17737 -25798 -23603 -27701
15686 -27701 -18845 -9100 -11338 -20584 -17681 -7220 -18166 -10555 -3404 -11037 -17159 -8267 -4507 11696
15672 11696 26852 28130 8907 -7226 -2718 -13766 -15697 -8357 9156 9508 -7501 -14715 -9139
15659 -9139 -9406 -12688 -11551 -18269 -16274 -18331 -19378 -6999 10101 -265 -11082 -48 1884 8040
15645 8040 4601 -8200 -12745 -6128 -4271 -3869 -288 -12525 -22682 -14715 -3384 -1348 -2857 -8248
15631h248M682L191j0565r616J907P80r949k83P727P167r188p423O228L177q766
15616b9179J0234M269J698N382J1440m155j0428j1053K977j640K012Q28k418J3380
15602f653L534o20j660j7310O828r037M052R355L139p270m782R529J0751j3359
15588a3503j1376J0992j41j851J0080Q819K408L448r725j3642p618n007q168J291
15574c3993J206M924k618j0433O984J8033J0658m872O001M633n108j2769N405
15561a1949M478j6087Q517O096N541J2258o425j2905o376r332M818O146l292O412
15547a2100K588P78O175j6344j0705N341l096M174P745M413j3205r021J817J8998
15533a2442J3550L019O074r301o466N439R219k521j366L585n36j7565j8453J0379
$$ plain form
15631 -8248 -3566 -375 -10940 -20556 -18649 -17869 -27818 -28101 -20374 -13207 -22395 -29818 -23590 -20413 -29179
15616 -29179 -18945 -14676 -12978 -7596 3844 -311 -10739 -21792 -18815 -20455 -18443 -17615 -20033 -6653
15602 -6653 -3119 -3739 -5399 -22709 -15881 -24918 -20866 -11511 -8372 -15642 -20424 -10895 -144 -13503
15588 -13503 -24879 -13887 -14028 -15879 -5799 3020 5428 8876 -849 -14491 -22109 -27116 -35284 -33993
15574 -33993 -32787 -27863 -30481 -40914 -33930 -15897 -5239 -10111 -4110 523 -4585 -17354 -11949
15561 -11949 -7471 -23558 -15041 -8945 -3404 8854 2429 -10476 -16852 -26184 -21366 -15220 -18512 -12100
15547 -12100 -9512 -8734 -2559 -18903 -29608 -24267 -27363 -23189 -15444 -11031 -24236 -33257 -31440 -12442
15533 -12442 1108 4127 10201 900 -5566 -127 9092 6571 5205 8790 8254 -9311 -27764 -17385
15519a7385J4715J029j3212l784J5646r473j7214o476O442O356N334J0836J6027
15506H841R52n486K704q157O652R535J402p693r070j5376q074n780J3966o198
15492b1782j1295J422n173K432R930M189P04M822J8881n603j2364P74N184j0574
15478a8453j274J856K53j6931R977L468Q969J0881L40j2230j357N291J4850K2512
15464B8152L772k1970o971O269J852n604q221L873O456n755o939M494q106j954
15450a0652N975k311l726J1502O890l059j3052j2957R632L921m379k558P03p408
15436b1479J5576J1107L442j519l584J578M896j4923n044n42P808M598L136n781
15422g31n668l566k540J779P215J2787j404o784p006p463j0008O426J6217L484
$$ plain form
15519 -17385 -2670 -1641 -14853 -18637 -2991 -12464 -29678 -36154 -29712 -23356 -18022 -7186 8841
15506 8841 9793 4307 7011 -1146 5506 15041 16443 8750 -320 -15696 -23770 -29550 -15584 -21782
15492 -21782 -33077 -31655 -36828 -34396 -24466 -20277 -19573 -14751 4130 -1473 -13837 -13063 -7879 -18453
15478 -18453 -19727 -17871 -17618 -34549 -24572 -21104 -12135 -1254 -914 -13144 -14501 -9210 5640 28152
15464 28152 31924 9954 2983 9252 11104 5500 -2721 1152 7608 1853 -5086 -592 -8698 -10652
15450 -10652 -4677 -6988 -10714 788 7678 4619 -8433 -21390 -11758 -7837 -12216 -14774 -14071 -21479
15436 -21479 -5903 5204 8646 7127 3543 5121 10017 -4906 -9950 -10492 -2684 1914 5050 -731
15422 -731 -6399 -9965 -12505 -10726 -3511 9276 7872 1088 -5918 -13381 -23389 -16963 -746 2738
15408B738p517o550R378J127o732O585j833N548L427p75j994j0984j1409m44K0152
15393G17J2856j6624k638K775l768o762K324j1310j5485j240J1131r501m493K7731
15379a4287p760j4427J4035J1148P811J865j5911n821N707J1809O370J64k758
15366b055K735M135m132o548j0919j334K1193P582j6774n882K629n243M322J4907
15352D616P627o814q371n622o999R62O466K488j1501k390q053j896J2838L246
15338a3403J207P365L372l356j3008j1808M969J6487K164J4787M685Q47L187j80
15324A7315k3077j3963K125N031R406p961J317O660j884J250J3898K372j840O291
15310A6940j0693R52q763l553m240l435P486q634n884k708k67O517o187L175O728
$$ plain form
15408 2738 -4779 -11329 -1951 -824 -7556 -971 -2804 2744 6171 5396 3402 -7582 -18991 -19435 717
15393 717 13573 -3051 -5689 -2914 -6682 -13444 -11120 -22430 -37915 -39155 -28024 -37525 -42018 -14287
15379 -14287 -22047 -36474 -22439 -11291 -3480 -1615 -17526 -23347 -17640 -5831 539 703 -2055
15366 -2055 680 4815 683 -5865 -16784 -18118 3075 10657 -6117 -11999 -9370 -14613 -10291 4616
15352 4616 12243 5429 -2942 -8564 -15563 -14601 -8135 -5647 -17148 -19538 -27591 -29487 -16649 -13403
15338 -13403 -12196 -4831 -1459 -4815 -17823 -29631 -24662 -8175 -6011 8776 13461 14308 17495 17315
15324 17315 -5762 -19725 -17600 -12569 -3163 -11124 -9807 -3147 -5031 -3781 10117 12489 10649 16940
15310 16940 6247 7199 -1564 -5117 -9357 -12792 -5306 -13940 -19824 -22532 -22799 -16282 -22469 -19294 -12566
15295a2566m299O392O594M82M179o417j6107k873j884O725J3425L690q161O289
15281d531n097J628j617j0394P697j699l159R574j4100j5503J7866J2047M81j460
15267h267M305j010n164l755O229K159P296K555m50o787k974j737m299M663k216
15252i452o416L839k568M207O123L960M67j1511J0085q197k682l437o31o089l502
15237b5804P786j2353n813o17J1827j307Q950L367l74m239O390p4K236l289K427
15222a0887k217j6794l277J1987J3754K957p400K920J4089q663j3507k1070P473
15209c0635J5280k888k867j433R259J03M735L383q91q178j0617P214Q393m498
15195a3640J3304K754r632j4461n082N440L638k370J690J800O31p572k390j1422
$$ plain form
15295 -12566 -16865 -10473 -3879 -3397 782 -5635 -21742 -24615 -26499 -19774 -6349 -2659 -10820 -4531
15281 -4531 -9628 -8000 -9617 -20011 -12314 -14013 -17172 -7598 -21698 -37201 -19335 -7288 -6807 -8267
15267 -8267 -3962 -4972 -10136 -13891 -7662 -5503 1793 4348 3898 -2889 -5863 -7600 -11899 -7236 -9452
15252 -9452 -15868 -12029 -14597 -10390 -4267 -307 160 -11351 -1266 -9463 -12145 -15582 -16213 -22302 -25804
15237 -25804 -18018 -30371 -36184 -36801 -24974 -26281 -17331 -13964 -14338 -18577 -12187 -12261 -10025 -13314 -10887
15222 -10887 -13104 -29898 -33175 -21188 -7434 -4477 -11877 -8957 5132 -3531 -17038 -38108 -30635
15209 -30635 -15355 -18243 -21110 -22543 -13284 -13181 -8446 -5063 -5954 -14132 -24749 -17535 -9142 -13640
15195 -13640 -336 2418 -7214 -21675 -26757 -21317 -17679 -20049 -18359 -16559 -15928 -23500 -25890 -37312
15181c7312P700J1079J1036P227l485J123O923o857j7718q272p64O909N021R555
15167g835K365j0985j0714q346L617K317K476o015P239N031J160J36L15M167M17
15152a4655j069J295j5763p270Q658k687j3719q222Q921q67N045K3372O829J714
15138h418N401J0152Q498l128j1644j2752o20J5827O018j0987p405n130M851o349
15124a5686j4204l237N124L017j323J853J3893J020j0994k58l062J1457Q323K399
15110a678M581K673M788N018j3858j1047J5251J2351J325l781j4023r109K230
15097e279m270P107R430J6509m607j95kj7157o562q275M910Q9m710p275k011r306
15081c1604N387J1118j5091q981O682J385K819m004m927P265J6339N988R074j854
$$ plain form
15181 -37312 -29612 -18533 -7497 -270 -3755 -2632 4291 -2566 -20284 -28556 -29320 -22411 -17390 -7835
15167 -7835 -5470 -16455 -27169 -35515 -31898 -29581 -27105 -33120 -25881 -20850 -19690 -19554 -19239 -15072 -14655
15152 -14655 -15724 -14429 -30192 -37462 -28804 -31491 -45210 -53432 -44511 -45378 -40333 -16961 -10132 -8418
15138 -8418 -3017 7135 15633 12505 861 -11891 -12511 3316 9334 -1653 -9058 -14188 -9337 -15686
15124 -15686 -29890 -33127 -28003 -24986 -26309 -24456 -10563 -9543 -20537 -20795 -23857 -12400 -4077 -1678
15110 -1678 2903 5576 10364 15382 1524 -9523 5728 18079 19404 15623 1600 -7509 -5279
15097 -5279 -9549 -2442 6988 23497 18890 18695 18693 1536 -5026 -13301 -8391 -8302 -13012 -20287 -22298 -31604
15081 -31604 -26217 -15099 -30190 -39171 -32489 -31104 -28285 -32289 -37216 -29951 -13612 -7624 1450 -404
15067d04J2152J3344R189j4051K218o484p150j0256j6521l062L899O45Q551M832
15053c098q024k380K38r612j309J0518o61o085O223Q430J42j2625o518j2346j31
15038c7238L427R450L577l635k110L786J4827m809j8897o905O423O578K969P808
15024a4749K604R541N568K516j07n860l863J193j3102m660k798K01l243J070J34
15009b5555O635O329N28M523P234J1494l415j0163o577Q43J82J7866R7J0449Q286
14994B8756j967j9356o539K361J237l936r642N795J2366O173p491l788l570N610
14980F009J2593m562o584j961J2885M924k522l171j0997o959l637j598N86q062
14966a3056q425J107j6229q017L510J0553J4764j009N224n386q774J0364l919
$$ plain form
15067 -404 11748 25092 34281 20230 22448 15964 8814 -1442 -17963 -21025 -17126 -16481 -7930 -3098
15053 -3098 -11122 -13502 -13264 -22876 -24185 -13667 -14328 -20413 -14190 -5760 -5618 -18243 -24761 -37107 -37238
15038 -37238 -33811 -24361 -20784 -24419 -26529 -22743 -7916 -12725 -31622 -38527 -32104 -25526 -22557 -14749
15024 -14749 -12145 -2604 2964 5480 5373 -487 -4350 -3157 -16259 -20919 -23717 -23516 -26759 -25689 -25555
15009 -25555 -18920 -12591 -12063 -7540 -306 11188 7773 -2390 -8967 -8124 -7942 9924 10021 20470 28756
14994 28756 26789 7433 894 3255 4492 556 -9086 -3291 9075 15248 7757 3969 399 6009
14980 6009 18602 14040 7456 5495 18380 23304 20782 17611 6614 -345 -3982 -5580 -4994 -13056
14966 -13056 -21481 -20374 -36603 -44620 -41110 -30557 -15793 -16802 -11578 -16964 -25738 -15374 -19293
14953a9293N777o943j0491n289N454J1378j954o581J922M390K622K089N96p002
14939b3325J0866k365j4047p619M281J8913J6918j6995l155J1994m512j4333o278
14926b9657J1816j610J833P072M952p28R649M957O114k913p81p504j2591l13M63
14911i241O220o148q706O611R964j435j3457n8q155J682o907j035J4299J3043
14897c323j1823j3757j2278J2209M016k708J532M02J0385q999N750J0609O242
14884a743K246q339N181O32N06r38k862J4955J583j4572K276L186M41P1j7266
14869a4643N92L579Q442j2277j0830P62J3034Q864p623o380n007L911R974n165
14855a2767N215n28p243o480k959Q785P920j2551j5092n144J2626J2203l410j5922
$$ plain form
14953 -19293 -13516 -20459 -30950 -36239 -30785 -19407 -21361 -27942 -26020 -21630 -19008 -16919 -16323 -23325
14939 -23325 -12459 -14824 -28871 -36490 -32209 -13296 3622 -13373 -16528 -4534 -9046 -23379 -29657
14926 -29657 -17841 -19451 -17618 -10546 -5594 -6322 3327 8284 14398 11485 10704 3200 -9391 -9704 -9241
14911 -9241 -3021 -9169 -17875 -11264 -1300 -2735 -16192 -16250 -24405 -22723 -29630 -30665 -16366 -3323
14897 -3323 -15146 -28903 -41181 -28972 -24956 -27664 -26132 -25730 -15345 -24344 -18594 -7985 -1743
14884 -1743 503 -7836 -2655 -2023 -1517 -2455 -5317 9638 11221 -3351 -1075 2111 2552 2623 -14643
14869 -14643 -14051 -10472 -2030 -14307 -25137 -24375 -11341 -2477 -10100 -16480 -21487 -17576 -7602 -12767
14855 -12767 -7552 -8080 -15323 -21803 -24762 -15977 -8057 -20608 -35700 -40844 -28218 -16015 -19425 -35347
14841c5347j793J3240K909l257J5944J3490k670r34j9016r713O315R362O604O234
14827A368o274j1307J067J17J067K847J0312J7980k572j0092q243r297L822k390
14813a1595q938J135J5165J2208l111N11P385q456J2m822q960n231Q235j962r518
14798a7942k528j2002n828P438Q227J4220M801p946M555o598j394J7243j0260
14785h014m794M888j733n884J0716J000p582J1799R844p17p97L432K87j0648j2455
14770a0658m686N065p493J0324M316j5802r956J1568N437o082M184o062n014P231
14756a7628r249j2704M277J8464m203r535r811P598J8085J3190k76j5500K552
14743a4740m78n662O581N552M476l42L659M652p971r397o725l910k847r191j521
$$ plain form
14841 -35347 -37140 -23900 -20991 -24248 -8304 5186 2516 1582 -17434 -27147 -20832 -11470 -4866 1368
14827 1368 -4906 -16213 -15146 -15029 -13962 -11115 -803 17177 14605 4513 -3730 -13027 -9205 -11595
14813 -11595 -20533 -19398 -4233 7975 4864 5375 12760 4304 4316 -506 -9466 -14697 -6462 -8424 -17942
14798 -17942 -20470 -32472 -38300 -30862 -22635 -8415 -3614 -11560 -7005 -13603 -14997 2246 -8014
14785 -8014 -12808 -7920 -9653 -15537 -4821 -3821 -11403 396 10240 9523 8726 12158 12445 1797 -10658
14770 -10658 -15344 -10279 -17772 -7448 -3132 -18934 -28890 -17322 -11885 -17967 -13783 -19845 -24859 -17628
14756 -17628 -26877 -39581 -35304 -16840 -21043 -30578 -40389 -32791 -14706 -1516 -1792 -17292 -14740
14743 -14740 -15218 -20880 -14299 -8747 -4271 -4613 -954 3698 -4273 -13670 -20395 -24305 -27152 -36343 -37864
14728c7864K336R406N210R623J490J022O435L674R855m941j2402j0915k938K105
14714a7904J1591N941n8R720J805j9519j5329j4236J2825K1608J1796N118j0597
14701B761j1701m893p136M033r679k615k230m520J0425m002L309J0397K08p125
14687b2768J21m192O67o49N265J6238k850M631o387q861p94O995Q157j465n985
14672a1877L624o256p317Q534R064k256p960j8359m064R541L477R632J056Q665
14658d496J1635n81j6992k933k632N67K632q177k996P986J5324r738l556J1429
14644b528K7n079l802k982J0380p609m076r171n529l716J023J654K402J3777J812
14629a3417K695m423M909p64j8885j7161P448N997j106k011K783o745m645l111
$$ plain form
14728 -37864 -35528 -26122 -20912 -11289 -9799 -8777 -2342 1332 11187 6246 -6156 -17071 -20009 -17904
14714 -17904 -6313 -372 -430 9290 11095 -8424 -23753 -37989 -25164 -3556 8240 13358 2761
14701 2761 -8940 -13833 -20969 -16936 -26615 -29230 -31460 -35980 -25555 -29557 -26248 -15851 -15643 -22768
14687 -22768 -22647 -26839 -26172 -26821 -21556 -5318 -8168 -3537 -9924 -18785 -19579 -12584 -4427 -5892 -11877
14672 -11877 -8253 -14509 -21826 -13292 -4228 -6484 -14444 -32803 -36867 -27326 -23849 -14217 -13161 -4496
14658 -4496 7139 6558 -10434 -13367 -15999 -15432 -12800 -20977 -23973 -15987 -663 -10401 -13957 -2528
14644 -2528 -2501 -7580 -11382 -14364 -3984 -11593 -15669 -24840 -30369 -34085 -33062 -31408 -29006 -15229 -13417
14629 -13417 -10722 -15145 -10236 -11000 -29885 -47046 -39598 -33601 -34707 -36718 -33935 -40680 -45325 -48436
14615d8436O835J0543P565J116o075k399M436K0030q902q467k868p20J6742L425
14601g175K144l155j1793q842p080J0064n789N649J7850J3911j8608r040L309
14588a8555R797K169n941N030m876j8322k596M520K741N550N688M7j292j2245
14574b8285P078O798rJ0832k10J604m882o226Q170n344L399j2826O448O93L850
14559h910M127j432j7872l427J1937K521L143R913n62j3553l981N564P340k671
14545g863Q079j1986j2103j2823j2181J1679K1341J0322j394R699M195j5220j3347
14532b1602m913N375L313M001K1189J1189L038j3181j7480J617m684J8M587L333
14518d200n265j194q356o941n517N659Q72J684N350m016J98J7512K1064l750j8065
$$ plain form
14615 -48436 -41601 -31058 -23493 -22377 -28452 -30851 -26415 -6385 -15287 -23754 -26622 -27342 -10600 -7175
14601 -7175 -5031 -8186 -19979 -28821 -35901 -25837 -31626 -25977 -8127 5784 -12824 -21864 -18555
14588 -18555 -8758 -6589 -12530 -7500 -12376 -30698 -33294 -28774 -26033 -20483 -14795 -14748 -16040 -28285
14574 -28285 -21207 -14409 -14418 -3586 -3796 -2192 -7074 -13300 -5130 -10474 -7075 -19901 -13453 -12760 -8910
14559 -8910 -4783 -6215 -24087 -27514 -15577 -13056 -9913 0 -562 -14115 -18096 -12532 -5192 -7863
14545 -7863 216 -11770 -23873 -36696 -48877 -37198 -15857 -5535 -6929 2770 6965 -8255 -21602
14532 -21602 -26515 -21140 -17827 -13826 7363 18552 21590 8409 -9071 -7454 -12138 -12120 -7533 -4200
14518 -4200 -9465 -10659 -19015 -25956 -31473 -25814 -24942 -23258 -17908 -21924 -21726 -4214 16850 13100 -4965
14503d965l985j036J585P230L426P152m573j5417J870L94P497N631O851m304K376
14488I732l599j5755j0036j310J3248k024j933J2561J0338j412m330p030J1253
14475I703n46p65J139k143M53k051j3165j0700J0421J4225j5302o415r17P160
14461h903q65j086j241m994r505j1654l660l371J1015N88M684p429o082J1579
14447c0924p22l198N081l290L602r362p666m98K0803J5428O924o120n245M319
14433a0868q38n431o64l092R19L059l56L770K1709N859q634n888O182J3338J1880
14418C0945p815j8327r303K400o649L034J9387n708l450p299p181J446m226q256
14404b1002K948J3131o197q23K459r78j311J4791j3032j8124m156J0033J7754
$$ plain form
14503 -4965 -8950 -9986 -8401 -1171 2255 9407 4834 -10583 -8713 -8319 -822 4809 11660 7356 9732
14488 9732 6133 -9622 -19658 -20968 -7720 -9744 -11677 884 11222 9810 5480 -1550 9703
14475 9703 9157 8392 9531 7388 7841 5790 -7375 -18075 -7654 6571 -8731 -15146 -16063 -8903
14461 -8903 -9768 -10854 -12095 -17089 -26594 -38248 -41908 -45279 -34264 -33676 -28992 -36421 -42503 -30924
14447 -30924 -31646 -34844 -29763 -33053 -29451 -38813 -46479 -46977 -26174 -10746 -3822 -9942 -15187 -10868
14433 -10868 -11706 -17137 -17801 -20893 -19974 -16915 -17271 -13501 8208 14067 5433 -455 5727 19065 30945
14418 30945 23130 4803 -4500 -2100 -8749 -5715 13672 7964 4514 -2785 -9966 -8520 -12746 -21002
14404 -21002 -18054 -4923 -11120 -11943 -9484 -10462 -11773 3018 -10014 -28138 -32294 -22261 -4507
14391d507p462L731J0034p195m779j0145L553O722J94j0339j6059l028M744R160
14377b5376J616l921m309P86j5709r242N889N839P97K0756K3251k802q988q537
14363a9950l561k95J2632K1461j2208J694r317j2163P824M304j0430P926L732
14350h351J557r369l418J1069R846j498O987l360k638j099j779j6038N898M909
14336g284R07J1195o898j127Q450N38j5292p672J0729P518O777j1087K315R014
14322H083p789m339L044j2867m208q581L861j963N854k800o459O23J5745P797
14308c999N248M848q056j2486O994P275j4417q600Q383j748O95M293M850j2087
14294a8807o902k436j594k638O078N714N627K1458K361j9011j0213r26m200j0899
$$ plain form
14391 -4507 -11969 -8238 1796 -5399 -10178 -20323 -16770 -10048 -9854 -20193 -36252 -39280 -34536 -25376
14377 -25376 -23760 -27681 -31990 -31204 -46913 -56155 -50266 -44427 -43630 -22874 377 -2425 -11413 -19950
14363 -19950 -23511 -23806 -11174 10287 -1921 -227 -9544 -21707 -13883 -9579 -20009 -12083 -8351
14350 -8351 -6794 -16163 -19581 -8512 1334 -164 6823 3463 825 -274 -2053 -18091 -12193 -7284
14336 -7284 -6377 4818 -2080 -3207 5243 5781 -9511 -17183 -6454 1064 7841 -3246 -931 8083
14322 8083 294 -4045 -1001 -13868 -18076 -26657 -22796 -24759 -18905 -21705 -28164 -27541 -11796 -3999
14308 -3999 1249 6097 -1959 -14445 -7451 -176 -14593 -23193 -14810 -16558 -15863 -11570 -6720 -18807
14294 -18807 -25709 -28145 -29739 -32377 -26299 -20585 -14958 6500 8861 -10150 -20363 -21289 -25489 -36388
14280c6388Q352K8569J660n304N399K380P095N564j6365j0142k55O332k753j6797
14266b2653P85J675N704M006o313L030M157K1078M358j8669j0200M873J9566j2241
14252h44j2017O386J304o57Q994J277n570m791p030q827O66O982k52K108p442
14237a9713m152r230l649K0986J1650Q925p64j0375m916J0262M86j5297l529M246
14223a5070p398j1294J1090Q064o314N690J1935J511K430N555M326j1183j1915
14210a2573O285R207k5655k139R903l63m096M713J2926o074l75N077k832j4929
14196b0925j0086r477o56J1553J1680P701K765P931n144N063q935k028Q828K452
14182G22q723n656j7653K66J3598K675M436k042l088j2806K076R787k361K601
$$ plain form
14280 -36388 -28036 533 2193 -3111 2288 4668 11763 17327 962 -9180 -9435 -3103 -5856 -22653
14266 -22653 -21868 -20193 -14489 -10483 -16796 -13766 -9609 11469 15827 -2842 -13042 -8169 11397 -844
14252 -844 -12861 -6475 -5171 -5828 3166 4443 -1127 -5918 -12948 -21775 -21109 -14127 -14379 -12271 -19713
14237 -19713 -23865 -33095 -36744 -15758 -4108 4817 4053 -6322 -11238 -976 -490 -15787 -19316 -15070
14223 -15070 -22468 -33762 -22672 -14608 -20922 -15232 -3297 -1786 644 6199 10525 -658 -12573
14210 -12573 -6288 2919 -22736 -24875 -14972 -15335 -19431 -14718 -1792 -7866 -8241 -3164 -5996 -20925
14196 -20925 -31011 -40488 -41144 -29591 -17911 -10210 -7445 486 -4658 405 -8530 -10558 -1730 722
14182 722 -8001 -13657 -31310 -31044 -17446 -14771 -10335 -12377 -15465 -28271 -26195 -16408 -18769 -16168
14168a6168O708k831q763j1019J0433L557n782j5357P71K6847R998j0131J965
14155i772O715j1122m625m009O31J6672Q783q802j0917N306p213n523M772J403
14141a7701N377O517m310m425j3357M748N446j1171J0501J3755J0127j375k937
14128A195l174M598L177n665J47L874p768J08R240l422m345m973k228r466k906
14113b1608R415J748n171P289R521j0397k72m346k0230m950K2566J1495K841p927
14099a0026q890J0954K562j2221L089Q765R411l25Q908k31j49j511J396J1165
14085B2897k1692n207n27m707n26N527J8897j1118j9412j119R75K899K207P84
14071a0122O822J5400J168j6601l46m161P968j031j5197J1215M743Q490L915N504
$$ plain form
14168 -16168 -9460 -12291 -21054 -32073 -21640 -18083 -23865 -39222 -38451 -11604 -1606 -11737 -9772
14155 -9772 -3057 -14179 -18804 -22813 -22182 -5510 3273 -5529 -16446 -11140 -18353 -23876 -19104 -17701
14141 -17701 -12324 -5807 -10117 -14542 -27899 -23151 -17705 -28876 -18375 -4620 5507 4132 1195
14128 1195 -1979 2619 5796 131 278 4152 -3616 -3508 5732 2310 -2035 -7008 -9236 -18702 -21608
14113 -21608 -12193 -10445 -15616 -8327 1194 -9203 -9475 -13821 -34051 -39001 -16435 -4940 -2099 -10026
14099 -10026 -18916 -7962 -5400 -17621 -14532 -5767 3644 3319 12227 11996 11847 10336 11732 22897
14085 22897 1205 -4002 -4529 -9236 -9762 -4235 14662 3544 -15868 -16987 -16012 -13113 -10906 -10122
14071 -10122 -3300 12100 13268 -3333 -3679 -7840 128 -903 -16100 -4885 -142 8348 12263 17767
14057A7767j209m286q386N532P165N072N449R069L652J512K190p574M924R045
14043D9922O034l191O966J1673J1480M774J7575J2287J9770M4869M1757M7745
14031B71661M3948M0038R356J6319K0619Q346m954J0750J0233r69J0266j0596
14019D25017j6278l2762l5780m1695l9615m1133n3500l6034l3757j0280j4615
14008F9568m07j7396L051L044o809k978k0765l46Q891q314o770R66k2220j4820
13994a5305P405J4977M174l592l433R694J0284N907J939j1215N099m352j5671
13981E911r506p869J7703K556K03J0818J4159l895j7277o771J273j718Q276j419
13967A2444R166J1225j62k588L262K643j0985o887K172J296o680O093L037L298
$$ plain form
14057 17767 16558 12272 3886 9418 16583 21655 27104 36173 39825 41337 43527 35953 40877 49922
14043 49922 55956 52765 59731 71404 82884 87658 105233 117520 137290 182159 223916 271661
14031 271661 315609 355647 365003 381322 401941 410287 405333 416083 426316 425347 435613 425017
14019 425017 408739 375977 340197 298502 258887 217754 164254 128220 94463 84183 69568
14008 69568 69161 51765 54816 57860 51051 48073 27308 26962 35853 27539 20769 21735 -485 -15305
13994 -15305 -7900 7077 11251 7659 4226 13920 24204 30111 32050 20835 25934 21582 5911
13981 5911 -3595 -11464 6239 8795 8998 19816 33975 30080 12803 6032 7305 5587 13863 12444
13967 12444 21610 32835 32673 30085 33347 35990 25005 18118 20290 21586 14906 20999 24036 27334
13953B7334q242j3799j1441l571R992P72q217j920K612j621p949J7081J1852l137
13939I746j7166J1862J510j0228m845J583L61J8436l262j2663J015j188o865k854
13925a4558J0216K1015L478j3673k122k207p654m936o831J946Q963K732L104Q711
13911H184M491m686l923J3991R694j248q301J1795p03j4779j1819p86O13L816
13897F339p761j1035j5815L099l23m230j118J7543K4683J5417q408j7910P105
13884G586m503k358k764k791o906m216P599L807o402P824M520l882K563R320k513
13869F884r863m082m349o478j862n678p970J5379J8063K2025N63n547j932n053
13855A0100l09J68l824j2432m343M117J5391J041J2812q45L654m112o536q412
$$ plain form
13953 27334 19092 5293 -6148 -9719 273 1045 -7172 -9092 -6480 -8101 -16050 1031 12883 9746
13939 9746 -7420 4442 5952 -4276 -9121 -7538 -7177 11259 7997 -4666 -3651 -4839 -11704 -14558
13925 -14558 -4342 16673 20151 6478 4356 2149 -5505 -10441 -17272 -15326 -6363 -3631 -527 8184
13911 8184 12675 7989 4066 18057 27751 26503 18202 29997 29294 14515 2696 1910 2523 6339
13897 6339 -1422 -12457 -28272 -25173 -25496 -29726 -30844 -13301 11382 26799 18391 481 7586
13884 7586 3083 725 -2039 -4830 -11736 -15952 -8353 -4546 -10948 -3124 1396 -2486 77 9397 6884
13869 6884 -2979 -7061 -11410 -17888 -19750 -25428 -33398 -18019 44 22069 22632 17085 15153 10100
13855 10100 9791 9959 6135 -6297 -10640 -6523 8868 9909 22721 21876 25530 21418 14882 6470
13841F470J930J1725J527j1557j3002o357m565N085j319q706m091n037J651N718
13827b0528J3211L766p476P970J3092o701p158j0426L261j275p143O465J4627
13814A685J1362p541O909q464j0392o712J0858j4015o674J1547J3060N842j016
13801F449m48J073o781m678j5777R530K26l200L622Q678L679n442M051m105j0585
13786a3708q81J6377P126O296M358r635O77M657n811j2341J722k954p20m376K5224
13771A6011M760l392K316n738l503J871l776q219M939J834j90j554j349K917l704
13756C223M061N440J1120J7240q759j0811J228Q171L929j199j3452o999j0417
13743B775o496K495P854j1710q856n639P850n81Q155O486r991L491j0161N652
$$ plain form
13841 6470 8400 20125 21652 10095 -2907 -9264 -13829 -8744 -10063 -18769 -22860 -27897 -26246 -20528
13827 -20528 -7317 -3551 -11027 -3057 10035 3334 -3824 -14250 -10989 -12264 -19407 -12942 1685
13814 1685 13047 5506 12415 3951 -6441 -13153 -2295 -16310 -22984 -11437 1623 7465 6449
13801 6449 6001 7074 293 -4385 -20162 -10632 -10406 -13606 -9984 -1306 2373 -3069 982 -3123 -13708
13786 -13708 -14589 1788 8914 15210 19568 9933 10610 15267 9456 -2885 -1163 -4117 -4837 -9213 16011
13771 16011 20771 17379 19695 13957 10454 12325 8549 330 5269 7103 6913 5359 4010 6927 3223
13756 3223 7284 12724 23844 41084 32325 21514 22742 30913 34842 33643 20191 13192 2775
13743 2775 -3721 -1226 6628 -5082 -13938 -19577 -11727 -12308 -4153 2333 -7658 -4167 -14328 -8676
13729h676J6072R272K280l896j5132l900J1560q42J2652p955j5391O140J8978
13716B1162M980P578M553o587o717j3489o304n861n666J7402J4867J1214j0806
13703B6326o415J811N910K478R94J664L153j9981k2622J601m439j3049O375P881
13689h313J5881m506q639J4624K3657K703p10k226k0983o704Q756J003j397j1491
13675A655n126J3806k279P559k743K907l958m770p093q260J2135J5206Q98L188
13661B3125m71m190k3654k914L779R45m952k844K973o336j3k29J1811J9130m960
13646A1200q346j1260r00K823L543o523M531O272N497N483R075j5312o934k560
13632c411k450N260J4j0108j2372J1881Q750K076j265L533J1860P590Q630k79
$$ plain form
13729 -8676 7396 16668 18948 15052 -80 -3980 7580 6738 19390 11435 -3956 2184 21162
13716 21162 26142 33720 38273 31686 24969 11480 5176 -685 -6351 11051 25918 37132 26326
13703 26326 19911 21722 27632 30110 31104 32768 35921 15940 -6682 -5081 -9520 -22569 -16194 -8313
13689 -8313 7568 3062 -5577 9047 32704 35407 34697 32471 11488 4784 13540 14543 13146 1655
13675 1655 -3471 10335 8056 15615 12872 15779 11821 7051 -42 -8302 3833 19039 19937 23125
13661 23125 22654 18464 -5190 -8104 -4325 -3380 -8332 -11176 -8203 -14539 -14552 -14781 -2970 16160 11200
13646 11200 2854 -8406 -9306 -6483 -2940 -9463 -4932 1340 6837 12320 21395 6083 -851 -3411
13632 -3411 -5861 -601 -587 -10695 -23067 -11186 -2436 -360 -1625 1908 13768 21358 29988 29709
13618B9709m911p107j6203o02R878m304o496j2153j8994R206P700O249N322L910
13604A204J0692l43p648m292j3870N366m417j771N556J3224l312k955M356n576
13590c786K037M114l294j989R885J1906j201L656O006j5949j0319J163Q46P620
13576A0695J1837J6070l238k259J738r609q030P011J0470M391J597l896j2255
13563B4522Q175Q67j752R265J708J3242N238J3262J4929J3651K466J1517K3326
13550A40416K4838J7353K0734K8359J6655K2103K2364J2288J0751K6231L0503
13539C72595L7905L1558K8071K0774Q929K6789K4225J3653j0999n302Q945j022
13527E56121P18J1857q253k6872l9668l7776j0079q035k4418k9282l1141k3198
$$ plain form
13618 29709 24798 17691 1488 886 10764 6460 -36 -12189 -31183 -21977 -14277 -8028 -2706 1204
13604 1204 11896 11553 3905 -387 -14257 -8891 -13308 -15079 -9523 3701 389 -2566 1790 -3786
13590 -3786 -1749 2365 -929 -2918 6967 18873 17672 21328 27334 11385 1066 2229 3075 10695
13576 10695 22532 38602 35364 33105 34843 25234 17204 24215 34685 39076 40673 36777 24522
13563 24522 32697 33564 31812 41077 42785 56027 61265 74527 89456 103107 105573 117090 140416
13550 140416 165254 182607 203341 231700 248355 270458 292822 305110 315861 342092 372595
13539 372595 410500 442058 470129 490903 499832 526621 550846 564499 553500 548198 557143 556121
13527 556121 556839 568696 560443 533571 493903 456127 446048 438013 413595 384313 353172 329974
13515C29974k9605k8575k2465k7592j3568k0440j4311j9705o046j1336M548j514
13503A39365j6560j9797J127j2018J475L255m144p643K548J3298P718n502p972
13490I5150k005j7939j6064k639J0823O192N984o471L371j5005r160P795m388
13477E5644n981J4757J9430M988J528J334O390J2361J1992J7388n609m321J996
13464A31897m392j6408n038j4465r702m497k59j4169p230p035N973o359p388j098
13450C9830J999n026K035j2707q009o745L315R591J0253J9814O569O023J3044
13437G9986j028J0574J0846K6711J8374Q712j106j1914j6082j4915j1457j4051
13425H4650k0069j7472j5454j2505O989n316J594J89q217n446j139n63P204l270
$$ plain form
13515 329974 300369 271794 249329 221737 208169 187729 173418 153713 147667 136331 140879 139365
13503 139365 122805 103008 104135 92117 93592 96847 92703 85060 87608 100906 108624 103122 95150
13490 95150 93145 75206 59142 56503 67326 73518 79502 73031 76402 61397 52237 60032 55644
13477 55644 49663 64420 83850 88838 90366 91700 98090 110451 122443 139831 134222 129901 131897
13464 131897 127505 111097 106059 91594 81892 77395 77136 62967 55737 48702 54675 48316 40928 39830
13450 39830 41829 36803 38838 26131 18122 11377 14692 24283 34536 54350 60919 66942 79986
13437 79986 78958 89532 100378 127089 145463 154175 153069 141155 125073 110158 98701 84650
13425 84650 64581 47109 31655 19150 26139 20823 22417 22606 14389 8943 7804 7241 14445 11175
13411A1175K834l104q983q8J0186k310J0549l497o380L283J1419Q706J331j1700
13397B3421R21M754R210j0287j3297P476l773o879L496j978L242l620m565O7M75
13382H663K147n646K446p660j3213L545O711J467l256J720J5047L860N841J0063
13368C1735N779K559k014m306k675m804k0106J6575R985p095l457o107j8989P029
13354D109Q753q330Q10l799R665O737r96r052Q621o1j0379n726P984J3057Q53
13339B2246j3228R751K90j3782k979j214P254J67m344M824n91O470r254n949k396
13324b735K026J599J0440j135j2124j922J1010K2503q605j1107k835j214J316
13311G217l366p224J4496j755o414J4447o16j5822M141N578j1978k191M721J854
$$ plain form
13411 11175 14009 10905 1922 1834 12020 9710 20259 16762 10382 13665 25084 33790 35121 23421
13397 23421 24342 29096 38306 28019 14722 22198 18425 11546 15042 13064 16306 12686 8121 8188 8663
13382 8663 10810 5164 7610 -50 -13263 -9718 -3007 -1540 -4796 -3076 11971 15831 21672 31735
13368 31735 37514 40073 38059 33753 31078 26274 6168 22743 32728 25633 22176 16069 -2920 4109
13354 4109 12862 4532 5342 1543 11208 17945 16949 7897 16518 16457 6078 352 8336 21393 22246
13339 22246 9018 18769 19059 5277 2298 1084 8338 8505 4161 8985 8394 14864 5610 -339 -2735
13324 -2735 -709 890 11330 10195 -1929 -3851 7159 29662 21057 9950 7115 5901 7217
13311 7217 3851 -3373 11123 9368 2954 17401 16785 963 5104 10682 -1296 -3487 1234 3088
13297C088R424K235o610p55j734J3195Q320Q627N372n587M30j3198n786m208j0126
13282B687r016K361M127R248J0144J423p555j424q809R428J0039M441j4817q505
13268C772Q505R663J3372p17k978o285L993l565p153J904J656O531J1487j2453
13254B7732j0771j4029M172R089O169O179l15j8012O288J1186k998n584P569L797
13240C0472O27J36n018R93j1574N187L503K134J0655J248n430j810L646j1943
13226B2826j4911R622J5060P545l04K606J797p317k554m727j0206q488p46J0154
13212B0357o168j3456O536m403J4335P791j3145L62R916j5307j8944N055J6838
13199I767J9268q294j2948l596m157N826M266J1931N540j4745M526N44J4921o671
$$ plain form
13297 3088 12512 14747 8137 7382 5648 18843 27163 35790 41162 35575 36005 22807 17021 12813 2687
13282 2687 -6329 -3968 159 9407 19551 20974 13419 11995 3186 12614 22653 27094 12277 3772
13268 3772 12277 21940 35312 34595 31617 25332 29325 25760 18607 20511 22167 28698 40185 27732
13254 27732 16961 2932 7104 16193 22362 28541 28226 10214 16502 27688 24690 19106 26675 30472
13240 30472 31099 31235 26217 27210 15636 20823 24326 26460 37115 38363 32933 31123 34769 22826
13226 22826 7915 17537 32597 40142 39838 42444 44241 36924 34370 29643 19437 10949 10203 20357
13212 20357 14189 733 7269 2866 17201 24992 11847 12209 22125 6818 -12126 -7071 9767
13199 9767 29035 20741 7793 4197 40 5866 10132 22063 27603 12858 17384 17928 32849 26178
13185B6178j5787M871K4340L388q535K121o23q871M928P504p372j1208j883m68
13171A8583J0955o502q458N013q657J0850J4663j366m614J632o044n172R012j324
13157B8571l071j2567j5969j3536j905R027M949R484L118l375L241j7210Q413
13144h30J6093k897q757j4906k928l154M145P652k736Q451J8875N263j2754r615
13130A902M601O747o888L16P167L587j1078l715O793p090j9075N056J7958K522
13116H803j267j380M62j985M706M292o582m903N853J7765L927n378O815J4741
13102D5869r028l069R97o774o931l359J1553J791J597j4799k9624O35o548J1852
13088e838J8353l778m320R34J1050L119M140J3863j2196j5636N629L533J2390
$$ plain form
13185 26178 10391 15262 39602 42990 34455 36576 35953 27082 32010 39514 32142 20934 19051 18583
13171 18583 29538 23036 14578 19591 10934 21784 36447 35081 30467 32099 26055 20883 29895 28571
13157 28571 25500 12933 -3036 -16572 -18477 -9450 -4501 4983 8101 4726 7967 -9243 -830
13144 -830 15263 12366 3609 -11297 -14225 -17379 -13234 -5582 -8318 133 19008 24271 11517 1902
13130 1902 6503 13250 6362 6678 13845 17432 6354 2639 9432 2342 -16733 -11677 6281 8803
13116 8803 7536 6156 6618 4633 9339 13631 7049 2146 7999 25764 29691 24313 31128 45869
13102 45869 36841 33772 34769 27995 21064 17705 29258 31049 32646 17847 -11777 -11142 -17690 -5838
13088 -5838 12515 8737 4417 5351 16401 19520 23660 37523 25327 9691 15320 18853 31243
13075C1243n819j434L240j1073p238J2588L762L399j339q337M396k96j045Q171
13061C0218j40O509O10n177k25O037j8541P098R87m592Q907R468o272m37j2942
13046B1508r161l711j1594j0195R234J1962p700J0983J2924l321M874P590J672
13033C5065q824o342j2357M312J4254j0036J6380O392p049j010L898Q519j472
13020D1730J978K65Q529Q607O747j477K662J0682K497Q124J5886J8011K4823L1946
13006A81010M0643O0935P0645Q6865J18721J38576J62870J67075J68371J48501
12996A344212R2359K4822n1194q7197j29987j56513j66683j46012j40526j22780
12986D60501j02480n8998n5813m0350k1100k7227k1386k4028j6237l900j5230
$$ plain form
13075 31243 25424 23990 27230 16157 8919 21507 25269 28668 27329 18992 23388 23092 22047 30218
13061 30218 30078 36587 37197 32020 31795 37832 19291 26389 27376 22784 31691 41159 34887 34450 21508
13046 21508 12347 8636 -2958 -13153 -3919 8043 343 11326 24250 20929 25803 33393 35065
13033 35065 26241 19899 7542 11854 26108 16072 32452 38844 31795 30785 34683 43202 41730
13020 41730 43708 43973 52502 61109 67856 66379 69041 79723 82220 90344 106230 124241 149064 181010
13006 181010 221653 282588 353233 440098 558819 697395 860265 1027340 1195711 1344212
12996 1344212 1436571 1461393 1410199 1323002 1193015 1036502 869819 723807 583281 460501
12986 460501 358021 299023 243210 202860 181760 154533 133147 109119 92882 88982 73752
12975G3752j649L823j6218m425K26o301o198j0240q556N853P084k053m587o615
12961B3896k635K332j847N001L075n844q332j4525J4512J3605n589M399J5945
12948D3993N466m838M866J5932j0604j3387j84n455j5284q922J99M117J605n426
12934A2078j886J4821J4481l002L717m623j586r445r76j563P191K382K983j366
12920C3206j232L173M541L129p153k962m410L002P922o163o03M284l144q472j0122
12905A4996K368J1523P578J4927M992l820K505l401j2436l833J0448l899k4437
12892A7511L183J2300n512j03P253L099J6427M379J0087R755j9077k4779j486
12879C3037N715m856J9166K0299m943J482K1455O529Q320j6670k495P810K204
$$ plain form
12975 73752 72103 75926 59708 55283 55509 49208 43010 32770 24214 30067 37151 35098 30511 23896
12961 23896 21261 23593 21746 26747 29822 23978 15646 1121 15633 29238 23649 28048 43993
12948 43993 49459 44621 49487 65419 54815 41428 41244 35789 20505 11583 11782 15899 17504 12078
12934 12078 10192 25013 39494 36492 40209 35586 34000 24555 23579 22016 29207 31589 34572 33206
12920 33206 31974 35147 39688 42817 35664 32702 28292 31294 39216 33053 32450 36734 33590 25118 14996
12905 14996 17364 28887 36465 51392 56384 52564 55069 51668 39232 35399 45847 41948 17511
12892 17511 20694 32994 27482 27379 34632 37731 54158 58537 68624 78379 59302 34523 33037
12879 33037 38752 33896 53062 73361 68418 69900 91355 97884 106204 89534 87039 94849 97053
12866I7053j2247m187R96j9048Q64L421m159K610o901M258J2012L122J940j837
12852G7897N133n220k149o969j510o324r46L601j6711n203M420Q265J6950J0696
12838H1930J0711j546M305K9J8740O122J0496J9844K0532R653J5604J9891Q031
12825B24342R509L8j0706j0404k0461k0699k8348n777L246m733j8883j1334N797
12812A11587o49r70m905j823k0328j3009O219k808L673J06O107o112p466m067
12798F5555J0635M805M098j0823j560P800L512j242L568j794P232J7937n424n193
12784I9106K817j2812j457j84K673L657q628l411r009k918J2554Q525P521K202
12770A00636j968L881l979j8325q821J883j4133K2249J4926L01n390n110R126
$$ plain form
12866 97053 84806 80619 81615 62567 63431 66852 62693 65303 58402 62660 74672 77794 79734 77897
12852 77897 83030 77810 75661 68692 67182 60858 59912 63513 46802 41599 46019 54284 71234 81930
12838 81930 92641 91095 95400 95429 114169 120291 130787 150631 171163 180816 196420 216311 224342
12825 224342 233851 233889 223183 212779 192318 171619 143271 137494 140740 136007 117124 105790 111587
12812 111587 110938 109968 105063 103240 82912 69903 76122 73314 76987 77093 83200 77088 69622 65555
12798 65555 76190 80995 85093 74270 72710 80510 84022 82780 86348 84554 91786 109723 104299 99106
12784 99106 101923 89111 87654 87470 90143 93800 85172 81761 72752 69834 82388 90913 98434 100636
12770 100636 98668 102549 98570 80245 71424 73307 59174 81423 96349 96650 91260 86150 95276
12757I5276J3606l554j4966k2604k0442m380m714P145M629J943J2730J2373J2834
12744H9876K5001j494j5465m104J7814K01j2956P201k053p006J9351J0475p495
12731A19346l617J7097J3105r869l582J963M637q392j9326j7658Q03K516j356
12718I5667Q565P525J8377K1169Q768O025q615M371J3306K914m073p071k782q044
12704A56102M739J6457J1882J5468L256J7136K1945L536j0937P776j2134j307
12692B33919j0258q333K863j398l16p789J085R011M943P180L945J0150K126j176
12678B45952n439n605n134P36J2421J4912Q663J312j452n957m01O276Q965J6058
12664B91307L6999J6135J6559N288K1016L1205j8Q277Q486K226P91R83P144J2338
$$ plain form
12757 95276 108882 105328 90362 67758 47316 42936 38222 45367 49996 51939 64669 77042 89876
12744 89876 114877 113383 97918 93814 111628 111829 98873 106074 104021 97015 116366 126841 119346
12731 119346 115729 132826 145931 136062 132480 134443 139080 130688 111362 93704 94507 97023 95667
12718 95667 104232 111757 130134 151303 160071 166096 157481 161852 175158 178072 173999 166928 164146 156102
12704 156102 160841 177298 189180 204648 207904 225040 246985 250521 239584 247360 235226 233919
12692 233919 223661 215328 218191 216793 216477 208688 209773 218784 223727 230907 234852 245002 247128 245952
12678 245952 240513 234908 229774 230510 242931 257843 266506 267818 266366 260409 260008 266284 275249 291307
12664 291307 328306 344441 361000 366288 387304 418509 418491 426768 435254 437480 438271 439254 446398 458736
12650D58736J0813R492K4019K1076K8608K6979K0527K2197P69P07P381J9519L3440
12637F84263L7133L1816K7587K5291L4242J7269J5015J7177J3663N421J5557j941
12625I22493O3K6336K9403L0773N2564M6637N9319O1838N9559Q0113Q7433J02043
12613A558574J14322J14904J24687J40267J21566J41289J44798J41957J61078
12604B763442J71406J91371J96974K27426K61017L00992L60955M57365N58115
12595E489063O95399Q74013J071233J273365J490301J685606J899618K142760
12587A6621358K441773K849895L472085M510980O205282Q885975J2852202J8159916
12579G5999466K4178596K9498438L2737662L3199164L0829806K5378068J6503150
$$ plain form
12650 458736 469549 479041 503060 524136 552744 579723 600250 622447 623216 623923 631304 650823 684263
12637 684263 721396 753212 780799 806090 840332 857601 872616 889793 903456 908877 924434 922493
12625 922493 922556 948892 978295 1009068 1061632 1108269 1167588 1229426 1288985 1369098 1456531 1558574
12613 1558574 1672896 1787800 1912487 2052754 2174320 2315609 2460407 2602364 2763442
12604 2763442 2934848 3126219 3323193 3550619 3811636 4112628 4473583 4930948 5489063
12595 5489063 6184462 7058475 8129708 9403073 10893374 12578980 14478598 16621358
12587 16621358 19063131 21913026 25385111 29896091 36101373 44987348 57839550 75999466
12579 75999466 100178062 129676500 162414162 195613326 226443132 251821200 268324350
12572B68324350M821701p546963j8169941k5800256l0470491l2350939l1318643
12565A27488818k7548326k2117164j6591327j2006201q626053o283632m709960
12558B9606155l707391l079892k653984k367794k129446j891789j659494j421493
12550A0694872j194666r94512q38751o93024o10354n34521m74900m20161l81352
12541D552631l38394k91386k69231k32160k00229j59081j52281j35118j37289
12532B637462j09298r7886r1314r9282q9739q1938o3647n4640m9778m8569l5317
12521A816054k9655l1009n5252n4409m9743n4735o8477q4718q2037q4297p0171
12510A151551p0625n1493m7406l5028l1754k4576k6915k7363k3571j5353k5451
$$ plain form
12572 268324350 273146051 265599088 247429147 221628891 191158400 158807461 127488818
12565 127488818 99940492 77823328 61232001 49225800 40599747 34316115 29606155
12558 29606155 25898764 22818872 20164888 17797094 15667648 13775859 12116365 10694872
12550 10694872 9500206 8505694 7666943 6973919 6363565 5829044 5354144 4933983 4552631
12541 4552631 4214237 3922851 3653620 3421460 3221231 3062150 2909869 2774751 2637462
12532 2637462 2528164 2430278 2338964 2239682 2149943 2068005 2004358 1949718 1899940 1851371 1816054
12521 1816054 1786399 1755390 1700138 1645729 1595986 1541251 1472774 1388056 1306019 1221722 1151551
12510 1151551 1080926 1029433 982027 946999 915245 890669 863754 836391 812820 797467 772016
12499G72016j8032k2374j1504k6435l4669j6147j4997j6207l1834k3792j3162
12488E42863r369n450k137M324n786j0142J0339Q948J5134J6154K1864K4305J5794
12475F26841J4545J9340K9222M1327K9120L5529N65j8439j7362m143R589L417
12463G69551k9497q9824q1270o3607l7181k5968r851r985q339q318r289n388K50
12450C91284M708M81o30J860P146K977j8229j6734p896r417j1540r022o393k7514
12436C01081k9779q514o41p048p581k124N614L054R941O264P258j4566q708n388
12422B48863m171o968k2672q319j429j425j7028j1490o44j810R856J1323j5346
12409A78740n501J3121M20q84O815J1030m080N465m733M74P546O351j2869n173
$$ plain form
12499 772016 753984 731610 720106 693671 659002 642855 627858 611651 579817 556025 542863
12488 542863 533494 528044 525907 530231 524445 514303 524642 533590 548724 564878 586742 611047 626841
12475 626841 641386 660726 689948 731275 760395 795924 796489 778050 760688 756545 766134 769551
12463 769551 740054 650230 568960 505353 468172 442204 432353 422368 414029 405711 396422 391034 391284
12450 391284 395992 396473 395843 397703 404849 407826 389597 372863 364967 355550 344010 334988 328595 301081
12436 301081 271302 262788 262147 255099 247518 245394 251008 254062 264003 270267 277525 262959 254251 248863
12422 248863 244692 237724 215052 206733 205304 203879 186851 175361 174717 172907 182763 194086 178740
12409 178740 173239 186360 186780 185896 192711 203741 199661 205126 200393 200867 208413 214764 201895 196722
12395A96722K536J7860J313j8002o322j9404k3357j7999L074O197j031J1645J0162
12382A63394O540L081J1686K1270K6231K4566L068k1091l0879k2021N648J3100
12370B04593l688k1757n147J1832P817O938L635k0406j0020J5743K6230J7128
12358B32898m711j1821j4874o05N591l369N226j789j0122j5346M201O737J4554
12345B06570J3684K8062L1227M4321M7251K6535j7358j3841l2449m6462l6817
12334B50723j8333k485j5168l0696k6591N83K2573J1642J2253L751k705P116j194
12321B11469O641O504K2217J3226j1604r926l5262j8674j0307p666p028j0650
12309A48940m049p275J99K6332K4504K7469J7858q500k6410k5360l6981k0203
$$ plain form
12395 196722 199258 217118 218431 200429 194107 174703 151346 133347 136421 142618 141587 153232 163394
12382 163394 169934 173015 184701 205971 232202 256768 259836 238745 207866 185845 191493 204593
12370 204593 200905 179148 174001 185833 193650 200588 204223 183817 173797 189540 215770 232898
12358 232898 228187 216366 201492 200887 206478 203109 208335 206546 196424 181078 185279 192016 206570
12345 206570 220254 248316 279543 323864 371115 397650 380292 366451 334002 287540 250723
12334 250723 232390 229905 214737 184041 157450 158033 180606 192248 204501 208252 205547 212663 211469
12321 211469 218110 224614 246831 260057 248453 238527 203265 184591 174284 166618 159590 148940
12309 148940 144891 137616 137815 164147 188651 216120 233978 225478 199068 173708 136727 116524
12297A16524q786k367j3070j8417j2769p439J674N015o60r442j2275n834l373
12284B8781M340K088r790J6552J6537K722J7762M013M644O602j3590k8327k7686
12271B4648R363J8149r774R152J6142P132r2N145l195q635J211J261P742j1877
12257F6372j1317N751R473J6110J210o980K639p365K861O67q918P372r440q477
12243E9958m01l237l113m713p062r950O513J9803n670q005M67N820l571j0524
12229C6315n896R929O257M306l25m23M923j0645N908O323O858q143M578K775O627
12214F9367K138j5123m161R07n429k511J848j1781l49K586l462M774R787J9242
12200F7833J34R752m290M714k243l137j1390q150J0568n45j883k355R735R840
$$ plain form
12297 116524 107738 105371 92301 73884 61115 53676 55350 60365 59705 50263 37988 32154 28781
12284 28781 33121 35209 25419 41971 58508 61230 78992 83005 87649 94251 80661 52334 24648
12271 24648 34011 52160 42386 51538 67680 74812 74720 79865 76670 68035 69246 70507 78249 66372
12257 66372 55055 60806 70279 86389 87599 80619 83258 75893 78754 79421 70503 77875 68435 59958
12243 59958 59557 56320 53207 48494 41432 31482 37995 57798 52128 44123 44590 50410 46839 36315
12229 36315 30419 40348 46605 50911 50586 50163 55086 44441 50349 56672 63530 55387 59965 62740 69367
12214 69367 71505 56382 52221 53128 47699 45188 47036 35255 34906 37492 34030 38804 48591 67833
12200 67833 67967 77719 73429 78143 75900 72763 61373 53223 63791 63246 61363 59008 68743 78583
12186G8583O507l841N990N125n078O780m82o176l136o631m550j0324J198N755
12172F9720m549L37m247N958P746R521j23m409J5428J3795J2144O266J5788J3927
12158A57302J8040K5724J3943O614L2635M3179N3284P3147J08111J48998J75318
12147H56295J79574J76899J60479J19281M5194k9890p9624j34205j56109j84829
12137I53065j81755j58190j30538q7244o1771m6132l0890j5083l1637j3885j5288
12126A80652k1774j0376j6446k3038j2639o497k579Q044j4247j0013k801m38K191
12113G0039K676m882J760p648K589n856L945K5475n660j5083j0868R291N308j7330
12099E3756j2486K983K370j2061M418q64N43J2983J3662J3005K2987K949j7268
$$ plain form
12186 78583 85090 81249 87239 92364 87286 94066 93584 87408 84272 77641 73091 62767 63965 69720
12172 69720 65171 65508 61261 67219 74965 84486 84363 79954 95382 109177 121321 127587 143375 157302
12158 157302 175342 201066 215009 221623 254258 297437 350721 423868 531979 680977 856295
12147 856295 1035869 1212768 1373247 1492528 1537722 1507832 1428208 1294003 1137894 953065
12137 953065 771310 613120 482582 395338 333567 287435 256545 241462 209825 195940 180652
12126 180652 158878 148502 132056 109018 96379 89882 87303 95347 81100 71087 68286 67848 70039
12113 70039 72715 67833 69593 61945 64534 58678 62623 88098 82438 67355 56487 65778 71086 53756
12099 53756 41270 44253 46623 34562 38980 38116 38659 51642 65304 78309 101296 104245 86977
12086H6977j2754n072J324R092L449j444J4834J051j1852r979j0621p425m470
12073E3110R45k494K1551J5700K832k1523k7760P075J4895J4570K3002J1509N633
12060A19045L805N649M120j442j003J5011J2496K3760K7961R310j1405p840J159
12047B00626N343J1029K0865K7684L4316N7631M4592L8430M4679M1536N4306Q0712
12035F61749J16948J53717K10212K70865L59039N02987P40876J137661K002085
12026F156139L979110P316234J0543377J1392966L704899p057411j0985165r098008
12018A5952141n234537l069861j990570j357670r37909o54331m75196l44052k47125
12009A640890j92446j53267j17718j12440r7322p9075n8403l6350j7936k1752
$$ plain form
12086 86977 74223 69151 70475 79567 83016 81572 96406 97457 85605 75626 65005 57580 53110
12073 53110 54055 51561 73112 88812 91644 70121 42361 49436 64331 78901 101903 113412 119045
12060 119045 122850 128499 132619 131177 130174 145185 157681 181441 209402 218712 207307 199467 200626
12047 200626 205969 216998 237863 265547 299863 357494 402086 440516 485195 526731 581037 661749
12035 661749 778697 932414 1142626 1413491 1772530 2275517 3016393 4154054 6156139
12026 6156139 10135249 17451483 27994860 39387826 43092725 36035314 25050149 15952141
12018 15952141 10717604 7647743 5657173 4299503 3361594 2707263 2232067 1888015 1640890
12009 1640890 1448444 1295177 1177459 1065019 967697 888622 830219 793869 775933 754181
11999G54181J265K1526J1304p084q257M10L4J2558K2752J8309K7131L2762L9642
11986I26533L4547J4685m128k6039k6515l0919m0759n2494l9866l2422l9238k8971
11974F54414k5070k3548l6359l2877k9341j2369k8237k8885k4053p832k1474j8404
11962C65965p608J74J534K385k344K4438M1403L6510O2170O1749O1071O5031M7910
11949G60388K4041L718l0633n2157n6944n4542p0234p5549o1572m4654l2483k6482
11937B82897m3750l2007k5789r761m882q520r362p388k0427o339Q70P49j06p604
11923A08581j126j2009r758l116J955N330o697j6205l350J203r6J8264N317q963
11909G9330M446P541Q414J3285J608j6195k37K095M703j305j3216M519M552J156
$$ plain form
11999 754181 755446 776972 788276 781192 772935 773345 773379 785937 808689 826998 854129 886891 926533
11986 926533 961080 975765 971637 945598 919083 888164 847405 794911 755045 722623 683385 654414
11974 654414 629344 605796 569437 536560 507219 494850 466613 437728 413675 405843 384369 365965
11962 365965 358357 358531 360065 362450 360106 384544 425947 462457 524627 586376 647447 712478 760388
11949 760388 784429 788147 757514 705357 648413 593871 523637 448088 386516 341862 309379 282897
11937 282897 239147 207140 181351 171590 166708 158188 148826 141438 121011 114672 115542 116291 116185 108581
11923 108581 107455 95446 85688 82572 84527 89857 83160 66955 63605 64808 64712 82976 88293 79330
11909 79330 83776 91317 99731 113016 114624 98429 98192 100287 104990 103685 90469 94988 99540 100696
11895A00696k103j338O754J2026p07p656m321j1243O291J7200j644k556q821Q912
11881A11490Q15r381J689q393O981K2799M226k715j090m043J464L562k699j668
11867A23037R80l724P670L0000J5528M833N028O187k89q639P851R82p353J3944
11853A96035L759q87P951L837R7k386J0382m122q432j2223r000J2756J6533J165
11839B15465k700k429k824r967j855l803j343q133Q216P549J2348O812J1459M379
11825B33174j4095J1263R862M029J139P087J0079R824k751J0571J5861O106P21
11812C02870J577K806J0310P527Q72k192j798R361o0M196K1112J7610K6766J9910
11798D20867L375L137O494j0187p85l843j2788k0415j5362o406l252O781R539
$$ plain form
11895 100696 98593 97255 104009 116035 115328 107672 103351 92108 98399 115599 113955 111399 102578 111490
11881 111490 112305 102924 104613 96220 103201 126000 130226 127511 126421 122378 123842 127404 124705 123037
11867 123037 124017 120293 127963 157963 173491 178324 183352 189539 189250 180611 188462 189444 182091 196035
11853 196035 199794 198907 206858 210695 210792 208406 218788 214666 206234 194011 185011 197767 214300 215465
11839 215465 212765 210336 207512 197545 195690 191887 190544 182411 190627 198176 210524 217336 228795 233174
11825 233174 219079 230342 240204 244233 245372 252459 262538 272362 269611 280182 296043 302149 302870
11812 302870 304447 307253 317563 325090 325962 323770 321972 331333 331273 335469 356581 374191 400957 420867
11798 420867 424242 427379 433873 423686 422901 419058 406270 385855 370493 364087 360835 367616 377155
11785C77155O842J5783k961J4445J7865J6927p889M748N215J2064J6645J3250
11773D90089N860n281m576J4072Q267l503n202j796O697p212j2869L478j571j7199
11759D69254j0847n972j0287q272j0723j1812j3819j9563j7066p562l917j1927
11747C37487k883m112p557p855l346J845J5237K3770K6008J9861K9747L0355J5777
11734D74334J7759L7860M2623K4329K7742L93j1446j8926l2937k6425j7783k3097
11722D94426k0429o122l551J0387M814K981j5937j6614o166j0564j9177l0944
11710C83104p260j656o366l035J34k359O426m133l413J6023O731j164k964o736
11696C73332j5022p697R312n43q44R589J6901M705O73N631J706O611r838N411
$$ plain form
11785 377155 383997 399780 396819 411264 429129 446056 438167 442915 448130 460194 476839 490089
11773 490089 495949 490668 486092 500164 508431 504928 499726 497930 504627 497415 484546 488024 486453 469254
11759 469254 458407 452435 442148 433876 423153 411341 397522 377959 360893 353331 349414 337487
11747 337487 334604 330492 322935 315080 311734 313579 328816 352586 378594 398455 428202 458557 474334
11734 474334 492093 529953 572576 596905 624647 625040 613594 594668 561731 535306 517523 494426
11722 494426 473997 467875 464324 474711 479525 482506 466569 449955 443789 433225 414048 383104
11710 383104 375844 374188 367822 364787 364921 362562 368988 364855 361442 377465 384196 383032 380068 373332
11696 373332 358310 350613 359925 359382 358538 368127 385028 389733 390406 396037 397743 404354 394516 399927
11682C99927J7394K7741q996j44O570J0349l972k281n782J7549l202J4812K4763
11669D94728J0405P093J8547L2535J9918O446J5859J234N570O588N307K3641L3116
11656F80987J0843J8167K3986J9662K1706K7743K6611K5707J9724J6693K8021
11645I19850L6176L4921K6726L3270N6254M8926M4499N6747P0714P6356P4827
11634A479266R6473P8672Q0877J07296J13714J14863J12413J42555J47443J72981
11624B646553J84113K06308K29719K60643K84135L51866M33247N52583O49272
11615E798439P55618Q62802J003140J181033J405773J714857K104314K582859
11607A7408835L160376L867528M729605N803190P170127Q879150J0867089J2752846
$$ plain form
11682 399927 417321 445062 436066 435922 442492 452841 448869 446588 440806 458355 455153 469965 494728
11669 494728 505133 512226 530773 563308 583226 589672 605531 606765 612335 618923 624230 647871 680987
11656 680987 691830 709997 733983 753645 775351 803094 829705 855412 875136 891829 919850
11645 919850 956026 990947 1017673 1050943 1107197 1156123 1200622 1257369 1328083 1404439 1479266
11634 1479266 1575739 1654411 1735288 1842584 1956298 2071161 2183574 2326129 2473572 2646553
11624 2646553 2830666 3036974 3266693 3527336 3811471 4163337 4596584 5149167 5798439
11615 5798439 6554057 7416859 8419999 9601032 11006805 12721662 14825976 17408835
11607 17408835 20569211 24436739 29166344 34969534 42139661 51018811 61885900 74638746
11599G4638746J3779778J3012994R989731N326235K66229m020000o970191q542075
11591I7481447r017572q698674p889388o815396n563858m217446k863541j578870
11583E0836702m15332N72151J292812J799523K171116K561210L114885L865281
11575F5798348M762192N714679O497385P082781P405570P442505P292736P124334
11567A19120530P101065P120617O801559N636883L293476P3794l273344n841745
11559A40032835p104557p175661o535984n715568n121926m921542n133207n575759
11551I2748631n919140n961572n652628n130134m521722l924149l383737k922120
11543E5333429k570553k249005j894165j384420o79284K52579J387360K797167
$$ plain form
11599 74638746 88418524 101431518 111421249 116747484 117013713 112993713 106023522 97481447
11591 97481447 88463875 79765201 71875813 65060417 59496559 55279113 52415572 50836702
11583 50836702 50421370 50993521 52286333 54085856 56256972 58818182 61933067 65798348
11575 65798348 70560540 76275219 82772604 89855385 97260955 104703460 111996196 119120530
11567 119120530 126221595 133342212 140143771 145780654 149074130 149147924 145874580 140032835
11559 140032835 132928278 125752617 119216633 113501065 108379139 103457597 98324390 92748631
11551 92748631 86829491 80867919 75215291 70085157 65563435 61639286 58255549 55333429
11543 55333429 52762876 50513871 48619706 47235286 46556002 46808581 48195941 50993108
11535E0993108M558797O753018R361747J2083359J4449062J5892310J5749632
11528A29841033J3149900P417856r73476r856061j6457868j9248739j8611833
11521H5260812j6036479j2931923j0126849p843550o089140m782419l795227l032070
11513B0623155k447787k035011j721624j472575j279001j136031j047504r43248
11505H540374q25674p10651o19162n43036m69658m00641l41519k99111k95632
11496D035290k62186k33372k18244k09255j69098j49141j65262j51394j24500
11487B352838j16090j09824j02066q6396r0063q2755p6224o2735o1981o0262l8097
11476A466345n1881o0365m2220l8633l4615l8487l2346m1169m1692m6815l3789
$$ plain form
11535 50993108 55551905 62304923 71666670 83750029 98199091 114091401 129841033
11528 129841033 142990933 150408789 149435313 139579252 123121384 103872645 85260812
11521 85260812 69224333 56292410 46165561 38322011 32232871 27450452 23655225 20623155
11513 20623155 18175368 16140357 14418733 12946158 11667157 10531126 9483622 8540374
11505 8540374 7714700 7004049 6384887 5841851 5372193 4971552 4630033 4330922 4035290
11496 4035290 3773104 3539732 3321488 3112233 2943135 2793994 2628732 2477338 2352838
11487 2352838 2236748 2126924 2024858 1938462 1848399 1765644 1689420 1626685 1564704 1504442 1466345
11476 1466345 1414464 1354099 1311879 1273246 1238631 1200144 1167798 1126629 1084937 1038122 1004333
11465A004333l0351k6334k3510j8211o739j6589j5847q747j2890r585j7733k6483
11453G91314j8934r014L51j5477l0427j3762q479j4459j7142o484l930j4329J053
11440F40281j1307M166M891j8420j2892L013P030k09n49Q219j0705n568j666j3321
11426E92963q121j9755n3o14L550n070p498M290m687K471Q153P510R478j3149
11412E69468p562N439L503Q018K496j1453O540Q391J2806M638J8498o256m15j2492
11398F01619r438j1758q510k6191k1823k3814j8111j7861k2607j7865q951j2908
11386D01782j4503k673j923n380j2573l3565k1139j1276L777o045j711M38j3592
11373B81617j3528j198q355j0221n966k228N03j3313k317R724j065j0065l168
$$ plain form
11465 1004333 973982 947648 924138 905927 899188 882599 866752 858005 845115 835530 817797 791314
11453 791314 772380 763366 763717 748240 717813 704051 695572 681113 663971 657487 653557 639228 640281
11440 640281 628974 633140 638031 619611 606719 609732 616762 616553 616004 624223 613518 607950 606284 592963
11426 592963 584842 565087 565034 564420 567970 562900 555402 559692 555005 557476 565629 573139 582617 569468
11412 569468 561906 567345 570848 578866 581362 569909 576449 584840 597646 602284 620782 614526 614111 601619
11398 601619 592181 580423 571913 545722 523899 500085 481974 464113 441506 423641 414690 401782
11386 401782 387279 384606 382683 377303 364730 331165 310026 298750 302527 296482 294771 295209 281617
11373 281617 268089 266891 258536 248315 242349 240121 240624 227311 224994 234718 233653 223588 220420
11360B20420j743n347l283r144L548O268j0193k0684M243J1238m550n537P131
11347A92367j008o043k188J850j292j2280r695r802o382k6252q444O099J3177
11334A30107q604q539l6O02J6184J4958j888m858Q229o7L027O577r666P929r925
11319A44030m369q069j3566J599M926j610o994k296r2N050r41q342k366p72m844
11304A01344J5856j1604j1249k0412j162n14n999J4761N13J2215J1826j0485k2450
11291G2640n262M278P874L571J927j164K830p596J420J0618P346M055k836q048
11277I1653q165J0405L3105K8220L1252L3033M5964L0560M302M609k5043n5515
11265B24380o0284m5271k8009q666P637L73j1960r616L626K016L572j9513p526
$$ plain form
11360 220420 218677 213330 210047 200903 204451 210719 200526 179842 184085 195323 190773 185236 192367
11347 192367 191359 185316 183128 184978 183686 171406 161711 151909 145527 119275 110831 116930 130107
11334 130107 121503 112964 112928 113530 129714 144672 142784 137926 146155 146088 149115 155692 146026 153955 144030
11319 144030 139661 131592 118026 119625 124551 122941 115947 113651 113559 118609 117668 109326 106960 106188 101344
11304 101344 117200 105596 94347 73935 72773 72259 66260 81021 81534 93749 105575 95090 72640
11291 72640 67378 71656 79530 83101 85028 83864 86694 79098 80518 91136 98482 102537 99701 91653
11277 91653 83488 93893 126998 155218 186470 219503 265467 296027 300329 304938 279895 224380
11265 224380 164096 118825 90816 82150 89787 90160 78200 68584 72210 74226 77798 58285 50759
11252E0759M304M747o31o62J7125J2688L059j4903k0446k212k616J829M446q804
11238D8683j1741n05K734J840J050Q321L492j525k117o497r901k346m438p997
11224A9053L892L55J427Q205J0612k181l71K234o356m45J052q075M000K421L606
11209C9429L1343J1519n369q211l133J6135p044p019N054l956j0650k4110k048
11196C1940J5611K1221J8916J4696j1091q959L071m080j2020j69J0300M174J1841
11183I5451O015J3859J5946K1429J9703J4182K5767M2977L7786N3730P0069P6449
11171D93363P3249Q4764R1744Q8636L9348K615k3000l0892o8311q6313j01142
11160E64061r3384p0808l9734j2518j2041l0606m274J0189R782K3140J3496O316
$$ plain form
11252 50759 55063 59810 59179 58517 75642 88330 91389 76486 56040 53828 51212 53041 57487 48683
11238 48683 36942 36437 39171 41011 42061 50382 53874 52349 50232 43735 33834 31488 27050 19053
11224 19053 22945 23300 24727 32932 43544 41363 40992 43226 36870 36425 37477 29402 33402 35823 39429
11209 39429 70772 82291 76922 68711 65578 81713 74669 67650 72704 68748 58098 33988 31940
11196 31940 47551 68772 87688 102384 91293 82334 85405 81325 69305 69136 79436 83610 95451
11183 95451 101466 115325 131271 152700 172403 186585 212352 255329 293115 346845 416914 493363
11171 493363 566612 651376 743120 831756 871104 873719 850719 819827 751516 665203 564061
11160 564061 470677 399869 360135 347617 335576 304970 300696 310885 320667 343807 357303 363619
11148C63619J8864K9209K5995K1029L4699L7844K8062M3761M5597M1884M2058
11137G32621M4684M1682K6705J0108r376k6472l5150m3817m5995l5806k3061m4857
11125E91266l0685k9443l1037j4997j0670k6740k0205j9432k4190j7270j0443
11114C56154k8602k2189q680p329m354J3868K2354J8226J9227L5054N6903Q0374
11102E31006P7981P5992O2237M2244L359k7225o4316q2221r3691q9860q1557o4038
11090B89911m8874l1628j6133k7914k7616p709J3910j4430j0340l495j4202q841
11078I2639p411q663j3536k368r575j1124P714Q415p672J1475M965p813j1702
11065D5344o24p776j4318M738Q180r72r847M55j891q572p293N682N206R251K946
$$ plain form
11148 363619 382483 411692 437687 458716 493415 531259 559321 603082 648679 690563 732621
11137 732621 777305 818987 845692 855800 846424 819952 784802 740985 694990 659184 636123 591266
11125 591266 560581 531138 500101 485104 474434 447694 427489 408057 383867 366597 356154
11114 356154 327552 305363 296683 289354 285000 298868 321222 339448 358675 393729 450632 531006
11102 531006 608987 684979 747216 789460 792819 765594 701278 619057 525366 435506 353949 289911
11090 289911 241037 209409 193276 165362 137746 130037 143947 129517 119177 115682 101480 92639
11078 92639 85228 76565 63029 60661 51086 39962 47676 56091 48419 59894 64859 57046 45344
11065 45344 44720 36944 22626 27364 35544 34572 24725 25180 23289 14717 7424 13106 18312 27563 30509
11050C0509m335o958p48J5660R85J686O140L679o888P219j0431j4153m651j006
11036A6708N094J2517Q310j4899o571R5J7149j405n942or020o430J2756J1368
11022C9724m254k700j618p415j484J0978L959k817r40Q008q253p847K29J998R221
11007C6789j0606K997N474N279r77l583j0887q415r026N586r810j1457O611l976
10993f001N417K290L708M191J0578j013j4486P648N885k426J774Q197o324J4719
10979C4157M345n804p183J5386J9998P32k1081J438L144o366j5168j1835J0024
10966B1787n864j6723m707J3792K0467o660k176L792j7488N642j1389j0564J5920
10953E829Q390o918j1257j0237P788J6828J5575l556l011M053p239j693m303q07
$$ plain form
11050 30509 26174 19216 18468 34128 35113 36799 42939 46618 39730 46949 36518 22365 17714 16708
11036 16708 21802 34319 42629 27730 21159 21254 38403 36998 31056 31050 22030 15600 28356 39724
11022 39724 35470 32770 31152 23737 22253 33231 37190 34373 33433 41441 33188 25341 25570 27568 36789
11007 36789 26183 29180 34654 39933 38956 35373 24486 16071 7045 12631 2821 -8636 -2025 -6001
10993 -6001 -584 1706 5414 9605 20183 19170 4684 12332 18217 15791 17565 25762 19438 34157
10979 34157 38502 32698 25515 40901 60899 61631 40550 41988 45132 38766 23598 11763 21787
10966 21787 15923 -800 -5507 8285 28752 22092 19916 23708 6220 11862 473 -10091 5829
10953 5829 14219 7301 -3956 -14193 -6405 10423 25998 22442 19431 23484 16245 14552 10249 9442
10939I442L060k367P148k390N637R043l850j1091J962L607j5141J21k197M554
10925G538j087p128L223R691j4276q045L638J2009k526M284J8884k651q934p303
10911G317j9377Q094J2858l787R553N406k676l75q147n005L746j856r945j0030
10897a4224m235R213L592Q754l959j1982M734J9697O733j7950n785L919J5142
10884A3649O406m105o686P414R213l181j4019r147O363P265O108M445j206m354
10870A8165L708M651r706o498k173q324j637M03q069K441q10K226J2201m684j1798
10855i904J649P564J0067P118O611K513j5p401j811q056r307k187Q454P477P517
10840B0289L701r530j0673j504O509N45J061m90j7490q097R33P128M820j1389
$$ plain form
10939 9442 12502 10135 17283 14893 20530 29573 25723 14632 16594 20201 5060 5181 2984 7538
10925 7538 6451 -677 2546 12237 -2039 -10084 -6446 5563 3037 7321 26205 23554 14620 7317
10911 7317 -12060 -3966 8892 5105 14658 20064 17388 17013 8866 3861 7607 5751 -4194 -14224
10897 -14224 -18459 -9246 -5654 3100 -859 -12841 -8107 11590 18323 373 -5412 -1493 13649
10884 13649 20055 15950 9264 16678 25891 22710 8691 -456 5907 13172 19280 23725 22519 18165
10870 18165 21873 26524 16818 10320 8147 -177 -1814 -1411 -9480 -7039 -7849 -5623 6578 1894 -9904
10855 -9904 -8255 -691 9376 16494 23105 25618 25603 18202 16391 8335 -972 -3159 5295 12772 20289
10840 20289 23990 14460 3787 2283 8792 9337 10398 9908 -7582 -15679 -14746 -7618 -2798 -14187
10826a4187J364Q272J9479J8919P856K524q288j6056k309K993O765o701j4930
10813E701k877K053q242R398j972n33L913j046o533M270N451J0324j810l917M082
10798A8262p842j2773j5755J0013k332J249J0688Q226k637J562q86o310M866M827
10784A1158l13N073N423J823j0966p313j667K45P754o43Q41J4435k995p564j6977
10769a686q505M988J5867P804n951j1334J302Q893k199J094R524R161l011j931
10755B4016K186j528j976r890M429N113n242N86l300N824J1173k0947q166Q168
10741A0446J0010K609j0440L527O419p521p719R792P631N884l341J2545J6042
10728E5884J1666p60k4353j1839k2003p787M875K363n182o978l32l485j054R664
$$ plain form
10826 -14187 -12823 -4551 14928 33847 41703 44227 35939 19883 17574 20567 27332 20631 5701
10813 5701 2824 4877 -3365 6033 4061 3528 7441 6395 -138 4132 9583 19907 18097 14180 18262
10798 18262 10420 -2353 -18108 -8095 -10427 -9178 1510 9736 7099 8661 7775 1465 6331 11158
10784 11158 10845 15918 21341 23164 12198 4885 3218 3463 11217 10574 11415 25850 22855 15291 -1686
10769 -1686 -10191 -5203 10664 18468 12517 1183 2485 11378 9179 10273 19797 28958 25947 24016
10755 24016 26202 24674 22698 12808 17237 22350 17108 17694 14394 20218 31391 10444 2278 10446
10741 10446 20456 23065 12625 16152 22571 15050 7331 17123 24754 30638 27297 39842 55884
10728 55884 67550 66790 42437 30598 8595 808 5683 8046 2864 -4114 -4446 -7931 -8985 679
10714F79K3726J4475k4m083r580j9452q770M737P2R2R488q079j842J3734q111
10699G062k362J4149j503j244j0994N063R728J2621J278K206m434J965q073j2708
10685A2754M071J3651m49j1792N411P84j7881k344J535j4234K037Q968j391M340
10671E460J1323K86j0261l416J2189P420l831K070l092j4347o475J3807J0588
10658B1721n365j058n190J1399o668P866j46J142n814q859j4018m290J3917J1379
10644A6016L341l842P959j1485n419N812O859j859o374J1390K950m387n084m654
10630A1223J239P7N185R981r650L46j869O985R691O33o536m907l882M113R670
10615C2299j132m466p662m210J630j560N823j553j92P796J2673r270j762j4305
$$ plain form
10714 679 24405 38880 38856 34773 25193 5741 -3029 1708 1780 1872 11360 3281 1439 15173 7062
10699 7062 4700 18849 17346 16102 5108 10171 19899 32520 33798 36004 31570 33535 25462 12754
10685 12754 16825 30476 30027 18235 23646 24430 6549 4205 5740 -8494 -6457 2511 1120 5460
10671 5460 16783 17069 6808 3392 15581 23001 19170 21240 18148 3801 -2674 11133 21721
10658 21721 16356 15298 10108 21507 14839 22705 22559 23701 17887 9028 -4990 -9280 4637 16016
10644 16016 19357 15515 23474 11989 6570 12382 19241 17382 11008 22398 25348 20961 15877 11223
10630 11223 12462 12539 17724 27705 18055 18401 16532 23517 33208 33841 27305 22398 18516 22629 32299
10615 32299 31167 26701 19039 14829 16459 14899 20722 19169 18977 26773 39446 30176 28414 14109
10601A4109q555j2863p050P592J7005K914J842J5009o502j4941k252q492K004
10588a80N651o678p952N05j72L594R025P545O997q623l221R39R617J4292j2670
10573A8669J47Q218j681r571r456j863J1739L273j0033K484N299N593j5739P54
10559G833R306R81l17K909O948J6289J2986P4K154k904l894J1525L176k4626l6455
10544E985j4185P883M905j1939j572J2438P131K051O858j244o951p071k088K606
10530D807N327J0217n349j963K0551K005r896L48Q973R13N118o280m920q838n408
10515A5605j2848p866j858P949k44q172J2474L98p861O178l007L801R669J6269
10501C0487j1506j2587M576J5935j577l044j202j1975k711J253L450j1160J7562
$$ plain form
10601 14109 5554 -7309 -14359 -6767 10238 13152 14994 30003 23501 8560 6308 -2184 -180
10588 -180 5471 -1207 -9159 -8654 -8826 -5232 3793 11338 18335 9712 6491 7430 17047 31339 18669
10573 18669 18816 27034 25353 15782 6326 4463 16202 19475 9442 11926 17225 22818 7079 7833
10559 7833 17139 18120 17803 20712 27660 43949 56935 57009 59163 56259 52365 63890 67066 42440 5985
10544 5985 -8200 -317 4588 -7351 -8923 3515 10646 12697 19555 18311 11360 4289 2201 4807
10530 4807 10134 20351 15002 13039 33590 35595 25699 26047 35020 35933 41051 34771 29851 21013 15605
10515 15605 2757 -5109 -6967 982 738 -7434 5040 5438 -2423 3755 748 4549 14218 30487
10501 30487 18981 6394 10970 26905 25328 22284 21082 9107 6396 7649 11099 -61 17501
10488A7501K465K4087J0529n661k671j0149J432p2l178p103j0694n17O208L382
10474B5559k836j3033n197K553N160K696N884J1147N252q764j088O146J11J5613
10460D9203k35k535m095m287r683r70J1186J956r950j6n12n438K738m88R778M804
10444D1456o896L213Q470O72j2989j894l971m315l67j866j0564j955O239N489
10430B0722P166l265q318o020n055K153O412J3404O463j674p006N708M857O930
10416D2477j99M367J369j2290r770J843o73m053j0842l802J0951P723n271Q100
10402B9930N392m169m211Q826j2647j3659N008N209K651K355p54j8455n439K2606
10388B2643K09N503L762m908j436k524Q110k277L664q242r52J2868m16R291P931
$$ plain form
10488 17501 19966 44053 54582 48921 46250 36101 37533 37461 34283 27180 16486 15969 22177 25559
10474 25559 22723 9690 4493 7046 12206 14902 20786 31933 37185 28421 27333 33479 33590 49203
10460 49203 48968 46433 42338 38051 28368 27398 38584 40540 30590 30574 30062 24624 27362 26874 36652 41456
10444 41456 34560 37773 46243 46915 33926 32032 28061 23746 23379 21513 10949 8994 15233 20722
10430 20722 27888 24623 16305 10285 5230 7383 13795 27199 33662 31988 24982 30690 35547 42477
10416 42477 42278 46645 48014 35724 25954 27797 27124 23071 12229 8427 19378 27101 21830 29930
10402 29930 35322 31153 26942 35768 23121 9462 14470 19679 22330 24685 23931 5476 37 22643
10388 22643 22852 28355 32117 27209 25773 23249 31359 29082 32746 24504 23552 36420 36004 45295 53226
10373E3226o856j1673p632m663J2441R102L194r219l81J6473O284J960r383P10
10359E3583j0038N52k235o525l990N084J223o499J928k965L817O39r819K236O887
10344C3878J8549L50r933L137l477l280M070R473N38N555j028o596j385r686m434
10329C5731N440M206l796j7590j2885J7241M56j0628K200K0991M11l451K95L547
10315D2168Q548m840m99j788l79Q664L732l39r127j8170o362J1426O960K072m542
10300C7524R600J2280q105L928n015N126L108j0161m608J0021P630n067l084n986
10286D7191M88m396J369j025L664l208r902p538o180N659J0680J0948Q343j2291
10272D3802j6839M735J146n679r780J1620R438J347O100j1509J5402J5470o306
$$ plain form
10373 53226 46370 34697 27065 22402 34843 43945 47139 37920 37539 54012 60296 62256 52873 53583
10359 53583 43545 44097 41862 35337 31347 36431 37654 31155 33083 30118 33935 34574 24755 26991 33878
10344 33878 52427 52777 42844 45981 42504 39224 43294 52767 53305 58860 57832 51236 49851 40165 35731
10329 35731 41171 45377 41581 23991 11106 28347 28803 18175 20375 41366 41777 38326 38621 42168
10315 42168 50716 45876 45377 43589 43210 51874 55606 55267 46140 27970 21608 33034 39994 42066 37524
10300 37524 47124 59404 51299 55227 50212 55338 58446 48285 43677 53698 61328 56261 53177 47191
10286 47191 47679 43283 44652 43627 47291 44083 34181 26643 20463 26122 36802 47750 56093 43802
10272 43802 26963 31698 32844 27165 17385 29005 38443 39790 45890 34381 49783 65253 58947
10259E8947L10o414k1169o824R559J3853o737j3686R217Q992p16Q870j2165m558
10245C7479R185m607q706O469O590m36o648J5257K797k2939j1313l983M009J5727
10231C8881Q473j9045o811O323K410O379J4429l187j3887k652Q963J025n064L827
10217D0064q933J1166L459O575J844k345O253r661j1522R593n053k702J874q76
10203C9736j2272j685j533J2405O360K761L568N508n329J387L400K921j3537k3001
10189B0689j8632Q602J1703J846J3007M900j9040o675Q463K0076k476N259L533
10176E1255P7r308j5813Q096J4277r306r143R13P942J6012n414j3804q498O838
10162C4124L877N709M654k1156Q682J3684q85R089o896K984j3566j5063R665K385
$$ plain form
10259 58947 59257 52843 31674 24850 34409 48262 41525 27839 37056 46048 45332 54202 42037 37479
10245 37479 46664 42057 33351 39820 46410 45974 39326 54583 57380 34441 23128 19145 23154 38881
10231 38881 47354 28309 21498 27821 30231 36610 51039 47852 33965 31313 40276 41301 36237 40064
10217 40064 31131 42297 45756 52331 54175 51830 58083 48422 36900 46493 41440 38738 40612 39736
10203 39736 27464 25779 24246 36651 43011 45772 49340 54848 49519 50906 54306 57227 43690 20689
10189 20689 2057 10659 22362 24208 37215 42115 23075 16400 24863 44939 42463 47722 51255
10176 51255 51332 42024 26211 34307 48584 39278 30135 31048 38990 55002 49588 35784 27286 34124
10162 34124 38001 43710 48364 27208 35890 49574 48689 57778 50882 53866 40300 25237 34902 37287
10148C7287J5744J960j0385m226r945l198Q84J0958J0398j4059j3474o834q932
10135F178M167O092J0609l722r184O790L415K043J6018N007j5662j7033N608J6391
10121C6717J6460j2608K633j604O151L50k31J3873l366j0865n566k277j0951R043
10107C7759J9165Q771l538P488p497n326p110j0185j1822n575k978P96J0507j782
10093B8673R699m91K199k691o347m857J1998J2780L889O05J5526N618J1713J3986
10079A02300j1899l521J827o676j0332P4n189j4251M4R60l93j0522r174P63J1606
10064D5617o03L825j994N503J5852J6308P966p188K01L89R636J4430O954n21O631
10049A23006J5603J3693J9520M0562N4549R4107J37415K84204N00932O78666O59885
$$ plain form
10148 37287 53031 54991 44606 40380 30435 27237 28121 39079 49477 35418 21944 15110 6178
10135 6178 10345 16437 27046 23324 14140 20930 24345 26388 42406 47413 31751 14718 20326 36717
10121 36717 53177 40569 43202 41598 47749 48099 47868 61741 58375 47510 41944 39667 28716 37759
10107 37759 56924 65695 62157 69645 62148 56822 49712 39527 27705 22130 19152 19948 30455 28673
10093 28673 38372 37881 40080 37389 31042 26185 38183 50963 54852 55457 70983 76601 88314 102300
10079 102300 90401 86880 88707 82031 71699 71773 66584 52333 52377 53337 52944 42422 33248 34011 45617
10064 45617 45014 48839 46845 52348 68200 84508 92474 85286 85487 85876 95512 109942 116896 116375 123006
10049 123006 138609 152302 171822 212384 266933 361040 498455 782659 1283591 1962257 2622142
10038B622142L3783m91694o82644n42743l00252j82815j16086p5426m7588l2027
10028A84650k5974j7192m31r099j1232n498j5469M026L658m699j5574R39J7500
10015A05605Q948l62q434j2663j7740p954R43q33j1208m073P305O900J324n758
10001F2000j9909R628k151L876J1767M877n602Q186O786J0976j2622K4N785J167
9987H4788K57o599j9305J2340J2616L115m582p220O892r200k613M495o596j6008
9973E2380N823j587J1965M282l693p701J5550M145j3993j1293n001J946k698o063
9959D4062P004J1227K361K987K542P575K068p355r705J1884J3025O607L318p048
9945I0552m126M335P074R508M38Q671m590K43p942p710j601J0953j867l65m081
$$ plain form
10038 2622142 2655925 2164231 1481587 938844 638592 455777 339691 264265 216677 184650
10028 184650 158676 141484 141053 131954 120722 115224 99755 103781 107439 102740 87166 88105 105605
10015 105605 114553 114191 105757 93094 75354 67400 68343 67510 56302 52229 59534 66434 67758 62000
10001 62000 42091 51719 49568 53444 65211 70088 64486 72672 79458 90434 77812 77836 83621 84788
9987 84788 85045 78446 59141 71481 84097 87212 82630 75410 82302 73102 70489 74984 68388 52380
9973 52380 58203 56616 68581 72863 69170 61469 77019 81164 67171 55878 50877 52823 50125 44062
9959 44062 51066 62293 64654 67641 70183 77758 79826 72471 62766 74650 87675 94282 97600 90552
9945 90552 86426 90761 97835 107343 107781 116452 111862 112105 104163 96453 94852 105805 103938 103573 99492
9930I9492q678n617N651R832J5369M583j0424p257Q431N460p260m259J1164P317
9916A23804R115O503J3689o733q055R170J7168k237M330l645Q087J1898J3505
9903A96599J3151R846K0919J5843K2158K4880L1940K4943K8870K1774J9352L3489
9891D63764M8990N8021Q3993O7219N9841O1743N5070O3124N9695N6814K5837Q231
9879A112342k663k1020k1649l9204m3410n4369n7136m7306m1562n2760p0856o0481
9867E99926n4413m8143n0468m0237k3464k4261k8179k0798n089k0514j0647j2138
9855B61575l5692k9508j7509m574M806m974j5693K431n421L293m399m204N885
9842A56016J6196K167j7459j6532J603Q334J200o858j1004J3677N409j2589L296
$$ plain form
9930 99492 90814 85197 90848 100680 116049 120632 110208 102951 111382 116842 109582 105323 116487 123804
9916 123804 132919 139422 153111 146378 138323 147493 164661 162424 166754 163109 171196 183094 196599
9903 196599 209750 219596 240515 256358 278516 303396 335336 360279 389149 410923 430275 463764
9891 463764 512754 570775 654768 721987 781828 843571 898641 961765 1021460 1078274 1104111 1112342
9879 1112342 1109679 1088659 1067010 1027806 984396 930027 872891 825585 784023 731263 660407 599926
9867 599926 545513 497370 446902 406665 383201 358940 330761 309963 304874 284360 273713 261575
9855 261575 225883 196375 178866 174292 179098 174124 158431 160862 155441 158734 154335 150131 156016
9842 156016 172212 174379 156920 140388 141991 150325 151525 144667 133663 147340 152749 140160 143456
9829A43456p658j7452j394L852q637m476j0586M092K45n531N020R989l610M142
9815A11452N211J2604l978m742o617K279J6705Q99j7241o74J9614M053m31J2681
9801A51815J098r676p606P743k643j3777j1784P892J3223J0028Q027J9014K5691
9788A99045R585K1703K8051K1577L5706P149j1280q559k9320l3710j6699j1017
9776B12231k463p641k3542k028Q009l022J4308K0895J0950J4147M292J4930J7816
9763B78882J955J2148K1774J2146J5890K0818J8661J9732K5436N122J1752L0705
9751D75021K3616J0178J6284L8003K4993K5971N0622M5537N7057P2109P1008M3548
9739I53947j3622p3854j00837q6111n9027m2217l9421l5646j6947o877p815j6784
$$ plain form
9829 143456 135798 118346 116952 120804 112167 107691 97105 101197 101442 95911 100931 110920 107310 111452
9815 111452 116663 129267 125289 120547 113930 116209 132914 133813 116572 115898 135512 139565 139134 151815
9801 151815 152913 143237 135631 143374 140731 126954 115170 123062 136285 146313 154340 173354 199045
9788 199045 208630 230333 258384 279961 315667 322816 311536 302977 273657 239947 223248 212231
9776 212231 209768 202127 178585 176557 184566 181544 195852 216747 227697 241844 246136 261066 278882
9763 278882 280837 292985 314759 326905 342795 363613 382274 402006 427442 432564 444316 475021
9751 475021 498637 508815 525099 563102 588095 614066 664688 710225 767282 839391 910399 953947
9739 953947 940325 866471 765634 679523 620496 578279 538858 503212 486265 479388 471573 454789
9727D54789k0853P391j812P363k894P846O87J7336L5318M8227M9320M6908M9538
9714F99164N0844L7716M3682J8631j5116l3472m1216l9315k5811k4836l2360n436
9702F32475J4986Q537n553k0309j6712k3864k2349j9051k3014j999J616k0261
9690E04502j3430o792R582K6253P666J8934J6814j230J5387K0844J2306K1011
9678F31847J6670J0814O308K0147P143m808q749j9640j6130j2574k171R058O307
9665F44222N95N182K0244L9598M2389M1737L9151M7222N0547P1834Q5559R2892
9653A181172R8440J01785O7462M7315K6217m311j7304m5465o6369p7126p4222
9642A237594q2109q5235p6245p1622n6633o6122o0594p3517p4381m6923m2381
$$ plain form
9727 454789 433936 441327 439515 446878 443984 451830 452517 469853 505171 553398 602718 649626 699164
9714 699164 750008 787724 831406 850037 834921 801449 760233 720918 695107 670271 637911 632475
9702 632475 647461 655998 650445 630136 613424 589560 567211 548160 525146 523147 524763 504502
9690 504502 491072 484280 493862 520115 527781 546715 563529 562299 577686 598530 610836 631847
9678 631847 648517 659331 665639 685786 692929 688121 679372 659732 643602 631028 628857 637915 644222
9665 644222 644817 649999 670243 709841 752230 793967 833118 880340 930887 1002721 1088280 1181172
9653 1181172 1279612 1381397 1448859 1496174 1522391 1518080 1500776 1455311 1388942 1311816 1237594
9642 1237594 1155485 1070250 994005 922383 865750 799628 739034 665517 591136 544213 501832
9631E01832m2208k0954j8507l5289k0405j8865k0264j9081j250J856m704p341
9619B94820j1658m824l75K710M212K704j800N110O424j1017j7502q220Q966K261
9605B71811J117l118K107r040L642j93K609M840O594j959n242J4249j6679l728
9591B67010J8924J032o385L029Q286K861J180k541Q622k699J06o806J529J9342
9577C13490p080M904q0m314J002n127N176J1287l341N949J2296J3945J6483L910
9563C68500j0442j8543n882k837j1319j164K978m842p743J6329M812o099J6077
9550C39825L522L872J4624J4801P021J2408R86m106O580J444o783q4n10j0335
9536C83265O668K3727L298J241N277l82L073J6323J3199j0547j5358J0355O194
$$ plain form
9631 501832 459624 438670 420163 384874 364469 345604 325340 306259 305009 306865 302161 294820
9619 294820 283162 278338 277963 280673 284885 287589 285789 290899 297323 286306 268804 260584 269550 271811
9605 271811 272928 269810 271917 262877 266519 266326 268935 273775 280369 278410 273168 287417 270738 267010
9591 267010 285934 286966 280581 283610 291896 294757 295937 293396 302018 299319 299425 292619 294148 313490
9577 313490 306410 311314 311234 306920 307922 302795 307971 319258 315917 321866 334162 348107 364590 368500
9563 368500 358058 339515 333633 330796 319477 318313 321291 316449 308706 325035 329847 323748 339825
9550 339825 343347 347219 361843 376644 383665 396073 397059 392953 399533 400977 394194 394110 393600 383265
9536 383265 389933 413660 416958 418199 423476 423094 426167 442490 455689 445142 429784 440139 446333
9523D46333l823L771J0958K0208K2108J8261J6924j97K3439J0541N896r99l477
9510E69943l104M234p987j0362q926m4n424k263R376J5327Q917p779J0313K3372
9496E95593J8568M330k2214j6472M70k052M201j4011j5099j2358k060L609R321
9483E51826J3461J5907O834O977m696O514K3551J4968J7695J3002K1833L3765
9471G21637K0998O268J8620R07Q655K1377N590P295o636j5489j1760k3803r718
9458G43941j8244l0651q267L865j0212l684J560J2061k785p65l955r963J5981
9445F88882L3293N292j932J2891K6258K8252K5856J9290J8709M5090L3914K9789
9433I65584J7368J6052N375j3797j2008j4917k0452j1378j6418K131J7271L7118
$$ plain form
9523 446333 442510 446281 457239 477447 499555 517816 534740 534543 557982 568523 574419 573420 569943
9510 569943 566839 571073 563086 552724 543798 543754 538330 536067 545443 560770 569687 561908 572221 595593
9496 595593 614161 618491 596277 579805 580275 578223 582424 568413 553314 540956 538896 542505 551826
9483 551826 565287 581194 588028 595005 590309 596823 620374 635342 653037 666039 687872 721637
9471 721637 742635 748903 767523 768430 777085 798462 804052 811347 804711 789222 777462 753659 743941
9458 743941 725697 695046 686779 690644 680432 676748 678308 690369 687584 686819 682864 672901 688882
9445 688882 722175 727467 725535 738426 764684 792936 818792 838082 856791 901881 935795 965584
9433 965584 982952 999004 1004379 990582 978574 963657 943205 931827 915409 917540 934811 971929
9421I71929K7941K6739J8188N530K5433K8864M0335L1521M1307L8515M9678P8082
9409A384062Q6596J03146J06136J31247J56797J93681K38782K88722L40422M07280
9399C436871N41182P05989Q59152R65383J041521J146558J292498J552684J850919
9390A3392757K105775K263557K308457K131322J683651R08342q1886j024180j723748
9381B1964047k034075j977567j689867j337514j002502o74297k78756J35463N38693
9372A3643625Q74061J111694J254418J298804J311967J377214J520288J722117
9364B4114188J975951K206746K407311K575516K716475K756347K755812K772550
9356D4280896K759489K614227K344169K065008J792819J520154J128636N29554
$$ plain form
9421 971929 999870 1026609 1044797 1050327 1075760 1104624 1144959 1176480 1217787 1256302 1305980 1384062
9409 1384062 1470658 1573804 1679940 1811187 1967984 2161665 2400447 2689169 3029591 3436871
9399 3436871 3978053 4684042 5543194 6508577 7550098 8696656 9989154 11541838 13392757
9390 13392757 15498532 17762089 20070546 22201868 23885519 24793861 24711975 23687795 21964047
9381 21964047 19929972 17952405 16262538 14925024 13922522 13248225 12969469 13104932 13643625
9372 13643625 14517686 15629380 16883798 18182602 19494569 20871783 22392071 24114188
9364 24114188 26090139 28296885 30704196 33279712 35996187 38752534 41508346 44280896
9356 44280896 47040385 49654612 51998781 54063789 55856608 57376762 58505398 59034952
9348E9034952j64389p79043j216494j461086j468746j204081p90672m25137k30210
9339E1295094j42135j3490J92391M20981N26434M56481L71005M23820O70892R64240
9329E5165713J150494J161488J068255J114967J382352J809634K440801L282173
9321F8575877M322395N299438N956157O132143N832717N089367L848187J976280
9313A07032561l64058k698024m515503n609005o107213o265813o124922n541784
9305F9806239m506208l150277j743457m66803N97473J366087J704429J507591
9297F5115074Q83837Q1985m95617o05329l18522J09365M55208O80060P97878R74303
9287F7678242J309946J811916K370259K804180K948554K599613J659962L08756
$$ plain form
9348 59034952 58870563 58091520 56875026 55413940 53945194 52741113 51950441 51525304 51295094
9339 51295094 51152959 51139469 51331860 51752841 52279275 52735756 53106761 53530581 54201473 55165713
9329 55165713 56316207 57477695 58545950 59660917 61043269 62852903 65293704 68575877
9321 68575877 72898272 78197710 84153867 90286010 96118727 101208094 105056281 107032561
9313 107032561 106668503 103970479 99454976 93845971 87738758 81472945 75348023 69806239
9305 69806239 65300031 62149754 60406297 59939494 60536967 61903054 63607483 65115074
9297 65115074 65998911 66080896 65585279 64979950 64661428 64770793 65226001 65906061 66703939 67678242
9287 67678242 68988188 70800104 73170363 75974543 78923097 81522710 83182672 83491428
9279H3491428j239481k797100m142065m967952n113953m632047l713914k586857
9271E4298059j435421n23258m8581o8709m84098j086372j653549k086719k371172
9262D4540180k522930k546118k401316k096389j718455j345112r39362m59241
9254C0511257R6226O84798J131980J313848J262118J053512Q92864Q44564Q44178
9245C8635345O21166o4786j071165k133572k927569l326508l269380k849779k301218
9236B1312534j706218j166036p82974o05831o01031o76758q05382r93168j169432
9227A2805704j259067j264673j167072j011886q43861o69316n25428m08878l29273
9218E326250k61878k06327j45699j03282p6379n2176m4237r0202j86392k36770
$$ plain form
9279 83491428 82251947 79454847 75312782 70344830 65230877 60598830 56884916 54298059
9271 54298059 52862638 52339380 52290799 52222090 51737992 50651620 48998071 46911352 44540180
9262 44540180 42017250 39471132 37069816 34973427 33254972 31909860 30970498 30511257
9254 30511257 30607483 31292281 32424261 33738109 35000227 36053739 36946603 37791167 38635345
9245 38635345 39256511 39191725 38120560 35986988 33059419 29732911 26463531 23613752 21312534
9236 21312534 19606316 18440280 17657306 17051475 16450444 15773686 14968304 13975136 12805704
9227 12805704 11546637 10281964 9114892 8103006 7259145 6589829 6064401 5655523 5326250
9218 5326250 5064372 4858045 4712346 4609064 4532685 4480509 4436272 4346070 4159678 3922908
9208C922908k21439k11074j63620j10262n1705j6267J6153L4921L4581M7764N4997
9197C336957P0694J11443J36423J27451P4841Q440m7640p5172p9395o4037m9425
9186C550580O91M3765J04792J56700K11286K63088L44785M04525M88821O19867
9176F188900P37562Q11158Q43243Q27765P62345O38226M58242K30179L1712p8304
9166A1451028p4581M1062K20836M31748O44703Q20530R18255J001101J046018
9157A6500700J092881J231029J512343J944228K203138K045319J405025L75519
9149B8310182p09983j516417j849314j727542j266494o73989o7251M60425Q20873
9140B1780490J011482J073362J013170Q05486M89328J89395j426j34386k36027
$$ plain form
9208 3922908 3701469 3490395 3326775 3216513 3164808 3148541 3164694 3199615 3234196 3281960 3336957
9197 3336957 3407651 3519094 3655517 3782968 3857809 3866249 3818609 3743437 3664042 3600005 3550580
9186 3550580 3551271 3595036 3699828 3856528 4067814 4330902 4675687 5080212 5569033 6188900
9176 6188900 6926462 7737620 8580863 9408628 10170973 10809199 11267441 11497620 11529332 11451028
9166 11451028 11376447 11417509 11638345 12070093 12714796 13535326 14453581 15454682 16500700
9157 16500700 17593581 18824610 20336953 22281181 24484319 26529638 27934663 28310182
9149 28310182 27600199 26083782 24234468 22506926 21240432 20566443 20499192 20959617 21780490
9140 21780490 22791972 23865334 24878504 25683990 26173318 26362713 26361287 26226901 25990874
9131B5990874k82018k09912M107L03506O73013J091999J506185J902506K315449
9122C3295709K681357K871947K678568K075729J267707N64779J38978P3087J85672
9113D5833533K76749J71933j62917p17065j256752j551471j645856j704301j797123
9104C7446730j855693j809644j710326j591393j421141j185045q63850m69619
9096B6540019o8660L44630P57813J187154J686993K309595L018274L623723L903861
9087D3303402L623084K746997J509333K67845p18487j325721j606816j600074
9079D6199563j486759j405992j291557j120833r19600p57781o97751p69065r30282
9070C6819943j052420r79962o64833j60784L63529O62328N86266J26019m63920
$$ plain form
9131 25990874 25708856 25498944 25503051 25806557 26479570 27571569 29077754 30980260 33295709
9122 33295709 35977066 38849013 41527581 43603310 44871017 45435796 45574774 45647861 45833533
9113 45833533 46110282 46282215 46119298 45402233 44145481 42594010 40948154 39243853 37446730
9104 37446730 35591037 33781393 32071067 30479674 29058533 27873488 27009638 26540019
9096 26540019 26471359 26815989 27573802 28760956 30447949 32757544 35775818 39399541 43303402
9087 43303402 46926486 49673483 51182816 51450661 50732174 49406453 47799637 46199563
9079 46199563 44712804 43306812 42015255 40894422 39974822 39217041 38519290 37750225 36819943
9070 36819943 35767523 34787561 34122728 33961944 34325473 34987801 35574067 35700086 35236166
9061C5236166q58855r23643o14788n6270O44724J415303K179870K831102L316069
9052D3169678L564200L598468L575386L629728M022256M888646O222658Q017224
9044H0688244J0143391J2586994J5312912J8212038K0979936K2884696K2902864
9037B03711075K0053394J3865721M913798n054858j3911548k0086232k3002090
9030A80489260k3129412k1463265j8967388j6290384j3741554j1483658r544904
9023F5868695p898089o489322n317783m281750l330139k501481j904938j721566
9015C2423627j967205k392437k593435k456806k070134j611873j166388p51378
9007A7413971l86935j22378j23336m06057q31559j230781j414421j348033j153225
$$ plain form
9061 35236166 34377311 33453668 32838880 32782610 33427334 34842637 37022507 39853609 43169678
9052 43169678 46733878 50332346 53907732 57537460 61559716 66448362 72671020 80688244
9044 80688244 90831635 103418629 118731541 136943579 157923515 180808211 203711075
9037 203711075 223764469 237630190 242543988 237489130 223577582 203491350 180489260
9030 180489260 157359848 135896583 116929195 100638811 86897257 75413599 65868695
9023 65868695 57970606 51481284 46163501 41881751 38551612 36050131 34145193 32423627
9015 32423627 30456422 28063985 25470550 23013744 20943610 19331737 18165349 17413971
9007 17413971 17027036 16904658 16781322 16375265 15543706 14312925 12898504 11550471 10397246
8998A0397246r38644p49568o10750n18887m66590l89592l42120l19036k91299
8989E770760k56552k32372k12853k05846k04582j88944j74779j67144j63200j43902
8979C820586j21921j26696j20919j10114j08996r7284q1316p8916p6223p1067
8969B827134n1969n0152m8490p2541p8496p3871o7580n7992n4408m0378m5803
8958B185454m2904l6884k7096k9489k3292l6604m6198l6168j5853k7261l1171
8947A832534j7021j5089q882j4639j1533O85r308L733M347K684k0149n910j1569
8934A729883k8996j2447k6871k9681m6693l5333l4582l3613k5143j8047j3593
8923A424884p402K969r686k8604l3545k3086k1413j2096j2425j3991n114J0794
$$ plain form
8998 10397246 9458602 8709034 8098284 7579397 7112807 6723215 6381095 6062059 5770760
8989 5770760 5514208 5281836 5068983 4863137 4658555 4469611 4294832 4127688 3964488 3820586
8979 3820586 3698665 3571969 3451050 3340936 3231940 3134656 3053340 2974424 2898201 2827134
8969 2827134 2775165 2725013 2676523 2603982 2525486 2451615 2384035 2326043 2271635 2231257 2185454
8958 2185454 2142550 2105666 2078570 2049081 2025789 1989185 1942987 1906819 1890966 1863705 1832534
8947 1832534 1815513 1800424 1791542 1776903 1765370 1766055 1756747 1760480 1764827 1767511 1747362 1741452 1729883
8934 1729883 1700887 1688440 1661569 1631888 1585195 1549862 1515280 1481667 1456524 1438477 1424884
8923 1424884 1417482 1420451 1410765 1382161 1348616 1325530 1304117 1292021 1279596 1265605 1260491 1271285
8911A271285j144J9440K1757J2488J051K6475K8574O32n958p706k6738k4598k8553
8898A287005l8819m8103m1141l7253k6445j4569j3607j6478p863k790j2094k8955
8886I98888k2119j2169k4354k9280j9586L887O863q287j3552k5018k0730j7489
8874H17054k0833j1832j650K266j881J4243P769m120P024R055p594j6310j5909
8861G77282j0512l594q205k78k2526l0913l6066k5306k4890k2799k3399j0766
8849E58028j0046k5967j4373q273n4j8207k7067q409n652M07j1231j5528l399
8836D10229Q350M618K759J5286j3598o903q048M34n432j8258j2695k175m357j0283
8822C59927j5298j8746j9409k3122l583N729J4997J327n873J8215M780j4973o477
$$ plain form
8911 1271285 1270141 1289581 1311338 1323826 1324877 1351352 1379926 1380558 1374600 1366894 1340156 1315558 1287005
8898 1287005 1248186 1200083 1158942 1121689 1095244 1080675 1067068 1050590 1042727 1039937 1027843 998888
8886 998888 976769 964600 940246 910966 891380 895267 902130 893843 880291 855273 834543 817054
8874 817054 796221 784389 782739 785005 783124 797367 805136 801016 808040 817095 809501 793191 777282
8861 777282 766770 763176 754971 754693 732167 701254 665188 639882 614992 592193 568794 558028
8849 558028 547982 522015 507642 499369 499315 481108 454041 445632 439980 440387 429156 413628 410229
8836 410229 418579 423197 425956 441242 427644 420741 412693 413127 407695 389437 376742 374567 370210 359927
8822 359927 344629 325883 306474 283352 279769 285498 300495 301822 295949 314164 318944 303971 297494
8809B97494p846m263K512n338r763k676Q532j1369j3751j4111k603o628m923L570
8795B28837Q367m337q276m416K013P49J0093m63L384K586J9117Q635k797P777
8781B71269R123l057j6135q497K180j8330q445m51l798J3631J0914p720N236n555
8767B40365N090P191k834J8111R492K496J9578J0309J7328J6773j0635o228j5841
8754C11195k1207p409N725j7710j6830j4786k451r137r718O723r790j6811J794
8741A99588n994n532J0930J4376J3967J8771J3097J6382J0662N118K531p813j860
8728B84223O157k108K3927K8654K4464K6602M2951K5758N123n826l652j6269k6164
8715D13840p762j1143q252o667k037o883j0438R05K409j42j4348j7206r441q276
$$ plain form
8809 297494 289648 285385 287897 282559 272796 270120 278652 267283 253532 239421 236818 230190 225267 228837
8795 228837 237204 232867 224591 220175 222188 222937 233030 232567 235951 238537 257654 266289 263492 271269
8781 271269 280392 277335 261200 252703 254883 236553 228108 227657 223859 237490 248404 240684 245920 240365
8767 240365 245455 252646 249812 267923 277415 279911 299489 309798 327126 343899 333264 327036 311195
8754 311195 289988 282579 288304 270594 253764 238978 236527 227390 217672 224395 214605 197794 199588
8741 199588 193594 188062 198992 213368 227335 246106 259203 275585 286247 291365 293896 286083 284223
8728 284223 290380 288272 312199 340853 365317 391919 434870 460628 465751 459925 456273 440004 413840
8715 413840 406078 394935 386683 380016 377979 371096 360658 361563 363972 363830 349482 332276 322835 314559
8701C14559j0798L507J270o173j3965l714L587o02J0269J0737N732J2482J2784
8688C39675J5780L8385N1305L4697M0947K9041L244j7798k7104l3808l8279l0400
8676D05685k2710j7784k7759j9490r178k193n071j0082m018J3180m197r256K196
8663B89323L031J1334K673K744Q917p46j758o583j9392o409J1321L629R984K2417
8649C30485J4784N117J9726K5377L847l125n325r281n145j3478j0111j2728m797
8636C35346j0453K766m147M787J0544L343j1803j2028k249K42r94m531N661l364
8622C13120j113J0947K3674L1076K4283J6510J6618L8045K6814K4533N5907O1217
8610F41631N1361O2187O0271O7546P4857N7703M9210J2879k1351p6341j00669
$$ plain form
8701 314559 303761 307268 308538 302365 288400 284686 288273 287671 297940 308677 314409 326891 339675
8688 339675 355455 393840 445145 479842 520789 549830 553074 535276 508172 474364 436085 405685
8676 405685 382975 365191 337432 317942 308764 306571 301500 291418 287400 300580 296383 287127 289323
8663 289323 292354 303688 306361 309105 318022 317276 315518 308935 289543 283134 294455 298084 308068 330485
8649 330485 345269 350386 370112 395489 399336 396211 390886 381605 376460 362982 352871 340143 335346
8636 335346 324893 327659 323512 328299 338843 342186 330383 318355 316106 316348 315354 310823 316484 313120
8622 313120 312007 322954 346628 377704 401987 418497 435115 473160 499974 524507 580414 641631
8610 641631 692992 755179 815450 882996 957853 1015556 1064766 1077645 1056294 979953 879284
8599H79284j08501j21354q4317n8161n0750m0572k9210k9756l0036l0569j2045
8588B84013K231j7639n096q792j3450j3897o703J00j3114j0671j4173n886Q813
8575A85736q798J019O176m546k059N13j418j2770k2075n358j308K783M911p061
8561A35745l415M352j3819j1038n298J3948K4590k959j3320M193N802O985J397
8548A47163j4916q234j8593K08Q187N8k800n628n714q556o121j483K1877J5506
8534A20954Q289M315l985l936M29L720j894q862k786p583j7856p578j1320k902
8520F9005O360J9454O704j5065r692O404Q17L545O047o8q210M22Q595k277J505
8505I3546n912m690l225L126j136K170R429l877j4530j1561J835L371K1424j79
$$ plain form
8599 879284 770783 649429 565112 506951 456201 415629 386419 356663 326627 296058 284013
8588 284013 286244 268605 263509 254717 241267 227370 220667 220767 207653 196982 182809 176923 185736
8575 185736 176938 177957 184133 179587 177528 178041 176623 163853 141778 136420 135112 137895 142806 135745
8561 135745 132330 136682 122863 111825 106527 120475 145065 142106 128786 132979 138781 145766 147163
8548 147163 132247 124013 105420 105628 113815 113873 111073 105445 99731 91175 85054 83571 105448 120954
8534 120954 129243 133558 129573 125637 126066 129786 127892 119030 116244 108661 90805 83227 71907 69005
8520 69005 75365 94819 101523 86458 76766 83170 83987 87532 93579 93511 85301 85723 94318 92041 93546
8505 93546 87634 82944 79719 82845 81709 83879 93308 89431 74901 63340 65175 68546 89970 89791
8491H9791n03n372j168n459k190r853K262J4393P951N59M781M735M546m615o786
8476I3072l437l481q375j8086j3428m763m122M491J6318J2769R240O371q276q600
8462F9693m818n506M232J4475M511J789q19n302j5211m471P924J7650m874j113
8448G8160J1727m087j4381r574J8108K1357l540O87m797k4855j7654J2933j368
8435F2716j468M942L554N707l270j1366n873r833p022j92o943j0456R534K2092
8421E2122J1886q547n261P705k883K386Q34j0244K1J4705L457n409k256l03l666
8406E4547L000Q520L990m280l698P356j3445j0537J3382P212J055K315L283p046
8392F5654J698j4304j7432O504J1231K849r355K783L060K362n126m584L294k631
$$ plain form
8491 89791 89288 83916 82748 77289 75099 65246 67508 81901 89852 90411 95192 99927 104473 99858 93072
8476 93072 89635 86154 77779 59693 46265 41502 37380 41871 58189 70958 80198 86569 78293 69693
8462 69693 64875 59369 63601 78076 82587 84376 83557 78255 63044 58573 66497 84147 79273 78160
8448 78160 89887 85800 71419 61845 79953 101310 97770 98457 93660 68805 51151 64084 62716
8435 62716 61248 66190 69744 75451 72181 60815 54942 45109 38087 37895 30952 20496 30030 52122
8421 52122 64008 55461 50200 57905 55022 57408 58242 47998 48019 62724 66181 60772 58516 58213 54547
8406 54547 57547 66067 70057 65777 62079 69435 55990 45453 58835 66047 67102 69417 72700 65654
8392 65654 67352 53048 35616 42120 53351 56200 46845 49628 52688 55050 49924 45340 48634 46003
8378D6003j0370j9498R132J4367m430L697K277k548N424m909j036j07j2795p549
8364A7658N119l752M009J3509O277j3028n554O455O049k049p920N625M093r610
8350B6881k820n165p828N432N172O642j21K539J6136J948r68K337q126j5318M718
8335C1459P556O883K441n242J094N23L588j654o35l944r906o735q132Q389R289
8320C4974J3100m330n022j1227j243l823K24J037m747n618L672R648J7306l748
8306D0203q088J4320P982L202o676r428K187j1102r292P299J5714O427j2676j1569
8292B8503n023l026n741j449J3406o35O995O453j1631K363o037j6186N535J9942
8278C3469R136l500l242r693j682P226r967R412J4153o182p575q549q191J389
$$ plain form
8378 46003 35633 16135 25267 39634 35204 38901 41178 38630 44054 39145 38109 38002 25207 17658
8364 17658 22777 19025 23034 36543 42820 29792 24238 30693 36742 34693 26773 32398 36491 26881
8350 26881 24061 18896 11068 16500 21672 28314 28193 30732 46868 48816 47848 50185 42059 26741 31459
8335 31459 39015 45898 48339 43097 44191 44714 48302 46648 46013 42069 32163 25428 17296 25685 34974
8320 34974 48074 43744 38722 27495 26252 22429 22653 23690 18943 13325 16997 26645 43951 40203
8306 40203 32115 46435 54417 57619 50943 41515 43702 32600 23308 30607 46321 52748 40072 28503
8292 28503 23480 20454 14713 13264 26670 26035 33030 39483 27852 30215 24178 7992 13527 33469
8278 33469 42605 39105 35863 26170 24488 31714 21747 31159 45312 39130 31555 23006 14815 16204
8264A6204j3018O498K7688L163N359J927K5j0257R43q435r685k442j3P862O43
8249B6462q341m278R70K313l178L834J6281M890j0292j1015J178K5887N095q406
8235D1400l193m409l974n092j7067m156J7278K1746N547J182j30L43j2001r148
8221B8326K68j4633j4851J4990J0192j740k968L041p896r472n999q49p201L109
8207e683O774N052J6647O701J640j956o34J531L852O12j161j250l986L941L750
8192C5830r866j668j265o873N591o867n116J2748J0149m118j0751P725J4375p41
8178C9153q271m316l215p967j968J0800K222O8Q249j3622j0189l353K307J6849
8164B6747m611K840J292K109l537J576k693j609M271J4229L838j1135q31k427
$$ plain form
8264 16204 3186 9684 37372 40535 45894 47821 47846 37589 38532 30097 20412 17970 17957 25819 26462
8249 26462 18121 13843 14813 17126 13948 17782 34063 38953 28661 17646 18824 44711 49806 41400
8235 41400 38207 33798 29824 24732 7665 3509 20787 42533 48080 49262 49132 49475 37474 28326
8221 28326 28594 13961 -890 14100 24292 22552 19584 22625 14729 5257 -742 -1591 -8792 -5683
8207 -5683 1091 6143 22790 29491 31131 29175 28541 30072 33924 34536 33375 32125 28139 32080 35830
8192 35830 25964 24296 23031 16158 21749 14882 9766 22514 32663 28545 17794 25519 39894 39153
8178 39153 30882 26566 23351 15384 13416 24216 26438 26506 34755 21133 10944 7591 9898 26747
8164 26747 22136 24976 26268 28377 24840 26416 23723 22114 26385 40614 44452 33317 32486 30059
8150C0059l624O639J581q47r141j13J0395j1500j1466N50l044N923O751M106J3505
8135C9774N574N596k41l458n587j781J1643Q986J0489k064j2532p421j916J033
8121D8095j19R857k0236k3977l329J2392J397K030K50j1027j0586m818J0948P115
8107A7992J2361O248K320J0616K619j6529L307j0410n149L854m22L230N123J402
8093C6562L21J588j20O785Q562n267j6586R009j014P621J3918J5999J5842J0619
8079A03839j603j7549j6079K607j5797k854J1652q604q828M931N107M91q476p383
8065D1454J0573l835l474P138O421M305K349L622q826j3017J0792L61r349M535
8051E3049N51K489n08j5588j5093N923R224J5344P694n082L444K514J6675P35
$$ plain form
8150 30059 26435 33074 34655 33808 24667 24554 34949 23449 11983 12533 9489 15412 22163 26269 39774
8135 39774 45348 50944 50703 47245 41658 39877 51520 60506 70995 68931 56399 48978 47062 48095
8121 48095 47976 57833 37597 13620 10291 22683 24080 26110 26360 15333 4747 -71 10877 17992
8107 17992 30353 36601 38921 49537 52156 35627 38934 28524 23375 27229 26807 30037 35160 36562
8093 36562 36883 38471 38351 45136 53698 48431 31845 40854 39840 47461 61379 77378 93220 103839
8079 103839 102236 84687 68608 71215 55418 52564 64216 55612 46784 51715 56822 57313 48837 41454
8065 41454 52027 48192 44718 51856 58277 62582 64931 68553 59727 46710 57502 57863 48514 53049
8051 53049 53600 56089 55581 39993 24900 30823 40047 55391 63085 58003 61447 63961 80636 81371
8037H1371R834R146Q72r374M264P006q428n467j2787P39N946j54Q028o491J2241
8022I6746J433j1277j6932Q604P065R683n390P551N034m316J5254K5312j536q939
8008A28292m215m18j5987j9089p833R608P294J3908j782r795L334l810p358r532
7994H2617K507J5787P390j3114j5177o256j094n807K47k857q364J1816N692r952
7980F3435n4O868n808m192J739o292M534J1544J2959R511J066n781J4259J1066
7966A14854j7357l371J4475n710n776K908J139J685k586o094o500j0385n499r484
7952F2299j1916j1795J528K0483j155m312n195m837N222K291n190p438N511Q431
7938E3927P958M869M401o624O925O54J054J389J6619J1786o779M094M361p161
$$ plain form
8037 81371 91205 100351 101223 91849 96113 103119 94691 89224 76437 77176 83122 82968 90996 84505 96746
8022 96746 98179 86902 69970 78574 85639 95322 89932 97483 102517 98201 113455 138767 137231 128292
8008 128292 124077 123659 107672 88583 80750 90358 97652 111560 109778 99983 103317 99507 92149 82617
7994 82617 85124 100911 108301 95187 80010 73754 72660 66853 67100 64243 55879 67695 73387 63435
7980 63435 63381 70249 64441 60249 61988 55696 60230 71774 84733 94244 95310 89529 103788 114854
7966 114854 97497 94126 108601 102891 97115 100023 101162 102847 100261 94167 87667 77282 71783 62299
7952 62299 50383 38588 40116 60599 59444 55132 49937 45100 50322 52613 47423 39985 45496 53927
7938 53927 61885 66754 71155 64531 71456 72110 73164 74553 91172 102958 96179 100273 104634 97473
7924I7473p470o529q020m181r161l112P856o2l095m774m256k748j1525k65P756
7909D7887O151R77r035j2925n86j44o365J1872Q670J936o428n822M575j868O738
7894D5633q422o397P874K380l054m717j131L032Q00j473M24m51j0677l812R646
7879B9655j293j097M807l680k716j8102l368R125J0698r61J330j2218j7801M96
7865e125L394R08P93N477P213J0739p337r090m500P415J2256J9919L339r696r144
7850B6561j3975k399o081M668L153r554J190P04j3800m145Q380M261N976J1138
7836A6077M213m627l223l134J7387J43q565n417m067M797j3381q141J7188l56
7822H894M833M6P491L704k825l851j883m537q471p922m478J6599J6971j1131j2331
$$ plain form
7924 97473 90003 83474 75454 71273 62112 59000 66856 66794 63699 58925 54669 51921 40396 40131 47887
7909 47887 54038 55015 45980 33055 32469 32325 25960 37832 46502 48438 42010 36188 40763 38895 45633
7894 45633 37211 30814 38688 41068 38014 33297 32166 35198 35998 34525 34949 34498 23821 20009 29655
7879 29655 28362 27265 32072 28392 25676 7574 4206 13331 24029 23068 24398 12180 -5621 -5125
7865 -5125 -1731 -823 -30 5447 12660 23399 16062 6972 2472 9887 22143 42062 45401 35705 26561
7850 26561 12586 10187 4106 8774 11927 2373 3563 4267 -9533 -13678 -5298 -1037 4939 16077
7836 16077 20290 15663 12440 9306 26693 26836 18271 12854 8787 13584 203 -7938 9250 8894
7822 8894 13727 13773 21264 24968 22143 18292 16409 11872 3401 -4521 -8999 7600 24571 13440 1109
7807A109o939Q074J5136P642j2196j4986q365J638q188k043O503K843n474j0124
7793b5370O078J2267l115J292N337J4939J1961J264o35M355J0168m117p363j5505
7779A1556j952J6224p138k2404m909R23K260n884r21J933k084j588M201J104P103
7764a576o265o030Q711J1613l669K345J0434o973j0594r95j712K968L666j4563
7750a2640n076J1728J1591r09L950N859J813l538j79K286q96R70o717o226j3195
7735a1179j3885L647J4846J4619q609j4937m100P548k872M781O897O387M058J3496
7721B0697j496n634M14J835J1060r457j5000l220K823O070N859P502j841j1961
7707G651j2879k368K212O556j221K041o460j1415j1079J854J2958P354L340N073
$$ plain form
7807 1109 -5830 2244 17380 25022 12826 -2160 -10525 -8887 -17075 -19118 -12615 -9772 -15246 -25370
7793 -25370 -19292 -7025 -10140 -8848 -3511 11428 23389 24653 24018 28373 38541 34424 27061 11556
7779 11556 9604 25828 18690 -3714 -8623 -7700 -5440 -11324 -12245 -10312 -12396 -13984 -9783 -8679 -1576
7764 -1576 -7841 -13871 -5160 6453 2784 5129 15563 8590 -2004 -2999 -4711 -1743 1923 -12640
7750 -12640 -17716 -5988 5603 4694 8644 14503 16316 12778 12599 14885 13989 14959 8242 2016 -11179
7735 -11179 -25064 -21417 -6571 8048 -561 -15498 -19598 -12050 -14922 -10141 -3244 3143 7201 20697
7721 20697 19201 13567 13981 15816 26876 17419 2419 -801 2022 8092 13951 21453 19612 7651
7707 7651 -5228 -7596 -5384 1172 -49 1992 -4468 -15883 -26962 -25108 -12150 -4796 -1456 3617
7693C617J318l848j4000n329P124J386R812j667l891K321Q166L51l11o277p072
7678h300P39J58J1458Q475k165K790M463j2266j9555j3586P569J2602l583k764
7664a3965j575K83J4032R22j0673n09o813p239J4313J7628J935R16j313j3433
7650e491j3170o241J3563J0616J00R818j189m256K16j3049N298J6243o360j8075
7636a1977p606J9016J2337r986p157N864l947q684j2407J2412Q391M764M227J1031
7622A6278M338r166l236J3978J3253j2639r120n443o60J0945o907P106P314o150
7608A9891j4859J0366p89P074m852k387o65p456j237r94l791J796K150l201L386
7593D432j5682r986o254J618J2329M519K598K750J15K171m193Q407j027l923k998
$$ plain form
7693 3617 4935 1087 -12913 -18242 -11118 -9732 80 -1587 -5478 -3157 5009 5360 5049 -1228 -8300
7678 -8300 -7561 -7403 4055 12530 10365 13155 17618 5352 -14203 -27789 -20220 -7618 -11201 -13965
7664 -13965 -15540 -15257 -1225 -303 -10976 -11485 -18298 -25537 -11224 6404 8339 9255 7942 -5491
7650 -5491 -18661 -24902 -11339 -723 -623 9195 8006 3750 3966 -9083 -3785 12458 6098 -11977
7636 -11977 -19583 -567 11770 1784 -5373 491 -3456 -12140 -24547 -12135 -3744 1020 5247 16278
7622 16278 20616 11450 8214 22192 35445 22806 13686 8243 7583 18528 11621 18727 26041 19891
7608 19891 5032 15398 14609 21683 16831 14444 13779 6323 5086 4092 301 2097 4247 1046 4432
7593 4432 -11250 -21236 -27490 -25872 -13543 -9024 -6426 -3676 -3561 -1390 -5583 2824 1797 -2126 -5124
7578e124J735J297P426p707r61j496L893P09o631M271J5282o977O270k651j0917
7563a581N650m520P90j1086k755K300l523K44O804M674q561j642L458j2514r272
7548c1534K4023J7487K760r701O98J912m388O042J0924j2202o521J249m692n327
7534i270j2692o117j228Q186P374M25j092j015K679N590k171m87Q301O931J355
7519F769m063n883K526m417j1585N017R432n853M230j397l881J034J0921O83j7271
7504a3738o378Q935K385P508J737J271J813J562j1598l55J0006K318O356o251
7490E571N926l549n725j0697m685m452j0007R803O683j3711R219R253J3873l506
7476C996r849k412K212N814K743J608r571j177L737l283j718j0900k156J1970
$$ plain form
7578 -5124 -3389 -2092 5334 -2373 -3334 -4830 -937 -228 -6859 -2588 12694 5717 11987 9336 -1581
7563 -1581 4069 -451 339 -10747 -13502 -11202 -14725 -14481 -7677 -3003 -11564 -13206 -9748 -22262 -31534
7548 -31534 -7511 9976 12736 3035 3733 5645 1257 7299 18223 6021 -500 749 -3943 -9270
7534 -9270 -21962 -28079 -29307 -21121 -13747 -13322 -14414 -15429 -12750 -7160 -9331 -9818 -1517 5414 6769
7519 6769 2706 -3177 -651 -5068 -16653 -11636 -2204 -8057 -3827 -5224 -9105 -8071 2850 3533 -13738
7504 -13738 -20116 -11181 -8796 -1288 449 1720 3533 5095 -6503 -6858 3148 5466 11822 5571
7490 5571 11497 7948 2223 -8474 -13159 -17611 -27618 -17815 -11132 -24843 -15624 -6371 7502 3996
7476 3996 -5853 -8265 -6053 -239 2504 4112 -5459 -6636 -2899 -6182 -7900 -18800 -20956 -8986
7462h986n634p775Q102J4570l976n576j945l411O304K958k006k995R533O16O663
7447F442j3172l216M063N851k475r417R340k089k8k913L361O461O044l18j7790
7432i856j0913O116J4252p078o865j727r347M267P311k713j355j164o92Q071L417
7417h276k489K077M142K161M645O123o243j2925k1l5K337J4190J359m053n496
7402b504M060N61P065N062r297n334R4J58j091j21L05j897R889M406o551r448
7386d643r428J2J0738j573m602J0973K877K9r813r144n526J5764R677l073j0251
7371g983J1219o973m967M724l247J1245N610K764J755o286j2004m82j0420p78
7357a5823Q349M980k501L36N943k668L278N17j78j3783J88K309L959M626N367
$$ plain form
7462 -8986 -14620 -22395 -14293 277 -3699 -9275 -11220 -14631 -8327 -5369 -7375 -10370 -837 -221 6442
7447 6442 -6730 -9946 -5883 -32 -2507 -11924 -2584 -4673 -4701 -7614 -4253 2208 8252 7934 -9856
7432 -9856 -20769 -14653 -401 -7479 -14344 -16071 -25418 -21151 -13840 -16553 -17908 -19072 -19764 -11693 -8276
7417 -8276 -10765 -8688 -4546 -2385 2260 8383 2140 -10785 -10806 -10841 -8504 5686 7045 2992 -2504
7402 -2504 1556 2117 9182 14244 4947 -387 -293 -135 -1226 -1347 -1042 -2939 6950 11356 4805 -4643
7386 -4643 -14071 -14059 -3321 -4894 -9496 1477 4354 4383 -5430 -14574 -20100 -4336 5341 2268 -7983
7371 -7983 3236 -3737 -8704 -3980 -7227 4018 9628 12392 14147 7861 -4143 -4625 -15045 -15823
7357 -15823 -7474 -2494 -4995 -4659 1284 -1384 1894 2411 2233 -11550 -11362 -9053 -5094 -468 4899
7342D899q340r880J2327P735k0830N305M026J467N159k703j949j53R462o120m779
7327d374n751o426l647k641J561l090m810L649L924L735m51J06J5623K310n443
7312e725l950O359p505j1005j877k514Q798J210p732m168Q694R964l465k655J443
7297a4128K745m967m70j319j450R62N165K230q795m493K426k3Q008R470j90l350
7281h179J141p158L744M539M245k695o044J664K942k03K763j750l716j0285Q948
7266a0044J3241L479N687j0206o868j061l062J678j102l936o873k516L664J8457
7252E38J1634L031j0134L801j5663P477N041r082j779O594p073n206p741R85j2296
7237b9873K424j2251q004J1505J5720J157j717R356P939l506L247l623j2362q204
$$ plain form
7342 4899 -3441 -13321 -994 6741 -14089 -8784 -4758 -3291 1868 -835 -2784 -2937 6525 405 -4374
7327 -4374 -10125 -16551 -20198 -22839 -21278 -24368 -29178 -25529 -21605 -17870 -18321 -18215 -2592 -282 -5725
7312 -5725 -9675 -3316 -10821 -21826 -23703 -26217 -17419 -16209 -23941 -28109 -19415 -9451 -12916 -15571 -14128
7297 -14128 -11383 -16350 -16820 -18139 -19589 -18627 -13462 -11232 -20027 -24520 -22094 -22117 -14109 -4639 -4829 -8179
7281 -8179 -7038 -14196 -10452 -5913 -1668 -4363 -10407 -8743 -5801 -6004 -3241 -4991 -8707 -18992 -10044
7266 -10044 3197 6676 12363 2157 -4711 -5772 -8834 -7156 -8258 -12194 -19067 -21583 -17919 538
7252 538 12172 15203 5069 8870 -6793 684 5725 -3357 -5136 1458 -5615 -10821 -18562 -17577 -29873
7237 -29873 -27449 -39700 -47704 -36199 -20479 -19322 -21039 -11683 -3744 -7250 -4003 -7626 -19988 -28192
7223b8192J4035J6208r96j5652r437q087J7226L948m318R318R851q167R73j0083
7209a3373j7503K16L677J3228p277P932K326m705j6386R927J2579m501J046J7340
7195D526K3585O562k701j4057J599N363j0196L657q157L813L714k632j0076Q82
7181E882k739m45O985q35n132m165P726L018j1469r708m581p903l835R678J020
7166a6503R553m66l484O14k786J324l180P810p574j4694m564L251J1767P081q519
7151b0370K934k09q080j559J1492J5330j380K4j0991j7892J1220K167j1162j901
7137c0377J2984J8913J4384p874j6204o847J2355J5096j2754j5520j3920l689
7125c3453J7034J6512j5790r212Q507M81J3838m397r44M750P164J167r951j7393
$$ plain form
7223 -28192 -14157 2051 1055 -14597 -24034 -32121 -14895 -10947 -15265 -5947 3904 -4263 -3290 -13373
7209 -13373 -30876 -30660 -26983 -13755 -21032 -13100 -10774 -15479 -31865 -21938 -9359 -13860 -12814 4526
7195 4526 28111 34673 31972 17915 19514 24877 14681 18338 10181 13994 17708 15076 5000 5882
7181 5882 3143 2698 9683 8848 3716 -449 7277 10295 -1174 -10882 -15463 -23366 -27201 -17523 -16503
7166 -16503 -6950 -7416 -10900 -10286 -13072 -11748 -14928 -7118 -14692 -29386 -33950 -30699 -18932 -11851 -20370
7151 -20370 -17436 -17645 -25725 -27284 -15792 -462 -1842 -1818 -12809 -30701 -19481 -17314 -28476 -30377
7137 -30377 -17393 1520 15904 8030 -8174 -15021 -2666 12430 -324 -15844 -29764 -33453
7125 -33453 -16419 93 -15697 -24909 -16402 -15921 -2083 -6480 -7424 -2674 4490 5657 -4294 -21687
7111b1687K74J252J5651M308j79K810p159p196Q325R074m964n753r985j6316k223
7096c3768P816R585O802Q314L547k958j3858q906j0759J1207R540j955l400P785
7082a1008k302j946J5947j141p581q201j6643J1803P706J6326P039q926j4120
7069a3047J3661Q612j952j6024J322q915m161M437L918m278k678J859p353K188
7055b2411J3598j5976p373J5943o174j356J7454L093L752j604M358O666l1499
7042b1529k2766J2151J2515p354J899J1236J587j276j530m541J1857K2365q861
7029E753P972j4349j0650m192j85k42r893M038Q126K319j474m00n672L734p064
7014b2179L127L658L939j338j365j866O402N82r327M230M907j0365r095L084M533
$$ plain form
7111 -21687 -21413 -20161 -4510 -202 -381 2429 -4730 -11926 -3601 5473 509 -5244 -15229 -31545 -33768
7096 -33768 -25952 -16367 -9565 -1251 2296 -662 -14520 -23426 -34185 -22978 -13438 -15393 -18793 -11008
7082 -11008 -13310 -15256 691 -450 -8031 -16232 -32875 -21072 -13366 2960 9999 1073 -13047
7069 -13047 614 9226 7274 -8750 -7428 -16343 -20504 -16067 -12149 -16427 -19105 -17246 -24599 -22411
7055 -22411 -8813 -24789 -32162 -16219 -22393 -23749 -6295 -3202 550 -1054 3304 9970 -21529
7042 -21529 -44295 -32144 -19629 -26983 -25084 -13848 -12261 -13537 -15067 -19608 -7751 14614 5753
7029 5753 13725 -624 -11274 -15466 -15651 -15893 -25786 -21748 -13622 -11303 -12777 -13177 -18849 -15115 -22179
7014 -22179 -19052 -15394 -11455 -12793 -14158 -16024 -9622 -9040 -18367 -14137 -9230 -19595 -28690 -25606 -21073
6999b1073L097R687j918J5059J3346R110J605j7954j0736o996j2419q823O965
6986b1050J8047J876r543m478R331J3159J4404r846k618Q617Q11o747j3264l186
6972d487K807l033n126k749q925N110L179j176q8Q152M379q775j3597J9586J0265
6957E522q916j0744k227r333p666j931J420O352N610K209l991L917q06j2441N483
6942b7542J7302Q087M051J4243N669j5561j0377j4638L078N204J0543J765k768
6929i44k001M590O152o846k0034l617M205K825p346O400J1357J7451K2320m542
6915B9970k5256j0914o610k141l156j5061J749O211l343O495L330q526L103J547
6901b2602R629n59r07J201n260l529P820N446N409m958p995k42K499J687j2709
$$ plain form
6999 -21073 -17976 -8289 -10207 4852 18198 27308 28913 10959 223 -6773 -19192 -28015 -21050
6986 -21050 -3003 -1127 -10670 -15148 -5817 7342 21746 11900 9282 17899 18710 11963 -1301 -4487
6972 -4487 -1680 -4713 -9839 -12588 -21513 -16403 -13224 -14400 -14488 -6336 -1957 -10732 -24329 -4743 5522
6957 5522 -3394 -14138 -16365 -25698 -33364 -35295 -33875 -27523 -21913 -19704 -23695 -19778 -20584 -33025 -27542
6942 -27542 -10240 -2153 1898 16141 21810 6249 -4128 -18766 -15688 -10484 59 1824 -944
6929 -944 -2945 1645 7797 951 -19083 -22700 -18495 -15670 -23016 -16616 -5259 12192 34512 29970
6915 29970 4714 -6200 -12810 -14951 -18107 -33168 -31419 -25208 -28551 -22056 -18726 -27252 -24149 -22602
6901 -22602 -12973 -13532 -14439 -13238 -18498 -22027 -14207 -8761 -3352 -8310 -16305 -16547 -14048 -12361 -25070
6886b5070J0408J0501K272m733n322J7534k563m403j1066j4940J505J0042n63
6873a6398J267j627J5730J153j3879l05O498N498m576n082Q188p423j4461O435
6859a8982l602N643P487P442q332l031q784o794K302J5276M083L139n024K391
6845f786J4156k910o887o865k17O030K685J1507n283j922J0091R10j226n519k2127
6830a4363J436j24N312k599k653J237j80K1096J2879j3962r644N712N478j2024
6816b399p306j1325j5404k829K3961Q227J857K141J3988J0404m604j3105p722
6803d116l094J3858r577L906j939q638J0600M956l695R30n316j1750n940J7762
6789b053P224l86k362J48N034l216p349n918o545M00J0270j2J1295J451o258k364
$$ plain form
6886 -25070 -14662 -4161 -1889 -6622 -11944 5590 3027 -1376 -12442 -27382 -25877 -15835 -16398
6873 -16398 -15131 -16758 -1028 125 -13754 -14059 -7561 -2063 -6639 -11721 -3533 -10956 -25417 -18982
6859 -18982 -22584 -16941 -9454 -2012 -10344 -13375 -22159 -28953 -26651 -11375 -7292 -4153 -9177 -6786
6845 -6786 7370 4460 -2427 -9292 -9509 -3479 -794 10713 5430 3508 13599 14509 13283 7764 -14363
6830 -14363 -12927 -13051 -7739 -10338 -12991 -11754 -11934 9162 22041 8079 -1565 4147 9625 -2399
6816 -2399 -9705 -21030 -36434 -39263 -15302 -7075 -5218 -3077 10911 21315 16711 3606 -4116
6803 -4116 -7210 6648 -2929 977 -962 -9600 1000 5956 2261 3191 -2125 -13875 -19815 -2053
6789 -2053 5171 4785 2423 2571 7605 4389 -2960 -8878 -15423 -15023 -4753 -4765 6530 7981 1723 -641
6773f41p65q584j73J1845J594N027j4178j5046J966M939p480J2305k00Q653l243
6758c981R563L692j627J4256k414j2705j4413M746l21j3114p958k11L928J4248
6744f311L165j660j2242k04j686Q882O943J57r423j723J0727O970n740R19J0295
6729I069j345j171j131m334p323r633P881O593L144o945n084m519j2317q92L404
6714b4603N096L975J2470J0287j22j20Q93o822J095j7638l633O572k491r785r71
6699b5797J3060m498J43J0329q5j2852n883k134L276J3442M807K655N969r550
6685g118L549P275n473r633O530J695l866m224o182p576M285J3144R59J0349O910
6670A0624l085r792j1164j097p28L517J2493K176o27Lk2484j5712N002K5941J3278
$$ plain form
6773 -641 -1406 -9990 -10163 1682 3276 8303 -5875 -20921 -18955 -14016 -21496 -9191 -9391 -738 -3981
6758 -3981 5582 9274 7647 21903 19489 6784 -7629 -2883 -3204 -16318 -24276 -24487 -20559 -6311
6744 -6311 -3146 -4806 -17048 -17252 -18938 -10056 -3113 -2956 -12379 -14102 -3375 3595 -2145 -1226 9069
6729 9069 7724 6553 5422 1088 -6235 -15868 -7987 -1394 1750 -5195 -10279 -14798 -27115 -28007 -24603
6714 -24603 -19507 -15532 -3062 7225 7103 6983 7876 1054 2149 -15489 -19122 -12550 -15041 -24826 -25797
6699 -25797 -12737 -17235 -17092 -6763 -6848 -19700 -25583 -27717 -24441 -10999 -6192 -3537 2432 -7118
6685 -7118 -3569 3706 -1767 -11400 -4870 -3175 -7041 -11265 -17447 -25023 -20738 -7594 -6635 3714 10624
6670 10624 7539 -2253 -13417 -14514 -15242 -11725 768 2944 2317 2320 -20164 -35876 -30874 -4933 8345
6655H345J405m288k276j3144o123J4342j274O374L186P62j582R447J391n714k358
$$ plain form
6655 8345 9750 5462 3186 -9958 -16081 -1739 -3013 3361 6547 7309 5727 15174 16565 10851 8493
$$ [...]
##END NTUPLES=NMR SPECTRUM
##END=
