##TITLE=Analysis number 329406
Compound Code cc 34001
Book Reference a
Project Code adrs
Chemist Name af chempharm
##JCAMPDX= 6.0         $$ Bruker NMR JCAMP-DX V2.0
##DATA TYPE= NMR SPECTRUM
##DATA CLASS= NTUPLES
##ORIGIN= Bruker BioSpin GmbH
##OWNER= nmr
$$ XWIN-NMR		Version 3.5
$$ Wed Aug 29 00:56:14 2007 GMT Daylight Time (UT+1h)  MAYBRIDGE\nmr@NMR_250MHZ
##.OBSERVE FREQUENCY= 250.131544655141
##.OBSERVE NUCLEUS= ^1H
##.ACQUISITION MODE= SIMULTANEOUS (DQD)
##.ACQUISITION SCHEME= undefined
##.AVERAGES= 16
##.DIGITISER RES= 18
##SPECTROMETER/DATA SYSTEM= dpx250
##.PULSE SEQUENCE= zg30
##.SOLVENT NAME= DMSO
##.SHIFT REFERENCE= (INTERNAL, DMSO, 0, 16.522)
##AUDIT TRAIL= $$ (NUMBER, WHEN, WHO, WHERE, WHAT)
$$ ##TITLE= Audit trail, XWIN-NMR		Version 3.5
$$ ##JCAMPDX= 5.01
$$ ##ORIGIN= Bruker BioSpin GmbH
$$ ##OWNER= nmr
$$ C:\u/data/dgb/nmr/ADRS/1280/pdata/1/auditp.txt
$$ ##AUDIT TRAIL=  $$ (NUMBER, WHEN, WHO, WHERE, WHAT)
(   1,<2007-08-29 00:55:03.39 +100>,<MAYBRIDGE\nmr>,<NMR_250MHZ>,
      <created by zg, POWCHK disabled, PULCHK disabled
       configuration hash MD5:
       76 6E 9A 78 1E 09 19 81 EC 84 63 8F B0 6A 59 2D
       data hash MD5: 64K
       82 08 66 D5 18 A5 8A 8F 32 4C BA 74 AD 81 C6 06>)
(   2,<2007-08-29 00:55:32.63 +100>,<MAYBRIDGE\nmr>,<NMR_250MHZ>,
      <Start of raw data processing
       ef LB = 0.3 FT_mod = 6 PKNL = 1 SI = 32K 
       data hash MD5: 32K
       F3 AF 81 CB CC C9 DD E7 E0 74 39 2D CA 31 62 9F>)
(   3,<2007-08-29 00:55:37.55 +100>,<MAYBRIDGE\nmr>,<NMR_250MHZ>,
      <apk 
       data hash MD5: 32K
       2D 6E 81 DC A4 2B 55 64 2E 36 76 0D A1 96 4B 61>)
(   4,<2007-08-29 00:55:42.44 +100>,<MAYBRIDGE\nmr>,<NMR_250MHZ>,
      <abs ABSG = 5 
       data hash MD5: 32K
       0F 2A 91 51 F2 CA 3D 1E B8 D3 1A 21 FB FA D3 FA>)
$$ ##END=
$$ 
$$ hash MD5
$$ 67 69 11 85 AF BF 5A BA 2B 42 9E 6F 52 DC 5B 76
##$RELAX= 
##$RELAX= 
##$RELAX= 
##$RELAX= 
##$RELAX= 
##$RELAX= 
##$RELAX= 
$$ Bruker specific parameters
$$ --------------------------
##$DU= <C:\u>
##$EXPNO= 1280
##$NAME= <ADRS>
##$PROCNO= 1
##$TYPE= <nmr>
##$USER= <dgb>
##$AMP= (0..31)
100 100 100 100 100 100 100 100 100 100 100 100 100 100 100 100 100 100 
100 100 100 100 100 100 100 100 100 100 100 100 100 100 
##$AQSEQ= 0
##$AQ_mod= 3
##$AUNM= <au_zg>
##$AUTOPOS= <5 >
##$BF1= 250.13
##$BF2= 250.13
##$BF3= 250.13
##$BF4= 250.13
##$BF5= 500.13
##$BF6= 500.13
##$BF7= 500.13
##$BF8= 500.13
##$BYTORDA= 1
##$CFDGTYP= 0
##$CFRGTYP= 5
##$CHEMSTR= <none>
##$CNST= (0..31)
1 1 145 1 1 1 1 1 1 1 1 1 1 1 1 1 1 1 1 1 1 1 1 1 1 1 1 1 1 1 1 1 
##$CPDPRG= <>
##$CPDPRG1= <>
##$CPDPRG2= <>
##$CPDPRG3= <>
##$CPDPRG4= <mlev>
##$CPDPRG5= <mlev>
##$CPDPRG6= <mlev>
##$CPDPRG7= <mlev>
##$CPDPRG8= <mlev>
##$CPDPRGB= <>
##$CPDPRGT= <>
##$D= (0..31)
0 1 0 0 0 0 0 0 0 0.06 0 0 0 0 0 0 0.0002 0 0 0 0 0 0 0 0 0 0 0 0 0 0 
0 
##$DATE= 1188345300
##$DBL= (0..7)
120 120 120 120 120 120 120 120 
##$DBP= (0..7)
150 150 150 150 150 150 150 150 
##$DBP07= 0
##$DBPNAM0= <>
##$DBPNAM1= <>
$$ [...]
##$SUBNAM7= <"">
##$SUBNAM8= <"">
##$SUBNAM9= <"">
##$SW= 20.6930455092707
##$SWIBOX= (0..15)
0 0 3 0 0 0 0 0 0 0 0 0 0 0 0 0 
##$SW_h= 5175.983436853
##$TD= 65536
##$TD0= 1
##$TE= 297.16
##$TE2= 300
##$TE3= 300
##$TEG= 300
##$TL= (0..7)
0 120 120 120 120 120 120 120 
##$TP= (0..7)
150 150 150 150 150 150 150 150 
##$TP07= 0
##$TPNAME0= <>
##$TPNAME1= <>
##$TPNAME2= <>
##$TPNAME3= <>
##$TPNAME4= <>
##$TPNAME5= <>
##$TPNAME6= <>
##$TPNAME7= <>
##$TPOAL= (0..7)
0.5 0.5 0.5 0.5 0.5 0.5 0.5 0.5 
##$TPOFFS= (0..7)
0 0 0 0 0 0 0 0 
##$TUNHIN= 0
##$TUNHOUT= 0
##$TUNXOUT= 0
##$USERA1= <user>
##$USERA2= <user>
##$USERA3= <user>
##$USERA4= <user>
##$USERA5= <user>
##$V9= 5
##$VALIST= <valist>
##$VCLIST= <CCCCCCCCCCCCCCC>
##$VD= 0
##$VDLIST= <DDDDDDDDDDDDDDD>
##$VPLIST= <PPPPPPPPPPPPPPP>
##$VTLIST= <TTTTTTTTTTTTTTT>
##$WBST= 1024
##$WBSW= 4
##$XGAIN= (0..3)
0 0 0 0 
##$XL= 0
##$YL= 0
##$YMAX_a= 235797
##$YMIN_a= -265916
##$ZGOPTNS= <>
##$ZL1= 120
##$ZL2= 120
##$ZL3= 120
##$ZL4= 120
##$ABSF1= 16.522
##$ABSF2= -4.171173
##$ABSG= 5
##$ABSL= 3
##$ALPHA= 0
##$AQORDER= 0
##$ASSFAC= 0
##$ASSFACI= 0
##$ASSFACX= 0
##$ASSWID= 0
##$AUNMP= <proc_1d>
##$AZFE= 0.1
##$AZFW= 0.1
##$BCFW= 0
##$BC_mod= 0
##$BYTORDP= 0
##$COROFFS= 0
##$CY= 12.5
##$DATMOD= 1
##$DC= 0
##$DFILT= <>
##$DTYPP= 0
##$F1P= 14.0000005364418
##$F2P= -0.99999901652339
##$FCOR= 0.5
##$FTSIZE= 32768
##$FT_mod= 6
##$GAMMA= 0
##$GB= 0
##$INTBC= 1
##$INTSCL= 1
##$ISEN= 128
##$LB= 0.3
##$LEV0= 0
##$LPBIN= 0
##$MAXI= 10000
##$MC2= 0
##$MEAN= 0
##$ME_mod= 0
##$MI= 0
##$NCOEF= 0
##$NC_proc= -6
##$NLEV= 6
##$NOISF1= 0
##$NOISF2= 0
##$NSP= 0
##$NTH_PI= 0
##$NZP= 0
##$OFFSET= 16.522
##$PC= 1
##$PHC0= -56.16173
##$PHC1= 9.861452
##$PH_mod= 1
##$PKNL= yes
##$PPARMOD= 0
##$PSCAL= 4
##$PSIGN= 0
##$REVERSE= no
##$SF= 250.13
##$SI= 32768
##$SIGF1= 0
##$SIGF2= 0
##$SINO= 400
##$SIOLD= 32768
##$SREGLST= <1H.DMSO>
##$SSB= 0
##$STSI= 32768
##$STSR= 0
##$SW_p= 5175.98343685301
##$SYMM= 0
##$S_DEV= 0
##$TDeff= 65536
##$TDoff= 0
##$TI= <Analysis number 999999
Compound Code 99
Book Reference 9
Project Code 9>
##$TILT= no
##$TM1= 0
##$TM2= 0
##$TOPLEV= 0
##$USERP1= <user>
##$USERP2= <user>
##$USERP3= <user>
##$USERP4= <user>
##$USERP5= <user>
##$WDW= 1
##$XDIM= 32768
##$YMAX_p= 392136184
##$YMIN_p= -989638
$$ End of Bruker specific parameters
$$ ---------------------------------
##NTUPLES= NMR SPECTRUM
##VAR_NAME=  FREQUENCY,     SPECTRUM/REAL,   SPECTRUM/IMAG
##SYMBOL=    X,             R,               I
##VAR_TYPE=  INDEPENDENT,   DEPENDENT,       DEPENDENT
##VAR_FORM=  AFFN,          ASDF,            ASDF
##VAR_DIM=   32768,         32768,           32768
##UNITS=     HZ,            ARBITRARY UNITS, ARBITRARY UNITS
##FACTOR=    0.157963299565203, 1,           1
##FIRST=     4132.6476996994, 0,             0
##LAST=      -1043.33573715361, 0,           0
##MIN=       -1043.33573715361, -989638,     0
##MAX=       4132.6476996994, 392136184,     0
$$ Real data points
##PAGE= N=1
##DATA TABLE= (X++(R..R)), XYDATA
$$ [...]
$$ plain form
15520 -329951 -317002 -66019 293331 301961 129807 -91045 126286 265510 220093 247462
15510 247462 64085 59353 365753 338155 77016 -171942 -266235 -395085 -328555 -328378 -145938
15499 -145938 54118 193871 63052 168113 122420 -47597 -301814 -190315 -51052 -127224
15489 -127224 -286606 -310944 -225530 -380676 -118373 -134574 -343221 -188927 -146815 -261171
15479 -261171 -20615 25939 136643 141837 -28802 -493916 -494125 -290826 -327611 -390757 -220899
15468 -220899 -78182 -45546 86794 195439 218594 109961 -40626 130825 125551 -54280
15458 -54280 155138 103049 46417 17862 -86242 -169815 -457305 -594432 -424694 -80707
15448 -80707 104531 90954 -118197 -330713 -462943 -302506 -253965 -127485 -282983 -115878
$$ packed form
15520c29951J2949K50983L59350Q630j72154k20852K17331J39224m5417K7369
15510B47462j83377m732L06400k7598k61139k48958r4293j28850O6530J77J82440
15499a45938K00056J39753j30819J05061m5693j70017k54217J11499J39263p6172
15489a27224j59382k4338Q5414j55146K62303j6201k08647J54294M2112j14356
15479b61171K40556M6554J10704N194j70639m65114k09K03299l6785o3146J69858
15468b20899J42717L2636J32340J08645K3155j08633j50587J71451n274j79831
15458e4280K09418n2089n6632k8555j04104q3573k87490j37127J69738L43987
15448h0707J85238j3577k09151k12516j32230J60437M8541J26480j55498J67105
$$ plain form
15438 -115878 38035 -152367 -389661 -525309 -187597 -116220 -230687 -291641 -228367 -54837
15428 -54837 94811 -18298 -74803 58451 266090 82350 -85843 -21410 108956 -40796
15418 -40796 -124952 -442100 -267857 53165 37554 -246923 -316277 139001 338759 213249
15408 213249 345085 151185 -35698 224786 362492 296202 268791 144548 -182913 -503760
15398 -503760 -353887 64539 358339 261637 332646 388654 195002 98391 -10904 -77288
15388 -77288 -42149 95749 5291 -47230 -3719 90275 59192 78518 -147443 -322575 -60373
15377 -60373 -159828 -173529 27597 130835 148925 -10631 87823 5448 99450 228043 62580
15366 62580 -8165 -154630 -324516 -327608 -237292 -174425 32924 202561 -24004 2891 -90928
$$ packed form
15438a15878J53913j90402k37294j35648L37712P1377j14467o0954O3274J73530
15428e4837J49648j13109n6505J33254K07639j83740j68193O4433J30366j49752
15418d0796q4156l17148J74243L21022j5611k84477o9354M55278J99758j25510
15408B13249J31836j93900j86883K60484J37706o6290k7411j24243l27461l20847
15398e03760J49873M18426K93800r6702P1009N6008j93652r6611j09295o6384
15388g7288L5139J37898r0458n2521M3511R3994l1083J9326k25961j75132K62202
15377f0373r9455j3701K01126J03238J8090j59556R8454q2375R4002J28593j65463
15366F2580p0745j46465j69886l092R0316O2867K07349J69637k26565K6895r3819
$$ plain form
15355 -90928 -399996 -509295 -194563 103583 176194 89446 -3242 51157 -234332 -271744 -121699
15344 -121699 -156668 -153647 -196114 18827 177452 215896 225749 470994 439119 322871 156301
15333 156301 289510 680509 699858 570207 387410 204397 -237947 -451460 -1213 128168
15323 128168 203474 294914 282257 139616 217875 384148 209045 -34291 -171283 -205695
15313 -205695 -363440 -275658 -116944 237574 219223 -59552 -147540 -80544 -21029 91761
15303 91761 321250 393509 127167 -55100 -34642 54232 -17717 -49146 -60990 -168821 102617
15292 102617 38372 77848 291963 315998 547599 503652 168852 188797 180175 171294 388616
15281 388616 564709 355995 230202 245014 191941 373849 484821 441037 196899 -81416
$$ packed form
15355i0928l09068j09299L14732K98146P2611q6748r2688N4399k85489l7412J50045
15344a21699l4969L021m2467K14941J58625L8444R853K45245l1875j16248j66570
15333A56301J33209L90999J9349j29651j82797j83013m42344k13513M50247J29381
15323A28168P5306R1440j2657j42641P8259J66273j75103k43336j36992l4412
15313b05695j57745Q7782J58714L54518j8351k78775q7988O6996N9515J12790
15303I1761K29489P2259k66342j82267K0458Q8874p1949l1429j1844j07831K71438
15292A02617o4245L9476K14115K4035K31601m3947l34800J9945q622q881K17322
15281C88616J76093k08714j25793J4812n3073J81908J10972m3784k44138k78315
$$ plain form
15271 -81416 33198 15968 28197 92385 -289950 -318047 -203876 -324704 -490687 -154043
15261 -154043 134078 74377 15392 176643 8422 25928 225162 3838 -235764 102030
15251 102030 764 -395756 -368685 -101076 29614 -14948 -199237 26645 -24875 19067
15241 19067 -188465 -323487 -160949 132878 73775 -162554 -274617 -190670 172442 121358
15231 121358 31419 -181380 -255991 -166113 -135270 -223897 -298527 -173562 -152714 2181 -4485
15220 -4485 -42399 -171861 -305092 -372961 -213681 -336386 -308164 -333421 -150444 -148821 -113662
15209 -113662 -31771 116265 185240 149346 139301 110442 255836 222996 71300 -208135 -226286
15198 -226286 -145935 -181465 126280 263727 59214 -198400 -387957 -565677 -437627 -250612
$$ packed form
15271h1416J14614j7230J2229O4188l82335k8097J14171j20828j65983L36644
15261a54043K88121n9701n8985J61251j68221J7506J99234k21324k39602L37794
15251A02030j01266l96520K7071K67609J30690m4562j84289K25882n1520M3942
15241A9067k07532j35022J62538K93827n9103k36329j12063Q3947L63112n1084
15231A21358q9939k12799p4611Q9878L0843q8627p4630J24965K0848J54895o666
15220d485l7914j29462j33231o7869J59280j22705K8222k5257J82977J623L5159
15209a13662Q1891J48036O8975l5894j0045k8859J45394l2840j51696k79435j8151
15198b26286Q0351l5530L07745J37447k04513k57614j89557j77720J28050J87015
$$ plain form
15188 -250612 -163913 -150743 2962 168316 279860 65327 55515 1947 38900 -40452 75205
15177 75205 52176 -46968 -9539 -177741 -393636 -467617 -163531 -97872 75444 10428 -207641
15166 -207641 -104848 6349 245820 177989 86558 -255219 -539942 -473344 -302995 -438223
15156 -438223 -359745 -365827 -219703 -121273 -230518 -64455 88146 163826 607 61317 312844
15145 312844 318872 158151 173770 72512 -280734 -530593 -523045 -389745 -175537 -230197 -286624
15134 -286624 -200897 -177398 -195869 -141661 -235848 -431301 -587912 -262344 209650 453751
15124 453751 363555 183188 140564 -89495 -213645 20084 -215750 -320804 -341251 -232697
15114 -232697 -363551 -329501 -432685 -346450 -424060 -206388 -92405 -323941 -240435 -143034
$$ packed form
15188b50612Q6699J3170J53705J65354J11544k14533r812n3568L6953p9352J15657
15177G5205k3029r9144L7429j68202k15895p3981L04086O5659J73316o5016k18069
15166b07641J02793J11197K39471o7831r1431l41777k84723O6598J70349j35228
15156d38223P8478o082J46124R8430j09245J66063J52601P5680j63219O0710K51527
15145C12844O028j60721J5619j01258l53246k49859P548J33300K14208n4660n6427
15134b86624Q5727K3499j8471N4208r4187j95453j56611L25568M71994K44101
15124D53751r0196j80367m2624k30059j24150K33729k35834j05054k0447J08554
15114b32697j30854L4050j03184Q6235p7610K17672J13983k31536Q3506R7401
$$ plain form
15104 -143034 63663 231976 241579 182466 171660 -93715 -215996 -31658 188253 120207
15094 120207 198630 331249 313907 356650 545022 394455 296196 261212 106565 121305 525656
15083 525656 609863 576466 132937 -48345 46361 35323 -177700 -485798 -583038 -450049
15073 -450049 -470962 -259931 -171593 -546622 -670516 -410172 -386165 -422491 -358587 -400046 -361224
15062 -361224 -65952 195865 444444 246519 256051 218676 -118249 -158592 -113795 -55209 -2581
15051 -2581 183495 316280 -88696 -263869 56390 -26087 -115592 115657 162080 -36348
15041 -36348 17627 40205 42472 78824 67932 114659 -304016 -449846 -254506 -118000 -18845
15030 -18845 15087 244792 289647 245302 24730 -122920 -319857 -327324 -229916 6001 -38486
$$ packed form
15104a43034K06697J68313R603n9113j0806k65375j22281J84338K19911o8046
15094A20207P8423J32619j7342M2743J88372j50567r8259l4984j54647J4740M04351
15083E25656Q4207l3397m43529j81282R4706j1038k13023l08098r7240J32989
15073d50049k0913K11031Q8338l75029j23894K60344K4007l6326O3904m1459L8822
15062c61224K95272K61817K48579j97925R532l7375l36925m0343M4797N8586N2628
15051b581J86076J32785m04976j75173L20259q2477q9505K31249M6423j98428
15041c6348N3975K2578K267L6352j0892M6727m18675j45830J95340J36506R9155
15030a8845L3932K29705M4855m4345k20572j47650j96937p467R7408K35917m4487
$$ plain form
15019 -38486 -46862 -242983 -221834 -89217 -193497 97832 324061 312225 221345 104454 -132577
15008 -132577 -102674 -46484 -12880 -59057 -214702 -31685 -108723 -220349 -262947 -241790 -315188
14997 -315188 -353132 -224647 -56856 -3473 23702 -165363 -48679 198132 15776 -165948
14987 -165948 -217721 -163369 -158416 -148627 -128510 -143628 -183929 108051 78870 -118558 34750
14976 34750 -127770 -229686 -19003 90898 348594 363672 268491 136589 363066 331768
14966 331768 103668 38859 110166 56181 168509 125185 54908 -205567 -510749 -496879 -272951
14955 -272951 -115687 -274455 -368847 -141476 109992 -109994 -297788 -255408 -396161 -536722
14945 -536722 -140710 149158 102119 -12647 97230 -77784 -178684 -150325 11377 96470
$$ packed form
15019c8486q376j96121K1149J32617j04280K91329K26229j1836r0880j16891k37031
15008a32577K9903N6190L3604m6177j55645J83017p7038j11626m2598K1157p3398
14997c15188l7944J28485J67791N3383K7175j89065J16684K46811j82356j81724
14987a65948n1773N4352M953R789K0117j5118m0301K91980k9181j97428J53308
14976C4750j62520j01916K10683J09901K57696J5078r5181j31902K26477l1298
14966C31768k28100o4809P1307n3985J12328m3324p0277k60475l05182J3870K23928
14955b72951J57264j58768r4392K27371K51468k19986j87794M2380j40753j40561
14945e36722L96012K89868m7039j14766J09877j75014j00900K8359J61702Q5093
$$ plain form
14935 96470 203739 91848 -161036 -165591 -34012 34700 -68291 -18424 322619 543008
14925 543008 594457 354899 155809 53575 80438 -23945 -105318 -138448 -117360 2573
14915 2573 310375 447672 534660 333739 189328 127357 128849 -188549 -142291 -136899 -99517
14904 -99517 -38292 -200945 -221605 -123557 -191585 -410893 -351171 -282848 -161319 -74909 -208439
14893 -208439 -394321 -248541 177885 206003 87031 76091 -133128 -260649 -256398 -172638
14883 -172638 -169411 -275939 66418 198944 64170 215340 475304 124386 150292 286908
14873 286908 309581 -21655 -123095 -150518 -92155 -122991 -192493 -92711 -160620 57201 255650
14862 255650 212859 -88983 71465 303022 509842 583122 347095 258528 117350 137122
$$ packed form
14935I6470J07269j11891k52884m555J31579O8712j02991M9867L41043K20389
14925E43008N1449k39558j99090j02234K6863j04383q1373l3130K1088J19933
14915B573L07802J37297Q6988k00921j44411o1971J492l17398M6258N392L7382
14904i9517O1225j62653k0660R8048o8028k19308N9722O8323J21529Q6410j33530
14893b08439j85882J45780M26426K8118j18972j0940k09219j27521M251Q3760
14883a72638L227j06528L42357J32526j34774J51170K59964l50918K5906J36616
14873B86908K2673l31236j01440k7423N8363l0836o9502R9782o7909K17821J98449
14862B55650m2791l01842J60448K31557K06820P3280k36027q8567j41178J9772
$$ plain form
14852 137122 136070 30349 -30685 -11054 -73749 -299227 -229998 -133006 -225581 -311871 -158383
14841 -158383 -219643 -294323 -151826 -65951 -210756 -264112 -270352 -384902 -349579 -433093 -292417
14830 -292417 -305435 -164822 -246031 -262895 -220985 -186925 -268585 -280690 -65850 67363 519311
14819 519311 692441 693902 774382 642673 400638 338859 343092 167930 -11938 -147567 -109473
14808 -109473 -10990 -230183 -665189 -600227 -341174 11280 -48881 -166062 -174910 -273369 -135936
14797 -135936 -237111 -409214 -59082 307682 172694 -16158 -56738 -27798 317 -224546
14787 -224546 -27692 -2873 -86769 -330623 -453615 -376064 -404818 -393026 -213473 -122057 -156699
14776 -156699 -257922 -417780 -532029 -543891 -470111 -246315 -139638 112831 -116723 -351833
$$ packed form
14852A37122j052j05721o1034J9631o2695k25478O9229R6992r2575q6290J53488
14841a58383o1260p4680J42497Q5875j44805n3356o240j14550L5323q3514J40676
14830b92417j3018J40613q1209j6864M1910L4060q1660j2105K14840J33213M51948
14819E19311J73130J461Q0480j31709k42035o1779M233j75162j79868j35629L8094
14808a09473R8483k19193m35006O4962K59053L52454o0161j17181q848r8459J37433
14797a35936j01175j72103L50132L66764j34988j88852m0580K8940K8115k24863
14787b24546J96854K4819q3896k43854j22992P7551k8754J1792J79553R1416l4642
14776a56699j01223j59858j14249j1862P3780K23796J06677K52469k29554k35110
$$ plain form
14766 -351833 -106373 -213142 -605330 -546246 -240966 -158782 80617 126600 151890 286054
14756 286054 291743 101402 45802 316588 492608 431684 353879 144392 131015 288863 313035
14745 313035 403109 542233 401662 428857 485113 346469 18592 -98571 -283819 -427298
14735 -427298 -434441 -427578 -486708 -436944 -311476 -261488 -120612 -106486 26353 55561 183255
14724 183255 153979 318699 293358 247666 123447 8894 -77877 -315259 -277057 -18354
14714 -18354 122262 388312 406960 258320 80481 -10900 -17667 82312 34181 -157386 -73109
14703 -73109 168921 352512 320060 388757 421793 141687 -13294 88006 11478 -23225 248298
14692 248298 275432 271989 455949 319098 35472 -345339 -396934 -442898 -295183 -279113 -83756
$$ packed form
14766c51833K45460j06769l92188N9084L05280Q2184K39399M5983K5290J34164
14756B86054N689j90341n5600K70786J76020o0924p7805k09487j3377J57848K4172
14745C13035R0074J39124j40571K7195N6256j38644l27877j17163j85248j43479
14735d27298p143O863n9130M9764J25468M9988J40876J4126J32839K9208J27694
14724A83255k9276J64720k5341m5692j24219j14553q6771k37382L8202K58703
14714a8354J40616K66050J8648j48640j77839r1381o767R9979m8131j91567Q4277
14703g3109K42030J83591l2452O8697L3036k80106j54981J01300p6528l4703K71523
14692B48298K7134l443J83960j36851k83626l80811n1595m5964J47715J6070J95357
$$ plain form
14681 -83756 137931 109126 192463 236402 108302 -24897 -51526 19691 223022 193126 135249
14670 135249 24335 -48777 42794 132832 297170 132314 -12710 -64523 -183292 -120845
14660 -120845 -152886 -273656 -157752 -104650 49171 -63895 128505 116588 -91074 112435
14650 112435 302389 125420 -169298 -161435 46249 109213 258969 207107 -33227 -113215
14640 -113215 -94063 21934 69462 30939 -72920 -193035 -46077 38762 62899 40085 6998
14629 6998 185431 225997 -194821 -261944 -345476 -310585 -205252 -98282 -122034 -251791 -369657
14618 -369657 -340161 -279101 -191714 -47728 193518 10132 -228251 -191357 -225008 -279089 -549176
14607 -549176 -300676 -83006 76131 270376 282012 103576 147030 108317 76270 69069 -123798
$$ packed form
14681h3756K21687k8805Q3337M3939j28100j33199k6629P1217K03331k9896n7877
14670A35249j10914p3112R1571R0038J64338j64856j45024n1813j18769O2447
14660a20845l2041j20770J15904N3102J53821j13066J92400j1917k07662K03509
14650A12435J89954j76969k94718P863K07684O2964J49756n1862k40334p9988
14640a13215J9152J15997M7528l8523j03859j20115J46958Q4839K4137k2814l3087
14629F998J78433M0566m20818o7123q3532L4891J05333J06970k3752j29757j17866
14618c69657K9496O1060Q7387J43986K41246j83386k38383L6894l3651n4081k70087
14607e49176K48500K17670J59137J94245J1636j78436M3454l8713l2047p201j92867
$$ plain form
14596 -123798 80788 -4534 -208069 -278253 -185162 101578 401321 457116 242445 -1777
14586 -1777 49110 171381 44172 225000 476599 226216 -48961 -245180 -268790 -351325
14576 -351325 -256308 -384107 -262198 -27330 -40885 -309644 -108494 125360 232397 380047
14566 380047 418421 58470 -182614 -381561 -72249 124326 -3919 -206652 -248361 -195035
14556 -195035 15238 -148290 -278893 -406791 -411803 -433728 -357941 -383761 -303185 -302944 -281518
14545 -281518 -50664 92603 61193 -137544 -346530 -160855 -223321 -433977 -284764 -234944
14535 -234944 -149471 123974 133390 157672 376052 548173 505994 416329 396208 530607 555036
14524 555036 666473 614793 371983 82011 -264674 -341607 -287213 -207269 1935 58477
$$ packed form
14596a23798K04586q5322k03535p0184R3091K86740K99743N5795k14671k44222
14586a777N0887J22271j27209J80828K51599k50383k75177j96219k3610q2535
14576c51325R5017j27799J21909K34868j3555k68759K01150K33854J07037J47650
14566C80047L8374l59951k41084j98947L09312J96575j28245k02733m1709N3326
14556a95035K10273j63528j30603j27898n012k1925P5787k5820Q0576K41K1426
14545b81518K30854J43267l1410j98737k08986J85675o2466k10656J49213M9820
14535b34944Q5473K73445R416K4282K18380J72121m2179q9665k0121J34399K4429
14524E55036J11437n1680k42810k89972l46685p6933N4394P9944K09204N6542
$$ plain form
14514 58477 -158893 -169025 -167439 -186536 -71282 11013 38644 -238617 -207393 -208406 266690
14503 266690 455011 408335 122080 -61370 -314891 -356408 -121475 9667 -4752 88274
14493 88274 263163 230899 -43447 -139132 -182311 -96075 79837 176099 -269750 -518727 -73308
14482 -73308 262092 131506 134668 114975 101535 120069 -126802 -162777 50115 178786 277690
14471 277690 404367 590435 754398 819843 464853 22750 -138421 183281 284405 59804
14461 59804 151602 212052 -77074 -193824 -181289 -6475 199918 309280 302148 334640 -119720
14450 -119720 -280116 -220938 -55150 18285 -358382 -426285 -316352 -173529 -119727 -299303
14440 -299303 -179948 66014 62125 -49327 -244265 -189555 -233195 -215098 -97120 97013
$$ packed form
14514E8477k17370j0132J586j9097J15254Q2295K7631k77261L1224j013M75096
14503B66690J88321m6676k86255j83450k53521m1517K34933J31142j4419R3026
14493H8274J74889l2264k74346r5685m3179Q6236J75912R6262m45849k48977M45419
14482g3308L35400j30586L162j9693j3440J8534k46871l5975K12892J28671R8904
14471B77690J26677J86068J63963O5445l54990m42103j61171L21702J01124k24601
14461E9804R1798O0450k89126j16750J2535J74814K06393J09362p132L2492m54360
14450a19720j60396N9178J65788P3435l76667o7903J09933J42823N3802j79576
14440b99303J19355K45962l889j11452j94938N4710m3640J8097J17978J94133
$$ plain form
14430 97013 226447 325485 362016 302787 91115 38790 291882 215848 240808 101996 -4332
14419 -4332 189439 229952 342007 323003 99820 -160357 -197462 -129999 -37163 -159516 -54056
14408 -54056 -101587 -327309 -143109 78489 -34195 -266429 -289696 -156963 -201721 -367446
14398 -367446 -273655 85210 86915 -133928 -228741 33824 224661 -34487 -255263 -138084
14388 -138084 -153084 -106703 51426 168528 25744 6664 -45616 -136913 -136761 165398 28122
14377 28122 -21778 -185053 -331618 -21594 149619 139780 99848 -94914 -9626 47774 -139809
14366 -139809 -355102 -601236 -385591 -7981 25274 -95833 -222632 -523987 -512011 -337062
14356 -337062 -103249 -104902 -126400 -218743 -229947 -207754 -179490 -38427 87924 -39117 -69939
$$ packed form
14430I7013J29434R9038L6531n9229k11672n2325K53092p6034K4960j38812j06328
14419d332J93771M0513J12055j9004k23183k60177l7105O7463R2836j22353J05460
14408e4056m7531k25722J84200K21598j12684k32234k3267J32733m4758j65725
14398c67446R3791L58865J705k20843r4813K62565J90837k59148k20776J17179
14388a38084j5000M6381J58129J17102j42784j9080n2280r1297J52L02159j37276
14377B8122m9900j63275j46565L10024J71213r839l9932j94762Q5288N7400j87583
14366a39809k15293k46134K15645L77610L3255j21107j26799l01355J1976J74949
14356c37062K33813j653k1498r2343j1204K2193K8264J41063J26351j27041l0822
$$ plain form
14345 -69939 -189048 99109 394675 509520 625080 578240 554387 265969 42348 92497
14335 92497 27468 -35661 180029 286530 264962 208503 207043 175450 295573 111150 24806
14324 24806 -203142 96372 457055 342203 61146 97488 -25893 -174010 -168893 173931
14314 173931 359707 477730 637484 334312 66873 -206502 -453398 -282698 121187 229233
14304 229233 182827 342519 200998 -13393 59684 232187 201114 46872 -49356 -10311
14294 -10311 -53203 -53037 138362 5173 34057 289679 200494 62795 -87689 -87232 45949
14283 45949 315253 279965 34141 57186 7475 -42993 -75762 -284226 -113279 -10726 52017
14272 52017 88108 -73029 -155228 -95337 -96934 143575 400660 204273 91224 -18089 -60885
$$ packed form
14345f9939j19109K88157K95566J14845J15560m6840k3853k88418k23621N0149
14335I2497o5029o3129K15690J06501k1568n6459j460l1593J20123j84423q6344
14324B4806k27948K99514L60683j14852k81057L6342j23381j48117N117L42824
14314A73931J85776J18023J59754l03172k67439k73375k46896J70700M03885J08046
14304B29233m6406J59692j41521k14391P3077J72503l1073j54242r6228L9045
14294a0311m2892J66J91399j33189K8884K55622q9185j37699j50484M57J33181
14283D5949K69304l5288k45824K3045m9711n0468l2769k08464J70947J02553O2743
14272E2017L6091j61137q2199N9891j597K40509K57085j96387j13049j09313m2796
$$ plain form
14261 -60885 -44426 83483 173138 266772 39559 -255060 -63848 221590 437288 730349
14251 730349 699766 283419 -85055 -112629 -81584 -83427 -20400 -212058 -304549 -62496 214913
14240 214913 193569 118612 203915 216203 18961 -38577 -88176 -110921 100807 333876 487121
14229 487121 284436 193669 280431 293450 -64200 -229965 -383318 -285177 60654 5465
14219 5465 -244210 -288654 -197394 -170238 -43016 92597 300429 100772 -138038 -493311
14209 -493311 -464693 -296343 -318017 53351 204659 207232 147023 303282 258888 -56393 -171671
14198 -171671 -108504 -114552 -15962 -19250 116391 95741 75058 236985 337479 427722 122265
14187 122265 -129895 -135198 53225 156389 -91136 -120313 -17866 -92289 25329 -103263
$$ packed form
14261f0885J6459J27909Q9655R3634k27213k94619J91212K85438K15698K93061
14251G30349l0583m16347l68474k7574L1045j843O3027j91658r2491K42053K77409
14240B14913k1344p4957Q5303J2288j97242n7538m9599k2745K11728K33069J53245
14229D87121k02685r0767Q6762J3019l57650j65765j53353R8141L45831n5189
14219E465k49675m4444R1260K7156J27222J35613K07832j99657k38810l55273
14209d93311K8618J68350k1674L71368J51308K573o0209J56259m4394l15281j15278
14198a71671O3167o048R8590l288J35641k0650k0683J61927J00494R0243l05457
14187A22265k52160n303J88423J03164k47525k9177J02447p4423J17618j28592
$$ plain form
14177 -103263 -339976 -139188 94336 253324 368021 182470 61484 246851 201219 72599
14167 72599 149174 172403 168482 104146 -139885 -375523 -478281 -492000 -400932 -45477 130490
14156 130490 -108895 -199463 -122250 -51922 48012 125574 -33538 -238627 -207231 -135887 -13514
14145 -13514 98595 -29726 167566 515535 701530 411928 49777 -165596 -338851 -536606
14135 -536606 -606838 -479675 -119194 36361 48918 150915 -141026 -371904 -99371 41440
14125 41440 115464 235037 138639 86852 233372 46673 6761 472833 471357 42462 101760
14114 101760 336972 115499 -86306 -133168 77382 142609 192950 62152 -210194 -333660
14104 -333660 29251 279804 273780 94469 132465 360724 381113 584577 536463 436804 236296
$$ packed form
14177a03263k36713K00788K33524J58988J14697j85551j20986J85367m5632j28620
14167G2599P6575K3229l921o4336k44031k35638j02758j3719R1068L55455J75967
14156A30490k39385r0568P7213P0328R9934P7562j59112k05089L1396P1344J22373
14145a3514J12109j28321J97292L47969J85995k89602l62151k15373j73255j97755
14135e36606p0232J27163L60481J55555J2557J01997k91941k30878K72533J40811
14125D1440P4024J19573r6398n1787J46520j86699l9912M66072j476m28895N9298
14114A01760K35212k21473k01805m6862K10550O5227N0341j30798k72346j23466
14104c33660L62911K50553o024j79311L7996K28259K0389K03464m8114r9659k00508
$$ plain form
14093 236296 -158589 -227683 -38915 -51245 -67682 -128905 -122655 -218368 106144 254642 -100871
14082 -100871 -19472 -70288 -151011 -258512 45995 313973 197197 107011 64879 -186937
14072 -186937 -141047 -237718 -235858 28122 389403 380509 -5048 -40960 -46629 237234 135156
14061 135156 -175628 -224202 -192127 -263816 -186058 24017 54870 -145135 -347934 -550140
14051 -550140 -409274 73476 135016 112442 309044 461709 363720 313614 356006 234199
14041 234199 49246 -4545 368947 328364 238611 242900 262832 61025 -44759 -227606 -306052
14030 -306052 -148495 -341028 -423852 -264427 30392 32931 168483 -8596 -49443 147380
14020 147380 -193698 -337969 -145441 -14672 129478 235337 333176 -148596 -632279 -656627
$$ packed form
14093B36296l94885o9094J88768j2330j6437o1223O250r5713L24512J48498l55513
14082a00871Q1399n0816q0723j07501L04507K67978j16776r0186m2132k51816
14072a86937M5890r6671J860K63980L61281q894l85557l5912n669K83863j02078
14061A35156l10784m8574L2075p1689P7758K10075L0853k00005k02799k02206
14051e50140J40866M82750O1540k2574J96602J52665r7989n0106M2392j21807
14041B34199j84953n3791L73492m0583q9753M289J9932k01807j05784j82847p8446
14030c06052J57557j92533q2824J59425K94819K539J35552j77079m0847J96823
14020A47380l41078j44271J92528J30769J44150J05859R7839m81772m83683k4348
$$ plain form
14010 -656627 -384472 -101001 143662 281941 309941 289907 223132 162077 126255 191249 174887
13999 174887 440646 381507 207507 245544 410569 443711 401607 264795 297880 176281
13989 176281 198387 -77200 -95375 -205314 -67096 -86290 139950 179906 254916 332153 310473
13978 310473 109964 -19592 3493 -64622 -73122 70488 254316 273632 315526 233073 439243
13967 439243 438243 574937 300556 223224 614337 362266 316722 307149 91252 32087 188923
13956 188923 252457 28114 -150674 -11700 -116140 -210708 71048 260856 221207 459738
13946 459738 509370 402516 295541 199345 278501 19322 -241925 -221456 -311171 -486949
13936 -486949 -447186 -447468 -224368 -83521 625 -40478 -64452 -138635 -183145 -90887 148866
$$ packed form
14010f56627K72155K83471K44663J38279K8000k0034o6775o1055l5822O4994j6362
13999A74887K65759n9139j74000L8037J65025L3142m2104j36812L3085j21599
13989A76281K2106k75587j8175j09939J38218j9194K26240L9956P5010P7237k1680
13978C10473k00509j29556K3085o8115q500J43610J83828J9316M1894q2453K06170
13967D39243j000J36694k74381p7332L91113k52071m5544r573k15897n9165J56836
13956A88923O3534k24343j78788J38974j04440r4568K81756J89808l9649K38531
13946D59738M9632j06854j06975r6196P9156k59179k61247K0469q9715j75778
13936d86949L9763k82K23100J40847Q4146m1103k3974p4183m4510R2258K39753
$$ plain form
13925 148866 148326 136962 200460 146870 -11964 71809 230669 221205 85484 -37577 181604
13914 181604 169876 -50203 -118539 -320588 -44756 -27884 -211659 -184230 -276185 -381513
13904 -381513 -554623 -402657 -124162 -6803 -216717 -186746 92334 61265 -14629 59332
13894 59332 62518 125741 147525 91707 -158236 -185997 22690 18694 -291022 -7121 426356
13883 426356 431710 388531 309404 165550 -13001 -103435 -236940 -102092 -82831 -332297 -399611
13872 -399611 -276402 31954 295598 466751 379055 305045 411166 247195 123772 5020
13862 5020 -77646 10331 13958 -117154 -179097 -260953 -268589 -263617 -91679 6492 -49373 -139486
13850 -139486 -86492 -89517 -204065 -290175 9737 152093 343634 479194 378233 262901
$$ packed form
13925A48866n40j1364O3498n3590j58834Q3773J58860r464j35721j23061K19181
13914A81604j1728k20079o8336k02049K75832J6872j83775K7429r1955j05328
13904c81513j73110J51966K78495J17359k09914K9971K79080l1069p5894P3961
13894E9332L186O3223K1784n5818k49943k7761K08687l996l09716K83901M33477
13883D26356N354m3179p9127j43854j78551r0434j33505J34848J9261k49466o7314
13872c99611J23209L08356K63644J71153q7696p4010J06121j63971j23423j18752
13862E020q2666Q7977L627j31112o1943q1856p636M972J71938R8171n5865r0113
13850a39486N2994l025j14548q6110K99912J42356J91541J35560j00961j15332
$$ plain form
13840 262901 52785 4402 -287636 -263421 -203645 -160375 -184358 146853 480951 495210 306219
13829 306219 -8402 -309055 -152261 190512 23856 -67584 247380 213606 161272 116309
13819 116309 -105938 -89501 -4778 -75242 -289896 -229331 -194359 -326645 -211683 -139864 72724
13808 72724 293213 518536 275483 119690 206457 71531 -13585 187651 281319 74711
13798 74711 -52725 -110538 45601 -163476 -226155 -196167 -284148 -298421 -197945 -118990 -190227
13787 -190227 -393047 -369703 -157066 -6439 81994 240979 138445 42653 -53135 -11516
13777 -11516 132842 301161 350160 11826 30704 -20220 -203176 -416108 -231528 -232114 -47017
13766 -47017 285189 237314 132730 358564 300727 201920 283563 337931 284915 270912 -30370
$$ packed form
13840B62901k10116m8383k92038K4215N9776M3270k3983L31211L34098J4259j88991
13829C06219l14621l00653J56794L42773j66656r1440L14964l3774n2334m4963
13819A16309k22247J6437Q4723p0464k14654O0565L4972j32286J14962P1819K12588
13808G2724K20489K25323k43053j55793Q6767j34926q5116K01236R3668k06608
13798G4711j27436n7813J56139k09077o2679K9988q7981j4273J00476P8955p1237
13787a90227k02820K3344K12637J50627Q8433J58985j02534r5792r5788M1619
13777a1516J44358J68319M8999l38334J8878n0924j82956k12932J84580n86J85097
13766d7017L32206m7875j04584K25834n7837r8807Q1643N4368n3016j4003l01282
$$ plain form
13755 -30370 -149726 -150867 -177251 123775 595834 351045 103113 12232 -172585 -183454 -6041
13744 -6041 149284 149100 236726 112802 167163 126610 16159 -39461 75881 145624 148468 218895
13732 218895 254261 321347 455254 711866 620055 264246 154263 2215 -154462 -155818
13722 -155818 -120519 -359927 -344029 13156 160576 215254 296109 266150 327970 357834 282395
13711 282395 85577 -48182 6018 -169347 -424852 -255767 21409 -99972 -370268 -301222
13701 -301222 -16426 30045 9445 -78815 -6564 -29576 -246745 -242024 -14725 8691 -252446
13690 -252446 -380772 -622417 -512893 -130329 -41982 -20099 78360 140371 165581 201866 275873
13679 275873 222524 -8696 -153195 -171063 -142650 41883 34249 -19373 41070 -119837 -133633
$$ packed form
13755c0370j19356j141k6384L01026M72059k44789k47932r0881j84817j0869J77413
13744f041J55325j84Q7626j23924N4361m0553j10451n5620J15342O9743K844P0427
13732B18895L5366O7086J33907K56612r1811l55809j09983j52048j56677j356
13722a55818L5299k39408J5898L57185J47420N4678Q0855k9959O1820K9864p5439
13711B82395j96818j33759N4200j75365k55505J69085K77176j21381k70296O9046
13701c01222K84796M6471k0600q8260P2251k3012k17169M721K27299K3416k61137
13690b52446j28326k41645J09524L82564Q8347K1883R8459O2011K5210L6285P4007
13679B75873n3349k31220j44499j7868K8413J84533p634n3622O0443j60907j3796
$$ plain form
13668 -133633 -201388 -95713 375264 473041 300365 101556 44798 -58839 316246 337103
13658 337103 199254 93094 42402 63008 245842 701130 827023 541640 239604 277513
13648 277513 302064 329285 147771 -62133 9840 252509 258936 149006 52853 221399 139485
13637 139485 130122 160414 -15468 113596 307770 -47663 -178608 -316206 -297287 -44797
13627 -44797 53635 248776 162904 -109154 -156232 311296 581658 381022 258530 345879
13617 345879 281789 316938 218004 224145 205592 410263 397983 209986 104027 171395 133513
13606 133513 150054 32440 21462 146447 27805 75276 192920 227204 -123302 -266011
13596 -266011 -24746 101085 239811 -184450 -252871 -135244 101554 243366 260458 450065
$$ packed form
13668a33633o7755J05675M70977R7777j72676j98809n6758j03637L75085K0857
13658C37103j37849j06160n0692K0606J82834M55288J25893k85383l02036L7909
13648B77513K4551K7221j81514k09904P1973K42669O427j09930r6153J68546q1914
13637A39485r363L0292j75882J29064J94174l55433j30945j37598J8919K52490
13627d4797R8432J95141q5872k72058m7078M67528K70362k00636j22492Q7349
13617C45879o4090L5149r8934O141j8553K04671j2280j87997j05959O7368l7882
13606A33513J6541j17614j0978J24985j18642M7471J17644L4284l50506j42709
13596b66011K41265J25831J38726m24261o8421J17627K36798J41812J7092J89607
$$ plain form
13586 450065 511086 414728 69848 -28899 127651 307126 523969 456834 442313 257706
13576 257706 199241 389133 395633 463927 385306 341964 486439 700447 661488 660667 172963
13565 172963 -48874 31872 98498 236478 396665 361989 26710 -245662 85604 304170
13555 304170 317695 345232 237194 -43433 276082 366638 -69149 -120454 61741 511072
13545 511072 612934 517272 521644 348914 143263 96008 -110269 208000 151199 -22086
13535 -22086 257737 234221 104798 198152 471137 310720 304196 140024 -99544 -132093 -167042
13524 -167042 -46685 186418 305808 273387 231106 83696 62417 417197 448921 691283
13514 691283 718575 527212 283743 55867 49260 5393 80825 121935 122307 61556 25727
$$ packed form
13586D50065O1021r6358l44880r8747J56550J79475K16843o7135j4521j84607
13576B57706n8465J89892O500O8294p8621m3342J44475K14008l8959q21m87704
13565A72963k21837Q0746O6626J37980J60187l4676l35279k72372L31266K18566
13555C04170J3525K7537j08038k80627L19515R0556m35787n1305J82195M49331
13545E11072J01862r5662M372j72730k05651m7255k06277L18269n6801j73285
13535b2086K79823k3516j29423R3354K72985j60417o524j64172k39568l2549l4949
13524a67042J20357K33103J19390l2421m2281j47410k1279L54780L1724K42362
13514F91283K7292j91363k43469k27876o607m3867P5432M1110L72o0751l5829
$$ plain form
13503 25727 261052 439079 461677 405642 93545 21577 -24015 -134885 -21935 91969
13493 91969 -93441 56156 80447 -202017 15222 109935 242090 390395 420497 386009
13483 386009 370633 215311 179333 193377 250699 153930 -65535 136764 216906 -6205 132173
13472 132173 98300 -232329 -390177 -230616 166739 215675 401928 367571 223544 332159
13462 332159 274529 -118569 -144562 93462 385582 302576 84431 79438 248964 98502
13452 98502 102204 8155 -100128 -205841 -125805 -1904 243707 485755 281834 65691
13442 65691 -22741 37987 255034 380451 361729 66996 132966 201591 250296 669101 757622
13431 757622 274556 211254 184160 31601 -120489 -231660 -234003 26273 5242 89954 417634
$$ packed form
13503B5727K35325J78027K2598n6035l12097p1968m5592j10870J12950J13904
13493I1969j85410J49597K4291k82464K17239R4713J32155J48305L0102l4488
13483C86009j5376j55322l5978J4044N7322r6769k19465K02299Q0142k23111J38378
13472A32173l3873l30629j57848J59561L97355M8936J86253l4357j44027J08615
13462C32159n7630l93098k5993K38024K92120q3006k18145m993J69526j50462
13452I8502L702r4049j08283j05713Q0036J23901K45611K42048k03921k16143
13442F5691q8432O0728K17047J25417j8722k94733O5970O8625M8705M18805Q8521
13431G57622m83066o3302k7094j52559j52090j11171k343K60276k1031Q4712L27680
$$ plain form
13420 417634 481001 212897 320397 210304 301195 143202 126849 181039 175147 307730 277718
13409 277718 365172 1707 -237015 -125251 20776 -30164 182399 310355 155426 -21383
13399 -21383 -133356 -88139 -245782 -89785 89335 -82599 83413 219726 194209 433085
13389 433085 382968 114622 215247 262508 198805 29371 54730 152140 -68216 19082 225989
13378 225989 440188 452569 497173 262549 247242 369423 346477 67286 -44916 -69630
13368 -69630 179362 93117 176453 404874 155894 267235 271671 143307 228541 384863 395788
13357 395788 -110243 -320264 -343392 -46787 21976 99532 -112863 -275861 -156477 149009
13347 149009 215171 233983 196579 139894 35625 -3667 109876 286751 219544 341622 540381
$$ packed form
13420D17634O3367k68104J07500j10093R0891j57993j6353N4190n892J32583l0012
13409B77718Q7454l63465k38722J11764J46027n0940K12563J27956j54929j76809
13399b1383j11973M5217j57643J55997J79120j71934J66012J36313k5517K38876
13389D33085n0117k68346J00625M7261o3703j69434K5359R7410k20356Q7298K06907
13378B25989K14199J2381M4604k34624j5307J22181k2946k79191j12202k4714
13368f9630K48992q6245Q3336K28421k48980J11341M436j28364Q5234J56322J0925
13357C95788n06031k10021k3128K96605O8763P7556k12395j62998J19384L05486
13347A49009O6162J8812l7404n6685j04269l9292J13543J76875o7207J22078J98759
$$ plain form
13336 540381 571374 526693 244804 183775 87488 -160473 -473704 -523050 -388968 -75137
13326 -75137 139331 318154 223164 52411 84614 47284 -196289 -23065 6472 148705
13316 148705 180209 -43157 -127223 -170241 -222050 147221 343061 246905 135431 243708
13306 243708 269937 315764 460296 634776 623409 459618 414303 219482 -80522 -245719
13296 -245719 -196411 -5279 -62078 -176869 -70359 196155 413365 482484 306732 244495
13286 244495 145833 -65301 -97258 -120119 -147522 -223705 -292269 -245345 -5063 179935 197191
13275 197191 120784 70431 62927 168678 -67260 -64482 -329266 -493977 -457857 -242708 -99838
13264 -99838 -110678 -141947 -269008 -163306 -77798 292233 525914 514695 323191 113065
$$ packed form
13336E40381L0993m4681k81889o1029r6287k47961l13231m9346J34082L13831
13326g5137K14468J78823r4990j70753L2203l7330k43573J73224K9537J42233
13316A48705L1504k23366q4066m3018n1809L69271J95840r6156j11474J08277
13306B43708K6229M5827J44532J74480j1367j63791m5315j94821l00004j65197
13296b45719M9308J91132n6799j14791J06510K66514K17210O9119j75752o2237
13286B44495r8662k11134l1957k2861k7403p6183o8564M6924K40282J84998J7256
13275A97191p6407n0353p504J05751k35938K778k64784j64711L6120K15149J42870
13264i9838j0840l1269j27061J05702Q5508L70031K33681j1219j91504k10126
$$ plain form
13254 113065 -153704 -86336 15666 -62455 52147 529535 616007 411883 307058 291579
13244 291579 278610 14334 4466 188177 24733 -166011 -228699 215493 42131 -171043
13234 -171043 -56225 -85331 -250483 -97248 192922 251337 278762 140485 -15296 234904
13224 234904 509422 662738 624029 459893 215987 35368 303106 333691 136327 55381
13214 55381 328429 166951 147205 221187 318474 239658 64668 99983 25709 143368 37616
13203 37616 274343 463462 554428 528103 133711 -317238 -429242 -259537 -413068 -579138
13193 -579138 -444920 -512699 -401067 -434508 -305097 -202561 -99189 -135800 -102002 -187363
13183 -187363 -137750 -42571 87644 139360 274268 146712 -70593 -197470 -212208 184432
$$ packed form
13254A13065k66769O7368J02002p8121J14602M77388Q6472k04124j04825j5479
13244B91579j2969k64276r868J83711j63444j90744o2688M44192j73362k13174
13234a71043J14818k9106j65152J53235K90170N8415K7425j38277j55781K50200
13224B34904K74518J53316l8709j64136k43906j80619K67738L0585j97364q0946
13214E5381K73048j61478j9746P3982R7287p8816j74990L5315p4274J17659j05752
13203C7616K36727J89119R0966k6325l94392m50949j12004J69705j53531j66070
13193e79138J34218o7779J11632l3441J29411J02536J03372l6611L3798q5361
13183a87363M9613R5179J30215N1716J34908j27556k17305j26877j4738L96640
$$ plain form
13173 184432 333881 533832 663566 593416 463758 543515 393929 61013 148390 356938
13163 356938 297987 368909 420316 375297 206151 99248 51604 120773 13545 277313 348808
13152 348808 205289 229801 259653 444734 235097 -145024 -258250 -27490 108218 -68327
13142 -68327 -61851 -57577 -313235 -291488 -116908 -126997 245515 270790 225551 133527 285904
13131 285904 577108 548921 292702 198063 265962 119912 -117094 -299326 -207338 32372
13121 32372 237205 132082 -152610 8352 76459 -249185 -36934 -30963 291398 396608
13111 396608 340023 166756 283609 471731 244246 -103275 -349733 -571629 -657436 -654783
13101 -654783 -600714 -559990 -505896 -472406 -334337 -77997 -357449 -463946 -398716 -38644
$$ packed form
13173A84432J49449J99951J29734p0150j29658P9757j49586l32916Q7377K08548
13163C56938n8951P0922N1407m5019j69146j06903m7644O9169j07228K63768P1495
13152C48808j43519K4512K9852J85081k09637l80121j13226K30760J35708j76545
13142f8327O476M274k55658K1747J74580j0089L72512K5275m5239r2024J52377
13131B85904K91204k8187k56219r4639O7899j46050k37006j82232R1988K39710
13121C2372K04833j05123k84692J60962O8107l25644K12251N971L22361J05210
13111C96608n6585j73267J16853J88122k27485l47521k46458k21896q5807K653
13101f54783N4069M0724N4094L3490J38069K56340k79452j06497O5230L60072
$$ plain form
13091 -38644 202014 105028 140687 259054 188317 66373 -157079 -275016 -196861 -47493
13081 -47493 199164 639414 591409 471154 537445 447712 188573 183853 31371 369562 720702
13070 720702 785771 681773 469144 236854 60653 -277698 -295863 -120868 -249541 2275
13060 2275 138253 54621 204585 156201 159954 17739 105063 276768 218830 254550 258175
13049 258175 381155 463908 474807 282066 111746 165597 383913 235794 312693 183922
13039 183922 171975 77535 21367 -66528 90785 -110204 294571 398651 477935 263810
13029 263810 161843 109512 -6384 35186 182792 -35836 -227626 -228257 -81139 -60167 72795
13018 72795 150640 32920 -276573 -222342 8751 150397 413496 590444 717248 596216
$$ packed form
13091c8644K40658r6986L5659J18367p0737j21944k23452j17937P8155J49368
13081d7493K46657M40250m8005j20255O6291q9733k59139m720j52482L38191L51140
13070G20702O5069j03998k12629k32290j76201l38351j8165J74995j28673K51816
13060B275J35978q3632J49964m8384L753j42215Q7324J71705n7938L5720L625
13049B58175J22980Q2753J0899j92741j70320N3851K18316j48119P6899j28771
13039A83922j1947r4440n6168q7895J57313k00989M04775J04080P9284k14125
13029B63810j01967n2331j15896M1570J47606k18628j91790o31J47118K0972J32962
13018G2795P7845j17720l09493N4231K31093J41646K63099J76948J26804j21032
$$ plain form
13008 596216 685237 628666 471790 126815 16475 146692 306741 463278 545164 355653
12998 355653 359860 343490 -7247 44646 320712 643043 745909 459384 233817 117252
12988 117252 153603 271632 307619 446993 590970 614140 571745 433229 1563 -24720
12978 -24720 6756 56227 -100563 172317 242804 231863 406296 324926 308721 -55574 -44748
12967 -44748 38549 15664 116709 196044 -68420 -241133 -315323 -188483 -352945 -548338
12957 -548338 -544796 -356268 -318206 -179780 1334 133977 18166 -39205 -212795 -206599 -105840
12946 -105840 -65740 23510 183024 -7896 225465 446566 182825 95588 178365 362254
12936 362254 224840 162465 167272 183340 124557 72078 64771 68053 612549 816171 626700
$$ packed form
13008E96216Q9021n6571j56876l44975j10340J30217J60049J56537Q1886j89511
12998C55653M207j6370l50737N1893K76066L22331J02866k86525k25567j16565
12988A17252L6351J18029L5987J39374J43977K3170m2395j38516m31666k6283
12978b4720L1476M9471j56790K72880P0487j0941J74433q1370j6205l64295J0826
12967d4748Q3297k2885J01045P9335k64464j72713p4190J26840j64462j95393
12957e48338L542J88528L8062J38426J81114J32643j15811n7371j73590O196J00759
12946a05840M0100Q9250J59514j90920K33361K21101k63741q7237Q2777J83889
12936C62254j37414o2375M807J6068n8783n2479p307L282N44496K03622j89471
$$ plain form
12925 626700 562178 554583 386446 325745 397355 284619 340371 300900 126761 191915 76922
12914 76922 -114455 -10357 399486 409445 227468 105385 66961 208210 73254 -165247
12904 -165247 -283100 -5149 152170 242769 301797 121877 16798 155046 313366 -47327
12894 -47327 -389090 -403487 43517 227472 117858 74052 -140155 -172666 146889 489894
12884 489894 312338 111702 177986 73397 121316 295633 397175 356120 367965 345619
12874 345619 232045 281665 196794 214449 253362 14308 -163298 -140772 -76416 79985 123977
12863 123977 316754 551647 650537 538526 501036 451124 360952 388060 360274 387276 480959
12852 480959 447549 518920 314861 451729 267341 -97400 -315142 -89863 69081 128750
$$ packed form
12925F26700o4522p595j68137o0701P1610j12736N5752l9471j74139O5154j14993
12914G6922j91377J04098M09843R959j81977j22083l8424J41249j34956k38501
12904a65247j17853K77951J57319R0599N9028j79920j05079J38248J58320l60693
12894d7327l41763j4397M47004J83955j09614m3806k14207l2511L19555L43005
12884D89894j77556k00636O6284j04589M7919J74317J01542m1055J1845k2346
12874C45619j13574M9620q4871J7655L8913k39054j77606K2526O4356J56401M3992
12863A23977J92777K34893R8890j12011l7490m9912r0172K7108k7786K7002R3683
12852D80959l3410P1371k04059J36868j84388l64741k17742K25279J58944N9669
$$ plain form
12842 128750 44367 -10775 2760 -66370 -216437 -8648 188135 437040 595764 573491
12832 573491 344272 463589 485566 186702 59744 -114339 -29572 -139974 -121176 -127154
12822 -127154 30681 127573 88422 53464 6123 52877 199708 302172 205480 97892 125572
12811 125572 122966 388351 494153 388199 404289 296881 207404 323202 188770 66723
12801 66723 43181 119985 277496 435532 218848 135229 31759 -51591 10817 328361 504448
12790 504448 512131 557741 327738 215606 260220 155794 77918 -55142 -128904 -21672 125887
12779 125887 204563 189138 199017 75982 333157 444856 390799 464695 528675 314123 250504
12768 250504 162075 211641 234127 174751 113441 334038 493464 290341 101697 285198
$$ packed form
12842A28750q4383n5142J3535o9130j50067K07789J96783K48905J58724k2273
12832E73491k29219J19317K1977k98864j26958j74083Q4767j10402J8798n978
12822a27154J57835R6892l9151l4958m7341M6754J46831J02464r6692j07588K7680
12811A25572k606K65385J05802j05954J6090j07408q9477J15798j34432j22047
12801F6723k3542P6804J57511J58036k16684q3619j03470q3350O2408L17544J76087
12790E04448P683M5610k30003j12132M4614j04426p7876j33060p3762J07232J47559
12779A25887P8676j5425R879j23035K57175J11699n4057P3896O3980k14552o3619
12768B50504q8429M9566K2486n9376o1310K20597J59426k03123j88644J83501
$$ plain form
12758 285198 256942 90864 88388 -37275 -27720 -33123 107103 274948 -23463 -6955 151780
12747 151780 -180543 -401726 -69887 336387 362254 402154 231579 168330 41995 32212
12737 32212 -35701 69044 220783 335004 179974 -184627 -213834 -11834 150712 47026
12727 47026 -146192 -25892 -34715 -139230 15782 11568 -23100 287785 329354 494129 608979
12716 608979 677973 618186 401559 472694 586591 486923 283481 274335 171862 383996 356152
12705 356152 310571 311266 335765 518434 456233 360315 559080 665217 414470 64832 109684
12694 109684 185668 258556 298612 273955 563538 603406 461569 202907 -79424 188191
12684 188191 376980 277859 310351 385116 394383 536671 569039 580049 237867 53850 -46914
$$ packed form
12758B85198k8256j66078k476j25663R555n403J40226J67845k98411J6508J58735
12747A51780l32323k21183L31839M06274K5867L9900j70575o3249j26335r783
12737C2212o7913J04745J51739J14221j55030l64601k9207K02000J62546j03686
12727D7026j93218J20300q823j04515J55012m214l4668L10885M1569J64775J14850
12716F08979O8994n9787k16627P1135J13897r9668k03442r146j02473K12134k7844
12705C56152m5581O95K4499J82669o2201r5918J98765J06137k50747l49638M4852
12694A09684P5984P2888M0056k4657K89583L9868j41837k58662k82331K67615
12684A88191J88789r9121L2492P4765R267J42288L2368J1010l42182j84017j00764
$$ plain form
12673 -46914 -34368 78645 86347 302772 467854 323622 283360 244188 300367 273478 47007
12662 47007 28122 7594 159284 350433 233763 109018 351885 338144 219531 214897 428502
12651 428502 201563 -19632 160833 278285 183367 434545 728354 892825 915417 925756
12641 925756 943559 922899 636726 698934 627066 622719 767317 692653 750111 650225 560701
12630 560701 483229 476659 516837 628057 659734 491723 424806 663477 728990 720881 703437
12619 703437 755660 633222 567221 655169 615205 683958 902039 706820 710404 344009 139077
12608 139077 -16848 -13963 217258 427109 313572 342970 346131 368317 606195 435816 207990
12597 207990 184436 426059 647398 796882 609066 580840 550175 586641 573409 516653 522794
$$ packed form
12673d6914J2546J13013P702K16425J65082j44232m0262l9172N6179k6889k26471
12662D7007j8885k0528J51690J91149j16670j24745K42867j3741j18613m634K13605
12651D28502k26939k21195J80465J17452r4918K51178K93809J64471K2592J0339
12641I25756J7803k0660k86173O2208p1868m347J44598p4664N7458r9886q9524
12630E60701p7472o570M0178J11220L1677j68011o6917K38671O5513q109j7444
12619G03437N2223j22438o6001Q7948l9964O8753K18081j95219L584l66395k04932
12608A39077j55925K885K31221K09851j13537K9398L161K2186K37878j70379k27826
12597B07990k3554K41623K21339J49484j87816k8226l0665L6466j3232n6756O141
$$ plain form
12586 522794 454477 450258 430907 269295 359485 395746 276703 258289 338343 635804 415665
12575 415665 373907 533710 548203 447103 272000 187612 280605 381888 144876 -116124
12565 -116124 283958 411115 307690 296611 334669 473318 454622 130323 -5822 283915
12555 283915 345006 403485 414020 437268 302413 386447 516892 562135 626741 532533 516777
12544 516777 659353 683627 741593 661920 526602 460344 300272 17084 99188 281620
12534 281620 411761 540701 663353 705290 873562 1119486 1283605 988263 700784 544675
12524 544675 460633 304404 270384 338662 203401 289842 478249 348103 437749 647966
12514 647966 561420 251617 63009 286142 588564 430278 228366 318011 438551 580671
$$ packed form
12586E22794o8317m219j9351j61612R0190L6261j19043j8414Q0054K97461k20139
12575D15665m1758J59803J4493j01100j75103q4388R2993J01283k37012k61000
12565a16124M00082J27157j03425j1079L8058J38649j8696l24299j36145K89737
12555B83915O1091N8479J0535K3248j34855Q4034J30445M5243O4606r4208j5756
12544E16777J42576K4274N7966p9673j35318o6258j60072k83188Q2104J82432
12534B81620J30141J28940J22652M1937J68272K45924J64119k95342k87479j56109
12524E44675q4042j56229l4020O8278j35261Q6441J88407j30146Q9646K10217
12514F47966q6546l09803j88608K23133L02422j58286k01912Q9645J20540J42120
$$ plain form
12504 580671 463880 260970 422665 323297 369218 615437 821111 724914 946292 816443
12494 816443 803171 756264 690355 737643 580376 673649 684723 853445 720405 829131 967507
12483 967507 1090831 1119327 1131447 1109211 808539 733327 617455 463234 422359 817494
12473 817494 1077613 958845 853514 937613 1016273 971044 743905 466655 279010 221069
12463 221069 230142 222215 152325 208520 331621 563733 542623 423179 236159 -75295 182634
12452 182634 248507 188243 434863 612317 657980 804136 456679 343234 490609 594123
12442 594123 624822 853992 1066645 1023796 1232986 1151686 1253356 1066633 826560 902826
12432 902826 1022229 760239 585044 530752 599690 436269 674741 1079741 974917 887102
$$ packed form
12504E80671j16791k02910J61695r9368M5921K46219K05674r6197K21378j29849
12494H16443j3272m6907o5909M7288j57267R3273J1074J68722j33040J08726J38376
12483I67507J23324K8496J2120k2236l00672p5212j15872j54221m0875L95135
12473H17494K60119j18768j05331Q4099P8660m5229k27139k77250j87645n7941
12463B21069R073p927o9890N6195J23101K32112k1110j19444j87020l11454K57929
12452A82634O5873o0264K46620J77454M5663J46156l47457j13445J47375J03514
12442E94123L0699K29170K12653m2849K09190q1300J01670j86723k40073P6266
12432I02826J19403k61990j75195n4292O8938j63421K38472M05000j04824q7815
$$ plain form
12422 887102 777334 578948 714790 924851 942191 740888 802810 892650 1020481 1173407
12412 1173407 1059946 762416 667609 694232 717800 950395 951457 647802 525314 644851
12402 644851 912030 1045192 891280 901875 1047975 987639 713090 737003 934615 928426
12392 928426 885266 888956 934604 807326 918783 959531 676274 615464 573504 660547 937641
12381 937641 835738 850850 1018269 1112490 1045740 947360 884722 778069 963371 1151652
12371 1151652 1380542 1044718 1025717 1107560 1055429 1129479 986354 1046979 919336 1090382
12361 1090382 1035671 765810 684505 785261 1112210 1205695 1095816 1020966 935705 927360 995951
12350 995951 1036254 1020401 1135233 1120696 1062655 907543 767285 722241 822509 898521 1111219
$$ packed form
12422H87102j09768j98386J35842K10061J7340k01303O1922Q9840J27831J52926
12412A173407j13461k97530r4807K6623K3568K32595J062l03655j22488J19537
12402F44851K67179J33162j53912J0595J46100o0336k74549K3913J97612o189
12392I28426m3160L690M5648j27278J11457M0748k83257o0810m1960Q7043K77094
12381I37641j01903J5112J67419R4221o6750r8380o2638j06653J85302J88281
12371A151652K28890l35824j9001Q1843n2131P4050j43125O0625j27643J71046
12361A090382n4711k69861q1305J00756L26949R3485j09879p4850q5261q345O8591
12350I95951M0303j5853J14832j4537n8041j55112j40258m5044J00268P6012K12698
$$ plain form
12339 1111219 1114050 887048 825024 629778 967161 1211533 1206145 1143655 1091965 784196 702904
12328 702904 1040600 1254189 1508527 1508911 1274493 1133593 820638 527713 622955 1180281
12318 1180281 1377521 1511163 1166394 955495 843125 1033662 999861 919184 1202543 1501674
12308 1501674 1229066 942389 1065365 1196393 1189638 1181432 1309327 1477664 1585006 1351827
12298 1351827 1404986 1488934 1096257 809762 913362 1101820 1277976 1409334 1545560 1664208
12288 1664208 1648475 1702375 1878307 1824614 1665412 1704625 1819157 2000215 1850520 1646181
12278 1646181 1620739 1459782 1520190 1395879 1271891 1445080 1389058 1384316 1430592 1341650 1230469
12267 1230469 1239493 1329191 1248699 1433091 1389389 1579274 1627778 1394524 1495974 1678861
$$ packed form
12339A111219K831k27002o2024j95246L37383K44372n388o2490n1690l07769q1292
12328G02904L37696K13589K54338L84k34418j40900l12955k92925R5242N57326
12318A180281J97240J33642l44769k10899j12370J90537l3801q0677K83359K99131
12308A501674k72608k86677J22976J31028o755q206J27895J68337J07342k33179
12298A351827N3159Q3948l92677k86495J03600J88458J76156J31358J36226J18648
12288A664208j5733N3900J75932n3693j59202L9213J14532J81058j49695k04339
12278A646181k5442j60957O0408j24311j23988J73189n6022m742M6276q8942j11181
12267A230469R024Q9698q0492J84392m3702J89885M8504k33254J01450J82887
$$ plain form
12257 1678861 1785041 1846528 1655814 1276875 1262334 1416965 1565612 1603436 1443653 1399136
12247 1399136 1508420 1501110 1592055 1471411 1577043 1600789 1448494 1390186 1517763 1734014
12237 1734014 1926902 1875559 1682378 1589154 1526840 2031398 2117340 1766737 1713048 2005730
12227 2005730 1999475 2044915 2436981 2624331 2255216 1705469 1479618 1920923 2326115 2386120
12217 2386120 2236484 1977792 1703944 1722909 1747694 1742242 1886670 2255999 2354501 2409470
12207 2409470 2563442 2483404 2437172 2354833 2054024 1942463 2031771 2287171 2496121 2602746
12197 2602746 2627873 2819284 2741210 2401146 2487661 2464457 2176925 2248669 2387967 2428356
12187 2428356 2478072 2734153 2676606 2802400 2981820 2876234 2829398 2617763 2429383 2366314
$$ packed form
12257A678861J06180O1487j90714l78939j4541J54631J48647L7824j59783m4517
12247A399136J09284p310R0945j20644J05632K3746j52295n8308J27577K16251
12237A734014J92888n1343j93181r3224o2314N04558Q5942l50603n3689K92682
12227B005730o255M5440L92066J87350l69115n49747k25851M41305M05192O0005
12217B386120j49636k58692k73848J8965K4785n452J44428L69329R8502N4969
12207B409470J53972q0038m6232q2339l00809j11561Q9308K55400K08950J06625
12197B602746K5127J91411p8074l40064Q6515k3204k87532P1744J39298M0389
12187B428356M9716K56081n7547J25794J79420j05586m6836k11635j88380o3069
$$ plain form
12177 2366314 2443224 2415907 2419167 2200564 2272338 2276973 2396508 2483575 2469677 2674114 2462581
12166 2462581 2149121 2557119 2950219 3009469 2696229 2487209 2560331 2955673 3133943 3034840
12156 3034840 3114675 3225867 3295481 3175130 3271875 3121110 2871234 2813776 3126114 3266476
12146 3266476 3742934 3781011 3680861 3560835 3483148 3141759 3218571 3486440 3599962 3639555
12136 3639555 3609643 3628398 3610894 3581190 3579837 3816974 3851184 4061830 4113763 4118345 4040001
12125 4040001 4066778 4220405 4226260 4173508 4031209 3875838 3715292 3887490 3972394 4468974
12115 4468974 4670565 4906780 4774686 4653477 4693699 4885818 4974950 5074065 4990422 4964934
12105 4964934 4807494 4865564 5154431 5342641 5285928 5316546 5387913 5311777 5343864 5648328
$$ packed form
12177B366314P6910k7317L260k18603P1774M635J19535Q7067j3898K04437k11533
12166B462581l13460M07998L93100N9250l13240k09020P3122L95342J78270r9103
12156C034840P9835J11192O9614j20351R6745j50765k49876n7458L12338J40362
12146C266476M76458L8077j00150j20026p7687l41389P6812K67869J13522L9593
12136C639555k9912J8755j7504k9704j353K37137L4210K10646N1933M582p8344
12125D040001K6777J53627N855n2752j42299j55371j60546J72198Q4904M96580
12115D468974K01591K36215j32094j21209M0222J92119Q9132R9115q3643k5488
12105D964934j57440N8070K88867J88210n6713L0618P1367p6136L2087L04464
$$ plain form
12095 5648328 5653959 5644432 5779050 5882274 6131150 6148668 6129916 6183826 6198602 6200689 6113581
12084 6113581 6302357 6288229 6215340 6374890 6631518 6864523 7207421 7362432 7151852 7237256
12074 7237256 7284361 7374430 7672374 7783389 7768861 7805864 8003428 7949789 8023952 8099496 8318775
12063 8318775 8333563 8361552 8450279 8316670 8161056 8258693 8384722 8584645 9084153 9323417
12053 9323417 9336469 9297407 9252019 9447402 9308546 9254454 9575740 9588688 9697389 9995153
12043 9995153 10085685 10132175 10319056 10857282 11176893 11062574 10869663 10964999 11166789 11279186
12033 11279186 11700854 11883260 11798473 11682221 11907296 12211255 12106235 11976751 12230273
12024 12230273 12420775 12419059 12788489 13028358 13371272 13599753 13937637 14320645 14479743 14747072
$$ packed form
12095E648328N631r527J34618J03224K48876J7518j8752N3910J4776K087q7108
12084F113581J88776j4128p2889J59550K56628K33005L42898J55011k10580Q5404
12074G237256M7105R0069K97944J11015j4528L7003J97564n3639P4163P5544K19279
12063H318775J4788K7989Q8727j33609j55614R7637J26029J99923M99508K39264
12053I323417J3052l9062m5388J95383j38856n4092L21286J2948J08701K97764
12043I995153R0532M6490J86881N38226L19611j14319j92911R5336K01790J12397
12033A1279186M21668J82406q4787j16252K25075L03959j05020j29484K53522
12024A2230273J90502j716L69430K39869L42914K28481L37884L83008J59098K67329
$$ plain form
12014 14747072 15170327 15351571 15101617 15220798 16111236 16537327 16749213 16725531 16813454 17219749
12004 17219749 17495418 17915387 18383430 18909767 19346424 19593730 19891463 20497144 21134577
11995 21134577 21451135 21693615 21907262 22204958 22736578 23458929 23799138 24292460 24902410
11986 24902410 25613861 26146182 26942066 27585035 27861739 28331851 28869680 29566247 30402015
11977 30402015 31221561 31978502 32704909 33721595 34763812 35767184 36637647 37449578 38348655
11968 38348655 39351285 40506689 41941956 43217847 44271253 45430635 46836760 48334064
11960 48334064 49594846 50890978 52455413 54059986 55709344 57332493 58944447 60943280
11952 60943280 62968132 64913198 67016147 69219119 71796303 74519717 77020274 79854490
$$ packed form
12014A4747072M23255J81244k49954J19181Q90438M26091K11886k3682Q7923M06295
12004A7219749K75669M19969M68043N26337M36657K47306K97733O05681O37433
11995B1134577L16558K42480K13647K97696N31620P22351L40209M93322O09950
11986B4902410P11451N32321P95884O42969K76704M70112N37829O96567Q35768
11977C0402015Q19546P56941P26407J016686J042217J003372Q70463Q11931Q99077
11968C8348655J002630J155404J435267J275891J053406J159382J406125J497304
11960D8334064J260782J296132J564435J604573J649358J623149J611954J998833
11952F0943280K024852J945066K102949K202972K577184K723414K500557K834216
$$ plain form
11944 79854490 82744071 85596651 88717260 92064725 95366929 98667298 102491320 106404184
11936 106404184 110446537 114645556 119005727 123818783 128503575 133143587 138332880 143661576
11928 143661576 149125297 155249626 160937584 166812688 172727213 178955748 185578564 191959118
11920 191959118 198123917 204720844 211220315 217571754 223535387 229695384 235211475 240210710
11912 240210710 245193028 249968108 254198929 258209178 261354393 263747977 265478900 266566366
11904 266566366 266882633 266445962 265444944 263819936 261566387 259031614 255865143 251873924
11896 251873924 247621742 242890773 237699626 232401089 227183169 221609627 215531153 209442043
11888 209442043 203235899 197538458 191790926 185862415 179601233 173849537 168331419 162693219
$$ packed form
11944G9854490K889581K852580L120609L347465L302204L300369L824022L912864
11936A06404184M042353M199019M360171M813056M684792M640012N189293N328696
11928A43661576N463721O124329N687958N875104N914525O228535O622816O380554
11920A91959118O164799O596927O499471O351439N963633O159997N516091M999235
11912B40210710M982318M775080M230821M010249L145215K393584J730923J087466
11904B66566366L16267m36671j001018j625008k253549k534773l166471l991219
11896B51873924m252182m730969n191147n298537n217920n573542o078474o089110
11888B09442043o206144n697441n747532n928511o261182n751696n518118n638200
$$ plain form
11880 162693219 157348373 151891378 146709077 142036235 137555078 133048346 128576716 124161396
11872 124161396 119844652 115874609 111979981 107901468 104342191 101104880 97995652 95068985
11864 95068985 92000775 89256112 86616771 83942767 81179252 78561100 76277410 74079114
11856 74079114 71733713 69346871 67507954 65506484 63435411 61851454 60222490 58598658
11848 58598658 56759287 55178226 53687723 52227706 50700667 49296475 47961774 46737757
11840 46737757 45792116 44901414 43688124 42636656 41430977 40393618 39536021 38479960
11832 38479960 37675576 36773643 35752692 35143070 34671127 33988267 32978011 31980431 31096656
11823 31096656 30609611 30350029 29870605 29168812 28464565 27785835 26978971 26593548 26340267
$$ packed form
11880A62693219n344846n456995n182301m672842m481157m506732m471630m415320
11872A24161396m316744l970043l894628m078513l559277l237311l109228k926667
11864I5068985l068210k744663k639341k674004k763515k618152k283690k198296
11856G4079114k345401k386842j838917k001470k071073j583957j628964j623832
11848E8598658j839371j581061j490503j460017j527039j404192j334701j224017
11840D6737757r45641q90702j213290j051468j205679j037359q57597j056061
11832C8479960q04384r01933j020951o09622m71943o82860j010256r97580q83775
11823C1096656m87045k59582m79424p01793p04247o78730q06864l85423k53281
$$ plain form
11814 26340267 25664429 25002379 24433713 23945001 23423662 23016436 22988861 22412855 21859040
11805 21859040 21441942 21078291 20977478 20765039 20196282 19659148 19210902 18658890 18408066
11796 18408066 18459514 18424883 17921941 17723863 17715203 17235779 16683645 16575249 16413041 15765067
11786 15765067 15236832 14953619 14879433 14897036 14836786 14568204 14505314 14191732 13920766 13756640
11776 13756640 13672344 13636891 13253960 12788276 12662052 12578270 12384221 12148687 12167302 12049256
11766 12049256 12026789 11842134 11809936 11660864 11221141 11155705 10824999 10688282 10688921 10731110
11756 10731110 10653952 10389364 10548170 10877033 10898499 10540904 10170392 9941997 9891985 9787113
11746 9787113 9384125 9110478 9027931 9216083 9358552 9242689 9129335 9107659 9073111 9102237
$$ packed form
11814B6340267o75838o62050n68666m88712n21339m07226k7575n76006n53815
11805B1859040m17098l63651j00813k12439n68757n37134m48246n52012k50824
11796A8408066N1448l4631n02942j98078q660m79424n52134j08396j62208o47974
11786A5765067n28235k83213p4186J7603o0250k68582o2890l13582k70966j64126
11776A3756640q4296l5453l82931m65684j26224q3782j94049k35534J8615j18046
11766A2049256k2467j84655l2198j49072m39723o5436l30706j36717O39M2189
11756A0731110p7158k64588J58806L28863K1466l57595l70512k28395n0012j04872
11746I787113m02988k73647q2547J88152J42469j15863j13354k1676l4548K9126
$$ plain form
11736 9102237 8986060 8758554 8916574 8834779 8796871 9083789 9301300 9144139 9008375 8994818
11726 8994818 9144889 9043852 9020861 9321570 9339856 9342254 9554190 9875348 9817275 9923922
11716 9923922 10001992 10276020 10609407 10725742 11000945 11134241 11421352 11588927 11925978 12226959
11706 12226959 12542644 13035838 13934993 14968125 15794875 16642122 17813088 19326630 20919892
11697 20919892 22768435 24443199 26329798 28685183 31469805 34446266 37864220 41732702
11689 41732702 46267909 51272910 56991053 63502615 70947355 79181980 87847538 96942326
11681 96942326 105931857 114606404 122414975 128403989 132665367 135455782 136481151 136131030
11673 136131030 134612250 132342699 129811148 127215732 125264057 123881082 122671305 121931398
$$ packed form
11736I102237j16177k27506J58020q1795l7908K86918K17511j57161j35764j3557
11726H994818J50071j01037k2991L00709J8286K398K11936L21158n8073J06647
11716I923922P8070K74028L33387J16335K75203J33296K87111J67575L37051L00981
11706A2226959L15685M93194Q99155J033132Q26750Q47247J170966J513542J593262
11697B0919892J848543J674764J886599K355385K784622K976461L417954L868482
11689D1732702M535207N005001N718143O511562P444740Q234625Q665558R094788
11681I6942326Q989531Q674547P808571N989014M261378K790415J025369l50121
11673A36131030j518780k269551k531551k595416j951675j382975j209777p39907
$$ plain form
11665 121931398 122072933 123231823 125097043 127760888 131049934 135055769 139737375 144919186
11657 144919186 150916238 157216174 163751783 170219646 176684050 182494199 187750942 192515782
11649 192515782 196103681 198521380 199985447 200599614 199798241 197916444 195288488 192000575
11641 192000575 187580480 183175138 178317365 172999271 167402181 161853637 156042878 149978206
11633 149978206 143822913 137776608 132279489 127388389 123417025 120233982 117551517 115620952
11625 115620952 114251053 113677081 113991230 115210548 117207647 120301534 124496076 129607452
11617 129607452 135653862 142190680 148915072 155107818 160110240 163546842 164833822 163113879
11609 163113879 157856640 149707507 139268663 127282258 114672330 102227862 90912144
$$ packed form
11665A21931398J41535J158890J865220K663845L289046M005835M681606N181811
11657A44919186N997052O299936O535609O467863O464404N810149N256743M764840
11649A92515782L587899K417699J464067O14167q01373j881797k627956l287913
11641A92000575m420095m405342m857773n318094n597090n548544n810759o064672
11633A49978206o155293o046305n497119m891100l971364l183043k682465j930565
11625A15620952j369899n73972L14149J219318J997099L093887M194542N111376
11617A29607452O046410O536818O724392O192746N002422L436602J286980j719943
11609A63113879n257239q149133j0438844j1986405j2609928j2444468j1315718
$$ plain form
11602 90912144 80841168 72020871 64273848 57789332 52481874 47817242 43645411 40177037
11594 40177037 37037589 34331894 32016555 29925569 27733149 25832916 23841788 22181635
11586 22181635 20635459 19574402 18392302 17224554 16179432 15442661 15094210 14686885
11578 14686885 14067928 13451736 12841298 12382220 12137902 11851658 11178599 10766487 10210686
11569 10210686 9694931 9401028 9314112 9190315 8820273 8212708 7916471 7961498 7683430 7344348
11559 7344348 7197837 6931423 6681408 6720381 6737493 6544815 6364334 6506290 6156258 6016296
11549 6016296 5857500 5514933 5269434 5373058 5410557 5227210 5206342 5153629 4711006 4565517
11539 4565517 4689260 4607626 4409447 4374034 4669667 4839614 4724906 4483158 4533480 4345233
$$ packed form
11602I0912144j0070976q820297p747023o484516n307458m664632m171831l468374
11594D0177037l139448k705695k315339k090986k192420j900233j991128j660153
11586B2181635j546176j061057j182100j167748j045122p36771l48451m07325
11578A4686885o18957o16192o10438m59078k44318k86244o73059m12112n55801
11569A0210686n15755k93903q6916j23797l70042o07565k96237M5027k78068l39082
11559G344348j46511k66414k50015L8973J7112j92678j80481J41956l50032j39962
11549F016296j58796l42567k45499J03624L7499j83347k0868n2713m42623j45489
11539D565517J23743q1634j98179l5413K95633J69947j14708k41748N0322j88247
$$ plain form
11529 4345233 4177113 4088573 3921258 3698709 3501117 3543665 3659457 3775028 3757878 3646067
11519 3646067 3457320 3403430 3203287 3077842 2932446 2929355 2690072 2678013 2790188 2928409
11509 2928409 2909950 2965766 2951498 2862053 2954970 2888526 2767424 2601399 2524292 2542383 2740348
11498 2740348 2740903 2758590 2632442 2395579 2289786 2745533 3077814 2958307 2734937 2450177
11488 2450177 2139073 2286368 2596892 2587977 2745393 2826455 2892688 2942573 2666089 2479893
11478 2479893 2494720 2501717 2703314 2631208 2312210 2224585 2214365 2106151 1701736 1627548 1917736
11467 1917736 2033746 1907597 1858284 2092998 2333888 2240000 1845087 1642029 1647335 1640775
11457 1640775 1538809 1508139 1399620 1269373 1406250 1496133 1572114 1431681 1365168 1409210
$$ packed form
11529D345233j68120q8540j67315k22549j97592M2548J15792J15571j7150j11811
11519C646067j88747n3890k00143j25445j45396l091k39283j2059J12175J38221
11509B928409j8459N5816j4268q9445R2917o6444j21102j66025p7107J8091J97965
11498B740348N55J7687j26148k36863j05793M55747L32281j19507k23370k84760
11488B450177l11104J47295L10524q915J57416Q1062O6233M9885k76484j86196
11478B479893J4827O997K01597p2106l18998q7625j0220j08214m04415p4188K90188
11467A917736J16010j26149m9313K34714K40890r3888l94913k03058N306o560
11457A640775j01966l0670j08519j30247J36877Q9883P5981j40433o6513M4042
$$ plain form
11447 1409210 1383158 1308689 1096045 1128579 1052842 1082371 1090429 1177902 1250371 1167643 1301792
11436 1301792 1025111 582942 749061 1209192 1173595 1030578 1379359 1506870 1269411 1137519
11426 1137519 1051030 1047549 1185824 1471974 1657485 1711150 1824202 1811867 1715458 1678733 1673530
11415 1673530 1553303 1405678 1384019 1206865 1270585 1326174 1473059 1650301 1567253 1353044
11405 1353044 1302833 1042850 1066958 1183511 1271352 1367960 1269706 977647 715387 671909
11395 671909 972591 1053671 1049841 983791 749272 776111 915785 774981 800997 944742 974394
11384 974394 871661 964734 1130191 1145023 1111927 964181 851872 700698 823334 782926
11374 782926 568428 419811 342528 417138 558816 707671 642479 757812 607648 508350
$$ packed form
11447A409210k6052p4469k12644L2534p5737K9529Q058Q7473P2469q2728J34149
11436A301792k76681m42169J66119M60131l5597j43017L48781J27511k37459j31892
11426A137519q6489l481J38275K86150J85511N3665J13052j2335r6409l6725n203
11415A673530j20227j47625k1659j77154O3720N5589J46885J77242q3048k14209
11405A353044n0211k59983K4108J16553Q7841R6608r8254k92059k62260m3478
11395F71909L00682Q1080l830o6050k34519K6839J39674j40804K6016J43745K9652
11384I74394j02733R3073J65457J4832l3096j47746j12309j51174J22636m0408
11374G82926k14498j48617p7283P4610J41678J48855o5192J15333j50164r9298
$$ plain form
11364 508350 261877 220238 391260 504745 455400 451340 473506 711591 950009 1145654
11354 1145654 1113650 788073 707959 879298 706668 491709 644098 944837 1071632 889166
11344 889166 822709 1026132 1082860 820440 587969 625918 780994 874759 861137 828585 652362
11333 652362 777778 740841 562829 577683 503777 445948 643031 541257 637407 803909
11323 803909 987367 919224 886884 864654 963205 1035071 838953 605739 631976 581498 511080
11312 511080 480812 714725 991322 1068666 751757 713022 714609 687010 696688 708638 671085
11301 671085 646247 734434 491277 530184 512865 707217 576017 571910 580715 242938 17
11290 17 125213 193819 301915 386753 457658 719076 778805 797580 892752 772649 666868
$$ packed form
11364E08350k46473m1639J71022J13485m9345m060K2166K38085K38418J95645
11354A145654l2004l25577q0114J71339j72630k14959J52389L00739J26795j82466
11344H89166o6457K03423N6728k62420k32471L7949J55076R3765j3622l2552j76223
11333F52362J25416l6937j78012J4854p3906n7829J97083j01774R6150J66502
11323H03909J83458o8143l2340k2230R8551P1866j96118k33214K6237n0478p0418
11312E11080l0268K33913K76597P7344l16909l8735J587k7599R678J1950l7553
11301F71085k4838Q8187k43157L8907j7319J94352j31200m107Q805l37777k42921
11290A7J25196O8606J08096Q4838P0905K61418N9729J8775R5172j20103j05781
$$ plain form
11279 666868 760048 631668 688279 559949 543456 669873 763233 582883 623983 478686
11269 478686 576868 863633 788480 639951 769256 911155 659187 485352 455899 624121
11259 624121 936311 930771 947322 906450 929168 1107002 1327998 1256832 1021606 1292818 1352515
11248 1352515 1464776 1361105 1158430 1045700 977989 1153066 1357661 1201703 1051078 1070554
11238 1070554 1200855 1122233 1089925 1183468 1271955 1183677 1196862 1188960 1184499 1120698 1012186
11227 1012186 1026976 1279347 1369959 1238718 1217161 1349520 1348012 1335183 1406334 1266290 1170306
11216 1170306 1132231 1458988 1564679 1294067 1470259 1235348 1224539 1242125 1437105 1422785
11206 1422785 1248438 1145888 1016809 1094660 1204862 1063688 919364 814314 899596 1013685
$$ packed form
11279F66868R3180j28380N6611j28330j6493J26417R3360j80350M1100j45297
11269D78686R8182K86765p5153j48529J29305J41899k51968j73835k9453J68222
11259F24121L12190n540J6551m0872K2718J77834K20996p1166k35226K71212N9697
11248A352515J12261j03671k02675j12730o7711J75077K04595j55958j50625J9476
11238A070554J30301p8622l2308R3543Q8487q8278J3185p902m461o3801j08512
11227A012186J4790K52371R0612j31241k1557J32359j508j2829P1151j40044r5984
11216A170306l8075L26757J05691k70612J76192k34911j0809J7586J94980j4320
11206A422785j74347j02550j29079P7851J10202j41174j44324j05050Q5282J14089
$$ plain form
11196 1013685 947337 1135347 1114799 1008389 1052951 1238105 1275434 1308248 1334567 1305537 1019829
11185 1019829 810684 1008421 1442574 1496307 1474925 1412862 1200782 1078614 852282 981709
11175 981709 1083159 1040598 1049928 998422 874647 770690 598079 469940 668396 805545
11165 805545 984992 996000 1066562 900226 657051 814779 804229 595987 560796 506231
11155 506231 342692 177389 197208 69136 202424 470981 512787 701073 741122 629721
11145 629721 321593 175136 -43882 -42363 23633 207527 299806 63957 -33225 -128477 -112871
11134 -112871 95136 301877 456637 495716 177139 -135548 -36874 240869 396494 477718
11124 477718 500027 471220 308896 190366 515029 379271 292307 297068 126162 328865
$$ packed form
11196A013685o6348J88010k0548j06410M4562J85154L7329L2814K6319k9030k85708
11185A019829k09145J97737M34153N3733k1382o2063k12080j22168k26332J29427
11175I81709J01450m2561R330n1506j23775j03957j72611j28139J98456J37149
11165H05545J79447J1008P0562j66336k43175J57728j0550k08242l5191n4565
11155E06231j63539j65303J9819j28072J33288K68557M1806J88286M0049j11401
11145F29721l08128j46457k19018J519O5996J83894R2279k35849r7182r5252J5606
11134a12871K08007K06741J54760L9079l18577l12687R8674K77743J55625Q1224
11124D77718K2309k8807j62324j18530L24663j35758q6964M761j70906K02703
$$ plain form
11114 328865 254416 30633 155643 140828 144895 -74145 -109940 -134373 -185928 141924 257383
11103 257383 379738 299624 311581 206078 380403 587852 710296 647887 622469 339739
11093 339739 295462 296203 333219 611687 633189 445454 425494 367742 231640 39179 121386
11082 121386 180911 308846 393496 300471 -46464 -121943 47061 110822 223244 185614 124157
11071 124157 372107 531127 236302 -145984 -8631 165919 197394 121988 -44446 -310135
11061 -310135 -30897 -30500 26809 147487 362200 829882 809726 633103 568287 575128 371357
11050 371357 362586 242160 506902 646242 569084 849779 1037016 953220 941643 1081483
11040 1081483 951433 921109 988679 1186872 1185332 1243326 1371499 1610188 1679472 1863892
$$ packed form
11114C28865p4449k23783J25010j4815M067k19040l5795k4433n1555L27852J15459
11103B57383J22355q0114J1957j05503J74325K07449J22444o2409k5418k82730
11093C39739m4277P41L7016K78468K1502j87735j9960n7752j36102j92461Q2207
11082A21386N9525J27935Q4650r3025l46935p5479J69004O3761J12422l7630o1457
11071A24157K47950J59020k94825l82286J37353J74550L1475p5406j66434k65689
11061c10135K79238L97N7309J20678K14713M67682k0156j76623o4816O841k03771
11050C71357q771j20426K64742J39340p7158K80695J87237q3796j1577J39840
11040A081483j30050l0324O7570J98193j540N7994J28173K38689O9284J84420
$$ plain form
11030 1863892 2132913 1998462 1950011 1844560 1633850 1512541 1481358 1587830 1760411 2136825
11020 2136825 2259409 2036307 1910708 2070354 1990727 1885473 1666051 1646994 1583047 1418489
11010 1418489 1363810 1702807 2064475 2116582 1849876 1651456 1604502 1152828 753510 563940
11000 563940 914127 920891 928680 1014735 912108 589058 370492 551323 807882 757022 603287
10989 603287 658075 692269 717282 818173 498705 374223 327118 252547 230353 273651 82229
10978 82229 -13404 40148 213444 49929 175906 294934 257937 192992 399584 542392
10968 542392 270718 226239 179910 -33790 -213878 -339139 -183959 -15305 317332 521545
10958 521545 544659 190467 -136378 -210224 36863 264324 355460 244794 153381 462969
$$ packed form
11030A863892K69021j34451m8451j05451k10710j21309l1183J06472J72581L76414
11020B136825J22584k23102j25599J59646p9627j05254k19422j9057o3947j64558
11010A418489n4679L38997L61668N2107k66706j98420m6954m51674l99318j89570
11000E63940L50187O764P789Q6055j02627l23050k18566J80831K56559n0860j53735
10989F03287N4788L4194K5013J00891l19468j24482m7105p4571k2194M3298j91422
10978H2229r5633N3552J73296j63515J25977J19028l6997o4945K06592J42808
10968E42392k71674m4479m6329k13700j80088j25261J55180J68654L32637K04213
10958E21545K3114l54192l26845p3846K47087K27461R1136j10666r1413L09588
$$ plain form
10948 462969 403209 370554 386650 309355 428726 522369 544691 648296 545393 219127 387185
10937 387185 518298 576199 537437 437043 359045 -4799 -339610 -400122 -466679 -299202
10927 -299202 -222028 -198715 -113906 238924 78519 20263 210117 30427 48708 152520
10917 152520 -73329 -422233 -273819 -140898 -193643 -103710 230330 312333 224155 241891
10907 241891 306957 82854 115765 278477 164447 -33345 -111655 -55181 126948 100917
10897 100917 106653 289982 98683 222845 303738 165120 -89921 46441 -21651 -80656
10887 -80656 -87853 -359179 -239037 -271501 -187641 -119089 115293 214802 122139 139953 74764
10876 74764 120130 158058 647152 827615 728856 801606 722847 427162 442948 592967 405491
$$ packed form
10948D62969n9760l2655J6096p7295J19371R3643K2322J03605j02903l26266J68058
10937C87185J31113N7901l8762j00394p7998l63844l34811o0512o6557J67477
10927b99202P7174K3313Q4809L52830j60405n8256J89854j79690J8281J03812
10917A52520k25849l48904J48414J32921n2745Q9933L34040Q2003q8178J7736
10907B41891O5066k24103L2911J62712j14030j97792p8310N6474J82129k6031
10897A00917N736J83329j91299J24162Q0893j38618k55041J36362o8092n9005
10887h0656p197k71326J20142l2464Q3860O8552K34382R9509r2663J7814o5189
10876G4764M5366L7928M89094J80463r8759P2750p8759k95685J5786J50019j87476
$$ plain form
10865 405491 105938 209641 376264 648230 594362 808171 847655 516582 727290 673898
10855 673898 258355 185051 293691 232103 -52709 -386564 -402308 -196533 -390472 -301203
10845 -301203 -270099 -101473 -91918 51455 77981 140850 35477 -80198 -192506 -91091
10835 -91091 127346 397282 331312 -138843 -331202 77026 229319 377954 115580 20388
10825 20388 68701 -8792 -171144 -186156 -25418 55290 89405 136681 237824 -27890 -105099
10814 -105099 91659 227782 417719 400103 312586 -4581 -74563 4541 39674 -76148
10804 -76148 20884 99652 186785 195117 333757 337058 129737 266521 405247 132230 -163332
10793 -163332 -92416 -93246 -300456 -175265 -105965 -58503 -146894 -147447 61873 119983 154665 272821
$$ packed form
10865D05491k99553J03703J66623K71966n3868K13809L9484l31073K10708n3392
10855F73898m15543p3304J08640o1588k84812l33855j5744K05775j93939Q9269
10845c01203L1104J68626R555J43373K6526O2869j05373j15675j12308J01415
10835i1091K18437K69936o5970m70155j92359M08228J52293J48635k62374r5192
10825B0388M8313p7493j62352j5012J60738Q0708L4115M7276J01143k65714p7209
10814a05099J96758J36123J89937j7616q7517l17167o9982P9104L5133j15822
10804g6148R7032P8768Q7133Q332J38640L301k07321J36784J38726k73017k95562
10793a63332P0916q30k07210J25191O9300M7462q8391n53K09320N8110L4682J18156
$$ plain form
10781 272821 479814 596563 447429 429399 316657 239920 260055 331914 298543 349795 451362
10770 451362 536015 466732 368557 440890 573254 574657 289323 124497 186510 330131 178021
10759 178021 212653 253051 10369 -17075 81394 93960 351449 398383 633370 716416 433142
10748 433142 203922 224742 50559 65884 260767 193610 50331 -265275 -294197 -354210
10738 -354210 -219239 435014 766844 582607 375092 337263 284047 216085 354419 368962
10728 368962 404287 498652 452519 431860 287801 9405 -251360 104356 84936 274606
10718 274606 278800 98817 -39335 58611 97956 138937 180516 -13682 257376 585681 511635
10707 511635 304673 484696 453977 313657 270863 290404 184195 340138 636265 850030
$$ packed form
10781B72821K06993J16749j49134j8030j12742p6737K0135P1859l3371N1252J01567
10770D51362Q4653o9283r8175P2333J32364J403k85334j64826O2013J43621j52110
10759A78021L4632M0398k42682k7444R8469J2566K57489M6934K34987Q3046k83274
10748D33142k29220K0820j74183J5325J94883o7157j43279l15606k8922o0013
10738c54210J34971O54253L31830j84237k07515l7829n3216o7962J38334J4543
10728C68962L5325R4365m6133k0659j44059k78396k60765L55716j9420J89670
10718B74606M194j79983j38152R7946L9345M0981M1579j94198K71058L28305p4046
10707E11635k06962J80023l0719j40320m2794J9541j06209J55943K96127K13765
$$ plain form
10697 850030 839122 734414 816849 850156 855049 1043353 906544 660237 229034 114328
10687 114328 231547 493878 577938 734420 915359 724818 627179 362396 256168 391503
10677 391503 598555 883231 1079945 1032753 741271 567037 646859 743755 708380 762839
10667 762839 521303 468687 451381 620322 640044 471426 534986 690776 715906 934658
10657 934658 932923 754775 891430 1258108 1497576 1732512 1688573 1749200 1717486 1852626
10647 1852626 1762429 1683503 1757553 2050332 2308728 2531816 2675104 2814852 3017441 3193903
10637 3193903 3522776 4284170 4644880 5259465 6253081 7361921 8274324 9168319 10428344
10628 10428344 11834527 13364882 15754204 18489804 21637077 25621339 30800430 37130328
$$ packed form
10697H50030j0908j04708Q2435L3307M893J88304j36809k46307m31203j14706
10687A14328J17219K62331Q4060J56482J80939j90541r7639k64783j06228J35335
10677C91503K07052K84676J96714m7192k91482j74234P9822R6896l5375N4459
10667G62839k41536n2616j7306J68941J9722j68618O3560J55790K5130K18752
10657I34658j735j78148J36655L66678K39468K34936m3939O0627l1714J35140
10647A852626r0197p8926P4050K92779K58396K23088J43288J39748K02589J76462
10637C193903L28873P61394L60710O14585R93616J108840R12403Q93995J260025
10628A0428344J406183J530355K389322K735600L147273L984262N179091O329898
$$ plain form
10620 37130328 45159571 55292998 68060424 82548286 97377122 111455099 124004122
10613 124004122 133894371 140190128 143268674 145297024 148673429 155864990 168671307 187422353
10605 187422353 210784734 235447069 258707403 277489982 289116749 291820740 286361590
10598 286361590 276574247 268902207 268878947 278785026 297923568 323452852 350226927 373162468
10590 373162468 388253157 392136184 381584046 357971826 327848566 299959560 280571426
10583 280571426 271839094 272346934 278705515 286486780 292652752 293761200 287051703 271169603
10575 271169603 247234339 220094753 195438020 176774257 164578648 157819171 155101273
10568 155101273 153233521 150447808 145838518 137609958 125876566 111108801 95092396
$$ packed form
10620C7130328Q029243J0133427J2767426J4487862J4828836J4077977J2549023
10613A24004122R890249O295757L078546K028350L376405P191561J2806317J8751046
10605A87422353K3362381K4662335K3260334J8782579J1626767K703991n459150
10598B86361590r787343p672040k3260R906079J9138542K5529284K6774075K2935541
10590C73162468J5090689L883027j0552138k3612220l0123260k7889006j9388134
10583B80571426q732332N07840O358581P781265O165972J108448o709497j5882100
10575B71169603k3935264k7139586k4656733j8663763j2195609o759477k717898
10568A55101273j867752k785713m609290q228560j1733392j4767765j6016405
$$ plain form
10561 95092396 79927245 67345115 57012076 48848943 42753853 38239891 34608620 31376545
10553 31376545 28630206 26459245 24713262 22947408 21045833 19546488 18195114 17143119
10545 17143119 16334611 15288515 14452027 13990144 13659863 13225553 12575184 11851763 10989676
10536 10989676 10274620 9886380 9628487 9305941 9001198 8669550 8314565 8020351 7613782
10527 7613782 7291735 7060005 7026484 7086719 6934397 6681355 6089017 5646417 5465632 5619824
10517 5619824 5613025 5463241 5046525 4931472 4880335 4736488 4725280 4587960 4580995 4304062
10507 4304062 3822165 3841214 3728334 3558693 3385482 3445854 3401395 3246659 3054991 2929769
10497 2929769 2783276 2712924 2590603 2735392 2760079 2903848 2546803 2370664 2436196 2435960
$$ packed form
10561I5092396j5165151j2582130j0333039q163133o095090m513962l631271l232075
10553C1376545k746339k170961j745983j765854j901575j499345j351374j051995
10545A7143119q08508j046096q36488m61883l30281m34310o50369p23421q62087
10536A0989676p15056l88240k57893l22546l04743l31648l54985k94214m06569
10527G613782l22047k31730l3521O0235j52322k53042n92338m42600j80785J54192
10517E619824o799j49784m16716j15053n1137j43847j1208j37320o965k76933
10507D304062m81897J9049j12880j69641j73211O0372m4459j54736j91668j25222
10497B929769j46493p0352j22321J44789K4687J43769l57045j76139O5532k36
$$ plain form
10487 2435960 2328186 2391956 2107937 2011585 2137141 2093273 1852332 1882874 1745879 1762709
10477 1762709 1675286 1705809 1761305 1804328 1759917 1921226 1701496 1534592 1847624 1908448
10467 1908448 1381011 1212399 1175665 1179103 1319079 1383680 1464245 1428448 1448447 1428919 1409641
10456 1409641 1362298 1341072 1028921 897529 867812 950199 1137407 1296917 1335984 1146844
10446 1146844 976305 959451 1023694 1011204 719479 898096 1165731 1014205 858060 783095
10436 783095 790852 884350 799539 801893 715589 873134 867654 761037 624226 882343 736064
10425 736064 760624 883161 712411 517913 535060 858814 1118867 891205 638152 775562
10415 775562 815511 577815 454832 346270 316399 549381 482585 506336 532189 279228
$$ packed form
10487B435960j07774O3770k84019r6352J25556m3868k40941L0542j36995J6830
10477A762709q7423L0523N5496M3023m4411J61309k19730j66904L13032O0824
10467A908448n27437j68612l6734L438J39976O4601Q0565l5797J9999j9528j9278
10456A409641m7343k1226l12151j31392k9717Q2387J87208J59510L9067j89140
10446A146844j70539j6854O4243j2490k91725J78617K67635j51526j56145p4965
10436G83095P757R3498q4811K354q6304J57545n480j06617j36811K58117j46279
10425G36064K4560J22537j70750j94498J7147L23754K60053k27662k53053J37410
10415G75562L9949k37696j22983j08562k9871K32982o6796K3751K5853k52961
$$ plain form
10405 279228 174379 256230 270660 186949 42750 137221 470050 927740 832189 608034
10395 608034 531726 284593 582207 462860 410044 541132 194689 250174 568091 833591
10385 833591 1001881 879949 642465 478785 585261 577786 606175 249278 -1136 -32592
10375 -32592 107646 417902 457287 513441 334317 205808 604284 499779 197626 96505
10365 96505 243885 413232 209830 65432 446079 529700 380530 454987 491711 389939
10355 389939 541132 679518 683654 740524 725629 603284 253337 229003 331827 222074
10345 222074 243400 341470 330155 374898 444419 353406 151622 401260 371402 413450 288414
10334 288414 259418 86125 234297 136726 325512 206447 274354 622226 460691 229485
$$ packed form
10405B79228j04849Q1851J4430q3711j44199R4471L32829M57690r5551k24155
10395F08034p6308k47133K97614j19347n2816J31088l46443N5485L17917K65500
10385H33591J68290j21932k37484j63680J06476p475K8389l56897k50414l1456
10375c2592J40238L10256L9385N6154j79124j28509L98476j04505l02153j01121
10365I6505J47380J69347k03402j44398L80647Q3621j49170P4457L6724j01772
10355C89939J51193J38386M136N6870j4895j22345l49947k4334J02824j09753
10345B22074K1326R8070j1315M4743O9521r1013k01784K49638k9858M2048j25036
10334B88414k8996j73293J48172r7571J88786j19065O7907L47872j61535k31206
$$ plain form
10324 229485 141240 122379 190463 255396 373971 159956 -64816 -153003 -34123 67826
10314 67826 335713 229867 380130 322333 198376 281290 414779 392665 247602 110185
10304 110185 239445 340691 531456 532217 318577 450483 390211 261119 357785 209166
10294 209166 32369 -136145 -324432 -276517 -91068 -157289 -293449 -279411 124080 101250
10284 101250 50533 209058 145910 151486 -80550 -441121 -564075 -362936 -275523 -219528 -77853
10273 -77853 249172 460594 783054 957722 619370 255189 378914 282984 -2140 111614
10263 111614 228446 222909 81992 5642 -132205 -68757 143804 63309 19759 -54254 277702
10252 277702 377100 359721 163477 52363 46461 148734 -195072 -138078 57946 112262 -141288
$$ packed form
10324B29485q8245j8861O8084O4933J18575k14015k24772q8187J18880J01949
10314F7826K67887j05846J50263n7797j23957Q2914J33489k2114j45063j37417
10304A10185J29260J01246J90765P61k13640J31906o0272j29092R6666j48619
10294B09166j76797j68514j88287M7915J85449o6221j36160J4038M03491k2830
10284A01250n0717J58525o3148N576k32036l60571j22954K01139Q7413N5995J41675
10273g7853L27025K11422L22460J74668l38352l64181J23725r5930k85124J13754
10263A11614J16832n537j40917p6350j37847O3448K12561q0495m3550p4013L31956
10252B77702R9398j7379j96244j11114n902J02273l43806N6994J96024N4316k53550
$$ plain form
10241 -141288 -47869 11449 -84378 -16162 -101112 -283214 98583 189552 234739 323641 429632
10230 429632 377541 413003 585177 388968 508705 611842 723885 555530 334728 84724
10220 84724 -17700 151554 63257 -241549 -538468 -634752 -424372 -66902 146249 133688
10210 133688 -220714 -377041 -446817 -309406 18837 -23204 118931 271875 260883 -186470
10200 -186470 -254620 86120 193423 9793 36347 -35974 176682 558426 450915 108018
10190 108018 123918 180032 314502 546170 308759 280576 500731 556602 802016 643876
10180 643876 467084 591085 724721 858684 983530 959233 943843 1086326 988455 650121
10170 650121 531510 824506 1157023 1597548 1797352 1819322 1901577 1798708 1584138 1305857
$$ packed form
10241a41288R3419N9318r5827O8216q4950j82102L81797R0969M5187Q8902J05991
10230D29632n2091L5462J72174j96209J19737J03137J12043j68355k20802k50004
10220H4724j02424J69254q8297l04806k96919r6284K10380L57470K13151j2561
10210A33688l54402j56327o9776J37411L28243m2041J42135J52944j0992m47353
10200a86470o8150L40740J07303j83630K6554p2321K12656L81744j07511l42897
10190A08018J5900N6114J34470K31668k37411k8183K20155N5871K45414j58140
10180F43876j76792J24001J33636J33963J24846k4297j5390J42483r7871l38334
10170F50121j18611K92996L32517M40525J99804K1970Q2255j02869k14570k78281
$$ plain form
10160 1305857 1544970 1542540 1527772 1664930 1945902 2318972 2272662 2170730 1867108 1621846
10150 1621846 1564407 1669217 1621164 1759786 1600841 1530466 1558352 1402890 1383507 1418167
10140 1418167 1353363 1046062 937323 1027038 859328 697073 707475 749106 776452 716701
10130 716701 657118 924182 1062587 690396 431997 101091 143239 75309 218891 352120
10120 352120 228814 235429 463427 376028 536226 439823 83845 137152 3162 43121 -80782
10109 -80782 34139 51229 -107057 -92459 -126508 -178069 -440147 -302982 -180326 -99212 -90790
10098 -90790 -363855 -234324 -116239 -196879 64069 250599 237197 125548 56419 32116
10088 32116 -196585 -138877 74880 -150019 -166564 -10856 151406 87103 144036 58719 -149854
$$ packed form
10160A305857K39113k430j4768J37158K80972L73070m6310j01932l03622k45262
10150A621846n7439J04810m8053J38622j58945p0375K7886j55462j9383L4660
10140A418167o4804l07301j08739Q9715j67710j62255J0402M1631K7346n9751
10130G16701n9583K67064J38405l72191k58399l30906M2148o7930J43582J33229
10120C52120j23306O615K27998q7399J60198r6403l55978N3307j33990L9959j23903
10109h0782J14921J7090j58286J4598l4049n1561k62078J37165J22656Q1114Q422
10098i0790k73065J29531J18085q0640K60948J86530j3402j11649o9129k4303
10088C2116k28701N7708K13757k24899j6545J55708J62262o4303N6933q5317k08573
$$ plain form
10077 -149854 -246659 -368237 -208170 -277088 -326311 -506183 -466922 -168584 -124732 -28418 -80913
10066 -80913 -254445 -150272 120516 142125 70386 5766 -143687 -147055 -379180 -454453 -90287
10055 -90287 -63752 -182259 -147223 -6418 116315 172144 531057 219440 -337070 -372633
10045 -372633 -228561 -138047 -83005 -11342 67675 209958 361386 342674 232653 66480
10035 66480 -17167 -146754 -241394 -272058 -381474 -171528 75474 -28935 -219765 -250059
10025 -250059 -205562 22346 -11110 28339 40104 -141505 -50729 183392 221403 113226 191822
10014 191822 175395 119150 80562 5261 73934 -17958 -67028 -158605 34487 -126009 -161043
10003 -161043 -2723 -344075 -505995 -394321 -349554 -220359 -102543 -77540 -220631 -344838
$$ packed form
10077a49854r6805j21578J60067o8918m9223j79872L9261K98338M3852R6314n2495
10066h0913j73532J04173K70788K1609p1739o4620j49453l368k32125p5273L64166
10055i0287K6535j18507L5036J40805J22733N5829L58913l11617n56510l5563
10045c72633J44072R0514N5042P1663P9017J42283J51428j8712j10021j66173
10035F6480q3647j29587r4640l0664j09416K09946K47002j04409j90830l0294
10025b50059M4497K27908l3456L9449J1765j81609R0776K34121L8011j08177P8596
10014A91822j6427n6245l8588p5301O8673r1892m9070r1577J93092j60496l5034
10003a61043J58320l41352j61920J11674M4767J29195J17816K5003j43091j24207
$$ plain form
9993 -344838 -347775 -155577 -75135 -86839 -127607 -202646 -109997 13287 12773 -79336 -171775 -156378
9981 -156378 -104248 -63197 -144998 -282994 -300184 -37851 -41383 -334193 -435014 -308078 -246975
9970 -246975 -137448 -132862 -437138 -430720 -338158 -231572 18541 75373 188108 61702 81773
9959 81773 102387 31722 85805 -44380 -130357 33982 131519 253961 -39624 4043 58770
9948 58770 22359 292985 355398 451746 407438 205085 108824 225247 153778 106811 -137357
9937 -137357 -76141 -69646 -150230 -12622 84578 346007 563655 601625 559351 374029 13955
9926 13955 -216028 -46752 -123840 -210396 -197415 -198130 -232038 -200302 -45489 63874 389
9915 389 -139097 -101411 -304784 -92864 104783 173158 77892 73518 50999 1394 140053
$$ packed form
9993c44838k937J92198Q0442j1704m0768p5039R2649J23284n14r2109r2439J5397
9981a56378N2130M1051q1801j37996j7190K62333l532k92810j00821J26936O1103
9970b46975J09527M586l04276O418R2562J06586K50113N6832J12735j26406K0071
9959H1773K0614p0665N4083j30185q5977J64339R7537J22442k93585M3667N4727
9948E8770l6411K70626O2413R6348m4308k02353r6261J16423p1469m6967k44168
9937a37357O1216O495q0584J37608R7200K61429K17648L7970m2274j85322l60074
9926A3955k29983J69276p7088q6556J2981p15l3908L1736J54813J09363o3485
9915C89j39486L7686k03373K11920J97647O8375r5266m374k2519m9605J38659
$$ plain form
9904 140053 332471 106923 -81961 2236 8499 87170 -82227 -30889 231554 -26119 141786
9893 141786 385307 365744 219869 -21041 47227 2112 88003 227248 399827 280775
9883 280775 230219 201338 94922 -10961 -213602 -504882 -477483 -283098 -21387 70025
9873 70025 -66527 -45027 -352741 -439479 -668130 -809869 -759301 -675681 -356381 -173925 -282381
9862 -282381 -245104 -477900 -471463 -322628 -73541 130158 24823 -106481 -174972 -230010 -216005
9851 -216005 -210762 197958 422208 220029 92990 36792 -296816 -474311 -449093 -282455
9841 -282455 -55060 250749 267834 212118 -67208 212632 496155 534477 629200 371923
9831 371923 -87450 -16270 341006 442511 287681 -25335 -63225 14056 322917 450230
$$ packed form
9904A40053J92418k25548j88884Q4197O263P8671j69397N1338K62443k57673J67905
9893A41786K43521j9563j45875k40910O8268m5115Q5891J39245J72579j19052
9883B80775n0556k8881j06416j05883k02641k91280K7399J94385K61711R1412
9873G0025j36552K1500l07714q6738k28651j41739N0568Q3620L19300J82456j08456
9862b82381L7277k32796O437J48835K49087K03699j05335j31304o8491n5038J4005
9851b16005N243M08720K24250k02179j27039n6198l33608j77495K5218J66638
9841b82455K27395L05809J7085n5716k79326K79840K83523L8322R4723k57277
9831C71923m59373P1180L57276J01505j54830l13016l7890P7281L08861J27313
$$ plain form
9821 450230 277372 95764 -34870 88708 -58538 -320405 -230604 -30773 135350 34969
9811 34969 -105110 -13767 38004 30695 -193494 -292279 -186783 -280151 -184589 17585 259189
9800 259189 423900 161605 -146461 -303957 -115863 46438 146034 73679 18594 76845
9790 76845 75326 -144709 -80383 64938 108617 119559 -32918 -88860 -193563 -102589 -22940
9779 -22940 308978 409783 279589 267926 415040 467209 399851 478633 525806 429467 46749
9768 46749 -371942 -240124 -190084 -200018 -195501 -520034 -547145 -297013 -105048 -104828 -25941 -163021
9756 -163021 -94993 -69192 74029 172314 364077 288290 -316 -258434 -422307 -471131 -560461
9745 -560461 -361872 -16759 -87289 -93217 106277 202601 144703 358449 294473 94003 78029
$$ packed form
9821D50230j72858j81608j30634J23578j47246k61867Q9801J99831J66123j00381
9811C4969j40079R1343N1771p309k24189r8785J05496r3368R5562K02174K41604
9800B59189J64711k62295l08066j57496J88094J62301R9596p2355n5085N8251
9790G6845j519k20035O4326J45321M3679J0942j52477n5942j04703R0974P9649
9779b2940L31918J00805j30194j1663J47114N2169o7358P8782M7173r6339l82718
9768D6749m18691J31818N0040r934M517l24533k7111K50132J91965K20P8887j37080
9756a63021O8028K5801J43221R8285J91763p5787k88606k58118j63873m8824q9330
9745e60461J98589L45113p0530n928J99494R6324n7898K13746o3976k00470j5974
$$ plain form
9734 78029 -149557 -204615 28947 -309780 -358774 -224326 -268154 -294883 -223517 -161586 76983
9723 76983 98289 109544 221903 148863 31368 173223 364826 324385 152167 268500 162674
9712 162674 -10823 147899 140349 -194334 -431897 -427983 -29261 -50671 4465 -66958 -368426
9701 -368426 -209706 21968 319822 103186 -105033 -164288 -110428 -80301 274338 171553
9691 171553 128821 -109357 -111893 -102822 -498989 -426177 -302770 -314960 -356131 -145380 130672
9680 130672 175197 79906 -10577 97706 321975 198107 86963 -41877 205863 241203
9670 241203 76507 -110493 -48273 283128 502084 542509 98401 -169540 -125682 -3389
9660 -3389 103817 343693 426015 717591 789421 1056617 1132937 1248682 1797566 2041954 1988634
$$ packed form
9734G8029k27586n5058K33562l38727m8994J34448m3828k6729P1366O1931K38569
9723G6983K1306J1255J12359p3040j17495J41855J91603m0441j72218J16333j05826
9712A62674j73497J58722p550l34683k37563L914L98722k1410N5136p1423l01468
9701c68426J58720K31674K97854k16636k08219n9255N3860L0127L54639j02785
9691A71553m2732k38178k536R071l96167P2812J23407j2190m1171K10751K76052
9680A30672M4525r5291r0483J08283K24269j23868j11144j28840K47740L5340
9670B41203j64696j87000O2220L31401K18956M0425m44108k67941M3858J22293
9660c389J07206K39876Q2322K91576P1830K67196P6320J15745N48884K44388n3320
$$ plain form
9649 1988634 1826696 1547181 1141595 925633 715375 500563 536986 316894 278165 432423
9639 432423 299575 255929 522815 813325 747102 647779 644622 593537 690713 725700 984478
9628 984478 890278 668150 454261 490515 505453 554634 819377 1075409 953005 623001
9618 623001 656913 590553 500793 431375 523471 21051 -291900 77362 112217 180372 577407
9607 577407 708736 444493 519071 420764 206214 264697 296135 528674 669753 475934
9597 475934 401092 510473 677546 651750 583687 762501 781379 754338 589879 615106 888776
9586 888776 1042998 797306 658338 830242 634692 554329 469849 473201 631066 694005 780104
9575 780104 874144 790535 798808 683257 440386 460095 674214 589938 464095 465172 469582
$$ packed form
9649A988634j61938k79515m05586k15962k10258k14812L6423k20092l8729J54258
9639D32423j32848m3646K66886K90510o6223r9323l157n1085R7176L4987K58778
9628I84478r4200k22128k13889L6254J4938M9181K64743K56032j22404l30004
9618F23001L3912o6360q9760o9418R2096n02420l12951L69262L4855O8155L97035
9607E77407J31329k64243P4578r8307k14550N8483L1438K32539J41079j93819
9597D75934p4842J09381J67073k5796o8063J78814J8878k7041j64459K5227K73670
9586H88776J54222k45692j38968J71904j95550q0363q4480L352J57865O2939Q6099
9575G80104R4040q3609Q273j15551k42871J9709K14119q4276j25843J077M410
$$ plain form
9564 469582 230189 -59070 -76264 80541 353085 416430 324196 301254 294606 365966 593624
9553 593624 775087 927943 787068 596480 617908 762080 658387 371215 304784 116727
9543 116727 101115 206284 429731 218831 -78804 225614 369873 772021 582696 452364
9533 452364 276397 121966 245288 -29550 73250 347721 724204 907013 648554 576806
9523 576806 735970 729175 683897 549396 416850 328014 279023 550148 542884 393612 403914
9512 403914 186745 176251 422856 480717 305344 99932 131879 150675 82813 421092 440627
9501 440627 262316 317042 461214 375197 336878 182204 262825 473003 470656 380488 215387
9490 215387 378107 509387 525461 424388 249782 184700 75111 272716 361917 58238
$$ packed form
9564D69582k39393k89259j7194J56805K72544O3345r2234k2942o648P1360K27658
9553E93624J81463J52856j40875j90588K1428J44172j03693k87172o6431j88057
9543A16727j5612J05169K23447k10900k97635L04418J44259M02148j89325j30332
9533D52364j75967j54431J23322k74838J02800K74471L76483J82809k58459p1748
9523E76806J59164o795m5278j34501j32546q8836m8991K71125p264j49272J0302
9512D03914k17169j0494K46605N7861j75373k05412L1947J8796o7862L38279J9535
9501D40627j78311N4726J44172q6017l8319j54674Q0621K10178k347r0168j65101
9490B15387J62720J31280J6074j01073j74606o5082j09589J97605Q9201l03679
$$ plain form
9480 58238 299889 734262 550722 298364 205767 298167 364415 673294 778718 758386 500756
9469 500756 160169 95078 151037 212830 187188 321239 414936 492844 399994 702746 809247
9458 809247 860443 942094 745140 650510 261734 86003 45037 37662 160452 308290 362614
9447 362614 351497 358606 378862 211548 -16412 -230139 -112863 -119523 -273101 83659 188839
9436 188839 145952 107813 450114 654217 431037 139921 144857 277018 180146 188600 169114
9425 169114 200335 189651 62716 136338 183258 437308 418831 278832 286705 261839 63899
9414 63899 -26732 107035 143149 43304 203679 226651 334361 283031 371724 413333 423900
9403 423900 836477 848685 508577 312972 296260 188049 481909 405097 468387 671015
$$ packed form
9480E8238K41651M34373j83540k52358r2597R2400O6248L08879J05424k0332k57630
9469E00756l40587o5091N5959O1793k5642J34051R3697P7908r2850L02752J06501
9458H09247N1196Q1651j96954r4630l88776j75731m0966p375J22790J47838N4324
9447C62614j1117P109K0256j67314k27960k13727J17276o660j53578L56760J05180
9436A88839m2887l8139L42301K04103k23180k91116M936J32161r6872Q454j9486
9425A69114L1221j0684j26935P3622M6920K54050j8477j39999P873k4866j97940
9414F3899r0631J33767L6114r9845J60375K2972J07710n1330Q8693M1609J0567
9403D23900M12577J2208l40108j95605j6712j08211K93860p6812O3290K02628
$$ plain form
9393 671015 607841 377352 306242 498641 464366 181498 -27217 66643 278370 252862 414875
9382 414875 431903 283922 359040 297611 188298 7969 125299 182421 281005 550011 779029
9371 779029 630441 174299 107911 130637 107478 223490 144843 240597 238699 378443 393143
9360 393143 153149 80537 403950 544830 915424 940563 639406 558423 427120 375104
9350 375104 377891 499146 663200 637120 811781 925680 846245 899544 887134 698550 676182
9339 676182 687399 527715 600901 842627 916828 781730 623645 519665 496382 453082 416106
9328 416106 435063 772010 828173 700488 816226 958083 923917 1136607 943318 520539
9318 520539 530956 366308 613029 1062646 1078290 850284 898990 997993 1268561 1417381
$$ packed form
9393F71015o3174k30489p1110J92399l4275k82868k08715R3860K11727k5508J62013
9382D14875J7028j47981P5118o1429j09313j80329J17330N7122R8584K69006K29018
9371G79029j48588m56142o6388K2726k3159J16012p8647R5754j898J39744J4700
9360C93143k39994p2612L23413J40880L70594K5139l01157q0983j31303n2016
9350C75104K787J21255J64054k6080J74661J13899p9435N3299j2410j88584k2368
9339F76182J1217j59684P3186K41726P4201j35098j58085j03980k3283m3300l6976
9328D16106J8957L36947N6163j27685J15738J41857l4166K12690j93289m22779
9318E20539J0417j64648K46721M49617J5644k28006M8706R9003K70568J48820
$$ plain form
9308 1417381 1177319 876182 866343 968470 1104301 1031410 952049 938112 1002199 1360124 1614198
9297 1614198 1729565 1974389 2031941 2005498 1792374 1854664 2063176 2371734 2464681 2592328
9287 2592328 2843736 3303553 3907829 4317428 4383634 4751532 5620747 6455665 7103342 7630941
9277 7630941 8307737 8997779 9584469 10333579 11313608 12435634 13596058 14626170 15808201
9268 15808201 16854303 17564166 18402223 19525468 20483869 21632191 22517949 23560622 24134011
9259 24134011 24518562 24897372 25359308 25573486 25547492 25772624 26185844 26527721 27150996 27900112
9249 27900112 28726736 29520840 30653751 31762130 32760663 34120455 35525038 36814450 38611919
9240 38611919 40838027 42878571 45180169 47597017 50246986 53123061 55931282 58650635
$$ packed form
9308A417381k40062l01137r839J02127J35831p2891p9361j3937O4087L57925K54074
9297A614198J15367K44824N7552k6443k13124O2290K08512L08558R2947J27647
9287B592328K51408M59817O04276M09599O6206L67898Q69215Q34918O47677N27599
9277G630941O76796O90042N86690P49110R80029J122026J160424J030112J182031
9268A5808201J046102P09863Q38057J123245R58401J148322Q85758J042673N73389
9259B4134011L84551L78810M61936K14178k5994K25132M13220L41877O23275P49116
9249B7900112Q26624P94104J132911J108379R98533J359792J404583J289412J797469
9240C8611919K226108K040544K301598K416848K649969K876075K808221K719353
$$ plain form
9232 58650635 61293699 63459431 65525029 67542139 69431775 71043479 71993092 72741681
9224 72741681 73641316 74657110 75247602 75612083 75873227 76219291 76618225 77203791 77733921
9215 77733921 78540425 79107047 79606420 80424412 81118112 81944690 83392576 85159476 87111164
9206 87111164 89337401 91931928 94920443 98152944 101853313 105729400 109532644 113196074
9198 113196074 116761897 119885234 122454409 124558063 125968240 126499130 126402689 126092556 125330922
9189 125330922 124317046 123195094 122174419 121263238 120578270 120042792 119847812 119837864 120076384
9180 120076384 120594733 121191757 121735781 122122454 122546464 122833702 123147229 123359771 123437677
9171 123437677 123405127 123451067 123700699 123933350 124169677 124559410 124945056 125749046 126712460 127423613
$$ packed form
9232E8650635K643064K165732K065598K017110J889636J611704R49613P48589
9224G2741681Q99635J015794N90492L64481K61144L46064L98934N85566N30130
9215G7733921Q06504N66622M99373Q17992O93700Q26578J447886J766900J951688
9206H7111164K226237K594527K988515L232501L700369L876087L803244L663430
9198A13196074L565823L123337K569175K103654J410177N30890r6441l10133p61634
9189A25330922j013876j121952j020675r11181o84968n35478j94980r948K38520
9180A20076384N18349N97024N44024L86673M24010K87238L13527K12542P7906
9171A23437677l2550M5940K49632K32651K36327L89733L85646Q03990R63414P11153
$$ plain form
9161 127423613 128217761 129236571 129605775 129702131 129214517 128726181 128189586 127272650 126342706
9152 126342706 125085322 123446548 121932634 120609791 119203608 117980911 116241307 114285887
9144 114285887 112310104 110528748 109303175 108710429 108266812 108228184 108509397 109128443 110246874
9135 110246874 111534690 113097416 114833146 116231452 117275651 118206586 119471564 120234248
9127 120234248 120792779 121112384 121364584 121036188 120132200 118970298 117688860 116151413 114518106
9118 114518106 112711337 110410508 108163461 105994310 103731851 101103290 98766092 96377408
9110 96377408 93686210 90707824 87704182 84779331 82085429 79768355 77707406 76099659
9102 76099659 74694715 73979580 73740836 73800713 74345743 74787111 75113349 75348394 75293688 75102996
$$ packed form
9161A27423613P94148J018810L69204R6356m87614m88336n36595r16936r29944
9152A26342706j257384j638774j513914j322843j406183j222697j739604j955420
9144A14285887j975783j781356j225573n92746m43617l8628K81213O19046J118431
9135A10246874J287816J562726J735730J398306J044199R30935J264978P62684
9127A20234248N58531L19605K52200l28396r03988j161902j281438j537447j633307
9118A14518106j806769k300829k247047k169151k262459k628561k337198k388684
9110I6377408k691198k978386l003642k924851k693902k317074k060949j607747
9102G6099659j404944p15135k38744N9877N45030M41368L26238K35045n4706j90692
$$ plain form
9092 75102996 74723958 74058819 73408242 72708789 71905658 70890291 70092165 68988004 68082293
9083 68082293 66800041 65270058 63465306 61505320 59716018 57962631 56463268 55213606
9075 55213606 54215180 53579954 53137910 53081344 53381091 53765058 53807972 54152228 54641507 54743387
9065 54743387 54737908 54803677 54903856 54929690 54630014 53970144 53116233 52340097 51292444 49976524
9055 49976524 48720996 47443797 46352898 45546391 44838408 44165908 43462828 42523391 41683134
9046 41683134 41202694 40680563 40194446 39755820 39098977 38321884 37442643 36840331 36085532
9037 36085532 34865048 33642014 32599730 31727842 30889378 30049095 29596798 29329990 28619518
9028 28619518 27794836 27262522 26494480 25639005 24864070 24332509 23806490 23189417 22700238
$$ packed form
9092G5102996l79038o65139o50577o99453q03131j015367p98126j104161r05711
9083F8082293j282252j529983j804752j959986j789302j753387j499363j249662
9075E5213606r98426o35226m42044n6566K99747L83967M2914L44256M89279J01880
9065E4743387n479O5769J00179K5834k99676o59870q53911p76136j047653j315920
9055D9976524j255528j277199j090899q06507p07983o72500p03080r39437q40257
9046D1683134m80440n22131m86117m38626o56843p77093q79241o02312p54799
9037C6085532j220484j223034j042284q71888q38464q40283m52297k66808p10472
9028B8619518q24682n32314p68042q55475p74935n31561n26019o17073m89179
$$ plain form
9019 22700238 22093509 21645951 21493440 21335581 21359496 21097360 20896172 20789365 20440877 19965839
9009 19965839 19412664 18761442 17911555 17027768 16196742 15164356 14733584 14204206 13396162
9000 13396162 12966512 12896641 12594409 12175911 11624808 11265283 10683097 9842035 9186940 8902567
8990 8902567 8364847 7989305 7584582 7035601 6919257 6929911 6817094 6740049 6505370 6364015
8980 6364015 6515996 6445413 6389192 6410398 6196656 6345345 6120182 5539896 4943192 4612818
8970 4612818 4234401 4078830 3933072 3886998 3595950 3492132 3421112 3194431 2778965 2607693
8960 2607693 2552901 2263081 1945203 1700207 1815451 2048013 2046869 1842514 1599519 1521486
8950 1521486 1699126 1825635 1805402 1637408 1546338 1462017 1275972 1032979 1107175 1066972
$$ packed form
9019B2700238o06729m47558j52511j57859K3915k62136k01188j06807l48488m75038
9009A9965839n53175o51222q49887q83787q31026j032386m30772n29378q08044
9000A3396162m29650o9871l02232m18498n51103l59525n82186q41062o55095k84373
8990H902567n37720l75542m04723n48981j16344J0654j12817p7045k34679j41355
8980F364015J51981p0583n6221K1206k13742J48689k25163n80286n96704l30374
8970D612818l78417j55571j45758m6074k91048j03818p1020k26681m15466j71272
8960B607693n4792k89820l17878k44996J15244K32562j144k04355k42995p8033
8950A521486J77640J26509k0233j67994r1070q4321j86045k42993P4196m0203
$$ plain form
8940 1066972 1154323 1417611 1601061 1579283 1536455 1477640 1471905 1295554 1263821 1282556 1342430
8929 1342430 1398648 1535183 1473719 1473767 1685030 1660970 1560417 1404230 1062976 780077 860544
8918 860544 875313 982620 1483463 1507321 1182972 953466 638899 680387 952631 701022
8908 701022 859310 1123150 1158936 1285391 1004625 915243 824786 793538 896867 925513 807631
8897 807631 748044 706422 741400 866754 1103248 1237817 1211872 910455 482832 543846 686610
8886 686610 606837 745286 958084 852171 652869 503561 439923 358248 360709 553761 580769
8875 580769 437410 356816 457151 644016 783276 902440 924470 753105 521658 616641
8865 616641 898972 885677 1017489 938436 739212 1100549 1301284 1278918 1072466 870402
$$ packed form
8940A066972Q7351K63288J83450k1778m2828n8815n735j76351l1733J8735N9874
8929A342430N6218J36535o1464M8K11263k4060j00553j56187l41254k82899Q0467
8918H60544J4769J07307N00843K3858l24349k29506l14567M1488K72244k51609
8908G01022J58288K63840L5786J26455k80766q9382r0457l1248J03329K8646j17882
8897H07631n9587m1622L4978J25354K36494J34569k5945l01417m27623O1014J42764
8886F86610p9773J38449K12798j05913j99302j49308o3638q1675K461J93052K7008
8875E80769j43359q0594J00335J86865J39260J19164K2030j71365k31447R4983
8865F16641K82331j3295J31812p9053j99224L61337K00735k2366k06452k02064
$$ plain form
8855 870402 801952 775996 591387 588341 672107 871507 795448 957416 885565 725280 892644
8844 892644 1039428 1000360 1006288 957988 1068067 1109726 1030302 988491 840169 907303 1114876
8833 1114876 1029538 955042 871996 866348 914828 1145314 1053955 971664 983968 557547 563120
8822 563120 754865 776273 534138 470365 553359 829562 1133313 994221 699981 726666
8812 726666 1035693 1129064 1028249 907930 847123 860295 1081829 928014 804801 825661
8802 825661 821667 985207 1270109 1382009 1267944 1141689 1129530 997241 591575 472455
8792 472455 740984 566249 475358 561379 719271 723121 810597 836581 1000964 1005543 525012
8781 525012 312294 388141 791433 913721 954974 949187 868915 1072659 1149925 728498 475093
$$ packed form
8855H70402o8450k5956j84609l046Q3766J99400p6059J61968p1851j60285J67364
8844H92644J46784l9068N928m8300J10079M1659p9424m1811j48322O7134K07573
8833A114876q5338p4496q3046n648M8480K30486r1359q2291J2304m26421N573
8822E63120J91745K1408k42135o3773Q2994K76203L03751j39092k94240K6685
8812G26666L09027R3371j00815j20319o0807J3172K21534j53815j23213K0860
8802H25661l994J63540K84902J11900j14065j26255j2159j32289m05666j19120
8792D72455K68529j74735r0891Q6021J57892L850Q7476K5984J64383M579m80531
8781E25012k12718P5847M03292J22288M1253n787q0272K03744P7266m21427k53405
$$ plain form
8770 475093 360228 465300 431643 695081 797902 1020282 928206 942788 936254 806044 687910
8759 687910 622647 728255 648762 533644 813619 843239 633793 526316 578023 903862
8749 903862 1029501 769355 616162 629038 694472 731551 586099 651770 795563 776930 613103
8738 613103 609330 611851 515539 191039 196266 496289 514114 782574 1208469 965249 735616
8727 735616 591264 799265 904682 716985 330836 351603 383309 560068 475366 229960
8717 229960 67017 198336 367180 476351 494798 361984 475184 632181 516463 541530
8707 541530 378571 106004 183196 438146 536485 553134 628770 594637 720151 658509 547143
8696 547143 734057 617904 641294 608151 525007 526300 192611 287290 552394 609190 367542
$$ packed form
8770D75093j14865J05072l3657K63438J02821K22380r2076J4582o534j30210j18134
8759F87910o5263J05608p9493j15118K79975K9620k09446j07477N1707L25839
8749I03862J25639k60146j53193J2876O5434L7079j45452O5671J43793j8633j63827
8738F13103l773K521r6312l24500N227L00023J7825K68460M25895k43220k29633
8727G35616j44352K08001J05417j87697l86149K0767L1706J76759q4702k45406
8717B29960j62943J31319J68844J09171J8447j32814J13200J56997j15718K5067
8707E41530j62959k72567P7192K54950R8339J6649P5636l4133J25514o1642j11366
8696E47143J86914j16153K3390l3143q3144J293l33689R4679K65104N6796k41648
$$ plain form
8685 367542 268618 430436 382604 272495 375315 379763 423957 365652 492965 349472 244181
8674 244181 91162 -49783 113953 23077 237501 476443 472167 589202 519438 407532
8664 407532 472029 593973 586097 449515 356469 494469 801124 572011 508940 693992 460849
8653 460849 41124 20640 323854 277621 264379 259283 164972 248578 258762 315007 359584
8642 359584 169960 -82781 -232069 -166265 -16517 -120962 -230730 -50565 120711 170779
8632 170779 172768 300918 574693 634457 479986 504835 396991 454355 374089 366128 349848
8621 349848 176011 185088 311886 317415 444789 396921 408061 315776 36221 92617 375667
8610 375667 557579 435456 406119 525423 465089 621546 702064 217296 -40412 -69393
$$ packed form
8685C67542r8924J61818m7832j10109J02820M448M4194n8305J27313j43493j05291
8674B44181j53019j40945J63736r0876K14424K38942m276J17035o9764j11906
8664D07532O4497J21944p876j36582r3046J38000L06655k29113o3071J85052k33143
8653D60849m19725k0484L03214m6233j3242n096r4311Q3606J0184N6245M4577
8642C59584j89624k52741j49288O5804J49748j04445j09768J80165J71276N0068
8632A70779J989J28150K73775N9764j54471K4849j07844N7364q0266p961j6280
8621C49848j73837R077J26798N529J27374m7868J1140r2285k79555N6396K83050
8610C75667J81912j22123k9337J19304o0334J56457Q0518m84768k57708k8981
$$ plain form
8600 -69393 -41583 -34799 134069 410152 589586 485499 450748 375656 490027 619882 520002
8589 520002 274530 16678 -28514 266801 244932 154303 177053 68243 17881 -2676 37424
8578 37424 197124 173076 184885 276742 414319 154857 -51990 -249561 -219481 1776 57958
8567 57958 -11943 -252752 -503236 -469887 -228963 29712 -20195 -32134 -101986 -44918 -74766
8556 -74766 -272208 -412159 -199669 63006 101299 310431 262256 183559 -78816 -248527
8546 -248527 -180284 -303306 -453803 -478189 -388108 -276357 -312863 -503184 -163403 158619
8536 158619 311749 45690 -225506 -418033 -507322 -230023 83869 30766 -131255 -112937
8526 -112937 99638 3564 -122076 83219 289893 71256 3591 65610 240487 107789
$$ packed form
8600f9393K7810O784J68868K76083J79434j04087l4751p5092J14371J29855r9880
8589E20002k45472k57852m5192K95315k1869r0629K2750j08810n0362k0557M0100
8578C7424J59700k4048J1809R1857J37577k59462k06847j97571L0080K21257N6182
8567E7958o9901k40809k50484L3349K40924K58675m9907j1939o9852N7068k9848
8556g4766j97442j39951K12490K62675L8293K09132m8175p8697k62375j69711
8546b48527O8243j23022j50497k4386R0081J11751l6506j90321L39781L22022
8536A58619J53130k66059k71196j92527q9289K77299L13892n3103j62021J8318
8526a12937K12575r6074j25640K05295K06674k18637o7665O2019J74877j32698
$$ plain form
8516 107789 126937 149204 11617 44464 363116 305747 189578 236842 285756 86537 -119201
8505 -119201 -237554 -147543 -27811 -37251 44134 116331 120250 169108 -60266 9017 -165031
8494 -165031 -53875 -205614 -580828 -495388 79284 334517 483348 147310 -159650 -155648
8484 -155648 -260503 4734 66244 31088 -19195 -184664 -129149 -121497 -354233 -444906 -136238
8473 -136238 163888 196744 -52523 -32977 -11784 -54238 -312418 -311880 -267603 -136697 143883
8462 143883 381354 375003 197221 58409 -55672 -284905 -371094 -184497 -47201 47362
8452 47362 -170577 -51561 150112 138795 38704 -64507 -10662 344116 593627 536913
8442 536913 387804 302612 188428 303250 585276 611352 549303 299270 383621 535751
$$ packed form
8516A07789J9148K2267j37587L2847L18652n7369j16169M7264M8914j99219k05738
8505a19201j18353R0011J19732r440Q1385P2197L919M8858k29374O9283j74048
8494a65031J11156j51739l75214Q5440N74672K55233J48831l36038l06960M002
8484a55648j04855K65237O1510l5156n0283j65469N5515P652k32736r0673L08668
8473a36238L00126L2856k49267J9546K1193m2454k58180N38M4277J30906K80580
8462A43883K37471o351j77782j38812j14081k29233q6189J86597J37296R4563
8452D7362k17939J19016K01673j1317j00091j03211N3845L54778K49511n6714
8442E36913j49109q5192j14184J14822K82026K6076o2049k50033Q4351J52130
$$ plain form
8432 535751 543250 598079 287249 58146 -81732 94643 289185 298671 47064 187789 -39490
8421 -39490 216287 235604 350608 466179 424131 272100 131680 198977 146540 -116894 -169154
8410 -169154 -280589 -103087 104819 120847 76759 133433 60796 17626 -74028 125247 161293
8399 161293 205779 45848 44257 162070 124192 150783 91232 393855 260486 119425 187300
8388 187300 251618 264882 497013 427874 185729 124494 -52515 -70824 -59932 -184679 -201076
8377 -201076 -170795 -238352 -552196 -654928 -485881 -139446 187587 236742 116161 139876
8367 139876 68387 176835 396928 739446 789767 428047 186573 31825 -63160 252390
8357 252390 399324 321245 16846 -43801 264004 296331 160772 58011 -176031 -357928
$$ packed form
8432E35751P499N4829l10830k29103j39878J76375J94542R486k51607J40725k27279
8421c9490K55777J9317J15004J15571m2048j52031j40420O7297n2437k63434n2260
8410a69154j11435J77502K07906J6028m4088N6674p2637m3170r1654J99275L6046
8399A61293M4486j59931j591J17813l7878K6591n9551L02623j33369j41061O7875
8388A87300O4318J3264K32131o9139k42145o1235j77009j8309J0892j24747j6397
8377b01076L0281o7557l13844j02732J69047L46435L27033M9155j20581K3715
8367A39876p1489J08448K20093L42518N0321l61720k41474j54748r4985L15550
8357B52390J46934p8079l04399o0647L07805L2327j35559j02761k34042j81897
$$ plain form
8347 -357928 -115069 135967 147441 302711 397941 226165 112406 251990 354320 268018
8337 268018 229946 46213 -126418 -197094 -66726 56209 87022 19148 -62573 -76100 -130903
8326 -130903 -66054 -110717 -188502 -323439 -344262 -308073 -193226 -225854 -351680 -265610 -31440
8315 -31440 142266 57353 -34790 -100082 -130289 187663 263607 198954 344269 295201 344783
8304 344783 204964 22670 44238 36060 128069 -42190 -116380 -95909 95871 165478 198249
8293 198249 285079 270544 455524 193313 -213236 -155026 34245 163983 229539 256833 -15399
8282 -15399 48935 257065 375101 112717 -48249 -24453 -111597 -73685 197374 164273 176153
8271 176153 61857 -112664 -219900 -350316 -213827 -78803 -297821 -348265 -413113 -326166
$$ packed form
8347c57928K42859K51036J1474J55270R5230j71776j13759J39584J02330q6302
8337B68018l8072j83733j72631p0676J30368J22935L0813o7874q1721j3527n4803
8326a30903O4849m4663p7785j34937k0823L6189J14847l2628j25826Q6070K34170
8315c1440J73706q4913r2143o5292l0207L17952P5944o4653J45315m9068M9582
8304C44783j39819j82294K1568q178R2009j70259p4190K0471J91780O9607L2771
8293A98249Q6830j4535J84980k62211m06549N8210J89271J29738O5556K7294k72232
8282a5399O4334K08130J18036k62384j60966K3796q7144L7912K71059l3101J1880
8271A76153j14296j74521j07236j30416J36489J35024k19018n0444o4848Q6947
$$ plain form
8261 -326166 -291851 -326946 -354333 -385716 -216480 -380857 -422267 -395483 -255253 -104864 60527
8250 60527 155453 275565 399258 214666 -210621 -177218 -125929 -187471 -270458 -331462 -116571
8239 -116571 -142165 -366867 -502675 -170958 -53858 220279 418976 446769 525817 512229
8229 512229 351397 459112 487215 427194 223148 122692 -120099 -56678 36177 296657
8219 296657 127770 -163359 -331056 -350699 -359578 -366174 -384586 -350823 -409887 -335795 79109
8208 79109 -2531 43868 71962 -95146 -231022 -119594 -121258 -160130 -269842 -17767 233871
8197 233871 133288 232538 165306 251939 319578 189376 174317 72403 133452 -143872 -52865
8186 -52865 -128463 -314472 -287847 -331476 -244075 -189369 -92808 57784 94067 90313 -79562
$$ packed form
8261c26166L4315l5095k7387l1383J69236j64377m1410K6784J40230J50389J65391
8250F0527R4926J20112J23693j84592m25287L3403N1289o1542q2987o1004K14891
8239a16571k5594k24702j35808L31717J17100K74137J98697K7793P9048j3588
8229E12229j60832J07715K8103o0021k04046j00456k42791O3421R2855K60480
8219B96657j68887k91129j67697j9643q879o596j8412L3763n9064P4092M14904
8208G9109q1640M6399K8094j67108j35876J11428j664l8872j09712K52075K51638
8197B33871j00583R9250o7232Q6633O7639j30202j5059j01914O1049k77324R1007
8186e2865p5598j86009K6625m3629Q7401N4706R6561J50592L6283l754j69875
$$ plain form
8175 -79562 -44872 -37682 25648 208596 64558 10737 144616 302284 265294 -34202 -180297
8164 -180297 -205735 -231517 -262316 -282638 -108332 -258477 -296862 -314100 -307382 -165166 -259110
8153 -259110 -359983 -313418 -397461 -253753 15212 6797 8781 126100 99576 153333 114873
8142 114873 -60018 -32638 -76279 -292873 -339026 -84179 263350 247188 166839 -22736 -218201
8131 -218201 -339279 -281670 -222429 -98521 -62496 -223213 -307650 -269138 -52204 -156676 31959
8120 31959 15744 59541 88154 -216536 -157322 -98909 -301261 -345541 -566221 -424980 -61523
8109 -61523 316837 236043 57618 212844 312909 325790 122613 223507 701394 729399
8099 729399 551348 447651 426228 324391 318191 264326 146139 59340 161283 177820 218428
$$ packed form
8175g9562L4690P190O3330J82948j44038n3821J33879J57668l6990k99496j46095
8164a80297k5438k5782l0799k0322J74306j50145l8385j7238O718J42216r3944
8153b59110j00873M6565q4043J43708K68965q415J984J17319k6524N3757l8460
8142A14873j74891K7380m3641k16594m6153K54847L47529j6162q0349j89575j95465
8131b18201j21078N7609N9241J23908L6025j60717q4437L8512K16934j04472J88635
8120C1959j6215M3797K8613l04690N9214N8413k02352m4280k20680J41241L63457
8109f1523L78360q0794j78425J55226J00065J2881k03177J00894M77887K8005
8099G29399j78051j03697k1423j01837o200n3865j18187q6799J01943J6537M0608
$$ plain form
8088 218428 388817 356403 247435 -56499 -77233 199440 164778 144841 299746 400611
8078 400611 316136 380064 160132 312502 278109 113049 88849 81777 -23223 -70586 -164816
8067 -164816 17088 20982 -344186 -440975 -456555 -434936 -428039 -368307 -195466 100695 228820
8056 228820 351208 106118 -221654 -290653 -15812 -69435 -228330 -244346 -385852 -287763
8046 -287763 137823 199812 111157 108862 100365 160069 288776 330654 274680 279434 285599 62641
8034 62641 -326504 -346925 -96980 -87774 -118125 -94597 -165047 -26448 -66517 66216 184332
8023 184332 -12257 -143401 -277369 -479715 -571811 -189028 65517 -96882 -151850 -200669
8013 -200669 -96646 165071 78821 83827 625 -227995 -293318 -249958 -119412 -25734 -84546
$$ packed form
8088B18428J70389l2414j08968l03934k0734K76673l4662j9937J54905J00865
8078D00611q4475O3928k19932J52370l4393j65060k4200p072j05000m7363r4230
8067a64816J81904L894l65168r6789j5580K1619O897N9732J72841K96161J28125
8056B28820J22388k45090l27772o8999K74841n3623j58895j6016j41506R8089
8046b87763M25586O1989q8655k295q497N9704J28707M1878n5974M754O165k22958
8034F2641l89145k0421K49945R206l0351K3528p0450J38599m0069J32733J18116
8023A84332j96589j31144j33968k02346r2096L82783K54545j62399n4968m8819
8013b00669J04023K61717q6250N006q3202k28620o5323M3360J30546R3678n8812
$$ plain form
8002 -84546 -67991 -37813 73947 24857 -17778 137295 284563 274434 240973 123430 27767
7991 27767 -2208 -100950 -93896 153958 364873 434457 404775 228491 63736 192267 -20845
7980 -20845 -293996 -244445 -198259 -148640 65964 105216 -41436 -150825 -147066 -287044 -393067
7969 -393067 -78412 -367076 -433240 -118807 -10215 279028 365092 417156 360168 151761
7959 151761 -234252 -339649 -155485 -26158 269126 424174 283948 83878 107647 -82838
7949 -82838 -65237 -184001 -228980 -124630 -114770 -215626 -148034 74831 279287 420125 437608
7938 437608 421044 325910 289556 291076 25406 -256289 -241931 22517 218843 102227 -248757
7927 -248757 -202463 -162760 -65955 -191824 -192155 -235227 -92976 21875 168 -15846 37155
$$ packed form
8002h4546J6555L0178J11760m9090m2635J55073J47268j0129l3461j17543r5663
7991B7767k9975r8742P054K47854K10915O9584k9682j76284j64755J28531k13112
7980b0845k73151M9551M6186M9619K14604L9252j46652j09389L759j39978j06023
7969c93067L14655k88664o6164L14433J08592K89243Q6064N2064n6988k08407
7959A51761l86013j05397J84164J29327K95284J55048j40226k00070K3769j90485
7949h2838J7601j18764m4979J04350R860j00856O7592K22865K04456J40838J7483
7938D37608j6564r5134l6354J520k65670k81695J4358K64448J96326j16616l50984
7927b48757M6294L9703R6805j25869l31m3072J42251J14851k1707j6014N3001
$$ plain form
7916 37155 167981 97431 -98922 -56939 -7492 -153080 -159564 -281991 -230462 -189960 -70399
7905 -70399 394787 189098 40882 -159364 -179755 68795 24251 -81278 241578 379684
7895 379684 350268 474327 441214 550027 324912 29996 9676 -6591 155855 364559
7885 364559 52812 13058 121350 17888 -87150 -141691 -233016 -325081 -446952 -349994 -85949
7874 -85949 -37325 -48607 27901 190515 137079 -78905 -80178 -54170 -119331 -252438 -134162
7863 -134162 -3810 70159 -136181 -278067 -432793 -410815 -348758 -54454 -8139 46338 12186
7852 12186 -186931 -195424 -272282 -297913 41389 66653 -36741 -218934 -117204 -118476 -291983
7841 -291983 -383270 -98704 161993 -43305 -370345 -261396 -41954 175206 127544 17893
$$ packed form
7916C7155J30826p0550j96353M1983M9447j45588o484j22427N1529M0502J19561
7905g0399M65186k05689j48216k00246k0391K48550m4544j05529L22856J38106
7895C79684k9416J24059l3113J08813k25115k94916k0320j6267J62446K08704
7885C64559l11747l9754J08292j03462j05038n4541r1325r2065j21871R6958K64045
7874h5949M8624j1282P6508J62614n3436k15984j273K6008o5161j33107J18276
7863a34162J30352P3969k06340j41886j54726K1978O2057K94304M6315N4477l4152
7852A2186j99117q493p6858k5631L39302K5264j03394j82193J01730j272j73507
7841b91983r1287K84566K60697k05298l27040J08949K19442K17160m7662j09651
$$ plain form
7831 17893 -24886 -135079 109171 43910 -151634 143609 173660 124272 236375 111549 144265
7820 144265 445973 507674 139349 -76402 -229101 -387772 -419018 -362221 -259286 -261113 -83010
7809 -83010 -142583 -257263 -182489 19165 38404 -79311 200390 256272 145682 276695 169216
7798 169216 -101698 -165570 23286 58012 -146507 -3546 -30152 -50018 -134106 106585 107649
7787 107649 61257 239762 76279 -169997 -263145 -593103 -460008 -222207 -105661 -67132
7777 -67132 -257706 -332809 -159310 -304589 -416616 -419797 -225992 -137048 -58440 76435 222956
7766 222956 78150 -37124 29074 34694 204017 245302 142979 124188 130574 286269 232686
7755 232686 50603 -101331 -336614 -352745 -543018 -610825 -393879 -327959 -232852 -304611 -116787
$$ packed form
7831A7893m2779j10193K44250o5261j95544K95243L0051m9388J12103j24826L2716
7820A44265L01708O1701l68325k15751j52699j58671l1246N6797J02935j827J78103
7809h3010n9573j14680P4774K01654J9239j17715K79701N5882j10590J31013j07479
7798A69216k70914o3872J88856L4726k04519J42961k6606j9866q4088K40691J064
7787A07649m6392J78505j63483k46276r3148l29958J33095K37801J16546L8529
7777f7132j90574p5103J73499j45279j12027l181J93805Q8944P8608J34875J46521
7766B22956j44806j15274O6198N620J69323M1285j02323j8791O386J55695n3583
7755B32686j82083j51934k35283j6131j90273o7807K16946O5920R5107p1759J87824
$$ plain form
7744 -116787 -103342 -399377 -46809 109302 33434 -181066 -497887 -499309 -353059 -522517
7734 -522517 -629269 -290146 -147272 46741 102362 150501 184331 208051 -43196 -105233 -49793
7723 -49793 68878 247725 107812 104944 -68991 -283935 -52101 210766 372263 237639
7713 237639 7951 -164628 -268455 -425655 -236429 -193439 76559 746427 561493 360235
7703 360235 61589 -267941 -571852 -623365 -401794 -247804 -117926 101289 256777 201914
7693 201914 34906 -288409 -243058 201523 204834 16189 -18928 -214702 -505608 -500778 -552980
7682 -552980 -367970 -152484 -168910 197175 366039 273089 42554 -332157 -740223 -638619
7672 -638619 -456979 -417914 -336975 -193036 -49161 216073 248073 17552 -171207 55347
$$ packed form
7744a16787J3445k96035L52568J56111p5868k14500l16821j422J46250j69458
7734e22517j06752L39123J42874J94013N5621M8139L3830K3720k51247o2037N5440
7723d9793J18671J78847j39913k868j73935k14944K31834K62867J61497j34624
7713B37639k29688j72579j03827j57200J89226M2990K69998O69868j84934k01258
7703C60235k98646l29530l03911n1513K21571J53990J29878K19215J55488n4863
7693B01914j67008l23315M5351M44581L311j88645l5117j95774k90906M830n2202
7682e52980J85010K15486j6426L66085J68864r2950k30535l74711m08066J01604
7672f38619J81640L9065Q0939J43939J43875K65234L2000k30521j88759K26554
$$ plain form
7662 55347 242253 179373 226970 -29890 -289385 -243330 -282829 -233163 -197601 -178425 -187400
7651 -187400 -320721 -333019 -437955 -401429 -73985 69001 205653 284496 80852 -192350
7641 -192350 -170932 49451 363000 -42966 -492270 -430994 -381049 -275216 36645 70130
7631 70130 101937 325375 84626 -195034 -224479 -61278 -88600 120922 72636 6 -48582
7620 -48582 -373209 -272101 24546 247790 19469 -136282 -150797 -502565 -553053 -327557
7610 -327557 -148834 -50316 -27359 -109925 -133233 -45000 31107 168729 168341 153917 111
7599 111 -121377 -441881 -380530 -76976 99489 214959 296573 226801 191391 133731 124079
7588 124079 69974 33411 -106019 59418 110742 267670 255684 203 -119874 -114698 -237387
$$ packed form
7662E5347J86906o2880M7597k56860k59495M6055l9499M9666L5562J9176q975
7651a87400j33321j2298j04936L6526L27444J42986J36652P8843k03644k73202
7641a92350K1418K20383L13549m05966m49304O1276M9945J05833L11861L3485
7631G0130L1807K23438k40749k79660k9445J63201k7322K09522m8286p2630m8588
7620d8582l24627J01108K96647K23244k28321j55751j4515l51768n0488K25496
7610c27557J78723R8518K2957q2566k3308Q8233P6107J37622l88j4424j53806
7599A11j21488l20504O1351L03554J76465J15470Q1614o9772l5410n7660r652
7588A24079n4105l6563j39430J65437N1324J56928j1986k55481j20077N176j22689
$$ plain form
7577 -237387 -329123 -282748 -103197 100137 96346 157846 348982 202352 -120302 -275102 -295181
7566 -295181 -369828 -110831 443 -6228 -19442 154864 113022 109800 195948 308007 198172
7555 198172 80550 143477 79446 224733 162807 -227369 -439704 -112446 27263 -35451
7545 -35451 85247 -39879 -479326 -572725 -495461 -450077 -380440 -273126 -478683 -357119 -56262
7534 -56262 220878 245887 -90992 -348400 -582315 -480703 -143868 144122 125417 -30176
7524 -30176 -254778 -300005 -552563 -536316 -241395 69316 113217 -214168 -301854 -333542 -370003
7513 -370003 -231886 -200715 -218520 -272980 -179275 -204398 -244879 -174107 -37533 -209560 -112065
7502 -112065 94887 238558 326660 164682 -170198 -374800 -256359 -342945 -292371 -170480
$$ packed form
7577b37387r1736M6375J79551K03334l791O1500J91136j46630l22654j54800k0079
7566b95181p4647K58997J11274o671j3214J74306m1842l222Q6148J12059j09835
7555A98172j17622O2927o4031J45287o1926l90176k12335L27258J39709o2714
7545c5451J20698j25126m39447r3399P7264M5384O9637J07314k05557J21564L00857
7534e6262K77140K5009l36879k57408k33915J01612L36835K87990j8705j55593
7524c0176k24602m5227k52558J6247K94921L10711M3901l27385q7686l1688l6461
7513c70003J38117L1171j7805n4460R3705k5123m0481P0772J36574j72027R7495
7502a12065K06952J43671Q8102j61978l34880k04602J18441q6586N0574J21891
$$ plain form
7492 -170480 -97574 -93537 99957 243537 334806 154193 72562 -55638 -253980 -238307 -274783
7481 -274783 -321451 -127012 -174970 -231489 -270539 -305400 -149288 147255 416193 202020 -173859
7470 -173859 -346378 -239256 49043 -20210 -212777 -252329 60348 120395 -39010 -323885
7460 -323885 -113743 188215 182676 21973 -229398 -80178 165256 190022 161361 201380 323393
7449 323393 171936 187279 172466 411300 318309 370653 535783 459514 319299 178120 161110
7438 161110 307170 262756 402640 539081 205722 -98627 -94243 -72090 25385 252267 350849
7427 350849 478416 575943 484025 308822 49697 81694 -38490 -96146 73129 125370 49117
7416 49117 -15305 161330 228575 9044 -210624 -230877 -268828 -127028 -197442 50148 159924
$$ packed form
7492a70480P2906M037J93494J43580R1269j80613q1631j28200j98342J5673l6476
7481b74783m6668J94439m7958n6519l9050l4861J56112K96543K68938k14173l75879
7470a73859j72519J07122K88299o9253j92567l9552L12677O0047j59405k84875
7460c23885K10142L01958n539j60703k51371J49220K45434K4766k8661M0019J22013
7449C23393j51457J5343j4813K38834r2991N2344J65130p6269j40215j41179j7010
7438A61110J46060m4414J39884J36441l33359l04349M384K2153R7475K26882R8582
7427C50849J27567R7527r1918j75203k59125L1997j20184n7656J69275N2241p6253
7416D9117o4422J76635O7245k19531k19668k0253l7951J41800p0414K47590J09776
$$ plain form
7405 159924 91776 -1922 79860 -37245 88645 244724 400466 205943 224815 157073 34511
7394 34511 87428 -1274 318056 672035 673622 588975 608418 398206 40260 -34136 -24369
7383 -24369 17300 -4520 145727 187453 313960 290372 -85003 -487129 -574883 -604459 -478967
7372 -478967 -296855 -157912 -242432 -359424 -288109 42457 271875 276383 153678 172223 203511
7361 203511 315933 -38404 -212063 -154834 -154855 -452656 -672343 -632847 -598687 -290469 -100486
7350 -100486 67899 124084 59550 16042 -146950 12230 -219604 -275793 -244721 -142842 -124946
7339 -124946 -132303 -262229 -353489 -338437 -535684 -593594 -461731 -485251 -212389 52033 -148075
7328 -148075 -450142 -732910 -648460 -181777 -3590 -60594 -307571 -375942 -456405 -354657
$$ packed form
7405A59924o8148r3698Q1782j17105J25890J56079J55742j94523J8872o7742j22562
7394C4511N2917q8702L19330L53979J587q4647J9443k10212l57946p4396R767
7383b4369M1669k1820J50247M1726J26507k3588l75375m02126q7754k9576J25492
7372d78967J82112J38943q4520j16992P1315L30566K29418M508j22705J8545L1288
7361B03511J12422l54337j73659N7229k1k97801k19687L9496L4160L08218J89983
7350a00486J68385N6185o4534m3508j62992J59180k31834n6189L1072J01879J7896
7339a24946p357j29926r1260J5052j97247n7910J31863k3520K72862K64422k00108
7328a48075l02067k82768Q4450M66683J78187n7004k46977o8371q0463J01748
$$ plain form
7318 -354657 -157459 -274302 -432462 -289623 -390256 -453213 -229926 26621 -254531 -291309
7308 -291309 -20255 54770 83117 241442 244201 -106270 24369 20324 195555 217489 -119950
7297 -119950 -111994 13018 -39117 -73590 -307674 -568902 -289342 78461 65889 -108755 -377606
7286 -377606 -374668 -313371 -301022 -439882 -488043 -113022 23709 114158 -95682 -460413 -436814
7275 -436814 -437309 -364529 -180795 -39858 -186630 -467464 -455152 -387626 -352415 -106175 -79182
7264 -79182 -53046 -56350 125904 352689 313350 587498 535627 194563 31212 -12182 -32075
7253 -32075 -175624 -256541 -328341 -224766 -49733 46778 49873 114476 304354 293196 60406
7242 60406 -92378 -27945 -104423 -182455 -154176 -329839 -648574 -465400 -163347 -26912 56425
$$ packed form
7318c54657J97198j16843j58160J42839j00633o2957K23287K56547k81152l6778
7308b91309K71054P5025K8347J58325K759l50471J30639m045J75231K1934l37439
7297a19950P956J25012n2135l4473k34084k61228K79560L67803j2572j74644k68851
7286c77606K938O1297J2349j38860m8161L75021J36731R0449k09840l64731K3599
7275d36814m95P2780J83734J40937j46772k80834J2312O7526L5211K46240K6993
7264g9182K6136l304J82254K26785l9339K74148n1871l41064j63351m3394j9893
7253c2075j43549q0917p1800J03575J75033R6511L095O4603J89878j1158k32790
7242F0406j52784O4433p6478p8032K8279j75663l18735J83174L02053J36435Q3337
$$ plain form
7231 56425 287938 350502 56450 -179746 -405523 -394197 -98976 157559 141340 77666 -253968
7220 -253968 -197892 -53739 142139 266289 211495 140246 -110307 -320220 -53070 268964
7210 268964 306042 21670 -369759 -519542 -458616 -63483 -27489 -169412 -384943 -539618
7200 -539618 -463316 -505854 -412813 -394148 -198761 34733 282746 46970 -153209 -94495 -114069
7189 -114069 67792 -70398 -277578 -279769 -118255 25427 104295 -33438 -286569 -27500
7179 -27500 22902 -58250 -109040 -274489 -371057 -139910 5468 -26949 189995 489141 553173
7168 553173 513056 491296 504731 457212 405682 30746 -147845 -325851 -299852 -85423 273778
7157 273778 517351 308717 282309 193589 207741 518666 562279 564564 510169 416185 327683
$$ packed form
7231E6425K31513O2564k94052k36196k25777J1326K95221K56535j6219o3674l31634
7220b53968N6076J44153J95878J24150n4794p1249k50553k09913K67150L22034
7210B68964L7078k84372l91429j49783O0926L95133L5994j41923k15531j54675
7200e39618P6302m2538R3041J8665J95387K33494K48013k35776k00179N8714j9574
7189a14069J81861j38190k07180k191J61514J43682P8868j37733k53131K59069
7179b7500N0402q1152n0790j65449r6568K31147J45378l2417K16944K99146O4032
7168E53173m0117k1760J3435m7519n1530l74936j78591j78006K5999K14429L59201
7157B73778K43573k08634k6408q8720J4152L10925M3613K285n4395r3984q8502
$$ plain form
7146 327683 440501 367688 187121 187521 67076 -194599 -252351 -134625 -104477 -48022 207735
7135 207735 177193 -33627 -34953 2559 -99220 168407 289661 86081 -227334 5635
7125 5635 150797 -22426 356 216950 176078 96932 283768 142050 42289 -254036 -103986
7114 -103986 91111 65460 -140889 -262356 -207150 -339410 -183653 -177396 -531093 -343549
7104 -343549 -171469 -15748 -207957 -604368 -738466 -535307 -181634 26130 -210016 -366285
7094 -366285 -155964 -57359 -265040 -268956 -221926 -580997 -538780 18627 232347 -91827 -286268
7083 -286268 -213559 -113040 -243801 -227254 -210886 -236121 -213407 -330609 -323424 -196545 -230310
7072 -230310 -46883 118877 -4891 -98299 -42281 -135799 -340867 -218906 69846 144146
$$ packed form
7146C27683J12818p2813j80567M00j20445k61675n7752J17726L0148N6455K55757
7135B07735l0542k10820j326L7512j01779K67627J21254k03580l13415K32969
7125E635J45162j73223K2782K16594m0872p9146J86836j41718r9761k96325J50050
7114a03986J95097k5651k06349j21467N5206j32260J55757O257l53697J87544
7104c43549J72080J55721j92209l96411j34098K03159L53673K07764k36146j56269
7094c66285K10321R8605k07681l916M7030l59071M2217N57407K13720l24174j94441
7083b86268P2709J00519j30761J6547J6368k5235K2714j17202P185J26879l3765
7072b30310J83427J65760j23768r3408N6018r3518k05068J21961K88752P4300
$$ plain form
7062 144146 -170682 -229083 -211213 -281437 -41346 96825 150912 132542 -178355 69284 506645
7051 506645 518396 627993 281777 285402 300383 194593 137518 -15757 -300673 -356639 -204968
7040 -204968 16924 119804 154773 91563 -298616 -292087 -29879 -13195 -326780 -311729 -69760
7029 -69760 -49787 -124031 85367 -64284 -94964 16146 69275 102013 -43527 -115942 -175118
7018 -175118 -136907 26865 47366 199571 255125 236046 -109155 9734 125916 -196875
7008 -196875 -225825 -426317 -449269 -396801 -467890 -259007 -410594 -440110 100534 222245 33911
6997 33911 -190602 -293140 -347368 -324417 -221085 -277425 -29862 98315 -51160 58937
6987 58937 299230 225265 533057 650472 416909 106599 153432 -77052 13037 224021
$$ packed form
7062A44146l14828n8401J7870p0224K40091J38171N4087j8370l10897K47639M37361
7051E06645J1751J09597l46216L625J4981j05790n7075j53275k84916n5966J51671
7040b04968K21892J02880L4969o3210l90179O529K62208J6684l13585J5051K41969
7029f9760J9973p4244K09398j49651l0680J11110N3129L2738j45540p2415n9176
7018a75118L8211J63772K0501J52205N5554j9079l45201J18889J16182l22791
7008a96875k8950k00492k2952N2468p1089K08883j51587k9516N40644J21711j88334
6997C3911k24513j02538n4228K2951J03332n6340K47563J28177j49475J10097
6987E8937K40293p3965L07792J17415k33563l10310M6833k30484R0089K10984
$$ plain form
6977 224021 426586 476008 77576 -264754 -168206 74319 413950 348884 110844 65275
6967 65275 -88694 -285484 -205832 -48836 -240335 -87405 213438 34455 -15817 -4461
6957 -4461 35595 42549 77623 -20638 -125337 -243252 -224594 -177525 -56128 -35756 -105526 -7447
6945 -7447 -73543 -67473 -172957 -94260 -67224 36907 31017 91257 -205752 -664826 -675747 -372161
6933 -372161 -177308 -78570 -112293 -381879 -212633 159216 159302 70307 -25798 -82164 -108121
6922 -108121 19761 26901 -127312 -71077 -101497 -131214 -157222 -408135 -298075 -416708 -284974
6911 -284974 -318361 -203655 -335100 -239866 -333975 -194955 -61501 73751 -89231 -216766
6901 -216766 -252167 71208 92516 90516 7585 -106289 -179050 -357147 -224687 -31374 14569
$$ packed form
6977B24021K02565M9422l98432l42330R6548K42525L39631o5066k38040m5569
6967F5275j53969j96790P9652J56996j91499J52930L00843j78983n0272J1356
6957d461M0056O954L5074r8261j04699j17915J8658M7069J21397K0372o9770R8079
6945g447o6096O070j05484P8697K7036J04131n890O0240k97009m59074j0921L03586
6933c72161J94853R8738l3723k69586J69246L71849Q6q8995r6105n6366k5957
6922a08121J27882P140j54213N6235l0420k9717k6008k50913J10060j18633J31734
6911b84974l3387J14706j31445R5234r4109J39020J33454J35252j62982j27535
6901b16766l5401L23375K1308k000q2931j13874p2761j78097J32460J93313M5943
$$ plain form
6890 14569 -152559 -397937 -551149 -474499 -382204 -323908 -217227 -72488 -169792 -199698 -11410
6879 -11410 77455 259581 134419 -242945 -451112 -468237 -293939 -324399 -348597 -449481 -380767
6868 -380767 -136558 98671 122913 -35887 27342 -81847 -153186 -77304 31959 166389
6858 166389 96683 107352 -19868 -191474 25528 190319 45989 -77052 -144967 -78345
6848 -78345 -264811 -353092 -386744 -406943 -353271 -111204 220158 451449 423764 477991 338224
6837 338224 293276 86343 -218760 -220039 -130830 -61157 -106007 -116955 -104008 23854 -144500
6826 -144500 -463954 -389947 -364360 -73919 289163 352319 129789 62945 143298 127139 -92757
6815 -92757 -137990 -242408 -385675 -245218 72929 204558 335811 190600 -16513 -88777
$$ packed form
6890A4569j67128k45378j53212P6650R2295N8296J06681J44739r7304k9906J88288
6879a1410Q8865J82126j25162l77364k08167j7125J74298l0460k4198j00884O8714
6868c80767K44209K35229K4242j58800O3229j09189p1339P5882J09263J34430
6858A66389o9706J0669j27220j71606K17002J64791j44330j23041o7915O6622
6848g8345j86466q8281l3652k0199N3672K42067L31362K31291k7685N4227j39767
6837C38224m4948k06933l05103j279Q9209O9673m4850j0948J2947J27862j68354
6826a44500l19454P4007K5587K90441L63082O3156k22530o6844Q0353j6159k19896
6815i2757m5233j04418j43267J40457L18147J31629J31253j45211k07113p2264
$$ plain form
6805 -88777 -335461 -478497 -671350 -401315 -273706 -189943 59780 90674 -349417 -495916
6795 -495916 -365527 -281022 79130 103620 183373 23451 -177351 -134112 -116520 -75787 -63740
6784 -63740 -19788 24861 200505 383015 386165 276236 99271 174405 261959 187107 155940
6773 155940 201876 106077 280358 381324 354305 132789 134900 162392 29230 -75345 -217887
6762 -217887 -188267 208463 95896 -103519 -7494 -117573 -205912 -201631 -124778 -205218 -95713
6751 -95713 -31889 -266971 -330509 -302219 -108243 49521 -70243 -87059 -52905 -31160 36069
6740 36069 210624 -2625 -454177 -617499 -484740 -334620 -133809 -84162 -127183 -28729
6730 -28729 -29957 -289488 -289219 44062 205039 454989 360748 130658 18013 -44116 -30160
$$ packed form
6805h8777k46684j43036j92853K70035J27609Q3763K49723L0894m40091j46499
6795d95916J30389Q4505L60152K4490P9753j59922k00802M3239J7592M0733J2047
6784f3740M3952M4649J75644J82510L150j09929j76965P5134Q7554p4852l1167
6773A55940M5936r5799J74281J00966k7019k21516K111K7492j33162j04575j42542
6762b17887K9620L96730j12567j99415R6025j10079q8339M281P6853q0440J09505
6751i5713O3824k35082o3538K8290J93976J57764j19764j6816L4154K1745O7229
6740C6069J74555k13249m51552j63322J32759J50120K00811M9647m3021R8454
6730b8729j228k59531K69L33281J60977K49950r4241k30090j12645o2129J3956
$$ plain form
6719 -30160 58420 -53850 145671 119289 -135097 -131482 -89205 -235706 -315190 -565371 -578013
6708 -578013 -366846 -379919 -355409 -315145 -292664 -110621 -46497 -105809 -119453 192915 332454
6697 332454 336808 280165 275230 187777 144213 -4451 -59976 -136050 -104916 108446 205295 55121
6685 55121 94272 -43248 -44211 96805 -81710 -280447 -160115 -272194 -167878 -20892 -163664
6674 -163664 -1970 -123125 -151862 25808 166506 204111 55729 -117193 -164868 60164
6664 60164 53945 -16019 37683 -130810 -80598 -72347 8378 107872 82084 97478 -100885 -435052
6652 -435052 -339942 -297052 -252519 -272237 -100123 26028 131862 364120 699252 632061 558427
6641 558427 328917 416109 398301 447914 263590 211079 262657 89999 -222049 -16854 112963
$$ packed form
6719c0160Q8580j12270J99521k6382k54386L615M2277j46501p9484k50181j2642
6708e78013K11167j3073K4510M0264K2481J82043O4124n9312j3644L12368J39539
6697C32454M354n6643m935q7453m3564j48664n5525p6074L1134K13362R6849j50174
6685E5121L9151j37520r63J41016j78515j98737J20332j12079J04316J46986j42772
6674a63664J61694j21155k8737J77670J40698L7605j48382j72922m7675K25032
6664F0164o219o9964N3702j68493N0212Q251Q0725R9494k5788J5394j98363l34167
6652d35052R5110M2890M4533j9718J72114J26151J05834K32258L35132o7191p3634
6641E58427k29510Q7192j7808M9613j84324n2511N1578j72658l12048K05195J29817
$$ plain form
6630 112963 93264 99061 18289 -175044 -249935 -351161 -492318 -489248 -380272 -123351 -132681
6619 -132681 -143808 -37929 95505 -53781 -5175 -174021 -323547 -517032 -567056 -728673
6609 -728673 -892451 -555127 -345799 -220086 -51404 -187631 -216184 127121 -68850 -112280
6599 -112280 293574 174167 -130208 -36339 -212927 -536045 -516142 -428596 -355045 -271352 -247926
6588 -247926 -20653 293921 -3593 -137583 -59632 3898 145175 60607 -60823 -234750
6578 -234750 -420293 -425118 9993 1034 51989 109975 181746 185294 487227 465882 248317
6567 248317 121349 93105 3810 40899 -310154 -329563 -69208 -132413 -107271 -158841 -256178
6556 -256178 -238253 -179454 -200675 -284421 -446664 -376699 -302682 -436248 -515517 -389230 -619925
$$ packed form
6630A12963j9699N797q0772j93333p4891j01226j41157L070J08976K56921r330
6619a32681j1127J05879J33434j49286M8606j68846j49526j93485n0024j61617
6609g28673j63778L37324K09328J25713J68682j36227k8553L43305j95971m3430
6599a12280M05854j19407l04375R3869j76588l23118J9903Q7546P3551Q3693K3426
6588b47926K27273L14574k97514j33990P7951O3530J41277q4568j21430j73927
6578b34750j85543m825M35111q959N0955N7986P1771L548L01933k1345k17565
6567B48317j26968k8244q9295L7089l51053j9409K60355o3205K5142n1570r7337
6556b56178J7925N8799k1221q3746j62243O9965P4017j33566p9269J26287k30695
$$ plain form
6545 -619925 -917150 -989224 -459150 -303227 -234783 -250719 -74567 166743 203749 70534
6535 70534 -325254 -224259 -75765 -80023 -4565 -181613 -189972 -166592 -109588 -73599 -62361
6524 -62361 65077 -3124 -158543 -293445 -468900 -370826 -354936 -410071 -665070 -721222 -406716
6513 -406716 -208456 60531 165157 118464 224258 119457 -514651 -845828 -730548 -876219
6503 -876219 -868874 -765655 -323749 -120966 -270242 -441611 -535032 -679155 -544271 -657518
6493 -657518 -611731 -443423 -389957 -482084 -635942 -654713 -457532 -323501 -2857 -12235 -260558
6482 -260558 -379144 -235659 -278707 -326278 -233526 -227749 -185254 -273734 -377825 -397544 -312946
6471 -312946 -319432 -620801 -264056 -175610 -344147 -189599 15568 164281 152459 170694 262383
$$ packed form
6545f19925k97225p2074N30074J55923O8444j5936J76152K41310L7006j33215
6535G0534l95788J00995J48494m258P5458j77048q359K3380N7004L5989J1238
6524f2361J27438o8201j55419j34902j75455R8074J5890n5135k54999n6152L14506
6513d06716J98260K68987J04626m6693J05794j04801o34108l31177J15280j45671
6503h76219P345J03219M41906K02783j49276j71369r3421j44123J34884j13247
6493f57518M5787J68308N3466r2127j53858j8771J97181J34031L20644r378k48323
6482b60558j18586J43485m3048m7571R2752N777M2495q8480j04091j9719Q4598
6471c12946o486l01369L56745Q8446j68537J54548K05167J48713j1822J8235R1689
$$ plain form
6460 262383 158403 88446 136653 148745 -26462 40431 364940 570742 567242 459085 345405
6449 345405 56436 -222198 -305700 -314606 -370092 -293720 -247500 -278335 30496 57449 -68779
6438 -68779 -115705 -159896 -138961 -411670 -319389 -54692 -9110 -240522 -344435 -350632 -29821
6427 -29821 236659 245388 152967 470419 662664 540043 257371 -60407 28253 32851 194359
6416 194359 263174 117157 78214 -27499 -167382 -117729 85866 116696 -72708 -40006 45784
6405 45784 401831 488198 450428 364046 118130 -85496 -17751 105989 335806 256910 17521
6394 17521 137083 -11040 19386 -62543 -213569 -290315 -423539 -568546 -462687 -351900
6384 -351900 -230334 -262964 -72640 -259266 -220962 -256620 -143538 -228458 -228403 -144862 -305733
$$ packed form
6460B62383j03980o9957M8207J2092j75207O6893L24509K05802l500j08157j13680
6449C45405k88969k78634q3502q906n5486P6372M6220l0835L08831K6953j26228
6438f8779m6926m4191K0935k72709R2281K64697M5582k31412j03913o197L20811
6427b9821K66480Q729r2421L17452J92245j22621k82672l17778Q8660M598J61508
6416A94359O8815j46017l8943j05713j39883M9653K03595L0830j89404L2702Q5790
6405D5784L56047Q6367l7770q6382k45916k03626O7745J23740K29817p8896k39389
6394A7521J19562j48123L0426q1929j51026p6746j33224j45007J05859J10787
6384c51900J21566l2630J90324j86626L8304l5658J13082q4920N5Q3541j60871
$$ plain form
6373 -305733 -380500 -365582 -100669 -241035 -202608 119739 175141 -53951 -193666 81142
6363 81142 190909 198808 21192 150305 205873 -106124 -277450 -223178 -322118 -244597 -240991
6352 -240991 -174318 -158007 -21982 -157850 -263104 -410632 -438806 -169232 58189 71864
6342 71864 -68987 -375831 -244330 -144516 -253504 -180176 78219 141411 191330 380912 116391
6331 116391 200620 311334 157024 -97657 -131083 -3202 399814 360761 257374 107508
6321 107508 172683 2533 -68593 -197940 -37879 142088 34482 -214722 -593763 -809843
6311 -809843 -614614 -245949 -5387 45546 59756 360280 443093 381412 248760 86119
6301 86119 68946 338671 323470 221021 78089 164846 78666 -64935 -286891 -250897 -165661
$$ packed form
6373c05733p4767J4918K64913j40366L8427L22347N5402k29092j39715K74808
6363H1142J09767P899j77616J29113N5568l11997j71326N4272r8940P7521L606
6352b40991O6673J6311J36025j35868j05254j47528k8174K69574K27421J3675
6342G1864j40851l06844J31501R9814j08988P3328K58395O3192M9919J89582k64521
6331A16391Q4229J10714j54310k54681l3426J27881M03016l9053j03387j49866
6321A07508O5175j70150p1126j29347J60061J79967j07606k49204l79041k16080
6311h09843J95229L68665K40562N0933J4210L00524Q2813o1681j32652j62641
6301H6119j7173K69725j5201j02449j42932Q6757q6180j43601k21956L5994Q5236
$$ plain form
6290 -165661 -250702 -353355 -468240 -337160 -274772 -585625 -784166 -366612 -67820 4463
6280 4463 -26825 -212029 -393326 -587203 -424638 -306631 -278276 -321766 -227320 50738 -81432
6269 -81432 -230338 -147967 -276329 -301548 -156841 -201296 -336267 -391850 -155360 -22722 43655
6258 43655 -213235 153772 329988 394493 476774 638536 483479 132434 199779 164178 34090
6247 34090 109343 47935 -223520 -222203 40410 126882 276323 368070 424026 89872 -11256
6236 -11256 -92011 -346397 -446799 -337019 -383057 -282084 -186241 8732 115622 166117 -178328
6225 -178328 -356687 -222622 258044 321863 35254 -271885 -138188 -269329 -250192 -97237
6215 -97237 -204852 -262857 -348275 -458379 -295312 -232537 -485678 -644852 -585780 -404149 -298977
$$ packed form
6290a65661q5041j02653j14885J31080O2388l10853j98541M17554K98792P2283
6280D463l1288j85204j81297j93877J62565J18007K8355m3490R4446K78058j32170
6269h1432j48906Q2371j28362k5219J44707m4455j34971n5583K36490J32638O6377
6258D3655k56890L67007J76216O4505Q2281J61762j55057l51045O7345l5601j30088
6247C4090P5253o1408k71455J317K62613Q6472J49441R1747N5956l34154j01128
6236a1256q0755k54386j00402J09780m6038J00973R5843J94973J06890N0495l44445
6225a78328j78359J34065M80666O3819k86609l07139J33697j31141J9137J52955
6215i7237j07615n8005q5418j10104J63067O2775k53141j59174N9072J81631J05172
$$ plain form
6204 -298977 -64307 132193 226325 257596 -77575 -148689 -152802 -18428 59519 -184288 -502201
6193 -502201 -392629 -362541 -170510 -74181 -189226 -179715 -97225 -25391 104904 154896 83649
6182 83649 233350 207572 -229373 -167203 -138772 -64095 20440 -48159 -53131 -148846 -8123
6171 -8123 162638 98989 219725 164169 41489 -42934 25835 -169524 -243230 -13304 174809
6160 174809 88165 3750 -24122 -87036 -120657 -120405 -52568 49856 305953 250666 257612 226587
6148 226587 118868 -30690 -114747 -48653 -217165 -92397 -184320 -322273 -128340 225197
6138 225197 16417 28490 112412 -93942 -217081 -320223 -268844 -185739 114023 243741
6128 243741 164390 105138 94721 -26977 -228354 -358117 -150682 -387733 -321122 -164531
$$ packed form
6204b98977K34670J96500R4132L1271l35171p1114m113J34374P7947k43807l17913
6193e02201J09572L0088J92031R6329j15045R511Q2490P1834J30295M9992p1247
6182H3649J49701k5778m36945O2170K8431P4677Q4535o8599m972r5715J40723
6171h123J70761o3649J20736n5556j22680q4423O8769j95359p3706K29926J88113
6160A74809q6644q4415k7872o2914l3621K52O7837J02424K56097n5287O946l1025
6148B26587j07719j49558q4057O6094j68512J24768r1923j37953J93933L53537
6138B25197k08780J2073Q3922k06354j23139j03142N1379Q3105K99762J29718
6128B43741p9351n9252j0417j21698k01377j29763K07435k37051O6611J56591
$$ plain form
6118 -164531 -69770 171055 12545 -85813 191029 239014 109234 188737 209119 87225 250904
6107 250904 374356 190056 -45031 -16942 -58638 -145083 -230356 -102792 -88236 -158210 -31518
6096 -31518 -24473 -88718 -2905 -183590 -331396 -310581 -412864 -436074 -28697 314850 326453
6085 326453 269973 -37079 -388321 -566652 -514530 -392622 -329394 -419206 -282303 4463
6075 4463 213504 186113 -71383 -91710 -126325 -377682 -445206 -601664 -537829 -406075 -234604
6064 -234604 -319883 -444649 -567981 -349531 -244063 -271238 -258899 -306814 -295428 -39485 -229866
6053 -229866 -356416 -213942 25853 213333 449491 443985 375202 254478 72972 -89534
6043 -89534 -354720 -231982 -203177 -292671 16913 -19622 -169027 -113411 155006 -125470 -514882
$$ packed form
6118a64531R4761K40825j58510r8358K76842M7985j29780P9503K0382j21894J63679
6107B50904J23452j84300k35087K8089m1696q6445q5273J27564J4556o9974J26692
6096c1518P045o4245Q5813j80685j47806K0815j02283k3210M07377L43547J1603
6085C26453n6480l07052l51242j78331N2122J21908O3228q9812J36903K86766
6075D463K09041k7391k57496k0327l4615k51357o7524j56458O3835J31754J71471
6064b34604q5279j24766j23332K18450J05468k7175J2339m7915J1386K55943j90381
6053b29866j26550J42474K39795J87480K36158n506o8783j20724j81506j62506
6043h9534k65186J22738K8805q9494L09584l6535j49405N5616K68417k80476l89412
$$ plain form
6032 -514882 -256999 -116503 -168324 -291147 -381470 -616357 -581421 -237617 -119634 -295837
6022 -295837 -242556 -123731 -177256 -162565 100620 194589 -89368 18844 129332 -29317
6012 -29317 -136054 -269493 -247650 -318215 -378716 -172662 -130906 191665 294550 26901 120828
6001 120828 105786 186339 -46998 160031 352030 106161 125707 -3480 115768 217316
5991 217316 302415 123811 -42917 -96107 150905 -87507 -7208 241443 65672 -12673
5981 -12673 115103 72436 33381 -268573 -351879 -278011 -228933 -306158 -165007 -181078 -408410
5970 -408410 -240241 -145121 -204666 -70995 4651 30820 29851 53224 8134 203047 313732
5959 313732 130455 -35599 -193290 -90464 106156 -34205 -290298 -206088 -141977 -257631
$$ packed form
6032e14882K57883J40496n1821j22823r0323k34887L4936L43804J17983j76203
6022b95837N3281J18825n3525J4691K63185R3969k83957J08212J10488j58649
6012b9317j06737j33439K1843p0565o0501K06054M1756L22571J02885k67649R3927
6001A20828j5042Q0553k33337K07029J91999k45869J9546j29187J19248J01548
5991B17316Q5099j78604j66728n3190K47012k38412Q0299K48651j75771p8345
5981a2673J27776m2667l9055l01954q3306P3868M9078p7225J41151j6071k27332
5970d08410J68169R5120n9545J33671P5646K6169r69K3373m5090J94913J10685
5959C13732j83277j66054j57691J02826J96620j40361k56093Q4210O4111j15654
$$ plain form
5949 -257631 -59328 -245648 -246906 113720 330369 152772 -237348 -687018 -553738 -277306
5939 -277306 -177733 -5001 96003 -187256 -273458 -197589 10193 -73384 -161330 -329033 -120447
5928 -120447 89998 -21196 -58777 -177601 -77498 1999 119758 220401 182530 167892
5918 167892 194479 117649 -3342 107075 -13946 11047 -40227 -45417 87603 273492 131909
5907 131909 -102013 -396001 -454056 -295944 -265234 23993 93780 54231 104446 234837 287515
5896 287515 31696 -278643 -176722 -48049 -75505 -199422 -296384 -143210 -255201 -368358
5886 -368358 -174791 -228770 -190422 3100 91851 92702 353422 360460 357737 328604 -136194 -373841
5874 -373841 -450352 -220774 -12459 30616 -151666 -101247 25080 198131 10546 -93637
$$ packed form
5949b57631J98303j86320j258L60626K16649j77597l90120m49670J33280K76432
5939b77306R9573J72732J01004k83259q6202P5869K07782q3577q7946j67703K08586
5928a20447K10445j11194l7581j18824J00103P9497J17759J00643l7871j4638
5918A67892K6587p6830j20991J10417j21021K4993n1274n190J33020J85889j41583
5907A31909k33922k93988n8055J58112L0710K89227O9787l9549N0215J30391N2678
5896B87515k55819l10339J01921J28673k7456j23917r6962J53174j11991j13157
5886c68358J93567n3979L8348J93522Q8751Q51K60720P038k723k9133m64798k37647
5874c73841p6511K29578K08315M3075j82282N0419J26327J73051j87585j04183
$$ plain form
5864 -93637 199016 452125 240464 -133020 -22780 138135 88528 -269352 -530051 -446103
5854 -446103 -579523 -504940 -221912 -143041 -333044 -302070 -203965 120368 7402 -159 50360
5843 50360 -165732 -331931 -165011 -259896 -212684 -14790 -63992 -69214 -338925 -410552 -451509
5832 -451509 -288614 -91213 -106393 -65897 -65890 -18850 -133565 -137473 248525 276179 21193 -47462
5820 -47462 -27307 -235750 -169351 -61052 124632 197111 -11793 22093 -6723 226080 313648
5809 313648 204260 83971 350867 486033 219101 -132174 -211881 -94410 -403115 -752892
5799 -752892 -433074 -252032 -223994 -336192 -439027 -495370 -344030 -137350 -92656 72740
5789 72740 279896 230724 111244 64779 25781 -75243 48086 -23049 -105939 131985 76092
$$ packed form
5864i3637K92653K53109k11661l73484J10240J60915m9607l57880k60699Q3948
5854d46103j33420P4583K83028P8871j90003L0974R8105L24333j12966p561N0519
5843E0360k16092j66199J66920r4885M7212J97894m9202n222k69711p1627m0957
5832d51509J62895J97401j5180M0496PM7040j14715l908L85998K7654k54986o8655
5820d7462K0155k08443O6399J08299J85684P2479k08904L3886k8816K32803Q7568
5809C13648j09388j20289K66896J35166k66932l51275p9707J17471l08705l49777
5799g52892L19818J81042K8038j12198j02835n6343J51340K06680M4694J65396
5789G2740K07156m9172j19480m6465l8998j01024J23329p1135q2890K37924n5893
$$ plain form
5778 76092 -5498 -120567 -97113 -241623 -266880 -221300 28626 37346 114127 -77878 -117878
5767 -117878 47704 189653 122745 64998 -48980 -115331 -288442 -331822 33734 -43359 -36472
5756 -36472 -97806 -47718 -176447 -417922 -248399 -390418 -389968 -198214 -78685 -229643 -94344
5745 -94344 -18582 -70633 -178251 -206351 -311331 -657750 -732885 -369483 -134900 7122 -10180
5734 -10180 -92091 -87849 -133217 -52148 215295 280582 319978 178588 102601 83319 31152 151922
5722 151922 321131 100197 -63565 -254689 -204524 -41722 -223792 -382930 -273596 -22939
5712 -22939 -190333 -373895 -413034 -375823 -441383 -733333 -488345 -457627 -304199 -261686 -381365
5701 -381365 -441678 -243029 -272400 -206297 9318 -32015 17974 88807 -49525 -161368 141645
$$ packed form
5778G6092q1590j15069K3454j44510k5257M5580K49926Q720P6781j92005m0000
5767a17878J65582J41949o6908n7747j13978o6351j73111m3380L65556p7093O887
5756c6472o1334N0088j28729k41475J69523j42019M50J91754J19529j50958J35299
5745i4344P5762n2051j07618k8100j04980l46419p5135L63402K34583J42022j7302
5734a0180q1911M242m5368Q1069K67443O5287L9396j41390p5987j9282n2167J20770
5722A51922J69209k20934j63762j91124N0165J62802j82070j59138J09334K50657
5712b2939j67394j83562l9139L7211o5560k91950K44988L0718J53428M2513j19679
5701c81365o0313J98649k9371O6103K15615m1333M9989P0833j38332j11843L03013
$$ plain form
5690 141645 178973 105549 36001 -128701 -170930 -72615 32501 57589 114094 77150 -235998
5679 -235998 -304192 -96552 -301542 -361393 -462707 -724437 -646265 -121622 -65991 -74943 -301409
5668 -301409 -512340 -181807 12126 87864 111127 -18570 108688 107001 152513 347557 494006
5657 494006 355784 33802 -92178 192878 33512 59835 262430 275107 222577 290717
5647 290717 251459 218194 133504 -78371 -193822 -365237 -222939 -6562 84725 153593 183312
5636 183312 215620 39056 34287 117208 18528 202480 61082 180295 109547 119131 61456
5625 61456 -23032 -58865 -22441 282310 327378 282500 432329 385886 103489 -182102 -370022
5614 -370022 -332712 -303439 -404326 -460965 -454506 -279249 -259942 -102891 12059 -53244 -114828
$$ packed form
5690A41645L7328p3424o9548j64702m2229R8315J05116K5088N6505l6944l13148
5679b35998o8194K07640k04990n9851j01314k61730P8172N24643N5631q952k26466
5668c01409k10931L30533J93933P5738K3263j29697J27258j687M5512J95044J46449
5657D94006j38222l21982j25980K85056j59366K6323K02595J2677n2530O8140
5647B90717l9258l3265q4690k11875j15451j71415J42298K16377R1287O8868K9719
5636A83312L2308j76564m769Q2921r8680J83952j41398J19213p0748R584n7675
5625F1456q4488l5833L6424L04751M5068m4878J49829m6443k82397k85591j87920
5614c70022L7310K9273j00887n6639O459J75257J9307J57051J14950o5303o1584
$$ plain form
5603 -114828 -148374 -116860 -130649 16362 136652 48110 -140 20888 84270 98646 21479
5592 21479 18352 -21682 -104237 -186280 -189939 -324702 -275154 -338474 -199260 -32568 87511
5581 87511 150860 -37249 -330071 -322381 -220596 75684 318167 274873 438642 529989 283702
5570 283702 349706 390498 111410 -9757 -425 31141 -104001 -56957 113252 125889 -113039
5559 -113039 -302562 -414930 -492790 -372748 -556275 -599989 -361735 -338038 -329825 -305048 -160141
5548 -160141 -101378 -179370 -163981 67738 310345 396458 267296 49148 -31509 49465 -67153
5537 -67153 -67262 -191208 -116189 89190 222886 356306 353577 137857 78780 -104662 -554439
5526 -554439 -429185 -122158 -364610 -602988 -505612 -404173 -159048 -183174 -331091 -503292
$$ packed form
5603a14828l3546L1514j3789J47011J20290q8542m8250K1028O3382J4376p7167
5592B1479l127m0034q2555q2043l659j34763M9548o3320J39214J66692J20079
5581H7511O3349j88109k92822P690J01785K96280K42483m3294J63769R1347k46287
5570B83702O6004M0792k79088j21167R332L1566j35142M7044J70209J2637k38928
5559a13039j89523j12368p7860J20042j83527m3714K38254K3697Q213K4777J44907
5548a60141N8763p7992J5389K31719K42607Q6113j29162k18148q0657Q0974j16618
5537f7153j09j23946P5019K05379J33696J33420k729k15720n9077j83442m49777
5526e54439J25254L07027k42452k38378R7376J01439K45125k4126j47917j72201
$$ plain form
5516 -503292 -550379 -651920 -475270 -295339 -232054 -218048 39917 80882 203985 -147021
5506 -147021 -365995 -386752 -106572 -7634 -50316 -44030 215504 105483 -181778 -363093 -428918
$$ packed form
5516e03292m7087j01541J76650J79931O3285J4006K57965M0965J23103l51006
5506a47021k18974k0757K80180R8938m2682O286K59534j10021k87261j81315o5825
$$ [...]
##END NTUPLES=NMR SPECTRUM
##END=
