##TITLE=Analysis number 329394
Compound Code cc 35801
Project Code adrs
Chemist Name ugmt ltd
##JCAMPDX= 6.0         $$ Bruker NMR JCAMP-DX V2.0
##DATA TYPE= NMR SPECTRUM
##DATA CLASS= NTUPLES
##ORIGIN= Bruker BioSpin GmbH
##OWNER= nmr
$$ XWIN-NMR		Version 3.5
$$ Tue Aug 28 12:42:39 2007 GMT Daylight Time (UT+1h)  MAYBRIDGE\nmr@NMR_250MHZ
##.OBSERVE FREQUENCY= 250.131544655141
##.OBSERVE NUCLEUS= ^1H
##.ACQUISITION MODE= SIMULTANEOUS (DQD)
##.ACQUISITION SCHEME= undefined
##.AVERAGES= 16
##.DIGITISER RES= 18
##SPECTROMETER/DATA SYSTEM= dpx250
##.PULSE SEQUENCE= zg30
##.SOLVENT NAME= DMSO
##.SHIFT REFERENCE= (INTERNAL, DMSO, 0, 16.522)
##AUDIT TRAIL= $$ (NUMBER, WHEN, WHO, WHERE, WHAT)
$$ ##TITLE= Audit trail, XWIN-NMR		Version 3.5
$$ ##JCAMPDX= 5.01
$$ ##ORIGIN= Bruker BioSpin GmbH
$$ ##OWNER= nmr
$$ C:\u/data/dgb/nmr/ADRS/1180/pdata/1/auditp.txt
$$ ##AUDIT TRAIL=  $$ (NUMBER, WHEN, WHO, WHERE, WHAT)
(   1,<2007-08-28 12:39:44.68 +100>,<MAYBRIDGE\nmr>,<NMR_250MHZ>,
      <created by zg, POWCHK disabled, PULCHK disabled
       configuration hash MD5:
       76 6E 9A 78 1E 09 19 81 EC 84 63 8F B0 6A 59 2D
       data hash MD5: 64K
       9A 0A 6F 81 EC 91 F4 96 20 7E B5 87 80 C1 82 E8>)
(   2,<2007-08-28 12:40:34.76 +100>,<MAYBRIDGE\nmr>,<NMR_250MHZ>,
      <Start of raw data processing
       ef LB = 0.3 FT_mod = 6 PKNL = 1 SI = 32K 
       data hash MD5: 32K
       A5 01 71 D5 41 C3 A5 FF 71 8B D7 8B 56 DC E4 38>)
(   3,<2007-08-28 12:40:45.85 +100>,<MAYBRIDGE\nmr>,<NMR_250MHZ>,
      <apk 
       data hash MD5: 32K
       93 51 3A 3D 94 DF 22 C5 5B A1 D8 BC 98 71 CB D0>)
(   4,<2007-08-28 12:40:55.01 +100>,<MAYBRIDGE\nmr>,<NMR_250MHZ>,
      <abs ABSG = 5 
       data hash MD5: 32K
       F8 6F CA 02 4C 92 D6 56 95 A1 3A F3 2F 4E A4 87>)
$$ ##END=
$$ 
$$ hash MD5
$$ A4 04 76 62 83 4F F6 8B 87 E6 4B F1 A8 64 36 F5
##$RELAX= 
##$RELAX= 
##$RELAX= 
##$RELAX= 
##$RELAX= 
##$RELAX= 
##$RELAX= 
$$ Bruker specific parameters
$$ --------------------------
##$DU= <C:\u>
##$EXPNO= 1180
##$NAME= <ADRS>
##$PROCNO= 1
##$TYPE= <nmr>
##$USER= <dgb>
##$AMP= (0..31)
100 100 100 100 100 100 100 100 100 100 100 100 100 100 100 100 100 100 
100 100 100 100 100 100 100 100 100 100 100 100 100 100 
##$AQSEQ= 0
##$AQ_mod= 3
##$AUNM= <au_zg>
##$AUTOPOS= <36 >
##$BF1= 250.13
##$BF2= 250.13
##$BF3= 250.13
##$BF4= 250.13
##$BF5= 500.13
##$BF6= 500.13
##$BF7= 500.13
##$BF8= 500.13
##$BYTORDA= 1
##$CFDGTYP= 0
##$CFRGTYP= 5
##$CHEMSTR= <none>
##$CNST= (0..31)
1 1 145 1 1 1 1 1 1 1 1 1 1 1 1 1 1 1 1 1 1 1 1 1 1 1 1 1 1 1 1 1 
##$CPDPRG= <>
##$CPDPRG1= <>
##$CPDPRG2= <>
##$CPDPRG3= <>
##$CPDPRG4= <mlev>
##$CPDPRG5= <mlev>
##$CPDPRG6= <mlev>
##$CPDPRG7= <mlev>
##$CPDPRG8= <mlev>
##$CPDPRGB= <>
##$CPDPRGT= <>
##$D= (0..31)
0 1 0 0 0 0 0 0 0 0.06 0 0 0 0 0 0 0.0002 0 0 0 0 0 0 0 0 0 0 0 0 0 0 
0 
##$DATE= 1188301178
##$DBL= (0..7)
120 120 120 120 120 120 120 120 
##$DBP= (0..7)
150 150 150 150 150 150 150 150 
##$DBP07= 0
##$DBPNAM0= <>
##$DBPNAM1= <>
##$DBPNAM2= <>
$$ [...]
##$SUBNAM7= <"">
##$SUBNAM8= <"">
##$SUBNAM9= <"">
##$SW= 20.6930455092707
##$SWIBOX= (0..15)
0 0 3 0 0 0 0 0 0 0 0 0 0 0 0 0 
##$SW_h= 5175.983436853
##$TD= 65536
##$TD0= 1
##$TE= 296.16
##$TE2= 300
##$TE3= 300
##$TEG= 300
##$TL= (0..7)
0 120 120 120 120 120 120 120 
##$TP= (0..7)
150 150 150 150 150 150 150 150 
##$TP07= 0
##$TPNAME0= <>
##$TPNAME1= <>
##$TPNAME2= <>
##$TPNAME3= <>
##$TPNAME4= <>
##$TPNAME5= <>
##$TPNAME6= <>
##$TPNAME7= <>
##$TPOAL= (0..7)
0.5 0.5 0.5 0.5 0.5 0.5 0.5 0.5 
##$TPOFFS= (0..7)
0 0 0 0 0 0 0 0 
##$TUNHIN= 0
##$TUNHOUT= 0
##$TUNXOUT= 0
##$USERA1= <user>
##$USERA2= <user>
##$USERA3= <user>
##$USERA4= <user>
##$USERA5= <user>
##$V9= 5
##$VALIST= <valist>
##$VCLIST= <CCCCCCCCCCCCCCC>
##$VD= 0
##$VDLIST= <DDDDDDDDDDDDDDD>
##$VPLIST= <PPPPPPPPPPPPPPP>
##$VTLIST= <TTTTTTTTTTTTTTT>
##$WBST= 1024
##$WBSW= 4
##$XGAIN= (0..3)
0 0 0 0 
##$XL= 0
##$YL= 0
##$YMAX_a= 273862
##$YMIN_a= -192432
##$ZGOPTNS= <>
##$ZL1= 120
##$ZL2= 120
##$ZL3= 120
##$ZL4= 120
##$ABSF1= 16.522
##$ABSF2= -4.171173
##$ABSG= 5
##$ABSL= 3
##$ALPHA= 0
##$AQORDER= 0
##$ASSFAC= 0
##$ASSFACI= 0
##$ASSFACX= 0
##$ASSWID= 0
##$AUNMP= <proc_1d>
##$AZFE= 0.1
##$AZFW= 0.1
##$BCFW= 0
##$BC_mod= 0
##$BYTORDP= 0
##$COROFFS= 0
##$CY= 12.5
##$DATMOD= 1
##$DC= 0
##$DFILT= <>
##$DTYPP= 0
##$F1P= 14.0000005364418
##$F2P= -0.99999901652339
##$FCOR= 0.5
##$FTSIZE= 32768
##$FT_mod= 6
##$GAMMA= 0
##$GB= 0
##$INTBC= 1
##$INTSCL= 1
##$ISEN= 128
##$LB= 0.3
##$LEV0= 0
##$LPBIN= 0
##$MAXI= 10000
##$MC2= 0
##$MEAN= 0
##$ME_mod= 0
##$MI= 0
##$NCOEF= 0
##$NC_proc= -5
##$NLEV= 6
##$NOISF1= 0
##$NOISF2= 0
##$NSP= 0
##$NTH_PI= 0
##$NZP= 0
##$OFFSET= 16.522
##$PC= 1
##$PHC0= -46.19912
##$PHC1= 3.314155
##$PH_mod= 1
##$PKNL= yes
##$PPARMOD= 0
##$PSCAL= 4
##$PSIGN= 0
##$REVERSE= no
##$SF= 250.13
##$SI= 32768
##$SIGF1= 0
##$SIGF2= 0
##$SINO= 400
##$SIOLD= 32768
##$SREGLST= <1H.DMSO>
##$SSB= 0
##$STSI= 32768
##$STSR= 0
##$SW_p= 5175.98343685301
##$SYMM= 0
##$S_DEV= 0
##$TDeff= 65536
##$TDoff= 0
##$TI= <Analysis number 999999
Compound Code 99
Book Reference 9
Project Code 9>
##$TILT= no
##$TM1= 0
##$TM2= 0
##$TOPLEV= 0
##$USERP1= <user>
##$USERP2= <user>
##$USERP3= <user>
##$USERP4= <user>
##$USERP5= <user>
##$WDW= 1
##$XDIM= 32768
##$YMAX_p= 347913434
##$YMIN_p= -717157
$$ End of Bruker specific parameters
$$ ---------------------------------
##NTUPLES= NMR SPECTRUM
##VAR_NAME=  FREQUENCY,     SPECTRUM/REAL,   SPECTRUM/IMAG
##SYMBOL=    X,             R,               I
##VAR_TYPE=  INDEPENDENT,   DEPENDENT,       DEPENDENT
##VAR_FORM=  AFFN,          ASDF,            ASDF
##VAR_DIM=   32768,         32768,           32768
##UNITS=     HZ,            ARBITRARY UNITS, ARBITRARY UNITS
##FACTOR=    0.157963299565203, 1,           1
##FIRST=     4132.6476996994, 0,             0
##LAST=      -1043.33573715361, 0,           0
##MIN=       -1043.33573715361, -717157,     0
##MAX=       4132.6476996994, 347913434,     0
$$ Real data points
##PAGE= N=1
##DATA TABLE= (X++(R..R)), XYDATA
$$ [...]
28188 8734 -120126 1184 -55025 -74383 -110512 -23599 -136160 -262463 -74343 51931 -87570
28177 -87570 -197406 -44230 136505 120027 281784 306307 187734 36570 -144554 99701
28167 99701 218895 285383 181220 196398 186738 182883 189004 49715 43129 138463 131474 84496
28155 84496 95959 -64309 -51964 -7304 165518 254727 225690 275965 214174 316387 302268
28144 302268 225290 150618 -92217 -19642 99303 61329 -72586 -257051 -281120 -145897
28134 -145897 23560 158954 70113 -35703 -12326 -42082 -138231 -207035 -121220 -21703 -34776
28123 -34776 -23120 51859 49211 6 5832 -18297 14348 -76839 -22149 132654 93997 194546
28111 194546 151706 58985 70691 11876 -39327 47617 21406 -42497 24206 -112555 -112335 -50933
28099 -50933 161415 99048 -114144 37950 87899 105253 171941 236439 17103 -18752 115723
28088 115723 54621 106003 189790 164302 287904 154795 -71910 -34202 -7443 -75292 28763
28077 28763 234076 346563 148258 8062 -11023 130312 294581 183440 96480 213114
28067 213114 189662 73435 164322 292256 447851 340851 315461 280559 202087 143433 146296
28056 146296 212703 219943 210597 89919 -36757 -36284 -19615 130995 326632 269861 271550 110427
28044 110427 424 -19184 -8930 41498 109092 195430 236246 315335 389050 400390 519453
28033 519453 537954 513835 471404 461202 521148 588262 486578 418583 284972 365081 136004
28022 136004 70867 120883 183439 288260 310570 267588 14540 -193476 -23098 160777
28012 160777 252072 158395 102808 249645 372800 398855 218170 256292 177933 99334 63617
28001 63617 130114 138631 131153 149100 171704 258000 327649 351757 298403 168573 78019 176959
27989 176959 257019 215812 144332 144348 212630 55632 17993 12305 167735 224526 9912 -42484
27977 -42484 -24688 131272 293959 313703 234259 228281 256175 243118 140164 -21713 -27737
27966 -27737 50096 42217 83342 147353 217035 213242 356383 550460 538361 294488 279189
27955 279189 301992 313318 413292 477776 422406 498547 484155 420515 317756 238504 420809
27944 420809 599899 608836 422655 271429 361375 438518 352602 216401 205534 225473 259776
27933 259776 444164 603348 660589 483390 551592 439220 302579 149321 96481 323745
27923 323745 364016 344697 275617 391289 483491 354386 460772 592923 484305 483219 558599
27912 558599 515038 422515 255154 139580 288646 383953 447130 552725 515920 549065 574824
27901 574824 526381 525781 513483 416453 479542 642828 725256 698425 472966 384142 483333
27890 483333 436761 388181 435142 409044 352692 344805 481508 559342 506194 555346 492065
27879 492065 318916 256075 322690 331585 335208 348035 483570 555830 587380 691523 491443
27868 491443 328485 452159 450959 443478 420332 412387 254385 201889 458989 450101 318970
27857 318970 389462 473554 668374 646233 645056 706385 595324 414279 378379 395046 546291
27846 546291 714227 834224 849648 777323 744427 687061 641927 444417 377150 313436 473121
27835 473121 578561 495875 375526 485654 476501 591177 720073 823628 874865 761824
27825 761824 690831 801240 746753 737904 647577 613973 529275 815252 784132 733242 821174
27814 821174 693779 546781 618850 604691 667430 734588 722657 814448 829962 840068 826830
27803 826830 881818 918787 872871 790169 740887 685517 780619 891637 929558 841030 771575
27792 771575 731678 612528 713211 754608 739426 933037 948633 800347 796172 997529 1108774
27781 1108774 1016441 990215 1118605 1245636 1250244 1346765 1392251 1190731 1131462 1078132 1033595
27770 1033595 1034571 1164947 1115110 1170569 1345930 1362219 1315633 1297247 1110587 1140229 1046765
27759 1046765 996071 1098757 1169168 1253944 1242824 1282004 1495330 1479747 1495181 1482748 1415941
27748 1415941 1460729 1356877 1447968 1557408 1570234 1559269 1647798 1764510 1841434 1937735 1927255
27737 1927255 1840695 1678497 1732129 1933496 1770812 1898120 2251696 2239681 2191248 2236616
27727 2236616 2255229 2180083 2104503 2158380 2253691 2463028 2508299 2545437 2405133 2411473 2402054
27716 2402054 2180236 2228108 2200438 2237859 2267652 2264522 2503463 2723062 2920238 3043776
27706 3043776 2937092 2877031 2895431 2888141 2786660 2823017 3070181 3139237 3099073 3021959 3139917
27695 3139917 3314316 3495030 3553264 3603425 3571792 3573127 3704583 3913931 4034043 4126293
27685 4126293 4215133 4306268 4451452 4466731 4530861 4512227 4467274 4572299 4598380 4737385 4924866
27674 4924866 5062532 5180500 5373996 5378254 5418930 5681651 5917604 6013884 5999429 6170841
27664 6170841 6414682 6621650 6635549 6647076 6836006 7177819 7436628 7570629 7821302 7986632
27654 7986632 8082549 8190732 8417898 8778273 8915619 9104853 9439953 9901400 10104535 10420960
27644 10420960 10693420 10905717 11106461 11306430 11690437 11932213 12355209 12988060 13302161
27635 13302161 13428854 13709747 14165637 14554609 14940371 15506299 15967540 16279969 16660332
27626 16660332 17268486 17705124 18077605 18779415 19413369 19892158 20250672 20748518 21391835
27617 21391835 21862412 22349491 22780653 23130296 23563433 24169582 24673963 25103296 25637019
27608 25637019 26108154 26742192 27099143 27447935 27638391 27884054 28139858 28517051 28699835
27599 28699835 28708118 28712425 28845508 28817144 28757936 28764805 28732426 28450577 28166297 27942836 27862425
27588 27862425 27654568 27425106 27104426 26731379 26281511 25798041 25431826 24885350 24328014
27579 24328014 23866777 23375320 22697533 22111058 21558872 21264041 20916079 20400381 19994148
27570 19994148 19648060 19101258 18522323 18020922 17483028 17045433 16638388 16134521 15866701
27561 15866701 15577916 15129644 14774216 14443426 14143375 13692309 13286956 12797970 12385267
27552 12385267 12214392 11889892 11520173 11155081 10814599 10388599 10134923 9973299 9696376
27543 9696376 9539647 9433954 9233527 8952615 8875348 8567834 8270534 8074669 7984620 7778692
27533 7778692 7760859 7486505 7342406 7277120 7011540 6741683 6599490 6440824 6282659 6039545
27523 6039545 6034700 5849931 5497468 5480470 5612175 5730139 5688512 5534299 5236191 5094548
27513 5094548 5083151 5009086 4802792 4707613 4736695 4768590 4720437 4717645 4526181 4254598 4121167
27502 4121167 4085516 4100189 4002430 4002412 3872254 3708937 3579746 3563205 3630906 3647992 3633948
27491 3633948 3570813 3404326 3375604 3248419 3221723 3235305 3195188 3005289 2952347 3110361
27481 3110361 3069373 2913182 2831296 2961393 2960266 2916021 2872932 2749279 2760435 2780346 2743736
27470 2743736 2676066 2674369 2533544 2468441 2623111 2581925 2542048 2434353 2287228 2218365 2370509
27459 2370509 2402017 2291832 2260516 2179312 2232380 1950856 1849484 1962351 1868201 1863843 1929674
27448 1929674 1907399 1831936 1868284 1959620 1882335 1969300 2002313 1845958 1874111 1862781 1587777
27437 1587777 1642851 1719199 1878140 1894031 1765201 1625207 1620754 1570701 1597096 1673193 1665121
27426 1665121 1710804 1704463 1643335 1545444 1470417 1447019 1406991 1349025 1346740 1429533 1542103
27415 1542103 1440772 1212881 1305595 1460295 1614325 1375869 1126479 1108748 1070802 1106121
27405 1106121 1261547 1210370 1159910 1171077 1246235 1273227 1226839 1086436 1025510 961964 963529
27394 963529 962711 979448 1069651 1043556 1045874 1181591 1388332 1393605 1366722 1354089 1089414 1090106
27382 1090106 1028671 1046490 1041992 934354 877928 984356 990900 971028 1001055 1088705 1105618
27371 1105618 993891 1001355 960627 927020 1112487 1096592 945599 926720 908256 947960 897942
27360 897942 790839 807388 670389 683801 673092 647337 722173 788838 716045 804199 856711
27349 856711 842922 813588 817560 902761 779425 774822 668212 851700 877358 806164 634479
27338 634479 596883 683724 698541 507384 436255 545878 636425 733249 641947 462543 514803
27327 514803 433175 483139 503073 555008 602668 686032 719019 721614 661229 612578 642496 761383
27315 761383 710748 702582 737776 667568 513669 449760 377474 423427 470404 356273 385959
27304 385959 356839 336725 369931 305252 433147 504135 522843 482165 478428 526836 416815
27293 416815 488427 596658 538215 611857 684557 745098 515955 529274 469078 366540 233011
27282 233011 343258 444391 622867 735310 530390 464359 442037 265376 155858 234810
27272 234810 303667 294500 225962 302791 361023 342269 358760 329482 358536 335383 259780 271655
27260 271655 335533 357536 423761 464811 451268 450794 558649 617636 519679 378419 354725
27249 354725 495060 455084 379988 306494 346312 342182 214907 323377 320425 294822 403223
27238 403223 481586 535441 537704 411166 456891 467015 393482 264070 388231 363686 502042
27227 502042 588343 453335 463498 391000 398505 249480 261941 450354 551881 576875 553059
27216 553059 450931 498892 553835 621426 528915 437234 442750 348637 328118 317511 298319
27205 298319 223369 96151 13336 66057 250425 422249 356819 304381 188588 76752
27195 76752 51851 231395 302294 280373 302755 235678 390975 576903 575421 402688 225084
27184 225084 107026 99697 296169 250671 -29491 -135219 -2040 88874 191543 301010
27174 301010 298577 106675 48194 89655 1165 31642 336864 367095 350681 326002 433683
27163 433683 404466 460863 573669 530368 438975 448809 339232 251628 388390 491879 416513
27152 416513 373886 278844 301049 360612 401511 480595 450686 363704 248643 291430 281773
27141 281773 351192 318224 280286 162202 -37816 109623 99002 259061 365630 293761
27131 293761 115553 177324 177040 204262 374411 444270 360178 466866 274774 269437 402257
27120 402257 303986 346358 372516 302171 322283 428905 371840 311423 317728 413730 354024
27109 354024 218871 264333 388734 319444 145388 235622 296744 288856 286725 308525 423719
27098 423719 593459 475179 327935 179686 272942 366221 336284 327416 246279 204754 275833
27087 275833 368917 240468 277255 218959 124664 160441 227495 122528 38038 112091 120836
27076 120836 182315 202230 237383 301392 290355 240764 81208 -14958 37791 104607 35792
27065 35792 -24216 -28884 63322 90253 -69493 -7670 -48521 -84689 -53475 -60423 21804 154626
27053 154626 188438 268037 374368 393347 280091 139166 257889 346640 228401 100619
27043 100619 99928 215885 129778 99916 243251 182313 -56311 -116986 210389 136522 -50119
27032 -50119 -1215 77712 -32546 -49988 -66925 -64910 -184580 -189565 88886 356938 245955
27021 245955 159867 186585 154137 55106 163458 187259 17268 31374 38840 -118508 29570
27010 29570 77724 117027 382826 356308 463232 526704 466913 389324 349188 352388 265748
26999 265748 71255 104683 205169 163896 213424 229648 219801 177488 107275 87001 140614
26988 140614 178323 157773 236013 305574 223009 206829 201017 310253 112363 40390 -28014
26977 -28014 -152906 -178933 27560 271779 243127 49684 11313 51063 -56406 -112478 40510
26966 40510 188060 98416 214070 295503 251723 110316 192770 114838 -79507 -298955 -225724
26955 -225724 -79296 227132 325117 324826 194542 149366 78265 23766 -91004 -56021 126960
26944 126960 196554 255382 269960 126114 75640 185721 282558 247649 220946 347938 208170
26933 208170 172751 304697 252016 102915 -31050 -64912 92651 253314 329916 346997
26923 346997 381457 414090 358901 243176 168378 108219 377 -14657 187856 259515 382266
26912 382266 293966 165435 81553 23196 107329 -4794 3350 125003 4977 -27726 -54887
26901 -54887 -35292 14508 76511 298284 304068 200127 225348 312531 134504 87927 191797
26890 191797 212254 235337 54619 87075 211208 372544 68065 -134332 -16338 156730
26880 156730 163211 178789 141637 60759 -146782 -32152 171870 262586 271516 118856 -59267
26869 -59267 -160429 -280795 -259338 8090 57538 -96605 -246335 -177931 -19524 132887
26859 132887 148336 269965 236783 230782 163315 -116441 -81547 83500 91338 188176 245311
26848 245311 172914 -14398 -69751 -48453 -41222 111455 326279 143978 -5610 86254 100838
26837 100838 -65678 -256764 -127683 -124210 -211232 10838 65344 200819 312796 320276 234725
26826 234725 201836 99236 254886 244643 244586 167849 112818 95193 63992 -11116 171773
26815 171773 279761 261675 312590 239471 -38036 -187339 -59021 125913 142675 -216872
26805 -216872 -345538 -277944 -211546 -206727 -150431 20903 141151 138439 55557 246799 281864
26794 281864 286318 323650 304933 208662 39266 -190330 -218943 -106259 -109796 -208034 -54249
26783 -54249 147514 246367 260300 345607 279933 190045 186646 102509 169397 115102 9686
26772 9686 11394 -35966 -169531 -123951 166279 301285 476861 401403 75931 63002 219420
26761 219420 203805 69391 -66937 -78091 -53440 217038 373753 201978 227506 288695
26751 288695 294002 138498 134435 -6303 -74061 17847 -35410 -111754 -177142 -120561 35659
26740 35659 144661 119015 144029 93974 151867 58950 14216 12541 24119 51147 -115502
26729 -115502 -39730 136245 202907 145319 182776 -57262 -194685 -59725 71601 120941
26719 120941 87033 -12193 166977 230722 76499 10263 44149 125307 140899 249821 198568
26708 198568 342703 403617 224922 182007 295198 178551 18381 60178 76624 14368
26698 14368 23572 -71855 -34452 80589 52955 133889 222974 422501 345073 169401 -18365
26687 -18365 -63340 93098 311051 419325 376376 155668 2832 -71081 -172078 6991
26677 6991 100487 191229 28176 -170986 -171318 -234061 -62088 48505 41855 17227 -36076 -141886
26665 -141886 -263781 33091 186177 448143 571553 342320 171339 236727 233266 136440
26655 136440 108006 -15396 148981 172808 94552 128895 282085 240088 57451 -140791
26645 -140791 -250412 -117070 27335 -17878 -139372 -104966 9471 837 187914 172498
26635 172498 79653 106324 93592 -10349 -88000 -47015 172090 431922 415207 234114 111693
26624 111693 97253 -141881 -249726 23581 141415 185852 64238 -87917 27519 232057
26614 232057 455594 482491 381675 387874 285277 196713 195547 71097 -112887 -38665 304551
26603 304551 298637 148320 206437 196841 109230 -7431 -53345 -29811 74669 4526 -110744
26592 -110744 -23142 254177 302280 181628 57537 70743 29697 -5324 44908 101859 320089
26581 320089 244595 187869 132874 132242 195795 194649 55351 58277 54651 83264 -3329 -102670
26569 -102670 -86495 125969 362427 290859 163550 124909 169823 67206 63790 200636 166806
26558 166806 188818 87395 18994 160690 101111 -34622 -77129 -92050 -69158 -131613 -368912
26547 -368912 -364254 -160950 137945 184790 18652 138850 108237 -137818 -259340 -144476
26537 -144476 -111911 -181945 -187777 -96010 -71517 -126092 -54145 57041 146286 41383 -17254
26526 -17254 -50823 -47812 -121933 -194664 -122020 -190633 -252388 -199542 -53330 -6418 -18611 -71224
26514 -71224 -157820 -201185 11808 84426 382 -67565 -26379 139779 280241 208055 159769
26503 159769 228815 293485 238534 146622 149814 193274 25220 -56556 101766 204123 135360
26492 135360 159467 152285 191199 169952 225952 336721 309406 162311 162991 214829 219120 43561
26480 43561 -35125 -68524 65807 287366 136322 28685 -32449 -41425 -42718 119249 216177
26469 216177 92567 115101 156446 -2041 75451 116896 142419 199034 112149 25373 -51066
26458 -51066 -45607 96338 160714 145937 180666 210799 197977 226015 199067 173398 98834 -34625
26446 -34625 -113503 -86302 -28265 -270 90391 131526 99100 197732 84897 -61567 -17107
26435 -17107 -126622 -157674 -118810 26208 138820 263628 109136 -158785 -144814 -9948
26425 -9948 -73986 -130754 -164017 -74933 30462 156421 226903 172871 91568 -83013 25317
26414 25317 112348 130142 89457 111598 46803 18069 -79454 8219 -206972 -148397 42824
26403 42824 174213 127536 12565 8449 161374 185589 -73534 -96417 79198 123137 108090
26392 108090 -39469 103194 326642 363333 364178 210866 -29420 23018 204553 93956
26382 93956 -1487 -167839 -206679 -215291 20432 72619 79755 72784 141750 -35427 -78369 -12378
26370 -12378 120492 128805 98055 -87302 -57555 -1739 -151785 -60816 16248 166364 293790
26359 293790 466387 391245 203365 698 -44391 6313 -17610 -44757 38806 76698 81549
26348 81549 167855 309062 231075 257718 95016 39618 93135 -34104 -33224 -29150 -16257 -56862
26336 -56862 -181282 -214861 -225995 -155582 -62549 88689 68259 96597 68194 33031 55102
26325 55102 140106 238079 207815 -59200 -54227 -81282 -195502 -144393 105860 160069 206469
26314 206469 14242 -128640 -169577 37565 -21322 -12288 34000 -47487 -119655 -110735 -165261
26303 -165261 -314145 -393569 -291961 -167540 -49618 -42586 -88619 -185003 -246901 51634 229745
26292 229745 155323 50863 -23791 -145790 -204518 -55583 169870 145169 35999 38060 126600
26281 126600 10003 -135576 -109560 36102 34862 -23953 -87691 -195613 -234027 -136455 -22404
26270 -22404 -50395 -100753 35878 205720 265804 347095 317325 416144 354239 142441 67115
26259 67115 107971 52819 100006 322290 384918 237202 2091 -75578 47585 145767 166501
26248 166501 224014 326593 453090 474493 377295 315502 183441 -8157 -63105 -141305 -208526
26237 -208526 -28897 119155 34001 -7679 67492 86012 203102 120071 -7160 -131116
26227 -131116 11795 24122 15660 -66616 -97570 4019 73948 231798 168524 19450 -34703
26216 -34703 -59534 -163049 -124602 160304 217255 -86106 -112928 -72060 38858 -22195 86270
26205 86270 37593 66225 342627 224843 74328 71391 56942 117087 307555 307447 197635
26194 197635 9491 2201 340492 467136 378628 132809 106061 237902 399644 322116
26184 322116 248166 102745 33087 -5061 155707 95311 20764 8069 -27965 56464 46699
26173 46699 27058 88900 17528 95064 260576 224382 298059 204490 85015 -14319 45928
26162 45928 -69029 -15218 124827 157725 23020 59034 80219 58621 18629 147738 98202
26151 98202 89882 130316 369508 485194 498185 383980 190812 49231 156045 75876 12969
26140 12969 249825 269290 240716 421400 348692 192896 136536 194813 58256 150832 192971
26129 192971 77415 89753 -81271 -63689 87166 225334 312231 206382 142296 66862
26119 66862 34544 63804 -49175 -86622 -19517 -71180 87295 113945 18044 91857 163279
26108 163279 180978 81311 106326 116895 101644 106209 121858 -45978 -54005 -101338 -36915 53286
26096 53286 184868 262188 352946 367271 373238 219362 75810 141931 132653 -16321 -6577
26085 -6577 -112142 -82283 -116333 -313770 -24186 156814 176884 38739 -63185 -112577 -145912
26074 -145912 56147 17192 -56568 66094 39039 -128411 -585 11978 2267 92343 44879
26063 44879 43547 80288 -13474 -110138 -223056 -251894 -233492 -61655 133792 277076 176173
26052 176173 62702 -119385 9318 93325 170934 142944 53512 -53988 -140458 25610
26042 25610 235050 328549 233170 146756 107888 99819 165660 124214 -42647 -257579 -247391
26031 -247391 -131321 59233 58454 19760 66204 87900 -35403 -27431 16321 -46457 -49128 -120545
26019 -120545 -124496 -123428 -15133 -99446 -287981 -174722 41246 108627 2598 84651 102985
26008 102985 93802 -29923 -117510 17367 -42930 -66211 252368 191632 225555 199981 63620
25997 63620 108801 145711 240730 96580 -84364 -115456 56005 93015 -4432 -35448 -147741
25986 -147741 -80288 -57893 -100037 -90673 -28500 174211 393402 497046 269741 154640 54767
25975 54767 160487 343633 399417 230168 53831 337 -73048 5491 -42438 -32891 201194
25964 201194 128992 -17297 -139165 -46227 116499 145458 229319 55890 40238 166247
25954 166247 258744 355996 249995 62881 -66908 -216922 -107372 20280 137490 333467
25944 333467 334815 252429 59087 -120780 -108255 96684 -21219 -208378 -208682 -131612 -12035
25933 -12035 158387 -9412 12276 -52510 40033 77082 6024 -14297 3671 -35428 -78984
25922 -78984 -25591 50133 16603 6088 -18240 -153133 -249737 -171779 -305435 -272072 -14296
25911 -14296 -83986 -124381 -103750 32428 7385 -188212 -26111 108299 52296 -88225 -104021
25900 -104021 -15321 44161 -88633 -105763 85479 23775 74056 100441 222961 92192 -96938
25889 -96938 -126469 78067 -11555 -103088 -209096 -24002 2634 -184244 -127244 82575 159623
25878 159623 292902 293590 154429 52647 -1656 35345 -17127 -181845 -116050 -30169 30992
25867 30992 145801 -51216 -265818 -214279 -111338 46493 70664 99292 34545 39916 35813
25856 35813 46444 -46754 -57748 -1399 29413 -72461 -23846 -87752 29210 162815 171271
25845 171271 319598 378754 270255 103742 -1507 -205080 -155216 16896 -89447 -148281
25835 -148281 -151069 -58643 44406 147695 128227 88165 6085 -12596 -94583 -30056 -63112
25824 -63112 -167612 -180921 -157123 -27437 241427 282164 169117 199775 109447 -43279 -168862
25813 -168862 -90027 32937 36839 -133659 -244678 -299834 -212999 -136401 -28639 34776 131355
25802 131355 201301 35583 132143 180242 -5417 -26039 132418 -13465 155447 192153
25792 192153 285000 197399 25299 -272618 -411732 -191498 121339 125664 -156108 -178683
25782 -178683 -68950 -72305 -102502 -103323 61129 211860 174099 29180 -287153 -287927 -76038
25771 -76038 -67020 -160496 -140247 -103768 -91491 -134536 -201052 -204213 -46951 -113377 -104560 -49784
25759 -49784 -24342 128846 195231 162846 -25925 -289973 -323754 -169202 -63284 -13126 156539
25748 156539 144065 83889 -42900 -103491 -159927 -138596 31869 144736 239710 194643 133665
25737 133665 104935 112635 23 5559 177799 185473 296493 327467 197173 180444 107213
25726 107213 61259 159527 -37349 -122410 89607 343262 318656 361114 395914 196693 -6008
25715 -6008 -90312 -127984 -17251 145956 187681 173337 144331 74553 169988 -22934 -150098
25704 -150098 34358 73558 78128 72479 87140 162552 -28738 -85669 -122972 -58069 -53905 104743
25692 104743 167550 164664 298345 227681 150555 29558 -63921 -70553 -120016 -30112 143765
25681 143765 156036 107965 26880 -83535 -164307 -201161 -94381 -11648 -59718 -33969 171356
25670 171356 210931 87113 55445 70578 30959 -19772 12220 86543 219037 315149 268729
25659 268729 90175 3256 18103 126895 125233 24739 29857 -18065 17797 241025 241524
25648 241524 240498 302610 284319 145077 96916 240555 148306 207368 173681 65478 120616
25637 120616 176193 34841 158384 243090 137438 259031 297125 154859 207521 78401
25627 78401 -48978 -184885 -149941 -156959 -190762 -188085 -251969 -271476 -406435 -263573 35514
25616 35514 146225 60312 -66030 38030 278142 151714 -24345 -119463 -108606 -87505
25606 -87505 -167755 17403 38120 -5237 -24440 -171219 -150428 25030 12716 28653 256386
25595 256386 435832 301586 72642 -100822 -133128 3627 110941 151113 191362 176063
25585 176063 110732 -4248 177961 100134 -115646 -27061 105988 48198 -4207 131249
25575 131249 241099 403373 401065 345499 327999 272333 339992 234961 241137 92613 150322
25564 150322 -33272 -157860 25537 97304 -207646 -262244 -237391 -20282 214914 284958
25554 284958 184565 94154 126597 301962 295216 119741 -37249 -27514 -24694 50058 53281
25543 53281 28493 180797 412911 375750 284424 173022 264087 140897 148459 161866 31151
25532 31151 -10034 -126689 -36296 16147 -14818 -76334 -78005 142763 329006 -9367 -110776
25521 -110776 57123 187397 230397 209007 91416 97813 45396 -10636 -188355 -224452 -207630
25510 -207630 -210179 -136975 27987 176525 93802 -106091 -113701 -14676 58603 103468 108018
25499 108018 98647 187292 164728 30983 180615 167184 3822 -75650 -210322 -221951 -84386
25488 -84386 138436 10525 -242971 -293631 -260564 -214017 -214589 -345853 -297180 8039 116053
25477 116053 70139 -39600 -207285 -347545 -256240 -122670 -38468 53138 8835 -204237
25467 -204237 -225076 49107 119686 200969 17911 -214763 -228635 -260767 -256638 -170013 -62453
25456 -62453 12959 -7539 -80365 -46108 -184549 -240890 -65275 -85421 -122482 -119208 -4678
25445 -4678 60523 44691 -135212 -124909 -117219 -212054 -263624 -65583 -10483 -95024 -128779 54717
25433 54717 145103 115174 -72621 -21214 121697 116113 131137 215541 193475 102558 162661
25422 162661 227452 121171 -71595 -200127 -253847 -913 103237 -75209 -209461 -53114
25412 -53114 76018 -23095 22415 103231 -59651 -67919 26509 4425 -92019 15494 33965
25401 33965 -57976 -72025 28164 21672 -60885 -122775 -182513 -182482 -318328 -324816 -270877 -148534
25389 -148534 -6757 -93591 -78638 -3381 -117714 -180829 91358 -15646 -64139 -76439 -7132
25378 -7132 109261 110170 -132289 -129300 -117967 -266839 -247753 -46979 -79154 -119462 16368
25367 16368 -89337 -83369 51691 -63658 -129624 10952 45400 63147 169381 276245 285317
25356 285317 180079 139017 159923 1591 -143227 -168589 -234594 -136325 -14264 -38355 -120639
25345 -120639 -212180 -126275 -109192 -3296 5624 -214868 -381684 -407980 -168643 112857 144638
25334 144638 -105068 -102978 -68868 -113919 -234853 -90815 -91723 -121668 -149796 -115577 -66658
25323 -66658 49043 -64611 -121876 -49524 -66416 -18518 -70110 -135478 -41396 -107254 -213121
25312 -213121 -272811 -175487 -109259 -169073 -155291 -207219 -400720 -441949 -275865 -205812 -127718
25301 -127718 -220808 -321532 -309584 -226738 -273032 -108201 84392 97299 153971 127941 -14275
25290 -14275 50411 22350 76914 -27774 -236731 -164145 -245037 -331412 -349538 -310531 -203154
25279 -203154 -88633 106552 249883 338973 275336 58871 -170123 -140333 40217 182147
25269 182147 295422 114276 126950 275738 347242 251675 336881 454151 341686 293791
25259 293791 234127 226589 417361 283462 128443 9017 -190947 -93133 37299 -82148
25249 -82148 -232348 -212720 -69818 -144769 -125794 -76255 79465 222868 315675 241392 77426
25238 77426 -54543 -89961 -134144 -22961 8684 -132994 -1952 50978 51448 -44644 -47034
25227 -47034 -74843 -18863 19065 -25871 122750 181616 185142 132364 8911 -13113 105552
25216 105552 201176 116207 15536 -112164 -229322 -195902 -76683 58474 193023 298243
25206 298243 203698 305514 440312 512379 424256 284166 197054 55704 24874 -66595 -37504
25195 -37504 -195393 -173447 95969 235606 258093 114630 -9402 43868 8454 -11745 -212141
25184 -212141 -219820 -25781 9432 -42195 53970 51997 137740 161809 -38837 -181143 -69749
25173 -69749 49798 242539 363916 225758 185105 128455 141332 19190 -42739 33786 161053
25162 161053 32612 -70572 -229846 -302356 -152598 52263 6987 -42502 -65023 90931
25152 90931 121724 248306 385680 116546 117365 -49085 -231227 -123513 -99066 -127845 -103281
25141 -103281 -124605 -157233 -116241 -56569 -38100 -101440 -4833 139249 -476 -20923 -30247
25130 -30247 -152192 -69446 27032 134248 205766 125563 -152493 -232921 -173009 70602 225012
25119 225012 259870 136835 -191550 -195652 -108485 -112175 -105492 -196919 -305516 -365787 -529548
25108 -529548 -415673 -203238 -149316 -312980 -322571 -344454 -272889 -139282 -39043 -198719
25098 -198719 -211202 -70769 36463 -17020 -53135 -158739 -128410 -147143 -47904 -8792 86595
25087 86595 137623 -27884 -189271 -119925 5064 39855 -16040 -54710 -241872 -181154 -77880
25076 -77880 -64933 -81708 73805 58376 -87426 -114098 -40410 -24309 -138977 -255002 -296780
25065 -296780 -323022 -213955 -81990 -174851 -129765 -253948 -338726 -250591 -196811 -81709 -127320
25054 -127320 -61316 -3659 -129683 -90499 -20074 72960 116180 44261 21907 78842 21436
25043 21436 116679 122339 -12159 79853 332715 288860 223455 240959 218854 208002 164704
25032 164704 4158 -45128 -16407 -65559 -73577 -152636 -245017 -394485 -477950 -435581 -273196
25021 -273196 -147794 -122400 -86278 -76112 -46859 -96173 -16247 -64124 -124079 -77896 -97884
25010 -97884 -110238 -125261 -162287 -203093 -50261 30938 164068 58005 -103646 -149322 -156974
24999 -156974 -22111 84763 121956 54252 74159 26296 -85167 66648 57037 25465 -48653
24988 -48653 -53123 19036 -16374 -160869 -249358 -229602 -224150 -225337 -30793 109735 36032 122548
24976 122548 71387 -190550 -188188 -116526 -159796 -172954 -106919 -62926 137217 263564 202201
24965 202201 137699 144681 193815 61103 -173260 -322531 -206489 -99035 -24803 -143103
24955 -143103 -313278 -471179 -506090 -504871 -388162 -252653 -212402 -228813 -56277 93044
24945 93044 227725 188530 -7416 -91498 73362 172496 196470 181348 143763 151164 182537
24934 182537 214399 369521 508597 401193 58181 -137662 -106010 -118283 -61401 7105
24924 7105 -5851 1533 -62377 -175969 -37950 181405 282724 278572 339540 397037 204395
24913 204395 195335 210004 167667 122333 166204 128282 13149 -149852 -66954 -100211 -82455
24902 -82455 33289 60673 34627 -125232 -85931 -89667 -205670 -193399 -131302 -190077 -121393
24891 -121393 -99900 -104313 17368 16853 21766 -59716 -60116 82304 237644 268927 313602 272290
24879 272290 226633 124441 161253 1027 -269569 -212000 -149635 -338665 -387125 -346852 -157302
24868 -157302 -90796 66759 154268 91842 -97060 -249105 -173712 -16497 -13998 -103859 34571
24857 34571 238198 225321 184325 136615 34792 -6747 139122 97177 52858 -205299 -176095
24846 -176095 -32030 59428 131255 48731 -85184 11899 96381 76124 152487 149569 -113177
24835 -113177 -72779 -26951 -49752 -5913 -43093 68180 136385 131051 120976 102786 144201
24824 144201 29691 47720 -130616 -250424 -70003 58461 -24085 25428 45239 -5792
24814 -5792 89982 -32359 -198389 -297391 -249387 -262211 -350302 -276291 -281478 -286925 -239297 -173386
24802 -173386 -183696 -247164 -102658 154346 119814 -35797 -209143 -191711 2317 15682
24792 15682 -144576 -101032 3820 97826 240562 36067 -229777 -189082 -174497 -59448
24782 -59448 103571 163719 204816 138955 -161725 -97445 1985 4786 64569 152402 205598
24771 205598 284903 140077 95649 -16766 16353 40896 53275 65997 -69466 -156259 -9696
24760 -9696 -30065 -66881 156866 321472 137992 -76754 -182655 -122307 -184550 -163640 -96961
24749 -96961 -93631 -46258 67755 29482 -64188 -52627 35665 32498 35065 45016 -74197 -160122
24737 -160122 120622 294987 220831 246164 143919 234099 247255 85874 87976 -11169 -213235
24726 -213235 -253402 -143801 -50270 -48729 87024 261920 229998 117650 142068 105563 138371
24715 138371 154152 161604 202624 64735 -120039 -204264 -134550 76056 126457 20372 18225
24704 18225 -85234 -84698 -5473 -195154 -229987 -165601 21822 41299 114452 -12201 101308
24693 101308 -43176 -118645 -161429 -217226 -74521 -16717 -117667 -242537 -254935 -345979 -99106
24682 -99106 79700 12460 -29842 -123139 -194415 -229429 -179763 -160111 -8669 -53754 -228087
24671 -228087 -127677 -14259 -9607 30539 33362 -38207 -114427 -203736 -236338 -188952 -187695 -212447
24659 -212447 -172234 -119437 -31894 -69658 -115180 84720 187989 6272 87085 80814 64931
24648 64931 -20191 51935 82957 74367 34319 -61992 -146869 -15330 155180 155224 -32858 71832
24636 71832 34295 22380 93403 115806 23404 116238 45580 32997 -67091 -124923 -159578
24625 -159578 -128351 39617 72701 176382 53551 62933 40129 -5610 -104810 -46022 152578
24614 152578 175084 100466 33635 1359 75577 -39725 -193629 -356979 -173279 -137450 -84023
24603 -84023 -210449 -269650 -332075 -348514 -461946 -312328 -192421 -45583 134796 234927
24593 234927 110437 109885 85510 38820 64093 -57450 -139823 -171223 -166280 -345875 -352738 -231348
24581 -231348 -215637 6888 -43346 -19403 -29053 -51704 -160981 -253715 -84779 11958 -56279
24570 -56279 -214708 -180851 -121506 -233775 -181751 -67251 -52913 -101181 -204807 -188632 -127759
24559 -127759 -203993 -180176 -146597 -187803 -186666 -89242 61308 107669 87336 149362 131536
24548 131536 103196 -114803 -59047 103608 261823 273572 19167 -126288 -182105 -205125
24538 -205125 -220267 -280109 -146822 -97994 -50041 32961 104385 201302 153930 28168 -183499
24527 -183499 -207032 -255546 -244288 -236003 -101232 -7475 -15243 138439 158317 23757 8940
24516 8940 -93150 -88193 -173938 -164996 -168450 -233737 -148650 -160559 -194300 -188095 49053 242279
24504 242279 180013 201585 444684 430914 200353 -50225 -102398 -44929 1212 4206 89480
24493 89480 331084 238379 83603 118229 271497 291133 326016 127624 127191 222364 110722
24482 110722 78126 81042 163897 144065 -9670 -8885 54597 140097 351293 363093 159948
24471 159948 -82721 -207678 -185157 -83479 -15613 13235 110591 202804 249997 141948 790
24460 790 10591 6275 74342 263622 239458 233619 140281 268444 208191 165776 194352 99999
24448 99999 194773 216607 70787 -6275 -32772 -162384 -225017 -216038 -290768 -238256 -151999
24437 -151999 -262882 -238664 -100352 -61607 -127315 -11049 161105 102309 -99362 -46406
24427 -46406 44362 -74391 -33998 -24080 144117 51710 -122041 -277321 -207910 -195409 -254568
24416 -254568 -183149 565 50431 150038 165105 -49576 -105243 -52499 32387 48 -2410
24405 -2410 80508 102696 -16064 -167242 -198571 10104 205903 152535 -63823 -21319 27688
24394 27688 -139857 -285032 -315983 -344178 -227663 -12555 99658 117758 197152 258664 249374
24383 249374 179835 216135 189349 -10871 -162579 -195131 -220128 -274731 -268139 -5484 188584
24372 188584 252683 62029 -44384 -125405 -210768 -91272 41872 151094 271319 426277
24362 426277 275076 53987 -165352 -182447 -39030 -96789 -7735 -75617 -279862 -448648
24352 -448648 -348516 -280664 -266589 -49111 36358 8368 -95273 -42672 136533 117119 109306
24341 109306 209773 115583 61508 155824 286281 282512 287390 185436 233135 197951 235720
24330 235720 160124 -25800 -198796 -222440 -204059 -275618 -240850 -279861 -368992 -365034 -264971
24319 -264971 -103283 23777 -64060 -167675 -161883 -70414 -29495 -93472 -29798 -138604 -179361
24308 -179361 49337 40514 -121605 -251876 -209680 -134305 -122778 -131301 -56487 -25593 -51471
24297 -51471 -190630 -289617 -355484 -179216 -40408 48873 217086 195807 153204 164841 56991
24286 56991 8925 99229 177027 -22553 -140940 -10830 20974 -77102 -188465 -152259 -22949
24275 -22949 -47582 8586 94702 93169 109120 90270 -97096 -193521 -74147 -56361 -127633
24264 -127633 -222428 -232269 -274004 -284382 -242167 -203886 56026 197584 59723 -54127 -97711
24253 -97711 -140982 -225739 -141976 -279222 -357806 -229357 -201394 96571 199690 135692 4497
24242 4497 -127036 -298660 -364920 -259198 -245193 -240122 -135200 193213 216458 234802 211338
24231 211338 179357 -2241 -74171 115167 177088 167600 179317 102610 52886 45197 -86300
24220 -86300 -1422 182549 156563 30171 -114505 16760 50344 -31668 36231 160768 137410
24209 137410 70229 170471 363275 316248 207897 92577 80805 140465 34377 84943
24199 84943 -10876 -50677 -20777 20094 15833 25232 58295 16235 -146167 -111352 107152 101493
24187 101493 -36351 -114364 -5791 77669 168217 165463 114038 -40945 -33697 -55641 -79049
24176 -79049 -5140 -62599 24011 39516 116640 123852 -51470 -94503 -14169 113246 153870
24165 153870 25557 -73148 -39539 124379 253621 294922 189677 135838 76213 14236 -97178
24154 -97178 -191449 -102340 -102155 -57366 -118449 -176705 -208744 -214577 -367326 -222001 -105368 -82924
24142 -82924 -27317 -78380 55534 123843 18572 -79347 39424 214489 167231 -43985 -43734
24131 -43734 20213 -73073 -152450 -163788 -118648 -96534 10475 -20888 9050 -80205 -129149
24120 -129149 35790 112936 -20607 -248886 -32468 304323 340947 184261 -12859 -117787
24110 -117787 -197574 -62976 -32858 -45744 12420 124831 -62103 -221998 -365972 -355573
24100 -355573 -247965 -325081 -117073 -119527 -56884 149579 94117 -7654 -193070 -247013 -176388
24089 -176388 -246204 -242018 -146622 -179125 -43922 -48237 -13420 54242 132215 139604 153953 103800
24077 103800 46040 -49662 -98876 -106275 -149597 -149340 -96148 -95410 -151471 -288616 -210844 -55876
24065 -55876 -10443 56811 139443 188706 222180 124304 45226 19422 55682 234305 276723
24054 276723 245271 207980 306595 212985 67525 125876 60744 -83995 -36884 -49337 -73586
24043 -73586 56252 133859 11569 -47968 -44619 -105667 -104319 -167693 -83316 -172729 -84952 -143909
24031 -143909 -49635 12774 -94883 -120324 95644 126659 -156856 -289425 -174783 -118405
24021 -118405 14907 12721 -67191 107756 225214 178847 23102 2371 121627 207580 68435
24010 68435 133187 153504 28926 -125891 -210980 -217911 -129832 -151638 -191940 -9604 -60260
23999 -60260 -138416 -71162 73294 67614 -191154 -272943 -159469 -148662 -135315 -67991 65729
23988 65729 22032 -42105 -2698 195710 290792 231493 101966 -23369 61797 63 43017
23977 43017 157402 299019 117735 49991 29420 -121855 -278136 -184842 24665 231662
23967 231662 189487 -84191 -143485 -41420 -31314 -43470 -181574 -151681 81318 96886 -22751
23956 -22751 3236 -4646 140872 79333 -98 27045 90789 18705 109248 47695 -136474
23945 -136474 -271369 -262349 -243847 -134312 -100780 -387673 -302092 -155230 -90609 -20093 -6112
23934 -6112 -69233 -24182 122292 -2939 -22212 133130 188392 117339 57732 642 -3696
23923 -3696 77667 121299 138618 173811 144939 148737 236212 174071 148985 162229 138725 27085
23911 27085 -62302 -7076 38365 92313 163701 206838 143785 29177 -106890 -60155 -73294
23900 -73294 -122310 -131807 57282 276355 351654 235416 139820 -9760 -79523 -105943 -73354
23889 -73354 35951 88428 150261 826 86291 109009 293634 199995 -46897 -184265 -274687
23878 -274687 -155006 69864 -2994 -364 -169505 -57347 -823 -52689 -160011 -154133 -56410
23867 -56410 30641 16826 -54355 -219877 -292031 -205877 -257290 -101614 -33630 -26440 38566
23856 38566 54730 25773 -8013 62711 43584 62341 104824 105743 177906 201850 250580 109359
23844 109359 36716 83719 76121 16148 -57862 -174978 -58395 -188333 -162375 -117952 -221290
23833 -221290 -99654 109230 107617 144863 54471 -117132 -35864 -69523 -107522 64311 130575
23822 130575 113947 25644 -8403 -11898 37172 -40451 -131727 -40962 62335 127887 65279
23811 65279 72536 82674 -17156 58145 167740 -125524 -325426 -207097 -91992 40475 39117
23800 39117 -44769 115931 223303 188223 97121 17590 18523 25383 28790 -49601 -214953 -147181
23788 -147181 -51850 66530 106750 21696 -25905 -77631 -264129 -288266 -105745 -56521 -149364
23777 -149364 -155710 -45266 -115867 -231905 -316938 -234615 -108207 -17838 5337 -71404 -65276
23766 -65276 80500 144961 47521 165826 150523 31095 17231 53709 66133 80797 -32107
23755 -32107 7441 136229 191673 34147 -36628 -159060 -115112 -104278 36534 65802 12392
23744 12392 40266 72499 149722 154638 224810 178294 56404 -22799 10484 -137986 -224388
23733 -224388 -260209 -311032 -131342 -101653 57016 213872 194310 295524 141855 -34908
23723 -34908 -16577 11253 19512 -97777 -64214 -12184 23957 104055 271273 132457 24862
23712 24862 -86122 28368 131255 71891 99677 98476 -97449 -328349 -379410 -417127 -361760
23701 -361760 -334182 -285037 -168404 -149966 -3083 103933 88167 113031 75447 160299 -95306
23690 -95306 -299242 -168429 22787 151650 206528 103731 -76498 -284156 -302476 -269877
23680 -269877 -212137 -324313 -199109 -183339 -17922 158474 129348 138622 87601 70244 80412
23669 80412 -139075 -257124 -192622 -59435 -43805 33412 60800 79633 96286 94842 -42892
23658 -42892 -109940 -29540 -32742 -30913 3707 112290 24767 -96130 27967 280549 287527
23647 287527 119614 20984 -11358 19193 133418 -28412 -314463 -318136 -248240 -239425 -318196
23636 -318196 -185767 78993 120578 -93836 -238113 -359391 -340091 -334845 -223618 -116069
23626 -116069 -271823 -396617 -315972 -238808 -231319 -192574 -24442 166436 341249 233393
23616 233393 46525 -24440 -74087 122314 236461 254335 240530 141055 175860 161831 -1981
23605 -1981 39187 42858 -97006 -195119 -76415 -24252 -27007 70409 48829 -166320 -270644
23594 -270644 -123574 141641 81746 -83216 140370 11384 -82677 -1268 87330 131244
23584 131244 43321 -159940 -188581 -158467 -190303 -182524 -226409 -212376 14065 225029 166702
23573 166702 -70702 -67283 -18774 -65392 -61727 -77368 39664 143127 139267 173605 342164
23562 342164 229650 23021 79519 -47275 -156478 -173167 -223546 -205244 -122226 193911
23552 193911 251682 111906 110069 48333 58398 173430 185528 241511 248304 33075 -89897
23541 -89897 -176029 -196520 -75303 60319 66585 87437 65908 168873 160812 199404 89965
23530 89965 87322 138295 319607 282048 358480 313343 126778 96357 67676 149089 182754
23519 182754 182833 70268 -33098 -28746 -12014 -34787 79858 146307 -17383 12221 87065
23508 87065 57024 36431 -38168 -94254 56193 176956 353851 290499 129598 -141228 -100571
23497 -100571 -38616 -36451 -87480 65218 66289 24664 23226 -101264 -167645 -150679 -100066 -167764
23485 -167764 -278354 -211907 -69865 33028 -825 36077 -11811 75115 108830 114421 -31358
23474 -31358 -16690 40240 144431 68905 -2495 -68696 -109394 67010 188815 -72000 -277222
23463 -277222 -228063 -120566 -163065 -257368 -273298 -259613 -85771 128620 230498 238340 35338
23452 35338 68713 140868 233418 253579 393063 353111 340113 367783 216109 -102136 -244865
23441 -244865 -90037 30837 -140809 -61991 10846 -106269 -217018 -83949 -29079 113562
23431 113562 97906 -124430 -147681 -144635 -146406 -216923 -137505 -18834 -63935 -111697 -80190
23420 -80190 -41582 -112280 52973 197746 147823 -86522 -50791 39034 116050 64714 -103153
23409 -103153 -129277 10806 113272 30793 -78861 -98022 -150476 -161301 -279674 -46936
23399 -46936 239509 192120 219939 99415 -97147 -88098 -136830 -153122 -282620 -171214 -75296
23388 -75296 12298 56913 195297 144572 -76734 -191532 -124950 -89068 -33768 48365 76112
23377 76112 121076 54095 158209 335649 141516 9759 114310 17542 -60098 -16600 -19672
23366 -19672 9479 -136426 -134576 -199041 -326861 -408421 -420585 -244465 -100355 -27725 -124762
23355 -124762 -110711 -217352 -163970 -199022 -96276 -60764 3912 -24078 61549 6230 64909
23344 64909 97537 79336 33667 -137808 -133775 33287 133893 119251 99492 17679 -156176
23333 -156176 -238485 -216493 -255428 -213951 -38621 162130 49730 -30773 36081 -74825 -164651
23322 -164651 -257614 -277373 -154840 -162276 -161006 -106449 -102093 -134639 -221154 -282461 -193105 -96701
23310 -96701 -88981 -145176 -103431 -13765 104486 9758 -99203 38091 191724 150037 6181
23299 6181 -84851 100114 62729 -31672 42976 258528 401708 384438 192764 71131 -141093
23288 -141093 -86859 -107145 88791 265540 175133 -50964 -52537 -27471 -97963 -140255 -230142
23277 -230142 -198168 -19581 1952 -73669 -225195 -275663 -255611 7298 14132 -24656 -216562
23266 -216562 -198777 -144739 -151249 -246455 -119947 -140232 -212952 -175267 -183887 -21887 60702
23255 60702 145321 135403 115311 -32584 -193675 -110249 54819 221034 39023 -111586 -217726
23244 -217726 -62847 50558 42176 -101779 -148636 -96274 -178061 -206857 -317132 -137815 28032
23233 28032 -70782 3782 -18265 24886 70692 10552 -29740 38254 -2601 -68727 -14874 -31929
23221 -31929 98459 135626 140061 67721 -13495 257 35890 -28404 132518 302987 239233
23210 239233 81991 -110950 -317752 -305541 -62900 20806 132808 398200 667139 613158
23200 613158 620599 656221 631953 531520 141490 -189307 -268221 -99202 -74743 -110905 20709
23189 20709 -44380 -87520 12998 100117 52877 -34098 20498 -102208 -135622 -78245 159667
23178 159667 173072 1433 -128361 -301216 -225597 -67289 -114976 -123044 -181544 -24566 131599
23167 131599 22409 93525 77135 131551 173262 35799 -40920 -178730 -100843 -124291 -142774
23156 -142774 -33787 43242 12363 39826 76288 63028 7055 120696 238123 44560 -34266
23145 -34266 122165 177253 16164 -74459 -34695 -14833 35887 -26097 -179735 -31311 53990
23134 53990 -22386 -96852 36522 -30109 -8956 42807 215134 283864 327685 282126 151060
23123 151060 120251 134985 164938 111069 5388 -80501 -35955 -22735 -53654 -112383 -231949
23112 -231949 -241380 -135317 -115501 -311988 -319594 -235806 -218689 -277622 -89762 76313 191886
23101 191886 243109 125721 111437 -10284 -189142 -237068 -343008 -197720 -82392 -195800
23091 -195800 -75171 139367 198917 339780 81303 -175047 -220430 -177978 -120658 -67833
23081 -67833 -204631 -285996 -298797 -207648 -161369 -53877 104766 113103 272243 163203 -4702
23070 -4702 -136029 -64046 -57782 -706 35199 -21476 -122876 -155820 2178 -106548 -132139
23059 -132139 82807 53712 -6696 -38164 72894 47388 58310 -86190 -107333 -7808 -51035
23048 -51035 10191 148809 209227 122463 103297 -4680 -160238 -334259 -271722 -303231 -214463
23037 -214463 8788 -51396 -191860 -164743 -184387 -72649 182445 155276 132241 85597 12324
23026 12324 -123602 -206817 -157666 -45054 -57071 -50337 50980 160873 136105 112819 112706
23015 112706 89689 107010 34852 90954 97012 59289 108096 213753 283221 258904 168963
23004 168963 165195 47732 160420 211840 175825 219243 65821 -40872 -96635 -67770 -36814
22993 -36814 -978 -71124 -71611 -55106 -97962 -79770 -86116 -131798 -191581 -77766 -3734 32060
22981 32060 44799 67870 73350 97706 -45900 -44401 -129547 -124403 -70654 -81004 -58864 -70331
22969 -70331 19915 48144 -3346 -41929 -137700 -171410 -73159 73109 26875 11419 58367
22958 58367 132568 98546 23099 -63332 -6582 98689 175807 192595 313792 276448 157736
22947 157736 -69909 -145827 -9072 66117 -22139 -159172 -271448 -249987 -6987 -6056 -130458
22936 -130458 -264190 -171640 -177321 -127655 191743 77680 -25572 -30441 -146151 -218014 -75870
22925 -75870 107957 5384 -135584 -107538 -15238 77246 76008 -88461 -147421 -31860 -11676
22914 -11676 -79176 -102615 -4101 200106 115379 141864 17562 -71138 -139986 -189756 -85043
22903 -85043 -207853 -268803 -47473 -36987 18208 40790 53592 43434 128027 -3469 -1794
22892 -1794 -11309 -152799 -68460 111358 126302 20343 -4191 75498 221852 184801 -31186
22881 -31186 -70022 -18501 -47820 -152340 74817 162814 98223 152821 121511 124589 -8184
22870 -8184 -87673 -4795 52400 86095 -53745 -176536 -120250 -189287 -175018 -2059 -69946
22859 -69946 -293645 -242623 -151740 17650 -73568 -125595 113193 134276 45469 16398 -229590
22848 -229590 -285750 -221962 -176859 -216790 -195877 -88819 -55506 -42573 18141 15865 29962
22837 29962 -66376 -33716 -102062 -82556 172951 171000 -84211 -163600 -47172 -64323 -74133
22826 -74133 -133302 -142366 -249250 -301105 -203818 47198 91315 -93878 -96785 -34695 -162776
22815 -162776 -305135 -476695 -317767 -199213 -162054 20926 129727 80391 9586 -45998
22805 -45998 -151998 -149768 -9349 110716 199685 282147 228185 186900 45022 -42608 -42376
22794 -42376 -67251 -119528 -55313 146328 56867 -2228 -131195 -128166 -129314 -199455 -108560 -127382
22782 -127382 -122517 42762 -39645 -243230 -329867 -162447 -237105 -155797 -202023 -267107 -246578
22771 -246578 -98921 -66005 82151 181288 76091 -4256 49219 127435 51560 1644 86798
22760 86798 -81863 -164718 -66882 -52398 -261552 -391499 -300481 -220724 -219749 -131300 -173067
22749 -173067 -300015 -34364 -24193 -22005 28147 87666 91338 -44826 -83243 -44766 16139
22738 16139 -55699 -205712 -210452 -273663 -153404 -113853 -78535 -53287 -18791 -28434 -254512
22727 -254512 -271991 -126830 53221 -19858 -127043 -197821 -198298 -257541 -176709 -37638 -31716
22716 -31716 -61804 -2091 -24305 -34399 -218984 -319321 -292256 -269572 -44381 126700 50706
22705 50706 -110379 1005 46776 28112 39283 17209 53773 75211 12425 79895 294581
22694 294581 55887 104776 238588 223618 258120 9349 -312965 -359109 -216410 -114616
22684 -114616 -83436 33085 -6169 -206368 -203095 -83018 -31861 -78675 -177718 -129823 -225442
22673 -225442 -14976 13972 -68011 -296307 -413759 -459473 -362284 -282040 -113352 -95396 -57207
22662 -57207 120541 212581 127654 -11009 -5186 -27456 -130996 -96160 -17835 68257 14529
22651 14529 -199424 -141945 42418 -17758 -95224 -54547 -116599 -186643 -222365 -227473 -158006
22640 -158006 -180266 -221657 -178892 -433893 -477621 -118273 -1184 -94586 53785 123006 46622
22629 46622 -39644 -117632 44671 252249 50277 -125182 -140277 -112030 60073 50000 58434
22618 58434 47258 73978 323352 324823 142986 131925 99719 244254 148194 66042 -27070
22607 -27070 -61117 -17954 31062 174729 98168 -33858 -5548 -13596 -101011 -39544 -42765 -177161
22595 -177161 -88114 -143886 -85919 -109616 -157929 -165359 -163177 -38281 157837 272984 291813
22584 291813 185081 101978 38285 -38254 -152827 -118461 -94122 -103654 -222439 -327588 -380275
22573 -380275 -505411 -558632 -490625 -441270 -333065 -268712 -345149 -382133 -360358 -216721 -200318
22562 -200318 -140621 -115965 52604 -39214 -145416 2104 66634 -16233 -184314 -79737
22552 -79737 7393 -138896 -191875 -103569 -12343 31331 126709 209234 157264 63294 -33646
22541 -33646 78814 103803 144828 175696 29539 -41221 -72177 -34466 -155711 -259297 -151120
22530 -151120 101120 143765 63710 -4842 24729 77182 -8167 -172807 -38433 58825 28012
22519 28012 -33455 -121470 -59975 -124820 -130907 56020 72352 169460 409884 491313 450903
22508 450903 391356 289531 253634 7131 -129740 -21686 59298 -19522 -74664 -138827 -86497
22497 -86497 -55455 51995 161325 105828 135459 124768 179927 107725 -164540 -263089 -209229
22486 -209229 -88417 -80793 65000 108586 91729 152169 118026 39400 -104252 -205892 -247350
22475 -247350 -160551 -93757 -60055 -33985 73973 172130 50871 -230994 -157751 -32984 35646
22464 35646 78890 24294 -78545 -96581 -231454 -307174 -228784 -31896 96857 -67206 -234983
22453 -234983 -214067 -115312 50037 18434 52129 -53907 -152351 -235513 -372161 -299711 -119577
22442 -119577 -93293 -161455 -245494 -275595 -99807 7431 -43398 -119822 -46780 -129945 38562
22431 38562 12310 -108250 -189146 -211390 -135963 48026 50896 -8020 -102448 -225908 -242215
22420 -242215 -170091 -210441 -253674 -205045 -97957 178937 223251 204483 112257 68332 36546
22409 36546 -152220 -183373 -238534 -238109 -167179 -90872 -87961 -114178 -208770 -263303 -157394 -25900
22397 -25900 57041 -50530 -116988 -157983 -94191 -129084 -231961 -292064 -265263 -267577 -219266
22386 -219266 -196074 -340197 -403144 -367898 -275562 -177120 -219617 -245238 -214883 -220603 -347706
22375 -347706 -295858 -92378 114594 343414 294338 361608 334225 142486 -34431 -68617
22365 -68617 -114734 -138246 -219821 -194637 -62165 -206046 -353015 -270482 -151303 -12812 197463
22354 197463 197667 133142 163694 230596 115580 -81127 31801 -28854 -193775 -219437 -59219
22343 -59219 -40463 82358 104820 4792 -102326 -100761 -194932 -171866 -91885 30689 14093
22332 14093 -119129 -198006 -278970 -329311 -230498 -181805 -84603 -81707 -186151 -92685 62386
22321 62386 133237 243398 240113 142965 -37295 -249243 -309576 -278332 -205813 -141519 -91443
22310 -91443 -9125 359701 311657 196312 237314 294413 125993 -52474 -144385 -84394 -241031
22299 -241031 -142100 -81185 -74875 -231723 -321201 -199011 -260441 -259951 -206243 -239304 -90920
22288 -90920 69727 156046 -44889 -56034 828 -143720 -310565 -417703 -269531 -36121
22278 -36121 -604 30211 185657 88993 -60007 -192884 -131654 -75038 66390 -82002 -41285
22267 -41285 66442 90255 41085 -33309 12736 -89504 -201193 -262999 -96684 -118938 -182093
22256 -182093 -333999 -241677 -133147 -151552 -107455 91177 185052 51260 -116796 -220487
22246 -220487 -322243 -366380 -295290 -283143 -330134 -231819 -154723 -108166 13452 19310 -3523
22235 -3523 -53522 -138487 -77201 -155952 -227175 -228088 -193338 -214156 84925 176636 -138831 -92549
22223 -92549 -82505 -205667 -233394 -225255 -237961 -205579 -240485 -238504 -246508 -286436 -174389 -186640
22211 -186640 -262570 -203818 -71915 -153504 -147149 -94560 -36526 -159389 -70834 -51929 -71590
22200 -71590 -86119 -110573 -143083 -155575 -203507 -212428 -100523 -26264 85794 73777 79081 244164
22188 244164 299746 162324 69797 -2018 -11476 -47618 -22626 33629 -70379 -265779 -498320
22177 -498320 -397746 -175608 -245192 -182244 77501 -40889 -121719 11972 -29465 -150660
22167 -150660 -190287 -55048 33627 -145297 -252569 -207892 -205656 -132777 52605 62112 -61973
22156 -61973 -38190 -92264 -41405 -55877 -80362 -70746 45325 96033 31270 -14957 -153675
22145 -153675 -226332 -105765 50242 42734 126322 115202 123733 248891 347158 303882 137654
22134 137654 -49442 -59011 -99095 -244481 -268210 -233327 85585 146222 151846 86338 26071
22123 26071 -25691 -60921 -93794 -152259 -297089 -360067 -153114 -61272 -19840 -63473 -49653
22112 -49653 42014 44066 -23826 12125 6172 -53670 -177324 -231859 -253775 -385800 -542730
22101 -542730 -429536 -113132 -140204 -250916 -123060 -104391 -156333 -252301 -209524 -60306
22091 -60306 -37026 -227609 -133717 -20019 16875 -58759 -32916 157224 182753 -40616 -268109
22080 -268109 -79833 44264 91332 41418 33655 18661 30886 24686 13458 -16287 2996
22069 2996 -28718 -126876 -83342 -54706 -38290 -141518 -99417 -45804 -96714 -124564 -48758 -357746
22057 -357746 -302791 -68825 -9440 46358 -50063 -245455 -241529 -431533 -454148 -245360 -46163
22046 -46163 142676 -102366 -159386 -88057 -53345 -78561 -139600 -246439 -226507 -248302 -206331
22035 -206331 -78770 -2337 11984 -109534 -50981 -60171 21419 109427 159903 358854 117578
22024 117578 -114449 -184940 -198496 -233455 -36037 -113915 -187601 -298362 -290303 -177729 -247953
22013 -247953 -179549 -107679 -19739 -76574 -137347 -235424 -134182 -233884 -103217 -119383 -116162
22002 -116162 -140511 -214141 -191860 -56891 -57381 -57348 -210111 -168290 -319947 -275795 -224412 -236951
21990 -236951 -188732 -109858 -2675 -3562 22006 104341 184997 105852 -22900 24215 169282
21979 169282 177588 183509 201827 206535 197348 211681 111678 18054 101426 210992 116433 -60165
21967 -60165 130325 122727 85823 3905 77959 24393 110687 292441 280778 238734 -93551
21956 -93551 -66999 9919 63636 18834 -23218 27891 10532 -58337 -176621 -164746 -195901
21945 -195901 -166471 -193429 -255972 -152235 -195041 -212217 -150768 17680 32832 42383 40588
21934 40588 -32549 97239 170611 160443 48978 -50344 -53388 48948 56092 -79241 -77414
21923 -77414 70166 -4150 -212247 -206344 -126439 -81470 -103901 -369946 -409787 -243889 -57963
21912 -57963 -16351 -67512 -18399 -34414 -76730 -129833 -140083 -199261 -174477 -148814 -236358 -312651
21900 -312651 -225284 -329847 -247995 -60875 22499 -149695 -287917 -381981 -218205 -101371
21890 -101371 -105527 -98738 -51668 -211811 -302686 -340583 -245611 -278329 -243801 -144707 -83774 -164824
21878 -164824 -270201 -194184 -46283 -28217 -71583 -71098 -147214 -35723 -95660 -61123 103275
21867 103275 117052 -110626 -104059 -148597 -68716 -80345 -167227 -307964 -291935 -249015 -139337
21856 -139337 -89290 28795 137271 65824 34180 -26631 -143585 -310730 -237443 -14881
21846 -14881 -22520 -38290 -150632 -154598 -134552 -7330 31728 99588 146112 -15966 -70234
21835 -70234 -151701 -269502 -295443 -246692 -59631 66788 4477 -132978 -199836 -180223 -78442
21824 -78442 44062 -238775 -429358 -262374 -213568 -94361 56989 92844 -28498 4230
21814 4230 24383 -2213 -52623 -69039 -76363 -69990 -113405 -180022 49721 182858 134948 72947
21802 72947 -85843 -166825 -140512 -96848 -20407 -105138 -173467 82322 24649 75942 114753
21791 114753 104155 -54102 -223910 -105467 -2344 147281 235893 4274 -38651 -47896
21781 -47896 -46709 82076 -80801 -148571 -376185 -435032 -430798 -371540 -184927 -137741 -165434
21770 -165434 -194118 -231813 -173043 -99511 -159768 -141505 -74635 -130990 -181315 -332442 -225843
21759 -225843 -213528 -218602 -199662 -103074 -81201 -33253 -63333 -83245 -257590 -339149 -199856
21748 -199856 -85893 -55605 -103904 -108155 -98638 -139404 47708 46349 42385 -100654 -342395
21737 -342395 -319203 -202179 244 5534 -81361 -75818 11021 -24181 -178722 -285314 -247550
21726 -247550 -172529 -181022 -101636 140542 11328 -180803 -179024 -316306 -397503 -493897 -473884
21715 -473884 -385829 -245511 -244674 -206774 -146310 -52510 -154 -97687 -89235 -178995 -276932 -176270
21703 -176270 -172161 -194119 6424 68660 77117 97370 89834 -35927 -48897 79845 25347
21692 25347 -134726 -154096 -118574 -194493 -39737 88323 72474 -38183 -32672 -59576 -74149
21681 -74149 -150422 -76843 -131256 -112754 -63884 -68160 -109754 -77016 71829 127091 8983
21670 8983 -149025 -228942 -239046 -166909 -148114 -218481 -69101 67676 -9326 -246617 -254050
21659 -254050 -200351 113585 56950 -112305 -198340 -212733 -9391 32410 -61927 -103318 -15224
21648 -15224 -70662 -270049 -258613 -141385 -143398 -114905 -185890 -189320 -149604 -208073 -247352 -43697
21636 -43697 16936 -141961 -156134 -107810 5558 175261 44073 135466 184437 110358 18630
21625 18630 22818 -76485 -83755 -30444 -61246 -179462 -236633 -148219 -64908 -88168 -64704 -30852
21613 -30852 21584 -130097 -47290 90299 -2409 -164367 -263876 -65093 67424 -88464
21603 -88464 -319069 -198308 -18952 25602 63870 131177 74515 -28441 -137333 -169822 -152063
21592 -152063 -63716 -66877 -55314 -95987 -150469 -35061 100310 75658 66028 -31659 37976
21581 37976 120695 34834 -25605 93075 -43103 -18802 -16939 92936 54511 -18613 66957
21570 66957 65699 -74558 -242639 -404633 -375003 -329748 -271946 -172394 -333933 -257642 -114619
21559 -114619 -55213 80596 36377 133721 212766 46709 -165455 -180632 -88407 74115 -72216
21548 -72216 -202928 -272357 -299861 -516259 -626747 -542709 -244620 -212205 -257595 -118400 -58286
21537 -58286 -8737 -206819 -469083 -351554 -245402 -69326 -4695 -70024 -121787 -183471 -263727
21526 -263727 -12934 162210 132700 -2816 -155546 -136969 -154000 -19363 71816 -105842
21516 -105842 -117541 13206 39314 79246 132151 75554 -69165 -58861 -18223 -24393 -88816
21505 -88816 -52423 30400 -60919 -48716 -75401 -167835 -139485 -137966 -125667 169914 242063 21022
21493 21022 26911 -5238 69803 96778 33970 32037 48359 145453 203299 304740 254570 191265
21481 191265 269529 270106 121317 -120932 -192953 -159585 -25113 40930 13463 -8561 37863
21470 37863 -96124 -211410 -220204 -85723 1541 -43231 -167055 -236835 -186731 -209429 -93390
21459 -93390 98919 19801 -107659 -117163 -34402 -19163 -63431 -85211 6213 152480 307214
21448 307214 268346 286300 167299 83247 3545 -17094 -1202 -96404 -35159 92718 146501
21437 146501 12627 69174 54460 43266 388 -84778 -85512 -118933 191 -49757 -240457
21426 -240457 -196918 -97358 -20946 -101272 -182443 -140792 15627 85504 -9727 -68591 27506
21415 27506 -74793 -226073 -181292 -198641 -260803 -201994 -215474 -265841 -246398 -121340 118905
21404 118905 152280 24880 88887 -12376 -48505 6603 58660 86599 82769 209043 128915
21393 128915 54272 73456 89681 -6140 -141202 -108398 -83542 -61191 -25005 59628 239127
21382 239127 15221 -193970 -208423 -258969 -199630 12207 105265 -6353 -50988 -42320 -25483
21371 -25483 18909 123992 53865 -184855 -78792 -59618 -142948 -129393 -105583 146565 160057
21360 160057 -30554 -58018 17682 85018 71403 -33449 -180501 -101551 113818 173958 67833
21349 67833 62405 140698 95151 35158 -27227 -190538 -325415 -188241 -27299 -4682 -85967
21338 -85967 135584 342208 415452 295236 38029 18645 46036 -128830 -39649 136451
21328 136451 166210 47981 84759 80430 75733 95420 70789 153385 12319 -108583 -261527
21317 -261527 -392060 -413588 -193378 7430 23847 -159207 -269373 -281980 -191236 -25208
21307 -25208 -79219 -53325 -87207 -236787 -230477 -294733 -170103 -122365 -214364 -165409 -194906
21296 -194906 -288733 -221421 -63034 11772 91767 86545 -39389 -131385 -180816 -219014 -202684
21285 -202684 -172043 -99759 -117039 -24363 -141829 -134759 -95121 -37429 -230912 -303285 -292526
21274 -292526 -279477 -251501 -375012 -674080 -703098 -460753 -242461 12294 -7774 -47731
21264 -47731 -113240 -136560 -179039 -133102 -335456 -490040 -219391 -108118 -208620 -186234 -104710
21253 -104710 -126225 -153218 -135853 -71570 -64874 -296826 -389226 -317057 -185920 -53044 -18018
21242 -18018 -21532 28153 95170 175975 183476 78607 38069 -3222 -8428 31311 41844 -41799
21230 -41799 -127918 -103259 -87480 70765 -52099 -82944 -64345 -74925 -277913 -321375 -184417
21219 -184417 -56668 -80300 -124229 -161682 -107449 -184838 -51033 76517 114561 10986 -49408
21208 -49408 -236297 -284717 -83041 -96879 -172066 -123088 -57409 -65659 -88457 -198444 -132168
21197 -132168 9452 4615 -50657 -39273 -76155 -34681 41833 142928 88931 9358 82236
21186 82236 -4271 -189816 -185552 -61068 -2346 2222 61319 115181 995 -15911 -41433
21175 -41433 -29566 -156458 -127926 99290 82051 -19363 -109198 -118587 -106292 -229856 -117127
21164 -117127 -9280 12083 -172442 -212990 -8309 117024 186909 180482 6994 -124546
21154 -124546 -177845 -49347 -178090 -326082 -414222 -524653 -312137 -174789 -88459 -87559 -226022
21143 -226022 -411399 -500292 -174985 -63660 -282090 -436063 -321560 -119436 11101 -26299
21133 -26299 55749 41643 -74855 -159345 -159051 -195418 -226592 -328926 -368626 -348910 -253180 -135434
21121 -135434 -130317 -22500 69243 -19458 -30568 -42528 -46184 -162062 3088 -7170 -164368
21110 -164368 -125072 -101708 -97566 -148506 -150224 -67536 -90337 -176081 -180933 -120770 -95944 -107404
21098 -107404 -140995 52561 79176 85692 67848 183576 251162 257031 251282 143828 67516
21087 67516 82208 44168 -211699 -433025 -354213 -79447 103307 7048 -111981 -313026
21077 -313026 -303912 -181000 -156657 -160267 -131841 -109189 -61684 -154977 -185132 -38052 -191262
21066 -191262 -436276 -308831 -155035 -214352 -136114 -149820 -201694 -112420 -106204 -225429 -289742
21055 -289742 -284182 -226556 -68465 -14062 -21299 -8535 153550 187573 -75757 -277011 -310198
21044 -310198 -335209 -355073 -270845 -275745 -235185 -237191 -201654 -80210 -79682 -57779 42662 122915
21032 122915 124895 29250 61094 133493 128327 141173 4198 -59065 -192165 -218652 -283683
21021 -283683 -105899 -14028 -2336 -30209 178678 327814 137608 16836 108852 249549
21011 249549 65808 -95395 -195091 -254558 -161720 -3194 102729 622 -216212 -195415
21001 -195415 -58474 -41260 5033 109068 179750 88979 -8608 -162083 -299671 -397154 -401825
20990 -401825 -183600 -46170 -80344 -114721 2232 53161 -34767 -87760 -20183 -78966 -89547
20979 -89547 -63508 -69743 -38926 33726 95516 103375 82376 166173 87383 -26347 80791 126790
20967 126790 86109 -90867 -114621 -31889 -115928 -129908 -260077 -293504 -327043 -333679 -285768
20956 -285768 -170289 -260934 -351949 -348691 -397034 -294758 -272584 -186278 4309 91195 88952
20945 88952 1014 -127623 -16304 -231938 -286060 -111440 -53230 -16348 -185590 -353430
20935 -353430 -194927 -78223 -71407 -141399 -91029 -7255 -32070 -128126 -56481 -91489 -163802
20924 -163802 -137437 -120144 -225065 -165885 -100735 -73560 -153320 -264999 -329843 -311331 -310607
20913 -310607 -242312 -70823 -103065 -202792 -347915 -286395 -55750 144669 98453 -117498
20903 -117498 -164399 -50723 -155628 -62473 131039 169094 135273 -20895 -267876 -304504
20893 -304504 -182783 66344 32206 -6917 -113314 -228859 -374893 -370905 -360169 -314602 -206372
20882 -206372 -22519 -33327 -26442 -81326 -190175 7831 -8514 -8398 75902 188837 234631
20871 234631 132045 -64425 -39454 -41672 -10730 50129 -112885 -43008 -38547 -120639 -117665
20860 -117665 -273950 -307669 -320510 -259615 -344214 -257797 -121842 -138179 -156709 -261738 -207341
20849 -207341 -83477 -55056 3974 -185871 -110622 -47926 -191996 -152640 -86386 -282000 -323954
20838 -323954 -149031 -7414 121317 206776 174834 32887 126239 303247 387575 588998
20828 588998 566533 442244 550497 995616 1238863 1197322 1076997 970853 731956 471259
20818 471259 236480 43591 -210300 -261519 -3368 -16097 -69529 -2003 -84116 26830
20808 26830 126730 119577 138546 1295 -70879 -158199 -91778 14385 36787 -16191 9085
20797 9085 -870 50542 143366 99068 -85788 -118933 -182603 -199732 -62737 5591 103549 77667
20785 77667 67045 -130461 -181157 -226809 60466 77016 -14248 -41681 -23754 27699 81068
20774 81068 -106676 -233836 -141415 -97078 -84515 -155649 -133275 107823 23868 -47917 -96274
20763 -96274 -179136 -261189 -212676 -122738 -214349 -169877 -256904 -343063 -281575 -78412 87038
20752 87038 81753 151280 155386 167372 120363 99914 210689 256327 137245 33077 -15487
20741 -15487 -47571 2401 -37560 57007 22597 -28685 57440 70966 -19837 143508 184016
20730 184016 80797 93122 -123930 -181733 -66013 -181534 -76077 7056 140884 -5819
20720 -5819 -51094 -17655 -136183 -229503 -20319 87854 -151668 -92053 -7831 -142179 -77280
20709 -77280 -15935 -65219 -17298 14542 15066 -28438 -193484 -233011 -270607 -357461 -256284 -130970
20697 -130970 26337 14594 -86552 -219631 -306880 -155563 -164876 -107505 59180 109757 103283
20686 103283 -88968 -198033 -36066 -72681 -120021 -41856 -3740 18204 139764 324595
20676 324595 400257 245479 131720 179021 173911 112696 14845 -111785 -193728 28203 198149
20665 198149 1647 -144980 -119609 -16344 -55055 -17326 157912 -29961 -18017 63208
20655 63208 43890 50472 38808 205098 368408 212632 -33313 1667 11680 -48200 -83006
20644 -83006 -176807 -192268 -183600 -144366 -183983 -197383 -104337 -31963 -109867 -105209 7355 18634
20632 18634 -223559 -172192 -82384 -203710 -299988 -353896 -267231 -168400 -147583 -306429 -371666
20621 -371666 -310736 -257686 -216230 -198325 -320376 -307529 -158662 -38844 -185706 -356876
20611 -356876 -316688 -349360 -294536 -245546 -246748 -220214 -42604 69571 115149 61276 71188
20600 71188 -10238 -129826 -221137 -68508 18840 -41644 -147184 -315988 -387459 -273809 -154385
20589 -154385 -90684 -131502 -246680 -138999 -2277 -71160 -297751 -444554 -456359 -474040
20579 -474040 -366387 -251929 -221392 -123560 -33149 -168382 -245675 -9592 45472 -138464
20569 -138464 -199678 -184533 -256249 -256615 -95657 -34463 -128246 -263305 -209405 -290596 -304674
20558 -304674 -442937 -524193 -429354 -479926 -392782 -144368 115641 -11494 -89591 6625 107087
20547 107087 -87462 49439 242345 116219 -19982 -168999 -318882 -589161 -472633 -354144
20537 -354144 -324297 -241730 -219287 34752 -31839 -149813 -172222 -255742 -394047 -362993 -359574
20526 -359574 -265498 -222905 -204625 -238878 -141856 -3917 280 78769 35940 -3484 180407
20515 180407 348241 238641 -83843 -112506 -56257 -171974 -266024 -153915 -230874 -413839
20505 -413839 -335294 -238189 -398225 -564426 -547944 -506120 -474006 -307595 -134223 -146510 -155106
20494 -155106 -168948 -152625 -84075 -6286 -59092 40528 111662 8951 -129407 -122550 -7120
20483 -7120 44634 -61465 -156325 -201248 -143492 -144757 -147509 -26823 226428 266562 289895 261602
20471 261602 50078 -71991 44519 106740 64637 86240 104128 -122153 -85201 140888
20461 140888 206404 66070 82567 37762 35120 -43676 -67839 -176133 -247655 -191859 -190219
20450 -190219 -240096 -158414 -132075 -235451 -39535 -81949 -293189 -299246 -386026 -276877 -208213
20439 -208213 -301526 -123738 -123165 -137630 37817 159187 100737 12345 -124390 -205554 -270337
20428 -270337 5489 136825 -81785 -284343 -417662 -537259 -566611 -418822 -285173 -149269
20418 -149269 -186805 -219932 -173186 -194333 -394098 -484591 -541505 -582513 -371362 -43710 -4715
20407 -4715 -217586 -345278 -377485 -361880 -254133 -138282 -32993 -141510 -264924 -218386
20397 -218386 -352716 -332387 -78699 8653 -60351 -184605 -356597 -271008 -84714 86367
20387 86367 97955 37561 -48559 74465 216173 269901 38043 73587 33873 -180852 -136698
20376 -136698 -21317 -58245 -41500 -64338 -127755 -191635 -131581 -99525 -121509 -206435 -332409
20365 -332409 -269032 -261985 -108312 -86681 -50604 52179 31587 -29929 -202384 -282317 -182991
20354 -182991 -233715 -321910 -280331 -188599 56340 277730 279927 212583 102594 -27337 13679
20343 13679 40387 -5204 -41142 -78885 -52990 27976 30175 62737 -52579 -191018 -140203
20332 -140203 -49385 22432 174787 122322 2609 -44230 -243132 -316982 -261983 -330945 -216424
20321 -216424 -114765 -19500 -7594 -128868 -140462 -139434 -127999 -79065 -96494 -54350 74451
20310 74451 40760 -45174 -186105 -210452 -100596 -138157 -36513 -74241 -111753 -155140 -78245
20299 -78245 -171422 -133003 -157332 -265936 -181817 -115785 -40430 -39061 -101477 -68153 -114807 -147174
20287 -147174 -189479 -297693 -333024 -286464 -160118 -103440 -91736 -175987 -304772 -84639 19862
20276 19862 84751 183077 4445 -126852 -170807 -130457 -7695 -79333 -131770 -87486 69174
20265 69174 203582 31245 -123872 -26818 7187 164519 263805 -20788 -71742 137284
20255 137284 77400 -8332 -180567 -251563 -244813 -169432 -172891 -158397 -338379 -382254 -396195
20244 -396195 -313554 -217677 -107537 -74255 5316 -91140 -210559 -331292 -368243 -260368 -248388
20233 -248388 -218240 -117716 -25150 3740 13100 5993 101203 324958 417653 512590 463770
20222 463770 409330 478567 459711 492859 519988 387232 336196 238904 280058 372120 394071
20211 394071 599359 872231 1094837 1198079 1200283 1090356 1136947 1059235 968847 982885 851661
20200 851661 766939 649669 459004 343198 296876 299526 354840 354527 299936 148079 244935
20189 244935 326109 385346 428743 335129 266307 354961 266936 390101 373317 441897 342278
20178 342278 289305 531569 666160 509937 401849 407850 460086 676790 592382 382798
20168 382798 368517 241440 154318 126165 165006 291752 329168 266173 289810 404359 403867
20157 403867 265883 393525 314787 220617 298266 478027 534913 520367 623519 833351
20147 833351 805783 561828 527014 419929 357249 317026 274954 466255 562409 415332 475677
20136 475677 459203 642721 807771 957384 969950 1124461 1181742 1320197 1178891 1228575
20126 1228575 1268012 1174570 1250136 1243308 1208051 1352482 1574158 1843074 2311133 2783234
20116 2783234 3153590 3506499 3816594 4011913 4042994 3842051 3755194 3817646 3987411 4311285
20106 4311285 4755481 5410148 6332922 7496042 8843785 10599452 12514966 14583317 17027066
20097 17027066 20155150 24992519 32082596 43318534 61208276 90770160 138411420
20090 138411420 205850104 282063289 338136308 347913434 314284778 246484882 167997762
20083 167997762 109074244 74001226 53690292 41300422 33043627 27147798 23103699
20076 23103699 20217721 18123621 16195298 14579653 12909699 11416418 9991658 8745738
20068 8745738 7686240 6824410 6235361 5885249 5653128 5369759 5289636 5136721 4927196
20059 4927196 4482486 4074447 3838244 3333215 3059233 3060213 2865377 2545365 2379700 2509975
20049 2509975 2551249 2452766 2410711 2512658 2350446 2296198 2297970 2119113 1854912 1780500 1670603
20038 1670603 1643717 1539141 1332091 1229230 1176395 1182521 1204241 1188939 1025617 958448 976439
20027 976439 844560 756791 895653 974423 836487 703639 712684 691739 785380 820051 793526
20016 793526 687551 713097 1021485 991753 767935 646761 592372 591182 651288 570994 546272
20005 546272 528568 530263 489217 616720 789386 838482 814805 946067 1115725 1246754 951132
19994 951132 707163 635062 595951 385686 456050 432791 366597 493427 650702 648750 558037
19983 558037 597576 557876 563017 540243 415919 431239 400290 437349 461681 345798 203813
19972 203813 197214 540605 588021 601383 644955 699188 696474 562450 576400 616960 872885
19961 872885 1131049 1133659 1113468 829346 507372 447213 360750 242077 287277 421187 481976
19950 481976 337180 368385 392570 480289 549271 554549 433622 336485 262708 306807 404182
19939 404182 563852 602476 531434 382220 301248 375563 300359 307507 316107 341167 243608
19928 243608 68713 33155 -14021 44366 24005 136299 -7266 -61525 127110 75864 -43049
19917 -43049 27328 275885 436281 276351 86501 416 95825 160338 160420 249747 234754
19906 234754 187789 221606 178422 281598 234846 -6720 95992 206566 151479 96294 219266
19895 219266 242541 226519 111529 52548 63245 118865 151100 159878 142771 219646 211924 146333
19883 146333 179561 157493 181879 269812 391434 397845 302433 226520 22481 -96569 -129070
19872 -129070 -110839 31985 114837 62900 9690 -40334 102158 55745 31420 33866 -44661
19861 -44661 134394 205321 214298 34662 19231 102312 252770 226945 174928 -39616 36504
19850 36504 93097 86086 55605 -86747 -172595 -33238 162821 72859 116678 34580 27288
19839 27288 48030 110743 130318 157366 203620 69629 17331 -98157 7746 20767 -23090
19828 -23090 131272 162698 126397 60760 175752 337484 137362 -114168 -118420 122934 271790
19817 271790 240323 201377 308361 292811 143501 93756 429306 702386 686939 676168 654416
19806 654416 539421 290496 284158 364636 408705 420250 467009 515291 516755 436728 477679
19795 477679 428118 286023 326757 329298 381110 391802 475704 409149 248714 176124 305574
19784 305574 344695 509605 526153 603453 633581 607122 504855 459264 510133 417885 498338
19773 498338 662193 713233 665425 724241 679105 764868 937084 1006049 1069086 888875 797623
19762 797623 916706 1101350 1386123 1624965 1830805 1845989 1887143 2041072 2245959 2418173
19752 2418173 2503216 2381654 2309159 2334689 2361761 2167188 2102912 2409479 2569653 2800700
19742 2800700 3188105 3196485 3072073 2967856 2931459 2894513 2945012 3042845 3076594 3132015 3112622
19731 3112622 3295914 3457352 3686001 3761517 3831727 3972658 4089349 4393831 4627846 4927928
19721 4927928 5226645 5389516 5725959 6056592 6448866 7355048 8281577 9343507 10774454
19712 10774454 12738804 15267949 18914232 24347892 32189625 42635065 54732448 66297686
19704 66297686 74791825 79801099 82195652 81435931 76768696 71350101 70611393 77863550
19696 77863550 93267124 113833453 133727053 146567351 150689995 148122265 139616897
19689 139616897 123704291 103331918 85850356 76312424 75594828 81130773 88628961 92641452
19681 92641452 90694552 85140788 77979777 67794180 54489733 41323007 31182685
19674 31182685 24578453 20032246 16871109 14588499 12874789 11588145 10596497 9669531
19666 9669531 8791204 8243264 7866994 7422223 6973296 6737499 6494980 6145763 5809765
19657 5809765 5400314 4803401 4356216 4020718 3904645 3602420 3352226 3184794 2838396
19648 2838396 2424385 2288499 2521490 2519886 2319101 2420323 2454770 2260942 2054629 1956484
19638 1956484 2005065 1856770 1610071 1542781 1434257 1431783 1640703 1589503 1362188 1205094
19628 1205094 1180201 1080067 1137808 1259987 1240523 1177709 1177977 1229309 1106283 1026286 1016066
19617 1016066 1191300 1281221 1263743 1164781 973524 971868 995421 1094207 1219656 1145567 964974
19606 964974 995152 913946 752788 675281 726909 792135 1011581 937166 913882 844228 838959
19595 838959 928111 803265 719435 745229 862476 950937 942607 966350 972087 896003 837008
19584 837008 842874 798933 809638 1045923 1143575 1222538 1292725 1099129 1050326 1038838 981860
19573 981860 1018800 994017 897444 816906 793896 820203 970333 1010794 899926 722203 617665
19562 617665 705158 709533 653783 756872 884512 1006924 1094119 978719 952657 1021325 930115
19551 930115 688541 781598 798793 764639 811855 640539 456305 513774 566982 622074 656985
19540 656985 731273 625584 606211 767713 762366 609756 560889 612996 610270 631123 621479
19529 621479 730041 736641 488496 354728 383755 314717 220789 131889 128753 157023 33147
19518 33147 97827 132899 100538 133082 38877 232996 239310 352864 443002 382320 272975
19507 272975 214126 230298 202408 186742 141856 90535 62146 93381 10651 -3080 -108906
19496 -108906 -77242 69945 220658 227501 270658 365425 472803 417650 402760 377603 382210
19485 382210 285399 191560 177862 82968 162294 412769 544839 439109 479137 461409 367249
19474 367249 281571 328820 369204 362304 192499 51385 125529 131715 35496 -149482 -1828
19463 -1828 43411 61380 131962 251606 338262 174634 -38122 79617 273004 255389 215280
19452 215280 367312 281988 239467 282987 248222 187470 132606 314938 391637 400669 417978
19441 417978 341323 379986 415853 374047 317347 214280 190143 271048 213023 18059 6369
19430 6369 -61656 -10602 -31173 -127698 105357 206824 215277 226343 224708 43614 73629 163663
19418 163663 236974 200606 198685 178598 88763 46109 -43399 -156789 -70449 69241 -33764
19407 -33764 93620 110842 122606 43296 68170 132708 339409 300786 194669 194609 113669 154741
19395 154741 51826 -3715 -33561 -118459 -125980 -19884 -4132 64435 230627 418836 299090
19384 299090 209440 241139 210149 223897 235157 316652 328113 217235 202594 324251 415917
19373 415917 319346 435869 321815 170002 135605 155529 267879 194018 171018 220549 164970
19362 164970 231894 284661 385403 426211 383594 322583 445597 562502 491368 491452 477618
19351 477618 324115 448698 629859 838864 1007705 1284580 1570913 1837976 1895489 1902598
19341 1902598 1950369 1910270 1746889 1558826 1429397 1295736 1305701 1386351 1447273 1458652 1395426
19330 1395426 1284499 1528589 1789360 1888000 1878835 1932473 2211928 2356428 2461605 2705472
19320 2705472 3068451 3472797 3707634 4172975 4747459 5462082 6260265 7478500 9064944
19311 9064944 11446516 15016849 20030586 26950783 35333997 42864616 46534427 45122177
19303 45122177 41066835 38751301 40814232 47592022 56817687 64740030 67427244 64510787
19295 64510787 60858651 58694979 55476608 49563331 43028823 39533230 40216420 44766018
19287 44766018 50343857 52467436 48081155 38598144 28547518 21153618 16609127 13624677
19279 13624677 11512805 10066053 9195419 8618771 8074548 7512987 7344736 7515744 7776275
19270 7776275 7909940 7841659 7961994 8241340 8685371 9513708 10664631 12250928 14630284
19261 14630284 18135118 23466220 31221395 41208138 50951471 56304607 55063767 50341816
19253 50341816 47410940 49511280 56587077 66652690 75250535 78448020 77109682 75356491
19245 75356491 74348134 71126656 63691820 55147130 50274995 50920844 56123745 63185306
19237 63185306 66869700 63132137 53402880 43068540 36104385 33114327 33696587 37745332
19229 37745332 44898704 53116114 58674557 58035209 52300406 47039888 46294951 50628040
19221 50628040 58935749 68711896 75653827 77037039 74213039 68768379 59973611 50201389
19213 50201389 43598127 41810852 44103204 48576561 51003378 47395409 38294837 28684250
19205 28684250 21726078 17238289 14519646 12537364 11124564 10078565 9294964 8886315
19197 8886315 8505405 7995252 7697504 7524108 7558525 7733087 8020634 8433898 8762213 9195300
19187 9195300 9956405 11187245 12790093 14935636 18322674 23514685 31440380 42598662
19179 42598662 55809142 66584818 69259171 63064605 54704550 50971416 53578523 61473511
19171 61473511 72200428 81936738 87810329 89912426 87816296 78525813 64569584 53214374
19163 53214374 47918865 48170843 52020313 55343621 53278570 44773170 34063315 25012507
19155 25012507 18971445 15174316 12542657 10415057 9030831 8098072 7340518 6694967
19147 6694967 5987834 5426730 4940447 4392244 3852066 3647076 3389573 3181701 3067214
19138 3067214 2865710 2790482 2735802 2649822 2499499 2387076 2402069 2282957 2022169 2080956
19128 2080956 2166748 1920494 1852103 1818278 1809646 1820834 1688716 1587997 1708513 1713498 1552245
19117 1552245 1534359 1590601 1411398 1216469 1021101 1104013 1261179 1206052 1258046 1255270 1330719
19106 1330719 1381417 1429395 1531729 1578447 1527097 1593474 1922369 2318667 2598343 2886184
19096 2886184 3204893 3318443 3297208 2897421 2640135 2417970 2067703 1974885 1889786 1760478
19086 1760478 1830833 1835306 1752054 1807614 2046741 2201388 2378647 2569997 2745686 2935610
19076 2935610 3320245 3775202 4159079 4129404 4077839 4005137 3808112 3595302 3564145 3584623
19066 3584623 3562199 3708539 3954411 4277635 4651431 5001020 5514804 6273975 7082597 8160350
19056 8160350 9382640 10681483 12585863 15120335 18301219 22820447 29132009 38275758
19048 38275758 52461281 75272116 111214862 163203314 227887914 290691445 331014933
19041 331014933 335094478 302373847 243636334 176833386 120220444 81920172 58600680
19034 58600680 44227875 34761614 28323010 23550309 19898890 16895761 14663130 12872232
19026 12872232 11274760 10116263 9055397 8119025 7254032 6805980 6204093 5717547 5294093
19017 5294093 4945630 4676882 4444286 4334589 4141174 4115919 4200108 4372160 4602236 4736184
19007 4736184 4557836 4387322 4061169 3672746 3192098 2908586 2858016 2673662 2513191 2328595
18997 2328595 2207901 2112375 2010949 2010349 2117379 2141172 1995850 2031912 2056088 2310778 2615221
18986 2615221 2960354 3225631 3176264 2741594 2306696 1969331 1758713 1532818 1253368 1027029
18976 1027029 1050971 1170632 1121544 1313418 1332375 1246880 1171499 1219695 1203197 1145621 906737
18965 906737 875850 909599 952313 1022498 1031098 1084982 1205823 1174050 1080106 955949 881065
18954 881065 1021762 1137832 1339594 1437541 1421971 1548318 1502314 1505275 1533828 1361786 1362942
18943 1362942 1417242 1338503 1155356 972134 706529 654863 700325 892433 1064646 970428
18933 970428 862124 831088 624056 686517 710397 676568 669664 703760 700459 679169 576140
18922 576140 704772 726536 665613 698925 740664 939114 1020029 1055790 938766 852945 801639
18911 801639 776057 628963 505927 656110 618230 510392 511980 569069 893285 1154130
18901 1154130 1284510 1625971 2037101 2390840 2495754 2470943 2409881 2203735 1921410 1656149
18891 1656149 1283924 1006950 943376 756515 566488 510387 654081 595871 630074 649577
18881 649577 591473 464407 390483 573213 631582 431152 417186 397469 426245 381192 364324
18870 364324 548036 503733 496805 444233 349312 426032 383169 352737 366221 492517 561754
18859 561754 551004 605980 793186 840315 882378 877438 933075 829240 889628 1059813 1230737
18848 1230737 1250049 1314425 1363867 1505763 1530057 1184679 841564 732214 621781 544409
18838 544409 757295 803443 613573 478538 456205 321334 138982 194766 140327 170961
18828 170961 232797 226990 191104 191215 403626 700212 719411 596658 422972 476098 642076
18817 642076 586048 706651 667465 669456 750107 789319 822113 866201 775540 810712 804551 812172
18805 812172 755044 769637 787004 782013 602680 574615 538047 456828 492374 694031 774261
18794 774261 796943 949447 915855 1017703 1217151 1149496 1050638 1065842 1055241 1089154 1074954
18783 1074954 1008506 928366 1187557 1426442 1706266 1776757 1688469 1873785 2089836 2170999
18773 2170999 2413166 2581157 2642527 2728549 2722167 2910804 2954249 3059836 3203660 3432194
18763 3432194 3674336 4081547 4479349 4892690 5502095 6409433 7703381 9398143 11796682
18754 11796682 15150610 20001162 27207541 37653897 51572509 66633994 78124516
18747 78124516 81401800 80124559 77933361 71069784 57150958 41787477 30142530 22333564
18739 22333564 17278521 13981995 11783227 10327443 9036262 7938189 7252783 6721461
18731 6721461 6446120 6097374 5942937 5914709 5969217 5986934 6125107 6433047 6476344 6298669
18721 6298669 6151183 5964661 5910504 5697126 5493104 5509594 5626582 5887826 6290884 6694548
18711 6694548 7550384 8614166 9926447 11671237 14148785 17697342 22525556 29517496
18703 29517496 40153516 56026860 77955016 103489521 125724339 135259181 134104324
18696 134104324 131188917 123177176 101889453 74663039 52858856 38511272 29344627
18689 29344627 23120058 18844236 15888243 13729873 11928628 10646541 9582818 8734201
18681 8734201 7961547 7348654 7037222 6678466 6413938 6266031 6197742 6141815 6095377 6122264
18671 6122264 5982144 5685142 5374179 5110014 4885594 4812440 4577065 4621150 4899795 5058208
18661 5058208 5317481 5697995 6282036 6970754 8073938 9806803 12410390 16228214 22096709
18652 22096709 30822121 41597628 51988614 57491905 57582366 56402632 54136057 46659574
18644 46659574 34796548 24382223 17565039 13194091 10368429 8338411 7010568 5893605
18636 5893605 5014870 4300544 3856721 3406169 3348647 3332327 3158329 2821378 2622502 2601044
18626 2601044 2457688 2377945 2467792 2628198 2486270 2233923 1982352 1811714 1613413 1497517
18616 1497517 1423303 1377826 1373858 1362122 1260865 1040960 1123609 1034574 947864 990905 1144902
18605 1144902 1156124 1018126 969773 888802 749608 784840 819876 783475 785213 661056 448124
18594 448124 416354 528337 753841 764510 808713 693565 707290 887647 854751 828820 832971
18583 832971 669952 665222 710979 701354 535401 392026 398638 499558 535592 739713 783201
18572 783201 684410 627289 505501 488497 428950 330777 285687 402410 385771 271250 291540
18561 291540 223221 315174 394753 380123 390153 335864 302713 258786 221422 192108 245121
18550 245121 475020 343350 342436 146351 33131 56464 75262 247863 312346 239986 276535
18539 276535 253659 226546 217119 271422 326741 261403 274927 466664 372225 307992 259180
18528 259180 176390 202653 211119 176162 203771 334076 335237 217912 344400 428980 356699
18517 356699 439978 422716 300589 229063 142429 121347 108435 257611 300596 307917 190895
18506 190895 23480 82280 165412 226750 317429 319876 292922 260824 179546 251554 201917
18495 201917 171574 201381 162733 137670 63761 120108 112268 136010 155443 132667 215871 381225
18483 381225 559944 635490 552834 315142 164751 315223 308528 274830 51947 6854 117045
18472 117045 308637 424715 286100 67051 -1024 -80754 117242 201501 199016 215609 329684
18461 329684 606015 691441 486940 491054 415768 367063 469294 403011 273844 293578 412263
18450 412263 407037 337622 395598 289893 104796 142849 301011 421367 325817 231001 148967
18439 148967 109796 169653 161218 201337 226925 315698 345227 245717 173871 354388 427847
18428 427847 504978 596605 672214 788572 806327 910813 1043668 941216 1061237 1214833
18418 1214833 1296923 1320148 1341683 1327979 1242989 1071809 790101 484774 325037 287536
18408 287536 298350 324835 181445 172163 158289 81790 103067 111138 152901 176523 111906 38909
18396 38909 219319 192195 222189 178517 174713 35359 -7571 67769 148686 107813 179790
18385 179790 168961 -1130 182995 215223 96163 93693 171632 236752 154370 134799 300938
18374 300938 467736 340987 187062 179722 159108 203169 350164 479758 545879 352614
18364 352614 98691 -1353 22050 18907 10826 -250828 -276756 -159924 -106691 8964 19394
18353 19394 -12786 104297 128122 145145 162734 356153 348410 167119 -45588 -87477 1451
18342 1451 -12899 33731 233921 342169 385296 306222 232339 322200 342879 -19885 -412259
18331 -412259 -317965 -114726 13335 8035 217332 371279 336274 183628 -4912 -31960
18321 -31960 -52102 38157 -3931 -51403 31205 53428 7088 -132744 -297062 -137204 -16813
18310 -16813 12829 -39480 23186 180450 84317 1676 38710 92395 136099 175471 168588 142977
18298 142977 259560 37178 -14944 50755 21292 13434 -35637 29982 12442 -138335 -3545
18287 -3545 73387 83089 97844 211104 59950 -37449 31810 109211 117325 73137 -36181 -159860
18275 -159860 -91560 269722 266649 241596 115329 60772 75713 219591 319256 368366 292545
18264 292545 271744 77913 -189417 -207961 -67100 65463 -10563 -50896 117016 164964
18254 164964 308476 183264 -8671 -10093 89252 313791 279420 107527 -2172 29828
18244 29828 103637 -35687 -50041 -8382 -71688 -51178 143176 112265 164796 284018 248817
18233 248817 324014 321507 339622 411418 383864 367256 339128 408978 372711 293246 322566 260302
18221 260302 180716 95478 -119423 -264234 -172815 -146433 -178984 -126455 101350 195921 109333
18210 109333 -5103 -156486 -53352 214418 218579 104460 27453 161258 326859 159495
18200 159495 954 -104701 -110868 162919 202593 -37449 -64909 152534 126571 292101
18190 292101 502173 571760 496361 362846 119719 247780 480361 528489 539074 660894
18180 660894 868566 932034 885384 627336 472461 420260 328080 282016 357425 443687 448834
18169 448834 465055 373271 173914 142490 137666 404395 662392 572837 508688 506627 724412
18158 724412 643711 477424 291824 146150 166577 262914 282742 52384 -79635 7925
18148 7925 105525 139327 88084 144051 167354 251748 393785 361388 332502 175571 112995
18137 112995 293061 207164 117779 70555 223977 256863 125207 156663 280971 332607 344020
18126 344020 276928 202527 89487 71027 -26737 -70992 35056 197358 260279 173669 -14031
18115 -14031 66484 149864 54808 -70879 -125358 -106812 -42748 26942 -22893 30907 32259 74786
18103 74786 -4025 -49030 -97528 -78173 29791 -21997 -117878 179924 272246 254750 263088
18092 263088 341104 396168 258558 210763 257643 184326 150546 226280 316168 262048 69958
18081 69958 -43018 -189602 -234999 -130909 -216169 -197913 -171553 -29802 93873 140288 296747
18070 296747 244106 111282 86677 -15183 39590 77913 -80430 -276371 -201531 -104976 26020
18059 26020 138308 110888 184682 299158 239459 96595 -36226 17419 23606 41697 158106
18048 158106 80337 -22856 -127036 -99397 -104177 -185922 -137367 -161716 -129911 -99088 -71492
18037 -71492 -166269 -93298 -79605 -92292 -2974 142973 70211 -14283 -82027 27301 -31428
18026 -31428 -80133 -110056 -178468 -177494 -162832 -219857 -147558 -135523 -72404 -75074 -97701 -210427
18014 -210427 -385617 -238030 -101549 -146967 -297079 -281809 -220416 -64675 128723 252859
18004 252859 194750 79532 26 40177 90766 173617 213262 289455 401000 369982 307719
17993 307719 233507 116668 34537 88535 -7348 24931 85274 113668 -126308 -325121 -122062
17982 -122062 20867 -50983 -93923 66459 21428 131016 96774 55829 130134 144266 100087
17971 100087 -40423 -86631 -74389 41643 134677 -9734 -301262 -342131 -173655 -180320 -51219
17960 -51219 141196 238920 140713 112797 136746 153238 172220 182176 253456 354421 250453
17949 250453 144168 93861 200634 193519 197852 99297 -28581 -179504 -79032 57097 151582
17938 151582 214342 147080 36726 -105083 -223498 -65446 208613 253750 213231 46250
17928 46250 -33255 -99150 -182897 -102309 -121235 -25150 101032 -169767 -206606 -33645 95142
17917 95142 28158 -83637 -22876 -2787 29599 -38053 -106181 -26116 8256 -61997 -33226
17906 -33226 119043 100265 55929 27084 137306 253420 234885 -30975 -202518 -178946 53146
17895 53146 159983 250762 345044 306823 346369 215525 94031 -112054 -34308 117584 56395
17884 56395 47778 -22108 15020 37192 -149829 -146158 -142484 -46508 -28080 -244424 -161486 55107
17872 55107 26793 38295 179213 144715 165649 112683 109532 189247 199752 163187 134786 -84506
17860 -84506 -34910 21355 -5777 -112194 -234901 -219942 12379 110325 330038 546577 385890
17849 385890 281686 368695 254904 179676 256894 356270 205409 199800 153454 97444 171902
17838 171902 366865 494367 507714 502179 415361 326734 401565 349031 349615 315216 290272 237500
17826 237500 184441 177397 117179 27672 36825 148726 66030 -26253 10825 31619 -154388
17815 -154388 -182562 -36005 44652 52480 16523 -76263 -51499 74078 287238 347772 307904
17804 307904 267774 223602 138258 39912 43136 241393 396242 382200 279693 221642 184820
17793 184820 318563 279379 125342 8072 -118863 -154873 -126244 -73408 134392 254690
17783 254690 198991 49121 -10424 92334 86446 -93004 -14621 106701 1085 -41843 16717
17772 16717 39290 15972 -83852 -89517 27338 96728 -30763 -198788 -181905 -64551 197037
17761 197037 17490 -200892 -143512 -28793 -113802 84579 197468 118822 46882 26082
17751 26082 79866 -9221 7851 -58116 -178559 -251849 -303062 -231753 -166674 -50865 -35591
17740 -35591 -90413 -42275 -96228 -120989 -36472 84554 120014 75836 83133 135118 49208 6662
17728 6662 -91594 -16103 51181 277291 309104 339940 418810 400965 248028 239618 164010 127793
17716 127793 45271 -9793 -15772 -76669 -193613 -67438 -19119 -86250 2374 113465 180624
17705 180624 399367 468897 339161 383534 361421 252555 165280 148304 20666 -4242 -95756
17694 -95756 -218465 -166150 -276654 -294585 -337898 -174562 66049 132702 11421 -64160 -104461
17683 -104461 23765 170460 334146 319574 198730 46285 -6561 67561 -113404 -47810
17673 -47810 128228 43610 -35952 -25963 29459 154844 221919 145540 10045 -27697 94277
17662 94277 -661 93323 178499 304701 358023 285453 196473 75122 70430 64828 -61907
17651 -61907 -45983 17292 -129396 -330028 -241523 -26398 96975 63365 -120691 -201213 -230111
17640 -230111 -307208 -147726 -160195 -238077 -230566 -130669 104460 330802 428807 439278 371343
17629 371343 448311 457653 204578 173665 245259 245954 292387 157069 -78139 -37295 -51048
17618 -51048 -6000 71964 121334 78176 47945 20933 -11905 -107098 -245106 -164375 -20800
17607 -20800 -21237 -75637 -118414 44246 204454 147309 133166 121278 132680 614 -63336
17596 -63336 -144416 -220438 -45894 -54816 58431 149840 221095 84144 53587 79634 78439
17585 78439 -37229 -1487 50541 -13379 97851 144094 139787 -171080 -206433 -93861 56802
17574 56802 201798 104351 123981 -21677 -69335 -90950 -130697 -86443 -170775 -180009 -19132
17563 -19132 39464 10379 -105560 -205754 -248006 -246221 -306750 -184212 -144952 -10447 127600
17552 127600 151248 -15128 -155575 -243749 -206450 -52565 59250 -137983 -154538 -182876
17542 -182876 -127583 5563 47889 -26887 -4008 36408 99617 120017 20103 29456 -8350
17531 -8350 -195508 -115231 -9350 91254 31944 42196 119484 105451 -83725 -27909 139512
17520 139512 161142 320628 372809 305974 308374 419985 358407 543528 477639 167965 115986
17509 115986 123603 259304 240236 45229 144134 39892 25422 188826 198155 144583 133201
17498 133201 179298 270357 86105 21389 15212 204881 210263 125148 -38231 102124 69655
17487 69655 30907 60489 -161437 -123230 -9285 -137599 -156236 -154243 -235230 -233271 -142523
17476 -142523 11538 38180 -29215 -218584 -121568 -74445 -32279 25142 -69712 -70921 19388
17465 19388 -42715 -12362 120849 172576 140540 262236 193281 160701 61508 106544 45093
17454 45093 -12247 -107928 -144920 -118183 -186367 -186493 -138797 -82688 -15926 -23853 -15646 -78166
17442 -78166 -5280 176957 737 -95293 -25467 59622 31612 57868 48503 -121421 -279280
17431 -279280 -275580 -232126 -328042 -315850 -231089 -117590 -77899 31758 -66362 -187631 -180598
17420 -180598 -179259 -34664 -106430 -217847 -179095 -158123 -169235 -81058 93583 51052 -27109
17409 -27109 77154 114975 177113 155589 -35683 -224338 -158822 -104256 -200563 -184647 -133407
17398 -133407 8848 72387 -78504 -35025 14202 -158071 -222826 -47013 93836 59356
17388 59356 83932 189076 249564 250553 165720 -59622 -140061 -116866 -70465 32929 -131865
17377 -131865 -133519 1572 21248 -41429 -160121 -258558 -295038 -226862 -154819 -55517 -60747
17366 -60747 -122161 -58287 10169 193292 200915 -168135 -239498 -176181 -103081 85830 125934
17355 125934 -63946 -170462 -140809 -69 12602 -154579 24093 13991 40397 29698
17345 29698 -13116 -4392 43542 181279 174925 -15908 51580 47987 -13986 -65930 -69486 -31781
17333 -31781 -1017 -144669 -143059 -108981 -135899 -20646 -4216 28356 -49048 -250619 -281985
17322 -281985 -148854 206331 381290 313274 142612 132780 81684 -63763 -157386 -152495 -84321
17311 -84321 -54245 -71033 53797 106812 97471 96126 71105 -53953 -82204 -68619 -66512 93509
17299 93509 189523 275312 226378 159433 229473 124149 33582 -30273 4376 13387 -37000 8099
17287 8099 -127720 -290641 -283193 -292573 -171944 -60034 -80832 -192939 -178851 -193054 -122520
17276 -122520 -10070 -179916 -171922 24026 5709 125166 106035 -17840 -133650 -192141
17266 -192141 -99145 -46199 -110981 -216669 -245807 -212758 -113793 -79244 18331 97716 100735
17255 100735 28785 35247 67734 -44680 -115699 -160317 -73224 -54247 144776 66913 161530
17244 161530 313254 355003 172840 22784 169114 8004 -83719 -89582 -53981 -134786 -153630
17233 -153630 -211730 -132076 12760 -48832 -256292 -277188 -182502 4733 92028 217260 214452
17222 214452 193381 67618 74835 140176 147534 68407 138470 171935 110607 83744 -10996 -71120
17210 -71120 32903 109959 97725 102194 216159 208366 103704 149042 109911 211917 42787
17199 42787 -87312 41529 -33431 8092 59529 -23586 46221 -75763 -154159 -53273 34388
17188 34388 4546 -42125 -63194 47351 211793 188622 35694 161119 225878 211346 245359
17177 245359 258389 85600 -152146 -329768 -284179 -130407 -2676 42459 114056 30331
17167 30331 -48902 -4656 -19812 13267 127300 138517 72330 181594 85617 -2800 187887
17156 187887 344001 -100071 -279594 -223304 -220897 -199639 -283849 -147532 -124314 -227232 -206532
17145 -206532 -103068 -3359 61342 190121 374309 330454 225587 40147 143972 157744
17135 157744 207173 191349 154766 117257 6452 52176 140188 247291 222817 108908 -15112
17124 -15112 105913 305093 276563 166908 38469 109536 124942 -51138 82446 61291
17114 61291 81387 27961 46823 153212 96670 99617 92758 65849 -71284 -206847 -277134
17103 -277134 -199628 -2558 79659 -61969 -221400 -262215 -167002 -88300 -187776 -154881 -295014
17092 -295014 -356535 -92998 49590 -13638 -26521 32862 289646 381844 276957 117231
17082 117231 -39630 -133426 -200962 -55024 84322 85108 160421 338416 402250 366328 85214
17071 85214 -85140 -135219 -152991 -31696 125944 151418 180384 88937 -198646 -114819 96222
17060 96222 -42514 -110382 -178053 -225895 -311304 -224924 -1327 22265 -50111 -185562 -42975
17049 -42975 -32703 -47851 52563 111408 266067 258679 134283 -1862 -4242 80389 148979
17038 148979 211767 150960 228751 141020 70695 77611 254248 199058 55131 -129417 -215816
17027 -215816 -271685 -167946 46978 111430 58788 77008 241048 250272 171227 130449 -126140
17016 -126140 -299885 -365441 -303359 -255935 -98919 26914 -25106 -122856 -95712 -207549 -227420
17005 -227420 -102118 -73461 -147398 -169829 -193064 -137629 -38361 38762 74183 41299 94840
16994 94840 -56880 -161404 -5032 149152 166657 204806 163842 112034 14428 -109704 -78589
16983 -78589 -77297 -102790 -137376 -58862 79693 145763 81268 143368 159170 80891 68602 46755
16971 46755 -22506 -2136 28225 131103 297890 123611 94961 215491 280881 253282 -46963
16960 -46963 -53458 139880 122589 131760 86687 -42161 -75783 4982 6619 86695 95966 -50835
16948 -50835 -193875 -228129 -77951 -25591 -218978 -259686 -345634 -244221 -245908 -176918 -25454
16937 -25454 95862 -7820 -219688 -213828 -170514 -255382 -306847 -393519 -328257 -251590 -273391
16926 -273391 -64491 57064 87323 101875 61178 43777 -28465 -108926 -47562 -240820 -174441
16915 -174441 -101824 -77321 -103789 -109841 -105493 -100568 -233690 -322274 -389724 -439375 -334123 -202280
16903 -202280 -3681 234971 201607 -9876 -110228 -112426 -181989 -97168 40936 -65866
16893 -65866 -110665 60815 49115 46752 74507 87306 116065 112152 64122 26162 -112996 -141554
16881 -141554 -212021 -188407 -236460 -142868 -86976 -170808 -159135 -16438 -12800 -79540 -200480
16870 -200480 -238974 -172481 -157581 -134549 -30690 -117860 -280602 -54531 88727 118666 208557
16859 208557 286890 190900 45001 -9898 28499 -19446 -74223 -12713 -128807 -212677 -198401
16848 -198401 62030 156369 201329 89853 -44703 -73899 -142145 -180982 -169793 71649 -48344
16837 -48344 -132701 -73440 -260515 -331160 -204506 -118510 -109809 -52875 142665 159973 128267
16826 128267 71818 9452 -208931 -314405 -212245 -204680 -119336 1944 -11399 17493 -18795
16815 -18795 -61071 -106941 -171981 -94337 62036 66530 95405 28324 126480 280917 93608
16804 93608 63661 -139984 -215460 -81140 -82616 5192 55034 74013 3665 187731 238782
16793 238782 113217 -10014 -69203 -56483 -133535 -18279 59957 132798 -4902 -156156
16783 -156156 -202034 -247460 -164614 -49717 128324 -21669 -62739 -90640 -64712 -129570 16452
16772 16452 115628 -22055 -33464 -2033 -50615 -155987 -171562 -228138 -312429 -229860 -97836
16761 -97836 -74846 22548 4261 15685 117615 99209 54439 1546 19893 -37470 -62139
16750 -62139 -194634 -140018 22958 114560 144569 91481 -17275 -163898 -277914 -240793 -213736
16739 -213736 -225841 -216073 -201545 -155691 -155480 -101289 -85749 -10865 41499 157298 129204 4590
16727 4590 -69552 -170255 -148810 -2426 173678 32472 -93895 -71653 -1697 225053 329005
16716 329005 313062 296376 206026 67481 266200 91324 -162123 -127200 17624 42151
16706 42151 10281 -95447 -23729 -29152 29079 194744 159378 56803 39667 45719 25373
16695 25373 35392 565 -82340 -51772 -85226 -177070 -253555 -337560 -337637 -300583 -201225 -16745
16683 -16745 152047 71902 44755 8697 -12235 -5813 -53803 -101288 -286183 -392514 -434006
16672 -434006 -291870 -121761 -44381 35966 212459 303168 112568 -143725 -250984 -282879
16662 -282879 -303112 -308948 -150199 -52774 -120630 -211487 -113289 62442 86462 14687 21576
16651 21576 -1848 -50398 23991 71614 94427 201615 121663 -111418 -227843 -229833 -77081
16640 -77081 -57605 -55876 -98500 -131778 -176620 -166176 66187 236704 207277 257174 345151
16629 345151 316753 153302 10699 -84157 -259884 -254964 -220206 6696 159311 96194 61658
16618 61658 30383 -68698 -206914 -122961 45849 10681 -15880 -183003 -306644 -264658 -224141
16607 -224141 10836 92377 132833 30314 -916 -37219 -131141 -139929 -124165 -136767 -13377
16596 -13377 -174685 -353515 -546430 -351148 -229103 -297661 -244750 -221836 -420587 -339672
16586 -339672 -258571 -76754 -143449 -215483 -129258 19858 -26749 -145465 -155186 -71766 -78711
16575 -78711 -290711 -306613 -254644 -290070 -385948 -495812 -587055 -548324 -537672 -336716 -235233
16564 -235233 -251808 -164904 -108298 -244911 -368967 -224574 -262810 -380171 -476520 -379151 -324551
16553 -324551 -448196 -407075 -288747 -471271 -577684 -431751 -334672 -326847 -180593 79745
16543 79745 122023 151627 140614 30955 4693 -23404 -50732 -142915 -111146 -72852 -61091
16532 -61091 15088 18683 35960 218735 201578 201933 274142 380901 424980 324701 204762
16521 204762 114952 -2481 46358 52769 30521 3490 -41780 5565 26400 -19899 -143534
16510 -143534 -158365 -141952 -114681 -245291 -197586 -49196 63051 180935 144987 120478 -60781
16499 -60781 -174887 -15775 151813 -10454 -129539 -156273 11337 57783 -36589 -210472
16489 -210472 -231654 -234469 -108469 -172803 -367722 -283465 -160630 -134491 -175001 -163098 -151935
16478 -151935 -245653 -249267 -174171 -202551 -131926 -59127 -54684 129688 352699 119393 -31530
16467 -31530 -133367 -214155 -188860 -75653 -18598 51571 -70597 -56110 -68362 -9020 -216087
16456 -216087 -344214 -234666 -116894 -168208 -205608 -126111 -148849 -103723 -155776 -164060 -82529
16445 -82529 113171 137413 66652 38071 -110629 -137691 -55609 -253129 -355282 -48616 143781
16434 143781 117333 27634 -6465 109676 135492 51820 134480 -86550 -87918 56648 41778
16423 41778 -159295 -164358 -131536 -176900 -179350 -113401 -226768 -289627 -301625 -291716 -226771 21698
16411 21698 11930 -62659 -156831 -188585 -176891 -345172 -432151 -454094 -285677 -94583 39823
16400 39823 132005 93136 82584 20178 171000 54408 42017 2079 49838 32684 80176
16389 80176 42402 -94008 -201032 -282792 -282711 -72863 -12998 -90816 -64965 -81358 -24517 15817
16377 15817 -41273 -20540 210880 268493 18435 -123296 -118029 -164882 -87725 150045 294815
16366 294815 278893 100939 -5331 18160 -44595 -118291 -311878 -219272 -244213 -210208 -108697
16355 -108697 6583 -22259 -142407 -250492 -227287 -195579 -125282 -165395 -213779 -211316 -56120
16344 -56120 38883 50427 42843 72677 183036 160891 49890 -53725 28131 -44700 -161740
16333 -161740 -85162 26336 92070 231761 178813 -106849 -182274 -160937 -233229 -274434 -207874
16322 -207874 -73761 -7121 -73294 -68660 -12938 -128895 -164031 -163010 -45540 2099 -12415
16311 -12415 -225785 -194110 -150322 -88544 -62660 -71004 -64692 -107715 -259025 -322233 -272723 -183884
16299 -183884 -154867 -181581 -34084 120636 125018 109119 90556 25115 -191376 -74813 17361
16288 17361 41073 222443 280916 215955 172924 144309 24106 -53948 -88935 -135623 -195026
16277 -195026 -173904 -132758 -150919 -148243 -106039 -16696 -233825 -308586 -235038 -92843 58274
16266 58274 -20435 -102170 -156042 -239831 -174481 -165823 -142199 -102295 -120768 -176813 -236113 -142804
16254 -142804 -112849 -71526 12368 17979 -24163 40631 95661 -54651 -63823 133800 121558
16243 121558 111181 64221 -33565 -21288 104303 100866 145994 135715 44088 38179 -68084
16232 -68084 -28808 122736 128385 122407 142767 165438 82134 -116256 -149212 -40676 35399
16221 35399 -83305 -223946 -138181 -194083 -272661 -200744 -133228 -29570 -126246 -234703 -337081
16210 -337081 -423863 -281442 -197156 -194136 -192729 -211783 -152621 -250900 -289509 -234344 7776
16199 7776 9761 -56946 -38770 12848 -140541 -203590 -212460 -203689 100773 214812 149233 24366
16187 24366 -2108 41498 -25276 -102119 -205995 -254371 -249340 -143019 -100175 39835 80648
16176 80648 140152 -10041 -130021 -195901 -20619 91151 186718 163485 -54209 -147987 -129879
16165 -129879 -62941 -88028 -94974 -44157 -59846 69030 -42723 -213905 -287128 -79547 -82916
16154 -82916 -151968 -134550 -137457 -101887 19463 40845 14867 -33144 -65696 -143777 -203478 -246877
16142 -246877 -166047 -44024 -1239 9270 191376 246651 141686 60241 70477 131830 170026
16131 170026 54332 -18098 -68486 -86395 -37800 32172 78371 124617 33149 -36367 -57197
16120 -57197 257640 128563 -122575 -299305 -211099 -51343 -129378 -151000 36265 48501
16110 48501 49982 -204054 -306722 -228307 -75167 -4376 -228582 -389946 -301179 -154778 -110140
16099 -110140 -117664 -58760 -114239 -339222 -381505 -334418 -210208 -73847 -70729 8193 46732
16088 46732 101405 225841 160582 -49486 47652 153433 144411 57813 -66091 -213884 -361478
16077 -361478 -338852 -97473 160969 159048 -26634 -218467 -84888 -23671 -31197 -91349 -104546
16066 -104546 -22802 40189 52701 60765 -26343 -213250 -325020 -325616 -307087 -269854 -324675 -296504
16054 -296504 -284550 -86749 5273 -124189 -171804 -103228 -129000 -301013 -372176 -324630 -219422
16043 -219422 -279208 -128770 142231 -21305 -89476 -11072 -238298 -182857 -73962 -110539
16033 -110539 -131252 -53935 81665 150723 134492 81587 -22095 -75395 -27713 -2478 -71241
16022 -71241 -28022 -157949 -356294 -231462 -48262 -93719 -144753 -154202 -301424 -218195 -93795
16011 -93795 -185926 -157320 -183176 -251605 -465104 -376666 -236521 -176707 -272321 -287812 -268713
16000 -268713 -169989 -201995 -129414 -29580 171738 195088 37906 -156371 -74397 -235808 -321651
15989 -321651 -126405 70738 22015 34572 14500 151596 198545 43058 -2478 141841
15979 141841 163777 207943 114054 -71365 -328817 -375893 -188199 -347832 -295924 -263461 -286060
15968 -286060 -263141 -219153 -184391 -210886 -177366 -146852 2002 -31079 -44309 28149 76016
15957 76016 81965 -31569 4377 13623 -43431 10453 134823 155724 252482 179085 168091 -1642
15945 -1642 -15030 129769 53989 99374 213718 222088 76697 32745 152043 332397 84140
15934 84140 -143159 -124679 20572 -30691 -89659 -1546 -28702 -81057 -128009 -226861 -167822
15923 -167822 -28061 82890 -5982 -195492 -46028 -148858 -223761 -126716 -88245 -3956
15913 -3956 3907 -246616 -370984 -143118 -89896 -88112 -149052 -33497 -85173 -224895 -96269
15902 -96269 230743 408369 329036 200321 175063 81766 -78348 -125742 -219831 -194917 -145410
15891 -145410 -9429 -167427 -306217 -139733 -141232 -243123 -206751 -205612 -74930 48480
15881 48480 -14104 -22368 -35020 -120000 -84160 126466 148751 45159 -87069 -32774 -97918
15870 -97918 -64152 -77034 -105541 -44977 -27266 -13082 -52728 -29368 -11807 -55533 -62706 29124
15858 29124 108995 122362 -54023 -89202 -77709 -223594 -301994 -253445 -96519 -41590 -90836
15847 -90836 -245059 -306694 -122697 -51892 -38021 -109380 -11020 -83286 -144974 -12020 -68736
15836 -68736 -146106 -192459 -102854 4278 126237 129883 58788 -48510 -123129 -147369 -219829
15825 -219829 -100629 -163634 -314052 -236810 -71168 -39962 -89837 52191 148427 42322
15815 42322 -135318 -82221 -170886 -252453 -267060 -244728 -291346 -158626 30129 50408 -67392
15804 -67392 -153082 65724 -4717 -49057 -146076 -151846 51535 -13030 -104548 -192270 -249284
15793 -249284 -285995 -380788 -349847 -145618 -33658 -99703 -47464 -79370 -106274 3003 53912
15782 53912 -20072 -73696 22544 -10962 -46944 16341 -52094 -115842 -114857 -122627 -168456 -295872
15770 -295872 -199983 -13351 -70672 -130962 -24247 -41387 -53932 17695 -27683 -78390 3258
15759 3258 131562 144629 67801 30370 -70848 -190491 -290153 -317650 -173607 85440 95696
15748 95696 -41461 -37758 116014 195530 -9130 -134255 12342 -14541 -185754 -141387 -11029
15737 -11029 170517 178520 83176 -97686 -96435 -186742 -118877 98500 -33176 -245868 -265548
15726 -265548 -160936 -174685 -211585 -206207 -199730 -288239 -310554 -236905 -173986 -188297 -135122 235
15714 235 137959 80000 -82877 -212071 -216699 -80043 -7732 58311 165851 113895 167479
15703 167479 39122 -12118 75753 70154 -41199 34996 96924 21845 -159193 -51309 65789
15692 65789 127891 59456 115866 234456 274643 157849 169609 91974 -105516 -43918 26030
15681 26030 45026 -26808 -214745 -140641 -64921 20315 74261 -9931 -188702 -332457 -349399
15670 -349399 27975 159804 11708 70419 156559 203916 130250 -38462 -25923 -75384 -138335
15659 -138335 -125890 -51107 -53637 -73355 -124209 -154283 -16631 -94246 -60831 76839 162701
15648 162701 27714 -174308 -207175 -77075 -85448 15360 -17466 981 -1822 -8271 -128672
15637 -128672 -242832 -76578 -51926 -51011 -7658 164314 353564 304173 276209 124617 258441
15626 258441 147818 20236 143707 239407 219670 375040 400494 413320 118016 97572
15616 97572 71970 -56863 3051 -113268 -180822 -25420 95776 162458 163796 -3161 -36384
15605 -36384 -74872 -159462 -180235 -16734 255420 107280 53445 58066 129700 105231 68464
15594 68464 246077 223873 146135 182050 83106 29460 -290902 -331986 -294376 -245188 -103187
15583 -103187 -19482 26033 143259 59049 15854 57961 44979 30036 157524 37675 -48039
15572 -48039 87034 136413 184254 114761 83526 198539 219627 125639 220280 223214 214254 66050
15560 66050 -73143 -104049 -151620 -52755 62790 23052 24348 -98952 -249156 -367301 -258114
15549 -258114 -233671 -292961 -168753 -7405 -169671 -211857 -217271 -208976 -124131 95408 -146206
15538 -146206 -294921 -365195 -311626 -116563 -104356 -60929 -48218 67133 160559 -157734 -287317
15527 -287317 -311909 -326887 -285256 -97804 -32546 25295 -9634 -221912 -187419 23387 49015
15516 49015 -75284 -232971 -237394 -41039 2942 62592 262146 306720 361484 249210 74869
15505 74869 -8736 26558 57842 -68286 102775 174405 216120 162197 -18155 -134866 -28922
15494 -28922 35430 -14267 -43942 -51535 4422 66366 37489 41393 -1151 -1442 32572 116740
15482 116740 67371 108058 115566 233845 127269 -76583 -152997 -330067 -199564 -27915
15472 -27915 -31446 92071 728 -338844 -221875 -211649 -154542 -54054 -108091 -166703 -98488
15461 -98488 2775 -38031 12119 24172 -129503 -235500 -204492 -11640 109664 -45488
15451 -45488 26650 49100 42329 -45989 -11967 177625 176885 246295 267155 190308 -33990 -57519
15439 -57519 107170 259499 232494 339002 172307 25348 -50658 -57341 -51557 -100139 38402
15428 38402 -30531 -29781 2205 -81660 -122900 -80686 -55603 47634 132520 75038 64698 -41338
15416 -41338 -49558 -177489 -266653 -179698 -288639 -265053 -140111 2810 -65592 -101601 -27949
15405 -27949 28040 -103434 -75931 -43565 -54382 115480 194373 161262 -54351 -90802 -215021
15394 -215021 -379598 -312274 -152838 -45641 62537 47135 171071 290661 252905 199117
15384 199117 105584 65009 128767 145791 212086 129754 45646 -24274 71015 125521 27546
15373 27546 180587 197551 30253 -257006 -281409 -267228 -209324 -99730 179696 250674 139776
15362 139776 85923 6065 108184 -5822 -24130 -137478 -65137 34488 -111628 -214933
15352 -214933 -139026 -106195 -239185 -377852 -239290 -213615 -187636 -361417 -199329 -23226
15342 -23226 -118156 -145281 -138913 -60993 -154078 -230031 -10484 55669 -173847 -304910 -133055
15331 -133055 -70761 -162604 -225883 -310965 -326021 -122216 -88109 -160158 -116925 -8768 7125
15320 7125 -161105 -265019 -257502 -254065 -105472 30815 -23194 -31711 44502 48727 70530 162181
15308 162181 169453 101042 -48152 -261233 -371048 -362490 -339610 -118640 10926 34374 -259444
15297 -259444 -322276 -53427 -25340 -64117 -409679 -428951 -320754 -363617 -383403 -270366 -310698
15286 -310698 -253017 -172162 -197740 -291391 -120282 -199623 -124375 110445 251815 109711 -23918
15275 -23918 -55420 6221 42130 -25876 -89321 -42100 -32020 -208710 -175800 -229135 -325389
15264 -325389 -281607 -151830 18398 34510 -42032 -121570 -57764 -79276 -82364 68487 -72868
15253 -72868 -140132 -94657 -93710 -164643 -23032 23757 -26484 -42029 65360 83720 -50775
15242 -50775 -82646 -194760 -33512 79262 -71791 -65295 -174706 -222473 -325662 -353306 -176089
15231 -176089 289 10635 -125161 -90282 -62391 -44284 -52407 -78719 129449 178897 278521
15220 278521 291355 287318 182012 174469 102523 -58824 -231567 -104867 -98093 -80014 53090
15209 53090 -9721 -104506 -67723 116631 162668 241205 206558 70750 -8551 -36991 158448
15198 158448 296800 199658 112491 155965 229998 188360 151954 231190 168752 209921 222335
15187 222335 224867 -61821 -82077 -279805 -281665 -169533 -125365 -41139 8341 41889 -31463
15176 -31463 59461 136367 135635 94834 -100669 -88866 49331 103799 72601 65217 -11841 -35447
15164 -35447 -34125 -23444 -151946 -36804 -234039 -173961 -194782 -294139 -256234 -25177 116706
15153 116706 51232 60486 147234 33975 -71920 -293644 -365787 -242639 -240849 -375111 -384436
15142 -384436 -153024 63422 77725 -5672 -76202 -16423 -50948 -182608 -76862 90374
15132 90374 181105 194968 210101 123036 189736 298753 199816 97311 282732 267266 -54433
15121 -54433 -46229 -27051 -34116 -53653 -52257 99042 122910 89716 115999 228053 187634 171513
15109 171513 227840 290611 130669 18009 -68830 -58370 -142497 -77461 -33502 -51975 67189
15098 67189 94637 29901 172475 105427 -28367 -134797 -78627 -11994 51691 18394 94725
15087 94725 93512 96338 111567 57867 -76037 -35157 -122653 -102994 129091 254703 234401
15076 234401 187040 341586 322781 148386 78117 39553 84071 84044 65831 177781 181308 88614
15064 88614 -148904 -97321 -108052 -243077 -276160 -166988 59799 131742 118871 106066 170722
15053 170722 81949 78217 195526 192426 226253 187112 161278 294442 255993 169423 128759
15042 128759 181331 85097 68733 46200 -44842 -50347 -3701 -150655 -252278 -272274 -96850
15031 -96850 -128320 68681 93056 -32721 -37223 5966 3528 -24444 -98834 -203119 -285085
15020 -285085 -232465 -43283 33353 77977 162105 1941 -157628 -119151 -108027 -39270 157545
15009 157545 168310 5762 -150467 -120656 49636 89206 29864 -102811 -166217 -106500 -46153
14998 -46153 -90326 -107522 -178113 -146684 -160025 -203748 -124758 -61714 -49390 -5510 -10907 81591
14986 81591 87033 -3435 -71606 99350 231085 237200 164202 94526 116603 97542 133905 151492
14974 151492 74229 -68876 -67954 10564 -42879 -12474 -26196 43302 66444 42376 172468
14963 172468 258873 161992 -50500 -132484 -86278 -78362 -107914 -34594 142189 274771 196159
14952 196159 179188 80384 68201 106643 73748 56427 127994 229227 39653 -161489 -194922
14941 -194922 -124146 -245791 -165013 -78776 75763 141666 136325 -951 21024 -12142 -84433
14930 -84433 -61265 -93664 -57362 -238554 -353092 -168787 -55505 -77717 -110655 -263625 -162307
14919 -162307 12278 87 -50400 20622 -115154 -39568 -12608 -168501 -285907 -343044 -279145
14908 -279145 -146474 -25497 -39636 -85639 -50525 -108302 -188723 -153106 -126055 -108679 -64611
14897 -64611 -94590 -253518 -380644 -373547 -134396 -148234 -109571 -19211 91521 208884 169403
14886 169403 43661 -67586 31493 9223 71885 -84 35241 84788 3949 -40444 -12412
14875 -12412 -33892 57847 147239 -49663 -83859 49295 196503 188130 128413 133924 7536
14864 7536 -79906 -120567 -51402 -61271 -67421 -175924 -348031 -393928 -5722 138057 67086
14853 67086 34360 -58959 -180253 -79942 113118 114965 158236 158934 -32831 67512 233822
14842 233822 332952 149398 22893 161723 134835 143390 80709 62019 151928 271787 325977
14831 325977 408794 297835 58709 -93414 9262 36606 123111 59299 -112951 -233098
14821 -233098 -310862 -403632 -402430 -178239 -12934 -11471 -12023 -84551 -74412 -108359 -146539 -7254
14809 -7254 -32370 -66264 33631 94013 93038 219818 66985 30972 -69009 14325 36190 24190
14797 24190 80634 158634 163603 120852 2752 -84718 -99963 -72684 -102733 11194 66121
14786 66121 55668 -13591 124192 168612 -18133 -103397 -103072 10775 112964 90998 -21148
14775 -21148 -144295 -207001 -241872 -138328 -194391 -132509 -1342 198915 172576 53267 -71331
14764 -71331 -26248 -76450 46260 62627 8018 -224189 -313391 -271561 -148784 -273422 -494097
14753 -494097 -331335 -216751 66456 230855 107367 -92609 -253942 -355934 -322176 -106812
14743 -106812 33193 9278 -119040 -238848 -341959 -444568 -444511 -375620 -145949 -93667 -165139
14732 -165139 21555 26826 141534 86400 26558 91005 45268 5454 96188 89588 17017
14721 17017 95631 50250 -16027 -226558 -113428 24478 61899 28734 -35900 108379 219905
14710 219905 157083 -8497 -87269 -277713 -234429 18022 23472 -26273 7370 -54183 -80234
14699 -80234 -89964 -56271 -13484 78537 339962 416162 406719 365892 249967 174688 302246
14688 302246 252419 80344 5166 -59428 -239800 -198753 -36867 136156 185237 92430 81704
14677 81704 -6831 6603 160145 272803 287939 86474 214576 135212 82870 45491 89734
14666 89734 150386 53368 -125963 -109927 -143173 -21605 -33881 -63825 -159836 -287843 -119671
14655 -119671 -11557 -86553 -18077 58383 -26135 -67806 72333 218452 8771 -37073 18331
14644 18331 -20468 -73507 80467 131222 40220 -38167 13080 56470 87985 54289 279985
14633 279985 283883 218207 181728 190233 274790 315846 116951 58397 -5129 13878 186799
14622 186799 159162 2130 -15763 23897 83670 48010 45649 74629 32094 155984 147679
14611 147679 61776 -120963 81452 28659 -112341 -48482 48653 116308 223967 99564
14601 99564 -50315 -96323 -62727 -161949 -185242 -247063 -129309 -83031 -79241 -64626 -96389
14590 -96389 -150550 -53539 204597 324122 244919 226034 117030 189998 142571 3996 -104162
14579 -104162 -292748 -249566 40607 143900 119860 201124 151979 63619 33893 106053 -83412
14568 -83412 -318106 -381255 -281706 -97739 60605 94270 183424 21137 -169372 -356465
14558 -356465 -315537 -119611 -13004 -44404 45676 60100 117710 22448 -77996 -145696 -213079
14547 -213079 -284809 -364411 -366244 -323654 -65125 271028 314187 291540 19579 111480 179200
14536 179200 216507 196544 158246 127318 209185 227589 222820 326017 165550 -29535 57366
14525 57366 199650 268517 118308 1610 -64231 47631 132534 172998 177459 232446 181602
14514 181602 60098 -12096 55215 -15464 -46245 11455 165138 157534 -4139 -195001 -110632
14503 -110632 -38854 160225 166971 104896 70449 10076 -198686 -121080 4399 -80993 -112215
14492 -112215 -23841 134522 215211 207258 151100 126879 74856 95456 -43639 -18396 -2782
14481 -2782 106648 155200 52114 80185 172782 167350 217496 257155 270756 174769 126971 2225
14469 2225 22345 232198 199349 334809 397951 378071 474648 309010 130770 35495 -24402
14458 -24402 -128876 -239241 -228575 -20919 -16681 46452 39085 81967 77367 142876 261746
14447 261746 242975 102443 -143802 -25614 50130 -531 143480 31638 -70686 -11371
14437 -11371 13329 40309 110753 242062 210627 310682 310231 127236 825 105861 145142
14426 145142 89616 -90819 -100563 -120366 -242284 -202357 -104101 -44364 35543 56186 -52079
14415 -52079 -233417 -90782 -51593 -155838 48990 -16234 -36096 23260 31866 -14987 74145
14404 74145 43752 -41348 -106177 -77157 29361 -22796 -70948 -45756 -123354 -204127 21512
14393 21512 167140 75307 -69803 -100572 -2639 11875 -102017 -103999 -153665 -139362 -205836
14382 -205836 -270357 43597 3477 -63365 5418 -7003 9867 -48906 -142036 -119411 -161161
14371 -161161 -239901 -144735 52101 25603 5966 -19591 84592 51117 -41604 -47754 -20575
14360 -20575 -87233 -179606 -240668 -269311 -429961 -245877 -79346 -221447 -270469 -312000 -184848
14349 -184848 -72324 81154 112364 -92641 -47148 -127890 -157847 -13672 126694 188588
14339 188588 274192 97052 116108 100577 43350 -29367 106459 284104 178112 47399
14329 47399 -115941 -92593 -48971 -112239 -139859 -47590 123812 189629 89848 17414 15038
14318 15038 -46112 -44153 1807 -104978 3221 132276 70142 -15124 119782 47835 -41146
14307 -41146 160856 252121 165377 -34531 -158946 -133751 -53532 29472 10526 13507 -22437
14296 -22437 -77522 38073 19908 40845 208732 173567 19329 -94732 -132006 105303 226986
14285 226986 280139 355601 483199 273245 240193 411820 493419 618783 650372 531950
14275 531950 345846 186368 87227 19949 112323 61557 118890 289095 293962 282106 256782
14264 256782 231882 171758 -33924 -43358 43125 47729 -42627 30202 -153002 -202293 -122386
14253 -122386 -217461 -249277 -125562 -231177 -226509 -191466 -92002 70701 148833 -24018 -51232
14242 -51232 85598 87338 -63205 -86871 40027 2374 21708 43143 8441 34653 -17008
14231 -17008 -142651 -43067 13475 87353 49461 76869 -19536 -49967 -64133 -46184 -68894
14220 -68894 -178052 -173739 -250834 -326403 -200979 -191247 -212458 -91770 108575 226116 37223
14209 37223 -237294 -169780 16424 150910 156397 182306 227045 -71963 -341880 -338705 -143159
14198 -143159 2612 25939 -85468 198630 378097 442527 328123 332907 232579 23765
14188 23765 -28716 137589 145815 65261 48189 13375 -235911 -272327 -76117 89034 -4862
14177 -4862 69269 238475 229155 119081 114463 145537 111934 120607 129272 -67186 -164012 -102356
14165 -102356 111729 49702 116265 164401 145647 -14847 -94611 -80982 -87356 -72309 196860
14154 196860 251731 118490 23789 -42165 13581 28177 101043 290701 489371 509644 425924
14143 425924 135468 314603 633154 479978 376764 388825 324118 390873 413438 319943
14133 319943 438768 497940 451493 399842 337963 210052 266314 321681 245053 300462 365419
14122 365419 200919 398113 464613 601123 702595 748865 673952 544254 634025 593021
14112 593021 639978 817721 875561 836065 858476 906094 917201 1012834 1110450 1062978 988117
14101 988117 1081312 1243159 1391451 1272628 1137751 1144760 1256381 1220562 1121061 941908
14091 941908 1102693 1207347 1137903 1179243 1263106 1225224 1136540 1098656 1067168 1220774 1179250
14080 1179250 1082508 1114592 1229821 1268643 1130288 1067201 1162341 1136729 1291707 1369712 1320740
14069 1320740 1225407 1195080 1139258 1186232 1226342 1101116 1010148 1051416 982324 809632 855307
14058 855307 934440 856687 884475 789820 764718 797464 641693 709928 693508 662894 485136
14047 485136 361913 203566 381500 373874 334942 426313 399614 359995 342021 460533 434123
14036 434123 455738 671698 551638 267925 71436 90496 260300 305464 117493 69346
14026 69346 69868 160742 225298 290385 355762 649183 594754 314724 313498 291201 47354 490
14014 490 -11057 -15990 35991 7633 42047 152923 304587 362791 437472 254927 270091 438230
14002 438230 247264 103195 32395 4584 -46644 112923 112118 99531 64330 283721 289881
13991 289881 305478 391834 388333 269766 315278 287988 260714 243907 189767 191544 336232
13980 336232 273451 438706 467896 388884 109730 25784 273470 379039 313489 305965 295653
13969 295653 208249 211280 118549 106392 47580 -113292 -179432 -159931 30397 82153 73332
13958 73332 21768 126030 178316 67358 -9061 -35651 -12620 -34163 46474 89393 180419
13947 180419 304687 291342 259165 75516 -22571 -34283 65964 45576 -38947 -173073 -164035
13936 -164035 43508 241903 123229 237156 177033 47692 99868 123749 189010 56834
13926 56834 14347 -31700 39886 -75826 -101149 -54206 7687 43056 45359 134564 257074
13915 257074 239608 210935 66931 40754 80215 37939 109036 10898 24755 -87732 -155831
13904 -155831 -58880 233388 327889 207779 166285 200523 248204 252882 128739 262970 232251
13893 232251 276571 245544 239129 227419 102010 48765 44192 201844 329068 364530 98683
13882 98683 137894 104748 134671 231916 231903 338659 435196 308985 174356 -1244 22667
13871 22667 -34697 61015 8373 87734 223870 290556 338428 412529 343464 200627 167521
13860 167521 149208 93991 -36888 26417 112019 136005 -41876 -46141 -12237 106351 43130
13849 43130 108232 218336 206615 232865 78131 23599 80727 128167 267303 249872 228961
13838 228961 133951 -55956 -58516 173961 350680 509500 527991 419522 292613 337917
13828 337917 283297 104922 238134 406611 411641 206762 -31256 -52287 1163 751 131690
13817 131690 207624 150059 71988 -2445 4313 -94264 43956 163269 221505 194275 -15595
13806 -15595 53842 -4749 23916 106674 126394 168903 334133 383385 461195 540198 398054
13795 398054 434899 596885 437454 194866 -35835 -52744 -58449 -1499 22367 -1191 -16584
13784 -16584 121797 270435 200383 132477 1897 -248545 10672 -10250 -44411 7287 137350
13773 137350 298543 319438 177425 15062 -5416 200081 319153 235537 264275 157676
13763 157676 77241 2045 97084 211976 369428 320870 301311 177085 -130897 -297684
13753 -297684 -169530 24377 111746 73593 342706 329567 209899 103928 82695 -120707
13743 -120707 -205184 -117866 -85717 67392 254673 294942 184417 4970 -42631 -24556 26140
13732 26140 92499 6998 -106676 -88121 -114522 -224856 -234527 -169268 -161760 -46547 148354
13721 148354 165361 83614 23110 30775 -13209 -61732 -42347 -110350 -204219 -254874 -102387
13710 -102387 156393 168367 52347 106761 185671 -3342 -162138 -176576 -189396 -214228 -236579
13699 -236579 -249001 -149842 -120899 -265605 -277274 -232183 -86834 -57196 -107206 4614 27951
13688 27951 107498 50443 -5882 -63514 -170998 -268598 -234933 -106186 -197379 -153546 -7748
13677 -7748 58847 57925 70943 128640 158316 147607 225872 207919 181073 168169 148696 242968
13665 242968 322939 199344 217186 201957 218789 240883 180050 125370 115719 77917 13312
13654 13312 -69002 92904 70288 45183 11794 63900 15244 36498 99427 61296 -50881
13643 -50881 -3125 105119 160425 338076 413346 423751 463527 217158 145790 134451 41197
13632 41197 12031 -44323 25700 174866 129356 235175 349928 291766 170159 71919 117760
13621 117760 183058 162596 108276 94624 29186 -18627 8494 126665 248677 209862 -8263
13610 -8263 -126445 38257 72247 -92292 -137606 16969 157283 37309 32450 94917 281742
13599 281742 433335 393386 290549 98340 -126173 -88329 4248 92119 288778 106151
13589 106151 -37773 -84800 133642 92317 -13179 -99555 -135279 -122116 -56718 -205572 -304885
13578 -304885 -140487 18259 104821 17743 5587 240874 356599 384441 346367 76366
13568 76366 31803 26801 126737 -116749 -351657 -315054 -60924 9025 79541 201365 105204
13557 105204 20695 186677 268645 254972 261195 179296 163406 223775 118987 168422 286094
13546 286094 281866 193944 140985 138441 217688 324580 287051 227204 302644 274188 312688 324394
13534 324394 284526 203277 8551 88712 279966 268422 108336 110348 251148 383180 317238
13523 317238 368233 468344 438169 340731 431203 299681 170801 188420 231105 -25746 -130885
13512 -130885 -131502 -14639 -2392 5118 -24310 7268 72371 -90755 -123117 52668 199868
13501 199868 185076 5505 -18039 27507 5749 -117158 -175318 -18370 40808 -69968 -153107
13490 -153107 -124567 10538 170850 293718 221477 62193 117200 205061 197085 311656 420079
13479 420079 344297 73987 -20723 24796 48204 50414 24283 27454 52106 79640 200724
13468 200724 77582 81949 87271 23166 -79286 -303346 -294223 -196117 -25388 138832 142265
13457 142265 16762 -114637 -60341 47084 161537 172265 142932 65826 207726 200224 133847
13446 133847 43308 -110699 -221680 -397074 -242126 79310 59886 -199067 -47650 86859
13436 86859 100241 264968 594123 601686 423785 302014 142665 249728 266962 217887 250549
13425 250549 100303 -4285 37086 -7354 -140698 -230996 -84512 38447 -62571 -229788
13415 -229788 -185704 -66042 94325 46350 -10505 -175432 -59683 -35992 -27921 -68307 89591
13404 89591 166657 316535 148820 72663 112117 -29617 -21176 236531 358034 358171 386090
13393 386090 424354 203092 141373 52305 22100 -67734 -30329 55288 7311 -233043 -335890
13382 -335890 -240418 -240400 -150461 -100222 117146 310652 385441 426512 402483 362765 280458 225552
13370 225552 101906 -10155 -42331 -60509 -129077 -49239 62777 -9660 62457 71165 65244
13359 65244 -48968 -32994 41982 -49235 -74550 -99642 23893 179196 170477 381600 473794
13348 473794 423460 462122 335510 224622 309522 414977 335102 226119 215408 465794
13338 465794 326031 101385 117542 367039 337087 263183 126635 17448 23438 -53225 -171761
13327 -171761 -173516 -99439 -67292 -32839 47478 140550 186010 19735 -33613 -75595 -20073
13316 -20073 -139271 -243181 -147575 -101458 10602 156261 356681 289960 52131 -112312
13306 -112312 -51636 60694 215758 229037 169971 67478 -3713 -239372 -149189 -84677 -34753
13295 -34753 -12331 -52738 -155630 -90509 -10856 57394 84905 -88241 -26716 101640 187550
13284 187550 89867 -77087 -47754 -46238 30182 175516 209986 213586 186754 142949 165291
13273 165291 109259 143458 107408 24611 181260 284985 204183 54912 19076 184606 184047
13262 184047 192272 217296 267362 108414 -39868 -163552 -190459 -74548 7413 12175 104033
13251 104033 -117942 -300826 -120273 -36756 56948 61839 119768 28629 91871 90678 33982
13240 33982 42414 244879 236315 221825 108012 14297 33719 34358 -224174 -270433 -73207 -37240
13228 -37240 153672 238997 -20038 -183116 8560 128493 51876 23873 101533 137196 141306
13217 141306 203107 117568 217550 243194 297999 302930 341984 295868 232205 209360 111900 95729
13205 95729 50354 -105755 -164400 -66128 -224200 -298874 -149547 27094 131663 148373 235615
13194 235615 122896 -69342 -183562 -150617 -114459 -3366 83361 28126 -100369 -131803
13184 -131803 27660 81691 -94757 160107 306160 386191 408515 114655 -60746 39362
13174 39362 92129 -57670 -90035 -6634 85349 145116 328811 351671 137751 58254 218580
13163 218580 298693 251769 147465 173995 47049 36924 -78878 -45491 -27749 83241 232008
13152 232008 302310 198972 117820 193033 317921 198893 112949 347480 353238 245144 257438
13141 257438 99387 -6639 -157547 11538 172613 278222 397664 262825 168236 123740
13131 123740 138700 240195 280897 203361 260223 107322 15391 217106 372545 250730
13121 250730 18949 57305 164524 47123 205348 283992 167899 155252 73133 -112284
13111 -112284 -209524 -230111 -210957 -62569 7042 278956 241721 130932 116872 12322 15571
13100 15571 150651 229834 73271 136339 110987 170408 191843 167927 -45337 23881 127932
13089 127932 234295 245564 88308 75188 106200 174130 331641 306687 217971 56761 47702
13078 47702 186473 138612 -139682 -90274 12025 -139674 -151522 50256 -66131 -33047
13068 -33047 9554 -56235 45580 38922 87280 312630 199202 283827 433610 449357 272012
13057 272012 154389 175248 106775 232822 208159 46123 22806 141435 88702 15435 116650
13046 116650 267958 323703 243885 273640 355455 229130 144625 296381 501342 318252
13036 318252 118270 85227 106754 131220 153741 53709 90697 167980 324991 306341 356590
13025 356590 401822 407020 427354 442285 473945 572797 661393 296764 -37400 -136429 -159061
13014 -159061 6733 85580 809 -19159 182354 243627 79471 187455 148144 133717 130504
13003 130504 210309 144011 -108679 -81987 136724 119589 161513 179327 72061 -24125 63315
12992 63315 215042 160518 188791 154399 264980 419355 290880 192002 143334 34996 -67214
12981 -67214 -225506 -245500 -160163 23464 -72167 8839 89899 196114 279715 246836 373924
12970 373924 174639 173257 234853 276227 164793 -1969 158 178482 181896 176028 164766
12959 164766 53432 -4773 81704 52739 103236 190816 223879 339108 464631 494536 399415
12948 399415 295377 304038 324218 292659 357768 379460 545340 524507 355424 230207 125092
12937 125092 185577 304992 220486 106781 130732 204209 233254 85352 48854 62890 44293
12926 44293 116263 159844 66361 147930 409990 337330 376067 357411 255930 314392 309145
12915 309145 233700 219806 309774 183446 -1522 65659 56234 72446 106592 224579 266737
12904 266737 112438 100110 238779 265351 231282 186616 135107 97409 185478 99217 155272
12893 155272 196754 131079 174608 344783 469665 358764 384327 381654 412941 359448 363248
12882 363248 380167 343875 226377 105488 167002 227521 273466 188125 187681 152451 232713
12871 232713 367385 379399 224188 165107 97191 13395 -4346 65011 61705 149092 129621
12860 129621 280493 440159 367915 180735 182388 206791 160334 188719 235987 144557 204830
12849 204830 352092 275746 140710 94930 279463 488149 556003 396919 208433 365434
12839 365434 482880 469432 452582 415929 495517 723103 905560 951256 756332 947859
12829 947859 1507575 1905586 2233687 2580789 2991218 3237593 3115294 2973776 2841346 2443122
12819 2443122 2056322 1787310 1580633 1361106 1191128 1166060 860508 766489 821713 600059
12809 600059 467753 545252 604674 541528 303128 363218 473752 440661 620686 637969 746180
12798 746180 777878 660064 611452 608466 606901 590598 567594 491749 493246 486329 261639 155473
12786 155473 108099 150940 110726 110987 127312 -140199 -32237 35935 50683 42495 84683 140594
12774 140594 176782 266616 393641 377403 452349 367706 367641 340327 264461 343874 271064 129884
12762 129884 253785 360810 281735 276756 368113 283063 117192 261921 174689 265592 509393
12751 509393 339110 217707 335227 319613 265596 341083 331964 330173 279507 174455 264124
12740 264124 315148 368018 226448 276761 443134 224397 133981 250017 406390 593547
12730 593547 505518 487350 644392 678708 705343 631270 627999 539690 444852 375579 386636
12719 386636 258557 305117 343381 386658 351325 373737 358924 309922 281448 168589 237232
12708 237232 358625 400210 228405 189626 193081 140060 324639 404867 306898 299086 233187
12697 233187 283164 260421 200528 307820 354330 328900 203085 200055 247136 295897 272082
12686 272082 425048 683107 679911 656538 566982 431465 419663 464239 479817 380542 349472
12675 349472 332226 356414 310101 267160 294814 286254 279698 223124 198610 253256 150210 146550
12663 146550 162832 128237 231963 444993 565511 562199 412384 293635 429633 371058
12653 371058 299186 329322 394741 409416 262988 357053 435817 558483 487371 354643 227750
12642 227750 189112 175170 245746 354595 394485 445392 578223 547891 621338 669885 580762
12631 580762 521809 500919 372106 346298 256860 239484 260004 373167 441145 534954 524124
12620 524124 463687 384285 495023 603757 487219 363090 266587 398393 547368 691065
12610 691065 848331 841724 627077 671440 736384 556871 489346 740294 791789 766734 822260
12599 822260 654357 640342 476024 292329 351789 501882 571300 648077 747840 645643
12589 645643 402643 346093 438929 559415 495504 684173 655860 521232 407068 209267
12579 209267 221460 310434 387096 458001 508229 380007 319127 436222 437934 650670 698569
12568 698569 646426 655811 815943 962391 1018355 925573 937340 1031422 1018436 1010106 974255
12557 974255 857774 785488 786913 828670 648402 614434 673429 758181 683627 665729 634766
12546 634766 561218 608944 490274 506220 535602 497166 386448 341602 519441 666268 667648
12535 667648 837787 1021445 1043006 1160935 1178119 1254373 1382063 1497761 1600995 1647634
12525 1647634 1619070 1403259 1312558 1255146 1310126 1310491 978581 927645 1043187 1065830 950655
12514 950655 966372 838067 780455 675180 604325 583776 721999 627412 612955 673192 722347
12503 722347 703000 689319 595722 846874 1036363 1175128 1025289 975474 1056187 1129425 1372264
12492 1372264 1479666 1314754 1394816 1591085 1625108 1718109 1609876 1320380 1227423 1162318
12482 1162318 1050897 803876 800147 823268 815781 808536 786111 889222 983590 872802 770877
12471 770877 848026 913872 958426 789765 777946 880419 910982 846735 648909 567823 785785
12460 785785 820580 705584 803773 942556 1142741 1111797 1021370 1040739 1114646 1150643 1262356
12449 1262356 1248830 1163416 1155398 1204679 1155538 1173564 1137971 1088178 967855 968284 1060383 1154933
12437 1154933 1191390 1131394 992368 927342 913590 944099 958190 952960 948527 971437 1013552
12426 1013552 1034241 1017127 1096377 1146197 1060748 991494 1085128 969702 837894 862636 970014
12415 970014 1065771 1028011 984205 1035564 1034043 1034965 964030 913614 1090316 1081551 919612 962699
12403 962699 1061992 844714 813561 882379 1037720 1214051 1228757 1156473 1184765 1198504 1326414
12392 1326414 1431579 1292652 1053952 934296 794862 696335 854871 770906 837122 1087856
12382 1087856 1140316 1116923 995823 924564 858651 1023636 1080931 965155 913997 883622 1002965
12371 1002965 976950 1009652 1021666 1161888 1085139 1031328 1024334 996982 1114387 1239021 1310622
12360 1310622 1322521 1290836 1153598 1195262 1209414 1109181 1060962 1126142 1142698 1110210 1077870
12349 1077870 1166284 1245185 1206323 1288938 1350957 1272888 1151200 1294553 1428338 1516312 1413697
12338 1413697 1259516 1190909 1217413 1278811 1227704 1236059 1305817 1409915 1440117 1528316 1600796
12327 1600796 1604610 1666944 1643901 1459647 1340729 1372098 1318333 1338246 1516770 1592532 1496425
12316 1496425 1508643 1430233 1399039 1453845 1489350 1447956 1492556 1624044 1609495 1440267 1566708
12305 1566708 1716643 1753044 1706670 1794728 1788916 1684255 1629420 1671367 1708832 1640547 1642788
12294 1642788 1890696 1900134 1895230 2011132 2061283 1934762 1870778 1926772 1918535 1995379 2053463
12283 2053463 2011115 1935350 1898699 1886402 1781358 1867311 1908939 1862503 2075870 2110978 2095669
12272 2095669 2061790 2203549 2179353 2068903 2100103 2081554 2029255 1988648 1948338 1967006 2052639
12261 2052639 1995990 2064941 2155067 1925910 1926496 2018373 1985917 2017897 2249487 2324220 2333750
12250 2333750 2315290 2244942 2135462 2213441 2186996 2256125 2361601 2427221 2382888 2206397 2157172
12239 2157172 2175201 2215856 2264828 2306110 2322500 2423600 2512518 2442336 2399221 2449243 2572142
12228 2572142 2646064 2516997 2394548 2580658 2689353 2690590 2984655 3021244 2893537 2843330
12218 2843330 2805261 2813548 2664357 2620374 2738048 2670804 2741881 2702259 2583819 2542476 2611512
12207 2611512 2680765 2698920 2791968 2947577 3020510 2951301 3001014 3164934 3228187 3276373 3236507
12196 3236507 3011637 3097676 3396895 3340224 3254542 3284037 3300138 3377745 3387327 3410402 3562324
12185 3562324 3711547 3697947 3637646 3696402 3660617 3672742 3660074 3697842 3752896 3750595 3784004
12174 3784004 3913795 4023136 3991162 4086319 4104037 4186143 4333632 4474438 4342455 4227140
12164 4227140 4217398 4228669 4259154 4287074 4330741 4392941 4476137 4444443 4610080 4621757 4435822
12153 4435822 4550356 4673846 4816597 4708279 4683037 4882831 4981120 4935600 4895265 4930105
12143 4930105 4880830 4877033 4977752 5066653 5196544 5244149 5437173 5483974 5706263 5726836 5633457
12132 5633457 5575571 5560697 5655131 5713019 5738766 5699641 5654411 5679661 5879129 6034664 6150125
12121 6150125 6168139 6235289 6277415 6318447 6346325 6474329 6512767 6564524 6554075 6701843 6941345
12110 6941345 7094057 7131375 7203342 7183713 7176733 7210207 7268944 7359897 7518041 7466457 7652100
12099 7652100 7764395 8063344 8117058 8037335 8163921 8315130 8394613 8475724 8570450 8711204
12089 8711204 8812580 8893247 9053510 9255338 9277558 9199961 9226523 9392889 9361343 9439621
12079 9439621 9603522 9820987 9988173 10005907 10001180 10053374 10212571 10503498 10745410 10909194
12069 10909194 11262936 11545997 11564714 11647449 11476983 11652144 11888389 11976331 12289137 12454629
12059 12454629 12633221 12794909 12945836 13129177 13269695 13566042 13887015 14051336 14136520
12050 14136520 14422089 14614106 14778479 15111981 15439392 15655686 15718563 16010432 16293021
12041 16293021 16531636 16831211 17141836 17229760 17457487 17724161 17939564 18052936 18374003
12032 18374003 18614693 18841583 19088598 19269586 19654583 19962716 20330984 20657966 20976812
12023 20976812 21219911 21506753 21873895 22318369 22801659 23186976 23558620 23909976 24178085
12014 24178085 24504109 24929800 25356282 25709073 26137607 26586840 26876959 27283431 27760546
12005 27760546 28241244 28838051 29398486 29827123 30222136 30772210 31330568 31771143 32304037
11996 32304037 32662776 32832283 33203217 33872595 34613008 35296130 35662878 36167922 36701628
11987 36701628 37133459 37630815 38185232 38602179 38934899 39421295 40103453 40655120 41100356
11978 41100356 41546143 41839654 42140531 42573424 43138988 43565192 43978826 44393506 44642911
11969 44642911 45022538 45563841 46064589 46585810 46812291 47092634 47467177 47759333 48083751
11960 48083751 48337819 48545911 48662944 48850825 49170129 49462089 49693864 49786154 49713062 49793741
11950 49793741 49795545 49791393 49790934 49671811 49742678 49663995 49406680 49279171 48933956 48633003 48653152
11939 48653152 48570293 48372064 48032646 47719547 47248695 46893186 46626920 46461473 46379050 46090602
11929 46090602 45671554 45163308 44764133 44424210 43947429 43327430 42640938 42087946 41518711
11920 41518711 41098387 40792657 40314621 39922697 39507269 38940233 38402922 37939011 37404679
11911 37404679 36889835 36535095 36013732 35588414 35124369 34466613 33909500 33412348 32901032
11902 32901032 32455766 31962092 31397003 30993000 30590652 30066196 29557117 29053550 28733843
11893 28733843 28456780 28225389 27923165 27420090 26903773 26377976 25888941 25311748 24973765
11884 24973765 24837065 24546674 24052091 23608470 23278817 22828256 22510639 22103511 21765804
11875 21765804 21243447 20938536 20706244 20506542 20303364 20182158 19780110 19488987 19154706
11866 19154706 18582422 18197069 18095706 17817701 17507165 17293186 17060523 16792072 16566449
11857 16566449 16260565 16077535 15971440 15889546 15608032 15240665 15068520 14793071 14567014
11848 14567014 14501403 14423265 14248740 13945538 13577886 13315985 13227137 13302114 13033571 12808872
11838 12808872 12640367 12492322 12290654 12062794 11914789 11810918 11784789 11621465 11553405 11330834
11828 11330834 11221125 11056489 10915985 10621187 10396465 10316469 10160297 9892016 9852630 9784824
11818 9784824 9793692 9736134 9666401 9681884 9321223 9149989 9115637 8944671 8947635 8813046 8598970
11807 8598970 8470739 8338047 8213684 8340222 8453521 8372934 8044525 7891732 7850320 7787454
11797 7787454 7813101 7705039 7459155 7404983 7345929 7254366 6995476 6886074 6939970 7025772
11787 7025772 6940071 6918867 6972761 6984555 6865380 6604738 6402619 6286708 6501895 6676846
11777 6676846 6674495 6537202 6501922 6293600 6260487 6382400 6476400 6408999 6455448 6566341 6781822
11766 6781822 7037411 7398532 8020454 8894592 10726217 13836619 18408762 23754528 26653045
11757 26653045 23356056 16805757 12070652 9471703 7944676 7230769 6689227 6357217
11749 6357217 6092739 5885631 5517763 5285594 5073052 4999510 4792060 4731208 4740611 4699620
11739 4699620 4723040 4733362 4748680 4927787 5242793 5420240 5393910 5091609 4915025 4717856
11729 4717856 4518926 4438204 4314349 4247758 4179259 4058133 3833402 3675894 3747804 3859905
11719 3859905 3719225 3715302 3530487 3543387 3562135 3521417 3484697 3429730 3289226 3402877 3656347
11708 3656347 3587537 3357390 3431017 3490409 3594490 3488873 3296466 3342480 3410364 3305711
11698 3305711 3372928 3641164 3672864 3736011 3669075 3567612 3408001 3082289 2997990 3153218
11688 3153218 3002137 2919649 2921588 2794505 2767473 2900091 2975043 3146332 3169289 3050562
11678 3050562 3126163 3406930 3824369 4272477 4554876 4706321 4335181 3685703 3300788 3059942
11668 3059942 2856937 2655352 2581701 2695843 2720448 2707666 2645487 2612452 2558455 2349433
11658 2349433 1971724 1916127 2056580 2120898 2121493 2066758 2209737 2243853 2145019 2107188 2016867
11647 2016867 2045691 2138085 2231289 2153568 2197403 2318491 2403399 2754869 3022863 3335046
11637 3335046 3690216 4067071 4316160 4278420 3666492 3056977 2514886 2261305 2088910 1946430
11627 1946430 1813146 2056730 2164688 2081593 2054806 1995802 1840374 1713585 1604083 1520365
11617 1520365 1523124 1481416 1627195 1739425 1831766 1835771 1842621 1825579 1799754 1965987 1928691
11606 1928691 2138635 2138632 2291870 2773732 3312235 3647107 4067837 3962045 3243767 2625912
11596 2625912 2388927 2173585 2094602 1986552 1831151 1608016 1496341 1573988 1593647 1637426
11586 1637426 1702291 1768343 1751205 1620583 1569440 1627501 1573150 1635039 1574059 1673731 1594606
11575 1594606 1611659 1846303 1907849 1665505 1692386 1957719 2384769 2972281 3427020 3624542
11565 3624542 3231224 2515242 2044249 1864288 1789377 1695076 1598930 1515540 1566611 1480901
11555 1480901 1182760 1130983 1084851 1096844 1137343 1183694 1213944 1213967 1226756 1386284 1413987
11544 1413987 1462787 1560945 1701948 1801829 1916151 2061532 1949094 1707446 1411529 1367227
11534 1367227 1379147 1171985 950537 1008122 1061823 1061086 782485 779852 1093720 1184362 1112144
11523 1112144 991239 1193858 1295064 1465731 1497932 1320325 1177175 1103060 998992 957692
11513 957692 961365 1037472 1029931 1072887 1354426 1612018 1750449 1710075 1726172 1487033 1470201
11502 1470201 1435647 1378561 1418829 1307338 1160196 1207432 1219110 1180435 1053760 921333
11492 921333 833513 751124 664848 953902 1078726 890759 918896 880374 842764 829035 726763
11481 726763 967402 952308 828340 779512 859337 687777 706137 863675 903820 898202 890280
11470 890280 901691 775773 651446 436569 587924 863933 949071 911360 999141 1010942
11460 1010942 801330 763569 724903 804461 761755 759617 812737 830745 879023 744013 597945
11449 597945 549679 509610 644692 729479 764926 795870 918887 1097131 990785 762980
11439 762980 686953 732343 732446 650863 526253 463734 411955 524697 725146 904679 1060096
11428 1060096 972760 970626 855569 730097 736290 819611 804374 733546 614314 545725 633909
11417 633909 667689 629003 677848 793388 837795 805357 766702 594356 678912 660397 570950
11406 570950 574729 748666 679749 601040 476337 524133 676220 606485 636836 455264 443785
11395 443785 600814 663514 596130 562834 507523 407228 458448 490073 431230 329455 429790
11384 429790 449440 552645 550196 654772 599912 523811 586025 630633 617823 774082 673642
11373 673642 569882 392386 267658 455771 631168 798270 738524 676784 604033 729707
11363 729707 509127 451941 541175 487565 470555 517983 496912 490059 607324 693335 645097
11352 645097 557593 519610 462857 484177 496585 594691 558991 358912 371148 314001 250461
11341 250461 284270 413536 437423 346014 319889 417987 415779 425956 355768 256503 359625
11330 359625 340698 160823 127886 129555 177408 226707 251881 194805 303048 396410 316143
11319 316143 254524 361440 545185 524557 553005 432885 411455 460053 594295 563246 429151
11308 429151 511939 558234 661317 719324 396391 237310 406389 501168 503001 529862 453346
11297 453346 290516 164110 178879 -16638 135343 274728 230472 130200 343396 400521
11287 400521 357883 332158 511141 572947 469941 417239 263069 255892 297666 309251 290607
11276 290607 254986 175307 359436 557287 611665 617190 498028 301934 86797 304921
11266 304921 455898 410994 509229 545098 656237 703989 716565 603852 406600 266731
11256 266731 266490 247203 198916 274132 260413 328740 421948 296406 366897 285490 283470 409791
11244 409791 535627 493759 453329 386050 284487 328195 515798 664234 525890 520508 599882
11233 599882 835081 837864 790023 677451 614212 601176 491325 474574 431830 414490 463318
11222 463318 299509 292922 360531 355991 479878 355956 290039 225854 53071 53992 194585
11211 194585 318627 360682 418278 366061 217270 417796 382539 288150 241155 293650 440940
11200 440940 387316 191580 224211 238910 246652 130741 106239 217502 439769 617733 451896
11189 451896 288739 163726 105958 93318 39835 -18825 -34842 103593 199695 308996 296619
11178 296619 128201 76271 153712 389214 494360 470556 190875 22982 105498 54199
11168 54199 74415 301416 266649 136000 223194 120910 96820 97205 -28657 -51182 121596
11157 121596 180662 156868 163654 -13576 -527 -11968 187522 409076 343255 354681 370174
11146 370174 360697 402109 340125 474941 471352 471497 287985 272170 102773 58971 147630 221958
11134 221958 296135 358644 328133 223836 187213 60329 148946 232592 170816 209789 373631
11123 373631 433390 355726 357339 361395 315339 413410 287403 77239 176013 322590 436978
11112 436978 361616 60916 -149971 -177353 -34840 182592 319395 343664 378317 328375
11102 328375 22550 107731 239931 349188 350687 346618 18715 -113209 -74179 218929 231032
11091 231032 238806 252726 270918 73754 209706 462169 334042 209855 254031 265769 212383
11080 212383 190259 272922 402634 337334 385648 346900 308464 515448 599958 649691 536255
11069 536255 429853 416196 132395 13019 159271 466253 503400 359034 369865 502308
11059 502308 514025 464796 494805 447739 273875 214880 234962 206282 219333 372606 563441
11048 563441 620132 545266 676336 681742 682287 717257 709945 633108 713716 764310 769974 998203
11036 998203 928989 899936 831455 976816 1206454 1246564 1389207 1339869 1169442 1147436 1165789
11025 1165789 1219799 1305265 1330520 1431862 1687396 1778308 1614310 1551677 1182843 974465
11015 974465 929834 1005666 964437 939439 923371 934075 1029391 1248826 1386206 1050968 676730
11004 676730 749836 949813 980999 819875 663430 816232 951218 1103907 1016044 881228
10994 881228 799478 779685 591113 527322 602074 609254 532303 437171 389873 477666 469250 478746
10982 478746 426644 256102 338137 344256 365874 438836 475904 364411 274504 197676 116368
10971 116368 142198 138827 287786 227391 201680 -49598 -6813 133258 156240 153217 136737
10960 136737 148982 210879 202944 324213 517413 374622 155339 154295 206795 211683 313882
10949 313882 303725 227115 183710 220771 210593 206779 137185 120126 175177 341497 370057
10938 370057 315905 292015 246236 82808 109478 275240 341976 176405 14151 53962 52046
10927 52046 91177 212937 241805 229180 123970 88517 73184 198293 205713 95917 186733
10916 186733 156746 118462 117957 320578 310579 220953 168195 224485 271394 214543 192275 259860
10904 259860 318457 240669 264286 281966 237612 209110 215813 208634 88196 160185 245639 295358
10892 295358 243578 241079 345151 418886 552270 450051 324527 300829 193808 109121 179005
10881 179005 171309 131737 -5936 -78779 -14251 49752 182715 372904 493038 476305 427174
10870 427174 472566 416959 358381 363226 350311 257882 228346 373706 328699 220141 118002
10859 118002 190172 316513 217011 218428 96485 -10604 92353 109628 66858 178016 312309
10848 312309 153748 8409 97818 77359 177047 262090 141307 94118 49100 205575 313341
10837 313341 384776 406985 427696 360272 194939 87514 103589 280402 289628 277103 276318
10826 276318 160366 147263 74149 159897 307718 322689 386443 414016 171765 161480 243769
10815 243769 434350 428898 341134 53674 119628 272953 205487 15083 -69597 -27479 3049
10804 3049 -67304 46883 203113 194739 396702 408792 279447 204837 373785 504376 411150
10793 411150 418524 395048 464771 324350 199191 63662 99683 112178 106405 212128 304897
10782 304897 364051 288486 292940 204375 246623 402628 307126 390302 407746 422445 513492
10771 513492 496287 418941 211970 222658 519709 644590 552508 676752 649132 612486 567093
10760 567093 704270 756592 649258 412193 222126 -15852 40593 241310 402657 404044
10750 404044 412126 532122 492590 400772 378920 453869 471574 338287 155746 229171 209676
10739 209676 208393 163143 90706 129200 296053 322961 327245 340002 349918 403040 357264 374392
10727 374392 362359 369984 409494 362021 367349 349744 202234 198946 179229 126975 325337 315989
10715 315989 348339 351622 330622 372800 438980 475475 381521 348479 403628 172806 282043
10704 282043 472678 387768 210782 342138 462430 515320 406914 341595 439112 504717
10694 504717 673809 604487 473632 477858 465724 453929 520391 452802 551493 715500 763461
10683 763461 646512 705739 767810 899711 932944 914173 855482 900456 976315 907363 862638
10672 862638 955411 974269 885359 760103 885635 1078797 1085339 1078362 1179037 1155081 1112784
10661 1112784 1045910 971297 911618 1092093 1203121 1268003 1301133 1369382 1505420 1760743
10651 1760743 1892858 1871459 1875115 1956833 2093840 2290435 2247039 2222035 2323751 2327425 2572336
10640 2572336 2961543 3330540 3523320 3686926 3968787 4220466 4581819 5159901 5695431
10631 5695431 6323579 6951207 7484425 7977524 8695053 9785269 10904192 12341071 14252012
10622 14252012 16917491 20441823 25132380 31635134 40287599 51400096 64965393 79736604
10614 79736604 92702501 100070316 100295116 95839339 90631373 88035435 89742841 96634495
10606 96634495 110082837 130880201 157897668 187621057 211833882 220677257 211143662
10599 211143662 191185601 171646037 159198359 155888668 162046792 178340034 204875859
10592 204875859 239656906 275971100 301565184 302960915 278006595 239577884 203198759
10585 203198759 176939726 161918261 157139499 161672749 174242606 192437705 210753400
10578 210753400 220616344 213891435 189901210 158704267 130707138 110429602 97761208
10571 97761208 91430576 90193801 92861714 97461418 101272436 101068099 94306876 81395176
10563 81395176 66121890 51868745 40502965 32107207 26045826 21697528 18373669 15781649
10555 15781649 13642712 12019779 10713652 9576597 8679135 7910367 7153399 6709391 6093559
10546 6093559 5572477 5003315 4706173 4502056 4371321 4145450 3845766 3578913 3322242
10537 3322242 3060326 2831881 2635911 2650016 2704261 2462464 2286145 2340123 2426092 2400937
10527 2400937 2306242 2140713 1936116 2032702 1902528 1867745 1802920 1690708 1498080 1673774
10517 1673774 1799438 1727338 1538261 1680346 1677971 1529592 1744136 1679481 1474265 1084076
10507 1084076 1072161 1286429 1401246 1393567 1331799 1197285 1044449 1075191 991879 1146410
10497 1146410 1169617 1086187 904678 818935 920253 815510 798280 891095 912760 1024283
10487 1024283 910507 967949 1117108 1101102 1257133 1214643 1149198 1244384 1239688 1070739 1049225
10476 1049225 1111675 1235229 1242902 1255761 1367420 1298280 1202745 1216492 1114975 913752 853702
10465 853702 876132 954480 979099 1011074 1055252 981825 782439 837450 929636 989117 940187
10454 940187 983410 1005912 1000718 1139843 1124265 965406 969906 859291 737566 805824 890281
10443 890281 965285 941357 882883 781338 675738 572288 453536 329602 271427 117898
10433 117898 45933 109235 154175 244962 457097 450943 375523 551255 721403 654656 564471
10422 564471 449721 461027 465135 425209 286013 293154 367398 287796 311345 173343 233631
10411 233631 317479 378314 174904 73717 -33875 -172164 -151432 14773 111588 86299
10401 86299 75875 48723 115061 274915 399720 406577 336779 374412 331717 200505 124285
10390 124285 54257 101630 28030 -88160 133096 269058 113221 53777 -54818 8493
10380 8493 194746 115429 270074 197849 113462 145151 230186 365530 422023 375560 257047
10369 257047 377587 406070 452701 399145 330777 427816 278020 126390 -6633 14396 252598
10358 252598 354356 188270 9774 71506 123254 11915 20186 211517 221708 105513
10348 105513 -103942 -163330 -143877 73936 123141 269673 347927 380398 310470 322246 200058
10337 200058 219134 304340 289211 376195 305018 441121 563728 518432 465875 461142 386049
10326 386049 261740 16703 -29960 -41183 -130753 -69477 70727 151106 105379 69571 212501
10315 212501 236973 315030 416775 206919 31100 115007 299706 157224 -7009 -74884
10305 -74884 -101573 64880 261874 415167 423527 306925 311774 192324 269374 367462 196805
10294 196805 148889 192301 236976 136644 65440 209175 282715 169957 10236 143216
10284 143216 146287 125823 73548 187743 108405 142820 195667 393560 353958 300118 460240
10273 460240 581808 486761 627960 971178 1175047 1390995 1823784 2493544 3450092 5517126
10263 5517126 8997199 13740658 18467599 19687784 14869944 8922632 5505324 3682259
10255 3682259 2606192 2166727 1691991 1270351 1029737 993277 993545 1047843 878119 649788
10245 649788 418069 239972 198445 185256 280555 438249 495912 330475 177555 28553
10235 28553 98889 359992 486402 485933 395599 222195 200622 271700 550464 574224 448412
10224 448412 324709 263424 120997 25836 -46800 -37059 75224 105654 97272 145951 148626
10213 148626 161800 225137 187030 92644 42463 90526 -25002 -89101 -103661 -130142 -215676
10202 -215676 -214813 -140735 -160424 -134288 -35127 -16378 137088 209635 113902 56499 173339
10191 173339 266028 198060 125641 174373 226120 235550 44372 -144293 69895 302346 499448
10180 499448 688514 558186 476250 462715 514265 404649 338033 473923 627280 721038
10170 721038 802111 785606 896093 1058381 1224718 1352399 1353003 1263818 1283618 1135735 956160
10159 956160 754145 923348 1142477 1233927 1575083 1762678 1814586 1774085 1852626 1736282
10149 1736282 1426371 1105163 1030874 998063 1164241 1326257 1360849 1345620 1285482 1044407
10139 1044407 765869 591639 612660 733897 680540 649001 689269 722607 631481 602445 680603
10128 680603 605961 583137 465748 340293 312340 271725 233766 153798 235995 386548 325874
10117 325874 246851 201269 242942 451992 431766 422474 432506 339329 -65834 -268278 -161138
10106 -161138 -99610 -149868 -28852 -23590 -49724 95712 187344 168565 184592 137849 58239
10095 58239 -15329 -87131 -181453 -102824 -34628 179957 191773 202973 172612 277509 310073
10084 310073 233027 121988 203345 34892 36229 117748 160468 69563 140971 152899 218677
10073 218677 284148 227235 93590 4867 33034 -60301 -223821 -279219 -54118 13762 46414
10062 46414 141597 268884 279535 248605 301637 253626 218449 206471 244676 206559 197722 172367
10050 172367 144414 265866 241957 23390 -179295 -128870 110570 200062 139621 -13054
10040 -13054 -139437 -160711 -58501 30654 19224 -30881 -43822 14211 -48805 -16678 -10076
10029 -10076 32362 -37976 -257491 -351332 -254508 -234053 -291600 -182903 -274140 -389250 -342545
10018 -342545 -170374 -146078 -137842 -231225 -187720 -32125 26428 -16646 -17573 -34232 -151876
10007 -151876 -55562 30605 -23933 37384 14727 -24376 -17588 -69502 -179671 -101896 -72012
9996 -72012 43024 47045 1361 -37677 -277085 -39357 71625 37932 -123392 -146680 -81538
9985 -81538 32772 83500 -59460 -57928 156036 187663 55107 46795 -45508 -220070 -149281
9974 -149281 21938 8981 30186 -46488 -2700 43400 -116753 -96325 24754 119283 207736
9963 207736 72468 -116663 -95845 64528 61695 169949 146476 -62777 -165122 -24622
9953 -24622 99688 13208 -116889 -39439 -53434 -136285 37329 15430 79923 173542 119627
9942 119627 1574 -62321 -28373 45066 93075 83204 -33444 -78706 -146959 -186940 -69265
9931 -69265 -81921 -36124 -54094 110400 231703 176034 129234 167732 213934 120031 -59810
9920 -59810 -53310 -117188 -42083 31012 142018 187198 240836 215438 53940 -14831 -130621
9909 -130621 -176981 -93650 -200536 -177997 -36423 -31543 -35408 -4476 60597 202066 202713 9881
$$ [...]
##END NTUPLES=NMR SPECTRUM
##END=
