##TITLE=Analysis number 329568
Compound Code cc 40823
Project Code adrs
Chemist Name fudan
##JCAMPDX= 6.0         $$ Bruker NMR JCAMP-DX V2.0
##DATA TYPE= NMR SPECTRUM
##DATA CLASS= NTUPLES
##ORIGIN= Bruker BioSpin GmbH
##OWNER= nmr
$$ XWIN-NMR		Version 3.5
$$ Fri Sep 14 09:20:31 2007 GMT Daylight Time (UT+1h)  MAYBRIDGE\nmr@NMR_250MHZ
##.OBSERVE FREQUENCY= 250.131544655141
##.OBSERVE NUCLEUS= ^1H
##.ACQUISITION MODE= SIMULTANEOUS (DQD)
##.ACQUISITION SCHEME= undefined
##.AVERAGES= 16
##.DIGITISER RES= 18
##SPECTROMETER/DATA SYSTEM= dpx250
##.PULSE SEQUENCE= zg30
##.SOLVENT NAME= CDCl3
##.SHIFT REFERENCE= (INTERNAL, CDCl3, 0, 16.522)
##AUDIT TRAIL= $$ (NUMBER, WHEN, WHO, WHERE, WHAT)
$$ ##TITLE= Audit trail, XWIN-NMR		Version 3.5
$$ ##JCAMPDX= 5.01
$$ ##ORIGIN= Bruker BioSpin GmbH
$$ ##OWNER= nmr
$$ C:\u/data/dgb/nmr/ADRS/1580/pdata/1/auditp.txt
$$ ##AUDIT TRAIL=  $$ (NUMBER, WHEN, WHO, WHERE, WHAT)
(   1,<2007-09-14 09:20:11.21 +100>,<MAYBRIDGE\nmr>,<NMR_250MHZ>,
      <created by zg, POWCHK disabled, PULCHK disabled
       configuration hash MD5:
       76 6E 9A 78 1E 09 19 81 EC 84 63 8F B0 6A 59 2D
       data hash MD5: 64K
       3B B2 3F 30 16 C6 3F 99 3D 71 67 37 41 88 3D 88>)
(   2,<2007-09-14 09:20:23.32 +100>,<MAYBRIDGE\nmr>,<NMR_250MHZ>,
      <Start of raw data processing
       ef LB = 0.3 FT_mod = 6 PKNL = 1 SI = 32K 
       data hash MD5: 32K
       17 81 4E FB DC B3 5B EF E4 32 44 05 CC C0 91 77>)
(   3,<2007-09-14 09:20:25.02 +100>,<MAYBRIDGE\nmr>,<NMR_250MHZ>,
      <apk 
       data hash MD5: 32K
       9B 11 DF A5 40 17 82 B2 D3 77 78 43 89 5E 2E AE>)
(   4,<2007-09-14 09:20:25.82 +100>,<MAYBRIDGE\nmr>,<NMR_250MHZ>,
      <abs ABSG = 5 
       data hash MD5: 32K
       CD D6 A6 1A F4 44 74 74 B3 B4 F8 95 5E B2 10 C8>)
$$ ##END=
$$ 
$$ hash MD5
$$ 93 D0 06 ED 30 C1 51 15 03 40 AA 58 C6 12 1A D9
##$RELAX= 
##$RELAX= 
##$RELAX= 
##$RELAX= 
##$RELAX= 
##$RELAX= 
##$RELAX= 
$$ Bruker specific parameters
$$ --------------------------
##$DU= <C:\u>
##$EXPNO= 1580
##$NAME= <ADRS>
##$PROCNO= 1
##$TYPE= <nmr>
##$USER= <dgb>
##$AMP= (0..31)
100 100 100 100 100 100 100 100 100 100 100 100 100 100 100 100 100 100 
100 100 100 100 100 100 100 100 100 100 100 100 100 100 
##$AQSEQ= 0
##$AQ_mod= 3
##$AUNM= <au_zg>
##$AUTOPOS= <6 >
##$BF1= 250.13
##$BF2= 250.13
##$BF3= 250.13
##$BF4= 250.13
##$BF5= 500.13
##$BF6= 500.13
##$BF7= 500.13
##$BF8= 500.13
##$BYTORDA= 1
##$CFDGTYP= 0
##$CFRGTYP= 5
##$CHEMSTR= <none>
##$CNST= (0..31)
1 1 145 1 1 1 1 1 1 1 1 1 1 1 1 1 1 1 1 1 1 1 1 1 1 1 1 1 1 1 1 1 
##$CPDPRG= <>
##$CPDPRG1= <>
##$CPDPRG2= <>
##$CPDPRG3= <>
##$CPDPRG4= <mlev>
##$CPDPRG5= <mlev>
##$CPDPRG6= <mlev>
##$CPDPRG7= <mlev>
##$CPDPRG8= <mlev>
##$CPDPRGB= <>
##$CPDPRGT= <>
##$D= (0..31)
0 1 0 0 0 0 0 0 0 0.06 0 0 0 0 0 0 0.0002 0 0 0 0 0 0 0 0 0 0 0 0 0 0 
0 
##$DATE= 1189758010
##$DBL= (0..7)
120 120 120 120 120 120 120 120 
##$DBP= (0..7)
150 150 150 150 150 150 150 150 
##$DBP07= 0
##$DBPNAM0= <>
##$DBPNAM1= <>
##$DBPNAM2= <>
##$DBPNAM3= <>
$$ [...]
##$SUBNAM7= <"">
##$SUBNAM8= <"">
##$SUBNAM9= <"">
##$SW= 20.6930455092707
##$SWIBOX= (0..15)
0 0 3 0 0 0 0 0 0 0 0 0 0 0 0 0 
##$SW_h= 5175.983436853
##$TD= 65536
##$TD0= 1
##$TE= 296.16
##$TE2= 300
##$TE3= 300
##$TEG= 300
##$TL= (0..7)
0 120 120 120 120 120 120 120 
##$TP= (0..7)
150 150 150 150 150 150 150 150 
##$TP07= 0
##$TPNAME0= <>
##$TPNAME1= <>
##$TPNAME2= <>
##$TPNAME3= <>
##$TPNAME4= <>
##$TPNAME5= <>
##$TPNAME6= <>
##$TPNAME7= <>
##$TPOAL= (0..7)
0.5 0.5 0.5 0.5 0.5 0.5 0.5 0.5 
##$TPOFFS= (0..7)
0 0 0 0 0 0 0 0 
##$TUNHIN= 0
##$TUNHOUT= 0
##$TUNXOUT= 0
##$USERA1= <user>
##$USERA2= <user>
##$USERA3= <user>
##$USERA4= <user>
##$USERA5= <user>
##$V9= 5
##$VALIST= <valist>
##$VCLIST= <CCCCCCCCCCCCCCC>
##$VD= 0
##$VDLIST= <DDDDDDDDDDDDDDD>
##$VPLIST= <PPPPPPPPPPPPPPP>
##$VTLIST= <TTTTTTTTTTTTTTT>
##$WBST= 1024
##$WBSW= 4
##$XGAIN= (0..3)
0 0 0 0 
##$XL= 0
##$YL= 0
##$YMAX_a= 644169
##$YMIN_a= -504668
##$ZGOPTNS= <>
##$ZL1= 120
##$ZL2= 120
##$ZL3= 120
##$ZL4= 120
##$ABSF1= 16.522
##$ABSF2= -4.171173
##$ABSG= 5
##$ABSL= 3
##$ALPHA= 0
##$AQORDER= 0
##$ASSFAC= 0
##$ASSFACI= 0
##$ASSFACX= 0
##$ASSWID= 0
##$AUNMP= <proc_1d>
##$AZFE= 0.1
##$AZFW= 0.1
##$BCFW= 0
##$BC_mod= 0
##$BYTORDP= 0
##$COROFFS= 0
##$CY= 12.5
##$DATMOD= 1
##$DC= 0
##$DFILT= <>
##$DTYPP= 0
##$F1P= 14.0000005364418
##$F2P= -0.99999901652339
##$FCOR= 0.5
##$FTSIZE= 32768
##$FT_mod= 6
##$GAMMA= 0
##$GB= 0
##$INTBC= 1
##$INTSCL= 1
##$ISEN= 128
##$LB= 0.3
##$LEV0= 0
##$LPBIN= 0
##$MAXI= 10000
##$MC2= 0
##$MEAN= 0
##$ME_mod= 0
##$MI= 0
##$NCOEF= 0
##$NC_proc= -3
##$NLEV= 6
##$NOISF1= 0
##$NOISF2= 0
##$NSP= 0
##$NTH_PI= 0
##$NZP= 0
##$OFFSET= 16.522
##$PC= 1
##$PHC0= -61.24897
##$PHC1= 6.961567
##$PH_mod= 1
##$PKNL= yes
##$PPARMOD= 0
##$PSCAL= 4
##$PSIGN= 0
##$REVERSE= no
##$SF= 250.13
##$SI= 32768
##$SIGF1= 0
##$SIGF2= 0
##$SINO= 400
##$SIOLD= 32768
##$SREGLST= <1H.CDCl3>
##$SSB= 0
##$STSI= 32768
##$STSR= 0
##$SW_p= 5175.98343685301
##$SYMM= 0
##$S_DEV= 0
##$TDeff= 65536
##$TDoff= 0
##$TI= <Analysis number 999999
Compound Code 99
Book Reference 9
Project Code 9>
##$TILT= no
##$TM1= 0
##$TM2= 0
##$TOPLEV= 0
##$USERP1= <user>
##$USERP2= <user>
##$USERP3= <user>
##$USERP4= <user>
##$USERP5= <user>
##$WDW= 1
##$XDIM= 32768
##$YMAX_p= 377243289
##$YMIN_p= -344959
$$ End of Bruker specific parameters
$$ ---------------------------------
##NTUPLES= NMR SPECTRUM
##VAR_NAME=  FREQUENCY,     SPECTRUM/REAL,   SPECTRUM/IMAG
##SYMBOL=    X,             R,               I
##VAR_TYPE=  INDEPENDENT,   DEPENDENT,       DEPENDENT
##VAR_FORM=  AFFN,          ASDF,            ASDF
##VAR_DIM=   32768,         32768,           32768
##UNITS=     HZ,            ARBITRARY UNITS, ARBITRARY UNITS
##FACTOR=    0.157963299565203, 1,           1
##FIRST=     4132.6476996994, 0,             0
##LAST=      -1043.33573715361, 0,           0
##MIN=       -1043.33573715361, -344959,     0
##MAX=       4132.6476996994, 377243289,     0
$$ Real data points
##PAGE= N=1
##DATA TABLE= (X++(R..R)), XYDATA
$$ [...]
18534G46771K5190M3240N1758P3225R2427R4376Q7416R9523J13811J55961J96054
18523A779752K01860J75514K14063L18039L69187L93515M41724M57814M93898
18514D845366O35153Q71467J254641J867693K865055M181111N470547O346503
18506B8337536O339029K972957j656267j361330J300697J416776k892750n252260
18498B9204388j823680K835771O277773Q061039P099817N87717r195543j3666575
18490B9380707j0594703o096924l376794k004091j287996q81686o09296m09990
18482D119227k99229k19686j39576q1566L66O5457Q0868O2930J00460K35966L58525
18471D283742L99004L67187M02486N51063P52470J003982J446363K198482L415298
$$ y = [746771, 771961, 815201, 866959, 940184, 1032611, 1126987, 1214403, 1313926, 1427737, 1583698, 1779752, 1981612, 2157126, 2371189, 2689228, 3058415, 3451930, 3893654, 4351468, 4845366, 5480519, 6351986, 7606627, 9474320, 12339375, 16520486, 21991033, 28337536, 34676565, 37649522, 35993255, 34631925, 35932622, 37349398, 34456648, 29204388, 27380708, 30216479, 36494252, 44555291, 51655108, 52242825, 43047282, 29380707, 18786004, 12689080, 9312286, 7308195, 6020199, 5138513, 4529217, 4119227, 3819998, 3600312, 3460736, 3379170, 3379536, 3444993, 3525861, 3588791, 3689251, 3925217, 4283742, 4682746, 5049933, 5452419, 6003482, 6755952, 7759934, 9206297, 11404779, 14820077]
18462A4820077N102846O712647P528727P042407J988145n975659o937769k175166
18454B8106255K554452O027686Q335743R540732O070145q61646j176007K004442
18446F0601802j268310o561252m719765o98448j466399q424876j1967684q724953
18438A6770115n009139k923809j834575j199009q58539o63842n42523m42287l26990
18429B969402k60408k24799j94094j68306j30686j53066j57859j45211j13337
18420A421636p7529o5520p5859p8841o0741n3481k3907J5287Q826J245J6108P8343
18408A105567J42598K26072L20044L90503L91687J61103j96562m65422n31966
18399A543624m07860k44992j67455r0620m6175m9968l4502l8066l7542j5959k0369
$$ y = [14820077, 19922923, 26635570, 34164297, 41206704, 43194849, 37219190, 30281421, 28106255, 30660707, 36688393, 45024136, 54564868, 60635013, 59773367, 58597360, 60601802, 59333492, 52772240, 48052475, 47354027, 45887628, 37462752, 25495068, 16770115, 11760976, 8837167, 7002592, 5803583, 4945044, 4281202, 3738679, 3296392, 2969402, 2708994, 2484195, 2290101, 2121795, 1991109, 1838043, 1680184, 1534973, 1421636, 1344107, 1278587, 1202728, 1123887, 1063146, 1009665, 985758, 1001045, 1009871, 1011116, 1027224, 1105567, 1248165, 1474237, 1794281, 2184784, 2576471, 2737574, 2541012, 2075590, 1543624, 1135764, 890772, 723317, 632697, 586522, 536554, 502052, 463986, 426444, 410485, 390116]
18388C90116j7622j5366o13J1476k266L032O183J646L019k56j218p413L1j2795
18374C57954o263O744J3985L2916N1508O9190J00907R2932P4709L2037o8962j17301
18362F40356j30649j03394o3044m4211k8889o295l401j6507j7623m934l878J742
18350B19273J1607k51j472m616K400R004j2867k1939J333N351J3945J1708m104
18337B29372n993R085L250R126J4342j3485l7771j4274k2397O678K4063K7516
18325B29512K0290K3256R053p282j7397k9189k7742q745J6462q551k9544j1116
18313A59007L612J3465K1621J6289j429p772l113k009J8747J2347j1941l094K491
18300B18221L881n919O923K1860J8077J7913K407J587q7l296K141J2667K6772
$$ y = [390116, 372494, 357128, 356515, 367991, 365725, 368757, 374940, 376586, 379605, 379349, 378131, 370718, 370749, 357954, 351691, 358435, 372420, 405336, 456844, 526034, 626941, 719873, 794582, 826619, 757657, 640356, 509707, 406313, 343269, 299058, 270169, 263874, 260473, 243966, 226343, 221409, 217531, 219273, 230880, 230629, 229157, 224541, 226941, 235945, 223078, 201139, 202472, 207823, 221768, 233476, 229372, 223379, 232464, 235714, 244840, 259182, 245697, 207926, 193652, 171255, 177933, 201996, 229512, 249802, 273058, 282111, 274829, 257432, 228243, 200501, 191756, 208218, 199667, 170123, 159007, 162619, 176084, 197705, 213994, 212565, 204793, 201680, 199671, 218418, 230765, 218824, 215730, 218221, 222102, 216183, 223106, 244966, 263043, 280956, 283363, 284950, 284863, 281567, 283708, 296375, 323147]
18287C23147K5361L700M93L797J7602J4653J9948K3380K8786M2373M8960M6171
18275E98371K2246O939j7102j0649K9106M2376O6009R3401R9645J21260J37895
18264A189497J49458J57398J91357K24926K89241L78325M94845O75214R76790
18255D727051J479180K119477K794745L354365L160134J377929o91134j974062
18247A6347685k919001k301162n76671J087599K413200L372500L699369K079965
18239B3203484q33624k660472m344527m844381l431705j947023j071267o00889
18231C469596l68434k42126j67703j43847j20576l0043N2122J20897K02332K51547
18221C023765K84735L10963L49555L83469M36337N42882O76619Q49351J107603
$$ y = [323147, 348508, 352208, 352701, 356498, 374100, 388753, 408701, 432081, 460867, 503240, 552200, 598371, 620617, 627556, 610454, 599805, 628911, 671287, 737296, 830697, 930342, 1051602, 1189497, 1338955, 1496353, 1687710, 1912636, 2201877, 2580202, 3075047, 3750261, 4727051, 6206231, 8325708, 11120453, 14474818, 17634952, 19012881, 18321747, 16347685, 13428684, 11127522, 10550851, 11638450, 14051650, 17424150, 21123519, 23203484, 22369860, 19709388, 15364861, 10520480, 7088775, 5141752, 4070485, 3469596, 3101162, 2859036, 2691333, 2547486, 2426910, 2396867, 2448989, 2569886, 2772218, 3023765, 3308500, 3619463, 3969018, 4352487, 4788824, 5331706, 6008325, 6857676, 7965279]
18212G965279J517016K169311L259490M852486O820928Q714752R835228P925683
18204E3060173K041988l229718p343051r479707o814718k239719J665760M469554
18196C2130562O264278O059217K258653j909886m497585o881369o573595m900350
18188B1949925l827916l352305l303384k606630j622636r92983o99477n07745
18180E036849k92151r6053O2861J75436L19564M17114N14010O37823P86715R48735
18170H510903J145687J329619J503256J810035K321277L228017M797502P373807
18162C2020103J0986135J4847803J7550626J7072880P527796q529130j5985785
18155G5490428j5594080j3369861q235166k382834K611008O915415J0186384J1791800
$$ y = [7965279, 9482295, 11651606, 14911096, 19763582, 26584510, 35299262, 45134490, 53060173, 55102161, 51872443, 44529392, 35049685, 28234967, 25995248, 27661008, 32130562, 38394840, 44454057, 46712710, 44802824, 40305239, 33423870, 26850275, 21949925, 18122009, 14769704, 11466320, 8859690, 7237054, 6244071, 5544594, 5036849, 4744698, 4648645, 4711506, 4886942, 5206506, 5623620, 6137630, 6775453, 7562168, 8510903, 9656590, 10986209, 12489465, 14299500, 16620777, 19848794, 24646296, 32020103, 43006238, 57854041, 75404667, 92477547, 100005343, 91476213, 75490428, 59896348, 46526487, 38291321, 35908487, 38519495, 45434910, 55621294, 67413094]
18147F7413094R168420m85863q756023r231082q358547q137834q923211r104775
18139B3584179o665962l955582k414919j662085j236098q86467n96518l84111
18131E782437k00040q424J92188L68429M99008N58682O26581O63216O38263O98427
18121I818767R33995J285605J860990K805500M305028O423236Q839722J0847983
18113D7120826J0953013P622229J368229n815323o964303k011257q81995l265883
18105D8125536m90832L861312L398033m769056j2425532j2088970q470646n167349
18097A1972496l015808j871689j238460q52319o11792m51303l52778k72518j96533
18088C109296j12664o5579n4256o9602l6957J0066N2558J15271J72679K00826
$$ y = [67413094, 76581514, 76095651, 67339628, 58108546, 49749999, 41612165, 32688954, 23584179, 16918217, 12962635, 10547716, 8885631, 7649533, 6763066, 6166548, 5782437, 5582397, 5573973, 5766161, 6134590, 6633598, 7192280, 7818861, 8482077, 9120340, 9818767, 10752762, 12038367, 13899357, 16704857, 21009885, 27433121, 36272843, 47120826, 58073839, 65696068, 67064297, 61248974, 54284671, 52273414, 51391419, 48125536, 47634704, 51496016, 54894049, 50124993, 37699461, 25610491, 17139845, 11972496, 8956688, 7084999, 5846539, 4994220, 4382428, 3931125, 3578347, 3305829, 3109296, 2996632, 2931053, 2876797, 2807195, 2770238, 2780304, 2832862, 2948133, 3120812, 3321638]
18078C321638J87879J59851J46637J92616K85904L93299O05910J002310J645128
18069G941172K503136L244263L527032K986425j04621m033692m184839j991712
18061I887164j01757J198766J926674J986128L95905k930583m212061k949699
18053E200537j631330r30160n61478l54991k53380k00210j49465q8996o1482o0599
18043I08446n2200o707L938N34m2365m2051l5992l3878n104K8611K2694l274m9305
18030F93347p7729q5369p8579l9635k2958j7636J314K2325K0373J3946k1223k6925
18018C81251j0156J75j8529k9180k7573j2849k8225r455L1p413j2748J061j940
18005B24450N932r167J1830m581j603M342N667L870K915j3655j2936J4718J4436
$$ y = [3321638, 3509517, 3669368, 3816005, 4008621, 4294525, 4687824, 5293734, 6296044, 7941172, 10444308, 13688571, 17215603, 20202028, 20097407, 16063715, 11878876, 9887164, 9785407, 10984173, 12910847, 14896975, 15292880, 12362297, 8150236, 5200537, 3569207, 2639047, 2077569, 1722578, 1469198, 1268988, 1119523, 1030527, 969045, 908446, 856246, 849539, 853477, 854011, 811646, 769595, 733603, 699725, 694621, 723232, 745926, 742652, 693347, 615618, 530249, 451670, 412035, 389077, 371441, 372755, 395080, 415453, 429399, 408176, 381251, 371095, 371270, 352741, 323561, 295988, 283139, 254914, 245459, 245490, 238077, 225329, 226390, 224450, 230382, 221215, 233045, 228464, 226861, 231203, 236870, 240740, 243655, 230000, 217064, 231782, 246218]
17992B46218J44J567N541J3042J0763J5215K1832L458R456M5399M0905N4399N0987
17979E18926K3680Q54l197j982M887k3737m4514l9350J2252K6720J2865l0752
17967D56652m7392m7615m5789m2529k5724q345k0294k993J1392n872k5473m035
17955A91983O630p484j1707j1677j4343j0151j0270r73j1152p920J069J0905J1809
17942A36719N960K65N48q370K937K004J5891N927K0377K6883M3982L6923K449
17929B92495j5021j5394m667K1952L3044J4532j5125j0266m067j2321r359J154
17917B76957K540j2300m7765l9393j7274j0397P373k817o186j2715M765R019o462
17904A45345L587M552N493l184j1717j2227j0929k4089k974J321L765P057N010
$$ y = [246218, 246362, 247929, 253470, 266512, 277275, 292490, 314322, 317780, 327236, 372635, 413540, 467939, 518926, 542606, 543460, 540263, 538281, 543168, 519431, 474917, 435567, 447819, 474539, 487404, 456652, 409260, 361645, 315856, 273327, 247603, 239258, 218964, 215971, 227363, 221491, 196018, 191983, 198613, 191129, 179422, 167745, 153402, 143251, 132981, 132008, 120856, 112936, 114005, 124910, 136719, 142679, 142944, 143492, 135122, 138059, 140063, 155954, 161881, 182258, 209141, 253123, 290046, 292495, 277474, 262080, 257413, 279365, 312409, 326941, 311816, 301550, 297483, 285162, 275803, 276957, 279497, 267197, 219432, 180039, 162765, 152368, 159741, 156924, 150738, 138023, 142788, 151807, 145345, 148932, 153484, 158977, 155793, 144076, 131849, 120920, 96831, 93857, 95178, 98943, 106000, 111010]
17891A11010N285M467j1529j3925o920j2717l322j1649K573p50m92k208j2518
17878D7305o477J2813J5011j5233n147n958q225k811N731J6629J722L400L001
17865F1761q76q246p324J8621N579N30J4657P425L574N784J5929k558j2466j0140
17851I2250J96j6652n301P013J2673M75r617k0110k459m820p062m277r451o58
17837C2200J4822K558o274j148m868O271l106j9535p85O944P256l720j4681p519
17823H415J418N361J7563O583o507R135l40L738n078Q947O132O643M907j3034
17809E3883J234L743K423N988Q7k1954j0745K725Q86m025m156J027L988J0452
17795D5556q200M408P03j304j506r100N399j830j8986j3861n745J2506J4440Q712
$$ y = [111010, 116295, 120762, 109233, 95308, 88388, 75671, 72349, 60700, 63273, 62523, 62031, 59823, 47305, 40828, 53641, 68652, 53419, 48272, 42314, 34089, 31278, 37009, 53638, 55360, 58760, 61761, 60885, 52639, 45315, 63936, 69515, 70045, 84702, 92127, 95701, 101485, 117414, 114856, 102390, 92250, 92446, 75794, 70493, 77506, 90179, 90654, 81037, 60927, 58468, 53648, 46586, 42309, 32858, 32200, 47022, 49580, 43306, 42158, 37290, 43561, 40455, 20920, 20135, 27079, 34335, 30615, 15934, 8415, 9833, 15194, 32757, 39340, 32833, 41968, 41628, 45366, 40288, 49235, 55367, 62010, 66917, 53883, 55117, 58860, 61283, 67271, 67358, 45404, 34659, 37384, 38270, 34245, 30089, 31116, 35104, 45556, 37356, 41764, 42467, 41163, 39657, 30557, 35956, 34126, 15140, 1279, -4466, 8040, 22480, 31192]
17781C1192n803j3693m328M981K551O885j6p029p082J1483M541k646j571J5902
17767C5367j0432j4352R373J1687p688r791J2244J6654k473m1n59q338j6265J1710
17753B7096K1580p155j9100k221L420n507R492J0540N638P202q447j713J3243
17740E4068J6959J8571J9402K2510K0341L5958K4845o905n908k8447j7479j2381
17728A41534j130L5233M0285p158k9898j6453l5053m3118k5244j4678r31O713
17716E0102J2031l742R982j0860p145R786J0980k132l069J8696J2632J2050J1051
17703A20362o356k458p391j9728o906j1600K330R950K4668L70M231J6794J2667
17690A36933J3357J7425L2806K6277Q341Q288Q973J4272K6345J8167p824l1740
$$ y = [31192, 25389, 11696, 7368, 12349, 14900, 21785, 21769, 14740, 7658, 19141, 23682, 21036, 19465, 35367, 24935, 10583, 19956, 31643, 23955, 14164, 26408, 43062, 40589, 40548, 39989, 31651, 15386, 27096, 48676, 41521, 22421, 20200, 23620, 18113, 27605, 38145, 43783, 50985, 42538, 40825, 54068, 71027, 89598, 109000, 131510, 151851, 187809, 212654, 205749, 199841, 171394, 153915, 141534, 140404, 175637, 215922, 208764, 178866, 162413, 127360, 84242, 58998, 44320, 43389, 50102, 62133, 58391, 68373, 57513, 50368, 60154, 71134, 69002, 65933, 84629, 97261, 109311, 120362, 114006, 111548, 104157, 84429, 77523, 65923, 68253, 78203, 102871, 103241, 107472, 124266, 136933, 150290, 167715, 200521, 226798, 235139, 243427, 252400, 266672, 293017, 311184, 303360, 271620]
17678B71620k1928k0431j3614k7268n359K785q054j9842k6705j9342p316L162
17666A07708j7852j3638J2727J1507J4995J8411K2500M2693L2149L0472K0857
17655B82529k2719k7071j461K177J7082P992k1515l9305l2647l1084k3172j7462
17643I3344o966Q372J910N661J4631P058N161J9998J8489J0176q748k5866o557
17630A36663M604J7613J2242o211j9912j1212l3590k2453j0348m515m522J6440
17618G4799J1924J8673P533K5216K8286K1661M9128N7958K4752K563K2661K8611
17606C73765J428k7723j1513k9142m1606j1398k3532m8988m4790m2647l3830K253
17594F2277M328j1259j2335o054O299j090j6512q900M783l218j3423r593k17J3775
$$ y = [271620, 249692, 229261, 215647, 188379, 183020, 185805, 177751, 157909, 131204, 111862, 104546, 107708, 89856, 76218, 88945, 100452, 115447, 133858, 156358, 199051, 231200, 261672, 282529, 259810, 232739, 231278, 233455, 250537, 258529, 237014, 197709, 165062, 133978, 110806, 93344, 86378, 94750, 96660, 102321, 116952, 124010, 129171, 149169, 167658, 177834, 169086, 143220, 136663, 141267, 158880, 171122, 164911, 144999, 133787, 100197, 77744, 67396, 62881, 58359, 74799, 86723, 105396, 112929, 138145, 166431, 188092, 237220, 295178, 319930, 322493, 345154, 373765, 375193, 347470, 335957, 306815, 265209, 253811, 230279, 181291, 136501, 93854, 60024, 62277, 66605, 55346, 43011, 36957, 43256, 42166, 25654, 16754, 21537, 18319, 4896, -4697, -4914, 8861]
17580H861N220L083j947j2230m944J4802j218r901J5962J0576M356o19Q438R704
17566E0143J8236J4570K5243L7935M1844Q964j9379k6030O88J0136N753N480k8477
17553A45106l0731k7130k5838p137N040L272l499j0232j2814l146j2446k178m025
17540A4242q755K959P908O153m765k900o342l985p72N175j1392R991J1632j716
17526A7433j464j435O163Q329N628n902J512K587j6728M946J5376j611L609K895
17512D1338L744j1069k792q646j553M174J4955o856q528j636J34l353r066J436
17498A2282J1752j827j3343l389j0039J1780P840m222k3426q555P212O328J7837
17485A0230J7722K957o278j0815j4930J0022R136o561n161j356k935o118j9920
$$ y = [8861, 14081, 17164, 15217, 2987, -1957, 12845, 11627, 1726, 17688, 28264, 32620, 32001, 40439, 50143, 68379, 82949, 108192, 146127, 187971, 196935, 177556, 151526, 152214, 162350, 168103, 173583, 145106, 114375, 87245, 61407, 54270, 59310, 62582, 59083, 48851, 36037, 32891, 20445, 18267, 14242, 5487, 8446, 16354, 22507, 17742, 14842, 8500, 4515, 3743, 8918, -2474, 7517, 19149, 17433, 15969, 14534, 20697, 29026, 34654, 28752, 30264, 32851, 16123, 21069, 36445, 34834, 38443, 41338, 45082, 34013, 31221, 22575, 21022, 25196, 40151, 33295, 24767, 23131, 23265, 19912, 10846, 12282, 24034, 22207, 8864, 5475, -4564, 7216, 15056, 10834, -12592, -21147, -13935, -7607, 10230, 27952, 30909, 24631, 13816, -1114, 8908, 18044, 11483, 6322, 4966, 2031, -4087, -24007]
17472b4007j675P272Q793Q686K836q679o810J2206J2038l504R327J0645j1310
17459A5818m030J1011L126J2180k091k2772j1212J8097O52j5797k477P398J4011
17446B3914J2408R430K4335L3679K4324P72k2020l6679m3300j3708J780k604P593
17433A9924j4688K328L948j0418q616o535J9046O260K454Q31p903q548j37M524
17419B470L037k2125p469L863J6230J1767j303o189M196J1913N30j6691l620k881
17405f272J4716p313k391R957p33j6603n687J0348J883K831o510J1894K479l036
17391E563M564M88j3583l420O842n194r071J921p155k59P982J3305l965j1242
17377a3224L310O501k670j411k338r121J3548k214k523N511Q992q521k574k264
$$ y = [-24007, -25682, -18410, -9617, -931, 1905, -6774, -13584, -1378, 10660, 7156, 16483, 27128, 15818, 11788, 22799, 25925, 38105, 36014, 13242, 2030, 20127, 20779, 4982, 2505, 9903, 23914, 36322, 45752, 70087, 103766, 128090, 128862, 106842, 70163, 26863, 13155, 14935, 12331, 19924, 5236, 7564, 11512, 1094, -7522, -14057, 4989, 11249, 13703, 14534, 6631, -1917, -2054, 2470, 5507, -16618, -24087, -20224, -3994, 7773, 6470, 281, 4477, 16390, 16920, 229, -3391, -6272, 8444, 1131, -1260, 8697, 7964, -8639, -14326, -3978, -2095, 736, -5774, 6120, 8599, 5563, 10127, 10615, -2968, -6388, 454, -4740, -13811, -11890, -19045, -19304, -11322, 1983, -1982, -13224, -9914, -3413, -6083, -7494, -9832, -18953, -5405, -7619, -10142, -4631, 4361, -4160, -6734, -8998]
17363h998P557J5363J3835K464o967k7768j3694k936m762J0296Q733N961R38n262
17349e240P255r912o190j2754m784K1977J9109K869j5041p272R571J0934K452
17336A2974k251m982j5310n063J6117M207q326J344P727J906l331R942q732m868
17322A354M673K0694L442j9928k2226l444J0443J7186L237j1003m455R793K042
17309A1808r213k510r46M712M239L382q520P705k869o724l576N22R607k940j7360
17294a2683m744J5079O252O05q27r235K742M109K211K4O614Q574j0521j4447j5817
17279b2064j339P157M784K880p349J2192J2376n911p701M902M140R576l476m570
17265E597L49O353l317j0061r92Q647J299j6089p285P775K361n887K54J53L876
$$ y = [-8998, -1441, 13922, 27757, 30221, 23254, -4514, -18208, -21144, -25906, -15610, -6877, -916, 22, -5240, 2015, -7897, -14087, -26841, -31625, -9648, 9461, 12330, -2711, -9983, -412, 10522, 12974, 10723, 5741, -9569, -14632, 1485, 5692, -2634, -1290, 6437, 8343, 5012, 14954, 6222, 1354, 6027, 26721, 30163, 10235, -11991, -15435, -4992, 12194, 15431, 4428, -27, 9766, 11808, 2595, 85, -861, 3851, 8090, 11472, 2952, 10657, 7788, 1064, -2512, -1990, 7617, 4677, -12683, -17427, -2348, 3904, 4509, 3682, -5553, -2811, 1298, 3509, 3533, 10147, 18721, 8200, -6247, -22064, -23403, -16246, -11462, -8582, -15931, -3739, 8637, 2726, -4975, -73, 4067, 13643, 10167, 5597, 5946, 12299, 8982, -1079, -2071, 6576, 7875, -8214, -15499, -7724, -5363, -11250, -10996, -10843, -6967]
17250f967L676J1457o141r728N852J0379q140N069J0807L407j2972K038m168j062
17236C507N033p89Q0K74n009l170j401j734L242n48q27o993p098M659J2739P563
17220I528m550L395P465r383Q552r24m773r424l542O614k514j1329r639l952J2560
17205a1916P561m102l431M987M351j1531k937l131J6727J4649p697j1183j1136
17192a8789n381Q442J1120J140j3972L983J510k60o581k605L295L838R489r313
17178a4084m336J1903p190j853l1O78M532J1949R995l846j8771j0279N801k067
17164a7599J0690m024m574N353K4842j848q584J965j3540k0272p581P872J890
17151b5410j76J5410L340j300M539N611j4977j0975o054m43N984M112o49n63J1698
$$ y = [-6967, -3291, 8166, 2025, -7703, -1851, 8528, 388, 5457, 16264, 19671, 6699, 8737, 4569, 3507, 8540, 7751, 7831, 8105, 3096, -74, -1475, -3209, 33, -515, -1342, -8335, -15433, -10774, 1965, 9528, 4978, 8373, 15838, 6455, 15007, 14083, 9310, -114, -3656, 2958, 444, -10885, -20524, -24476, -11916, -4355, -8457, -11888, -6901, -2550, -14081, -17018, -20149, -3422, 11227, 3530, -7653, -18789, -24170, -15728, -4608, -3468, -17440, -13457, -11947, -12207, -18788, -21393, -18098, -14260, -4771, -14084, -18420, -6517, -13707, -15560, -15591, -14913, -10381, 1568, 11563, 7717, -11054, -21333, -15532, -17599, -6909, -10933, -15507, -10154, 14688, 12840, 4256, 6221, -7319, -27591, -35172, -27300, -25410, -25586, -10176, -6836, -8136, -3597, 2014, -12963, -23938, -29992, -30435, -24451, -20339, -20988, -21551, -9853]
17136i853K37Q286P943o658j2986L049J3870J3837M647M904o745j405r627J721
17122A1220r988q816Q252P412O412M362K584q297l735Q94l148J220j0345j2662
17108a4635k613o378N62K079J1279J710M919R940K423j1487k4558p333K0435Q322
17094e335J942n402m121N662K5098Q025j1588r780o771j078N259J3063J0266l825
17080B1415j3185j8517J135M306J3098J3960k924j4760j0716p892o86N558j101
17067a0309m290l863o505Q656J6997L326p005l684j345P930L596r740M960K717
17053A441J818J1925m00M5j2003l598l348J487R424P027p940k160K466j590n847
17038a253o753k60J609P879o205m012R974P994O031q784K282j4149l608R164Q92
$$ y = [-9853, -9616, -1330, 6613, -45, -13031, -9982, 3888, 17725, 22372, 27276, 20531, 19126, 9499, 11220, 1232, -7584, 668, 8080, 14492, 18854, 21438, 13141, 9406, 10300, 7152, 8372, -1973, -14635, -17248, -23626, -23064, -20985, -9706, -7996, -3077, 6863, 9286, -2201, -26759, -34092, -13657, -5335, -3393, -8795, -12916, -7254, 17844, 25869, 14281, 4501, -2270, -3348, 1911, 14974, 25240, 21415, 8230, -10287, -9152, -4846, 8252, 22212, 19288, 4528, -6188, -14080, -14766, -9208, -10309, -14599, -18462, -24967, -16311, 686, 4012, -2993, -6677, -8022, -92, 3504, -6236, -1276, 1441, 3259, 15184, 14784, 14829, 2826, -772, -4120, -2633, 6791, 13818, 5878, 3718, 6184, 4594, -1253, -8006, -8266, -6657, 1222, -4983, -8995, 979, 8973, 15004, 6220, 8502, -5647, -9255, -91, 801]
17023H01P616J3065o662j7307M021N913j4640N869R632M159j1019j726R053K801
17009A1576j0458n223j4165M993K3036Q471m107j5613P637O765M149P851j2155
16996A2757J704M623j2545j926K662o519N950Q262j837r255l66N92j3463l404
16982a2765Q968O593N204J907j1482q668Q971J4132J0880p763n415q039J94l923
16968a206m607J79j580O951Q192K112l70j0847m553j7880L692J24M948Q915O461
16953E31l57k599j0997l408j1073l193o338J5915J6656n379p26J2057p751J22
16939f540p28N12R21l752K581l805k455M112j555K22J217j2164j5821P83J7256
16924a9216J393O276n363m478J0615J3044j141k867j2559k610R093L204L968p891
$$ y = [801, 8417, 21482, 14820, -2487, 1534, 7447, -7193, -1324, 8308, 12467, 1448, -278, 8775, 11576, 1118, -4105, -18270, -13277, 9759, 18230, 14123, -1490, 6147, 12912, 17061, 24912, 12757, 14461, 19084, 6539, 4613, 7275, 756, 6706, 14968, 13131, 3876, 3510, 4102, -9361, -12765, -3797, 2796, 8000, 9907, -1575, -10243, -1272, 12860, 23740, 15977, 10562, 2523, 2717, -1206, -5813, -5634, -7214, -263, 7929, 10041, 9671, -1176, -5729, -23609, -19917, -19793, -14845, -5930, 531, 174, -2425, -13422, -16830, -27903, -31096, -37434, -21519, -4863, -10242, -10968, 1089, -6662, -6540, -7268, -6756, -5835, -9587, -7006, -10811, -13266, -9154, -10709, -10487, -9270, -21434, -37255, -36472, -19216, -17823, -11547, -16910, -21388, -10773, 2271, 1130, -1737, -14296, -16906, -7813, -4609, -641, -8532]
16910h532N987J5721P500j0830m45n355j3526N787K678j468l181p324P722l564
16896h830L974k239J5640J6501j6007j0779J440J312L546J2410k038Q72J1032
16883B6834o151j7893n301p506p851J0456J0200q611m217K747J402L36n77j978
16869h110j2978N27L492N443J3304L144o278R313P55j4191j3152k698J2502M597
16855d330M746n91K609m8O20L359p72N748m784J37P904K740j7081j6021j336M709
16839a2391J4143O703p767o798p727K853p359P697J3030J431j5045j9520N376
16826b5374J8902O652j4989n237L6598K5354K943j0597q667j5331j7476N538P345
16813E661O94K173l949n422j0323L155N758J0172Q84j803k037K046k254L352m960
$$ y = [-8532, -2545, 13176, 20676, 9846, 9401, 4046, -9480, -3693, -1015, -2483, -5664, -12988, -5266, -8830, -4856, -7095, 8545, 25046, 9039, -1740, -300, 1012, 4558, 16968, 14930, 15802, 26834, 20683, 2790, -2511, -10017, -17868, -7412, 2788, -5823, -10040, -7293, -5891, -5555, -6132, -8110, -21088, -20561, -17069, -11626, 1678, 4822, -1456, 7857, 8612, -5579, -18731, -21429, -8927, -4330, 416, -175, 2434, 2386, 3006, 6365, 5593, 11341, 6557, 6694, 14598, 17338, 257, -15764, -17100, -12391, 1752, 8455, 688, -6110, -13837, -10984, -18343, -10646, 2384, 3815, -11230, -30750, -25374, -6472, 180, -14809, -20046, 16552, 41906, 44849, 34252, 25585, 10254, -7222, -1684, 5661, 6355, 8528, 4579, -843, -11166, -8011, -2253, 7919, 8803, 7000, 4963, 7009, 4755, 8107, 3147]
16798C147l320m468j128q298K59J0367K0265R752J096m346m554r782L16P73O119
16783A6198Q261j848r280q994O361j287K245J005j340k117P236o309L791N288
16769A9210q323n853j1321j4939N326J8479J0081L175l051m311k2112o010M227
16756a5422K2852J610j5668J178K831R490n8m107n458p550j118J1317N842J6280
16742B2019l70m751L954r832o727O46j644j4269n812J8675J5158j055l688j078
16728A1226j843j082j0737j7956J2803M497k658j1478l185J0349K550M110l862
16715g266j5517J1036L776o93J248O312j0298r105m80K488l93P854m597r638j283
16700b6556R347O293J2872N101j245j3129k662K498j872J0516n193j977P467Q670
$$ y = [3147, -173, -4641, -5769, -14067, -13808, -3441, 16824, 26576, 27672, 23326, 18772, 8990, 9306, 10079, 16198, 24459, 22611, 13331, 4337, 10698, 9411, 11656, 12661, 11321, 9204, 16440, 10131, 13922, 19210, 10887, 5034, -6287, -21226, -15900, 2579, 12660, 15835, 12784, 8473, -13639, -19649, -15422, 7430, 9040, -6628, -5450, -2619, 6871, 6813, 2706, -2752, -10302, -11420, -103, 5739, 22019, 21649, 16898, 20852, 11020, 4293, 4939, 3295, -10974, -16786, 1889, 17047, 15992, 12304, 11226, 9383, 8301, -2436, -20392, -7589, -3092, -5750, -17228, -20413, -10064, -7514, -3404, -7266, -22783, -11747, -7971, -8664, -7416, -1104, -11402, -20507, -20987, -18499, -18892, -11038, -15635, -25273, -26556, -17209, -10916, 1956, 7057, 5812, -7317, -9979, -7481, -9353, 1163, -4030, -6007, 1460, 10130]
16686A0130k10o601k97J108K481P906M881j8091j7631o966J3248q381L210N538
16672i675M781N349O250p821K610j0377O40P487M855j717j2920N56L768r351N386
16657a0179M481j8861j3555L921R495J0706J758j555o062j184Q992L391J552J403
16643e697J438P903R152k3236j4961o30l573N292J1274p2J6873O529n380j075
16629C837j729l43j2952n099j0517p210N879R206J9094J1742k2883j873J7350
16616D502J0255N034j2804j1608l701R124j682r056j493m51l171O101l852j5156
16602b7958j2642R292J0121J1089R576p842M569q775m324O309J7600o033q322
16589g340m245J875P36p191p985J4466K1766l929j5169o374J1553P406j2572L460
$$ y = [10130, 9920, 3319, 3022, 4130, 6611, 14517, 19398, 1307, -16324, -23290, -10042, -18423, -15213, -9675, -4894, 455, 6705, -1116, 1494, -8883, -8243, -756, 4099, 2382, -10538, -9982, -6214, -15565, -10179, -5698, -24559, -38114, -34193, -24698, -13992, -12234, -13789, -19851, -21035, -12043, -8652, -7100, -5697, -4259, 3644, 12796, -10440, -25401, -26031, -29604, -24312, -13038, -13110, 3763, 10292, 4912, 3837, 2108, 1765, -11187, -16286, -26803, -34013, -28134, -18928, 166, 11908, -10975, -12848, 4502, 14757, 19791, 6987, -4621, -8322, 802, -880, -9936, -11429, -11880, -15051, -8950, -12802, -27958, -40600, -31308, -21187, -10098, -522, -8364, -3795, -12570, -16894, -10585, 7015, 982, -7340, -11585, -9710, -8974, -16165, -24150, -9684, 12082, 8153, -7016, -13390, -1837, 5569, -7003, -3543]
16575c543M262j483J5288M737r28k721r211q351j5066L233L418Q553P369p485
16561a928j0545k153n289l369M274J3281R122j466p426j3362K899q771L348L72
16547b1013o902K829Q52M353M229K649l365P77M785N165J1275P751o548K586o915
16532B508q323j0098N70J764Q981P209L566L652L822j0531l871q79j7303r633
16518b8566P514P851J0972N012k026M786r134Q621K072q43L667j997n327O252
16504H854o077J0919K8j5777o899m276J091m954J674L882N785N785j085j535j029
16489c614O936p42k580j3583j5274j983n737j20L761R320J3401j3730j650p01
16475b6296J546J0412J4769j649K172j603j748N989P345J689M07j0028K35K445
$$ y = [-3543, 719, -764, 14524, 19261, 18333, 15612, 6401, -1950, -17016, -13783, -10365, -1812, 5557, -1928, -12473, -14626, -19915, -23284, -19010, -5729, 3393, 1927, -5499, -18861, -15962, -24733, -21385, -21013, -27915, -25086, -24234, -19881, -15652, -13003, -16368, -15591, -10806, -5641, 5634, 13385, 6837, 9423, 2508, -5815, -15913, -15343, -13579, -4598, 2611, 6177, 9829, 13651, 3120, -751, -1630, -18933, -28566, -21052, -13201, -2229, 2783, 757, 5543, -3591, 5030, 7102, 6259, 9926, 7929, 2602, 8854, 2777, 13696, 13724, -2053, -8952, -13228, -12137, -17091, -15417, -11535, -5750, 35, -1050, -2585, -3614, 3322, 2580, 0, -13583, -28857, -30840, -36577, -36697, -32936, -23616, -10215, -23945, -25595, -26296, -24750, -14338, 431, -1218, 954, -649, -2397, 3592, 10937, 12626, 13033, 3005, 3240, 5685]
16461E685K351m257k1615k339m348K389O01K082M822J3097K227k048l685P011
16447A973N731m83j2172n588N451Q00R896j029M920l95N90L811J659n323o323
16432C518j0677K880J6310K0700M631j3384L37J969l535q283l627K186l711j6470
16418g156p037r55j225J7742p255J6534J3075J0643M955K1054R874j0282r752
16405E0215j4766k1455p889j757r799o30n14L198J368q75j147P800L814L374r189
16390A748N668R948J0832O045R589j0269j6484r513P39j90r477L634l184M136
16376C222o545Q006J5781j1162k2695o238R690L389L941l854o611L435J445N464
16362b732m675j2831n908K746l32O401N040J4769M404p820R729N185J396j1955
$$ y = [5685, 8036, 3779, -17836, -20175, -24523, -22134, -21533, -19451, -14629, -1532, 695, -1353, -5038, 1973, 7704, 7221, -4951, -10539, -5088, -4288, 5608, 4579, 9499, 9104, 9694, 13505, 15164, 9841, 3518, -7159, -4279, 12031, 32731, 37362, 23978, 24315, 26284, 22749, 14466, 10839, 13025, 9314, -7156, -14193, -15148, -16373, 1369, -5886, 10648, 23723, 34366, 39321, 60375, 70249, 59967, 50215, 35449, 13994, 6105, 4348, -5451, -6081, -6595, -3397, -2029, -2904, -4051, 3749, 7563, 10937, 1748, 7416, 17364, 28196, 34241, 43830, 33561, 17077, 7564, 8303, 8113, -1364, 2270, -914, 3222, -3323, 4683, 20464, 9302, -13393, -19631, -9941, -6552, -2611, -6465, -13076, -9641, -8196, -2732, -7407, -20238, -26146, -23400, -23732, -17331, -12291, 2478, 6882, -938, 8791, 13976, 15372, 3417]
16348C417j2753k442J252r6j613P707Q981k684p971k834K859k22k367J1509J3852
16333A6595l823k5432n651n552N030J3109K5017N870k847j4405m248l251N351
16320E763J5550L035j0916k8071j2094m60j176J11K839r687r533L782K4166J2779
16306c912j283q473j0807N665J8177J3071m748n131L233n405Q7p852j5645j255
16292b4278J1877J0673Q739N541r992j8995R495J4543j5527Q110p239j8411O24
16279b4840K0568J5046j1344O272P688j5091j8370j599N57O073R320q396R996
16266d120m647n809q102m972Q594k68n336L925n799m186O071K0765J8181N172
16252A9469n372k808j1711j1601l42J632j242j0920K099K952k161O839R555l239
$$ y = [3417, -9336, -11778, -10526, -10622, -12235, -4528, 4453, 1769, -6202, -9036, -6177, -6399, -8766, 2743, 16595, 12772, -12660, -18311, -23863, -18833, -5724, 19293, 25163, 22316, 7911, 3663, 412, 5763, 21313, 24348, 13432, -14639, -26733, -27193, -28369, -28258, -25419, -35106, -44639, -40857, -16691, -3912, -5195, -13668, -24475, -18810, -633, 12438, 7690, 2559, 5792, 387, 474, -7378, -23023, -24278, -12401, -1728, 7011, 12552, 2560, -16435, -6940, 7603, -7924, 186, -7053, -25464, -24840, -4272, 10774, -570, 5702, 13390, -1701, -20071, -21670, -21113, -15040, -5720, -14116, -4120, -8767, -14576, -22678, -27650, -19056, -19324, -24660, -20735, -26534, -30720, -24649, -3884, 14297, 19469, 14097, 11289, -422, -12023, -12365, -10733, -11975, -22895, -20796, -17844, -20005, -13166, -3611, -6850]
16238f850j3481k2830l342Q684J0066J1210J2082M560q33j1206j2257p543J9009
16225a2731M506j3415k689k054M935N980P411J7751j097j1857j8144K649N412
16212a3343J9405J1071m547n876N636q260j7189k259n535p5Q18L233M846J2546
16198D71q531j0151j021l808j3379Q776J4912J1251K67r075l006m256k314n179
16184b5043j218k95j1756R237J707N371Q907q883o208j427J878J652K711K562
16170b0805L499J0554O951p741q940p99M78J0450J532j1634M200J1381j0205q894
16156a9973R02J0634J8430r23j1335j1470J5752Q559j3298K238J8128K828j5773
16143D699K637j674j4346P595J285j6168J661J1985J4186j122k844m423o970P612
$$ y = [-6850, -20331, -43161, -46503, -37819, -27753, -16543, -4461, 99, -734, -11940, -24197, -31740, -12731, -8225, -21640, -24329, -26383, -21448, -15468, -8057, 9694, 8597, -3260, -21404, -18755, -13343, 6062, 17133, 12586, 6710, 12346, 4086, -13103, -15362, -20897, -20972, -20154, -16921, -12075, 471, -8060, -18211, -19232, -23040, -36419, -27643, -12731, -1480, -1213, -10288, -13294, -17550, -19864, -25043, -26261, -26556, -38312, -29075, -27368, -21997, -13090, -21973, -28181, -29608, -27730, -26078, -23367, -20805, -17306, -6752, 199, -7542, -16482, -17281, -16803, -6353, -4821, -16455, -12255, -874, -11079, -19973, -19071, -8437, 9993, 9070, -2265, -13735, 2017, 10576, -2722, -484, 17644, 20472, 4699, 7336, 5662, -8684, -1089, 196, -15972, -14311, -2326, 11860, 10738, 7894, 3471, -3499, 4113]
16129D113j6711j6320P231l577M644O845N945L668o227O72j2802o155m53J2509
16115a6618M89L619o56j897J180J6816O009m44k494R015R516p855j8097j5696
16101a7113j684m64L816J1887K862n143q21K900o416j269K602K337M64Q363P524
16086I845k536j1026m179m788q21N198Q692r345n620K911j3910l936J1359O021
16072a2135L919J3738L328m636j7732j05j2399q700J5876N526j897k026J8869
16059A626J3850K968k310l025j1914q26k674o563n198K388k847p050P213R360
16045e002O161j1026k929J0716O177m983q476N097P358J0159l68n473N027J861
16031A4299k515m121j2223r72K711M313N476r104o574J7303m491M125k135r4p17
$$ y = [4113, -12598, -28918, -21687, -25264, -20620, -13775, -7830, -4162, -10389, -9717, -22519, -28674, -29127, -16618, -16129, -12510, -13166, -15063, -13883, 2933, 8942, 8498, 6004, 15019, 24535, 16680, -1417, -17113, -18797, -19261, -15445, -3558, -696, -5839, -6660, -3760, -10176, -11445, -8843, -6506, -6042, 2321, 9845, 7309, -3717, -7896, -12684, -13505, -8307, 385, -8960, -14580, -11669, -25579, -29515, -18156, -12135, -8216, 5522, 8850, 4214, -13518, -13623, -26022, -34722, -18846, -13320, -15217, -17243, 1626, 15476, 18444, 16134, 13109, 1195, 369, -2305, -8868, -14066, -11678, -14525, -21575, -14362, -5002, 1159, -9867, -12796, -2080, 4097, -886, -9362, -4265, 3093, 13252, 12884, 7411, 12438, 14299, 11784, 7663, -4560, -5532, -2821, 1492, 6968, -2136, -8710, 8593, 4102, 8227, 6092, 5998, 5281]
16016E281m123j0327l778J501Q253J017l85n354L038J1431k106q63n525o808J240
16001g508j1338Q056J808O062P345r725q484Q305J516M085J9839M28j7450M567
15987G506Q652J66k1166n872m437M829l115J630J99J316M068J9534R530j5800
15973G040p561K066K631j2240q595L061O017L491L22K299j442j0064J373J2949
15959A347M335J0610l964j2304j2190k479J512m141J320L506O165K025J2596O139
15945A4477m578j9185K84j685O40Q072K950J2423M989q704j4942m95L266K708
15931B20n11L407j2728m586J7923J4320M313j0691j0126R038J0271N670j3222
15918A3298j7586Q294j2358j3073M227J4753M36m497J4204L973j9369j2678r9
$$ y = [5281, 1158, -9169, -12947, -11446, -3193, -2176, -2561, -7915, -4877, 6554, 4448, 3585, -1940, -8748, -7508, -18846, -10790, -8982, -2920, 4425, -5300, -13784, -5479, -3963, 122, 19961, 20389, 2939, 7506, 16158, 16324, -4842, -10714, -15151, -10322, -13437, -11807, -11608, -10292, -6224, 13310, 22840, 7040, -521, 1545, 4176, -8064, -16659, -13598, -7581, -4090, -3768, -1469, -2911, -12975, -11602, 1347, 5682, 16292, 12328, 24, -12166, -14645, -13133, -17274, -15954, -12448, -6283, -4258, 8338, 14477, 9899, -9286, -9002, -10687, -10047, -1975, 975, 13398, 18387, 9683, -5259, -5754, -2488, 220, -291, 3116, -9612, -14198, 3725, 18045, 22358, 11667, 1541, 10579, 20850, 26520, 13298, -4288, 4006, -8352, -21425, -17198, -2445, -2009, -6506, 7698, 11671, -7698, -20376, -20475]
15905b0475o160J1343J0324j489O217M475N214L92l581M323K405l922M088j1452
15891A702q007L663p106Q9J94K456L912j4865p309J9965J2549p090j6946j1886
15877b8679J542O211J2052J2481q509n952K185L499N668j1832j0071n916J6071
15864a1250M034m840j799k386l360n238Q170J0866K946j470O461Q51k045M09m703
15849c354K675O449L406n981N001R475K705j2482m273M740P2k77M866p250r179
15834c407l227m473Q098j219q604Q453M962p207K443P25r128L304R021M378J5908
15819B0027O21j3982L793j5306j7543Q633Q828l089n43P22l023q962J4921L283
15805a620K713p89m439J1185p6R199P008m835o174J707n025j505j0714q616j73
$$ y = [-20475, -26635, -15292, -4968, -6457, -240, 4235, 9449, 9841, 6260, 10583, 12988, 9066, 13154, 1702, -6305, -2642, -9748, -9659, -9465, -7009, -3097, -17962, -25271, -5306, 7243, 153, -16793, -28679, -27137, -20926, -8874, 3607, -4902, -10854, -8669, -5170, 498, -11334, -21405, -27321, -11250, -7216, -12056, -13855, -16241, -19601, -24839, -16669, -5803, -2857, -4327, 2134, 2985, 940, 1349, -3354, -679, 5770, 9176, 3195, 8196, 17671, 20376, 7894, 3621, 8361, 8433, 8156, 13022, 5772, -3407, -6634, -11107, -3009, -4228, -12832, -4379, 583, -6624, -4181, -3456, -12584, -9280, -259, 4119, 20027, 20648, 6666, 10459, -4847, -22390, -13757, -4929, -8018, -8561, -7839, -10862, -19824, -4903, -1620, 1093, 304, -4135, 7050, 6974, 16173, 23181, 18346, 12172, 13879, 8854, 7349, -3365, -11981, -12154]
15790a2154K882j576p810m817O062M606R343J634r194K988J1167J4244L464r196
15776A1643j2606j779Q279m227j0633r589N864J3833k50j106J0181O326o144q771
15762A021m34j016p974m577r818L630n867j0279R688J5200j558K376J816J0179
15748B387K165m074r667M054j591Q770j0766o865K145R473j1554j087J1373P474
15734B237r838j7106P840J9727L949r131J392j1953P143R548N22j2865k70J1848
15720C043r193R383L894j1701O605o994o240j53M884q937O770K077O104j7177
15706a7635j150n875K118O734l840m987L94J4299o90m590o405o895O024M979j0494
15691b8013j704O077L232Q196J0530J238j0422l47M287J715n242p107j972J4562
$$ y = [-12154, -9272, -10848, -18658, -23475, -17413, -12807, -3464, -1830, -11024, -8036, 3131, 17375, 20839, 11643, -963, -2742, 5537, 1310, -9323, -18912, -13048, 785, 535, -571, 9610, 15936, 9792, 1021, 587, -429, -8403, -12980, -22798, -19168, -25035, -35314, -25626, -10426, -11984, -9608, -7792, 2387, 4552, 478, -9189, -5135, -6726, 2044, -8722, -15587, -13442, -3969, -15523, -16610, -5237, 2237, -7601, -24707, -16867, 2860, 6809, -2322, -930, -12883, -5740, 3808, 4330, -8535, -8805, 3043, -6150, 3233, 7127, -4574, 2031, -4963, -11203, -11356, -6472, -15409, -8639, -6562, -458, -17635, -18785, -24660, -22542, -15808, -19648, -24635, -24241, -9942, -10632, -15222, -21627, -28522, -22498, -17519, -28013, -29717, -23640, -20408, -12212, -1682, -444, -10866, -11213, -6926, -5211, -10453, -17560, -19532, -4970]
15677d970K1974J3782j2880j2043k1661N154K0132Q536o116o505j1476K356K713
15664a004p419K726O282L384O116L056J64j1979q467L659J3871O377r826o581
15650C59j3224k749m679J4193J1499m346J297l9k291k159j7949o411j1522O652
15636c1369K8177M269j8473n788O838O545N703q027n188J9621J9174k182K578
15623B1878k119q957j8092p914p427J912J2850O275P37M30N486q985j0088J4302
15609B88P322m25m716j0550J0058j149j4870j1110L3J0193R601P746m020P166
15595E567J361p654L507J287j03j8576N73R108Q141Q111n392n38P823K51l11O029
15579A9184O963o682O641j1790j227O683p250p305J4363q023j1626K510O285j0070
$$ y = [-4970, 17004, 30786, 17906, 5863, -15798, -10644, 9488, 18024, 11908, 5403, -6073, -3717, -1004, -8423, -5697, 585, 3969, 10085, 13141, 13305, 1326, -7141, -3482, 10389, 16766, 6940, 359, -12865, -15614, -20293, -6100, 5399, 1053, 2350, 2311, 20, -2139, -20088, -26499, -38021, -31369, -3192, 1077, -17396, -23184, -16346, -9801, -4098, -12125, -17313, 2308, 21482, 19300, 21878, 19759, 10802, -7290, -15204, -22631, -20719, -7869, -1594, -857, -427, 5059, -3926, -14014, 288, 7610, 7185, 2469, -8081, 1977, 828, -14042, -25152, -25119, -14926, -5325, 2421, -1599, 5567, 6928, -726, 2781, 4068, 3965, -14611, -14038, -4930, 3211, 11322, 5930, 5392, 13215, 13466, 13155, 19184, 26147, 19465, 26106, 14316, 13089, 19772, 12522, 5217, 19580, 11557, -69, 2441, 8726, -1344]
15565a344r977J2072K565O394L191L184m372j5268j1558N674o091m035K282O038
15551a1245P241L685J56N936P016j2003j2962p75J2024M946m451j1192j0180q855
15537c0659l877J0346J3801J2702L602L004r35j6748J330N44j2184o359m174R481
15523b0126L445n312J701K561P009k913M876O724N940K412k146o218o823n065
15509a3935N574O072j7151L703N952o802J404R797J7620o130M67J2523l898q479
15495F717r258K837K901k6j701L502K695p007j3401N448J740N41q12L661l864
15480f027K508K317p105P006Q441L14j4184P180n071k519J0595l572M605j157
15466C331j0298J0207k871p744l314l454n613J67N326l216m340M330K5405L925
$$ y = [-1344, -11321, 751, 3316, 9710, 12901, 16085, 11713, -3555, -15113, -9439, -15530, -19565, -17283, -11245, -4004, -319, -163, 5773, 12789, 786, -12176, -12951, -927, 4019, -432, -11624, -21804, -30659, -34536, -24190, -10389, 2313, 5915, 8919, 7984, -8764, -7434, -6890, -19074, -25433, -29607, -20126, -16681, -21993, -20292, -17731, -10722, -13635, -8759, -2035, 3905, 6317, 4171, -2047, -8870, -13935, -8361, -2289, -19440, -15737, -9785, -16587, -15183, -5386, 12234, 6104, 6571, 19094, 15196, 6717, -2541, 296, 3197, 3171, 1470, 4972, 7667, 660, -12741, -7293, -5553, -5012, -5824, -2163, -6027, -3519, -1202, -8307, -1301, 7140, 7454, -6730, 450, -4621, -7140, 3455, -117, 4488, 3331, -6967, 3240, 369, -7375, -10689, -14143, -19756, -19589, -14263, -17479, -21819, -17489, 7916, 11841]
15452A1841j0090j2862j182J0713N880k1980o127J2750P617O848j2714j133J169
15439i270P850N01O756J32n358M665R184N643j9079p803M737j806N675O76j0374
15424g871n259J2209o888N244q381O838O734r232O250j9551n472J5416R425M371
15410C833J5331k451q60p152n392J755m205K769N1O738l982p991J1484J002L224
15395A4154m103r747J882N862K3053K6749J2151L1206K0083k961l1652k2823Q59
15382F4713l312o653j4573j2982n909J3089K31m676j3O85J5419J6342J9228J8553
15368A00142J827j404m570j5150j8569l6275k5696l203M827n908N176Q845Q58
15355A0900q277K16l091M090k413j626j0041l523J4060K1195j0381j2900k987
$$ y = [11841, 1751, -11111, -12293, -1580, 4300, -17680, -23807, -11057, -3440, 3408, -9306, -10439, -9270, -1420, -919, 5837, 5969, 611, 5276, 14460, 20103, 1024, -6779, -2042, -3848, 1827, 2503, -7871, -13130, -921, -7809, -2565, -10946, -4108, 2626, -6606, -356, -19907, -25379, -9963, -538, 3833, 19164, 16713, 15853, 8701, 3309, 5064, 859, 3628, 3679, 10417, 6435, -1556, 9928, 10930, 14154, 10051, 304, 2186, 8048, 31101, 57850, 70001, 101207, 121290, 118329, 86677, 63854, 64713, 61401, 54748, 40175, 27193, 21284, 34373, 34604, 29928, 29915, 30600, 46019, 62361, 81589, 100142, 101969, 100565, 95995, 80845, 62276, 26001, 305, -2898, 1929, -3979, 1197, 10042, 10900, 2623, 2839, -252, 3838, 1425, -201, -10242, -13765, 295, 21490, 11109, -1791, -4778]
15342d778J877P930L904N452j678j0925O27k356n369n565p736l736k315N816P886
15327a0966P749R60J148Q9p201r2L650J5175K219r490L999J2622q851j1389k3943
15312b4321m060O723K3332J5524k337q526q902J874l951J722J5957O811J205k240
15298A8811j788L574j33k0289n799L024p865J2368Q007k203j0645j0808J627M301
15284g818k965p124O092m797J0818N978P176r074p804l431K376J1937M876P433
15270A3673j198k004J1044k885o010j1187l904p644k048L964m209n445O71P226
15256i956r2j2709j0617K933J8449P944r721O0J1614K23k074J525K072k517m117
15241f983Q0o79M718K278K701k829j2455M82M442j449j2484J8066L1837l099j0408
$$ y = [-4778, -2901, 5029, 8933, 14385, 12707, 1782, 2409, 53, -5316, -10881, -18617, -22353, -24668, -18852, -10966, -3217, -2257, -1109, -1020, -8221, -8313, -4663, 10512, 12731, 3241, 7240, 19862, 11011, -378, -24321, -28381, -21658, 1674, 17198, 14861, 6335, -2567, -693, -4644, -2922, 13035, 19846, 21051, 18811, 17023, 20597, 20464, 175, -5624, -2600, -10465, 1903, 9910, 7707, -2938, -13746, -12119, -7818, -10783, -17907, -11815, -16612, -5794, 184, 7360, -1714, -9518, -12949, -10573, 1364, 6240, 13673, 12475, 10471, 21515, 18630, 12620, 1433, -2471, -10115, -12163, -8199, -12408, -17853, -17182, -9956, -10048, -22757, -33374, -30441, -11992, -4048, -13769, -13709, -2095, -1872, -3946, -2421, -349, -2866, -6983, -6903, -7582, -2864, -586, 2115, -714, -13169, -12687, -8245, -9694, -22178, -4112, 27725, 24626, 14218]
15226A4218j4004m735j4393J119J5109Q077r415J11J4903m198O29P582R868k563
15212B2308q202n913j575j0878q355M628K000M565K299J1676J96j4576k163o292
15198a0282k800K069m359j263L420k56J540J0715M401o366j0501P969L988p119
15184h844n215J4213K709r982J1568K780m27l728o180N211m596o358M129L050
15170a670K801L435l197k001j2Q752Q488J394k052R203q5m854j2397l846j4498
15155a0539j3465l715J2950k696q391N346Q021k806Q133Q463R44M257l046Q709
15141A2165K4437O510j4809k0215j4963R561N808K6j3613j3614k23k554M43O291
15127a4750J808n866j0653n751M313j386J3063K0297R026p595j4369N448O920
$$ y = [14218, 214, -4521, -18914, -17795, -2686, 5391, -4024, -3913, 10990, 6792, 7421, 15003, 24871, 22308, 14106, 8193, 6618, -4260, -12615, -7987, -5987, -1422, 877, 12553, 12749, -1827, -3990, -10282, -13082, -11013, -15372, -16635, -13215, -13471, -11931, -1216, 3185, -3181, -13682, -5713, -1725, -8844, -14059, 154, 2863, -7119, 4449, 7229, 6802, 3074, -3106, 2105, -2491, -8849, -4720, -1670, 1131, 4566, 1369, -632, -644, 8108, 16596, 17990, 15938, 25141, 25056, 20202, 7805, 3959, -10539, -24004, -27719, -14769, -17465, -25856, -20510, -12489, -15295, -7162, 1301, 2245, 6502, 3456, 12165, 36602, 43112, 28303, 8088, -6875, 2686, 8494, 8520, -5093, -18707, -18930, -21484, -21041, -14750, -12942, -18808, -29461, -35212, -30899, -32285, -19222, 1075, 10101, 2506, -11863, -6415, 505]
15114E05k082j2762j5351k555O847J8413r908O620n06l980j0690l739J9528K2899
15100A3239l470o619J051J832l049j4407j372J1379M905j4747Q31Q198o119R684
15086A336M323r43j3371r941M72P737J3069k629p073j1511p455J9229L940Q09
15072b008k495K197K164n993q470L209Q157r577p038K73M859N827j3737L241J3315
15057f076K734o713p468k405k828O824L012l384N390J0775k10m100P540j0028
15043f937k997J2384P191M153J79j382L781k189K181r148m893l334j9039Q101
15029a1949N381O252q868n734k685k979J3756Q861O040K368L329l767p571m571
15015b137L26J0186j5951k868J5373j582J0245o044n039j1369J0036j47p309l284
$$ y = [505, -1577, -14339, -29690, -32245, -25398, -6985, -16893, -10273, -10779, -14759, -25449, -29188, -9660, 13239, 9769, 3150, 4201, 6033, 2984, -11423, -12795, -1416, 3489, -11258, -10427, -2229, -8348, 1336, 5659, 4716, -8655, -18596, -18124, -10387, 2682, 53, -7020, -18531, -25986, -6757, -2817, -2008, -4503, -2306, -142, -6135, -14605, -11396, -3239, -12816, -19854, -19581, -14722, -8895, -22632, -19391, -6076, -3342, -10055, -17523, -19928, -22756, -15932, -12920, -16304, -10914, -139, -349, -4449, 3091, -6937, -9934, 2450, 9641, 13794, 13973, 12591, 16372, 14183, 16364, 7216, 2323, -1011, -20050, -11949, -6568, -316, -9184, -14918, -17603, -20582, -6826, 2035, 8075, 10443, 13772, 10005, 2434, -2137, -1811, 8375, -7576, -10444, 4929, 3347, 13592, 7548, 2509, -8860, 1176, 1029, -6280, -9564]
15001i564r579Q61K331Q246Q952k938j3292P356R924N124O394M126l670j6590
14987b319o687M458J0778J2681K803M563j4423J458l737q342j18O598n57j2575
14973e419n662N414J7005K006n523j2136o288l597o923K512J8678l413P79K847
14959B80M687o290M253j6544j893J9410Q307j012j5461l481L965n449p618n596
14945b2442J5629O485M528p269p844N878m061o981J1081m041J086L776O147l955
14931a983J99J3701K336o588p317j3132n12q537J1688Q797k970j0237j3363J1693
14917a6225J0751L997j3920K559P69j4122N33K235L459j110J6883J7938Q48j5852
14903a257j0559r474j5316m921K4760K713k953l635j5960R388M611l308J185K866
$$ y = [-9564, -19143, -18282, -15951, -7705, 1247, -1691, -14983, -7627, 2297, 7421, 13815, 17941, 14271, -2319, -9006, -4548, 6230, 18911, 21714, 26277, 11854, 13312, 9575, 1233, 1115, 7713, 7156, -5419, -11081, -5667, 11338, 13344, 7821, -4315, -10603, -14200, -21123, -18611, 67, -3346, -2567, 280, 4967, -1323, 2930, -13614, -15507, 3903, 12210, 11198, -4263, -7744, -3779, -9228, -16846, -22442, -6813, -328, 4200, -3069, -10913, -5035, -9096, -16077, -4996, -9037, -7951, -4175, 1972, -1983, -1784, 11917, 14253, 7665, 348, -12784, -13296, -21833, -10145, -1348, -4318, -14555, -27918, -16225, -5474, -1477, -15397, -12838, -12069, -26191, -25658, -23423, -19964, -21074, -4191, 13747, 14595, -1257, -11816, -21290, -36606, -41527, -16767, -14054, -17007, -20642, -36602, -27214, -22603, -25911, -24726, -21860]
14889b1860j4487q866M924J5863M35J1637J5182J3625k640r079j430k890L404
14876C818P535j3619j6054J5024J9154M598p455N321K057J943m923j3534l775
14863I0p687j0130L341L50J453l046n184O116r036K810k208Q175m99J2631K559
14848b65j80k635o079o226p661J4647K3149N807j1399j1624l352r022j7895k408
14834c5143J3909K0366J3680K647k162n715k908m151m096q348J853O0J2721j953
14820G60j1574J0923J478j9290R8J2316L963r300k50J004L605J484p265q412P93
14805a9667n699J596P650J1081k117J29O308n856k39p336j250J0826J3182o613
14791A995n561k537R87K2824J4850o23p250P22Q176j4079j1010j1791j5127k70
$$ y = [-21860, -36347, -45213, -40289, -24426, -23991, -12354, 2828, 16453, 13813, 4734, 3304, 414, 3818, 11353, -2266, -18320, -3296, 15858, 20456, 13001, 18322, 20379, 22322, 17399, 3865, 90, -7597, -17727, -14386, -14036, -12583, -15629, -20813, -14697, -23733, -20923, -23131, -14956, -15455, -2824, -265, -445, -3080, -9159, -15385, -23046, -8399, 14750, 20557, 9158, -2466, -5818, -14840, -32735, -35143, -21234, -868, 12812, 15459, 13297, 7582, 4674, 523, -3573, -11921, -10068, -10008, 2713, 760, -10814, 109, 1587, -17703, -17605, -5289, -1326, -10626, -10876, -9872, -6267, -4783, -12048, -20460, -19667, -25366, -23770, -16120, -5039, -7156, -7027, -719, -6575, -6814, -14150, -15400, -4574, 8608, 1995, -3566, -6103, -5116, 17708, 32558, 31935, 24685, 25407, 33583, 19504, 8494, -3297, -18424, -18694]
14777a8694J1880J0529k145J888K1352K252j2910L553Q802J3964J690k5468j5470
14764A223j1282j2931M900K586M301J2643l230r457l287m751q425J2991J215j3956
14750b7460n403Q454J7895k963j9961J300P350J9018J1309r245L644j980O48l077
14736d71k624j1939j806j068K637o785j0507N793L109J4713P41j8749M612J0156
14722a2188J105L168P302O787J1644l061N217K011J293j2076m8J0952j101q623
14708A2382K073p13n974L563j357l058L097J6511L721J3210K03J732k344j3370
14694B9676j6396r872l481l766o141j314J7233J1892k193K330M133n757k226K494
14680A6612J3455j07L688j3976q251j2047r272N646m364J648j1900J373L175Q167
$$ y = [-18694, -6814, 3715, 1570, 3458, 24810, 27062, 14152, 17705, 26507, 40471, 42161, 16693, 1223, -10059, -22990, -18090, -15504, -11203, 1440, -1790, -11247, -14534, -19285, -27710, -14719, -13504, -27460, -32863, -24409, -6514, -9477, -29438, -28138, -20788, -1770, 9539, 294, 3938, 1958, 2606, -471, -3095, -15034, -16840, -17908, -15271, -22056, -32563, -26770, -23661, -8948, -8207, -26956, -22344, -12188, -11083, -7915, -613, 6174, 17818, 14757, 19974, 21985, 23278, 11202, 11154, 22106, 21005, 12382, 14455, 13742, 7768, 11331, 9974, 6916, 10013, 26524, 30245, 43455, 43658, 45390, 43046, 29676, 13280, 3408, -73, -3839, -9980, -11294, 5939, 17831, 15638, 17968, 22101, 16344, 14118, 16612, 30067, 29960, 33648, 19672, 11421, -626, -9898, -4252, -8616, -6968, -18868, -17495, -14320, -6153]
14666f153r11j1290J5925M555P517k281j1435J0022N793L117k039j0077m747O526
14652D522m706M156j0426j672J5509K0437m653r314j0102j3266J4686Q853q582
14639E442q854l048j1949J1443Q361j0219J1689j0268j397J1491j701N542k754
14626C778j4793j1112N099Q556L1652K2382j3354j7509j6999L83O381J1391m177
14613A1678r514j7881P780R622n097J0401J4300o472j1729l691l045j686j0185
14600a5519k76J0323J424N507J1586O25q642k372k445n355k28O964Q731o674r750
14585f101J740n951j755K804L528q42J91J155K651K376n203k130l318N513r121
14570a4463k454Q305J13m088K602J2447n025L664j543l80r55K951l21J193M204
$$ y = [-6153, -7064, -18354, -2429, 2126, 9643, 7362, -4073, 5949, 11742, 14859, 12820, 2743, -2004, 4522, -184, 3972, -6454, -8126, 7383, 27820, 23167, 13853, 3751, -9515, 5171, 14024, 5442, -3412, -6460, -18409, -6966, 1395, -8824, 2865, -7403, -8800, 2691, 990, 6532, 3778, -11015, -22127, -17028, -8472, 23180, 45562, 32208, 14699, -2300, -1917, 4464, 15855, 11678, 2164, -15717, -7937, 1685, -3412, 6989, 21289, 14817, 3088, -603, -3648, -5334, -15519, -15795, -5472, -4048, 1459, 13045, 13670, 5028, 2656, 211, -5144, -5372, 1592, 10323, 3649, -6101, -4361, -10312, -12067, -9263, -5735, -6577, -6386, -5231, -2580, -204, -5407, -7537, -10855, -5342, -14463, -16917, -8612, -8499, -12587, -9985, 2462, -2563, 1101, -442, -822, -1777, 1174, 853, 2046, 6250]
14555F250j1841j6996k82j387q335Q922K46M724j804N16O300N136M350m32j860
14540f493N472O187O53l299m831l331M442j825r732J218Q490P646L658J0209K946
14525B1410J151q783n790M909k6l050M802M051M44O683k959j1594j302L546n459
14510H033n875J674M623J067o368j7481J669R735N452l297M93K610Q8Q445r364
14495A504j4580L729J616r934m71J2934l855P80O870j0084P026R644Q334L229
14481A6742q73j2802o194J5974O595M710j5373j0383p905J2895J5835j330k468
14468A5423M121j8687p012O04j637j560j2033Q249J2762n525j0639J258o29J191
14454a4114J0776N895l881J4843P237j71n188n624K528m672j2602M849Q826m869
$$ y = [6250, -5591, -22587, -22869, -24256, -32591, -23669, -23423, -18699, -20503, -19987, -13687, -8551, -4201, -4633, -6493, -1021, 5166, 5819, 2520, -2311, -5642, -1200, -3025, -12757, -11539, -3049, 4597, 8255, 18464, 21410, 22561, 13778, 7988, 12897, 12871, 9821, 14623, 18674, 19118, 25801, 22842, 11248, 9946, 13492, 8033, 2158, 3832, 8455, 9522, 3154, -14327, -12658, -2923, 2529, -768, -275, 2335, 2423, 10868, 1504, -13076, -9347, -7731, -17665, -18136, -5202, -9057, -8277, -1407, -11491, -4465, 5179, 13513, 16742, 15869, 3067, -3127, 12847, 19442, 24152, 8779, -1604, -9509, 3386, 19221, 17891, 15423, 19544, 857, -6155, -5551, -7188, -8748, -20781, -12532, 230, -5295, -15934, -14676, -15305, -14114, -3338, 2557, -1324, 13519, 20756, 20585, 15397, 9773, 12301, 7629, -4973, -124, 8702, 3833]
14440C833j1348o263j0080P642K9986L3J27r57j3510K9k386j821J928R825M432
14425A1470n325j7577M404P729N668J627M085j0562R124K258j2672j2102m307
14412a6180P328J0736Q741m962j255p436q502l856O230M289m304J3884P569m364
14398G918n646k726J7485k581o273J524M447j0118k2251m259J160J6885K2217
14385A7782K677r965R36N99n110j0005j2785J2720r169k914O190P924M004n350
14371b466k936o908P097L756n330n024j0754N580J3535M861R769l446j283N550
14357A2001J0326o48q370j5624j7931M132m448j4007O748P267R846K407j0261
14344a8562r004j425M229J3285J6790N673r347j48m07K846L114n559J3213p567
$$ y = [3833, -7515, -13778, -23858, -16216, 13770, 13803, 13930, 12973, -537, -508, -2894, -4715, -2787, 7038, 11470, 6145, -11432, -7028, 701, 6369, 7996, 12081, 1519, 10643, 12901, 229, -11873, -16180, -8852, 1884, 10625, 5663, 4408, -3028, -11530, -15386, -9156, -4867, -9171, 4713, 12282, 7918, 2272, -454, 17031, 14450, 8177, 9701, 14148, 4030, -18221, -22480, -21320, -4435, 17782, 20459, 10494, 11430, 12029, 6919, -3086, -15871, -3151, -12320, -15234, -9044, -1120, 2884, -2466, -5402, -12310, -5213, -1457, -6787, -11811, -22565, -16985, -3450, 1411, 11180, 7734, 6451, 12001, 22327, 21679, 13309, -2315, -20246, -16114, -20562, -34569, -27821, -20554, -10708, -8301, -18562, -27566, -28991, -24762, -11477, 5313, 10986, 1639, 1491, 1084, 3930, 7044, 1485, 14698, 7131]
14330G131l578j2008n971q31n259J1729K506n75n206j138J3264l494k726j14j665
14315g935m004k682P287K0959K809j169K211L047l724m564j7800j8994j448J0748
14301a5259J351l210m181J2017J2267p692m795N690K862l699K144o18O653k869
14287F61k929q368o847K694m200j930J0666O12Q540m002r078k324Q286L812O539
14272B132m122n477N37j127q76N837r583l749J5409l855O253k329R070k915r814
14257d609N506J7698j2244j0322j1304k372P484J0574N902K871K454o523r040
14244c925p311n007N021R158m651q016r382N203Q123J0832k112j2508K448J5343
14230C216L462j1021j0010j0014R786L508n383P875O551o959l989J9918P881q323
$$ y = [7131, 3553, -8455, -14426, -15257, -20516, -8787, -6281, -6856, -12062, -13200, 64, -3430, -6156, -6270, -7935, -11939, -14621, -7334, 13625, 16434, 15265, 17476, 20523, 16799, 12235, -5565, -24559, -26007, -15259, -13908, -17118, -21299, -9282, 2985, -4707, -9502, -3812, -950, -4649, -2505, -3123, 3530, 661, -2268, -10636, -17483, -14789, -18989, -20919, -10253, -9641, -1101, -5103, -14181, -16505, -8219, -4407, 2132, -1990, -7467, -6930, -8057, -8933, -3096, -12679, -16428, -1019, -4874, 1379, -950, 8120, 5205, -4609, 897, 18595, 6351, -3971, -15275, -17647, -10163, 411, 6313, 9184, 11638, 5115, -3925, -11236, -16243, -11222, -2064, -6715, -14731, -24113, -18910, -10787, 45, -2067, -14575, -12127, 3216, 6678, -4343, -14353, -24367, -14581, -11073, -16456, -8581, -2030, -8989, -12978, 6940, 14821, 6498]
14216F498j6196K110J7382J0536J976j4223r18o200q390m654N24J3415M846J319
14202H025J881J946j3341k0949R43l116l209O561J5620P568R536j0659j4921N8
14188a4057R122J333P53K111j1334j0816q862m490K5563O187j4076O562M539j3700
14174b1165o050K732M656Q009l122K45j0101l994N349J2692N336K09J1521j746
14160D571j1102j0901J0182j794j5356q14K1144J2889k434n796p139j0735l317
14147b0602M927O85K676m248O378P54M728K872m528p892J700J3474L913j7339
14133a2502p495l292J0232l748k271j425r60p559q85J9984m824j6259P373J1574
14119a2057J967n410M293J6172k760p635J4169J6384j9577k4774mK249P508Q325
$$ y = [6498, -9698, -7588, 9794, 20330, 22306, 8083, 7165, 965, -7425, -12079, -11555, 1860, 6706, 8025, 9906, 11852, -1489, -22438, -21495, -24611, -27820, -21259, -5639, 1929, 11465, 806, -14115, -14057, -4935, -3602, -2849, -738, -12072, -22888, -31750, -36240, -10677, -4490, -18566, -12004, -7465, -21165, -27215, -24483, -19827, -11818, -14940, -14695, -24796, -28790, -23441, -10749, -5413, -5204, 6317, 4571, -6531, -17432, -7250, -9044, -24400, -25214, -4070, 8819, 6385, 589, -6550, -17285, -20602, -15675, -14990, -12314, -16562, -10184, -9430, -4702, -1830, -6358, -14250, -12550, 924, 4837, -12502, -19997, -23289, -13057, -16805, -19076, -20501, -21461, -29020, -29905, -9921, -14745, -31004, -23631, -12057, -10090, -15500, -11207, 4965, 2205, -5430, 8739, 25123, 5546, -19228, -19232, -16983, -9475, -1150]
14105a150L280m555j448j2104N184R812R427j2231j2374l887J769O880Q595O067
14091C265r494j1623j2018L783j6J05J3295K825o684P431R500L185k655j6574
14077a5675k2165p436K069J9003J0745L097k773J5776J3729l460q55N035K687
14064A9777J158j0896j3858P104r280j4936P184j615o0M006j0396n968R539O306
14050a1935k52j724m465P02J1666P15K566o61j615k883j0197M032m191N09j530
14035a9263J2595j62J090J6040M264n127l36Q322j787j7477l695n603n407P041
14021i505J5067l853p584J957J610O047L749m86o945l992l962R52K254L904J897
14006A110j3242Q913J34o916LL632j1009J263L480P627J1670J887q164L000m125
$$ y = [-1150, 2130, -2425, -3873, -15977, -10793, -981, 8446, -3785, -16159, -20046, -18277, -11397, -2802, 3265, -6229, -17852, -29870, -26087, -26103, -25998, -12703, -9878, -16562, -9131, 369, 3554, 899, -15675, -37840, -45276, -43207, -24204, -13459, -10362, -13135, 2641, 16370, 12910, 12055, 17090, 19777, 20935, 10039, -3819, 3285, -5995, -20931, -13747, -15362, -15422, -11416, -21812, -27780, -18241, -11935, -12187, -13911, -18376, -17674, -6008, -5293, -2727, -3388, -5003, -7886, -18083, -14051, -18242, -17733, -19263, -6668, -6830, -5740, 10300, 14564, 9437, 9101, 17423, 15636, -1841, -5536, -11139, -16546, -9505, 5562, 1709, -5875, -3918, -2308, 3739, 7488, 7002, 57, -3935, -7897, -6945, -4691, -787, 1110, -12132, -3219, -3085, -10001, -9998, -6366, -17375, -16112, -12632, -5005, 6665, 8552, 388, 3388, -737]
13991g37j0435o513K302k480J7543k823j1887K997P76j0841j0465K4721K0506
13978A2664o155j3238m207m903Q102J0946L637M489j217n241Q948P620j8698j6152
13964a3405J6640J3612n234m947J1820J2672N417M688n332n513L745K3156K2025
13951G9344K1537L4745N2744N1491O4686L3423m1317q5745p1098n8257m1390k2415
13939A7748r416n748j70P839K979J6194L961k839n050p261j257L771m125r773
13925F853j035P015l948m802k210K460o35j4l715O529J3145k147k144n174j2822
13910b644k975J7285M5j047r453o340j246j2974j163K895q029Q300J6735M801
13896D190p769j6648l809J1699m222J4494J0628l587k6111k0467P533K486j471
$$ y = [-737, -11172, -17685, -15383, -17863, -320, -3143, -15030, -12033, -11257, -22098, -32563, -7842, 12664, 6509, -6729, -10936, -15839, -7737, 3209, 6846, 11335, 10118, 4877, 13825, 21445, 2747, -13405, 3235, 16847, 11613, 6666, 18486, 31158, 36575, 41263, 35931, 30418, 34163, 57319, 79344, 100881, 135626, 188370, 239861, 304547, 337970, 296653, 210908, 139810, 81553, 40163, 17748, 8332, 2584, 2414, 10253, 13232, 29426, 33387, 30548, 25498, 18237, 16980, 20751, 16626, 6853, 5818, 12833, 8885, 4083, 1873, 4333, 3698, 3684, -31, 6498, 19643, 17496, 15352, 10178, -2644, -5619, 11666, 11711, 10664, 1211, -5129, -6375, -19349, -20512, -17617, -25646, -17346, -611, 4190, -3579, -20227, -24036, -12337, -16559, -2065, 8563, 4976, -21135, -41602, -34069, -31583, -33054]
13883c3054o542N488J0627j0074k751J5684J8015q188k092O558j3555j0445P162
13870b3167J1537o211J429L294J9935M718K737l697j6821J564Q861R112L095q907
13856G479Q917O693j300j5888j8886j2503J2253P795J3590M366M747j9555R889
13843G597L825j488m448j6025o288k813J436N298n168K45J4119P52r297o206J0179
13828h282M772q985j5253j3451Q816K1475J4372o354K659K012j745P48J2890J732
13814A5406r612P76l442Q358J6528J4930l270J00K545j8528j085K3258K7581K1514
13800I5059L4451K7469L9354N7045L9339j2434o1506n2792n5422l4921k2931j2651
13788D0060n708l734P36l707p176q881P224P963l345k322J1468n768o832L488
$$ y = [-33054, -39596, -34108, -23481, -33555, -36306, -20622, -2607, -10795, -12887, -6329, -19884, -30329, -23167, -11630, -17841, -16412, -13118, 6817, 11535, 14272, 10575, -6246, -4682, 4179, 13291, 16386, 7479, 16396, 23089, 21789, 5901, -12985, -25488, -13235, -5440, 8150, 12516, 17263, -2292, 7597, 11422, 9934, 5486, -10539, -16827, -19640, -18204, -12906, -18074, -17829, -3710, -2958, -12255, -18461, -8282, -3510, -12495, -27748, -41199, -32383, -10908, 3464, -2890, -231, 1781, 36, 784, 13674, 15406, 5794, 6570, 3128, 11486, 28014, 42944, 39674, 39774, 42319, 23791, 22706, 45964, 73545, 95059, 129510, 156979, 196333, 253378, 292717, 280283, 218777, 165985, 110563, 75642, 52711, 40060, 34352, 30618, 31354, 27647, 20471, 11590, 18814, 26777, 23432, 21110, 32578, 26810, 19978, 23466]
13774B3466j892m455K265O45R913l352n040J2439J3214K477P940M912J4077K3330
13760I9939K6666K1803R124M0024O7352R5285J27599J47455J44277Q6391k2010
13749H43905j56102k01246j64681j05728p0940l1538k0833j2546p799q242p40
13738F3510j1675j2217k2258j3891J8571L063o993m599O024J0226J1426j042l590
13725C6555L986K777O73O868J0113J4041J3353P512J2198Q183O940K1384M7739
13712A92322M7261M8106Q1869J09851J38449J60214J17261J2743j31035k18528
13702E58513j89712j28681o9377n4398l1332k4798k4457J873J046j0789l090m24
13690B4374N618r194Q505j947q674n082r984j2597J6227M212j62Q72P04O270P236
$$ y = [23466, 21574, 17119, 19384, 20029, 29942, 26590, 21550, 33989, 47203, 49680, 57620, 62532, 76609, 99939, 126605, 148408, 157532, 197556, 264908, 360193, 487792, 635247, 779524, 865915, 843905, 687803, 486557, 321876, 216148, 145208, 113670, 92837, 80291, 72492, 64250, 63510, 51835, 39618, 17360, 3469, 22040, 25103, 18110, 13511, 19535, 29761, 41187, 40145, 36555, 40541, 43318, 43991, 50859, 60972, 75013, 88366, 95878, 108076, 116259, 123199, 144583, 192322, 239583, 287689, 369558, 479409, 617858, 778072, 895333, 908076, 777041, 558513, 368801, 240120, 170743, 116345, 85013, 60215, 35758, 37631, 38677, 27888, 24798, 24374, 29992, 20798, 29303, 27356, 18682, 13600, 3616, -8981, 7246, 11458, 11296, 12168, 12872, 19142, 26378]
13675B6378j3433J0164k063M625J5551N769J4128j542P460L6661L1190L7071N8018
13662B29977O5258M3468p933n2342q0937n6979l0900j7712l5935j7577J3113q79
13650E0622j4847j2167o085N364j257j6530n421J462R566L842N638O462o07k978
13636B3064K801N832j0894k362l783l07M843P889J229L397n358J893k746j0811
13622A4687r83R203J2571n496l502m494R690O089j0613n775j1447k055M383k578
13608I680M755O795k169Q358J484J1907L973j2962j1277k616q332J948J2174J5576
13594C9294m289o200J729j410j2360k177K0306J6366M537j1595j1834M717m765
13581C2319j917p055o232j063L099k496O148k23k105j2566k876L062R965l675
$$ y = [26378, 12945, 23109, 21046, 25671, 41222, 46991, 61119, 59577, 67037, 103698, 134888, 171959, 229977, 295235, 338703, 330770, 278428, 197491, 140512, 109612, 91900, 55965, 38388, 51501, 50622, 35775, 23608, 17523, 22887, 21630, 5100, -321, 1141, 10707, 14549, 20187, 26649, 26042, 23064, 25865, 31697, 20803, 18441, 14658, 14351, 19194, 27083, 28312, 31709, 26351, 28244, 25498, 14687, 13704, 22907, 35478, 29982, 26480, 21986, 31676, 37765, 27152, 21377, 9930, 7875, 12258, 9680, 14435, 21230, 19061, 27419, 28903, 40810, 44783, 31821, 20544, 17928, 9596, 11544, 23718, 39294, 35005, 28805, 30534, 29124, 16764, 14587, 34893, 51259, 55796, 44201, 32367, 37084, 32319, 30402, 23347, 17115, 16052, 19151, 16655, 22803, 22580, 20475, 7909, 5033, 8095, 18060, 14385]
13567A4385J730j344n376j512m191M466K567o511J1398J634L027k445J3807P302
13553C8937K1025L883j3506j0167q372Q841R796P205J5490Q021J5248L0676O610
13540A33687j9529m4741k4353j0275l612j2426p65j090K341O773K497j3375r145
13527E987M344M721O942l8l220N931m843r769j4736p080o720R644J6637Q530o58
13512A5672k159J4905J8801R335n817q126j464Q388J1464k63p232L14Q870J1293
13498G3981K9831K4248J3200j2447m3724l7958j6655k3754r501q391N363L678
13486b129J8410J5313n769R492l301J2628j996J0896R929l192j4593j7131r174
13473A9383M279n882m830P660J0633l384p778O220K262M612p572p17Q150j2541
$$ y = [14385, 16115, 14771, 9395, 7883, 3692, 8158, 10725, 4214, 15612, 17246, 20273, 17828, 31635, 38937, 59962, 63845, 50339, 40172, 31800, 40641, 50437, 57642, 73132, 81153, 96401, 127077, 133687, 114158, 69417, 45064, 34789, 31177, 18751, 17986, 16896, 19237, 26010, 28507, 15132, 5987, 10331, 15052, 21994, 21956, 18736, 24667, 19824, 10055, -4681, -11761, -18481, -8837, 7800, 16330, 15672, 13513, 28418, 47219, 56554, 50737, 42611, 41147, 49535, 60999, 60736, 53504, 53818, 62688, 73981, 103812, 128060, 141260, 128813, 85089, 47131, 30476, 6722, -2779, -11170, -5807, -2129, 16281, 31594, 25825, 35317, 32016, 44644, 42648, 53544, 63473, 60281, 45688, 28557, 19383, 23662, 17780, 12950, 20610, 31243, 27859, 20081, 26301, 28563, 33175, 25603, 24886, 33036, 20495]
13459B0495l1484j6238Q797J9655M285P888K700J9726J7056O363k6131j6766l80
13446A5966o125l077O233J7535J5474J8599K4350J0037K173q380j719O369j0187
13433H7248N221J1127O634j1101j2425O93M997L678j3053r484K402L106j3605
13420F5438l066r50l41r64j8063n5238n0424k4772O557K6234M8587L2172J4815
13407C9985N220P165J4299N8L808J607n424l246j6321j388K8772K8777K0400J5714
13393A39426J5080J3757O017j0866l122K753J730R095N84m867m694J572k14Q330
13379A74581J6379J4885K5034R254n577J3969R235J0945l750l4456n9569m5113
13367A25817Q017N3087P6294P0640P2232N0836M4814M6387N3594N3860O8234R9922
$$ y = [20495, -10989, -27227, -18430, 1225, 5510, 13398, 16098, 35824, 52880, 59243, 33112, 16346, 15966, 9841, 6764, 12997, 30532, 46006, 64605, 88955, 98992, 101165, 92785, 91066, 97435, 87248, 92469, 103596, 110230, 99129, 86704, 87397, 92394, 96072, 83019, 73535, 75937, 79043, 65438, 62372, 61422, 61081, 60117, 42054, -13184, -63608, -88380, -81823, -55589, -7002, 25170, 39985, 45205, 52370, 66669, 66727, 70535, 72142, 66718, 63472, 47151, 45763, 74535, 103312, 123712, 139426, 154506, 168263, 174280, 163414, 160292, 163045, 164775, 173870, 174454, 169587, 164893, 166465, 166251, 174581, 190960, 205845, 230879, 240133, 234556, 248525, 257760, 268705, 264955, 230499, 170930, 125817, 133834, 186921, 263215, 333855, 406087, 456923, 501737, 548124, 601718, 655578, 723812, 823734]
13355H23734J07732J38460J74168K14957K48272K77538L30083L95445M80979N50956
13345C742324O44680P34544Q51620J010440J252587J713690K591318M013407N999423
13336B2554033Q162968R672855R151852M799799l392968j0697143j2222721r279370
13328A8749305n759582l414795k075445j340866r27106o96280n78577m63571l71038
13319C122045k64785j66076r2200m5838J240M6855R0897J33665J89159K64212
13309C279174L57891M49401N48067O57501P97383R58287J153649J357075J593084
13300A1151512J860521K182891K534452K968765L617474M826007P136225J1059441
13292D7337288J6823815K3621803K9076503K9534869J9776986l456228k9774399
$$ y = [823734, 931466, 1069926, 1244094, 1459051, 1707323, 1984861, 2314944, 2710389, 3191368, 3742324, 4387004, 5121548, 5973168, 6983608, 8236195, 9949885, 12541203, 16554610, 22554033, 30717001, 40389856, 49541708, 54341507, 50948539, 40251396, 28028675, 18749305, 12989723, 9574928, 7499483, 6158617, 5231511, 4535231, 3956654, 3493083, 3122045, 2857260, 2691184, 2598984, 2553146, 2554386, 2601241, 2692138, 2825803, 3014962, 3279174, 3637065, 4086466, 4634533, 5292034, 6089417, 7047704, 8201353, 9558428, 11151512, 13012033, 15194924, 17729376, 20698141, 24315615, 29141622, 36277847, 47337288, 64161103, 87782906, 116859409, 146394278, 166171264, 162715036, 132940637]
13285A32940637l9963169l2305074k0148170j1641150o925832m375694k927374
13278A4654174k159674j805760j589903j350229j050695p55492n29877l78417
13270E034127k50531j51185r1969l8737N0395J30080K51011L40056M58493O01278
13260F333018P44914R00052J086022J285561J535255J808693K128290K475826
13252A8297631K897698L514910M590814O666473J0312630J5788689K2586682K8634662
13244A13290189L0443503K3144558K175863k5630742m0501344l5572578k3071604
13237D4277845j3368937p851189m876803l226783k327063j911179j700426j469198
13229G546267j161554q67564o51615m79954l50196k77388k23660j69125j19592
$$ y = [132940637, 92977468, 60672394, 40524224, 28883074, 21957242, 17581548, 14654174, 12494500, 10688740, 9098837, 7748608, 6697913, 5942421, 5412544, 5034127, 4783596, 4632411, 4540442, 4501705, 4552100, 4682180, 4933191, 5273247, 5731740, 6333018, 7077932, 7977984, 9064006, 10349567, 11884822, 13693515, 15821805, 18297631, 21195329, 24710239, 29301053, 35967526, 46280156, 62068845, 84655527, 113290189, 143733692, 166878250, 169054113, 143423371, 102922027, 67349449, 44277845, 30908908, 23057719, 18180916, 14954133, 12627070, 10715891, 9015465, 7546267, 6384713, 5517149, 4865534, 4385580, 4035384, 3757996, 3534336, 3365211, 3245619]
13220C245619q5390l0202J5025O0083J36677J85249K40974L06600L81010M53378
13210D909023N67909O78373Q04586R32055J112351J445093K092623L237513M962678
13201B0742204P192613R280481J0185295Q295295J915783p165653j2894037j2277868
13193B5274113q475991n101947l050781j873355j217072q78015p06884o18842
13185C351226n36591m24140l24705k40437j76445j32404j26521j07362r0036o0702
13175A131883o7160p2298o5065n3338o1995m4126k0196k8408l5370j5191J5971
13164F84707M4072L4228k871l7487n6942n5113m0132k9357k7108j7060R853q364
13152D98426j9055j4498j4219k7783l3680l6179j4631j3404M815n841k0662j9308
$$ y = [3245619, 3160229, 3130027, 3145052, 3205135, 3341812, 3527061, 3768035, 4074635, 4455645, 4909023, 5476932, 6155305, 6959891, 7891946, 9004297, 10449390, 12542013, 15779526, 20742204, 27934817, 37215298, 47400593, 55695888, 57611671, 50446018, 37551981, 25274113, 16798122, 11696175, 8645394, 6772039, 5554967, 4676952, 3970068, 3351226, 2814635, 2390495, 2065790, 1825353, 1648908, 1516504, 1389983, 1282621, 1192585, 1131883, 1064723, 992425, 927360, 874022, 812027, 767901, 747705, 719297, 683927, 668736, 684707, 728779, 763007, 760136, 722649, 665707, 610594, 570462, 541105, 513997, 496937, 506790, 498426, 479371, 464873, 450654, 422871, 389191, 353012, 338381, 324977, 329792, 323951, 303289, 283981]
13140B83981K139p126r101M814j863J4462L3732L065Q480l949k4585l1589J005
13127B73465p578j931N52n590j1654K0677K5588K6464M0040M9948M8837j166l7629
13114D20023o8666m8308l7232j2110J4558M428l633k1257j6417k3048m859j9521
13102A83958k1787N284N29k1830j3911j683o817P287Q864j0072k114J5939R190
13089A52837K7604J9717J9572N522n205j0592k1274k788n726j2674k483J97j2399
13076A52308j1050J1316O373M247K3596R961k0509K849r682K268N676j747j4035
13063A61571j0292k031l035k7357j3395j3340o283L718K172j2037q394L384j2733
13050F1948r540r043L34M445J2136K3098O717k413l219L431J4685K2519J904R358
$$ y = [283981, 286120, 278994, 269893, 274707, 272844, 287306, 321038, 324103, 332583, 328634, 304049, 272460, 273465, 265887, 263956, 264508, 258918, 247264, 267941, 293529, 319993, 360033, 409981, 458818, 457652, 420023, 351357, 303049, 265817, 253707, 268265, 272693, 269060, 247803, 231386, 208338, 203479, 183958, 162171, 167455, 167984, 146154, 132243, 130560, 123743, 131030, 139894, 129822, 127708, 143647, 152837, 180441, 200158, 219730, 225252, 220047, 209455, 188181, 185393, 179667, 166993, 164510, 164707, 152308, 141258, 152574, 158947, 163194, 186790, 196751, 176242, 179091, 169409, 171677, 177353, 175606, 161571, 151279, 149248, 146213, 118856, 105461, 92121, 85838, 89556, 91728, 79691, 71297, 74681, 61948, 52408, 43365, 43699, 48144, 60280, 83378, 90095, 87682, 84463, 87894, 102579, 125098, 127002, 136360]
13036A36360m006l977n93j8564j2564o491L42n756j6443o510J876j327n486q581
13022D8280L683n587J4038O887j400O139J3497p712k757r325j0812M807N919k856
13008F2801N337Q723m125m690P640p196K620J1923o54r090j155K380Q560m095
12994G8979M377J5630K3973J4621o793k4994j4071J446L85k983j8700l1407l350
12981C7113P052L859O332n929j987O549j0178k057L590k772j779l493j444N238
12967D0094L312O378P302O120J380j0137l339L593J909j257R322R789P3j5365
12953E9174j6672m752J808J421J875q569j6373n262o391k962m251J1651L774P2
12939A4543l891L591j619k663j323k730Q385J3972L374L551N071K192L511K8531
$$ y = [136360, 132354, 128377, 127784, 109220, 96656, 90165, 90507, 84751, 68308, 61798, 63674, 62347, 56861, 48280, 51963, 46376, 60414, 67301, 65901, 72040, 85537, 77825, 75068, 65743, 54931, 59738, 65657, 62801, 68138, 76861, 72736, 68046, 75686, 68490, 71110, 83033, 82379, 73289, 72134, 74514, 83074, 78979, 83356, 98986, 122959, 137580, 130787, 105793, 91722, 93168, 93553, 90570, 71870, 40463, 37113, 44165, 48024, 54356, 48427, 46440, 52989, 42811, 40754, 44344, 41572, 39793, 36300, 34856, 40094, 43406, 49784, 57086, 63206, 64586, 54449, 51110, 54703, 56612, 55355, 64677, 74466, 74539, 59174, 42502, 37750, 39558, 40979, 42854, 34285, 17912, 12650, 6259, 3297, -954, 10697, 14471, 14543, 10652, 14243, 12624, 9961, 8638, 5908, 14293, 28265, 31639, 35190, 40261, 42453, 45964, 74495]
12925G4495j637k0117q224J4239o31k7131p826J7417K0989K693o951J6565J5484
12912H9365J56R527J6377R238J3375J2133J1193K3718R565J6213M0513M8006P1650
12899C71029Q0620J39085J89614K14069K23668J62988m16j34573j22628k7295
12889A096161O6155J08466P1455q3790k56442k85814k28833j35619r0723n5088
12879B05928m2963j3128p578m709n677j6516r716j2861M707J3649K9941J5175
12867A56252j689P71L4747O1494N8814M7068J045n8107o2434o0001m3623j7606
12855A16731j2954r766j5278O968r998j0226m742r590j1917n696N583M225P643
12842E0983Q523J9955l900j7434j659J7472j437k484R79m03Q684O725J1533m388
$$ y = [74495, 72858, 52741, 44517, 58756, 58125, 30994, 23168, 40585, 61574, 64267, 57316, 73881, 89365, 89521, 99048, 115425, 124663, 138038, 150171, 161364, 185082, 194647, 210860, 251373, 299379, 371029, 451649, 590734, 780348, 994417, 1218085, 1381073, 1380657, 1246084, 1123456, 1096161, 1162316, 1270782, 1342237, 1258447, 1002005, 716191, 487358, 351739, 261016, 205928, 162965, 149837, 142259, 137550, 131873, 115357, 105641, 92780, 97487, 111136, 141077, 156252, 154563, 155334, 190081, 251575, 310389, 357457, 358502, 300395, 237961, 177960, 134337, 116731, 103777, 94011, 78733, 85701, 75703, 65477, 60735, 51145, 39228, 33532, 39115, 43340, 50983, 59506, 79461, 75561, 58127, 56468, 73940, 72503, 70019, 70998, 70595, 79279, 86004, 97537, 93149]
12828I3149J1397K4038K3389M133J1342J9699M0694P4372J18147J53233J62363
12817G35956J32934N5606p2866j88632j91592j32064q5005o7033n3836j7998m556
12806A10914k793k8888k1821r585n105K993P959O409J2451R761k981j6631r66
12793F1717J587N445N589J220P222J9817O731Q980p466p078J1607J6354J9586
12780A51311K0948P213J4522N2720P7465J00798J19618J52080J39534P3487n5171
12769H54525j75030j97854j51272q6378m5952l9059l5350k8160j5424r282j3220
12758E7544l092L145J0231K664K180R152p47j0651r414P78K4409Q656N946J0314
12744A11115J7180J8069J5956L7553L8100Q070j7070k7087k2774P386J9695M1276
$$ y = [93149, 104546, 128584, 151973, 156106, 167448, 187147, 227841, 302213, 420360, 573593, 735956, 868890, 924496, 851630, 662998, 471406, 339342, 254337, 187304, 133468, 115470, 110914, 108121, 79233, 57412, 47827, 42722, 45715, 53674, 60083, 72534, 82295, 79314, 62683, 61717, 63304, 68749, 74338, 75558, 82780, 102597, 109328, 118308, 110842, 103764, 115371, 131725, 151311, 172259, 179472, 193994, 246714, 324179, 424977, 544595, 696675, 836209, 909696, 854525, 679495, 481641, 330369, 243991, 198039, 158980, 123630, 95470, 80046, 70764, 57544, 54452, 57597, 67828, 70492, 72672, 81824, 81077, 70426, 61012, 61790, 86199, 94855, 100801, 111115, 128295, 146364, 162320, 199873, 237973, 246043, 228973, 201886, 179112, 186498, 206193, 247469]
12732B47469K0280R0n211P841J8706K5810K0857j400m5049o7367m8326l5583l3543
12719A04574j7043k7235j1741m084k370m058j280n246j1782q926O228J5440n48
12706C1929M69P216J0814J6797l69r871M357N264m841j6430o475k056J564j5640
12692B2728j9280J203O837M73J509P81N558o919L143J5195J1343J3068J6278J1616
12678H3533P302J577N847K590k910j0762k52j652j9933j6488j0174J6518L47j6862
12664C8681j4781j6129R121O395P352K148J1482R72J431j1669r998j777o997n612
12650A0619n879j3337l965J3819O949r458k935q439n383M768J6467K2239K0059
12637D5524P389n197j9429K606J1354K4958R610K0189K1478k276k975P8k541Q955
$$ y = [247469, 267749, 267839, 262628, 270469, 289175, 314985, 335842, 334442, 289393, 222026, 173700, 138117, 104574, 87531, 60296, 48555, 44471, 42101, 38043, 36763, 31517, 19735, 10809, 17037, 32477, 31929, 32398, 39614, 50428, 67225, 66856, 56985, 61342, 66606, 61765, 45335, 38860, 36804, 38368, 22728, 3448, 4651, 11488, 11961, 13470, 14251, 19809, 12890, 16033, 31228, 42571, 55639, 71917, 83533, 90835, 92412, 98259, 100849, 97939, 87177, 86925, 85273, 65340, 48852, 38678, 55196, 55543, 38681, 23900, 7771, 16892, 23287, 30639, 32787, 44269, 45241, 46672, 35003, 25005, 23228, 16231, 10619, 4740, -8597, -12562, 1257, 8206, -1252, -4187, -12626, -18009, -13241, 3226, 25465, 45524, 52913, 47716, 28287, 30893, 42247, 67205, 76815, 97004, 118482, 116206, 113231, 113309, 110768, 119723]
12623A19723J559R75l98O707N586j5263j9731n509k2181n5545q0234r8029m1440
12610b03780M1514O5807L6314k1353p0176m7072P91M8253O0708N1909M1968K6366
12598C1249J1569M346M416N735O139Q806l361K256J9065M300R55K428J6479J4312
12584A28694J4773J7060k130m756O88J7755R237J472q634o89J699n521j4541r351
12570A45756K3883J3623k986m526J936J2387J5712J5077J4240P668J4960L058
12558B60788o075p058L341J0269K3321J2764K3940J5115K0236K0807L4346L0499
12546D42293J3801J794J2191K5276K3277R938R107K8044L7083N7588O7346P9473
12534H07211J12907J49180J68364J36915K5890o8701j19639q1734R929P0848R4563
$$ y = [119723, 121282, 122257, 121859, 128566, 134152, 118889, 99158, 93649, 71468, 15923, -64311, -162340, -203780, -162266, -96459, -60145, -81498, -151674, -198746, -197955, -149702, -88994, -37085, 4883, 31249, 42818, 47164, 51580, 57315, 63454, 72260, 68899, 71155, 90220, 94520, 95475, 97903, 114382, 128694, 143467, 160527, 158397, 153641, 154329, 172084, 181321, 182793, 174159, 173470, 175169, 169648, 155107, 145756, 169639, 183262, 180276, 175750, 177686, 190073, 205785, 220862, 235102, 242770, 257730, 260788, 254713, 247655, 250996, 261265, 284586, 297350, 321290, 336405, 356641, 377448, 411794, 442293, 456094, 457888, 470079, 495355, 518632, 528570, 537677, 565721, 602804, 660392, 727738, 807211, 920118, 1069298, 1237662, 1374577, 1400467, 1331766, 1212127, 1130393, 1140322, 1211170, 1305733]
12523A305733P5773Q4272J08803J41786J81332K12799K49147K89481L47878M58447
12513C455451O01864P73577Q79666Q70371P64059O42236O51403Q81653J231295
12504A0751575J478215J564774J621224J770909K039118K393071K779831L122485
12496B7521202L626509M616118O327154R057802J3400561K0092909K9299517L9358914
12488A53300686M6598449M4817020K5416009r262410l3865869k7590357j982990
12481A97430538K0226691K6599005J0397244k5044356n4742618n6936886m0356559
12474G7573059k3893121j4107242q954001n981355m052411k741812j876873j379682
12466A4586562j228812j203951r89951o20667l97123m19290n60538p13634p47728
$$ y = [1305733, 1381506, 1465778, 1574581, 1716367, 1897699, 2110498, 2359645, 2649126, 2997004, 3455451, 4057315, 4830892, 5710558, 6580929, 7344988, 7987224, 8638627, 9520280, 10751575, 12229790, 13794564, 15415788, 17186697, 19225815, 21618886, 24398717, 27521202, 31147711, 35763829, 42090983, 51148785, 64549346, 84642255, 113941772, 153300686, 199899135, 244716155, 270132164, 260869754, 227003885, 199413528, 197430538, 217657229, 244256234, 254653478, 229609122, 174866504, 117929618, 77573059, 53679938, 39572696, 30618695, 24637340, 20584929, 17843117, 15966244, 14586562, 13357750, 12153799, 11163848, 10543181, 10146058, 9726768, 9166230, 8452596, 7704868]
12457G704868n85165l91427l55641m77000o14887p10641o99805n70683m03988
12448B895631k80894j86756j26699j06240q9781p1714p2077o4783p9470r0427
12438A726790r1567o5992k4163k1544l5380n7569r9402j03953p7904n3942n5582
12427A039792n4765o0775m9201k9964j7271r906j3764j1115j5042l4690j8190
12416G25109j8792j1639l907k3366j2555k0258k3365k0993m939r473j5024l0345
12404E30453k5660j3283J0180k348o897j2016j3264k8552k0428j74j013J410q566
12391D09842k0506j9823p055q321j830Q287K1999j570q081p237j3514R504P588
12378C69283j4539r625q703r270n49N788K197m594j262o388M225j709n04N590
$$ y = [7704868, 7119703, 6728276, 6372635, 5895635, 5280748, 4570107, 3870302, 3299619, 2895631, 2614737, 2427981, 2301282, 2195042, 2105261, 2033547, 1961470, 1896687, 1817217, 1726790, 1635223, 1569231, 1545068, 1523524, 1488144, 1430575, 1331173, 1227220, 1149316, 1095374, 1039792, 985027, 924252, 875051, 845087, 827816, 817910, 804146, 793031, 777989, 743299, 725109, 706317, 694678, 690771, 667405, 654850, 634592, 611227, 590234, 585295, 575822, 560798, 530453, 504793, 491510, 501690, 499342, 492445, 480429, 467165, 438613, 418185, 418011, 416998, 418408, 409842, 389336, 369513, 362458, 354137, 352307, 360594, 382593, 381023, 372942, 365705, 352191, 361695, 369283, 354744, 345119, 336416, 327146, 326597, 332385, 334582, 329988, 328726, 322338, 326563, 324854, 324350, 329940]
12364C29940J9315L5226P8373P5642K9050k1975o3592m6461r53M0133N2703J4088
12352E41489m8694q0643q4343n6826k5165j3381j9173j0602q687j5403j1032R679
12340A77219J5139M200o275p882j8395j7652N398K9049K4550L694J524O80M80
12327B11729M596O39N718N311J1745N087j4629j9837q61k375q24k1348j5958k1157
12313A47836m163q393J3206J4087o847l120M978P903P66j975M54n672k1768j3008
12299A24284R047j8785j0989P41p158k894j6196k7738n045P919R501K294P27j697
12285F4011J3683J9610P600J39J9839n03j2641j4286p660o130j455k328L441m073
12271G9247o976n234J212j3065j1738n734J013J6491K9413M457j6971q050j121
$$ y = [329940, 349255, 384481, 462854, 538496, 567546, 545571, 481979, 435518, 434565, 474698, 527401, 541489, 492795, 412152, 327809, 270983, 245818, 232437, 213264, 202662, 193975, 178572, 167540, 177219, 192358, 196558, 190283, 182401, 164006, 146354, 151752, 180801, 205351, 209045, 210569, 211249, 211729, 216325, 216964, 222682, 227993, 239738, 244825, 230196, 210359, 209498, 207123, 206299, 184951, 168993, 147836, 143673, 135280, 148486, 162573, 155726, 152606, 157584, 165487, 166253, 164278, 164732, 159060, 137292, 124284, 133331, 114546, 103557, 104298, 97140, 94246, 78050, 50312, 45267, 53186, 62687, 64981, 65708, 64011, 77694, 97304, 104904, 105043, 124882, 124379, 111738, 97452, 89792, 83662, 82207, 79879, 83320, 79247, 72271, 67037, 68249, 55184, 43446, 37712, 38725, 55216, 84629, 89086, 72115, 64065, 62944]
12258F2944Q916J3792J3906J4643m109J0682j0559j3122N50r570M185p107o071
12245G9080n874k4452j2436J3944M886J009K965K411K0190O678Q342J276N950
12232A03969J5057R503J0751O408r742k437j125j2206j8306j6565k0669j2581
12220E2057k713m88K147n277O336R14r054q413P090k532K666Q460J5257r9R18
12205F7269l207p676r747n778Q20m64j0747M755J1454K445n723P374J1970j940
12191F0805j4559n775L614J6191Q265O8r594q268j774M143n663j0216m568M946
12177C7615J1731j62L079l261k390M2j8534j4960o51j1986R736J6966P508O788
12163D1521p639k801j292j3480o629m068J8035j945K569J0340k245q418J2653
$$ y = [62944, 71860, 85652, 99558, 114201, 110092, 120774, 110215, 97093, 97643, 88073, 92258, 85151, 79080, 73206, 48754, 36318, 50262, 55148, 56157, 59122, 61533, 81723, 88401, 96743, 98019, 103969, 119026, 128529, 139280, 145688, 135946, 133509, 132384, 120178, 101872, 85307, 64638, 52057, 49344, 48856, 51003, 45726, 52062, 52976, 43922, 35509, 42599, 40067, 42733, 51193, 66450, 66351, 67269, 64062, 56386, 46639, 40861, 41681, 41217, 30470, 35225, 46679, 49124, 43401, 50775, 62745, 60805, 46246, 40471, 44085, 60276, 68541, 68609, 59015, 50747, 48973, 53116, 47453, 37237, 32669, 37615, 49346, 49184, 52263, 49002, 46612, 46654, 28120, 13160, 12509, 523, 10259, 27225, 34733, 41521, 33882, 31081, 29789, 16309, 9680, 5612, 23647, 21702, 24271, 34611, 32366, 23948, 36601]
12150C6601Q576k0413j547J9120k954n888o367j3006O723J7040m525q745n355
12137A9260j0302Q334N908j602J5548J027M644N217k372p00m93N934j0997k055
12123C7351j1123n400l546K102P630N879j4558m655P243n17J162n19K499L654
12109B7202j967J3671J0010r783k0509n241K390J691N230o63L765J2304J8236
12096E6336j860R314K0768R993J1464J0686Q925j348Q811Q801Q314J0141K1766
12083A82111J9483K7403K8656L5409P0380R2192J22489J77603K16328K25591J62349
12072A359994J8548j15748j40427m3440P0696J24728P0706q5168k41249k86018
12062G32622k19190j41186j04650o7805m0110j9225j8505p746j3675j0177P525
$$ y = [36601, 45177, 24764, 23217, 42337, 39383, 33495, 27128, 14122, 20845, 37885, 33360, 24615, 19260, 8958, 17292, 23200, 21598, 37146, 38173, 42817, 48034, 45662, 44962, 44469, 50403, 39406, 37351, 26228, 20828, 17282, 19384, 27014, 32893, 18335, 13680, 20923, 20406, 21568, 21049, 23548, 27202, 25235, 38906, 48916, 39133, 18624, 13383, 15773, 17464, 22694, 22031, 25796, 38100, 56336, 54476, 63790, 84558, 94551, 106015, 116701, 125626, 124278, 133089, 141890, 150204, 160345, 182111, 201594, 228997, 257653, 293062, 363442, 455634, 578123, 755726, 972054, 1197645, 1359994, 1378542, 1262794, 1122367, 1078927, 1149623, 1274351, 1345057, 1259889, 1018640, 732622, 513432, 372246, 267596, 199791, 159681, 140456, 121951, 114205, 100530, 90353, 97878]
12051I7878M355k7454o662j6390j2565M51Q578j4078M130o69q817N338j923P400
12037C9572P441j3112P51J3614l564k07L795O226J2268K013r932l777L881l707
12023E5262N142k714j3700j6074j2804k091K0190Q943p339j524J3829p318O29
12010D0431p915j2981o553j0541N097J2570L119M840k460j3475K0348N46J250
11997C4276l717k217j6126n341l352l64K028M191J1045M94l185j9348P440O273
11983A2097p190J1010Q333j1477r19N657N885j8681q496J86J7612J359K659K881
11969B0916p260j0003p180P796K783j3517J20J5025K409q527Q641J821K084M093
11955A9201Q957l77q747j2761j0325j636R744P754J680q443L032J3558n27j517
$$ y = [97878, 102233, 74779, 68117, 51727, 39162, 39613, 48191, 34113, 38243, 37574, 28757, 34095, 32172, 39572, 47013, 33901, 34652, 48266, 44702, 44495, 48290, 54516, 66784, 68797, 58865, 55088, 58969, 55262, 60404, 57690, 43990, 27916, 15112, 13021, 33211, 42154, 34815, 33291, 47120, 39802, 40431, 32516, 19535, 12982, 2441, 7538, 20108, 23227, 28067, 25607, 12132, 32480, 33026, 34276, 30559, 28342, 12216, 6875, 3523, 3159, 5187, 9378, 20423, 20917, 17732, -1616, 5824, 12097, 4907, 15917, 24250, 12773, 11854, 17511, 23396, 4715, -3781, -3595, 14017, 15376, 18035, 20916, 13656, 3653, -3527, 4269, 7052, -6465, -6345, 8680, 11089, 2562, 11203, 13024, 15108, 19201, 28158, 27781, 19034, 6273, -4052, -5688, 4056, 11810, 13490, 5047, 8079, 21637, 21110, 19593]
11941A9593R906j691K59k376n74k494j4335j2235k786L604j404J162L891J612
11927B132O120O337R884M278m243j103l291q636l685l819j579k776J1174j357
11913I436K680j18K81J5470k931N312p929k54j6317J43J0811j1695K664R208l314
11898A3447r961K852P86j3681l66K977j2219P757P469O728K2626l693k796j855
11884B0071j0494j0617N993M674p036J1327j2126j2502n976J114P557r0P849M438
11870D182j360N027N288j676l342J2617J209N263j3325k664O540k859m929J0973
11856B0944r943j3952O908L68r973Q29J4878J0135k120N689l097j5031j5866p725
11842a7956O918r8J3262K0772M772m347R92L038K127k1016k2114l214P957J2360
$$ y = [19593, 29499, 27808, 28067, 25691, 25117, 22623, 8288, -3947, -6733, -3129, -4533, -3371, 520, 2132, 8252, 14589, 24473, 28751, 24508, 23405, 20114, 11478, 7793, 3974, 2395, -381, 10793, 9436, 12116, 11998, 12279, 27749, 24818, 30130, 22201, 21947, 5630, 5773, 16584, 4889, 7553, 16761, 13447, 3486, 6338, 7124, -6557, -6923, -3946, -16165, -8408, -939, 5789, 28415, 24722, 21926, 20071, 9577, -1040, 4953, 9627, 2591, 13918, 1792, -10710, -16686, -15572, -8015, -8105, -256, 4182, 2822, 7849, 13137, 11461, 8119, 20736, 21945, 27208, 13883, 11219, 17759, 14900, 9971, 20944, 11001, -2951, 3957, 4325, -5648, -4819, 10059, 20194, 18074, 23763, 20666, 5635, -10231, -17956, -11038, -11136, 2126, 22898, 27670, 23323, 24315, 27353, 29480, 8464, -13650, -16864, -8907, 3453]
11828C453O207Q901j396j6913j6154Q220J0214o025j82Q451k387J392Q790q636
11814C935K825P36j845k958M427N741k796q171M60k907J0835P30K693K388n509
11799A0584m423l22j0172j138N542K486j1o288N216O27J930j015o302k0726J4982
11784i030J7778L253l434r740m45p177r976n41J0871N068k080M920O483j0036
11770d086j9207N990K551R929J0120J443m591m633k651L231p773j607J1546K657
11756B919j271j1273J0063K0336m148K100o244j4960P598J0235M75q326Q97J1159
11742A9560q610Q022k551j4337O663P369K979Q197J480J8266L091k5983k0321
11729C825k354j0452j55o797j0201P509J2717k306O287J1869J2676M698J0089
$$ y = [3453, 9660, 18561, 17165, 252, -15902, -7682, 2532, -3493, -3675, 4776, 2389, 3781, 12571, 3935, 6760, 7496, 5651, 2693, 7120, 12861, 10065, 1894, 2354, -553, 10282, 11012, 13705, 16093, 10584, 6161, 5839, -4333, -5471, 71, 2557, 2546, -3742, 1474, 2101, 4031, 3016, -3286, -24012, -9030, 8748, 12001, 8567, -1173, -1618, -8795, -18771, -19312, -8441, -3373, -5453, -533, 5950, -4086, -23293, -17303, -14752, -4823, 5297, 6740, 2149, -2484, -5135, -1904, -9677, -11284, 262, 2919, 1648, -9625, 438, 20774, 16626, 18726, 12482, -2478, 5120, 15355, 15830, 7504, 8401, 19560, 10950, 18972, 16421, 2084, 8747, 16116, 19095, 27292, 28772, 47038, 50129, 24146, 3825, 1471, -8981, -9136, -15933, -26134, -18625, -5908, -8214, -1927, 9942, 22618, 27316, 37405]
11716C7405l22k4463m95Q127M037n812n396J0857R301j5557j2290j827Q093j0866
11702G92J0418J4832r573r227j3915j2288J0181O995o595P99Q166j610J736N885
11688F596L26P783n658J0199J4058j2252j1969j2309J266R692j657L684J1692
11675B1451J961j0100j2930J793l187K108P105K591N343J229N152n698j3704l206
11661i2o379K3061J1496M56m874M061l717n654J649l061k252j404n436j29j3481
11646e756l881P361Q306o188l484k933J7395N437M014K650l159q066j3823r739
11632a1866m862K427j4841Q407Q839K899M174O165J286R730M1l972p320j7008
11618a5901n606N832J0947R452j266N802L082l712o10j1747J226M805k377r622
$$ y = [37405, 37083, 12620, 12125, 20252, 24289, 18477, 13081, 23938, 33239, 17682, 5392, 3565, 11658, 792, 11210, 26042, 16469, 7242, -6673, -18961, -8780, -1785, -8380, -7581, 585, -1025, 711, 6596, 6922, 14705, 9047, 19246, 33304, 21052, 9083, -3226, -1960, 7732, 6075, 9759, 21451, 23412, 13312, 382, 2175, -1012, 1096, 8201, 10792, 16135, 17364, 22516, 16818, 3114, -92, -6471, 16590, 28086, 28542, 23668, 27729, 24012, 18358, 20007, 16946, 14694, 13290, 7854, 7725, -5756, -9637, -2276, 6030, -158, -3642, -6575, 10820, 16257, 20271, 22921, 19762, 11696, -2127, -11866, -16728, -14301, -29142, -20735, -11896, -8997, -4823, 1342, 2628, 12358, 12399, 8427, 1107, -15901, -21507, -15675, -4728, 4724, 3458, 9260, 12342, 8630, 8020, -3727, -2501, 2304, -73, -9695]
11604i695M200K26Q932P400J811m463n120k446K054J1638j069l279q252N816j533
11589F220O772j164j4906K3349K5713p780P46n347K149m876p818j2043j5814L680
11575a119J183J0486J1434j476o519n20J6648j6495r221R178o908M680J920j5093
11561a822J091O127J2451J1168p305o531L094M971j0905j8791K177k063m708k395
11547a3441m21J1719J921J0355K974p216n767j001n835j803l568l658O556J117
11533h068k365k240R394J6615J2059j6919k4342j210L625K988l506j0784M189
11520b0564K3202M367n924n255Q020m112j6304J0442K257J4175J9066n186n986
11507A8198M506L109r634j4977j0393R028j81k475m684j8377o279M409J5482Q158
$$ y = [-9695, -5495, -5269, 3663, 11063, 12874, 8411, 3291, 845, 2899, 14537, 13468, 10189, 1937, 7753, 6220, 12992, 11828, -3078, 20271, 45984, 38204, 38950, 33603, 35752, 30876, 23058, 11015, -4799, -1119, 64, 10550, 21984, 20508, 13989, 13469, 30117, 13622, 4401, 13579, 6671, 11351, 13271, -1822, -731, 5396, 17847, 29015, 21710, 15179, 18273, 23244, 12339, -6452, -4275, -6338, -11046, -13441, -13862, -2143, -222, 10133, 13107, 5891, 124, -877, -6712, -8515, -12083, -15741, -9185, -8068, -10433, -12673, -3279, 13336, 25395, 8476, -15866, -17076, -13451, -10463, -13969, -24753, -20564, 2638, 7005, 1081, -4174, 3846, -266, -16570, -6128, -3871, 10304, 29370, 24184, 18198, 22704, 25813, 16179, 1202, -9191, -163, -344, -2819, -7503, -25880, -32159, -27750, -12268, -4110]
11493d110O480j795j334j2806r0K773j3535j059J0008L61j373j0956o598M55n167
11478c8746J8004M026r709r534n016q40j976N331L0996J1954n565j1559J073J9662
11464H101j589o152J385P151k376j2328j0153j692P225K989n111O626J805r923
11450a4042J1990k818Q211J1868j9492j4746o157J0564o79q44M082M393m525J281
11436a0914L981L595p985j2912Q862R373Q709j95p164j6008q48J738N298R202
11422e268P624N153k349M722j1848K16l786o560J264J25m048J4803R210L293r313
11407C238j097J794r306j1596K130k036r635r384N586J1380J7320R216M341m594
11393G357j5520k640R512m163Q72M198l224L192l791R93k197j0712p075J295P648
$$ y = [-4110, 2370, 575, -759, -13565, -13655, -10882, -24417, -25476, -15468, -15107, -16480, -27436, -34034, -33579, -38746, -20742, -16716, -26425, -35959, -40975, -41815, -43791, -38460, -7464, 4490, -1075, -12634, -11561, 8101, 6512, 360, 1745, 8896, 6520, -5808, -15961, -17653, -10428, -7439, -12550, -5924, -4119, -14042, -2052, -4870, 3341, 15209, -4283, -19029, -25186, -14622, -15301, -16145, -12063, -7670, -12195, -10914, -6933, -3338, -11323, -24235, -15373, -6000, 2709, 2514, -4650, -20658, -21506, -19768, -14470, -5268, 2356, 7509, 5160, 9882, -1966, -1750, -5536, -12096, -10832, -10707, -14755, 48, 9258, 12551, 3238, 2141, 3935, -5371, -16967, -14837, -16873, -26508, -35892, -30306, -18926, -1606, 7610, 11951, 7357, -8163, -10803, -1291, -5454, -4582, -384, -3608, -416, -4207, -3214, -5411, -16123, -23198, -21903, -14255]
11378a4255N226J1550r202m803N417l841j120J1608m063j086K137L016O806J0170
11364A7560O107r279m642m181q047j2830l696o60O803M86P697N21o806j6859P050
11349b0776K01J3648P923K328j0376O932k402o197L474Q713j7495k635L815R984
11335b863P148q03m123j8001N870N476O326J5193M334r28j0225j1168o16M608
11321B28j325J649j5554K179J4356J1451r712j2429q307j409J8067M114M097O501
11307A3906m143j460k971j2744p35j620k231k934j364q830K1709J4192j3782P980
11293D973J1837r093m266m027O79J126M661N755m037m072p711o793l905M554J8792
11278H473J0660n886O074j900j5257p900L405J000J5571k103l151K006k661j3418
$$ y = [-14255, -9029, 2521, -6681, -11484, -6067, -9908, -11028, 580, -3483, -4569, -2432, 584, 7390, 17560, 23667, 14388, 9746, 5565, -2482, -15312, -19008, -19668, -12865, -12379, -4682, -4161, -10967, -27826, -20776, -20575, -6927, 996, 3324, -7052, -120, -2522, -8719, -5245, 3468, -14027, -16662, -12847, -2863, 4285, 3482, -641, -18642, -12772, -7296, -970, 14223, 18557, 17629, 7404, -3764, -4380, 228, -1097, 552, -15002, -12823, 1533, 12984, 3272, -9157, -17464, -18873, -806, 3308, 7405, 13906, 9763, 8303, 5332, -7412, -8147, -9767, -11998, -14932, -16296, -25126, -3417, 10775, -3007, 4973, 16810, 7717, 3451, -576, 103, 1229, 5890, 11645, 7608, 3536, -4175, -10968, -14873, -10319, 8473, 19133, 13247, 19321, 17421, 2164, -5736, -2331, -1331, 14240, 12137, 8986, 10992, 8331, -5087]
11264e087k098q76Q624Q307M87q758l478R892N325J0644K761j4493l893q309p366
11249h318p399M726J287n359Q411R733K391o82j429m77p911O210J4472o191O62
11234A0126J6025N24q177k0532q501Q291p743j215n005p656J5207L740j1556j5246
11220c1718N939J4528K1814j234r509o378J503K096j9891j2202J3632J9128Q738
11207F446o588J0515L871k351j8966j8344l374R811M039M964n107L918J5581q265
11193c850l663K637o36m927O43m676M707J0276j605N362L979l803M215L299j8175
11178f217j0119P451J0070N828j5948J3796K446Q134L643j4306k0406R9K425Q823
11164d281P143l544j8883o66N870J241k923n0N867J5247M14J511j3190j0634K549
$$ y = [-5087, -7185, -8061, 563, 8870, 9357, 599, -2879, 7013, 12338, 22982, 25743, 11250, 7357, -952, -8318, -15717, -10991, -9704, -15063, -6652, 3081, 5472, 4790, 3361, 2884, -5027, 1183, 15655, 9464, 10126, 26151, 26675, 18498, -2034, -10535, -2244, -9987, -11202, -16207, -23863, -8656, -4916, -16472, -31718, -25779, -11251, 10563, 9329, -180, -6558, -5055, -2959, -22850, -35052, -21420, -2292, 6446, -142, 10373, 14244, 11893, -7073, -25417, -28791, -18980, -14941, -9977, -15084, -11166, 4415, -3850, -7513, -4876, -5512, -10439, -9796, -14472, -9765, 511, -1094, 4268, 8247, 4444, 8659, 11958, -6217, -16336, -8885, 1185, 7013, -8935, 4861, 7307, 15441, 19084, 4778, -15628, -15529, -13104, -4281, 2862, -682, -19565, -20231, -14361, -13120, -16043, -16093, -10226, 5021, 5435, 6946, -6244, -16878, -14329]
11149a4329j197J2445L824j346P299Q819N211j4902j5801k584m106r209m49M137
11135b2188n323Q557m045m52J2200J911O002J783K509n421k336n349O057J5261
11121I166O231j1417k51K750j406r699m916N627K131p702J66J5442M686O060p343
11106I525q628R514N023L928K401l592n263o624k051j1393k013l66j7423n637
11092c2599J548k989j0461J7859J4880P25K968P624R306p712r97P705K08p25r96
11077F344L172M296L88j2357J8708j1387P23N323o608n572O10j085j5103j9970
11063c2518P393J8642J4261M157n552o183l307J2860j2941p970l087O573N264
11050b408O508N51L89k649j5831m004N040p52o233O637P683j345j565P56N325
$$ y = [-14329, -15526, -3081, 743, -603, 6696, 15515, 20726, 5824, -9977, -12561, -16667, -25876, -26325, -22188, -27511, -18954, -22999, -23451, -11251, -9340, -3338, -1555, 954, -4467, -6803, -12152, -6095, 9166, 15397, 3980, 3729, 6479, 5073, -4626, -9542, -3915, -1784, -9486, -9320, 6122, 10808, 16868, 9525, 897, 10411, 15434, 19362, 21763, 18171, 12908, 6284, 4233, -7160, -9173, -9539, -26962, -32599, -31051, -34040, -44501, -26642, -11762, -11037, -8069, -445, 8861, 1149, 152, 7857, 8065, 7340, 6344, 9516, 13812, 14200, 1843, 20551, 9164, 9887, 15210, 8602, 3030, 3640, 2555, -12548, -32518, -25125, -6483, 7778, 11935, 6383, 200, -3107, 9753, -3188, -11158, -14245, -7672, -2408, 4100, 4651, 5040, 2391, -13440, -17444, -12404, -13156, -19389, -12752, -5069, -6414, -7979, -7223, -1898]
11035a898R502o100n305r492k29Q28J677M271o122M39J0333N585N222j1013l426
11020e728j663j313K81p468j078n402K802J0454J3416J7089j7183j5982N275J2659
11006F159M788P151q050j7222p404q814O475J6397J0097N214o806L54k65O06N673
10991A4353l450k667j4350p090j0863r90J3995N477J290M264M584P677n664l767
10977B799k0618l256K811Q334J4868R650j791M271n170o922L585O479J120j8008
10963a848k867N61l821N138O76P546O717j1702j3888P431k454j28N247J212K564
10948C84J758l216O141J3J499O509Q85l548j1364M124N499j0484J412l099k607
10933f094j3474m180L580O416N271K267n314l171o386K074K717l163M471J2094
$$ y = [-1898, 7604, 1504, -3801, -13293, -13522, -12694, -11017, -6746, -12868, -12429, -2096, 3489, 8711, -2302, -5728, -7391, -8704, -8423, -15891, -16969, -22371, -19569, -9115, 4301, 21390, 4207, -11775, -6500, 6159, 10947, 18098, 10048, -7174, -14578, -23392, -16917, -520, 9577, 14791, 7985, 8339, 8074, 8680, 14353, 10903, 8236, -6114, -13204, -24067, -25057, -11062, -5585, -4295, -31, 4553, 12230, 6566, 2799, -17819, -21075, -18264, -9930, 4938, 14588, 12797, 17068, 11898, 4976, 8561, 15040, 16160, -1848, -4715, -4154, -7975, -2837, -2161, 5385, 12102, 400, -13488, -6057, -8511, -8639, -3392, -2180, 384, 2142, -1074, 5067, 5080, 6579, 13088, 13973, 10425, -939, 3185, 8684, -1800, -388, -3487, -6094, -19568, -23748, -20168, -13752, -8481, -6214, -11528, -14699, -21085, -19011, -16294, -19457, -14986, -2892]
10919b892J0880Q707M287q923r403l847r395m22J0097k53k327j269p894n142Q448
10904i348J7953j524j8596m731O08j534O288k692j0545Q946J0913j708j088R483
10890B425k21j807J69N259j0691j891k884J3217J2913o543m283j0387J2566J366
10876I208k1246r673J0271O451m09m094P095j326p989k235m25K772N389P87O88
10861d736n063J3005K1994r722k1506k2525O5n841P332J5141L034Q105J287K102
10847B672O00m727k229p899o522L611M661p648J413P230l016J216O600k71O326
10832B017L003K343K251L055j2469R217Q500m15r440J733m329m328l797O59J1752
10817I752m705j6189n510R041K072j1954q167R11o661j1908J1424J2980J3216
$$ y = [-2892, 7988, 16695, 20982, 12059, 2656, -1191, -10586, -11008, -911, -1164, -3491, -4760, -12654, -17796, -9348, 8605, 7081, -11515, -16246, -15638, -17172, -10884, -13576, -24121, -15175, -4262, -5970, -7058, 2425, 2204, 397, 566, 5825, -4866, -6757, -9641, 3576, 16489, 9946, 5663, -4724, 7842, 9208, -12038, -21711, -11440, -4989, -5398, -9492, -2397, -3723, -11712, -13947, -14372, -11600, -6211, -5424, -4736, -9799, 3206, 25200, 15478, -6028, -28553, -28488, -34329, -26997, -11856, -8822, -717, 570, 2672, 3272, -1455, -3684, -11583, -18105, -14494, -9833, -17481, -16068, -8838, -11854, -10638, -4038, -4309, 2017, 5020, 7363, 9614, 12669, 200, 9417, 17917, 17502, 8062, 9795, 5466, 1138, -2659, -2000, 9752, 5047, -11142, -16652, -7611, -5539, -17493, -25660, -24749, -31410, -43318, -31894, -18914, -5698]
10804e698J877m857M989O320O964Q959o331m455q276p738j813J8127L289k46j3097
10789a986j0940M83L839K489J4274l095p214m039P71j380k410O047L811l294P622
10774D978j822p471j831l586J0998O381J1030l672o260n254m744J851O825N971
10760A3394K236L560j1499k070l660Q3o940J2645Q206p735o29k280l233l637r109
10745a0668R660J674N163n479n696K890J148K295j2485l470K005J4602M213j0200
10731d348k4255n991l135J2821J9251Q927o97M950R558l9j2144j5198j1933j934
10717b4167k57K203J7234M042j169q325N910m495R51j6647o692R486N661O096
10703a0169Q427o064n547K805M83M400j3839J2330J889J2038j593k030p174n640
$$ y = [-5698, -3821, -8678, -3689, 2631, 9595, 18554, 12223, 7768, -508, -8246, -10059, 8068, 11357, 11111, -1986, -12926, -12443, -8604, -6115, 8159, 5064, -2150, -6189, -5418, -6798, -9208, -3161, 650, -2644, 4978, 3156, -4315, -6146, -9732, 1266, 7647, 18677, 15005, 8745, 3491, -1253, 598, 7423, 13394, 15630, 19190, 7691, 5621, 1961, 2044, -4896, 7749, 15955, 8220, 7591, 5311, 2078, -1559, -10668, -1008, 666, 5829, 350, -5346, -2456, -1308, 987, -11498, -14968, -12963, 1639, 5852, -4348, -28603, -34594, -37729, -24908, -5657, 3270, 2573, 7523, 17081, 17042, 4898, -10300, -22233, -24167, -24424, -22221, -4987, -945, -2114, -10439, -4529, -9024, -8073, -24720, -31412, -21926, -16265, -10169, -1742, -7806, -13353, -10548, -10065, -5665, -19504, -7174, -5285, 6753, 5160, 3130, -4044, -9684]
10689i684N12O816k029j6520o906P495l998o697m141q6J5966J1924O518m841j552
10674g223R180l935l478K54k083n04n848j315o293N826J1191q441r560J2438k666
10659a2457l39k032o93L318L984q952J3150J1143k420J236n963N548O838m107
10645H254o542j0191J1748N848k274N981J922o308j0041O401P667j925L988q811
10631E717m827N010o056l590O16J1195L766j5393j6789l057N252J7280J0154O927
10617A6205m657j502n16J1162O464q666k1620n529n764O858M379j776r677L435
10603a1204O486M173K409j2938q238N048P149k762j0888N46J5356J3006j931q722
10589b510k33j780J6517l351n221K566q326P593J1353j1968j4252n640l909N320
$$ y = [-9684, -9172, -2356, -4385, -20905, -27811, -20316, -24314, -31011, -35152, -35238, -19272, -7348, -830, -5671, -7223, 1957, -1978, -5456, -5202, -7285, -7789, -13637, -14952, -21245, -15419, -4228, -12669, -22229, -9791, -12457, -12796, -14828, -15521, -12203, -8219, -17171, -4021, 7122, 4702, 5938, -25, 5523, 12361, 8254, 1712, -8479, 3269, 9117, 6843, 12824, 14746, 8438, -1603, 4798, 12465, 10540, 14528, 5717, 890, 5900, -156, -3746, -3130, 8065, 11831, -3562, -20351, -23408, -18156, -876, 9278, 16205, 11548, 10046, 9530, 20692, 27156, 18490, -3130, -8659, -14423, -7565, -3186, -4962, -14639, -11204, -4718, -545, 1864, -11074, -19312, -14264, -7115, -9877, -20765, -20219, -4863, 8143, 6212, -2510, -2743, -4523, 11994, 8643, 3422, 5988, -2338, 5255, 16608, 4640, -9612, -15252, -19161, -13841]
10575a3841O582j2098l36Q731J0701O131j515k148K800N605m549n183M049j552
10561C377n225m897q325o449m028M747k109p547J2612m504m367O052J6605l410
10547g468j1486N310L635K195O617j005j122o712p143N051L377j1313j1280o930
10533c8274K19j0352J886R785J957q439O796J7803j9j6333j529J4682L616M5n901
10518b4058l952k636N424J5428K705j1256j5313R472J3939J470p295l589J4360
10505e301J7106o120M39J0878o056j3404l279K743l564j306M426l496o457j1062
10491b4453O640N195K117Q304K324j363P880k9J0974M581J468m303m405l895J1148
10476B2183r486N118K2059J7333j037j1290j083j4325j789J652j3386Q263Q399
$$ y = [-13841, -7259, -19357, -19693, -10962, -261, 5870, 4355, 2207, 5007, 10612, 6063, 880, 4929, 3377, -1848, -6745, -15070, -21519, -25547, -20800, -22909, -30456, -17844, -22348, -26715, -20663, -4058, -7468, -18954, -13644, -10009, -7814, -1197, -2202, -3324, -10036, -17179, -12128, -8751, -20064, -31344, -38274, -38055, -48407, -46521, -36736, -34779, -43218, -36422, -18619, -18638, -34971, -36500, -21818, -18202, -18157, -24058, -28010, -30646, -25222, -9794, -7089, -18345, -33658, -24186, -10247, -8777, -16072, -19661, -5301, 11805, 5685, 6124, 17002, 10946, -2458, -5737, -2994, -6558, -7864, -3438, -6934, -13391, -24453, -17813, -12618, -10501, -2197, 127, -1236, 6644, 6615, 17589, 22170, 23638, 19335, 14930, 11035, 22183, 12697, 17815, 39874, 57207, 56170, 44880, 43797, 29472, 27683, 29335, 15949, 24212, 32611]
10463C2611R365p219j0597k817j1263K14j046o684p825k433J4629J2175q461j5075
10449d426N838N419q442J0126k438q5p871r914o019k97J230J1407k68n541L991
10434g290k683j4342n423J6409N594m298R020J092r285n486M784j3330L819J3788
10420g631o71J375j15Q766Q682n002j3622p060J28p39J3126Q710l493j0357q724
10405a6627J8350O317l990J980M136k273M656R420J879q035r483P662J3184p667
10391A9509n615r128q337N721J0079Q336p52j6795k4819k942J4428J2643K409
10378D737J2731k394k704o86P654N476r209q475O402r141k0204l889J0500L1127
10364B1925J3603o383o655q87J0056J4940Q368M349j1433j3191P478Q339l65j1758
$$ y = [32611, 41976, 34757, 24160, 21343, 10080, 10294, 9248, 2564, -5261, -7694, 6935, 19110, 10649, -4426, 1412, 6831, -1611, 8515, 6077, 5992, -1879, -11793, -17812, -18109, -16879, -5472, -5740, -11281, -7290, -9973, -24315, -29738, -13329, -7735, -12033, -3013, -1921, -11206, -16692, -11908, -25238, -21419, -7631, -8302, -6927, -7042, 1724, 10406, 5404, -8218, -15278, -15150, -15889, -2763, 5947, 2454, -7903, -16627, 1723, 8040, 4050, 6030, 10166, 7893, 12549, 21969, 23848, 15813, 6330, 13992, 27176, 19509, 13894, 4766, -3571, 2150, 12229, 20565, 19813, 3018, -21801, -24743, -10315, 2328, 4737, 17468, 15074, 12370, 11684, 19338, 24814, 15605, 7130, 13532, 4391, -15813, -19702, -9202, 21925, 35528, 29145, 22490, 21603, 31659, 46599, 54967, 59316, 47883, 34692, 42170, 50509, 50144, 38386]
10350C8386q432K128j2211j8996j0797p42N574r103n708J56P181J060Q168J0753
10336G417j3097r832K324j328q716O656O411J2412J4000k85m835q890L593l209
10322B621q899j4666M875P130m818r066J6663O359J2385M529Q06m468p537L893
10308I807j0120l76j764m688N364q275M779p039k441r242j3525k363J6202K332
10294b1349k299N576J5671O711j0156m073j7669j4713O727P837Q880J8765n701
10281e793N79R226R696j305n110L212O725l448j2787Q039P680p842p987j4230
10267a3345P26N030l070L840O373Q009Q368N219m889j4605L251j5623m854J0083
10253e487J9058O152q720n946j140P896R982l951j7084q562M075k166K066q443
$$ y = [38386, 29954, 32082, 19871, 875, -9922, -10664, -5090, -14193, -19901, -19745, -12564, -11504, -3336, 7417, -5680, -15512, -13188, -14516, -23232, -16576, -10165, 2247, 16247, 15962, 11127, 2237, 5830, 2621, -6278, -20944, -16069, -8939, -13757, -22823, -6160, 199, 12584, 17113, 17919, 13451, 5914, 9807, -313, -689, -2453, -7141, -1777, -10052, -5273, -12312, -14753, -23995, -37520, -39883, -23681, -21349, -23648, -18072, -2401, 4310, -5846, -9919, -27588, -42301, -35574, -27737, -18857, -92, -5793, -5214, 4012, 13708, 12403, 7293, 10505, 17230, 13782, 995, 9034, 16714, 8872, 885, -13345, -12619, -7589, -10659, -6819, -446, 7563, 15931, 21150, 16261, 1656, 4907, -10716, -15570, -5487, 13571, 19723, 11003, 5057, 3917, 11813, 21795, 17844, 760, -7802, -3727, -5893, -3827, -12270]
10239a2270R503L40J2220Q044q720k043M15J1212j348n249o032p433m458m433
10225a0252P18q444J011J0774k502n314p507L158J009J7215J5381N332j6690j2306
10211h417j0093J3261J1222L660j4171L623j96M420Q076m158p972J2505L369n336
10197I793j3833l245j881P424J561o006j178m326J5121N565r113j537k822R042
10183D565J2450j591j093j0036j730J3048N354O262J5802m224n153j156p069J7713
10169D3142J0941l092n997k4782j2731L343r928L906o834j1393q755l17q52M531
10155a8818K1392K0287j966L826m993J116r554n495j4859m742N246K824j365J841
10141e260n855P395O576Q386p651o848L545J0400L231J0730Q262J276n552r600
$$ y = [-12270, -2767, -2427, 9793, 17837, 9117, 7074, 7489, 18701, 17353, 12104, 6072, -1361, -5819, -10252, -9534, -17978, -16967, -6193, -8695, -14009, -21516, -18358, -17349, -134, 15247, 20579, 3889, -8417, -18510, -5249, 5973, 9633, -4538, -915, -1111, 3309, 11385, 7227, -745, 11760, 15129, 9793, -4040, -7285, -9166, -1742, -181, -6187, -7365, -11691, 3430, 8995, -118, -1655, -4477, 4565, 17015, 15424, 14331, 4295, 2565, 15613, 20967, 27229, 43031, 38807, 33654, 32498, 25429, 43142, 54083, 50991, 44994, 20212, 7481, 10824, 896, 4802, -2032, -13425, -22180, -22497, -23349, -18818, 2574, 22861, 20895, 24721, 19728, 20844, 11290, 5795, -9064, -13806, -8560, -5736, -7101, -5260, -11115, -3720, 2856, 11242, 3591, -3257, 288, 10688, 13919, 24649, 32911, 34187, 28635, 19035]
10127A9035j3281r996P102j1203o262N204l502J2319K4103P777k38j538o794J666
10113B4392r729J255J3423j0263j7221O23p051k715L361q476p846m568m150M685
10099b4280J2966Q549J48J600o909j531Q709R728j630j0669J2898O121j6028j9036
10085a9364l418J1033J988K328K433r613R902J809j694K912j620j4220J2810J8247
10071A3533l136j1969j932m69r064j0080o513L16r06J2664M527P502Q440L769
10057F682Q2r975J0604J1186J0004J2212l049j338k209n512q060m191l201r437
10043C798j4280J068j285R319k720K877n634q205J455l583j1265q94J6664l819
10029a6504l596J215J0028k354l419o323k672J0155K226O585N202o037j0710L383
$$ y = [19035, 5754, -4242, 2860, -8343, -14605, -9401, -12903, -584, 23519, 31296, 31058, 29520, 22726, 24392, 14663, 15918, 29341, 19078, 1857, 2480, -4571, -7286, -3925, -12401, -20247, -24815, -28965, -24280, -11314, -2765, -2617, -1017, -7926, -9457, -748, 8980, 7350, -3319, 9579, 15700, -328, -19364, -22782, -11749, -9761, -7433, -5000, -14613, -4711, -2902, -4596, -1684, -3304, -17524, -4714, 13533, 10397, -1572, -3504, -3973, -13037, -23117, -29630, -29314, -30220, -17556, -13029, -5527, 2913, 6682, 6764, -3211, 7393, 18579, 28583, 40795, 37746, 36408, 34199, 28687, 20627, 16436, 13235, 3798, -10482, -9414, -10699, -1380, -4100, -1223, -6857, -15062, -13607, -17190, -28455, -29349, -12685, -16504, -20100, -18885, -8857, -11211, -14630, -20953, -23625, -13470, -11244, -4659, 543, -5494, -16204, -12821]
10015a2821J4791J0609j3495q656r976n210J4417j721J0307Q035r632O55N339
10002B642N023r91j1000p879q576r456J3563P496r724J039J1099J887m29j4015
9988a9321N892N753l117n63j1433L900N939k91n423J4443k731o47K107K544m349
9973g297j4376n819p179m586J6567J5356J619N742l623k16j5486m126P381M605
9959a1438J658J0341M120j4623j0026L014M022R542M47o540n553P09L398Q767
9945b162L202q844P656J5173R86n308q906q006m680j177L562j76O936r368N080
9930f032P483p552k993J624J5605j0424K698K932m976O401n30Q52l192k337K555
9915B114J3505j728j4857K144q361j3871O843J2265n839l150N588k60M503k062
$$ y = [-12821, 1970, 12579, -916, -9572, -19548, -24758, -10341, -12062, -1755, 6280, -3352, -2697, 2642, 7665, 6674, -4326, -12205, -20781, -30237, -16674, -9178, -18902, -17863, -6764, -4877, -5306, -19321, -13429, -7676, -10793, -11356, -22789, -18889, -12950, -13241, -18664, -4221, -6952, -7599, -5492, -2948, -7297, -21673, -27492, -34671, -39257, -22690, -7334, -5715, 27, -3596, -3812, -19298, -23424, -16043, -11438, -9780, 561, 4681, -9942, -19968, -16954, -12932, -3390, -2943, -9483, -15036, -14327, -10929, -2162, 1040, -7804, -148, 15025, 16011, 10703, 1797, -6209, -10889, -12066, -8504, -8680, -1744, -11112, -6032, 1451, -6101, -9094, -7470, 8135, -2289, 409, 3341, -1635, 4766, 4236, 5088, 1896, -441, 2114, 15619, 13891, -966, 1178, -7183, -21054, -14211, -1946, -7785, -10935, -5347, -5607, -1104, -3166]
9901c166k688P348j2090l326L965R695J5624P146k095N546R464o995j0135o309
9887A1984j2005p63m765P630m490K76M750p697m473J5138R008j229K584j839k271
9872A1838p198P127P074K256K278o938R558P070q71k471j0742j1754n61N680p501
9857D845p326Q572R264j072j0841k001k975j5493r584J346J0081J3200j805K524
9843a265o584J943J1759N13o716J21L069N123J736o582n360O373L427K36J2332
9828B0125q18j2308j497J5502m820K604J971l241q481O476L399O428q143j6052
9814A145k0407N345J9274j096M814k491l767j0653O849L04j236o439J90J2427
9800D259J5645q081j7226k834M970q468o760K481L812Q021M128M394M092j5675
$$ y = [-3166, -5854, 1494, -10596, -13922, -9957, -262, 15362, 22508, 20413, 25959, 35423, 28428, 18293, 11984, -21, -784, -5549, 2081, -2409, -2133, 2617, -5080, -9553, 5585, 14593, 13364, 15948, 14109, 11838, 4640, 11767, 18841, 21097, 23375, 16437, 25995, 33065, 32194, 29723, 18981, 7227, 6666, 12346, 4845, -2481, 6091, 15355, 14283, 3442, 1441, -1534, -17027, -26611, -25265, -15184, -1984, -3789, -1265, -7849, -5906, 5853, 6366, -350, -229, 2840, 7963, 9699, 3117, -2243, 4130, 7557, 7793, 20125, 19307, 6999, 5502, 21004, 16184, 18788, 20759, 17518, 9037, 15513, 18912, 25340, 17197, 1145, -19262, -13917, 5357, 4261, 9075, 6584, 2817, -7836, -987, -683, -1919, -8358, -8168, 4259, 19904, 11823, -5403, -8237, -3267, -11735, -18495, -16014, -12202, -4181, -53, 4341, 8433, -7242]
9786g242l149r770Q297J9009J5945o96j1728j1759O004J3160j7592K432J0737
9773A3648O318j4636j1381P861j1161l269J2805O557K367J1394l264j0159j6518
9760i438J382O205o536M735N556L82M02L762K865O845J9899P562j3110o272r609
9745A4630L50m191J242M391K219L499j1548J815n36j0178J2365O294K220j5518
9731G054j4163n826o06J3349j551P910J3375n298n767j964K364J4157k933m932
9717A5169n839o968k754k152J2099N071n137r621k506M688r860M03N155O328Q129
9702A2205N92P030k3739j6023N683R382J2240l037j0969n447j2949J0101J3050
9689a881J960O423O072R948N486j2211j6446j7967J1586N167N215K556q101N362
$$ y = [-7242, -10391, -20161, -11864, 7145, 23090, 22394, 10666, -1093, 4911, 18071, 479, 2911, 13648, 19966, 5330, -6051, 1810, -9351, -12620, 185, 6742, 9109, 20503, 17239, 7080, -9438, -8056, -1851, -8387, -3652, 1904, 2286, 2688, 6450, 9315, 16160, 36059, 43621, 30511, 24239, 14630, 14980, 10789, 12031, 16422, 18641, 22140, 10592, 12407, 11871, 1693, 14058, 20352, 22572, 7054, -7109, -12935, -13541, -192, -1743, 6167, 19542, 14244, 8477, 6513, 8877, 23034, 20101, 15169, 9330, 2362, -392, -2544, 9555, 14626, 9489, -132, -2638, 2050, -7810, -7407, -2252, 4076, 12205, 12797, 19827, -3912, -19935, -14252, -4870, 7370, 4333, -6636, -12083, -25032, -14931, -1881, 79, 6502, 12574, 22522, 28008, 15797, -649, -18616, -7030, -1863, 3352, 5908, -2193, 3169]
9675C169P222N113j3602j1116O700L749j0409j6489J722J013j0612K283J7542
9662a3715P032m253j1900l080J5425J5533l194j009Q619M039p603n397K595j0685
9648g593L033J343O529M969n433L940M400m2J023L286O130J0685j5623r927q366
9633a646q58k476k933Q962R338j178K708j569j007M399o840j1714R511L223P406
9618A5326J0235j1745j0873Q017M086J858L036L90l558l57k344O420J151m92J402
9603B2552m648m64o611n735n939Q069J0993q014r896Q938P878M974R751r370k0893
9588A585j053J2093j536m716O135k165p498q834J0271J8607J2223n058j810j971
9574B6273l751J641q358j2814L000J0207o515l633R571J273k721j796Q198K496
$$ y = [3169, 10391, 15504, 1902, -9214, -2514, 1235, -9174, -25663, -23941, -22928, -33540, -31257, -13715, -6683, -10936, -22836, -25916, -10491, 5042, 1848, 839, 9458, 13497, 5894, 497, 3092, -7593, -4560, -3217, 3312, 8281, 2848, 6788, 11188, 11146, 12169, 15455, 21585, 32270, 16647, 6720, -1646, -2504, -4980, -7913, 1049, 10387, 9209, 11917, 10348, 9341, 13740, 6900, -4814, 4697, 7920, 15326, 25561, 13816, 2943, 10960, 15046, 16904, 19940, 20330, 16772, 16415, 14071, 20491, 21642, 21150, 22552, 17904, 17440, 10829, 5094, -845, 7224, 18217, 10203, 307, 9245, 17123, 22097, 31848, 22478, 1585, 532, 12625, 11089, 6373, 12508, 10343, 2845, -5989, 4282, 22889, 35112, 30054, 28244, 26273, 22522, 24163, 15805, 2991, 5991, 16198, 9683, 6050, 15621, 16894, 14173, 12377, 20575, 23071]
9560B3071n245O021l75n377M632P295j1258j591O600K816l947q479k774J4472
9546B5861p941N685J1702q538j2714j676j107J87q182j1705J592J1163M814J8431
9532B7572j2796q732R124R278j938k998m45N737L636j006K012l975q863L858o851
9517A3613m86M922j3835J643N217O22O718q320q860J474p395N48Q151O30k646
9502A996p633o878P478j21J2374Q613J891K405q548q613j2487J1087O467L022
9488A1053O574N51m248m433j018o370j0858j347J078R102O300k862p232l565J0514
9473C239K73r41j8191m972J2634J0578L64P372P299k176j6611N721K3850P455
9459C5894N034n596o566j1234j2039l03q384m545o08R295O443Q090J1735Q042
$$ y = [23071, 17826, 23847, 23472, 18095, 22727, 30022, 18764, 17173, 23773, 26589, 22642, 14163, 11389, 25861, 17920, 23605, 35307, 26769, 14055, 12379, 11272, 11459, 3277, -8428, -6836, 4327, 9141, 27572, 14776, 6044, 15168, 24446, 22508, 19510, 19065, 24802, 28438, 27432, 29444, 25469, 16606, 20464, 13613, 13127, 18049, 4214, 5857, 11074, 11696, 18414, 10094, 1234, 2708, -4687, -4139, 4012, 4642, 1996, -5637, -12515, -5037, -5158, 7216, 15829, 17720, 20125, 11577, 2964, -9523, 1564, 8031, 11053, 17627, 18178, 13930, 9497, 8479, 2109, -8749, -10096, -9018, 84, 6384, 3522, -3710, -7275, 3239, 3512, 2571, -15620, -20592, -7958, 2620, 2984, 10356, 17655, 15479, -1132, 4589, 28439, 35894, 40928, 35332, 28766, 17532, 5493, 5190, -3194, -7739, -8347, 948, 7391, 15481, 27216, 35258]
9445C5258j2522j136K999m283l315N592j5117j2741q167r437O058K4439J934r581
9431a9p308J4768J0422L550L541j2298L762m203m432m496J2332R266P609J7q92
9416C1619j1210j8508r206m116N087o798K581J2831K3339o514r170M603J0637
9403B5175O603J5033Q467n586p012j770j303K901j0033j8981j316n109j2949J7684
9389A1804m598r849n715m744O237Q230O796p96R544k806n345O390L763O059j8374
9374F596m805N281R406j525q578O144J0535j5391m564J206J242l391K801L934
9360H891O976o836r326J198k732Q47N18J8523k2N940m790j7422k691P538m045
9345B567O795P752m865j1331n783K856M949R95J6818J080n937l747O758L294Q677
$$ y = [35258, 22736, 21600, 24599, 20316, 17001, 22593, 7476, -5265, -13432, -22869, -16811, 7628, 9562, -19, -7327, 7441, 17863, 21413, 24954, 12656, 16418, 12215, 7783, 3287, 15619, 24885, 32494, 32511, 31619, 20409, 1901, -7305, -11421, -6334, -13132, -10551, 2280, 25619, 19105, 9935, 14538, 25175, 31778, 46811, 55278, 49692, 42680, 40910, 39607, 42508, 32475, 13494, 12178, 7069, -5880, 11804, 7206, -2643, -8358, -13102, -6865, 1365, 8161, 7365, 16909, 14103, 8758, 15148, 18911, 24970, 6596, 1791, 7072, 16478, 14953, 6375, 12519, 23054, 7663, 3099, 4305, 5547, 2156, 4957, 8891, 15867, 9031, -295, 903, -1829, -982, -464, 18059, 18037, 23977, 19187, 1765, -926, 6612, 2567, 9362, 17114, 12249, 918, -4865, -2009, 2940, 3935, 20753, 21833, 15896, 12149, 18907, 22201, 30878]
9330C0878j0668j0961o880L772J8876J0848p811n011K284j564K485N438Q797K81
9316D0764j4162q284j1296p553O777r56L512N94R066J627j1766j6085J2856M871
9302I965O478j991J1270P393J0358M399R80k750m087o675k70k946j521O60L209
9287C4472l623j1297N30J5415K380l413K008J931J4525J8292j1530j2544J0878
9274E8024m855R03o645J073O794m637K266R255j418O657o987j2436k8o540j498
9259C9928o84K793j0056m72J2132J0350m211n978m984j0336M614J2925o658l34
9245C9029J2159n231M23L400p892k066J0574q67p198R058J6384K0944O84M695
9231I4096J845M280M70j9498K24J0790L560q107j4684N208K841r534n602J1535
$$ y = [30878, 20210, 9249, 2369, 6141, 25017, 35865, 28054, 23043, 25327, 23763, 26248, 31686, 40483, 40764, 26602, 18318, 7022, -531, 6246, 5290, 8802, 9396, 18462, 20089, 8323, -7762, 5094, 9965, 16443, 14452, 25722, 33115, 43473, 47872, 48852, 46102, 42015, 35340, 35070, 32124, 30603, 31263, 34472, 30849, 19552, 20082, 35497, 37877, 34464, 36472, 38403, 52928, 71220, 59690, 47146, 58024, 53169, 54072, 47427, 48500, 55294, 50657, 52923, 62178, 60760, 67417, 60430, 47994, 47966, 41426, 39928, 39244, 42037, 31981, 31509, 43641, 53991, 49780, 43802, 38818, 28482, 33096, 46021, 39363, 39029, 51188, 45957, 46380, 49780, 41888, 39822, 50396, 49529, 42331, 51389, 67773, 88717, 89401, 94096, 95941, 100221, 100691, 81193, 81417, 92207, 95767, 87660, 72976, 78184, 81025, 71491, 65889, 77424]
9217G7424L3424O558l719R003K4748J4583R477J8140L2383K8173M2900N6161O6861
9204D16116Q0290Q2506J05291J09582J26439J44068J75835J96256K47151L07754
9194A991288M37845O65313J094102J858175K801300L470076L663727K530451k410916
9185A6101361n884930m306607k214813j153999o89324m48421k89299k06161j72519
9176G35288j11751r3559p2635m8405l3260m0120l8415k2298j5739j6977j7938
9165B24191k7344j9907j7114O183M344j5146j0748J515o164p412n118Q704k307
9152A33677j4800j1222n631J0289Q181n625k667j3315q418Q293O055j348j2781
9139I0688p584k307q202k257K394J7142J9486J1256K148j4635k4887m148Q827
$$ y = [77424, 110848, 117406, 113687, 122690, 147438, 162021, 171498, 189638, 222021, 250194, 293094, 349255, 416116, 496406, 578912, 684203, 793785, 920224, 1064292, 1240127, 1436383, 1683534, 1991288, 2429133, 3094446, 4188548, 6046723, 8848023, 12318099, 15981826, 18512277, 16101361, 10216431, 5909824, 3695011, 2541012, 1851688, 1403267, 1113968, 907807, 735288, 623537, 529978, 457343, 408938, 375678, 335558, 297143, 274845, 259106, 242129, 224191, 196847, 176940, 159826, 166009, 170353, 155207, 144459, 145974, 139810, 132398, 127280, 135984, 133677, 118877, 107655, 102024, 112313, 120494, 114869, 112202, 98887, 90469, 98762, 104817, 103469, 90688, 83104, 80797, 72595, 70338, 72732, 89874, 109360, 120616, 122764, 108129, 83242, 79094, 87921]
9126H7921j0423J1931J1516L129k805J307q125q767n343n269N282l544j5248l833
9112E7729K018J2257N658M123J1368J122N11L13o345r559l872p766M680L313j3161
9097F2389J497K3387L2375J3062O1K6457M7562L2697L8164R1180J37785J71293
9085F77909J79371J57193J1951j87114k46650j97860j05617n5765m2002j9530
9075A71886l2588j8151j5527j255L497j4011l672q955l0J1149J1094M346K1611
9062A29394Q366j0151k999n287o537j3745n629K308J6370K620J3124J0949J5235
9049A54018L7067L3286L5913L8623O7614R7760J53457K43605L19774L78927L65322
9038A925366J32796l25763n48147m19391k55716j55818p7408l8703m5302l1571
$$ y = [87921, 77498, 89429, 100945, 104074, 101269, 102576, 94451, 85684, 80341, 75072, 80354, 76810, 61562, 57729, 59747, 72004, 77662, 81785, 93153, 94275, 94786, 95099, 88754, 79195, 75323, 67557, 72237, 75550, 62389, 63886, 87273, 119648, 132710, 132771, 159228, 206790, 239487, 277651, 368831, 506616, 677909, 857280, 1014473, 1026424, 839310, 592660, 394800, 289183, 233418, 191416, 171886, 139298, 121147, 105620, 104365, 107862, 93851, 90179, 81224, 81194, 92343, 103437, 107783, 129394, 137760, 127609, 124610, 119323, 112786, 99041, 93412, 95720, 112090, 114710, 127834, 138783, 154018, 191085, 224371, 260284, 298907, 366521, 464281, 617738, 861343, 1181117, 1560044, 1925366, 2058162, 1732399, 1184252, 764861, 509145, 353327, 275919, 237216, 191914, 160343]
9028A60343l0624j8065q009j5690n884K281r691M628J2556m996q7r681O311j0535
9014G2857L368J6832P972p426n583m746P376J5358P009J5573J8597K2006J3343
9001A82536J2460K5437L9724N1951R6729J52320J91035J65383P5673j04422k54696
8990F34130k25055j41703p9524l7121k1111k0833j1868j0987o505n304o652j276
8978F6191J146J330q355k4044q773k210P728R156j807J1268o972j123n28J1626
8964E4633K452L400K278M475j5989n049l642p441m512N955J4186K660K925J8061
8950G4392R167p839l412j642j1060n56J8980J6596Q594N095M125j750L2878N248
8936A48816m7059j4564j4835j9680J776n036P957K270j2776K545J648j096p00
$$ y = [160343, 129719, 111654, 103645, 87955, 82071, 84352, 74661, 79289, 91845, 86849, 86762, 77081, 83392, 72857, 76225, 93057, 101029, 93603, 88020, 83274, 90650, 106008, 113017, 128590, 147187, 169193, 182536, 194996, 220433, 260157, 312108, 408837, 561157, 752192, 917575, 993248, 888826, 634130, 409075, 267372, 187848, 150727, 129616, 108783, 96915, 85928, 79423, 74119, 67467, 66191, 67337, 68667, 60312, 36268, 27495, 25285, 33013, 42169, 40362, 51630, 44658, 43535, 43007, 54633, 57085, 60485, 62763, 67238, 51249, 46200, 42558, 35117, 30605, 36560, 50746, 53406, 56331, 74392, 83559, 75720, 72308, 70666, 59606, 59050, 78030, 94626, 103220, 108315, 112440, 110690, 143568, 148816, 101757, 87193, 72358, 52678, 54454, 49418, 57375, 59645, 46869, 49414, 51062, 49966, 49266]
8923D9266q314K33K234L211K052k416p305o933L320j1623j0515p010Q038J6275
8909C0513M550J4834J8530N706J8239k593k307m831j6034J6549R768R297K7109
8896A29330K5606q199J0711R4931M6138r8055p5965m1931j9659j5434j1726J2837
8884D8584L794q5q367L697R53J1365J2223N363J4156l337j9363j8103L299j6938
8870C7241j8263p438n695l972K0763L9927K2831m550n567j4906q843J0327J4505
8857G6360K602M116r924l608R076K4240K2603M055j8698K1389K8005m4500o2870
8844E2846k1541p567n702j0551o174N500K0925L7354K7321R572J3628J6377O218
8831A38206J183p813j0824J19j4341j9830k6184j6711p267k083J3262K7994J2834
$$ y = [49266, 40952, 41185, 43419, 46630, 48682, 46266, 38961, 32028, 35348, 23725, 13210, 6200, 14238, 30513, 35063, 49897, 68427, 74133, 92372, 89779, 87472, 82641, 66607, 83156, 92924, 102221, 129330, 154936, 146737, 157448, 252379, 298517, 200462, 124497, 82566, 62907, 47473, 35747, 48584, 52378, 52293, 43926, 47623, 48576, 59941, 72164, 77527, 91683, 88346, 68983, 50880, 54179, 37241, 18978, 11540, 5845, 1873, 22636, 62563, 85394, 80844, 75277, 60371, 51528, 61855, 76360, 78962, 83078, 73154, 69546, 78622, 102862, 125465, 129520, 110822, 132211, 160216, 115716, 52846, 31305, 23738, 18036, 7485, 1311, 6811, 27736, 65090, 92411, 101983, 115611, 131988, 138206, 139389, 131576, 120752, 120871, 106530, 86700, 60516, 43805, 36538, 34455, 47717, 75711, 88545]
8818H8545J6087k776j8188n878J0322k0018n3303n9409p9746l3506N9795O8541
8806b9534L5243K5990J8957P550q423j2744o155o415l439p751j4864j608J1990
8793H797M6908M8402K3045L0003K1312M219j921J9613j946j7686j4443J8461L848
8780A88612o105J3505K2128J4357P729Q608J319k9030k8404o334j6496N239Q801
8767A83929p9755j49030j90272j09831R0686J35487R4725N8740M7943M0693L5075
8756A58390P443k84L582J3506K784q092j9061p317K0150L3980J4971L0636L5562
8743B86250L3926P859K215J0546K0386J5272O815J4244L7753M9977L6276M1736
8731E63255M0837O954l0237j1753l2650q581K2052N6319O7055Q950k6350n1254
$$ y = [88545, 104632, 101856, 83668, 77790, 88112, 68094, 14791, -44618, -124364, -157870, -98075, -29534, 5709, 31699, 50656, 58206, 49783, 37039, 30884, 24469, 21030, 13279, -1585, -3193, 8797, 55705, 104107, 127152, 157155, 178467, 182686, 180765, 200378, 198432, 180746, 166303, 184764, 188612, 182507, 196012, 218140, 232497, 240226, 248834, 250153, 221123, 192719, 186385, 169889, 175128, 183929, 104174, -44856, -235128, -344959, -254273, -118786, -24061, 34679, 82622, 123315, 158390, 165833, 165549, 169131, 182637, 185421, 177329, 158268, 150951, 171101, 205081, 220052, 250688, 286250, 320176, 328035, 330250, 340796, 361182, 376454, 383269, 397513, 435266, 485243, 521519, 563255, 604092, 611046, 580809, 569056, 536406, 527825, 549877, 606196, 673251, 682201, 655851, 604597]
8719F04597l2012M5588J11221J21995J31537J46431J17205J23706J61945J90600
8709A722813K01661K09529K70184L35972M22450N21398O55161Q46063J013386
8700F198617J205598J427171J614493J718011J712432J780129K175392K829198
8692B0661041L817301N544122Q552751J3587146K1013176K9392393L5010351L4700931
8684A72279212J9304251k0884387n1044388m4410822k6567025j4884322q831163
8677B4961356n610441l775639k682379j952161j393965r54537o27330m16290l05405
8668G243209l08135l55511k98529j30771M978J48481L02139M55567O48749Q56683
8658H566860J109274J448279J803376K155919K575413K993521L266501L278004
$$ y = [604597, 572585, 618173, 729394, 851389, 982926, 1129357, 1246562, 1370268, 1532213, 1722813, 1924474, 2134003, 2404187, 2740159, 3162609, 3684007, 4339168, 5185231, 6198617, 7404215, 8831386, 10445879, 12163890, 13876322, 15656451, 17831843, 20661041, 24478342, 30022464, 38575215, 52162361, 73175537, 102567930, 137578281, 172279212, 191583463, 170699076, 119654688, 75243866, 48676841, 33792519, 24961356, 19350915, 15575276, 12892897, 10940736, 9546771, 8592234, 7964904, 7548614, 7243209, 6935074, 6579563, 6281034, 6150263, 6155241, 6303722, 6605861, 7061428, 7710177, 8566860, 9676134, 11124413, 12927789, 15083708, 17659121, 20652642, 23919143, 27197147]
8650B7197147L356209L972294N128369O891011R876231J5105702K4101535L8145758
8642A33774256N5170530O7749517P0425610N0123376k5360170r8208493r3997102
8635A59677524n7872058l2354411j9017381j1974550p996148n607401m084331
8628B0771244k944405k059024j427762j048770q36752q96066j161271j196534
8620I200660r32589o40243m19577k33923r2338K0504J69620L38234N12692P19161
8610H642201Q62313J039448J260369J455921J537077J571434J805524K297850
8602B0472137L122536M493750O815579J0733383J6882671K4828948L1768291L4163356
8594A53280651K7335821k214903m1129835m8795715l2721126j8427706j0628617
$$ y = [27197147, 30553356, 34525650, 39654019, 46545030, 56421261, 71526963, 95628498, 133774256, 188944786, 256694303, 327119913, 377243289, 351883119, 253674626, 159677524, 101805466, 69451055, 50433674, 38459124, 30462976, 24855575, 20771244, 17826839, 15767815, 14340053, 13291283, 12454531, 11558465, 10397194, 9200660, 8268071, 7627828, 7208251, 6974328, 6881990, 6902494, 7072114, 7410348, 7923040, 8642201, 9504514, 10543962, 11804331, 13260252, 14797329, 16368763, 18174287, 20472137, 23594673, 28088423, 34904002, 45637385, 62520056, 87349004, 119117295, 153280651, 180616472, 178401569, 137271734, 88476019, 55754893, 37327187, 26698570]
8587B6698570o591004m333983l010043k195572j612215j144094p88577n44228
8579F478854l93556l65265n45394o92229o06528m45882l14006k52293k18121j92687
8569B452893j65190j21978j14092j03104p8271r1174q5688m6386j7537J876k2005
8558A609344m7460j35981j07699n4300l4117l2260l1859k6473j1765j4832l1363
8547A081235n8418n7528m3523l2552k9232j3815k0729j8505k6917m717n39j890
8535G72870m998J4345J6079k203k4432j3833m946j0080l4166l9168l2024k9484
8523F07960k4807q439m887r838l399J0511L5316P7976J24134J35744O9544j10593
8511H99222j89559r6768n5912l7605l6833k8606k1016j5139k1450j8612J40Q528
$$ y = [26698570, 20107566, 15773583, 12763540, 10567968, 8955753, 7811659, 7023082, 6478854, 6085298, 5720033, 5174639, 4482410, 3875882, 3430000, 3115994, 2863701, 2645580, 2452893, 2287703, 2165725, 2051633, 1948529, 1870258, 1779084, 1693396, 1647010, 1629473, 1631349, 1609344, 1561884, 1425903, 1318204, 1263904, 1229787, 1197527, 1165668, 1139195, 1127430, 1112598, 1081235, 1022817, 965289, 921766, 889214, 859982, 846167, 825438, 806933, 780016, 775299, 774760, 772870, 767872, 782217, 798296, 796093, 771661, 757828, 752882, 742802, 708636, 669468, 637444, 607960, 583153, 574714, 569827, 559989, 556590, 567101, 602417, 680393, 804527, 940271, 1009815, 899222, 709663, 612895, 556983, 519378, 482545, 453939, 432923, 417784, 396334, 377722, 377862, 386390]
8499C86390j1068j2289J1538N99j2196n91k133J064k5568k4393k7550Q573K5991
8486C18367L5945L2125K9614M0643J84j6825l3489k3009k2798k9280q554Q31P28
8473C24482k369J1574J9560M7562M4362M6449R16n8125o0058m2898k1324l0064
8461B80067j2649o346N34L341Q694P331N724j4360l0551k3857j4621k126j8997
8448A82184q79Q032j4422j596K4129J4301J3771P529R880J7111J6758J3545j2167
8435B78176o812p240j5402j6654j7556m222m226j2432r163j3555m99o416o282
8422A57717K277P347q073q076Q716J9351Q991o119O768L017m165P740O825n011
8408A97305j1492j712n655k1526j0992m982n340j2452k588K970K036J3521Q433
$$ y = [386390, 375322, 363033, 374571, 375170, 362974, 362383, 360250, 361314, 335746, 311353, 283803, 292376, 318367, 354312, 386437, 416051, 456694, 456878, 440053, 406564, 383555, 360757, 331477, 322923, 323754, 324482, 322113, 333687, 353247, 400809, 445171, 491620, 492536, 434411, 374353, 331455, 310131, 280067, 267418, 261072, 261606, 264947, 273641, 280972, 286696, 272336, 241785, 217928, 203307, 201181, 182184, 181305, 189337, 174915, 173319, 197448, 211749, 225520, 233049, 242929, 260040, 276798, 290343, 278176, 271364, 264124, 248722, 232068, 214512, 210290, 206064, 193632, 184469, 170914, 170415, 163999, 157717, 159994, 167341, 159268, 151192, 159908, 179259, 188250, 182131, 188899, 191916, 187751, 195491, 202316, 197305, 185813, 184101, 178446, 156920, 145928, 140946, 135606, 123154, 120566, 123536, 125572, 139093, 147526]
8395A47526j1105O276Q739J426J4892K6249J7512j3337L004O834J4317k0068l0226
8382A72039j2192p965j1940q70K760j1495j9722j7589j0985q669J9819J9838J5917
8369A28946n144q310kP455r337q210q131j4619m586r54N42j797K446J3988l793
8354H8494l81J2792K6655J0567n200j3455n428j858J5097J2426N076K70M680N481
8340A55216N038n222l444j2087k3810j7449p874M710K829j7019n266r562p860
8327E8200K880N021P874K423J3457j114m222N667k855j546k471L064l032j0292
8313G3054l349O310m473P169J1281O279j1873p200J428N339M101p320m723N217
8299H1240r10J1298J0689K1035j70K036n034k447J7188K7729J0870K1382K2914
$$ y = [147526, 136421, 142697, 151436, 152862, 167754, 194003, 211515, 198178, 201182, 208016, 222333, 202265, 172039, 159847, 151882, 139942, 139072, 141832, 130337, 110615, 93026, 82041, 73372, 93191, 113029, 128946, 123802, 115492, 115490, 122945, 113608, 105398, 97267, 82648, 78062, 77108, 77650, 75853, 78299, 92287, 88494, 88113, 100905, 127560, 138127, 132927, 119472, 114044, 112186, 127283, 139709, 144785, 145055, 149735, 155216, 160254, 155032, 151588, 139501, 115691, 98242, 90368, 95078, 97907, 80888, 75622, 66060, 58200, 61080, 66101, 73975, 76398, 89855, 88741, 84519, 90186, 87331, 85785, 83314, 86378, 83346, 73054, 69705, 76015, 71542, 78711, 89992, 96271, 84398, 77198, 78626, 83965, 88066, 80746, 76023, 81240, 80330, 91628, 102317, 123352, 123182, 125218, 120184, 117737, 134925, 162654, 173524, 194906, 217820]
8286B17820K5885M4395N4798J01495J50212J80533J84873J25160q4323k65547
8276G35301k50304j51333q1610n4759m4917k6343j0478p574K314R367j7260j2365
8264I0039p961J603R5o233m55J1063k731j0628K237K0339P511J0865O792J7493
8250A40029J7642K0132R161K819Q196J0460K4704L7977M0432N6349P4884J19711
8238E62496J98525K92660L59850L65173K76227r5434n01502n07862l06824j70560
8228D72749j16604o6505m0742l6874k9714k0020k3242j9297j1397m528k532r135
8216I2159k3230O599J7392o415m906K3918O736o277j0042j6294O702P953M825
8203I9120P372P503K541P393J4104J7720K0395M1810N1226N6237P4946J14042
$$ y = [217820, 243705, 288100, 342898, 444393, 594605, 775138, 960011, 1085171, 1000848, 735301, 484997, 333664, 252054, 197295, 152378, 126035, 115557, 107983, 110297, 119664, 102404, 90039, 82078, 83681, 83776, 77543, 77088, 88151, 85420, 74792, 77029, 97368, 104879, 115744, 122536, 140029, 157671, 177803, 186964, 189783, 197979, 208439, 233143, 271120, 311552, 367901, 442785, 562496, 761021, 1053681, 1413531, 1778704, 2054931, 1959497, 1457995, 950133, 643309, 472749, 356145, 289640, 248898, 212024, 182310, 162290, 139048, 119751, 108354, 103826, 101294, 92159, 68929, 75528, 92920, 86505, 81599, 105517, 112253, 105976, 95934, 79640, 86342, 94295, 99120, 106492, 113995, 116536, 123929, 138033, 155753, 176148, 217958, 269184, 325421, 400367, 514409]
8191E14409J70557J73227J48302R003k12202k48019j64432r5180o9603n1259k2221
8180A52582m279k2146q585K47L82j8502j8297o284k2786k3733M126K0348o87m386
8166D8000Q441N283K750j246q845j2251j1461m60m534J946P964k76o924o192j1236
8151A0959P568J6360P674J7512L063l416j4611q167M080Q877O104K1039l768J525
8137G4799J739r767r771J0851J4554P175j1357j7168m768J2597P475J659J0378
8124H8396O337K41L238j7746k1305J38k699o916q949M95N556Q248J0449q178L908
8109F1213O513j2417k305J427l506J2140J572M343L09L574K750o596j4800j1761
8095D2456l721J6214J1510m024M368K3n282j2254K930K631Q237L376K824K012
$$ y = [514409, 684966, 858193, 1006495, 1015498, 803296, 555277, 390845, 295665, 226062, 174803, 152582, 148303, 126157, 117572, 117819, 118201, 99699, 81402, 75118, 52332, 28599, 32725, 53073, 52386, 48000, 56441, 61724, 64474, 63228, 54383, 42132, 30671, 30211, 25677, 27623, 35587, 35311, 28387, 22195, 10959, 18527, 34887, 42561, 60073, 63136, 59720, 45109, 36942, 41022, 49899, 56003, 77042, 73274, 74799, 76538, 66771, 57000, 67851, 82405, 89580, 78223, 61055, 56287, 68884, 76359, 78018, 88396, 94733, 94974, 98212, 80466, 59161, 59299, 56600, 49684, 40735, 41230, 46786, 55034, 65483, 57305, 61213, 67726, 55309, 53004, 54431, 50925, 63065, 64637, 68980, 69289, 72863, 75613, 69017, 54217, 42456, 38735, 54949, 66459, 62435, 66803, 66826, 61544, 49290, 52220, 54851, 63088, 66464, 69288, 71300]
8081G1300O034K0095K7294M407J3054K5301K706j7402l3324j0499k314n939j2412
8068H8301j3303J581r944k729L77M656k294m069j0299R781N216p110j2714L167
8054E0617K177j927J686j384J6038j490j0935j3023M046J2804J036n521J1481
8041F5605P448J7371Q771J0208M586J4745J2708R336R72L703J5276J1461j9955
8028A62235j3265j1946j1322j1007k0984q705j1026j831J45p818j7077r461l664
8015C4274M185L361M607J2915R946K130j1693P181q339K229N606J5422J0002L580
8001I5406k566j4843N808j47j836m115q01M809l895L988J7316O944K277o338P255
7986A09262l142l869j6037l619K370O87k43j9595j1603R856O425l849j2291l804
$$ y = [71300, 77334, 97429, 124723, 129130, 142184, 167485, 170191, 152789, 119465, 108966, 106652, 100713, 88301, 74998, 76579, 66635, 63906, 64283, 68939, 66645, 62576, 52277, 62058, 67274, 60164, 47450, 50617, 52794, 50867, 52553, 51169, 67207, 65717, 54782, 41759, 45805, 58609, 59645, 54124, 65605, 73053, 90424, 99195, 109403, 113989, 128734, 141442, 150778, 151750, 155453, 170729, 182190, 162235, 148970, 137024, 125702, 114695, 93711, 85006, 73980, 72149, 72294, 64476, 47399, 37938, 34274, 38459, 41820, 46427, 59342, 69288, 71418, 59725, 66906, 58567, 60796, 66402, 81824, 91826, 95406, 92840, 77997, 83805, 83658, 81822, 77707, 76906, 81715, 77820, 81808, 99124, 106068, 108345, 102007, 109262, 106120, 102251, 86214, 82595, 84965, 85652, 85409, 65814, 54211, 64067, 70492, 66643, 54352, 50548]
7972E0548j0269j209J9197mn953M496K188J711p775N149j559l296k743Q691K337
7957F1509o430N58K581P49K733p24n031q54k515M588n752J198k589n722j890j1732
7941C0677p560L115K357N275N458L424L218n336M255m107m885p293R208M426p859
7926C4373l244J0225K301K133n282N855J2661p671j3212K07n956j877k668j164
7912B6681R95J3594K737p60R195r594j6352l463L757K941P749N305q12j377j4471
7897B6125n677O664Q83l237J244N00o243K73J2876k426R824N986o771M367O053
7882E0441k463o287j5615j0281R841M452m391l390o449P681O172M828j3098j2827
7868H614N97j72k1j0921j52P567L964J683o747Q623M300K943j2957j1491P750
$$ y = [50548, 40279, 39070, 58267, 58263, 52310, 56806, 58994, 60705, 52930, 58079, 56520, 53224, 50481, 59172, 61509, 55079, 55637, 58218, 58967, 61700, 60976, 55945, 55091, 52576, 57164, 51412, 52610, 50021, 44299, 42409, 30677, 23117, 26232, 28589, 33864, 39322, 42746, 45964, 40628, 44883, 40776, 35891, 28598, 37806, 42232, 34373, 31129, 41354, 43655, 45788, 40506, 46361, 59022, 51351, 38139, 38346, 32390, 30513, 27845, 26681, 27676, 41270, 44007, 43247, 52442, 42848, 26496, 23033, 26790, 29731, 37480, 42785, 41973, 40596, 26125, 20448, 27112, 27995, 24758, 26002, 26502, 20259, 20532, 33408, 30982, 40806, 46792, 40021, 44388, 50441, 47978, 41691, 26076, 15795, 25636, 30088, 25697, 22307, 15858, 23539, 29711, 34539, 21441, 8614, 9211, 9039, 9018, -1903, -2055, 5512, 9476, 11159, 4412, 13035, 17335, 20278, 7321, -4170, 3580]
7853C580J1001L948J1763M997j6145l696N456M63j2355L01M705J7026N792r86
7839C5850r116P7L030P500j2784j5428n625J2930R558R57N18K962k1771j0447
7825a789R240M050n939M386J3944J9194J1855q299j7331j2395p789j370O617p427
7811F947J226p01J6244J190j0451l869J0020k1929m959J5616l190L125O364J4934
7797C0567l207q455n793J3115J33l587k081o379k661p250o528O223J6798J0589
7783C1484l389N811j314m846J324r304o963O798J5084N638j3102j7402p10j2894
7769c785o869K175R740R447Q585j882l46j261j997O743L673K860L20o023J5q100
7753A3295r741J981J1261O246p015k2460j1812N470J0386J1032M625J0657n761
$$ y = [3580, 14581, 18529, 30292, 35289, 19144, 15448, 20904, 21367, 9012, 9313, 14018, 31044, 36836, 35850, 26734, 26811, 29841, 37341, 24557, 9129, 3504, 16434, 25992, 26949, 27467, 30429, 8658, -1789, 7451, 11501, 5562, 9948, 23892, 43086, 54941, 46642, 29311, 16916, 9127, 7757, 14374, 6947, 8173, 7472, 23716, 24906, 14455, 10586, 20606, -1323, -6282, 9334, 6144, 9269, 15633, 30567, 27360, 18905, 13112, 26227, 26360, 22773, 20692, 14313, 11652, 4402, -2126, 4097, 20895, 31484, 28095, 33906, 32592, 27746, 29070, 19766, 12803, 19601, 34685, 40323, 27221, 9819, 9109, -3785, -10654, -8479, 1261, 10708, 19293, 17411, 17065, 15804, 13807, 20550, 24223, 27083, 27403, 21380, 21395, 13295, 3554, 5535, 16796, 23042, 16027, -6433, -18245, -12775, -2389, 8643, 13268, 23925, 18164]
7740A8164q127m486q02M973O667L202R004j1095j0225J2157J5076L638q534k3646
7726E966j5429k068N502J2798Q488n78j6146o956r523J5615K426r99J880k103
7712a127J0970J1409j2531j2611R576J1021J153j5809j4110O426J0457j669Q24
7699C979P344P09j1383J805J1696j386K242r108j1282J4179N156J136q429j5995
7685i337p320J5076R428p730J743K624j2061l899K455L498j046k2J322R827P049
7670A1607J605O223m56m617r181M343l452k505N256K968q329r244R556M107m655
7655C226J2736m007N452M2R28K607p733J2854j092j2197j7628j3858J4776J0845
7641F951q956j968J5889L009L098Ko095r548P103K964N067J435j30k374j188O243
$$ y = [18164, 10037, 5551, 4749, 9722, 16389, 19591, 28595, 17500, 7275, 19432, 34508, 38146, 29612, 5966, -9463, -11531, -6029, 6769, 15257, 14679, -1467, -8423, -17946, -2331, 95, -904, 976, -1127, 9843, 21252, 8721, -3890, 5686, 16707, 17860, 2051, -12059, -5633, 4824, 3155, 3979, 11323, 12032, 649, 2454, 14150, 12764, 15006, 5898, -5384, 8795, 13951, 15087, 6658, -9337, -16657, -1581, 7847, 117, 1860, 4484, -7577, -11476, -9021, -5523, -6569, -6591, -5269, 4558, 11607, 13212, 19435, 18979, 14362, 5181, 9524, 6072, 3567, 8823, 11791, 3462, -5782, 3774, 7881, 3226, 15962, 11955, 17407, 17449, 18377, 20984, 13251, 26105, 25013, 12816, -4812, -18670, -3894, 6951, -2005, -3973, 11916, 14925, 18023, 18025, 11930, 2382, 9485, 12449, 17516, 18951, 18821, 16447, 15259, 21502]
7625B1502L75Q62P997J055k516n064p980r724J0879Q237m647r252K831J5168k447
7610B7276n078j4331j7088j329N303Q84P282Q741r90J0647J115P69m200r832n313
7595C856j2690m637Q291M819M870M833O843P079P236p900m827N274j4560k564
7581E923J149r533m638J2028O324J32o262j5676J3485J1837J0143l398m114k052
7567A5348l825O640P543J890o904l556j917l473q906r352J5552J3550l284j4855
7553D451n602o3k432j6811o319K3528J5536L366r160k20k524L619k696o230O156
7538D599K795J790J203j986r609J557m271O8j54n828n660J0693J0484m190Q68
7523B359N942L992j1686j4542Q110J3794j3069o74J9580K67J0460K001j2823j6609
$$ y = [21502, 21877, 22739, 30736, 31791, 29275, 24211, 16231, 6507, 17386, 25623, 20976, 11724, 14555, 29723, 27276, 22198, 7867, -9221, -10550, -5247, -4363, 2919, 11660, 10670, 21317, 22432, 23201, 19001, 9169, 3856, -8834, -13471, -5180, -361, 4509, 9342, 16185, 23264, 30500, 22600, 17773, 23047, 8487, 5923, 7072, -2461, -7099, 4929, 11253, 11385, 5123, -10553, 2932, 14769, 24912, 21514, 17400, 15348, 11523, 18163, 25706, 27596, 20692, 17136, 15219, 11746, 2840, -6512, 9040, 22590, 19306, 4451, -1151, -1214, -3646, -20457, -26776, -3248, 12288, 15654, 6494, 6274, 3750, 7369, 4673, -1557, 4599, 7394, 9184, 10387, 8401, -1208, 349, -3922, -3854, -4008, -9836, -15496, -4803, 5681, 1491, 2359, 8301, 12293, 607, -13935, -5825, 7969, -5100, -5774, 13806, 14073, 24533, 26534, 13711, -2898]
7509b898l330O369P389o842j8023j1359K077P440M632L408K0117J2032L491N558
7495C0061M698r871k1738j137oL902K0054R99j6098q541K529J403N384M163o118
7480I684q903R474J3172j461j1290j787Q699Q29J0676q770r213l4n608j0555k922
7465h009n90O213M307N613J0258k634j4077l882l918J426r707Q723J4642p581
7451G84M674N608j816j406M844m746J3750K118r843l445N10k186K264k749j2882
7436d521M090N524K584N443L612k128n499j3445P758Q411q686j0676O331J1431
7422A0229K520p620j912j746Q498O860l87J731n961o260j2545q058l908r08Q926
7407a0541N013j360L85P583O182L080j084j4057j692K414K215l562K284l971J760
$$ y = [-2898, -6228, 141, 7530, 688, -17335, -28694, -26617, -19177, -14545, -11137, 8980, 21012, 24503, 30061, 34759, 24888, 3150, 2013, 2007, 5909, 25963, 26962, 10864, 2323, 4852, 6255, 11639, 15802, 9684, 781, 10255, 23427, 21966, 10676, 8889, 17588, 18417, 29093, 20323, 11110, 11076, 5468, -5087, -8009, -8599, -2386, 1921, 7534, 17792, 15158, 1081, -2801, -6719, -5293, -15000, -6277, 8365, 784, 5458, 11066, 9250, 7844, 12688, 7942, 21692, 23810, 13967, 10522, 11032, 8846, 11110, 8361, -4521, -431, 5093, 7677, 13120, 16732, 14604, 9105, -4340, 3418, 11829, 3143, -7533, -1202, 10229, 12749, 5129, 3217, 1471, 9969, 16829, 16442, 18173, 12212, 5952, -6593, -14651, -18559, -19467, -10541, -5528, -6888, -6503, 1080, 7262, 10342, 9258, -4799, -6491, -4077, -1862, -5424, -3140, -7111, -5351]
7392e351o566O860J4115Q065n500o366p774j819K34j349Q070M845k765o412o509
7377h222p254N055K4274L566O437j2031j2608n31K629k774p86l046o623j0636
7363b2550Q005N883L294L777N793L310J6094K092n683o286r166Q963N723k82r712
7348I255r807q9K164J155P362J563R591q448j0345l15Q93m557n46N423o993j4867
7332a8561M1l574O717P370K3185M878o171j460L934j0413l0238o882J3024J4107
7318d043k503k697j0824L848J0213J0599J4535l093j5407L928q88O497m197k261
7304C707Q94J015Q380p277J562o523j581P055R810J0518o525m684j5751r189O310
7289b279J1445R51l01M276J1300J2347O941o677k5872j0499m424L894J3301m801
$$ y = [-5351, -11917, -5057, 9058, 17123, 11623, 5257, -2517, -4336, -4102, -5451, 2619, 7464, 4699, -1713, -8222, -15476, -10421, 13853, 17419, 23856, 11825, -783, -1314, 1315, -1459, -2245, -5291, -11914, -22550, -14545, -8662, -5368, -1591, 4202, 7512, 23606, 25698, 20015, 13729, 4563, 13526, 19249, 18967, 9255, -552, -641, 1523, 2678, 10040, 11603, 21194, 12746, 2401, 2086, 2979, -1578, -2124, 3299, -3694, -18561, -18520, -22094, -15377, -8007, 15178, 20056, 13885, 12425, 16359, 5946, -24292, -31174, -18150, -4043, -6546, -9243, -20067, -16219, -6006, 4593, 19128, 16035, 628, 4556, 3668, 10165, 5968, 3707, 4601, 5616, 13996, 6719, 8281, 1758, 177, 7232, 17042, 27560, 21035, 16351, 600, -8589, -2279, 9166, 10117, 9816, 14092, 25392, 37739, 44680, 38003, 12131, 1632, -2792, 1102, 14403, 9602]
7275I602k3666p128N673M702N421J1511l602m25k929J3406J127p97n144l479o482
7260b210j0450j2926Q373J1481J3392o988k9742j972J5849l6j7225L408L1646
7247B600J6627m029q854K755j9285q610L102j381m122J4050j871r478K811J1409
7233d276J87M631J3633J764p801j2443K317N613N329P659n819n087M307p879J646
7218C781L000L383Q32j2368j3707J0618J2157O327j043K661P854q957j0194J426
7204E770m963q756j3P126R778n505R762J0861m949k0490J031J0502K959R263j461
7189B0915L581K797k621j7179j7517q645M728J0055O692l590N567o205q467r045
7175a8934N654L016L53M612Q716J563j8214o428J3422N353J185o980k000r190
$$ y = [9602, -14064, -21192, -15519, -10817, -5396, 6115, 2513, 2088, -841, 12565, 13692, 12895, 7751, 4272, -2210, -12660, -25586, -17213, -5732, 7660, 672, -29070, -31042, -15193, -15229, -32454, -29046, 2600, 19227, 15198, 6344, 9099, -10186, -18796, -15694, -17075, -21197, -7147, -9018, -18496, -15685, -4276, -4089, 542, 14175, 15939, 8138, -4305, -1988, 3625, 8954, 16613, 10794, 5707, 10014, 2135, 3781, 6781, 10164, 10996, -1372, -15079, -4461, 7696, 14023, 12980, 15641, 23495, 14538, 4344, 5770, 807, -7949, -7962, -836, 8942, 3437, 13199, 24060, 19111, -1379, -348, 10154, 13113, 22376, 20915, 24496, 27293, 24672, 7493, -10024, -18669, -13941, -3886, 2806, -784, 4783, -1422, -9889, -18934, -13280, -10264, -9911, -5299, 3417, 4980, -13234, -19662, -6240, -887, 298, -6682, -8682, -17872]
7161a7872N890J7489M963K354P602J491k941p464o418N068J1525p778n296q914
7147c01j3519k621Q313J1039l100j6792L297o820K41J480M836K953q427j446J5218
7132e649J2884L702j1439j2511N510K953J39q308J653Q689Q438p904M56L396l04
7117A705P67r068J360J213L318K0218J530R33j8130j4316O089M525l816N48Q89
7102b235n573J0226J4435M71j1639j0283k0475J1098J3955J679m211n37j1710
7089a4799p669K0106K7828J2223L525q817q932m136r848j6553L707m447N298l898
7075f412J886K725m873j7179J2432J8252K142q185p601l538L762k501m915J0381
7061c624J2540M438o36J045p002k1667o989R757J0194N838j533O688n718j986
$$ y = [-17872, -11982, 5507, 10470, 12824, 20426, 21917, 18976, 11512, 5094, 10162, 21687, 13909, 8613, -301, -13820, -16441, -8128, 2911, -189, -16981, -13684, -20504, -20263, -18783, -13947, -10994, -19421, -20867, -5649, 7235, 10937, -502, -13013, -7503, -4550, -4411, -12719, -11066, -2377, 6061, -1843, -1387, 2009, 1705, 2472, -6596, -5236, -4023, -705, 19513, 21043, 21976, 3846, -10470, -4381, 144, -3672, -3124, -2235, -7808, 2418, 16853, 17324, 5685, -4598, -25073, -13975, -20, 1659, -2552, -3089, -14799, -22468, -2362, 25466, 37689, 41214, 32397, 23465, 19329, 9481, -7072, -3365, -7812, -2514, -6412, -4526, -1801, -6674, -23853, -11421, 6831, 8973, 788, -6813, -10351, -6589, -9090, -14005, -3624, 8916, 13354, 12718, 13763, 6761, -14906, -21895, -12138, -1944, 3894, 2361, 9049, 3331, 1345]
7047A345p31P033J884k620j888j2003m265k308K512j561j2342l454J5851J4402
7033A855J5651j1056n114Q675J1922L083r307j1056P90L298q175j4662j0290j678
7019b6064J1426J8443m30J34r914k6254j3J2343J2483Q757L340J4769J1058m784
7005B5294r488K622j1108j2217J5363O437J877m461j552q842L948Q419o824k1533
6991a2065j6322J8052K6329M563j6522p151r969p459q877J3359K637j1221K7007
6978B361J1308j959Q325j0027j7168R812k98P63Q537Q458j895Q476N017m676j2136
6963A4898j5597M048R080J900Q073j247j1947r715R759N164J0815j2344o96j0271
6949A920j2855K837M925l569N018k3p3L476r322P720l377M396J3061p508r569
$$ y = [1345, 614, 7647, 9531, 6911, 5023, -6980, -11245, -13553, -11041, -12602, -24944, -28398, -12547, 1855, 17506, 6450, 1336, 10011, 21933, 25016, 15709, 4653, 5443, 8741, 566, -14096, -24386, -26064, -14638, 3805, 3375, 3509, -6405, -32659, -32672, -20329, -7846, 911, 4251, 19020, 30078, 25294, 15806, 18428, 7320, -4897, 10466, 16903, 18780, 14319, 12767, 3925, 7873, 16292, 9468, -12065, -28387, -10335, 15994, 20557, 4035, -3116, -13085, -20544, -29421, -16062, -13425, -24646, 2361, 13669, 11710, 20035, 10008, -7160, 2652, 2354, 3117, 11654, 20112, 18217, 26693, 31710, 27034, 14898, -699, 3349, 12429, 14329, 22402, 21155, 9208, -507, 9252, 14416, 25231, 12887, 12191, 1920, -10935, -8098, -3173, -6742, -1724, -1747, -1820, 1656, -7666, 54, -3323, 1073, 14134, 6626, -2943]
6934b943j1803m140J1192J0520M206K2363j231j3085j6662Q45o847M410J1306
6921H131K887j1430m241J3659J3873k1591j301J605R74j7798j1287L819O143N34
6907a6023J2120j785K582j6929o422J274r052Q486l20J0430Q85N416J1973J9522
6893B2157j440m476K342n335M833J7714M330k1326k1373m199R925k677j746l389
6879d660M562k74K627j440R18j0407m853R684m302p51K768l34R257J528K520M12
6863G255q248q50j926q686m500O777J3121N226R491j6261p478p269M808N006O596
6848C062M854o305k948Q67J063j35k702p782R122R185r397l756o607m136J5831
6833B16Q381M017l196Q629J3283J724j1959O067r00j4309o931p045N409r45k166
$$ y = [-2943, -14746, -18886, -7694, 2826, 7032, 29395, 28164, 15079, -1583, -738, -7585, -3175, 8131, 11018, -412, -4653, 9006, 22879, 1288, -13, 1592, 2566, -15232, -26519, -22700, -16557, -16023, -3903, -5688, -3106, -20035, -26457, -25183, -34235, -25749, -26069, -15639, -14754, -9338, 2635, 22157, 20717, 16241, 18583, 13248, 18081, 35795, 40125, 18799, -2574, -6773, 3152, 475, -1271, -4660, -98, -372, 2255, 815, 1733, -8674, -13527, -3843, -8145, -8896, -6128, -6462, 2795, 4323, 6843, 7255, -993, -1843, -3769, -12455, -16955, -10178, 2943, 8169, 17660, 1399, -6079, -13348, -8540, -3534, 3062, 7916, 1611, -1337, -470, 593, 458, -2244, -10026, -904, 8281, -1116, -4872, -11479, -15615, 216, 8597, 12614, 9418, 18047, 31330, 33054, 21095, 27162, 26262, 11953, 5022, -2023, 3386, 2441, 275]
6818B75l141q064L463j534j1584p316J0581J7364O412m897j6755q384L396m455
6804b4639j795j195J4523J9424N059m329m757J1735k03R20p435j1994n781L59
6790a0108J5911M124K247Q704J909j7861n121J3189l869P826m986p311m473j4461
6776a4280L456J8214K1123j1690j3776r285J5011R487j0778r700K279K180j2905
6763a0664Q41K907J2289L381q039q208J0213J1481k930L691m094o583n365M473
6749C393q85P72O733o44n287j0451p742M032J3096J1151o336o083m155j220J7694
6734A4068M489n890K231p971j0795p542k01n277Q500j870l62K718L633Q197J5432
6719A9360J0057J514j1250j1888o363P682M164O219l963j4169n086q428J739J2081
$$ y = [275, -2866, -10930, -7467, -9001, -20585, -27901, -17320, 44, 6456, 1559, -15196, -23580, -20184, -24639, -26434, -27629, -13106, 6318, 11377, 7048, 2291, 14026, 13823, 14743, 7308, -4686, -10467, -10108, 5803, 9927, 12174, 20878, 22787, 4926, -195, 12994, 9125, 16951, 11965, 4654, 181, -14280, -10824, 7390, 28513, 16823, 3047, -6238, 8773, 18260, 7482, -2218, 61, 2241, -10664, -9823, -6916, 5373, 8754, 715, -7493, 2720, 14201, 11271, 14962, 10868, 4285, -1080, 3393, 2508, 3280, 10013, 9369, 4082, -6369, -14111, -10079, 3017, 14168, 7832, 1749, -2406, -3626, 14068, 18557, 12667, 14898, 6927, -3868, -11410, -11611, -16888, -8388, -10258, -10620, -7902, -4269, 3928, 19360, 29417, 30931, 19681, 7793, 1430, 9112, 13276, 19495, 15532, 1363, -3723, -12151, -10412, 1669]
6705A669j919o496J329n455k653M419l852o905L815J3803N100j0986o736J379
6691a3488P125P471m683n220J0022k273q300k839l955M812J2979k90k370J143
6677A34O5L91R553l778N327k428r009q966r642j26J1184O574J552n089l076K360
6661d974N78o801N562o475Q742J6141J962j3319n143q274n014R221N934l101K294
6646b667k821L990M30j037o018p236L70O378j947l270O195O833p524o440M354
6631a0410O423K96n595o853J2264O412q326j045J84m628q212m635n907n52J5611
6616a4973M449J8122N294K6l453j5169m268K836M046Q05J598o480r57O281J6611
6601A4768l60q441j3797j7134q844J6979J0751J417K55M594j89j2352L02r889
$$ y = [1669, -250, -6746, -5417, -10872, -13525, -9106, -12958, -19863, -16048, -2245, 2855, -8131, -14867, -13488, -6363, 1108, -3575, -8795, 1227, -1046, -9346, -12185, -16140, -11328, 1651, 1361, -1009, 134, 199, 590, 10143, 6365, 11692, 9264, 255, -8711, -18353, -18479, -7295, -721, 831, -4258, -7334, -4974, -4396, -11197, -5635, -12110, -3368, 12773, 14735, 1416, -3727, -12001, -17015, -7794, -1860, -4961, -2667, -5488, -1498, -1068, -2105, -8123, -15359, -14989, -8611, -10558, -13828, -7633, -800, -8324, -14764, -10410, -3987, -3691, -9286, -16139, -3875, 2537, -5789, -6834, -6650, -11278, -19490, -24125, -30032, -30584, -14973, -10524, 7598, 12892, 12918, 9465, -5704, -9972, -7136, -3090, -2285, -687, -7167, -8124, -1843, 14768, 14408, 5967, -7830, -24964, -33808, -16829, -6078, -4661, -4406, 188, -1, -12353, -12051, -21940]
6587b1940m400J5368M800J756J762L725k427P409k633n910O891k767l192O633
6573E075j0121j3890J6618M273N310L634p436j292N838J0583j1487k315L437r785
6559a558Q523O340j296M685n944K779J890l0264j5297O647P394R420J1869m054
6545A134p893n971n529j6969Q69J6390R837J2366O002m499k490k349m160O315
6531C053O93j0299n253m256J5309o4M274j360N788j1642o548l567J843J4067n407
6516c369K568N676L059r653k0289j235J3451J2727n95o99N081p911j0299k946
6502a4434K187o013m136q93L925J4356p564j52K244K493R036m087p095j898Q3
6487a1948l133J223J873N628p021o975J73j3481N486j805l41m229J675L088J1978
$$ y = [-21940, -26340, -10972, -6172, -4416, -2654, 1071, -1356, 6053, 3420, -2490, 4401, 1634, -1558, 5075, -5046, -18936, -2318, 1955, 7265, 10899, 3463, 2171, 8009, 18592, 7105, 4790, 8227, -1558, 6965, 13305, 12009, 16694, 10750, 13529, 15419, -14845, -30142, -23495, -16101, -6681, 5188, 1134, -6759, -12730, -18259, -35228, -34359, -17969, -8132, 4234, 10236, 5737, 3247, 898, -3262, 3053, 3746, -6553, -11806, -16062, -753, -817, 3457, 2097, 7885, -3757, -10305, -13872, -12029, 2038, -3369, -801, 4875, 7934, -1719, -22008, -23243, -9792, 2935, 2340, 1641, 6722, -1189, -11488, -14434, -12247, -18260, -22396, -23289, -19364, -5008, -12572, -12724, -10480, -7987, 1049, -3038, -10133, -12031, -11948, -15081, -13858, -11985, -6357, -13378, -20353, -20180, -33661, -28175, -29980, -30321, -34550, -32875, -29787, -17809]
6472a7809J4884j1278m566J6308m655q820O046j4383q849N60J3338P370o153K512
6458a5495M856Q657Q976j2199j4931l830Q715J1615k167N400k782J028N968L18
6444D129L974R248k190o349l13M01J870j0108j0806l719m852o228J0536J3848
6430e59l212r141q147J7648K954k813O053J848o647r026k739P455J9856J70k404
6415A1296j1211j186k297q279J1862M133l428m96j1983m91j187J883m959k480
6401a8823J4096R388n949j4420l416J3200p864P43n749L242J4727Q978n661N812
6387H304J281r248p854Q807O93N603j502j8764k057P639R128J5133M456j355j4575
6372E689m297j2621R77Q992J2281L727O073p19j6284j2958O222J8189l472k040
$$ y = [-17809, -2925, -14203, -18769, -2461, -7116, -15936, -9890, -24273, -33122, -32562, -19224, -11854, -18007, -15495, -10639, -1982, 6994, -5205, -20136, -23966, -15251, -3636, -5803, -403, -3185, -2157, 3811, 4129, 8103, 17351, 15161, 8812, 8499, 8900, 10770, 662, -10144, -13863, -18715, -24943, -14407, -559, -3771, -12912, -21059, -3411, -457, -3270, 2783, 4631, -2016, -11042, -13781, -6326, 13530, 13700, 11296, 85, -1101, -3398, -11677, 185, 4318, 890, 394, -11589, -12080, -13267, -11384, -16343, -18823, -4727, 4661, -1288, -15708, -19124, -5924, -13788, -13045, -18794, -15552, -825, 8153, 2492, 8304, 9585, 337, -7517, 1290, 1983, 7586, 6084, -12680, -14737, -7098, 2030, 17163, 21619, 20264, 5689, 1392, -11229, -10252, -1260, 11021, 14748, 20821, 20102, 3818, -9140, -2918, 15271, 11799, 9759]
6358I759J0347N987r613j4111q663p020l884m22n071J4201J3456m299l644n120
6344h097L657L006R51q106j7540L484j224L7O644J1212J0659o357L002r64Q520
6329H884j81N777M421M892o219k833L194J1833n854j1224j3208K197J2210J16
6315A4005k1978j0855N569K309K923J5143l928k889q778J4835J695q762k797k215
6301e723k213N096k124j4114k700o929N677Q58P069j080R429J3005j27q341L378
6286A161P508o054l346p632P225J0566o341o452j1065N908K832q084q491J2525
6272i740P887o507N518j1939q216R098O145R727n58k012P792N185L151j706J7709
6257C1534M578n321r028r601J0786j661O735Q694j3307j6932o101m514O983P653
$$ y = [9759, 20106, 26093, 16480, 2369, -6294, -13314, -17198, -17620, -22691, -8490, 4966, 667, -2977, -8097, -4440, -1434, -483, -8589, -26129, -22645, -23869, -23832, -17188, -5976, 4683, -1674, 1328, 364, 8884, 8703, 14480, 18901, 23793, 17574, 14741, 17935, 29768, 23914, 12690, -518, 1679, 13889, 14005, -7973, -18828, -13259, -10950, -8027, 7116, 3188, 299, -8479, 6356, 8051, -711, -3508, -5723, -7936, -2840, -4964, -19078, -21778, -28707, -23030, -22172, -15103, -16183, -6754, 6251, 6124, -2217, 1161, 8669, 2615, -731, -8363, -1138, 9428, 3087, -3365, -14430, -8522, -5690, -13774, -22265, -9740, -1853, -8360, -2842, -14781, -22997, -13899, -7754, 1973, 1415, -597, 7195, 12380, 15531, 13825, 31534, 36112, 30791, 21763, 12162, 22948, 21287, 28022, 36716, 23409, 6477, 376, -4138, 2845, 10498]
6243A0498R04j3128j0015n230J871Q009P434k20j0644n460O523R598J945R836
6229A1921q660k765K36L115M97q344O907K073j7126K93P871p020o940Q227J7404
6214G689m585j0935O379Q877P722j679j3213j2117j517j2506l764P441O325J525
6200a4358Q72j960m357k54M930R625j593L299o429k165J6212K67k012O37j6595
6185a3881j8264O584J3971l329J4119L623l40r511q056l577J9496j0770L864k444
6171h515k011O290K505K267O033J5628n310j2420q338j041L598l880o117j537
6157a2848R5o348Q132P605M130n856Q797L967n136p890O00K719r401O0n31J2004
6141I9J524P284k988m724L355O784p513j499J2729R031j0099j9434n621P564J0646
$$ y = [10498, 11402, -1726, -11741, -16971, -15100, -7091, 343, 123, -10521, -15981, -9458, 140, 2085, 11921, 3261, 496, 732, 3847, 4344, -4000, 2907, 4980, -12146, -11853, -3982, -11002, -17942, -9715, 7689, 3104, -7831, -1452, 7425, 15147, 13468, 255, -11862, -13379, -25885, -29649, -22208, -15883, -14358, -13486, -15446, -19803, -20057, -15127, -5502, -7095, -3796, -10225, -12390, 3822, 4089, 2077, 2714, -13881, -32145, -25561, -11590, -14919, -800, 2823, 2483, -7028, -15084, -18661, 835, -9935, -6071, -8515, -10526, -4236, -1731, 536, 6569, 22197, 16887, 4467, -3871, -4912, -1314, -5194, -11311, -12848, -12753, -19101, -10969, -3364, 766, -5090, 3707, 7674, 2538, -5352, -4752, -2033, -11434, -11374, -11905, 99, 1623, 8907, 5919, 1195, 4550, 11334, 3821, 2322, 15051, 24082, 13983, -5451, -11072, -3508, 7138]
6126G138L142K65k502j659j475P331N86R886K289j8971j5349m430J1105j2370
6112a5014q031J1346J0207J2005O000o296m237O597K007j266o193p997O518j1425
6098e779j1224k706m70l818P640J4503J2150k269n711q248j0100j4383O041P353
6084a7021l739n29Q948J642M705q01M08L115j626J1639j2627N87m513m79J2803
$$ y = [7138, 10280, 10545, 8043, 6384, 4909, 12240, 12826, 22712, 25001, 6030, -9319, -13749, -2644, -15014, -23045, -11699, -1492, 10513, 16513, 10217, 5980, 12577, 14584, 13318, 7125, -872, 5646, -5779, -17003, -19709, -20179, -23997, -16357, -1854, 10296, 8027, 2316, -5932, -16032, -30415, -24374, -17021, -20760, -21289, -12341, -10699, -5994, -6795, -6387, -3272, -4898, 6741, -5886, -5299, -9812, -10291, 2512]
$$ [...]
##END NTUPLES=NMR SPECTRUM
##END=
