##TITLE=Analysis number 328701
Compound Code cc 49504
Book Reference 486/162
Project Code adrs
Chemist Name simons
##JCAMPDX= 6.0         $$ Bruker NMR JCAMP-DX V2.0
##DATA TYPE= NMR SPECTRUM
##DATA CLASS= NTUPLES
##ORIGIN= Bruker BioSpin GmbH
##OWNER= nmr
$$ XWIN-NMR		Version 3.5
$$ Wed Jun 27 10:09:01 2007 GMT Daylight Time (UT+1h)  MAYBRIDGE\nmr@NMR_250MHZ
##.OBSERVE FREQUENCY= 250.131544655141
##.OBSERVE NUCLEUS= ^1H
##.ACQUISITION MODE= SIMULTANEOUS (DQD)
##.ACQUISITION SCHEME= undefined
##.AVERAGES= 16
##.DIGITISER RES= 18
##SPECTROMETER/DATA SYSTEM= dpx250
##.PULSE SEQUENCE= zg30
##.SOLVENT NAME= CDCl3
##.SHIFT REFERENCE= (INTERNAL, CDCl3, 0, 16.4546)
##AUDIT TRAIL= $$ (NUMBER, WHEN, WHO, WHERE, WHAT)
$$ ##TITLE= Audit trail, XWIN-NMR		Version 3.5
$$ ##JCAMPDX= 5.01
$$ ##ORIGIN= Bruker BioSpin GmbH
$$ ##OWNER= nmr
$$ C:\u/data/dgb/nmr/ADRS/2080/pdata/1/auditp.txt
$$ ##AUDIT TRAIL=  $$ (NUMBER, WHEN, WHO, WHERE, WHAT)
(   1,<2007-06-27 10:08:39.59 +100>,<MAYBRIDGE\nmr>,<NMR_250MHZ>,
      <created by zg, POWCHK disabled, PULCHK disabled
       configuration hash MD5:
       76 6E 9A 78 1E 09 19 81 EC 84 63 8F B0 6A 59 2D
       data hash MD5: 64K
       49 CF CD 08 6F 36 7A B5 6B 4B 22 28 6C 0F 51 15>)
(   2,<2007-06-27 10:08:52.56 +100>,<MAYBRIDGE\nmr>,<NMR_250MHZ>,
      <Start of raw data processing
       ef LB = 0.3 FT_mod = 6 PKNL = 1 SI = 32K 
       data hash MD5: 32K
       C4 72 75 2A 98 D5 1D B0 59 61 57 9F 62 E5 EF 1A>)
(   3,<2007-06-27 10:08:54.23 +100>,<MAYBRIDGE\nmr>,<NMR_250MHZ>,
      <apk 
       data hash MD5: 32K
       D4 D2 D2 EA 3E 69 9B 4A A0 0C F9 2E 89 2B 92 2A>)
(   4,<2007-06-27 10:08:54.96 +100>,<MAYBRIDGE\nmr>,<NMR_250MHZ>,
      <abs ABSG = 5 
       data hash MD5: 32K
       14 24 2D A9 2C 9A 31 28 75 D1 CD BE 3D 8F C8 73>)
$$ ##END=
$$ 
$$ hash MD5
$$ D6 EB 44 93 B7 FE 3F BC BA 72 B6 2E 9D C6 D7 61
##$RELAX= 
##$RELAX= 
##$RELAX= 
##$RELAX= 
##$RELAX= 
##$RELAX= 
##$RELAX= 
$$ Bruker specific parameters
$$ --------------------------
##$DU= <C:\u>
##$EXPNO= 2080
##$NAME= <ADRS>
##$PROCNO= 1
##$TYPE= <nmr>
##$USER= <dgb>
##$AMP= (0..31)
100 100 100 100 100 100 100 100 100 100 100 100 100 100 100 100 100 100 
100 100 100 100 100 100 100 100 100 100 100 100 100 100 
##$AQSEQ= 0
##$AQ_mod= 3
##$AUNM= <au_zg>
##$AUTOPOS= <7 >
##$BF1= 250.13
##$BF2= 250.13
##$BF3= 250.13
##$BF4= 250.13
##$BF5= 500.13
##$BF6= 500.13
##$BF7= 500.13
##$BF8= 500.13
##$BYTORDA= 1
##$CFDGTYP= 0
##$CFRGTYP= 5
##$CHEMSTR= <none>
##$CNST= (0..31)
1 1 145 1 1 1 1 1 1 1 1 1 1 1 1 1 1 1 1 1 1 1 1 1 1 1 1 1 1 1 1 1 
##$CPDPRG= <>
##$CPDPRG1= <>
##$CPDPRG2= <>
##$CPDPRG3= <>
##$CPDPRG4= <mlev>
##$CPDPRG5= <mlev>
##$CPDPRG6= <mlev>
##$CPDPRG7= <mlev>
##$CPDPRG8= <mlev>
##$CPDPRGB= <>
##$CPDPRGT= <>
##$D= (0..31)
0 1 0 0 0 0 0 0 0 0.06 0 0 0 0 0 0 0.0002 0 0 0 0 0 0 0 0 0 0 0 0 0 0 
0 
##$DATE= 1182935318
##$DBL= (0..7)
120 120 120 120 120 120 120 120 
##$DBP= (0..7)
150 150 150 150 150 150 150 150 
##$DBP07= 0
##$DBPNAM0= <>
##$DBPNAM1= <>
$$ [...]
##$SUBNAM7= <"">
##$SUBNAM8= <"">
##$SUBNAM9= <"">
##$SW= 20.6930455092707
##$SWIBOX= (0..15)
0 0 3 0 0 0 0 0 0 0 0 0 0 0 0 0 
##$SW_h= 5175.983436853
##$TD= 65536
##$TD0= 1
##$TE= 296.16
##$TE2= 300
##$TE3= 300
##$TEG= 300
##$TL= (0..7)
0 120 120 120 120 120 120 120 
##$TP= (0..7)
150 150 150 150 150 150 150 150 
##$TP07= 0
##$TPNAME0= <>
##$TPNAME1= <>
##$TPNAME2= <>
##$TPNAME3= <>
##$TPNAME4= <>
##$TPNAME5= <>
##$TPNAME6= <>
##$TPNAME7= <>
##$TPOAL= (0..7)
0.5 0.5 0.5 0.5 0.5 0.5 0.5 0.5 
##$TPOFFS= (0..7)
0 0 0 0 0 0 0 0 
##$TUNHIN= 0
##$TUNHOUT= 0
##$TUNXOUT= 0
##$USERA1= <user>
##$USERA2= <user>
##$USERA3= <user>
##$USERA4= <user>
##$USERA5= <user>
##$V9= 5
##$VALIST= <valist>
##$VCLIST= <CCCCCCCCCCCCCCC>
##$VD= 0
##$VDLIST= <DDDDDDDDDDDDDDD>
##$VPLIST= <PPPPPPPPPPPPPPP>
##$VTLIST= <TTTTTTTTTTTTTTT>
##$WBST= 1024
##$WBSW= 4
##$XGAIN= (0..3)
0 0 0 0 
##$XL= 0
##$YL= 0
##$YMAX_a= 289528
##$YMIN_a= -269556
##$ZGOPTNS= <>
##$ZL1= 120
##$ZL2= 120
##$ZL3= 120
##$ZL4= 120
##$ABSF1= 16.45458
##$ABSF2= -4.238592
##$ABSG= 5
##$ABSL= 3
##$ALPHA= 0
##$AQORDER= 0
##$ASSFAC= 0
##$ASSFACI= 0
##$ASSFACX= 0
##$ASSWID= 0
##$AUNMP= <proc_1d>
##$AZFE= 0.1
##$AZFW= 0.1
##$BCFW= 0
##$BC_mod= 0
##$BYTORDP= 0
##$COROFFS= 0
##$CY= 12.5
##$DATMOD= 1
##$DC= 0
##$DFILT= <>
##$DTYPP= 0
##$F1P= 14.0000005364418
##$F2P= -0.99999901652339
##$FCOR= 0.5
##$FTSIZE= 32768
##$FT_mod= 6
##$GAMMA= 0
##$GB= 0
##$INTBC= 1
##$INTSCL= 1
##$ISEN= 128
##$LB= 0.3
##$LEV0= 0
##$LPBIN= 0
##$MAXI= 10000
##$MC2= 0
##$MEAN= 0
##$ME_mod= 0
##$MI= 0
##$NCOEF= 0
##$NC_proc= -3
##$NLEV= 6
##$NOISF1= 0
##$NOISF2= 0
##$NSP= 0
##$NTH_PI= 0
##$NZP= 0
##$OFFSET= 16.45458
##$PC= 1
##$PHC0= -50.97235
##$PHC1= 6.564659
##$PH_mod= 1
##$PKNL= yes
##$PPARMOD= 0
##$PSCAL= 4
##$PSIGN= 0
##$REVERSE= no
##$SF= 250.130016863342
##$SI= 32768
##$SIGF1= 0
##$SIGF2= 0
##$SINO= 400
##$SIOLD= 32768
##$SREGLST= <1H.CDCl3>
##$SSB= 0
##$STSI= 32768
##$STSR= 0
##$SW_p= 5175.98343685301
##$SYMM= 0
##$S_DEV= 0
##$TDeff= 65536
##$TDoff= 0
##$TI= <Analysis number 999999
Compound Code 99
Book Reference 9
Project Code 9>
##$TILT= no
##$TM1= 0
##$TM2= 0
##$TOPLEV= 0
##$USERP1= <user>
##$USERP2= <user>
##$USERP3= <user>
##$USERP4= <user>
##$USERP5= <user>
##$WDW= 1
##$XDIM= 32768
##$YMAX_p= 513024720
##$YMIN_p= -134002
$$ End of Bruker specific parameters
$$ ---------------------------------
##NTUPLES= NMR SPECTRUM
##VAR_NAME=  FREQUENCY,     SPECTRUM/REAL,   SPECTRUM/IMAG
##SYMBOL=    X,             R,               I
##VAR_TYPE=  INDEPENDENT,   DEPENDENT,       DEPENDENT
##VAR_FORM=  AFFN,          ASDF,            ASDF
##VAR_DIM=   32768,         32768,           32768
##UNITS=     HZ,            ARBITRARY UNITS, ARBITRARY UNITS
##FACTOR=    0.157963299565203, 1,           1
##FIRST=     4115.78444967083, 0,            0
##LAST=      -1060.19898718218, 0,           0
##MIN=       -1060.19898718218, -134002,     0
##MAX=       4115.78444967083, 513024720,    0
$$ Real data points
##PAGE= N=1
##DATA TABLE= (X++(R..R)), XYDATA
$$ [...]
##PAGE= N=2
##DATA TABLE= (X++(I..I)), XYDATA
$$ plain form
15855 -287000 -297437 -335890 -356477 -349356 -320376 -316175 -319069 -321917 -338714 -341908 -340932 -316208 -301537
15842 -301537 -317513 -327535 -317327 -294708 -314094 -311929 -297040 -292771 -285543 -296581 -285978 -283393
15830 -283393 -302521 -285511 -278438 -284517 -275531 -269648 -271840 -296199 -316208 -301423 -321819 -338898
15818 -338898 -344997 -312972 -273315 -261235 -280156 -294388 -290400 -306776 -308994 -285485 -263569 -244356
15806 -244356 -242903 -240943 -255859 -261223 -263190 -259594 -263946 -287618 -282476 -262022 -246230 -244919 -265364
15793 -265364 -275551 -294392 -283488 -284382 -280161 -308395 -319493 -314393 -350955 -351058 -295934 -272096 -295553
15780 -295553 -296767 -290029 -271950 -293660 -301496 -300074 -293903 -302980 -280690 -212246 -200686 -203184 -244960
15767 -244960 -240709 -232839 -229571 -235376 -269968 -256087 -242677 -265278 -270493 -241003 -248357 -236837 -242085
$$ packed form
15855b87000j0437l8453k0587P121K8980M201k894k848j6797l194R76K4724J4671
15842c01537j5976j0022J0208K2619j9386K165J4889M269P228j1038J0603K585
15830b83393j9128J7010P073o079Q986N883k192k4359k0009J4785k0396j7079
15818c38898o099L2025L9657J2080j8921j4232L988j6376k218K3509K1916J9213
15806b44356J453J960j4916n364j967L596m352k3672N142K0454J5792J311k0445
15793b65364j0187j8841J0904q94M221k8234j1098N100l6562j03N5124K3838k3457
15780b95553j214O738J8079k1710p836J422O171r077K2290O8444J1560k498m1776
15767b44960M251P870L268n805l4592J3881J3410k2601n215K9490p354J1520n248
$$ plain form
15754 -242085 -284309 -294882 -275134 -285698 -299180 -293053 -308561 -308933 -304051 -306763 -291853 -289425 -303228
15741 -303228 -314730 -299667 -287200 -275947 -275260 -291294 -297375 -296708 -308454 -305806 -293777 -315799 -304464
15728 -304464 -260329 -229216 -204415 -218203 -198045 -188263 -219900 -276367 -272960 -229530 -200643 -174657
15716 -174657 -168677 -192490 -222517 -238468 -248519 -274334 -272166 -269920 -323896 -363822 -358059 -351619
15704 -351619 -309685 -276034 -253172 -258052 -281393 -273659 -263137 -254127 -281032 -272301 -271483 -268402 -250375
15691 -250375 -268361 -275102 -282204 -278957 -281712 -280008 -256836 -238824 -226065 -243059 -275074 -273390 -255171
15678 -255171 -269002 -275254 -268930 -278435 -262793 -229390 -234844 -243991 -237261 -204244 -205963 -224200 -243743
15665 -243743 -280191 -295699 -275954 -261931 -267671 -265984 -278805 -306778 -343690 -340196 -310452 -310730
$$ packed form
15754b42085m2224j0573J9748j0564j3482O127j5508l72M882k712J4910K428j3803
15741c03228j1502J5063J2467J1253O87j6034o081O67j1746K648J2029k2022J1335
15728c04464M4135L1113K4801j3788K0158R782l1637n6467L407M3430K8887K5986
15716a74657N980k3813l0027j5951j0051k5815K168K246n3976l9926N763O440
15704c51619M1934L3651K2862m880k3341P734J0522R010k6905Q731Q18L081J8027
15691b50375j7986o741p102L247k755J704K3172J8012J2759j6994l2015J684J8219
15678b55171j3831o252O324r505J5642L3403n454r147O730L3017j719j8237j9543
15665b43743l6448j5508J9745J4023n740J687j2821k7973l6912L494K9744k78
$$ plain form
15653 -310730 -311780 -291372 -289992 -275345 -247487 -223226 -239170 -262967 -256946 -260912 -281539 -286021
15641 -286021 -274601 -286626 -283194 -259219 -253917 -260867 -252390 -251814 -271133 -267191 -260114 -280093 -274048
15628 -274048 -254261 -259775 -282915 -277345 -269624 -254160 -256457 -292014 -278723 -245705 -228495 -230193
15616 -230193 -210031 -207447 -221714 -218810 -220890 -258707 -253367 -275877 -325342 -330289 -267457 -256466
15604 -256466 -241647 -237171 -250557 -248423 -234705 -235474 -234961 -247273 -257950 -286161 -276676 -265960 -252613
15591 -252613 -241196 -215826 -220018 -238183 -247409 -255961 -253544 -247750 -277141 -249693 -221247 -207216
15579 -207216 -222529 -243525 -259073 -248259 -216578 -191709 -182110 -195693 -219186 -236253 -246257 -224505
15567 -224505 -233422 -230550 -250439 -295923 -300076 -272488 -221445 -217080 -210614 -213251 -206152 -222978 -217297
$$ packed form
15653c10730j050K0408J380J4647K7858K4261j5944k3797O021l966k0627m482
15641b86021J1420j2025L432K3975N302o950Q477N76j9319L942P077j9979O045
15628b74048J9787n514k3140N570P721J5464k297l5557J3291L3018J7210j698
15616b30193K0162K584j4267K904k080l7817N340k2510m9465m947O2832J0991
15604b56466J4819M476j3386K134J3718p69N13j2312j0677k8211R485J0716J3347
15591b52613J1417K5370m192j8165r226q552K417N794k9391K7448K8446J4031
15579b07216j5313k0996j5548J0814L1681K4869R599j3583k3493j7067j0004K1752
15567b24505q917K872j9889m5484m153K7588N1043M365O466k637P099j6826N681
$$ plain form
15554 -217297 -211678 -250685 -273676 -254779 -256149 -244181 -241900 -233372 -248107 -244541 -205847 -208827 -216897
15541 -216897 -212283 -240917 -227857 -237437 -256116 -240845 -230345 -237886 -254680 -263958 -276050 -264751
15529 -264751 -238936 -211457 -230716 -248969 -274998 -278119 -289408 -292108 -262969 -217172 -211932 -231678
15517 -231678 -242797 -257717 -287347 -269081 -293479 -312181 -299915 -284223 -260832 -266860 -286607 -283995
15505 -283995 -251542 -232598 -231249 -240989 -207695 -195580 -215009 -233638 -246890 -256419 -234177 -225322
15493 -225322 -223347 -213680 -192929 -168715 -147834 -149862 -173821 -192464 -200866 -202794 -206254 -219822 -228937
15480 -228937 -217577 -240805 -259152 -235577 -225091 -230135 -211395 -213540 -241418 -232259 -256910 -258579
15468 -258579 -270983 -247081 -250492 -254379 -250687 -237662 -207486 -230152 -258110 -228565 -190024 -197884
$$ packed form
15554b17297N619l9007k2991J8897j370J1968K281Q528j4735L566L8694k980q070
15541b16897M614k8634J3060r580j8679J5271J0500p541j6794r278j2092J1299
15529b64751K5815K7479j9259j8253k6029l121j1289k700K9139M5797N240j9746
15517b31678j1119j4920k9630J8266k4398j8702J2266J5692K3391o028j9747K612
15505b83995L2453J8944J349r740L3294J2115j9429j8629j3252r529K2242Q855
15493b25322J975R667K0751K4214K0881k028k3959j8643q402j928l460j3568r115
15480b28937J1360k3228j8347K3575J0486n044J8740k145k7878R159k4651j669
15468b58579j2404K3902l411l887L692J3025L0176k2666k7958K9545L8541p860
$$ plain form
15456 -197884 -198793 -188223 -199447 -209555 -222230 -248320 -230469 -233135 -231669 -228495 -243766 -238844 -229098
15443 -229098 -230610 -223416 -226666 -184760 -207361 -233906 -258845 -229391 -198142 -192805 -210251 -179091
15431 -179091 -159128 -186259 -208984 -186412 -195557 -214716 -198102 -164761 -180533 -202812 -198121 -178415
15419 -178415 -181542 -187576 -237109 -246327 -236030 -233648 -226333 -225587 -270681 -276731 -264453 -246354 -222324
15406 -222324 -207554 -248166 -262024 -254547 -254924 -259965 -245733 -230979 -208365 -192912 -180151 -187947
15394 -187947 -185961 -204352 -213917 -246344 -222711 -192431 -198505 -217786 -224261 -230038 -212933 -176775
15382 -176775 -147532 -179476 -205399 -213901 -226196 -209552 -217042 -236510 -223722 -219608 -199559 -188955
15370 -188955 -205598 -240847 -235710 -212546 -202124 -176435 -135427 -145019 -144174 -114493 -115580 -108575 -143640
$$ packed form
15456a97884r09J0570j1224j0108j2675k6090J7851k666J466L174j5271M922R746
15443b29098j512P194l250M1906k2601k6545k4939K9454L1249N337j7446L1160
15431a79091J9963k7131k2725K2572r145j9159J6614L3341j5772k2279M691J9706
15419a78415l127o034m9533r218J0297K382P315P46m5094o050J2278J8099K4030
15406b22324J4770m0612j3858P477l77n041J4232J4754K2614J5453J2761p796
15394a87947J986j8391r565l2427K3633L0280o074j9281o475n777J7105L6158
15382a76775K9243l1944k5923q502j2295J6644p490j9468J2788M114K0049J0604
15370a88955j6643l5249N137K3164J0422K5689M1008r592Q45K9681j087P005l5065
$$ plain form
15357 -143640 -148280 -131622 -138107 -159236 -155156 -172671 -180110 -181272 -181819 -199705 -201601 -217876 -234336
15344 -234336 -223484 -190882 -176349 -195323 -194355 -195900 -210693 -220271 -232333 -220508 -202707 -218144
15332 -218144 -219143 -218350 -229930 -194233 -183629 -195560 -201161 -194398 -201799 -188944 -177009 -165205 -159957
15319 -159957 -144966 -121400 -134157 -182075 -199287 -201958 -213860 -217329 -185935 -170734 -184341 -190720
15307 -190720 -178724 -169425 -174171 -221236 -247957 -222987 -223932 -206507 -188941 -217629 -242120 -214561
15295 -214561 -211593 -184121 -154707 -149125 -130262 -143295 -153118 -162727 -162862 -168212 -173067 -154056 -142764
15282 -142764 -153592 -153452 -163588 -181372 -181635 -204617 -216235 -199965 -215033 -209333 -172758 -182998
15270 -182998 -203578 -229580 -248736 -225143 -198405 -192071 -195216 -208849 -237627 -257252 -268129 -202561
$$ packed form
15357a43640m640J6658o485k1129M080j7515p439j162n47j7886j896j6275j6460
15344b34336J0852L2602J4533j8974R68j545j4793r578j2062J1825J7801j5437
15332b18144r99P93j1580L5697J0604j1931n601O763p401J2855J1935J1804N248
15319a59957J4991K3566j2757m7918j7212k671j1902l469L1394J5201j3607o379
15307a90720J1996R299m746m7065k6721K4970r45J7425J7566k8688k4491K7559
15295b14561K968K7472K9414N582J8863j3033r823r609j35n350m855J9011J1292
15282a42764j0828J40j0136j7784k63k2982j1618J6270j5068N700L6575j0240
15270a82998k0580k6002j9156K3593K6738O334l145j3633k8778j9625j0877O5568
$$ plain form
15258 -202561 -180108 -192504 -209092 -192801 -162466 -176301 -173179 -191665 -193305 -177061 -171445 -152445
15246 -152445 -136839 -137774 -153306 -173898 -176502 -154807 -121567 -106608 -121608 -141273 -138539 -161490
15234 -161490 -170000 -180256 -200479 -195863 -217446 -210520 -188165 -177718 -171019 -174810 -193592 -214579
15222 -214579 -208343 -168857 -165801 -176077 -194850 -200480 -191579 -204948 -235075 -213646 -219951 -270434
15210 -270434 -265797 -235654 -218216 -212758 -219938 -211081 -148682 -125486 -167767 -204819 -206760 -143278
15198 -143278 -130263 -146948 -140636 -145636 -143385 -130202 -146218 -159723 -133156 -112677 -128324 -149154
15186 -149154 -175395 -194007 -178095 -183911 -192717 -204491 -216254 -211485 -182711 -154733 -129517 -144064
15174 -144064 -144397 -154943 -132982 -128649 -140670 -134049 -138057 -173053 -167159 -165198 -134659 -151292 -157383
$$ packed form
15258b02561K2453j2396j6588J6291L0335j3835L122j8486j640J6244N616J9000
15246a52445J5606r35j5532k0592k604K1695L3240J4959j5000j9665K734k2951
15234a61490q510j0256k0223M616k1583O926K2355J0447O699l791j8782k0987
15222b14579O236L9486L056j0276j8773n630Q901j3369l0127K1429o305n0483
15210b70434M637L0143J7438N458p180Q857O2399K3196m2281l7052j941O3482
15198a43278J3015j6685O312n000K251J3183j6016j3505K6567K0479j5647k0830
15186a49154k6241j8612J5912n816q806j1774j1763M769K8774K7978K5216j4547
15174a44064l33j0546K1961M333j2021O621m008l4996N894J961L0539j6633o091
$$ plain form
15161 -157383 -151124 -162248 -188587 -192727 -168958 -141207 -133169 -156130 -149278 -169086 -189034 -177378
15149 -177378 -158129 -139231 -147799 -147923 -139252 -154254 -172414 -154787 -120731 -132261 -148805 -150004
15137 -150004 -145768 -153837 -132540 -121391 -134370 -142093 -153958 -155432 -175849 -151426 -130629 -137263
15125 -137263 -143054 -112794 -110000 -125023 -131943 -138892 -131392 -163522 -182797 -186909 -175936 -142739 -134824
15112 -134824 -114911 -108027 -97513 -104864 -128180 -140285 -127857 -154062 -144742 -131507 -111717 -86876
15100 -86876 -70988 -85076 -111245 -113008 -72174 -47463 -62348 -95840 -90343 -125902 -133774 -142163
15088 -142163 -130355 -118808 -100063 -104367 -95121 -70745 -90676 -132357 -137677 -143333 -162838 -157960
15076 -157960 -152175 -126022 -106376 -104012 -127701 -122932 -119356 -101039 -90509 -94917 -103136 -74628 -63703
$$ packed form
15161a57383O259j1124k6339m140K3769K7751Q038k2961O852j9808j9948J1656
15149a77378J9249J8898q568j24Q671j5002j8160J7627L4056j1530j6544j199
15137a50004M236q069K1297J1149j2979p723j1865j474k0417K4423K0797o634
15125a37263n791L0260K794j5023o920o949P500l2130j9275m112J0973L3197P915
15112a34824J9913O884J0514p351k3316j2105J2428k6205R320J3235J9790K4841
15100h6876J5888j4088k6169j763M0834K4711j4885l3492N497l5559p872q389
15088a42163J1808J1547J8745m304R246K4376j9931m1681n320n656j9505M878
15076a57960N785K6153J9646K364k3689M769L576J8317J0530m408q219K8508J0925
$$ plain form
15063 -63703 -44250 -49915 -71998 -98534 -105464 -100614 -112920 -91965 -81690 -87405 -92857 -103309 -109876
15050 -109876 -109817 -91489 -57072 -65764 -69409 -71171 -62952 -75728 -89605 -76669 -64114 -75449 -76640
15037 -76640 -89777 -116301 -131903 -123696 -82506 -99555 -70362 -29957 -2810 -43813 -63193 -88275
15025 -88275 -99292 -78068 -57889 -63154 -66561 -50708 -20665 -27261 -42358 -48663 -44407 -45631 -34273
15012 -34273 -11882 10745 15274 38724 47152 51268 69607 84072 104507 161760 194951 234257
15000 234257 301499 406057 480444 494265 320039 -140188 -572994 -798613 -801090 -706807 -613965
14989 -613965 -546614 -520804 -502079 -477325 -456979 -411189 -385567 -364076 -343496 -323299 -291797
14978 -291797 -279272 -280797 -290258 -259598 -238323 -239727 -224229 -233974 -266380 -253862 -220122 -230301
$$ packed form
15063f3703J9453n665k2083k6536o930M850j2306K0955J0275n715n452j0452o567
15050a09876N9J8328L4417q692l645j762Q219j2776j3877J2936J2555j1335j191
15037g6640j3137k6524j5602Q207M1190j7049K9193M0405K7147m1003j9380k5082
15025h8275j1017K1224K0179n265l407J5853L0043o596j5097o305M256j224J1358
15012c4273K2391K2627M529K3450Q428M116J8339J4465K0435N7253L3191L9306
15000B34257O7242J04558P4387J3821j74226m60227m32806k25619k477R4283R2842
14989f13965O7351K5810J8725K4754K0346M5790K5622K1491K0580K0197L1502
14978b91797J2525j525r461L0660K1275j404J5498r745l2406J2518L3740j0179
$$ plain form
14966 -230301 -242383 -248269 -258456 -249301 -275452 -284126 -281080 -244953 -209160 -210830 -204858 -208699 -232124
14953 -232124 -223672 -212254 -210627 -214834 -201747 -184166 -207095 -206197 -183514 -165042 -179113 -199773
14941 -199773 -175250 -163744 -132695 -137108 -161055 -157229 -182972 -201351 -209437 -223339 -196624 -172744
14929 -172744 -151732 -157583 -183726 -185343 -175129 -179636 -187585 -160148 -130710 -108981 -110367 -129775
14917 -129775 -142465 -120915 -128353 -117717 -128709 -198465 -205657 -176401 -152071 -157735 -157399 -147600 -187438
14904 -187438 -163443 -143132 -153101 -175810 -203708 -176666 -182677 -181601 -165538 -164955 -160016 -163956 -172932
14891 -172932 -176356 -181745 -157641 -160336 -159922 -120088 -105578 -118526 -116619 -137162 -160538 -164701 -155828
14878 -155828 -143098 -167893 -156744 -152953 -168253 -169293 -146724 -112321 -101648 -87745 -115152 -134362
$$ packed form
14966b30301j2082n886j0187R155k6151q674L046L6127L5793j670N972l841k3425
14953b32124Q452J1418J627m207J3087J7581k2929Q98K2683J8472j4071k0660
14941a99773K4523J1506L1049m413k3947L826k5743j8379q086j3902K6715K3880
14929a72744K1012n851k6143j617J0214m507p949K7437K9438K1729j386j9408
14917a29775j2690K1550p438J0636j0992o9756p192K9256K4330n664L36R799l9838
14904a87438K3995K0311r969k2709k7898K7042o011J076J6063N83M939l940q976
14891a72932l424n389K4104k695M14L9834J4510j2948J907k0543k3376m163Q873
14878a55828J2730k4795J1149L791j5300j040K2569L4403J0673J3903k7407j9210
$$ plain form
14866 -134362 -148498 -153399 -148266 -146706 -156341 -166419 -162729 -169260 -163494 -174455 -180893 -172449 -145443
14853 -145443 -159754 -164169 -174011 -178559 -157178 -142227 -152763 -176070 -202785 -146475 -139664 -159602
14841 -159602 -154845 -130395 -105978 -97429 -115166 -133248 -150110 -165623 -179199 -176140 -181643 -162162
14829 -162162 -157732 -141620 -133198 -142735 -115910 -138645 -164984 -170278 -144501 -131576 -118710 -143480
14817 -143480 -143377 -101032 -91204 -111547 -125097 -126378 -131775 -143802 -143197 -138024 -129722 -134935 -122781
14804 -122781 -102377 -56374 -74141 -117831 -117463 -126745 -142631 -166953 -160263 -168737 -173722 -154492 -137265
14791 -137265 -136891 -163119 -158866 -129760 -112035 -120137 -114270 -126252 -116114 -109303 -113991 -114111 -133659
14778 -133659 -163036 -185639 -173605 -151825 -119079 -104832 -107599 -100193 -96321 -88245 -64699 -72872
$$ packed form
14866a34362j4136m901N133J560r635j0078L690o531N766j0961o438Q444K7006
14853a45443j4311m415r842m548K1381J4951j0536k3307k6715N6310O811j9938
14841a59602M757K4450K4417Q549j7737j8082j6862j5513j3576L059n503J9481
14829a62162M430J6112Q422r537K6825k2735k6339n294K5777J2925J2866k4770
14817a43480J03M2345R828k0343j3550j281n397j2027O05N173Q302n213J2154
14804a22781K0404M6003j7767m3690L68r282j5886k4322O690q474m985J9230J7227
14791a37265L74k6228M253K9106J7725q102N867j1982J0138O811m688j20j9548
14778a33659k9377k2603J2034K1780L2746J4247k767P406L872Q076K3546q173
$$ plain form
14766 -72872 -79643 -97775 -109174 -119620 -127382 -121292 -112844 -88599 -83775 -62456 -73848 -72755 -82508
14753 -82508 -111443 -106476 -70726 -104356 -137039 -154110 -138243 -107910 -118429 -157887 -206359 -215885
14741 -215885 -175511 -136052 -137118 -149733 -121335 -120999 -146559 -157385 -120503 -131052 -141869 -148482
14729 -148482 -167657 -198489 -180581 -164338 -164378 -152724 -151821 -154351 -133932 -103489 -117727 -120086 -90931
14716 -90931 -90559 -77989 -79641 -104394 -114782 -111284 -122813 -135795 -143741 -120083 -94634 -77890 -57476
14703 -57476 -63933 -73681 -40690 -25411 -30614 -38311 -35502 -50343 -92893 -112760 -98563 -83594 -74945
14690 -74945 -35251 -25678 -54099 -81744 -92939 -72287 -77475 -105381 -115411 -153238 -141803 -141286
14678 -141286 -141459 -128766 -124312 -105725 -114751 -117178 -84044 -108331 -91838 -78501 -89794 -78208
$$ packed form
14766g2872o771j8132j1399j0446p762O090Q448K4245M824K1319j1392J093r753
14753h2508k8935M967L5750l3630l2683j7071J5867L0333j0519l9458m8472r526
14741b15885M0374L9459j066j2615K8398L36k5560j0826L6882j0549j0817o613
14729a48482j9175l0832J7908J6243m0J1654R03k530K0419L0443j4238k359K9155
14716i0931L72J2570j652k4753j0388L498j1529j2982p946K3658K5449J6744K0414
14703e7476o457r748L2991J5279n203p697K809j4841m2550j9867J4197J4969Q649
14690g4945L9694R573k8421k7645j1195K0652n188k7906j0030l7827J1435N17
14678a41286j73J2693M454J8587r026k427L3134k4287J6493J3337j1293J1586
$$ plain form
14666 -78208 -79394 -87907 -87692 -53045 -81454 -123372 -123973 -94066 -69482 -79783 -122950 -108195 -111304
14653 -111304 -119774 -151268 -159405 -123230 -117423 -111013 -97875 -90455 -91552 -62994 -52788 -47207 -56623
14640 -56623 -53379 -67022 -76122 -76658 -83797 -104405 -125263 -111037 -125361 -126872 -104658 -104116 -92395
14627 -92395 -70617 -57969 -38840 -42062 -63373 -87404 -104754 -104875 -124037 -125901 -84858 -59818
14615 -59818 -66494 -65942 -49713 -47403 -41761 -62434 -133456 -147651 -143356 -131469 -105688 -111949 -97107
14602 -97107 -92533 -82275 -94613 -109040 -113157 -88559 -93118 -78314 -74702 -90137 -92219 -110155 -108584
14589 -108584 -85300 -88089 -98877 -94514 -108049 -88577 -93904 -115045 -89154 -110549 -144408 -148466
14577 -148466 -112263 -71841 -60064 -34001 -30865 -40187 -37105 -66919 -70228 -70124 -89577 -109136 -92389
$$ packed form
14666g8208j186q513K15L4647k8409m1918o01K9907K4584j0301m3167J4755l109
14653a11304q470l1494q137L6175N807O410J3138P420j097K8558J0206N581r416
14640e6623L244j3643r100n36p139k0608k0858J4226j4324j511K2214N42J1721
14627i2395K1778J2648J9129l222k1311k4031j7350j21j9162j864M1043K5040
14615e9818o676N52J6229K310N642k0673p1022j4195M295J1887K5781o261J4842
14602i7107M574J0258j2338j4427m117K4598m559J4804L612j5435k082j7936J571
14589a08584K3284k789j0788M363j3535J9472n327k1141K5891k1395l3859m058
14577a48466L6203M0422J1777K6063L136r322L082k9814l309J04j9453j9559J6747
$$ plain form
14564 -92389 -71791 -56012 -86767 -96250 -62736 -50668 -60843 -67778 -83865 -84477 -101687 -109112 -112788
14551 -112788 -73767 -64159 -58279 -35404 -65251 -93920 -98574 -96468 -116141 -122446 -117057 -123474 -109820
14538 -109820 -107548 -113232 -81412 -78205 -77289 -76872 -89963 -93810 -95992 -100082 -100842 -70973 -55119 -75453
14524 -75453 -112850 -120701 -115075 -88374 -75528 -118144 -123789 -105525 -61696 -68308 -88757 -111796
14512 -111796 -111560 -82541 -57738 -44633 -28707 -10512 -32693 -64924 -58875 -60530 -57874 -54903 -86673
14499 -86673 -89977 -71246 -64072 -69311 -68179 -45654 -30104 -33519 -36454 -55383 -66398 -76637 -78049
14486 -78049 -97186 -108821 -89632 -74642 -51701 -43449 -32651 -23475 -36136 -52314 -36971 -36008
14474 -36008 -38295 -70980 -54610 -51878 -72219 -73961 -59083 -31510 -48457 -33028 -3478 16967
$$ packed form
14564i2389K0598J5779l0755r483L3514J2068j0175o935j6087o12j7210p425l676
14551a12788L9021R608N880K2875k9847k8669m654K106j9673o305N389o417J3654
14538a09820K272n684L1820L207R16M17j3091l847k182m090p60K9869J5854k0334
14524g5453l7397p851N626K6701J2846m2616n645J8264M3829o612k0449k3039
14512a11796K36K9019K4803J3105J5926J8195k2181l2231O049j655K656K971l1770
14499h6673l304J8731P174n239J132K2525J5550l415k935j8929j1015j0239j412
14486g8049j9137j1635J9189J4990K2941Q252J0798R176j2661j6178J5343R63
14474c6008k287l2685J6370K732k0341j742J4878K7573j6947J5429K9550K0445
$$ plain form
14462 16967 10330 -38611 -62086 -64951 -81814 -92305 -71910 -54155 -33762 -33533 -70980 -82590
14450 -82590 -63673 -77043 -90462 -90431 -111915 -115404 -113729 -94559 -97147 -95548 -90723 -75134 -60539
14437 -60539 -68641 -67290 -63215 -51826 -43152 -61530 -46321 -33090 -31974 -6810 6073 -9135 -34531
14424 -34531 -37414 -30812 -11777 -5964 -5454 -7363 -23566 -43901 -52563 -62464 -47730 -64462 -66233
14411 -66233 -38339 -30796 -35364 -29413 -13448 -17244 -29087 -28210 -3386 -32249 -43162 -26465 -18253
14398 -18253 -68213 -77831 -70038 -81917 -71217 -83473 -72946 -51689 -57680 -55467 -47380 -40686 -48851
14385 -48851 -33778 -744 4547 -18438 -30380 -28833 -27374 -47144 -95581 -97198 -55451 -42987
14373 -42987 -52965 -50396 -48557 -34470 -13603 -1351 -20636 -35423 -14019 -15319 -28958 -11870
$$ packed form
14462A6967o637m8941k3475k865j6863j0491K0395J7755K0393K29l7447j1610
14450h2590J8917j3370j3419L1k1484l489J675J9170k588J599M825J5589J4595
14437f0539q102J351M075J1389Q674j8378J5209J3231J116K5164J2883j5208k5396
14424c4531k883O602J9035N813N10j909j6203k0335q662r901J4734j6732j771
14411f6233K7894P543m568N951J5965l796j1843Q77K4824k8863j0913J6697Q212
14398a8253m9960r618P793j1879J0700j2256J0527K1257n991K213Q087O694q165
14385d8851J5073L3034N291k2985j1942J547J459j9770m8437j617M1747J2464
14373d2987r978K569J839J4087K0867J2252j9285j4787K1404j300j3639J7088
$$ plain form
14361 -11870 -19181 -20175 -6108 -24543 -25673 -34414 -45457 -52756 -49952 -57410 -73820 -58991 -16298
14348 -16298 -12724 -25859 1835 -10549 -31689 -40225 -54252 -48833 -58476 -41411 -21149 -18110 -19192
14335 -19192 -26987 8038 24525 9374 -2900 7981 25009 6481 -32961 -31243 -17842 -4004
14323 -4004 -2260 -4415 -32946 -44176 -71328 -97513 -86103 -96149 -94013 -63952 -52976 -61776 -70781
14310 -70781 -71780 -68186 -83218 -83684 -63779 -37010 -19690 -41264 -57263 -51686 -57616 -77733 -66185
14297 -66185 -22853 -8451 -6430 20455 22917 1182 -30416 -49191 -43424 -17413 -17492 -41647 -46882
14284 -46882 -37605 -9312 15273 -420 -31305 -60028 -41558 7676 9521 -7312 -11991 -8181
14272 -8181 -4391 1154 10723 7418 -8845 -26697 -17573 -44225 -38990 -36170 -12830 18717 20264
$$ packed form
14361a1870p311r94J4067j8435j130q741j1043p299K804p458j6410J4829M2693
14348a6298L574j3135K7694j2384k1140q536j4027N419r643J7065K0262L039j082
14335a9192p795L5025J6487j5151j2274J0881J7028j8528l9442J718J3401J3838
14323d004J744k155k8531j1230k7152k6185J1410j0046K136L0061J0976q800r005
14310g0781r99L594j5032m66J9905K6769J7320k1574j5999N577n930k0117J1548
14297f6185M3332J4402K021K6885K462k1735l1598j8775N767K6011p9k4155n235
14284d6882R277K8293K4585j5693l0885k8723J8470M9234J845j6833m679L810
14272h181L790N545R569l305j6263j7852R124k6652N235K820K3340L1547J547
$$ plain form
14259 20264 2223 -8061 -17997 -20231 -19572 -15827 15251 -14144 -23196 -16983 -37264 -43436 -55626
14246 -55626 -46882 -35875 -23246 19899 34544 -269 -19652 -31846 -13214 -514 7579 405
14234 405 -23214 -33823 -40256 -24163 12494 61964 50962 5889 -6472 -27805 -55984 -31698
14222 -31698 -37484 -32523 -11493 -511 -22187 -57695 -62541 -22594 -16194 162 -8485 -29887 -49350
14209 -49350 -54558 -64566 -62553 -43218 -21812 -19645 -18498 -8873 -19167 -34806 -40610 -30697 -15899
14196 -15899 -62084 -52217 -7116 -16797 -12750 -12258 2177 8296 -1641 -1899 -36363 -40062 -18850 13475
14182 13475 -6407 -44364 -35201 -9547 -29466 -40585 -29289 -16035 -64058 -87259 -69998 -43079
14170 -43079 -7578 -17435 -20367 -31410 -34081 -13901 -32162 -11233 -4771 -34126 -38906 -46206 -25008
$$ packed form
14259B0264j8041j0284r936k234O59L745L1078k9395r052O213k0281o172j2190
14246e5626Q744J1007J2629M3145J4645l4813j9383j2194J8632J2700Q093p174
14234D05k3619j0609o433J6093L6657M9470j1002m5073j2361k1333k8179K4286
14222c1698n786M961K1030J0982k1676l5508m846L9947O400J6356q647k1402j9463
14209d9350n208j0008K013J9335K1406K167J147R625j0294j5639n804R913J4798
14196a5899m6185R867M5101r681M047M92J4435O119r937k58l4464l699K1212L2325
14182A3475j9882l7957R163K5654j9919j1119J1296J3254m8023k3201J7261K6919
14170d3079L5501r857k932j1043k671K0180j8261K0929O462k9355m780p300K1198
$$ plain form
14157 -25008 -23161 -17788 -16215 -59047 -70321 -61240 -23847 -15542 -17013 -30060 -39511 -26481 -57563
14144 -57563 -67722 -37884 -21502 -24102 -17764 -61644 -67735 -46709 -38179 -20921 -19156 -18001 -12694
14131 -12694 3849 32440 -6721 -31595 -27093 -2724 1967 -18578 13913 23503 24488 -174 10564
14118 10564 4609 6601 32263 36171 13987 -4751 -501 -15089 -4575 -14380 -15514 -6965 2377
14105 2377 -8016 -1717 16807 37381 22077 -11882 11453 32105 12060 -3976 2633 -4725
14093 -4725 -14118 -14702 -35969 -51748 -30030 14810 33018 23209 6650 -24614 -20706 5945 -20497
14080 -20497 -19182 3500 26323 38665 43748 14224 19645 17299 7609 -2067 -9085 -8496 -18651
14067 -18651 -11361 7044 9343 7221 11882 24157 37140 21056 31571 46735 34120 16687
$$ packed form
14157b5008J847N373J573m2832j1274R081L7393Q305j471j3047r451J3030l1082
14144e7563j0159K9838J6382k600O338m3880o091K1026Q530J7258J765J155N307
14131a2694J6543K8591l9161k4874M502K4369M691k0545L2491R590R85k4662J0738
14118A0564n955J992K5662L908k2184j8738M250j4588J0514r805j134Q549R342
14105B377j0393O299J8524K0574j5304l3959K3335K0652k0045j6036O609p358
14093d725r393n84k1267j5779K1718M4840J8208r809j6559l1264L908K6651k6442
14080b0497J315K2682K2823J2342N083k9524N421k346r690r676p018N89j0155
14067a8651P290J8405K299k122M661J2275J2983j6084J0515J5164j2615j7433
$$ plain form
14055 16687 10530 -4282 12146 24653 40320 33077 17966 18713 16503 24457 25615 7972 -6323
14042 -6323 -30258 -11569 20404 28826 7085 7649 31195 47690 17046 19242 26392 55623 35198
14029 35198 3278 2476 3960 31673 44999 22389 13330 4228 -6187 11056 18627 3827 -8329
14016 -8329 -11862 -39507 -37307 -18460 -24215 -16967 14201 50436 48810 37557 40745 33016 8578
14003 8578 32440 31093 29349 41093 28784 42093 45406 38442 -1789 -8370 7090 11121 15111
13990 15111 22851 16625 49630 56876 22327 23299 17369 21606 44505 67865 68817 67997 62063 63898
13976 63898 38801 32845 50861 57464 35120 -2060 -20008 24923 66165 19917 5572 -16816
13964 -16816 -18686 -2557 -2234 8004 23446 52489 32360 11983 15570 7700 21640 22229 17520
$$ packed form
14055A6687o157j4812J6428J2507J5667p243j5111P47k210P954J158j7643j4295
14042f323k3935J8689L1973Q422k1741N64K3546J6495l0644K196P150K9231k0425
14029C5198l1920q02J484K7713J3326k2610r059r102j0415J7243P571j4800j2156
14016h329l533k7645K200J8847n755P248L1168L6235j626j1253L188p729k4438
14003H578K3862j347j744J1744j2309J3309L313o964m0231o581J5460M031L990
13990A5111P740o226L3005P246l4549R72n930M237K2899K3360R52q20n934J835
13976F3898k5097n956J8016O603k2344l7180j7948M4931M1242m6248j4345k2388
13964a6816j870J6129L23J0238J5442K9043k0129k0377L587p870J3940N89m709
$$ plain form
13951 17520 37859 38322 18922 31198 41562 26932 34248 55839 41384 31203 22329 24098 22688
13938 22688 35591 42340 25111 -8305 607 21916 12703 6092 22521 44700 40169 37153 43472
13925 43472 66101 70908 62122 11966 2595 -8137 -22361 -6718 33305 67698 54503 17268
13913 17268 31799 34155 45833 57099 64612 68803 87523 89906 78573 61469 15663 12476 24339
13900 24339 33270 9942 6075 24579 23644 8302 22777 2802 7217 41791 39685 2651 -6136
13887 -6136 20597 32030 46621 56912 71653 52234 20127 39579 27286 31298 28681 34883
13875 34883 35752 41400 33872 -7614 -6662 6128 9913 29956 42526 28470 19171 14269 30693
13862 30693 17534 -28526 1890 20665 39465 55400 74456 75904 71251 53762 48556 73547
$$ packed form
13951A7520K0339M63j9400J2276J0364j4630P316K1591j4455j0181q874J769j410
13938B2688J2903O749j7229l3416Q912K1309r213o611J6429K2179m531l016O319
13925D3472K2629M807q786n0156r371j0732j4224J5643M0023L4393j3195l7235
13913A7268J4531K356J1678J1266P513M191J8720K383j1333j7104m5806l187J1863
13900B4339Q931k3328l867J8504r35j5342J4475j9975M415L4574k106l7034q787
13887f136K6733J1433J4591J0291J4741j9419l2107J9452j2293M012k617O202
13875C4883Q69N648p528m1486R52J2790L785K0043J2570j4056r299m902J6424
13862C0693j3159m6060L0416J8775J8800J5935J9056J448m653j7489n206K4991
$$ plain form
13850 73547 75242 71748 39279 45208 60824 57168 52457 67246 46618 62779 99538 99481 81568
13837 81568 54475 42888 70987 76282 60964 62522 38599 35007 53835 56207 33120 7423
13825 7423 23949 78777 73021 31310 24009 36306 43496 28807 30407 47699 66645 75737 73988
13812 73988 71247 77352 94760 71998 54211 46357 44439 48600 58860 43595 22673 28486 31001
13799 31001 46692 50965 39029 37053 23689 40889 52149 47255 65212 85641 117112 130372
13787 130372 132793 121296 107594 106297 128864 127858 157105 152049 96942 76436 85653 118126
13775 118126 121390 112554 122634 106582 80769 98506 78184 65007 47718 16100 24316 38884
13763 38884 48604 77676 86844 64604 72769 96017 84377 74380 75220 88638 92318 113792 86608
$$ packed form
13850G3547J695l494l2469N929J5616l656m711J4789k0628J6161L6759n7j7913
13837H1568k7093j1587K8099N295j5318J558k3923l592J8828K372k3087k5697
13825G423J6526N4828n756m1711p301J2297P190j4689J600J7292J8946R092j749
13812G3988k741O105J7408k2762j7787p854j918M161J0260j5265k0922N813K515
13799C1001J5691M273j1936j976j3364J7200J1260m894J7957K0429L1471J3260
13787A30372K421j1497j3702j297K2567j006K9247n056n5107k0506R217L2473
13775A18126L264q836J0080j6052k5813J7737k0322j3177j7289l1618Q216J4568
13763C8884R720K9072R168k2240Q165K3248j1640r997Q40J3418L680K1474k7184
$$ plain form
13750 86608 88569 107226 108805 84933 53258 55578 90095 68579 6130 -31656 220 23097
13738 23097 24319 65530 82838 65176 68037 60472 56005 47470 49629 64008 55713 15613 58235
13725 58235 99985 106946 77080 12903 20010 26499 29430 48345 58154 44679 67322 85722 100714
13712 100714 104630 118275 106258 81918 76625 87274 100361 100337 66827 68549 57205 60974 88120
13699 88120 127070 136571 117866 95066 90949 63152 67452 84189 87380 86366 120977 103702 83618
13686 83618 82453 105478 96397 78499 80213 83923 83339 92029 104909 118113 69442 15773 38396
13673 38396 42235 69143 70939 89253 94214 86694 58423 69235 91301 64296 58671 53568 66398
13660 66398 66523 96984 83719 69663 105874 109686 87828 87994 120669 121328 121909 122093 109625 71937
$$ packed form
13750H6608J961J8657J579k3872l1675K320L4517k1516o2449l7786L1876K2877
13738B3097J222M1211J7308j7662K861p565m467q535K159J4379q295m0100M2622
13725E8235M1750O961k9866o4177P107O489K931J8915R809j3475K2643J8400J4992
13712A00714L916J3645j2017k4340n293J0649J3087k4l3510J722j1344L769K7146
13699H8120L8950R501j8705k2800m117k7797M300J6737L191j014L4611j7275k0084
13686H3618j165K3025r081j7898J714L710n84Q690J2880J3204m8671n3669K2623
13673C8396L839K6908J796J8314M961p520k8271J0812K2066k7005n625n103J2830
13660F6398J25L0461j3265j4056L6211L812k1858J66L2675O59N81J84j2468l7688
$$ plain form
13646 71937 53840 83276 106629 111522 84596 82583 74623 71332 75667 104441 123960 124962 123721
13633 123721 128593 109976 109982 105922 89123 97182 102591 102833 101115 107621 93236 93962 100627 72954
13619 72954 81554 101317 79796 68007 54331 64536 77068 49766 73891 101236 117095 121959
13607 121959 109273 97718 104789 106080 100261 89824 76841 93033 113470 81777 72049 99559
13595 99559 116987 116997 121309 102693 57573 75628 94553 106470 98687 106488 113888 103539 100341
13582 100341 104168 64677 31056 24007 53910 58165 63716 61553 64103 100935 147493 143353 104128
13569 104128 98141 89310 88155 86480 98262 107447 107602 89716 98375 114721 114687 111569 135033 147833
13555 147833 133947 125663 114713 101508 69906 71253 91539 97750 100865 114880 100777 96333
$$ packed form
13646G1937j8097K9436K3353M893k6926k013p960l291M335K8774J9519J002j241
13633A23721M872j8617Om060j6799Q059N409K42j718O506j4385P26O665k7673
13619G2954Q600J9763k1521j1789j3676J0205J2532k7302K4125K7345J5859M864
13607A21959j2686j1555P071J291n819j0437j2983J6192K0437l1693r728K7510
13595I9559J7428J0M312j8616m5120J8055J8925J1917p783P801P400j0349l198
13582A00341L827l9491l3621p049K9903M255N551k163K550L6832M6558m140l9225
13569A04128n987q831j155j675J1782R185J55j7886Q659J6346l4l118K3464J2800
13555A47833j3886q284j0950j3205l1602J347K0286O211L115J4015j4103m444
$$ plain form
13543 96333 102157 110390 111486 91988 70808 89480 129234 125293 115278 142418 155404 115992
13531 115992 94795 104017 128312 119661 111426 121323 135206 122627 93664 121381 147123 166571
13519 166571 128067 110135 107877 83805 64996 71759 95556 102970 101851 96660 94081 90413 115145
13506 115145 128856 152915 142155 126475 115064 102135 112527 127692 128883 132866 111710 89370
13494 89370 68321 66806 90904 108303 124431 105815 87785 92892 71806 94587 106877 90615
13482 90615 86294 102905 108382 109902 132126 128215 108098 96707 104747 107137 109617 104845 99209
13469 99209 133161 138957 141917 158522 165921 144899 144098 157630 146866 137395 127344 98271 99714
13456 99714 117190 110491 126880 144814 131170 137933 164249 164636 166868 151137 130846 145658 149944
$$ packed form
13543I6333N824Q233J096j9498k1180J8672L9754l941j0015K7140J2986l9412
13531A15992k1197R222K4295q651q235R897J3883j2579k8963K7717K5742J9448
13519A66571l8504j7932k258k4072j8809O763K3797P414j119n191k579l668K4732
13506A15145J3711K4059j0760j5680j1411j2929J0392J5165J191L983k1156k2340
13494H9370k1049j515K4098J7399J6128j8616j8030N107k1086K2781J2290j6262
13482I0615m321J6611N477J520K2224l911k0117j1391Q040K390K480m772n636
13469I9209L3952N796K960J6605P399k1022q01J3532j0764r471j0051k9073J443
13456I9714J7476o699J6389J7934j3644O763K6316L87K232j5731k0291J4812M286
$$ plain form
13443 149944 150744 158000 148909 136375 118962 97736 97016 122841 157077 140728 124803 113910 114094
13430 114094 130962 105429 112642 116548 103569 88157 85312 122885 161518 168351 152911 127003
13418 127003 130870 139317 137301 144820 156757 146637 135721 174344 206257 187012 171603 153434
13406 153434 139500 150511 149318 158948 184733 171939 188985 195126 163751 162416 175881 150885
13394 150885 147481 191105 189640 171936 165152 181511 159101 174873 147581 136193 148891 130939
13382 130939 126046 132765 131915 148098 113720 96265 75478 77631 107097 112398 118588 157719 172311
13369 172311 171124 133514 115356 110840 157782 181708 193867 180157 188848 179541 173192 153170
13357 153170 176836 172562 154491 140894 146675 144510 152309 147465 145163 121891 123829 154210 175075
$$ packed form
13443A49944Q00P256r091j2534j7413k1226p20K5825L4236j6349j5925j0893J84
13430A14094J6868k5533P213L906j2979j5412k845L7573L8633O833j5440k5908
13418A27003L867Q447k016P519J1937j0120j0916L8623L1913j9245j5409j8169
13406A53434j3934J1011j193R630K5785j2794J7046O141l1375j335J3465k4996
13394A50885l404M3624j465j7704o784J6359k2410J5772k7292j1388J2698j7952
13382A30939m893O719q50J6183l4378j7455k0787K153K9466N301O190L9131J4592
13369A72311j187l7610j8158m516M6942K3926J2159j3710Q691r307o349k0022
13357A53170K3666m274j8071j3597N781k165P799m844k302k3272J938L0381K0865
$$ plain form
13344 175075 170150 153229 135566 153431 165990 152707 132965 118558 125619 119477 131390 145744
13332 145744 161798 140138 125280 142862 190231 190018 157819 162965 185466 164342 163636 173861
13320 173861 170514 192808 206077 228403 235896 213242 177342 171708 182191 193750 190354 162952
13308 162952 173328 175361 169906 152114 132613 150791 169220 177228 179694 194105 214390 209203
13296 209203 223258 207471 220555 202669 167645 181289 188198 190049 189905 199800 169434 132532
13284 132532 142101 157360 161336 149083 143020 145492 130109 157613 160209 162739 173119 175086 174760
13271 174760 203377 204779 213264 205166 187956 178247 176626 156815 143748 140688 151744 160811 172547
13258 172547 208840 233648 224648 193645 173807 161071 147925 152708 166740 182926 227594 247327
$$ packed form
13344A75075m925j6921j7663J7865J2559j3283j9742j4407P061o142J1913J4354
13332A45744J6054k1660j4858J7582M7369k13l2199N146K2501k1124p06J0225
13320A73861l347K2294J3269K2326P493k2654l5900n634J0483J1559l396k7402
13308A62952J0376K033n455j7792j9501J8178J8429Q008K466J4411K0285n187
13296B09203J4055j5787J3084j7886l5024J3644O909J851j44R895l0366l6902
13284A32532R569J5259L976j2253o063K472j5383K7504K596K530J0380J967l26
13271A74760K8617J402Q485q098j7210r709j621j9811j3067l060J1056R067J1736
13258A72547L6293K4808r000l1003j9838j2736j3146M783J4032J6186M4668J9733
$$ plain form
13246 247327 233996 211108 201403 189299 166024 156311 168975 200671 209782 184763 153835 124062
13234 124062 152703 200827 192389 162187 150611 141037 123722 156010 171483 152595 131262 127003
13222 127003 112653 144358 156405 163425 188177 201992 190841 182571 163587 174799 164336 145592
13210 145592 135982 161158 203684 233434 231272 234013 227431 218709 236362 202168 199380 204107 212235
13197 212235 187225 175220 148611 139718 169451 180843 176973 191874 207053 239117 242351 202562
13185 202562 192474 188813 196908 205147 190921 181107 194301 193779 195226 190807 171787 171648 194023
13172 194023 212022 227219 256667 229360 196229 201031 205752 186217 186223 188293 196264 192712 192857 210481
13158 210481 202135 209081 203531 182564 215908 210354 196400 194847 241446 235318 184244 171262 163657
$$ packed form
13246B47327j3331k2888r705j2104k3275r713J2664L1696R111k5019l0928k9773
13234A24062K8641M8124q438l0202j1576r574j7315L2288J5473j8888k1333m259
13222A27003j4350L1705J2047P020K4752J3815j1151q270j8984J1212j0463j8744
13210A45592r610K5176M2526K9750k162K741o582q722J7653l4194k788M727Q128
13197B12235k5010j2005k6609q893K9733J1392l870J4901J5179L2064L234l9789
13185B02562j0088l661Q095Q239j4226r814J3194n22J447m419j9020j39K2375
13172A94023J7999J5197K9448k7307l3131M802M721j9535OK070P971l552J45J7624
13158B10481q346O946n550k0967L3344n554j3954j553M6599o128n1074j2982p605
$$ plain form
13145 163657 167699 176387 207756 194844 177483 152680 167113 183030 189299 158789 138222 171485
13133 171485 201579 195228 201063 177656 168181 176751 189815 218744 239995 229233 259170 262420
13121 262420 202836 183025 225028 236045 230679 202235 189345 175887 182310 185945 191245 192749
13109 192749 211166 203879 197405 181361 163638 147007 150508 149780 186447 227471 230610 186781 161968
13096 161968 183227 204942 210974 218641 231857 239427 229245 220685 198079 200918 213495 201872
13084 201872 179995 174594 203836 203297 192921 232810 263685 266042 256750 243037 236250 222407 222753
13071 222753 234267 253940 256348 254585 252101 233223 233653 230658 167226 149252 171472 195633 219485
13058 219485 231996 251916 276966 268529 241491 190917 202558 205357 233059 239632 259991 256686
$$ packed form
13145A63657M042Q688L1369j2912j7361k4803J4433J5917O269l0510k0567L3263
13133A71485L0094o351N835k3407r475Q570J3064K8929K1251j0762K9937L250
13121B62420n9584j9811M2003J1017n366k8444j2890j3458O423L635N300J504
13109A92749J8417p287o474j6044j7723j6631L501p28L6667M1024L139m3829k4813
13096A61968K1259K1715O032P667J3216P570j0182q560k2606K839J2577j1623
13084B01872k1877n401K9242n39j0376L9889L0875K357r292j3713o787j3843L46
13071B22753J1514J9673K408j763k484j8878M30k995o3432j7974K2220K4161K3852
13058B19485J2511J9920K5050q437k7038n0574J1641K799K7702O573K0359l305
$$ plain form
13046 256686 219069 218232 200548 187606 204181 219091 212351 223512 230831 232332 265251 257542 229054
13033 229054 240164 215550 203636 228029 226347 210663 210941 194988 208439 232699 239010 218779
13021 218779 220480 231167 247531 245135 217223 205473 203531 229163 244451 238384 246716 247484 238626
13008 238626 244922 231601 205401 192849 212692 235088 242988 246605 259568 257506 236495 233264
12996 233264 249351 268366 268605 262524 218765 179092 187657 200464 218585 219268 224033 245303 270700
12983 270700 261582 250669 249858 242268 239244 232882 220085 219872 210617 233041 231849 218049 224586 233701
12969 233701 245700 245849 241285 256106 232759 218064 214923 217378 247401 252908 256418 248131 198714
12956 198714 187109 216942 224115 221622 203556 206676 249860 261070 256792 252520 244742 237847 231371
$$ packed form
13046B56686l7617q37j7684j2942J6575J4910o740J1161P319J501L2919p709k8488
13033B29054J1110k4614j1914K4393j682j5684K78j5953J3451K4260O311k0231
13021B18779J701J0687J6364k396k7912j1750j942K5632J5288o067Q332P68q858
13008B38626O296j3321k6200j2552J9843K2396P900L617J2963k062k1011l231
12996B33264J6087J9015K39o081m3759l9673Q565J2807J8121O83M765K1270K5397
12983B70700r118j0913q11p590l024o362j2797k13r255K2424j192j3800O537R115
12969B33701J1999J49m564J4821k3347j4695l141K455L0023N507L510q287m9417
12956A98714j1605K9833P173k493j8066L120M3184J1210m278m272p778o895o476
$$ plain form
12943 231371 246030 236561 242506 217542 215039 237879 252318 236096 216243 221763 269941 290676
12931 290676 250830 219360 232121 229184 251897 252211 224763 213567 221664 213803 221435 228535 251343
12918 251343 292827 304955 275607 284381 291010 270080 258904 273051 273047 240578 233312 207521 167134
12905 167134 201180 247335 281942 304493 289654 289033 301437 295718 231448 193281 221190 204309
12893 204309 193214 214211 234640 264386 283236 284341 286161 288498 266897 240999 277704 308245
12881 308245 325131 353000 335655 277129 249171 201779 214374 255396 274984 300375 308175 292064
12869 292064 305435 291589 270697 261944 247862 258254 273592 260031 269756 274851 301537 290749
12857 290749 291585 277131 270961 289266 312752 301357 282203 293209 295280 284408 276794 240334
$$ packed form
12943B31371J4659r469N945k4964k503K2840J4439j6222j9853N520M8178K0735
12931B90676l9846l1470J2761k937K2713L14k7448j1196Q097p861P632P100K2808
12918B51343M1484J2128k9348Q774O629k0930j1176J4147ml2469p266k5791m0387
12905A67134L4046M6155L4607K2551j4839o21J2404n719o4270l8167K7909j6881
12893B04309j1095K0997K0429K9746J8850J105J820K337k1601k5898L6705L0541
12881C08245J6886K7869j7345n8526k7958m7392J2595M1022J9588K5391P800j6111
12869B92064J3371j3846k0892q753j4082J0392J5338j3561R725N095K6686j0788
12857B90749Q36j4454o170J8305K3486j1395j9154J1006K071j0872p614l6460
$$ plain form
12845 240334 217580 235958 258842 290630 305973 297370 275536 284581 292024 245897 250193 256176
12833 256176 278036 278330 291694 319417 313246 293836 279635 280418 295549 313853 310884 292422 297066
12820 297066 292327 282053 286261 295638 306407 304985 312483 327659 329337 323953 342174 334035 335378
12807 335378 321028 290832 263108 244964 288803 308684 321778 326914 343355 348484 339080 324467
12795 324467 336975 350830 342735 335945 342141 335818 321579 316652 306518 289378 289065 286091 293282
12782 293282 297504 285743 281783 316773 328769 291130 270631 255832 280355 277944 258648 270610
12770 270610 283902 291629 316291 335185 356096 348386 331964 301770 280720 289953 302424 299601
12758 299601 322360 336349 350098 352245 318800 283815 274566 282240 291842 304753 313974 300616
$$ packed form
12845B40334k2754J8378K2884L1788J5343q603k1834R045P443m6127M296N983
12833B56176K1860K94J3364K7723o171j9410j4201P83J5131J8304k969j8462M644
12820B97066m739j0274M208R377J0769j422P498J5176J678n384J8221q139J343
12807C35378j4350l0196k7724j8144M3839J9881J3094N136J6441N129r404j4613
12795C24467J2508J3855q095o790O196o323j4239m927j0134j7140l13k974P191
12782B93282M222j1761l960L4990J1996l7639k0499j4799K4523k411j9296J1962
12770B70610J3292P727K4662J8894K0911p710j6422l0194k1050R233J2471k823
12758B99601K2759J3989J3749K147l3445l4985r249P674R602J2911R221j3358
$$ plain form
12746 300616 280477 280463 300592 306157 293554 283043 282723 285676 276761 270402 272402 289559 294066 308900
12732 308900 326693 341733 328129 317268 305323 324817 314387 305104 319594 300514 304031 314105
12720 314105 337609 359008 334900 362945 372771 364348 338597 305400 323241 326470 306822 307145
12708 307145 306658 296995 301686 303080 312798 336729 345075 312346 294193 320751 371403 372704 344713
12695 344713 321456 303252 337635 386784 380740 369706 348812 358613 326798 309118 302557 338962
12683 338962 334290 335884 345520 334219 322406 330900 335948 307075 297672 294855 290110 281698 321309
12670 321309 332451 322656 313716 327062 318089 320478 290257 290438 285029 254824 292589 353152 353534
12657 353534 363098 365106 353773 385722 375345 349957 349249 334403 302222 301775 321389 314628 336137
$$ packed form
12746C00616k0139j4K0129N565j2603j0511l20K953q915o359K000J7157M507J4834
12732C08900J7793J5040j3604j0861j1945J9494j0430r283J4490j9080L517J0074
12720C14105K3504K1399k4108K8045R826q423k5751l3197J7841L229j9648L23
12708C07145m87r663M691J394R718K3931Q346l2729j8153K6558N0652J301k7991
12695C44713k3257j8204L4383M9149o044j1034k0894R801l1815j7680o561L6405
12683C38962m672J594R636j1301j1813Q494N048k8873r403k817m745q412L9611
12670C21309J1142r795q940J3346q973K389l0221J81n409l0205L7765O0563L82
12657C53534R564K008j1333L1949j0377k5388p08j4846l2181m47J9614o761K1509
$$ plain form
12644 336137 348190 365450 357083 322245 297596 320775 354910 375521 381170 350817 339299 329781
12632 329781 343078 377192 353776 345015 355988 364294 373233 359358 357254 386088 381681 376214 363227
12619 363227 361472 347964 335048 323164 356990 375546 343622 334219 300842 304546 303419 275200
12607 275200 313419 340997 352365 384479 380841 371324 350725 339329 321586 307373 310989 335585
12595 335585 340594 359587 364976 350175 348103 337502 344116 349653 337347 341951 355076 336954 339909
12582 339909 383729 384067 355041 320377 339344 373005 406664 416012 379928 346319 361033 372888
12570 372888 372858 357791 360547 363603 366885 374075 359612 358802 383937 370445 366168 380081 403512
12557 403512 402043 398430 409777 414693 375511 343468 328381 348556 361168 352299 342784 305317
$$ packed form
12644C36137J2053J7260q367l4838k4649K3179L4135K0611N649l0353j1518r518
12632C29781J3297L4114k3416q761J0973Q306Q939j3875k104K8834m407n467j2987
12619C63227j755j3508j2916j1884L3826J8556l1924r403l3377L704j127k8219
12607B75200L8219K7578J1368L2114l638r517k0599j1396j7743j4213L616K4596
12595C35585N009J8993N389j4801k072j0601O614N537j2306M604J3125j8122K955
12582C39909M3820L38k9026l4664J8967L3661L3659R348l6084l3609J4714J1855
12570C72888l0j5067K756L056L282P190j4463q10K5135j3492m277J3913K3431
12557D03512j469l613J1347M916l9182l2043j5087K0175J2612q869r515l7467
$$ plain form
12545 305317 302676 311140 339002 348599 338394 332416 358870 369974 342624 338944 361136 350610
12533 350610 357649 354351 368647 396697 403619 420956 415630 372642 379004 410188 411970 403458 393311
12520 393311 377286 374212 357711 331935 329258 361427 400707 408629 419945 387925 400182 421864
12508 421864 415172 399585 389277 396901 400521 408857 401565 408746 415339 397232 389662 393915 380336
12495 380336 385132 409824 420378 404549 417334 424014 414441 389112 381232 390432 400285 410299 400343
12482 400343 432333 453457 466201 463105 466893 444097 435055 386065 378772 411052 372200 341421
12470 341421 394379 438012 452355 459934 441104 433426 437797 430507 422171 410235 393769 364400
12458 364400 365012 383767 402416 418197 425989 414405 412386 420422 440415 414416 398147 442028
$$ packed form
12545C05317k641Q464K7862R597j0205n978K6454J1104k7350l680K2192j0526
12533C50610P039l298J4296K8050O922J7337n326m2988O362L1184J782q512j0147
12520C93311j6025l074j6501k5776k677L2169L9280P922J1316l2020J2257K1682
12508D21864o692j5587j0308P624L620Q336p292P181O593j8107p570M253j3579
12495C80336M796K4692J0554j5829J2785O680r573k5329p880R200R853J0014r956
12482D00343L1990K1124J2744l096L788k2796r042m8990p293L2280l8852l0779
12470C41421N2958M3633J4343P579j8830p678M371p290q336j1936j6466k9369
12458C64400O12J8755J8649J5781P792j1584k019Q036J9993k5999j6269M3881
$$ plain form
12446 442028 473617 434977 423927 453782 465705 455313 453169 450852 437720 437592 464737 459505
12434 459505 441651 455148 447807 438382 423547 422418 401295 409942 425730 410374 434739 441379
12422 441379 432193 418680 408899 412148 431013 447059 444394 442770 448705 430938 415780 424546 436945
12409 436945 416145 418928 437737 433597 438210 458003 470117 438485 441154 470862 478063 472790 468704
12396 468704 489500 491370 505445 505711 500404 499823 505701 494314 476336 461325 470046 447226 422442
12383 422442 446888 460556 452242 463768 458532 450048 455721 431006 450984 459803 448985 459252
12371 459252 489060 467629 425273 450574 448434 435078 430943 430818 465139 475579 457029 443431
12359 443431 440537 426381 404791 385258 424925 420294 428657 456419 484183 482097 468051 440601
$$ packed form
12446D42028L1589l8640j1050K9855J1923j0392k144k317j3132j28K7145n232
12434D59505j7854J3497p341r425j4835j129k1123Q647J5788j5356K4365O640
12422D41379r186j3513r781L249J8865J6046k665j624N935j7767j5158Q766J2399
12409D36945k0800K783J8809m140M613J9793J2114l1632K669K9708P201n273m086
12396D68704K0796J870J4075K66n307n81N878j1387j7978j5011Q721k2820k4784
12383D22442K4446J3668q314J1526n236q484N673k4715J9978Q819j0818J0267
12371D59252K9808k1431m2356K5301k140j3356m135j25L4321J0440j8550j3598
12359D43431k894j4156k1590j9533L9667m631Q363K7762K7764k086j4046k7450
$$ plain form
12347 440601 442552 457722 466225 477651 491012 490774 478896 476088 465489 458482 471921 482220 503406
12334 503406 499794 478565 451726 428583 395142 399504 407643 402758 424032 432152 442465 444973 455440
12321 455440 461078 440188 461371 501135 501827 493910 484530 465403 473874 505713 477016 461839 487321
12308 487321 472228 444152 451940 506297 506300 473946 462391 464512 478129 489444 465353 447332 441446
12295 441446 463381 461552 467742 474059 476890 508422 504705 503181 523732 528492 527198 532001 503649
12282 503649 467514 451493 444569 481100 483815 471588 480694 469483 469842 446042 449995 461802 461841
12269 461841 458439 444531 463872 485467 503488 557170 570236 542925 532561 530112 557628 528402
12257 528402 538568 550019 545144 533652 512811 519339 513205 504526 538968 539434 523789 527803 488211
$$ packed form
12347D40601J951J5170Q503J1426J3361k38j1878k808j0599p007J3439J0299K1186
12334E03406l612k1229k6839k3143l3441M362Q139m885K1274Q120J0313K508J0467
12321D55440N638k0890K1183L9764O92p917r380j9127Q471L1839k8697j5177K5482
12308D87321j5093k8076P788N4357Ll2354j1555K121J3617J1315k4091j8021n886
12295D41446K1935j829O190O317K831L1532l717j524K0551M760j294M803k8352
12282E03649l6135j6021o924L6531K715j2227R106j1211L59k3800L953J1807L9
12269D61841l402j3908J9341K1595J8021N3682J3066k7311j0364k449K7516k9226
12257E28402J0166J1451m875j1492k0841O528o134q679L4442M66j5645M014l9592
$$ plain form
12244 488211 488797 484856 479562 462062 473777 530138 535705 535782 520664 510002 512712 507837 485478
12231 485478 501866 509389 541180 558684 540833 530456 521646 497865 509003 548264 561894 540142
12219 540142 543952 556834 558457 567777 570533 571864 574574 568335 536669 525223 560446 578586 564696
12206 564696 558484 561065 565829 556498 546129 533662 514579 506717 521663 509515 497283 514828
12194 514828 506302 494058 507112 526721 555788 547346 541312 567631 543384 521180 512594 538423
12182 538423 554291 579012 588077 577304 572337 565170 605446 591794 543268 504334 495940 502017
12170 502017 539183 555137 555811 568885 561894 566116 567434 594618 594969 568791 545037 550138 571884
12157 571884 585892 569152 565579 532443 535948 562774 586456 569955 513071 523972 553312 579183
$$ packed form
12244D88211N86l941n294j7500J1715N6361N567P7j5118j0662K710m875k2359
12231D85478J6388P523L1791J7504j7851j0377q810k3781J1138L9261J3630k1752
12219E40142L810J2882J623R320K756J331K710o239l1666j1446L5223J8140j3890
12206E64696o212K581M764r331j0369j2467j9083p862J4946j2148j2232J7545
12194E14828q526j2244J3054J9609K9067q442o034K6319k4247k2204q586K5829
12182E38423J5868K4721R065j0773m967p167M0276j3652m8526l8934q394O077
12170E02017L7166J5954O74J3074o991M222J318K7184L51k6178k3754N101K1746
12157E71884J4008j6740l573l3136L505K6826K3682j6501n6884J0901K9340K5871
$$ plain form
12145 579183 559789 559188 588447 607009 592946 610621 619877 607667 586248 586858 564898 566041 568106
12132 568106 601775 605394 593897 572771 556422 531583 515319 521285 545561 529924 541274 581025
12120 581025 610271 605545 594280 590403 618872 622699 590717 598409 601867 595421 602074 598214 584380
12107 584380 587818 589060 572924 589757 614082 621108 590189 561770 585724 605516 599953 567152
12095 567152 563196 573054 593663 588341 571100 585455 578194 569465 590562 581863 583162 592842 595127
12082 595127 607104 606412 602913 599944 598765 587061 597538 624716 611986 611993 620591 589158 607121
12069 607121 630915 620033 611914 635686 624217 591958 565377 578520 606756 636410 625099 596959
12057 596959 599673 611124 631404 669236 659201 612849 613170 630292 638052 637307 618533 591258 608374
$$ packed form
12145E79183j9394o01K9259J8562j4063J7675R256j2210k1419O10k1960J143K065
12132E68106L3669L619j1497k1126j6349k4839j6264N966K4276j5637J1350L9751
12120E81025K9246m726j1265l877K8469L827l1982P692L458o446O653l860j3834
12107E84380L438J242j6136J6833K4325P026l0919k8419K3954J9792n563l2801
12095E67152l956R858K0609n322j7241J4355p261q729K1097q699J299R680K285
12082E95127J1977o92l499k969j179j1704J0477K7178j2730PQ598l1433J7963
12069F07121K3794j0882q119K3772j1469l2259k6581J3143K8236K9654j1311k8140
12057E96959K714J1451K0280L7832j0035m6352L21J7122P760p45j8774k7275J7116
$$ plain form
12044 608374 617699 628646 650153 668122 665070 668856 645598 619413 615503 608466 615897 594213 593589
12031 593589 602737 604164 613037 641959 675732 660227 647947 665735 661159 628171 621784 628130 639592
12018 639592 605412 593593 590691 613398 652068 634374 599537 617015 616636 640044 643469 629675
12006 629675 641240 654350 649899 625417 641112 662312 693517 726792 721132 690310 661760 651512
11994 651512 665570 667716 684263 686188 663190 654262 669129 689644 700593 682350 693313 674111
11982 674111 648808 645354 670988 720930 728219 720004 710579 700970 721970 720354 718751 689927 659965
11969 659965 679123 677699 687601 678732 693611 693927 680099 685247 693186 693354 700852 705754 716874 723241
11955 723241 732269 720129 703717 697641 684646 671432 658583 668960 662878 653709 655737 678675
$$ packed form
12044F08374R325J0947K1507J7969l052L786k3258k6185l910p037P431k1684o24
12031E93589R148J427Q873K8922L3773j5505j2280J7788m576l2988o387O346J1462
12018F39592l4180j1819k902K2707L8670j7694l4837J7478l79K3408L425j3794
12006F29675J1565J3110m451k4482J5695K1200L1205L3275n660l0822k8550j0248
11994F51512J4058K146J6547J925k2998q928J4867K0515J0949j8243J0963j9202
11982F74111k5303l454K5634M9942P289q215r425r609K1000j616j603k8824k9962
11969F59965J9158j424R902q869J4879L16j3828N148P939J68P498M902J1120O367
11955G23241R028j2140j6412o076j2995j3214j2849J0377o082r169K028K2938
$$ plain form
11943 678675 689870 719755 730087 706683 708497 727908 723903 696899 726424 742282 712821 705066
11931 705066 718814 723161 716018 707144 699204 691762 672893 677542 699136 721827 723808 716549 707973
11918 707973 723365 721129 721495 732978 729323 720198 716563 703846 697841 708791 697994 690132 713866
11905 713866 747803 735843 760538 748284 721182 683899 667319 674267 706497 760919 779007 787280
11893 787280 777393 776231 785542 755747 734172 727049 735164 756473 749466 740654 738497 759914 754487
11880 754487 765798 767574 748207 758333 752009 754175 754128 757580 775157 781058 782592 803872 807897
11867 807897 775540 731152 701167 669111 674568 694285 686211 689681 698511 707908 722577 727868 748346
11854 748346 758666 767602 776100 749792 729546 766428 769268 773162 780460 794893 826267 816864 797863
$$ packed form
11943F78675J1195K9885J0332k3404J814J9411m005k7004K9525J5858k9461p755
11931G05066J3748M347p143q874p940p442j8869M649K1594K2691J981p259q576
11918G07973J5392k236L66J1483l655r125l635j2717o005J0950j0797p862K3734
11905G13866L3937j1960K4695j2254k7102l7283j6580O948L2230N4422J8088Q273
11893G87280r887j162R311k9795k1575p123Q115K1309p007q812k157K1417n427
11880G54487J1311J776j9367J0126o324K166m7L452J7577N901J534K1280M025
11867H07897l2357m4388k9985l2056N457J9717q074L470Q830R397J4669N291K0478
11854G48346J0320Q936Q498k6308k0246L6882K840L894P298J4433L1374r403j9001
$$ plain form
11841 797863 787980 783054 799874 795634 789854 781448 772084 804603 789929 769178 757606 754874 781601
11828 781601 789848 785690 786486 783987 810221 807838 810276 809360 798338 781739 756855 747985 743524 737732
11814 737732 791272 828401 837794 837730 854582 849376 864511 853836 843732 838156 845507 840078 805935
11801 805935 806221 797768 793986 804938 819560 838288 809201 806000 802804 797029 809682 808402 805713
11788 805713 827522 853653 853082 835587 833663 837278 819431 832519 831273 814892 799648 843458
11776 843458 859173 844402 809671 796571 804043 834487 821014 818281 843272 873476 894420 878803
11764 878803 891893 891404 889728 890288 908551 906455 876737 874233 858068 860879 869896 894962 905141
11751 905141 880736 853867 880253 900185 899340 884095 880852 873270 887046 877289 857023 860580 888614
$$ packed form
11841G97863r883m926J6820m240n780q406r364L2519j4674k0751j1572k732K6727
11828G81601Q247m158P96k499K6234k383K438r16j1022j6599k4884q870m461n792
11814G37732N3540L7129R393o4J6852n206J5135j0675j0104n576P351n429l4143
11801H05935K86q453l782J0952J4622J8728k9087l201l196n775J2653j280k689
11788H05713K1809K6131n71j7495j924L615j7847J3088j246j6381j5244M3810
11776H43458J5715j4771l4731j3100P472L0444j3473k733K4991L0204K0944j5617
11764H78803J3090m89j676N60J8263k096k9718k504j6165K811R017K5066J0179
11751I05141k4405k6869K6386J9932q45j5245l243p582J3776r757k0266L557K8034
$$ plain form
11738 888614 897664 914234 892214 926604 919033 903611 890547 901114 919962 911820 880339 868552
11726 868552 853311 841207 821256 829402 844174 867794 896994 908713 923929 904112 899447 909991
11714 909991 879819 854925 851515 883169 870926 825222 854570 885386 894983 889827 889644 917224
11702 917224 903246 904505 916313 905145 891787 913602 922459 917567 919076 927973 924893 946076 952466
11689 952466 930909 915199 920935 917609 939616 946038 924381 924264 949930 954588 955893 964117 980672
11676 980672 973927 965510 956027 945068 921023 936908 958879 967932 966257 961330 993281 997473 961627
11663 961627 978100 980868 932121 917459 920247 942722 968667 952661 942461 923074 918181 952191
11651 952191 977674 941973 932268 892788 924282 965640 987291 968926 986173 990079 960409 982578
$$ packed form
11738H88614R050J6570k2020L4390p571j5422j3064J0567J8848q142l1481j1787
11726H68552j5241j2104j9951Q146J4772K3620K9200J1719J5216j9817m665J0544
11714I09991l0172k4894l410L1654j2243m5704K9348L0816R597n156j83K7580
11702I17224j3978J259J1808j1168j3358K1815Q857m892J509Q897l080K1183O390
11689I52466k1557j5710N736l326K2007O422k1657j17K5666M658J305Q224J6555
11676I80672o745q417r483j0959k4045J5885K1971R053j675m927L1951M192l5846
11663I61627J6473K768m8747j4662K788K2475K5945j6006j0200j9387m893L4010
11651I52191K5483l5701r705l9480L1494M1358K1651j8365J7247L906k9670K2169
$$ plain form
11639 982578 1003033 1009702 1019206 1001890 996314 1006227 1036252 1068663 1050883 1030729 1036057 1036940 1004279
11626 1004279 981703 975566 1010088 1005712 983724 981276 992151 1019089 1025485 1053778 1113018 1106459
11614 1106459 1066550 1030161 1008317 1030222 1049331 1054890 1041514 1031787 1015489 989353 1017228 1038244
11602 1038244 1038508 1059835 1049615 1051917 1068622 1060395 1071535 1072905 1080345 1082687 1038339 1019379 1029506
11589 1029506 1042455 1039995 1038424 1074642 1082664 1053649 1058167 1067030 1092787 1093878 1089599 1083553 1091276
11576 1091276 1132635 1136952 1123468 1130665 1115998 1104048 1098952 1084192 1079959 1084885 1067257 1057031
11564 1057031 1057542 1035822 1033570 1069527 1118223 1105848 1090889 1089557 1096316 1081648 1063834 1047427
11552 1047427 1039551 1090554 1096741 1086784 1102461 1097687 1101294 1106915 1110665 1124762 1112500 1098383 1102342
$$ packed form
11639I82578K0455O669R504j7316n576R913L0025L2411j7780k0154N328Q83l2661
11626A004279k2576o137L4522m376k1988k448J0875K6938O396K8293N9240o559
11614A106459l9909l6389k1844K1905J9109N559j3376r727j6298k6136K7875K1016
11602A038244K64K1327j0220K302J6705q227J1140J370P440K342m4348j8960J0127
11589A029506J2949k460j571L6218Q022k9015M518Q863K5757J091m279o046P723
11576A091276M1359M317j3484P197j4667j1950n096j4760m233M926j7628j0226
11564A057031N11k1720k252L5957M8696j2375j4959j332O759j4668j7814j6407
11552A047427p876N1003O187r957J5677m774L607N621L750J4097j2262j4117L959
$$ plain form
11539 1102342 1120538 1124141 1070210 1051491 1065820 1105732 1109243 1096147 1118009 1130179 1131252 1113636
11527 1113636 1078935 1100968 1135738 1119567 1140874 1149820 1175242 1165459 1178826 1189620 1199843 1209408
11515 1209408 1178875 1154527 1141184 1128553 1130737 1134611 1169857 1195317 1180968 1176764 1174431 1184533
11503 1184533 1189556 1156688 1124538 1139751 1161838 1178161 1175154 1173851 1158635 1142303 1159106 1175865
11491 1175865 1169820 1154201 1168462 1204555 1216977 1216912 1210700 1226641 1240607 1219273 1186892 1179212
11479 1179212 1184202 1175303 1178992 1208807 1227855 1201958 1169257 1196142 1204154 1226082 1254765 1245008
11467 1245008 1254941 1272882 1264390 1244248 1257060 1267705 1263087 1295743 1298820 1272723 1243901 1216263
11455 1216263 1208664 1227977 1226340 1234294 1245565 1223346 1229950 1243595 1274451 1282814 1269089 1265979
$$ packed form
11539A102342J8196L603n3931j8719J4329L9912L511j3096K1862J2170J073j7616
11527A113636l4701K2033L4770j6171K1307Q946K5422r783J3367J0794J0223R565
11515A209408l0533k4348j3343j2631K184L874L5246K5460j4349m204k333J0102
11503A184533N023l2868l2150J5213K2087J6323l007j303j5216j6332J6803J6759
11491A175865o045j5619J4261L6093J2422o5o212J5941J3966k1334l2381p680
11479A179212M990q899L689K9815J9048k5897l2701K6885Q012K1928K8683r757
11467A245008R933J7941q492k0142J2812J0645m618L2656L077k6097k8822k7638
11455A216263p599J9313j637P954J1271k2219O604J3645L0856Q363j3725l110
$$ plain form
11443 1265979 1276412 1282089 1266243 1256856 1261232 1271329 1276216 1290070 1307087 1343272 1342051 1312461
11431 1312461 1315752 1349631 1342306 1297738 1310914 1311570 1286494 1296584 1285841 1290587 1305588 1303451
11419 1303451 1298479 1306341 1293454 1297056 1284603 1287053 1307166 1303996 1323296 1328928 1310145 1303337 1342729
11406 1342729 1349597 1337333 1340204 1342802 1341576 1326260 1311600 1320994 1338857 1345769 1340197 1349481 1375726
11393 1375726 1375524 1380172 1402490 1430313 1404218 1375662 1378024 1379974 1357791 1357607 1394073 1394211 1354667
11380 1354667 1352898 1356143 1356973 1366249 1366999 1360301 1378278 1375589 1392224 1390607 1404118 1412929 1423565
11367 1423565 1411940 1401452 1418717 1421251 1440159 1458544 1441673 1433550 1420032 1406700 1402943 1413365
11355 1413365 1421735 1435162 1406925 1373912 1410586 1419105 1422476 1418842 1435098 1450807 1436809 1468715
$$ packed form
11443A265979J0433N677j5846r387M376J0097M887J3854J7017L6185j221k9590
11431A312461L291L3879p325m4568J3176O56k5076J0090j0743M746J5001k137
11419A303451m972P862j2887L602j2453K450K0113l170J9300N632j8783o808L9392
11406A342729O868j2264K871K598j226j5316j4660R394J7863O912n572R284K6245
11393A375726k02M648K2318K7823k6095k8556K362J950k2183j84L6466J38l9544
11380A354667j769L245Q30R276P50o698J7977k689J6635j617J3511Q811J0636
11367A423565j1625j0488J7265K534J8908J8385j6871q123j3518j3332l757J0422
11355A413365Q370J3427k8237l3013L6674Q519L371l634J6256J5709j3998L1906
$$ plain form
11343 1468715 1472464 1450987 1463413 1436916 1404953 1420041 1433788 1449795 1440384 1458493 1491576 1515178
11331 1515178 1515012 1495747 1477589 1490736 1501880 1510884 1510081 1498817 1520644 1524799 1511964 1522355
11319 1522355 1542141 1529727 1528495 1529095 1553690 1583265 1588323 1591375 1601305 1591159 1575527 1544497
11307 1544497 1519938 1521556 1505803 1522055 1528358 1548911 1587226 1584586 1572371 1595962 1615321 1620549
11295 1620549 1612847 1589121 1581254 1625905 1639773 1628625 1620702 1625307 1645917 1675797 1662942 1628073
11283 1628073 1631049 1608118 1591434 1626678 1635835 1638646 1648269 1612324 1585968 1605865 1632671 1618668
11271 1618668 1629179 1644105 1643627 1649476 1657894 1660078 1652789 1639536 1655599 1664452 1684944 1689172 1673331
11258 1673331 1673033 1683466 1694033 1687482 1690747 1693392 1699396 1704059 1681874 1677789 1707825 1740453 1751029
$$ packed form
11343A468715L749k1477J2426k6497l1963J5088J3747J6007r411J8109L3083K3602
11331A515178j66j9265j8158J3147J1144R004q03j1264K1827M155j2835J0391
11319A522355J9786j2414j232O00K4595K9575N058L052R930j0146j5632l1030
11307A544497k4559J618j5753J6252O303K0553L8315k640j2215K3591J9359N228
11295A620549p702k3726p867M4651J3868j1148p923M605K0610K9880j2855l4869
11283A628073K976k2931j6684L5244R157K811R623l5945k6356J9897K6806j4003
11271A618668J0511J4926m78N849Q418K184p289j3253J6063Q853K0492M228j5841
11258A673331k98J0433J0567o551L265K645O004M663k2185m085L0036L2628J0576
$$ plain form
11245 1751029 1729294 1720915 1708364 1693369 1708513 1740533 1719906 1705905 1740580 1801562 1779628
11234 1779628 1736415 1750425 1744704 1743695 1744612 1738700 1728684 1736668 1770142 1774728 1770755 1805646 1810769
11221 1810769 1813728 1798515 1796548 1793613 1826466 1827193 1857023 1898440 1874710 1858531 1863527 1846634
11209 1846634 1846545 1819729 1799500 1812355 1828747 1854432 1893990 1890623 1865385 1864172 1882066 1904038
11197 1904038 1878244 1861456 1876346 1881739 1890325 1899981 1883971 1874586 1880831 1886000 1873899 1901908
11185 1901908 1904022 1894946 1916712 1936728 1937136 1909756 1912445 1899609 1892478 1899486 1928091 1934590 1957122
11172 1957122 1969009 1983646 2001201 2007339 1984650 1965808 1965354 1979827 1985304 1981834 1965685 1977484
11160 1977484 1999129 2000156 1976785 1956718 1956588 1971876 2001820 2014614 2006131 2022256 2035321 2069074
$$ packed form
11245A751029k1735q379j2551j4995J5144L2020k0627j4001L4675O0982k1934
11234A779628m3213J4010n721j009R17n912j0016P984L3474M586l973L4891N123
11221A810769K959j5213j967k935L2853P27K9830M1417k3730j6179M996j6893
11209A846634q9k6816k0229J2855J6392K5685L9558l367k5238j213J7894K1972
11197A904038k5794j6788J4890N393Q586R656j6010r385O245N169j2101K8009
11185A901908K114r076K1766K0016M08k7380K689j2836p131P008K8605O499K2532
11172A957122J1887J4637J7555O138k2689j8842m54J4473N477l470j6149J1799
11160A977484K1645J027k3371k0067j30J5288K9944J2794q483J6125J3065L3753
$$ plain form
11148 2069074 2106857 2103726 2068329 2063383 2079826 2079116 2061558 2022836 2016283 2034015 2084632 2128304
11136 2128304 2116436 2115457 2145705 2160040 2153907 2129312 2137432 2132401 2119391 2119549 2128555 2106162 2124169
11123 2124169 2146119 2148315 2119160 2111587 2156686 2206365 2193626 2165479 2175117 2217411 2212572 2224152
11111 2224152 2224737 2242272 2261812 2265872 2255363 2249500 2257096 2249937 2266921 2290613 2291628 2264318 2272512
11098 2272512 2272658 2251141 2232802 2267464 2275420 2263276 2278852 2279070 2306178 2327344 2356701 2370437
11086 2370437 2360325 2350179 2329721 2339106 2335990 2354618 2389066 2423560 2417621 2439037 2450383 2433780
11074 2433780 2421164 2455160 2456949 2420431 2407214 2396106 2388908 2420291 2439194 2447807 2458994 2491541
11062 2491541 2504883 2497221 2458814 2447075 2458739 2461560 2495299 2558141 2553591 2549708 2551960 2561058
$$ packed form
11148B069074L7783l131l5397m946J6443p10j7558l8722o553J7732N0617M3672
11136B128304j1868r79L0248J4335o133k4595Q120n031j3010J58R006k2393J8007
11123B124169K1950K196k9155p573M5099M9679j2739k8147R638M2294m839J1580
11111B224152N85J7535J9540M060j0509n863P596p159J6984K3692J015k7310Q194
11098B272512J46k1517j8339L4662P956j2144J5576K18K7108K1166K9357J3736
11086B370437j0112j0146k0458R385l116J8628L4448L4494n939K1416J1346j6603
11074B433780j2616L3996J789l6518j3217j1108p198L1383J8903Q613J1187L2547
11062B491541J3342p662l8407j1739J1664K821L3739O2842m550l883K252R098
$$ plain form
11050 2561058 2580097 2598071 2622257 2612593 2596453 2608725 2613241 2594585 2598244 2618683 2610258 2606345
11038 2606345 2613028 2640539 2673161 2671540 2670261 2674891 2684746 2713524 2727004 2727530 2734309 2722592 2711531
11025 2711531 2720726 2735007 2743084 2765523 2800046 2805841 2822231 2811333 2797183 2781662 2790063 2836984
11013 2836984 2859349 2866001 2874934 2896936 2920064 2897469 2912404 2944794 2973513 3012242 3005275 3020274
11001 3020274 3040377 3082832 3112853 3100930 3098375 3121464 3158318 3198148 3252530 3294998 3315170
10990 3315170 3364349 3442156 3467969 3512274 3573944 3644870 3730060 3838246 3995899 4178189 4307226
10979 4307226 4341933 4142870 3448438 2514804 1863649 1623164 1660263 1803562 1937849 2074515
10969 2074515 2167108 2216348 2302954 2379810 2451314 2501848 2533216 2544449 2576285 2661303 2715937
$$ packed form
11050B561058J9039J7974K4186r664j6140J2272M516j8656L659K0439q425l913
11038B606345O683K7511L2622j621j279M630R855K8778J3480N26O779j1717j1061
11025B711531R195J4281Q077K2439L4523N795J6390j0898j4150j5521Q401M6921
11013B836984K2365O652Q933K2002K3128k2595J4935L2390K8719L8729o967J4999
11001C020274K0103M2455L0021j1923k555K3089L6854L9830N4382M2468K0172
10990C315170M9179P7807K5813M4305O1670P0926Q5190J08186J57653J82290J29037
10979D307226L4707j99063o94432r33634o51155k40485L7099J43299J34287J36666
10969B074515R2593M9240Q6606P6856P1504N0534L1368J1233L1836Q5018N4634
$$ plain form
10958 2715937 2745012 2766674 2762456 2809156 2829073 2851238 2839218 2865055 2894328 2884807 2899205 2915450
10946 2915450 2938340 2994277 3006558 3002276 3051386 3096440 3085626 3073621 3066747 3082848 3106999 3160613
10934 3160613 3198792 3181406 3168438 3164271 3193951 3241651 3265782 3253360 3249619 3272911 3283731 3274349
10922 3274349 3300931 3338247 3362673 3359143 3341901 3347958 3372243 3388362 3421542 3461099 3461247 3481868
10910 3481868 3478072 3460481 3442408 3449733 3484742 3525174 3555849 3560461 3603320 3601623 3573729 3583090
10898 3583090 3585608 3609457 3620527 3592929 3632868 3667830 3670157 3659092 3687600 3737439 3739958 3742350
10886 3742350 3732988 3764338 3804965 3818488 3808835 3833713 3862519 3897025 3902171 3887673 3925241 3950762
10874 3950762 3970796 3954553 3959936 4024784 4054245 4058949 4076421 4067587 4073657 4077856 4076344 4114408
$$ packed form
10958B715937K9075K1662m218M6700J9917K2165j2020K5837K9273r521J4398J6245
10946B915450K2890N5937J2281m282M9110M5054j0814j2005o874J6101K4151N3614
10934C160613L8179j7386j2968m167K9680M7700K4131j2422l741K3292J0820r382
10922C274349K6582L7316K4426l530j7242O057K4285J6119L3180L9557J48K0621
10910C481868l796j7591j8073P325L5009M0432L0675M612M2859j697k7894R361
10898C583090K518K3849J1070k7598L9939L4962K327j1065K8508M9839K519K392
10886C742350r362L1350M0627J3523r653K4878K8806L4506N146j4498L7568K5521
10874C950762K0034j6243N383O4848K9461M704J7472q834O070M199j512L8064
$$ plain form
10862 4114408 4143697 4149538 4179908 4172732 4165431 4211454 4261923 4262369 4284866 4304458 4281796 4295987
10850 4295987 4313446 4357625 4372895 4359836 4399122 4437105 4452663 4466297 4476055 4490716 4513437
10839 4513437 4573132 4599562 4589759 4605642 4615471 4653427 4727920 4755603 4742899 4769700 4786314 4810019
10827 4810019 4871418 4928385 4963307 4967792 5002360 5029314 4957064 4792130 4730526 4717116 4767758
10816 4767758 4824235 4870479 4918619 4944609 4946946 4985038 5012660 5025122 5040012 5056960 5087037
10805 5087037 5127545 5160999 5174440 5215134 5267214 5297346 5297123 5300574 5327517 5356210 5386105 5400567
10793 5400567 5384317 5380408 5407510 5456494 5514014 5573469 5608840 5630216 5653649 5677134 5710326
10782 5710326 5780558 5814684 5867895 5901918 5921519 5915924 5915693 5958066 5993265 5994565 6009456 6074567
$$ packed form
10862D114408K9289N841L0370p176p301M6023N0469M46K2497J9592k2662J4191
10850D295987J7459M4179J5270j3059L9286L7983J5558J3634R758J4661K2721
10839D513437N9695K6430r803J5883R829L7956P4493K7683j2704K6801J6614K3705
10827D810019O1399N6967L4922M485L4568K6954p2250j64934o1604j3410N0642
10816D767758N6477M6244M8140K5990K337L8092K7622J2462J4890J6948L0077
10805E087037M0508L3454J3441M0694N2080L0132k23L451K6943K8693K9895J4462
10793E400567j6250l909K7102M8984N7520N9455L5371K1376K3433K3485L3192
10782E710326P0232L4126N3211L4023J9601n595k31M2373L5199J300J4891O5111
$$ plain form
10770 6074567 6148725 6186694 6200331 6232067 6279829 6295376 6316219 6378361 6435813 6473216 6504758
10759 6504758 6544449 6566844 6567944 6624407 6679495 6731118 6759589 6789601 6808629 6847014 6911133
10748 6911133 6908685 6932903 6985691 7023571 7034683 7076348 7097091 7145562 7205471 7245539 7265661
10737 7265661 7281710 7304079 7378737 7447273 7491875 7560900 7636912 7712622 7775378 7808024 7858725
10726 7858725 7906327 7974017 8048542 8091567 8111873 8161541 8214004 8271681 8305006 8344138 8413182
10715 8413182 8458975 8503987 8547125 8625661 8714534 8819467 8907879 8964042 9044185 9121822 9197306
10704 9197306 9255615 9350117 9477152 9574642 9681597 9814417 9940626 10139313 10315324 10373191
10694 10373191 10307833 10186709 10098993 10089526 10150888 10237750 10322274 10377676 10443925 10568086 10703915
$$ packed form
10770F074567P4158L7969J3637L1736M7762J5547K0843O2142N7452L7403L1542
10759F504758L9691K2395J100N6463N5088N1623K8471L0012J9028L8385O4119
10748F911133k448K4218N2788L7880J1112M1665K0743M8471N9909M0068K0122
10737G265661J6049K2369P4658O8536M4602O9025P6012P5710O2756L2646N0701
10726G858725M7602O7690P4525M3025K0306M9668N2463N7677L3325L9132O9044
10715H413182M5793M5012M3138P8536Q8873J04933Q8412N6163Q0143P7637P5484
10704I197306N8309R4502J27035R7490J06955J32820J26209J98687J76011N7867
10694A0373191o5358j21124q7716r467O1362Q6862Q4524N5402O6249J24161J35829
$$ plain form
10683 10703915 10801437 10894670 11006822 11097475 11189025 11288368 11399925 11515734 11619086 11752257
10673 11752257 11866916 11994181 12103537 12224128 12354184 12488873 12609476 12754790 12903753
10664 12903753 13016585 13168997 13339370 13479647 13612808 13784183 13951995 14120167 14265211
10655 14265211 14427117 14606380 14769026 14892060 15039801 15241235 15456189 15668907 15860155
10646 15860155 16052233 16254663 16490738 16726082 16927931 17137500 17343052 17591889 17877819
10637 17877819 18151502 18457221 18762377 19040358 19352645 19670480 19972197 20291569 20600109
10628 20600109 20916706 21246088 21588489 21961034 22357424 22760176 23161503 23565491 23993210
10619 23993210 24486407 25017513 25555933 26094721 26652384 27208802 27799967 28410001 29072039
$$ packed form
10683A0703915R7522R3233J12152R0653R1550R9343J11557J15809J03352J33171
10673A1752257J14659J27265J09356J20591J30056J34689J20603J45314J48963
10664A2903753J12832J52412J70373J40277J33161J71375J67812J68172J45044
10655A4265211J61906J79263J62646J23034J47741K01434K14954K12718J91248
10646A5860155J92078K02430K36075K35344K01849K09569K05552K48837K85930
10637A7877819K73683L05719L05156K77981L12287L17835L01717L19372L08540
10628B0600109L16597L29382L42401L72545L96390M02752M01327M03988M27719
10619B3993210M93197N31106N38420N38788N57663N56418N91165O10034O62038
$$ plain form
10610 29072039 29740818 30465991 31226595 32050191 32924053 33848691 34810529 35791994 36808549
10601 36808549 37885618 39033934 40239288 41508458 42824950 44299683 45927032 47743578
10593 47743578 49697067 51731553 53738343 55398285 56825229 58714120 61261555 64400310
10585 64400310 68020645 72061908 76588801 81840917 87787147 94493041 102221365 111154619
10577 111154619 121534950 133730573 148483922 166546495 188457344 214362309 242444121
10570 242444121 265783723 263420626 185169899 13016390 -152741034 -245764465 -267096399
10563 -267096399 -247537802 -217663465 -190672735 -168706697 -150826355 -136083949 -123795478
10556 -123795478 -113428844 -104543428 -96868451 -90169974 -84295179 -79060652 -74296697 -69984815
$$ packed form
10610B9072039O68779P25173P60604Q23596Q73862R24638R61838R81465J016555
10601C6808549J077069J148316J205354J269170J316492J474733J627349J816546
10593D7743578J953489K034486K006790J659942J426944J888891K547435L138755
10585F4400310L620335M041263M526893N252116N946230O705894P728324Q933254
10577A11154619J0380331J2195623J4753349J8062573K1910849K5904965K8081812
10570B42444121K3339602k363097p8250727j72153509j65757424r3023431k1331934
10563b67096399J9558597K9874337K6990730K1966038J7880342J4742406J2288471
10556a23795478J0366634Q885416P674977O698477N874795N234527M763955M311882
$$ plain form
10548 -69984815 -66075813 -62586607 -59559077 -56935574 -54789690 -53360173 -52207311 -50848557
10540 -50848557 -49266760 -47568901 -45883346 -44267443 -42702679 -41200258 -39822961 -38567272
10532 -38567272 -37430446 -36351877 -35315209 -34390173 -33552576 -32793335 -32010987 -31278892 -30599119
10523 -30599119 -29920663 -29221140 -28581985 -27986328 -27391112 -26815683 -26282299 -25765440 -25274313
10514 -25274313 -24828391 -24363848 -23898374 -23454455 -23034006 -22623697 -22230489 -21873817 -21505439
10505 -21505439 -21136771 -20786599 -20430941 -20110697 -19818897 -19531350 -19288716 -19033843 -18757466
10496 -18757466 -18475193 -18221709 -17976427 -17754567 -17547621 -17325234 -17077948 -16836744 -16620956
10487 -16620956 -16429586 -16249188 -16056875 -15849350 -15678605 -15498555 -15319668 -15121635 -14917314
$$ packed form
10548f9984815L909002L489206L027530K623503K145884J429517J152862J358754
10540e0848557J581797J697859J685555J615903J564764J502421J377297J255689
10532c8567272J136826J078569J036668R25036Q37597P59241P82348P32095O79773
10523c0599119O78456O99523O39155N95657N95216N75429N33384N16859M91127
10514b5274313M45922M64543M65474M43919M20449M10309L93208L56672L68378
10505b1505439L68668L50172L55658L20244K91800K87547K42634K54873K76377
10496a8757466K82273K53484K45282K21860K06946K22387K47286K41204K15788
10487a6620956J91370J80398J92313K07525J70745J80050J78887J98033K04321
$$ plain form
10478 -14917314 -14732721 -14599172 -14446014 -14257143 -14143535 -14031110 -13886324 -13753884 -13608367
10469 -13608367 -13469985 -13306997 -13194702 -13095644 -12967673 -12818602 -12686333 -12542827 -12420245
10460 -12420245 -12312961 -12184161 -12075067 -11990961 -11885843 -11783261 -11661966 -11562907 -11474454 -11367510
10450 -11367510 -11237685 -11103393 -11008067 -10898103 -10762294 -10620371 -10500529 -10390112 -10309740 -10276281
10440 -10276281 -10265216 -10228017 -10176173 -10116240 -10107578 -10063501 -9995102 -9904769 -9797617 -9735783 -9667466
10429 -9667466 -9611704 -9558418 -9516227 -9435706 -9369100 -9347282 -9292689 -9219043 -9179831 -9115261 -9051881
10418 -9051881 -8990357 -8900208 -8825839 -8750178 -8706049 -8655740 -8599517 -8517245 -8446388 -8382513 -8320603
10407 -8320603 -8306222 -8310205 -8239822 -8151260 -8083618 -8053222 -8033811 -7994483 -7944103 -7895730 -7889586 -7866144
$$ packed form
10478a4917314J84593J33549J53158J88871J13608J12425J44786J32440J45517
10469a3608367J38382J62988J12295R9058J27971J49071J32269J43506J22582
10460a2420245J07284J28800J09094Q4106J05118J02582J21295R9059Q8453J06944
10450a1367510J29825J34292R5326J09964J35809J41923J19842J10417Q0372L3459
10440a0276281J1065L7199N1844N9933Q662M4077O8399R0333J07152O1834O8317
10429i667466N5762N3286M2191Q0521O6606K1818N4593P3646L9212O4570O3380
10418i051881O1524R0149P4369P5661M4129N0309N6223Q2272P0857O3875O1910
10407h320603J4381l983P0383Q8562O7642L0396J9411L9328N0380M8373O144K3442
$$ plain form
10395 -7866144 -7776929 -7734223 -7680791 -7615671 -7521700 -7454590 -7448736 -7440159 -7395002 -7344028 -7280555 -7254022
10383 -7254022 -7256841 -7220464 -7164372 -7094310 -7051139 -7006917 -6942844 -6897993 -6863690 -6831087 -6821926 -6790620
10371 -6790620 -6798421 -6789400 -6738766 -6698867 -6651360 -6612336 -6576000 -6553479 -6538899 -6524093 -6484343 -6423740
10359 -6423740 -6379832 -6345558 -6353049 -6332016 -6301903 -6268641 -6256266 -6261491 -6227376 -6192443 -6168891 -6121101
10347 -6121101 -6065790 -6081158 -6079726 -6061338 -6050444 -6000757 -5968486 -5959459 -5954513 -5905248 -5843742 -5796756
10335 -5796756 -5795763 -5757117 -5702660 -5674448 -5642612 -5625497 -5596303 -5555536 -5503594 -5488211 -5468994 -5468646
10323 -5468646 -5466764 -5437318 -5395320 -5347814 -5314183 -5319965 -5277666 -5253500 -5243721 -5265950 -5248577 -5218548
10311 -5218548 -5225390 -5237189 -5232450 -5235537 -5211099 -5176929 -5132778 -5115702 -5101696 -5088602 -5060111 -5011960
$$ packed form
10395g866144Q9215M2706N3432O5120R3971O7110N854Q577M5157N0974O3473K6533
10383g254022k819L6377N6092P0062M3171M4222O4073M4851L4303L2603R161L1306
10371f790620p801R021N0634L9899M7507L9024L6336K2521J4580J4806L9750O0603
10359f423740M3908L4274p491K1033L0113L3262J2375n225L4115L4933K3552M7790
10347f121101N5311j5368J432J8388J0894M9687L2271R027M946M9265O1506M6986
10335e796756R93L8646N4457K8212L1836J7115K9194M0767N1942J5383J9217L48
10323e468646J882K9446M1998M7506L3631n782M2299K4166R779k2229J7373L0029
10311e218548o842j1799M739l087K4438L4170M4151J7076J4006J3094K8491M8151
$$ plain form
10299 -5011960 -5008075 -5002970 -4975881 -4972302 -4954937 -4928922 -4899255 -4877713 -4898718 -4877504 -4861949 -4846171
10287 -4846171 -4825760 -4830111 -4823454 -4812070 -4789016 -4731872 -4704942 -4679250 -4649129 -4626421 -4622067 -4623046
10275 -4623046 -4593562 -4543800 -4520975 -4535675 -4545826 -4535300 -4514449 -4497975 -4487741 -4441344 -4417070
10264 -4417070 -4412056 -4403769 -4378909 -4342975 -4331487 -4337919 -4336030 -4323454 -4310832 -4290449 -4254752 -4250333
10252 -4250333 -4255756 -4262872 -4261921 -4282066 -4251218 -4220825 -4206338 -4186267 -4149611 -4164720 -4165446 -4126646
10240 -4126646 -4113324 -4065987 -4053291 -4036346 -3992142 -3983781 -4007092 -4003572 -3979685 -3952138 -3955644 -3983090
10228 -3983090 -3970436 -3961591 -3953921 -3923517 -3899543 -3861600 -3878049 -3866602 -3836255 -3796075 -3796884 -3817344
10216 -3817344 -3829335 -3794382 -3768676 -3776110 -3768440 -3735120 -3705763 -3698266 -3673769 -3648213 -3645284 -3651988
$$ packed form
10299e011960L885N105K7089L579J7365K6015K9667K1542k1005K1214J5555J5778
10287d846171K0411m351O657J1384K3054N7144K6930K5692L0121K2708M354r79
10275d623046K9484M9762K2825j4700j0151J0526K0851J6474J0234M6397K4274
10264d417070N014Q287K4860L5934J1488o432J889J2576J2622K0383L5697M419
10252d250333n423p116R51k0145L0848L0393J4487K0071L6656j5109p26L8800
10240d126646J3322M7337J2696J6945M4204Q361k3311L520K3887K7547l506k7446
10228c983090J2654Q845P670L0404K3974L7943j6449J1447L0347M0180q09k0460
10216c817344j1991L4953K5706p434P670L3320K9357P497K4497K5556K929o704
$$ plain form
10204 -3651988 -3630716 -3632812 -3611161 -3599005 -3584658 -3546125 -3538354 -3542155 -3542691 -3538732 -3508125 -3479398
10192 -3479398 -3461097 -3462994 -3433153 -3401891 -3412445 -3388098 -3347492 -3336426 -3343341 -3363382 -3341050 -3321825
10180 -3321825 -3284043 -3259764 -3226377 -3193301 -3153573 -3136293 -3152425 -3172008 -3154658 -3126820 -3102949
10169 -3102949 -3082589 -3046630 -2995299 -2930771 -2873204 -2823652 -2779216 -2714957 -2638035 -2573845 -2498403
10158 -2498403 -2392168 -2234767 -2092351 -1936835 -1888447 -2196977 -3007930 -3950890 -4512354 -4715141
10148 -4715141 -4649857 -4463675 -4287148 -4151356 -4074784 -3972593 -3896900 -3853788 -3793109 -3718027
10138 -3718027 -3633994 -3595349 -3552185 -3532487 -3544152 -3528671 -3515425 -3532112 -3518701 -3482434 -3475775
10127 -3475775 -3482413 -3513112 -3501143 -3476635 -3442262 -3386230 -3356049 -3362587 -3347101 -3313691 -3277686 -3251691
$$ packed form
10204c651988K1272k096K1651J2156J4347L8533P771l801n36L959L0607K8727
10192c479398J8301j897K9841L1262j0554K4347M0606J1066o915k0041K2332J9225
10180c321825L7782K4279L3387L3076L9728J7280j6132j9583J7350K7838K3871
10169c102949K0360L5959N1331O4528N7567M9552M4436O4259P6922O4190P5442
10158b498403J06235J57401J42416J55516M8388l08530q10953r42960n61464k02787
10148d715141O5284J86182J76527J35792P6572J02191P5693M3112O0679P5082
10138c718027Q4033L8645M3164J9698j1665J5481J3246j6687J3411L6267O659
10127c475775o638l0699J1969K4508L4373N6032L0181o538J5486L3410L6005K5995
$$ plain form
10115 -3251691 -3226550 -3239040 -3249107 -3250727 -3243149 -3214230 -3224726 -3235224 -3180042 -3145233 -3150819 -3171054
10103 -3171054 -3137229 -3087537 -3077026 -3050573 -3040648 -3035082 -3048851 -3021414 -3011684 -3005943 -2979125 -2982876
10091 -2982876 -2987227 -2997916 -2985873 -2952363 -2937776 -2980527 -2974131 -2957454 -2924268 -2943998 -2948270 -2925874
10079 -2925874 -2926147 -2913844 -2911443 -2940934 -2924027 -2919015 -2926536 -2887749 -2869714 -2860394 -2854797 -2847668 -2806827
10066 -2806827 -2788584 -2777936 -2793116 -2817784 -2802129 -2768484 -2797856 -2803126 -2773163 -2764322 -2748142 -2779470
10054 -2779470 -2783285 -2763406 -2735626 -2725446 -2707985 -2697271 -2684772 -2663211 -2622362 -2607454 -2619976
10043 -2619976 -2608947 -2594221 -2657143 -2793007 -2863618 -2837879 -2838047 -2858377 -2833808 -2815563 -2798930
10032 -2798930 -2792753 -2766265 -2783300 -2753597 -2732727 -2733889 -2725799 -2681166 -2640537 -2650717 -2655233 -2630075
$$ packed form
10115c251691K5141j2490j0067j620P578K8919j0496j0498N5182L4809n586k0235
10103c171054L3825M9692J0511K6453R925N566j3769K7437R730N741K6818l751
10091b982876m351j0689J2043L3510J4587m2751O396J6677L3186j9730m272K2396
10079b925874k73J2303K401k9491J6907N012p521L8787J8035R320N597P129M0841
10066b806827J8243J0648j5180k4668J5655L3645k9372n270K9963Q841J6180l1328
10054b779470l815J9879K7780J0180J7461J0714J2499K1561M0849J4908j2522
10043b619976J1029J4726o2922j35864p0611K5739j68k0330K4569J8245J6633
10032b798930O177K6488j7035K9703K0870j162Q090M4633M0629j0180m516K5158
$$ plain form
10020 -2630075 -2628060 -2637753 -2623170 -2593473 -2579684 -2577345 -2598061 -2623477 -2626471 -2627169 -2615727 -2616712 -2618473
10007 -2618473 -2605247 -2592665 -2609642 -2594773 -2570279 -2571205 -2549038 -2553086 -2549642 -2532308 -2544713 -2517480
9995 -2517480 -2485104 -2487373 -2486617 -2499200 -2503730 -2504611 -2492228 -2482675 -2473048 -2455403 -2457270 -2437128 -2393095
9982 -2393095 -2410243 -2433343 -2411627 -2412630 -2408505 -2396352 -2396889 -2425676 -2397908 -2395610 -2390757 -2401341 -2425546
9969 -2425546 -2413462 -2384128 -2382346 -2368401 -2363193 -2379022 -2383679 -2385514 -2365154 -2363071 -2337800 -2340518 -2361822
9956 -2361822 -2372402 -2362180 -2323030 -2335198 -2338625 -2307952 -2299393 -2277426 -2280287 -2288102 -2303825 -2346622
9944 -2346622 -2367331 -2327217 -2309122 -2286221 -2236117 -2212916 -2243843 -2237077 -2204840 -2202726 -2215735 -2233511
9932 -2233511 -2218544 -2198688 -2199479 -2232863 -2236844 -2208891 -2179795 -2177414 -2168488 -2207947 -2233058 -2219752
$$ packed form
10020b630075K015r693J4583K9697J3789K339k0716k5416k994o98J1442r85j761
10007b618473J3226J2582j6977J4869K4494r26K2167m048L444J7334j2405K7233
9995b517480L2376k269P56j2583m530q81J2383R553R627J7645j867K0142M4033
9982b393095j7148k3100K1716j003M125J2153n37k8787K7768K298M853j0584k4205
9969b425546J2084K9334J782J3945N208j5829m657j835K0360K083K5271k718k1304
9956b361822j0580J0222L9150j2168l427L0673Q559K1967k861p815j5723m2797
9944b346622k0709M0114J8095K2901N0104K3201l0927O766L2237K114j3009j7776
9932b233511J4967J9856p91l3384l981K7953K9096K381Q926l9459k5111J3306
$$ plain form
9920 -2219752 -2217441 -2205841 -2211548 -2225811 -2224669 -2204204 -2194763 -2185918 -2171855 -2155428 -2188183 -2213212
9908 -2213212 -2189767 -2155190 -2132687 -2150579 -2152930 -2152771 -2162966 -2145860 -2113803 -2100059 -2097199 -2124092
9896 -2124092 -2153346 -2135077 -2105112 -2075143 -2059659 -2053823 -2074353 -2107963 -2092511 -2075212 -2075586 -2100479
9884 -2100479 -2105069 -2103591 -2105680 -2083357 -2078402 -2104579 -2090754 -2047496 -2028916 -2070337 -2102026 -2105336
9872 -2105336 -2079812 -2060418 -2041231 -2006741 -1992518 -2008879 -2018483 -2011791 -2015611 -2038893 -2068974 -2058793
9860 -2058793 -2012467 -1995532 -1986813 -1993587 -1976985 -1971628 -1981765 -1987681 -1980528 -1963028 -1958687 -1956808 -1977111
9847 -1977111 -2004334 -2016199 -2033164 -2017359 -1995204 -2002215 -2017485 -1996039 -1985933 -1986795 -2015053 -2022906
9835 -2022906 -2030363 -1990875 -1975162 -1939704 -1930357 -1955519 -1958195 -1957319 -1951956 -1960872 -1945613 -1928606 -1936400
$$ packed form
9920b219752K311J1600n707j4263J142K0465R441Q845J4063J6427l2755k5029
9908b213212K3445L4577K2503j7892k351J59j0195J7106L2057J3744K860k6893
9896b124092k9254J8269K9965K9969J5484N836k0530l3610J5452J7299l74k4893
9884b100479m590J478k089K2323M955k6177J3825M3258J8580m1421l1689l310
9872b105336K5524J9394J9187L4490J4223j6361r604O692l820k3282l0081J0181
9860b058793M6326J6935Q719o774J6602N357j0137n916P153J7500M341J879k0303
9847a977111k7223j1865j6965J5805K2155p011j5270K1446J0106q62k8258p853
9835b022906p457L9488J5713L5458R347k5162k676Q76N363q916J5259J7007p794
$$ plain form
9822 -1936400 -1930416 -1938249 -1937149 -1912009 -1873511 -1877783 -1914083 -1915126 -1917108 -1925321 -1922647 -1922857 -1957765
9809 -1957765 -1967918 -1945248 -1909944 -1893713 -1870894 -1870908 -1885936 -1884810 -1888705 -1885246 -1878390 -1866449 -1859901
9796 -1859901 -1842205 -1832592 -1869004 -1872180 -1864937 -1891118 -1887917 -1858379 -1844533 -1846865 -1857231 -1865556 -1839351
9783 -1839351 -1847213 -1856432 -1833006 -1825959 -1846308 -1799856 -1770337 -1782996 -1799090 -1810835 -1820577 -1825444
9771 -1825444 -1839310 -1847740 -1841575 -1825135 -1808080 -1828763 -1835991 -1799036 -1774057 -1784011 -1782801 -1779056 -1781178
9758 -1781178 -1765752 -1756875 -1765611 -1792916 -1800565 -1801937 -1787654 -1807039 -1798416 -1788767 -1788499 -1766634 -1761348
9745 -1761348 -1783797 -1771890 -1742643 -1733762 -1733095 -1738000 -1737481 -1700682 -1691430 -1706024 -1720476 -1717335 -1675377
9732 -1675377 -1678622 -1689731 -1662718 -1634798 -1649945 -1679204 -1684084 -1699060 -1709332 -1695559 -1656856 -1641267
$$ packed form
9822a936400N984p833J100K5140L8498m272l6300j043j982q213K674k10l4908
9809a957765j0153K2670L5304J6231K2819j4j5028J126l895L459O856J1941O548
9796a859901J7696R613l6412l176P243k6181L201K9538J3846k332j0366q325K6205
9783a839351p862r219K3426P047k0349M6452K9519j2659j6094j1745r742m867
9771a825444j3866q430O165J6440J7055k0683p228L6955K4979r954J210L745k122
9758a781178J5426Q877q736k7305p649j372J4283j9385Q623R649K68K1865N286
9745a761348k2449J1907K9247Q881O67m905N19L6799R252j4594j4452L141M1958
9732a675377l245j1109K7013K7920j5147k9259m880j4976j0272J3773L8703J5589
$$ plain form
9720 -1641267 -1616579 -1635373 -1643370 -1662402 -1657801 -1640975 -1626863 -1641132 -1634231 -1641235 -1617013 -1599498
9708 -1599498 -1635742 -1645783 -1613436 -1627533 -1625244 -1619852 -1648377 -1669774 -1662804 -1584940 -1558992 -1576238
9696 -1576238 -1615147 -1634985 -1625905 -1625670 -1601595 -1604864 -1623153 -1610794 -1602044 -1607612 -1586392 -1582409 -1601180
9683 -1601180 -1612176 -1613666 -1595495 -1580540 -1605332 -1606286 -1598343 -1589476 -1585105 -1583649 -1573119 -1530556 -1510397
9670 -1510397 -1535286 -1580557 -1599861 -1600678 -1582149 -1587632 -1574014 -1554813 -1559792 -1560927 -1597909 -1588857 -1547042
9657 -1547042 -1547880 -1549889 -1543510 -1543744 -1547793 -1574212 -1592650 -1613624 -1597049 -1585453 -1561139 -1563395 -1591637
9644 -1591637 -1579157 -1562019 -1526605 -1502758 -1466479 -1472952 -1500949 -1497150 -1483622 -1482223 -1490523 -1483327
9632 -1483327 -1490156 -1480273 -1476021 -1476524 -1515528 -1503957 -1493201 -1484318 -1529365 -1504657 -1448374 -1441548 -1452881
$$ packed form
9720a641267K4688j8794p997j9032M601J6826J4112j4269O901p004K4222J7515
9708a599498l6244j0041L2347j4097K289N392k8525k1397O970P7864K5948j7246
9696a576238l8909j9838R080K35K4075l269j8289J2359Q750n568K1220L983j8771
9683a601180j0996j490J8171J4955k4792r54P943Q867M371J456J0530M2563K0159
9670a510397k4889m5271j9304q17J8529n483J3618J9201m979j135l6982R052M1815
9657a547042q38k009O379k34m049k6419j8438k0974J6575J1596K4314k256k8242
9644a591637J2480J7138L5414K3847L6279o473k7997L799J3528J399q300P196
9632a483327o829R883M252n03l9004J1571J0756Q883m5047K4708N6283O826j1333
$$ plain form
9619 -1452881 -1464630 -1481610 -1441927 -1449291 -1446082 -1444075 -1465020 -1462349 -1478008 -1497170 -1498448 -1493216 -1490179
9606 -1490179 -1496070 -1469863 -1465189 -1462284 -1458625 -1442255 -1449156 -1427214 -1402317 -1398915 -1376799 -1385648 -1407316
9593 -1407316 -1416951 -1407553 -1393510 -1376316 -1360165 -1382400 -1380176 -1373259 -1363710 -1382688 -1410832 -1412716 -1440728
9580 -1440728 -1448506 -1427299 -1422316 -1425708 -1422073 -1440346 -1435682 -1436541 -1415248 -1404269 -1429206 -1419806 -1413608
9567 -1413608 -1426440 -1400648 -1388404 -1398874 -1419200 -1435982 -1437274 -1422744 -1406948 -1414974 -1408881 -1383463
9555 -1383463 -1393519 -1406165 -1401041 -1375342 -1358153 -1359173 -1373668 -1396634 -1385379 -1370442 -1365919 -1357810
9543 -1357810 -1356215 -1346484 -1329440 -1322429 -1328072 -1312011 -1339171 -1356019 -1344852 -1350260 -1338160 -1339505 -1331385
9530 -1331385 -1344284 -1372429 -1380717 -1364328 -1364604 -1356677 -1366764 -1363726 -1330220 -1306613 -1322725 -1319143 -1315812
$$ packed form
9619a452881j1749j6980L9683p364L209K007k0945K671j5659j9162j278N232L037
9606a490179n891K6207M674K905L659J6370o901K1942K4897L402K2116q849k1668
9593a407316r635R398J4043J7194J6151k2235K224O917R549j8978k8144j884k8012
9580a440728p778K1207M983l392L635j8273M664q59K1293J0979k4937R400O198
9567a413608j2832K5792J2244j0470k0326j6782j292J4530J5796q026O093K5418
9555a383463j0056j2646N124K5699J7189j020j4495k2966J1255J4937M523Q109
9543a357810J595R731J7044P011n643J6061k7160j6848J1167n408J2100j345Q120
9530a331385j2899k8145q288J6389k76P927j0087L038L3506K3607j6112L582L331
$$ plain form
9517 -1315812 -1349560 -1340443 -1320970 -1314953 -1313641 -1283581 -1257196 -1267921 -1285196 -1296595 -1290877 -1289347
9505 -1289347 -1282151 -1276684 -1295725 -1329991 -1314429 -1306958 -1306270 -1287818 -1261826 -1267265 -1285045 -1273291 -1280042
9492 -1280042 -1283038 -1271926 -1266855 -1277854 -1291996 -1273879 -1279805 -1286935 -1289936 -1318892 -1327089 -1326746 -1314805
9479 -1314805 -1293023 -1291140 -1295892 -1268441 -1275779 -1271303 -1264008 -1268953 -1296208 -1297614 -1270736 -1247092 -1228093
9466 -1228093 -1186963 -1186517 -1217117 -1235693 -1244673 -1267383 -1285288 -1249165 -1201826 -1181396 -1175595 -1183089
9454 -1183089 -1198527 -1182989 -1186848 -1202616 -1181952 -1187580 -1205150 -1224466 -1241298 -1248286 -1248972 -1225968
9442 -1225968 -1198535 -1178550 -1166818 -1168350 -1158433 -1167352 -1199982 -1237392 -1246957 -1236915 -1209841 -1196872
9430 -1196872 -1162176 -1133981 -1164459 -1189072 -1201251 -1209500 -1142820 -1143260 -1159394 -1159318 -1141384 -1125140 -1133414
$$ packed form
9517a315812l3748R117J9473O017J312L0060K6385j0725j7275j1399N718J530
9505a289347P196N467j9041l4266J5562P471O88J8452K5992n439j7780J1754o751
9492a280042k996J1112N071j0999j4142J8117n926p130l001k8956q197L43J1941
9479a314805K1782J883m752K7451p338M476P295m945k7255j406K6878K3644J8999
9466a228093M1130M46l0600j8576q980k2710j7905L6123M7339K0430N801p494
9454a183089j5438J5538l859j5768K0664n628j7570j9316j6832o988o86K3004
9442a225968K7433J9985J1732j532R917q919l2630l7410r565J0042K7074J2969
9430a196872L4696K8195l0478k4613j2179q249O6680m40j6134P6J7934J6244q274
$$ plain form
9417 -1133414 -1139182 -1148604 -1132539 -1141666 -1113181 -1106052 -1103478 -1113847 -1126783 -1095350 -1128944 -1163907
9405 -1163907 -1162653 -1137774 -1115072 -1083091 -1083753 -1109801 -1106132 -1104989 -1118789 -1082056 -1048577 -1063518
9393 -1063518 -1091245 -1116508 -1149916 -1176018 -1128660 -1098907 -1093170 -1113299 -1122880 -1154317 -1146743 -1116534
9381 -1116534 -1092405 -1072518 -1080487 -1086028 -1075953 -1080140 -1086441 -1063230 -1058654 -1066674 -1074504 -1057840 -1068181
9368 -1068181 -1098864 -1081199 -1073371 -1079792 -1066571 -1061673 -1029314 -1009381 -1020396 -1008834 -1006864 -1010507
9356 -1010507 -986547 -1004023 -1001715 -977588 -1005248 -1028681 -1001373 -988238 -1000195 -982564 -956760 -975403
9344 -975403 -995640 -971920 -961055 -1008011 -1020852 -1044905 -1058452 -1029908 -1033208 -1032533 -988422 -1008643
9332 -1008643 -1012522 -987524 -962170 -967340 -976382 -966434 -960101 -990608 -975469 -967450 -983084 -1010994 -1008080
$$ packed form
9417a133414n768r422J6065r127K8485P129K574j0369j2936L1433l3594l4963
9405a163907J254K4879K2702L1981o62k6048L669J143j3800L6733L3479j4941
9393a063518k7727k5263l3408k6102M7358K9753N737k0129r581l1437P574L0209
9381a116534K4129J9887p969n541J0075m187o301K3211M576q020p830J6664j0341
9368a068181l0683J7665P828o421J3221M898L2359J9933j1015J1562J970l643
9356a010507K3960j7476K308K4127k7660k3433K7308J3135j1957J7631K5804j8643
9344i75403k0237K3720J0865m6956j2841k4053j3547K8544l300O75M4111k0221
9332a008643l879K4998K5354n170r042R948O333l0507J5139Q019j5634k7910K914
$$ plain form
9319 -1008080 -978929 -945368 -958218 -944994 -929403 -942864 -920933 -909681 -911575 -907002 -901202 -891531
9307 -891531 -905948 -921677 -903949 -915451 -912833 -900344 -883470 -853533 -855767 -883000 -867337 -880669
9295 -880669 -881957 -854623 -829657 -805372 -786029 -803488 -800677 -786689 -747798 -751669 -797578 -817372
9283 -817372 -767884 -753931 -763964 -769098 -741569 -752934 -770062 -781098 -779747 -777060 -766161 -729100
9271 -729100 -699296 -686730 -681310 -702940 -683050 -674631 -669731 -667378 -650638 -647350 -658668 -638446 -631315
9258 -631315 -591479 -598026 -632375 -640891 -614755 -612745 -624900 -625779 -638770 -657602 -653872 -647561 -634043
9245 -634043 -620872 -572512 -555092 -580518 -566697 -528684 -522403 -547899 -555440 -563451 -578592 -540225
9233 -540225 -489633 -462189 -451527 -442937 -446616 -462745 -475824 -460349 -448879 -452540 -443600 -426918
$$ packed form
9319a008080K9151L3561j2850J3224J5591j3461K1931J1252j894M573N800R671
9307h91531j4417j5729J7728j1502K618J2489J6874K9937k234k7233J5663j3332
9295h80669j288K7334K4966K4285J9343j7459K811J3988L8891l871m5909j9794
9283h17372M9488J3953j0033n134K7529j1365j7128j1036J351K687J0899L7061
9271g29100K9804J2566N420k1630J9890Q419M900K353J6740L288j1318K0222P131
9258f31315L9836o547l4349q516K6136K010j2155q79j2991j8832L730O311J3518
9245f34043J3171M8360J7420k5426J3821L8013O281k5496p541q011j5141L8367
9233e40225N0592K7444J0662Q590l679j6129j3079J5475J1470l661Q940J6682
$$ plain form
9221 -426918 -430324 -418416 -393637 -414297 -427233 -420500 -382184 -389455 -404375 -398609 -398202 -419778 -435612
9208 -435612 -428877 -392693 -370123 -400543 -429266 -418706 -420603 -441617 -432093 -417917 -450447 -463300
9196 -463300 -476545 -497416 -517316 -509815 -550649 -571835 -570684 -595561 -643592 -686076 -730689 -777177
9184 -777177 -843848 -887412 -928225 -936261 -961848 -1006416 -1076200 -1128146 -1186595 -1252383 -1289854 -1309849
9172 -1309849 -1353623 -1389474 -1418591 -1467872 -1536841 -1601538 -1612649 -1650129 -1686690 -1703304 -1745577
9161 -1745577 -1765205 -1787790 -1789831 -1795200 -1818249 -1831629 -1886109 -1917384 -1906478 -1887349 -1897799 -1902647
9149 -1902647 -1904541 -1931550 -1922823 -1932683 -1929462 -1926425 -1940565 -1931416 -1914010 -1936534 -1953875 -1913524 -1905586
9136 -1905586 -1894577 -1890743 -1872796 -1893852 -1907490 -1883374 -1874785 -1876398 -1850502 -1838415 -1791105 -1772602
$$ packed form
9221d26918l406J1908K4779k0660j2936O733L8316p271j4920N766M07k1576j5834
9208d35612O735L6184K2570l0420k8723J0560j897k1014R524J4176l2530j2853
9196d63300j3245k0871j9900P501m0834k1186J151k4877m8031m2484m4613m6488
9184g77177o6671m3564m0813q036k5587m4568o9784n1946n8449o5788l7471j9995
9172a309849m3774l5851k9117m9281o8969o4697j1111l7480l6561j6614m2273
9161a745577j9628k2585k041n369k3049j3380n4480l1275J0906J9129j0450m848
9149a902647j894k7009Q727r860L221L037j4140R149J7406k2524j7341M0351P938
9136a905586J1009L834J7947k1056j3638K4116Q589j613K5896J2087M7310J8503
$$ plain form
9124 -1772602 -1778754 -1764132 -1728923 -1712355 -1715699 -1742916 -1773108 -1789944 -1796057 -1778880 -1738388 -1712095
9112 -1712095 -1699059 -1725726 -1739997 -1710243 -1714771 -1722239 -1697829 -1685258 -1698559 -1680171 -1670608 -1660510
9100 -1660510 -1648224 -1647251 -1667082 -1665765 -1671549 -1719771 -1704415 -1658914 -1625019 -1611421 -1609461 -1600175 -1600843
9087 -1600843 -1606474 -1590720 -1593701 -1596008 -1602889 -1596928 -1585405 -1548477 -1551309 -1524639 -1521529 -1533824 -1544774
9074 -1544774 -1533824 -1524580 -1531450 -1520205 -1505443 -1484253 -1471093 -1450311 -1431518 -1451938 -1447236 -1455659
9062 -1455659 -1482593 -1513982 -1485279 -1455536 -1463873 -1462511 -1474075 -1467470 -1465335 -1489157 -1486934 -1507506
9050 -1507506 -1500744 -1463393 -1451010 -1447042 -1430382 -1466693 -1485480 -1433223 -1431179 -1445704 -1444147 -1459255
9038 -1459255 -1465753 -1451262 -1437759 -1443381 -1438760 -1441929 -1421532 -1395447 -1398805 -1372350 -1356879 -1367691
$$ packed form
9124a772602o152J4622L5209J6568l344k7217l0192j6836o113J7177M0492K6293
9112a712095J3036k6667j4271K9754m528p468K4410J2571j3301J8388R563J0098
9100a660510J2286R73j9831J317n784m8222J5356M5501L3895J3598J960R286o68
9087a600843n631J5754k981k307o881N961J1523L6928k832K6670L110j2295j0950
9074a544774J0950R244o870J1245J4762K1190J3160K0782J8793k0420M702q423
9062a455659k6934l1389K8703K9743q337J362j1564O605K135k3822K223k0572
9050a507506O762L7351J2383L968J6660l6311j8787N2257K044j4525J557j5108
9038a459255o498J4491J3503n622M621l169K0397K6085l358K6455J5471j0812
$$ plain form
9026 -1367691 -1390835 -1413456 -1442149 -1458486 -1464096 -1462978 -1408958 -1342857 -1324385 -1342857 -1385787 -1368850
9014 -1368850 -1367110 -1352681 -1373183 -1387370 -1384553 -1339529 -1320483 -1313946 -1308933 -1315706 -1299795 -1343649
9002 -1343649 -1357481 -1368120 -1383556 -1380743 -1353531 -1329648 -1331345 -1338231 -1352478 -1375657 -1368120 -1340497
8990 -1340497 -1310791 -1280517 -1269959 -1257102 -1251275 -1253246 -1255705 -1261836 -1297735 -1294287 -1278010 -1291612
8978 -1291612 -1284586 -1296901 -1311579 -1321721 -1317709 -1284818 -1283176 -1289119 -1312607 -1331996 -1330335 -1314568
8966 -1314568 -1287343 -1275115 -1280451 -1273108 -1249558 -1253466 -1272980 -1252745 -1254710 -1274565 -1291241 -1296260
8954 -1296260 -1280611 -1251299 -1239001 -1258800 -1247463 -1199034 -1178623 -1201959 -1199461 -1222998 -1223153 -1227038
8942 -1227038 -1225182 -1237550 -1240709 -1206729 -1210393 -1203974 -1213896 -1208392 -1198311 -1246594 -1237076 -1191724 -1136488
$$ packed form
9026a367691k3144k2621k8693j6337n610J118N4020O6101J8472j8472m2930J6937
9014a368850J740J4429k0502j4187K817M5024J9046O537N013o773J5911m3854
9002a343649j3832j0639j5436K813K7212K3883j697o886j4247k3179P537K7623
8990a340497K9706L0274J0558J2857N827j971k459o131l5899L448J6277j3602
8978a291612P026j2315j4678j0142M012L2891J642n943k3488j9389J661J5767
8966a314568K7225J2228n336P343K3550l908j9514K0235j965j9855j6676n019
8954a296260J5649K9312J2298j9799J1337M8429K0411k3336K498k3537j55l885
8942a227038J856j2368l159L3980l664O419r922N504J0081m8283R518M5352N5236
$$ plain form
8929 -1136488 -1104701 -1123151 -1149122 -1154175 -1175697 -1203544 -1209817 -1189412 -1193635 -1204376 -1192725 -1205967
8917 -1205967 -1223257 -1197125 -1162539 -1163498 -1153715 -1129131 -1138819 -1154680 -1160648 -1176067 -1205341 -1237433
8905 -1237433 -1225200 -1222245 -1229552 -1206538 -1221068 -1235876 -1232877 -1222696 -1200804 -1208649 -1212209 -1215914 -1200689
8892 -1200689 -1184682 -1187232 -1176487 -1168294 -1176955 -1144641 -1121901 -1113691 -1119522 -1158608 -1173002 -1161406
8880 -1161406 -1136001 -1141214 -1153860 -1147558 -1154095 -1125909 -1143562 -1161569 -1132975 -1115098 -1116238 -1139509
8868 -1139509 -1123214 -1092385 -1105121 -1109059 -1113802 -1100545 -1090464 -1109053 -1127812 -1147184 -1157226 -1133534
8856 -1133534 -1137754 -1142979 -1146264 -1144757 -1145129 -1148678 -1135467 -1166833 -1190447 -1197691 -1193361 -1187731 -1184643 -1185352
8842 -1185352 -1191647 -1173515 -1166834 -1181085 -1155247 -1133101 -1145549 -1131070 -1144387 -1133204 -1110677 -1139824
$$ packed form
8929a136488L1787j8450k5971n053k1522k7847o273K0405m223j0741J1651j3242
8917a205967j7290K6132L4586r59R783K4584r688j5861n968j5419k9274l2092
8905a237433J2233K955p307K3014j4530j4808K999J0181K1892p845l560l705J5225
8892a200689J6007k550J0745Q193q661L2314K2740Q210n831l9086j4394J1596
8880a161406K5405n213j2646O302o537K8186j7653j8007K8594J7877j140k3271
8868a139509J6295L0829j2736l938m743J3257J0081j8589j8759j9372j0042K3692
8856a133534m220n225l285J507l72l549J3211l1366k3614p244M330N630L088p09
8842a185352o295J8132O681j4251K5838K2146j2448J4479j3317J1183K2527k9147
$$ plain form
8830 -1139824 -1170098 -1132590 -1077619 -1096628 -1118705 -1109054 -1128094 -1126626 -1107717 -1089943 -1098237 -1102420
8818 -1102420 -1107569 -1110718 -1110006 -1104075 -1084102 -1132860 -1148810 -1133577 -1111242 -1072079 -1050612 -1055844 -1066160
8805 -1066160 -1064157 -1054997 -1061688 -1062039 -1063861 -1061883 -1051664 -1069407 -1074049 -1076052 -1083495 -1099868 -1079905
8792 -1079905 -1056757 -1066773 -1091950 -1099516 -1089451 -1095638 -1104333 -1117392 -1124127 -1095359 -1055372 -1050839
8780 -1050839 -1063858 -1052531 -1051773 -1049604 -1048681 -1039273 -1053442 -1075089 -1062705 -1043987 -1023108 -1021231 -1003703
8767 -1003703 -1014992 -1025610 -1056177 -1069634 -1050379 -1035264 -1039162 -1030760 -1047738 -1050704 -1030947 -1035102
8755 -1035102 -1030226 -1025672 -1013991 -1016641 -999506 -1011497 -985908 -995467 -1031951 -1038772 -1032472 -1027152 -1016238
8742 -1016238 -1003961 -1011235 -985007 -976770 -1007818 -1042743 -1007960 -1002935 -1014569 -1014996 -1001506 -1018454
$$ packed form
8830a139824l0274L7508N4971j9009k2077R651j9040J468J8909J7774q294m183
8818a102420n149l149P12N931J9973m8758j5950J5233K2335L9163K1467n232j0316
8805a066160K003R160o691l51j822J978J0219j7743m642k003p443j6373J9963
8792a079905K3148j0016k5177p566J0065o187q695j3059o735K8768L9987M533
8780a050839j3019J1327P58K169R23R408j4169k1647J2384J8718K0879J877J7528
8767a003703j1289j0618l0567j3457J9255J5115l898Q402j6978k966J9757m155
8755a035102M876M554J1681k650J7135j1991K5589r559l6484o821O300N320J0914
8742a016238J2277p274K6228Q237l1048l4925L4783N025j1634m27J3490j6948
$$ plain form
8730 -1018454 -1035666 -1019867 -988272 -993556 -1011643 -999215 -989579 -997987 -1008443 -1012617 -1019798 -1031777
8718 -1031777 -1021604 -1017538 -1021939 -1003171 -979361 -995627 -1003808 -992868 -1004337 -1011079 -1005765 -991675
8706 -991675 -1009286 -1009829 -1002645 -992080 -979621 -975856 -976607 -992118 -1004423 -968054 -942241 -941683 -969967
8693 -969967 -977601 -991168 -1010471 -1025495 -1025273 -981657 -978040 -984062 -965094 -931021 -919523 -963531 -992065
8680 -992065 -1004775 -988659 -978323 -971641 -969016 -958021 -968162 -986670 -977161 -966629 -990978 -1016243
8668 -1016243 -1001902 -994694 -1000336 -991787 -984102 -987866 -973544 -961171 -935336 -951845 -974187 -972179 -946298
8655 -946298 -911932 -898138 -923233 -942834 -949257 -973236 -1001804 -990289 -941952 -958123 -960899 -967998
8643 -967998 -943046 -936560 -976198 -1013735 -1000131 -996137 -1015999 -1011493 -993290 -978124 -974001 -949568
$$ packed form
8730a018454j7212J5799L1595n284j8087J2428R636q408j0456m174p181j1979
8718a031777J0173M066m401J8768K3810j6266q181J0940j1469o742N314J4090
8706i91675j7611n43P184J0565J2459L765p51j5511j2305L6369K5813N58k8284
8693i69967p634j3567j9303j5024K22M3616L617o022J8968L4073J1498m4008k8534
8680i92065j2710J6116J0336O682K625J0995j0141j8508R509J0532k4349k5265
8668a016243J4341P208n642Q549P685l764J4322J2373K5835j6509k2342K008K5881
8655i46298L4366J3794k5095j9601o423k3979k8568J1515M8337j6171k776p099
8643i67998K4952O486l9638l7537J3604L994j9862M506J8203J5166M123K4433
$$ plain form
8631 -949568 -939781 -926129 -929704 -932623 -907111 -898797 -904740 -907470 -912703 -918652 -890034 -893361 -901060 -896907
8617 -896907 -900572 -934933 -953363 -925510 -911304 -931139 -939503 -937392 -955598 -942342 -938261 -969213
8605 -969213 -979688 -969038 -959550 -971349 -963811 -948270 -953382 -993441 -982771 -955053 -975254 -998608
8593 -998608 -995158 -989990 -995150 -1022308 -1009884 -987499 -1015655 -1008625 -978203 -954937 -975562 -1013928
8581 -1013928 -1033656 -1042085 -1026797 -1041365 -1040472 -1030603 -1005144 -989044 -993862 -1001454 -1006524 -1024002 -1024057
8568 -1024057 -1011955 -1010789 -987012 -1018201 -1031807 -1035537 -1022503 -1030083 -1049833 -1027516 -1020183 -991472
8556 -991472 -987577 -972041 -960232 -944987 -918768 -929956 -951299 -953659 -964791 -992279 -990275 -991986
8544 -991986 -992396 -984976 -996463 -1007846 -974139 -981746 -978145 -996368 -1017252 -1015878 -995830 -1008502 -1015452
$$ packed form
8631i49568R787J3652l575k919K5512Q314n943k730n233n949K8618l327p699M153
8617h96907l665l4361j8430K7853J4206j9835q364K111j8206J3256M081l0952
8605i69213j0475J0650R488j1799P538J5541n112m0059J0670K7718k0201k3354
8593i98608L450N168n160k7158J2424K2385k8156P030L0422K3266k0625l8366
8581a013928j9728q429J5288j4568Q93R869K5459J6100m818p592n070j7478n5
8568a024057J2102J166K3777l1189j3606l730J3034p580j9750K2317P333K8711
8556i91472L895J5536J1809J5245K6219j1188k1343k360j1132k7488K004j711
8544i91986m10P420j1487j1383L3707p607L601j8223k0884J374K0048j2672o950
$$ plain form
8531 -1015452 -1002925 -964995 -962428 -969095 -996963 -998925 -987607 -978743 -965378 -930843 -927437 -899883
8519 -899883 -849188 -864759 -887723 -904156 -897734 -922155 -956643 -976600 -984282 -977550 -970662 -958823
8507 -958823 -947376 -944081 -959593 -963752 -933416 -926272 -941011 -936767 -920965 -909628 -926780 -924789 -864377
8494 -864377 -850848 -863360 -887781 -918058 -926230 -910356 -887965 -877671 -881259 -875315 -882350 -904374
8482 -904374 -934822 -952583 -937472 -922471 -921633 -902894 -889376 -900926 -911625 -938246 -953764 -930631
8470 -930631 -922566 -923270 -899813 -901082 -915386 -893975 -875487 -897602 -919201 -914045 -936968 -944903 -927320
8457 -927320 -931549 -915065 -925163 -947075 -930655 -924156 -945203 -926598 -922001 -920950 -930786 -928869 -935475
8444 -935475 -922140 -881935 -865379 -892111 -928919 -921240 -906959 -896335 -904547 -926101 -927812 -931491
$$ packed form
8531a015452J2527L7930K567o667k7868j962J1318Q864J3365L4535L406K7554
8519h99883N0695j5571k2964j6433O422k4421l4488j9957p682O732O888J1839
8507i58823J1447L295j5512m159L0336P144j4739M244J5802J1337j7152J991O0412
8494h64377J3529j2512k4421l0277q172J5874K2391J0294l588N944p035k2024
8482i04374l0448j7761J5111J5001Q38J8739J3518j1550j0699k6621j5518K3133
8470i30631Q065p04K3457j269j4304K1411J8488k2115k1599N156k2923p935J7583
8457i27320m229J6484j0098k1912J6420O499k1047J8605M597J051r836J917o606
8444i35475J3335M0205J6556k6732l6808P679J4281J0624q212k1554j711l679
$$ plain form
8432 -931491 -946423 -930453 -933026 -921184 -954417 -933503 -921232 -908479 -916790 -902258 -866302 -862697
8420 -862697 -887556 -911487 -897284 -875442 -876040 -908629 -928191 -924244 -900571 -902010 -909159 -914130 -912150
8407 -912150 -893644 -882834 -866885 -850501 -863544 -862746 -861862 -870029 -872077 -856293 -831344 -824278 -820890
8394 -820890 -828975 -847160 -855437 -864506 -871397 -880322 -867902 -867260 -834243 -838350 -830038 -855867 -849893 -826197
8380 -826197 -839267 -859495 -866896 -879715 -894529 -862507 -873669 -885533 -904519 -897783 -875620 -856539
8368 -856539 -866436 -885294 -870774 -859519 -830201 -816933 -823771 -833419 -855021 -843815 -825765 -828719
8356 -828719 -810567 -803088 -802597 -846881 -865128 -878710 -853485 -855425 -850842 -857834 -890576 -887815 -861690
8343 -861690 -860835 -872256 -844839 -841018 -854956 -863155 -854611 -866414 -878473 -877614 -863263 -848755 -847090
$$ packed form
8432i31491j4932J5970k573J1842l3233K0914J2271J2753q311J4532L5956L605
8420h62697k4859k3931J4203K1842n98l2589j9562L947K3673j439p149m971J980
8407i12150J8506J0810J5949J6384j3043P98Q84q167k048J5784K4949P066L388
8394h20890q085j8185q277r069o891q925J2420O42L3017m107Q312k5829N974K3696
8380h26197j3070k0228p401j2819j4814L2022j1162j1864j8986O736K2163J9081
8368h56539r897j8858J4520J1255K9318J3268o838r648k1602J1206J8050k954
8356h28719J8152P479M91m4284j8247j3582K5225j940M583o992l2742K761K6125
8343h61690Q55j1421K7417L821j3938q199Q544j1803j2059Q59J4351J4508J665
$$ plain form
8330 -847090 -847248 -856827 -878972 -889104 -898594 -896911 -872931 -852118 -857184 -856818 -873201 -844583 -832208
8317 -832208 -835555 -862517 -864384 -820614 -817605 -800256 -797925 -808476 -829536 -858406 -875744 -867195 -850366
8304 -850366 -829022 -820062 -797550 -804247 -805278 -819063 -830108 -817680 -829495 -844672 -867786 -880800
8292 -880800 -866008 -857636 -844483 -819902 -808558 -841786 -863093 -872012 -850374 -824648 -797930 -792788
8280 -792788 -792903 -811658 -816545 -806403 -830160 -837168 -818069 -788703 -779400 -758755 -776244 -782448 -795949
8267 -795949 -812977 -840044 -866803 -866016 -844722 -826327 -809247 -826120 -846114 -830925 -838130 -836542
8255 -836542 -840928 -833593 -838386 -846908 -813430 -815751 -838263 -813661 -816093 -816766 -807495 -814232 -825194 -853847
8241 -853847 -849681 -828329 -820591 -806733 -796707 -786460 -794646 -795565 -804923 -834172 -822677 -819182 -817262
$$ packed form
8330h47090j58r579k2145j0132r490J683K3980K0813n066L66j6383K8618J2375
8317h32208l347k6962j867M3770L009J7349K331j0551k1060k8870j7338Q549J6829
8304h50366K1344Q960K2512o697j031j3785j1045J2428j1815j5177k3114j3014
8292h80800J4792Q372J3153K4581J1344l3228k1307q919K1638K5726K6718N142
8280g92788j15j8755m887J0142k3757p008J9099K9366R303K0645j7489o204j3501
8267g95949j7028k7067k6759P87K1294J8395J7080j6873j9994J5189p205J588
8255h36542m386P335m793q522L3478k321k2512K4602k432o73R271o737j0962k8653
8241h53847M166K1352P738J3858J0026J0247q186r19r358k9249J1495L495J920
$$ plain form
8228 -817262 -818652 -854435 -879214 -823782 -795591 -796964 -808080 -826179 -799994 -784369 -789257 -814530
8216 -814530 -818907 -831255 -815597 -799844 -790542 -795935 -794644 -775824 -782903 -758282 -784909 -796159 -783243
8203 -783243 -762946 -774306 -792666 -814454 -801319 -798494 -789741 -795685 -822011 -845945 -830028 -811098
8191 -811098 -818141 -818563 -799430 -807307 -785579 -772822 -811747 -822153 -807396 -830339 -812890 -791849
8179 -791849 -779359 -801102 -801048 -790608 -782290 -775695 -777824 -782794 -794002 -803760 -776523 -774109 -784009 -785428
8165 -785428 -789259 -798893 -814079 -833813 -840999 -820517 -827850 -835494 -820552 -786044 -793323 -779017 -774613
8152 -774613 -802523 -815633 -800146 -767125 -766487 -771953 -795031 -796015 -768877 -772262 -797084 -809479 -808815
8139 -808815 -799001 -827598 -817601 -817990 -800175 -801612 -813291 -791101 -774885 -774994 -786365 -782045 -793658
$$ packed form
8228h17262j390l5783k4779N5432K8191j373j1116j8099K6185J5625m888k5273
8216h14530m377j2348J5658J5753R302n393J291J8820p079K4621k6627j1250J2916
8203g83243K0297j1360j8360k1788J3135K825Q753n944k6326k3934J5917J8930
8191h11098p043m22J9133p877K1728J2757l8925j0406J4757k2943J7449K1041
8179g91849J2490k1743N4J0440Q318O595k129m970j1208r758K7237K414r900j419
8165g85428l831r634j5186j9734p186K0482p333p644J4942L4508p279J4306M404
8152g74613k7910j3110J5487L3021O38n466k3078r84K7138l385k4822j2395O64
8139h08815R814k8597R997l89J7815j437j1679K2190J6216j09j1371M320j1613
$$ plain form
8126 -793658 -786011 -783730 -797434 -807362 -797287 -803093 -792461 -799780 -815567 -835487 -813256 -802152 -800987
8113 -800987 -791405 -760836 -761740 -768883 -790198 -783203 -768369 -747299 -740263 -757397 -782884 -793286 -770664
8100 -770664 -772501 -794614 -770733 -758544 -743235 -734175 -738489 -750775 -775790 -797618 -792084 -764370
8088 -764370 -743245 -708722 -705329 -715365 -735222 -762555 -764244 -764952 -772908 -778083 -763238 -759615 -751299
8075 -751299 -778472 -803376 -810946 -784645 -766794 -761065 -769453 -795583 -784412 -755287 -773430 -786286
8063 -786286 -801808 -791610 -770228 -751155 -750053 -738933 -749093 -782153 -788206 -758096 -782186 -789055
8051 -789055 -760630 -768593 -776630 -765269 -767035 -770831 -762518 -738150 -746627 -762123 -732906 -703512 -687501
8038 -687501 -699404 -728613 -747650 -755180 -737536 -741874 -742220 -743698 -732363 -714516 -697492 -690070 -689970
$$ packed form
8126g93658P647K281j3704r928J0075n806J0632p319j5787j9920K2231J1104J165
8113h00987R582L0569r04p143k1315O995J4834K1070P036j7134k5487j0402K2622
8100g70664j837k2113K3881J2189J5309R060m314j2286k5015k1828N534K7714
8088g64370K1125L4523L393j0036j9857k7333j689p08p956n175J4845L623Q316
8075g51299k7173k4904p570K6301J7851N729q388k6130J1171K9125j8143j2856
8063g86286j5522J0198K1382J9073J102J1120j0160l3060o053L0110k4090o869
8051g89055K8425p963q037J1361j766l796Q313K4368q477j5496K9217K9394J6011
8038f87501j1903k9209j9037p530J7644m338l46j478J1335J7847J7024P422J00
$$ plain form
8025 -689970 -688989 -693953 -740603 -752318 -729055 -716703 -687321 -678635 -686415 -686844 -709474 -739792 -752336
8012 -752336 -751842 -735254 -734204 -766617 -765248 -718174 -695990 -699783 -713414 -673090 -653541 -676743 -692402
7999 -692402 -674938 -668474 -669979 -675790 -693687 -742262 -766514 -780364 -794381 -804087 -812561 -797944 -801355
7986 -801355 -787186 -741077 -723698 -746960 -772591 -767164 -807674 -853417 -847608 -835316 -821789 -822358
7974 -822358 -783682 -789466 -799619 -772635 -768775 -755399 -745387 -727908 -707242 -716124 -713499 -715610 -712229
7961 -712229 -726393 -744747 -748456 -735045 -743966 -753712 -748108 -729323 -707744 -713165 -731499 -724139 -736025
7948 -736025 -769666 -809304 -781657 -750498 -760437 -781005 -783396 -770438 -774130 -776814 -798974 -825017
7936 -825017 -837708 -823832 -800052 -792067 -790314 -804730 -819041 -801751 -787128 -787344 -818385 -835858
$$ packed form
8025f89970R81m964m6650j1715K3263J2352K9382Q686p780m29k2630l0318j2544
8012g52336M94J6588J050l2413J369M7074K2184l793j3631M0324J9549k3202j5659
7999f92402J7464O464j505n811j7897m8575k4252j3850j4017r706q474J4617l411
7986h01355J4169M6109J7379k3262k5631N427m0510m5743N809J2292J3527n69
7974h22358L8676n784j0153K6984L860J3376J0012J7479K0666q882K625k111L381
7961g12229j4164j8354l709J3411q921r746N604J8785K1579n421j8334P360j1886
7948g36025l3641l9638K7647L1159r939k0568k391J2958l692k684k2160k6043
7936h25017j2691J3876K3780P985J753j4416j4311J7290J4623k16l1041j7473
$$ plain form
7924 -835858 -810935 -775461 -772553 -782645 -783735 -759674 -777769 -819122 -818827 -802846 -810151 -797634 -738095
7911 -738095 -722434 -738855 -749716 -762607 -782448 -777036 -765046 -766251 -771125 -776438 -757794 -744499
7899 -744499 -749575 -745284 -740290 -761258 -759870 -749598 -746451 -771558 -780601 -776248 -788439 -786502 -771573
7886 -771573 -772701 -746905 -752419 -768337 -748283 -751314 -755268 -763690 -766025 -735942 -754292 -752085 -767674
7873 -767674 -776506 -752287 -753289 -758262 -762987 -765479 -775292 -771693 -766201 -777001 -760110 -742711 -735283
7860 -735283 -723246 -724920 -749948 -776186 -765377 -756793 -768428 -766968 -752488 -755183 -756400 -758760 -745275
7847 -745275 -743401 -737967 -706906 -710187 -726769 -713970 -720493 -719242 -712069 -719846 -740496 -738119 -725679
7834 -725679 -707819 -727532 -746898 -757876 -753771 -739884 -753676 -763557 -750532 -740490 -757502 -735750
$$ packed form
7924h35858K4923L5474K908j0092j090K4061j8095m1353K95J5981p305J2517N9539
7911g38095J5661j6421j0861j2891j9841N412J1990j205m874n313J8644J3295
7899g44499n076M291M994k0968J388J0272L147k5107r043M353j2191J937J4929
7886g71573j128K5796n514j5918K0054l031l954q422k335L0083j8350K207j5589
7873g67674q832K4219j002m973m725k492r813L599N492j0800J6891J7399P428
7860g35283J2037j674k5028k6238J0809Q584j1635J460J4480k695j217k360J3485
7847g45275J874N434L1061l281j6582J2799o523J251P173p777k0650K377J2440
7834g25679J7860j9713j9366j0978M105J3887j3792r881J3025J0042j7012K1752
$$ plain form
7822 -735750 -725689 -734733 -718718 -723632 -719910 -736856 -742831 -720422 -736367 -734191 -749134 -761734 -722481
7809 -722481 -708730 -706503 -699204 -710131 -711976 -696721 -725508 -735748 -761332 -729392 -679668 -683468
7797 -683468 -692020 -708025 -744336 -759255 -765818 -758889 -750051 -710656 -711451 -734205 -701764 -669034 -660830
7784 -660830 -678523 -708145 -711708 -694715 -678885 -664930 -666288 -667620 -685380 -706835 -711577 -714401 -754307
7771 -754307 -756568 -730344 -714725 -683906 -681592 -699465 -705332 -670488 -659801 -670373 -687294 -712813
7759 -712813 -713817 -690543 -711352 -717463 -724677 -720888 -703019 -718114 -707070 -670006 -626821 -622179 -646532
7746 -646532 -665019 -673513 -703095 -698550 -709628 -719118 -700056 -682501 -669922 -672886 -670823 -682682 -686918
7733 -686918 -708244 -720786 -718518 -717864 -713088 -726322 -732755 -716237 -722773 -717030 -710566 -729746 -748083
$$ packed form
7822g35750J0061r044J6015m914L722j6946n975K2409j5945K176j4943j2600L9253
7809g22481J3751K227P299j0927j845J5255k8787j0240k5584L1940M9724l800
7797f83468q552j6005l6311j4919o563O929Q838L9395p95k2754L2441L2730Q204
7784f60830j7693k9622l563J6993J5830J3955j358j332j7760k1455m742k824l9906
7771g54307k261K6224J5619L0819K314j7873n867L4844J0687j0572j6921k5519
7759g12813j004K3274k0809o111p214L789J7869j5095J1044L7064M3185M642k4353
7746f46532j8487q494k9582M545j1078r490J9062J7555J2579k964K063j1859m236
7733f86918k1326j2542K268O54M776j3234o433J6518o536N743O464j9180j8337
$$ plain form
7720 -748083 -753827 -701003 -694705 -712469 -717123 -698541 -674933 -695903 -713442 -702577 -702918 -711804 -740789
7707 -740789 -772796 -758065 -747006 -745631 -759790 -772745 -771603 -756449 -760207 -733056 -703122 -695106
7695 -695106 -695007 -713535 -702218 -693730 -709711 -722350 -713844 -730148 -717283 -681833 -670505 -680594 -665897
7682 -665897 -630457 -622475 -647219 -677501 -679096 -675818 -691650 -697432 -685309 -668673 -656151 -667086
7670 -667086 -678770 -703367 -714840 -685212 -695232 -682635 -670845 -684079 -690518 -702027 -712199 -694274
7658 -694274 -674806 -682025 -678229 -646735 -649381 -655010 -641785 -630608 -624227 -627801 -647938 -696033 -699035
7645 -699035 -673003 -678627 -692643 -700008 -676196 -670480 -700194 -721851 -722990 -698598 -704536 -684449 -673330
7632 -673330 -665070 -652192 -676766 -693287 -655658 -638594 -645059 -628364 -627311 -652527 -651927 -644524 -637141
$$ packed form
7720g48083n744N2824O298j7764m654J8582K3608k0970j7539J0865l41q886k8985
7707g40789l2007J4731J1059J375j4159j2955J142J5154l758K7151K9934Q016
7695f95106R9j8528J1317Q488j5981j2639Q506j6304J2865L5450J1328j0089J4697
7682f65897L5440P982k4744l0282j595L278j5832n782J2123J6636J2522j0935
7670f67086j1684k4597j1473K9628j0020J2597J1790j3234o439j1509j0172J7925
7658f94274J9468p219L796L1494k646n629J3225J1177O381l574k0137m8095l002
7645f99035K6032n624j4016p365K3812N716k9714k1657j139K4392n938K0087J1119
7632f73330Q260J2878k4574j6521L7629J7064o465J6695J053k5216O00P403P383
$$ plain form
7619 -637141 -646253 -672439 -679101 -703782 -702835 -713204 -670101 -666625 -672568 -693176 -686791 -681137 -656410
7606 -656410 -647865 -668186 -683458 -687569 -655444 -635090 -650525 -641979 -620096 -646939 -680528 -671722
7594 -671722 -653972 -645134 -653826 -685657 -691001 -687446 -683611 -684992 -675098 -671386 -665311 -633858 -637386 -633791
7580 -633791 -637107 -650170 -665964 -666789 -651743 -656003 -693843 -726721 -717694 -704109 -710139 -723473 -732105
7567 -732105 -708897 -688856 -699300 -717041 -721525 -698268 -692601 -677419 -645767 -642756 -663055 -676416
7555 -676416 -689203 -696432 -691631 -654321 -643592 -641719 -650899 -665912 -648964 -646301 -653014 -666340 -673118
7542 -673118 -656146 -654891 -681552 -706692 -706839 -715909 -723674 -720464 -682287 -677750 -664092 -659195 -663981
7529 -663981 -649369 -653924 -677428 -687445 -700294 -694255 -685553 -673502 -670782 -661515 -659134 -653230 -638127
$$ packed form
7619f37141r112k6186o662k4681R47j0369M3103L476n943k0608O385N654K4727
7606f56410Q545k0321j5272m111L2125K0354j5435Q546K1883k6843l3589Q806
7594f71722J7750Q838q692l1831n344L555L835j381R894L712O075L1453l528L595
7580f33791l316j3063j5794q25J5046m260l7840l2878R027J3585o030j3334q632
7567g32105K3208K0041j0444j7741m484K3257N667J5182L1652L011k0299j3361
7555f76416j2787p229M801L7310J0729J873r180j5013J6948K663o713j3326o778
7542f73118J6972J255k6661k5140j47r070p765L210L8177M537J3658M897m786
7529f63981J4612m555k3504j0017j2849O039Q702J2051K720R267K381N904J5103
$$ plain form
7516 -638127 -648099 -629686 -618382 -636751 -643492 -651405 -628792 -632675 -657036 -656366 -666270 -667715 -669460
7503 -669460 -656852 -684246 -707516 -721571 -702487 -731409 -733807 -714087 -709845 -700110 -686418 -667467
7491 -667467 -677872 -696709 -711962 -737436 -716810 -677532 -680789 -653952 -626116 -649282 -686446 -677212
7479 -677212 -636932 -619157 -636487 -649258 -625666 -622456 -638534 -680255 -665751 -615310 -608076 -613033
7467 -613033 -622531 -631772 -646625 -675358 -661342 -672591 -676708 -665950 -673774 -658388 -659564 -700849 -700850
7454 -700850 -700340 -693242 -708634 -719415 -697540 -669294 -655284 -634749 -637376 -639776 -632860 -641944 -668154
7441 -668154 -673946 -683117 -649002 -639768 -644378 -662326 -686073 -681032 -649828 -659554 -676823 -673053 -626791
7428 -626791 -600780 -618100 -618722 -624011 -635748 -636639 -619904 -635094 -621744 -635199 -630819 -621264 -630931
$$ packed form
7516f38127r972J8413J1304j8369o741p913K2613l883k4361O70r904j445j745
7503f69460J2608k7394k3270j4055J9084k8922k398J9720M242R735J3692J8951
7491f67467j0405j8837j5253k5474K0626L9278l257K6837K7836k3166l7164R234
7479f77212M0280J7775j7330j2771K3592L210j6078m1721J4504N0441P234m957
7467f13033r498r241j4853k8733J4016j1249m117J0758p824J5386j176m1285j
7454g00850N10P098j5392j0781K1875K8246J4010K0535k627k400O916r084k6210
7441f68154n792r171L4115R234m610j7948k3747N041L1204r726j7269L770M6262
7428f26791K6011j7320o22n289j1737q91J6735j5190J3350j3455M380R555r667
$$ plain form
7415 -630931 -634790 -623999 -624311 -642955 -657533 -643165 -636581 -641074 -614332 -607752 -638539 -649739 -625779
7402 -625779 -635615 -653311 -650574 -641818 -648742 -635463 -599619 -588842 -592316 -603308 -561942 -548752 -574228
7389 -574228 -597335 -604519 -596824 -591659 -614862 -615350 -638914 -668716 -637794 -609603 -609004 -604116 -636489
7376 -636489 -653892 -658349 -652904 -601266 -574283 -581015 -612907 -625440 -666549 -698563 -711630 -696534
7364 -696534 -685437 -686296 -684046 -651481 -612077 -595562 -613583 -619802 -620463 -649386 -650447 -655864 -673413
7351 -673413 -677646 -646416 -630604 -615561 -631038 -643572 -653732 -671350 -674685 -647230 -653113 -667472
7339 -667472 -670680 -674978 -654604 -658321 -641297 -620320 -628755 -630504 -616735 -602945 -629550 -630856 -657494
7326 -657494 -644550 -639793 -653000 -643807 -638172 -642368 -648368 -637299 -627461 -631984 -663142 -685650 -687005
$$ packed form
7415f30931l859J0791l12j8644j4578J4368O584m493K6742O580l0787j1200K3960
7402f25779r836j7696K737Q756o924J3279L5844J0777l474j0992M1366J3190k5476
7389e74228k3107p184P695N165k3203m88k3564k9802L0922K8191N99M888l2373
7376f36489j7403m457N445N1638K6983o732l1892j2533m1109l2014j3067J5096
7364f96534J1097q59K250L2565L9404J6515j8021o219o61k8923j061n417j7549
7351f73413m233L1230J5812J5043j5477j2534j0160j7618l335K7455n883j4359
7339f67472l208m298K0374l717J7024K0977q435j749J3769J3790k6605j306k6638
7326f57494J2944M757j3207R193N635m196o000J1069R838m523l1158k2508j355
$$ plain form
7313 -687005 -690794 -691544 -678529 -655456 -674247 -700485 -680985 -658700 -627431 -663384 -646484 -643878
7301 -643878 -620661 -609516 -591882 -607632 -619033 -624931 -610380 -636509 -644065 -647434 -645253 -633404
7289 -633404 -617815 -604469 -575338 -563473 -595865 -624518 -619307 -621120 -637871 -679026 -680306 -668481
7277 -668481 -609529 -603688 -599385 -596762 -572429 -584442 -564778 -557906 -571985 -584038 -610123 -628226
7265 -628226 -595397 -591045 -596229 -607159 -616206 -612396 -614606 -603082 -588013 -599846 -594995 -602540 -617319
7252 -617319 -649521 -647628 -621240 -605749 -587652 -603459 -611257 -604521 -600483 -589157 -596131 -597870 -613804
7239 -613804 -625435 -615740 -612201 -603199 -626455 -621906 -627823 -629849 -609976 -600200 -578157 -582534 -584277
7226 -584277 -588527 -578811 -566303 -580281 -593029 -609601 -595510 -580969 -630010 -641299 -640651 -644879 -651851
$$ packed form
7313f87005l789p50J3015K3073j8791k6238J9500K2285L1269l5953J6900K606
7301f43878K3217J1145J7634j5750j1401n898J4551k6129p556l369K181J1849
7289f33404J5589J3346K9131J1865l2392k8653N211j813j6751m1155j280J1825
7277f68481N8952N841M303K623K4333j2013J9664O872j4079j2053k6085j8103
7265f28226L2829M352n184j0930r047L810k210J1524J5069j1833M851p545j4779
7252f17319l2202J893K6388J5491J8097j5807p798O736M038J1326o974j739j5934
7239f13804j1631R695L539R002k3256M549n917k026J9873R776K2043m377j743
7226e84277m250R716J2508j3978j2748j6572J4091J4541m9041j1289O48m228o972
$$ plain form
7213 -651851 -647121 -627595 -620723 -609723 -619973 -607769 -618231 -632350 -625791 -622491 -640884 -651224
7201 -651224 -647006 -641095 -604663 -580023 -559591 -563847 -579526 -565300 -599272 -596545 -588227 -588554 -592316
7188 -592316 -570796 -596507 -634809 -647957 -625828 -646945 -657811 -644218 -636200 -626013 -639577 -633046
7176 -633046 -628886 -616553 -659906 -667534 -648987 -634670 -632937 -593018 -569030 -581031 -585407 -577595 -626482
7163 -626482 -653238 -610632 -608423 -636603 -654017 -643398 -620855 -634298 -633648 -613972 -631802 -631190 -637078
7150 -637078 -639065 -607705 -595193 -592163 -598494 -588993 -609004 -629804 -592191 -598029 -587842 -586299 -582972
7137 -582972 -588654 -563477 -546343 -563542 -579009 -573296 -586437 -611169 -609672 -609267 -592579 -571950 -572581
7124 -572581 -585252 -589066 -568932 -581733 -575007 -577294 -582709 -558289 -583066 -602124 -582612 -564041
$$ packed form
7213f51851M730J9526O872J1000j0250J2204j0462j4119O559L300j8393j0340
7201f51224M218N911L6432K4640K0432m256j5679J4226l3972K727Q318l27l762
7188e92316K1520k5711l8302j3148K2129k1117j0866J3593Q018J0187j3564O531
7176f33046M160J2333m3353p628J8547J4317J733L9919K3988j2001m376P812m8887
7163f26482k6756M2606K209k8180j7414J0619K2543j3443O50J9676j7830O12n888
7150f37078j987L1360J2512L030o331R501k0011k0800L7613n838J0187J543L327
7137e82972n682K5177J7134j7199j5467N713j3141k4732J497M05J6688K0629o31
7124e72581j2671l814K0134j2801O726k287n415K4420k4777j9058J9512J8571
$$ plain form
7112 -564041 -583751 -573877 -578747 -593192 -613934 -638712 -626089 -626652 -646711 -645241 -640366 -624786 -614229
7099 -614229 -610599 -594020 -568110 -582437 -605527 -602305 -611535 -596554 -601424 -576485 -583143 -600751 -608598
7086 -608598 -595138 -573606 -568302 -579668 -587336 -570102 -558773 -532587 -529803 -559273 -561121 -554488 -554743
7073 -554743 -541027 -537803 -554918 -601886 -603653 -605106 -576157 -582460 -590627 -584689 -592140 -589435 -582673
7060 -582673 -577747 -575565 -583060 -582367 -573693 -551927 -563576 -604450 -617593 -632600 -607360 -599183 -638184
7047 -638184 -620962 -604504 -595390 -594087 -570604 -548546 -562679 -559725 -538483 -512364 -503032 -503259 -510671
7034 -510671 -556611 -570685 -563515 -583853 -638308 -641994 -618258 -598580 -580217 -586077 -593672 -572898
7022 -572898 -544989 -567298 -614498 -608850 -604265 -610078 -602423 -587964 -571956 -581096 -587900 -585067 -625531
$$ packed form
7112e64041j9710R874m870j4445k0742k4778J2623n63k0059J470M875J5580J0557
7099f14229L630J6579K5910j4327k3090L222r230J4981m870K4939o658j7608p847
7086f08598J3460K1532N304j1366p668J7234J1329K6186K784k9470j848O633k55
7073e54743J3716L224j7115m6968j767j453K8949o303q167N938p451K705O762
7060e82673M926K182p495O93Q674K1766j1649m0874j3143j5007K5240Q177l9001
7047f38184J7222J6458R114J303K3483K2058j4133K954K1242K6119R332k27p412
7034e10671m5940j4074P170k0338n4455l686K3736J9678J8363n860p595K0774
7022e72898K7909k2309m7200N648M585n813P655J4459J6008r140o804K833m0464
$$ plain form
7009 -625531 -622079 -590277 -562880 -545111 -553816 -549994 -540068 -541396 -553751 -591694 -609763 -638379 -634293
6996 -634293 -613002 -575077 -574345 -592814 -592434 -581975 -568746 -576331 -576269 -575367 -601950 -605667 -582219 -588552
6982 -588552 -613670 -606995 -597459 -598082 -582946 -611412 -630383 -633803 -616791 -617558 -610471 -584754 -553686
6969 -553686 -541166 -571088 -615813 -589329 -564274 -570555 -599731 -588494 -573407 -564350 -589471 -590901
6957 -590901 -601368 -643081 -636951 -607893 -597450 -596554 -595769 -597330 -606855 -585263 -592545 -585682 -563932
6944 -563932 -547937 -549951 -574713 -589615 -602079 -595064 -572330 -564237 -570676 -566675 -543358 -557359 -558912
6931 -558912 -565423 -583831 -594928 -567056 -570506 -593107 -596985 -595672 -552655 -581484 -598792 -576425
6919 -576425 -564535 -551977 -527178 -524700 -550820 -579025 -555266 -555260 -581833 -557273 -536081 -539359 -540648
$$ packed form
7009f25531L452L1802K7397J7769q705L822R926j328j2355l7943j8069k8616M086
6996f34293K1291L7925P32j8469L80J0459J3229p585O2R02k6583l717K3448o333
6982e88552k5118O675R536o23J5136k8466j8971l420J7012p67P087K5717L1068
6969e53686J2520k9922m4725K6484K5055o281k9176J1237J5087R057k5121j430
6957e90901j0467m1713O130K9058J0443Q96P85j561r525K1592p282O863K1750
6944e63932J5995k014k4762j4902j2464P015K2734Q093o439M001K3317j4001j553
6931e58912o511j8408j1097K7872l450k2601l878J313M3017k8829j7308K2367
6919e76425J1890J2558K4799K478k6120k8205K3759Ok6573K4560K1192l278j289
$$ plain form
6906 -540648 -538346 -549234 -550460 -576676 -618185 -613037 -625475 -618113 -590059 -567395 -524961 -522725 -540991
6893 -540991 -548143 -530889 -536384 -527059 -539148 -555660 -543633 -547191 -525648 -521659 -562471 -569082 -555804
6880 -555804 -542334 -570294 -559602 -537314 -537957 -545126 -555228 -531439 -532225 -541719 -531685 -552721 -548824
6867 -548824 -564881 -570694 -525986 -508169 -512068 -546519 -586133 -580652 -569152 -583347 -594455 -575250
6855 -575250 -561635 -556771 -561254 -564328 -562280 -525347 -517926 -554106 -552176 -553144 -540961 -528143 -519155
6842 -519155 -524533 -514400 -504464 -514537 -509336 -506829 -552696 -547806 -544084 -556461 -538801 -520863 -536815
6829 -536815 -562189 -578108 -559172 -533249 -519008 -501445 -514890 -537102 -555111 -545764 -536753 -560011
6817 -560011 -580208 -575439 -547653 -518582 -494453 -483538 -523543 -552053 -568925 -604671 -564739 -552046
$$ packed form
6906e40648K302j0888j226k6216m1509N148j2438P362K8054K2664M2434K236j8266
6893e40991p152J7254n495R325j2089j6512J2027l558K1543L989m0812o611J3278
6880e55804J3470k7960J0692K2288o43p169j0102K3789p86r494J0034k1036L897
6867e48824j6057n813M4708J7817l899l4451l9614N481J1500j4195j1108J9205
6855e75250J3615M864m483l074K048L6933P421l6180J930r68J2183J2818Q988
6842e19155n378J0133R936j0073N201K507m5867M890L722j2377J7660J7938j5952
6829e36815k5374j5919J8936K5923J4241J7563j3445k2212j8009R347R011k3258
6817e60011k0197M769K7786K9071K4129J0915m0005k8510j6872l5746L9932J2693
$$ plain form
6805 -552046 -560288 -559050 -551109 -519104 -537780 -575924 -584532 -560888 -546737 -527933 -521731 -527517 -559975
6792 -559975 -570261 -552973 -519484 -534941 -537152 -545235 -560797 -543517 -538621 -526754 -512419 -526314
6780 -526314 -541887 -527008 -520605 -529601 -519240 -535592 -548462 -537964 -528413 -523692 -522254 -534163 -527777
6767 -527777 -519099 -506124 -499325 -499496 -516715 -527926 -522220 -514765 -526162 -512092 -496067 -516700 -506802
6754 -506802 -503720 -505276 -496766 -502286 -512360 -523237 -508478 -509202 -522441 -528398 -490568 -464053 -462397
6741 -462397 -440453 -450703 -431828 -427878 -439690 -489105 -471555 -474017 -455884 -454684 -454671 -422943 -434363
6728 -434363 -459101 -462254 -444356 -403859 -401968 -404342 -379599 -348926 -319094 -294266 -274373 -237262
6716 -237262 -161791 -122183 -136278 -278410 -509399 -752121 -908162 -969277 -954728 -883977 -831529
$$ packed form
6805e52046q242J238P941L2005j8676l8144q608K3644J4151J8804O202n786l2458
6792e59975j0286J7288L3489j5457k211q083j5562J7280M896J1867J4335j3895
6780e26314j5573J4879O403q996J0361j6352j2870J0498R551M721J438j1909O386
6767e27777Q678J2975O799j71j7219j1211N706P455j1397J4070J6025k0633R898
6754e06802L082j556Q510n520j0074j0877J4759p24j3239n957L7830K6515J656
6741d62397K1944j0250J8875L950j1812m9415J7550k462J8133J200J3L1728j1420
6728d34363k4738l153J7898M0497J891k374K4743L0673K9832K4828J9893L7111
6716b37262P5471L9608j4095j42132k30989k42722j56041o1115J4549P0751N2448
$$ plain form
6705 -831529 -811862 -788709 -766075 -717611 -680335 -666758 -646047 -627827 -625478 -633766 -664029 -656053
6693 -656053 -647237 -648519 -621182 -587487 -599766 -614290 -618898 -662442 -699177 -676444 -657440 -670236
6681 -670236 -674605 -651113 -626711 -644091 -647110 -631417 -623728 -619309 -598414 -608264 -636060 -641945 -635444
6668 -635444 -624469 -621492 -619667 -630441 -637372 -652817 -643173 -633372 -597035 -588611 -578018 -574073 -569608
6655 -569608 -562066 -564559 -581143 -577279 -566081 -567484 -546169 -557484 -584017 -574907 -551728 -549891 -565480
6642 -565480 -572213 -581726 -568940 -549259 -543894 -560352 -547372 -547179 -543927 -560560 -557141 -550520 -543530
6629 -543530 -538107 -544718 -529736 -495128 -516652 -530802 -538928 -580749 -610818 -588839 -565838 -553328
6617 -553328 -525312 -526563 -559063 -560336 -566763 -566369 -557563 -556333 -551952 -551460 -564532 -594226 -625586 -610721
$$ packed form
6705h31529J9667K3153K2634M8464L7276J3577K0711J8220K349q288l0263P976
6693f56053Q816j282K7337L3695j2279j4524m608m3544l6735K2733J9004j2796
6681f70236m369K3492K4402j7380l019J5693P689M419K0895r850k7796n885O501
6668f35444J0975K977J825j0774o931j5445R644R801L6337Q424J0593L945M465
6655e69608P542k493j6584L864J1198j403K1315j1315k6533R110K3179J837j5589
6642e65480o733r513J2786J9681N365j6458J2980J93L252j6633L419O621O990
6629e43530N423o611J4982L4608k1524j4150q126m1821l0069K1979K3001J2510
6617e53328K8016j251l2500j273o427L94Q806J230M381M92j3072k9694l1360J4865
$$ plain form
6603 -610721 -602039 -606246 -598166 -617702 -612747 -585926 -586538 -585741 -556243 -533406 -528650 -525594 -523549 -521059
6589 -521059 -526996 -541572 -558748 -544111 -532606 -532656 -562362 -601419 -593200 -592342 -586597 -573865 -562724
6576 -562724 -548982 -544603 -560522 -534790 -510031 -543283 -552865 -536397 -554015 -565909 -562821 -539547
6564 -539547 -541515 -558373 -546925 -541380 -567745 -576981 -550557 -516832 -497858 -498096 -523273 -531872 -511148
6551 -511148 -499803 -508900 -498114 -505411 -515333 -507476 -484986 -474535 -498607 -528984 -557398 -597171
6539 -597171 -587198 -552125 -531144 -525061 -525021 -518723 -512062 -529143 -564756 -581823 -566436 -553686 -557473
6526 -557473 -564795 -567565 -555661 -524895 -504262 -507183 -519068 -537133 -544079 -518930 -520934 -544250 -534994
6513 -534994 -518527 -527262 -547676 -534361 -502648 -531082 -525895 -530679 -546270 -548015 -561482 -613889
$$ packed form
6603f10721Q682m207Q080j9536M955K6821o12P97K9498K2837M756L056K045K490
6589e21059n937j4576j7176J4637J1505n0k9706l9057Q219Q58N745J2732J1141
6576e62724J3742M379j5919K5732K4759l3252r582J6468j7618j1894L088K3274
6564e39547j968j6858J1448N545k6365r236K6424L3725J8974k38k5177q599K0724
6551e11148J1345r097J0786p297r922P857K2490J0451k4072l0377k8414l9773
6539e97171R973L5073K0981O083M0O298O661j7081l5613j7067J5387J2750l787
6526e57473p322k770J1904L0766K0633k921j1885j8065o946K5149k004k3316R256
6513e34994J6467q735k0414J3315L1713k8434N187m784j5591j745j3467n2407
$$ plain form
6501 -613889 -596068 -551642 -538344 -529474 -525467 -497707 -516427 -516973 -494910 -489409 -499082 -506001 -530878
6488 -530878 -578450 -576650 -555990 -542197 -523670 -529583 -542968 -553317 -558236 -545060 -565594 -599157
6476 -599157 -588544 -549470 -547248 -536172 -554997 -544281 -550656 -543460 -530539 -541745 -556447 -542749
6464 -542749 -531460 -516406 -496721 -497096 -506668 -530069 -542078 -545661 -552751 -556297 -537230 -536856 -537885
6451 -537885 -521587 -536717 -535609 -544644 -548029 -546438 -545290 -532489 -512627 -515463 -559890 -573442 -572447
6438 -572447 -590077 -579133 -571863 -573582 -566844 -549066 -541282 -545475 -548745 -532505 -527995 -541580 -533772
6425 -533772 -538713 -535745 -540113 -531332 -569017 -594274 -569235 -558472 -547151 -528014 -526063 -531241 -550026
6412 -550026 -554908 -547355 -532633 -510300 -513962 -527553 -503353 -503580 -485238 -454591 -469249 -462900 -488846
$$ packed form
6501f13889J7821M4426J3298Q870M007K7760j8720n46K2063N501r673o919k4877
6488e30878m7572J800K0660J3793J8527n913j3385j0349m919J3176k0534l3563
6476e99157J0613L9074K222J1076j8825J0716o375P196J2921j1206j4702J3698
6464e42749J1289J5054J9685l75r572k3401j2009l583p090l546J9067L74j029
6451e37885J6298j5130J108r035l385J591J148J2801J9862k836m4427j3552R95
6438e72447j7630J0944P270j719O738J7778P784m193l270J6240M510j3585P808
6425e33772m941K968m368Q781l7685k5257K5039J0763J1321J9137J951n178j8785
6412e50026m882P553J4722K2333l662j3591K4200k27J8342L0647j4658O349k5946
$$ plain form
6399 -488846 -504177 -495168 -527676 -559018 -525597 -486106 -489417 -529346 -569866 -567767 -552278 -498574
6387 -498574 -481875 -475688 -523211 -546719 -527726 -518755 -539711 -555058 -547650 -549483 -562850 -547288
6375 -547288 -558388 -569933 -557116 -534682 -524689 -497166 -492014 -509252 -523581 -501868 -490643 -499332
6363 -499332 -527874 -511466 -509708 -495507 -485418 -463519 -481388 -458347 -486808 -493992 -496499 -494324
6351 -494324 -482846 -490800 -532248 -557063 -542612 -524687 -525957 -526497 -508744 -494855 -470308 -473663 -501699
6338 -501699 -504150 -512826 -516925 -485540 -470354 -498197 -512823 -515016 -514804 -510685 -523879 -522130 -507594
6325 -507594 -469101 -455004 -488653 -520240 -512648 -502582 -485010 -444850 -448617 -480420 -505029 -508355
6313 -508355 -513975 -521019 -523412 -514950 -492473 -482252 -478775 -459841 -481809 -531582 -559130 -552051 -519791
$$ packed form
6399d88846j5331R009l2508l1342L3421L9491l311l9929m0520K099J5489N3704
6387d98574J6699O187m7523k3508J8993Q971k0956j5347P408j833j3367J5562
6375e47288j1100j1545J2817K2434R993K7523N152j7238j4329K1713J1225q689
6363d99332k8542J6408J758J4201J0089K1899j7869K3041k8461p184k507K175
6351d94324J1478p954m1448k4815J4451J7925j270n40J7753J3889K4547l355k8036
6338e01699k451q676m099L1385J5186k7843j4626k193K12M119j3194J749J4536
6325e07594L8493J4097l3649l1587P592J0066J7572M0160l767l1803k4609l326
6313e08355n620p044k393Q462K2477J0221L477J8934k1968m9773k7548P079L2260
$$ plain form
6300 -519791 -509941 -494344 -492441 -487015 -478474 -480786 -490776 -514396 -523569 -535077 -535125 -513723 -484025 -509042
6286 -509042 -523980 -552169 -561293 -569441 -548780 -514828 -496006 -486548 -475804 -496699 -499659 -475450
6274 -475450 -489695 -500303 -499805 -548098 -574195 -567755 -534448 -524651 -532056 -527324 -514513 -532424 -545874
6261 -545874 -549702 -561947 -546982 -538996 -537089 -537890 -511752 -505429 -530729 -551778 -560475 -524998 -503823
6248 -503823 -507617 -487708 -510296 -547092 -530224 -493836 -484482 -514484 -528368 -542906 -532139 -518100
6236 -518100 -478052 -473426 -502486 -521903 -510542 -487945 -473406 -527763 -572231 -596336 -561894 -536289
6224 -536289 -513563 -484261 -481471 -487562 -476109 -482594 -488579 -523688 -517170 -503433 -510224 -526054 -553226
6211 -553226 -539880 -531297 -517088 -513565 -534368 -518691 -518299 -522112 -525136 -531612 -525834 -496432 -525236
$$ packed form
6300e19791R850J5597J903N426Q541k312r990k3620r173j1508m8K1402K9698k5017
6286e09042j4938k8189r124q148K0661L3952J8822R458J0744k0895k960K4209
6274d75450j4245j0608M98m8293k6097O440L3307R797p405M732J2811j7911j3450
6261e45874l828j2245J4965P986J907q01K6138O323k5300k1049q697L5477K1175
6248e03823l794J9909k2588l6796J6868L6388R354l0002j3884j4538J0767J4039
6236e18100M0048M626k9060j9417J1361K2597J4539n4357m4468k4105L4442K5605
6224e36289K2726K9302K790o091J1453o485n985l5109O518J3737o791j5830k7172
6211e53226J3346Q583J4209L523k0803J5677L92l813l024o476N778K9402k8804
$$ plain form
6198 -525236 -535981 -513342 -510282 -505924 -490826 -472621 -488760 -505378 -480777 -480214 -506044 -530135
6186 -530135 -540128 -520304 -508752 -501924 -515721 -504807 -492391 -505128 -525474 -523291 -489533 -479980
6174 -479980 -458942 -430689 -451261 -480007 -486545 -512358 -505820 -506917 -520405 -515985 -497273 -508441
6162 -508441 -506958 -482081 -470406 -487372 -492710 -512480 -518709 -531486 -548929 -529222 -537266 -527067
6150 -527067 -511811 -513146 -544617 -546803 -528440 -508610 -503310 -484909 -494206 -471158 -473337 -494917 -506866
6137 -506866 -533316 -529101 -548464 -535807 -497317 -482681 -492961 -506622 -514072 -504065 -509275 -504684
6125 -504684 -502576 -499505 -518817 -525716 -518071 -530609 -542640 -542388 -551662 -539103 -512716 -516164 -477831
6112 -477831 -440751 -463997 -493242 -509086 -499425 -479318 -473009 -494452 -527972 -517076 -501662 -506161
$$ packed form
6198e25236j0745K2639L060M358J5098J8205j6139j6618K4601N63k5830k4091
6186e30135r993J9824J1552O828j3797J0914J2416j2737k0346K183L3758R553
6174d79980K1038K8253k0572k8746o538k5813O538j097j3488M420J8712j1168
6162e08441J483K4877J1675j6966n338j9770o229j2777j7443J9707q044J0199
6150e27067J5256j335l1471k186J8363J9830N300J8401r297K3048k179k1580j1949
6137e06866k6450M215j9363J2657L8490J4636j0280j3661p450J0007n210M591
6125e04684K108L071j9312o899P645j2538j2031K52r274J2559K6387l448L8333
6112d77831L7080k3246k9245j5844R661K0107O309k1443l3520J0896J5414m499
$$ plain form
6100 -506161 -475947 -458378 -459871 -468179 -469206 -482707 -493152 -491014 -456980 -457018 -453796 -466222 -462691
6087 -462691 -451684 -448496 -466090 -476495 -473025 -484575 -490466 -474697 -496087 -504168 -527722 -523671 -510780
6074 -510780 -503572 -549790 -543646 -517504 -510485 -533465 -544538 -528323 -501541 -484715 -501732 -514304
6062 -514304 -462669 -454866 -461839 -479098 -488656 -509285 -514134 -495355 -507560 -482503 -462484 -473159
6050 -473159 -487424 -512684 -503969 -527650 -549412 -523913 -513471 -505805 -509378 -508097 -474527 -448421
6038 -448421 -454045 -476360 -481055 -470680 -484925 -478814 -455064 -453092 -437194 -410695 -417032 -415340 -443239
6025 -443239 -462114 -437941 -418287 -457068 -476142 -457800 -471657 -468280 -444858 -413278 -414540 -447421
6013 -447421 -453537 -436986 -469914 -490831 -502746 -465004 -435966 -439135 -458652 -476922 -463053 -465730
$$ packed form
6100e06161L0214J7569j493q308j027j3501j0445K138L4034l8L222j2426L531
6087d62691J1007L188j7594j0405L470j1550n891J5769k1390q081k3554M051J2891
6074e10780P208m6218O144K6142P019k2980j1073J6215K6782J6826j7017j2572
6062e14304N1635P803o973j7259r558k0629m849J8779j2205K5057K0019j0675
6050d73159j4265k5260Q715k3681k1762K5499J0442P666l573J281L3570K6106
6038d48421n624k2315m695J0375j4245O111K3750J972J5898K6499o337J692k7899
6025d43239j8875K4173J9654l8781j9074J8342j3857L377K3422L1580j262l2881
6013d47421o116J6551l2928k0917j1915L7742K9038l169j9517j8270J3869k677
$$ plain form
6001 -465730 -511292 -483823 -446008 -476169 -520117 -514428 -502388 -467058 -475054 -506205 -508421 -511885
5989 -511885 -539265 -536543 -505109 -455534 -439049 -445836 -472726 -464409 -448469 -415212 -427806 -438173
5977 -438173 -439300 -437758 -446590 -445797 -466992 -489401 -510273 -531956 -536700 -527324 -544946 -541019 -534607
5964 -534607 -541396 -516973 -475813 -483530 -496850 -541043 -544682 -515278 -484851 -505174 -500360 -464419
5952 -464419 -435098 -420515 -399071 -416551 -453150 -485802 -498826 -496092 -489686 -490178 -482261 -469416 -489076
5939 -489076 -503847 -525190 -534210 -536155 -530603 -528406 -505068 -490099 -499406 -471447 -461648 -440503 -461193
5926 -461193 -466406 -489314 -495592 -514306 -531924 -513421 -528895 -552923 -572417 -578872 -552358 -542038
5914 -542038 -529260 -536546 -513703 -479966 -495497 -507610 -482210 -446802 -446756 -455103 -468109 -490794 -507077
$$ packed form
6001d65730m5562K7469L7815l0161m3948N689J2040L5330p996l1151k216l464
5989e11885k7380K722L1434M9575J6485o787k6890Q317J5940L3257j2594j0367
5977d38173j127J542q832P93k1195k2409k0872k1683m744R376j7622L927O412
5964e34607o789K4423M1160p717j3320m4193l639K9404L0427k0323M814L5941
5952d64419K9321J4583K1444j7480l6599l2652j3024K734O406m92P917J2845j9660
5939d89076j4771k1343r020j945N552K197K3338J4969r307K7959R799K1145k0690
5926d61193n213k2908o278j8714j7618J8503j5474k4028j9494o455K6514J0320
5914e42038J2778p286K2843L3737j5531j2113K5400L5408M6q347j3006k2685j6283
$$ plain form
5901 -507077 -497534 -510111 -500878 -472430 -440271 -439362 -463381 -505709 -515851 -504988 -505837 -492425 -477674
5888 -477674 -476950 -491099 -474507 -463273 -475966 -469180 -493288 -499994 -506915 -494312 -524857 -552139 -540546
5875 -540546 -515459 -520349 -507580 -485009 -484879 -473673 -501396 -513000 -508270 -499626 -491678 -516232 -491844
5862 -491844 -452607 -476601 -482721 -450493 -445265 -460113 -444576 -474535 -496929 -491639 -501468 -484480
5850 -484480 -473034 -462601 -482464 -489770 -453200 -423652 -432463 -429705 -439216 -447742 -441285 -444013 -452553
5837 -452553 -454756 -442938 -443835 -472147 -489901 -508303 -504001 -498664 -505343 -502206 -478808 -447630 -455809
5824 -455809 -440244 -431222 -423329 -427851 -444950 -443797 -459888 -470993 -432855 -414041 -425069 -444334
5812 -444334 -469136 -474804 -503667 -484427 -439183 -457317 -487521 -496474 -472259 -468290 -470290 -466873 -462936
$$ packed form
5901e07077R543j2577R233K8448L2159R09k4019m2328j0142J0863q49J3412J4751
5888d77674P24j4149J6592J1234j2693O786k4108o706o921J2603l0545k7282J1593
5875e40546K5087m890J2769K2571J30J1206k7723j1604M730Q644P948k4554K4388
5862d91844L9237k3994o120L2228N228j4848J5537k9959k2394N290r829J6988
5850d84480J1446J0433j9863p306L6570K9548q811K758r511q526O457k728q540
5837d52553k203J1818q97k8312j7754j8402M302N337o679L137K3398L1178q179
5824d55809J5565R022P893m522j7099J153j6091j1105L8138J8814j1028j9265
5812d44334k4802n668k8863J9240M5244j8134l0204q953K4215L969k000L417L937
$$ plain form
5799 -462936 -448360 -456861 -474005 -499166 -495089 -468216 -459237 -481446 -499349 -483396 -449164 -437101
5787 -437101 -434259 -455657 -453173 -427762 -427644 -466335 -481043 -481858 -476187 -491512 -494447 -511506 -550254
5774 -550254 -519296 -516973 -549399 -516915 -516810 -518501 -514720 -530593 -521587 -487345 -445636 -429301 -435745
5761 -435745 -461543 -470526 -480238 -494021 -502405 -478258 -431509 -439874 -429268 -459808 -458309 -452736 -464108
5748 -464108 -427547 -403532 -410095 -437077 -424759 -415996 -442093 -464444 -473994 -474678 -489888 -479340 -473134
5735 -473134 -468079 -462729 -476304 -476624 -448440 -440772 -451886 -447254 -423911 -449498 -465894 -491768 -505774
5722 -505774 -495451 -478992 -486964 -477413 -470748 -445644 -418536 -432764 -433997 -435318 -422917 -415661 -419350
5709 -419350 -448856 -465008 -471002 -462647 -445921 -445975 -449723 -436464 -409942 -396500 -410167 -437591 -444688
$$ packed form
5799d62936J4576q501j7144k5161M077K6873Q979k2209j7903J5953L4232J2063
5787d37101K842k1398K484K5411J18l8691j4708q15N671j5325k935j7059l8748
5774e50254L0958K323l2426L2484J05j691L781j5873R006L4242M1709J6335o444
5761d35745k5798q983r712j3783q384K4147M6749q365J0606l0540J499N573j1372
5748d64108L6561K4015o563k6982J2318Q763k6097k2351r550o84j5210J0548O206
5735d73134N055N350j3575l20K8184P668j1114M632K3343k5587j6396k5874j4006
5722e05774J0323J6459p972R551O665K5104K7108j4228j233j321J2401P256l689
5709d19350k9506j6152n994Q355J6726n4l748J3259K6522J3442j3667k7424p097
$$ plain form
5696 -444688 -439235 -452347 -471989 -489854 -468286 -457783 -458761 -467432 -466348 -457388 -463750 -466369 -455563
5683 -455563 -452260 -423873 -425095 -454040 -451412 -452765 -467398 -459581 -468163 -443774 -444355 -475496 -454859
5670 -454859 -441051 -431854 -444714 -432274 -421331 -409304 -448177 -487362 -491173 -479258 -477225 -475823
5658 -475823 -450960 -434449 -448459 -452904 -447486 -465387 -467232 -462972 -448535 -449443 -475893 -479834 -479539
5645 -479539 -474155 -445598 -431576 -423946 -445782 -456142 -436318 -416519 -430318 -443562 -455483 -464265
5633 -464265 -476660 -477263 -458707 -457596 -454224 -463190 -484997 -471762 -450449 -473687 -484276 -485253 -477506
5620 -477506 -468967 -466481 -468771 -448523 -438205 -437796 -426647 -450210 -439451 -420190 -399750 -418828 -427918
5607 -427918 -440547 -481437 -492775 -501627 -500430 -479171 -451270 -438796 -457082 -463714 -429829 -413864
$$ packed form
5696d44688N453j3112j9642j7865K1568J0503r78q671J084Q960o362k619J0806
5683d55563L303K8387j222k8945K628j353j4633P817q582K4389n81l1141K0637
5670d54859J3808R197j2860J2440J0943J2027l8873l9185l811J1915K033J402
5658d75823K4863J6511j4010m445N418j7901j845M260J4437r08k6450l941K95
5645d79539N384K8557J4022P630k1836j0360J9824J9799j3799j3244j1921q782
5633d64265j2395o03J8556J111L372q966k1807J3235K1313k3238j0589r77P747
5620d77506Q539K486k290K0248J0318M09J1149k3563J0759J9261K0440j9078r090
5607d27918j2629m0890j1338q852J197K1259K7901J2474j8286o632L3885J5965
$$ plain form
5595 -413864 -407474 -439125 -445050 -439869 -442356 -445804 -456515 -454007 -418487 -415720 -443201 -446039 -444857
5582 -444857 -460697 -454514 -447452 -448965 -440543 -478580 -471349 -471182 -472657 -472256 -460085 -436830 -439970 -459070
5568 -459070 -469855 -485994 -485246 -474312 -437326 -451329 -465248 -486155 -487288 -488658 -463047 -461814 -461164
5555 -461164 -430465 -431005 -444041 -462487 -471588 -428944 -438842 -450085 -441234 -414454 -413245 -451722 -489471
5542 -489471 -513097 -512735 -478680 -473724 -472698 -452792 -449952 -471273 -508126 -531397 -501921 -481951 -482768
5529 -482768 -501635 -479906 -477250 -456779 -450488 -483450 -495818 -488782 -469156 -461146 -448290 -452437 -445120
5516 -445120 -469586 -458373 -455624 -471516 -487308 -495770 -503103 -477590 -443104 -428694 -435151 -428123 -416809
5503 -416809 -429281 -453068 -442741 -413969 -442316 -456477 -453777 -453955 -440096 -441629 -439830 -423388 -422887
$$ packed form
5595d13864O390l1651n925N181k487l448j0711K508L5520K767k7481k838J182
5582d44857j5840O183P062j513Q422l8037P231J67j475M01J2171K3255l140j9100
5568d59070j0785j6139P48J0934L6986j4003j3919k0907j133j370K5611J233O50
5555d61164L0699n40j3036j8446r101M2644r898j1243Q851K6780J209l8477l7749
5542d89471k3626L62L4055M956J026J9906K840k1321l6853k3271K9476J9970q17
5529d82768j8867K1729K656K0471O291l2962j2368P036J9626Q010J2856m147P317
5516d45120k4466J1213K749j5892j5792q462p333K5513L4486J4410o457P028J1314
5503d16809j2472k3787J0327K8772k8347j4161K700j78J3859j533J799J6442N01
$$ plain form
5490 -422887 -412816 -411617 -430429 -447366 -434627 -440404 -436785 -416328 -411760 -425524 -420713 -430711 -434938
5477 -434938 -435014 -441380 -461539 -461695 -429807 -447691 -457389 -459452 -458964 -462223 -456197 -429425 -401224 -373448
5463 -373448 -385239 -414828 -438607 -456737 -421469 -415898 -411131 -414429 -407893 -411017 -430699 -429207 -441880
5450 -441880 -457302 -457603 -471956 -427476 -434972 -476626 -485796 -469641 -497084 -486492 -459662 -462160 -457713
5437 -457713 -438016 -444673 -424694 -434176 -420579 -402565 -417865 -407789 -407493 -422917 -432829 -440680 -446431
5424 -446431 -438742 -457790 -472535 -479632 -450832 -442107 -464245 -504236 -505910 -488071 -456589 -462197 -457889
5411 -457889 -488218 -499026 -471545 -446570 -445292 -442665 -454248 -480009 -467253 -470616 -474378 -453696
5399 -453696 -459764 -459818 -460082 -437914 -457215 -468143 -458401 -451043 -463096 -438185 -410590 -404846 -391640
$$ packed form
5490d22887J0071J199j8812j6937J2739n777L619K0457M568j3764M811r998m227
5477d34938p6o366k0159j56L1888j7884r698k063M88l259O026K6772K8201K7776
5463c73448j1791k9589k3779j8130L5268N571M767l298O536l124j9682J492j2673
5450d41880j5422l01j4353M4480p496m1654r170J6155k7443J0592K6830k498M447
5437d57713J9697o657J9979r482J3597J8014j5300J0076K96j5424r912p851n751
5424d46431P689j9048j4745p097K8800Q725k2138l9991j674J7839L1482n608M308
5411d57889l0329j0808K7481K4975J278K627j1583k5761J2756l363l762K0682
5399d53696o068n4k64K2168j9301j0928R742P358j2053K4911K7595N744J3206
$$ plain form
5386 -391640 -391645 -415355 -420589 -407130 -410612 -418237 -440756 -445391 -456756 -478298 -483273 -479033 -477384 -464776
5372 -464776 -468029 -469527 -471807 -457616 -443180 -445816 -453528 -466091 -453269 -438994 -420604 -438394 -441408
5359 -441408 -421935 -374148 -408774 -433604 -399430 -415340 -428616 -420431 -424143 -430854 -420494 -430210
5347 -430210 -446885 -454051 -452303 -479722 -464975 -428927 -440013 -456439 -448500 -414602 -403694 -411299
5335 -411299 -408196 -407656 -406158 -383626 -380422 -401121 -397861 -391909 -383450 -402709 -416450 -421327 -441561
5322 -441561 -468539 -457746 -444884 -463721 -479561 -465621 -428622 -455338 -465438 -467712 -464918 -478995
5310 -478995 -497567 -481230 -457033 -444733 -428912 -402756 -429904 -475973 -478627 -486276 -471377 -466837
5298 -466837 -476799 -470287 -493869 -484640 -450437 -428908 -436818 -435848 -447021 -427317 -421238 -426284 -461672
$$ packed form
5386c91640nk3710n234J3459l482p625k2519m635j1365k1542m975M240J649J2608
5372d64776l253j498k280J4191J4436k636p712j2563J2822J4275J8390j7790l014
5359d41408J9473M7787l4626k4830L4174j5910j3276Q185l712o711J0360r716
5347d30210j6675p166J748k7419J4747L6048j1086j6426P939L3898J0908p605
5335d11299L103N40J498K2532L204k0699L260N952Q459j9259j3741m877k0234
5322d41561k6978J0793J2862j8837j5840J3940L6999k6716j0100k274K794j4077
5310d78995j8572J6337K4197J2300J5821K6156k7148m6069k654p649J4899M540
5298d66837r962O512k3582R229L4203K1529p910R70j1173J9704O079n046l5388
$$ plain form
5285 -461672 -455845 -438813 -397988 -368452 -392261 -391005 -395458 -386847 -376180 -404329 -416015 -397664
5273 -397664 -385913 -415234 -432004 -445867 -468127 -448218 -460055 -451373 -441719 -436112 -441077 -457983
5261 -457983 -445593 -419107 -412382 -413818 -417292 -414991 -439781 -438148 -428179 -420645 -432622 -411638 -415112
5248 -415112 -434657 -413279 -425000 -431443 -456932 -445982 -421579 -405952 -425218 -442939 -449786 -439190
5236 -439190 -434911 -419973 -407679 -414208 -418437 -409768 -441289 -481951 -500445 -487232 -470524 -443415
$$ packed form
5285d61672N827J7032M0825K9536k3809J256m453Q611J0667k8149j1686J8351
5273c97664J1751k9321j6770j3863k2260J9909j1837Q682R654N607m965j6906
5261d57983J2390K6486O725j436l474K301k4790J633R969P534j1977K0984l474
5248d15112j9545K1378j1721o443k5489J0950K4403J5627j9266j7721o847J0596
5236d39190M279J4938J2294o529m229Q669l1521m0662j8494J3213J6708K7109
$$ [...]
##END NTUPLES=NMR SPECTRUM
##END=
