##TITLE=Analysis number 328976
Compound Code cc 49506
Book Reference 486/170
Project Code adrs
Chemist Name simons
##JCAMPDX= 6.0         $$ Bruker NMR JCAMP-DX V2.0
##DATA TYPE= NMR SPECTRUM
##DATA CLASS= NTUPLES
##ORIGIN= Bruker BioSpin GmbH
##OWNER= nmr
$$ XWIN-NMR		Version 3.5
$$ Fri Jul 20 13:32:37 2007 GMT Daylight Time (UT+1h)  MAYBRIDGE\nmr@NMR_250MHZ
##.OBSERVE FREQUENCY= 250.131544655141
##.OBSERVE NUCLEUS= ^1H
##.ACQUISITION MODE= SIMULTANEOUS (DQD)
##.ACQUISITION SCHEME= undefined
##.AVERAGES= 16
##.DIGITISER RES= 18
##SPECTROMETER/DATA SYSTEM= dpx250
##.PULSE SEQUENCE= zg30
##.SOLVENT NAME= CDCl3
##.SHIFT REFERENCE= (INTERNAL, CDCl3, 0, 16.4511)
##AUDIT TRAIL= $$ (NUMBER, WHEN, WHO, WHERE, WHAT)
$$ ##TITLE= Audit trail, XWIN-NMR		Version 3.5
$$ ##JCAMPDX= 5.01
$$ ##ORIGIN= Bruker BioSpin GmbH
$$ ##OWNER= nmr
$$ C:\u/data/dgb/nmr/ADRS/1290/pdata/1/auditp.txt
$$ ##AUDIT TRAIL=  $$ (NUMBER, WHEN, WHO, WHERE, WHAT)
(   1,<2007-07-20 13:32:16.44 +100>,<MAYBRIDGE\nmr>,<NMR_250MHZ>,
      <created by zg, POWCHK disabled, PULCHK disabled
       configuration hash MD5:
       76 6E 9A 78 1E 09 19 81 EC 84 63 8F B0 6A 59 2D
       data hash MD5: 64K
       31 2F F8 1A 01 49 B9 CD B3 03 20 9F 6B C7 54 27>)
(   2,<2007-07-20 13:32:27.85 +100>,<MAYBRIDGE\nmr>,<NMR_250MHZ>,
      <Start of raw data processing
       ef LB = 0.3 FT_mod = 6 PKNL = 1 SI = 32K 
       data hash MD5: 32K
       1E BC 6F 84 68 C7 7D 77 CC 78 97 12 E4 6D 99 3C>)
(   3,<2007-07-20 13:32:29.55 +100>,<MAYBRIDGE\nmr>,<NMR_250MHZ>,
      <apk 
       data hash MD5: 32K
       9E FA C5 1B 81 AD 7E 1D B2 88 D3 6A B8 3B FE 1F>)
(   4,<2007-07-20 13:32:30.29 +100>,<MAYBRIDGE\nmr>,<NMR_250MHZ>,
      <abs ABSG = 5 
       data hash MD5: 32K
       BE DC 96 FF 49 CC 04 D7 80 49 E1 73 65 C6 D4 C3>)
$$ ##END=
$$ 
$$ hash MD5
$$ 49 A5 B5 6E 0E 82 18 C5 15 D1 18 41 54 86 AF E7
##$RELAX= 
##$RELAX= 
##$RELAX= 
##$RELAX= 
##$RELAX= 
##$RELAX= 
##$RELAX= 
$$ Bruker specific parameters
$$ --------------------------
##$DU= <C:\u>
##$EXPNO= 1290
##$NAME= <ADRS>
##$PROCNO= 1
##$TYPE= <nmr>
##$USER= <dgb>
##$AMP= (0..31)
100 100 100 100 100 100 100 100 100 100 100 100 100 100 100 100 100 100 
100 100 100 100 100 100 100 100 100 100 100 100 100 100 
##$AQSEQ= 0
##$AQ_mod= 3
##$AUNM= <au_zg>
##$AUTOPOS= <12 >
##$BF1= 250.13
##$BF2= 250.13
##$BF3= 250.13
##$BF4= 250.13
##$BF5= 500.13
##$BF6= 500.13
##$BF7= 500.13
##$BF8= 500.13
##$BYTORDA= 1
##$CFDGTYP= 0
##$CFRGTYP= 5
##$CHEMSTR= <none>
##$CNST= (0..31)
1 1 145 1 1 1 1 1 1 1 1 1 1 1 1 1 1 1 1 1 1 1 1 1 1 1 1 1 1 1 1 1 
##$CPDPRG= <>
##$CPDPRG1= <>
##$CPDPRG2= <>
##$CPDPRG3= <>
##$CPDPRG4= <mlev>
##$CPDPRG5= <mlev>
##$CPDPRG6= <mlev>
##$CPDPRG7= <mlev>
##$CPDPRG8= <mlev>
##$CPDPRGB= <>
##$CPDPRGT= <>
##$D= (0..31)
0 1 0 0 0 0 0 0 0 0.06 0 0 0 0 0 0 0.0002 0 0 0 0 0 0 0 0 0 0 0 0 0 0 
0 
##$DATE= 1184934735
##$DBL= (0..7)
120 120 120 120 120 120 120 120 
##$DBP= (0..7)
150 150 150 150 150 150 150 150 
##$DBP07= 0
##$DBPNAM0= <>
##$DBPNAM1= <>
$$ [...]
##$SUBNAM7= <"">
##$SUBNAM8= <"">
##$SUBNAM9= <"">
##$SW= 20.6930455092707
##$SWIBOX= (0..15)
0 0 3 0 0 0 0 0 0 0 0 0 0 0 0 0 
##$SW_h= 5175.983436853
##$TD= 65536
##$TD0= 1
##$TE= 297.16
##$TE2= 300
##$TE3= 300
##$TEG= 300
##$TL= (0..7)
0 120 120 120 120 120 120 120 
##$TP= (0..7)
150 150 150 150 150 150 150 150 
##$TP07= 0
##$TPNAME0= <>
##$TPNAME1= <>
##$TPNAME2= <>
##$TPNAME3= <>
##$TPNAME4= <>
##$TPNAME5= <>
##$TPNAME6= <>
##$TPNAME7= <>
##$TPOAL= (0..7)
0.5 0.5 0.5 0.5 0.5 0.5 0.5 0.5 
##$TPOFFS= (0..7)
0 0 0 0 0 0 0 0 
##$TUNHIN= 0
##$TUNHOUT= 0
##$TUNXOUT= 0
##$USERA1= <user>
##$USERA2= <user>
##$USERA3= <user>
##$USERA4= <user>
##$USERA5= <user>
##$V9= 5
##$VALIST= <valist>
##$VCLIST= <CCCCCCCCCCCCCCC>
##$VD= 0
##$VDLIST= <DDDDDDDDDDDDDDD>
##$VPLIST= <PPPPPPPPPPPPPPP>
##$VTLIST= <TTTTTTTTTTTTTTT>
##$WBST= 1024
##$WBSW= 4
##$XGAIN= (0..3)
0 0 0 0 
##$XL= 0
##$YL= 0
##$YMAX_a= 298460
##$YMIN_a= -262505
##$ZGOPTNS= <>
##$ZL1= 120
##$ZL2= 120
##$ZL3= 120
##$ZL4= 120
##$ABSF1= 16.45112
##$ABSF2= -4.242052
##$ABSG= 5
##$ABSL= 3
##$ALPHA= 0
##$AQORDER= 0
##$ASSFAC= 0
##$ASSFACI= 0
##$ASSFACX= 0
##$ASSWID= 0
##$AUNMP= <proc_1d>
##$AZFE= 0.1
##$AZFW= 0.1
##$BCFW= 0
##$BC_mod= 0
##$BYTORDP= 0
##$COROFFS= 0
##$CY= 12.5
##$DATMOD= 1
##$DC= 0
##$DFILT= <>
##$DTYPP= 0
##$F1P= 14.0000005364418
##$F2P= -0.99999901652339
##$FCOR= 0.5
##$FTSIZE= 32768
##$FT_mod= 6
##$GAMMA= 0
##$GB= 0
##$INTBC= 1
##$INTSCL= 1
##$ISEN= 128
##$LB= 0.3
##$LEV0= 0
##$LPBIN= 0
##$MAXI= 10000
##$MC2= 0
##$MEAN= 0
##$ME_mod= 0
##$MI= 0
##$NCOEF= 0
##$NC_proc= -2
##$NLEV= 6
##$NOISF1= 0
##$NOISF2= 0
##$NSP= 0
##$NTH_PI= 0
##$NZP= 0
##$OFFSET= 16.45112
##$PC= 1
##$PHC0= -52.19497
##$PHC1= 7.663183
##$PH_mod= 1
##$PKNL= yes
##$PPARMOD= 0
##$PSCAL= 4
##$PSIGN= 0
##$REVERSE= no
##$SF= 250.130017727795
##$SI= 32768
##$SIGF1= 0
##$SIGF2= 0
##$SINO= 400
##$SIOLD= 32768
##$SREGLST= <1H.CDCl3>
##$SSB= 0
##$STSI= 32768
##$STSR= 0
##$SW_p= 5175.98343685301
##$SYMM= 0
##$S_DEV= 0
##$TDeff= 65536
##$TDoff= 0
##$TI= <Analysis number 999999
Compound Code 99
Book Reference 9
Project Code 9>
##$TILT= no
##$TM1= 0
##$TM2= 0
##$TOPLEV= 0
##$USERP1= <user>
##$USERP2= <user>
##$USERP3= <user>
##$USERP4= <user>
##$USERP5= <user>
##$WDW= 1
##$XDIM= 32768
##$YMAX_p= 318222654
##$YMIN_p= -76211
$$ End of Bruker specific parameters
$$ ---------------------------------
##NTUPLES= NMR SPECTRUM
##VAR_NAME=  FREQUENCY,     SPECTRUM/REAL,   SPECTRUM/IMAG
##SYMBOL=    X,             R,               I
##VAR_TYPE=  INDEPENDENT,   DEPENDENT,       DEPENDENT
##VAR_FORM=  AFFN,          ASDF,            ASDF
##VAR_DIM=   32768,         32768,           32768
##UNITS=     HZ,            ARBITRARY UNITS, ARBITRARY UNITS
##FACTOR=    0.157963299565203, 1,           1
##FIRST=     4114.91903143777, 0,            0
##LAST=      -1061.06440541524, 0,           0
##MIN=       -1061.06440541524, -76211,      0
##MAX=       4114.91903143777, 318222654,    0
$$ Real data points
##PAGE= N=1
##DATA TABLE= (X++(R..R)), XYDATA
$$ [...]
##PAGE= N=2
##DATA TABLE= (X++(I..I)), XYDATA
16112a89827p771O4N783J7601J5776J0116p463o807L187j2230j3597j6381K093
16099a99456r575l427J012n902J0978J6531o632R008K3053L344j1605q625J30
16086a81166o890J2300M824j8317k225J5305N616j1908k976p061L995L179L012
16073a82312q527j048J1381J0652o248n961r516J0287K1392p797k894J4611J215
16060a54765J607n252j5105j6717K773m708J2156N78L318J2666L478m709J257
16047a63423K1463k3416j8681K645o533L496K1987l252M986l176j2210J3319q734
16034a71529m028J7373Q996m175q199J7636k064j2037p172j2032k028M559K022
16021a72678J0798J0966j5933J0047j703k3935l990m650J9480K7782R58j8811
$$ y = [-189827, -197598, -197534, -191751, -174150, -158374, -148258, -155721, -162528, -159341, -171571, -185168, -201549, -199456, -209031, -212458, -211446, -217348, -206370, -189839, -196471, -187463, -164410, -161066, -172671, -181296, -181166, -188056, -175756, -170932, -189249, -191474, -176169, -170553, -182461, -185437, -192498, -188503, -185324, -182312, -190839, -191887, -180506, -169854, -176102, -182063, -191579, -181292, -159900, -167697, -170591, -155980, -154765, -153158, -158410, -173515, -190232, -187459, -192167, -180011, -179433, -176115, -163449, -159971, -164680, -163423, -141960, -165376, -184057, -181412, -187945, -184449, -162462, -165714, -160728, -163904, -176114, -162795, -171529, -175557, -158184, -149188, -153363, -161562, -143926, -145990, -158027, -165199, -177231, -179259, -174700, -172678, -161880, -150914, -166847, -156800, -158503, -182438, -186428, -191078, -171598, -143816, -142858, -161669]
16009a61669r491j7451j5932k826M785O271K8977N127m712O133m433o530p001
15996a78752J9053J4225q119j9551N177j6136j6468L419J3729J534Q80N82J4557
15983a65870P831R755J0082p806j9198j5924J4892o310l732k881J017m00J5350
15970a63194r000J0903J9176l72j5272o150j0902o423J367N358n318K9580N44
15957a49703n91J1904R491K872j9906j0315o425J918m339o861J5267j94P513J4858
15943a34511O99K271L295n527m219P902j2713j7034m714l330J6152J0877J1922
15930a28930p982k279r228j8838j3244K6055K6845P871O28J4096j5381j4011j7685
15917a52083p35j0198L196o936q199J1163R113r914r802J364R562K104Q168j935
$$ y = [-161669, -171160, -188611, -204543, -207369, -202584, -196313, -167336, -162209, -166921, -160788, -165221, -171751, -178752, -159699, -145474, -153593, -173144, -167967, -184103, -200571, -197152, -183423, -181889, -181009, -180427, -165870, -158039, -148284, -138202, -146008, -165206, -181130, -166238, -172548, -176280, -179161, -178144, -178544, -163194, -172194, -161291, -142115, -142487, -157759, -163909, -174811, -181234, -179867, -174509, -179827, -150247, -149703, -150294, -138390, -128899, -126027, -145933, -156248, -162673, -160755, -165094, -171955, -156688, -156882, -149369, -134511, -133812, -131541, -128246, -133773, -137992, -130090, -142803, -159837, -164551, -167881, -151729, -140852, -128930, -136912, -139191, -148419, -167257, -180501, -154446, -127601, -119730, -119102, -105006, -120387, -134398, -152083, -152818, -163016, -159820, -166756, -174955, -163792, -154679, -164593, -174395, -173031, -163469, -161365, -153197, -155132]
15903a55132k2896N785J0882N874N170K815q997j4873l72J6732N902p596K846
15890a53860O062K581j1190r552k28P375Q759J0105l690J575m47j365O313o411
15876a43973j4473O795J4014r675j132N385j421p305J3127J4047j148R80r034
15863a33813L377m220j0557j1021j641j1845L109L916K744N041m931N37L267M264
15849a51773j4839m633N323R482J1410l438k930j796j3969O316L803L629p49p749
15835a61913j0502q98k834O085J3591L109o146o012q06m687p045O97K5816J5332
15821a36213N807Q785j356j5443M86j2035j0882J7201K5000j4181j0680o940j482
15808a51933J2221j0085R089J2973j4134j7024j0730Q238M891o489P360P972Q580
$$ y = [-155132, -178028, -172243, -161361, -155487, -150317, -147502, -156499, -171372, -171744, -155012, -149110, -156706, -153860, -147798, -145217, -156407, -165959, -166187, -158812, -150053, -139948, -143638, -142063, -142510, -143875, -137562, -143973, -158446, -151651, -137637, -147312, -148444, -143059, -144480, -151785, -138658, -124611, -125759, -124779, -133813, -130436, -134656, -145213, -156234, -157875, -169720, -166611, -162695, -159951, -154910, -159841, -159304, -156037, -151773, -166612, -171245, -165922, -156440, -145030, -148468, -151398, -153194, -167163, -160847, -157044, -153415, -154164, -161913, -172415, -173313, -176147, -170062, -156471, -153362, -159508, -165520, -166326, -171013, -178058, -177361, -151545, -136213, -130406, -121621, -122977, -138420, -137934, -149969, -160851, -143650, -118650, -132831, -143511, -150451, -151933, -139712, -149797, -140708, -127735, -141869, -158893, -169623, -161385, -156494, -162983, -155623, -147651, -139071]
15795a39071L375j6792J8939K3474j7262k5789J1386O464K268j417o876J003J3372
15782a26926R17K892P995Q574P885J8903J0656j5222j3178k3201j1937M024O816
15769a21802M66q857Q578K203o226n588R338J1250l717J3160n040j3367j6088
15756a35690r854o630K645N749P920J4794M00o425m057N462K3167P453J706j1971
15742a05331k6555j4828J4536M784J5161k808j1548M656N808J1870K780j1237
15730a12712j2467j8979r643K6192p160j8383M509Q998J4846m052l498r873o255
15717a48477O067L97J1265L952l971N909p248J5695K3345j4647j1564q326J905
15704a25698L904r664n763j0700R761J5863J2139M454j0768J245j7246Q93L606
$$ y = [-139071, -135696, -152488, -133549, -110075, -127337, -153126, -141740, -135276, -133008, -134425, -141301, -140298, -126926, -126009, -123117, -115122, -106548, -98663, -79760, -69104, -84326, -97504, -120705, -132642, -128618, -121802, -121336, -130193, -121615, -119412, -125638, -131226, -121888, -110638, -114355, -101195, -106235, -119602, -135690, -145544, -152174, -149529, -143780, -135860, -121066, -120666, -127091, -131148, -125686, -102519, -95066, -93360, -105331, -131886, -146714, -132178, -127394, -112233, -115041, -126589, -121933, -116125, -104255, -101475, -112712, -125179, -144158, -153801, -127609, -134769, -153152, -148643, -139645, -124799, -128851, -132349, -142222, -148477, -142410, -142013, -130748, -126796, -130767, -124858, -132106, -116411, -93066, -107713, -119277, -127603, -125698, -121794, -131458, -137221, -147921, -138160, -122297, -110158, -105704, -116472, -115227, -132473, -131580, -127974]
15691a27974j1165N107J5602o428k603Q347Q352j8119J0907n891r288J3215n054
15678a24992j542J8891J8589j6181j9183K00p360J4026M308J3524k101O272O223
15665h9326L474m531j3600l801p911O942L765Q99q547L705J9316j6968k6674q19
15651a34076J490J709P785O02J9029P184k1155k2524j127L638J9358J5291j1366
15638a14162j068k274j6174J2450Q293J4033M434j1834J98K826J36k400L453M377
15624i7712k108o276n635j046m865q976o337n570Q633L672J5679K947m250m096
15610a15940J3261n748J0828K4597m220m354L231j0213j1671j2312n067J1024
15598a06584L479j5247k347K3111r081J3780N394J5682J3608L318k3883j6505
$$ y = [-127974, -139139, -134032, -118430, -124858, -127461, -119114, -110762, -128881, -117974, -123865, -133153, -119938, -124992, -126534, -107643, -89054, -105235, -124418, -124218, -131578, -117552, -113244, -99720, -101821, -95549, -89326, -85852, -90383, -103983, -107784, -115695, -108753, -104988, -104089, -112636, -108931, -89615, -106583, -133257, -134076, -132586, -130877, -123092, -122490, -103461, -96277, -117432, -139956, -141083, -137445, -118087, -102796, -114162, -115230, -117504, -133678, -121228, -112935, -98902, -94468, -106302, -106104, -103278, -103142, -105542, -102089, -97712, -99820, -106096, -111731, -112777, -117642, -126618, -132955, -138525, -129892, -126220, -110541, -107594, -111844, -115940, -102679, -108427, -97599, -73002, -77222, -81576, -78345, -88558, -100229, -112541, -117608, -106584, -103105, -118352, -120699, -97588, -106669, -92889, -87495, -71813, -58205, -54887, -78770, -95275]
15586i5275p390M832Q553j3916j4012J1420j0126q065k541J4515l327q952Q699
15573a15585J0085K614J1189O634l96k0731R002n560j7352Q354J2315j475R61
15560i9945o864j695m335J794N87J3014J6270K030q674q647L873M471R799J8710
15546e9612j9040k2701j1053M016L858j0514J3649J3657m719N156l912p660l817
15533a02692M20l274P282O839p354J1605J1898L37l488n946j298R694n994j913
15519h3884J3688J1569k86j0420k0543j476k181P622L991k1351j7341j82K486
15506a18308K2919J4647L856p537j1272R64k732K863P994j3483j2863l138J9864
15493i6226K811j3400L535K3040j2214m497R538j1401j1767j5612J8814L4344
$$ y = [-95275, -102665, -97833, -89280, -103196, -117208, -105788, -115914, -123979, -126520, -112005, -115332, -124284, -115585, -105500, -102886, -91697, -85063, -85459, -106190, -97188, -102748, -120100, -111746, -99431, -100906, -99945, -106809, -108504, -112839, -111045, -110458, -97444, -81174, -79144, -87818, -96465, -92592, -88121, -78322, -59612, -78652, -101353, -112406, -108390, -104532, -115046, -101397, -87740, -92459, -87303, -91215, -98875, -102692, -102272, -105546, -98264, -91425, -98779, -87174, -75276, -74939, -78427, -84373, -85671, -75977, -81971, -83884, -70196, -58627, -58913, -69333, -89876, -91352, -93533, -85911, -81920, -103271, -120612, -120794, -118308, -95389, -80742, -76886, -84423, -95695, -94731, -97463, -94600, -86606, -100089, -112952, -116090, -96226, -93415, -106815, -103280, -80240, -92454, -96951, -87413, -98814, -110581, -126193, -107379, -73035]
15481g3035M957o785k183n46N457Q004r88j0914J434p287j506L112l81P214O438
15466f7009j6998j5161N185K1232m342p754l660R789O472p028m687r628K451J4430
15452g6708J2640O641j555r546k240k0576k0739J2592J0312R001n16J2643L186
15439f4865n332P906j2341k8428K862j882J2284J5259J4694J373j3458m769k198
15426g8895p297p997K4120K491j567M899j6648r30J6912J622j9166j5932j0708
15413a09096n497P718P634J2297n126q451K5719J8333M05q36k1753j177J0111
15400f9719m796o989R64j1181j7015k599o806k38L4685j67l131J230j893M265
15386h3390k54J385p562K312j0435Q546n598j6000J2861K714P127J0458j238l846
$$ y = [-73035, -68078, -74863, -77046, -77592, -72135, -64131, -65119, -76033, -74599, -81886, -83392, -80280, -80661, -73447, -67009, -84007, -99168, -93983, -72751, -77093, -84847, -88507, -78718, -72246, -79274, -83961, -93589, -91138, -76708, -64068, -57427, -58982, -68528, -70768, -91344, -112083, -99491, -89179, -80178, -80694, -68051, -64865, -70197, -62291, -74632, -103060, -100198, -102080, -89796, -74537, -59843, -58470, -71928, -76697, -78895, -86192, -94189, -70069, -67578, -69145, -64246, -80894, -81824, -64912, -63290, -82456, -98388, -109096, -114593, -106875, -99241, -86944, -92070, -100521, -74802, -56469, -56064, -56900, -78653, -79830, -69719, -74515, -81504, -80540, -91721, -108736, -111335, -118141, -118379, -83694, -83861, -86992, -85762, -87655, -83390, -83644, -82259, -89821, -87509, -97944, -89398, -94996, -110996, -98135, -95421, -88294, -77836, -79074, -82920]
15372h2920o034k274L456K3097J9679l465o209j1352k05l168o716p712j2438m989
15358a01250N835J5087Q47m552P522J534m014k4501j289M064O393J4204K1316
15345e8804j931j7495j1984p772P596J1050n769P537Q53M792o262o334J9530O146
15331e8847r8j5450K09p646n249O150J6373K457j1370l219o935P261P292J626
15317f7446J89N312J7170l219n815J4999q291j0221L776M092o64J341J964J154
15303d5659m509j2108O584K507l037J347j28j6980J3980R292j35O520J1156q045
15289c9215m935L28j5857n874j160K340R320J766l819M932J4484N316o313o653
15275d5340P052q675l00j1754m218k440m632R712j4558M494J111J1585J5073j3966
$$ y = [-82920, -88954, -91228, -87772, -64675, -44996, -48461, -54670, -66022, -66227, -69395, -76111, -83823, -96261, -101250, -95415, -80328, -79481, -84033, -76511, -74977, -78991, -103492, -104781, -100717, -94324, -80120, -58804, -60735, -78230, -90214, -97986, -90390, -79340, -85109, -77572, -76719, -71927, -78189, -84523, -64993, -58847, -58945, -74395, -74186, -81832, -87081, -80931, -64558, -62101, -73471, -76690, -83625, -76364, -69072, -67446, -67257, -61945, -44775, -47994, -53809, -38810, -47101, -57322, -53546, -49454, -50118, -48777, -46813, -45659, -50168, -62276, -55692, -53185, -56222, -54875, -55003, -71983, -58003, -48711, -48846, -42326, -31170, -39215, -44150, -43822, -59679, -65553, -66713, -64373, -55053, -53287, -57106, -52174, -37690, -32374, -38687, -45340, -38288, -46963, -47263, -59017, -63235, -65675, -70307, -60595, -75153, -70659, -69548, -57963, -42890, -56856]
15261e6856m57L446J0923J2823J649p482j4608j6842q532j0760J33K2577R754
15248e4232J4155J0951K865r317J172m7k241J7096r58j2468l549o270k354J001
15234d4196P591K483o304q656j4321l688K0193K928M419k488m239K209p329p405
15220e8803K35J0000l665n291N126p13K2314l198j0266j1797N347k411L221j0110
15206f0011p217n622p117J6062K0629J0548P064k784k405j4172Q302K133k944
15193c7534l200J866n734J4127J4030j6550j2687R504q664r973L862j3510j0659
15180g5122J0553N807j4033J589Q684j970m95K0298J9611Q97K513M667k5195k1238
15166f3434J3733P348R139O130K048r409N818r521j1649J0304J3493j8645k3653
$$ y = [-56856, -57313, -53867, -42944, -30121, -28472, -35954, -50562, -67404, -75936, -86696, -86563, -63986, -54232, -40077, -29126, -26261, -35578, -34406, -34453, -36694, -19598, -20556, -33024, -36573, -42843, -45197, -44196, -36605, -34122, -40426, -49082, -63403, -67091, -46898, -43970, -39551, -42039, -46278, -44069, -51398, -58803, -58568, -48568, -52233, -57524, -52398, -53111, -30797, -33995, -44261, -56058, -50711, -53122, -49901, -60011, -67228, -72850, -79967, -63905, -43276, -32728, -25664, -28448, -30853, -45025, -36723, -34590, -37534, -40734, -38868, -44602, -30475, -16445, -32995, -45682, -36178, -44842, -54815, -50953, -64463, -75122, -64569, -58762, -72795, -71206, -62522, -64492, -64987, -44689, -25078, -24181, -21668, -17001, -42196, -63434, -49701, -42353, -33214, -27084, -25036, -34445, -28627, -38148, -49797, -39493, -26000, -44645, -68298]
15153f8298K563J0431Q895P360k254J2363J828j273k255r506n842O850p630j2704
15139e9472L9j629K875J202J6654j9748j354K2067M521o272N488j42n088n193
15125d6052k944Q646J0307n880n597M564J5027L257k0370o237M161N408o438q589
15111e0737P621N163q698j146m935n043L585M025J8256Q148o432q181K3333J44
15097a4897l273o325N28n714k0436R617J3197N051L771l56k142j4169j4146m135
15083e3429P751M185j4854J5061P110p593K621K637j0562M83J704p895k381j1138
15069f6300N861P828J5341J3964o345p256j1597J0322j8752L650r683O393J4414
15056d2160J051m261J035l522J0017r75N919J1936l335M911q368j0500m362q140
$$ y = [-68298, -65735, -55304, -46409, -39049, -41303, -28940, -27112, -28385, -30640, -40146, -45988, -39138, -46768, -59472, -59433, -61062, -58187, -56985, -40331, -60079, -61433, -39366, -34845, -41117, -35629, -35771, -40859, -46052, -48996, -40350, -30043, -35923, -41520, -36956, -21929, -18672, -39042, -45279, -41118, -35710, -42148, -50737, -43116, -37953, -46651, -47797, -52732, -57775, -54190, -50165, -31909, -23761, -30193, -38374, -15041, -14897, -18170, -24495, -23967, -29681, -50117, -40500, -27303, -22252, -18481, -18837, -20979, -35148, -49294, -53429, -45678, -41493, -56347, -41286, -34176, -41769, -39148, -36511, -47073, -46590, -44886, -52781, -55162, -66300, -60439, -52611, -37270, -23306, -29651, -36907, -48504, -38182, -56934, -53284, -62967, -56574, -42160, -41109, -45370, -44335, -47857, -37840, -38815, -32896, -20960, -24295, -19384, -27752, -38252, -42614, -50754]
15042e0754j292j6848L453J1071m34O138N539n930J0468K804k765J0703J8218
15029i629R88q380j472K726J025l130O876K857j3836q155J3617j7131R18N478
15015b7248k890j1624m950m183O697K5231l662k226J0609J61j1005j3111N665
15002c2536j787p905J706R391k12R408O949K25P842j277q637q883j0305j1995
14988d8016J1457k349K428J3099j498j0826Q503K526J0732N843j6662M057k497
14975b3203M056p860r498N33l960o440n530J0553J0355l216j6393O022L830j2278
14961e3029l198m394m30J4211J22M272K075O755K980Q19r097r886r815o676K5221
14946d0070J4092M754J8622k804j1316o996j7426j2220M133J3237J0082q157q380
$$ y = [-50754, -52046, -68894, -65441, -54370, -54804, -48666, -43127, -49057, -38589, -35785, -38550, -27847, -9629, -8641, -17021, -18493, -15767, -14742, -17872, -10996, -8139, -21975, -30130, -16513, -33644, -32726, -27248, -30138, -41762, -46712, -50895, -44198, -18967, -22629, -24855, -14246, -14085, -25090, -38201, -32536, -34323, -42228, -40522, -31131, -31343, -21935, -14986, -14761, -6919, -8196, -16833, -25716, -36021, -48016, -36559, -38908, -36480, -23381, -24879, -35705, -27202, -24676, -13944, -8101, -24763, -20706, -23203, -19147, -27007, -36505, -35972, -39932, -46372, -51902, -41349, -30994, -34210, -50603, -44581, -40751, -53029, -56227, -60621, -61051, -46840, -46718, -42446, -40371, -33616, -30636, -29817, -38914, -48800, -58615, -65291, -40070, -25978, -21224, -2602, -5406, -16722, -23718, -41144, -53364, -49231, -35994, -25912, -34069, -42449]
14933d2449N829M810J8302L686q766o412j2344J3238J031L733q692j2930m154
14920d5118J256J7770L420k177j5509n311K144J4954P489M598J1347r059k0991
14907c5187R627J2545j1667j5532M787R039O7J4309L693j0811J492J3833P432
14894C627j2780k4258l106k215r60N270P011K5534j0214k1083j490P930K1733
14881e001J4352r209k1200j5592q096m831N667J738P039R40M811J0788m234J925
14867b0903l282M569n175p906J3260K11j5018m896P286J1948o052l165R61j648
14853b9810k1143J730R712K2512j26j6002j5842k087P357k603p268J5512J2858
14840b5200J5257j74j2383j9767Q096O578j1284O759J3057k239Q671l542o672
$$ y = [-42449, -36620, -31810, -13508, -9822, -18588, -25000, -37344, -24106, -23075, -19342, -28034, -40964, -45118, -43862, -26092, -22672, -24849, -40358, -45669, -43525, -28571, -21082, -16484, -5137, -14196, -35187, -25560, -13015, -24682, -40214, -35427, -26388, -26321, -12012, -8319, -19130, -17638, -3805, 3627, -9153, -33411, -36517, -38732, -39692, -34422, -27411, -1877, -12091, -33174, -34664, -26734, -5001, 9351, 142, -21058, -36650, -44746, -49577, -43910, -42172, -35133, -34193, -29382, -18594, -22828, -20903, -24185, -19616, -24791, -32697, -19437, -19226, -34244, -39140, -31854, -19906, -25958, -29123, -28162, -29810, -50953, -49223, -39511, -16999, -17125, -33127, -48969, -51056, -43699, -46302, -53570, -38058, -25200, -9943, -10117, -22500, -42267, -34171, -27593, -38877, -32118, -19061, -21300, -12629, -16171, -22843]
14827b2843O027O349j1502J92J1425k32l501o59p277J4972n58j1567k0536P107
14813c2603J2332j008o492R52J2334j812K115O621o39m650O262Q999k424j0275
14799a0288n953K45M507M093J0364m228j8610j7883J9796J7852q524k1737j5206
14786d5572K6813m648j3675P707O427R548M723l114j0356J1491l92O920q57J0277
14772E292r547j9214p469k78p073k434J5887L2481J5505r86j5387k0259j4123
14759b7605j2733R829J1476L722O933J270j6086P023Q116m00P555R406p632k1539
14745b0665P310n426p662K112M172J3600j1768L869J6076R799j4150k5271M757
14732b3247J2671J3420O445j2846k5596l322m254j2731M172J0995R376R929O075
$$ y = [-22843, -16816, -10467, -21969, -21777, -10352, -10584, -14085, -14744, -22021, -7049, -7607, -19174, -39710, -32603, -20271, -21279, -27771, -26819, -14485, -16297, -14182, -7561, -8200, -12850, -6588, 2411, -13, -10288, -16241, -15996, -11489, -7396, 2968, -1260, -19870, -37753, -17957, -105, -8629, -30366, -45572, -18759, -23407, -37082, -29375, -22948, -13400, -8677, -11791, -22147, -10656, -11048, -4128, -4985, 5292, -4255, -23469, -30938, -31216, -38289, -40723, -24836, 7645, 23150, 22164, 6777, -13482, -27605, -40338, -30509, -19033, -15311, -8378, -7108, -23194, -16171, -8055, -8455, -900, 8506, 874, -20665, -13355, -18781, -26443, -24331, -20159, -6559, -18327, -14458, 1618, 11417, -2733, -28004, -23247, -10576, 2844, 9289, -3557, -29153, -32475, -36729, -49460, -45288, -34293, -24917, -14988, -8913]
14719h913M470j2570j6909P686J8752J0012m152J5588m148n015N376J665n567
14706F275q365q915J325j10J3780L6950M916l1595k8511L001O232l933n847O897
14692g900L763R15r052J866j015L230j009J3814k534j2906n376N978M021J2371
14678F166J595P851q950r012j7K55L090K3837k072j2782J27r369O096L55j1011
14663c841k414p920J4795K0101j2935k1739J4976R076L207o801l016k442O91p675
14649e937L999P203K789j953p514O583L094l556n502l177L717j473J3639k423
14635I489L909m413m893l960o775r10R294L706m833P61M913j1280K271N884L025
14620F188K542j059o319n295p111j2214j6949Q948Q697L150J944l264p566l478
$$ y = [-8913, -4443, -17013, -33922, -26236, -7484, 2528, -1624, 13964, 9816, 4801, 10177, 11842, 6275, -2090, -11005, -9680, -9790, 3990, 40940, 45856, 14261, -14250, -11249, -5017, -8950, -14797, -7900, -4137, -3222, -12274, -10408, -11423, -8193, -9202, 4612, 2078, -10828, -16204, -10226, -6205, 6166, 7761, 15612, 6662, -2350, -2367, -2112, 978, 24815, 22743, 9961, 10088, 719, 6815, 7170, -3841, -6255, -14175, 620, 20721, 7786, -13953, 1023, 10099, 13306, 6505, 3489, 1047, 1738, -5937, -1938, 5265, 8054, 6101, -1413, 5170, 8264, 4708, -794, -3971, -254, -1727, 11912, 9489, 13398, 8985, 4092, 132, -6643, -7553, 1741, 5447, 614, 1375, 6288, -4992, -2721, 3163, 6188, 8730, 7671, 1352, -3943, -11054, -23268, -40217, -31269, -22572, -19422, -17478, -20742, -28308, -31786]
14606c1786K980J0001J7564O741m51q989J810K2179J1666k256m627j5402q410
14593A020K1530J0644j6248j3330J23J9257p692j4594k116P66j7012J832J1046
14580d774P83J8783J7891l18k182n928Q915J3550M178j3058k0095K580N319l96
14566B5248N129j3744k3282j190J3803K0163N597M962j5900K197Q850r604k55
14553B1974Q67J0649j503p444J7710Ol2634k034J4387n455n260j822l863N168
14539A0746r425k7286n663J924J1519J3843K1169L260j2682j0571k429L070J3968
14526A1443J4157J0226n057q294L902N530O532K30P3L17j1607J0277q380k0185
14512I164l51k054Q056L099l11j7642J7942p333j0608K1193J0631j1314j3572
$$ y = [-31786, -28806, -18805, -1241, 5500, 5049, -3940, -2130, 20049, 31715, 29459, 24832, 9430, 1020, 22550, 33194, 16946, 3616, 3739, 22996, 15304, 710, -1406, -640, -17652, -15820, -4774, -3991, 14792, 32683, 32365, 30183, 24255, 33170, 46720, 50898, 37840, 17745, 20325, 25644, 25248, 30377, 16633, -6649, -7839, 5964, 26127, 31724, 36686, 20786, 22983, 31833, 22229, 21974, 22841, 33490, 31987, 24543, 42253, 42259, 9625, 7591, 21978, 16523, 11263, 9441, 5578, 10746, 1321, -25965, -31628, -29704, -18185, -4342, 16827, 20087, 7405, -3166, -5595, -2525, 11443, 25600, 35826, 30769, 22475, 26377, 31907, 38439, 38669, 38742, 39059, 27452, 37729, 29349, 9164, 8813, 6759, 14815, 17914, 17603, -39, 17903, 10570, -38, 21155, 31786, 20472, 6900]
14499F900J8984R090n539j1073j5406O165j384k034J3971Q833p691o718J9296
14486C3394o749n877P13J0116l108r047J2141M785M005q293k4700k0095j736o699
14472b1150K5856L2722N367k937P450r478j5225q803Q564N154N652n955l342k937
14458B0938n620J847J759P328J6229p330N574J591k156q143j8948r156o738J4742
14444A1917J1716J9998o805K20K608o739j8503J807O229n764J2694J5240L904
14431D8522q228j7793J104K018j387j805m862M244l475l742n215L751K5064N151
14417D3347j964j4627M887j062j7607o430k091N551o003m131K2764J0967J38r163
14403B4576N54j3595m526L715J047N716p627J1063L96R12J2151p314l666O010
$$ y = [6900, 25884, 34974, 29435, 18362, 2956, 9121, 7737, 5703, 19674, 28507, 20816, 14098, 33394, 26645, 20768, 21481, 31597, 28489, 19442, 31583, 36368, 40373, 32080, 7380, -12715, -14451, -21150, 4706, 37428, 42795, 39858, 47308, 37830, 22605, 13802, 22366, 27520, 33172, 27217, 23875, 20938, 15318, 17165, 18924, 26252, 42481, 35151, 40725, 42316, 40160, 32017, 13069, 3913, -2825, 11917, 23633, 43631, 36826, 37046, 39654, 32915, 14412, 16219, 22448, 16684, 29378, 44618, 48522, 40294, 22501, 23605, 25623, 24236, 22431, 17569, 21813, 18338, 14596, 9381, 13132, 38196, 43347, 41383, 26756, 31643, 30581, 12974, 6544, 4453, 10004, 4001, -130, 22634, 33601, 33739, 24576, 25130, 11535, 7009, 10724, 11771, 17487, 9860, 20923, 21319, 22231, 34382, 27068, 23402, 29412]
14389B9412L201m522m142P549J380J0568L215k193M001l611j6733n640j484O843
14375B7844p784j7646M524L373P444k704p26j985k478j775J980r714J2177P452
14361A9982r367j596N716o241n112L421P861n383K721J963J4744Q317o990J0432
14347D0468M784j2723p438J3718j0408j061r43p09p184K2288Q526j1846j5064
14334B2408j5525r057R936j646P981k452K4072R413m305j0547r267o042r954j705
14320C310N305l268j1190P945O545K1994J1455l402n782k1208j4903M372J2400
14307A3573P914n208Q571K0387K640K679l143p857M153J1806K1697j7543j3887
14294D5782j2603j339K183r529K026J4098K152n210R447j0382k2776K531R554
$$ y = [29412, 32613, 28091, 23949, 31498, 32878, 43446, 46661, 44468, 48469, 44858, 28125, 22485, 21001, 27844, 20060, 2414, 6938, 10311, 17755, 15051, 14325, 12340, 9862, 8087, 10067, 353, 12530, 19982, 10615, 9019, 14735, 8494, 3382, 6803, 14664, 9281, 12002, 13965, 28709, 37026, 30036, 40468, 45252, 32529, 25091, 38809, 28401, 27340, 26397, 25688, 18504, 40792, 49318, 37472, 22408, 6883, -2174, 7762, 6116, 14097, 11645, 35717, 45130, 40825, 30278, 21011, 14969, 5015, 3310, 8615, 5347, -5843, 2102, 8647, 30641, 42096, 38694, 32912, 11704, -3199, 1173, 13573, 21487, 16279, 24850, 45237, 47877, 50556, 47413, 39556, 43709, 55515, 77212, 59669, 45782, 33179, 31840, 34023, 24494, 26520, 40618, 42770, 37560, 47007, 36625, 13849, 16380, 25934]
14281B5934J960j906l567N384q488J3981q000m110P53r873l462P465J3951O461
14267C6483n778j127k443K624k6750K391J8699R891J1740R824j0398j2040j882
14254C1234K3020j5049j6631j245j474J5774n6l122J732j3818M597J3997K7444
14241F6403m125l7571j2159k801j521O89P422r55O27N022Q120P573j1497j178
14227B4049J5318p166j3673J574M100p54R2n450R08j888q3N734M757L1721J7977
14212G7216k367j0817m419j300p850j2114N19Q491j5148j0946J0911J7486O293
14199E5955R109o184N83P26N723j750j9015j6631K19J7291N660J18J20j0322M433
14184D6035J952j1034r631O077R510J1079J936k04K622o910j2959j4190q947p707
$$ y = [25934, 27894, 25988, 22421, 27805, 19317, 33298, 25298, 21188, 21941, 12068, 8606, 16071, 30022, 36483, 30705, 29578, 27135, 29759, 3009, 5400, 24099, 33990, 45730, 55554, 45156, 33116, 31234, 54254, 39205, 22574, 21329, 19855, 35629, 35573, 32451, 34183, 20365, 24962, 38959, 66403, 62278, 24707, 12548, 9747, 8226, 8915, 16337, 15382, 16009, 21031, 29151, 36724, 25227, 24049, 39367, 32201, 18528, 20102, 24202, 23448, 23540, 18090, 18998, 17110, 17027, 22761, 27518, 59239, 77216, 74849, 64032, 59613, 58313, 50463, 38349, 38868, 47359, 32211, 21265, 32176, 49662, 55955, 65064, 58880, 59463, 60189, 65912, 64162, 45147, 28516, 28735, 46026, 51686, 51804, 51924, 41602, 46035, 47987, 36953, 27322, 33399, 42909, 53988, 55924, 55720, 58342, 51432, 38473, 24283, 15336, 7629]
14170G629J7771K4670N895j5037n40L965l170l726O266K0768J145j8807m254o712
14156C5863j3156J838M30K62J0837N517P283J2444j1280k7515j5059J0132J0003
14143B7599J3933o690k649q1M855j82J0027k534L53j1118j5321K870Q474L88J292
14128C1216J0687J2824O178j0942j2175J1795M027r23O330K335M490J9394j340
14115H3896j3625k663j4523j5363o100m345M480P881r516l359M593K0304J3081
14102F4741q88m187R320K748l977l015r833J419j2262j919q365j3811j3596O513
14088A2888J7546j732l090j136l381j054J6068O711K816K737n713k023Q303k367
14074D6573K109Q988k578m792j895o154j4603q537j290N011k392J5432n398R665
$$ y = [7629, 25400, 50070, 55965, 40928, 40388, 44353, 41183, 37457, 43723, 64491, 65636, 46829, 42575, 35863, 22707, 24545, 24975, 25237, 36074, 41591, 48874, 61318, 50038, 22523, 7464, 17596, 27599, 41532, 34842, 32193, 32112, 36967, 36785, 46812, 44278, 44631, 33513, 18192, 21062, 29536, 29924, 31216, 41903, 54727, 60905, 49963, 37788, 49583, 53610, 52687, 59017, 61352, 65842, 85236, 83896, 70271, 67608, 53085, 37722, 31622, 27277, 31757, 39638, 30122, 26763, 31356, 51660, 64741, 63853, 59666, 68986, 71734, 67757, 64742, 54909, 56328, 44066, 42147, 33782, 19971, 6375, 12888, 30434, 28702, 25612, 24476, 21095, 20041, 36109, 42820, 45636, 48373, 42660, 40637, 48940, 46573, 48682, 57670, 55092, 50300, 48405, 42251, 27648, 19111, 17821, 22832, 20440, 35872, 30474, 40139]
14060D0139J9767Q731M385q623j5062j7247K626J6024l9j119l743K0J1740R118
14046F6717M565N23o141l607q884j5013p415o63K0197J0284j820L012k845q606
14032E0304j5238K0215J2951n532k2274j1321R605j1355J1304J9921O76j0606
14020D8650p160J8028n746j1920j0231J5756N821K568j890O452J982j7288j1434
14007C3588O623K350K278R027L971k0104l767r471n409J6407O182J0898K550j1542
13993D3581n715Q703K262M507j028k323J2335L605l039k3771k0152J5542J8173
13980E2680R0n836o778J2833L235k766k513R744q956J817m160m817j0344o149
13966B8080m641j318O279k076L058J3594J5485q556r884o298q339M770J0846l295
$$ y = [40139, 59906, 68637, 73022, 64399, 49337, 32090, 34716, 50740, 50701, 49582, 45839, 45859, 57599, 66717, 71282, 71805, 65664, 62057, 53173, 38160, 30745, 30082, 50279, 60563, 58743, 61755, 58910, 50304, 35066, 55281, 68232, 62700, 40426, 29105, 38710, 27355, 38659, 58580, 59256, 48650, 41490, 59518, 53772, 41852, 31621, 47377, 53198, 55766, 53876, 60328, 62310, 45022, 33588, 40211, 42561, 44839, 53866, 57837, 37733, 33966, 24495, 19086, 35493, 41675, 52573, 55123, 43581, 37866, 46569, 48831, 53338, 52310, 49987, 62322, 65927, 62888, 39117, 18965, 34507, 52680, 52770, 46934, 40156, 52989, 56224, 53458, 50945, 60689, 51733, 53550, 49390, 44573, 34229, 28080, 23439, 22121, 28400, 26324, 29382, 42976, 58461, 49905, 40021, 33723, 25384, 30154, 41000, 37705]
13952C7705j5142M598J1426M572L234R349J1024K3663j7075j9382m51r190N682
13939E0013j535r10n445L208n713n684J2774J863M305L141j3886j0258n870j1776
13925A4227m13J6585R031j3141o581M4M884M249L063J873O807P189j1040j3118
13911B3659K4108Q318m340q829m682j4741K081J982N922R482Q282o563N622J796
13897E2097j4183O33R416J1953J6951K907L750q615r122m25K575m497N399K579
13883G1418m610j702k376k44l063O87N487p012J1656m98j3167j2860J660L956
13869D9332R879O532J0058m997j1428j285j1377j0428J6698Q137q590o283L71
13856D6619J0091J794o747J312L304m733M429l37p525L174K404J2590J4810q063
$$ y = [37705, 22563, 27161, 38587, 43159, 46393, 55742, 66766, 90429, 73354, 53972, 53521, 44331, 50013, 48478, 47568, 42123, 45331, 39618, 33934, 46708, 48571, 52876, 56017, 42131, 31873, 26003, 14227, 13814, 30399, 39430, 26289, 19708, 19752, 24636, 28885, 31948, 33821, 40628, 47817, 36777, 23659, 47767, 56085, 51745, 42916, 38234, 23493, 25574, 27556, 33478, 42960, 51242, 44679, 50301, 52097, 37914, 38547, 47963, 59916, 76867, 79774, 83524, 74909, 65787, 65362, 67937, 63440, 68839, 71418, 66808, 65106, 62730, 62486, 59423, 60110, 65597, 58585, 70241, 69743, 56576, 43716, 45376, 49332, 59211, 65743, 75801, 70804, 59376, 58091, 46714, 36286, 52984, 61121, 52531, 46248, 46619, 56710, 58504, 51757, 53069, 56373, 51640, 56069, 55732, 48207, 51381, 53785, 66375, 81185, 73122]
13842G3122k702l005j2937l51L116l779k379J0686k988p665j7518k1742Q68J8903
13828C1629M143N880K387l219j3397r758L94J6111j893j108J5263j915q396J8570
13814E4691J7914k975r006j3161J0237J110k426k587O14k5798L182M116J9877
13801E5788N514j5421L309j2014J3856K0623p260j9786j7975J3996R720Q038M737
13788F3125N22K172K050j0049j1582m067R772J7376k620j419l798j3649n923M889
13774D6799P967p036j358K2582J4911K239r502k2042r836j5932J285n540J4985
13761C9522K563j788K0657J8550J050j9229j1987P291q400M858R652j434N699
13748F7004J941N775j2888j1968m731L856J3307K2970N954K595m292m558k263
$$ y = [73122, 70420, 67415, 54478, 54127, 57243, 53464, 51085, 61771, 58783, 51118, 33600, 11858, 12726, 31629, 35772, 41652, 44039, 40820, 27423, 17665, 18059, 34170, 32277, 31169, 46432, 44517, 36121, 54691, 72605, 69630, 60624, 47463, 57700, 58810, 56384, 53797, 54411, 28613, 31795, 35911, 55788, 61302, 45881, 49190, 37176, 51032, 71655, 64395, 44609, 26634, 40630, 50350, 58388, 63125, 63647, 65819, 67869, 57820, 46238, 42171, 51943, 69319, 66699, 65280, 61482, 47833, 41910, 46799, 54766, 47730, 46372, 68954, 83865, 86104, 76602, 54560, 44724, 28792, 30077, 24537, 39522, 42085, 40297, 60954, 79504, 80554, 61325, 49338, 56629, 48229, 53087, 62739, 61305, 67004, 68945, 74720, 61832, 49864, 45133, 48989, 62296, 85266, 91220, 93815, 89523, 84965, 82702]
13735H2702o788n009N048o353j4051J991o190p284N583J1221l290o318J63k960
13721D8465J5845Q154j2148j7644J4310J1093k427O164p653k182n582j0026L931
13708E0300j3130O154J9623O130P574o04k7174O669K3278J5637L276j3915j9005
13695F4813L859J1134K234j8903j0120j0708r393Q189Q117l384J8238R685p38
13682G3023Q450p231j5489O18p377R160M890K742m961N239P456l957m458O105
13668G4210l552l406k2773Q94o987J2118P013k648m911l082r352L663J6092j3721
13654D3558j5880q192Q441J6592J0494j041J599r055O277N065J932o992N446P074
13640F5318J6221n341q447K029p41k6875j4154R410J8013O666p1L810l911o117
$$ y = [82702, 75914, 70905, 75953, 69600, 55549, 57540, 51350, 44066, 49649, 60870, 57580, 51262, 51425, 48465, 64310, 72464, 60316, 42672, 56982, 68075, 65648, 71812, 64159, 61977, 56395, 46369, 50300, 37170, 43324, 62947, 69077, 76651, 76047, 48873, 55542, 78820, 94457, 97733, 83818, 64813, 68672, 79806, 82040, 63137, 53017, 42309, 32916, 41105, 49222, 45838, 64076, 73761, 73023, 81473, 74242, 58753, 59371, 51994, 61154, 66044, 68786, 63825, 69064, 76520, 72563, 68105, 74210, 70658, 67252, 44479, 45373, 38386, 50504, 57517, 54869, 49958, 46876, 37524, 41187, 57279, 43558, 27678, 19486, 27927, 44519, 55013, 53972, 55571, 46516, 52793, 57858, 59790, 52798, 58244, 65318, 81539, 76198, 67751, 69780, 69039, 42164, 28010, 37420, 55433, 62099, 62028, 65838, 61927, 55810]
13626E5810m167J6239J203j5502n209P604L717L898J1118R419l709M535m386n94
13612G9976j2224J2303K326L42J379k4411J2085O130n235m497j9948o173J0174
13599E2227L251Q844p799J4890k441K911q139r302Q775j0158r76J4757K530L955
13585G3325k505Q418J1321j605K465j2236j1751P977J9232J271j9104l155L689
13572G7342O114j4670o442Q286j951j484O480Q541l710j0493O163p797j0438J035
13558E6976J3847J0049P258j263o498M276n131k666M590l709K655J2806O249o102
13544I3337j6339Q018r89j632J4389j2083k514J4781L586L363K345K716q37q411
13530I9730j899K0756j0027l2670q867L512j799J136l223j818P976K3323q829
$$ y = [55810, 51643, 67882, 69085, 53583, 48374, 55978, 59695, 63593, 74711, 84130, 80421, 84956, 80570, 79976, 67752, 80055, 82381, 82723, 84102, 59691, 71776, 77906, 72671, 68174, 48226, 42053, 52227, 55478, 64322, 56523, 71413, 68972, 71883, 63744, 54442, 63217, 53059, 52083, 66840, 69370, 73325, 70820, 79238, 90559, 88954, 91419, 79183, 67432, 75409, 94641, 95912, 76808, 73653, 77342, 83456, 68786, 62344, 70630, 68679, 67195, 73675, 82216, 78506, 68013, 74176, 66379, 55941, 56976, 70823, 80872, 88130, 86867, 80369, 84645, 79514, 76848, 81438, 77729, 80384, 93190, 99439, 93337, 76998, 85016, 84027, 82395, 96784, 84701, 82187, 96968, 100554, 103917, 106262, 108978, 108141, 99730, 97831, 118587, 108560, 75890, 67023, 70535, 68736, 69872, 66649, 64831, 72807, 96130, 87301]
13517H7301j4824M631R038m784o86l631m434L486m597K692J7526j1243l402K980
13503H0053k30l676j670N354P251N870N25j9934r959j271L197K2853Q407J987
13489I8757q718l003n51p346J0153M468J4205J293j2421r944o792m70j1762j1105
13475E6764l284j0002K4920j438q307J3357J743j072J2180N689J0905j3366J101
13462H9190Q446j6799m453K4063l970O035P099k1284q97J5484K268j0482q316
13449H6384o670M746O564r262N579L814p082j506J612j3314K5146O018j862L255
13435A03422n793L34m301j6713L856J0604n815l450N936M754r81J1611P578m794
13421A06248k6511J6843R627j2089k8308o237M918N920R592j942R216R937n391
$$ y = [87301, 72477, 77108, 86146, 81362, 80676, 77045, 72611, 76097, 71500, 74192, 91718, 80475, 77073, 80053, 79823, 76147, 74477, 79831, 87082, 92952, 93477, 73543, 63584, 62313, 65510, 88363, 96770, 98757, 90039, 87036, 86485, 79139, 89292, 93760, 107965, 109258, 96837, 86893, 80101, 79631, 67869, 56764, 53480, 43478, 68398, 66960, 58653, 72010, 73753, 72681, 84861, 90550, 101455, 88089, 89190, 97636, 80837, 76384, 100447, 96477, 102512, 109611, 88327, 87430, 102914, 105182, 94700, 86384, 79714, 84460, 91024, 81762, 87341, 91155, 84073, 82567, 84179, 70865, 96011, 102029, 100167, 103422, 97629, 97963, 93662, 76949, 80805, 91409, 85594, 82144, 88080, 92834, 91853, 103464, 111042, 106248, 79737, 96580, 106207, 94118, 65810, 59573, 64491, 70411, 80003, 78061, 87277, 97214, 91823]
13408I1823R697k1124r681J2644K2935r809j8749L403J1108M266p587j4037j9778
13395E5111J184L616J1215P530j459J6560L712P006j2970J108K557K455R028R322
13381A15975L954O910m304j1814j5294l933J5778m963j1728p264K822R310l473
13368I1976p138k3555r263J4730M843L314R267k228J258j1174m700N761J4427
13355H7518J5151N922P895j5780j1711J0039M559K0341K442k958o869j2107n103
13342I9339M361R34N80J0162q91r142L331K292j6467K485r99q622K750J9669R860
13327A19642j1501k5020n926L906K3537J0253n914p63L339l439O045R539L605
13314A27303K43j2300j2859j9114k22J5332J307R537j0212r789R099J2918j1371
$$ y = [91823, 101520, 80396, 70715, 83359, 106294, 96485, 77736, 81139, 92247, 96513, 88926, 74889, 55111, 56295, 59911, 71126, 78656, 77197, 93757, 97469, 104475, 91505, 92613, 95170, 97625, 106653, 115975, 119929, 126839, 122535, 110721, 95427, 91494, 107272, 102309, 90581, 83317, 86139, 95449, 91976, 84838, 61283, 52020, 66750, 71593, 74907, 84174, 81946, 83204, 72030, 67330, 73091, 87518, 102669, 108591, 116486, 100706, 88995, 99034, 103593, 123934, 126376, 123418, 116549, 104442, 99339, 103700, 104634, 105214, 115376, 114485, 105343, 108674, 110966, 94499, 96984, 95985, 87363, 90113, 109782, 119642, 108141, 83121, 77195, 81101, 104638, 114891, 108977, 108214, 111553, 108114, 114159, 123698, 127303, 127546, 115246, 102387, 83273, 83051, 98383, 99690, 109227, 99015, 89226, 98325, 111243, 99872]
13301I9872L014m865N701j5419p305j0913l285k2L551J344o372K754K1573L447
13287I3075J7943O759k1805n560P233P472J3774K265m918m560r733p048M100p347
13273I1650j5170N604K3887J5486O05k3992j1894L713J7211N964K913O722j4331
13260A08368j6784K873J1907m911L800K2453M931J6140j241m378j6178K268q46
13247A28402j508N92l604K2266J3220j8024j1836o83j0110k3427j42J3302n940
13234A02508M171J6938p054k2043K678J763K162j633P853l973K1073J8956j1837
13221A31562M121j0064j0047o709l089Q792O724k697j6436j4300p219O152J5436
13208A02226j2846j0019J6766N925j5522l2j0055P124K0257O553N205J843r445
$$ y = [99872, 102886, 98021, 103722, 88303, 80998, 70085, 66800, 66778, 70329, 71673, 65301, 68055, 89628, 93075, 111018, 117777, 95972, 90412, 97645, 105117, 118891, 121156, 116238, 111678, 101945, 94897, 98997, 91650, 76480, 82084, 105971, 121457, 122062, 98070, 86176, 89889, 107100, 113064, 115977, 122699, 108368, 91584, 94457, 106364, 101453, 105253, 127706, 132637, 148777, 147536, 143158, 126980, 129248, 128402, 126894, 127486, 123882, 146148, 159368, 141344, 129508, 128825, 118715, 95288, 95146, 108448, 102508, 106679, 123617, 116563, 94520, 97198, 98961, 101123, 99490, 107343, 103370, 124443, 143399, 131562, 135683, 125619, 115572, 108863, 105774, 114566, 121290, 118593, 102157, 87857, 80638, 86790, 102226, 89380, 79361, 96127, 102052, 86530, 86498, 76443, 83567, 103824, 110377, 115582, 117425, 107980]
13195A07980L959J4385j7494O2k532L951Q464n463j9678r433L02O975J6514J343
13181A09335j963J088J1698J763p324L162J2823N345m326j2392J661P0k1558j7050
13167H2332J0546K1265r680m731J8463l763P445L797k1664m286J6834l89J8350
13154A34519J3493M304l430R510j6479j5841J852o39o315J858l965P705j1341
13141A15231k2558j0959M322J5584J5371Q085k405J1011J1777R75j1833k347M49
13128A32703q37j0038p72R327J1638q377J22j4797k5297Q411J5706P897o976l711
13114A14999o777m055Q132R448M215l802P827n05m817J795O952j937J96j0637
13100A21034j1811K1257m467n24r425n542j334O1J2275N83n413M806J0722N974
$$ y = [107980, 111939, 126324, 108830, 108892, 106360, 110311, 118775, 113312, 93634, 84201, 84503, 91478, 107992, 109335, 107372, 108460, 120158, 121921, 114597, 117759, 130582, 135927, 131601, 119209, 120870, 120940, 99382, 82332, 92878, 114143, 104463, 99732, 118195, 114432, 121877, 125674, 104010, 99724, 116558, 116169, 134519, 148012, 152316, 148886, 158396, 141917, 126076, 127928, 127289, 120974, 122832, 118867, 126572, 115231, 92673, 81714, 86036, 101620, 116991, 125076, 122671, 133682, 145459, 146434, 134601, 132254, 132703, 131866, 121828, 121056, 130383, 142021, 133644, 133766, 118969, 93672, 102083, 117789, 125686, 118710, 114999, 108222, 104167, 112299, 121747, 125962, 122160, 129987, 129482, 124665, 126460, 133412, 131475, 131671, 121034, 109223, 130480, 126013, 125489, 116064, 110522, 109188, 109249, 121524, 122107, 116694, 121500, 132222, 138196]
13086A38196J125r748j685n473P672J069J4698o716n391Q446j0339k640J2012
13073A41226r98O918k89j576l349m048O008M160j0828j0165n931O907k41K071
13059A29865n14m269J670J780L960N294n361J3294r683O601J046P740J3225q997
13045A55651k3413j3097J2797r84L91P948n26K800m450m105p458J7655O051O148
13031A55408J2758o435O554P354k062q848l335r475j1342N129Q734J5238O743
13018A76421j4801j4820r395J4129j5734j272n45l695Q426n279q484N121P185
13005A37257J181j6653M020K7018r342j4116o73J961O835Q846j981L488p874p65
12991A39202j6632J1904P659L678j6157n495M920K2770j4900p177K4639K3544
$$ y = [138196, 139321, 129573, 127888, 122415, 130087, 131156, 145854, 139138, 133747, 142193, 131854, 129214, 141226, 140228, 147146, 146857, 145281, 141932, 137884, 143892, 148052, 137224, 127059, 121128, 128035, 127794, 129865, 129351, 125082, 126752, 128532, 132492, 137786, 132425, 145719, 136036, 142637, 143683, 151423, 164648, 155651, 132238, 119141, 131938, 130954, 131345, 139293, 138767, 141567, 137117, 133012, 125554, 143209, 149260, 155408, 168166, 161731, 168285, 175639, 173577, 164729, 161394, 151919, 140577, 145706, 154440, 169678, 176421, 161620, 146800, 137405, 151534, 135800, 134528, 133983, 130288, 138714, 133435, 124951, 130072, 137257, 138438, 121785, 125805, 152823, 143481, 129365, 128692, 130653, 137488, 146334, 144353, 147841, 139967, 139202, 122570, 134474, 142133, 145811, 129654, 124159, 129079, 151849, 136949, 129772, 154411, 177955]
12979A77955j6191k2527o19P78J0667m729q513K074M205K115O340O273O776o360
12965A58244j7834j211m209K3522m734j8283R479L618K113m31J1561n591m151
12952A52093K827J943j4984p628k1300K1593r004J084J1720J0055n066q386O52
12939A35599n415P863K1777N924m194m577k07j0092P357J702r685j5665j4044
12926A16343M109l273O684o95k344K0254r889P632K9577l17Q621M713J2274J3897
12912B07586j5400j5469j3275J339J4685J3341M992N547q855o049k930J2186K1381
12899B19079K3117j2431m1577l6087l2897l3424j6116J1476K6840K3183J6365
12888A47528R973J102k670J2800p211K841k22n773k483n95R703m066J8025M553
$$ y = [177955, 161764, 139237, 138618, 139396, 150063, 145334, 136821, 138895, 143100, 145215, 151555, 157828, 164604, 158244, 140410, 139199, 134990, 158512, 153778, 135495, 144974, 148592, 150705, 150274, 161835, 156244, 152093, 154920, 156863, 141879, 134251, 112951, 134544, 125540, 126624, 138344, 148399, 143333, 134947, 135599, 130184, 138047, 159824, 165748, 161554, 156977, 156770, 146678, 154035, 155737, 146052, 130387, 116343, 120452, 117179, 123863, 123168, 120824, 141078, 131189, 138821, 168398, 168081, 176702, 181415, 193689, 207586, 192186, 176717, 163442, 164781, 179466, 192807, 197799, 203346, 194491, 188442, 185512, 197698, 219079, 242196, 229765, 188188, 152101, 119204, 85780, 69664, 81140, 107980, 131163, 147528, 157501, 158603, 155933, 168733, 161522, 164363, 164141, 158368, 155885, 155290, 164993, 160927, 178952, 183505]
12874A83505j3806J1703J6602j2444j2154J0366l112j0483j0489j8094q737J0961
12862A43818Q63L017J3704j0762J437l133J854j5626J2040P951J4275j617l173
12849A64648j7159R51L736m005lJ8692j2410j1000p991J0185J2428K1305R677
12836A89054j3617j6124k0893o11O610J7282J2902p253r457l46N603J5217q809
12823A69558J737M973k98p249N524J5903n402j209k299j1949L021P954j3226L466
12809A70504O056k3377j4519R241K0416J4566J7180L159k749J796q178j6532p870
12796A69693q032Q499O462j1503k957J0865j4014L137J5945k302k983J6497l109
12783A86198p650k026J2180J1526M653o847k2318j9110M968L703m498k749J1490
$$ y = [183505, 169699, 181402, 198004, 185560, 173406, 183772, 180660, 170177, 159688, 141594, 132857, 143818, 144681, 147698, 161402, 150640, 152077, 148944, 150798, 135172, 147212, 155163, 169438, 167821, 164648, 147489, 148440, 152176, 148171, 148168, 166860, 154450, 143450, 135459, 145644, 158072, 179377, 189054, 175437, 159313, 138420, 137809, 144419, 161701, 174603, 167350, 157893, 157547, 163150, 178367, 169558, 171295, 176268, 175970, 168721, 174245, 190148, 184746, 183537, 181238, 169289, 172310, 180264, 167038, 170504, 176560, 153183, 138664, 147905, 168321, 182887, 200067, 203226, 200477, 202273, 194095, 177563, 169693, 161661, 170160, 176622, 165119, 162162, 173027, 159013, 162150, 178095, 175793, 172810, 189307, 186198, 178548, 176522, 188702, 200228, 204881, 198034, 175716, 156606, 161574, 165277, 160779, 158030, 169520]
12770A69520j891M444N263J0563r25k825J045L678q524j8934l057p216j24N989
12756A57006J1106Q730J3411j1331l782k926j904q509l581n924J072J3322P814
12743A74504L869P01J3172o44n142l675k2267j0206R083j537J7962L919M687J0336
12729A94762J8249j1578j3720j5540j937Q061K621P634K954p712p400K451N05
12716A79350K140O900L550l609M081j426J0442l167O361J0474k240j3473q368
12703A91015j3614M264O325j8554j658O351J3136J7514p885q420M043j7253M1
12690A75305N261K3748K214j127J4297m368j4089j9551j1367j308M912R621O729
12677A90277J0623J5688J85k8294o012Q877j5112j0723J4432M418M285R889m590
$$ y = [169520, 167629, 172073, 177336, 187899, 186974, 184149, 185194, 188872, 180348, 161414, 158357, 151141, 151017, 157006, 168112, 176842, 190253, 178922, 175140, 172214, 170310, 161801, 158220, 152296, 153368, 166690, 174504, 178373, 179074, 192246, 191602, 186460, 182785, 160518, 150312, 159395, 157858, 175820, 179739, 184426, 194762, 213011, 201433, 187713, 172173, 170236, 178297, 180918, 188552, 191506, 183794, 176394, 178845, 179350, 181490, 188390, 191940, 188331, 192412, 190986, 201428, 198261, 204622, 215096, 212856, 199383, 191015, 177401, 181665, 187990, 169436, 167778, 174129, 187265, 204779, 196894, 188474, 192517, 175264, 175305, 180566, 204314, 206528, 205401, 219698, 215330, 201241, 181690, 170323, 169015, 173927, 183548, 190277, 200900, 216588, 216773, 188479, 182467, 191344, 176232, 165509, 179941, 184359, 188644, 198533, 193943]
12664A93943j2378M950J6206Q076J0746K306j2161j0664QL191R753J483k7182
12651A88277j4082P650K8247n635l356r85N732N372j4951j3587j5599n462Q050
12638A69671J1777k392J1036L0669O460p527p280n384p923K509l690q68l803n775
12624A87480J3592R869O00j2204J0317J16m778j5196k995K7011P32K048r650j2063
12610A94879Q34Q424n428k509r544N158L675J024M549Q873j3061j2691K1965J4049
12596B20197o311j4407K670J2711O7j3364J3791j446N098q170J898P367p441n943
12582B06717J026N028k064J380K269J818j4766M578J3290j6647k913J4312Q002
12569B22030K576J0155J1693l141j4365o467J1248q609n484J6879l937k2455r670
$$ y = [193943, 181565, 186515, 202721, 210797, 221543, 223849, 211688, 201024, 201032, 204223, 213976, 215459, 188277, 174195, 181845, 210092, 204457, 201101, 200116, 205848, 211220, 196269, 182682, 167083, 161621, 169671, 181448, 179056, 190092, 220761, 227221, 219694, 212414, 207030, 199107, 201616, 197926, 197058, 193255, 187480, 201072, 210941, 211541, 199337, 209654, 209770, 204992, 189796, 186801, 213812, 214544, 216592, 206942, 194879, 195713, 204137, 198709, 196200, 186656, 191814, 195489, 196513, 201062, 209935, 196874, 184183, 206148, 220197, 213886, 199479, 202149, 214860, 214927, 201563, 215354, 213908, 219006, 210836, 212734, 220101, 212660, 206717, 207743, 212771, 210707, 212087, 214356, 216174, 201408, 205986, 219276, 202629, 199716, 214028, 222030, 224606, 234761, 246454, 243313, 228948, 222481, 233729, 225120, 219636, 236515, 232578, 210123, 200453]
12556B00453K4r376M733M307l333P483N703p477R617J3545o716j5351Q321P104
12542B19037J2339q226j0068Q88J2742k057k997M754k2963p614K546J3411J6194
12529B27986j411k1307j5954J1324J2344Q98J3129k0268l8o928o71J5161O371
12516B20636p432n248j2077L072J2989r729L832J1975J7066l19m334j0007N079
12503B25503M394K944l525p892j463j1383n046o151l359L027J5636J4116r073
12490B17728J3305L546j6110j4670j3043J1043Q204O2J1136J1700J047q51N257
12477B38354J1012j0699J180m703k3427j231J7531K8220R572j8313J863M331r270
12464B44420J936M420j4523j4927J0721L378o438J065O945o208L81n531J48o858
$$ y = [200453, 200477, 191101, 195834, 200141, 196808, 204291, 209994, 202517, 212134, 225679, 218963, 203612, 211933, 219037, 231376, 223150, 213082, 213970, 226712, 224655, 221658, 226412, 203449, 195835, 198381, 211792, 227986, 226575, 205268, 189314, 200638, 212982, 213880, 227009, 206741, 206703, 199775, 199104, 214265, 220636, 213204, 207956, 195879, 198951, 211940, 202211, 206043, 218018, 235084, 234765, 230431, 220424, 225503, 229897, 232841, 229316, 221424, 219961, 208578, 203532, 197381, 194022, 197049, 212685, 226801, 217728, 231033, 234579, 218469, 203799, 190756, 201799, 210003, 210065, 221201, 232901, 233948, 233097, 238354, 249366, 238667, 239847, 235144, 211717, 210486, 228017, 256237, 265809, 247496, 249359, 253690, 244420, 246356, 250776, 236253, 221326, 232047, 235425, 228987, 230052, 236997, 230789, 231170, 225639, 225787, 218929]
12450B18929p121K589J6928K497q776p975O832J0363j0811R445R383m399J751
12437B39635J2772J0415K1953k932L683k5229O200J7461j5703k0654q342n793
12425B33466m324j404p36R723k434q989N255N945M872K002N406P826j0163j4605
12411B31840n730n882j3304J3162K0798J8360J8313L471p518J3895O675J8238
12399C12318l825j3138k8043j5469J409K636K557m81M304K869J0015J4131N318
12386B94601L188k0817j4005J3141n770p728K1456Q425q471n846j0175m82p539
12373B59978k3578L844J4544Q777L740n34n30j0616j1366O890M194j1332O959
12360B50970J1541m831p66Q735J561J0014R122o781M481Q39j2532J2829l06o967
$$ y = [218929, 211808, 214397, 231325, 233822, 225046, 217071, 223903, 234266, 223455, 232900, 242283, 237884, 239635, 252407, 262822, 284775, 281843, 285526, 260297, 266497, 283958, 268255, 247601, 239259, 233466, 229142, 227738, 227002, 236725, 234291, 225302, 230557, 236502, 241374, 243376, 248782, 256608, 246445, 231840, 226110, 220228, 206924, 220086, 240884, 259244, 277557, 281028, 273510, 287405, 294080, 312318, 308493, 295355, 267312, 251843, 253252, 255888, 258445, 257964, 262268, 265137, 275152, 289283, 294601, 297789, 276972, 262967, 276108, 270338, 262610, 284066, 292491, 284020, 278174, 267999, 267517, 259978, 236400, 240244, 254788, 263565, 267305, 266771, 266241, 255625, 244259, 251149, 255343, 244011, 250970, 262511, 257680, 256914, 265649, 267210, 277224, 286346, 279565, 284046, 284885, 272353, 285182, 284876, 277909]
12346B77909r557O59O08j376K515P203K0069j8485O979n223j0352M09P333K1476
12332C00167J4672k4722o826M706j2526k2910J0906J3957J0808J697k2703j689
12320B65537J0852n500o066P449p936J2358J2311J2358N252j4819j4266j0260
12308B67270m571J4281J5786j39j3447L824J4441J9170K292j2513k0676K598L280
12295B91596k384N611J479P396j424M587o024N380j892j17m156n271j0155J0474
12281B95100q834j3221l729L360J3447q89k515N436L849J5600K5722j1121n526
12268C16679q206n989J242J8835k653n468p848j6890m444J9459J6770N718j794
12255C25411o221P297P1j8128j5235L951o45j156J2173J5046o176K238o383j663
$$ y = [277909, 268352, 269011, 269619, 268243, 270758, 277961, 298030, 279545, 286524, 281301, 270949, 271358, 278691, 300167, 314839, 290117, 283291, 287997, 275471, 252561, 263467, 277424, 288232, 289929, 267226, 265537, 276389, 270889, 264823, 272272, 264336, 276694, 289005, 301363, 306615, 291796, 277530, 267270, 262699, 276980, 292766, 292627, 279180, 283004, 297445, 316615, 318907, 306394, 285718, 288316, 291596, 289212, 294823, 296302, 303698, 302274, 306861, 300837, 306217, 304325, 304208, 300052, 294781, 284626, 295100, 286266, 273045, 269316, 272676, 286123, 285234, 282719, 288155, 292004, 307604, 333326, 322205, 316679, 308473, 302484, 303726, 322561, 319908, 314440, 306592, 289702, 285258, 304717, 321487, 327205, 325411, 319190, 326487, 326558, 308430, 293195, 297146, 296501, 295345, 307518, 322564, 316388, 318626, 312243, 310580]
12241C10580j352J862J1222J8591Q724r872j6573k5988p2J2240K028k463M840
12228C13767J5219K408M280m140K456k80l875m544n309J4378J431R76k925j0604
12214C23238n02J7322O231K978m73m478k1844o603Q957J4487Q597p05K0432K1076
12200C88713O781j7540N730j5007O616O127J0244J3879L690J9729J3819K2020
12188D64801J3276J7902P024J2672J6130J2864n9572j27836j05280k7674M378
12177B28685J4978L1967K6506J4000K884R881J4376N50J7325N087j3607k2215
12165C30417j37J9530L0926J4916J8880k69k369J2965L482j9809M294O431Q144
12152D27401R635L5728J5175N234J4457K6826J2849J1296L0947L3572N5006P0532
$$ y = [310580, 309228, 311090, 322312, 340903, 349627, 339755, 323182, 297194, 297122, 309362, 311390, 308927, 313767, 328986, 331394, 335674, 331534, 333990, 333710, 329835, 325291, 319982, 334360, 335791, 336767, 333842, 323238, 322736, 340058, 346289, 349267, 348794, 344316, 322472, 315869, 324826, 339313, 347910, 347205, 367637, 388713, 395494, 377954, 383684, 368677, 375293, 381420, 391664, 405543, 409233, 428962, 442781, 464801, 478077, 495979, 503003, 515675, 531805, 544669, 485097, 357261, 251981, 224307, 228685, 243663, 275630, 302136, 316136, 319020, 328901, 343277, 343827, 361152, 366239, 352632, 330417, 330280, 349810, 380736, 395652, 414532, 414263, 411894, 424859, 428341, 408532, 412826, 419257, 427401, 437036, 472764, 487939, 493173, 507630, 534456, 547305, 558601, 589548, 623120, 678126, 748658]
12140G48658Q0527L4418q7604l39802m19354j93242J3644N8830P9626O9493L9697
12129H4891L7317L8999R244J6142J1139O61J2315J3551K845O472J7692J3504J6681
12116B81453K3846K5188M797M893p0l19M508J5524J3450L821M569Q788K1285M3114
12102D54847J4242J5611K8416M2325M1810O6119Q2019N6037l5997k39112m33829
12091I2488k97552j9890O8822M9402M1164M7722M9301L2092J6592K3329L1072
12080A34542K3802J634J2861k095P032R689L226P098K7263Q449O20J162K52j2133
12066B23402R025N584j9l99O644K0336J1048M659J1448R549k193N29K6553L6833
12052C62999K8047K5646j357n3130j12007j08950n7284p912J7473K9196K4588
$$ y = [748658, 829185, 863603, 775999, 436197, 16843, -176399, -162755, -103925, -24299, 45194, 84891, 122208, 161207, 170451, 186593, 197732, 198393, 210708, 224259, 227104, 233576, 251268, 264772, 281453, 305299, 330487, 335284, 340177, 340107, 339788, 344296, 359820, 373270, 377091, 381660, 390448, 411733, 454847, 469089, 484700, 513116, 555441, 597251, 663370, 745389, 801426, 765429, 526317, 92488, -205064, -224954, -156132, -106730, -65566, -17844, 31457, 63549, 80141, 103470, 134542, 158344, 159978, 172839, 170744, 177776, 187465, 190691, 197789, 225052, 233501, 234121, 235283, 235535, 223402, 232427, 238011, 237992, 237593, 244237, 264573, 275621, 280280, 291728, 301277, 299084, 299613, 326166, 362999, 391046, 416692, 415335, 362205, 250198, 141248, 83964, 76052, 93525, 122721, 147309]
12041A47309K8998J2138R975J1281j52j5407l584K0368L109J4729J4108k693R176
12028B49355P997K9445O620J3184j9356j9951j5944J230N64k042M259K0314n78
12015B75097j3690K066J2093O553O396J4144l743j3803m134O777J1438J0711j344
12002C08561j9752j9076N195J4154o634j5140R405K1071j1569k6431J0442J3452
11990B83678N853N898L331P452j365j3251P822m44r356j8074O266P560l740m650
11976B76980J2215L380P050J5147O306m595R615l96M547p650q623q294l658J711
11962C03735J5952q426j7919j0326J659J9373P740N05J2130k229R566j2550m772
11949C14438J7405m387l033j5768R258O405n522K894J4938O108m126j0409N499
$$ y = [147309, 176307, 188445, 198420, 209701, 209549, 194142, 190558, 210926, 214035, 228764, 242872, 240179, 249355, 257352, 286797, 293417, 306601, 287245, 267294, 251350, 252580, 253144, 251102, 255361, 275675, 275097, 261407, 263473, 275566, 282119, 288515, 302659, 298916, 285113, 280979, 287756, 299194, 309905, 308561, 288809, 269733, 274928, 289082, 282448, 267308, 276713, 297784, 286215, 259784, 270226, 283678, 289531, 295429, 298760, 306212, 304847, 291596, 299418, 298974, 289618, 271544, 277810, 285370, 281630, 276980, 289195, 292575, 299625, 314772, 321078, 316483, 326098, 325702, 330249, 322599, 313976, 305682, 302024, 303735, 319687, 311261, 293342, 283016, 284675, 304048, 311788, 312293, 324423, 322194, 331760, 319210, 314438, 331843, 327456, 324423, 308655, 317913, 324318, 318796, 321690, 336628, 342736, 338610, 328201, 333700]
11936C33700K870l0988m065K2308K4359R822l060q957m084m929n265J4957m25
11923C46243o992k310j439L770K238J5533j788k1334K919J6306q70q764L184M5
11909C46741r550M921L795R910J6005j4591R467N765J0251l73j5027j5442K681
11896C54553P728k76n593N284o597k722N667n590r920J8345L6515p12j1259j1101
11882C74322j3805N159J672j0075p206o545J3023J1361q34L351k99j6054j6975
11869C37095M909J1239R559j4066q469Q351M54r898q970M93R800J7995q232R419
11855C59679J4637O441l934j0192j1842M001J5885j0960j25j503j3856O047K9043
11842C83321J2841J8516Q901p376j4693k3027j467n50q114J8550J3204o833m546
$$ y = [333700, 336570, 305582, 301517, 323825, 348184, 358006, 354946, 345989, 341905, 336976, 331711, 346668, 346243, 339251, 336941, 335502, 339272, 341510, 357043, 355255, 333921, 336840, 353146, 352276, 343512, 346696, 346741, 337191, 342112, 345907, 355817, 371822, 357231, 366698, 372463, 382714, 382341, 367314, 351872, 354553, 362281, 362005, 356412, 361696, 355099, 352377, 358044, 352454, 342534, 360879, 397394, 396682, 385423, 374322, 360517, 365676, 367348, 357273, 350067, 343522, 356545, 367906, 367072, 370423, 370124, 354070, 337095, 342004, 353243, 362802, 348736, 340267, 348618, 349072, 339174, 330204, 330697, 340497, 358492, 350260, 359679, 374316, 380757, 376823, 366631, 354789, 358790, 374675, 363715, 363590, 362087, 348231, 354278, 383321, 396162, 414678, 423579, 416203, 401510, 378483, 377016, 376466, 368352, 386902, 400106, 393273, 388727]
11829C88727L597l443l08n860j440Q658J3554l067j2578j6007q244J2496R338
11816C85423J6302P015k3211J653j671L300L336J2900J399k330N414j3728j8719
11803C77083J1260k855r140l874n082O532L2126r302L421P23j8043N114J4675
11790D02638J1574o546o373n707q227n01J3965J8754j9622q953J3770J3710M542
11777D23024q851j017J6612L0566J5563O090j5870k9275j8350l623r36L842Q490
11764D26265o131l345m057M783L93Q979j0114k6567j846J0045P413k098L846O56
11750D08222j5727J1418J3643l152j3046R02J4327j465m816K063J5093o925p933
11737D12604J481R315M104m372R225M752J0131J0129j9480q332l887o271p900
$$ y = [388727, 392324, 388881, 388573, 382713, 381273, 389931, 403485, 400418, 387840, 371833, 363589, 376085, 385423, 401725, 408740, 385529, 387182, 385511, 388811, 392147, 405047, 406446, 404116, 409530, 395802, 377083, 388343, 385488, 376348, 372474, 367392, 373924, 406050, 396748, 400169, 400892, 382849, 387963, 402638, 414212, 407666, 401293, 395586, 387359, 386858, 400823, 419577, 399955, 391002, 404772, 418482, 423024, 414173, 413156, 429768, 460334, 475897, 481987, 466117, 436842, 418492, 414869, 413933, 417775, 426265, 420134, 416789, 412732, 417515, 417908, 426887, 416773, 390206, 388360, 398405, 405818, 403720, 407566, 408222, 392495, 403913, 417556, 414404, 401358, 402260, 416587, 415122, 410306, 412369, 427462, 420537, 412604, 414085, 423400, 427504, 423132, 432357, 437109, 447240, 457369, 437889, 429557, 425670, 419399, 411499]
11724D11499Q234K6380J8937J5691p902j8730j3716n401P765R508j163r746P548
11711D48904j868p108q438J198j443N912K2157J4177r511k1434r685p241J319
11698D26939J159J3177P425K523R027l109j6982q08J5324M263l920k807l505j1849
11684D36857O407J7963J0471J308k373q727j0553J1594M934j9068j0774R967l947
11671D44059j670J8718J5267P576J3612m919j7667k2168n666J2648O806N631J4588
11658D86815J2591O893N793P030j6330r514p918k1287o942J4038J1612P482j1586
11645D78677p008o21j1774R590k689Q495O500P923J6820o081r001M742R70k093
11631D94450J0304k137j1967L272j1782J1836K4237o725j0424K792R407J3405
$$ y = [411499, 419733, 446113, 465050, 480741, 472839, 454109, 440393, 434992, 442757, 452265, 451102, 441356, 448904, 447036, 439928, 431490, 432688, 431245, 437157, 459314, 473491, 463980, 442546, 432861, 425620, 426939, 428098, 441275, 448700, 451223, 460250, 457141, 440159, 439351, 454675, 458938, 455018, 452211, 448706, 436857, 443264, 461227, 471698, 473006, 470633, 461906, 451353, 462947, 467881, 448813, 438039, 448006, 444059, 442389, 461107, 476374, 483950, 497562, 492643, 474976, 452808, 447142, 459790, 466596, 472227, 486815, 499406, 506299, 512092, 519122, 502792, 493278, 485360, 464073, 457131, 471169, 482781, 490263, 478677, 471669, 471048, 459274, 468864, 466175, 474670, 481170, 489093, 505913, 499832, 490831, 495573, 496543, 494450, 504754, 502617, 490650, 493922, 482140, 493976, 518213, 511488, 501064, 503856, 513263, 526668]
11619E26668r135j4198K488l177Q201J81J5248m778r415P72q117k956m19M331
11605E05694J7669q013o795n695J053k703L228q035j4827L56K3865J0192n016
11592E10973j0802j604j0354J4804J5314k0475r770n008k662Q903Q387N877J7523
11579E21106j069j3362N4J7660P284m459J3485J9936m073j3387j8675j1085J092
11566E14507P916m29J8044K3605p420r0P562o398k1660K298J2497P618J3263k309
11552E69004j5309m807j1390j7309L200R923R78k913J6748O578l918L817K238
11539E56840r69j951L378j23j3715n414n110P069L1929Q471p681Q482j8221j7903
11525E45082n446q175R676J3116o260L970o304Q979J7859N421o090n911m593L941
$$ y = [526668, 517533, 503335, 505823, 502646, 510847, 511028, 526276, 521498, 512083, 512855, 504738, 501782, 501363, 505694, 523363, 515350, 508555, 502860, 503913, 501210, 504438, 496403, 481576, 481932, 505797, 515989, 510973, 500171, 498567, 488213, 503017, 518331, 497856, 488086, 483078, 480416, 489319, 497706, 503583, 521106, 520037, 506675, 506729, 524389, 531673, 527214, 540699, 560635, 556562, 543175, 524500, 513415, 514507, 522423, 521994, 540038, 563643, 556223, 556133, 563695, 557297, 535637, 537935, 550432, 558050, 571313, 569004, 553695, 548888, 537498, 520189, 523389, 533312, 534290, 531377, 548125, 554703, 550785, 554602, 556840, 555871, 553920, 557298, 557175, 543460, 538046, 532936, 540005, 571934, 580405, 572724, 581206, 562985, 545082, 539636, 531461, 541137, 554253, 547993, 551963, 545659, 554638, 572497, 577918, 571828, 565917, 561324, 565265]
11511E65265M70o368R277l926k510K4361n825k0424M671J9353j929q557j4363
11498E59495P879R067p119K814L527n889J072M613K7454L129n733P26j749j382
11484E97904m057K734j86m630r33N961r326j3q06J383J646N482N157j8451M750
11469E86615M639j1683K582J6364m00J2303j568Q135m029l382L406m441M937Q09
11455F14287Q416k150j4463n347p519r959R440Q714k154J8361J4032L948J011
11442F36617L707M754J756R384n100q227p756M83L72j3377r985J3423J7024q92
11428F42183j5925N034K1012N248j8067k1840k0437N92J0197J9070Q373p816o486
11415F21138M943J0225k758j156K750K487J2582j8420K563J5267N185m774k686
$$ y = [565265, 565735, 559367, 568644, 564718, 562208, 586569, 580744, 560320, 564991, 584344, 582415, 573858, 559495, 567374, 576441, 569322, 572136, 575663, 569774, 570846, 575459, 602913, 606042, 600309, 601035, 599286, 597904, 593847, 596581, 596395, 591765, 590832, 596793, 587467, 587454, 586648, 588031, 589677, 595159, 600316, 581865, 586615, 591254, 579571, 582153, 598517, 598117, 610420, 608852, 616987, 612958, 609576, 612982, 608541, 613478, 614287, 622703, 620553, 606090, 600743, 593224, 583265, 592705, 601419, 599265, 617626, 631658, 635606, 636617, 640324, 645078, 646834, 656218, 651118, 642891, 635135, 635618, 635990, 622613, 612628, 626051, 643075, 642183, 626258, 631292, 652304, 657552, 639485, 617645, 597208, 597800, 607997, 627067, 635440, 627624, 621138, 626081, 636306, 633548, 632392, 635142, 637629, 650211, 631791, 634354, 649621, 654806, 650032, 647346]
11402F47346J741J0992L372j11J5868J1112j8643r344K918L202n335K960L0878
11389F96956J4909m177l502p600j5773q523J3566j0027n469K5183J5424P550j7426
11376G01091k1461o556J5927n02q707N849M234L398J38o303K655n906k965j01
11362F80791J1977R618r496o037K392M012O809J6797l544j406l648m210j2002
11349F92053n562l713K0950O715J03J8239J9122m967j2384Q06J6117j9115j7343
11336G11021N480J3405K6j3030K392J2212J144J0564N052k576k1589j0476K3417
11323G37042N837N328P459p09L8Q60j0823o150p783l401N50Q504J7332k871q668
11308G42545N376N57j7651o068o037J5759J1450R023J6113P790l421p137Q701
$$ y = [647346, 649087, 660079, 663451, 663340, 679208, 690320, 671677, 662333, 665251, 668453, 663118, 666078, 696956, 711865, 707688, 704186, 696586, 680813, 672290, 685856, 675829, 670360, 695543, 710967, 718517, 701091, 679630, 673074, 689001, 688499, 679792, 685641, 689875, 693273, 693411, 687108, 689763, 683857, 680892, 680791, 692768, 702386, 692890, 686853, 689245, 693257, 700066, 716863, 713319, 711913, 708265, 704055, 692053, 686491, 682778, 703728, 710443, 710546, 728785, 747907, 742940, 730556, 731362, 747479, 728364, 711021, 716501, 729906, 729932, 716902, 719294, 731506, 732650, 743214, 748266, 745690, 724101, 713625, 737042, 742879, 748207, 755666, 754957, 754995, 755855, 745032, 738882, 731099, 727698, 728248, 736752, 754084, 751213, 742545, 747921, 748478, 730827, 724759, 718722, 734481, 745931, 754954, 771067, 778857, 775436, 768299, 777000]
11295G77000P988l210P681k759o769k3086j2137j01J2494m054P36J3646O555K435
11281G76419p360P200J3617J9155o480p467N12J7502J885j5969q175R913J3202
11268H13954Q042k302L276r693O979o454M909K0419R305j4850k3003r976R150
11255H09756N196P70k5729O122K9554J1500Q681M506o681o053J845J517J0520
11242H51504j5460r806l56J4797R117R224L855j1080j8073k292M48k790P227M480
11228H40795P076l170O180K877n804J5990p279M702j861L182K4478l207m888K362
11214H81433j394J0352O776Q568j0575o017N656j2390Q722K184m128K0025j5456
11201H93756l183J1793m908P63O561j1378j667k49M720L796K2190K2149O600k8793
$$ y = [777000, 784988, 781778, 789459, 786700, 779931, 756845, 744708, 744607, 757101, 753047, 753783, 767429, 773984, 776419, 769059, 776259, 789876, 809031, 802551, 795084, 795596, 813098, 814983, 799014, 790839, 800752, 813954, 821996, 819694, 822970, 813277, 820256, 813802, 818711, 839130, 848435, 833585, 810582, 800606, 809756, 814952, 815722, 789993, 796115, 825669, 837169, 845850, 850356, 843675, 837622, 839467, 840984, 851504, 836044, 826238, 825882, 840679, 849796, 859020, 862875, 851795, 833722, 831430, 831878, 829088, 836315, 840795, 847871, 844701, 850881, 853758, 847954, 863944, 856665, 861367, 859506, 862688, 887166, 883959, 879071, 881433, 880039, 890391, 897167, 905735, 895160, 889143, 894799, 882409, 891131, 893315, 889187, 909212, 893756, 890573, 902366, 897458, 898221, 904782, 893404, 891737, 891488, 896208, 900004, 922194, 944343, 950943, 922150]
11187I22150p385j1857k420J2067J2448o92o398o159L029J9863J2449J4173J4989
11174I76257p330o053j4684j1674r445P71q529J9648J3791M419p889J1241j8932
11161I41591j508P293J5614L046m299L126M594J1759p772K685K593r457J082J7663
11147I88010O508J27J1112J2532O494J991j47J227o143O703k857q140R609L043
11133A030069j3158p057N65n528P379M725J2892K498J617j6189L277L097j7384
11120A006803K382J4843J9959K544j0690k0329J2305J0258R349J3286Q377J603
11108A070690j2799n620O120K872j2031N922R391J3913J2519Q670P618J5541r71
11095A121835k018M308k751l436k6251J2240R767K3943J6000n265j208K0903m480
$$ y = [922150, 914765, 902908, 900488, 912555, 925003, 924311, 917913, 911754, 914783, 934646, 947095, 961268, 976257, 968927, 962874, 948190, 936516, 927071, 927842, 919313, 938961, 952752, 957171, 949282, 960523, 941591, 940083, 947376, 962990, 966036, 961737, 964863, 969457, 981216, 973444, 976129, 978722, 969265, 970347, 988010, 994518, 994645, 1005757, 1018289, 1024783, 1026774, 1026627, 1027854, 1021711, 1028414, 1025557, 1017417, 1027026, 1030069, 1016911, 1009854, 1010419, 1004891, 1012270, 1016995, 1029887, 1032385, 1034002, 1017813, 1021090, 1024187, 1006803, 1009185, 1024028, 1043987, 1046531, 1035841, 1015512, 1027817, 1038075, 1047424, 1060710, 1069087, 1070690, 1057891, 1052271, 1058391, 1061263, 1049232, 1055154, 1064545, 1078458, 1090977, 1099647, 1107265, 1122806, 1121835, 1119817, 1124125, 1121374, 1117938, 1091687, 1103927, 1113694, 1137637, 1153637, 1148372, 1147164, 1168067, 1163587]
11082A163587k8317k1494K1403J9642o954K667j1561o200J4505K2315k293p880
11070A159420m804n102m516n467J6456J8760m481L490J1739R806n434J140m7O036
11056A196996q759q302l629J0653J3161r647p719Q315J7468J6216J0108j6278
11044A218583j4584j1226J2418K0726J2927o151j638J0405M988m076R258R688
11032A261318K3407R662j6850Q238J6139j6668j9763J1212M412J0933p830O738
11020A290948R929R781j256n373k167R631K228N147J411L360O781K258J5859L869
11006A352406K3414k736M251m595j72Q546j648J4068N376k6934l285J3202K0784
10993A402677J5630J0179M849J29O780M485j0186J4611j041m707Q755O842N282
$$ y = [1163587, 1135270, 1113776, 1135179, 1154821, 1147867, 1150534, 1138973, 1132773, 1147278, 1169593, 1167300, 1159420, 1154616, 1149514, 1144998, 1139531, 1155987, 1174747, 1170266, 1173756, 1185495, 1195301, 1189867, 1191007, 1190960, 1196996, 1188237, 1179935, 1176306, 1186959, 1200120, 1190473, 1182754, 1191069, 1208537, 1224753, 1234861, 1218583, 1203999, 1192773, 1205191, 1225917, 1238844, 1232693, 1231055, 1241460, 1246448, 1242372, 1251630, 1261318, 1284725, 1294387, 1277537, 1285775, 1301914, 1285246, 1265483, 1276695, 1281107, 1292040, 1284210, 1290948, 1300877, 1310658, 1309402, 1304029, 1301862, 1311493, 1313721, 1318868, 1320279, 1323639, 1330420, 1332678, 1348537, 1352406, 1375820, 1373084, 1377335, 1372740, 1372568, 1381114, 1379466, 1393534, 1398910, 1371976, 1368691, 1381893, 1402677, 1418307, 1428486, 1433335, 1433464, 1440244, 1444729, 1434543, 1449154, 1448113, 1443406, 1452161, 1459003, 1464285]
10980A464285k356J4582p040K443K4525K1854J3008n970k220J3501K0320L556
10968A560488J0724K3935N128M790K3535J3455P256p059Q632J8101L5222L2266
10956A736473L2179J9992K0185M6552P1445O2091Q1901J03763J19271R6152j39312
10945B250692n85146p14986l01209L2690J14386J11360Q9575O4556O4853O1833
10935A188604M6761K2082K1310K3002K7793J0172K9750J2001K0146L3615k066
10924A433170J2311P583j344L170J0278J3734M848P854J1316O571q914o352K5707
10911A519932J1631N71K2074Q410j0400J3515J7546J1128Q61J2724K9427P533
10899A644952L942N300J5828Q405o364p903M987j326R006J8791k723K155N566
$$ y = [1464285, 1461929, 1476511, 1469471, 1471914, 1496439, 1518293, 1531301, 1525331, 1523111, 1536612, 1556932, 1560488, 1571212, 1595147, 1600275, 1605065, 1628600, 1642055, 1649311, 1642252, 1650884, 1668985, 1704207, 1736473, 1768652, 1788644, 1808829, 1855381, 1926826, 1988917, 2070818, 2174581, 2293852, 2390004, 2250692, 1665546, 950560, 649351, 682041, 796427, 907787, 997362, 1061918, 1126771, 1188604, 1235365, 1257447, 1278757, 1301759, 1329552, 1339724, 1369474, 1381475, 1401621, 1435236, 1433170, 1445481, 1453064, 1451720, 1454890, 1465168, 1478902, 1483750, 1491604, 1502920, 1509491, 1500577, 1494225, 1519932, 1531563, 1532134, 1554208, 1562618, 1552218, 1565733, 1583279, 1594407, 1595268, 1607992, 1637419, 1644952, 1648894, 1654194, 1670022, 1678427, 1672063, 1664160, 1669147, 1667821, 1676827, 1695618, 1692895, 1695050, 1700616]
10886A700616K3594J361j5496k190K0313K6608O488o51j3843N486j181j1453J0928
10873A750580K7330K0431J9613P228J7245J277j1273o086N443J8274J3013R932
10861A873007p360q699o279P712J3298J9202J3248q537L207K3796J1272J9317
10849A953184N1k3653n338K7869K1264K2375J4990J8046P589j98K929l12K0433
10836B059229J5403L405J5211M491J8650J6507j84J5064K2849p767J708O599j4681
10823B156484n509J1452J2976L8271J5060O159m454l018J9139Q836r589l197J8675
10810B261285J1053J4192L0175K1099J0490J0268M189m750r75K1678J5266M380
10798B398350J2148o638J4593J3533q348k1404R241P535R004J9097j7973J6612
$$ y = [1700616, 1724210, 1725571, 1710075, 1707885, 1728198, 1754806, 1761294, 1760643, 1746800, 1752286, 1751105, 1739652, 1750580, 1777910, 1798341, 1817954, 1825182, 1842427, 1843704, 1832431, 1826345, 1831788, 1850062, 1863075, 1873007, 1865647, 1856948, 1850669, 1858381, 1871679, 1890881, 1904129, 1895592, 1898799, 1922595, 1933867, 1953184, 1953235, 1929582, 1924244, 1952113, 1973377, 1995752, 2010742, 2028788, 2036377, 2036179, 2039108, 2038796, 2059229, 2074632, 2078037, 2093248, 2097739, 2116389, 2132896, 2132712, 2147776, 2170625, 2162858, 2164566, 2171165, 2156484, 2150975, 2162427, 2175403, 2213674, 2228734, 2234893, 2230439, 2227421, 2246560, 2255396, 2245807, 2242610, 2261285, 2272338, 2286530, 2316705, 2337804, 2348294, 2358562, 2362751, 2358001, 2357026, 2378704, 2393970, 2398350, 2410498, 2403860, 2418453, 2431986, 2423638, 2402234, 2411475, 2419010, 2428014, 2447111, 2429138, 2445750]
10786B445750J9206J5289n017j7173l464P322J0519K0858K2375P640L814K4080
10774B551199L9473K4687K0318K3195Q277j0322J7920N327J9868J1214N860K279
10762B719295J451K0566L5810J7125L527J1706N462J4591J5279O496J0843J7642
10750B879793L2098K4758n817M873K9303J9502J4204Q816K7260K952k6720Q841
10738C019863L0312J8338K1542K0371L3726N312R234L5191Q653K3872L9977L1077
10726C297468J9027K7735L4941M2337J4693k396R780K9682J3797J0205L3282K1690
10714C552241l872K0679J5339K7746K7259L2711J9880L487R143J5688L4333M0134
10702C794768M153K3614K2463L4675L0037J6631R186L4710L0280J4069K5147M0645
$$ y = [2445750, 2464956, 2480245, 2475228, 2458055, 2454591, 2461913, 2472432, 2493290, 2515665, 2523305, 2527119, 2551199, 2590672, 2615359, 2635677, 2658872, 2667149, 2656827, 2674747, 2680074, 2699942, 2711156, 2717016, 2719295, 2720746, 2741312, 2777122, 2794247, 2797774, 2809480, 2814942, 2829533, 2844812, 2851308, 2862151, 2879793, 2911891, 2936649, 2930832, 2935705, 2965008, 2984510, 2998714, 3007530, 3034790, 3037742, 3011022, 3019863, 3050175, 3068513, 3090055, 3110426, 3144152, 3149464, 3158698, 3193889, 3202542, 3226414, 3266391, 3297468, 3316495, 3344230, 3379171, 3421508, 3436201, 3433805, 3443585, 3473267, 3487064, 3497269, 3530551, 3552241, 3548369, 3569048, 3584387, 3612133, 3639392, 3672103, 3691983, 3695470, 3704613, 3720301, 3754634, 3794768, 3798921, 3822535, 3844998, 3879673, 3909710, 3926341, 3935527, 3970237, 4000517, 4014586, 4039733, 4080378]
10690D080378N2219M2901K1956L8299K6007J0446L5260L5453M3276L3227K6602
10679D446024N4538K7373L9559M8978K4236K4937K9205M8262L9840K7232L5735
10668D845919J3001n8206n9611O841M2356M6127N0643R9967M9852l6597k7897
10657D972395O5897J09222P9287P0806M8673N4589M2627M9088N8350N6861N6273
10646E664068O1045N9865N2937M6646P1240P8750N3506O0159O6862Q4626P3275
10635F372979O3999N2930N3003P1238P4089Q3671Q2822N2812O9986Q0736J00545
10624G158810J18134Q8242Q5725P9107Q4042R7691Q9399R0084Q3121Q9805J03697
10613H167857J24697J26597J21768J07139J22964J19825J35560J50520J52438
$$ y = [4080378, 4132597, 4175498, 4197454, 4235753, 4261760, 4272206, 4307466, 4342919, 4386195, 4419422, 4446024, 4500562, 4527935, 4567494, 4616472, 4640708, 4665645, 4694850, 4743112, 4782952, 4810184, 4845919, 4858920, 4800714, 4741103, 4747944, 4790300, 4836427, 4887070, 4987037, 5036889, 5000292, 4972395, 5038292, 5147514, 5226801, 5297607, 5346280, 5400869, 5443496, 5492584, 5550934, 5607795, 5664068, 5725113, 5784978, 5837915, 5884561, 5955801, 6034551, 6088057, 6148216, 6215078, 6299704, 6372979, 6436978, 6489908, 6542911, 6614149, 6688238, 6771909, 6854731, 6907543, 6977529, 7058265, 7158810, 7276944, 7365186, 7450911, 7530018, 7614060, 7711751, 7801150, 7891234, 7974355, 8064160, 8167857, 8292554, 8419151, 8540919, 8648058, 8771022, 8890847, 9026407, 9176927, 9329365]
10604I329365J38583J17316J28517J91834J97604J76552J64069J52663J46416
10595A0742919J73850J94193K21600K26754K38672K66058K57527K66473K50449
10586A2838495K63434K89684L35601L56513L54197L81774M58053N14594N50608
10577A6342953O21766N71316K51250o02668j142314l71807N07028P68571P65264
10568A7711359P40697P18919P26970P92224Q60193R14722R90021J071054J139239
10559B5665398J053627O40765M80259J033407J591478J905150K072798K177405
10551C6620287K356512K717590L213357L753564M295066M914970N611253O584129
10543G0066728Q293591J0698804J3807053J8112885K3019065K3643281K417773
$$ y = [9329365, 9467948, 9585264, 9713781, 9905615, 10103219, 10279771, 10443840, 10596503, 10742919, 10916769, 11110962, 11332562, 11559316, 11797988, 12064046, 12321573, 12588046, 12838495, 13101929, 13391613, 13727214, 14083727, 14437924, 14819698, 15277751, 15792345, 16342953, 16964719, 17536035, 17787285, 17184617, 16042303, 15670496, 16177524, 16946095, 17711359, 18452056, 19170975, 19897945, 20690169, 21550362, 22465084, 23455105, 24526159, 25665398, 26719025, 27359790, 27840049, 28873456, 30464934, 32370084, 34442882, 36620287, 38976799, 41694389, 44907746, 48661310, 52956376, 57871346, 63482599, 70066728, 78360319, 89059123, 102866176, 120979061, 143998126, 167641407, 170059180]
10536A70059180p1342262j47653633j01731088j0974257K0034716K0745455J6830748
10529a04031141J3072287J0338292Q523822P021906N843335N025755M250249L608241
10521d6347254L167463K888901K629573K264060J808274J458313J351771J411871
10513b9367028J309825Q47841K68176L30980Q39835J048720J013085R44133Q78880
10504b1885553P34504N59831M97288N63306N82097N18013M79646M69131M68394
10495a7013343M82614M41795M20993L78540L49820L63940L33762K91106K74038
10486a3676735K57743K70116K74402K66925K42312J99275J95950K14515K27056
10477a1528441J93629J72584J71921K02310J99471J95426J69389J56031J41497
$$ y = [170059180, 98716918, -48936715, -150667803, -161642060, -141607344, -120861889, -104031141, -90958854, -80620562, -72096740, -65074834, -59231499, -54205744, -49955495, -46347254, -43179791, -40290890, -37661317, -35397257, -33588983, -32130670, -30778899, -29367028, -28057203, -27209362, -26941186, -26610206, -25770371, -24721651, -23708566, -22764433, -21885553, -21151049, -20591218, -20093930, -19530624, -18948527, -18430514, -17950868, -17481737, -17013343, -16530729, -16088934, -15667941, -15289401, -14939581, -14575641, -14241879, -13950773, -13676735, -13418992, -13148876, -12874474, -12607549, -12365237, -12165962, -11970012, -11755497, -11528441, -11334812, -11162228, -10990307, -10787997, -10588526, -10393100, -10223711, -10067680, -9926183]
10468i926183J47043J49816J44161J25093J11162J17800J40004J24267J05689
10459h761148J06512J24010J22323J00814R8088J09813Q1158J12889J00931Q9320
10449g715290R6197J02262J01130O3154N5558O0605P6213R0884Q1016N9699O5904
10438f862668R5024Q3571P6100O6465N7283N4017O5139O6504P0718O1068M2633
10427f124146M9513N7945M7069M9914N1052M8606M3899O8752P3407M3448N0198
10416e540343L4412J8940L903L9527P6299Q8196j865m7567l0907l1104k8953J6766
10404e402696J02498J32681Q3367M7971M9651N9962L4422L0144L8907L6710L3268
10393d753115M0289M9062O0536N6980L3990L6004K6856K3540K6897K2025K4416
$$ y = [-9926183, -9779140, -9629324, -9485163, -9360070, -9248908, -9131108, -8991104, -8866837, -8761148, -8654636, -8530626, -8408303, -8307489, -8209401, -8099588, -8018430, -7905541, -7804610, -7715290, -7619093, -7516831, -7415701, -7352547, -7296989, -7236384, -7160171, -7069287, -6988271, -6928572, -6862668, -6767644, -6684073, -6607973, -6541508, -6484225, -6430208, -6365069, -6298565, -6227847, -6166779, -6124146, -6074633, -6016688, -5969619, -5919705, -5868653, -5820047, -5776148, -5707396, -5633989, -5590541, -5540343, -5505931, -5486991, -5483088, -5443561, -5367262, -5279066, -5280931, -5328498, -5359405, -5390509, -5419462, -5402696, -5300198, -5167517, -5084150, -5036179, -4986528, -4926566, -4892144, -4862000, -4823093, -4786383, -4753115, -4712826, -4663764, -4603228, -4546248, -4512258, -4476254, -4449398, -4425858, -4398961, -4376936, -4352520]
10382d352520J9769Q673l940Q943M7592L8229M1389K8725J2306K6442L6536K5161
10370d062695L2502K4976J3839L2414M2871J9448J386L1925L9462J5298J0382
10359c798192M530J529K1788K2942J4053L254M4208L5225L1398N256R119K3107
10347c581783L231P868J7648M109J11J3603K7800J4139L4770L6143J1120o492
10335c417733P067J5552J5267J0674K2135K7412J7725j638K2839L1349K3610K6207
10323c199534J6703L829O469L7403M0380K6447J1047M876M729p073l768J6951
10311c041541K4004n131J6710L3959K7774K3824K5903R872J8438P743o814J3520
10299b851739j367R462J1453K92P251K5809R218M663K9960J6360K6695K7434K1821
$$ y = [-4352520, -4332751, -4324078, -4328018, -4319075, -4271483, -4233254, -4191865, -4163140, -4150834, -4124392, -4087856, -4062695, -4030193, -4005217, -3991378, -3958964, -3916093, -3896645, -3895259, -3863334, -3823872, -3808574, -3798192, -3793662, -3792133, -3770345, -3747403, -3733350, -3730096, -3685888, -3650663, -3619265, -3614009, -3604890, -3581783, -3578552, -3570684, -3553036, -3548927, -3548816, -3535213, -3507413, -3493274, -3458504, -3422361, -3411241, -3417733, -3410666, -3395114, -3379847, -3369173, -3347038, -3319626, -3301901, -3303539, -3280700, -3249351, -3225741, -3199534, -3182831, -3179002, -3172533, -3135130, -3094750, -3068303, -3057256, -3052380, -3047651, -3054724, -3058492, -3041541, -3017537, -3022668, -3005958, -2971999, -2944225, -2920401, -2894498, -2884626, -2866188, -2858445, -2865259, -2851739, -2853106, -2843644, -2832191, -2831899, -2824648, -2798839, -2789621, -2784958, -2754998, -2738638, -2711943, -2684509, -2662688]
10286b662688J4876q495j1221l962Q760P247K7350R693R760J4194N695o004l960
10273b598755K0344K4021K0167J0411P83N239m047J4937P557j2656q838J3288
10261b507549K4784P517J0468K4478K7442J0140J0936J1620P878J83Q640p412
10249b370875P527n846N072Q167P920O732J6752P676O444K7469K5236j3260p330
10236b278316N715M220J3425J8631J0685K2558L026n156M555p56J1889M516j4940
10223b199948l276Q914Q278K7216K2415J3429J3222N849n482k451n600p31J0339
10210b107826R098K7117J7366K412J7018J3437n803r286K884J3921J2291O227
10198b001144m800K9427L619J917J6645N257r428m6Q735J8321j784r899L427K1963
$$ y = [-2662688, -2647812, -2656307, -2667528, -2671490, -2662730, -2655483, -2628133, -2618440, -2608680, -2594486, -2588791, -2594795, -2598755, -2578411, -2554390, -2534223, -2523812, -2523029, -2517790, -2521837, -2506900, -2499343, -2511999, -2520837, -2507549, -2482765, -2475248, -2464780, -2440302, -2412860, -2402720, -2391784, -2380164, -2372286, -2372103, -2363463, -2370875, -2363348, -2369194, -2364122, -2355955, -2348035, -2341303, -2324551, -2316875, -2310431, -2282962, -2257726, -2270986, -2278316, -2272601, -2268381, -2254956, -2236325, -2225640, -2203082, -2200056, -2205212, -2200657, -2201413, -2189524, -2185008, -2199948, -2203224, -2194310, -2186032, -2158816, -2136401, -2122972, -2109750, -2103901, -2109383, -2111834, -2117434, -2118165, -2107826, -2098728, -2071611, -2054245, -2051833, -2034815, -2021378, -2027181, -2036467, -2033583, -2019662, -2007371, -2001144, -2005944, -1976517, -1972898, -1970981, -1954336, -1949079, -1958507, -1958553, -1949818, -1931497, -1933281, -1943180, -1939753, -1917790]
10184a917790J8193J7737J4468O909p869j1310k778J2096J6950J978l103M793
10172a849726k349rK0328J9549L852J7154K1873q890J0116j269l8o99K1020o999
10158a756087P463K2658K2820M672r556L672J2293N652N026J2797J7074K2242
10146a629274K2650J1396J1963R624J767N623K7098J7710R234J9490P856J2748
10134a472115J5896R492K6352M1840L4431M5718L8911L8355P2980R9141J12863
10123i36136J30555L1843l06718p08146n83427j17761P5203J12185J02494O4859
10113b135049N2785N3719L9661N3484M6366L4824J6776J9025K3119J1894J3316
10102a770080J1163k216o613R587K7905N627j0340J6623O684k810J5114Q101K2571
$$ y = [-1917790, -1899597, -1881860, -1867392, -1860483, -1868352, -1879662, -1882440, -1870344, -1853394, -1851416, -1854519, -1849726, -1852075, -1852084, -1831756, -1812207, -1808355, -1791201, -1769328, -1778218, -1768102, -1769371, -1769409, -1770108, -1749088, -1756087, -1748624, -1725966, -1703146, -1698474, -1708030, -1704358, -1692065, -1686413, -1681387, -1668590, -1651516, -1629274, -1606624, -1595228, -1583265, -1573641, -1571874, -1566251, -1539153, -1521443, -1512209, -1492719, -1484863, -1472115, -1456219, -1446727, -1420375, -1378535, -1344104, -1298386, -1259475, -1221120, -1148140, -1048999, -936136, -805581, -773738, -1080456, -1788602, -2372029, -2489790, -2414587, -2302402, -2199908, -2135049, -2082264, -2028545, -1988884, -1935400, -1889034, -1854210, -1837434, -1818409, -1795290, -1783396, -1770080, -1758917, -1761133, -1767746, -1758159, -1730254, -1724627, -1734967, -1718344, -1711660, -1714470, -1699356, -1691255, -1668684]
10089a668684J2427J2744J2929j151Q75O617r241N275L3821K5236J0420j6388
10077a575120j3280J1348Q475O413j3423J7621J9389m685n913J1007K0046N171
10065a512951O018R139K3209R40n349J2053J7757p72N433J0404K1522R962J4888
10052a387747K8945L3403L3356L8512K3379j23366k57735j02515M9806M4664J9559
10041a599739K5242K2922K0134K7339J1260J9637J626L54o191n40J1969K129l820
10028a467678J5897J5123k391N91J2379J7078J0183O77n17q612P610M991L887
10015a390782k729j415J2167k227m11J1837J7839J1534j0126P992P671l213m822
10002a346685L346J159K719K592j2389R939J8290J3044O771j5006l301R846k4920
$$ y = [-1668684, -1656257, -1643513, -1630584, -1631735, -1630860, -1624243, -1633484, -1628209, -1594388, -1569152, -1558732, -1575120, -1588400, -1577052, -1568577, -1562164, -1575587, -1557966, -1538577, -1543262, -1549175, -1538168, -1518122, -1512951, -1506933, -1497794, -1474585, -1473645, -1478994, -1466941, -1449184, -1449956, -1444523, -1434119, -1412597, -1402635, -1387747, -1358802, -1325399, -1292043, -1253531, -1230152, -1353518, -1611253, -1713768, -1663962, -1619298, -1599739, -1574497, -1551575, -1531441, -1504102, -1492842, -1473205, -1471579, -1471225, -1477416, -1477956, -1465987, -1463858, -1467678, -1451781, -1436658, -1439049, -1438458, -1426079, -1409001, -1398818, -1398141, -1398658, -1407270, -1399660, -1394669, -1390782, -1393511, -1394926, -1382759, -1384986, -1385397, -1373560, -1355721, -1344187, -1354313, -1346321, -1338650, -1341863, -1346685, -1343339, -1342180, -1339461, -1336869, -1349258, -1339319, -1321029, -1307985, -1301214, -1316220, -1319521, -1309675, -1334595]
9989a334595q779J6722J9649K4098J0166j8322l495P085M261J0081J6388m677
9977a261418j4472Q016M755n022j205J1446P450n965N493q587l662k715k47J7111
9963a249022J5420l651j6455K007l888J0186J5123K3856n243L052Q781q875n766
9950a214475j6664l714j194L963J8627J3606J5909l061J7704j1090j1747J4170
9938a177966l070L5j1727P361O810J09O851j3420j2029P732K44j2381J3140J3517
9924a174794l123j517R919K5990J1717j1452j6374p189K706N533j707J500O617
9911a152174O390j775J5930J9193K659p515J552K809L917P63N332R57L470j0443
9897a108935m097O293J7166Q616R924J746j8786k0938j2090O416j779K821P415
$$ y = [-1334595, -1343374, -1326652, -1307003, -1282905, -1272739, -1291061, -1294556, -1287471, -1283210, -1273129, -1256741, -1261418, -1275890, -1267874, -1263119, -1268141, -1269346, -1257900, -1250450, -1256415, -1250922, -1259509, -1263171, -1265886, -1266133, -1249022, -1233602, -1237253, -1253708, -1251701, -1255589, -1245403, -1230280, -1206424, -1211667, -1208615, -1199834, -1208709, -1214475, -1231139, -1234853, -1236047, -1232084, -1213457, -1199851, -1183942, -1187003, -1169299, -1180389, -1192136, -1177966, -1181036, -1181001, -1192728, -1185367, -1178557, -1178448, -1171597, -1185017, -1197046, -1189314, -1189070, -1201451, -1188311, -1174794, -1177917, -1179434, -1169515, -1143525, -1131808, -1143260, -1159634, -1166823, -1164117, -1158584, -1160291, -1158791, -1152174, -1145784, -1147559, -1131629, -1112436, -1109777, -1117292, -1115740, -1112931, -1109014, -1108251, -1102919, -1101962, -1098492, -1108935, -1113032, -1106739, -1089573, -1080957, -1071033, -1069287, -1088073, -1109011, -1121101, -1114685, -1116464, -1113643, -1106228]
9884a106228J4939m514n742j380K5775l618q065O127J2461N021J633k865J2742
9871a053714K861j5362N762P220J368Q814K148J4320p082n443K514l11l68j121
9857a038394J1933k637N211j1976N054J676j4839j2630M845K2867P130l96j3419
9844a035575q796m765k909K546J6467J8434j816j1709j424Q801K625M627m891
9831a018385K105m322j103K0047J0863j2471J219N20j0461M127l42J7853J2071
9818i78279J567N252J1395J3392j3950j7877R15J367o402L80j400O472P218K41
9804i69709o526j2636o033J3061J1494N750J5569L725K203M141l068k2819o286
9791i71134P765J143j0661L301J6431O627p943j2364o061r432P699J1938K4477
$$ y = [-1106228, -1091289, -1095803, -1101545, -1102925, -1077150, -1080768, -1088833, -1082706, -1070245, -1065224, -1063591, -1066456, -1053714, -1050853, -1066215, -1060453, -1053233, -1051865, -1043051, -1040903, -1026583, -1033665, -1039108, -1036594, -1036905, -1037273, -1038394, -1026461, -1029098, -1023887, -1035863, -1030809, -1029133, -1043972, -1056602, -1051757, -1028890, -1021760, -1022156, -1035575, -1044371, -1049136, -1052045, -1049499, -1033032, -1014598, -1016414, -1028123, -1029547, -1020746, -1018121, -1013494, -1018385, -1016280, -1020602, -1021705, -1001658, -990795, -1003266, -1002047, -1001527, -1011988, -1007861, -1008203, -990350, -978279, -976712, -971460, -960065, -946673, -960623, -978500, -977585, -976218, -982620, -982240, -983640, -977168, -969950, -969709, -976235, -988871, -994904, -981843, -970349, -964599, -949030, -945305, -943102, -938961, -942029, -964848, -971134, -963369, -962226, -972887, -969586, -953155, -946528, -954471, -966835, -972896, -982328, -974629, -962691, -938214]
9778i38214J7957J773j1803k2546j2432J3682K3819J3020j277R817J5427r129
9766h99906k5541l807J5736r03J861M569o552O341J4492q512j1892j174J6851
9753h98437Q988M746j128j1505k3511M751O022L806j793J5442P511R319l087k0294
9739h99170j8571J1416Q182p466p070J4089L5060M035j0723j3795l986J0174J815
9726h76010j9652l879K376Q935K0546J3524J142o666j1496r046J634J2200R446
9713h56946K1587J0491k6933j3414j129L475j3885r794m756K2561K0226P579l464
9700h44402k037p670Q936P401M588q087j382L754P716J0919O086q448p846n237
9686h35709n142R786n68J1419p351l487j7265l105L894m113J6475J8459o923j3836
$$ y = [-938214, -920257, -918484, -930287, -952833, -965265, -951583, -927764, -914744, -916021, -906204, -890777, -899906, -925447, -929254, -913518, -914421, -912560, -907991, -914543, -908202, -893710, -902222, -914114, -915288, -898437, -889449, -884703, -885831, -897336, -920847, -916096, -910074, -906268, -908061, -892619, -885108, -875789, -878876, -899170, -917741, -906325, -898143, -905609, -912679, -898590, -863530, -859495, -870218, -884013, -887999, -877825, -876010, -895662, -899541, -897165, -888230, -867684, -854160, -853018, -859684, -871180, -880226, -878592, -866392, -856946, -835359, -824868, -851801, -865215, -866344, -862869, -876754, -886548, -891304, -868743, -848517, -840938, -844402, -846439, -854109, -845173, -837772, -833184, -841271, -842653, -838899, -831183, -820264, -814178, -822626, -830472, -835709, -840851, -831065, -831633, -820214, -827565, -831052, -848317, -851422, -847528, -851641, -835166, -816707, -823630, -837466]
9672h37466R987J7684R227k0108j1632J4049p546k3051K1743J5578J0294k1103
9660h22344j1306k657l877J195K4363J7883m226J516O807J1468n166K779m858
9647g88423j1496Q11J735j4367l776M783J2140o004L295K3993J1379j4532j8794
9634g99256l122J5429m609l620J138K8739O642N238L367Q5l003J1019k854q658
9620g53465O308j2964Q102R509J520Q624p532n953j5639j3529L973J5126J9031
9607g36889J070k834R6Q769r958l2281j8796J0848K3781l552R217M742m823q982
9593g59592L359N075M80q901j2471R804J7816p656j739K3209O222J0509P182o319
9579g13022n579j943L049L983p700j9591j7072R687J0933l109k1389M169J5392
$$ y = [-837466, -827479, -809795, -800568, -820676, -832308, -818259, -825805, -848856, -827113, -811535, -801241, -822344, -833650, -836307, -840184, -838989, -814626, -796743, -800969, -799453, -792646, -781178, -786344, -783565, -788423, -799919, -799108, -797373, -811740, -815516, -810733, -798593, -804597, -801302, -777309, -765930, -780462, -799256, -802378, -786949, -791558, -795178, -794040, -765301, -758659, -753421, -750054, -749969, -752972, -741953, -744807, -753465, -747157, -760121, -752019, -742510, -740990, -732366, -739898, -745851, -761490, -775019, -771046, -755920, -736889, -735819, -738653, -738557, -729788, -739746, -772027, -790823, -779975, -756194, -759746, -750529, -745787, -750610, -759592, -756233, -751158, -750678, -759579, -772050, -762246, -744430, -752086, -753825, -730616, -724394, -713885, -706703, -713022, -718601, -720544, -717495, -713512, -721212, -740803, -757875, -748188, -737255, -740364, -761753, -757584, -742192]
9566g42192K2219j066k0038r905M638J3492M222j3535j0440k735K4708J8307N36
9553g11789j0648N036K1625J5456j6271j9549m926J4800J5975j1776R297P607
9541f85163j1295Q049k079J130P955J258j2809N329Q735J1651R754q026n451Q0
9527f70882L260l367k0038j1984L0745J7480m949j5006j3269l297M717n886M586
9514f87890K257L232M320K40J2392J835Q820J0460p355N679j200N32j0543Q97
9500f56324k335l432q006j549K1188J4291R403m96N558j6322K898J0163k0206
9487f45169j2954j1489R090J5850J1460K947o517O907j222J179J2428N123m197
9474f16564j3609L239j5151L131q319k4826P458K5687J8473J3779j3693j5474
$$ y = [-742192, -719973, -721039, -741077, -750982, -746344, -732852, -728630, -742165, -752605, -755340, -730632, -712325, -711789, -722437, -717401, -695776, -680320, -696591, -716140, -721066, -706266, -690291, -702067, -692770, -685163, -696458, -688409, -690488, -689358, -681403, -680145, -692954, -687625, -678890, -667239, -657485, -665511, -670962, -670882, -667622, -670989, -691027, -703011, -672266, -654786, -659735, -674741, -688010, -691307, -686590, -692476, -687890, -685633, -682401, -678081, -677841, -665449, -663614, -654794, -644334, -651689, -646010, -647210, -646678, -657221, -656324, -658659, -662091, -670097, -671646, -650458, -636167, -626764, -627260, -621702, -638024, -635126, -624963, -645169, -658123, -669612, -660522, -644672, -633212, -630265, -636782, -629875, -631097, -629918, -617490, -612367, -616564, -630173, -626934, -642085, -638954, -647273, -672099, -664641, -638954, -620481, -606702, -620395, -635869]
9462f35869m455J1487K1702j6808M265P250j350n427j529J6689L195n149m497
9449f10496q967L315j2529r386J4893O221j1706J6851K3531Q119J090r67j1845
9436e91876J705N86K493O693j7239q288P041q734q122O285K809M999J2450J3083
9422e76115q692k0120J479n096j599p817K3934j850M83J5224o47j206R519n718
9408e78221L246J3043M110m16J4796n794q485r131l714J1474N215j964r88N352
9394e51477O077L925J6362p175J3304M711k5308r094o196o753M389R34J18Q923
9380e47260k947P276M007J35M194Q880j589r571N169J3449K1427J2113M04j7074
9366e01387k3150r78J6559p283j0624P404M705L932n881l934Q59Q495R486o858
$$ y = [-635869, -640324, -628837, -607135, -623943, -619678, -612428, -613778, -619205, -620734, -604045, -600850, -605999, -610496, -619463, -616148, -628677, -638063, -623170, -616949, -628655, -611804, -588273, -580154, -579064, -580031, -591876, -590171, -589585, -587092, -580399, -597638, -605926, -598885, -607619, -615741, -609456, -606647, -601648, -589198, -576115, -584807, -604927, -603448, -608544, -610143, -617960, -594026, -595876, -595393, -580169, -580816, -582022, -572503, -578221, -574975, -561932, -557822, -558238, -543442, -549236, -557721, -566852, -570566, -559092, -553877, -555841, -556829, -551477, -545400, -541475, -525113, -532288, -518984, -514273, -539581, -548675, -554871, -561624, -557235, -556301, -556183, -547260, -550207, -542931, -538924, -538789, -534595, -525715, -527304, -536875, -531706, -518257, -496830, -484717, -484313, -501387, -524537, -525515, -508956, -516239, -526863, -519459, -514754, -510822, -516703, -520637, -519778, -511283, -501797, -508655]
9352e08655j8009M415J0456J1735J1108j2133L188N313m191l72o703L319J3041
9339d87488J1703N919j7457O632R643l69j4037j307Q258P214k569o37K524p291
9325d79262J434K460J7553J6150J5678R74j4047m454J1807R240r940j5024j0242
9312d57673m132J2168J3702J598j3743O446J7412J8868J560j2516k7042M818K8923
9299d09611j0685k293Q133K935O747r613n626J630J9143Q234P93J128N470L687
9285c79928n931l959J0493J4796N656m053j0359M237O515J593K147J0623j6472
9272c64642j3347J4560J7084j0674j8690J85K0902m714o225K336O515j0617O917
9259c60410m520O132K4217M603m495m402O663R765o677n459j307J5992J2852K036
$$ y = [-508655, -526664, -522249, -511793, -500058, -488950, -501083, -497895, -492582, -496773, -497145, -503848, -500529, -487488, -475785, -469866, -487323, -480691, -471048, -471417, -485454, -486761, -478503, -471289, -473858, -474495, -471971, -479262, -477828, -475368, -457815, -441665, -425987, -425013, -439060, -443514, -431707, -422467, -432407, -447431, -457673, -461805, -449637, -435935, -434337, -448080, -441634, -424222, -405354, -403794, -416310, -443352, -438534, -409611, -420296, -422589, -414456, -411521, -404774, -414387, -420013, -418383, -399240, -391006, -390213, -389085, -383615, -379928, -385859, -389818, -379325, -364529, -358873, -362926, -373285, -369048, -362533, -360940, -358793, -348170, -364642, -377989, -363429, -346345, -357019, -375709, -375524, -354622, -359336, -365561, -363225, -356710, -367327, -360410, -364930, -358798, -334581, -329978, -334473, -338875, -332212, -322447, -329124, -334583, -335890, -319898, -307046, -305010]
9245c05010K5664Q932p858o439j0133k1944K1103J1633J0411J7679j816j1770
9233b69548N385K9111j3147k3884j3779K0206J7275M031Q386O648L4546Q511j5506
9220b01765L075R100J6235n473l514q809J0851K241K362J6568L2722J1404M287
9207a10716p096J1534R327m942R727J3046J2038J0844L815J1303J5716o70K3112
9194b962K5687q40P213K774m96J6740L024J1913K8834K7993M647r694J9847K7824
9180A62504K4749M0053K8960M218R603L5140L4483K8741L0370L2391K9337K3260
9168D83809L5919M2894N0245L0636K4449M9780N0484N2889N5208N4188O5922P1408
9156A067831O3685P3901J05232J11853J12341J27335J37231J63559J52138J70766
$$ y = [-305010, -279346, -270414, -278272, -284711, -294844, -316788, -295685, -284052, -273641, -255962, -257778, -269548, -264163, -235052, -248199, -272083, -285862, -265656, -248381, -244350, -235964, -229316, -194770, -186259, -201765, -198690, -189590, -173355, -178828, -182342, -191151, -180300, -178059, -175697, -159129, -126407, -115003, -110716, -117812, -106278, -96951, -101893, -92166, -79120, -67082, -56238, -52423, -41120, -25404, -26074, -2962, 22725, 21885, 29098, 31872, 31376, 48116, 51140, 63053, 91887, 119880, 124527, 114833, 134680, 162504, 187253, 227306, 256266, 260484, 270087, 305227, 339710, 368451, 398821, 431212, 460549, 483809, 519728, 562622, 612867, 643503, 667952, 717732, 768216, 821105, 876313, 930501, 996423, 1067831, 1131516, 1205417, 1310649, 1422502, 1534843, 1662178, 1799409, 1962968, 2115106, 2285872]
9146B285872J65733J52271J26845P8581l396j83380m63615q08341j120575j229968
9136i99973j104688q28452n03730k62328o5306M5071J00898J26621J37354J40413
9126c214120J48796J54717J27305J02472J08332R2116Q4901P5877O2066P6342
9116b181196Q0744P1943O1496M6132L6002L2301N0214M2693K5266K6710M6253
9105a661442L5915M1259M0815K2536K5756L0255K5789L2518J9897n377N219K7396
9093a359464J1956M532L6461L2776R620m252J2864L3321K1647K620k713K08Q111
9080a192313L0761J9812L807Q783K5327J9305m348K531J8260j0698l061J8304
9068a063530Q816J0759J3354N532l803J6849P306J0668o501J950P982J4953J3848
$$ y = [2285872, 2451605, 2603876, 2730721, 2809302, 2805906, 2622526, 2158911, 1350570, 229995, -999973, -2104661, -2933113, -3436843, -3699171, -3764477, -3719406, -3618508, -3491887, -3354533, -3214120, -3065324, -2910607, -2783302, -2680830, -2572498, -2480382, -2395481, -2319604, -2257538, -2181196, -2100452, -2028509, -1967013, -1920881, -1884879, -1852578, -1802364, -1759671, -1734405, -1707695, -1661442, -1625527, -1584268, -1543453, -1520917, -1495161, -1464906, -1439117, -1406599, -1386702, -1392079, -1386860, -1359464, -1347508, -1342976, -1306515, -1273739, -1264119, -1268371, -1255507, -1222186, -1200539, -1197919, -1200632, -1200424, -1192313, -1161552, -1141740, -1137933, -1129150, -1103823, -1084518, -1088866, -1086335, -1068075, -1078773, -1081834, -1063530, -1054714, -1043955, -1030601, -1025069, -1028872, -1012023, -1004717, -994049, -1000550, -998600, -990618, -975665, -961817]
9055i61817N099J5265n000p132O273J4783l416P95K0477R869j677j068P076J472
9041h99001L428j0352O437J0247M309o795O14K713J1493J2055J4121m511p616
9028h62858O00n612L738Q214P97M977M625N238o870j978m824K2438O393j1279
9014h36401K266m048O739L987N78J064p210m987N230J2808K5939J1197Q329J0873
9000g63636k436N023J1152J4214r642r853q736j3198M63J0458p107M8L733J8388
8986g51129m057j0706j6335j312K945J6783M501J2314J498J0673l032j2855N491
8973g45221J6356K0240J4520J0283j8726l3613P924J2433q814J669J948Q027J844
8960g11130M805r717q608N876P37P238J4156J5897q357q067q472k809k683j2305
$$ y = [-961817, -956718, -941453, -946453, -953585, -947312, -932529, -935945, -935150, -914673, -904804, -906481, -907549, -900473, -899001, -895573, -905925, -899488, -889241, -884932, -891727, -891113, -888400, -876907, -864852, -850731, -855242, -862858, -862258, -867870, -864132, -855918, -855121, -850144, -845519, -840281, -847151, -849129, -853953, -831515, -825122, -836401, -834135, -838183, -831444, -827457, -826879, -825815, -833025, -838012, -832782, -819974, -794035, -782838, -774509, -763636, -766072, -761049, -749897, -735683, -745325, -755178, -763914, -777112, -776649, -766191, -773298, -773250, -769517, -751129, -755186, -765892, -782227, -783539, -780594, -763811, -759310, -746996, -745498, -734825, -737857, -750712, -745221, -728865, -708625, -694105, -683822, -702548, -736161, -728237, -715804, -724618, -722949, -721001, -712974, -711130, -706325, -716042, -724650, -718774, -718037, -710799, -696643, -680746, -689103, -697170, -705642, -708451, -711134, -723439]
8946g23439L597J7230J1368j4017l072J2127L312R87K946J8814j135L329O516
8933f61437n751o945j3683Q28J2458l737p952q88L469l563Q782M606Q48J7613
8919f55352M633k0202K0197Q054m598J2724J3013q053O926O820j5755J422J2148
8906f18023n206j9108n07N051R723K0456R298j1737l6206j4340K0369J5461O979
8893f17790J872k3252k2253O049R230J758J8958j98q390J3100N939P761N984l565
8879f04797l006J7911N307J5128N261M855n231j1994l5130k6729j432J363p883
8866f46377Q168p759L140M838o163O635J8750K2597Q90k1773l540j1447O699J1951
8852f13391J2319M821j6611K739n438N148Q473q540r423K0342J4157O621l351
$$ y = [-723439, -719842, -702612, -691244, -705261, -708333, -696206, -692894, -691907, -688961, -670147, -671282, -667953, -661437, -667188, -674133, -687816, -686988, -674530, -678267, -686219, -687107, -683638, -687201, -678419, -673813, -672965, -655352, -650719, -670921, -650724, -642670, -647268, -634544, -621531, -629584, -622658, -615838, -631593, -630171, -618023, -623229, -642337, -642844, -637793, -628070, -607614, -598316, -610053, -646259, -660599, -640230, -624769, -617790, -615918, -639170, -661423, -655374, -646144, -644386, -625428, -625626, -634016, -620916, -614977, -607216, -601232, -604797, -607803, -589892, -584585, -569457, -564196, -559341, -564572, -576566, -611696, -638425, -639857, -638494, -646377, -638209, -645968, -642828, -637990, -644153, -637518, -618768, -596171, -595281, -617054, -620594, -632041, -625342, -613391, -601072, -596251, -612862, -610123, -615561, -610413, -601940, -610480, -619903, -599561, -585404, -578783, -582134]
8839e82134M682p601j0959m535K127Q486J0621q69k193q246k3892L160R066K5797
8825e76490l693L58m366m921K2507J0003j214J0524m332j6426k5664j0596J8061
8812e86249p64p418L611J9660P495q481o733Q382j413k472j0919j5288J0931K2270
8798e67388K3727M716k8280l139P324R760J4614j1712j2904o950R279J609j4186
8785e73530p140M550p64Q175J1649P129K2446q11q907q467j0616J4503L201j8387
8771e56969n226R071J5883J5683J113j0111l557J0702L467k1463Q47n953j6518
8758e63031J4569K4376P269j0483R005P532q502j4278p636q304J462M044J04l024
8744e46897r551m063J5807Q518N302o188K272K562P324N166Q923R41l299j0361
$$ y = [-582134, -577452, -585053, -596012, -600547, -598420, -589934, -579313, -580182, -582375, -590621, -614513, -611353, -602287, -576490, -580183, -579825, -584191, -589112, -566605, -556602, -557816, -547292, -551624, -568050, -593714, -604310, -586249, -587013, -594431, -590820, -571160, -563665, -572146, -578879, -570497, -571910, -574382, -585301, -600589, -589658, -567388, -543661, -538945, -567225, -570364, -563040, -553280, -538666, -550378, -563282, -570232, -560953, -559344, -573530, -580670, -576120, -576884, -568709, -557060, -549931, -527485, -528296, -537203, -545670, -556286, -541783, -538582, -556969, -562195, -553124, -537241, -521558, -520445, -530556, -534113, -523411, -519944, -541407, -540560, -546513, -563031, -548462, -524086, -516817, -527300, -518295, -510763, -519265, -533543, -541179, -549483, -548021, -543977, -543873, -546897, -556448, -560511, -544704, -536186, -530884, -537072, -534800, -532238, -524914, -519748, -510825, -509884, -513183, -523544]
8730e23544J4339Q841n11p712q411k5969m014J2637J3144L0002K4278K516j9211
8717d83615k9460j0671j4949L886q81J9619j67l253K897M692l308j4716p179J3395
8703e23710J9505K256P731R819j92q96o292J9176q864J927j46J172p02n736l822
8688d88774J350M06J2237j749p77J4579j038J883q784j1442J437r715l798J0050
8674d84135J1200k89j513J1874Q056j6291j4276J3115K4586J2436j1931j2791
8662d59959n284O845Q482O085J0552l257r500n27j12K1716q827m184J155J4853
8648d21962K2m578J6090L322j5186L274M83j1481J475J3280L41M23k778j5357
8634d32632k931N223K4367q33j517j524o551J3611J347n104L128L808J4036J423
$$ y = [-523544, -509205, -500364, -500875, -508587, -516998, -542967, -546981, -534344, -521200, -491198, -466920, -464404, -483615, -513075, -523746, -538695, -534809, -535690, -516071, -516238, -519491, -516594, -511902, -515210, -529926, -537105, -523710, -504205, -501949, -494218, -484399, -484591, -485487, -491779, -472603, -481467, -479540, -479686, -478514, -479216, -484952, -488774, -487424, -487018, -474781, -476530, -477307, -462728, -463766, -461883, -470667, -482109, -480672, -490387, -494185, -484135, -472935, -473224, -474737, -462863, -454807, -471098, -485374, -472259, -447673, -435237, -447168, -459959, -465243, -458398, -449916, -443831, -433279, -436536, -446036, -446563, -446675, -424959, -433786, -437970, -436815, -421962, -421940, -426518, -410428, -407106, -422292, -419018, -418535, -430016, -428541, -415261, -414920, -414497, -417275, -432632, -435563, -430340, -405973, -406806, -408323, -409847, -416398, -402787, -401440, -406544, -403416, -399608, -385572, -384149]
8620c84149R42N651J4702j06k2855p460J5322K5253O56n771Q54j1653K785m687
8606c70516N747l53r348K313R804j8184r96K620l107l790m087j8324o168n309
8592d19698N43n967o245K604N533L450O980K3359P190j424P466K1853K1075p274
8578c40555p436J1017K0741K2843J1647K8929L4055L5971M0384N0931Q2423R9002
8566H9952O7079o017k29624m65827l63463q9159N0379P8293P1196N3768O5995
8555f77428M1295J6652K1940L0594L1582R947l69J2371K6860J4230J4478L1215
8543d26633J4042N378o132J4972O462J804J5993M0491J6132J3194Q203J8355L2898
8530b44841M5202L5438N3206M9773N1727Q6517J04005J53186J82975J27558k19135
$$ y = [-384149, -383207, -377556, -362854, -362960, -385815, -393275, -377953, -352700, -352044, -357815, -356961, -368614, -365829, -370516, -364769, -365122, -374470, -372157, -362353, -380537, -381533, -378913, -382020, -385810, -389897, -408221, -414389, -419698, -419155, -425122, -431367, -428763, -423230, -419780, -412800, -389441, -382251, -383675, -376209, -354356, -333281, -340555, -347991, -336974, -316233, -293390, -281743, -252814, -218759, -182788, -142404, -91473, -9050, 89952, 157031, 151014, -78610, -544437, -907900, -997059, -946680, -868387, -797191, -743423, -677428, -636133, -619481, -597541, -566947, -535365, -525418, -525787, -513416, -486556, -472326, -457848, -426633, -412591, -407213, -413345, -398373, -391911, -390107, -374114, -333623, -317491, -304297, -296094, -277739, -244841, -199639, -164201, -110995, -61222, -9495, 77022, 181027, 334213, 517188, 644746, 425611]
8519D25611q55205q99523k88687Q5610J38862J23925J00851Q1189P6270M0650
8509i70447N2916M0686L0394J9471K2709L5931J4494J755N722J1456L2095K3486
8497f79332O654J7526K0609J8750L6858Q635R111K3353j1692l336J4771K5227
8485e12866K1568L0795K7377K3480L7545O5314P7842Q7477O1713m2679k65245
8474c87679m37751k77317l1797O0190P9570N4444L4842N3573M0726L2034R042
8463g70123k685J202J2960J5155n56K6799M414Q843J3850Q311j3026J7422J7793
8450f59641q061p375O187K0568J2148l428m395R827m465K548J8227K0057J3516
8437e84287l021r289q962k705J2368P776N900n98q268r322k132j4086J2218J2283
$$ y = [425611, -429594, -1329117, -1617804, -1532194, -1393332, -1269407, -1168556, -1087367, -1011097, -970447, -917531, -876845, -846451, -826980, -804271, -768340, -753846, -752091, -746369, -734913, -702818, -679332, -672678, -655152, -634543, -615793, -578935, -570300, -561189, -537836, -549528, -552864, -538093, -512866, -491298, -460503, -433126, -409646, -372101, -306787, -228945, -141468, -79755, -122434, -387679, -825430, -1102747, -1134544, -1074354, -994784, -940340, -905498, -851925, -811199, -779165, -770123, -772808, -771606, -758646, -743491, -744047, -717248, -712834, -703991, -690141, -681830, -694856, -677434, -659641, -667702, -675077, -668890, -648322, -636174, -639602, -643997, -634170, -638635, -636087, -617860, -597803, -584287, -587308, -596597, -605559, -608264, -595896, -588120, -582220, -582818, -591086, -600408, -602540, -616626, -604408, -592125]
8423e92125j684m873m902N783J7402n113Q414L301j0757p640O65J6430P866j5594
8409e82827j6385p013J3589Q642L576p68J3041J6830J782k816r141m579J8064
8396e48005R343k3463m930K02p179J367J7629O232Q81K277L280o134k388L559
8382e47329l697J2709j8867o689j0195m562J8760K7018q70K005k653m018L540
8369e34848l686p980p1P337M660q377K422R12K3776J068q24K421j1355j2964Q178
8354e29331M974n535m161M854k575L384Q574M630N59l16k304P57J154o396o937
8339e28669r301N509R417J3439n029k246N721n516l711r202K2197J4507L367r906
8325d99423j5177J0525l183J280K577q246M844q387j2045o988j0364J252J4512
$$ y = [-592125, -593809, -598682, -603584, -597801, -580399, -585512, -577098, -573797, -584554, -592194, -591529, -575099, -567233, -582827, -599212, -606225, -592636, -583994, -580418, -581186, -568145, -551315, -549533, -552349, -561490, -566069, -548005, -538662, -562125, -567055, -566853, -574032, -572665, -555036, -548804, -547923, -545646, -542366, -548500, -550888, -547329, -551026, -538317, -557184, -563873, -574068, -578630, -559870, -532852, -533722, -531717, -534370, -538388, -534848, -538534, -546514, -546585, -539248, -534588, -542965, -540543, -539631, -515855, -514787, -515611, -513190, -524545, -537509, -529331, -524357, -529892, -534053, -529199, -531774, -528390, -519816, -515186, -514627, -514943, -517247, -516490, -515336, -521732, -528669, -537970, -532461, -523044, -509605, -514634, -516880, -511159, -516675, -520386, -529588, -507391, -492884, -489517, -499423, -514600, -504075, -507258, -505978, -503401, -511647, -506803, -515190, -527235, -534223, -544587, -543335, -528823]
8312e28823K1318L20m896p907J156J2234o18j3264p069J2720j1444k1643j0923
8299e58839J5989o493J4250K1887M059p306r768J7494P141R760l679J5916q676
8286d88265k8446M442Q919M644r21J1191O518j168p698j4262J1177M116M607m630
8272d89776J1236M19l45j8J1444l91p517J8373P964M7l2262k3721O781O061j1619
8257e03324N572L578Q738J1473Q211r021j8646K099J322N434M913k430Q11l535
8243d84805k078j1616N085R629j877m653l010l37O076l781J0996j957j814J1093
8229d73049P999J2020N447p651k1060j0052O898J2144O344M015n017l235r285
8216d74482O332n897r519o194j8366j3004J1055J9092J1353P989N946j2366j7164
$$ y = [-528823, -507505, -507185, -512081, -519988, -518832, -506598, -507216, -520480, -527549, -514829, -526273, -547916, -558839, -542850, -549343, -535093, -513206, -509147, -516453, -526221, -508727, -501586, -491826, -495505, -479589, -488265, -516711, -512269, -503350, -498706, -499627, -488436, -481918, -483086, -490784, -505046, -493869, -489753, -485146, -489776, -478540, -478121, -478466, -478484, -467040, -467431, -474948, -456575, -448611, -448564, -480826, -504547, -497766, -491705, -503324, -497752, -494174, -485436, -473963, -465752, -474773, -493419, -491320, -489998, -484564, -479651, -482081, -481270, -484805, -486883, -498499, -493414, -483785, -485662, -490315, -493325, -493662, -487586, -491367, -480371, -482328, -484142, -473049, -465050, -453030, -447583, -455234, -476294, -486346, -479448, -467304, -460960, -456945, -461962, -465197, -474482, -468150, -474047, -483566, -489760, -508126, -521130, -510075, -490983, -479630, -471641, -465695, -478061, -495225]
8203d95225j1269M145J4277K398m216M066Q956P036k85l264j0805K203o917O753
8189d82147J4247j3593k575J1215R030O139j8619r868P616Q074O614q485k269
8176d74621n985K0909R488r456m2r34r591j8891O807k139J0105J264j1016L636
8162d80466L981Q148Q641J1838l026Q046n421K176J8440q547j6337m370m257M40
8148d60714Q866J3066n76k867j8855j2737Q043J0207k619J16L032o084N237P345
8134d48540J0467n293j6995K560J4236l99l788p805J5522J0334j2118j6699Q009
8121d50509J917O736N413o781o378O667o212J6047l70p975j326M762P279J1531
8107d19199j60j7840o963N743k01k972K437r798J0986K764Q804K3298Q184j7273
$$ y = [-495225, -506494, -502349, -488072, -485674, -489890, -485824, -476868, -469832, -470117, -473381, -484186, -481983, -488900, -482147, -467900, -481493, -484068, -472853, -463823, -457684, -476303, -486171, -478555, -470481, -463867, -472352, -474621, -480606, -459697, -450209, -459665, -459707, -460641, -470232, -489123, -482316, -484455, -474350, -473086, -484102, -480466, -476485, -468337, -459696, -447858, -450884, -442838, -448259, -446083, -427643, -436190, -452527, -456897, -461154, -460714, -451848, -438782, -439358, -442225, -461080, -473817, -465774, -455567, -458186, -458070, -455038, -461122, -455885, -448540, -438073, -443366, -460361, -457801, -443565, -443964, -447752, -455557, -440035, -429701, -441819, -458518, -450509, -448592, -441856, -436443, -443224, -449602, -442935, -449147, -433100, -433470, -441445, -442771, -438009, -430730, -419199, -419359, -437199, -444162, -438419, -438620, -441592, -439155, -448953, -437967, -435203, -426399, -403101, -394917, -412190]
8093d12190n154Q182q553l0612L840O052L328o205k102r715n835J1155Q442N769
8079d33598P504R211r713j2837j1416n662p845j1890N161J1174M820J4444J9827
8066d20820m4m272Q44l181n815M715q631J1307M850L152q538p661J6850K9405
8052c87839o860o329k2709j2901r72m722m050J9039J4216M754M726O889J593p266
8038d02431q453k770j0970l034K069m528J738k16j1020q608N810R496n675n93
8024d39185K84l022J728K4942L236o673j7631J22J1650R958M098J1230r226j5475
8010d23964J3233l140K267m176J867R061Q036q058j2099r792o183R979J6432r192
7996d15729l0162q392J6760J5033P105K780j3444k0722l605J1014K888m274R639
$$ y = [-412190, -417344, -409162, -417715, -448327, -444487, -438435, -435107, -441312, -443414, -453129, -458964, -447809, -439367, -433598, -426094, -416883, -426596, -439433, -450849, -456511, -464356, -476246, -471085, -459911, -455091, -440647, -420820, -420864, -425136, -424292, -427473, -433288, -428573, -437204, -425897, -421047, -417895, -426433, -434094, -417244, -387839, -394699, -401028, -423737, -436638, -437610, -442332, -446382, -427343, -413127, -408373, -403647, -396758, -395165, -402431, -410884, -413654, -424624, -427658, -425589, -430117, -428379, -428595, -439615, -448223, -442413, -432917, -438592, -439185, -438901, -441923, -440195, -415253, -412017, -418690, -436321, -436199, -424549, -414591, -410493, -399263, -408489, -423964, -410731, -413871, -411604, -415780, -413913, -404852, -396816, -404874, -416973, -426765, -432948, -422969, -406537, -415729, -445891, -454283, -437523, -422490, -415385, -412605, -426049, -446771, -450376, -439362, -436474, -440748, -431109]
7983d31109J0568p212J463N388m2J483M431j1144j466m142J248k517J8456J240
7969d13355m460O635L182K884L674m634p549K2193N904k7323o958n521j3147n460
7955d43935P975J2815o575L407O559l801j4516K579m16n688q28Q29L646N280K701
7940d29968J6835J4079j4861n929k777k114n957J2687J0761j2997r286R858k92
7927d19961K197J742L777j6376j2618J5368J2136j2439L405P524K57k201Q015
7914d09174n006n188J2814j1824j9021j0318K586L348N510K496j341l732j8048
7901d56898K541M065j1175J2975R690Q709L123K9142J8367k4484k8555n615k1189
7888d59304l790P962R721M572P744q394j0209m39l114O249j742j013q222j3680
$$ y = [-431109, -420541, -427753, -426290, -420902, -420944, -419461, -415030, -426174, -427640, -431782, -430534, -433051, -414595, -413355, -417815, -411180, -407998, -405114, -401440, -406074, -413623, -391430, -385526, -412849, -419807, -425328, -438475, -443935, -435960, -423145, -429720, -426313, -419754, -423555, -438071, -435492, -435908, -441596, -442424, -441595, -437949, -432669, -429968, -413133, -399054, -413915, -419844, -422621, -424735, -430692, -418005, -407244, -420241, -429527, -419669, -419961, -417764, -416022, -412245, -428621, -441239, -425871, -413735, -426174, -422769, -415245, -414988, -417189, -409174, -414180, -419368, -406554, -418378, -437399, -447717, -445131, -441783, -436273, -433777, -435118, -438850, -456898, -454357, -450292, -461467, -448492, -438802, -430093, -426970, -397828, -379461, -403945, -432500, -438115, -459304, -463094, -455132, -445411, -440839, -433095, -441489, -451698, -452137, -455251, -449002, -450744, -451757, -459979, -473659]
7874d73659J5721R868m439n181J3953J0621j0725O42M935k894k455M426n913q571
7860d53671J739r253L362J4860Q451k495q576p992n605N990J3165Q027j2523j6425
7846d60946k753L7335J1674j2533n34m86o163j0866J8697p57j9326j2188M178
7833d54668J9990R635J0893p5q026j0474r582n013j447J3107J007L637O277j6523
7819d41262l490J7336J5125k874N85M42Q216J1219o838j2010j297K250J3488J1193
7805c87917L108j1286j7547k796J0772J0238k2023r375n666p381Q264J794J0638
7792d19177J1921K127P843j1771j0323n620l157P51P225J0152K500j6666q352
7779d32547P610R319Q017j0787n599r566L636J1714j0055j793O733O198o680m784
$$ y = [-473659, -457938, -448070, -452509, -457690, -443737, -433116, -443841, -443199, -438264, -441158, -443613, -439187, -445100, -453671, -451932, -461185, -457823, -442963, -434512, -437007, -445583, -453575, -459180, -453190, -440025, -431998, -444521, -460946, -463699, -426364, -414690, -427223, -427757, -428243, -434406, -445272, -426575, -427332, -446658, -458846, -454668, -434678, -425043, -414150, -414225, -422251, -432725, -442307, -447320, -448767, -435660, -434653, -431016, -424739, -441262, -444752, -427416, -412291, -415165, -414580, -414138, -405922, -394703, -401541, -413551, -414848, -412598, -399110, -387917, -384809, -396095, -413642, -416438, -405666, -395428, -417451, -426826, -432492, -439873, -431609, -429815, -419177, -407256, -405129, -397286, -409057, -419380, -425000, -428157, -427406, -420181, -410029, -407529, -424195, -432547, -424937, -415618, -407601, -418388, -423987, -433553, -429917, -418203, -428258, -430051, -423318, -417120, -423800, -428584]
7765d28584J6288J4315j851r243O566o962k022k222M912j8924j2395R169L306
7752d27647R660N04N022K964Q533j0321k2013P849J2799K9163j4231K848J0275
7739c84595k0641j7217p694L013Q673q657l984J0469N095o37k875N321j7876k0981
7725d52586J3251J0178j221J1348m112R132j048Q23n51n807l17O885l1K770K834
7710d08452K148j2326J6080K0497M192j1882j2551k609P941o397K369p459q667
7697d17116K353J933M541J017K264J3180K865J240J929o826P13Q568O10k2587
7683d05316Q458R361r791j0509J2235l744j2365L308N396j540N375J7538k1768
7670d03362o834n457J0702M448P203r400N91M040m109j4102j2966L872O116J894
$$ y = [-428584, -412296, -397981, -399832, -409075, -402509, -409471, -411493, -413715, -408803, -427727, -440122, -430953, -427647, -417987, -417483, -412461, -409497, -400964, -411285, -433298, -425449, -412650, -383487, -397718, -394870, -384595, -405236, -422453, -430147, -427134, -418461, -427118, -431102, -420633, -415538, -416175, -419050, -413729, -431605, -452586, -439335, -429157, -430378, -419030, -423142, -414010, -415058, -414235, -414786, -420593, -420910, -414025, -414056, -411286, -408452, -406304, -418630, -402550, -382053, -377861, -389743, -402294, -404903, -396962, -403359, -400990, -408449, -417116, -414763, -412830, -408289, -407272, -405008, -391828, -388963, -387723, -385794, -392620, -391907, -383339, -382729, -405316, -396858, -387497, -397288, -407797, -395562, -399306, -411671, -408363, -402967, -404507, -399132, -381594, -403362, -410196, -415653, -404951, -400503, -393300, -402700, -402109, -398069, -402178, -416280, -429246, -425374, -419258, -417364]
7656d17364J8246k521k0162m117J4136o700R10l78J4297J3184P716j1956j3578
7643d08287O424k737K455L321J052o708J0780P567J993j0786m985K3057O698j9071
7629c89227p873L659J090j2045k453o405j803l451j5936J4609O702P284k336R934
7615c98251O486j472k53L870j8004K292P074p181J191P964N020k180j669n3j2209
7600d07375n401j628M441P132J9835j0888j4312n742J2992J3601J1643J892l023
7587c76833l330j2580q595q738k16n82P151N950o050j1965j4195J6083M04J2648
7573d00848R444R364o232J2884J4011q327n496j559j3051p935J6486J44Q398r36
7559c73653J482j2934j2890j3927k0851J7680J7711K422j1184l03L0638L3753
$$ y = [-417364, -399118, -401639, -421801, -425918, -411782, -418482, -417572, -417950, -403653, -390469, -382753, -394709, -408287, -401863, -404600, -402145, -398824, -397772, -404480, -393700, -386133, -384140, -394926, -399911, -376854, -370156, -389227, -397100, -393441, -392351, -404396, -406849, -413254, -415057, -418508, -434444, -419835, -413133, -405849, -408185, -398251, -391765, -393237, -393490, -389620, -407624, -405332, -398258, -405439, -404248, -396284, -391264, -393444, -395113, -395166, -407375, -412776, -414404, -409963, -402831, -382996, -393884, -408196, -413938, -400946, -387345, -375702, -373810, -376833, -380163, -392743, -401338, -410076, -410292, -410874, -403723, -397773, -403823, -415788, -429983, -413900, -413496, -400848, -391404, -382040, -388272, -375388, -361377, -369704, -375200, -376759, -389810, -397745, -381259, -381115, -372717, -373653, -372171, -385105, -397995, -411922, -432773, -415093, -397382, -394960, -406144, -406447, -375809, -342056]
7547c42056j78j7051K791N796P57j7113r933n447j5062J2584K1822l602m864j207
7533c72763k3555L11p534k808M727K1720J1498J138j7073J863J1096j25P502k10
7519c64213j6757L654M730p112l137M177P708J1218n050p72K1594L658j3547j9851
7505c73700n662R00j6032j1823R01O876J0802j972J1966n68q293j905o225N968
7491c88767K3548j992K202J7245j7723n053L937j814L236p587j2194l322K348
7478c85936Q904J2158m93j1774j0969R962K7666O56k4823k1829p032K3574J1582
7465c68354J3925N855O088R708n897j9612j6096O930j134j5862m44P239O613J0670
7451c60371J403j460j6972k7319J9297Q201n151P511o444M051J0820O154M694
$$ y = [-342056, -342234, -359285, -356494, -350698, -349941, -367054, -376987, -382434, -397496, -384912, -363090, -366692, -371556, -372763, -396318, -396007, -403541, -406349, -401622, -379902, -368404, -367266, -384339, -382476, -371380, -371505, -364003, -364213, -380970, -377316, -372586, -379698, -382835, -378658, -370950, -359732, -364782, -365554, -343960, -340302, -353849, -373700, -379362, -378462, -394494, -406317, -405416, -398540, -387738, -389710, -377744, -378312, -386605, -388510, -394735, -388767, -365219, -367211, -365009, -347764, -365487, -370540, -366603, -368417, -365181, -372768, -384962, -388284, -385936, -377032, -364874, -365367, -377141, -388110, -378148, -350482, -349826, -374649, -396478, -403510, -379936, -368354, -354429, -348574, -342486, -332778, -338675, -358287, -374383, -367453, -368587, -384449, -384893, -377654, -371041, -360371, -358968, -360428, -377400, -404719, -385422, -377221, -382372, -374861, -381305, -377254, -366434, -360280, -355586]
7438c55586J3966p315r929n963j0170J094m739P336J0494m891j1070r096P670
7425c78199J3676j6584r94N735O238k309l361l329q342o58Q514L37L252R124n18
7410c67418M10j2822K088R439l934j94j4446L645J923J3470l695r924J858J2165
7396c67435M665O409j472J1571o893P626r977j3583m935J3027m187M411R705J642
7382c49426k3019k344J429j5755R340J5045j968j33l574o881m743L006J8001J0106
7368c50916k745m952L20n732j4012o264N805L14K386R600P48k017k4107J2845
7354c78727J6080J489o123Q869J300N09P651K211R497J3138J274m718L878r22
7340c24594j1528q773O370j3966j9225J368J7874K700P63j1747k629O154N02M977
$$ y = [-355586, -341620, -348935, -358864, -364827, -374997, -373903, -378642, -371306, -360812, -365703, -376773, -385869, -378199, -364523, -381107, -382101, -376366, -370128, -372437, -375798, -379127, -387469, -388127, -379613, -379276, -376024, -366900, -367418, -367008, -379830, -377742, -368303, -372237, -372431, -386877, -383232, -381309, -367839, -371534, -381458, -379600, -367435, -362770, -356361, -357833, -346262, -353155, -345529, -355506, -369089, -374024, -360997, -365184, -360773, -351068, -349426, -372445, -374789, -373360, -389115, -379775, -364730, -366698, -366831, -370405, -377286, -382029, -379023, -361022, -350916, -353661, -358613, -358293, -364025, -378037, -384301, -378496, -378182, -375796, -366196, -365448, -367465, -391572, -378727, -362647, -361158, -367281, -358412, -357112, -356603, -348952, -346741, -337244, -324106, -322832, -327550, -323672, -324594, -336122, -344895, -338525, -352491, -371716, -370348, -352474, -349774, -349011, -360758, -363387, -357233, -356731, -351754]
7326c51754j103j692J703n2N362M536P847j0664j4795P951J6739R673p05r482
7312c36436J531j9658l740J0613M292r983o49J9131K7419m906j9657M972l069
7299c30140k725j0353l098r322m734j5233M112J2451L550J7643J4019q152r677
7286c41659p379J734P318n873l539j3135L501K470M099J0894M132n56m46k0521
7272c58960n396Q122j919J0134J2761k571N218n401m411m974J0922N778M513l989
7258c30173o754p895n480N58J573J1153J9157j519j3190n333k515j2093r145q132
7244c69788O541J7918J7133P741q700K338j9854j5122J970K1570O557o372l18
7231c38386O541R438J0413J536q459L637q61p582J0465N697j6134k7338O086J2065
$$ y = [-351754, -352857, -354549, -352846, -352898, -347536, -343000, -335153, -345817, -360612, -352661, -335922, -326249, -326954, -336436, -334905, -354563, -358303, -347690, -343398, -353381, -354030, -334899, -307480, -312386, -332043, -327071, -330140, -332865, -343218, -346316, -355638, -360372, -375605, -371493, -359042, -355492, -337849, -323830, -331982, -341659, -349038, -347304, -339986, -345859, -349398, -362533, -359032, -356562, -352463, -341569, -337437, -337993, -338439, -358960, -364356, -356234, -358153, -348019, -335258, -337829, -332611, -338012, -342423, -347397, -336475, -330697, -326184, -330173, -336927, -344822, -350302, -349744, -348171, -337018, -317861, -319380, -332570, -337903, -340418, -352511, -361656, -369788, -363247, -345329, -328196, -320455, -329155, -326817, -346671, -361793, -359823, -338253, -331696, -338068, -338386, -331845, -322407, -311994, -310458, -318917, -315280, -316141, -323723, -313258, -307561, -323695, -351033, -344947, -332882]
7217c32882j6783N364j123k8l827L925J7223P037q737j1351J2857n427j363l411
7203c38526l577q08O642n111j1121N884J5312O076j874j3301j058J1345o619n18
7189c37254J3652Q185p047j3260j7209p97J085R448P252K069l319n259J74q909
7175c51189P395L463q80n154K1648O172k5433n028P297N067j1987K678M213j3373
7161c55111m283J70m096P639p51N758p180O731J4377P112m420k197N341l570m988
7146c39468o201Q102n60j045q019J0320l323N68J1220J2048J546r670N799J8980
7132b99703l608k1955j5745n351K1227L949k2709M993J8012M920j6995k3561L339
7119c53187j2162Q446L1389J6436J5691M386j4559k4004j3996r104J1049L467
$$ y = [-332882, -349665, -344301, -345424, -345452, -349279, -345354, -328131, -321094, -329831, -341182, -328325, -333752, -335115, -338526, -342103, -342911, -336269, -341380, -352501, -346617, -331305, -325229, -327103, -340404, -341462, -330117, -336736, -337254, -323602, -315417, -322464, -335724, -352933, -353730, -352645, -343197, -335945, -333876, -337195, -342454, -342280, -351189, -343794, -340331, -341211, -346365, -324717, -318545, -343978, -349006, -341709, -336642, -348629, -345951, -341738, -355111, -359394, -359224, -363320, -355681, -356432, -350674, -357854, -351123, -336746, -329634, -334054, -336251, -330910, -334480, -339468, -345669, -337567, -338127, -339172, -347191, -336871, -340194, -339626, -328406, -316358, -314812, -324482, -318683, -299703, -303311, -325266, -341011, -346362, -325135, -321186, -343895, -338902, -320890, -315970, -332965, -356526, -353187, -365349, -356903, -325514, -309078, -293387, -289001, -303560, -327564, -341560, -350664, -339615, -336148]
7107c36148j8125m496P143K8310J2999l791q652p158P587m350J019j0514j7958
7094c54134J0441J9015P937p12m698k020q44j8895j7335p361l417N262J2455N214
7080c49092N65o074J986Q525k122k1903L80K2050J2878O421K1657L971J5571m774
7066b89961k8841k1554n077K0434P745J300M20J7529N752q742j2523j3019P931
7053c18606j0610j0012M780J787O979j107J480Q969K335j3065n713J4189L24k2062
7039c40332J0296J907r36K5216O679k7553p969r225q660R505J1508L567k917p625
7025c36539J044j878j4100J0933J0179P283O862q853j5112k071O410M964J2359
7012c18519N640q585o880q748j4205n440K2616P839P18j1595l243J3509Q751l021
$$ y = [-336148, -354273, -358769, -351626, -323316, -310317, -314108, -322760, -329918, -322331, -326681, -325662, -336176, -354134, -343693, -324678, -316741, -317453, -322151, -324171, -325015, -343910, -361245, -368606, -372023, -366761, -354306, -349092, -348527, -354601, -352615, -344090, -346212, -368115, -367735, -345685, -332807, -326386, -304729, -300758, -285187, -289961, -318802, -340356, -345433, -324999, -317254, -315954, -315534, -298005, -292253, -300995, -313518, -326537, -318606, -329216, -339228, -334448, -332661, -325682, -326789, -325309, -316340, -314005, -327070, -332783, -318594, -318270, -340332, -330036, -328129, -329065, -303849, -297170, -324723, -332692, -341917, -350577, -341072, -329564, -325997, -328914, -336539, -335495, -337373, -351473, -340540, -330361, -323078, -316216, -325069, -340181, -342252, -335842, -330878, -318519, -312879, -321464, -328344, -337092, -351297, -356737, -334121, -326282, -325564, -337159, -340402, -326893, -318142, -321163]
6998c21163o40k107n350j4555K995K5009P234J105k0456J0124J4129j3051k3543
6985c40269m630O707O975Q697N982J0437l907j0223K597j5350l744K0850M316
6972c11562m580p265J7831J2032j5023q713N158j260r119j0144o367M379O393
6959c28240j5537N49J7472J2006M170o635o136N727K413j5046k0082n34J7410
6946c32463K7154m879o835p263l231j0960Q569M383n946n232J3846P141P315O479
6932c01922m669K287O281l737r256P59p287j682j0296K257J1433J5308r161o725
6918c16410k337L845R24Q543J5777r368j4248K40l474o170m198p060O967J1014
6904c15955n709M819J4516n636M691L375q391p470r06l479J3279J66q868L462
$$ y = [-321163, -321803, -323910, -329260, -343815, -340820, -315811, -308577, -307472, -327928, -317804, -303675, -316726, -340269, -344899, -338192, -331217, -322520, -316538, -306101, -310008, -320231, -317634, -332984, -336728, -315878, -311562, -316142, -323407, -305576, -293544, -308567, -317280, -312122, -313382, -322501, -332645, -339012, -334633, -328240, -343777, -343228, -325756, -313750, -309580, -316215, -322351, -316624, -314211, -329257, -349339, -349873, -332463, -305309, -310188, -317023, -324286, -327517, -338477, -329908, -325525, -331471, -336703, -322857, -315716, -308401, -301922, -306591, -304304, -298023, -301760, -311016, -310257, -317544, -319226, -329522, -327265, -315832, -300524, -309685, -316410, -318747, -314902, -313978, -305435, -289658, -299026, -313274, -313034, -316508, -322678, -326876, -333936, -326969, -315955, -321664, -316845, -302329, -307965, -303274, -299899, -308290, -315760, -316666, -320145, -306866, -306700, -315568, -312106]
6890c12106k53j020r695N23p624j6604M914J4646R268K665q53K969M159N615k6315
6875c29711j8327k865J8223N169M302k560l706P64R309Q737J630l44K041j7650
6861c24988q361K469n675J6656j938j163J8229M104m228k719L544J698M735j7099
6847c14736j6756P657Q398K2438m4j1635J2710J5268J330j2685k86r197J262J7446
6833b78830m439K937K667p56q063l290j6500Q141J4507O82o942p012j244J049
6819b97093M248r641k970J53p257J481R262k15j1303m653OJ8754J5143j3700k5287
6804c23072N262K2303J0410O895Q107j9701k8118j8742J8441K9205J7665m402
6792b75747j828j371j3514l647J0920q252j2281l903j2943j4209J0383J4641L362
$$ y = [-312106, -312359, -313379, -323074, -322551, -330175, -346779, -341865, -327219, -317951, -315286, -316139, -313170, -309011, -303396, -329711, -348038, -350903, -332680, -327511, -323209, -325769, -329475, -328711, -319402, -310665, -309035, -309379, -307338, -324988, -333349, -330880, -336555, -319899, -321837, -323000, -304771, -300667, -304895, -307614, -304070, -302372, -297637, -314736, -331492, -323835, -315437, -292999, -293043, -304678, -291968, -276700, -275370, -288055, -288341, -297538, -296276, -278830, -283269, -280332, -277665, -278421, -286484, -289774, -306274, -298133, -283626, -282944, -289886, -296898, -298142, -297093, -292845, -302486, -305456, -305303, -312560, -311079, -301817, -302032, -313335, -317988, -317982, -299228, -284085, -297785, -323072, -317810, -295507, -285097, -278202, -270095, -289796, -317914, -336656, -318215, -289010, -271345, -275747, -277575, -278946, -292460, -296107, -285187, -293439, -305720, -309623, -322566, -336775, -326392, -311751, -308389]
6779c08389j392r098K489N509J0669j0781j0044J601j7472K598o73J2289K4360
6766b98334J3993k341n980K310J3382P964l366M770k181j274J1565K0943n346
6753b43895q436M610J923N288J0203J516j0613j9218q21K3917o186j0212M585
6740b47339k4937q35J5376Q861r971M381J7437N208L904M945K4475J9437q165
6727a87223J1323J5426K1358K8219L9339K0176J3838R052k5996j40210k31017
6716d25715j82060l0555L7199M2759L2065K2969J7623J3322J5280K1346k256K042
6704d35981K912Q302K7982K5282J7083N729N871l024k023n907j1128r630o025
6691c80557N009q700J7255P039j2652O399L0681K498J311j438P158o288Q84k3200
$$ y = [-308389, -309781, -318879, -316390, -310881, -300212, -310993, -321037, -319436, -336908, -334310, -334983, -322694, -298334, -284341, -286682, -292662, -290352, -276970, -269006, -272372, -267602, -269783, -271057, -259492, -238549, -243895, -252331, -247721, -245798, -240510, -230307, -228791, -239404, -258622, -259443, -235526, -241712, -251924, -247339, -272276, -273111, -257735, -248874, -258845, -254464, -237027, -231819, -227915, -222970, -198495, -179058, -187223, -175900, -160474, -139116, -110897, -71558, -51382, -37544, -28492, -54488, -194698, -425715, -607775, -638330, -601131, -558372, -526307, -503338, -485715, -472393, -457113, -435767, -438023, -435981, -433069, -424767, -396785, -371503, -354420, -348691, -342820, -345844, -347867, -353774, -364902, -374532, -380557, -375548, -384248, -366993, -359954, -372606, -366207, -335526, -333028, -331717, -333155, -325997, -332285, -331401, -354601]
6677c54601k0264O177J8990j7033L988J6440K2300L032k84j1578k766J127J465
6664c33007k114k692J70P531J2089l265j212q814m157o884Q891M753j3932N226
6650c37417J7799Q838O906P895R24k4966k4452O140K9323Q966o116k0253m013
6637c30426r504j6260N78J3576J8823K1370r432j8993N684L098m48J4961r682
6624c16655o976j5385R715J1266o546k661q569q10J0887O344K092n035N668K5832
6610b90833k768k1621o669L0315j433m262p161r594K222O475j0313Q164J4682
6597b92796L818j3593p514K1147J8284n671k3502j5445N296K242J579P388k8950
6584c27717k1621j571J7094Q331m55K075R348Q997p254o001N09K1347J2372M19
$$ y = [-354601, -374865, -368688, -349698, -366731, -362743, -346303, -324003, -320971, -321255, -332833, -335599, -334472, -333007, -335121, -337813, -337643, -330112, -318023, -321288, -322500, -331314, -335471, -342355, -333464, -328711, -342643, -337417, -319618, -310780, -303874, -295979, -295055, -320021, -344473, -338333, -309010, -300044, -306160, -326413, -330426, -339930, -356190, -355612, -342036, -323213, -301843, -311275, -330268, -324584, -321486, -321934, -306973, -316655, -323631, -339016, -329301, -318035, -324581, -327242, -335811, -336621, -325734, -319390, -317298, -322333, -316665, -290833, -293601, -315222, -321891, -291576, -293009, -297271, -304432, -314026, -311804, -305329, -315642, -307478, -292796, -288978, -302571, -310085, -288938, -270654, -276325, -299827, -315272, -309976, -307734, -306155, -298767, -327717, -349338, -350909, -333815, -325484, -325939, -323864, -314516, -305519, -312773, -318774, -318265, -296918, -284546, -284127]
6570b84127q642M280j4007j927q538L986R06k587n268p321p545k97M078K147R570
6555c15292O394R888Q321P521q503j9582k611N957m695O805J5541n23k3280J917
6541c12142P982j8675o334J2687N832J7041R067Q97o717M173j921k3634M580J6976
6527b90188J0844j339j3009q794j426j6552K994O680J3103k895j332M965M996
6514b91953k557m292K0877M283k2043j6483j027Q31K638Q665O538L0528n991r630
6500b79616J0556l134r589j5037j4231q090q449J3707Q825n27O980M80K892K804
6486b92429p07k589l103o067n484J6398R370O158N363o553j81L39K887N133J7298
6471b54167k871m358r181j8441k6107p064K3900M078q159j2956M095l32n804k781
$$ y = [-284127, -292769, -288489, -302496, -304423, -312961, -308975, -308069, -310656, -315924, -323245, -330790, -331087, -327009, -324862, -315292, -308898, -299010, -290689, -283168, -291671, -311253, -313864, -307907, -312602, -305797, -290256, -290779, -314059, -312142, -304160, -322835, -329169, -316482, -310650, -293609, -284542, -283645, -290362, -286189, -288110, -311744, -307164, -290188, -279344, -280683, -293692, -302486, -303912, -320464, -317470, -310790, -297687, -300582, -301914, -296949, -291953, -294510, -298802, -277925, -273642, -295685, -312168, -313195, -312364, -309726, -301061, -294523, -263995, -269986, -279616, -269060, -272194, -281783, -296820, -311051, -319141, -327590, -313883, -305058, -305585, -298605, -298125, -295233, -292429, -293136, -295725, -298828, -304895, -310379, -293981, -284611, -278453, -273090, -279643, -279824, -279485, -276598, -271465, -254167, -257038, -261396, -270577, -289018, -315125, -322189, -298289, -294211, -302370, -315326, -311231, -311563, -317367, -320148]
6457c20148M328P274p483K37J9126K802j634J319J1043O629Q352P701o725l40
6443b67519P276O949M017j102j885o954j1511j2922R84m982r225Q57j506J526
6429b95997J1024o47K086j595J1913P620p425j9639m195j0280M824K693l52K4742
6415b75228J1936p782m814q491Q12p635J904Q607r600j0755Q165j2574N800n716
6401c05371j3107J5575J3244J1729j7114j0527M742K740j2154m728Q079Q712J2323
6388b85857K677r335j2650J983p11L318j4175M127Q799R164o364k664K895r760
6374c08553M188J8327M078j6142O084j84j427k785L393L47j5439r50M326J119
6360c03618O408J4460k0605p269j3201n534K1175j458j4632l661M442R387k85
$$ y = [-320148, -315820, -308546, -316029, -315792, -296666, -293864, -295498, -294179, -283136, -276507, -268155, -260454, -267179, -267519, -260243, -253294, -249277, -250379, -252264, -259218, -270729, -283651, -282667, -287649, -296874, -296017, -297523, -295997, -284973, -285620, -283534, -285129, -273216, -265596, -273021, -292660, -296855, -307135, -302311, -299618, -299970, -275228, -263292, -271074, -275888, -284379, -283567, -291202, -289298, -280691, -290291, -301046, -292881, -305455, -299655, -305371, -318478, -302903, -289659, -277930, -295044, -305571, -300829, -298089, -310243, -314971, -306892, -298180, -285857, -283180, -292515, -305165, -303182, -303893, -300575, -314750, -310623, -301824, -292660, -299024, -301688, -298793, -308553, -304365, -286038, -281960, -298102, -292018, -292202, -293629, -296414, -293021, -292674, -308113, -309063, -304737, -303618, -297210, -282750, -303355, -310624, -323825, -329359, -308184, -309642, -324274, -327935, -323493, -314106, -314391]
6347c14391J3168J0878r79j7061p533J1551L206K301l187J0329N318p03O346l259
6333b84016j4926K133M503n697l362N317L410j3759P19J1468K349P538o562o663
6319b97548J205l292r58n986K280N628O723n06k07j5576j4720O674J8544R49K488
6304b94302Q868q865k324k483M89J9138Q693L559n176o434o422N714J411p09L059
6289b75784N745l188K375l630J888J5460L761j0869p419k2029j0295R574R203
6276b85208M795P51o107j1147J7507R255j6014j7664m634J4320K1810Q132o588
6263b70792l727J716J031q230n322l918N255J840n931n814K304q139l91k920m926
6248c07964J0975q42R301P934r665J156J4204R762P113k0198k4306O275j03J400
$$ y = [-314391, -301223, -290345, -291324, -308385, -315918, -304367, -301161, -298860, -302047, -291718, -286400, -287103, -280757, -284016, -298942, -296809, -292306, -298003, -301365, -296048, -292638, -306397, -305678, -294210, -291861, -284323, -290885, -297548, -296343, -299635, -300593, -306579, -304299, -298671, -291948, -292454, -292661, -308237, -322957, -316283, -297739, -296790, -294302, -285434, -294299, -296623, -299106, -298617, -279479, -270786, -267227, -272403, -278837, -285259, -279545, -278134, -278843, -275784, -270039, -273227, -270852, -274482, -272594, -257134, -253373, -264242, -271661, -293690, -303985, -294411, -285208, -280413, -279662, -285769, -296916, -279409, -270154, -286168, -303832, -308466, -294146, -272336, -264204, -270792, -274519, -272803, -271772, -280002, -285324, -289242, -283987, -282147, -288078, -293892, -291588, -299727, -300118, -303038, -307964, -296989, -297831, -288530, -280596, -290261, -289105, -274901, -265139, -258026, -278224, -302530, -296255, -296358, -294958]
6234b94958J0556J2739P363j4233k044l721k534K209P391L64m049O24k420j6203
6220b98916R51K1643J0025k0641j7439j2574J8420K1366j97j205K40p222M69m626
6206b89706J8022Q895k94n21K812O820l555m600j2774j3339J0766J076k828L562
6192b75664Q889q436k4681j7444M141R102J0796J3346P554O47n488j370O239o108
6178b78477q05P652r694K672P785q947o655J2518o571p161Q159R044M894J896
6164b63690j861N635N970j6352j4520M068m395J1639J4371J037P26Q250m996j1789
6150b65907j6651j1875l775k130J207J400J4180R59m516r328J1838k927M03j6116
6136c03238J2019N469N608P26l051R646M301j3936j1785l802J6566J1832J0299
$$ y = [-294958, -284402, -271663, -264300, -278533, -280577, -284298, -286832, -284623, -277232, -276868, -280917, -280293, -282713, -298916, -297965, -276322, -266297, -286938, -304377, -316951, -298531, -277165, -277362, -278567, -278327, -285549, -285080, -289706, -271684, -262789, -263083, -263604, -260792, -253972, -257527, -262127, -274901, -288240, -277474, -276398, -279226, -275664, -266775, -275211, -299892, -317336, -313195, -304093, -293297, -279951, -272397, -271750, -277238, -278608, -272369, -278477, -279282, -271630, -281324, -278652, -270867, -279814, -286469, -273951, -280522, -287683, -279524, -270480, -265586, -263690, -265551, -259916, -253946, -270298, -284818, -280750, -285145, -273506, -259135, -258098, -257372, -249122, -254118, -265907, -282558, -294433, -298208, -300338, -299131, -297731, -283551, -282592, -287108, -296436, -284598, -287525, -287122, -303238, -291219, -285750, -280142, -279416, -282467, -272821, -268520, -282456, -294241, -298043, -281477, -269645, -259346]
6123b59346k776j4948j2170j5221P677K7303m633J1468l34n880P816j120j0877
6110b73041j2368N917P110K549R476J1842j2454j6286M82N207K272r052R642R415
6096b59289K291q831j9398l243J4506J4946J0006j0938k2486L990nL694R617j161
6082b66301j5831l378J1129l389j566K786m390R438J1498n998j0150k284l137
6069b81573L132k21J0045j1149K777J1041J318j7822o697j0711P00K0680J0452
6056b68028M178L269j0150k6195p760K417J0782J9072O842p975r639q784l47J4158
6042b78160j1217P998Q360l321j3904L1960J1570K973k5647J756j5419o005J0119
6029b78937N573J287j6293k904J0354R453p129j3760j1837J2720K2412K462J2573
$$ y = [-259346, -262122, -277070, -289240, -304461, -296784, -269481, -274114, -262646, -262980, -268860, -261044, -262164, -273041, -285409, -279492, -272382, -269833, -260357, -248515, -260969, -277255, -276773, -271566, -269294, -278346, -268704, -259289, -256998, -265829, -285227, -288470, -273964, -259018, -249012, -259950, -282436, -278446, -278451, -274757, -265140, -266301, -282132, -285510, -274381, -277770, -279336, -276550, -280940, -271502, -260004, -266002, -276152, -278436, -281573, -278441, -278662, -268617, -279766, -276989, -265948, -264630, -282452, -289149, -299860, -299160, -278480, -268028, -263850, -260581, -270731, -296926, -304686, -302269, -291487, -272415, -265573, -273548, -283187, -291971, -292318, -278160, -289377, -281379, -273019, -276340, -290244, -258284, -246714, -243741, -269388, -267632, -283051, -289056, -278937, -273364, -272077, -288370, -291274, -280920, -271467, -278596, -292356, -304193, -291473, -269061, -266599, -254026]
6016b54026L152k5273n777J0635J318J3718K066J487j4837n033L0114o33j4590
6003b57679j0723N366j3383j0169J5504J863j4211k446j6765o112K4906J5669
5991b68180J438J1443m742j2514j7470q791J2675P54L019J3117o292p035j1630
5978b94208J3224J0706j2837p180J9494J0591o525P578j505j807l587m616K463
5965b68209j2994r15L291r510J3968J1173n673n449o915k504P771J8660r242r667
5951b76215j2789p37O666k003P918K1568K044n795J290O135n107o406j0621j0649
5937b84701O236j1377Q858K0816J5648r360p978o598Q31L797J0290j1520l1713
5924b96771O76J5380l733P105J5904J4420p218j5392o479Q149j5247k270R926
$$ y = [-254026, -250874, -276147, -281924, -271289, -269971, -256253, -254187, -252700, -267537, -272570, -242456, -243089, -257679, -268402, -263036, -276419, -286588, -271084, -269221, -283432, -285878, -302643, -308755, -283849, -268180, -266742, -255299, -260041, -272555, -290025, -298816, -286141, -285387, -282368, -269251, -275543, -282578, -294208, -280984, -270278, -283115, -290295, -270801, -260210, -266735, -259157, -260662, -262469, -266056, -270672, -268209, -281203, -282118, -278827, -288337, -274369, -263196, -268869, -274318, -281233, -283737, -275966, -257306, -266548, -276215, -289004, -289741, -283075, -285078, -277160, -255592, -253548, -259343, -258053, -251918, -257025, -263431, -274052, -284701, -278465, -289842, -280984, -260168, -244520, -253880, -261858, -268456, -267625, -263828, -253538, -265058, -296771, -296095, -280715, -284448, -277343, -261439, -247019, -254237, -269629, -276108, -267959, -283206, -285476, -275550]
5911b75550Q799o19O011J5065k629j3416p60N329J3185M303J561j7070j9361j2363
5897b87515o445J1825L818o425K291J5654j2736o196K4611R092k0918j602J2331
5884b62215k960j149l47k383J257J0458k01L025K816n793p165J9230k546j5336
5870b63309j4002k0016L362J4596J1461j7475j7497Q783J1473R36r484J5772O386
5857b69014o907m460j6454P260K1663M169o249k164J5267l488j0345l995l235
5844b77952j1377m742m826k547J0393r71k221j2393M559J4607K1135l216q701
5831b78252q96j679Q520K270p320K69M796P911Q466P91J722j3535k912p174n838
5816b82861r7P055P415J6663l529j8212j2078M244J3585k857Q072n885O30M828
$$ y = [-275550, -266751, -267370, -261359, -246294, -248923, -262339, -263099, -257770, -244585, -240282, -238721, -255791, -275152, -287515, -293960, -282135, -278317, -284742, -282451, -266797, -279533, -285729, -261118, -252026, -272944, -274546, -262215, -265175, -266324, -266671, -269054, -267797, -257339, -257540, -254515, -251699, -257492, -264657, -245427, -247973, -263309, -277311, -297327, -293965, -279369, -267908, -285383, -302880, -294097, -282624, -281688, -291172, -275400, -269014, -275921, -280381, -296835, -289575, -267912, -263743, -269992, -272156, -256889, -260377, -270722, -274717, -277952, -289329, -294071, -298897, -301444, -291051, -292022, -294243, -306636, -302077, -287470, -266335, -269551, -278252, -279148, -280827, -272307, -270037, -277357, -277088, -272292, -264381, -255915, -255124, -253402, -266937, -269849, -277023, -282861, -282958, -275903, -268488, -251825, -255354, -273566, -285644, -281400, -267815, -270672, -262600, -268485, -267855, -263027]
5802b63027m152l441r918K234J9506J635r253n176j1171p051j8974R056J2057
5789b87675M134J9506k775j7357j632L653o438q699L857k221K845M563k082K335
5775b87986K2696J1638M627j3286k3303j3339J3817J0195j2808k668O995K171
5763b81251n600J3218O192K0664k416P15j2410l775P116J1306M059l110l826r723
5749b58841j6096K05J626m834q471L121P90j860q932J7078L0328J3396j6955j2588
5735b62033L617J4204K590p448k727j1654j6588J8695J6495R202o358k0300n722
5722b68027M932P120l327m910Q496J3023J1359j4267j3461O408J3868L559l858
5709b39085P055J145j2102j0823j667p832j849o975o177J9176J0450k420p335
$$ y = [-263027, -267179, -270620, -280538, -278304, -258798, -257163, -266416, -271592, -282763, -289814, -308788, -299732, -287675, -283541, -264035, -266810, -284167, -285799, -282146, -288584, -297283, -293426, -295647, -292802, -288239, -290321, -287986, -265290, -253652, -249025, -262311, -285614, -298953, -285136, -274941, -287749, -290417, -283422, -281251, -286851, -273633, -267441, -246777, -249193, -248478, -260888, -264663, -257547, -246241, -242182, -245292, -249118, -258841, -274937, -274732, -273106, -277940, -286411, -283290, -282500, -284360, -293292, -276214, -245886, -232490, -249445, -262033, -258416, -244212, -241622, -249070, -251797, -263451, -280039, -261344, -244849, -235647, -242005, -262305, -268027, -263095, -255975, -259302, -264212, -255716, -242693, -231334, -245601, -259062, -252654, -238786, -235227, -239085, -232030, -230885, -242987, -253810, -255477, -263309, -265158, -272133, -278310, -259134, -248684, -251104, -258439]
5696b58439L282M70R106j479p942K2825l578k3328r395j4401M64J2157M326o307
5682b72239O307o590L514K340M33K0549M082k569R84R040J4052j183j6559l7822
5668b75661M285K2328m24j1554j0220Q009K015p273M64P104J1856m569l706R567
5654b47779r811o833j3732l177K2368J4606k0088m149K234n993K933J8267K623
5641b48531J310j535l142j251j9809j6806J013J9529R347N776J0094n279k2979
5628b72263q214N823P858M948j8207q435P978J4574J5283J4241j2763j3180N330
5615b57027O531p247R210p111j2940l546L910r282K550J458J2770p789l676j295
5601b73484J560m788J15K0922R39k710j0779K7548J5071p464o467n445K675K970
$$ y = [-258439, -255157, -254687, -245581, -247060, -255002, -232177, -235755, -259083, -268478, -282879, -282415, -270258, -265932, -272239, -265932, -272522, -269008, -266668, -266235, -245686, -241604, -244173, -243189, -234149, -220097, -221280, -237839, -275661, -271376, -249048, -249472, -261026, -271246, -263237, -261222, -268495, -268031, -260927, -249071, -253640, -257346, -247779, -257590, -264423, -278155, -281332, -258964, -244358, -264446, -268595, -266361, -272354, -269421, -251154, -248531, -247221, -248756, -251898, -253149, -272958, -289764, -288751, -269222, -259875, -254099, -244005, -249284, -272263, -280477, -274654, -266796, -261848, -280055, -288490, -280512, -265938, -250655, -236414, -249177, -262357, -257027, -250496, -257743, -248533, -255644, -268584, -272130, -268220, -277502, -274952, -273494, -260724, -268513, -272189, -273484, -271924, -276712, -276597, -255675, -254736, -257446, -268225, -240677, -225606, -233070, -239537, -244982, -242307, -239337]
5587b39337j2847l594p902J8909M438k212Q301r607p163n927J422p475l592j9195
5573b85781j6563J4815J1051J281j6491q27J2451J7468J6426J040r948k576O416
5560b51238K842n879m619l755j1538J0475O270J522j0084k851m636q084l422J9124
5546b65873l69j5954j587l403P885J2245J5430J393R992O891O227r804q431j3647
5532b59005q311j2297j295J0528J2348K388o127r667Q730O564j281o966j9951
5519b84342J5996J9405r827n101P870R312n867r95p128M614l130O54O089L349
5505b49101k263J481R342J714R300q07p120o403q755N196J5403j1388J176J1251
5491b30974j8288R007J534K981k94J2568j1470j594k481j380j2205r644j457p034
$$ y = [-239337, -252184, -255778, -263680, -244771, -240333, -242545, -234244, -243851, -251014, -256941, -255519, -262994, -266586, -285781, -302344, -287529, -276478, -275197, -291688, -292515, -280064, -262596, -246170, -245130, -255078, -257654, -251238, -248396, -254275, -258894, -262649, -274187, -263712, -257442, -255920, -266004, -268855, -273491, -281575, -284997, -265873, -266242, -282196, -283783, -287186, -279301, -267056, -251626, -250233, -240241, -233350, -227123, -236927, -245358, -259005, -267316, -279613, -280908, -270380, -258032, -255644, -261771, -271438, -262708, -256144, -257425, -264391, -284342, -268346, -248941, -258768, -263869, -255999, -246687, -252554, -253549, -260677, -256063, -259193, -258539, -252450, -249101, -251364, -249883, -240541, -238827, -229527, -230334, -237454, -243857, -252612, -247416, -232013, -243401, -242225, -230974, -249262, -240255, -238721, -235740, -236034, -223466, -234936, -236530, -239011, -240391, -252596, -262240, -263697, -270731]
5477b70731l530K3381L0251l905j9097k453n791J5726Q044m336j0866J6559J5150
5464b11598k2684j0209n001K430M493q653j618N229O381k652q50O852N189N146
5450b27545k940j6172N633R182j654l358k3347j847k648J0535J6209q500j0198
5437b56650J7534Q933j7305k556Q032k2493O57Q961K631K579l717j065Q372K972
5423b43115j948j1444n797J0129J0740N109M335K245j6044N853l302O224m891
5410b41906k088l095k907p0j837m056n455j1148j789J0111n544J505J8181J4665
5396b35433J026K918m187o55m32j5189k164J69O546K6053J5348q121j3600K14
5382b27507l943M287P906j1290M492j345j6145r132q63n780J7908J676R901j1299
$$ y = [-270731, -274261, -250880, -220629, -224534, -243631, -246084, -251875, -236149, -228105, -232441, -243307, -226748, -211598, -234282, -244491, -249492, -247062, -242569, -251222, -252840, -247611, -241230, -243882, -244732, -237880, -232691, -227545, -230485, -246657, -241024, -231842, -233496, -236854, -260201, -262048, -264696, -254161, -237952, -246452, -256650, -239116, -230183, -247488, -250044, -242012, -264505, -263848, -254887, -252256, -249677, -253394, -254459, -246087, -243115, -245063, -256507, -262304, -252175, -241435, -236326, -231991, -229746, -245790, -239937, -243239, -237015, -241906, -243994, -247089, -249996, -250066, -251903, -255959, -261414, -272562, -274351, -264240, -269784, -268279, -250098, -235433, -234407, -231489, -235676, -236331, -236763, -251952, -254116, -253947, -247401, -221348, -206000, -214121, -227721, -227507, -231450, -227163, -219257, -230547, -226055, -227400, -243545, -252677, -253540, -259320, -241412, -239736, -229835, -241134]
5368b41134j6347J260P291M554O836J14J5334m805j0350L726M774k690l786j6333
5354b51556n137p031L017J7211J7806K628q926k0884L808L982j798r713R048R724
5340b37821J3379q986o766Q150J093k106P792j681m961n818p283L612J287n695
5326b45804K089r78k615N175M297k543R341R4J1600R582j4262q873O856p845p039
5311b40925j0752j3007l922K5059M054k710P503q48o46q86m147N015n861N773
5297b36300r318P164J7818K736O936l231L461K180l396j0154J0599N171j6255
5284b22589j8911j7249q6N461J221m704Q679n076j607K342M083P297M785o560
5270b42914O09J3042j524o427j551j6608j5094j0426J052Q913K911r696o119J8813
$$ y = [-241134, -257481, -256221, -248930, -244376, -237540, -237426, -222092, -226897, -237247, -233521, -228747, -231437, -235223, -251556, -256693, -263724, -260707, -243496, -225690, -223062, -231988, -252872, -249064, -245082, -246880, -256593, -247545, -237821, -224442, -233428, -240194, -232044, -230951, -233057, -225265, -226946, -231907, -237725, -245008, -241396, -240109, -245804, -243715, -244693, -247308, -242133, -237836, -240379, -231038, -230944, -219344, -209762, -224024, -232897, -226041, -233886, -240925, -251677, -264684, -268606, -243547, -239493, -242203, -234700, -235548, -236194, -237080, -241227, -236212, -242073, -236300, -245618, -238454, -220636, -217900, -210964, -214195, -210734, -208554, -211950, -222104, -211505, -206334, -222589, -241500, -258749, -258835, -253374, -252153, -256857, -248178, -253254, -254861, -252519, -248436, -241139, -236354, -242914, -242305, -229263, -230787, -237214, -238765, -255373, -270467, -280893, -279841, -270928, -268017, -277713, -283832, -265019]
5256b65019J7589J7893J9552j1740j2595j6927j367J318N768K1966M759j1920
5244b30723j9399N207j641n89Q709J7712K070N486q489j7451p432P791L078k5658
5230b61329j446J8217J594J9803J1371j8644j6428o030P566Q134J698O305L326
5217b25863j9955n822J3901m724N41J622M942k097J782q063p760j0549L401J594
5203b57050J6640J7481P64r281l596j297O91j2821P14J1126N446k0802j941L322
5189b50604m964q684O709O262n324m516m829J0005n053l810N889N185n786L369
5175b56151o782j1529J7809l31J344N73J6725M184O261k998q940mQ353r669j5049
5160b56204N64R131N914n887n019J0702j4774n628J1968L481M429j5252j087J171
$$ y = [-265019, -247430, -229537, -209985, -221725, -234320, -251247, -252614, -251296, -245528, -223562, -218803, -230723, -250122, -244915, -246556, -247145, -238436, -220724, -218654, -213168, -221657, -239108, -246540, -238749, -235671, -261329, -262775, -244558, -242964, -223161, -211790, -230434, -246862, -252892, -245326, -237192, -235494, -229189, -225863, -245818, -251640, -237739, -242463, -241922, -240300, -235358, -237455, -235673, -243736, -251496, -262045, -258644, -257050, -240410, -222929, -222165, -231446, -235042, -236339, -235648, -248469, -247755, -236629, -231183, -251985, -253926, -250604, -255568, -264252, -257543, -251281, -256605, -261121, -265950, -255945, -260998, -264808, -258919, -253734, -259520, -256151, -262933, -274462, -256653, -256984, -255640, -255067, -238342, -234158, -227897, -230895, -239835, -239839, -231486, -241155, -256204, -255640, -246509, -240595, -246482, -251501, -240799, -255573, -261201, -249233, -245752, -241323, -256575, -257662, -256491]
5146b56491o001j8597J2127J8922N048N720Q349j0884j5133J8J7553J3491j6206
5133b42084M558K0909M082l632N749J5275r470j9931j1677q055l407M189J408
5120b42086K297N882o48l371j9212p794J0749K4042q873k157o914O012j0367Q008
5106b44432K0950J0021k6872j5297J5553q287k981l728K944k254j6868o015J1511
5093b65755L0976J3214n078j2815n422q713O344j8252j3989J2828K0323J8336
5081b28003L397k994J412K087Q614o252L71o18j5538j4351K4907Q90p854l711
5067b37643r612J804N068J5269j9458j122K6505O11p324N152L256p029q771J209
5053b32085J3081L3180J8773k2858j5083L30R70k946P538j5141m680P045n325
$$ y = [-256491, -262492, -281089, -268962, -250040, -244992, -239272, -230923, -241807, -256940, -256922, -239369, -225878, -242084, -237526, -216617, -212535, -216167, -210418, -195143, -204613, -224544, -236221, -244276, -247683, -243494, -242086, -239789, -233907, -234555, -237926, -257138, -264932, -254183, -230141, -239014, -241171, -248085, -242073, -252440, -244432, -223482, -213461, -240333, -255630, -240077, -248364, -251345, -255073, -252129, -254383, -271251, -277266, -265755, -234779, -221565, -226643, -239458, -244880, -253593, -247249, -265501, -279490, -266662, -246339, -228003, -224606, -227600, -226188, -224101, -215487, -221739, -221368, -221986, -237524, -251875, -226968, -226078, -233932, -237643, -247255, -245451, -240383, -225114, -244572, -245694, -219189, -218578, -225902, -220750, -217494, -224523, -233294, -232085, -219004, -185824, -167051, -189909, -204992, -204662, -203692, -206638, -199100, -214241, -218921, -211876, -217201]
5040b17201L675O856k5069K67J7632q786O374j969n033p11p223l001n635J0177
5026b29647l301K330J4726n142Q711J1235R68n856j6512k847R371J5901N655l9465
5012b33873j2879J2411r927J4372n197k1554P88J3770K3910J0735j5953p099r315
4999b39811K147J3707J729k694q849j7008q029J4559N93q319j4245j1547p478
4986b85245j3103J1385J7203R078m412N696O584J4393K6952n758l462M890L702
4973b12097o169J504m20o446j1399n371J108l162J329O591P812m919J7622m279
4959b18296j0841K818J5359J1817M022j4762o316p31q801k4207j7954J7582K0737
4946b29573j1448j449n813o22O490k5J1210J1740r45j2491p421j2958q511j6365
$$ y = [-217201, -213526, -206670, -231739, -231472, -213840, -222626, -216252, -218221, -223254, -223965, -231188, -234189, -239824, -229647, -232948, -230618, -215892, -221034, -212323, -201088, -200120, -205976, -222488, -225335, -215964, -200063, -194408, -233873, -246752, -234341, -244268, -229896, -235093, -256647, -255859, -242089, -218179, -207444, -223397, -230496, -239811, -237664, -223957, -222228, -224922, -233771, -250779, -258808, -244249, -243656, -251975, -266220, -277767, -285245, -298348, -286963, -269760, -260682, -265094, -259398, -252814, -238421, -211469, -217227, -220689, -215799, -212097, -218266, -216762, -217182, -223628, -235027, -240398, -239290, -242452, -241123, -234532, -226720, -231639, -214017, -218296, -229137, -226319, -210960, -199143, -195121, -209883, -216199, -216930, -225731, -249938, -267892, -250310, -229573, -241021, -242470, -248283, -248905, -242415, -242440, -231230, -219490, -220435, -232926, -240347, -253305, -261816, -278181]
4932b78181J7837J7290M035J0202N714j8028j3966R28M406L103p986n897N451
4919b55092M110j2540P590J694J609R775K4554R019L613k4257j7292O901P402
$$ y = [-278181, -260344, -243054, -239019, -228817, -223103, -241131, -255097, -254169, -249763, -246660, -254646, -260543, -255092, -250982, -263522, -255932, -254238, -252629, -242854, -218300, -209281, -205668, -229925, -247217, -240316, -232914]
$$ [...]
##END NTUPLES=NMR SPECTRUM
##END=
