##TITLE=Analysis number 329193
Compound Code cc 49513
Book Reference 486/180
Project Code adrs
Chemist Name simons
##JCAMPDX= 6.0         $$ Bruker NMR JCAMP-DX V2.0
##DATA TYPE= NMR SPECTRUM
##DATA CLASS= NTUPLES
##ORIGIN= Bruker BioSpin GmbH
##OWNER= nmr
$$ XWIN-NMR		Version 3.5
$$ Wed Aug  8 12:06:35 2007 GMT Daylight Time (UT+1h)  MAYBRIDGE\nmr@NMR_250MHZ
##.OBSERVE FREQUENCY= 250.131544655141
##.OBSERVE NUCLEUS= ^1H
##.ACQUISITION MODE= SIMULTANEOUS (DQD)
##.ACQUISITION SCHEME= undefined
##.AVERAGES= 16
##.DIGITISER RES= 18
##SPECTROMETER/DATA SYSTEM= dpx250
##.PULSE SEQUENCE= zg30
##.SOLVENT NAME= CDCl3
##.SHIFT REFERENCE= (INTERNAL, CDCl3, 0, 16.4601)
##AUDIT TRAIL= $$ (NUMBER, WHEN, WHO, WHERE, WHAT)
$$ ##TITLE= Audit trail, XWIN-NMR		Version 3.5
$$ ##JCAMPDX= 5.01
$$ ##ORIGIN= Bruker BioSpin GmbH
$$ ##OWNER= nmr
$$ C:\u/data/dgb/nmr/ADRS/310/pdata/1/auditp.txt
$$ ##AUDIT TRAIL=  $$ (NUMBER, WHEN, WHO, WHERE, WHAT)
(   1,<2007-08-08 12:06:13.39 +100>,<MAYBRIDGE\nmr>,<NMR_250MHZ>,
      <created by zg, POWCHK disabled, PULCHK disabled
       configuration hash MD5:
       76 6E 9A 78 1E 09 19 81 EC 84 63 8F B0 6A 59 2D
       data hash MD5: 64K
       63 AE B9 2E 76 9F 77 9D AB 90 A8 B2 53 F0 E9 29>)
(   2,<2007-08-08 12:06:25.85 +100>,<MAYBRIDGE\nmr>,<NMR_250MHZ>,
      <Start of raw data processing
       ef LB = 0.3 FT_mod = 6 PKNL = 1 SI = 32K 
       data hash MD5: 32K
       CA 1A 0B 5F 67 4E F5 41 A9 6A 2C 59 64 99 D9 F8>)
(   3,<2007-08-08 12:06:27.50 +100>,<MAYBRIDGE\nmr>,<NMR_250MHZ>,
      <apk 
       data hash MD5: 32K
       C8 94 39 2B C4 2E D6 2D E7 59 84 DD 59 D4 93 27>)
(   4,<2007-08-08 12:06:28.31 +100>,<MAYBRIDGE\nmr>,<NMR_250MHZ>,
      <abs ABSG = 5 
       data hash MD5: 32K
       41 48 AE F1 7D ED A8 0E FC 38 E2 79 4D 0D 3D 97>)
$$ ##END=
$$ 
$$ hash MD5
$$ EC AB A0 9F CA FB 25 8E AA C0 93 73 1E 31 5C 62
##$RELAX= 
##$RELAX= 
##$RELAX= 
##$RELAX= 
##$RELAX= 
##$RELAX= 
##$RELAX= 
$$ Bruker specific parameters
$$ --------------------------
##$DU= <C:\u>
##$EXPNO= 310
##$NAME= <ADRS>
##$PROCNO= 1
##$TYPE= <nmr>
##$USER= <dgb>
##$AMP= (0..31)
100 100 100 100 100 100 100 100 100 100 100 100 100 100 100 100 100 100 
100 100 100 100 100 100 100 100 100 100 100 100 100 100 
##$AQSEQ= 0
##$AQ_mod= 3
##$AUNM= <au_zg>
##$AUTOPOS= <16 >
##$BF1= 250.13
##$BF2= 250.13
##$BF3= 250.13
##$BF4= 250.13
##$BF5= 500.13
##$BF6= 500.13
##$BF7= 500.13
##$BF8= 500.13
##$BYTORDA= 1
##$CFDGTYP= 0
##$CFRGTYP= 5
##$CHEMSTR= <none>
##$CNST= (0..31)
1 1 145 1 1 1 1 1 1 1 1 1 1 1 1 1 1 1 1 1 1 1 1 1 1 1 1 1 1 1 1 1 
##$CPDPRG= <>
##$CPDPRG1= <>
##$CPDPRG2= <>
##$CPDPRG3= <>
##$CPDPRG4= <mlev>
##$CPDPRG5= <mlev>
##$CPDPRG6= <mlev>
##$CPDPRG7= <mlev>
##$CPDPRG8= <mlev>
##$CPDPRGB= <>
##$CPDPRGT= <>
##$D= (0..31)
0 1 0 0 0 0 0 0 0 0.06 0 0 0 0 0 0 0.0002 0 0 0 0 0 0 0 0 0 0 0 0 0 0 
0 
##$DATE= 1186571172
##$DBL= (0..7)
120 120 120 120 120 120 120 120 
##$DBP= (0..7)
150 150 150 150 150 150 150 150 
##$DBP07= 0
##$DBPNAM0= <>
##$DBPNAM1= <>
$$ [...]
##$SUBNAM7= <"">
##$SUBNAM8= <"">
##$SUBNAM9= <"">
##$SW= 20.6930455092707
##$SWIBOX= (0..15)
0 0 3 0 0 0 0 0 0 0 0 0 0 0 0 0 
##$SW_h= 5175.983436853
##$TD= 65536
##$TD0= 1
##$TE= 297.16
##$TE2= 300
##$TE3= 300
##$TEG= 300
##$TL= (0..7)
0 120 120 120 120 120 120 120 
##$TP= (0..7)
150 150 150 150 150 150 150 150 
##$TP07= 0
##$TPNAME0= <>
##$TPNAME1= <>
##$TPNAME2= <>
##$TPNAME3= <>
##$TPNAME4= <>
##$TPNAME5= <>
##$TPNAME6= <>
##$TPNAME7= <>
##$TPOAL= (0..7)
0.5 0.5 0.5 0.5 0.5 0.5 0.5 0.5 
##$TPOFFS= (0..7)
0 0 0 0 0 0 0 0 
##$TUNHIN= 0
##$TUNHOUT= 0
##$TUNXOUT= 0
##$USERA1= <user>
##$USERA2= <user>
##$USERA3= <user>
##$USERA4= <user>
##$USERA5= <user>
##$V9= 5
##$VALIST= <valist>
##$VCLIST= <CCCCCCCCCCCCCCC>
##$VD= 0
##$VDLIST= <DDDDDDDDDDDDDDD>
##$VPLIST= <PPPPPPPPPPPPPPP>
##$VTLIST= <TTTTTTTTTTTTTTT>
##$WBST= 1024
##$WBSW= 4
##$XGAIN= (0..3)
0 0 0 0 
##$XL= 0
##$YL= 0
##$YMAX_a= 399037
##$YMIN_a= -385151
##$ZGOPTNS= <>
##$ZL1= 120
##$ZL2= 120
##$ZL3= 120
##$ZL4= 120
##$ABSF1= 16.46012
##$ABSF2= -4.233053
##$ABSG= 5
##$ABSL= 3
##$ALPHA= 0
##$AQORDER= 0
##$ASSFAC= 0
##$ASSFACI= 0
##$ASSFACX= 0
##$ASSWID= 0
##$AUNMP= <proc_1d>
##$AZFE= 0.1
##$AZFW= 0.1
##$BCFW= 0
##$BC_mod= 0
##$BYTORDP= 0
##$COROFFS= 0
##$CY= 12.5
##$DATMOD= 1
##$DC= 0
##$DFILT= <>
##$DTYPP= 0
##$F1P= 14.0000005364418
##$F2P= -0.99999901652339
##$FCOR= 0.5
##$FTSIZE= 32768
##$FT_mod= 6
##$GAMMA= 0
##$GB= 0
##$INTBC= 1
##$INTSCL= 1
##$ISEN= 128
##$LB= 0.3
##$LEV0= 0
##$LPBIN= 0
##$MAXI= 10000
##$MC2= 0
##$MEAN= 0
##$ME_mod= 0
##$MI= 0
##$NCOEF= 0
##$NC_proc= -2
##$NLEV= 6
##$NOISF1= 0
##$NOISF2= 0
##$NSP= 0
##$NTH_PI= 0
##$NZP= 0
##$OFFSET= 16.46012
##$PC= 1
##$PHC0= -45.95004
##$PHC1= 6.017252
##$PH_mod= 1
##$PKNL= yes
##$PPARMOD= 0
##$PSCAL= 4
##$PSIGN= 0
##$REVERSE= no
##$SF= 250.130015476578
##$SI= 32768
##$SIGF1= 0
##$SIGF2= 0
##$SINO= 400
##$SIOLD= 32768
##$SREGLST= <1H.CDCl3>
##$SSB= 0
##$STSI= 32768
##$STSR= 0
##$SW_p= 5175.98343685301
##$SYMM= 0
##$S_DEV= 0
##$TDeff= 65536
##$TDoff= 0
##$TI= <Analysis number 999999
Compound Code 99
Book Reference 9
Project Code 9>
##$TILT= no
##$TM1= 0
##$TM2= 0
##$TOPLEV= 0
##$USERP1= <user>
##$USERP2= <user>
##$USERP3= <user>
##$USERP4= <user>
##$USERP5= <user>
##$WDW= 1
##$XDIM= 32768
##$YMAX_p= 314710068
##$YMIN_p= -104938
$$ End of Bruker specific parameters
$$ ---------------------------------
##NTUPLES= NMR SPECTRUM
##VAR_NAME=  FREQUENCY,     SPECTRUM/REAL,   SPECTRUM/IMAG
##SYMBOL=    X,             R,               I
##VAR_TYPE=  INDEPENDENT,   DEPENDENT,       DEPENDENT
##VAR_FORM=  AFFN,          ASDF,            ASDF
##VAR_DIM=   32768,         32768,           32768
##UNITS=     HZ,            ARBITRARY UNITS, ARBITRARY UNITS
##FACTOR=    0.157963299565203, 1,           1
##FIRST=     4117.16988210762, 0,            0
##LAST=      -1058.81355474539, 0,           0
##MIN=       -1058.81355474539, -104938,     0
##MAX=       4117.16988210762, 314710068,    0
$$ Real data points
##PAGE= N=1
##DATA TABLE= (X++(R..R)), XYDATA
$$ [...]
17130A0750l083k515N817N231q881k739j0197K148m770L926O487j0019o207N920
17116h132M914j632J1840J332j561P166l564j5635q799m129N670L038k24Q22P395
17101a499M60L176j3043j897L921P855K828J965n403k980k538J132N46l921M16
17086h982j763k179O31Q750J2651P551j6916L803L804q77p200j1543n860O919
17072a1211M838M956K522p432m254m065J453K341J202M988j096n202j237R065
17058c132P670m984o25j957l547L022R871J172r833N240m082p158Q44N000R699
17043G200M334j4958k830j879k23M00Q1J1112N459q903K662K976o645r534o653
17028a7401J860L916r81J0164J5190R73l280o801J183l716M374J871p174j4474
$$ plain form
17130 10750 7667 5152 10969 16200 7319 4580 -5617 -3469 -8239 -4313 2174 -7845 -14052 -8132
17116 -8132 -3218 -4850 6990 8322 6761 13927 10363 -5272 -14071 -18200 -12530 -9492 -9716 -8894 -1499
17101 -1499 -1039 2137 -10906 -12803 -8882 -1027 1801 3766 -1637 -4617 -7155 -6023 -5477 -9398 -8982
17086 -8982 -10745 -12924 -12293 -3543 9108 16659 -257 3546 7350 6473 -727 -12270 -18130 -11211
17072 -11211 -6373 -1417 1105 -6327 -10581 -14646 -13193 -10852 -9650 -4662 -5758 -10960 -12197 -3132
17058 -3132 4538 -446 -1071 -3028 -6575 -3553 6318 7490 -2343 2897 -1185 -8343 -7499 -2499 7200
17043 7200 11534 -3424 -6254 -8133 -8356 -7956 -7875 3237 8696 -207 2455 5431 -1214 -10748 -17401
17028 -17401 -15541 -11625 -12606 -2442 12748 13721 10441 3640 4823 1107 5481 7352 178 -14296
17014a4296K909L946J410O66J663L752n825K24J617Q054m222o484N862m575j324
16999f623n501K349J1200J144m487j037M298n138K610J1735p746q454l756j857
16985a1263J0526R354J09q705j2243O893R252L045l957l777m002n449N72K461
16971g184J119k66j798O73M44m404M867M111N376l915L979N741p124r944K792
16956e533M268l474P237L607K312q979n93j2223j4705K935J2641M702J2251Q652
16942A3098o500O634k445o546p472o964m494O819K564k530k519k708J106j153
16928a3110j095p467J993Q819K1004Q445j3975p485K216o795q987R179J455L943
16914a860J0271J262m829L200J757l785j318l571n915o033J864N453P858N531
$$ plain form
17014 -14296 -11387 -7441 -6031 -5365 -3702 50 -5775 -5551 -3934 4120 -102 -6586 -724 -5299 -6623
16999 -6623 -12124 -9775 1425 2569 -1918 -2955 1343 -3795 -1185 10550 2804 -5650 -9406 -11263
16985 -11263 -737 8617 8726 21 -12222 -5329 3923 6968 3011 -766 -4768 -10217 -9645 -7184
16971 -7184 -6065 -6331 -8129 -7456 -7012 -11416 -6549 -2438 2938 -977 3002 8743 1619 -8325 -5533
16956 -5533 -1265 -4739 2498 6105 8417 -562 -1155 -13378 -28083 -25148 -12507 -7805 4446 13098
16942 13098 6598 13232 10787 4241 -3231 -10195 -14689 -7870 -5306 -7836 -10355 -13063 -11957 -13110
16928 -13110 -14205 -21672 -19679 -10860 10144 18589 4614 -2871 -655 -7450 -16437 -7258 -5803 -1860
16914 -1860 8411 9673 4844 8044 9801 6016 4698 1127 -4788 -10821 -8957 -3504 4354 9885
16900I885o441l528j4209N715R349R19j314k149k740K449P31m177L332L023p620
16885f775m573J940M619k960J480J386j1670j776J0347J986p497R677O285O98
16871C167M033l448l30O59J871K543o90n380M442k478M121n754m538P330R78q766
16855b240J783P53n74o744N881O962j4986m808o32O726K396o430J98L012M619
16840d084l450O07M471o284O248M622n101q494k003M149O935o595p632M4O663
16825i904N069p83M395J66N383n315l259j968j505j719k07n495M337J2380L045
16810D620k231L93m456L991N539R056N468j556p62o955p314j078l39m170j20J1257
16794A1343N712o757p130p990m792n079j807N761K475J517j562M868K869J468
$$ plain form
16900 9885 3444 -84 -14293 -8578 771 1690 376 -1773 -4513 -2064 -1333 -5510 -2178 845 -6775
16885 -6775 -11348 -9408 -4789 -7749 -6269 -4883 -16553 -18329 -7982 -5996 -13493 -3816 2469 3167
16871 3167 7200 3752 3422 4081 5952 8495 7805 2425 6867 4389 8510 2756 -1782 5548 6526 -2240
16855 -2240 -457 296 -278 -7022 -1141 5821 -9165 -13973 -14605 -7879 -5483 -11913 -11715 -8703 -4084
16840 -4084 -7534 -6927 -2456 -8740 -2492 2130 -2971 -11465 -13468 -9319 -2384 -8979 -16611 -16567 -9904
16825 -9904 -4835 -5618 -1223 -1057 4326 -989 -4248 -6216 -7721 -9440 -9647 -15142 -10805 1575 4620
16810 4620 2389 2782 -1674 2317 7856 16912 22380 20824 20062 13107 5793 4715 4376 206 86 11343
16794 11343 17055 10298 3168 -4822 -9614 -14693 -16500 -10739 -8264 -6747 -8309 -3441 -572 896
16780H96K021O466J969R442K381p71j1141j2119p600K811J712l416J474M930k055
16765c000M005m387K024j036k404J478L62o315j851P729J682j160L826k1r11j374
16749a353m404p761J0269J2580O566q386j5296L85L509J407M964m246o523l27
16735h616n854M634l421k35J022n992K819P122k552l757n1m629Q245Q073q267
16720a1459q969k958N133L463j297L691O552O611n154j473n011l355M885R602
16706B61l82j790l676k694j064k915J979P99m05j191r141J091j746L009O710R121
16690b034K601o411m003L8J230j468j3k253J0147j61n374J956J467K254q062K250
16674g836K9k613k509j903m734L882P555N986J225N015P979Q79K849o619j9K934
$$ plain form
16780 896 2917 9383 11352 20794 23175 22404 11263 -856 -8456 -5645 -3933 -7349 -5875 -945 -3000
16765 -3000 1005 -3382 -1358 -2394 -4798 -3320 -2958 -9273 -11124 -3395 -1713 -2873 953 932 21 -1353
16749 -1353 -5757 -13518 -3249 9331 15897 7511 -7785 -7400 -3891 -2484 2480 -1766 -8289 -8616
16735 -8616 -14470 -9836 -13257 -13492 -12470 -18462 -15643 -8521 -11073 -14830 -14881 -19510 -11265 -3192 -11459
16720 -11459 -20428 -23386 -18253 -14790 -16087 -12396 -5844 767 -4387 -5860 -10871 -14226 -9341 261
16706 261 -121 -1911 -5587 -8281 -9345 -12260 -10281 -9482 -9887 -11078 -20219 -19128 -20874 -17865 -11155 -2034
16690 -2034 567 -5844 -9847 -9809 -8579 -10047 -10060 -12313 -2166 -2327 -7701 -5745 -4278 -2024 -10086 -7836
16674 -7836 -7807 -10420 -12929 -14832 -19566 -15684 -8129 -2143 -918 4097 12076 12955 15804 9185 9166 12100
16658A2100r580l635M994l044M229P628r640p848L878J955K085r157l634N075
16644d594N006j926m870J901M944K338L054j4116k106R356P491o625K633O36r066
16629e944L785p82J0410l844l687l315J622r16K635Q137j322m257p115p011r04
16614a2508j295N886P064k809l695K009L823j826q586j38M371l374J154L492P479
16599A047K550j476l283k276p42j3375m787J0104J9351N495l667n234r878m28
16585f599J858L200J718R24r215m305m953K015N371q18L31N9L848L929Q558P43
16569F664m337p064N233J421L321o057R09Q362M963m476o213J891K029j688n404
16554d46k528J438J0815K358L024k652o041p055M774O772m752J51k475q851O310
$$ plain form
16658 12100 2520 -1115 3879 835 5064 12692 3052 -4796 -918 1037 3122 -6035 -9669 -4594
16644 -4594 412 -1514 -6384 -4483 461 2799 5853 -8263 -10369 -1013 6478 -147 2486 3122 -5944
16629 -5944 -2159 -2941 7469 3625 -62 -3377 -1755 -2671 -36 8101 6779 2522 -4593 -11604 -12508
16614 -12508 -13803 -7917 -853 -3662 -7357 -5348 -1525 -3351 -11937 -12075 -7704 -11078 -9924 -6432 1047
16599 1047 3597 2121 -1162 -3438 -4180 -17555 -22342 -12238 7113 12608 8941 3707 -6171 -6599
16585 -6599 -4741 -1541 177 1101 -8114 -12419 -17372 -15357 -9986 -10804 -10473 -10414 -6566 -2637 5921 6664
16569 6664 2327 -4737 496 1917 5238 -819 90 8452 13415 8939 2726 4617 6646 4958 -446
16554 -446 -2974 -1536 9279 11637 14661 12009 5968 -1087 3687 10459 5707 5858 3383 -5468 842
16539H42N850R860k392j952N920j1194r085j468m192L603Q593L60l755j991l372
16524d373m410O594J1230Q858j914j6568o593J122K153M70M648R34n521o513L3
16509i850P692O507m154K93Q333p578p582j042M016N703m811o699q975L401N164
16494i582j0361m33P092J574L73o108P613P036J376n60N242L446n507M109O525
16479A1835p1j806l36L645j025o668o790r298J065P958M411M095p493n098n428
16464a1004J093l994j917N613K218N018Q610p485j068J5174j0020j1691L076M162
16450b215N161k497k64j304n025j221R442P362M179O58K060m842j4078p900m067
16435a4551L6k707K610P940O878P686n168n263o456j341L926M684L693j801n183
$$ plain form
16539 842 6692 16552 14160 12208 18128 6934 -2151 -3619 -7811 -4208 4385 4745 990 -1001 -4373
16524 -4373 -8783 -2189 9041 17899 15985 -583 -7176 -6054 -3901 -3431 1217 2151 -3370 -9883 -9850
16509 -9850 -2158 4349 195 488 8821 1243 -6339 -7381 -3365 2338 -2473 -9172 -18147 -14746 -9582
16494 -9582 -19943 -20376 -13284 -11710 -11337 -17445 -9832 -2796 -1420 -1980 3262 6708 1201 5310 11835
16479 11835 11764 9958 9622 13267 12242 5574 -1216 -10514 -9449 -1491 2920 7015 -478 -5576 -11004
16464 -11004 -9911 -13905 -15822 -10209 -7991 -2973 5637 -1848 -2916 12258 2238 -9453 -6377 -2215
16450 -2215 2946 449 185 -1119 -6144 -7365 2077 9439 13618 14276 16336 11494 -2584 -10484 -14551
16435 -14551 -14515 -17222 -14612 -6672 206 7892 2724 -2539 -8995 -10336 -6410 -1726 1967 166 -5017
16420e017m195j192P326P423n125m626k398m092m440J472M878q43K00r22J991
16405i560k086j346K594M388O839l830q224j440P784L828m11j063l084O15j96
16390e192n148R584J5515r428l231o470N059K324o520p845j279J785j00q217J120
16375a8043J967o003j079R665J497N970n827r810L86N495P756N619p304j119L451
16360g379J3497J0380J175j6175k150L116j430j0320J890P6k176P849J0809N404
16346A4566j593j1042M937J0529O61o979q830k679p35K795o319m903P265n713
16332h040r701N636K396n565k371J815M128K028P099p206M280O751n20N4j420
16317f36q105k933k177Q008L493K094r62j645L809M684P802k573j0765j4235n679
$$ plain form
16420 -5017 -9212 -10404 -3078 4345 -780 -5406 -7804 -11896 -16336 -14864 -9986 -10829 -10629 -11551 -9560
16405 -9560 -11646 -12992 -10398 -6010 829 -3001 -11225 -12665 -4881 -1053 -1464 -2527 -5611 -4996 -5192
16390 -5192 -10340 -756 14759 5331 2100 -4370 689 3013 -3507 -11352 -12631 -10846 -10946 -19163 -18043
16375 -18043 -16076 -22079 -23158 -13493 -11996 -6026 -11853 -21663 -21277 -15782 -8026 -2407 -9711 -10830 -7379
16360 -7379 6118 16498 17673 1498 -652 2464 1034 -9286 -7396 -7320 -9496 -1647 9162 14566
16346 14566 12973 1931 6868 17397 18058 11079 2249 -430 -1165 1630 -4689 -9592 -2327 -8040
16332 -8040 -17741 -12105 -9709 -15274 -17645 -15830 -11702 -9674 -2575 -9781 -5501 1250 730 784 -636
16317 -636 -8741 -11674 -13851 -5843 -2350 -256 -1218 -2863 946 5630 13432 10859 94 -14141 -19820
16302a9820Q416L649J0687J4282j2139j2457K490M792l567J4999N886r826j0536
16289c144N271P716k842j1103m863o14P174m046m93P463q651K701N766r168p918
16274a6751K400J539L167l964P91j350l882Q621q40L984M730k425K136O736K768
16259G660O834k344m724N503j692o286m030l013j1450k991N742P829J0648L03
16245G989n638k199Q274K309M13l381j6797P72M672J475n580k665j027m740j115
16230a7238L464J0763L854J147R499l800n245J281n11L516L944N088r738j1951
16216e927K769j258j922M288M270l649m466J009K073J510Q912k714L96n042j0335
16201a0086q81J1252l92o955j1276n899L52J0472M907J948K719p694k988L268
$$ plain form
16302 -19820 -11404 -7755 2932 17214 5075 -7382 -4892 -100 -3667 11332 17218 7392 -3144
16289 -3144 2127 9843 7001 -4102 -8965 -9579 -2405 -6451 -6944 519 -8132 -5431 335 -8833 -16751
16274 -16751 -14351 -12812 -9645 -13609 -12818 -14168 -18050 -9429 -10269 -6285 -1555 -3980 -1844 4892 7660
16259 7660 14494 12150 7426 12929 11237 4951 921 -2092 -13542 -16533 -10791 -2962 7686 7989
16245 7989 2351 152 8426 10735 11148 7767 -9030 -8258 -3586 -2111 -7691 -10356 -11383 -16123 -17238
16230 -17238 -13774 -3011 843 1990 11489 7689 2444 3725 3214 6730 10674 15762 6024 -5927
16216 -5927 -3158 -4416 -6338 -2050 2220 -1429 -5895 -4886 -2813 -1303 7609 4895 5291 249 -10086
16201 -10086 -10967 285 -107 -7062 -18338 -24237 -23885 -13413 -8506 -6558 -3839 -11533 -14521 -11253
16187a1253Q136P560N145J584j444O36q13J05M75p323j960J026m553m112K244
16172d547k058k015J0926p833p054j25M943Q91o02L256K508n163k609M543J582
16157c357J644m133p380N081N959J139o833j21j922m569r77j15L995L294J4960
16142F665K891r536J35L25r869k904O656J24m065m005J319l938j460J4257n293
16127h698o501J5189P478J673l132n690m692l239m747L331K565M11K929n289q042
16112a6454K968Q111O458k169k163o887J752N818r977j1783N565M162J216J0496
16098b887n490n38K340L799N084k911L901j166o452J91J649K578p343k49N138
16083b356P621n061k757Q48L789J643n043N736n530p903J399J967j106l467J732
$$ plain form
16187 -11253 -3117 4443 9588 11172 9728 10364 9551 9656 10131 2808 848 1874 -2679 -6791 -4547
16172 -4547 -6605 -8620 2306 -5527 -12581 -12706 -7763 -6872 -7474 -4218 -1710 -6873 -9482 -4939 -3357
16157 -3357 -1713 -5846 -13226 -8145 -2186 -1047 -7880 -8001 -9923 -14492 -15469 -15584 -11589 -8295 6665
16142 6665 9556 20 155 480 -9389 -12293 -5637 -5513 -9578 -13583 -12264 -16202 -17662 -3405 -8698
16127 -8698 -15199 -10 7468 9141 6009 319 -4373 -7612 -12359 -9028 -6463 -6052 -3123 -8412 -16454
16112 -16454 -13486 -5375 1083 -1086 -3249 -10136 -8384 -2566 -12543 -24326 -18761 -14599 -13383 -2887
16098 -2887 -8377 -8915 -6575 -2776 2308 -603 3298 2132 -4320 -4129 -2480 98 -7245 -7494 -2356
16083 -2356 5265 204 -2553 -1705 2084 3727 -1316 4420 -1110 -9013 -7614 -5647 -6753 -10220 -8488
16068h488N560m496j230K577k008M933L259l413N054n023m126m590J0831J1100
16054I940j152j0135o438k73J0521l84m87o997K117m705j2638k870P834J2479
16040c188N385L46p41J612J843L225n229M394K583j256k678q633j849n434j723
16025a1343J016P106Q88L538r458r475k323O077L901o05L495n220L950P444Q288
16010G279J0074p551o719O671k75j211m254j801j0470n018J110N456P999J2213
15996A3503K299m970r481q089M972M530n456Q83M828q881p297N93O432L199K964
15981B9O94o876k19M015N083N253k490p148o808J234k59J6k530j0269K133m474
15965b2616J79J2297K406k735J3287O838n166j3780p772m713M082P387N642J76
$$ plain form
16068 -8488 -2928 -7424 -8654 -6077 -8085 -3152 107 -3306 1748 -3275 -7401 -11991 -1160 9940
16054 9940 8788 -1347 -7785 -8058 2463 2079 1592 -5405 -3288 -7993 -20631 -23501 -15667 -3188
16040 -3188 2197 2543 1802 3414 5257 8482 3253 7647 10230 8974 6296 -2337 -4186 -9620 -11343
16025 -11343 -10327 -3221 -2333 1205 -8253 -17728 -20051 -13974 -10073 -10678 -7183 -12403 -8453 -1009 7279
16010 7279 17353 9802 3083 9754 9479 8268 4014 2213 -8257 -13275 -12165 -6709 1290 13503
15996 13503 15802 10832 1351 -6738 -1766 2764 -2692 -1809 3019 -5862 -13159 -12566 -6134 -2935 29
15981 29 723 -6153 -6372 -2357 2726 7979 5489 -1659 -8467 -7233 -7492 -7476 -10006 -20275 -18142 -22616
15965 -22616 -22437 -10140 -7734 -10469 2818 9656 4490 -9290 -17062 -21775 -17693 -10306 -4664 -4488
15951d488K621q35m797q53k811N94K61n394N164Q38k064l271k992M086M423N94
15935h924k361N738P977j618p987m316J0511L542N593K087j793M659m23n032j0289
15920b636j84R039n10l773k271k885L948J967J0609n31k69j0747r355j137n538
15905a4273Q449R462M064L194j1001j2481N611K716N830L897K009k943N501j1934
15891a899p517k868m097o84O702L785K903R58O3l241J598Q052L35m332J111l093
15875b224m39q537K144M731N476l840m471k164M525L597k447J016R808L427P75
15860A1377m978j0934p115m64K392j600L164L94m87N155P139n56p269j984J804
15845c962m446j0199K090J3964P512l123p302O65L713Q576R365k650q743j573
$$ plain form
15951 -4488 -1867 -2702 -7499 -8352 -11163 -10569 -10308 -15702 -10538 -9700 -11764 -15035 -18027 -13941 -9518 -8924
15935 -8924 -11285 -5547 2430 812 -7175 -11491 -980 2562 8155 10242 8449 13108 12685 7653 -2636
15920 -2636 -2820 6219 5709 1936 -335 -3220 728 2695 13304 12773 12504 1757 -7598 -8735 -14273
15905 -14273 -5824 3638 7702 10896 -105 -12586 -6975 -4259 1571 5468 7477 4534 10035 -1899
15891 -1899 -9416 -12284 -16381 -17065 -10363 -6578 -3675 -2717 -2654 -5895 -4297 3755 4090 -242 869 -2224
15875 -2224 -2663 -11200 -9056 -4325 1151 -2689 -7160 -9324 -4799 -1202 -3649 -2633 7175 10602 11377
15860 11377 6399 -4535 -11650 -12114 -9722 -11322 -8158 -7764 -8251 -3096 4043 3487 -3782 -5766 -3962
15845 -3962 -8408 -18607 -16517 -2553 4959 1836 -5466 -4801 -1088 7488 16853 14203 5460 3887
15831C887k106L51L22n000J342q16q304n637r51K820Q056q45j812Q313k66k188
15815b834l77J197J2549k841M15j0797J878M632n711j0264J191J3255n674m182
15801g563J404N005k27n171K554K783k121R94K41Q806J157q409n576j5271K18
15786b1176J1571Q458J875M443l481P993K115p668l418o541M47M885J67m715j347
15771f392M061L57K792K697j503K781k043l442j0041o224J452R797J0640J549
15757F481o536J518n725q64O053K529o304M8n681K152K042J708L41l042K62N691
15741F73j668J281j6n005J042J6954n032q399m657K547k162p889n7Q037k479N349
15725a481K771k122J483n137p58J149Q53L076K71l397K545L200K18l984K09Q728
$$ plain form
15831 3887 1781 2132 2454 -2546 -1204 -2020 -10324 -15961 -16912 -14092 -6036 -6881 -8693 -380 -646 -2834
15815 -2834 -3211 -2014 10535 7694 8109 -2688 -810 3822 -1889 -12153 -10962 2293 -3381 -7563
15801 -7563 -6159 -1154 -1381 -6552 -3998 -1215 -3336 -2342 -2101 6705 7862 -547 -6123 -21394 -21176
15786 -21176 -9605 -1147 728 5171 1690 9683 11798 4130 712 -5829 -5382 -497 -330 -5045 -6392
15771 -6392 -2331 -1974 818 3515 2012 4793 2750 -692 -10733 -16957 -15505 -5708 4932 6481
15757 6481 -55 1463 -4262 -5126 927 3456 -2848 -2800 -8481 -6329 -4287 -2579 -2238 -5280 -5018 673
15741 673 -995 286 270 -4735 -3693 13261 8229 -170 -4827 -2280 -4442 -12331 -12388 -4351 -6830 -1481
15725 -1481 1290 -832 651 -4486 -5244 -4095 -3242 -166 105 -3292 -747 2453 2671 -1313 -1104 7624
15709G624L029J674q028j0066k15O656j010j376P571N639O666r118K664l489p334
15694H87m307L959l083J714P6R39N353P176l539o068J08J355l241l567O863n08
15678D117K841O156j1497q161L862J556o941M871M232P710J277m874p120M82J537
15663D8Q32j866L661N594M838L211j3210m486L389r1O936m764N811N986m232L908
15647A5565j7144j3348L666J0487q861j198O703M301o781M254P293L309M79m256
15633D469l329j0718l506L324J5027O600n194m46m585O701J722N675J790j0853
15619F677m925m555p811m002N97k388J3821K291r59M233O355K604j793q804l191
15604a850J794m404q483m035O35Q061J0458O8j637k333J763O644l083L585p585
$$ plain form
15709 7624 10653 12327 4299 -5767 -5982 674 -336 -1712 5859 11498 18164 9046 11710 8221 887
15694 887 -3420 539 -2544 -830 -754 185 5538 12714 9175 3107 3215 4570 1329 -2238 4625 4117
15678 4117 6958 13114 1617 -6544 -2682 -1126 -8067 -3196 1036 8746 10023 5149 -1971 -1489 48
15663 48 880 -986 2675 8269 13107 16318 3108 -1378 2011 1920 8856 4092 9903 15889 11657 15565
15647 15565 -1579 -14927 -11261 -774 -9635 -10833 -4130 171 -6610 -2356 4937 8246 8725 4469
15633 4469 1140 -9578 -13084 -9760 5267 11867 6673 6227 1642 8343 10065 15740 17530 6677
15619 6677 1752 -2803 -10614 -14616 -14019 -16407 -2586 -295 -1254 2979 9334 11938 10145 1341 -1850
15604 -1850 -56 -4460 -12943 -16978 -16343 -8282 2176 2244 607 -1726 37 6681 3598 7183 -402
15589d02p178K570J619n810M4O346n652n060K053J724l712j46Q913J651k311O277
15573I26L794o304q601J090M910j1082o303O90J5200J2428K042l617j037m758
15559f22j2975l828K795N7N417J073O44r390K862P652l812M554K832L720R93N060
15543G032K979J454p08r287m280N44o642J7188K3476l137j8326j0268j133o528
15529g636q82j468j67o787J196N18L049J96m630R865L275j273M288l314o539Q162
15513b147l68p185K561l430j0221l719K390Q255M752P37P919L068p692L55J764
15498b961L784R844m490j616q80m481j0362Q916Q126L940j3813j1509P208L396
15484d898q2K264r89M632n35O971k774k830J603o550p462q186J4303J1364o625
$$ plain form
15589 -402 -7580 -5010 -3391 -9201 -9157 -2811 -8463 -13523 -11470 -9746 -13458 -13604 -4691 -3040 -5351 926
15573 926 4720 -1584 -10185 -9095 -4185 -15267 -21570 -20880 -5680 6748 8790 5173 4136 -622
15559 -622 -13597 -17425 -14630 -14573 -9156 -8083 -7439 -16829 -13967 -6315 -10127 -5573 -2741 979 1972 7032
15543 7032 10011 11465 10757 1470 -2810 -2266 -8908 8280 31756 28619 10293 25 -1108 -7636
15529 -7636 -8518 -9986 -10153 -16940 -15744 -15226 -12177 -11981 -16611 -6746 -3471 -4744 -456 -3770 -10309 -2147
15513 -2147 -2515 -9700 -7139 -10569 -20790 -24509 -22119 -13864 -9112 -8375 -456 2612 -5080 -4725 -2961
15498 -2961 823 10667 6177 4561 3681 -800 -11162 -2246 5880 9820 -3993 -15502 -8294 -4898
15484 -4898 -4980 -2716 -3705 927 392 7363 4589 1759 3362 -3188 -10650 -18836 -4533 6831 206
15469B06k594Q925n558m134N452K768n626M830P19j1048p485m335K177N219m0
15454a0524m665O704j592o929K071N586M7M214K205m269J461M103k139k23L598
15439c52n503P37J2669l059j0841O312n085j172Q866j363N200J4162J680q930
15425A3321o696J64j825j344j335m547o695k242n560N5R180L458M265N386M681
15410A0266O217n688l869q190j779L725p10K726m215J106J1559K391m246J352
15396A0645j3545l907O319Q864p913p501O485Q168p146M703n74J087K195j25M900
15381A2655K668o243j721Q24n230j607j1846m272Q526N716m199j701n643O107
15367e966L415l558L904j805k670o904K656Q898P201J470o040M436M612j0135
$$ plain form
15469 206 -2388 6537 979 -3155 2297 5065 -561 4269 4988 -6060 -13545 -17880 -15703 -10484 -10524
15454 -10524 -15189 -8485 -10077 -17006 -14935 -9349 -9302 -5088 -2883 -7152 -5691 -1588 -3727 -3950 -352
15439 -352 -5855 -5118 7551 4492 -6349 -37 -5122 -6294 2572 1209 6409 20571 22251 13321
15425 13321 6625 6789 4964 3620 2285 -2262 -8957 -11199 -16759 -16704 -7524 -4066 199 5585 10266
15410 10266 16483 10795 6926 -1264 -3043 682 -28 2698 -1517 -411 11148 13539 9293 10645
15396 10645 -2900 -6807 -488 8376 463 -7038 -553 7615 469 5172 4598 5685 7880 7755 12655
15381 12655 15323 9080 7359 8183 2953 1346 -10500 -14772 -6246 -530 -4729 -6430 -12073 -5966
15367 -5966 -2551 -6109 -2205 -4010 -6680 -13584 -10928 -2030 5171 6641 601 5037 9649 -486
15353d86j0785j159N02K686K577N802p055R368k598n611k425m842K133R28j66
15338a1131o45Q221L097l179N930p737n797L001m249K082O264o530j4380P274
15324a7779J1809R817O220N238k512q531o047P128Q985j1950j3106J82M353O885
15310F92L673R68K653L40m395N54o607k930J637N900k217m992K196Q809R818n157
15294A0942O770P23p046K34j0267p110J190K899N411J096N567k888n678j8296
15280a6453J98O603M254j219k981P54L886m425K83L589K503l049m36M037j885
15265d341Q20j277L237K078R848n168q384M571O319p94j735n680N576l35m161
15250E74n317l262P815q38r212m965l699J348M727m199P206J3426o56o793k32
$$ plain form
15353 -486 -11271 -12430 -11928 -9242 -6665 -863 -7918 1450 -1148 -6759 -9184 -14026 -11893 -10965 -11131
15338 -11131 -11776 -3555 -458 -3637 2293 -5444 -11241 -8240 -12489 -10407 -4143 -10673 -25053 -17779
15324 -17779 -5970 3847 10067 15305 12793 4262 -1785 5343 14328 2378 -10728 -10546 -6193 692
15310 692 4365 5333 7986 8326 3931 4485 -2122 -5052 -3415 2485 268 -4724 -2528 6281 16099 10942
15294 10942 17712 18435 11389 11623 1356 -5754 -4564 -1665 3746 4842 10409 7521 1843 -16453
15280 -16453 -16255 -9652 -5398 -6617 -9598 -8844 -4958 -9383 -9100 -5511 -3008 -6057 -6493 -2456 -4341
15265 -4341 -3521 -4798 -1561 517 10365 5197 -3187 1384 7703 6909 5174 -506 5070 4735 574
15250 574 -4743 -8005 -190 -1028 -10240 -15205 -18904 -17556 -12829 -17028 -9822 3604 2948 -3845 -4077
15235d077q98R392J447m347j889N835r760n900n133n22R462M381L181l575q935
15220a1338M389J319j917m064J776M639m841o935L761j688O682l088o092K713
15206a4684J692O200K274m324o923j252R331n537l586Q406K496R15J313O815O736
15191I872m318p749m394k957J51p024p03j880J96J1815J1830O653m593Q67N434
15176A3200N443M940j1166p139o926o158K025m25k371K457r5K706O335K286p456
15161b344j0984j232L294n253q62J3637o350Q404Q55l246L733K132N942K429J533
15146A1688m677n576m356m807Q219l874k114N245m174M445j1258K55j601m691
15132a7276M677P333n566j797M537N077l77K52J331m130l983P455K343M021Q13
$$ plain form
15235 -4077 -4975 4417 5864 1517 -372 5463 -4297 -10197 -15330 -15852 -6390 -2009 1172 -2403 -11338
15220 -11338 -6949 -5630 -7547 -11611 -9835 -5196 -10037 -16972 -13211 -14899 -8217 -11305 -17397 -14684
15206 -14684 -12992 -6792 -4518 -8842 -15765 -17017 -7686 -13223 -16809 -8403 -5907 -4992 -3679 3136 9872
15191 9872 5554 -2195 -6589 -9546 -9395 -16419 -17122 -19002 -18806 -6991 4839 11492 6899 7766 13200
15176 13200 18643 23583 12417 5278 -1648 -7806 -5781 -6206 -8577 -6120 -6215 -3509 2826 5112 -2344
15161 -2344 -13328 -14560 -11266 -16519 -17381 -3744 -10094 -1690 -835 -4081 -348 1784 7726 10155 11688
15146 11688 7011 1435 -2921 -7728 491 -3383 -5497 -252 -4426 19 -11239 -10984 -12585 -17276
15132 -17276 -12599 -5266 -10832 -12629 -8092 -3015 -3392 -3140 -1809 -5939 -9922 -2467 -124 3897 4710
15117D710p455L820K210m420o008l291M432N321n945j676R16p51p02J703P401
15102B65O041L227K396L130p502o933k364L424j628M317K095P561o335l997k89
15087C408Q959q248j5055j3130j632Q998J240P234N273l797j0790l304K922O84
15073a7238L861J0286n488m35J0421o53k196o560m246o149Q673J597k670N697
15059e100J7248M920J981l598j380j1496m489O27j37q22J967o219O885R568J1338
15044B1293M843j3923r49Q53j3216j814R179k239R84Q32n547J656n446J1033k099
15029E440p006J034K233M645K878o789j09J21j387l099j46J3780N726J106o757
15014A1670j1164p284P312J451K698N2k792O518O804j775m933j119O185N797Q163
$$ plain form
15117 4710 -2745 1075 3285 -1135 -7143 -10434 -6002 -681 -6626 -8302 -7386 -8137 -8839 -7136 265
15102 265 6306 9533 11929 15059 7557 624 -1740 1684 56 4373 6468 14029 7694 3697 3408
15087 3408 12367 4119 -10936 -24066 -25698 -16700 -15460 -8226 -2953 -6750 -17540 -20844 -17922 -17238
15073 -17238 -13377 -3091 -8579 -9014 1407 754 -1442 -8002 -12248 -18397 -9724 -8127 -10797 -5100
15059 -5100 12148 17068 19049 15451 14071 2575 -1914 -1287 -1424 -2246 -279 -6498 387 9955 21293
15044 21293 26136 12213 11264 12117 -1099 -2913 6266 4027 5011 5843 296 1952 -3494 7539 5440
15029 5440 -1566 -532 1701 6346 9224 2435 2326 2447 1060 -2039 -2185 11595 17321 18427 11670
15014 11670 506 -6778 534 1985 4683 4735 1943 8461 15265 13490 8557 7438 13623 19420 27583
14999B7583L481p36N106J0861P382j177q80P099P764R470J5154K8993L5980L6100
14985A92180M7544P2648J18655K07901L71874P36237J456853J910098N98977j441780
14975D271187j758088j059339n39997k84300j71654j09034q1185n4006l0470k6782
14965A56332j8436j9980k4193k0603o098j1576r316p550J437j552l198j733j0813
14952B2721j3171p941p331J680J3668l228M802L711j544j175p257m329M927J367
14938F900o57n133n412J675L389j596J416j706J26J26p833j103J311r22K993P861
14922A435N212O534Q77j107m342j1406L314K779j524L185m341q339p355J338P604
14907f136R46m010j0097j574P423Q56m311P367N329N749O796J29p153K693l876
$$ plain form
14999 27583 31064 30328 35434 46295 53677 52500 51620 58719 66483 75953 91107 120100 156080 192180
14985 192180 239724 312372 431027 638928 1010802 1747039 3203892 5113990 5712967 4271187
14975 4271187 2513099 1453760 913763 629463 457809 348775 267590 213584 183114 156332
14965 156332 137896 117916 93723 73120 67022 55446 46130 38580 40017 38465 35267 33534 22721
14952 22721 9550 1609 -5722 -4042 9626 6398 11200 14911 13367 12192 4935 606 5533 6900
14938 6900 6243 1110 -4302 -2627 762 -834 582 -1124 -998 -872 -8705 -9808 -8497 -9419 -6426 1435
14922 1435 6647 13181 14058 12951 8609 -2797 517 3296 1772 4957 616 -7723 -15078 -13740 -6136
14907 -6136 -5190 -9200 -19297 -20871 -13448 -12592 -16903 -9536 -4207 1542 8338 8467 1314 4007 131
14892A31l507J333J836k289J876Q390k550p098n108K564l543k31N300J832r446
14877a0510n434R077Q765L389m008M682P477K172P11N114q27p642R421J155Q062
14862C1604Q440P887l603q138p290q532l686r503o970q291k17o431j163J2891
14848c002Q061j2438j1230O471L040M891O244J354k999l603l227l099J374N848
14834b315r353N133L038M15l29l121M947L984n493n965o242o038K46O621M168
14819a0304P953l468p678J963O697J651n098N589L091L623j075J378L5j790l079
14804e12j0055K121M51J305N174J070j987L64K10K801l843P556J1880n066o050
14789E419p123K551J568R557R0J7l405o347r091p239l467N495L5l833N20L436
$$ plain form
14892 131 -3376 -2043 -207 -2496 -620 7770 5220 -1878 -6986 -4422 -7965 -8196 -2896 -1064 -10510
14877 -10510 -15944 -6867 1898 5287 1279 5961 13438 15610 16321 21435 20608 12966 22387 23542 31604
14862 31604 40044 47931 44328 36190 28900 20368 16682 7179 209 -8082 -8299 -14730 -15893 -3002
14848 -3002 5059 -7379 -18609 -12138 -9098 -4207 2037 3391 392 -3211 -6438 -9537 -8163 -2315
14834 -2315 -11668 -6535 -3497 -3082 -3411 -6532 -1585 2399 -3094 -9059 -15301 -21339 -21093 -14472 -10304
14819 -10304 -2351 -5819 -13497 -11534 -4837 -3186 -8284 -2695 396 4019 2944 4322 4357 2567 -512
14804 -512 -10567 -8446 -7995 -6690 -1516 -446 -2433 -2069 -1859 942 -2901 4655 16535 11469 5419
14789 5419 -1704 847 2415 11972 12062 12079 8674 2327 -6764 -14003 -17470 -11975 -11940 -15773 -15253 -11817
14773a1817J0253L096j16O947K822J203l648k891o492Q705N785m191K811N249
14759A7716m756q048M467o62J0298P449n652q055j085o532o192j21M724M387j818
14744F120m19o738j600M607q921m161R154n324J012N44l158j041l132k16Q601
14729d672l02q503l237N552L314m050J4651M01r07k64m094K618K04K136j010m324
14713b487P916J750n682J178r1L463l505m587j983M263o763L354P046r62J246
14698D156N286P63j0572K428o8j454p033Q46R31L705J5554O56O513n729q455j7467
14682i940k623J6375m680J176N393n08n027J844l551N182R901l220k639q78k138
14667D667m855r084L241K592q42n26l555J802J784N797q90q329l53J836j213M591
$$ plain form
14773 -11817 -1564 1532 1416 8363 11185 12388 8740 5849 -643 8062 13847 9656 12467 17716
14759 17716 12960 4912 9379 8717 19015 26464 20812 12757 11672 5140 -1052 -1173 3551 7938 6120
14744 6120 5701 -1037 -2637 1970 -6951 -11112 -1958 -7282 -6270 -5726 -8884 -9925 -13057 -13273 -4672
14729 -4672 -4974 -13477 -16714 -11162 -7848 -11898 2753 3154 2247 1983 -2111 507 711 2847 1837 -2487
14713 -2487 5429 7179 1497 2675 2584 6047 2542 -2045 -4028 235 -6528 -3174 3872 2910 4156
14698 4156 9442 10205 -367 2061 1993 539 -6494 -5648 -4717 -1012 14542 15198 21711 15982 7527 -9940
14682 -9940 -12563 3812 -868 308 5701 5193 166 2010 -1541 3641 13542 10322 7683 6805 4667
14667 4667 -188 -9272 -6031 -3439 -4281 -4807 -8362 -6560 -4776 1021 131 -8198 -8551 -6715 -7928 -3337
14651c337K194j001o82Q084K081n30m761k790J411J64m402K015Q19O932n567N787
14635F417J4681N497m940n815J848p625p682R585K328m877q285p397p241J422
14621a2084O699J4606Q447l455p671J552L344J282k475l398p463k049N649L765
14607F749q629j192L568j265n308L734q13j928J045O688Q140L244r950n840j182
14592b939O127k650l91K345K031J138n376l489l10j773j2589J664J2392O524j616
14577A088n507j917K46n854o247J1069R75L458J2027M718J58j1566k098j480N81
14562c49j123o479K820P623O956k605m728k952P593J0709j43k811q304j18J325
14547G414N063q639o90k504j78k87J296O232r338j2742M753P666o246m85m35k576
$$ plain form
14651 -3337 -1143 -2144 -2826 5258 7339 6809 2048 -742 669 833 -3569 -1554 -735 6197 630 6417
14635 6417 21098 26595 21655 15840 17688 10063 2381 11966 14294 9417 1132 -6265 -13506 -12084
14621 -12084 -5385 9221 17668 14213 6542 8094 11438 12720 10245 6847 -616 -2665 2984 6749
14607 6749 -1880 -3072 496 -769 -6077 -2343 -3156 -5084 -4039 2649 10789 14033 4083 -1757 -2939
14592 -2939 3188 538 147 2492 4523 5661 285 -3204 -3514 -5287 -17876 -16212 -3820 2704 1088
14577 1088 -4419 -6336 -6090 -11944 -18191 -7122 -6147 -2689 9338 14056 14214 2648 550 -930 -349
14562 -349 -1472 -7951 -5131 2492 9448 6843 2115 -837 6756 17465 17322 14511 6207 6089 7414
14547 7414 12477 3838 3148 644 466 179 1475 7707 -1631 -14373 -9620 -1954 -8200 -8685 -9120 -11696
14531a1696O348L785M089K515L199K337Q52j1034q322M599L40n090P806Q558M03
14516H689o633j484n170K093Q856J1414l905j3542k273l140j4335q45J3885N532
14502h58l715m464K913N286K16m290m020L099M334j0859l215K137P397M603N508
14487D072N45J81Q490M306j4270j2990m262N238O596j163J167o746n603K763Q579
14472c097j063m69P07Q706J229J686r22q918r359p431N314m913Q424N921N729
14457A544k211O745Q134n821k891Q64P244n226j0528o76Q70r59L65O637O221M568
14441A4880k213m036j075l211n865m404n645O858M527k673j1251k177J569P028
14427g688K895m08J735M162r97o653n990N064N289j088n409N922J2360M817R262
$$ plain form
14531 -11696 -5348 -1563 2526 5041 8240 10577 11429 395 -7927 -3328 -2988 -8078 -272 8286 8689
14516 8689 2056 572 -4598 -2505 6351 17765 13860 318 -1955 -5095 -19430 -20275 -6390 -858
14502 -858 -4573 -9037 -6124 -838 -622 -4912 -8932 -5833 -1499 -12358 -15573 -13436 -6039 -1436 4072
14487 4072 4617 4798 13288 17594 3324 -9666 -13928 -8690 -2094 -3257 -2090 -8836 -14439 -11676 -3097
14472 -3097 -4160 -4629 -3922 4784 6013 7699 6777 -2141 -11500 -18931 -13617 -18530 -10106 -4185 1544
14457 1544 -667 6078 14212 8391 5500 6364 13608 8382 -2146 -2822 -1952 -2911 -2546 4091 10312 14880
14441 14880 12667 8631 7556 4345 -1520 -5924 -11569 -4711 -184 -2857 -14108 -16285 -14716 -7688
14427 -7688 -4793 -5201 -3466 696 -301 -6954 -12944 -7880 -2591 -3679 -9088 -3166 9194 14011 23273
14412B3273J7521o249j9435n709l17J113q620r422j966O245R710J716L684J2448
14398B3992k106q399o724N742m39j1107l811P868j1385o633r26J7880O472k202
14384H222o466p792l428L472M89O138N019L731M90n094M539O321M19P077l945
14369A9192J661L008p957q92n608r642j322o214l09J681p83L996L792O211p973
14354a159p87R344Q6J417M292n120K496L709o871j425K856p605o516J242K424
14339a617j46l188k892m804J999M342L987M299L310j728m629j583n141L855j945
14324e881J777L224J0948P329k152r784k614l275l25l777l853N456J747p232R997
14309A585Q35n84P151K379l76j5990k793j695M057J4230J742J800K068J103m05
$$ plain form
14412 23273 40794 34545 15110 9401 9084 10197 1577 -7845 -9811 -3566 6144 7860 11544 23992
14398 23992 21886 13487 6763 12505 12066 959 -2852 5016 -6369 -13002 -13928 3952 10424 8222
14384 8222 1756 -6036 -9464 -5992 -5503 635 5654 9385 9875 4781 9320 15641 16060 23137 19192
14369 19192 20853 23861 15904 15012 9404 -238 -1560 -7774 -8083 -6402 -7185 -3189 603 6814 -1159
14354 -1159 -1946 7398 7484 8901 13193 8073 10569 14278 7407 5982 8838 1233 -5283 -4041 -1617
14339 -1617 -1763 -4951 -7843 -12647 -10648 -6306 -2319 1980 5290 3562 -1067 -2650 -7791 -3936 -5881
14324 -5881 -4104 -880 10068 17397 15245 5461 2847 -428 -753 -4530 -8383 -2927 -1180 -8412 1585
14309 1585 2420 1836 8987 11366 10990 -5000 -7793 -9488 -5431 8799 10541 12341 14409 15512 15107
14294A5107n967r631n697p03L11j099n667m631m30R51L661M075k545l2N199L434
14278c664k798K377P56L485J729k930K448J847J782r762J311k207O107L061n668
14263b126N180K576m151m825j142j404Q179J0148m848n612p595J603Q360M570
14249H913j596r87J664Q35l027j438K787j3125r82L694P6m57k741l771n319p72
14233a6246L644M397J62P09j101J377r21k751o164P180P439M948M483L18J594
14218I068o058p732p64j188m819Q888M867q734P452n022j4985P356P111J995J943
14203f22Q972l59O327k659l756k273l105N125j465P511L781p777p64o510k786
14188c60K952L954m787k138N256m883l291O507L405N26k49j398N716r86o63q037
$$ plain form
14294 15107 9140 -491 -6188 -6891 -6580 -7679 -13346 -17977 -18407 -17456 -13795 -9720 -12265 -12297 -7098 -3664
14278 -3664 -6462 -4085 -3329 156 1885 -1045 1403 3250 5032 -4730 -3419 -5626 481 3542 -2126
14263 -2126 3054 5630 1479 -3346 -4488 -5892 2287 12435 7587 1975 -5620 -4017 4343 8913
14249 8913 7317 6330 7994 8829 5802 4364 7151 -5974 -6956 -3262 -3186 -3643 -6384 -10155 -15474 -16246
14233 -16246 -12602 -8205 -8043 -7334 -8435 -7058 -7979 -10730 -16894 -9714 -2275 2673 7156 7474 9068
14218 9068 3010 -4722 -5486 -6674 -11493 -2605 2262 -6472 980 -4042 -19027 -11671 -4560 -2565 -622
14203 -622 8350 7991 14318 11659 7903 5630 2525 7650 6185 13696 17477 9700 8936 2426 -360
14188 -360 2592 6546 1759 -379 4877 -6 -3297 3210 6615 7141 6892 5494 11210 10224 9561 1524
14172A524J485L12J978N093J1631O759P143J682K530j827k302J0140Q047K478
14158E6673J1321J6100J4150J6189K0759M4004O8550R5090J11357J09278J21759
14147F85230J48070J56921J06204M3887K8704l228n3766r9213j38079j34986j22105
14136F17639j13674j16440j06180q3071n3460k0875r751j5782j4173j5070n737
14125F3426m607l669p066j1140k998R470K456m868j2199q595j51L709N134J011
14111B9913p485j0892R130k76o554Q05K807p8o837L258P954J332r17l096q71k770
14095A5423N282K108J707N6Q06n294p950K092L723M490K968n156j404O051r298
14080A5604j046J308n346j48n694K605n335o6J4153N657L953k651o232L60m922
$$ plain form
14172 1524 3009 3321 5299 10392 22023 28782 35925 37607 40137 38310 36008 46148 54195 56673
14158 56673 67994 84094 98244 114433 135192 179196 247746 342836 454193 563471 685230
14147 685230 833300 990221 1096425 1140312 1169016 1165788 1112022 1012809 874730 739744 617639
14136 617639 503965 387525 281345 198274 144814 123939 114188 98406 84233 69163 63426
14125 63426 58819 55150 48084 36944 33946 43416 45872 41004 28805 20210 20059 23768 28902 29913
14111 29913 22428 11536 20666 20390 13836 14641 17448 17370 10533 13791 21745 23077 22160 19064 18193 15423
14095 15423 20705 22813 24520 24576 25382 20088 12138 14230 17953 22443 25411 20255 18851 24902 15604
14080 15604 14558 15866 10520 10372 4678 7283 1948 1882 16035 21692 25645 22994 16762 17122 12200
14065A2200p338J885P831O811n844l261M489k453o621L29K449m799k000l361j0421
14050a0104m763P140J3892O062p151o417J241O670K599J691l362k10j058j643
14036D587R425O10j926k950M350L864q643j1277m328N364M913o918o192N174J595
14021b352K538O231M494M525M167N272q19o897r603n446N635m625j1165M995M490
14006A440L516m368n844k43O25M152P524k604p639j462Q839j42P177N963m535
13991A2399M116K135J991K793j848J6r048p330m509o260P49R788Q213Q481L565
13976B5251n469j0610l65j673j276O439R75n022K374O358l039l393M811n006o069
13961D286o879L895o414k811N419R189P866o078j808P200K715L254m31l759J509
$$ plain form
14065 12200 4862 6747 14578 21389 15545 12284 16773 14320 7699 8028 10477 5678 3678 317 -10104
14050 -10104 -14867 -7727 6165 12227 5076 -1341 -100 6570 9169 10860 7498 7288 6230 4587
14036 4587 14012 14622 12696 9746 14096 17960 9317 -1960 -6288 -924 3989 -2929 -9121 -3947 -2352
14021 -2352 186 6417 10911 15436 19603 24875 24056 17159 7556 2110 7745 3120 -8045 -3050 1440
14006 1440 4956 588 -5256 -5499 -4874 -722 6802 4198 -3441 -4903 3936 3794 10971 16934 12399
13991 12399 16515 18650 20641 23434 21586 21602 12554 5224 715 -5545 -4796 4992 13205 21686 25251
13976 25251 19782 9172 8807 7134 5858 12297 13272 8250 10624 16982 13943 10550 15361 10355 4286
13961 4286 -2593 1302 -5112 -7923 -2504 6685 14551 8473 6665 13865 16580 19834 19403 15644 17153
13946A7153n403o873Q343R356P44j686K81K323l666o242q62l829k780No5O211
13930A3010m715J984P193K019r321n147N222P50o098p911N194K008n5K648Q309
13915A5090L544N954p247r149l836L183j194O32l099p16O5k379K383J5609Q058
13900B6898o326l553k438j88R071J033q877k784O167N04n667m517M563l413O6
13885A0539N152p238m569j782L225M060K420K818Q683J712J451k381J62n100j6565
13870B587n049M161R218J2331M086r9o411n537j158R782M279l838j0448j497r019
13855C388M837L132k31J237l225j875j166O00O419J873l728L064L078J908j770
13840A7541j3315R284L122M632J397q830M964Q401O489q121n787l549K798L857
$$ plain form
13946 17153 11750 4877 13220 22576 23320 21634 21915 24238 20572 14330 13468 9639 6859 6864 6799 13010
13930 13010 8295 10279 17472 19491 10170 5023 10245 10995 4897 -3014 2180 4188 4133 6781 15090
13915 15090 18634 24588 17341 8192 4356 7539 6345 6977 3878 3162 3227 848 3231 18840 26898
13900 26898 20572 17019 14581 14393 23464 24497 15620 12836 19003 19507 13840 9323 13886 10473 10539
13885 10539 15691 8453 3884 2102 5327 9387 11807 14625 23308 25020 26471 24090 24252 19152 2587
13870 2587 -2462 1699 10917 23248 27334 27235 20824 15287 14129 23911 28190 24352 13904 12407 3388
13855 3388 8225 11357 11126 12363 9138 7263 6097 6697 13116 14989 11261 14325 17403 19311 17541
13840 17541 4226 13510 16632 21264 22661 13831 18795 27196 33685 25564 19777 16228 19026 22883
13826B2883m434J436n687L680J0560N585L995k920j3624r774M588P67n727q47
13812A0481R48J499j658n867n499r336P426N629l904R91n52j755K356p474n268
13797a1983J372J0632N038r9l055J746J22j864Q415K615L140O483N845P65J347
13782C0519L58k489m69O39o875M277R879J315k010n814J0794P265j3070j0598
13768B3721J685L978q342l186J725n254p120M449l638j883J2293K393M088Q659
13754C3568l058K287N802N967j956J432k204j4147q937K332M069J9014L040n97
13740D6612L382P182P384K732Q951K1846K8297J4369J4614K5012L1700K0092K8522
13727B60695K0789K3853M2503M6302N7190N4627M5795N0815N5253O1933O7087
$$ plain form
13826 22883 18449 19885 14198 17878 28438 34023 38018 35098 21474 11700 16288 17055 11328 10481
13812 10481 11429 12928 11270 5403 -96 -9432 -2006 3623 -281 710 158 -1597 759 -6715 -11983
13797 -11983 -10611 21 5059 4960 1905 3651 3773 1909 10324 12939 16079 22562 28407 29172 30519
13782 30519 30877 28388 27919 28558 21683 25960 35839 37154 35144 29330 40124 47389 34319 23721
13768 23721 25406 29384 21042 17856 19581 14327 7207 11656 8018 6135 18428 20821 24909 33568
13754 33568 30510 32797 38599 44566 42610 44042 41838 27691 18754 21086 25155 44169 47209 46612
13740 46612 49994 57176 64560 67292 76243 98089 126386 140755 155369 180381 212081 232173 260695
13727 260695 281484 305337 347840 394142 451332 505959 551754 602569 657822 719755 786842
13716G86842O6181N9053O2154M7679L2864L0314K5472K8569K6073j875j2194r311
13704A141821j6601k8378l4671m2875l6359n9298p0529n6796n9049n9891n7802
13693F19572m8003n5356o4732m4006k8545l6813m6193l6092l2161l1222k4985
13682A71464j8098j5267k3237j5929r767p705J635q312k290N969p679n654j4290
13669E0840q153n155j1979o507r39J2495R486j2915o547P36n753m76m696k753
13655G684K99j316R151M857o42m644r868K588M911K307R382k164K818r64L103
13640B7502o044k631J412P41N956l524j2468j632R94m437k186k145L987j260Q10
13625E075N486L067m399j974m248j1450r77J1426P718j121r972o324L801J3803
$$ plain form
13716 786842 853023 912076 974230 1021909 1054773 1085087 1110559 1139128 1165201 1163326 1151132 1141821
13704 1141821 1125220 1096842 1062171 1019296 982937 923639 853110 796314 737265 677374 619572
13693 619572 571569 516213 451481 407475 378930 342117 295924 259832 227671 196449 171464
13682 171464 153366 138099 114862 98933 89166 81461 83096 74784 72494 78463 70784 65130 50840
13669 50840 42687 37532 25553 19046 18107 30602 40088 27173 20626 21362 15609 15133 10437 7684
13655 7684 7983 6667 15818 20675 20033 15389 5521 8109 13020 15327 24709 22545 25363 24399 27502
13640 27502 21458 18827 20239 20980 26936 23412 10944 9312 10306 5869 3683 1538 5525 4265 5075
13625 5075 10561 13628 9229 7255 3007 -8443 -9420 2006 9724 8603 -1369 -7693 -3892 9911
13611I911J2720M054k044l671p471o144P04R011R138k364j6668j6617k090M247
13597g284N604K273N866P286K336m872k606K80j707o255k409J3220M164j225P58
13582A5429L779K131o971j5578l342P554P374j872k853Q853M156k608r67o08L475
13567A7952o635k1n274m370J1833J502m115m414J174M443q312j989M429P963J2106
13552B6272k231o79J1686n889j4987j102L474n65j938m377m845M475P17k04o066
13537C741r594K186J1280O449j218k370l429l592n364qL81J0389O954n506K539
13522A2838R061O036j89o440j4739j006j289J810J3077Q64j0072J08p186J195
13508D068p087m754q620K799J474L673L318J3508M219m583m605N2J376K493k627
$$ plain form
13611 9911 22631 26685 24641 20970 13499 7355 8059 17070 26208 23844 7176 -9441 -11531 -7284
13597 -7284 -1680 593 6459 13745 16081 11209 8603 8883 7176 921 -1488 11732 15896 14671 15429
13582 15429 19208 21339 14368 -1210 -4552 3002 10376 8504 5651 14504 18660 16052 15085 14477 17952
13567 17952 11317 11296 6022 1652 13485 14987 10872 6458 7632 12075 3763 1774 6203 14166 26272
13552 26272 24041 23362 35048 29159 14172 13070 16544 15979 14041 9664 4819 9294 10011 9807 3741
13537 3741 -5853 -3667 7613 14062 12844 10474 7045 3453 -1911 -1919 -1538 8851 15805 10299 12838
13522 12838 21899 27935 27746 21306 6567 5561 4272 6082 19159 20023 9951 10059 2873 4068
13508 4068 -3019 -7773 -16393 -13594 -12120 -8447 -5129 8379 12598 8015 3410 3462 4838 7331 4704
13493D704N971O532N950j448n385j300l335q272K934M816l12L023R691R90n140
13478A9419M105m311j0045j1891j651O551N562j809N126l934j365r020k305j515
13464g083L484r899N015J4033P344q882o695Q65K958L57o581M167J2975l617m425
13449D016N908j629k058K710p685k066N047K054K48O079L699j70O24j2184R60
13434E553j161l121j3512K319J3895M743l733j371k27r241l694R15J0817J2946
13420A5128R886J123m069j5450k07R097o558q720q58o678M073k879o54O053M371
13405C658r078K260L292o001N088O792M326k133k047O23k628m500J624k313j102
13390b139Q164K746N31M42N060p42j0736q851j089P101P43M583L038J1r003k060
$$ plain form
13493 4704 10675 17207 23157 21709 16324 15024 11689 3417 6351 11167 10855 13878 23569 24559 19419
13478 19419 23524 19213 9168 -2723 -4374 2177 7739 5930 11056 7122 5757 -3263 -5568 -7083
13464 -7083 -3599 -13498 -8483 5550 12894 4012 -2683 -1818 1140 1497 -5084 -917 12058 8441 4016
13449 4016 9924 8295 6237 8947 1262 -804 4243 6297 6545 12624 16323 16153 16777 4593 5553
13434 5553 4392 1271 -12241 -9922 3973 8716 4983 3612 3385 -5856 -9550 -8635 2182 15128
13420 15128 25014 26137 22068 6618 6411 15508 8950 230 -628 -7306 -3233 -6112 -6766 -713 3658
13405 3658 -5420 -3160 132 -5869 -781 6011 10337 8204 6157 6780 4152 -348 1276 -1037 -2139
13390 -2139 6025 8771 9302 9744 14804 14062 3326 -5525 -6614 487 1230 5813 8851 8862 -141 -2201
13374b201J3830L469k840j2199m811M74r356J4034K787L35R28j799J695M830j327
13359G849M263r07m634J434J727k778j828m146N938K597O79m669m819l187J2951
13344A0470K558j822k513K027K474l169N597k013M246N979j0247k613N47j624
13330I897p34k754l78p559m882J172p29j965j368j2O225P779L440P428K584P626
13314B5770Q001Q655J686o74l910P447J5647J9096K0604K6244M0700O3524N8225
13301B91015N5250O7300P0193L5777K0556J1692n159k7925m8400o0810o8100o8255
13289B73134n6931n0836m8651k4754j0456l003q212j3368r345k190q408p987n219
13276B3774n117O220J207L334r846j3354R590J4591k615M5p37k397k87O694M115
$$ plain form
13374 -2201 11629 15098 12258 59 -4752 -4278 -13634 400 3187 3522 4450 2651 4346 9176 7849
13359 7849 12112 11205 6571 8005 9732 6954 5126 980 6918 9515 10194 5525 706 -2481 10470
13344 10470 13028 11206 8693 10720 13194 10025 15622 13609 17855 23834 13587 10974 11521 9897
13330 9897 9163 6409 6031 -1528 -6410 -5238 -5967 -7932 -9300 -9312 -3087 4692 8132 15560 18144 25770
13314 25770 33771 42426 44112 43438 39528 46975 62622 81718 102322 128566 169266 232790 291015
13301 291015 346265 413565 483758 519535 540091 551783 546624 518699 470299 409489 341389 273134
13289 273134 216203 165367 116716 91962 81506 78503 70291 56923 47578 45388 36980 28993 23774
13276 23774 18657 24877 26084 29418 19572 6218 15808 30399 27784 27829 27092 24695 24408 31102 35217
13261C5217p258p949m117r61K113L380o113L19j1068o922J1481m562m543J2662
13247A1679O938o217l371n017K743N862Q00P807l681j0109n179L508L333m712
13233D384L406O960j028K961P27n164J710k662J705O588j889n736k611L345N247
13218A7943L321k139m070j2463q130m00J672O77R386J816m950L286K178o10k633
13203D884r072j331P625P520n832q595J536J3047Q625N878K011n167m226m659
13189A2244j772r945p852M923J6841J7361L322n561j4248p471K443k6L324J907
13175A5490m138m563j4847l066Q316J0804N444L044j679k502j642M76n54J724
13161A2307j880r99l825K018N599k082J942L460l649M808J80P136L620J881l694
$$ plain form
13261 35217 27959 20010 15893 14932 17045 20425 14312 14631 3563 -3359 8122 3560 -983 11679
13247 11679 18617 12400 9029 4012 6755 12617 13417 21224 17543 7434 2255 5763 9096 4384
13233 4384 7790 14750 13722 16683 17410 12246 13956 11294 12999 19587 17698 11962 9351 12696 17943
13218 17943 21264 19125 15055 2592 -5538 -5938 -4266 -3589 5797 7613 2663 5949 8127 7517 4884
13203 4884 -4188 -5519 2106 9626 3794 -4801 -3265 9782 18407 24285 26296 21129 16903 12244
13189 12244 10472 527 -7325 -2402 14439 31800 35122 29561 15313 7842 10285 10259 13583 15490
13175 15490 11352 6789 -8058 -11124 -2808 7996 13440 16484 14805 12303 10661 11137 10583 12307
13161 12307 10427 9428 5603 7621 13220 11138 13080 16540 12891 17699 17879 25015 28635 30516 26822
13146B6822K403k804j1504j321k559o73j364J2538O513k199N124J093L799M205
13132D0073l24R854M645K065J1584R790k249P041J2538M833n295K812j0766k0268
13118F6333j0015P683n490j5580j5298k80K689K130j250m597p934o336o93m9Q860
13103B0173L617j076Q009n0N968P23l943m580r610o126O383J8436n654l235j095
13088B7940r70n879r525N276p65Q332J153N621O623N264K919k68k175q05m638
13073C8103n505n628M575R094k500q119j810L18q015j517j7537j1697k684O735
13059f187P881n287n788M85L500P06j273j51l022q70O246J1225J5372Q650j125
13044C0362l212Q382m173p513j916k112J695O009k488p200K414J1613Q816k290
$$ plain form
13146 26822 29225 26421 14917 13596 11037 10364 9000 21538 28051 25852 30976 32069 35868 40073
13132 40073 39749 49603 54248 56313 67897 77687 75438 82479 95017 99850 94555 97367 86601 66333
13118 66333 56318 64001 58511 42931 27633 27353 30042 32172 30922 26325 18391 12055 11362 11313 20173
13103 20173 23790 22714 30723 30673 36641 37364 33421 28841 19231 13105 19488 37924 32270 29035 27940
13088 27940 26970 21091 11566 16842 16077 24409 25562 31183 37806 43070 45989 45721 43546 42741 38103
13073 38103 32598 26970 31545 40639 38139 30020 28210 28528 20513 18996 1459 -10238 -12922 -6187
13059 -6187 1694 -3593 -9381 -8896 -5396 -4690 -5963 -6114 -9136 -10006 -3760 7465 22837 31487 30362
13044 30362 27150 35532 31359 23846 21930 19818 21513 27522 25034 17834 20248 31861 40677 38387
13030C8387M948J2057K031O21Q971j0229J1440J5549o39j6191j3022r226j811
13017D2886k805P119R395l861k158L315l270R666N662J519J980o99J3678K0444
13003A02871J1441J3462J8984R764O485j047r469j5240p447J083k609l902p66
12990A23610m935r213j3413q993J194o265o944p155l654k59Q52o469m536m034
12976D9786O238K382J0292K602L53J1180N526K866J114J030L479l452R701J3741
12962A16838N953K963R844j91P124N995l875J941P692Q190M182q03n37J1N71N451
12946A71349j637R667R451L043O334O577j602n123K26J3569J5922J1519J3626
12933B52921R46L493J2873P427J1557Q226J4715J8794J3331K236P59L116L1205
$$ plain form
13030 38387 43335 55392 57423 58044 67015 56786 68226 83775 83136 66945 53923 44697 42886
13017 42886 40081 47200 56595 52734 50576 53891 50621 60287 65949 67468 69448 68749 82427 102871
13003 102871 114312 127774 146758 156522 163007 161960 152491 137251 129804 130887 128278 124376 123610
12990 123610 118675 109462 96049 87056 88250 81985 75041 67886 64232 63973 64825 58356 53820 49786
12976 49786 56024 58406 68698 71300 71653 82833 88359 91225 92339 93369 96848 93396 103097 116838
12962 116838 122791 125754 135598 135407 142531 148526 144651 146592 154284 162474 166656 165853 165316 165327 165898 171349
12946 171349 169712 179379 188830 191873 198207 204784 203182 198059 198285 211854 227776 239295 252921
12933 252921 253867 257360 270233 277660 289217 297443 312158 330952 344283 346519 347278 350394 381599
12920C81599L4276K1795j686R647K2557K1130J7792K3146K6904K8286L2589M1169
12908F59204M1725M3306O1611O0056O5813O8876O7826R4555R7824J09561J29459
12897A499816J45010J80629K14287K57274L18720L81377M25385M85734N62772
12888D471004O46701P16719Q10780R78429J240698J685382K465498L776963N818706
12879B2610880Q163548R710116J0414657J1577482J2996289J2326304Q485723
12872I6284999M183094J334490j669302o217095j0354651j1853546j1617952j1372574
12864D8717463j1019841r534923p073248m752207l171391k198620j618022j253287
12856H095924j011071q80796p80115o89292o11612n36032m59599l92788l14673
$$ plain form
12920 381599 415875 437670 435984 445631 468188 489318 507110 530256 557160 585446 618035 659204
12908 659204 700929 744235 805846 865902 931715 1000591 1068417 1162972 1260796 1370357 1499816
12897 1499816 1644826 1825455 2039742 2297016 2615736 2997113 3422498 3908232 4471004
12888 4471004 5117705 5834424 6645204 7623633 8864331 10549713 13015211 16792174 22610880
12879 22610880 30774428 40484544 50899201 62476683 75472972 87799276 96284999
12872 96284999 100468093 101802583 100133281 93916186 83561535 71707989 60090037 48717463
12864 48717463 37697622 28162699 21089451 16337244 13165853 10967233 9349211 8095924
12856 8095924 7084853 6204057 5423942 4734650 4123038 3587006 3127407 2734619 2419946
12847B419946k45902k01972j68091j37395j24603j04765r7354q6889q4559o3809
12837A104607o4474n4309l8719m6688l6576k7301k9706l1985l3335l2474l7200
12826F71840j8279j9209k1086l2296l0441l4239l2225l3173j9426r751j2309j3931
12814C95475r838l262J633m246j5497j8729j0517m245l995j4294j1979j2419j7203
12801B70884r872j4307k22p085k339p902j109N27K877J251J986j1812j7471l533
12787B01873K434M430M217Q224J3781J5802L3003K7767J3440K2677J0096k437
12775C55307k411J351k093k3026k7103l4578k2743k3721j3979j3238k049r902
12763A81815k0953m979K515k405L804p403j0536j386r053M169J0911P760J665
$$ plain form
12847 2419946 2174044 1972072 1803981 1666586 1541983 1437218 1339864 1252975 1168416 1104607
12837 1104607 1040133 985824 947105 900417 863841 836540 806834 774849 741514 709040 671840
12826 671840 653561 634352 613266 580970 550529 516290 484065 450892 431466 421715 409406 395475
12814 395475 385637 382375 384008 379762 364265 345536 335019 330774 326779 312485 300506 288087 270884
12801 270884 261012 246705 246483 239398 237059 229157 228048 228575 231452 232703 234689 222877 205406 201873
12787 201873 204307 208737 212954 221178 234959 250761 283764 311531 324971 347648 357744 355307
12775 355307 352896 354247 352154 329128 302025 267447 244704 220983 207004 193766 191717 181815
12763 181815 160862 155883 158398 155993 159797 152394 141858 140472 131419 135588 146499 154259 155924
12750A55924J779N811J2306j524o822l949n988j868k783K447j460j8257j7648
12737A17968j5536j9988j1418Q7j4341j0346Q067P703L523n33p723o603k980j212
12723D6668J790P047L506r018j5479K723K861N978K911J976O423Q274p762p360
12709E0538P52J2551O909P8j54j823m866M114n587l317o467j70k001p613o513
12694C6431Q973J2772J6893m18L748K599J1554J290q613r55q505o403k937J968
12680F8397K322j3279j7772m201K210M713p96q821M00N793Q354N919j189L84k384
12665E0050j1416j0857L347k484L83P298J731k44n946K223P94P729j402n138l660
12650C2408q143p729j253M473M52J3150j184n958n141p533O160J55N023k903j598
$$ plain form
12750 155924 157703 163514 175820 174296 167474 163525 157537 155669 152886 155333 153873 135616 117968
12737 117968 102432 82444 71026 71113 56772 46426 54493 62196 65719 65186 57463 50860 47880 46668
12723 46668 48458 55505 59011 49993 34514 37237 40098 46076 48987 50963 57386 65660 57898 50538
12709 50538 51290 63841 70750 70828 70674 68851 63985 68099 62512 59195 52728 52558 50557 42944 36431
12694 36431 45404 58176 75069 74651 78399 80998 92552 93842 85229 84274 75769 69366 66429 68397
12680 68397 70719 57440 39668 35467 37677 42390 41594 32773 33173 38966 47320 53239 52050 52434 50050
12665 50050 38634 27777 31124 28640 29023 36321 38052 37808 31862 34085 34879 42608 41206 36068 32408
12650 32408 24265 16536 15283 19756 20208 33358 32174 26216 21075 13542 19702 19857 24880 21977 20379
12635B0379J943M480j413q890J607J347j333M636q743o939R641J0709N29j5067
12621A2886p578Q862J431K345R613P902M369N641o879p589q732k850k641L41O64
12606A7785K516R851O858o06m172k369J07k134o14n194J751Q111K310J280M014
12591C9494o336o193l375M693j285o970l411q367j184L040N706N151q90O332l56
12576B6049M379K971j1882m685L355l315n027O02P89K739j095o114R89O618M772
12561B1145k779m025o75L995k451j4694k556K901L009L090l464P271l488J0156
12547A7435M757L77j95K933J561K480M688L046j033j0682k624J633N107R601J1701
12532E0785J351K393k942r370r796n067k373j0483j0190o982j685P461J3191N37
$$ plain form
12635 20379 22322 26802 25389 16499 18106 19453 18120 22756 14013 7074 16715 27424 27953 12886
12621 12886 5308 14170 15601 17946 27559 35461 39830 45471 38592 31003 22271 19421 16780 17121 17785
12606 17785 20301 30152 37010 36404 32232 29863 29970 27836 27222 22028 23779 31890 34200 35480 39494
12591 39494 33158 26965 23590 28283 26998 20028 16617 8250 7066 10106 15812 20963 20073 26405 26049
12576 26049 30428 33399 21517 16832 20187 16872 11845 12447 13236 15975 14880 8766 9755 16373 21145
12561 21145 18366 14341 13666 17661 15210 516 -2040 861 3870 6960 3496 10767 7279 17435
12547 17435 22192 22569 22374 25307 26868 29348 34036 37082 36049 25367 22743 24376 29483 39084 50785
12532 50785 52136 54529 51587 42217 32421 27354 24981 14498 4308 -2674 -4359 3102 16293 16830
12518A6830q794k322J107M279l297p373O189Q882o085n464n546k747l636M749
12504c228J3073J1418r594j4778N464Q573J0685L177l182r700k763P397J15j247
12490A5410j435J637J544l638k615n05O833k527k575K677K084k44M556p708j1318
12475B176N915k697M884O294o778k008R878J132k244O860M061r128j2127p171
12461i53J0080O565J6066J4276l387M271o75k033K763L290N830J0984L4708M8169
12447A49954O1182N8871N4120O3637P1885N2310L4532J4558j0225k3548m9707
12436D77569n1980o0995n8415o3778n7283m6263j7038l511j0647n775o058M386
12424A00212R459J5466k04j5684q126j1504M938P239J251j7134q169n198n725
$$ plain form
12518 16830 8036 5714 6821 11100 7803 430 6619 15501 9416 3952 -1594 -4341 -7977 -3228
12504 -3228 9845 21263 11669 -3109 2355 10928 21613 24790 21608 11908 9145 16542 16657 15410
12490 15410 13975 15612 17156 13518 10903 10398 17231 14704 12129 14806 16890 16646 21202 13494 2176
12475 2176 8091 5394 10278 16572 9794 7786 17664 18796 16552 23412 27473 18345 6218 -953
12461 -953 9127 15692 31758 46034 42647 46918 46243 44210 46973 50263 56093 67077 101785 149954
12447 149954 211136 270007 324127 387764 459649 511959 546491 561049 550824 527276 477569
12436 477569 425589 364594 306179 242401 185118 138855 121817 118306 107659 101884 95826 100212
12424 100212 109671 125137 124933 109249 101123 89619 94557 101796 103047 85913 77744 72546 66821
12411F6821l380K263j695r241r306j5430q939K901l976l62O697K7K682J083K043
12396C2188o239j1579j667Q779J298j623n776J476o171j4947j645M140J305K061
12382A600n205L993j815n163K175K612q00m760L040k941O588J3180K724p922p509
12367b03o904o198j953J4678R564N589j1077m651n973n978O425P218Q696O018
12353A5251q043n589l047K531P005Q202l462j1070N947O896p612j0479j472J3259
12339H317J1942K63p308L012j694p972l569R802N309k818l168k6n006j376k757
12324B951M495R31l327m292P89k27m682k584J887J2587R182j773m230M524l590
12309A2641J813N343O66J474q956m835K963O037L21M781o402n395p100L027J981
$$ plain form
12411 66821 63441 65704 64009 54768 45462 30032 21093 23994 20018 19656 26353 26380 29062 30145 32188
12396 32188 25949 14370 12703 21482 22780 21157 15381 16857 10686 -4261 -5906 -1766 -461 1600
12382 1600 -3605 388 -1427 -6590 -4415 -1803 -2603 -7363 -4323 -7264 -676 12504 15228 7306 -203
12367 -203 -7107 -13305 -15258 -580 8984 14573 3496 -1155 -7128 -13106 -6681 537 9233 15251
12353 15251 7208 1619 -1428 1103 8108 16310 12848 1778 7725 14621 7009 -3470 -4942 8317
12339 8317 20259 20522 13214 16226 14532 6560 2991 12793 18102 15284 12116 12090 7084 5708 2951
12324 2951 7446 8377 5050 758 1547 1320 -3362 -5946 -4059 8528 17710 15937 11707 16231 12641
12309 12641 14454 19797 20463 21937 12981 8146 11109 17146 17467 22248 15846 10451 3351 6378 8359
12294H359o974m185M846P64m726K699N847J4673L907q562l212m020m178p004K838
12279A072L292M800K314p309J75L72o450m533O357L332K039J143K89J63m327j303
12263A426J997j2062J05R586Q67J033p126k09K302L896j106l612J851k094N623
12248B477J376o368o511M66J0278J4763L306j39k176O59n725J000Q572l804O929
12233B5103N254n765o897p226j506L120L072J320m442m306o484k813K222k716
12219b064Q93q07j524Q998O517M262k564l512m637o310k734M549J454Q133N459
12204A6113r417j1149o45j06l771M183O019M776K10p953n329L742J256K177N630
12189E736N700o126K025l05K795k511p518L905N43J348k615p866J622N524J3800
$$ plain form
12294 8359 1385 -2800 2046 2810 -1916 783 6630 21303 25210 16648 13436 9416 5238 -1766 1072
12279 1072 4364 9164 11478 4169 4344 4716 -1734 -6267 90 3422 5461 6604 6893 7056 2729 1426
12263 1426 3423 -8639 -8534 1052 1919 2952 -4174 -4383 -2081 1815 709 -2903 -1052 -3146 2477
12248 2477 3853 -2515 -9026 -8560 1718 16481 19787 19648 17472 18131 12406 13406 21978 18174 25103
12233 25103 30357 24592 17695 10469 8963 12083 15155 16475 12033 7727 1243 -1570 652 -2064
12219 -2064 -1171 -1978 -3502 5496 12013 16275 13711 10199 5562 -748 -3482 1067 2521 10654 16113
12204 16113 6696 -4453 -5098 -5204 -8975 -4792 1227 6003 6213 -1740 -7069 -3327 -2071 106 5736
12189 5736 11436 5310 7335 7030 9825 7314 -204 3701 4244 5592 2977 -4889 -3267 2257 16057
12174A6057O863j716m171n027n698l673o392J295l414K455M415l093j0489m464
12160a7052M071O687J0870M727l313J202J720l103k046J439O847j738j0319l742
12146c750R221K469K957l784m076K115m174P331J551O303M331m042o979q94m466
12131D113j411M524M304o643p091M904J0945M474M886O276L787m778j5461l583
12117I246J3530R0o336R354P456q263l281J276J673J312n760l302J336l17q767
12102I247o129K631n335l75Q944M625j628L898j52J570j018k617J699L31O563
12087B2254Q554K1800J8861K6058M9072Q2783J38715K87237N40050N28710p9733
12076A644361n59504m67722k39410j34489q5541m2406j9949j5709j7903n176j0423
$$ plain form
12174 16057 22920 21204 17033 12006 6308 2635 -3757 -2462 -5876 -3421 994 -2099 -12588 -17052
12160 -17052 -12981 -6294 4576 9303 5990 7192 8912 5809 3763 5202 12049 10311 -8 -3750
12146 -3750 5471 7940 10897 7113 3037 5152 978 8309 9860 16163 20494 16452 9473 8579 4113
12131 4113 2702 7226 11530 4887 -2204 2700 13645 18119 23005 29281 33068 28290 12829 9246
12117 9246 22776 22866 16530 25884 33340 25077 21796 23072 24745 26057 20297 16995 18331 18014 9247
12102 9247 3118 5749 414 39 8983 13608 11980 15878 15726 17296 16278 13661 15360 15691 22254
12087 22254 30808 52608 71469 97527 146599 229382 368097 655334 1195384 1724094 1644361
12076 1644361 1084857 617135 377725 243236 157695 115289 95340 79631 61728 56552 46129
12065D6129o392o916n145P28J751j066p477j4130m565O398p05K726Ql837o328
12050A179j216O197O464L552j197m34L398n404j997L78q124l794k370j685J2993
12035G940O258m748j280j1459p239l232n986L866P720Q848N523l074n148K234
12021B23j570o369o144M601L889M94L784L421J4282Q81j7615m945n559k991M967
12006h651M834N037J627p417p495N146K241Q182J5163J1359l849r742n673o95
11992A0067l888r756K168M117Q098jl649L293j218O818L196K256r653j4738j2737
11977a5627O786J0170M941j9577r995Q019N916l641N212L304J1765L532l871j282
11963E652Q60L09l65o565q635P710Q176N351j1436j0704l448O776J221M02Q774
$$ plain form
12065 46129 39737 32821 27676 28404 30155 29089 21612 7482 2917 9315 8610 11336 11344 7507 1179
12050 1179 -37 6160 12624 16176 14979 14545 17943 12539 10542 10920 2796 -998 -3368 -5053 7940
12035 7940 14198 9450 8170 -3289 -10528 -13760 -19746 -15880 -8160 688 6211 3137 -2011 223
12021 223 -1347 -7716 -13860 -9259 -5370 -4876 -1092 2329 16611 17492 -123 -5068 -10627 -13618 -8651
12006 -8651 -3817 1220 2847 -4570 -12065 -6919 -4678 3504 18667 30026 26177 16435 10762 10067
11992 10067 6179 -3577 -1409 2708 10806 10805 7156 10449 9231 16049 19245 21501 11848 -2890 -15627
11977 -15627 -8841 1329 6270 -13307 -23302 -15283 -9367 -13008 -7796 -4492 7273 10805 6934 5652
11963 5652 6512 6821 6456 -109 -8744 -1034 7142 12493 1057 -9647 -13095 -6319 -5098 -4696 4078
11948D078j284j0046j129N321L790o097o234P775K575j0911P4R534J0394M604
11934A2444n731K129j922j470N072k397k881l213n776j1578n498J3410J9323l978
11920G934P09p908m936k794L518k750m949M596L597N708J2368j1393j4096J93
11906a0203N623Q924K816q704K67Q353J809j472R09j7490n367J35J554K059M874
11891e913M551Q981J85k03l224p381j194P17M433j637k093O576k087p80l434m055
11875f558P476n910m193J548j454n821j006O073J1392K460l707N788r51p66J034
11860E405q72m325L282n60J246k504r76P85k289j228J341J572j743j95k702q48
11844d611p055J945J1025q124K290M909k666k278p30j162K325k519l151n942P353
$$ plain form
11948 4078 2794 -7252 -8381 -3060 730 -5367 -11601 -3826 -1251 -12162 -12088 -2554 7840 12444
11934 12444 6713 8842 6920 5450 10522 8125 5244 2031 -3745 -15323 -20821 -7411 11912 7934
11920 7934 8643 735 -4201 -6995 -3477 -6227 -11176 -6580 -2983 2725 15093 3700 -10396 -10203
11906 -10203 -4580 4344 7160 -1544 -1277 7076 8885 7413 8322 -9168 -14535 -14400 -12846 -10787 -5913
11891 -5913 -1362 7619 7804 7601 4377 -3004 -4198 -3481 952 -685 -2778 3798 1711 931 -2503 -6558
11875 -6558 918 -4992 -9185 -7637 -9091 -14912 -15918 -9845 1547 4007 300 6088 5137 4371 5405
11860 5405 4533 208 3490 2930 4176 1672 696 1481 -808 -2036 -695 877 -866 -1061 -3763 -4611
11844 -4611 -11666 -9721 1304 -6820 -4530 379 -2287 -4565 -5295 -6457 -4132 -6651 -9802 -15744 -8391
11829h391J1046L869l740o096j222N257J2125m89K408L729j4404q120K808j5054
11815a6274r39N322q7N29Q38j541k370M921P636j798k764K862r94o260K223J032
11799g664l858m660k066Q164O338k507O87n092o073J539O443P442O025k367l616
11784a265k444k614j197L564Q213J819n395r4o944j858k359Q59q987J131J4883
11769b688J1685R772M591q126p862p537p711L704M2l03K958p977j68K146O003
11754a471k413n776J72P274P459l258l326j888L445N679Q621j859p196k603M415
11739G275j073p939n207o126P46k425j757k334P082M128j843j2011m280P847O521
11724a1396m47L877J045j020o5l801n405J3942N011M926p468m920L180Q326Q360
$$ plain form
11829 -8391 2655 6524 2784 -3312 -4534 723 12848 12359 14767 18496 4092 -4028 -1220 -16274
11815 -16274 -17213 -11891 -11978 -11449 -10611 -12152 -14522 -9601 -1965 -3763 -6527 -3665 -4659 -10919 -8696 -7664
11799 -7664 -11522 -16182 -18248 -10084 -3746 -6253 -5566 -10658 -16731 -15192 -8749 -1307 4718 2351 -1265
11784 -1265 -3709 -6323 -7520 -3956 4257 6076 681 587 -6357 -8215 -10574 -9715 -18702 -17571 -2688
11769 -2688 8997 18769 23360 15234 7372 -165 -7876 -4172 -4130 -4433 -1475 -9452 -9620 -7474 -1471
11754 -1471 -3884 -9660 -9488 -2214 5245 1987 -1339 -3227 218 5897 14518 12659 5463 2860 7275
11739 7275 6202 -1737 -6944 -13070 -12324 -14749 -16506 -18840 -11758 -7630 -9473 -21484 -25764 -17917 -11396
11724 -11396 -11843 -7966 -6921 -7941 -8006 -11807 -17212 -3270 1741 6667 -801 -5721 -2541 5785 14145
11709A4145p710p72O44K704m819K004Q078m520j2767o884O24M194p673M016K1253
11694A2517N858j2164q297j0900o65K327K876l461J525J2570n384j0522O28O319
11680f773L705l793L277m704K718M993l399O61l91J380K567n324q588p032N069
11665a5634K989r366P9K917K355l17M918O52L136l537p106R8k153l556P002O670
11649a0853m645n68q793L63Q972J616M351O625K123l672o827J583L27O701P381
11634D684o427n453R026L285l28k169k564J439L025o749m292l445j667p837q25
11619b0297O323q095L529K499L503N427K799n048M127Q114O232K977j3584q419
11605i913j390P61R320j550p778K498J1247r03j821r610p51M042M891j205L796
$$ plain form
11709 14145 6435 5663 6307 9011 4192 6196 14274 9754 -3013 -9897 -9273 -5079 -12752 -8736 12517
11694 12517 18375 6211 -2086 -12986 -13651 -11324 -8448 -11909 -10384 2186 -3198 -13720 -13092 -6773
11680 -6773 -3068 -6861 -3584 -8288 -5570 -577 -3976 -3315 -3706 -2326 241 -5083 -13671 -20703 -15634
11665 -15634 -12645 -22011 -21932 -19015 -16660 -16977 -12059 -11407 -8271 -11808 -18914 -18816 -20969 -24525 -17523 -10853
11649 -10853 -15498 -16066 -24859 -24496 -15524 -13908 -9557 -2932 -809 -4481 -11308 -9725 -9398 -2697 4684
11634 4684 -1743 -7196 1830 5115 4787 2618 54 1493 4518 -2231 -6523 -9968 -11635 -19472 -20297
11619 -20297 -13974 -22069 -18540 -16041 -12538 -7111 -4312 -9360 -5233 2881 9113 12090 -1494 -9913
11605 -9913 -11303 -10542 -1222 -2772 -10550 -8052 3195 2292 471 -9139 -9890 -5848 -957 -2162 1634
11590A634J2095m459M183k902o255K657n306m272Q634m333r893L344O130M201
11576E458J30J668l118p165p57L16j108o839j148l504J31N311P897r312K235M918
11560d887l198j300L644O309P457K900J349m315r816P874P819p452j339N877k665
11545H257j192L799J284K214n587j3618n683M137J1240k386J76m798n414l947
11531a1518P71J7127J621j1855n291J4699R33r441k492k747n78n85j3500N355
11517a7501P677j525M287L948K578k732K820R189L979m922P908J065k763Q7L755
11502A7850q140k9K994n74r491r482M270p24o039m53N288P956P541O006J149o066
11486A2056p946j6248R706J1419J635N0q81J204p827r406l073p07m53l641R141
$$ plain form
11590 1634 13729 9270 13453 10551 4296 6953 1647 -2625 6009 1676 -8217 -4873 1257 5458
11576 5458 5588 7256 4138 -3027 -3784 -3468 -4576 -11415 -12563 -16067 -15936 -10625 -2728 -12040 -9805 -4887
11560 -4887 -8085 -9385 -5741 568 8025 10925 12274 7959 -1857 6017 13836 6384 5045 10922 8257
11545 8257 7065 10864 12148 14362 8775 -4843 -10526 -6389 4851 2465 2641 -2157 -7571 -11518
11531 -11518 -10747 6380 8001 -3854 -9145 5554 6487 -2954 -5446 -8193 -8771 -9356 -22856 -17501
11517 -17501 -9824 -11349 -7062 -3114 -536 -3268 -448 8741 12720 7798 15706 16771 14008 14095 17850
11502 17850 9710 9681 12675 12101 2610 -6872 -2602 -3326 -9365 -9818 -4530 3426 10967 16973 18122 12056
11486 12056 4110 -12138 -2432 8987 10622 10672 9791 10995 3168 -6238 -9311 -10018 -10471 -14112 -4971
11471d971M449J237k932j846k074p081K996O505R133o314n898K817k475M86P785
11456A817j478r073o687m83Q15L333N36p077J720O214L313M069k744o848J0329
11441b244J4435M813p896o976j2577o006n198L368J2781J118m933k386K46j443
11427a2898J969O124N078l197J597L238K097K441l045m751o422R295R778k370
11413H934j0837k608L176Q503K095M321k106L734l079K417n916N388P701o512
11399A5211j5356m291J2172N909K624N332j0240j3190r588J236n681R58J1568
11386c336j282l065O818J475p314n971N772J2689O224Q66n471l40m94K241j2656
11371c844r80L184M654o029N465J0011J057j959M13r12L023M95j2037J803L476
$$ plain form
11471 -4971 -522 715 -2217 -4063 -6137 -13218 -10222 -3717 5416 -898 -6796 -3979 -6454 -5968 1817
11456 1817 339 -8734 -15421 -15904 -15089 -11756 -11220 -18297 -16577 -10363 -7050 -2981 -5725 -12573 -2244
11441 -2244 12191 17004 9108 2132 -10445 -16451 -21649 -18281 -5500 -4382 -9315 -11701 -11455 -12898
11427 -12898 -10929 -4805 273 -2924 -1327 1911 4008 6449 3404 -1347 -7769 1526 11304 8934
11413 8934 -1903 -4511 -1335 7168 9263 13584 11478 15212 12133 14550 8634 14022 21723 15211
11399 15211 -145 -4436 7736 13645 16269 21601 11361 -1829 -11417 -10181 -15862 -14904 -3336
11386 -3336 -4618 -7683 -865 610 -6704 -12675 -6903 5786 12010 12876 7405 7065 6571 8812 -3844
11371 -3844 -4824 -1640 3014 -3015 2450 12461 13518 11559 11972 11060 14083 14578 2541 4344 7820
11356G820k178n860L418K076M391R947j860j1363p801m020m465K073M146n681
11342i357q853L806m72K930L721L742n462J71J733M226O810K076l355q816n849
11327a2949k282R367M214O459L267J175j244j5037l866J0279Q131N173m678l135
11313D874q64O917Lm125j07Q707j695j0289j1413q933l109N738M58l217q652M984
11297b0723M12N600O584Q735K66p582K459K086l736j448p036k334R049P808N186
11282E326L549K522O399J962n002n456j597J876j058m891r575M060J6282K6315
11268D0712L1013M9148N6552N3944K6554r167j3236l2935m5781m5077m2003k5808
11256D3916q314n444o903o976k798M626l18k072j592l207n668j871j2236p570
$$ plain form
11356 7820 5642 -218 3200 5276 9667 19614 17754 6391 -1410 -5430 -9895 -7822 -3676 -9357
11342 -9357 -18210 -14404 -14876 -11946 -8225 -4483 -9945 -9774 -8041 -3815 2995 5071 1716 -7100 -12949
11327 -12949 -15231 -5864 -1650 4809 8076 9251 8007 -7030 -10896 -617 7514 12687 8009 4874
11313 4874 4010 10927 10930 6805 6698 15405 13710 3421 -7992 -16925 -20034 -14296 -13838 -17055 -25707 -20723
11297 -20723 -20311 -14711 -8127 608 874 -6708 -4249 -2163 -5899 -7347 -14383 -16717 -7668 140 5326
11282 5326 8875 11397 17796 19758 14756 9300 7703 9579 8521 3630 -5945 -1885 14397 40712
11268 40712 71725 120873 177425 231369 257923 248756 235520 202585 156804 111727 69724 43916
11256 43916 35602 30158 23255 16279 13481 18107 17789 15717 14125 10918 5250 3379 -8857 -16427
11242a6427j845l332J122R43N536L189J3187K876q07n00m45q945m554M184J2319
11227F501n235o665L048q8q387m669P816J0645K288p847n842k679l26l818P511
11212g747J3698k373q051l237K602N25j519m205j575J922p76l580j174M194P652
11197c644L810k105k151N379P51L215l289m692L980J734o377L489J3927k706j316
11182A0005l118l626j32L831m315j5304J301J0126K677k583o496j09r06L675J105
11167c869p919O745K224O950k574Q409N323o85k060j955j834Q508J9346J9883
11153E6492K7565M4244N2029K0094q037L000J1252q864m7447n3673k5227j1977
11141E9451j4758j5389j2970j3457M971N336n019P19p77n39Q75Q902L402M8K1
$$ plain form
11242 -16427 -18272 -21604 -20482 -19539 -14003 -10814 2373 5249 4442 3942 3497 -5448 -10002 -5818 6501
11227 6501 1266 -5399 -2351 -2439 -10826 -15495 -7679 2966 5254 -2593 -8435 -11114 -11440 -15258 -7747
11212 -7747 5951 3578 -4473 -7710 -5108 -4583 -6102 -10307 -11882 -9960 -10736 -14316 -15490 -11296 -3644
11197 -3644 166 -1939 -4090 1289 2040 5255 1966 -2726 1254 2988 -3389 100 14027 11321 10005
11182 10005 6887 3261 3129 6960 2645 -12659 -11358 -1232 1445 -1138 -7634 -7743 -8649 -4974 -3869
11167 -3869 -11788 -5043 -2819 4131 1557 9966 15289 14604 12544 10589 8755 17263 36609 56492
11153 56492 84057 128301 180330 200424 192387 195387 206639 197775 150328 96655 71428 59451
11141 59451 44693 29304 16334 2877 7848 13184 8165 8884 8107 7568 8443 17345 20747 20795 20816
11126B0816k611R68J71j0046p416J271j832M003n121j78K494m326J542l481M471
11111G25P63K941n495j0371L283n421n873J3828P963L348l351l789R227o116M56
11096B118l909n265N732J0720k366j5610j708R532N026j663N81J3762K516o960
11082A2506n857q095j655J4753m339o801m301j380K800J996O844M425j080p18
11068I098J070j915N8j534m064j3314o685J0093J586O73O592K969J060j901R77
11053D763k342m260M312J772m756j194M577k421L853Q9M52J2762N52l370q415
11038F374R379J1479J616j959m998j1596J430j409m444p402Q026J0401K071m281
11024A4687O19l727o970M65m109j445j59Q502J5448l336l808L539l330l687r217
$$ plain form
11126 20816 18205 19173 19344 9298 1882 3153 1321 5324 203 25 2519 -1807 -265 -3746 725
11111 725 1488 4429 -1066 -11437 -8154 -13575 -19448 -5620 2343 5691 2340 -1449 7778 1662 2118
11096 2118 -1791 -7056 -1324 9396 7030 -8580 -10288 -756 4270 2607 3188 16950 19466 12506
11082 12506 6649 -1446 -3101 11652 7313 512 -3789 -5169 -2369 -373 6471 10896 9816 9098
11068 9098 10168 8253 8311 6777 2713 -10601 -17286 -7193 -5607 -4934 1658 4627 5687 3786 4763
11053 4763 2421 -1839 2473 4245 -511 -1705 2872 451 4304 4393 4845 17607 18159 14789 6374
11038 6374 15753 27232 28848 26889 21891 10295 11725 10316 5872 -1530 6496 16897 18968 14687
11024 14687 15306 11579 4609 5074 965 -480 -639 7863 23311 19975 16167 19706 16376 12689 3472
11009C472l302Q790L677l093J680n266l749J842K829K197p579P801J3583L067
10995B5949Q53q314m12P157n543l376q720j4790J206J776o285q098l290J4220
10981g667J1249K202L33K562N354j7K312o577r773K026J287n01R305j665J000
10966A1430J1828n367m430J77n127Mj193k666p098p563j006J0624J267k187n97
10951a904L001L292N560m984j641jP217R733R11N200L603m516R83k14L140n263
10935B4117q646M110P061Q979P476J7869J1611M990P484Q893J1775K1827M1234
10922A68780O2531R2626J52278K57900M10820M39431R3833l32780m34215l12945
10912E98259j87615j03669n7780m6677l9142l2377k2195j8489j3317p409j580
$$ plain form
11009 3472 170 8960 12637 9544 11224 5958 2209 4051 6880 9077 1498 9299 22882 25949
10995 25949 26802 18488 18076 25233 19690 16314 7594 -7196 -5990 -4214 -10499 -18597 -21887 -7667
10981 -7667 3582 5784 6117 8679 14033 14016 16328 9751 -22 2004 3291 2790 12095 10430 11430
10966 11430 23258 17891 13461 13638 8511 8515 7322 4656 -2442 -10005 -11011 -387 880 -1307 -1904
10951 -1904 1097 4389 9949 4965 3324 3323 10540 20273 21184 26384 29987 25471 26454 26240 29380 24117
10935 24117 15471 19581 26642 35621 43097 60966 72577 77567 85051 93944 105719 127546 168780
10922 168780 231311 323937 476215 734115 1144935 1584366 1678199 1345419 911204 598259
10912 598259 410644 306975 249195 202518 163376 130999 108804 90315 76998 69589 68009
10901F8009j0700j0756j175N597j863j0832m323L217m023k886K067o735L274P626
10887C6497p3l745n301K502K728N250J055m101k362R277O30J959q180j3320j72
10872B2644L379L516K355j0726L822J715j120Q69M716m709k617Q2l251K089m251
10857A8513M4j567R431k77j0108q81J332o780n690j33Q49l831J926O321K23J3034
10841B2406j933r874l018L443L047O17n91q334p608m617n819p62J2674j194n506
10826g069l236p520O426J9408O878r157l584P908j385j467k756M665N212J595
10812A5918k987p402j555j4979m698K354L155K0743O368l027k559Q438R594R958
10798C9321K726j6773K155p831j0633j1658k544M459N05N644L163M983J1504N930
$$ plain form
10901 68009 57309 46553 45378 50975 49112 38280 33957 37174 33151 30265 32332 25597 28871 36497
10887 36497 36424 32679 27378 29880 32608 37858 38913 34812 32450 41727 42357 44316 36136 22816 22644
10872 22644 26023 29539 31894 21168 24990 26705 25585 26454 31170 26461 23844 23926 20675 22764 18513
10857 18513 18557 16990 26421 26144 16036 15155 16487 9707 4017 3884 4733 902 2828 9149 9372 22406
10841 22406 20473 10599 7581 11024 14071 14688 14097 5763 -1845 -6462 -12281 -13043 -369 -1563 -7069
10826 -7069 -10305 -17825 -11399 8009 14887 5730 2146 10054 8669 7202 4446 9111 14323 15918
10812 15918 12931 5529 3974 -11005 -15703 -13349 -10194 10549 16917 13890 11331 19769 29363 39321
10798 39321 42047 25274 27429 19598 8965 -2693 -5237 -778 -273 5371 8534 13517 25021 30951
10784C0951K436j64K076j228k789l625j4580j5210K468R871J815L709Q022R402
10770C3154M64L06R043N05N767R214J8251M2599N4962N7119L5145m2340o1164
10757A63025k9283k0050r689p697j3370j0477o442j7198q057j2153n74l262L657
10744B8430j568j209j875j263P049N985m662L964J0401R792Q077K403j3528j6018
10730C5978l934J2656N632j1932p419j382J180j691L409O756l265K628J0212N9
10716D8887J226n530O627Q548j3467j4087j6980j983J3120J4773J4402J269n703
10703E1102o961K712p536j448J1698K248l697j9723k2340l6930m6707k7356P145
10690i7793K1495K4295K5456L0136K2728J8249O211J0761R911k646o084j48o958
$$ plain form
10784 30951 33387 33223 35299 34071 31282 27657 13077 -2133 335 10206 12021 15730 23752 33154
10770 33154 33618 33924 42967 43472 49239 58453 76704 119303 174265 231384 266529 224189 163025
10757 163025 133742 113692 104003 96306 82936 72459 66017 48819 40762 28609 28035 24773 28430
10744 28430 26862 25653 23778 22515 29564 35549 30887 34851 45252 55044 63121 65524 51996 35978
10730 35978 32044 44700 50332 38400 30981 29599 30779 29088 32497 39253 35988 38616 48828 48887
10716 48887 50113 44583 51210 59758 46291 32204 15224 13241 26361 41134 55536 56805 51102
10703 51102 44141 46853 39317 37869 49567 51815 48118 28395 6055 -30875 -77582 -104938 -97793
10690 -97793 -76298 -52003 -26547 3589 26317 44566 50777 61538 71449 68803 62719 62571 55613
10677E5613p943j5501n976j284n891o580J239k003O621N798J4620N043N761Q870
10663E8387J1426J1267J8065J1118N223m610N677Q877p581j6323j2561j776J666
10650H8855N862k331P376J0197j4016j2130m844Q970J1205R809K6323L1724L0903
10637A97903L9569N9670O2290j8092o2597k5312k1725l9814k5997r067j0370o519
10625A39939o210l675r283j5609j7332K259j331m975j1429K087M25M77J5790J3563
10611A04696m82N507J0579Q624J8741r656j3558n628p744q790L975P572J0664
10598A24500J0319K7967K1430m47l172K5919L6442J001q294j2605j5024k344J2819
10585B18511J2973J6527n545j0208L959J2516K4703J0834J7459J4738J1893O052
$$ plain form
10677 55613 47670 32169 26193 24909 19018 12438 13677 11674 18295 24093 38713 43756 49517 58387
10663 58387 69813 81080 99145 110263 115486 110876 116553 125430 117849 101526 88965 87189 88855
10650 88855 94717 92386 99762 109959 95943 83813 78969 87939 99144 108953 135276 167000 197903
10637 197903 237472 297142 359432 341340 278743 253431 231706 191892 165895 156828 146458 139939
10625 139939 133729 130054 120771 105162 87830 90089 88758 83783 72354 74441 74866 75343 91133 104696
10611 104696 104214 109721 120300 128924 147665 138009 124451 118823 111079 102289 106264 113836 124500
10598 124500 134819 162786 184216 183769 180597 206516 242958 243959 235665 223060 208036 205692 218511
10585 218511 231484 248011 242466 232258 236217 248733 273436 284270 301729 316467 328360 334412
10573C34412O785j3244j7014J3428L0819K5707K5217L5113L0191K1485K3727K2147
10561E38773L3342L4761K8074K0155K0591O7826J29183J74298K53200M23185O19839
10550B343227N23524l7548n25599n25455l25358j37125k8424J9833M3065N9970
10540A410110O1509O0761O4583Q3325J31723J87972K59762L80495N32279P04291
10530C876810O36375J91834j73853j36688J09071L44751M87429N65098O39328
10521F540155P80530J035590J405023J884139K505162L300212M520374O573679
10513B8544864R962055J5900431K7437529M9174031P9799855Q4646879J9244424
10506C14710068o4390774q4241250n8663974l3049731j8520351j1429088p867184
$$ plain form
10573 334412 341197 327953 310939 324367 355186 380893 406110 441223 471414 492899 516626 538773
10561 538773 572115 606876 634950 655105 675696 743522 872705 1047003 1300203 1723388 2343227
10550 2343227 2866751 2829203 2303604 1778149 1452791 1315666 1287242 1307075 1350140 1410110
10540 1410110 1471619 1532380 1596963 1680288 1812011 1999983 2259745 2640240 3172519 3876810
10530 3876810 4513185 4705019 4531166 4394478 4503549 4848300 5335729 5900827 6540155
10521 6540155 7320685 8356275 9761298 11645437 14150599 17450811 21971185 28544864
10513 28544864 38506919 54407350 81844879 131018910 210818765 295465644 314710068
10506 314710068 250319294 166078044 107414070 74364339 55843988 44414900 36547716
10499C6547716n607844m689469m657354m283529l419098k559142j927426j451739
10491G952115j076728q07304o15314m75497l53060j92594M4704K10571l1526n14922
10481D140445o54493m91218l21696k36970k08008j94186j69791j30049j10508
10472A623526r9859p3192m7661m7105n9562p3765q0693q6133q3089n9298l7162
10461H76007l1151k1606p703k1441n2765n0035l7117k7042k2739k5971k4183q698
10449E45556j9731r993j2653o876J4141j248k2072l9221m5209k3932j8101r368
10437C51293J797J0242K115o788q156j5913j2335p918n382n923j553j1981j2624
10424B76874j1551J5509K8104J7883m33k3818j8042j1474k234R37o298p73q52
$$ plain form
10499 36547716 30939872 26250403 21593049 17309520 13890422 11331280 9403854 7952115
10491 7952115 6875387 6068083 5452769 4977272 4624212 4431618 4476322 4686893 4655367 4140445
10481 4140445 3485952 2994734 2673038 2436068 2228060 2033874 1864083 1734034 1623526
10472 1623526 1523667 1450475 1402814 1355709 1296147 1222382 1141689 1055556 972467 913169 876007
10461 876007 844856 823250 815547 794106 741341 691306 654189 627147 604408 578437 554254 545556
10449 545556 525825 515832 503179 496303 510444 509196 487124 447903 402694 378762 360661 351293
10437 351293 353090 363332 365447 358659 350503 334590 322255 314337 308955 303032 301479 289498 276874
10424 276874 265323 280832 308936 326819 326386 302568 284526 273052 270818 271755 265457 264684 263832
10411B63832j2107k3500j6909j1819j635k248N617L129L676J1683L407k651K997
10398B23472r854r287n023p020j2631o729n095j1025k891M444J6794R918J1717
10385A96790J0696L0287O0092Q0839q808q5469n4553m2742j3426j2302j7832j1258
10373A32314p08N283O883j0477k4262o981N527J211J2296l131r554j1754k7848
10360F8799o89k132m917o749l51N823J918O919K406K007J9522J2573P12O140P364
10345A19345R368M213j5511j1229Q460n347n59k072n893n744r622j4045m248p66
10331F6350J6161J3328J6446J5345J1373J8470L1669J7021l670k6884k1450k3633
10319A30526k3063k6191n291K54N253Q145o799j0248q853j5608j0604K401J8547
$$ plain form
10411 263832 251725 228225 211316 199497 197862 195614 201231 204360 208036 219719 223126 220475 223472
10398 223472 213618 204331 199308 192288 179657 172928 167833 156808 153917 158361 175155 185073 196790
10385 196790 207486 237773 297865 378704 369896 284427 229874 187132 173706 161404 143572 132314
10373 132314 131606 136889 143772 133295 109033 102052 107579 108790 121086 117955 108401 96647 68799
10360 68799 68110 65978 61061 54312 53961 59784 61702 68621 71027 73034 92556 105129 105841 111981 119345
10345 119345 128713 132926 117415 106186 114646 109299 108740 106668 100775 95031 85409 71364 67116 66350
10331 66350 82511 95839 112285 127630 139003 157473 189142 206163 202493 175609 154159 130526
10319 130526 107463 81272 75981 76235 81488 89633 82834 72586 63733 48125 37521 39922 58469
10306E8469K6637J788j8036j4877j0623K114O268K571J0343r569q758Q24j236
10293D5915O378M107O978M559n146o547r53k393L874K202L29r090m871J402k495
10278D4249J878o786L481O141p358J012J1292P518m208j858j245P967L8j9017
10264D3104j2563M934L40n262o619j819R459J4863J0487J1180P235k198r338j52
10250F3651l9K088k667l530K604l717q866q724p76m300L397oO08k058j0813j2453
10234A4399j47N336N586J084M846O770O296O950J123k413m31j407r181q545k528
10219B7738p251N716M247j62K679k019M187R087q53m976M438O420J410L395N980
10204F0036m202j1162j1273k552N26k414L770L46m81k270k874n504J614P859O00
$$ plain form
10306 58469 85106 86894 68858 53981 43358 45472 51740 54311 64654 55085 46327 47151 45915
10293 45915 52293 56400 63378 67937 62791 56244 55291 52898 56772 58974 59303 50213 45342 46744 44249
10278 44249 46127 39341 42822 48963 41605 42617 53909 61427 57219 55361 54116 62083 62121 43104
10264 43104 30541 35475 35815 30553 23934 22115 31574 46437 56924 68104 75339 73141 63803 63651
10250 63651 63612 65700 63033 59503 62107 58390 49524 40800 40024 35724 39121 39115 39723 37665 26852 14399
10234 14399 14252 19588 25174 26258 31104 37874 44170 51120 52243 49830 49399 47992 38811 30266 27738
10219 27738 20487 26203 30450 30288 32967 30948 35135 44222 43369 38393 42831 49251 50661 54056 60036
10204 60036 55834 44672 33399 30847 31373 28959 32729 33075 32594 30324 27450 21946 23560 31419 32019
10189C2019P855J0690m622m578k599j1505l133P911j178K502r588k172O269K944
10175C0815p31K628m52k94J7955J7171K813P337Q945m984q715r992j1487l530
10161D7479j330J700l757M1j392j2397j042k986l641m589k713j2458O528J0167
10147A9610K946J681M669r097j804J752J984J0049m241l985q004P038K855N949
10133C1402L65k442K61L447l960k473j282J836q081m31J0086O116q167l470L421
10118B6628N583L150O909L793N426m307R64J615k801P572M268l84Q063K1227R877
10103I7583J2090J7513J2721J5472L6871O7570J11411J81686L16971M61494L61536
10092A692918o1220m07022m11165k64296j61827q6493m5081m3655l3448k2104
$$ plain form
10189 32019 39874 50564 45942 41364 38765 27260 24127 32038 30860 33362 23774 21602 27871 30815
10175 30815 30084 32712 32260 31966 49921 67092 69905 77242 86187 81203 72488 62496 51009 47479
10161 47479 46149 47849 44092 44133 42741 30344 29302 26316 22675 18086 15373 2915 9443 19610
10147 19610 22556 24237 28906 19809 18005 19757 21741 31790 27549 23564 15560 22598 25453 31402
10133 31402 31767 29325 29586 33033 29073 26600 25318 27154 19073 18642 28728 34844 26677 23207 26628
10118 26628 32211 35361 42270 46063 51489 47182 48146 49761 46960 54532 58800 58416 66479 87706 97583
10103 97583 109673 127186 139907 155379 192250 259820 371231 552917 869888 1331382 1692918
10092 1692918 1631698 1224676 813511 549215 387388 300895 255814 212159 178711 156607
10082A56607j8534j2056j5173k0782j3697j7858j7786k254O744k306L586R295
10070E5786J010l837l653j446N28j1424j260r1k986k301j36N647k244l957K353
10055C1989J18j517O481m518n283k208J2461l422j0525l677j357m301j835O764
10041A9170l062J0199J1102o61Q332L146O118r254l497l95P636R930J2723K411
10027G3898M814L7145N9419J28086K43804L18485R3143k51826k89844j68250p9959
10016A68915m8751k0694j6519o563j0335j2692n10J872r288j987M519K0279K1590
10003H9836J8600P046j5093k2616k1842j0487M263P126p730r801j0572n372R369
9990C2727Q714Q447J0521O420l661q497m345l706j5039P160J2400k896k345N945
$$ plain form
10082 156607 138073 126017 110844 90062 76365 58507 40721 38467 45211 42905 46491 55786
10070 55786 56796 52959 49306 47860 48388 36964 35704 35613 32627 30326 30190 35837 33593 29636 31989
10055 31989 32107 30590 37071 32553 27270 25062 37523 34101 23576 19899 18542 14241 12406 19170
10041 19170 16108 26307 37409 36748 45080 48226 54344 45090 41593 41198 48834 58764 71487 73898
10027 73898 78712 115857 175276 303362 547166 865651 958794 706968 417124 248874 168915
10016 168915 120164 99470 82951 76388 66053 53361 52851 54723 45435 43448 47967 68246 89836
10003 89836 108436 115482 100389 77773 55931 45444 49707 56833 49103 39302 28730 23358 32727
9990 32727 41441 49888 60409 66829 63168 54671 50326 46620 31581 38741 51141 48245 45900 51845
9976E1845J3260Q271J8265J8352K0178k6n474o675l975J439m089o296o083J1093
9962A10085K1377K2974J0992J0002J8580K9590M1674N2454N7848R2262J28660
9951E96498J88391K36807K54514J99677Q0479l6318o7314r211J07451K48714L89425
9940B189113M37222K86093n0942l38507m07556l32770j97714o5055L0074P3843
9930A623801J436j26027k31970k62678k22167j75892j16758q9764p2860n4103
9920B73018l1523j9031j9678j0185j5789j9130j5561j107j0316j4129j2988o773
9908I6808P910r077j1023j2240j4409L890N63N648m356N502J437m244j2889k683
9894E0837m90n358o347q886p442J4212J8214j0271r581j57R896j377Q04O260n353
$$ plain form
9976 51845 65105 73376 91641 109993 130171 130145 124671 117996 114021 115460 111371 105075 98992 110085
9962 110085 131462 154436 165428 175430 194010 223600 265274 317728 375576 467838 596498
9951 596498 784889 1021696 1276210 1475887 1556366 1520048 1452734 1443523 1550974 1799688 2189113
9940 2189113 2626335 2912428 2861486 2522979 2115423 1782653 1584939 1519884 1549958 1623801
9930 1623801 1625237 1499210 1267240 1004562 782395 606503 489745 399981 327121 273018
9920 273018 241495 222464 202786 192601 176812 157682 142121 141014 130698 116569 103581 96808
9908 96808 104718 95641 84618 72378 57969 61859 62422 68070 63714 69216 70653 66409 53520 50837
9894 50837 50347 44989 38642 29756 22314 36526 54740 44469 34888 34731 44627 43250 44054 50314 44961
9879D4961p372l229K348N076k591j781M034N633M5m46J105k757O829J9994J1649
9864H3498J4500J5073k200j0900j3090r820k2470j9848n265R743P581J328n546
9851D2584j330m896k453M795J512j929k958o452j075J629M989K31O46L8k680O027
9835C8678l398j1349m243p599L352J8858J6855M345k428j2249l992L367R030q81
9821D8346o317k277k727k870k861j528l49p752M424k828j034P222J2261J60p917
9806C3953j309k920K070m547l111L443O261Q377j69j712L592j638o414L38P585
9791D3799K129J612q651q996L548P523k349j441k70j242M824R890K0690L5944
9777A07010L4660N4752M8718O30l8382o9256n0238j6017o947q646j3123Q675R488
$$ plain form
9879 44961 37589 34360 36708 41784 39193 37412 41446 47079 47124 46678 47783 45026 51855 71849 83498
9864 83498 97998 113071 110871 99971 86881 77061 54591 34743 29478 39221 46802 48130 42584
9851 42584 41254 36358 33905 38700 40212 38283 35325 28873 27798 29427 34416 34647 35293 35331 32651 38678
9835 38678 35280 23931 19688 12089 15441 34299 51154 55499 53071 40822 36830 40197 49227 48346
9821 48346 42029 39752 37025 34155 31294 29766 29417 21665 26089 23261 22227 29449 41710 41870 33953
9806 33953 32644 29724 31794 27247 24136 27579 33840 42217 42048 40336 43928 42290 35876 36214 43799
9791 43799 45928 47540 38889 29893 33441 40964 38615 37174 36904 35662 40486 50376 71066 107010
9777 107010 141670 196422 245140 245770 207388 138132 87894 71877 64930 56284 43161 51836 61324
9764F1324l716j2878r018o365n039O725P402K650l867K075k7L732m745j2489m135
9749B1629m370M592J5821M699J337L627M715M758J137J962k784Q45l305o780k063
9734D5820R503J2655K47m547N46J3545N350K808J2443M107N493J7730R889J4241
9720A49830J9213K5965J0351J6783K9726N0277N1314N4280P3177R7788J54550
9709G33254K13372K93245L72881L94929L34276K73808L25042M02921L08548j3092
9699C639184l03400l86480k97343k72399l40823m06210l82584k91301k02160j49529
9689F06955j08094q3779o9652n1712k3527k2746j7019l0241k5426j9929j4842
9678A39988k1640j3006q824n204j485q212p010q989n914q59J0267J3049J371j2742
$$ plain form
9764 61324 57608 44730 35712 29347 24308 31033 38435 41085 37218 39293 39266 42998 38253 25764 21629
9749 21629 17259 21851 37672 42371 43708 47335 52050 56808 57945 59907 57123 57968 54663 47883 45820
9734 45820 55323 67978 68225 63678 64224 77769 83119 85927 98370 102477 107970 125700 135589 149830
9720 149830 169043 195008 205359 222142 251868 302145 353459 407739 480916 578704 733254
9709 733254 946626 1239871 1612752 2007681 2341957 2615765 2940807 3343728 3652276 3639184
9699 3639184 3335784 2949304 2651961 2379562 2038739 1632529 1249945 958644 756484 606955
9689 606955 498861 415082 345430 293718 270191 247445 230426 200185 174759 154830 139988
9678 139988 118348 105342 96518 91314 89829 81617 74607 65618 59704 58845 69112 82161 83532 70790
9664G0790j5912J784n152j3874m049M893K125n711L873O483k668P922j222m000
9650D5282p722J931o955q265Q660K935j285J300r346O458J0960l444p620K658
9636C5547N88l370J019J580r454r218K474R445R007r04q119j366J015r799q378
9621A0067O82l950p065k68J1696M124o895k762l7j551L201J204J020K899k92m93
9605A1580L612j515P246K944M431o493j1917Q266n53P600J079j447L936J731k538
9590B7962n47M605L601J066j373n675J221j264n658K142J797n772o89K816L555
9575B7787l32J033o054r401j430M396l551J3641P301n720k003k848K489Q867J0455
9560D4630k255m721k154O480L740J910N975L719q82j866m595j940J939l524p715
$$ plain form
9664 70790 54878 56662 51510 37636 33587 38480 40605 34894 38767 45250 42582 50504 49282 45282
9650 45282 37560 39491 32536 24271 32931 35866 34581 35881 26535 32993 43953 40509 32889 35547
9636 35547 36135 32765 33784 35364 25910 16692 19166 28611 37618 36714 28595 27229 28244 18445 10067
9621 10067 10749 6799 -266 -534 11162 15286 8391 5629 5592 4041 7242 8446 9466 12365 12073 11580
9605 11580 15192 13677 20923 23867 28298 21805 9888 18154 17601 25201 26280 24833 28769 30500 27962
9590 27962 27415 32020 35621 36687 35314 29639 30860 29596 23938 26080 27877 22105 21416 24232 27787
9575 27787 27455 28488 22434 13033 11603 15999 12448 26089 33390 27670 25667 22819 25308 34175 44630
9560 44630 42375 37654 35500 41980 45720 47630 53605 57324 56442 54576 49981 48041 49980 46456 38741
9545C8741k248l938o154L62P712l490j671m617J440M259p242P19N953J0086l367
9530C6545m683o53K790Q630n462r423r14n298L042N58l314P295K618o006M59Q971
9514C5155J779j399l027O25o434M25Q245L309J0258M216J4069K0247K9033O7277
9500A83778O0524J6329m8285o0982m4780k6207j9321j1241M79l576m049m781j365
9487C6523J583o085q66q09m95k855J1251J2861o141j2812P562q65j1781j6220
9473A0851j312K152P905J3388M302n146j2429l236K194R55J857k06j154L390J649
9458B5160o708M827n55J635O61L353J4460n75l914P152M702j1727r238K782p311
9443B4704j105k039n83l807l488J1263L855J747q948j844O682L159l504J827n960
$$ plain form
9545 38741 36493 32555 26401 26763 34475 30985 29314 24697 26137 30396 23154 23873 29826 39912 36545
9530 36545 31862 31209 33999 42629 37167 27744 26830 21532 24574 25132 21818 29113 31731 25725 26184 35155
9514 35155 36934 35535 32508 33133 26699 27124 35369 38678 48936 53152 67221 87468 116501 183778
9500 183778 244302 260631 212346 151364 106584 80377 61056 49815 50294 46718 42669 37888 36523
9487 36523 38106 32021 31155 30346 29851 26996 38247 51108 44967 32155 39717 38852 27071 10851
9473 10851 9539 11691 19596 32984 37286 32140 19711 16475 18669 19624 21481 21275 20121 23511 25160
9458 25160 18452 23279 22724 24359 25020 28373 42833 42258 38344 45496 50198 38471 29233 32015 24704
9443 24704 23599 21560 20977 17170 13682 24945 28800 30547 21599 19755 26437 29596 26092 27919 21959
9428B1959R21O15m282p352N262R576p80O051O775l936o500K851n523j5707n413
9413D517K427L805N323J1171K649n895j1217M198L789k719O535J306j994L444
9399B7339K762K059J092J159l808k654l329N101k002R837R813l004l553O210P726
9384E4748l266j1745M79l29m81J003m294l187P203r09p276K470J9j455k069J912
9368C2823N843N684L526o145Q79L74m184L850M656P301O915r29J356P765n63p171
9352F1980o518o821l146P781K178J5198J557j0768K022j0526r324j1945K695O421
9338D0784N140J278j141M462l795J731J800P304p048p648j580n501j181K534M424
9323D1563l226k624R498P016N201o921M069P915n572k745L226j261M009o697r441
$$ plain form
9428 21959 22880 23495 19213 11861 17123 26699 25919 31970 38745 34809 28309 31160 25637 9930 4517
9413 4517 6944 10749 16072 27243 29892 23997 12780 16978 20767 18048 24583 25889 23895 27339
9399 27339 30101 32160 33252 34411 30603 27949 24620 29721 27719 37556 47369 44365 40812 47022 54748
9384 54748 51482 39737 40216 39887 39406 40409 36115 32928 40131 39222 31946 34416 34435 32980 30911 32823
9368 32823 38666 44350 47876 41731 42610 42984 38800 42650 47306 54607 61522 60593 61949 69714 69151 61980
9352 61980 55462 48641 45495 53276 55454 70652 72209 61441 63463 52937 43613 31668 34363 40784
9338 40784 45924 47202 46061 50523 46728 48459 50259 57563 50515 42867 41287 35786 34605 37139 41563
9323 41563 38337 35713 45211 52227 57428 50507 54576 62491 56919 54174 57400 56139 60148 53451 44010
9308D4010o98m09M663J0777Q415n970K39n9O701O705J0339M162M213j015o547
9293H5526r786j1112K617j983o234P158k393k846j181m432m056O749j116O288
9279F3199O505K231J4947K705o137j807k247L818N190p650r227k551L117R5R407
9264H1595P087J7410n654p91K942J6522O411Q566K944R21o463p248K460%k685
9249A24017J707L39p021n553j0553K863J0609L015M518j087k891r982o800M48
9235A03629J595L892k1r0P44k064N94k946K851q611n787n977K679J2125o823J954
9219I7744J9844k401l010N648M817q723k263J3463m177p113J061m589j0066R579
9205A09814N00M974M756j0389R200Q441r31n988L048P10L7o793J907P997K05j107
$$ plain form
9308 44010 43312 42903 47566 58343 66758 60788 61027 60968 67669 74374 84713 88875 93088 92073 85526
9293 85526 75740 64628 67245 65262 59028 66186 63793 60947 59766 55334 51278 58027 56911 63199
9279 63199 69704 71935 86882 89587 83450 81643 79396 83214 88404 80754 71527 68976 72093 72188 81595
9264 81595 88682 106092 100438 99647 102589 119111 125522 134088 137032 137953 131490 124242 126702 126702 124017
9249 124017 125724 126063 119042 113489 102936 105799 116408 119423 123941 122854 119963 109981 103181 103629
9235 103629 105224 109116 109095 109005 109749 107685 108279 105333 108184 99573 93786 87809 90488 102613 95790 97744
9219 97744 117588 115187 112177 117825 122642 113919 111656 125119 120942 113829 114890 110301 100235 109814
9205 109814 110314 115288 120044 109655 118855 127296 126365 120377 123425 124135 124172 117379 119286 127283 127488 126381
9189A26381k320q398L237M27j1053R831J2199L083J159J353J243l611N323J0866
9175A49720P681R327n510n51L517N770L343m571l10L219l379M292N336L244J0726
9160A91854Q083o92K462j226O709P538P210O855J0063M502j387q681O334M959
9146B44583j563q21J1161J6327L960N383K697R046R444J2150O903Q358O307N25
9132C34460q89K705J0871K313J2176Q193k199O450k259L83Q588j085r064l329
9118C67314k648j214J1633L870Q801J2190O014q136l112P781J314P797J5868J3283
9104D40755O572J1502P591O627M107O580J5329J2927J1280L712J1582K0782J7728
9091E77074P354M051J7022J7598J1056J4043J9763J2094J3002L3495L2165K2280
$$ plain form
9189 126381 124061 115663 118900 119327 108274 118105 130304 133387 134546 135899 137142 133531 138854 149720
9175 149720 157401 166728 161218 160667 164184 169954 173297 168726 168416 171635 168256 172548 177884 181128 191854
9160 191854 199937 199245 201707 200481 207190 214728 221938 228793 238856 243358 241971 233290 239624 244583
9146 244583 243020 242199 253360 269687 273647 279030 281727 290773 300217 312367 319270 327628 333935 334460
9132 334460 333571 336276 347147 349460 361636 369829 367630 374080 371821 372204 380792 379707 370643 367314
9118 367314 364666 363452 375085 378955 387756 399946 405960 397824 394712 402493 403807 411604 427472 440755
9104 440755 447327 458829 466420 473047 477154 483734 499063 511990 523270 526982 538564 559346 577074
9091 577074 584428 588479 605501 623099 634155 648198 667961 680055 693057 726552 758717 780997
9079G80997N848R638K6784K9775R615J7316K7313J6023K4576K7420L5857K7535
9067A038697K7067L1456M6621L8848L5731L6755L5348L7737M6958M6438N1481
9056A473137N8751N5020N4012O3114O1933P1579P6493P2212Q3814Q6781R4047
9045B250893J09669J10728J16451J16377J29591J41587J57736J70066J83603J94008
9035C680709K03090K34697K50604K72953K89273L18077L58413L86105M31042M81400
9025F906363N32602N92568O57447P26498Q22005R05596J027739J168999J329421
9016A4669238J508168J725944J974184K255309K558829K891774L257036L592741
9008C4433223L879410M076560M094196L841940L261994K364961J184106j50853
$$ plain form
9079 780997 786845 796483 823267 853042 862657 879973 907286 923309 947885 975305 1011162 1038697
9067 1038697 1065764 1097220 1143841 1182689 1218420 1255175 1290523 1328260 1375218 1421656 1473137
9056 1473137 1531888 1586908 1640920 1704034 1765967 1837546 1914039 1986251 2070065 2156846 2250893
9045 2250893 2360562 2471290 2587741 2704118 2833709 2975296 3133032 3303098 3486701 3680709
9035 3680709 3883799 4118496 4369100 4642053 4931326 5249403 5607816 5993921 6424963 6906363
9025 6906363 7438965 8031533 8688980 9415478 10237483 11143079 12170818 13339817 14669238
9016 14669238 16177406 17903350 19877534 22132843 24691672 27583446 30840482 34433223
9008 34433223 38312633 42389193 46483389 50325329 53587323 55952284 57136390 56985537
9000E6985537j453997k560258l352373l822551l996111l941780l751673l463137
8992C0643657l132199k803663k497860k215375j943480j708308j505640j328015
8984A3509117j178588j037031r21815q18700p28764o43031n82646n25740m74706
8975F598096m36124l97238l57804l24018l00519k74276k42882k24631k12218j96191
8965C632195j72729j65321j57227j46674j34169j28404j17619j14194j12345j03898
8955B279615q7777q0002p4504r1807p0144o6038o7902n4025n6107n5539n2252
8944A523518n3006m0162n3717n4387l9756m3479m3642l3725l4387k5783l0692
8933A070782l0948k5741k2270j8861l0391l6188k5949k2255k4487k2091j4775
$$ plain form
9000 56985537 55531540 52971282 49618909 45796358 41800247 37858467 34106794 30643657
8992 30643657 27511458 24707795 22209935 19994560 18051080 16342772 14837132 13509117
8984 13509117 12330529 11293498 10371683 9552983 8824219 8181188 7598542 7072802 6598096
8975 6598096 6161972 5764734 5406930 5082912 4782393 4508117 4265235 4040604 3828386 3632195
8965 3632195 3459466 3294145 3136918 2990244 2856075 2727671 2610052 2495858 2383513 2279615
8955 2279615 2191838 2111836 2037332 1945525 1875381 1809343 1741441 1687416 1631309 1575770 1523518
8944 1523518 1470512 1430350 1376633 1322246 1282490 1239011 1195369 1161644 1127257 1101474 1070782
8933 1070782 1039834 1014093 991823 972962 942571 906383 880434 858179 833692 811601 796826
8922G96826j6338j9573j2060j6780r998o665j5056j5914k0327k1357j9265o820
8910F16673p161j1926j3954q890p768q829q501j1231q938n907m032k470j2453
8897E04613j3698j7286r200l273m77p504j5614m088Q401r995j2877N634j593n955
8883D17088l433l649j3604j1334%J2527J0953J0395K993o029q167j3327j1636
8870C82777r9j0872j3589m971J1086J7191o675j7413j9016j7103j5543j950l472
8857C00351n800p383j2470m282o352r028K911J4229L344n40j894o561j1684q195
8843B46646m57J510m506j1397o153L652p452o272R169J603n445j0626K716m22
8829B12566l389j22j770n307p670Q773O542j037o156l990k508J4903Q893o254
$$ plain form
8922 796826 780488 760915 748855 732075 722077 715412 700356 684442 664115 642758 623493 616673
8910 616673 609512 597586 583632 574742 566974 558145 549644 538413 529475 523568 519536 517066 504613
8897 504613 490915 473629 464429 461156 460679 453175 437561 433473 441874 431879 419002 424636 423043 417088
8883 417088 413655 410006 396402 385068 385068 397595 408548 418943 421936 415907 407740 394413 382777
8870 382777 382678 371806 358217 353246 364332 381523 374848 357435 338419 321316 305773 303823 300351
8857 300351 294551 287168 274698 270416 264064 255036 257947 272176 275520 274980 273086 266525 254841 246646
8843 246646 246189 247699 243193 231796 225643 229295 221843 215571 224740 226343 220898 210272 212988 212566
8829 212566 209177 209055 207285 201978 194308 203081 209623 208586 202430 198440 195932 210835 219728 213474
8815B13474j0248p733q191j1551j2609q512N773k388o845J0073p80k99O73j9P413
8800A68231j0166o633q593J766K312k399j653K292K881q442o519j103n685o795
8786A19494R60O771J117l956n532q212K750K992O059l265o344p896n036K248L93
8771A02543J201Q780N30l042o149q651r101j15R520J0917p71N737o634j1563J315
8756I4517J0391P804L121k960m753j1445o261j616J189n678K989J777J2996n99
8742A01472J358J364K208l119K552k319r702j879J381K826m964j771m38l582n28
8727H4859L652p985j957J287J797m827N02m151k381j556P737J0816q224l999k911
8712G2659J1145J77j593Q119p773r765k45J467M307O97J266O519O433r82N030
$$ plain form
8815 213474 203226 195493 187302 175751 163142 154630 160403 158015 151170 161243 160463 160164 160837 160818 168231
8800 168231 158065 151432 142839 144605 146917 144518 142865 145157 148038 139596 133077 131974 126289 119494
8786 119494 120454 127225 128342 124386 118854 110642 113392 116384 122443 119178 112834 104938 99902 102150 102543
8771 102543 103744 112524 113054 110012 103863 95212 86111 85996 95516 106433 105662 111399 104765 93202 94517
8756 94517 104908 112712 115833 112873 108120 96675 90414 88798 89987 84309 87298 89075 102071 101472
8742 101472 102830 104194 106402 103283 105835 103516 93814 91935 93316 96142 91178 89407 88969 85387 84859
8727 84859 88511 80526 78569 79856 81653 76826 77328 73177 70796 69240 76977 87793 79569 75570 72659
8712 72659 83804 83981 82388 90507 82734 72969 72724 74191 78498 79195 80461 86980 93413 92431 97461
8697I7461L650O58n520j6238m328P07O946N896L090n425j1119o850p65J274L29
8682F9766k562n577L562j960Q193M344j150L690J447p237N287L535l945p130l504
8667F6759k099k14J703N501j643j279r598J15J0068L5L334P045m919j0119m727
8652E9962L689L540O409k37N677N784O50J616J31o425q296q465L125M585q257
8637F3488l169l67M049q890m677Q479L933K766l530M314O584J161m971K499k081
8622F9588j327n977j220K967M509j682P712O818n585o929J0054m991j5420p937
8608E0580l110l763J303J2070P569J3504k36j856L663M229N317L224m78r257n617
8593G7142M119N923p285m641J2635o99n925O034K214j854J5687J3548j140N653
$$ plain form
8697 97461 101111 101769 96249 80011 75683 76390 83336 89232 92322 86897 75778 68928 68163 69437 69766
8682 69766 67204 61627 65189 63229 71422 75766 74616 78306 79753 72516 77803 81338 77393 70263 66759
8667 66759 64660 64446 66149 71650 70007 68728 59130 59245 69313 69348 72682 79727 74808 64689 59962
8652 59962 63651 67191 73600 73363 79040 84824 85474 87090 87221 80796 72500 64035 67160 71745 63488
8637 63488 60319 59952 64001 55111 50434 58913 62846 65612 62082 66396 72980 74141 69170 71669 69588
8622 69588 68261 62284 61064 64031 68540 66858 74570 81388 75803 68874 78928 73937 58517 50580
8608 50580 47470 43707 45010 57080 64649 78153 77917 76061 79724 83953 89270 92494 92016 82759 77142
8593 77142 81261 87184 79899 75258 87893 87194 81269 87303 89517 87663 103350 116898 115758 121411
8579A21411R221J1894J3778L76R018J6737R279K145P829J6318K200j8173j9191
8566A82842j5203k2199k6757m996j170p331J184J049j0094j0051L783k259q124
8553H0674j741q845r78p129n879L730J288k628K947O457P804j421j263n604n233
8538F2179n218l296j997p661L694k413p572R620J62q225k003K391J0280k792l835
8523D3314Q005p064n692M828J5174M098p552l792m029L879Q793q738P6n03m384
8508D6413n624L86m165o908J194N266j566J04J213K08Q60O627j435n449m726K334
8492C4732q079m93N006J1702k042q742o341Q271o455j0244j999n39M45J154L442
8477A9818R08N56O005o705o42O765M024m625J698P143o310J049l030j1579J0865
$$ plain form
8579 121411 130632 142526 156304 156680 165698 182435 191714 193859 201688 218006 220206 202033 182842
8566 182842 167639 145440 118683 113687 112517 105186 106370 107419 97325 87274 91057 88798 80674
8553 80674 78933 70088 69110 61981 56102 59832 61120 58492 61439 67896 75700 74279 73016 67412 62179
8538 62179 56961 53665 51668 44007 47701 45288 37716 47336 47498 39273 37270 39661 49941 47149 43314
8523 43314 51319 44255 38563 43391 58565 62663 55111 51319 47290 51169 59962 51224 51300 50797 46413
8508 46413 40789 41175 37010 30102 31296 36562 34996 35100 36313 36521 37381 44008 42573 37124 32398 34732
8492 34732 26653 26160 31166 42868 40826 32084 25743 34014 27559 17315 15316 14777 15222 16376 19818
8477 19818 20726 21282 27287 20582 19940 26705 30729 26104 27802 34945 28635 29684 26654 15075 25940
8462B5940J788j4142r216Q771J0875M796J636j918M91L394m271m928k230O188
8448B7174O123n363L502j6301n619k29J3128J6643m054l447J94K064l366k931
8434B7518K870j583J84m157L39K709l538J416o457P023N407L140M45o888l662
8419B4766r124K835R217k139O020K29r321Q700Q27j0268m965J5849Q728k915m511
8404C3928k196j92k72j3512n922J740Q432K081J4947j476m692q439l256q28Q58
8389B1201M25K728O834K3J614j754j36m225M996N495m295j4134n126L70Q483Q310
8373C0809N171n201j09R787j3460j6724m263l369l645J3335J0045L07k95m689
8359A7699j534J0377K689K122n65L54M934l737r407q644n581K267J0693K035l011
$$ plain form
8462 25940 27728 13586 4370 13141 24016 28812 30448 28530 29021 32415 28144 23216 20986 27174
8448 27174 33297 27934 31436 15135 9516 9287 22415 39058 35004 31557 31751 33815 30449 27518
8434 27518 30388 28805 28989 24832 25171 27880 24342 25758 19301 26324 31731 34871 35316 28428 24766
8419 24766 15642 18477 27694 25555 31575 31804 22483 31183 32010 21742 16777 32626 41354 38439 33928
8404 33928 31732 31540 31268 17756 11834 13574 22006 24087 39034 37558 32866 24427 21171 20343 21201
8389 21201 21626 24354 31188 31211 32825 31071 30935 26710 31706 37201 32906 18772 13646 14016 22499 30809
8373 30809 35980 30779 30670 40457 26997 10273 6010 2641 -1004 12331 22376 22683 22388 17699
8359 17699 16165 26542 29231 31353 30788 31142 36076 32339 22932 14288 8707 10974 21667 23702 20691
8344B0691k113M471L565p938l70J1504O545j1085n737n416n571M080N016K793
8330B0435q71M672K83j017n326j756k44l258j780n866j678l597P969J9464J1024
8315C8454N05j5727j2692r155N408N130k687Q505j473M477n96l535K1L270K835
8300B2740K778O58m814j9985j3796J5O164J2444P857J382K882q572k891j632K596
8285G826L504L200q586l480L243M713Q058R678j254q749n834m954j363Q263R121
8270B3386p978o40m389l684P86P316L244j2166O54J4214O387L329J493j1156q979
8255A1817j752K099M993k987m571o184K008J2588o491j7325n978N498N609R766
8241I090M780j28k848M677Q169r773q883R284L230o625N81J1848Q818m483r985
$$ plain form
8344 20691 18578 23049 26614 18676 18306 29810 36355 25270 19533 14117 8546 12626 17642 20435
8330 20435 19564 24236 24519 23502 18176 16420 16176 12918 11138 5272 3594 -3 7966 27430 38454
8315 38454 38959 23232 10540 1385 6793 11923 9236 17741 16268 20745 20149 16614 16635 19905 22740
8300 22740 25518 26176 21362 1377 -12419 -12404 -6240 6204 14061 15443 18325 9753 6862 5230 7826
8285 7826 11330 14530 5944 2464 5707 10420 18478 28156 26902 18153 12319 7365 6002 14265 23386
8270 23386 15408 14768 10379 6695 7481 14797 18041 5875 6529 20743 27130 30459 31952 20796 11817
8255 11817 10065 12164 17157 14170 9599 3415 5423 18011 11520 -5805 -11783 -6285 -676 9090
8241 9090 13870 13742 10894 15571 23740 13967 5084 14368 17598 10973 11554 23402 32220 27737 17752
8226A7752j2368Q68Q788r987p513k173O915R672K102P335O217Q10l14q518q099
8211A1487L885P335M122p358l666p529q35j75L173j07q592o35J3703n346p012
8196B450n64J026r95k981M518k50l397j398o58J3706P228k431Q810P462r08r343
8180B2275j172l202l824l522j801o420j994N103Q67L808N207k445l67J1020k493
8165B1040p676l64K600k09m957l728l870j937m36j549O278P837K933n207K380
8150A3135L257M739J0674M89k237L852L57R271N548n047j6957n096K284r032p448
8135G789M287j846P777p231n242M378N65l466P685o523M347K195l156l694k052
8120E813N317J302m591j1373n092J2829J3539m913o643OJ273K672J2446K685r91
$$ plain form
8226 17752 5384 6252 15040 5053 -2460 -4633 2282 11954 14056 21391 27608 28418 28104 19586 11487
8211 11487 15372 22707 26829 19471 15805 8276 7441 7266 10439 10332 1740 1105 14808 9462 2450
8196 2450 1886 2912 1917 -1064 3454 3204 -193 -1591 -2249 11457 18685 16254 25064 32526 31618 22275
8180 22275 21103 17901 14077 10555 8754 2334 340 5443 6310 10118 15325 12880 12513 23533 21040
8165 21040 13364 13000 15600 15391 10434 6706 2836 899 463 -1086 5192 13029 15962 10755 13135
8150 13135 16392 21131 31805 32294 30057 33909 34266 43537 49085 44038 27081 21985 24269 15237 7789
8135 7789 12076 10230 18007 10776 5534 9912 10477 7011 14696 8173 12520 14715 11559 7865 5813
8120 5813 11130 12432 7841 -3532 -8624 4205 17744 12831 6188 6194 7467 10139 22585 25270 24279
8105B4279O26o876p75P618n035k438r164r590M615J1549O350j451j977n81P357
8090B4507K429l57n599o236L526Q056o568j4110n024r15J1799N584n18j1953%
8075D621P80l695j4895m510K0266L384j882q741p493P329J1997k171k343l91O301
8060H557J906M452m155l028L624J762l364j4M897R272n924k508P394J302m987
8045A9186L523J1175o540l912j81O490N831p117n916L203q675j2698M288M097
8031A2754P287M9l612j0711j0064M69L416l362N486R668N583K835k637n965n062
8016F134j171M561O368o953m75O076L54n29n053N005K618P744k049l554K206k401
8000A8881j352l76P956j710l174K727K570N64J179P167m31L530K196j609l236
$$ plain form
8105 24279 24905 18029 17254 24872 19837 17399 8235 -1355 3260 14809 21159 19708 17731 17150 24507
8090 24507 26936 26579 20980 14744 18270 26326 19758 5648 624 -291 11508 17092 16574 4621 4621
8075 4621 5401 1706 -13189 -17699 2567 5951 4069 -4672 -12165 -4836 7161 4990 2647 2256 8557
8060 8557 10463 14915 10760 7732 11356 13118 9754 9740 14637 23909 17985 15477 22871 24173 19186
8045 19186 22709 33884 27344 23432 23251 29741 35572 28455 22539 25742 17067 4369 8657 12754
8031 12754 20041 20090 16478 5767 -4297 -3828 -412 -3774 1712 11380 16963 19798 17161 11196 6134
8016 6134 4963 9524 15892 8939 8464 14540 14894 14365 9312 14317 16935 24679 22630 19076 21282 18881
8000 18881 17529 17153 25109 23399 20225 22952 25522 26086 27265 34432 34001 37531 39727 38118 34882
7985C4882N23j3444n454J2094R777R214q37m650p98L467L142J080l391q519J486
7970C8572l510j0074L434J1624R18m783m99M671L381j618k927k170K315r629n126
7955B4579M236m226j2885N862Q530o27O269N996n18m176N668j56o921k962J097
7940B9766L598N756J362m024L847N161L794j450m55k350O49q392J27N011n194
7925C7206n965m033n481L403l803R980Q474o58o041p532J24K064j789M221J190
7910C1360q234n413q758K710n358J350L418p749L093Q873N385N751L852Q684r266
7895B9698l512k46m75r813N893J0562r67N788m645k334K334N972l427k268j1213
7880B1347n061J190m70k333P267O578o14J054m04p142R647o081o122L32m613m033
$$ plain form
7985 34882 35405 21961 16507 28601 38378 47592 46755 42105 41307 44774 47916 48996 45605 37086 38572
7970 38572 35062 24988 28422 40046 40964 36181 35682 40353 43734 42116 39189 37019 39334 29705 24579
7955 24579 28815 24589 11704 17566 26096 25469 31738 37734 37216 33040 38708 38552 31631 28669 29766
7940 29766 33364 39120 40482 36458 40305 45466 49260 47810 47355 45005 45654 37262 37389 42400 37206
7925 37206 31241 27208 21727 25130 21327 31307 39781 39123 33082 25550 25674 27738 25949 30170 31360
7910 31360 23126 17713 8955 11665 6307 7657 11075 3326 6419 15292 20677 26428 30280 38964 29698
7895 29698 26186 25940 25465 15652 21545 32107 31140 36928 32283 29949 32283 38255 34828 32560 21347
7880 21347 16286 17476 17006 14673 21940 28518 27904 28958 28554 21412 31059 24978 18856 19188 14575 10542
7864A0542q92m855k975L969J4751J368M225m611K551J2795K880r993r265j3394
7850G096p203Q327J0285j680m876q581R57P858N647Q176m753o455r558J417K433
7835I090o45J250O72M865k189M652o286n752K259p958l158M96L526k441O409J31
7819D921K242j55P3K811N31M433M323m444p34n269l944K840l457L860j206J388
7803H213J3256o32p579m243l358M747R743l546m45k976l98j957q614J694l64L687
7787G228k415j712j746O12m435k153n485k826P070J2816P992K243k534q604R329
7772A5380q584r162q174R410M63K887j46Q85M41m230r335L167J538L924J021O629
7756F114M288L242P34j1178p086J477l436n709Q604P336q291l341K1450K109J358
$$ plain form
7864 10542 9650 4795 1820 5789 20540 21908 26133 21522 24073 36868 39748 29755 20490 7096
7850 7096 -107 8220 18505 16825 11949 3368 4325 12183 17830 26006 21253 14798 5240 6657 9090
7835 9090 8445 9695 10367 15232 13043 17695 11409 5657 7916 -42 -3200 -2704 822 -1619 4790 4921
7819 4921 7163 7008 7081 9892 10423 14856 19179 14735 14001 8732 4788 7628 4171 8031 6825 8213
7803 8213 21469 20837 13258 9015 5657 10404 20147 16601 16156 13180 12782 10825 2211 3905 3541 7228
7787 7228 4813 3101 1355 1967 -2468 -4621 -10106 -12932 -5862 6954 14946 17189 14655 6051 15380
7772 15380 6796 -2366 -10540 -1130 -667 2220 2074 2959 3400 -830 -10165 -6998 -5460 -1536 -515 6114
7756 6114 10402 13644 14378 3200 -3886 -2409 -5845 -11554 -2950 4386 -3905 -7246 14204 16313 17671
7741A7671n336j2251n600n866P356N800J963p560O023j509o929O363M151n562
7727a286L404M472K017k311J9p016K476N072Q989N558k474r658o883K166L155
7712G700m26p11K888M947K591m423q418L356O663q411p359K046J471N038l062
7697C890J0589J150j454k53L535j74n246J269n561j737j260L675r167n94O137
7682D799k349N094r053N186J774L876m051p842K979o349o677m77L701L929J727
7667c733k794o713R681J9615o28j578o531p562l287K62P850J0137o332j3424P186
7652B149P887o508n163O890L467m087k227J580m632j3855N361Q444q541k542J0163
7637a614O551o082J030p947m226Q935J478R42m988q921J382J0796N447q431L00
$$ plain form
7741 17671 12335 84 -5516 -11382 -4026 1774 3737 -3823 2200 691 -6238 125 4276 -1286
7727 -1286 2118 6590 8607 6296 6315 -701 1775 6847 15836 21394 18920 9262 2379 4545 7700
7712 7700 7274 6563 9451 14398 16989 12566 4148 7504 14167 5756 -1603 443 1914 6952 3890
7697 3890 14479 15629 14175 13922 17457 17283 12037 13306 7745 6008 4748 8423 -744 -1338 4799
7682 4799 2450 7544 -1509 3677 5451 9327 5276 -2566 413 -5936 -12613 -13090 -9389 -5460 -3733
7667 -3733 -6527 -13240 -3559 16056 15428 13850 7319 -243 -3530 -3268 4582 14719 8387 -5037 2149
7652 2149 10036 3528 -1635 5255 8722 4635 2408 3988 -644 -14499 -9138 -694 -9235 -11777 -1614
7637 -1614 4937 -1145 -115 -8062 -12288 -3353 -1875 -933 -5921 -14842 -13460 -2664 2783 -5648 -5348
7622e348R378N393o023q288k706Q876o06k105m373l9R10L935j174O805m778q480
7606h623J2364k740N018L100m474m158K478k713l804K024j827o377k265K923o602
7591a5676K376N417l489l224n327M973Q409R139O876J934J745o781l970j382j2687
7576a1667O678J3523Q843P497j5712o986K756j093j709j430m882O531M126n853
7562F22j0132K891K352J1459L585k70n44q859r198n599N253J0132N460O405o804
7547F753P92R30m486r827Q170m134j989K294M46l719L359R469J16q226j4518P23
7531a3847Q180M727r520k860M730R171J0825j2805p634K337K324k419p504P115
7517g180O692L724Q162K023q595K139L54o809m340k842M206j718l548J0927L551
$$ plain form
7622 -5348 4030 9423 3400 -4888 -7594 1282 676 -1429 -5802 -5841 -4931 -996 -2170 4635 -143 -8623
7606 -8623 3741 1001 6019 9119 4645 487 2965 252 -3552 -1528 -3355 -9732 -11997 -9074 -15676
7591 -15676 -13300 -7883 -11372 -14596 -19923 -14950 -6541 2598 9474 11408 13153 6372 2402 1020 -11667
7576 -11667 -4989 8534 17377 24874 9162 2176 4932 3839 2130 700 -4182 2349 6475 622
7562 622 -9510 -6619 -4267 7192 10777 10507 9963 1104 -8094 -13693 -8440 1692 7152 13557 6753
7547 6753 7545 8475 3989 -5838 2332 -1802 -3791 -1497 -1051 -4770 -1411 8058 8174 -52 -14570 -13847
7531 -13847 -5667 -940 -10460 -13320 -8590 581 11406 -1399 -9033 -6696 -4372 -6791 -14295 -7180
7517 -7180 -488 3236 11398 13421 4826 6965 7319 510 -3830 -6672 -2466 -4184 -7732 3195 6746
7502F746l066m284O609m813J1938l672j843L473o307l515k227J4996l19q405q55
7487D456N912L969j2868j1537O836O472p067l800k236m83L508J0227k687k448
7473a746k190M791J577P33J526M035J967l073q175r672m577J539M979l26k383
7458a0995Q194J2367j562j481n275p275k529Q913J3481J311l659j4567m465N175
7444b367K788j707O780K367r040p58R072j27k635L779J887N20n365k0866o092
7429b1764N901L216K915l10k51l45O906P827L311j281K684n126q835j0857k866
7414a8875m14J3926O529n238L296K088Q165o748j0198K69N736Q104M039p903J305
7399D081Q714m312r409o951m49J1697N405l241m595m58O415q229M518n75j689
$$ plain form
7502 6746 3680 -604 6005 1192 13130 9458 7615 11088 4781 1266 -961 14035 13716 5311 4456
7487 4456 10368 14337 1469 -10068 -3232 3240 -3827 -7627 -9863 -10346 -6838 3389 702 -1746
7473 -1746 -3936 855 2432 3165 4691 8726 10693 7620 -555 -10227 -14804 -13265 -8286 -8612 -10995
7458 -10995 -2801 9566 8004 6523 1248 -6027 -8556 357 13838 15149 11490 -3077 -7542 -2367
7444 -2367 421 -1286 5494 7861 -1179 -1937 7135 7008 4373 8152 10039 10559 5194 -15672 -21764
7429 -21764 -15863 -12647 -9732 -10042 -10293 -10638 -3732 4095 7406 6125 8809 3683 -5152 -16009 -18875
7414 -18875 -19289 -5363 1166 -4072 -776 1312 9477 2729 -7469 -7200 -1464 6640 10679 2776 4081
7399 4081 12795 8483 -926 -7877 -8326 3371 8776 5535 940 482 6897 -1332 3186 2611 922
7384I22J926p44k776R283J896M111j3010q480J381K192O972Q263M316l519q241
7369D492n540m992j104J0972M89l856m068O38j0441m62N217l834l491O665l209
7354a2524M625N968N385K760r51l340L438K264j3694l82Q41k153K661k396n160
7339a2658p69N197J3782J306m421q243j67K076Q346o715r516K437M484M990J607
7324A736l154L138O937j538l696p243o751P060Q194J0311P47n569R07k848o157
7309B074J510O984P10K819j4266q559L282k582o249n04Q733K407O447n319m379
7294f892j047O475M724j1330L91N575k12k17L372p663N493P719N512L601J282
7279A6783N116N26m250l337l803p502n242K637M498M530O492R502j2478j5187
$$ plain form
7384 922 2848 2104 -672 8611 10507 14618 1608 -6872 -5491 -3299 3673 11936 16252 12733 4492
7369 4492 -1048 -6040 -7144 3828 4317 461 -3607 -2969 -13410 -13872 -8655 -12489 -15980 -9315 -12524
7354 -12524 -7899 -1931 3454 6214 5263 1923 5361 7625 -6069 -6451 -5610 -7763 -5102 -7498 -12658
7339 -12658 -13427 -8230 5552 6858 2437 -5806 -5973 -3897 4449 -2266 -11782 -9345 -4861 129 1736
7324 1736 -1418 1720 8657 7119 3423 -3820 -10571 -3511 4683 14994 15741 10172 11079 8231 2074
7309 2074 3584 10568 11278 14097 -169 -8728 -5446 -8028 -14277 -14781 -6048 -3641 2806 -2513 -6892
7294 -6892 -7939 -1464 3260 -8070 -7679 -2104 -2316 -2533 839 -6824 -1331 6388 11900 15501 16783
7279 16783 21899 22425 18175 14838 11035 3533 -1709 928 5426 9956 16448 25950 13472 -1715
7265a715l60M426J2986j911p747l208j298L12n759p146j913L502J4078O823j2024
7250i54j3285P41M680J167L130k351J305n831o549m280J3177Q433o525l57K426
7235e073L394j80P35k903J895O144Q629k143j0785k730n996Q854q38q931k141
7220a2069l5L510M397J0301L616m710k923m684P355J796n340k318M575L360Q09
7205G640l637k181l225r22k53k931P215M195m184m345j176j545r221l864K729
7190a5705J1670J3962J849m143m389j163m954j49m172L204O11r826O377L638o0
7175c250P888Q540j2185m116k290r84R769O619J1706M179j5766m958Q048j214
7161A1986k276q421k986O918q343m562J392R270j003n819n746K578K448R074K299
$$ plain form
7265 -1715 -2075 2351 15337 13426 5679 2471 1173 1485 -4274 -11420 -13333 -9831 4247 11070 -954
7250 -954 -14239 -13498 -8818 -7651 -4521 -6872 -5567 -11398 -17947 -22227 -9050 -617 -7142 -7499 -5073
7235 -5073 -1679 -1859 -1124 -4027 -2132 4012 12641 10498 -287 -3017 -9013 -159 -997 -9928 -12069
7220 -12069 -12104 -8594 -4197 6104 9720 5010 2087 -2597 4758 6554 1214 -1104 3471 6831 7640
7205 7640 4003 1822 -1403 -2325 -2578 -5509 1706 5901 1717 -2628 -3804 -5349 -14570 -18434 -15705
7190 -15705 -4035 9927 11776 7633 3244 2081 -2873 -3022 -7194 -3990 -3379 -13205 -6828 -3190 -3250
7175 -3250 4638 13178 993 -3123 -5413 -6397 3372 9991 21697 25876 10110 5152 13200 11986
7161 11986 9710 1289 -1697 5221 -3122 -7684 -6292 2978 1975 -3844 -9590 -7012 -4564 4510 6809
7146F809K914n47j6356o070p506K62K535M872j86J626P378N339O581O019j2877
7131G93r036%M771j2j135L668L701m780j828l281l011J0732N594p376p835J268
7115g767J3599L094j3579q491j753l676M281Q179k477p037n082n30Q734L746J921
7100f838K313L86l909n411M02L770O041N337J30K427J815q272o928k548L481o10
7084h414n040p057K839N174K657n131j1197P055J6137P802j37n469n124N393J561
7069A049J514k596r940o963K714K179p10J2683O598n305j169k104J339K47J923
7054A459k797o226l319P430o113o060M697M685K784P778K899j6635n950r2K117
7039a3343N884L711L294O596q78L487M274k753q731n032N936j0957p626M099N090
$$ plain form
7146 6809 9723 9176 -7180 -13250 -20756 -20494 -17959 -13087 -13273 -11647 -4269 1070 7651 13670 793
7131 793 -8243 -8243 -3472 -3484 -4619 -951 2750 -2030 -3858 -7139 -10150 582 6176 -1200 -9035 -7767
7115 -7767 5832 8926 -4653 -13144 -14897 -18573 -14292 -6113 -8590 -15627 -20709 -21239 -12505 -8759 -6838
7100 -6838 -4525 -4139 -8048 -13459 -13057 -9287 -3246 2091 2221 4648 6463 -1809 -8737 -11285 -7804 -8414
7084 -8414 -13454 -20511 -17672 -12498 -9841 -14972 -26169 -19114 -2977 4825 4688 -781 -5905 -512 1049
7069 1049 2563 -33 -9973 -16936 -14222 -12043 -12753 -70 6528 1223 54 -2050 -711 -464 1459
7054 1459 -1338 -7564 -10883 -3453 -9566 -15626 -10929 -6244 -3460 4318 7217 -9418 -15368 -15460 -13343
7039 -13343 -7459 -3748 -454 6142 5264 8751 13025 10272 1541 -3491 2445 -8512 -16138 -12039 -6949
7024f949K339j361o809J0378K475L237Q605j1904l666j580J856k282K119m38j2895
7009a6875N411N996M50P248J3815R272m645j4514k078K403l505o511n233k79L421
6994e624O332L385L693M544J143l229j4337j915L36r44L513l438K13o469J0324
6979b473O494J476o840k303j2N54j577k353N898n761l685n411J117J2379J480
6964a017k399j949k919J5974M812o907j987l52J419k189J21k090n800n80L486
6949b377M089l246n737J102k434P37m343j1062o35J3123J3875J038l430Q017N394
6934A4111j0157m039l179m333n785l570j381N127r385j670P761P824K576k557
6920h657L301L377M026k676o401n71J997j161n124O314O764J717j123p210m016
$$ plain form
7024 -6949 -4610 -5971 -12780 -2402 73 3310 11915 11 -3655 -5235 -3379 -5661 -3542 -3980 -16875
7009 -16875 -11464 -5468 -5018 2230 16045 25317 20672 6158 4080 6483 2978 -3533 -8766 -9045 -5624
6994 -5624 708 4093 7786 12330 13473 10244 -4093 -6008 -5672 -6616 -3103 -6541 -6328 -12797 -2473
6979 -2473 4021 5497 -1343 -3646 -3658 -3104 -4681 -7034 -1136 -6897 -10582 -15993 -14876 -2497 -1017
6964 -1017 -3416 -5365 -8284 7690 12502 5595 3608 3256 4675 2486 2607 517 -5283 -5863 -2377
6949 -2377 1712 -1534 -7271 -6169 -8603 -7866 -12209 -23271 -23906 -10783 3092 4130 700 8717 14111
6934 14111 3954 -85 -3264 -7597 -13382 -16952 -18333 -13206 -22591 -24261 -16500 -8676 -6100 -8657
6920 -8657 -5356 -1979 2047 -629 -7030 -7601 -5604 -6765 -11889 -5575 1189 2906 1783 -5427 -9443
6905i443O864l375o823k136K560q35j974k444M317J0841N829l575n610k199R849
6890A846L334p068l613J0L511J889P4J729K552n17k596J132N050n145n539R971
6874F620L84j1904O05L845k14r153p290J876N133j966O197K154l25n659j898L742
6858g853J9725N931J539j0120n656r320o496l198J467L330l60j356K860j844O059
6843e292M770L061j502m007L164M332o89p712k399K71P585O591m260r273M264
6828a096R303Q11j0948m809R265J52k072M604J0711p683j5886n88M064L292o182
6813g062j509L612K470K479p93K44o7R12o490p704J211L02Q845R097J867R418
6797A6832n308J710J831o329n831q116j852J284k754o599Q319P171O376m318r349
$$ plain form
6905 -9443 -2579 -5954 -12777 -14913 -12353 -13188 -15162 -17606 -13289 -2448 3381 -194 -5804 -8003 1846
6890 1846 5180 -1888 -5501 -5491 -1980 -91 -17 1712 4264 3747 1151 2283 7333 2188 -3351 6620
6874 6620 7004 -4900 -4295 -450 -664 -9817 -17107 -15231 -10098 -12064 -5867 -3713 -4038 -9697 -11595 -7853
6858 -7853 11872 17803 19342 9222 3566 -5754 -12250 -15448 -13981 -10651 -11011 -12367 -9507 -11351 -5292
6843 -5292 -522 2539 1037 -2970 194 4526 3837 -3875 -6274 -6003 1582 8173 3913 -5360 -1096
6828 -1096 8207 9018 -1930 -6739 2526 2678 606 5210 15921 8238 -7648 -8236 -4172 -880 -7062
6813 -7062 -8571 -4959 -2489 -10 -803 -559 -626 286 -6204 -13908 -12697 -12395 -3550 5547 7414 16832
6797 16832 11524 13234 15065 8736 2905 -5211 -7063 -5779 -8533 -15132 -6813 358 6734 2416 -6933
6782f933m149K040o455P547J597k018j203M098K983J208q340k963R449j454J025
6767c568L187R99P910L24J479L733r343p696o048j5J3859J2276j695n248k028
6752H126q252l90M256l247j1694n162o22M179N213K72j161P052R258M790l150
6737I468m524m608O08J71J6448P377r658k145o170R26L923R923o527l349m881
6722F982l541l771N919o37L754P050J0682J2057J966p273o343J3890J5691l381
6708E3045L841K4011K7949M0294L8726J6665k6170m9781m2852k5975j5946m588
6696C9219j4572k556j053m771m437k453r51o029n132O210M707K615n485l611n900
6681d199l325J5372k564l678l439O691j618K419k216p95m418l778P979R869J938
$$ plain form
6782 -6933 -11082 -9042 -15497 -7950 -6353 -8371 -9574 -5476 -2493 -1285 -9625 -12588 -3139 -4593 -3568
6767 -3568 -381 618 8528 8852 10331 14064 4721 -2975 -9023 -9038 4821 17097 15402 10154 8126
6752 8126 -126 -516 3740 493 -11201 -16363 -16985 -12806 -7593 -7321 -8482 -1430 7828 12618 9468
6737 9468 4944 336 944 1115 17563 24940 15282 13137 6967 7893 11816 21739 15212 11863 6982
6722 6982 3441 -330 5589 4952 8706 15756 26438 38495 40461 33188 26845 40735 56426 53045
6708 53045 56886 80897 108846 149140 187866 204531 178361 128580 85728 59753 43807 39219
6696 39219 24647 22091 21038 16267 11830 9377 8426 2397 -2735 3475 8182 10797 5312 1701 -4199
6681 -4199 -7524 7848 5284 1606 -1833 4858 3240 5659 3443 2648 -1770 -5548 2431 12300 14238
6666A4238k076J1983K236k758q681q120M31N173j227k423q539O33K661L018o011
6651E38r60R236m108q978q64K224J018m5L893Q401O228n38p841j086J933r775
6635g24O880J3655N114l550l459r829L62n157l825L341o34j0643l378K868j677
6620a0656L660l823K814J749n376j4053Q945J2431Kp762K247K500q12N376k217
6605d975q622j59N435L666j4K333O651k766l581o675l810j934J986k138o123K444
6589a8282l6M02N462q431M400O597M254Q037k796L633m43J622J089k778l65n38
6573A827J46j483q870K320Q675m29M423l669o051j348j802o921K780m77P8jp163
6556a7965N902P014p14J3371K070q585q935O118L249j1464k299O309Q624Q643
$$ plain form
6666 14238 12162 24145 26381 23623 14942 6822 7253 12426 11199 8776 237 870 3531 6549 538
6651 538 -422 8814 4706 -4272 -5136 -2912 -1894 -1939 1954 10355 16583 16045 8204 7118 9051 -724
6635 -724 6156 19811 24925 21375 17916 8087 8449 3292 -533 2808 2174 -8469 -11847 -8979 -10656
6620 -10656 -6996 -10819 -8005 -6256 -11632 -25685 -16740 -4309 -4307 -12069 -9822 -7322 -8134 -2758 -4975
6605 -4975 -13597 -13756 -8321 -4655 -4669 -2336 4315 1549 -2032 -8707 -12517 -14451 -12465 -14603 -20726 -18282
6589 -18282 -18318 -17916 -12454 -20885 -16485 -9888 -5634 2403 -393 3240 2797 4419 5508 2730 2365 1827
6573 1827 1973 490 -8380 -6060 2615 2186 6609 2940 -3111 -4459 -6261 -13182 -10402 -10879 -10801 -10802 -17965
6556 -17965 -12063 -5049 -5763 7608 9678 1093 -7842 -1724 1525 -9939 -12238 -5929 2695 11338
6542A1338k565p139K18P754n440l948J380r213j210m231L779k17J0360J483l284
6527i35l599r004l2K937Q271k525j614J1796j895p445q932K011K466N406j0284
6512a3378N730k817j4939J498J0169J6439N34r239L746L816P237L625p209K67
6498E479K785P39o142m978n124j027P358P154K282o087p5m954k564N396R318L858
6482A3418k9p233o111l584n221K234K93l519O70M840J537m104l385j600M503J11
6466g180J452P029M556N177j479m040m612l644q50K244M349j7056l12J3187n67
6451a746m945p520J794n333j0158P560Q207M366Q80k178M300l00m301K107o871
6436a4138p164P317J2781M315K894L323l693j026n656r781Q211P988K015J251
$$ plain form
6542 11338 8773 1634 1852 9606 4166 218 1598 -7615 -8825 -13056 -9277 -9494 866 2349 -935
6527 -935 -4534 -13538 -13570 -10633 -2362 -4887 -6501 5295 3400 -4045 -12977 -10966 -8500 -3094 -13378
6512 -13378 -7648 -10465 -25404 -23906 -13737 2702 3236 -6003 -2257 1559 8796 12421 5212 5479
6498 5479 8264 9003 2861 -2117 -7241 -8268 -910 6244 8526 2439 2364 -2590 -5154 242 9560 13418
6482 13418 13389 6156 45 -3539 -8760 -6526 -6233 -9752 -9082 -4242 -2705 -6809 -10194 -11794 -7291 -7180
6466 -7180 -5728 1301 5857 11034 9555 5515 903 -2741 -3591 -1347 3002 -14054 -14366 -1179 -1746
6451 -1746 -6691 -14211 -12417 -17750 -27908 -20348 -12141 -7775 -6895 -9073 -4773 -5073 -9374 -7267 -14138
6436 -14138 -21302 -13985 -1204 3111 6005 9328 5635 4609 -1047 -10828 -2617 5371 7386 8637
6422H637n376m719n664j305p79j823j246k26P678P277P71l10m79l359j881k414
6406e218R032K399p99J832j0673p236p56m637r549j843P023Q394N990O553q156
6391g644j1238R148N974n59j212K390O048l301L989m211o011k649n67P210J973
6376f60J3430p105p896o253p67n122j541J4478P890m180o407j0552K053K561R519
6361e52j757n552k487K73p714n645J422P477J2621J968J060l887n698Q295l991
6346d167J208P790N182l329k920n661L351L018o416N702L717J174j034M257j725
6331A0147M955Q48J481m072r054L92j589k346m321l136N05r413k924O654n545
6316a7418K094Q083L100j0842K951J0357m18j175P925j765r010q190N961m565
$$ plain form
6422 8637 3261 -1458 -7122 -8427 -9206 -11029 -12275 -12501 -4823 2454 3225 2915 2436 -923 -2804 -5218
6406 -5218 3814 6213 5414 7246 -3427 -10663 -11419 -16056 -25605 -27448 -20425 -12031 -6041 512 -7644
6391 -7644 -18882 -9734 -3760 -4319 -5531 -3141 2907 -394 3595 -616 -6627 -9276 -9843 -2633 -660
6376 -660 12770 5665 -2231 -8484 -9251 -14373 -15914 -1436 6454 2274 -4133 -14685 -12632 -10071 -552
6361 -552 -2309 -7861 -10348 -10075 -17789 -23434 -22012 -14535 -1914 54 1114 -2773 -8471 -176 -4167
6346 -4167 -2959 4831 10013 6684 3764 -1897 1454 4472 -1944 3758 7475 8649 7615 11872 10147
6331 10147 15102 15950 17431 13359 4305 4697 3108 762 -3559 -6695 -6190 -15603 -18527 -11873 -17418
6316 -17418 -15324 -7241 -4141 -14983 -12032 -1675 -2093 -3268 4657 2892 -6118 -14308 -8347 -12912
6302a2912k351J497P212J895N495o229J233j923R746N054k516p859O64j658q026
6287a0678O212K114j388l058L290J7570p999q645o423K07K415j928K536L498J593
6272f84K249m502m284R101P883J402n084k378l140j701L73k496o525L428M50M108
6256a800O68l27L109j096j214M05p34o656M586m720l080Q328K740O328n875j306
6240f44l906l535J477N288L93r379m364j067J1798L206o97l3q952j009J6653j006
6224D223j899R155p413m42M692K436k775l887j753l061o111q493N348M379J132
6209d469L328m542J14J0455K840k403L361o704J179l422J0883L827q434j0185
6195d172r18L965J195r57j449k705M276j386j0014n859L018R666M017l407j526
$$ plain form
6302 -12912 -15263 -13766 -6554 -4659 836 -5393 -4160 -6083 3663 8717 6201 -1658 -994 -2652 -10678
6287 -10678 -4466 -2352 -3740 -6798 -3508 14062 6063 -2582 -9005 -8798 -6383 -8311 -5775 -2277 -684
6272 -684 1565 -2937 -7221 1880 9763 11165 6081 3703 563 -1138 -765 -3261 -9786 -6358 -5908 -1800
6256 -1800 -1132 -1459 1650 554 -660 -255 -989 -7645 -3059 -7779 -10859 -2531 209 6537 662 -644
6240 -644 -4550 -8085 -6608 -1320 -927 -10306 -14670 -15737 -3939 -733 -1430 -1463 -10415 -11424 5229 4223
6224 4223 2324 11479 4066 3624 8316 10752 7977 4090 2337 -724 -6835 -15328 -9980 -5601 -4469
6209 -4469 -1141 -5683 -5569 4886 7726 5323 8684 1980 3159 -263 10620 14447 6013 -4172
6195 -4172 -5090 -1125 70 -887 -2336 -5041 -765 -2151 -12165 -18024 -15006 -5340 -1323 -4730 -6256
6180f256M460o77j521m470r85m107j2868J531J1298O003j521o157M815P710J427
6165a318K586o802M318N386r32r295M194R217J968L115j737m03j3282j0616O756
6150f845L997R627n978q419K921K359l457P649O339K175n711l189m753O522O697
6135I934K622j38q303j1174p541P669M495j0452R41k944n96j887M108J2289M997
6120D020M795J1201M639l426o327j3274k432M772O234m49L252l261o508k158Q71
6105A949k843J612Q591l200k702o00L018j572M924m905q25l050j948J4386K212
6090A5047j394m002m752j4438J654K404q815J950q541M87J6708N944K809K949
6076H010M84j0997r560J315L37q404m344J910O978m760Q478R537K462l282l38
$$ plain form
6180 -6256 -1796 -2473 -3994 -8464 -9449 -13556 -26424 -24893 -13595 -7592 -9113 -15270 -10455 -2745 -1318
6165 -1318 1268 -5534 -1216 4170 3238 -6057 -1863 7354 9322 12437 10700 10297 -2985 -13601 -6845
6150 -6845 -2848 6779 801 -7618 -4697 -2338 -5795 1854 8193 10368 4657 1468 -3285 3237 9934
6135 9934 12556 12418 4115 -7059 -14600 -6931 -2436 -12888 -11947 -14891 -15487 -17374 -13266 -977 4020
6120 4020 8815 20016 24655 21229 14902 1628 -804 3968 10202 9753 13005 9744 3236 1078 1949
6105 1949 -894 718 9309 6109 3407 2807 5825 4253 9177 4272 3447 397 -1551 12835 15047
6090 15047 13653 9651 4899 -9539 -7885 -5481 -14296 -12346 -20887 -20400 -3692 2252 5061 8010
6076 8010 8494 -2503 -12063 -10748 -10411 -18815 -23159 -21249 -14271 -19031 -10553 -1016 1446 -1836 -2174
6061b174l409q636J38M834P626J4791k488q908r144N700O599O161k716p007J2478
6046A3845q60o264m406o865Q57J1135J642o926o043k831j379M695M567J2056M239
6031A7462o272j552l127Q9J4539j496j1393k589J1636K668j0156j0211K012n684
6017d074n14N839K756K973K861m360q103k339Q425O497k232K024o42J496r06o925
6001B776j115j939j0338k439L498n46l430J591P153k95p256l336J4147J3535j954
5986A0052o36Q46K843m58J445m0p096k232Q708r64j4653j1118K11R417L307n225
5970e593J247j136q957J846J0509J2406P467p307r772q64k592j3283j0801Q907
5956a7923J7081N893k212J222j788L715k363q541L096R591q739l046N823K271
$$ plain form
6061 -2174 -5583 -14219 -14081 -9247 -1621 13170 10682 1774 -7370 -1670 4929 11090 8374 1367 13845
6046 13845 12985 6721 2315 -4550 -3693 7442 9084 2158 -3885 -6716 -8095 -3400 1167 13223 17462
6031 17462 11190 9638 6511 6600 21139 19643 8250 5661 17297 19965 9809 -402 1610 -4074
6017 -4074 -4588 1251 4007 6980 9841 5481 -2622 -4961 3464 9961 7729 9753 9111 10607 9701 2776
6001 2776 1661 -278 -10616 -13055 -9557 -10103 -13533 -11942 -4789 -5084 -12340 -15676 -1529 12006 10052
5986 10052 9416 10262 13105 12647 14092 14052 6956 4724 13432 12468 -2185 -13303 -13092 -3675 -368 -5593
5970 -5593 -4346 -5482 -14439 -12593 -2084 10322 17789 10482 710 -154 -2746 -16029 -26830 -17923
5956 -17923 -842 5051 2839 4061 2273 5988 3625 -4916 -1820 7771 -968 -4014 1809 4080
5942D080j6277O774M864j384K011m486O222M656l417J202O151j102k67J658N306
5927A5991K430K789m443n384m260k869j2150j1134N362J596L525n41l749O778
5913f059Q733r40J4608P963q949j2627l599R781O510j2142o989q181m419J3025
5899c285P6n535m611M220m023M314K06N263o79m458K958L224M929L954J914o319
5883B148k538N359J0091P094K764j0693j293q308p128o165K725P41J084l397K555
5868d961r39k785l18J2478J32l893K572m642J35P672L660O987o324J28m124m324
5852A454k242o29O058j450o821L27m453j111K137M611N393k247j671L933J980
5837E269l966j803K228j343o033j331N456N166O100n803p933L664j43j1094l167
$$ plain form
5942 4080 -12197 -5423 -559 -1943 68 -4418 1804 6460 3043 4245 10396 9294 9027 10685 15991
5927 15991 18421 21210 16767 11383 7123 4254 -7896 -19030 -13668 -12072 -8547 -9088 -12837 -6059
5913 -6059 2674 1734 16342 24305 15356 2729 -870 8911 15421 3279 -3710 -11891 -16310 -3285
5899 -3285 -3209 -8744 -13355 -9135 -13158 -8844 -8638 -3375 -4054 -8512 -5554 -2330 2599 6553 8467 2148
5883 2148 -390 4969 15060 22154 24918 14225 12932 4624 -2504 -8669 -5944 -5203 -4119 -7516 -4961
5868 -4961 -5900 -8685 -9003 3475 3607 -286 2286 -2356 -2221 5451 9111 16098 9774 9902 5778 1454
5852 1454 -788 -1417 4641 3191 -3630 -3303 -7756 -8867 -6730 -2119 3274 1027 -644 3289 5269
5837 5269 1303 -500 1728 385 -5648 -6979 -1523 3643 9743 3940 -3993 -329 -472 -11566 -14733
5822a4733M858r012L431K290K517L199j121L298J131M309j959o48n905q347L487
5807a3205P465M288L038o723o875P520J17o507M70j011L251k133M933N344O650
5792F622O017M979n702K426M29P925j377p258m755j0744m378j4451j6047M06J1615
5777b4293J450K384P533J0331Q297J864L920j500L97n231n14k595o072m714M318
5762d425P342J243M417k13j2198L680j637N516k988j3930k519K119J124J743P234
5747c492J1799j4019Q2J0843j748p461M762J1446n323j0578M878Q15k841o915
5733g752N081J753J3841N761n232j1148m186K12L955j448R603N019j5183m648
5719d372p659K34P394r67l903J140j934n647N109N197p37M600q493k855r830l025
$$ plain form
5822 -14733 -9875 -18887 -15456 -13166 -10649 -7450 -8571 -5273 -4142 167 -1792 -2440 -8345 -16692 -13205
5807 -13205 -5740 -1452 1586 -5137 -12012 -4492 -4375 -10882 -10412 -11423 -8172 -10305 -5372 -28 6622
5792 6622 12639 17618 11916 14342 14771 22696 21319 14061 9306 -1438 -5816 -20267 -36314 -35908 -24293
5777 -24293 -22843 -20459 -12926 -2595 5702 7566 11486 9986 10383 5152 4638 2043 -4029 -8743 -4425
5762 -4425 2917 4160 8577 8364 -3834 -154 -1791 3725 737 -13193 -15712 -13593 -12469 -10726 -3492
5747 -3492 8307 -5712 -5630 5213 3465 -3996 766 12212 6889 -3689 1189 2004 -837 -7752
5733 -7752 -2671 -918 12923 18684 13452 2304 -1882 -1670 2285 837 10440 15459 276 -4372
5719 -4372 -12031 -11797 -4403 -5370 -9273 -8133 -10067 -15714 -10605 -5408 -6145 -1545 -10038 -12893 -22723 -25748
5703b5748J0586O473Q302K868k211R1j1658j1643J117J2812J663Q013o862l045
5689i242J78o570N282J2568j192m698j621m004k659L985q97N99m536L986j575
5674a0396p83o18J705N518O35N686L510k513l244M892J357j0723j3003p760N388
5659b0349O6O689O575R220m32K161N696k366K038N52l466n521k041m100m014Q046
5643a246M245N739k515n114O699p26n764n727J164j951J947R4k70j81k242P845
5627A997k156l851r836p552n28P421L864J059M00m273J355k570P107K640N625
5612G02k330q526P122L045k954j824J1056O785j579o068l55K865Q93N701R68j0011
5596E490J646k115n269N092j356q506o529j303O118P202Q119M288p032q557L932
$$ plain form
5703 -25748 -15162 -8689 -387 2481 270 361 -11297 -22940 -21823 -9011 -7348 665 -6197 -9242
5689 -9242 -9064 -15634 -10352 2216 1024 -3674 -5295 -9299 -11958 -7973 -8870 -8271 -12807 -8821 -10396
5674 -10396 -11179 -11797 -10092 -4574 -3939 1747 5257 2744 -500 4392 5749 -4974 -17977 -25737 -20349
5659 -20349 -20283 -13594 -7019 2201 1769 3930 9626 7260 9298 9850 6384 863 -1178 -5278 -9292 -1246
5643 -1246 2999 8738 6223 1109 7808 7082 1318 -4409 -3245 -5196 -3249 -3155 -3425 -3606 -5848 1997
5627 1997 -159 -4010 -13846 -21398 -21926 -14505 -10641 -9582 -9182 -13455 -12100 -14670 -7563 -4923 702
5612 702 -1628 -10154 -3032 13 -2941 -4765 6291 13076 11497 5429 5074 7939 8832 14533 15501 5490
5596 5490 7136 5021 -248 4844 3488 -5018 -11547 -12850 -6732 470 8589 12877 5845 -2712 1220
5581A220J109n022r06k179j326j666k967M563J1146k182j135J0504L757q254L720
5566A0382N130m395J362p42r87p391r042L908R785r55j082R76n112q481j682L968
5550d358J8033K185o235M84N37o121L53p822m613R18L391J63k504r293j500O032
5534a0350L578l414n37O145L940Q33o238N160L893n047l779J372m525L379j154
5519f744R07L763k25l039k390o208q282Q111R186O142q23P341q842l117R1J825
5503b304j3168j1885M781P179j428O043N260N67k696L491o221M932J9286k468
5489A1369r985j106K279q191k90J101m326l48J2855Q419o669q848P387L781J061
5474H489k934j0897q242J334J987J8148Q652p961o627j0052l23M961l539n310
$$ plain form
5581 1220 2329 -2693 -3599 -5778 -7104 -8770 -11737 -7174 3972 1790 655 11159 14916 6662 10382
5566 10382 15512 11117 12479 11737 10750 3359 -5683 -1775 8010 7055 5973 6949 1837 -6644 -8326 -4358
5550 -4358 13675 15860 9625 10109 10646 4525 4878 -2944 -7557 -6639 -3248 -3085 -5589 -14882 -16382 -10350
5534 -10350 -6772 -10186 -10723 -4578 -638 195 -6043 -883 3010 -2037 -5816 -4444 -8969 -5590 -6744
5519 -6744 -5837 -2074 -2299 -5338 -7728 -13936 -22218 -14107 -4921 1221 398 7739 -1103 -4220 -4129 -2304
5503 -2304 -15472 -27357 -22576 -15397 -16825 -10782 -5522 -4955 -7651 -4160 -10381 -5449 13837 11369
5489 11369 1384 278 2557 -5634 -5924 -4823 -9149 -9497 3358 11777 5108 -3740 3647 7428 8489
5474 8489 5555 -5342 -13584 -12250 -10263 7885 16537 8576 1949 -8103 -8426 -3465 -7004 -12314
5460a2314o453P056Q037j41M482l204M212q181k371M584N116m414K320N520n508
5445a259O344M37k879m796R403l729o398J395J0005j37r007o171l620l959O82
5430a3689J5109j243j1329J609J010L500K766n984r271m598N389K339o889n122
5416b6403J0352M710O775L000k026l643N665K36j07P5n651N86J011M580M80l162
5400c522Q33L040J349m639j347m581P13J461P400q659M288P59l083m903O485M713
5384C07n206l631Q948O605L202l334j3125j2863L856r3m909q565L526L935L144
5369a8203K881R594J982o431J306M287n275P045k041r582p974K567N486O709J011
5354f638r2n906J27j38N516P018P488M776q003j5529m708J1877L195M968L139
$$ plain form
5460 -12314 -18767 -11711 -3674 -3815 667 -2537 1675 -6506 -8877 -4293 823 -3591 -1271 4249 -1259
5445 -1259 5085 5522 2643 -2153 7250 3521 -2877 -1482 8523 8386 -621 -6792 -10412 -14371 -13689
5430 -13689 1420 177 -11152 -9543 -8533 -5033 -2267 -8251 -17522 -22120 -16731 -14392 -21281 -26403
5416 -26403 -16051 -11341 -4566 -1566 -3592 -7235 -1570 -1334 -1441 -1366 -7017 -6431 -5420 -840 -360 -3522
5400 -3522 -2689 351 1700 -2939 -4286 -8867 -8154 -6693 707 -7952 -3664 -2905 -5988 -10891 -4406 307
5384 307 -4899 -8530 418 7023 10225 6891 -6234 -19097 -15241 -15334 -20243 -28808 -25282 -21347 -18203
5369 -18203 -15322 -5728 -3746 -10177 -8871 -4584 -9859 -2814 -4855 -14437 -22411 -19844 -14358 -7649 -6638
5354 -6638 -6730 -12636 -12509 -12647 -7131 -113 7375 12151 4148 -11381 -16089 -4212 -1017 3951 7090
5339G090l207n98K16m894q457k016M668N76P888N494j519n729M111K865n430m533
5323c475J891R571P143N049j0470n854m996p13p873K310j110q295l87m43J558
5308a6094J959J0376N728J013l58J0065J919m689m157M797P01j0208q716R087
5294A423K775r2l755n266J367N898K017J671P908j0422r927O16l131J0626K845
5279D553q700l98K363r48K880L560P753N953k203p428p028Q248J632p103K381
5264E515J230o265L609n999N806L18j4241R79J048M82m111j156R986M873J1511
5249A3585K353q711n353m510n000M147K319m668o825Q445L000P02j83R907M620
5234A3828o459j7671l9O158j0967j0962m655Q173Q344P554M808L220J771l600
$$ plain form
5339 7090 3883 3285 3501 -1393 -9850 -11866 -7198 -6622 1266 6760 5241 -488 3623 6488 1058 -3475
5323 -3475 -1584 7987 15130 20179 9709 3855 -1141 -1854 -9727 -7417 -8527 -16822 -17209 -17652 -16094
5308 -16094 -14135 -3759 1969 2982 2624 12689 14608 9919 5762 10559 11260 1052 -7664 1423
5294 1423 4198 4106 351 -4915 -3548 2350 4367 6038 13946 3524 -6403 -5787 -8918 1708 4553
5279 4553 -4147 -4545 -2182 -3130 -250 3310 11063 17016 14813 7385 357 8605 10237 3134 5515
5264 5515 6745 480 4089 -1910 3896 4214 -10027 -9048 -8000 -7518 -11629 -12785 -2799 2074 13585
5249 13585 15938 7227 1874 -2636 -7636 -3489 -1170 -5838 -12663 -4218 -1218 -516 -699 9208 13828
5234 13828 7369 -10302 -10341 -4183 -15150 -26112 -30767 -22594 -14250 -6696 -1888 1332 3103 -497
5220d97l060q67q7J190l014l034M909N969J040r629p605M412R4J3323N786j2636
5204c706p856M060K434R49k756K937M8l332M000R148k604r751m227J927O528o727
5188h928O078J4333Q580k158L988J83n275j0340j0294L516m134n915J0211J1149
5174A0994q64q041k136j311J1475m649j1348J148K616O760M712l26p442n195k20
5159c827N505j184n975n292p078P875Q791N552l700l439r823k077m566J1047m321
5144a2512J132J1491k065m952l345J2320M473k068j4587l065Q725Q317o58k017
5130A189k625l350r054k319J1367J3330K628l840q513k282p348m390J901J0982
5116b324p15n108l617r342j524Q487L91R056N246J731J657Q12Q569l428j7994
$$ plain form
5220 -497 -3557 -4424 -4511 -3321 -6335 -9369 -4460 1509 2549 -7080 -14685 -10273 -10179 3144 8930 -3706
5204 -3706 -11562 -7502 -5068 -4119 -6875 -3938 -3890 -7222 -3222 5926 3322 -6429 -10656 -8729 -2201 -8928
5188 -8928 -2850 11483 20063 17905 21893 22076 16801 6461 -3833 -317 -4451 -10366 -155 10994
5174 10994 10130 2089 -47 -1358 10117 5468 -5880 -4732 -2116 4644 9356 9030 1588 -3607 -3827
5159 -3827 1678 494 -5481 -10773 -17851 -9976 -1185 4367 667 -2772 -12595 -14672 -19238 -8191 -12512
5144 -12512 -11380 111 -1954 -6906 -10251 2069 6542 4474 -10113 -13178 -4453 3864 3206 1189
5130 1189 -1436 -4786 -13840 -16159 -4792 8538 11166 7326 -1187 -3469 -10817 -15207 -13306 -2324
5116 -2324 -3039 -8147 -11764 -21106 -22630 -14143 -13752 -4696 550 2281 3938 4750 13319 9891 -8103
5101h103R7J2009J770l393j204M498l252k199j255M150M47k738M755P0j1122m880
5085a0350o185K640K090K980j551J2149N741r04K741J0940J111j296o355m834
5071H917p303m874n30Q270P364j2450j3990m453L947N297O621m177n34J907J245
5056d743n31k540n422K710P999N62n004o032o59p002N379R493R736O080L763L153
5040A6942j148k535O802m544K046N66l382k478P51p514m181o3l764m867P504N61
5024F96K437j622q250n738m776K788K367O332rN688J4092l815m314o87J893j563
5008E519j5340q765P416J289J0774p687p805L413M083j2845N259J902k592R54
4994a4425J129m681k946L598J0590K189R175R145j277l501L830n103p763J796
$$ plain form
5101 -8103 -8006 4003 5773 2380 1176 5674 2422 223 -1032 3118 3565 827 5582 5652 -5470 -10350
5085 -10350 -16535 -13895 -11805 -8825 -10376 1773 7514 6610 9351 20291 21402 20106 13751 8917
5071 8917 1614 -3260 -3790 4480 11844 -606 -14596 -19049 -15102 -9805 -3184 -7361 -7895 -5988 -4743
5056 -4743 -5274 -7814 -13236 -10526 -2527 -1965 -6969 -13001 -13660 -20662 -15283 -5790 3946 10026 13789 16942
5040 16942 15794 13259 20061 15517 17563 18129 14747 12269 13020 5506 1325 1262 -2502 -7369 135 696
5024 696 3133 1511 -6739 -12477 -17253 -14465 -12098 -5766 -5775 -87 14005 10190 5876 5189 7082 5519
5008 5519 -9821 -18586 -11170 -9881 893 -6794 -14599 -11186 -7103 -19948 -14689 -12787 -15379 -14425
4994 -14425 -13296 -17977 -20923 -17325 -6735 -4546 4629 13774 12497 8996 12826 7723 -40 1756
4980A756j601O004L34r790L856Q51L029j902o559o092K524J850J0l330m263j968
4964a5291M043P021P208O22K509j995l221M244J0739J0024K269j745j2572o958
4950F897o239n413J225r36k036r99O306o052m494J0389L6k558M654M141k881J855
4934C895r699l166K589N536M336m741O574Q735j168o883n439r139n959J635J2025
4919h69J988K363j851j0897n195M322P99P31O940p30m622l252J375J332K015M946
4903f05l885m722K497K136j022O953J068R53M222r745l930j98J275l176J083J1313
4887D217P907j072K983N495j1396j6050l038N028l207N68O138p239k286l419P345
4872h026K511o240m255l091l548L201J672M328M816P408J564j857k185P247J308
$$ plain form
4980 1756 155 6159 6493 -3297 559 1410 4439 2537 -4022 -10114 -7590 -5740 -5730 -9060 -13323 -15291
4964 -15291 -11248 -4227 2981 3603 6112 4117 896 5140 15879 25903 28172 26427 13855 6897
4950 6897 658 -4755 -3530 -4466 -6502 -7501 -1195 -7247 -11741 -1352 -1316 -3874 780 4921 2040 3895
4934 3895 -5804 -8970 -6381 -845 3491 -1250 5324 14059 12891 6008 569 -8570 -14529 -12894 -869
4919 -869 1119 3482 1631 -9266 -14461 -10139 -9340 -8609 -1669 -2399 -7021 -10273 -8898 -7566 -5551 -605
4903 -605 -4490 -9212 -6715 -4579 -5601 1352 2420 3373 7595 -2150 -6080 -6278 -5003 -8179 -7096 4217
4887 4217 12124 11052 14035 19530 8134 -7916 -10954 -5926 -9133 -8565 -2427 -9666 -11952 -15371 -8026
4872 -8026 -5515 -11755 -16010 -19101 -22649 -19448 -17776 -13448 -8632 -1224 340 -1517 -3702 3545 4853
4857D853L596K201l844o970q72j917O00M777j082q043L533O470M218P818p573
4842G765j5019M818L708K143M645M690J919p976j0763j2019K895O658P529J2527
4828A3520L51n827J743L499n470o531o315m096M241M730J07p621k866N107J657
4813c771J1270j200o637P151J1047n865j2762r485j136M362j734N414j552k337
4799g235K240L230l485J288N931O003J5066l2m327j407j760q50J350n728j3174
4784b890j1796R05J005P138j207l599r02L590L252n163l153l068N013j436R753
4769b558N199j843L180J509j126n351j0902k067Q118r6O616p938J400Q671N422
4754H234m968r428p584l86n227P015P305L41O582K888l628j176M611o290k446
$$ plain form
4857 4853 8449 10650 6806 -164 -1036 -2953 -2353 2424 1342 -6701 -3168 3302 7520 15338 7765
4842 7765 -7254 -2436 1272 3415 8060 12750 14669 6693 -4070 -16089 -13194 -6536 993 13520
4828 13520 13871 8044 9787 13286 7816 1285 -5030 -9126 -4885 -155 -48 -7669 -10535 -5428 -3771
4813 -3771 7499 6299 -338 6813 17860 11995 -767 -10252 -11388 -7026 -8760 -3346 -4898 -7235
4799 -7235 -4995 -1765 -5250 -3962 1969 7972 23038 23006 18679 17272 15512 14662 16012 10284 -2890
4784 -2890 -14686 -13781 -12776 -5638 -6845 -10444 -11346 -7756 -4504 -9667 -12820 -15888 -10875 -12311 -2558
4769 -2558 2641 798 3978 5487 4361 -990 -11892 -13959 -5841 -5937 679 -7259 -5859 2812 8234
4754 8234 3266 -6162 -13746 -14132 -19359 -12344 -5039 -4698 1884 4772 1144 -32 4579 -1711 -4157
4739d157O796L763r468L803n249m108R850L344K57o767j679P40K536K772K054
4724D487R408n743j2738l971j944R61J0114Q011r01o884J58N70j308k695l538
4709f013n282J176p10l134J328l237o110K492J2787L41j869n824j550j360k647
4694a9612L895K475J0793K651k944j4584P531L898J509L340J889m704l97K2P932
4679C694R326J282o55m113k149Q34o795J069k65n334O115P988k703m530j1021
4664g257M72k945j680R196k497r353l251P521P872o454j260M370J2884M243r240
4649B621o867k254O762o647P846P447j118r082P11l875k161N352J4802K858J369
4634A7764q152p909l606J3j87N61L449Q29p107m023J324P260p21K695J0640K527
$$ plain form
4739 -4157 2639 6402 -3066 737 -4512 -8620 1230 4574 4831 -1936 -3615 -2875 -339 2433 4487
4724 4487 13895 8152 -4586 -8557 -10501 -9540 574 8585 7684 800 958 1528 220 -2475 -6013
4709 -6013 -11295 -10119 -10829 -13963 -12635 -15872 -21982 -19490 -6703 -6362 -8231 -14055 -15605 -16965 -19612
4694 -19612 -15717 -13242 -2449 202 -2742 -17326 -9795 -5897 -4388 -1048 841 -3863 -4260 -4238 3694
4679 3694 13020 14302 13647 9534 7385 8219 1424 2493 2228 -3106 3009 10997 8294 3764 -7257
4664 -7257 -6785 -9730 -11410 -2214 -4711 -14064 -17315 -9794 -1922 -8376 -9636 -5266 7618 11861 2621
4649 2621 -4246 -6500 262 -6385 1461 8908 7790 -1292 -581 -4456 -6617 -1265 13537 16395 17764
4634 17764 9612 1703 -1903 -1890 -2077 -1516 1933 2762 -4345 -8368 -7044 216 -505 2190 12830 15357
4618A5357J646k281q285j0519P72N797J243K278n861r003m750k6J0680P563K241
4603F852m976r626K65j62J344N567n59M758l813J1029j855l241K968m131j154
4588C266R4o856j089P037M258m457K813q052j134O842j36n594m630M186k199j0445
4572a6096O195M077k449o209Q175Mk297J354J294O719J888K689m991q208N053
4557b802Q027o338m927R575p192j0077J0224L324k028o346J485O206O710M92l246
4542C087Q437N517q316j1205l667P779J2055j223j0988k057k672O165K80j135
4528B057k61q943j273Q566j235Q187Q011p336j0301N01L223n678o149j246K966
4513h911J3516L792p920o267O95M904J1321R672j1878r139k876P224K250j1414
$$ plain form
4618 15357 17003 14722 6437 -4082 -3310 2487 3730 6008 147 -8856 -13606 -13632 -2952 4611 6852
4603 6852 1876 -7750 -7485 -7647 -6303 -736 -1295 3463 -350 10679 8824 5583 8551 4420 3266
4588 3266 3360 -3496 -4585 2452 6710 2253 5066 -2986 -4120 2722 2586 -3008 -7638 -3452 -5651 -16096
4572 -16096 -9901 -5824 -8273 -14482 -6307 -6303 -8600 -7246 -5952 767 2655 5344 353 -7855 -2802
4557 -2802 5225 -1113 -6040 3535 -3657 -13734 -3510 -186 -2214 -8560 -7075 -869 5841 6333 3087
4542 3087 11524 17041 8725 -2480 -6147 1632 13687 12464 1476 -581 -3253 2912 3192 2057
4528 2057 1796 -7147 -8420 146 -1089 7098 15109 7773 -2528 -2027 1196 -4482 -10631 -11877 -8911
4513 -8911 4605 8397 477 -5790 -5095 -191 11130 20802 8924 -215 -3091 4133 6383 -5031
4499e031j947R178O921j3155j6954K218J3099J311q103m047K220K056P312L374
4485a548K060k076p167j7379K056J1178O626j826l424J878L316j117M970Rl479
4470e923P425J40n419m88P49R359J671p828K18j898L85Q99K799j704k990n832
4454h437n946J1796N43J473j944N57O605N963k372r515J307Q85Q55K685o024m597
4438f166r905o91O221o06P637N531J025k238n47Q39q173p649N909N031j455j223
4422f460M397m168M339J0942j381n773N185N761j259n197o774k00l340L437j219
4407a710j2304M124l569l952M866n546Q61R925K420J0964m461q185M982J540N967
4392E922k65r643r296R36N306K641p117q630k709M702L317O170J178Q144P39K872
$$ plain form
4499 -5031 -6978 2200 9121 -4034 -20988 -18770 -5671 -4360 -12463 -16510 -14290 -12234 -4922 -1548
4485 -1548 512 -1564 -8731 -26110 -24054 -12876 -6250 -8076 -11500 -9622 -6306 -7423 -2453 -2444 -5923
4470 -5923 1502 1642 -3777 -4265 -3516 5843 7514 -314 -96 -1994 -1609 -710 2089 385 -2605 -8437
4454 -8437 -14383 -2587 -2044 -571 -2515 -1958 4647 10610 8238 -1277 30 915 1770 4455 -1569 -6166
4438 -6166 -16071 -16762 -10541 -11147 -3510 2021 3046 808 261 1100 -7073 -14722 -8813 -3782 -5237 -6460
4422 -6460 -2063 -6231 -1892 9050 7669 1896 7081 12842 11583 6386 -388 -588 -3928 -491 -1710
4407 -1710 -14014 -9890 -13459 -17411 -12545 -18091 -17230 -7305 -4885 6079 1618 -6567 -1585 -45 5922
4392 5922 5657 -3986 -13282 -12346 -7040 -4399 -11516 -20146 -22855 -18153 -14836 -8666 -7488 656 1395 4267
4376D267K18n242P977K167o22j0829m708M011Q29M558j310K958j483K265M225
4361I281J115q143K880J400K393o879k770k650J123r25R04N08J827N769j213o202
4345a582q718k158J036K192J2202K601q773j1150o533Q771P968k972K32K400J566
4330b918j600l760J615Q682Q182K647j2480k549L393K631j543j1001o181N05k012
4315a6389k535J082M42J2142J289M415n91K167L951j207L943l192r596J2913O201
4300A5035m992L302p185k096o30P46j357K651m800m656L596J964m51j56l79l391
4284b799L42K698J793o947l32N687R616q695p212M473J14j727K194k356L033j365
4268a483k014q88O273L613N161l848k994p832M14k712q72O56K116O126P431K969
$$ plain form
4376 4267 4485 -757 7220 9387 8765 -2064 -6772 -2761 -1932 2626 1316 4274 2791 5056 9281
4361 9281 10396 2253 5133 6533 8926 2047 -723 -3373 -2250 -3175 -2271 -1763 64 5833 4620 -1582
4345 -1582 -10300 -12458 -11422 -9230 2972 5573 -3200 -14350 -20883 -12112 -4144 -7116 -6884 -4484 -2918
4330 -2918 -4518 -8278 -6663 2019 10201 12848 368 -2181 1212 3843 2300 -8701 -14882 -14377 -16389
4315 -16389 -18924 -17842 -17400 -5258 -3969 446 -145 2022 5973 4766 8709 5517 -4079 8834 15035
4300 15035 10043 13345 6160 4064 3434 4180 2823 5474 674 -3982 -386 1578 1127 971 592 -2799
4284 -2799 -2457 241 2034 -4913 -5245 442 10058 1363 -5849 -1376 -1262 -2989 -795 -3151 -118 -1483
4268 -1483 -3497 -4385 1888 5501 10662 6814 3820 -4012 -3598 -6310 -7182 -6526 -4410 1716 9147 12116
4252A2116o869J996m215p220L43l411R14L088Q131O490l797m766N096L541j180
4237A0257Op90J553n981N754N67r065j0798R695P950j1136Q822P300n618k471
4222F045m615R06o723q645L210P207l467p87L999M884K509q593l819K353N56n684
4206a0664m39J754j92L814Q141O957J052k527k077J23j250M319P826j4339o350
4191c852k545J975Q310r815j1809l6J1382Q077J0092K799j0872r341m515N572
4177d578M090l594o388j676O987m115N936J874Q014K886m132K16o424J847P625
4162H568k779p690o072r236N67N064O183Q033M95M773l406n641Q49K3M469l345
4146H55K793o009j4015K138P473M110n551J586j0345Q20O387K279K910k501L563
$$ plain form
4252 12116 5247 7243 3028 -4192 -3849 -7260 -6346 -3258 4873 11363 7566 2800 7896 11437 10257
4237 10257 10263 9473 11026 5045 10799 11366 2301 -8497 1198 9148 -1988 6834 14134 8516 6045
4222 6045 1430 2336 -4387 -13032 -9822 -2615 -6082 -6869 -2870 2014 4523 -4070 -7889 -5536 -4980 -10664
4206 -10664 -11103 -9349 -9541 -5727 2414 9371 10423 7896 5819 5942 4692 9011 16837 2498 -3852
4191 -3852 -6397 -4422 3888 -5927 -17736 -17772 -6390 1687 11779 14578 3706 -5635 -10150 -4578
4177 -4578 -488 -4082 -10470 -12146 -5159 -9274 -3338 -1464 6550 9436 5304 5520 -904 943 8568
4162 8568 5789 -1901 -7973 -17209 -16642 -11578 -5395 2638 3133 7906 4500 -1141 -292 -269 4200 855
4146 855 3648 -2361 -16376 -14238 -6765 -2655 -8206 -6620 -16965 -16145 -9758 -7479 -4569 -7070 -3507
4131c507j473m022J301l977J289p953m14P9Q398M395O249M408N58K648l779J153
4115E353l882n863k317J271J3476J9026P203n455j4131q734k260O981N856J823
4101A8347l64r264k0110l988m607K964M763N304Q23J959M970K639Q367n394m877
4086A532k121K991j582m230n501l30N351N232K235Q413Q771m946J999o919m046
4071F849j3009j861R193p467K364O336P720n564m743l156n947L746J3879J3338
4057B1678l807j362j553n364J826N660l701K24o052J345K390J492r699j0379L245
4042d057j258k448m694L788L940Q63J2621M149p420r103k097L236J592K381p4
4027A419j003J597L468k443k910K167J5106L665r709r372L100n210q15j469K259
$$ plain form
4131 -3507 -4980 -9002 -7701 -11678 -10389 -18342 -18756 -18677 -10279 -5884 365 4773 5331 7979 4200 5353
4115 5353 1471 -4392 -6709 -5438 8038 27064 34267 28812 14681 5947 3687 10668 16524 18347
4101 18347 17983 8719 -11391 -15379 -19986 -17022 -12259 -6955 -6132 -4173 797 3436 11803 6409 1532
4086 1532 -589 2402 820 -3410 -8911 -9241 -3890 1342 3577 11990 20761 15815 17814 10895 6849
4071 6849 -6160 -8021 1172 -6295 -3931 2405 10125 4561 -182 -3338 -9285 -5539 8340 21678
4057 21678 17871 16509 14956 9592 11418 17078 13377 13601 7549 8894 11284 12776 3077 -7302 -4057
4042 -4057 -5315 -7763 -12457 -8669 -4729 -3866 8755 12904 5484 -3619 -5716 -2480 -888 1493 1419
4027 1419 416 2013 5481 3038 128 2295 17401 21066 11357 1985 5085 -125 -940 -2409 -150
4012a50N961l055q152o835O715J228Q802L816p135q394k772M623M225N579k194
3997B262q552P865P083j003o954M785n996m631l187m330M23N062n388o873p47
3982b0181J3319K922N88J0362L121j0624j8022n146r783P896L990M625m768K944
3968a8757l652J479O719J981p17O522j704m816j936o27j509O215J044M012J502
3953d244J066L035P21n973O707N57l82L073o942o542k016L656J0068M914j2283
3938d585o799K587j194j3061j0349r86J4540J0079J123K999j530R525P995l1P57
3923A1070j81r748P7M04L579K903O07O309m19j8818r932k190J0496K696j826j21
3907e094J2301J727k212r640r113k454O30O678P718k249P076k46p129o589M004
$$ plain form
4012 -150 5811 2756 -5396 -12231 -5516 -4288 4514 8330 1195 -7199 -9971 -5348 -1123 4456 2262
3997 2262 -6290 1575 8658 7655 701 5486 -510 -5141 -8328 -12658 -12235 -7173 -12561 -19434 -20181
3982 -20181 -6862 -3940 -3352 7010 10131 -493 -18515 -23661 -33444 -25548 -21558 -16933 -21701 -18757
3968 -18757 -22409 -20930 -14211 -12230 -12947 -6425 -8129 -12945 -14881 -15508 -17017 -10802 -9758 -5746 -4244
3953 -4244 -3178 -143 578 -5395 1312 1869 1487 4560 -2382 -8924 -10940 -7284 2784 7698 -4585
3938 -4585 -11384 -8797 -9991 -23052 -33401 -34387 -19847 -9768 -8645 -5646 -7176 2349 10344 10313 11070
3923 11070 10889 1141 1218 1622 5201 8104 8711 15020 14601 -4217 -14149 -16339 -5843 -3147 -4973 -5094
3907 -5094 7207 8934 6722 -2918 -12031 -14485 -13855 -7177 541 -1708 5368 5122 -2007 -8596 -4592
3892d592P721l15R28Q598k081r466p412j272N402K48n295k068O020L108k546o035
3876i057O262JP905m85p803j0730O783K732J102L411N093k537o294o749J431J044
3860g891J0953Q578N8j0291q127O17K040O721L095o861K660K813N22M858r13m941
3844C891J830n28k865p155M03K211K682l472L287j507n18J1315j597o382J7536
3829A9131J866o336q326r522j0120Q967J4045m803j2283M01K102Q439L138O251
3815A2950K836n313k026P32j98M201m41j882J631q218n995O541M439m673m368
3800B16l499P457j184j4711l728j239L14R112l094L09j521L705n113m012R357
3785g631j198o300J878O698J1916O870o460n507n154l898M395M502j134o474M407
$$ plain form
3892 -4592 3129 2814 3742 12340 10259 793 -6619 -7891 -2489 -2241 -7536 -9604 -3584 -476 -3022 -9057
3876 -9057 -2795 -2794 5111 4626 -3177 -13907 -7124 -4392 -3290 121 5214 2677 -3617 -10366 -8935 -7891
3860 -7891 3062 11640 11698 1407 -6720 -6103 -4063 2658 5753 -1108 1552 4365 4887 9745 8832 3891
3844 3891 5721 5193 2328 -4827 -4424 -2213 469 -3003 284 -1223 -1741 9574 7977 1595 19131
3829 19131 20997 14661 6335 -3187 -13307 -4340 9705 4902 -7381 -6980 -4878 3561 6699 12950
3815 12950 15786 10473 8447 9179 8981 13182 12741 10859 12490 4272 -1723 4818 9257 4584 216
3800 216 -3283 4174 2990 -11721 -15449 -16688 -16374 -7262 -10356 -10047 -11568 -7863 -12976 -16988 -7631
3785 -7631 -8829 -15129 -13251 -6553 5363 12233 5773 266 -4888 -8786 -4391 111 -1023 -7497 -3090
$$ [...]
##END NTUPLES=NMR SPECTRUM
##END=
