##TITLE=Analysis number 328814
Compound Code cc 49546
Book Reference 486/166
Project Code adrs
Chemist Name simons
##JCAMPDX= 6.0         $$ Bruker NMR JCAMP-DX V2.0
##DATA TYPE= NMR SPECTRUM
##DATA CLASS= NTUPLES
##ORIGIN= Bruker BioSpin GmbH
##OWNER= nmr
$$ XWIN-NMR		Version 3.5
$$ Thu Jul  5 13:48:25 2007 GMT Daylight Time (UT+1h)  MAYBRIDGE\nmr@NMR_250MHZ
##.OBSERVE FREQUENCY= 250.131544655141
##.OBSERVE NUCLEUS= ^1H
##.ACQUISITION MODE= SIMULTANEOUS (DQD)
##.ACQUISITION SCHEME= undefined
##.AVERAGES= 16
##.DIGITISER RES= 18
##SPECTROMETER/DATA SYSTEM= dpx250
##.PULSE SEQUENCE= zg30
##.SOLVENT NAME= CDCl3
##.SHIFT REFERENCE= (INTERNAL, CDCl3, 0, 16.522)
##AUDIT TRAIL= $$ (NUMBER, WHEN, WHO, WHERE, WHAT)
$$ ##TITLE= Audit trail, XWIN-NMR		Version 3.5
$$ ##JCAMPDX= 5.01
$$ ##ORIGIN= Bruker BioSpin GmbH
$$ ##OWNER= nmr
$$ C:\u/data/dgb/nmr/ADRS/490/pdata/1/auditp.txt
$$ ##AUDIT TRAIL=  $$ (NUMBER, WHEN, WHO, WHERE, WHAT)
(   1,<2007-07-05 13:47:57.72 +100>,<MAYBRIDGE\nmr>,<NMR_250MHZ>,
      <created by zg, POWCHK disabled, PULCHK disabled
       configuration hash MD5:
       76 6E 9A 78 1E 09 19 81 EC 84 63 8F B0 6A 59 2D
       data hash MD5: 64K
       DA 3A 7A 3F A1 76 90 10 AC 31 9F A9 3B 0C A8 20>)
(   2,<2007-07-05 13:48:14.75 +100>,<MAYBRIDGE\nmr>,<NMR_250MHZ>,
      <Start of raw data processing
       ef LB = 0.3 FT_mod = 6 PKNL = 1 SI = 32K 
       data hash MD5: 32K
       6B 63 84 3E 03 D6 2C 7A 43 E0 24 8F 24 06 C8 5C>)
(   3,<2007-07-05 13:48:16.55 +100>,<MAYBRIDGE\nmr>,<NMR_250MHZ>,
      <apk 
       data hash MD5: 32K
       76 7A D2 F7 95 CE AF 55 FB CD ED 86 1B DC 7F 1A>)
(   4,<2007-07-05 13:48:17.34 +100>,<MAYBRIDGE\nmr>,<NMR_250MHZ>,
      <abs ABSG = 5 
       data hash MD5: 32K
       36 8B 29 5F 36 4A 3C 45 05 E0 19 4F 47 7E C8 FF>)
$$ ##END=
$$ 
$$ hash MD5
$$ D0 D8 84 AC FE B7 63 6F E8 B3 CF C1 C1 90 03 84
##$RELAX= 
##$RELAX= 
##$RELAX= 
##$RELAX= 
##$RELAX= 
##$RELAX= 
##$RELAX= 
$$ Bruker specific parameters
$$ --------------------------
##$DU= <C:\u>
##$EXPNO= 490
##$NAME= <ADRS>
##$PROCNO= 1
##$TYPE= <nmr>
##$USER= <dgb>
##$AMP= (0..31)
100 100 100 100 100 100 100 100 100 100 100 100 100 100 100 100 100 100 
100 100 100 100 100 100 100 100 100 100 100 100 100 100 
##$AQSEQ= 0
##$AQ_mod= 3
##$AUNM= <au_zg>
##$AUTOPOS= <34 >
##$BF1= 250.13
##$BF2= 250.13
##$BF3= 250.13
##$BF4= 250.13
##$BF5= 500.13
##$BF6= 500.13
##$BF7= 500.13
##$BF8= 500.13
##$BYTORDA= 1
##$CFDGTYP= 0
##$CFRGTYP= 5
##$CHEMSTR= <none>
##$CNST= (0..31)
1 1 145 1 1 1 1 1 1 1 1 1 1 1 1 1 1 1 1 1 1 1 1 1 1 1 1 1 1 1 1 1 
##$CPDPRG= <>
##$CPDPRG1= <>
##$CPDPRG2= <>
##$CPDPRG3= <>
##$CPDPRG4= <mlev>
##$CPDPRG5= <mlev>
##$CPDPRG6= <mlev>
##$CPDPRG7= <mlev>
##$CPDPRG8= <mlev>
##$CPDPRGB= <>
##$CPDPRGT= <>
##$D= (0..31)
0 1 0 0 0 0 0 0 0 0.06 0 0 0 0 0 0 0.0002 0 0 0 0 0 0 0 0 0 0 0 0 0 0 
0 
##$DATE= 1183639676
##$DBL= (0..7)
120 120 120 120 120 120 120 120 
##$DBP= (0..7)
150 150 150 150 150 150 150 150 
##$DBP07= 0
##$DBPNAM0= <>
##$DBPNAM1= <>
$$ [...]
##$SUBNAM7= <"">
##$SUBNAM8= <"">
##$SUBNAM9= <"">
##$SW= 20.6930455092707
##$SWIBOX= (0..15)
0 0 3 0 0 0 0 0 0 0 0 0 0 0 0 0 
##$SW_h= 5175.983436853
##$TD= 65536
##$TD0= 1
##$TE= 296.16
##$TE2= 300
##$TE3= 300
##$TEG= 300
##$TL= (0..7)
0 120 120 120 120 120 120 120 
##$TP= (0..7)
150 150 150 150 150 150 150 150 
##$TP07= 0
##$TPNAME0= <>
##$TPNAME1= <>
##$TPNAME2= <>
##$TPNAME3= <>
##$TPNAME4= <>
##$TPNAME5= <>
##$TPNAME6= <>
##$TPNAME7= <>
##$TPOAL= (0..7)
0.5 0.5 0.5 0.5 0.5 0.5 0.5 0.5 
##$TPOFFS= (0..7)
0 0 0 0 0 0 0 0 
##$TUNHIN= 0
##$TUNHOUT= 0
##$TUNXOUT= 0
##$USERA1= <user>
##$USERA2= <user>
##$USERA3= <user>
##$USERA4= <user>
##$USERA5= <user>
##$V9= 5
##$VALIST= <valist>
##$VCLIST= <CCCCCCCCCCCCCCC>
##$VD= 0
##$VDLIST= <DDDDDDDDDDDDDDD>
##$VPLIST= <PPPPPPPPPPPPPPP>
##$VTLIST= <TTTTTTTTTTTTTTT>
##$WBST= 1024
##$WBSW= 4
##$XGAIN= (0..3)
0 0 0 0 
##$XL= 0
##$YL= 0
##$YMAX_a= 431231
##$YMIN_a= -570945
##$ZGOPTNS= <>
##$ZL1= 120
##$ZL2= 120
##$ZL3= 120
##$ZL4= 120
##$ABSF1= 16.522
##$ABSF2= -4.171173
##$ABSG= 5
##$ABSL= 3
##$ALPHA= 0
##$AQORDER= 0
##$ASSFAC= 0
##$ASSFACI= 0
##$ASSFACX= 0
##$ASSWID= 0
##$AUNMP= <proc_1d>
##$AZFE= 0.1
##$AZFW= 0.1
##$BCFW= 0
##$BC_mod= 0
##$BYTORDP= 0
##$COROFFS= 0
##$CY= 12.5
##$DATMOD= 1
##$DC= 0
##$DFILT= <>
##$DTYPP= 0
##$F1P= 14.0000005364418
##$F2P= -0.99999901652339
##$FCOR= 0.5
##$FTSIZE= 32768
##$FT_mod= 6
##$GAMMA= 0
##$GB= 0
##$INTBC= 1
##$INTSCL= 1
##$ISEN= 128
##$LB= 0.3
##$LEV0= 0
##$LPBIN= 0
##$MAXI= 10000
##$MC2= 0
##$MEAN= 0
##$ME_mod= 0
##$MI= 0
##$NCOEF= 0
##$NC_proc= -2
##$NLEV= 6
##$NOISF1= 0
##$NOISF2= 0
##$NSP= 0
##$NTH_PI= 0
##$NZP= 0
##$OFFSET= 16.522
##$PC= 1
##$PHC0= 158.2599
##$PHC1= 3.147295
##$PH_mod= 1
##$PKNL= yes
##$PPARMOD= 0
##$PSCAL= 4
##$PSIGN= 0
##$REVERSE= no
##$SF= 250.13
##$SI= 32768
##$SIGF1= 0
##$SIGF2= 0
##$SINO= 400
##$SIOLD= 32768
##$SREGLST= <1H.CDCl3>
##$SSB= 0
##$STSI= 32768
##$STSR= 0
##$SW_p= 5175.98343685301
##$SYMM= 0
##$S_DEV= 0
##$TDeff= 65536
##$TDoff= 0
##$TI= <Analysis number 999999
Compound Code 99
Book Reference 9
Project Code 9>
##$TILT= no
##$TM1= 0
##$TM2= 0
##$TOPLEV= 0
##$USERP1= <user>
##$USERP2= <user>
##$USERP3= <user>
##$USERP4= <user>
##$USERP5= <user>
##$WDW= 1
##$XDIM= 32768
##$YMAX_p= 373429171
##$YMIN_p= -18356
$$ End of Bruker specific parameters
$$ ---------------------------------
##NTUPLES= NMR SPECTRUM
##VAR_NAME=  FREQUENCY,     SPECTRUM/REAL,   SPECTRUM/IMAG
##SYMBOL=    X,             R,               I
##VAR_TYPE=  INDEPENDENT,   DEPENDENT,       DEPENDENT
##VAR_FORM=  AFFN,          ASDF,            ASDF
##VAR_DIM=   32768,         32768,           32768
##UNITS=     HZ,            ARBITRARY UNITS, ARBITRARY UNITS
##FACTOR=    0.157963299565203, 1,           1
##FIRST=     4132.6476996994, 0,             0
##LAST=      -1043.33573715361, 0,           0
##MIN=       -1043.33573715361, -18356,      0
##MAX=       4132.6476996994, 373429171,     0
$$ Real data points
##PAGE= N=1
##DATA TABLE= (X++(R..R)), XYDATA
$$ [...]
17260a336j835k693mK37J587M228J649k846j109q37O81N46J916N323l599m127
17244b219r53n59O568J013k241k391M91r61k815J354L437K025l528j544m44j201
17228c968Q95N489K297Q71j910k188K141K268J488J5l729R54R83l683J271L372
17212F566k23n614m352o42L224O59Q84J130M034L50l307o62R88p60R02K306j297
17195D186J014K297L31l482m915n205L453K481R51m931J408J848r45j710r3N855
17179B543J375j256k738p65J901r0k084K301q54k722O50k305K709K805M61K064
17163C995q37j433n820J312N439j32K29M718N984K21m493M43j754j826l200n92
17147B254M518L25j291l62j861o18N19m22M134k583j387j950j658K896N215K850
$$ y = [-1336, -3171, -5864, -5868, -5631, -4044, 184, 1833, -1013, -2122, -2959, -2278, -1732, 184, 5507, 1908, -2219, -3172, -3731, 2837, 3850, 1609, -782, -291, -1252, -4067, -2713, 724, 2749, -779, -2323, -2767, -3968, -3073, 2416, 4713, 5584, 3674, 1486, 3627, 5895, 7383, 7398, 3669, 4623, 5606, 1923, 3194, 6566, 6343, 729, -3623, -4265, -1041, -382, 502, 1632, 5666, 6016, 2709, 2047, 3035, 2275, 3177, 5483, 4186, 5200, 7497, 7828, 4346, -569, -5774, -2321, 160, 1111, -3820, -2412, -564, -1509, -3219, -3312, 2543, 3918, 2662, -76, -841, 1060, 970, -1114, 1187, 333, -2389, -1739, -4044, -1335, 1470, 1931, 3995, 3158, 1725, -4095, -2783, 2656, 2524, 2753, 7471, 13455, 13676, 9183, 9626, 7872, 6046, 2846, 2254, 6772, 7097, 5806, 5444, 3583, 2965, 3484, 3062, 7196, 4613, 3226, 1276, -382, 2514, 7729, 10579]
17131A0579j373p897m39k02J106n45p05o95O77J709j170K4k52L347M927K930J36
17114A2157k303m013m274k447Q78L043M900j0o66J984j378j087k099q7K039O137
17098A2774M221q46n543p325k370K020J950O36J742K102l528k824o12p99l333
17083a735J158K040N03Q79k296n35J824k209J214k90l559M741K437j559m279j261
17067b927o85k69k075j906j062J824K925L539k374r15j225M822L052M443j867
17052E300n643K792q95n94O43j738k751J006n116RK733j27K92P73Q31J48j649
17035c986l052P3J466J369L585n2j429R44L858L514m080L98p12P65L554q77j077
17018D261k065k214k532N63M33k825J803N857n01k563n42j925J041k893j464j821
$$ y = [10579, 9206, 1309, 870, 668, 1774, 1229, 524, -171, 506, 2215, 1045, 1069, 817, 4164, 9091, 12021, 12157, 9854, 5841, 1567, -880, -2, 3041, 7941, 7931, 7265, 9249, 7871, 6784, 4685, 4598, 6637, 12774, 16995, 16149, 10606, 3281, 911, 2931, 4881, 5517, 7259, 9361, 5833, 3009, 2397, 1598, -1735, -577, 1463, 1966, 2845, 549, 14, 1838, -371, 843, 553, -3006, 1735, 4172, 2613, -1666, -2927, -3612, -3881, -5956, -7862, -8924, -7100, -4175, -636, -3010, -3925, -5150, -328, 2724, 7167, 5300, -343, 2449, 1554, 960, 1603, -135, -2886, -1880, -6996, -6987, -4254, -4381, -4089, -3316, -2485, -2337, -3986, -7038, -6965, -5499, -4130, -545, -597, -2026, -1082, 2776, 6290, 2210, 2608, 1896, 2661, 6215, 5338, 4261, 2196, -18, -2550, -1987, -1554, -4379, -2576, 3281, 2780, 217, -325, -2250, -1209, -4102, -5566, -7387]
17002g387n85L747K155N4J5R46K40K242L867o80k77L11j237J838k5m058j097m175
16984d106k198J134L056M98q60J353m017j620L496K245m86j744k703l505J675
16969g782J674k91J883j707j343J243o02P78J118L003J117m77l032o37J292K482
16953a281k580J06L666q60l644l287L879K844j043k098J52L274O515l632n193
16938c182r2L449l614l52J446m38k74P05k76J509k656r24K598L168j062QM218
16921D231J269j843m800J080J767r9j857J631K937j215m791J625n71M994J226
16906E584l281Q49P66n72j34k85k099l439K644M086j346J495O10K349p61j756
16890D710k093j920J014Q63n1K7k227k927k907k792L087M059j683N162j851m693
$$ y = [-7387, -7972, -4225, -2070, -2016, -2001, -1055, -815, 1427, 5294, 4614, 4337, 4648, 3411, 5249, 5224, 1166, 69, -4106, -6304, -5170, -2114, -1616, -2476, -1123, -5140, -6760, -3264, -1019, -1505, -3249, -5952, -9457, -7782, -6108, -6399, -4516, -6223, -7566, -6323, -6925, -6147, -5029, -2026, -909, -1386, -4418, -5055, -3763, -1281, -3861, -3755, -89, -949, -4593, -7880, -4001, -1157, -2200, -4298, -4146, -872, 5643, 2011, -3182, -3274, 175, -3439, -3791, -2345, -2783, -3057, -2352, -2628, -1119, -3775, -4699, -2101, 1067, 5, 13, 4231, 5500, 3657, -1143, -63, 1704, 1605, -252, 1379, 4316, 3101, -1690, -65, -636, 4358, 5584, 2303, 3152, 3918, 3346, 3212, 2927, 828, -2611, 33, 4119, 2773, 4268, 4878, 7227, 6466, 4710, 2617, 697, 1711, 2574, 2523, 2550, 323, -2604, -5511, -8303, -5216, -1157, -2840, 2322, 471, -4222]
16874d222O7J252l561k779L536J628o42KM203N403l940n621j156L665K952k996
16858b209j452l330j570K696j964j618O1M125N297K787J98m891n079K62L813L086
16842B12K185j161k055j087M032K329j375m125l107l787K127K758j430n17j643
16827f644K414J178J475K95M80l822l69j247j41k748J071Q133L168m94j656k038
16811i45k377M75M83k753k338K80J027K499O058p53k54j729l946K440K675J257
16795B099k063O2M24l583J658l40K565K556p18k64r8k526j547K50k238p8r43k131
16777f915J744j606L825O018P7n56j297k195K120k431R62K54N36P16L00J956L447
16760F955m596k242l731j800M425K964l567k712m11O06M0J677O42K089K167o479
$$ y = [-4222, -4155, -2903, -6464, -9243, -5707, -4079, -4721, -4719, -516, 4887, 947, -4674, -5830, -2165, 787, -2209, -3661, -6991, -8561, -5865, -7829, -9447, -9386, -5261, 36, 2823, 3021, -1870, -6949, -6687, -2874, 212, 2397, 1236, -819, -1906, 2126, 4455, 3080, -1045, -4152, -7939, -5812, -3054, -4484, -5001, -6644, -4230, -3052, -1577, -1282, -802, -4624, -4993, -6240, -6381, -9129, -8058, 75, 3243, 2749, 1093, -945, -3322, -2847, -2364, -5117, -7455, -7175, -6148, -3649, 2409, 1656, 1402, -327, -4273, -1833, 842, 2099, 36, 98, 522, -3061, -1403, -1743, 822, 3378, 2660, 2396, 2298, -228, -1775, -1525, -3763, -3841, -4784, -6915, -5171, -6777, -2952, 3066, 3143, 2587, 1290, -905, 1215, -1216, -254, 0, 536, 1252, 1552, 3508, 6955, 2359, 117, -3614, -5414, -989, 1975, -1592, -4304, -4715, -4109, -4069, -2392, -1750, 339, 2506, -3973]
16744c973m534N02J428J509j408r34K882K826K963L88k786o601o246j1J863L616
16728h516J338k417R68M612J562o22k574J936j00L462L147j222l658M92n18Q73
16712a237J094k601P97m761l223J359K757J736N307O74m093j995k183K292N726
16697A649J979K066q34k977j415R60L06k741j058p22j400L091J399K765o92r06
16681A470k66M397n77K990L931J538j446m201O7J136M90l064K96j731L85J96q55
16664D756j232K289L36k337j891k69j401m504k088N078K971j894J019k668j87
16649b022K088N51k754l824l06k693l151O2L792L235Q44J042k466K0P6m91k93
16632f290M65n99K871J163j044L740K02J430K754K460k533k025j262L34j59K0
$$ y = [-3973, -8507, -8005, -6577, -5068, -6476, -7410, -4528, -1702, 1261, 1649, -1137, -7738, -13984, -13995, -12132, -8516, -7178, -9595, -8627, -4015, -2453, -3075, -5649, -3713, -3813, -351, 2796, 1574, -2084, -1592, -2110, -1237, -143, -2744, -1947, -6708, -9931, -8572, -5815, -4079, 1228, 1902, -2191, -4186, -6369, -4077, 1649, 3628, 5694, 4860, 1883, 468, 1428, 1734, -1007, -2065, -2787, -4187, -1096, 303, 3068, 2376, 1470, 1204, 5601, 5024, 8014, 11945, 13483, 12037, 7836, 7903, 9039, 9529, 6465, 6761, 5030, 5415, 5611, 4756, 3524, 5813, 6149, 3812, 1921, 1652, 251, -4253, -6341, -1263, 1708, -186, 833, -1835, -2022, 66, 617, -2137, -5961, -6267, -8960, -12111, -12049, -8257, -5022, -4178, -3136, -5602, -5582, -5506, -5997, -6290, -5825, -6424, -3553, -2390, -3434, 306, 508, 1938, 4692, 7152, 4619, 2594, 1332, 1666, 1507, 1527]
16616A527K26N071L590J129m278l285l254l566L99M264o74k044p85m709K97J288
16600d804r22k273Q28K749J09k561m443K850M781K907M61j020k097m93P24m375
16584g579l235L76M618p5P24n14J774L107J365j071K032K467J266O81m72J284
16568F748m551J060q27m453k427Q86K81J803j798m34Q55k474Q5K004K695K06n
16551c46k266J536P91L03Q50J544l940J184j54o89M59K287p94k812j62K484l320
16534c045l111j043L383M404k285J043k519n622k67K031J759L177m828J525K974
16519b424K82M99M743J687K349J657k131j322P40J878J189k725m365l237m062
16504e242K279J85q52K207j266r08j030L238J50k411j244k252J896J491N69J832
$$ y = [1527, 1753, 6824, 10414, 11543, 7265, 3980, 726, -2840, -2441, 1823, 1149, -895, -1680, -6389, -6092, -4804, -5726, -7999, -7171, -4422, -4313, -6874, -11317, -8467, -3686, -779, -318, -1338, -3435, -3928, -3204, -7579, -10814, -10438, -5820, -5895, -5171, -5685, -3911, -804, 561, -510, 1522, 3989, 5255, 5936, 5464, 6748, 2197, 3257, 2430, -2023, -4450, -3564, -3283, -1480, -3278, -3712, -2857, -5331, -5246, -3242, -547, -341, -346, -2612, -1076, -285, 18, 868, 2412, -1528, -344, -498, -1187, -728, 1559, 765, -2047, -2209, 275, -3045, -6156, -7199, -3816, 588, -1697, -654, -3173, -8795, -9062, -7031, -5272, -2095, -6923, -5398, -2424, -2142, -1643, 3100, 4787, 7136, 8793, 6662, 5340, 6080, 7958, 9147, 6422, 2057, -1180, -5242, -2963, -2778, -3630, -1423, -2689, -3597, -4627, -1389, -1239, -3650, -4894, -7146, -5250, -3759, -3190, -1358]
16488a358J830L122J820l350o036l024R27L855J957j237j162J118K710K577j885
16473A864l284k742n76p95j104L326Q140J078j729k469j896j522o26n25J498n87
16457a949l478k193J131O107M518l57J846k998m151M79P14l421l497L458L084
16442g07K194O5j698O16K835M734l582k902j107Q12j347k535K590m60MO43j657
16425a502o187R05L758l9N81M655n113j359j453l35l6k22N267J968p39p05j795
16408b351k87k882J033j598j611K935J740n17R39j93L45r53k34l7k175j756K580
16391e022K530Q28J032j044L559K046J53k657p11k562m029J27M000K386J952j165
16375A423k43k716j336J643K246N16R74J814n700J006m769m505j181L625N289
$$ y = [-1358, 472, 3594, 5414, 2064, -3972, -6996, -6069, -2214, -257, -1494, -2656, -1538, 1172, 3749, 1864, -1420, -4162, -4738, -5533, -6637, -3311, 4829, 5907, 4178, 1709, -187, -1709, -2335, -2860, -1362, -1949, -5427, -7620, -6489, -382, 4136, 3779, 5625, 2627, -1524, -1045, -331, -3752, -7249, -3791, -707, 1487, 1552, -146, 470, 3305, 8039, 4457, 1555, 448, 1260, -87, -2622, -32, -492, -488, 155, -1502, -7689, -6784, -3026, -3065, -2484, 2171, -2942, -4301, -5754, -6089, -6125, -6347, -1080, 888, 149, -556, -2351, -2638, -5520, -4487, -6085, -7696, -4761, -3021, -3538, -2599, -2792, -2447, -3400, -3634, -3671, -5846, -7602, -5022, -2492, -1664, -632, -1676, 1883, 3929, 4082, 1425, 714, -1848, -5877, -5750, -1750, 636, 2588, 1423, 1180, -1536, -2872, -1229, 1017, 1533, 2507, 4321, -1379, -373, -5142, -9647, -10828, -7203, -1914]
16360a914j167k613j033M143N35J276p80l075k808k09N454L430k42n097p656l127
16344a4883J490K815K580o86k925k576l000J307L664L923M428l295m27N01L36
16329f748K711k919k565N556M116r76o58R02m779j496L651N29l343p86o18L035
16313d388P85N661k931l255j649N574K132L38q78l776N251M635p793k147K9R65
16297a447O65j144o057j186L776O903L865l624l655l426J910J379K494n24J452
16282A381m257k515L019L509r58p099l183J222L783L600j247j103M69j482J722
16267c139j752l93n02k16J649R84N811j143N22O97L12k638p45n097J874J019j05
16250b862K38l144k745N207J595K63K902n35k009J960r40k552o18J881j206j347
$$ y = [-1914, -3081, -5694, -6727, -2584, -2049, -773, -1553, -4628, -7436, -7645, -2191, 1239, 997, -4100, -11756, -14883, -13393, -10578, -7998, -8684, -11609, -14185, -17185, -15878, -12214, -8291, -3863, -7158, -7585, -7084, -6748, -4037, -6956, -9521, -3965, 151, -825, -1483, -581, -5360, -6856, -3205, -2676, -6019, -6805, -7423, -4388, -3603, 2058, -873, -4128, -5777, -203, 1929, 2267, 1389, -2387, 2864, 7499, -294, -2441, -2412, -1447, -782, -1926, -7983, -9169, -5393, 1510, 5375, 1751, -1904, -5330, -3420, -2041, 453, -71, 1381, -2876, -5391, -2372, 1137, 179, -6920, -10103, -8881, -5098, -1498, -2745, -3848, -3379, -4861, -3139, -4891, -5284, -5786, -6002, -4353, -3369, 2442, 1299, 1821, 2518, 2830, 192, -553, -5650, -3776, -2757, -2862, -2624, -5768, -8513, -3306, -1711, -1448, 1454, 919, -1090, 870, -70, -2622, -3240, -1359, -2565, -3912]
16234c912k426P99N65j351K167J47J28M000R29L0J134j79j563j175r3j031J053
16217g78j530J21k105J666j848k313j807N001M451l163l680Q35r76m432o86K762
16201h482O397O165K334j453k614l383k111k825L04M795j088m803J64L087J042
16186b471k171L589n62m92J365P21j15q97J661K852L897K17l191J754k04J434
16170G387l794l297Po33K135N301l904k632J455m557j389m033m013K485O684L708
16154I10J159j884k077l739l50j412M36M778k39l807J124K877M195O53R10m834
16138a300l151K117J820J294N253m836k579J260J680q24J764l518p527P21M357
16123c469M407M012K94m332j682J337j932m88j251p98p70K582J973j287J034J723
$$ y = [-3912, -6338, -5539, -4974, -6325, -4158, -4011, -3883, 117, 1046, 1076, 2210, 2031, 468, -707, -800, -1831, -778, -2308, -2187, -4292, -2626, -4474, -6787, -8594, -3593, 858, -2305, -5985, -5150, -6126, -10558, -11244, -8482, -2085, 4080, 6414, 4961, 2347, -1036, -3147, -5972, -5668, -873, -1961, -6764, -6600, -3513, -2471, -4642, -1053, -1615, -2107, -742, -21, -136, -1033, 628, 3480, 7377, 7594, 4403, 6157, 5953, 7387, 3593, 296, 303, -330, 1805, 7106, 3202, 570, 2025, -2532, -3921, -7954, -11967, -9482, -2798, 910, 2069, 185, -1892, -5631, -5981, -7393, -6957, -2179, -2418, -6225, -5101, -2224, 1971, 2624, 3534, -1300, -4451, -2334, -514, 780, 6033, 1197, -1382, -122, 1558, 734, 2498, -1020, -8547, -7826, -3469, 938, 4950, 5244, 912, -770, 567, -1365, -1853, -3104, -3902, -4672, -2090, -117, -1404, -370, 1353]
16107A353m62M03k87k256k65M290l246j710j997M53k189n62M734J964m769Q53
16091c693q65K99M563M671l578K95J472J640R71K650k085L88O7Q51M66k000Q18
16074F930J204l526m865k292k089k484q13J973J761K418L106k89j817J959L022
16059D198j628k762k736J879m052j246O010Q3l811l701K334K486l75j794K12M046
16043h57J252m648R00k586l82K107M214P10J205L122p31n549l257L142K297k422
16027a483k352j283K47r51k235j77J220M139j246o17l07r3N73k81N775L109J660
16010E698j926j686j338o23O2r65l131j804j381l43M538J740k178m018L767o9
15994c657L097K904k334l132m41p96j376J93j180K904O318j428K948j932p349
$$ y = [1353, 891, 1294, 1007, -1249, -1514, 2776, -470, -2180, -4177, -3724, -5913, -6475, -1741, 223, -4546, -3693, -4558, -4259, 304, 4975, 1397, 1692, 3164, 4804, 5775, 8425, 6340, 6728, 6795, 7646, 8112, 6112, 6930, 8134, 4608, -257, -2549, -4638, -7122, -7935, -5962, -4201, -1783, 1323, 1034, -783, 1176, 4198, 2570, -192, -2928, -1049, -5101, -6347, -337, -254, -4065, -7766, -5432, -2946, -3321, -5115, -4903, -857, 395, -4253, -3353, -5939, -6321, -4214, 0, 710, 1915, 5037, 4306, -1243, -4500, -1358, 939, -1483, -3835, -5118, -4871, -5822, -8057, -8234, -7014, -2875, -4121, -4738, -5045, -5138, -4565, -4846, 929, 4038, 5698, 3772, 2086, 748, 125, 187, -778, -3909, -5713, -7094, -7437, -2899, -1159, -3337, -7355, -3588, -3657, -560, 2344, 10, -3122, -3563, -4359, -5735, -5542, -6722, -3818, 2500, 1072, 4020, 2088, -5261]
15979e261n1q4k504q24k415J258J989J228K029J849N05P30j918K558M8l006K256
15962a613q71J404o32M288J976m19j500m48L973K663l357n249n086K21N634K546
15946C530R33n519l44J090K901j61j472j000l266L165l453m012l493p98J069O25
15930a0205M98K367M007M659J039Q0J418l594l358N668L575j530p882m772N849
15915b181M432J369J28p658l407M76J000K565J681K967o03l3j175J318K14K7K69
15898A389j566K084J392l46k474m063m329k022k758M467O182k337Q32M916P76
15883B143l972j152J958K556j514o638l190J166L221j130J086j904j129l91J391
15868g499K192r28j66K337Q81N136L176Q7m34j954o423k530j158J842L727M808
$$ y = [-5261, -5312, -5396, -7900, -8724, -11139, -9881, -7892, -6664, -4635, -2786, -2281, -1551, -3469, -911, -863, -3869, -1613, -2484, -1080, -1712, 2576, 4552, 4133, 2633, 2185, 6158, 8821, 5464, 215, -4871, -4650, 984, 3530, 4463, -1056, -1400, -310, 2591, 2430, 958, -42, -3308, -143, -3596, -7608, -11101, -11899, -10830, -10205, -9707, -7340, -3333, 1326, 2365, 2445, 3863, 269, -3089, 2579, 6154, 4624, -3258, -8030, -2181, 2251, 3620, 3748, -3910, -7317, -6841, -5841, -3276, -1595, 1372, 769, 736, -439, 879, 1093, 1120, 1389, -177, 1907, 3299, 2953, 479, -3584, -7913, -9935, -12693, -8226, -2044, -4381, -3549, 1367, 2143, -1829, -2981, -1023, 1533, 19, -6619, -9809, -8643, -5422, -6552, -5466, -7370, -8499, -8890, -7499, -5307, -6235, -6401, -4064, -3183, 1953, 5129, 5216, 4782, 2828, -3595, -6125, -7283, -5441, -1714, 3094]
15852C094m550n255m350K72L510N202N415k110q77K065j481J904k87J704l551
15837G05j255p1L502p97k241P63k500J639j740j150m56K109L52j035k270o37K372
15820b710P42k630J827L51J421K896R28k362n72K713j351o62K383K105k14k056
15804B809l502k57N427P97l361m131l873L391L505m487k355K234j084K763j419
15789c543j540K49L404J28j450N52j35k312l91N51n77N76K633q79m628j30q2L604
15771c970M24j923N79L27K171l278K071M739N06j840J785r9Q70k475j157n93O19
15754a244n662j059K361J907O57K156j898O04k222L108p00j019K322L274J68j433
15738A320L068K919L556L246Q81j903j764l606O95l017l035l52K26j24k678J801
$$ y = [3094, -1456, -6711, -11061, -10789, -7279, -2077, 3338, 1228, 351, 2416, 935, 2839, 2552, 4256, 705, -550, -621, 2881, 2084, -157, 606, -1894, -255, -1995, -3145, -3601, -1492, -1140, -2175, -4445, -5082, -2710, -1968, -4598, -2771, -2420, -999, 1897, 2825, 463, -109, 2604, 1253, 591, 2974, 5079, 4865, 2809, -693, -950, 4477, 5274, 1913, -2218, -6091, -2700, 805, -3682, -6037, -3803, -4887, -2124, -3543, -5083, -4834, -1430, -1302, -2752, -2200, -2335, -4647, -5038, -4487, -5064, -4488, -1855, -2734, -7362, -7492, -7574, -3970, -3546, -5469, -4890, -4563, -2392, -5670, -3599, 1140, 1646, -194, 1591, 1492, 2362, -113, -1270, -1863, -1244, -6906, -7965, -5604, -3697, -3040, -884, -2782, -2178, -4400, -1292, -1992, -3011, -689, 2585, 2753, 1320, 4388, 7307, 10863, 14109, 14990, 13087, 11323, 7717, 8412, 5395, 2360, 2008, 2234, 2110, -568, 1233]
15722A233M96J862k934n360l7L92j280j668p34R26J513O94k591J797M811L62r89
15705a507M869K782L274R21m108M44K370k497J631L207K541P140K100n222j187
15690A6758l711n94K909o98m800j329j906N67K08j069l759L96l642l838M13L326
15674g69N570K728m137p25K047N02j54K63k334K58R11n25Q46L06K146o76k865
15657C392M697K751K72N44K061K826o3J293K946k245o283m490o36k283J62K411
15641G355K5m62j320j313k870k301M455R92K72K352r51m937k571K562O86n086
15625c112j126K981R8K154L499l217L752K010k788M28j218K640O90R74K13R22
15609H900n187k710K134R22J81j697L303K158m229k065p35J448l271N66M349J398
$$ y = [1233, 1729, 3591, 657, -4703, -4740, -4348, -5628, -7296, -8030, -7104, -5591, -4897, -7488, -5691, -880, -518, -1507, 3362, 6144, 9418, 10339, 6231, 6675, 9045, 6548, 8179, 11386, 13927, 21067, 23167, 17945, 16758, 13047, 12453, 15362, 14664, 9864, 8535, 6629, 7196, 7404, 6335, 2576, 2972, -670, -4508, -4095, -769, 4801, 7529, 3392, 2667, 4714, 5216, 5062, 5325, 2991, 3249, 4160, 3635, 4481, 4787, 6933, 6257, 3392, 8089, 10840, 11112, 11656, 13717, 16543, 16480, 17773, 20719, 18474, 12191, 7701, 7065, 4782, 4944, 7355, 7380, 6918, 5598, 4285, 1415, -886, 3569, 4561, 4833, 7185, 6234, 1297, -1274, 1288, 1974, -3112, -4238, -1257, -1159, 995, 4494, 1277, 5029, 7039, 4251, 4679, 3461, 6101, 6791, 7765, 7978, 8900, 3713, 1003, 3137, 4059, 4240, 2543, 5846, 8004, 3775, 1710, 975, 2423, -848, -282, 4067, 5465]
15593E465r15k090m321j99L55R88qm021j973L901K079K212k827j657Q23K992L849
15576D653L259j610l033k555j163k652J800M505J166k252K829K521m789l822j713
15561b856J538K115j291K168j549k705k37J062N030k243j801L67Q04J617l110
15546a091k002l38l924M030L065K67J021k209l471k633O10K413K254K272k219
15531a955K01j972k241m45Q83L311Q89K242M788n869o959J719J155J588N937L34
15515C606k68j950j591m587R66M806p74n784n448k483k095N693j504L378K901
15500e134L631K538K740j017rk159j518K758O93m479m484J85l30K96j28L627j338
15483d128J672J68m05j19L782J098l525l305k597J923M195l156K494K286P12j782
$$ y = [5465, 4550, 2460, -1861, -2060, -1705, -717, -725, -4746, -6719, -2818, -739, 1473, -1354, -3011, -2188, 804, 4653, 7912, 6302, 3269, 714, -449, -3101, -1301, 3204, 4370, 2118, 4947, 7468, 2679, -1143, -2856, -1318, 797, -494, 1674, 125, -2580, -2817, -1755, 3275, 1032, -769, -402, 402, 2019, -1091, -3093, -3431, -7355, -3325, -260, 7, 1028, -1181, -4652, -7285, -6675, -4262, -2008, 264, -1955, -1754, -3726, -5967, -6412, -5529, -2218, -1329, 913, 5701, -168, -7127, -5408, -4253, -2665, 3272, 3606, 3338, 1388, -203, -4790, -3824, 982, 208, -5576, -11024, -13507, -15602, -9909, -11413, -8035, -5134, -1503, 1035, 3775, 2758, 2749, 590, -928, 1830, 2523, -1956, -6440, -6255, -6585, -6289, -6417, -2790, -4128, -2456, -2288, -2693, -2812, 970, 2068, -1457, -4762, -7359, -5436, -1241, -4397, -1903, 383, 1095, -687]
15467f87j380J328nk491j361K629K478m76p54J056J386J530K088K136j654l343
15451B480M48j258J370p9j709k696l611J792M320L205k323l842m168p6J919K672
15435a556m558k079j595M408M503o71j93Q82L348o353M56M039m696o019R13M866
15419d305p23K77q29l40N001J65n264j965K533o01k338K920N038L066r39p26l057
15402b087n365J659l08l26j299K273M749m46m647k710l170K543N354K901L99k525
15386c005P76p80j061M065k640m51K946j790l05m35j222R23K557J741m286l617
15370f584N105o49L256J999j130J010k296p016k181M868J705j033r06K556N48
15355g48q09p68J010K12k682J104n11J112K129r93p36q46K263J445k341o85K186
$$ y = [-687, -2067, -739, -744, -3235, -4596, -1967, 511, 35, -719, 337, 1723, 3253, 5341, 7477, 5823, 2480, 2928, 1670, 3040, 2961, 1252, -1444, -5055, -3263, 1057, 4262, 1939, -1903, -6071, -6147, -4228, -1556, -6114, -8193, -9788, -5380, -877, -1548, -1741, -859, 2489, -3864, -3408, 631, -4065, -10084, -9171, -4305, -5028, -4751, -5580, -5920, -919, -754, -6018, -7983, -5450, -6051, -8389, -5469, -431, 2635, 1696, 970, -2087, -7452, -5793, -6101, -6427, -7726, -5453, -704, -1150, -5797, -8507, -11677, -9134, -3780, -879, -480, -3005, -2229, -3009, -4070, -5, -2645, -3096, -150, -1940, -2245, -2680, -3902, -2979, -422, 1319, -2967, -6584, -1479, -2128, 1128, 3127, 1997, 3007, 711, -6305, -8486, -3618, -1913, -2946, -3852, -1296, -748, -1557, -2325, -1315, -1103, -3785, -2681, -3192, -2080, 49, -944, -1680, -2526, -263, 1182, -1159, -1844, 342]
15338C42l10j273j939m051L071M914k356l216k280N354R54k077M724J190p800
15323d753o645L229M216J665L40L852M51p054l501J170K341K855N252L312l515
15308C215k543n98j39K465J719p21n789l695k22J356k091J077K579K519K333J0
15292A475J74k308k871j892k32K778M087J077m239Q82l745k872k407j686L29R28
15276a0522M634M017p78n135j526k051l284L919N083N6k354j346L217K480L360
15261b30J231J298L70k058r95m198j767l343K023P681k412m784j454L521R5N51
15245d471k05Q2J129K729J115K296k355l02l084n008o48K375L3K281L143L074
15229B184l6k864l005K20L350j777k795k711k122Q3M754Q435O44l321l546j49
$$ y = [342, 32, -1241, -3180, -7231, -4160, 754, -1602, -4818, -7098, -1744, -790, -2867, 1857, 3047, -4753, -11398, -8169, -3953, -2288, -1948, 1904, 2355, -4699, -8200, -7030, -4689, -1834, 3418, 6730, 3215, 672, 74, -65, 2400, 4119, 3398, -2391, -6086, -6308, -4952, -7043, -5966, -3387, -868, 1465, 1475, 1649, -659, -3530, -5422, -5654, -2876, 1211, 2288, -1951, -1069, -4814, -7686, -10093, -11779, -11450, -10522, -5888, -1871, -2649, -7784, -9310, -11361, -14645, -10726, -5643, -5587, -7941, -9287, -6070, -3590, -230, 1001, 2299, 2669, 611, -384, -4582, -6349, -9692, -7669, 12, -2400, -7184, -8638, -5117, -5022, -4471, -4676, -4594, -3465, -736, 379, 2675, 320, 18, -3066, -8074, -8722, -6347, -6314, -4033, -890, 2184, 2148, -716, -3721, -3501, -151, -1928, -4723, -7434, -9556, -9473, -4719, 3716, 4360, 1039, -2507, -2656]
15213b656k582K98L142K88k357j672j084q4K420J093K337j370K708J566r36j038
15197G3k177J763K68P17k719q84l161J893K702l84K813K232J079l722k795K134
15181a68l919m735J199N880k692J435j663k00P75L973K007j859l981J129P78J203
15165h38L653Q83j719m550j900K997L116k660m575l922k101J757L631M67p59j262
15149g782j093J316P45J121K823J047R91k634L32L896K276l166Q5Q58R72L583
15133E370p3m807O8j59m242j449j397k549J251J92O209M061l155r23L259J389
15117C045j383l534k663l268m69L368L154J808j674k664N5J724L564J875L48j208
15101B078p27K376O13l669j232M05K84K730J928j928J706K650k473l790l744k45
$$ y = [-2656, -5238, -4940, -1798, -1510, -3867, -5539, -6623, -6707, -4287, -3194, -857, -2227, 481, 2047, 1111, 73, -2104, -341, -73, 644, -2075, -2959, -6120, -4227, -1525, -1909, 904, 3136, 4215, 493, -2302, -168, -4087, -8822, -7623, -1743, -4435, -3000, -4663, -4863, -4088, -115, 1892, 33, -3948, -2819, -2041, -838, 2815, 3698, 1979, -2571, -4471, -1474, 1642, -1018, -5593, -9515, -11616, -9859, -6228, -5761, -6520, -7782, -8875, -7559, -6814, -5693, -2870, -1823, -832, -3466, -3134, 762, 3038, -128, -43, 815, 1787, 5370, 5297, 490, 558, 399, -3843, -5292, -6689, -9238, -7987, -7795, -1586, 2475, -680, -1603, 1656, 3045, 1662, -1872, -4535, -7803, -8272, -4904, -1750, 58, -1616, -4280, -4225, -2501, 1063, 2938, 3286, 2078, 1351, 3727, 4340, 671, -561, -156, 128, 2858, 4786, 2858, 4564, 7214, 4741, 951, -2793, -3038]
15085c038j99R66Q92K461l504j303J09J587r11J121M572J104J00p48l337l959
15069d087K767K996j610q06K74Q48l127p219p14J762q57J936N214k72l927Q79
15053e943N604l88l215j936M407L682J055J842n04o185l079K640J564r99p18O01
15037a572K125r97k453J551L921j719j566K378M50j269l794m601J582L360j842
15022d446k36k542Q80J72N676p82j405L22k19k073J711r51N713j714l778l470
15006g142J243L194K101l505l607n85J805L685M764K205q04O90R19j562m58k919
14990B4j020j016J709Q93k485J953l063o405N58N379L267N354j376n54k833m169
14974c784J000M172k804m40k542k995Q79K482J088K299K271l862l210k611m16
$$ y = [-3038, -3237, -2271, -1379, 1082, -2422, -3725, -3616, -2029, -2940, -1819, 2753, 3857, 3957, 3209, -128, -4087, -1320, 1676, 66, -740, -466, 382, -2745, -9964, -10678, -8916, -9773, -7837, -2623, -2895, -6822, -5943, -339, -727, -3942, -5878, -1471, 2211, 3266, 5108, 4604, -1581, -4660, -2020, -456, -1455, -2173, -1572, 553, -444, -2897, -1346, 2575, 856, -710, 1668, 2118, 849, -2945, -7546, -5964, -2604, -4446, -4682, -7224, -6344, -6172, -496, -1278, -2683, -2361, -2580, -4653, -2942, -3893, 1820, 106, -3672, -7142, -5899, -2705, -604, -4109, -7716, -8301, -6496, -2811, 1953, 4158, 3354, 4044, 4963, 3401, 2943, 24, -996, -2012, -303, 590, -1895, 58, -3005, -9410, -8852, -3473, -206, 5148, 3772, 3218, 385, -3784, -2784, 1388, -1416, -1856, -4398, -7393, -6514, -4032, -2944, -645, 1626, -2236, -5446, -8057, -8473]
14959h473L8K976M029L77o358k518P49M906L388K061M8l526L724L483P950Q966
14943B1820J060n519p562l000j505p68k342n68k268j43j928O58L746J472l903
14928g50j352j760M08k69m285L145M22k556P24J219L333P29O87K123j696n22j342
14911a742m835j681K643L113K459k411k042L611N27j674j401p15K830L30l33p97
14895b118J767N614k781j543l517j408k19k736K54K619k74m38j869J439P021N77
14879B388l98n119o97r92j232O501J337O43Q94n09k30j52q74j512m341l07P33
14862c867k211J317k057l4k838j891N01K023Q83J358J732J163J002j85k177j135
14846f416K200j95P86N23m834j081K865J636q22r46M198L209k829k94k9j240k535
$$ y = [-8473, -8435, -5459, -1430, -1053, -7411, -9929, -9180, -4274, -886, 1175, 1223, -2303, 1421, 4904, 12854, 21820, 22880, 17361, 9799, 6799, 5294, 4526, 2184, 1616, -652, -795, -2723, -2065, 1681, 3153, -750, -2102, -3862, -3454, -3723, -8008, -4863, -4441, -6997, -6273, -5054, -1721, -992, -305, 1818, 122, -400, -1742, -6577, -8258, -5615, -2502, -43, -2454, -4496, -885, -358, -2032, -3433, -4148, -1318, -988, -1321, -2118, -351, 5263, 2482, 939, -2578, -3986, -4205, -6941, -6687, -4068, -4342, -4780, -6649, -5210, 1811, 2388, 1990, -3129, -3826, -4818, -6050, 451, 1788, 2431, 3325, 2816, 2586, 2434, 1560, 48, -4293, -4600, -3867, -6078, -4761, -6818, -6852, -9690, -11581, -11080, -9057, -8174, -6816, -5084, -3921, -2919, -3104, -5281, -6416, -4216, -4411, -3625, -3102, -7936, -9017, -6152, -4516, -5338, -6284, -2086, 1123, -1706, -2000, -2029, -3269, -5804]
14829e804k116P14N022J190l12j262l192J709J170l54N093K71l200p70o75k265
14813d781k246k815j870L403M035J946J04l730R53j247l806K402L235K824M39
14798a154O69j633J966R93j538n613k021N074J414J82K842J7m27k659k847l111
14782g846l6j605K629M645M316L4K705R82k101r99k782o519j9L863M879J480j811
14765A815j585P82k813J754K477P0l932l987K293M90j385L087K907PO45o6k728
14748a69o007n90L921J474k971l145j388L471M456M197J7L348R18j002l023k882
14732F25o19K802K54k537l278L094J142o283j008J892K649o41o61j998J152J919
14716a496K869M229L90m106k869j481m589j756j390O089O99j11M179l27o81j78
$$ y = [-5804, -7920, -7206, -2184, -994, -1306, -2568, -5760, -4051, -2881, -3235, 1858, 2129, -1071, -1841, -2516, -4781, -7027, -9842, -11712, -8309, -4274, -2328, -2224, -5954, -5001, -6248, -10054, -7652, -4417, -1593, -1154, -485, -2118, -152, 841, -697, -6310, -8331, -3257, -1843, -1661, 1181, 1198, 771, -1888, -4735, -7846, -7882, -9487, -6858, -2213, 2103, 2137, 4842, 5824, 3723, 2724, -58, -6577, -6596, -2733, 2146, 3626, 1815, 230, 1012, -1801, -47, 2430, 2500, -1432, -5419, -3126, -2636, -4021, -934, 1973, 1980, 2625, 2559, -169, -6176, -6766, -2845, -1371, -4342, -7487, -8875, -5404, -948, 3249, 3266, 6614, 7532, 6530, 3507, 625, 6, 2808, 3062, 525, -2753, 341, 1483, -4800, -5808, -3916, -1267, -1908, -2569, -4567, -3415, -1496, 1373, 5602, 5992, 1886, -983, -2464, -7053, -8809, -10199, -4110, -3411, -3522, 657, 330, -351, -529]
14700e29l017r27j819J398M057K389L327K228j083m436l997M501N507J811l939
14685E471k866k279J264j73l343J596l925l320j596m6K028p23K815K531K545K11
14669A90P85J547o98L829L005l195K11l266k218L066J255k387j341L383M079q94
14653G351M45L494j370k457k801J967k032k728l172j356K061M19Q67k532L646
14638A802K869q59k34p50n991j957O131L466j403n999r67M205j859J737o72J907
14622A426P88N92k01j135J062O37q07r47j820j274p59L11O950L246J355l516j791
14605D117K269O98L010m85j015j535j795L798O39k723o80k150k428j716l332j36
14589c464P6L424p51l238K620M279k713n642M42L650L913j879n246q05M609N35
$$ y = [-529, -3546, -4473, -6292, -4894, -837, 1552, 4879, 7107, 6024, 1588, -2409, 2092, 7599, 9410, 5471, 2605, 326, 1590, 1417, -1926, -330, -4255, -7575, -9171, -9217, -7189, -7912, -5097, -2566, -21, 190, 975, 2522, 1824, 5653, 8658, 5463, 5674, 2408, 190, 3256, 4511, 2124, 783, 4166, 8245, 7351, 7796, 11290, 9920, 7463, 4662, 6629, 4597, 1869, -1303, -2659, -598, -179, 688, -1844, 1802, 4671, 3812, 3578, 2828, -3163, -5120, 1011, 4477, 3074, -2925, -3892, 313, -1546, 191, -481, 1426, 2214, 2806, 2605, 1470, 2532, 3169, 2362, 1415, -405, -1679, -2438, -2127, 4823, 8069, 9424, 5908, 4117, 6386, 7084, 10094, 9609, 8594, 7059, 5264, 9062, 9701, 6978, 6298, 4148, 1720, 4, -3328, -3464, -3388, 36, -715, -3953, -1333, 2946, 233, -5409, -4967, -1317, 2596, 717, -4529, -5334, -725, -190]
14573a90q15J531P19k072k992J133N824o62n418n34J378K612L994k238j98k325
14557b53j450K096L158j400m586M78j84j306J248L579K273k76n175j258L158K127
14541B229l830M11K391Q45K046k636k534k655L821M614O27k846l416N59K820J326
14525C772l970k118m99L138j385M365J963m38N77R50J554M712J594m744l534L722
14509I659m6k438l309l151l280L150K901J56l455K522m938J008L540k46k532L813
14493C354L818j386K633j715l824m109k96l29J285j326k569L941k075q49M741
14478A294K439M44j27J300n861n030O683K949k837m76o875l500M545K892J317
14463h43J30k219K958Q051K842k338J24k083l789l020k398K168R21K359j356k871
$$ y = [-190, -1005, 526, 1245, -827, -3819, -2686, 3138, 2476, -2942, -3476, -2098, 514, 4508, 2270, 2072, -253, -1703, 393, 3551, 2151, -2435, -1957, -2141, -3447, -2199, 1380, 3653, 3377, -1798, -3056, 102, 2229, -1601, -1190, 1201, 2046, 4092, 1456, -1078, -3733, 88, 4702, 5329, 2483, -933, -374, 2446, 3772, -198, -2316, -2815, 323, -1062, 3303, 5266, 4828, 5405, 6355, 7909, 12621, 14215, 9471, 5937, 9659, 9613, 7175, 3866, 715, -2565, 585, 3486, 3642, 187, 2709, -2229, -1221, 2319, 2073, -459, 3354, 7172, 5786, 8419, 6704, 2880, -1229, -1525, -1854, -569, -1895, -4464, -523, -2598, -3447, 1294, 3733, 4177, 4050, 5350, -511, -5541, 1142, 4091, 1254, 778, -6097, -9597, -5052, -2160, -843, -713, -2932, 26, 8077, 10919, 8581, 8705, 6622, 2833, -187, -2585, -417, 504, 2863, 1507, -1364]
14447a364J663o08M608L001j224n842k49N08l20O49o72k698L91L22p56N924J178
14430D511k162L388L293j925j838k407k027j238L155M894k728m8m750k107J302
14415f87j940j022J10M191K775k902n122L85L497M131k1K000K067K711k490O11
14399H294n443j598j146K469L395L480Q62n28m015p155l153k99j179J519M471
14384b6k214K957O26l209P40K755L211K834k390M46k727k685L228Q32R05L054
14368H337K708L839l893j126j36l278k2r28m027j240K741k034m051j603J27J599
14352b987J538k196j41K459M584J480k080k562L1K963n27k231J62L670n61k957
14336F45j377j94R99L712j674p17k72j802J33j817k065O3q37K57N47N965L656
$$ y = [-1364, 299, -309, 4299, 7300, 6076, 234, -15, 493, 173, 822, 150, -2548, -2157, -1835, -2591, 3333, 4511, 2349, 5737, 9030, 7105, 5267, 2860, 833, -405, 2750, 7644, 4916, 4868, 118, -1989, -687, -2627, -3649, -3539, 652, 3427, 525, -4597, -4212, -715, 3416, 3395, 5395, 7462, 10173, 7683, 8294, 2851, 1253, 107, 2576, 5971, 9451, 10313, 9785, 5770, -1385, -4538, -4837, -6016, -4497, -26, -2240, 717, 1343, -1866, -1126, 1629, 4840, 7674, 5284, 5730, 3003, 318, 3546, 4378, 5283, 8337, 11045, 14884, 10991, 9865, 9729, 6451, 6429, 5501, 1474, 234, 2975, 941, -3110, -4713, -4586, -2987, -1449, -3645, -3786, -1327, 3257, 4737, 2657, 95, 126, 3089, 2562, 331, 493, 4163, 3602, 645, -732, -926, 73, 3785, 2111, 1394, 1122, -680, -547, -2364, -4429, -4366, -5203, -4946, -4399, 1566, 5222]
14319E222J175k207M28P90j917j836j426l271J241J958K305j842o90J080l5j64
14303H11n99L89L604j624j284P44L147L308j805l846j955m257j99M501K269J137
14287D341J83j86k506J406J678k891m216K027J917J243M1L379P3P63j920k313
14271C019M82k876l007M375L863m26o14K269j563j960m624k381r97J056L354j685
14255a715k826q30K663O3J566K503N78o8J291J023L90l37Q39k274p17M153n9p34
14237E509K118J001o9P35l024l275k551L095O36m257j951J819K066k237r32J624
14221C07p72k329M22L29j620K558J521j576J460M262J437j495O18K078k906j785
14205B509L830j084j837L365K087l94j828j017l531l935J199k063M252K575l41
$$ y = [5222, 6397, 4190, 4618, 5408, 3491, 1655, 229, -3042, -1801, 157, 2462, 620, -70, 1010, 975, 811, 212, 601, 4205, 2581, 1297, 2041, 5188, 8496, 6691, 2845, 890, -3367, -3566, 935, 3204, 4341, 4524, 4338, 1832, 3238, 4916, 2025, -2191, -164, 1753, 2996, 3037, 6416, 6489, 7252, 5332, 3019, 3501, 625, -2382, 1993, 5856, 5430, 4816, 7085, 5522, 3562, -1062, -3443, -4440, -3384, -30, -1715, -4541, -5371, -2708, -2645, -1079, 1424, 2002, 1934, 3225, 4248, 4638, 4301, 5140, 2866, 2149, 6302, 6243, 5509, 7627, 8628, 8559, 9294, 6270, 2995, 444, 3539, 4175, -82, -2033, -214, 1852, -385, -1317, 307, -465, -2794, -2372, -2043, -3663, -1105, 416, -1160, 300, 4562, 5999, 4504, 5122, 7200, 4294, 2509, 6339, 5255, 3418, 6783, 8870, 8476, 6648, 5631, 2100, -1835, -636, -2699, 1553, 4128, 3787]
14190C787R28o88J676J640j831L153L197m539m854K398O921M117n223o126l114
14175A442k729L073M712n114j656N018k49K27L491j83J349r34k004J054k019l422
14159B056J403q31k48l148M249M080L01k612m825j842J21r30M042R634K632j049
14143A3033J248M432J237n900m217K98j409r2K432M538J085l267m803J073L299
14128A2987r00J978j933R32K029j013n418p06j08O25L251J99J869L521j209k571
14112A3533m136l187N52M58J919l54L503J265j433K936L812J29j650q74j848R55
14096A5580L343J392N855j811l311k04O018K780r69K072M917k181j486J017J2337
14081D5349R570N327M523Q961J1652J6681K6581M0457M6460M9157N0945O1626
$$ y = [3787, 4715, 4027, 5703, 7343, 5512, 8665, 11862, 7323, 2469, 4867, 11788, 15905, 10682, 4556, 1442, -1287, 1786, 6498, 1384, -272, 4746, 4497, 4724, 8215, 8032, 9381, 8447, 6443, 7497, 5478, 2056, 3459, 2628, 2380, -768, 3481, 7561, 7862, 5250, 425, -1417, -1296, -2226, 1816, 11450, 14082, 13033, 14281, 18713, 19950, 14050, 9833, 10131, 8722, 8630, 11062, 15600, 16685, 13418, 8615, 9688, 12987, 12087, 14065, 12132, 13064, 15093, 14080, 8662, 7956, 7848, 8473, 11724, 11923, 13792, 17313, 16104, 13533, 9397, 6210, 6762, 7220, 9139, 8785, 12288, 13553, 12120, 15056, 18868, 18997, 17347, 16473, 14625, 15580, 18923, 20315, 26170, 24359, 21048, 20844, 26862, 29642, 28673, 30745, 35662, 33481, 31995, 33012, 45349, 54919, 60246, 64769, 73730, 85382, 102063, 128644, 169101, 215561, 264718, 315663, 377289]
14069C77289P4189O5357M3099K5577J1015q348k0307m4759o4945o6079o5111o3451
14057B63526o1426m5719l8062k6843j5879p184q905j2156n789n954m253k759k224
14044B6373K516j57k117l713l306o222j855j254K98L76k54k791P81J199j962k430
14028E482N020k402J204M160J458k872l952J14J32J210L370r40l897J739M97k580
14012G743O15M703L903m039j131m876o061O138L801L155K456K793L959q38L08
13997B2629j770k148j780J20K900j288J181P98K248j844r84l163k882l925j422
13982H670M105J561j673J089K464M419J035K493M157N226m056L062l137j488L613
13967C1540j792o324k553J681M436o70J23N708L127j166l393l780l342J273M037
$$ y = [377289, 451478, 516835, 559934, 585511, 596526, 588178, 567871, 523112, 458167, 392088, 326977, 263526, 202100, 156381, 118319, 91476, 75597, 68413, 59508, 47352, 41563, 35609, 31356, 28597, 26373, 28889, 28732, 26615, 22902, 19596, 13374, 11519, 10265, 10563, 10939, 10685, 7894, 8675, 9874, 7912, 5482, 10502, 8100, 9304, 13464, 14922, 12050, 8098, 8212, 8344, 9554, 12924, 11984, 8087, 9826, 10323, 7743, 8358, 13061, 16964, 12925, 11794, 6918, 857, 6995, 10796, 13951, 16407, 19200, 23159, 22321, 22629, 20859, 18711, 16931, 17051, 19951, 18663, 19844, 20642, 22890, 21046, 20062, 16899, 14017, 10092, 8670, 12775, 14336, 12663, 13752, 16216, 20635, 21670, 24163, 28320, 33546, 29490, 32552, 29415, 27927, 31540, 29748, 23424, 20871, 22552, 26988, 26318, 26441, 32149, 35276, 34110, 30717, 26937, 23595, 24868, 28905]
13952B8905j12K009J190l493L062r72M129P035m56n463P24J697J887J347L705
13937D5194l03N362J968m369l177k61k627j111k108J545L224L318j053k766j609
13922D1227J171k46P8o3q26Q72J544k178J685M861R22k340K538J177K675K346
13906E5443J562J00k841p001L182P687K40j128N260J46j31O38J908P13J002P95
13890F7575k523J192L082J899K77j564j666o02K609J064j404l55P42M352J866
13875G6544j396P50O316J806J252m24N676Q418M858l866k036j521j670k459Q00
13860I3048j257k327O08R44k49m614p629j442M159K340j711m94O157j278m319
13845H1936q0J787N32n86r07k563j249L05k27J48q12o47L577K698Q64k421m496
$$ y = [28905, 28793, 30802, 31992, 28499, 31561, 30589, 34718, 41753, 41297, 35834, 36558, 38255, 40142, 41489, 45194, 44891, 50253, 52221, 47852, 44675, 44414, 41787, 40676, 38568, 40113, 43337, 46655, 45602, 42836, 41227, 42398, 42152, 42230, 42167, 41341, 42213, 43757, 41579, 43264, 48125, 49047, 46707, 49245, 50422, 53097, 55443, 57005, 57105, 54264, 47263, 50445, 58132, 58372, 57244, 62504, 62650, 62519, 63157, 65065, 65778, 66780, 67575, 65052, 66244, 69326, 71225, 71502, 69938, 68272, 67670, 70279, 71343, 69939, 69584, 70326, 74678, 76544, 75148, 75898, 82214, 84020, 85272, 84848, 90524, 98942, 103800, 99934, 97898, 96377, 94707, 92248, 93048, 91791, 89464, 90072, 91016, 90767, 86153, 78524, 77082, 81241, 83581, 81870, 81376, 87533, 86255, 81936, 81856, 83643, 84175, 83589, 82682, 80119, 78870, 79175, 78948, 79096, 78284, 77637, 81214, 83912, 84776, 82355, 77859]
13828G7859m58p061m582L064O951M552J649o466k473K121J695j949k369K837K145
13813G7515k608j724M89J768j909k024J762J655k287R76K38l997j505P68L19J644
13797G1080p78m54l477l771L17n483k631L230P681J198m433J19k315l262J291
13782E8312K406M581j58n268J376j435o494n506K349K748N898j946r994q768j278
13767C6823J500l08K460J716q2n52N76j209R40j288j111J304j65K754l42j520
13751D1496K62n226m695j993j497j843k849J703K028K092j634m049n15J811J711
13736B6802J768M71J760k55j191k404o395N0J09l202J789L467J282j290K573J249
13720B6583m067l467l196P70N100L718k688l872Q32J29r74o14J59M51J469j956
$$ y = [77859, 77401, 70340, 65758, 68822, 75773, 80325, 81974, 75508, 73035, 75156, 76851, 74902, 72533, 75370, 77515, 74907, 73183, 73672, 75440, 73531, 71507, 73269, 74924, 72637, 73613, 73851, 69854, 68349, 69117, 69436, 71080, 70302, 69848, 66371, 62600, 62917, 57434, 54803, 58033, 65714, 66912, 62479, 62598, 60283, 57021, 58312, 60718, 65299, 65141, 59873, 61249, 59814, 53320, 47814, 50163, 52911, 58809, 56863, 46869, 38101, 36823, 38323, 38015, 40475, 42191, 42109, 41557, 42133, 40924, 41864, 40576, 39465, 40769, 40604, 43358, 43016, 41496, 41758, 36532, 31837, 29844, 28347, 26504, 23655, 25358, 27386, 29478, 27844, 23795, 23280, 25091, 26802, 28570, 29041, 30801, 30546, 29355, 26951, 20556, 20606, 20715, 17513, 19302, 22769, 24051, 22761, 25334, 26583, 22516, 19049, 15853, 16623, 21723, 25441, 22753, 18881, 19713, 19842, 18868, 18254, 18413, 18864, 20333, 18377]
13704A8377L77K60L060N70r64j91l952J284K804k123K683K533N064J512O424N516
13688D3234k000kK591K848j140J534M110J316j0802q689j720N050k181m791k705
13673B6653j979k632k642J355J202l425O00L232j216k625l717j685J403K364P4
13658A6962R59j985R47J670K148n329k034J470K797M491m348l945n778l107L381
13643H299K371j028J174J318J676o04k997j588L532j84p762O36L453N35p54K682
13627A0759P21L70J782N48r07l263K558K164O37r42k439j377j209j720L248O21
13611A1551m423K502J806k43j248J797M39l09n26J80m107m235j33N262L540K598
13595A4451J77l506j188O25r31K030M343J748j034K947j465k760n560k28m439
$$ y = [18377, 18754, 19014, 22074, 22644, 21680, 21489, 17537, 18821, 21625, 19502, 22185, 24718, 29782, 31294, 37718, 43234, 41234, 41232, 43823, 46671, 45531, 47065, 51175, 52491, 41689, 33000, 31280, 36330, 34149, 29358, 26653, 24674, 22042, 19400, 20755, 21957, 18532, 19132, 22364, 21148, 18523, 14806, 13121, 14524, 16888, 16962, 17921, 15936, 16883, 18553, 20701, 15372, 13338, 14808, 17605, 22096, 17748, 13803, 8025, 4918, 8299, 10670, 9642, 10816, 12134, 13810, 13206, 10209, 8621, 12153, 11969, 4207, 4843, 8296, 8831, 8077, 10759, 11480, 11850, 13632, 14180, 13273, 10010, 12568, 14732, 15369, 14427, 11988, 10611, 9402, 7682, 10930, 11551, 7128, 9630, 11436, 11193, 9945, 11742, 12181, 11872, 11346, 11526, 7419, 3184, 3051, 8313, 11853, 14451, 14628, 11122, 9934, 10559, 9628, 11658, 16001, 17749, 16715, 19662, 18197, 15437, 9877, 9649, 5210]
13580E210o29O018p28k715J773K724Q73K295l135j073k905l016j966j128M545
13565F143M277J391P16m578m186M84j142L097N482N24qJ639J115k063J544k267
13549A2168j525r59k853K837O89J737l764N44L514J95l641n33k467J18K496l456
13533E100K74M402J822m678k079J015j589L580M444K245M404k455k648j73J104
13518A4768j663q85o57j451o704J599L449K937J135p71r35K668K049m988l097
13503G454K545J664L795J220K112K524R81j993K95L56r2n31l144J034O01q45J11
13486A8087j28J053L129j530l968m56l344l174k11j598o77N313j508l898j180
13471E910n83J38L596J948J862j395k081n59J331K308P343k146k507Ll826j921
$$ y = [5210, 4581, 10599, 9871, 7156, 8929, 11653, 12526, 14821, 11686, 10613, 7708, 4692, 2726, 1598, 6143, 10420, 11811, 12527, 7949, 3763, 4247, 3105, 6202, 11684, 12208, 12200, 13839, 14954, 12891, 14435, 12168, 10643, 9684, 6831, 9668, 10357, 12094, 8330, 8874, 12388, 12583, 8942, 8409, 5942, 6060, 8556, 5100, 5374, 9776, 11598, 6920, 4841, 5856, 4267, 7847, 12291, 14536, 18940, 16485, 13837, 13664, 14768, 13105, 12220, 11563, 10112, 3408, 5007, 8456, 11393, 12528, 11757, 10822, 13490, 15539, 10551, 7454, 9999, 11663, 15458, 16678, 18790, 21314, 22295, 20302, 20597, 20953, 20861, 20330, 17186, 18220, 18821, 17976, 18087, 17959, 19012, 22141, 20611, 16643, 16187, 12843, 9669, 9458, 7860, 7183, 12496, 10988, 7090, 5910, 5327, 5465, 9061, 11009, 12871, 11476, 9395, 8836, 10167, 12475, 19818, 17672, 15165, 15168, 11342, 9421]
13455I421k306j496k528L972j882L90K557L455R6n78K343n51j144Q52m28q15k249
13438I109K970M046J213l561k773J172N742P694n06k323k389m829l68L865L671
13423B2733o94P08K586L944M049K556j62L064K070J263N72O984R394J7626J7693
13408I4386J8009K2204K6357K1454J4940J4440L499j092q705j7955j7062j9485
13396A50990j7331j2363j1274j0668q779k713m316q45P920J0732J7414J6507J5861
13383A51135J8145J3264O834L064J157m731j2438j5497k4944j8760j4590r876
13371I2763j5546j9298j1375q325p492k498K377J683K304k056m442k662k039L44
13357B3738p35K459l690j681M355j444l438l685R59K919q87Q17K901K684L13J852
$$ y = [9421, 7115, 5619, 3091, 7063, 5181, 5571, 8128, 11583, 11679, 11101, 13444, 12893, 11749, 12601, 12173, 11358, 9109, 12079, 16125, 17338, 13777, 11004, 12176, 17918, 25612, 25106, 22783, 20394, 15565, 15197, 19062, 22733, 22039, 22747, 25333, 29277, 33326, 35882, 35720, 38784, 40854, 42117, 42689, 49673, 59067, 76693, 94386, 112395, 134599, 160956, 182410, 197350, 211790, 215289, 214197, 205492, 187537, 170475, 150990, 133659, 121296, 110022, 99354, 90575, 87862, 83546, 82701, 90621, 101353, 118767, 135274, 151135, 169280, 182544, 189378, 192442, 193599, 188868, 176430, 160933, 135989, 117229, 102639, 92763, 77217, 57919, 46544, 38219, 30727, 28229, 30606, 32289, 34593, 32537, 28095, 25433, 23394, 23738, 23003, 25462, 21772, 20091, 24446, 23002, 19564, 15879, 16838, 19757, 18870, 19687, 22588, 25272, 25585, 27437]
13341B7437K69k59N97J360R15m144J973M755J057J38N485M590j224j338J0997
13326E2608P195J1368R358J2724J8898K0541K3251K4430K6265K1588K0493J3140
13314B61859M137o875j7742k1223k2693k4388k2391j8537j3704q623p314j964
13302A00542K623Q886J3691J6349J8138J9515K3144K5098J8929M432l835p947
13290B39565j8269k3287j9753k4739k4492j9136j8389j7987q398o803p732n861
13278D4719n781n335k75j074k9k58k412j129M0O05p55j349J284L680j728L259
13262C3462p1n56k053l570L34k02j331J244J615l659n47k668j660Q04K049J2L79
13245B3582k547k694M95J65J214K914L183l7R68Q5q75Q72j075j47J863j055j256
$$ y = [27437, 27706, 27447, 28044, 29404, 30319, 26175, 28148, 32903, 33960, 34098, 39583, 44173, 42949, 41611, 52608, 59803, 71171, 80529, 93253, 112151, 132692, 155943, 180373, 206638, 228226, 248719, 261859, 265996, 259121, 241379, 220156, 197463, 173075, 150684, 132147, 118443, 109820, 102506, 100542, 103165, 112051, 125742, 142091, 160229, 179744, 202888, 227986, 246915, 251347, 247512, 239565, 221296, 198009, 178256, 153517, 129025, 109889, 91500, 73513, 65115, 58312, 50580, 44719, 38938, 33603, 33328, 32254, 32225, 31967, 29555, 28426, 28466, 29071, 28316, 26967, 28251, 31931, 30203, 33462, 33391, 32835, 30782, 27212, 27546, 27344, 26013, 27257, 28872, 25213, 24666, 21998, 20338, 21142, 23191, 23203, 23582, 21035, 18341, 18836, 19001, 20215, 23129, 26312, 26275, 27243, 27328, 26453, 27325, 26250, 26103, 27966, 26911, 25655]
13228B5655j708l437L769k380n185j784L657L040K75k048N769O571K041l225m28
13213C0582r1P4p15k031k253M80J417N21m136j505l96l007q55L189j680K401J724
13196B3719k90J027K472K864j852l609k427l344Q82J936K485m90k078P161N167
13181C3623k526k961L83K153j840k942l674o7J333J162P0j400m68K148n47L279
13165B7726l84p64M050J068j874R5K481J960P20R09l946j614J72m34k326j889
13149B5950K394K074J560j113J136j471o52m418J651J592O06J526N159P83j032
13134C5745J60j141q37j239l836j95P381M104n22m111n725k542L246J311m824
13119B6975n189P94L37Q97J369K114J021o8o2J040M866L005O43r35J021O84l449
$$ y = [25655, 23947, 20510, 24279, 21899, 16714, 14930, 18587, 21627, 21902, 19854, 25623, 32194, 34235, 31010, 30582, 30491, 30565, 29850, 27819, 25566, 26046, 27463, 27984, 23848, 22343, 21947, 18940, 18085, 21274, 19594, 21995, 23719, 23429, 24456, 26928, 29792, 27940, 24331, 21904, 18560, 19442, 21378, 23863, 23373, 21295, 28456, 33623, 31097, 28136, 28519, 30672, 28832, 25890, 22216, 22149, 23482, 24644, 24714, 23314, 22846, 24994, 24447, 27726, 27342, 26578, 30628, 31696, 29822, 29917, 32398, 34358, 35078, 35987, 32041, 30427, 30599, 30165, 27839, 25950, 28344, 30418, 31978, 30865, 32001, 30530, 29878, 25460, 27111, 28703, 29309, 30835, 35994, 36777, 35745, 35905, 34764, 33927, 32688, 28852, 28657, 36038, 40142, 39620, 35509, 29784, 27242, 30488, 31799, 26975, 21786, 22580, 22917, 23814, 25183, 27297, 28318, 28250, 28188, 29228, 34094, 37099, 37742, 36807, 37828, 38512, 35063]
13102C5063K085R13J658l493L32J194K328K066j280J910L834k96j355l895n142
13087C5922L39L626K73J072O553J165m069k145J382M001M094J129K343K919n94
13072E8010M52K186L044l2L007Q28J434K749N485M476K567K871K353M232J1862
13057A05524R381P628J0096R766J3088J4771J6210J5251J1239J3703J6064J5160
13045B57881K1414K0946Q081M080J066Q52k829q070j0266j5712j7459j7317k0015
13032B22652j5982j3869j6032j8887j3980n271o760o992j1533o813m587q386m397
13019H9163m502m666j550J299n263p51j831j624K289l094l047k354k395l071j755
13004E6848k154l764M921L932k258J539n81q54M67l113l421l022K383J772q50
$$ y = [35063, 37148, 38061, 39719, 36226, 36558, 37752, 40080, 42146, 40866, 42776, 46610, 46314, 44959, 41064, 35922, 36261, 39887, 40160, 41232, 47785, 48950, 44881, 42736, 44118, 48119, 52213, 53342, 55685, 58604, 58010, 58462, 60648, 63692, 63660, 66667, 67495, 68929, 71678, 77163, 81639, 84206, 87077, 89430, 93662, 105524, 114905, 122533, 132629, 142395, 155483, 170254, 186464, 201715, 212954, 226657, 242721, 257881, 279295, 300241, 308322, 312402, 313468, 314320, 311491, 303421, 293155, 277443, 259984, 242667, 222652, 206670, 192801, 176769, 157882, 143902, 138631, 131871, 124879, 113346, 106533, 101946, 93560, 89163, 84661, 79995, 78445, 79744, 74481, 73730, 71899, 70275, 72564, 69470, 66423, 64069, 61674, 58603, 56848, 54694, 50930, 55851, 59783, 57525, 59064, 58483, 57629, 58096, 54983, 51562, 48540, 50923, 52695, 51845]
12989E1845R54j14N79L798K59k049m92m07j58p93M233k450J44m31q41k288q5p8
12971E1626P60N096Q07k970K61J24J628R38n4m159k49k610p81K571k34K65M802
12954E7821L908K222K528o108k031o84R96L818j13k026j065k040N85l986k041
12939E1784J947L96k440L364L916M718q08K236K116j81m11l256l004O69M80K087
12923F3613K164J48K026K20m551J436Q288k773L779J143j127P48j640MJ508J240
12907G6226K600N595M88n98J153K573rL303K711j762N54M89L0N85K771O874R00
12890A04483R70K159n65O53l922K88q45j93L43j309m032M159P736J230l472l16
12874A07367M801L023J797j212j421k10J965L7n60o94N14r75k024k635l5K00L285
$$ y = [51845, 52799, 52685, 53264, 57062, 57321, 55272, 54780, 54373, 54215, 53422, 57655, 55205, 55349, 54918, 54077, 51789, 51704, 51626, 52386, 57482, 58289, 55319, 55580, 55704, 57332, 58270, 58216, 54057, 53808, 51198, 50417, 52988, 52754, 53019, 57821, 61729, 63951, 66479, 60371, 58340, 57656, 58652, 62470, 62357, 60331, 59266, 57226, 57811, 53825, 51784, 53731, 54127, 51687, 55051, 58967, 63685, 62877, 65113, 67229, 67048, 66637, 63381, 60377, 61046, 61526, 63613, 65777, 65925, 67951, 68171, 63620, 65056, 73344, 70571, 74350, 75493, 74366, 75114, 73474, 73478, 74986, 76226, 78826, 84421, 84909, 84311, 85464, 88037, 88028, 91331, 94042, 92280, 92834, 93323, 93353, 93938, 96709, 103583, 104483, 105453, 107612, 107047, 107700, 103778, 104066, 103221, 103028, 103371, 102062, 98030, 102189, 109925, 111155, 107683, 107367, 112168, 115191, 116988, 115776, 114355, 114145, 116110, 116147, 115587, 114893, 115407, 114432, 112408, 109773, 109738, 109938, 113223]
12857A13223L409k906k167M322L220J653k880j653K47N43j621O44J434O384O228
12842A30080L838k473k796O01M898J812P39l949m273L455L183l821J032O518K169
12827A41013j406L313P321m283m091m71K674M047M00L00l436l721j282J095k58
12812A41215q462m757K679J308L643q70K535M369r86j478n26R14L044k648J239
12797A41219L131P91L425N587M823L609K996q65j437J647O289j173J720N205O703
12782A83670O370J928m29K506P996L291k728N395N797N9Q2j138K020O611P683
12767B29113l34M725J0317P474J834J014L871N281R425L918J038J017pN429M775
12752B88890r57k011K98L578N198L865N189M182M124p39j948K054l523L927Q287
$$ y = [113223, 116632, 113726, 111559, 115881, 119101, 120754, 117874, 116221, 116468, 117011, 115390, 116034, 117468, 123852, 130080, 133918, 131445, 128649, 129250, 134148, 135960, 136699, 132750, 128477, 131932, 135115, 131294, 132326, 138844, 141013, 139607, 142920, 150241, 145958, 141867, 141396, 144070, 148117, 148517, 148817, 145381, 141660, 140378, 141473, 141215, 132753, 127996, 130675, 131983, 135626, 134756, 137291, 141660, 140674, 139196, 138670, 139584, 142628, 139980, 141219, 144350, 145141, 148566, 154153, 158976, 162585, 165581, 164716, 163279, 164926, 171215, 170042, 171762, 176967, 183670, 190040, 191968, 191539, 194045, 202041, 205332, 202604, 207999, 213796, 213855, 213937, 212799, 214819, 221430, 229113, 228779, 233504, 243821, 251295, 253129, 254143, 258014, 263295, 272720, 276638, 277676, 278693, 278686, 284115, 288890, 287933, 285922, 286220, 289798, 294996, 298861, 304050, 308232, 312356, 311617, 309669, 311723, 308200, 312127, 320414]
12737C20414K260L523N374Q354O441k371J196N709N049N780J1499L897R595O463
12723C93183O805N105N397R861J2840J3036J1191J3902Q879Q335R128O669J1273
12710E15604J6118J6316P292J2179J5028J8534J5665J3591R541J5573J7617J4986
12698F88044J6812K1644J7884J6508J6283J8850K6210K3502K2647K1320K1030
12687I10734K2692K5525K5651K8379L1472L5654L3537L6554L7863L7016M1578
12676A266655M7235M4355M8523N6385N7361O0274O8363P0890P1190P5813Q0531
12665A947575Q6578R0168R5729J08454J13390J20392J30786J42731J49993J68049
12655C153845J87662K00725K16508K34318K55322K83432L11722L47546L83013
$$ y = [320414, 322674, 326197, 331571, 339925, 346366, 343995, 345191, 350900, 355949, 361729, 373228, 377125, 386720, 393183, 399988, 405093, 410490, 420351, 433191, 446227, 457418, 471320, 480199, 488534, 497662, 504331, 515604, 531722, 548038, 555330, 567509, 582537, 601071, 616736, 630327, 639868, 655441, 673058, 688044, 704856, 726500, 744384, 760892, 777175, 796025, 822235, 845737, 868384, 889704, 910734, 933426, 958951, 984602, 1012981, 1044453, 1080107, 1113644, 1150198, 1188061, 1225077, 1266655, 1313890, 1358245, 1406768, 1463153, 1520514, 1580788, 1649151, 1720041, 1791231, 1867044, 1947575, 2034153, 2124321, 2220050, 2328504, 2441894, 2562286, 2693072, 2835803, 2985796, 3153845, 3341507, 3542232, 3758740, 3993058, 4248380, 4531812, 4843534, 5191080, 5574093]
12646E574093M22700M75251N35253O02237O69131P45650Q37541R40522J055589
12637A1857967J185490J337861J522302J723570J947442K198051K468201K746339
12629B6987223L009362L220908L354707L374344L256805K986377K544693J947727
12621E0682146J227842M22332m04159j200607j916855k510382k939471l210743
12613D0150103l324667l304399l175579k966733k715106k450990k187882j944004
12605A8080743j722436j524849j357421j203933j071312r60325q61902p73134
12597H605431o93177o23602n56257m96339m48775m03621l65459l30612l04068
12588D383521k71943k47466k29452k05547j89246j69931j57878j49590j38704
$$ y = [5574093, 5996793, 6472044, 7007297, 7609534, 8278665, 9024315, 9861856, 10802378, 11857967, 13043457, 14381318, 15903620, 17627190, 19574632, 21772683, 24240884, 26987223, 29996585, 33217493, 36572200, 39946544, 43203349, 46189726, 48734419, 50682146, 51909988, 52332320, 51928161, 50727554, 48810699, 46300317, 43360846, 40150103, 36825436, 33521037, 30345458, 27378725, 24663619, 22212629, 20024747, 18080743, 16358307, 14833458, 13476037, 12272104, 11200792, 10240467, 9378565, 8605431, 7912254, 7288652, 6732395, 6236056, 5787281, 5383660, 5018201, 4687589, 4383521, 4111578, 3864112, 3634660, 3429113, 3239867, 3069936, 2912058, 2762468, 2623764]
12579B623764j29947j16362j09802j00964r2780q6016p8810p3782p7015p0718
12569A687568o2629n6727n6892n3245m5617m3670m5842m3766m0990l6782l7466
12558A163942l8918l7452l4574l2271k9177k9740k6284k0156k2776k5446j9849
12547H47299j7829j9059k0339j8186k2296k2247j7250j1893j1568j4255j2924
12536F59453j6620j2947j0338j0978j2412j1177j3222j3523j1044n765r049j0248
12524E22130q251p313n581o440o411o198j1553p777p767m672o782o126l273p617
12510D26369o742n156m924l194j344j195k333K60k989n573m226l45k671n347o044
12495C74546k603k537l452n882k540n379o395o898k740o466m306m163o489l561
$$ y = [2623764, 2493817, 2377455, 2267653, 2166689, 2073909, 1987893, 1909083, 1835301, 1758286, 1687568, 1624939, 1568212, 1511320, 1458075, 1412458, 1368788, 1322946, 1279180, 1238190, 1201408, 1163942, 1125024, 1087572, 1052998, 1020727, 991550, 961810, 935526, 915370, 892594, 867148, 847299, 829470, 810411, 790072, 771886, 749590, 727343, 710093, 698200, 686632, 672377, 659453, 642833, 629886, 619548, 608570, 596158, 584981, 571759, 558236, 547192, 541427, 532378, 522130, 513879, 506566, 500985, 494545, 488134, 481936, 470383, 462606, 454839, 450167, 443385, 437259, 433986, 426369, 419627, 414471, 409547, 406353, 405009, 403814, 401481, 401741, 398752, 393179, 388953, 388608, 385937, 380590, 374546, 371943, 369406, 365954, 360072, 357532, 352153, 345758, 338860, 336120, 329654, 325348, 321185, 314696, 311135]
12481C11135n538o411k213k873j691m016o759k200l229k023k800j252l30m495
12467B65305o779q021r935n791o094l105q646m145m760l842o949l439k714p41
12453A90344j467j680m897r13K218k665k444J568l6n406k957J798n89P33j16J884
12437A75375j539J403J36J58K474J150K915L765M224Q319J6816J3833J1597J6648
12423B57274R102P511P831l501p731r322q978j0997j4239j2707j7254j5835j3394
12410A67760q883j0598q913p048m007L83M616J716K610N634Q420J5976K2400K7973
12396B18039M2470M9423L9616J9554p60k8699l8784m3785m3779l3602k6212j9043
12384A34438j2831r043n380p239m264k351k011n028k950k8l231l897J343r67l784
$$ y = [311135, 305597, 299186, 296973, 294100, 292409, 288393, 281634, 279434, 276205, 274182, 271382, 270130, 269800, 265305, 258526, 250505, 240570, 234779, 228685, 225580, 216934, 212789, 208029, 204187, 197238, 193799, 191085, 190344, 188877, 187197, 182300, 181387, 183605, 180940, 178496, 180064, 180028, 174622, 171665, 173463, 172874, 173607, 173491, 175375, 173836, 175239, 175375, 175533, 178007, 179157, 182072, 185837, 190061, 198380, 215196, 229029, 240626, 257274, 266376, 273887, 281718, 278217, 270486, 261164, 252186, 241189, 226950, 214243, 196989, 181154, 167760, 158877, 148279, 139366, 132318, 128311, 128694, 133310, 135026, 137636, 143270, 151690, 167666, 190066, 218039, 260509, 309932, 349548, 369102, 368342, 339643, 300859, 257074, 213295, 179693, 153481, 134438, 121607, 112564, 107184, 99945, 95681, 93330, 91319, 86291, 83341, 83313, 80082, 76185, 77528, 76561, 72777]
12369G2777k652K393m983M35O76k017n22l88J464K333j242j140M87R44j040m27
12353F7098L567L446O225l448k926k321l96M537O581O619P142O761O278R193J8622
12338A36978L2789L7647M1598M4510L3835J2112j2697k9261m0133m0486l9245
12327A77647k6904r866j2136j0400o520o265o288m12j239j660r04l232L81M744
12313I6946M269J0244J3683K5151L4225M0151L5757K7609O749j2504k7146l6242
12301B18892l5825l0423k2844j7781j1941p387n866n683l307n62n033q769m043
12288E9428J144l164q80p02n402l057o81K01L244o72J518j041k005K074J968l010
12272D8963k704j418m694o189R14K838M964N302K80L80j281N22L856L163N061
$$ y = [72777, 70125, 72518, 67535, 67970, 68646, 66629, 66107, 65719, 67183, 69516, 68274, 67134, 67621, 68565, 67525, 67098, 70665, 74111, 80336, 76888, 73962, 71641, 71245, 75782, 82363, 88982, 96124, 102885, 109163, 118356, 136978, 169767, 207414, 249012, 293522, 327357, 339469, 326772, 297511, 257378, 216892, 177647, 150743, 140877, 128741, 118341, 111821, 105556, 99268, 98856, 97617, 95957, 95053, 91821, 92202, 96946, 101215, 111459, 125142, 150293, 184518, 224669, 260426, 288035, 294784, 282280, 255134, 218892, 183067, 152644, 129800, 112019, 100078, 92691, 86825, 81142, 77835, 77273, 72240, 63471, 59428, 60572, 57408, 56528, 55826, 50424, 47367, 46686, 46887, 50131, 49459, 50977, 49936, 47931, 50005, 51973, 48963, 46259, 44841, 40147, 33958, 34872, 37710, 42674, 47976, 48256, 48636, 47355, 47877, 51733, 54896, 59957]
12257E9957L727L858M150M405P818J2154K3567L0994L5744L3561L0842J9201L881
12244B73859j3214k9863l5655l0433k6856k6652k1015j3817q519k568k644j886
12232F0737l067K97K509k492Q32k346m62M433p90j67K52L552O098N883L632m939
12216G3962J555L209Q080Q894L730O513N670M505P228O622J1770J2645J2917J6768
12202A84068K0463J7215J6182K3371K4864K8333L3855L3081K7326Q035j2873k4242
12190C79678k5027k1976j7052j4417j0614n744r087o463j6161k6892l4559k7688
12178A63998k1739j2323j3174j4964r184m314m138k8o637o858l513j174m7k901
12164F3004p334l46L402J632L705J931O177L7r080j0806l086R33Q7k62O57K509
$$ y = [59957, 63684, 67542, 71692, 76097, 83915, 96069, 119636, 150630, 186374, 219935, 250777, 269978, 273859, 260645, 230782, 195127, 164694, 137838, 111186, 90171, 76354, 67835, 65267, 62623, 60737, 57670, 57967, 60476, 57984, 58816, 56470, 56008, 60441, 59651, 59484, 59736, 63288, 69386, 75269, 78901, 73962, 75517, 78726, 86806, 95700, 99430, 105943, 111613, 116118, 123346, 129968, 141738, 154383, 167300, 184068, 204531, 221746, 237928, 261299, 286163, 314496, 348351, 381432, 408758, 416793, 403920, 379678, 354651, 332675, 315623, 301206, 290592, 284848, 275761, 269298, 253137, 226245, 191686, 163998, 142259, 129936, 116762, 101798, 92614, 88300, 84162, 84134, 77497, 70639, 67126, 65952, 65905, 63004, 55670, 55324, 58726, 60358, 64063, 65994, 72171, 72208, 63128, 52322, 49236, 50169, 50256, 49994, 50651, 53160]
12148E3160J184j087j599m401m586O47J239l125j186K820M65l848l990m553o237
12133B4903m810N039K016l24K160Q59M1l515k724n59K686k582K053O571J673j090
12117C2397M963O270m593k253L977L818j922k856k519n260k181p05k603n453k204
12102A8876R56K149M450o85p78J179K472Q92m033J519O97m295p186l605j629L530
12086A4509K389l82K920L331J659l968L880L171M0j136L06J512m642k495P77K784
12070B4655N430k38n536j39j866j703L327j750k052J836M585j128M0m30k603k248
12054B0180m300k845k008L593P535j567l948m461K613K563R34Q54j329k644K17
12039A5387L537K609l351p398J44M836K390q81k298j681l977p74J798K309M836
$$ y = [53160, 54344, 53257, 51658, 47257, 42671, 43318, 44557, 41432, 40246, 43066, 43531, 39683, 35693, 31140, 24903, 20093, 25132, 27148, 26824, 28984, 29843, 29884, 26369, 23645, 23086, 25772, 23190, 25243, 31814, 33487, 32397, 37360, 43630, 39037, 36784, 40761, 44579, 42657, 39801, 37282, 32022, 29841, 29136, 26533, 21080, 18876, 19832, 21981, 26431, 25746, 24968, 26147, 28619, 29511, 25478, 26997, 27694, 23399, 16213, 12608, 10979, 14509, 16898, 16516, 19436, 22767, 24426, 20458, 24338, 27509, 27549, 26413, 26719, 28231, 23589, 21094, 21871, 24655, 30085, 29847, 24311, 24172, 22306, 20603, 23930, 22180, 20128, 21964, 26549, 25421, 25461, 25031, 22428, 20180, 15880, 13035, 11027, 14620, 22155, 20588, 16640, 12179, 14792, 17355, 18289, 19143, 17814, 15170, 15387, 18924, 21533, 18182, 10784, 10928, 15764, 18154, 17273, 14975, 13294, 9317, 8543, 10341, 12650, 17486]
12024A7486M762m069j961P23k289l875O37M466K435J727K730N781L379j996j105
12009B8831J124J099k871l874m498l359l839j04K32K224k207j026O69P48J045
11994A4194J965J947N62K459l610l467K284J605j519o343K255k27k89l377j916
11979F523M491N00K49p90o38J969K868j995m829K142J689k201j373K251J099p97
11963A1158p59L013K485J000p83L48J964j141j263j019m091o74J525K641l330
11948A1074J284K749K390K901J034k467R06l584P07J726J012j904l458J972L47
11933A6689M495n54k596m183m60J689N818k029n215r53l872J066N868j152k174
11918A2437J595K973J048J399j323K087J893p77k706k709k94O30n927L180M648
$$ y = [17486, 22248, 18179, 16218, 16941, 14652, 10777, 11414, 15880, 18315, 20042, 22772, 28553, 31932, 29936, 28831, 29955, 31054, 28183, 24309, 19811, 16452, 12613, 12509, 12741, 14965, 12758, 11732, 12401, 13149, 14194, 16159, 18106, 18668, 21127, 17517, 14050, 16334, 17939, 16420, 10077, 12332, 12105, 11816, 8439, 6523, 11014, 11514, 11763, 10973, 10335, 12304, 15172, 13177, 8348, 10490, 12179, 9978, 8605, 10856, 11955, 11158, 10399, 13412, 15897, 16897, 16114, 16462, 18426, 17285, 16022, 15003, 10912, 10238, 11763, 14404, 11074, 12358, 15107, 17497, 20398, 21432, 18965, 19871, 16287, 16994, 18720, 19732, 17828, 14370, 16342, 16689, 21184, 20630, 18034, 13851, 13391, 15080, 20898, 18869, 13654, 12701, 8829, 9895, 15763, 14611, 12437, 14032, 17005, 18053, 19452, 18129, 20216, 22109, 21332, 18626, 15917, 15623, 16253, 10326, 13506, 18154]
11903A8154R31q00l340l113n29J901N9J903O59j247J69M137L111j532m487J633
11887A7609j97k399J130J044N62l488j100M056Q18n332J149R90L02k775K820L896
11871A9085K813m173k799L169L917k902j308j20O27M200j179j764K17l873k44
11856A5666K566L520k996o468K315o21J323N301P36l847k107l013J863K454j683
11841A5009j693p00L686L694J116l833L138K035l945j04k561l387k348P02K256
11826A3065m766J768J835m92M276L849O85K244K222j590j407P64j237k091O46
11811A9771K001l864J9J033m038N18J293r50K498J738L372p22k526n08J457M84
11795B1576j894q68k464P04J630J755J334k993M76m51m788l31j880K968M092k171
$$ y = [18154, 19085, 18285, 14945, 11832, 11303, 13204, 13263, 15166, 15825, 14578, 14747, 18884, 21995, 20463, 15976, 17609, 17412, 15013, 16143, 17187, 17749, 14261, 13161, 17217, 18035, 12703, 13852, 14842, 15144, 12369, 15189, 19085, 21898, 17725, 14926, 18095, 22012, 19110, 17802, 17682, 18309, 22509, 21330, 19566, 19783, 15910, 15666, 18232, 21752, 18756, 12288, 14603, 13982, 15305, 20606, 21342, 17495, 15388, 12375, 14238, 16692, 15009, 13316, 12616, 16302, 19996, 21112, 17279, 20417, 22452, 18507, 18403, 15842, 12455, 10107, 10809, 13065, 8299, 10067, 11902, 11410, 15686, 19535, 20220, 22464, 24686, 23096, 21689, 22453, 21216, 19125, 19771, 21772, 17908, 17927, 18960, 14922, 15440, 16733, 15783, 18281, 20019, 23391, 22669, 20143, 19635, 21092, 21576, 19682, 18814, 16350, 17054, 18684, 20439, 21773, 18780, 19256, 18805, 14017, 13686, 11806, 14774, 18866, 16695]
11779A6695o452j660Q07Q029N361J690K966o48o678j672M579N572K105N451k01
11764C5944J236r61k296m052j233J132m426k488l112m467J209q14J496O765j245
11749B2688j73L67K537j175m845K43p94k38O03l048l592j315M510L019L046k665
11733A9168j661j403j224L062K56N15M890r01j949r83J92J460k473j569k278j023
11717A4079K523N377M611p24o73J854O4L172j45n519k919k482l303l4m75J917
11701A7323J931M418L511Q57j324K171k528m279k995o86J434M894J365n750p310
11686A3032q0L748q62O36L549J033k223k57M404j006M782J272o001p52Q2l454
11670A7903K906J162m386j467J716M003L119k584n588m73j594O436K645J815m519
$$ y = [16695, 10243, 8583, 9390, 17419, 22780, 24470, 27436, 26788, 20110, 18438, 23017, 28589, 30694, 36145, 35944, 37180, 36219, 33923, 29871, 28638, 29770, 25344, 22856, 19744, 15277, 16486, 15672, 17168, 23933, 22688, 22515, 22882, 25419, 24244, 19399, 19642, 18848, 18610, 19213, 16165, 12573, 11258, 15768, 18787, 21833, 19168, 17507, 16104, 14880, 17942, 18198, 18713, 23603, 22702, 20753, 19770, 19962, 21422, 18949, 17380, 15102, 14079, 16602, 21979, 26590, 25866, 25193, 27047, 27111, 30283, 30138, 24619, 21700, 19218, 15915, 15881, 15406, 17323, 19254, 23672, 27183, 28040, 26716, 28887, 26359, 22080, 19085, 18399, 19833, 24727, 26092, 20342, 13032, 12952, 16700, 15838, 16474, 20023, 21056, 18833, 18576, 22980, 21974, 26756, 28028, 22027, 21275, 21357, 17903, 20809, 21971, 17585, 16118, 17834, 21837, 24956, 22372, 16784, 16311, 14717, 21153, 23798, 25613, 21094]
11655B1094q838o17K158K15L748M004j645K15r41K331L063J141R56k199j429k248
11639B1008j35J530n723j594L105k934Q04J053N50L734K068p04m83O1l029r85
11623A8326L318l357p93j105Q118L122p1m237k22M80k033j191M773P61m256J63
11607B1796rj228p0M82P09j473M812M945R91m134j685K870j385J605J12m256O06
11590B4688k67k770M743J361j317k533m64K421Q74L852P36L943J384j159J559
11575C7051O74K263J722R05l31K598K019l193N93O013L953M336K475N096L298
11560F9472O990R162L897K610k62k462k044l339l767Q46j964q97M310Q60R14P709
11544I2035M643k9J2m94Q825P864P99K083J0050N655K773o18P05L53l45k293j407
$$ y = [21094, 12256, 11639, 13797, 14012, 17760, 21764, 20119, 20334, 19393, 21724, 24787, 25928, 26884, 24685, 23256, 21008, 20873, 22403, 16680, 15086, 18191, 15257, 16061, 17114, 17664, 21398, 23466, 22762, 22279, 22340, 19311, 18326, 21644, 18287, 17494, 16389, 24507, 27629, 27558, 23321, 23099, 23579, 21546, 20355, 25128, 25889, 21633, 21796, 21787, 20559, 20489, 20971, 21680, 20207, 25019, 29964, 30955, 26821, 25136, 28006, 26621, 28226, 28338, 24082, 24688, 24421, 21651, 26394, 27755, 26438, 23905, 23441, 25862, 26736, 30588, 31324, 35267, 36651, 35492, 37051, 37725, 39988, 41710, 42615, 42284, 44882, 46901, 43708, 44301, 50314, 54267, 58603, 61078, 66174, 69472, 76462, 85624, 89521, 92131, 91869, 89407, 87363, 84024, 80257, 81103, 79139, 78242, 82552, 83412, 84326, 92035, 96678, 96649, 96661, 96167, 104992, 112856, 113655, 115738, 125788, 131443, 134216, 133598, 134303, 134656, 134311, 132018, 130611]
11527A30611J092L297l180l154m611m623j333m796q639n109m876m168l733j406
11513H5372k031l282l223m497k791k358l766m176l352j317J379K020M08J005j549
11498E7842o493L62J262k03j85L641J694j087k654j491j851k807n46k951J303
11483D5836J719j453k229l291P45J517j289J87r96r52N11J037m92k210M825J253
11467D4718j301l466j818r98r48m33P332O660m12k617K188L88N24n260k74K238
11451D6521L734K235m48J220M583O428O791J2354J6412J9846J5823J6078L2r802
11437A41807j6588j8552j3318q742p883p936m405p82k740p220p580m076m94J80
11423D1671K915j39K390O438R324J3885M846j4035j3016j0008l975r96M18L80
$$ y = [130611, 131703, 135000, 131820, 128666, 124055, 119432, 118099, 113303, 104664, 99555, 94679, 90511, 86778, 85372, 83341, 80059, 76836, 72339, 69548, 67190, 63424, 59248, 55896, 54579, 55958, 57978, 58386, 59391, 57842, 51349, 51711, 52973, 52770, 52585, 56226, 57920, 56833, 54179, 52688, 50837, 48030, 47484, 44533, 45836, 47555, 46102, 43873, 40582, 41327, 42844, 41555, 41742, 40746, 39794, 40305, 41342, 40850, 38640, 43465, 44718, 43417, 39951, 38133, 37135, 36187, 35754, 43086, 49746, 49334, 46717, 48905, 49293, 49817, 44557, 44283, 46521, 50255, 52490, 52042, 53262, 57845, 64273, 71064, 83418, 99830, 119676, 135499, 151577, 151609, 141807, 125219, 106667, 93349, 84607, 76724, 68788, 64383, 63601, 60861, 53641, 46061, 41985, 41491, 41671, 44586, 44447, 46837, 53275, 62599, 76484, 81330, 67295, 54279, 44271, 40296, 39300, 39718, 40098]
11409D0098J612q60q93K697l0n62k491k256J985N664K869m647k728M382L030J374
11393D9244N4K236K242M369R215J7825K5947K8555K0487n263k3581j9447j7327
11380I4556j3089o351l301m195j0151J061K347j23k599j083O74r50J161j428n468
11365E1061o33M182O134O001M448Q362J0830J7123K4912L2701L8607J9603n418
11352B17913k0568k1197j6590j8995j4737r772q387k240K525N92m40l600k271
11339A02233L806Q630M763J276L303J291L442J783l60K928L591L313K965J791
11325A44755J373m399p253m661n103o097q248n764l597o989r205l655k600J214
11311G9771m739l963M01J325m443j1012q112L734K063K473J376m653j803L391
$$ y = [40098, 41710, 40850, 39957, 42654, 42624, 42062, 39571, 37315, 39300, 44964, 47833, 43186, 40458, 44840, 47870, 49244, 49298, 51534, 53776, 58145, 67360, 85185, 111132, 139687, 160174, 154911, 131330, 111883, 94556, 81467, 75116, 71815, 67620, 57469, 58530, 60877, 60754, 58155, 57072, 57746, 56796, 57957, 56529, 51061, 50428, 54610, 60744, 66745, 71193, 79555, 90385, 107508, 132420, 165121, 203728, 223331, 217913, 197345, 176148, 159558, 140563, 125826, 116054, 107667, 105427, 107952, 108544, 108104, 104504, 102233, 106039, 114669, 119432, 120708, 124011, 125302, 128744, 130527, 130167, 133095, 136686, 139999, 142964, 144755, 146128, 141729, 134476, 129815, 124712, 118615, 110367, 104603, 101006, 94017, 84812, 81157, 78557, 79771, 75032, 71069, 71470, 72795, 68352, 57340, 49228, 52962, 55025, 57498, 58874, 54221, 52418, 55809]
11297E5809J390k946m188l109k771L78M998J615J833K53n698j826J369K021k18
11282D8910j604m726q95J8j551J789L536L333m541m656J888N537J952K089j286
11267D9793p18l167k943J23n51J206l236K355K113j912j302k277l502j264L261
11252C7979N234Q96l180K646L829n40j517l020m44J057l197j514J218j411L086
11237D1122M381q60J243j516l274J419q69N00O79j657j890q56J660J675K639j711
11221D2685O17L861k064R14J177M523J335j035q29q72p4Q64J337L423K583n517
11205E2928J249Q276p20k49J300l411R21N008L517O906N465J832K396K749K862
11190I1029o672r270p467p352l259q79n425m119P70L035j723k875k883J472O30
$$ y = [55809, 57199, 54253, 50065, 46956, 44185, 44563, 49561, 51176, 53009, 53262, 47564, 45738, 47107, 49128, 48910, 47306, 42580, 41685, 41703, 40152, 41941, 45477, 48810, 44269, 39613, 41501, 47038, 48990, 51079, 49793, 49075, 45908, 42965, 43088, 42537, 43743, 40507, 42862, 44975, 43063, 41761, 39484, 35982, 34718, 37979, 43213, 44109, 40929, 43575, 47404, 46864, 45347, 42327, 41883, 42940, 39743, 38229, 39447, 38036, 41122, 45503, 44643, 45886, 44370, 41096, 42515, 41646, 42146, 42825, 41168, 39278, 38422, 40082, 41757, 44396, 42685, 43302, 47163, 45099, 46013, 47190, 51713, 53048, 52013, 51184, 50312, 50238, 51102, 52439, 55862, 58445, 52928, 54177, 62453, 61733, 61484, 62784, 59373, 60294, 65302, 68819, 75725, 81190, 83022, 85418, 88167, 91029, 84357, 75087, 67620, 60268, 57009, 56130, 50705, 46586, 47356, 50391, 48668, 45793, 42910, 44382, 45012]
11175D5012k347k37J558M167J595k26M279M240K349L20o89q38q57M002l303l950
11159E5075J488K705p14N6j598r73M259K427k784r88O44P77l393j090P658J282
11143F4831n07n68l041J181O72p8k698k212L566L539r79n413m705q88L98K097
11127E5195P3J38L705J148J269k712k264J353K709j544L13J475j751p53Q87j461
11111E7780q07N68M496J461r59j157p8J656j306l219o684m75P260q24n145o12
11095E1955J473Qk102k70j361j168K841n73N94J602J795O23j27R01k52K50J566
11078E7755K401K312N70M36K111L586K558K074O464O989J1497J2888J0042J1244
11064A32927M476o511j1377j2168r362j1660j1718k790j687Q82L423r4n63j205
$$ y = [45012, 42665, 42428, 43986, 48153, 49748, 49522, 53801, 58041, 60390, 60710, 60021, 59183, 58326, 62328, 59025, 55075, 56563, 59268, 58554, 58610, 57012, 56039, 60298, 62725, 59941, 58953, 59597, 60374, 56981, 55891, 63549, 64831, 64324, 63756, 60715, 61896, 62568, 62490, 59792, 57580, 61146, 64685, 63706, 58293, 53588, 52700, 53098, 55195, 55268, 55406, 59111, 60259, 61528, 58816, 56552, 57905, 60614, 59070, 59383, 60858, 59107, 58354, 59241, 57780, 56973, 57541, 62037, 63498, 62539, 61382, 61304, 62960, 61654, 58435, 51751, 51276, 58536, 57712, 52567, 51955, 53428, 53436, 51334, 51064, 49703, 48535, 51376, 50803, 51397, 52999, 54794, 55417, 55290, 56191, 55939, 56189, 57755, 60156, 62468, 63038, 63474, 65585, 69171, 71729, 73803, 80267, 87256, 98753, 111641, 121683, 132927, 137403, 130892, 119515, 107347, 97985, 86325, 74607, 71817, 70130, 71012, 74435, 74341, 73778, 72573]
11050G2573O18R89J365k791n31pK55l893l469k447m31N27R50l93l760m253M46
11033E5748M71k801O165N490M8k986k338K40O72R36R66M711L133J240K519J933
11017G6147j318N8m608k611K115L382l702k990O37J463k385l227J305J040M488
11002F9794J501l826l020j178p90J130L222k776j306K897K759N059L308J763K794
10987H1331m988n048J548K578M68k263O12k145j844m39M629N217K548J766j147
10972H2823m730r39L87o24L303J970j595M282M508K56O41k920J161n2k592m5p29
10955H5105J215M828q5j902q75n230p822o37K799O571P8m351j748j31k815k699
10939G2301p43J221M206K178L067J746L842J977j211N24N451j481K785N395K078
$$ y = [72573, 73191, 74180, 75545, 72754, 72223, 72216, 72471, 68578, 65109, 62662, 62231, 62758, 63708, 63315, 59555, 55302, 55748, 56219, 53418, 59583, 65073, 65121, 62135, 59797, 60037, 60709, 61645, 62611, 67322, 70455, 71695, 74214, 76147, 74829, 74887, 70279, 67668, 69783, 73165, 69463, 66473, 67110, 68573, 66188, 62961, 64266, 65306, 69794, 71295, 67469, 64449, 63271, 62481, 63611, 66833, 64057, 62751, 65648, 68407, 73466, 76774, 78537, 81331, 76343, 71295, 72843, 75421, 75889, 73626, 74238, 72093, 70249, 69810, 74439, 79656, 82204, 83970, 82823, 78093, 77154, 77541, 76917, 80220, 82190, 80595, 84877, 89385, 89641, 90282, 87362, 88523, 88471, 85879, 85834, 85105, 86320, 91148, 91063, 89161, 88286, 83056, 75234, 74597, 77396, 83967, 84045, 79694, 77946, 77815, 75000, 72301, 71558, 72779, 76985, 79163, 82230, 83976, 87818, 89795, 88584, 89108, 94559, 93078, 95863, 101258, 103336]
10924A03336K342M845R569M558Q11m216n028n02k15J104j044o78J972q30K192
10909A18216p36n849K199J691K708J3808J7456O401M717K954n65Q761J1431Q568
10895A91760P683O262J4605J8001J9702K4186K1641K6880L1626L5142M3165N3795
10883D94448N7875O0266O3817O6411P6203R7200J49815K53768M04637M33402N4316
10872B212158l57680m60298l67000k46271j52192r4756o9789n9511m8428l8303
10862C17930l0975k5413k4234j6951r690p052o795k496l715l386J0718J7126K7203
10849B42270J3141q580l3334k3927j7064j7451j3344k514J21J206o944m438l152
10836A25990j586K241K484J834M939J003l323p55O53j941M910j024m18j378k976
$$ y = [103336, 105678, 110523, 120092, 124650, 125461, 121245, 116217, 115715, 115500, 116604, 115560, 114882, 116854, 116024, 118216, 117480, 111631, 113830, 115521, 118229, 132037, 149493, 155894, 160611, 163565, 163000, 171761, 183192, 191760, 199443, 205705, 220310, 238311, 258013, 282199, 303840, 330720, 362346, 397488, 440653, 494448, 552323, 612589, 676406, 742817, 819020, 916220, 1066035, 1319803, 1724440, 2157842, 2212158, 1854478, 1394180, 1027180, 780909, 628717, 533961, 464172, 404661, 356233, 317930, 286955, 261542, 237308, 220357, 210667, 203615, 196820, 194324, 190609, 187223, 197941, 215067, 242270, 255411, 246831, 213497, 189570, 172506, 155055, 141711, 139197, 139318, 140524, 133580, 129142, 125990, 124404, 126645, 129129, 130963, 135902, 136905, 133582, 132827, 133480, 131539, 136449, 135425, 135007, 133629, 130653]
10821A30653l840m313l173M149K940q22j417k536M754L662l98q85M093J51N48
10806A33566p50K41j25L37J791j011j810L013P61n57K777P32q54l731K972J812
10790A39164j531K927K770R55p7k341l229k36K768J422L88M470L192M499M601
10775A59742j137n370n214N97L963K878J907n390j1768j0639m695J17L158J0805
10761A38954Q287Q876J0781M535O63N191N381Q018L618P33J425L698L567N965
10747B09692R400M835L909J679M298J0579R253N007L33j0550j0978n988P332M853
10733B43654j919n774o830K888P307j192j146l250l927P395R401P735L056J900
10719B59298N097J1408Q545O898P264N221k991q643o884o633n025o730P16L918
$$ y = [130653, 126813, 122500, 119327, 123476, 126416, 125594, 124177, 121641, 126395, 130057, 129659, 128774, 132867, 133018, 133566, 132816, 133057, 132932, 133269, 135060, 134049, 132239, 135252, 136013, 135456, 138233, 138965, 138111, 134380, 137352, 139164, 137633, 140560, 143330, 144285, 144208, 141867, 138638, 138402, 141170, 142592, 142980, 147450, 150642, 155141, 159742, 158605, 153235, 148021, 148618, 152581, 155459, 157366, 151976, 140208, 129569, 124874, 124991, 128149, 138954, 147241, 156117, 166898, 171433, 172096, 177287, 182668, 190686, 194304, 195037, 196462, 200160, 203727, 209692, 219092, 223927, 227836, 229515, 233813, 244392, 253645, 258652, 258985, 248435, 237457, 231469, 238801, 243654, 241735, 235961, 229131, 232019, 239326, 238134, 236988, 233738, 229811, 237206, 246607, 254342, 257398, 259298, 264395, 275803, 284348, 291246, 298510, 303731, 300740, 292097, 285213, 278580, 273555, 266825, 267541, 271459]
10705B71459L69m518n285n426q534l632k741l327J890J753L736j202L771J351
10691B49664K90M200J931O800J2574P913P466l651q134k088K888M881N74l830
10677B81478p410k086r39n02L100l115n070P66M300R73M873J936m80J672O566
10662B86062Q701K194j1080j1953j1672j6974j2425n373j955Q94m226r528l237
10649B09428J697K659n5m001J0011K7378K2552J5383R993O066P81k151k330K278
10635B99689L672Q490J2614P024k203l105N399R252L498N64j822L34l20k829r78
10620C39279j556k39N165j1748k6896j4893K1270M7845N1512K1898k366J1320
10608D40591M5711M5852L5542M6620L8867n482j2976K1283K6107p629k0751J1376
$$ y = [271459, 271828, 267310, 262025, 256599, 248065, 244433, 241692, 238365, 240255, 242008, 245744, 244542, 248313, 249664, 249954, 254154, 256085, 262885, 275459, 283372, 290838, 287187, 279053, 276965, 279853, 284734, 285308, 281478, 274068, 271982, 271043, 270541, 273641, 270526, 265456, 266222, 270522, 271495, 276368, 278304, 277824, 279496, 286062, 294763, 296957, 285877, 273924, 262252, 245278, 232853, 227480, 225525, 226419, 222193, 212665, 209428, 211125, 213784, 213729, 209728, 219739, 247117, 269669, 285052, 295045, 301111, 301892, 299741, 297411, 299689, 303361, 311851, 324465, 331489, 329286, 326181, 331580, 340832, 344330, 344894, 343072, 343406, 343086, 340257, 339279, 337723, 337484, 342649, 330901, 304005, 289112, 310382, 358227, 409739, 431637, 429271, 440591, 486302, 532154, 567696, 614316, 653183, 647701, 634725, 656008, 682115, 674486, 653735, 665111]
10596F65111K4266k5944n4947m2957r082K7971L3895J5425k3704l2064j4256j490
10584E62224j0671p205M913J6244J7356Q852J1172Q014J5704J9447J3442O627
10572F66119M136K142R90O981J2785K0433J2590O318N981J0416K7018L9282L2565
10559H47756K7008K7612K5228J7866K1566K4852K0280J9197K3665K1342J4623
10548A090995J2636K5821M0276M7045L5770K8849K1264K1501K9697K8618K7722
10537A410194K7613L4607M2453L7082K6213K2353M2867O8948P8837O7639N8870
10526A917676M1178J9549K0540M8872Q0351R6700J09642J23040J42928J82251
10516B782727K73951M42331P19455J082147J046477J04554o71373p64498n19134
$$ y = [665111, 689377, 663433, 608486, 565529, 556447, 584418, 618313, 633738, 610034, 577970, 563714, 562224, 551553, 544348, 549261, 565505, 582861, 591713, 602885, 610899, 626603, 646050, 659492, 666119, 670255, 672397, 673387, 680368, 693153, 713586, 726176, 732494, 738475, 748891, 775909, 815191, 847756, 874764, 902376, 927604, 945470, 967036, 991888, 1012168, 1031365, 1055030, 1076372, 1090995, 1103631, 1129452, 1169728, 1216773, 1252543, 1281392, 1302656, 1324157, 1353854, 1382472, 1410194, 1437807, 1472414, 1514867, 1551949, 1578162, 1600515, 1643382, 1712330, 1791167, 1858806, 1917676, 1958854, 1978403, 1998943, 2047815, 2128166, 2224866, 2334508, 2457548, 2600476, 2782727, 3056678, 3499009, 4218464, 5300611, 6347088, 6451642, 5780269, 5015771, 4496637]
10507D496637k55968p0872K8583P5821J26560J80096K10297K21764K50093L06473
10497E569484L33914L09607L21631L78219M42523M83377N48377O83582Q72875
10488I943589J102003J063119O12688M12369O01193R46775J258119J488470J719372
10479A9147697J963463K290110K751472L316891M146001N299744O552966Q001617
10471E3469961J0454394J4728771K2301374L5691012N7989789Q5979011Q2224412
10464C62838724J0590447n1344349o4781171m9691280l1111598j9473260j4257187
10457A42770326j3102691j3669397j3715197j2847029j1478856r955395q500795
10450E9500966p333864o323913n378620m490012l745090l157283k659392k188099
$$ y = [4496637, 4240669, 4169797, 4198380, 4274201, 4400761, 4580857, 4791154, 5012918, 5263011, 5569484, 5903398, 6213005, 6534636, 6912855, 7355378, 7838755, 8387132, 9070714, 9943589, 11045592, 12108711, 12721399, 13133768, 13734961, 14681736, 15939855, 17428325, 19147697, 21111160, 23401270, 26152742, 29469633, 33615634, 38915378, 45468344, 53469961, 63924355, 78653126, 100954500, 136645512, 194635301, 280614312, 362838724, 373429171, 322084822, 257303651, 207612371, 176500773, 157027513, 142770326, 129667635, 115998238, 102283041, 89436012, 77957156, 68001761, 59500966, 52167102, 45843189, 40464569, 35974557, 32229467, 29072184, 26412792, 24224693]
10442B4224693j726085j379709j519531j797458j738939j458450j178728r56720
10434A2469073p96799o84715n61704m58407m12022m25063m61651m81881n14202
10425G672629n33616n11110m67864m21451l91935l71858l34756k67595k17371
10416D155073j88009j59125j39272j42372j46523j40693j35259j19487j03408
10407B880925r6650j06880j21371j30326j31238j13018p9111n6843m4542m2464
10397A958482n5205p5429p6783o2189n1940m7079m8595n2691m9800m7159m7591
10386A344021n4444m7039k8215j9243k0568l1593l3353l4526l0024j9966k0827
10375A004223k6233k1624k4191j3335n513q355m910J996R936Q847j6903k7202
$$ y = [24224693, 22498608, 21118899, 19599368, 17801910, 16062971, 14604521, 13425793, 12469073, 11672274, 10987559, 10425855, 9967448, 9555426, 9130363, 8668712, 8186831, 7672629, 7139013, 6627903, 6160039, 5738588, 5346653, 4974795, 4640039, 4372444, 4155073, 3967064, 3807939, 3668667, 3526295, 3379772, 3239079, 3103820, 2984333, 2880925, 2784275, 2677395, 2556024, 2425698, 2294460, 2181442, 2102331, 2045488, 2000946, 1958482, 1903277, 1827848, 1751065, 1688876, 1636936, 1589857, 1541262, 1488571, 1438771, 1391612, 1344021, 1289577, 1242538, 1214323, 1195080, 1174512, 1142919, 1109566, 1075040, 1045016, 1025050, 1004223, 977990, 956366, 932175, 918840, 913327, 904972, 900062, 902058, 911994, 920841, 903938, 876736]
10363H76736k3989j9389j5016j3114j1622k4299k9382k2621j4826j2375m571J180
10351F86712k56m701o602K669O060l011l394M777k773k2245k9922m748J9050K2186
10337F63802O648j9970n1242p0489k7097K2120J687m4315k8113l871k1066m6573
10325C81521m4032j9609r41J6914L7070L0936k341j8656l872K9152L2519J1760
10313D50421j7759k7862k2532p751P77n719j3793j7420j1956o534p777j3483o476
10300B92136l106o522r577j0235k637M64K82o036r624n612o370o064m731m240
10286B18128P046J4241J8712P907m707k006K685L701J301j582k302L198M009o893
10272B63438j6428j8971j9757j8400j7535m749j783l352n802o057n118k620j749
$$ y = [876736, 852747, 833358, 818342, 805228, 793606, 769307, 739925, 717304, 702478, 690103, 685532, 686712, 686456, 681755, 675153, 677822, 683882, 680871, 677477, 682254, 679481, 657236, 627314, 622566, 641616, 663802, 670450, 650480, 599238, 528749, 501652, 523772, 525459, 481144, 453031, 449160, 428094, 381521, 337489, 317880, 316939, 333853, 370923, 401859, 399518, 380862, 376990, 406142, 438661, 450421, 432662, 404800, 382268, 374517, 375294, 369575, 355782, 338362, 326406, 319872, 312095, 298612, 292136, 289030, 282508, 272931, 262696, 260059, 260523, 260805, 254769, 245145, 239533, 233163, 227099, 222368, 218128, 225174, 239415, 258127, 266034, 261327, 259321, 262006, 265707, 267008, 265426, 263124, 266322, 270331, 263438, 247010, 228039, 208282, 189882, 172347, 167598, 165815, 162463, 156661, 150604, 145486, 142866, 141117]
10259A41117P05OJ587l420k930k672m859o437j0157j2285r658k065L196m033j2165
10244G5930p630J68J973P218P219J235k768j629L037L053J23L135l822k48k000
10229H4994K086M64l050m57O88P65m301K528O315N5l52k361j0192j2238r698l006
10213E2240L555J656L59j167l082N72M194Q000L911L142L338Q42m164l475k040
10198F7881N650M681o14l139j542O63n526j3779m894n762j272K965q51q6K292
10183D6667L198Q540P300L645Q913O873K196m150k311k026P55P23j56M09M425
10168H5001L097L46J156M502N636M167j0903j1991j539k243j216k495m120k613
10154F6785l878L422N376N386O208P987Q707J0836J9970K6531L2931M5015N9268
$$ y = [141117, 141822, 141828, 143415, 139995, 137065, 134393, 129534, 123097, 112940, 100655, 90997, 88932, 92128, 88095, 75930, 68300, 68468, 70441, 77659, 84878, 86113, 83345, 81716, 84753, 87806, 87929, 91064, 87242, 86994, 84994, 87080, 87544, 84494, 84037, 84725, 85490, 81189, 83717, 90032, 90087, 89735, 87374, 77182, 64944, 55246, 52240, 55795, 57451, 57810, 56643, 53561, 54133, 58327, 66327, 70238, 73380, 76718, 77560, 73396, 69921, 67881, 73531, 78212, 77598, 74459, 72917, 73580, 68054, 54275, 49381, 43619, 42347, 45312, 44461, 44375, 46667, 49865, 58405, 65705, 69350, 78263, 85136, 87332, 83182, 80871, 78845, 79600, 80323, 80167, 80576, 85001, 88098, 88444, 89600, 94102, 99738, 103905, 93002, 81011, 79472, 77229, 76013, 73518, 69398, 66785, 62907, 66329, 71705, 77091, 83299, 91286, 99993, 110829, 130799, 157330, 190261, 235276, 294544]
10141B94544O3686M9129J1124k9108n1946n8213m9102l7689k9016j9460r211o634
10129A28104l040r311r073j0487j0188q937k161j232j445l962n467k567p491q829
10115D3914M38N106L510M67K168J146k852n342m917m814k237O49J818o44j941
10100C6469R53L533O005Q954N984j571m12P40k300M785R8r04j78k845j388L633
10084F1556R13n80K766k576n016j052J17L127L397L7J951L844M724L812L673J279
10068H1972J414R140M873P893N550O185R707L351J2483K2063K7566L5131M8000
10055B75328P4340J22957K13010L60618N08490L54157j23261l87718l74027k58881
10045G65013j51892q4155m3870j7646j238J0983J8702K0827K8520L1673K2815
$$ y = [294544, 358230, 407359, 418483, 389375, 337429, 279216, 230114, 192425, 163409, 143949, 134738, 128104, 125064, 115753, 106680, 96193, 86005, 77068, 74907, 73675, 72230, 68268, 62801, 60234, 52743, 43914, 44352, 49458, 52968, 53435, 55603, 56749, 53897, 48555, 43638, 38824, 36587, 37236, 39054, 38410, 36469, 37422, 40955, 46960, 55914, 61898, 60327, 59915, 60655, 58355, 63140, 63238, 62334, 62156, 59311, 57923, 61556, 62469, 61889, 64655, 62079, 57063, 56011, 56128, 59255, 62652, 62689, 64640, 68484, 73208, 77020, 80693, 81972, 83386, 92526, 97399, 105292, 110842, 117027, 126734, 130085, 142568, 164631, 192197, 227328, 275328, 349668, 472625, 685635, 1046253, 1554743, 1908900, 1785639, 1397921, 1023894, 765013, 613121, 528966, 485096, 467450, 466212, 477195, 495897, 516724, 545244, 576917, 599732]
10034E99732M03j5894k9973m0488m1262m3369m1037l8455k6994j9234k1625k9054
10022B52750k7547k6843j9873j4534p355j2209j5604j1814r049o330p730o603
10010H7259m941o957r534j0140m822j343j765J691J657M570J130k978k070k56
9996E1501k188M969J401K312K329j912j223l259P04r95N779O484P860o047n661
9981F2054n063o631n957K50L155m91k921n62M591J52K270L021l42m421lq00n269
9964D3033o933j445K257m660o583j404o298k121J712L336l050n690J317M28L924
9949A7823O005l682p085L91K305j235k250N665P4J419J532j675L13O86Q07k189
9933A8904Lj228p35k670J207L928k790J431P176N882m870j952J486J21j013k278
$$ y = [599732, 600135, 584241, 554268, 513780, 472518, 429149, 388112, 349657, 322663, 303429, 281804, 252750, 225203, 198360, 178487, 163953, 156598, 144389, 128785, 116971, 107922, 101592, 93862, 87259, 82318, 75361, 65827, 55687, 50865, 49522, 47757, 49448, 51105, 55675, 56805, 53827, 51757, 51501, 49313, 54282, 55683, 57995, 60324, 58412, 57189, 53930, 54634, 53639, 59418, 65902, 73762, 67715, 62054, 56991, 50360, 44403, 44653, 47808, 47317, 44396, 43834, 48425, 48577, 50847, 53868, 53526, 49105, 49102, 48302, 43033, 36100, 34655, 36912, 32252, 25669, 24265, 17967, 15846, 17558, 20894, 17844, 12154, 13471, 13899, 17823, 23828, 20146, 13061, 13452, 15757, 14522, 12272, 17937, 18011, 19430, 20962, 19287, 19600, 20286, 21093, 18904, 18907, 17679, 16944, 14274, 15481, 19409, 16619, 18050, 25226, 31108, 26238, 24286, 25772, 25893, 24880, 22602]
9917B2602k104J631j242l548K62n09O76n666j946j689O301K395K124J549J770
9902B2606k348l55k221K637K813j929j512p39K17j946j768L58m20J324k335O80
9886A5062j418j111j662L74j051q81J979J535k019j464l78j466L857P288K110
9871B0755k33j746n94k730M648L145l749p603J165O14M100j269N9P43k590o111
9855H604l65M726L533R59R70n07M66j902n371L379M035P54k6m43K132J230j342
9838B0832l676K081L845M21l440R47j858q11j6M831K205n01r18J359j769m2k403
9821B1087j580J858R84k496m405L287L971k693J306j689j103q41j383L389j988
9806A7704k795K661O097j68o56l564j827k53p38k516J051K013J111j053J250L254
$$ y = [22602, 20498, 22129, 20887, 17339, 17601, 17092, 17768, 12102, 10156, 8467, 14768, 17163, 19287, 20836, 22606, 20258, 19903, 17682, 20319, 23132, 21203, 19691, 18952, 19169, 17223, 15455, 15813, 15393, 16717, 14382, 15062, 13644, 12533, 10871, 11245, 10194, 9313, 11292, 12827, 10808, 9344, 8966, 7500, 11357, 18645, 20755, 20522, 18776, 18182, 15452, 20100, 23245, 19496, 11893, 13058, 13672, 17772, 16503, 16562, 17305, 14715, 8604, 8239, 12965, 16498, 17457, 18427, 17920, 18386, 16484, 11113, 14492, 18527, 19281, 19255, 18812, 20944, 22174, 20832, 17156, 19237, 23082, 23503, 20063, 21010, 19152, 18341, 18325, 23156, 25361, 24860, 23942, 25301, 23532, 23490, 21087, 19507, 21365, 22349, 19853, 15448, 18735, 22706, 20013, 21319, 19630, 18527, 17686, 16303, 19692, 17704, 14909, 17570, 23667, 23499, 22843, 19279, 17452, 17199, 16461, 13945, 14996, 17009, 18120, 17067, 18317, 21571]
9790B1571N392N176O036K407j194K811M251P905O66p472m646q685n664l03k89
9775B7962l952l62m222o54P11K909K436Q77Q4K818k244l421J849J353O88L037
9759B9869P92m848m352K304M142M222j083l323j469M700K781P91K955O561R697
9744E3739J4021J9978J6969j592j4705j9425j5990j3647n413K45m11j348k060
9731C0361k803o973j082O83M783J148o9J844k264m93q62l746J570J472J492J543
9715B6604m025k524K792j997K00J691L614M137l863j270L11j236j288o37J475
9700B3984M246O18j825l287m847k622j852j80M550j341j456m41M107J832O50M566
9684B6702M326j621K335p80m216o554J263l83J773J408K81J31J036M053p161k387
$$ y = [21571, 26963, 32139, 38175, 40582, 39388, 42199, 46450, 54355, 55021, 47549, 42903, 34218, 28554, 28251, 27962, 24010, 23648, 19426, 18772, 19483, 22392, 24828, 25705, 25789, 28607, 26363, 22942, 24791, 26144, 26832, 29869, 30661, 25813, 21461, 23765, 27907, 32129, 31046, 27723, 26254, 30954, 33735, 34526, 37481, 44042, 53739, 67760, 87738, 104707, 103115, 88410, 68985, 52995, 39348, 33935, 34180, 33769, 32421, 30361, 27558, 20585, 19503, 20186, 24969, 26117, 26048, 27892, 25628, 25135, 24273, 20527, 22097, 23569, 25061, 26604, 22579, 20055, 22847, 20850, 21050, 22741, 26355, 30492, 26629, 25359, 25670, 24434, 23146, 22509, 23984, 28230, 28848, 27023, 23736, 18889, 16267, 14415, 14235, 18785, 17444, 15988, 15547, 19654, 21486, 22136, 26702, 31028, 29407, 31742, 30962, 26746, 20192, 21455, 21072, 22845, 24253, 24534, 24665, 25701, 29754, 22593, 20206]
9668B0206O782M539R2l358q87n69R37K88j000m70L05L08l366j348j23M727K742
9651B9805J134k193J086J1j070n22J431M52m028l73k358K055K959r46j351J434
9635B7526l975k366J336j539M37M656K78O07K413l13l684L597J066K872m822m291
9619B3798J484K709L834L103J832j497K379J16J19J481m3n217q99k900j57O24
9603C0766L59k123j712n998M723M50L308k453J530N71L94n221k136k274k868J020
9587A8336K049J575L116O499M5j695K609K404l834m453l720L419M981M54j285
9572C0500m271j644J900J479M346j162k489J408L131J892K292M64j949j295k788
9557C1814m36N16j105j834J690j901K886n16L87l25l978k278o32J543N858k38
$$ y = [20206, 26988, 31527, 31619, 28261, 27374, 26805, 27742, 28030, 27030, 26560, 26865, 27173, 23807, 22459, 22336, 27063, 29805, 30939, 28746, 29832, 29843, 28773, 28251, 29682, 30134, 26106, 25733, 23375, 25430, 28389, 27443, 26092, 27526, 23551, 21185, 22521, 20982, 21419, 26075, 26353, 26960, 29373, 29060, 25376, 28973, 30039, 32911, 28089, 23798, 25282, 27991, 31825, 34928, 36760, 35263, 37642, 37758, 37877, 39358, 39315, 34098, 33199, 30299, 30142, 30766, 31125, 29002, 27290, 21292, 26015, 26465, 29773, 27320, 28850, 29421, 29815, 24594, 22458, 20184, 17316, 18336, 20385, 21960, 25076, 31575, 31620, 29925, 32534, 34938, 31104, 26651, 22931, 26350, 31331, 31785, 30500, 26229, 24585, 26485, 27964, 32310, 31148, 28659, 30067, 33198, 35090, 37382, 37846, 35897, 34602, 31814, 31378, 31894, 30789, 28955, 30645, 28744, 31630, 31114, 31501, 31176, 27198, 24920, 24288, 25831, 31689, 31451]
9541C1451k178l742J134N800J490o76l42k776R63j435k795J555l359q5J340J731
9525B8076j488N04O446N904J168p945q187r2K988L342L282M538k461J84k433j5
9509C3811j687m17K464L491J294o69l631K94L273L907m71M822L172J527n73L074
9493E3681K767j249n31n606J127l11k956O83L100j004l747p01O8k865k603L720
9477D3573n03j867m609R97J945J208j367J688K215R96K601K949K786L334O571
9462F2517M525Q254Q253R399J2047J3959J9111J9784J5620L747p556j5593j7156
9449A36911j8304j6080j2988o798q928l830q153n8p11M36r83k324j553r81k090
9434E3566j94m791J28J491j73PK535N64J024o92L524K808M889J200O053N719K912
$$ y = [31451, 29273, 25531, 26665, 32465, 33955, 33279, 32937, 30161, 31124, 29689, 26894, 28449, 25090, 25005, 26345, 28076, 26588, 27092, 33538, 39442, 40610, 32665, 24478, 24386, 27374, 30716, 33998, 38536, 36075, 36259, 33826, 33811, 32124, 31707, 34171, 37662, 38956, 38287, 34656, 34950, 38223, 42130, 41659, 46481, 49653, 51180, 50607, 53681, 56448, 55199, 54668, 49062, 50189, 49878, 46922, 47605, 50705, 49701, 45954, 45253, 45321, 42456, 39853, 43573, 43070, 41203, 36594, 37591, 39536, 40744, 39377, 41065, 43280, 44276, 46877, 49826, 52612, 55946, 62517, 67042, 75296, 83549, 92948, 104995, 118954, 138065, 157849, 173469, 177216, 169660, 154067, 136911, 118607, 102527, 89539, 82741, 73813, 69983, 61830, 61772, 61061, 61497, 60514, 58190, 56637, 55656, 53566, 53372, 48581, 48709, 50200, 50027, 50034, 52569, 53133, 54157, 53465, 56989, 59797, 64686, 65886, 71939, 77658, 80570]
9417H0570M831R035J3747K0983K2058J1999J450m463j4149j4212j6612j3741j0141
9404I1355j2119r965m465J411J26l520n736o940k257J106o24m61p326k022L460
9389D2023K454k57l564l353m50L206K642L701j710R59L98k069k465J545N05J058
9373D4623l809r97L269J896M60K836K057l561l954K790L160k506n117J993K731
9358D5871P65j860N42M84l224n09j753n24J595k935j758L169l41k275R61m64k143
9341C5601K941N726O377l841l026k178J15L639K844p93q0k69O409l33k500j973
9325D8659p71M579m061l700K480j240n93O57j649L478J958n537q39N797M431j028
9309E2621l930O30l829n123j94L208J817k58j275o6N83m45M542R18R12l376o403
$$ y = [80570, 85401, 94436, 108183, 129166, 151224, 163223, 164673, 160210, 146061, 131849, 115237, 101496, 91355, 79236, 69271, 64806, 66217, 66343, 62823, 57087, 50147, 47890, 48996, 48372, 47911, 40585, 38563, 42023, 44477, 44220, 40656, 37303, 36853, 40059, 42701, 46402, 44692, 45651, 46049, 43980, 41515, 43060, 43565, 44623, 40814, 39817, 43086, 44982, 45442, 48278, 50335, 46774, 42820, 45610, 48770, 46264, 41147, 43140, 45871, 46636, 44776, 45318, 45802, 42578, 42069, 40316, 39792, 41387, 38452, 36694, 39863, 39522, 37247, 38208, 37744, 35601, 38542, 44268, 50645, 46804, 43778, 41600, 41715, 45354, 48198, 47405, 47325, 47056, 53465, 53132, 50632, 48659, 47888, 52467, 48406, 44706, 47186, 45946, 45353, 46010, 44361, 47839, 49797, 44260, 43421, 49218, 53649, 52621, 48691, 49321, 45492, 40369, 40175, 43383, 45200, 44942, 43667, 43601, 44184, 43739, 48281, 49199, 50111, 46735, 40332]
9292D0332k324L698N935J118l676nj308R97J539K056k051o70R59J332N538k12
9276E3258l270K39J275J968J552P05n662m142k908K929M085r0M502m32M768J187
9260E9964l715j981j020K169l85N63L43K392m933n440L291R76l981L785J624r60
9244E2692j589j792N265l94K848J205N41J049k686J913j799j071j61N84K936L253
9228F2794j675j812p83J320m20j37n14M589N62l002J947L323J014Q34J418l038
9212F6420m962r08q20K749M739J779o402Q83O83R37K610K744o47m130J720j010
9196F6385k748k724L685K38K56n62K580K69n57J70J076j218K62N197q4l200J357
9179G0382J917J77N66p67k14J983j16l75J311k993j146m296j719k80K959j007
$$ y = [40332, 38008, 41706, 47641, 48759, 45083, 45078, 43770, 44767, 46306, 48362, 46311, 45641, 46600, 47932, 53470, 53258, 49988, 50227, 51502, 53470, 55022, 55727, 50065, 45923, 43015, 45944, 50029, 49939, 54441, 54009, 58777, 59964, 56249, 54268, 53248, 55417, 55032, 55595, 55938, 58330, 53397, 47957, 51248, 52224, 48243, 52028, 53652, 52692, 51103, 49311, 54576, 54182, 57030, 58235, 58776, 59825, 57139, 59052, 57253, 56182, 56021, 56605, 59541, 62794, 61119, 59307, 58524, 59844, 59424, 59287, 58773, 63362, 63924, 60922, 62869, 66192, 67206, 68040, 69458, 66420, 61458, 60550, 59730, 62479, 67218, 68997, 62595, 63478, 64161, 65098, 67708, 70452, 69805, 65675, 67395, 66385, 63637, 60913, 64598, 64836, 65092, 64530, 67110, 67379, 66822, 66992, 68068, 66850, 67112, 72309, 72225, 69025, 70382, 72299, 72476, 73042, 72275, 72061, 74044, 73928, 73553, 74864, 71871, 70725, 66429, 64710, 64430, 67389, 66382]
9163F6382k917M113K884O14J688M59j038R72L754k844k352M28j025J943R44J331
9147G5336J920M699L062J199k142k86O89O4p72l485l80j244M797O41r58J75r70
9130H2345J886L626L255M400j270j898k921j104K99P24K983O500J680m166n298
9115I1041j569L756L856J651q91O78L743L94J952J530J471j185j94j02m519m839
9099I6773J544M602L938P53l99R22j846j943J691L902m49L188j68N3r73k860r44
9082A07784j092L723K775j185k932L482M228K658R99K333j639n276J387K554l6
9067A19763k80J0311L721j026m522R25k569m62P96K53K344K981K950k033l765
9052A29387K003J296L107O651j67M49K449j960k428K141N089L682j266k743J898
$$ y = [66382, 63465, 67578, 70462, 71076, 72764, 73223, 72185, 73157, 76911, 74067, 71715, 72143, 71118, 73061, 74005, 75336, 77256, 81955, 85017, 86216, 84074, 83788, 84477, 84541, 83769, 80284, 79904, 78660, 83457, 84098, 83140, 83315, 82345, 84231, 87857, 91112, 95512, 94242, 92344, 89423, 88319, 88618, 89342, 92325, 98825, 100505, 96339, 91041, 89472, 93228, 97084, 98735, 97844, 98522, 102265, 102659, 104611, 106141, 107612, 106427, 106233, 106131, 101612, 96773, 98317, 102919, 106857, 107610, 107211, 108133, 106287, 104344, 106035, 109937, 109488, 112676, 112508, 112561, 111588, 108728, 107784, 106692, 110415, 113190, 112005, 109073, 112555, 116783, 119441, 120440, 122773, 121134, 115858, 117245, 119799, 119763, 119483, 129794, 133515, 132489, 127967, 128892, 126323, 125861, 126657, 126910, 129254, 132235, 135185, 133152, 129387, 131390, 132686, 135793, 142444, 142277, 142726, 145175, 143215, 140787, 142928, 148017, 151699, 150433, 147690, 149588]
9037A49588j725J735P572N05k838k91K798K276l287J434J995K471J607k08q49
9022A62783l201l468Q78J135J804N722M989N735K508K306l72P29k355k415M541
9007A81319M437k38p80K413O367M453m556o240K007J169M020K632P67K15K361
8992B00346L974J090J462K995K463j683k573L392J339j432P92M315L503M865P998
8977B32846K37m97J236k058K701k21K238M819J141K671N914J657M256J475k910
8962B55505K453K593N719M272R52K050N078k511L920O736L453K949J490J036N826
8947C01521K198J711M178M680L208M914M665M854K061M422M136O457N201M768
8933C58974K989J500O386Q218N350L589M721k226N576Q368R440O410N810M595
$$ y = [149588, 147863, 149598, 157170, 157675, 154837, 154546, 157344, 159620, 156333, 157767, 159762, 162233, 163840, 163632, 162783, 159582, 156114, 156992, 158127, 159931, 165653, 170642, 176377, 178885, 181191, 180819, 181548, 179193, 176778, 181319, 185756, 185518, 184738, 187151, 193518, 197971, 193415, 187175, 189182, 190351, 194371, 197003, 197770, 197985, 200346, 204320, 205410, 206872, 209867, 212330, 210647, 208074, 211466, 212805, 211373, 212165, 216480, 219983, 224848, 232846, 233083, 232586, 233822, 231764, 234465, 234244, 236482, 241301, 242442, 245113, 251027, 252684, 256940, 258415, 255505, 257958, 260551, 266270, 270542, 271494, 273544, 278622, 276111, 280031, 286767, 290220, 293169, 294659, 295695, 301521, 303719, 305430, 309608, 314288, 317496, 322410, 327075, 331929, 333990, 338412, 342548, 349005, 354206, 358974, 361963, 363463, 369849, 378067, 383417, 387006, 391727, 389501, 395077, 403445, 412885, 419295, 425105, 429700]
8919D29700M663M090M479Q371N305M465O240Q905P920R336O537N323J0676R007
8905E25017M435K297O229J2507O754Q363J4735J0575O025R425J0610Q901Q467
8892F34340P439J2791J5740J2996J0111J3353J6532J4215J0224J1757J7809J4666
8880G91973J5675J7724J4605J6814J8180J6558J7207J4865J5093J8812K1192K6723
8868A005421K6543K1582K2084K3825K9477K9480K6656L1775K9435K7643K9986
8857A303907L0368K7669L6726L7576L7107L7750M1079M0754M3744M7246N1033
8846A734959N0722N3421N8445N6256N5882O0566O2885O6322O9160P2572P6899
8835B418089Q2253Q4769Q9307R4680R7227J01441J07629J06117J08254J24346
$$ y = [429700, 434363, 438453, 442932, 451303, 456608, 461073, 467313, 476218, 484138, 493474, 500011, 505334, 516010, 525017, 529452, 531749, 537978, 550485, 557239, 565602, 580337, 590912, 596937, 606362, 616972, 625873, 634340, 641779, 654570, 670310, 683306, 693417, 706770, 723302, 737517, 747741, 759498, 777307, 791973, 807648, 825372, 839977, 856791, 874971, 891529, 908736, 923601, 938694, 957506, 978698, 1005421, 1031964, 1053546, 1075630, 1099455, 1128932, 1158412, 1185068, 1216843, 1246278, 1273921, 1303907, 1334275, 1361944, 1398670, 1436246, 1473353, 1511103, 1552182, 1592936, 1636680, 1683926, 1734959, 1785681, 1839102, 1897547, 1953803, 2009685, 2070251, 2133136, 2199458, 2268618, 2341190, 2418089, 2500342, 2585111, 2674418, 2769098, 2866325, 2967766, 3075395, 3181512, 3289766, 3414112]
8825C414112J32777J38195J36698J46633J54657J64416J70783J75234J83007J90931
8815E007443K01502K11381K20235K30234K35881K49153K52709K60500K67336K72737
8805G409111K74802K77415K82019K79507K76575K75978K69191K51365K37359K25471
8795A0058793K00094J75306J54483J24908R4510N4811J8928p988l9746p5306j08673
8784A0650120j38905j64570j89364k12223k33542k44747k57909k70926k79239
8775H658695k81077k83682k84550k81924k71797k65300k65848k59268k48774k38726
8765E977749k28596k24412k17956k06122k00822j95982j83751j71529j66385j57656
8755D024538j51590j41431j36821j35914j27228j16224j09441j11630j07939j02020
$$ y = [3414112, 3546889, 3685084, 3821782, 3968415, 4123072, 4287488, 4458271, 4633505, 4816512, 5007443, 5208945, 5420326, 5640561, 5870795, 6106676, 6355829, 6608538, 6869038, 7136374, 7409111, 7683913, 7961328, 8243347, 8522854, 8799429, 9075407, 9344598, 9595963, 9833322, 10058793, 10258887, 10434193, 10588676, 10713584, 10808094, 10862905, 10881833, 10873845, 10834099, 10758793, 10650120, 10511215, 10346645, 10157281, 9945058, 9711516, 9466769, 9208860, 8937934, 8658695, 8377618, 8093936, 7809386, 7527462, 7255665, 6990365, 6724517, 6465249, 6216475, 5977749, 5749153, 5524741, 5306785, 5100663, 4899841, 4703859, 4520108, 4348579, 4182194, 4024538, 3872948, 3731517, 3594696, 3458782, 3331554, 3215330, 3105889, 2994259, 2886320, 2784300]
8745B784300r2598r0846q8809q5623p9343p2627p0111o8545o9284n9870n7373
8734A949271o2187n7381n2454m7033n3127m8934m1784l9344m2248m1609l4929
8723A428241l6725l6776l6866l5558l4438l0795k7860k8683k6239k6070k7438
8712A080793k5300k1983k3118k3204j8811k0684j9482j8144j8176k1929k0480
8701H49482j9600j9728j7285j1366j1290j8978j8120j3257j4011j0011j1870j3163
8689F70803j2801j1375j2374j0271q447j2054p008r068j1973j0953q595r631n973
8676E40280l899l532p367j5659j0276o160r770p662m651q125l442n797p499q195
8662D38246p035q078p107k705l123j068m213n278m757p117j0323l070k653p393
$$ y = [2784300, 2691702, 2600856, 2512047, 2426424, 2347081, 2274454, 2204343, 2135798, 2066514, 2006644, 1949271, 1887084, 1829703, 1777249, 1730216, 1677089, 1628155, 1586371, 1547027, 1504779, 1463170, 1428241, 1391516, 1354740, 1317874, 1282316, 1247878, 1217083, 1189223, 1160540, 1134301, 1108231, 1080793, 1055493, 1033510, 1010392, 987188, 968377, 947693, 928211, 910067, 891891, 869962, 849482, 829882, 810154, 792869, 781503, 770213, 751235, 733115, 719858, 705847, 695836, 683966, 670803, 658002, 646627, 634253, 623982, 615535, 603481, 596473, 587405, 575432, 564479, 555884, 546253, 540280, 536381, 532849, 525482, 509823, 499547, 493387, 483617, 475955, 471304, 463179, 459737, 453940, 446441, 438246, 431211, 423133, 416026, 413321, 410198, 409130, 404917, 399639, 394882, 387765, 377442, 374372, 371719, 364326]
8648C64326o709o306k983P86n699l814n762j220k60n382n316k718J596N139O919
8633C32597N800l48j597o233j1936j4600j2887q584o3m417l865o032q96K314k301
8618B66952k751k952m455k938n083l097l923k980m163J697L721m241n043l095
8604B27649k698j28j115K021j21l392k958l41m61l738j187l052L53N654O952J0042
8588B33480J5288J6696J6730L775j5744k3070j7969j2394r301p861o051j188R96
8575A93387n402j501L28k388j709K516J381o029J921O334J546J607J687k871n51
8560A90256m968r09J717K052M21P632R477o45N20L090R645R398Q417L381N360
8545B44844P122R702J9590K3136K4109K1389J2940O648m589j5255k6013k7372
$$ y = [364326, 357617, 351311, 348328, 349114, 343415, 339601, 333839, 332619, 332359, 326977, 321661, 318943, 320539, 325678, 332597, 338397, 338049, 336452, 330219, 318283, 303683, 290796, 282212, 282149, 277732, 273867, 267835, 266939, 269253, 266952, 264201, 261249, 256794, 253856, 248773, 245676, 241753, 238773, 234610, 236307, 240028, 235787, 230744, 227649, 224951, 224823, 223708, 225729, 225608, 222216, 219258, 218917, 218456, 214718, 213531, 210479, 210832, 216486, 223438, 233480, 248768, 265464, 282194, 285969, 270225, 247155, 229186, 216792, 207491, 199630, 193579, 192391, 193387, 187985, 186484, 186812, 184424, 182715, 185231, 186612, 180583, 182504, 188838, 190384, 191991, 193678, 190807, 190256, 185288, 184379, 186096, 188148, 188569, 196201, 205678, 205033, 205553, 208643, 218288, 227686, 236103, 239484, 244844, 251966, 261668, 281258, 304394, 328503, 349892, 362832, 369480, 364891, 349636, 323623, 296251]
8533B96251k6231k4752k0706j2584j0622j3304o494o127q312o650p807l653O27
8520A49636m330o508l058l978m572n90R91l869o48R33o95j322l232k090j602L165
8504A18231m166m731L04n60K118l412l870m633k274j46K453J241k933o132j002
8489I0488K37l335J289R08m62O83K820Q84k950n300l846l29q30M784N3l042Q2
8472H2134J820j005l815m220J579J672k545r64K611P26k218L668J147k618k427
8457G5545k35j965J466K138L626j536j34k119m062l308m459j230M30p05L350L642
8441G0444J208O239j522m441k22q95p06j119p85j01j118J086r19J053R03m03k848
8424F5854n348J50M69o158o702M119Q993K485k160J656m182j894L602p1l287j683
$$ y = [296251, 270020, 245268, 224562, 211978, 201356, 188052, 181558, 175431, 167119, 160469, 152662, 149009, 149636, 145306, 138798, 135740, 131762, 127190, 126600, 127591, 123722, 123074, 124007, 123312, 121990, 118758, 116668, 115066, 118231, 114065, 109334, 109638, 109078, 111196, 107784, 103914, 99281, 97007, 96861, 99314, 100555, 97622, 91490, 90488, 90725, 87390, 88679, 89587, 89125, 89808, 92628, 93512, 90562, 85262, 81416, 81087, 80257, 85041, 85094, 82052, 82134, 83954, 82949, 79134, 74914, 76493, 78165, 75620, 74656, 77267, 77993, 75775, 79443, 80590, 77972, 75545, 75310, 73345, 74811, 76949, 80575, 79039, 78905, 76786, 72724, 69416, 64957, 63727, 64157, 63452, 66802, 70444, 71652, 77891, 76369, 71928, 71706, 70811, 70105, 68986, 68201, 68100, 66982, 68068, 67149, 68202, 69105, 68702, 65854, 60506, 60656, 61125, 54967, 48265, 52384, 61377, 63862, 61702, 63358, 59176, 57282, 60884, 60813, 57526, 55843]
8408E5843j325R36k107j452O73k25Q08L682K604q30p24p48k763j379K274L8o2
8391E5243J98k031m371n626Q49k336J251J385L248Q57J43j11j530K769j634m204
8375D4100k195o61k53k864r36N17j846O74L141k481j383K774R79l279j359K839
8359C7767J827N726L356L83n36K04k599l765O96k696J297K45j316N27l045K085
8343D0156L182p98k074O71m299k710n057j060m86K993N466K440l74L90J368j797
8327C8011l386r39K680o86j558J069K346J202k975k712K066j620K803J577K064
8312C9942P039L1j791k376k108jJ399L38K117k133k62j642k492m288r22L590l72
8295C6069m622L1M181J310k045N76j280l099k025r20k363l585j127l238J99L574
$$ y = [55843, 54518, 55454, 53347, 51895, 52568, 52343, 53151, 56833, 59437, 58607, 57883, 57135, 54372, 52993, 55267, 55305, 55243, 55441, 53410, 49039, 43413, 44262, 41926, 43177, 44562, 47810, 48667, 48810, 48699, 47169, 49938, 48304, 44100, 41905, 41244, 40991, 38127, 37191, 37708, 35862, 36536, 39677, 37196, 35813, 38587, 39566, 36287, 34928, 37767, 39594, 45320, 48676, 49059, 48523, 48727, 46128, 42363, 43059, 40363, 41660, 41905, 40589, 41116, 38071, 40156, 43338, 42540, 40466, 41137, 36838, 34128, 29071, 28011, 27525, 30518, 35984, 38424, 38050, 38440, 39808, 38011, 34625, 33686, 36366, 35680, 34122, 35191, 37537, 38739, 35764, 33052, 35118, 33498, 36301, 37878, 39942, 46981, 47012, 45221, 42845, 40737, 40736, 42135, 42473, 44590, 42457, 42195, 40553, 38061, 33773, 32851, 36441, 36069, 31447, 31478, 35659, 36969, 34924, 35500, 34220, 31121, 29096, 28176, 25813, 22228, 21101, 17863, 18062, 21636]
8279B1636L380M149j356k376k458L205L033m065J591O99n845k63J07n8J905K024
8263B5308M306J833l604k955k530k47l953N87L622N740r00o001L01L864K9J285
8247B6685j35L147N73m335l740l865k935K894M588J709m767j690K965L19L53r
8231B1757J101O63J146p89j279r15N27k755l194Q79M034K676l816k111j88k844
8215A4892Q86J18j488N18L637L880q78M41l130j915K737j227j016J688K037K508
8199B3688o263l597r79l645m90L771K193L6m74N140L309j261n510n823m459N122
8183A0758Q96o67k037J688L94K152J713k497k672K077M086L095k050l075k654
8168A1207M177q10k496l76k49j231r40J796N823K880k117m430k374k011J50J999
$$ y = [21636, 25016, 29165, 27809, 25433, 22975, 26180, 29213, 25148, 26739, 27438, 21593, 21330, 21437, 21379, 23284, 25308, 29614, 31447, 27843, 24888, 22358, 22111, 18158, 18745, 22367, 28107, 27207, 21206, 21507, 25371, 25400, 26685, 26550, 29697, 30270, 25935, 22195, 18330, 15395, 18289, 22877, 24586, 19819, 18129, 21094, 21413, 21766, 21757, 22858, 23521, 24667, 23878, 22599, 21684, 22211, 19456, 16262, 17141, 21175, 23851, 20035, 17924, 17736, 14892, 15778, 15896, 14408, 14926, 18563, 22443, 21565, 22006, 18876, 16961, 19698, 18471, 17455, 19143, 21180, 23688, 17425, 13828, 12849, 9204, 8714, 12485, 14678, 14714, 14240, 19380, 22689, 21428, 15918, 10095, 5636, 10758, 11654, 10987, 8950, 10638, 11032, 13184, 14897, 12400, 9728, 11805, 15891, 18986, 16936, 13861, 11207, 15384, 14574, 12078, 11702, 11453, 10222, 9282, 11078, 16901, 19781, 17664, 13234, 10860, 8849, 8999, 10998]
8152A0998J128J496m44R35k69k979K916K801J532L813K871l874P63k354r76J954
8136B0311J360j403m429k395j559L71O92k679J718M642l52k000k091J721j173
8121A2734P54k163p560n3L021j174K179Q05L990N19l850j010J809k44k201k112
8105E444J88l32J615j593J197L780l72R59k182j03m89l256k809L77L463L345L32
8088I564M743K098K411j62K34j579k784q67O67r43J074N372j324k04L786o56j972
8071A9458J523j378j262k812k571j463N61k463m65K793M996r94n433j688J376
8056A0178J695J773j127m405j254J990K980l457o43M019L700k08j369j797k101
8041I974J361J189k872O20M881l975k965l040k657L020K924j39K904Lk353k27
$$ y = [10998, 12126, 13622, 13178, 14113, 13844, 10865, 13781, 16582, 18114, 21927, 24798, 20924, 21687, 19333, 18357, 20311, 21671, 20268, 15839, 13444, 11885, 12256, 12948, 10269, 11987, 16629, 16277, 14277, 12186, 13907, 12734, 13488, 11325, 3765, 3712, 6733, 5559, 7738, 8543, 12533, 13052, 9202, 8192, 10001, 9757, 7556, 5444, 5632, 5300, 6915, 5322, 6519, 10299, 9927, 10886, 8704, 8601, 8112, 4856, 2047, 2424, 5887, 9232, 9564, 14307, 16405, 18816, 18654, 18888, 17309, 14525, 13658, 14325, 13382, 14456, 19828, 18504, 18300, 22086, 21430, 19458, 20981, 19603, 18341, 15529, 12958, 11495, 12056, 9593, 9128, 11921, 16917, 15923, 10490, 8802, 10178, 11873, 13646, 12519, 8114, 6860, 8850, 11830, 8373, 7730, 11749, 15449, 15241, 13872, 12075, 9974, 11335, 12524, 9652, 10272, 15153, 11178, 8213, 5173, 2516, 5536, 8460, 8321, 11225, 11228, 8875, 8648]
8025H648K331J504K598P90r14j902Q1K343K145j401K291K678k638j736K071K237
8009B1126m181j261J698K99j91j520q19m239K02o18r25L194L635K85J396J88l191
7992A5078k87K902j432q56M254K822L472m23k467K668K871k263m125p60K633K765
7976B6852j193L28j318k611j949l580L729K610J177R4j125J048P64k945O723L912
7960C2516k634J830j61n173j724m52j379j25M557M073N03K845L680Q09J599R069
7944D9833K219K518L990k815k187m052l361m971m636j455N48l515j316q77q85
7929B9038j507j287k547l912J582M13L772M399N748K535n815l679k55R64K300
7914C1749M974K884K717Q22q41L492n19m231j653M542K789K519M14j411m958J68
$$ y = [8648, 10979, 12483, 15081, 15871, 14957, 13055, 13136, 15479, 17624, 16223, 18514, 21192, 18554, 16818, 18889, 21126, 16945, 15684, 17382, 17681, 17490, 15970, 15151, 10912, 11114, 10496, 9571, 12765, 16400, 16685, 18081, 18269, 15078, 14791, 17693, 16261, 15405, 19659, 22481, 25953, 25530, 23063, 25731, 28602, 26339, 22214, 21454, 24087, 26852, 25659, 25987, 24669, 22058, 20109, 16529, 20258, 22868, 24045, 24139, 23014, 24062, 24826, 21881, 28604, 32516, 29882, 31712, 31551, 26378, 24654, 24202, 22823, 22698, 27255, 31328, 31831, 34676, 38356, 39165, 40764, 49833, 52052, 54570, 58560, 55745, 53558, 49506, 46145, 41174, 36538, 35083, 35631, 32116, 30800, 29923, 29038, 27531, 26244, 23697, 19785, 21367, 21780, 25552, 29951, 35699, 38234, 32419, 28740, 28485, 29449, 31749, 36723, 39607, 42324, 43146, 42305, 45797, 45278, 41047, 39394, 43936, 46725, 49244, 49658, 48247, 43289, 43457]
7898D3457j560k944J914K181j001M955l419q688m315j273k61l333K188k837m288
7883B0776K0O98K460L226l116m2J674J486J854J34j692J112J763j010m263j353
7867B3727j232N617K111J421j862j124K987K421j711k291j742k141L79j046j35
7852B5379k16r39N7l112l159J967j500k492L673k811m102j379l016L232J532n07
7836A2607k053j065L73j932j057L668j31n341j637J629M131J539M92o27l083l181
7820D332j501J800J928J178j783j694L24K097l010k134l073M987K787j354L41
7805E225j577m54K391K136K841l26k013O30n09k645j014n036k019J673L686j252
7789A737k409K337M303k566O38m26Q80o74L753l92j5K768q74m551k570j033j732
$$ y = [43457, 41897, 38953, 40867, 43048, 42047, 47002, 43583, 34895, 30580, 29307, 29046, 25713, 27901, 25064, 20776, 20796, 21494, 23954, 27180, 24064, 24022, 25696, 27182, 29036, 29170, 27478, 28590, 30353, 29343, 25080, 23727, 22495, 28112, 30223, 31644, 29782, 28658, 31645, 34066, 32355, 30064, 28322, 26181, 26560, 25514, 25379, 25163, 24224, 24281, 21169, 18010, 19977, 18477, 15985, 19658, 16847, 12745, 11366, 8350, 11582, 13114, 12607, 10554, 9489, 9862, 7930, 6873, 10541, 10410, 5069, 3432, 5061, 9192, 10731, 11223, 10596, 7513, 4332, 2831, 4631, 6559, 7737, 5954, 4260, 4584, 6681, 3671, 1537, -1536, 3451, 6238, 4884, 5225, 3648, 3194, 5585, 7721, 10562, 10236, 8223, 8853, 8344, 5699, 4685, -351, -2370, -697, 2989, 1737, -672, 1665, 5968, 3402, 4040, 3614, 4494, 3820, 7573, 7181, 7166, 9934, 9060, 4509, 1939, 906, -826]
7772h26J586p52N525J477k080k564n578j135K939L434L814k223o251k776M937
7757d73J299p46l48m827j900l3L669K953L031J392R40m171m271k487Q18K836j495
7740c813M418K688k762k255M5o80L62k242L325k347l942k986J46K046J704M366
7724a927J105j363Q69K305j401k410k455p14N60J581J549n70J284k606j407J751
7708c849L637J684L48p20k356j294J187J130q62k610K608L998j499o064M185P334
7692F857R33j254j235k891n935l122K663l621l371J962L382J742K163J463O79
7677D15j713j646M609L927M06l450o001j12J906K176J555j033K630k507l772j502
7661d112M620K152m85K585k258m404j049j34l561r29j647L747J328k362K807o2
$$ y = [-826, 760, 8, 5533, 7010, 4930, 2366, -3212, -4347, -1408, 2026, 5840, 3617, -2634, -5410, -473, 826, 80, -268, -5095, -6995, -7028, -3359, -406, 2625, 4017, 4957, 786, -3485, -5972, -5154, -2318, -3813, 605, 3293, 531, -1724, -1679, -2359, -1997, -4239, -914, -3261, -7203, -10189, -10043, -7997, -6293, -1927, -822, -2185, -1316, 989, -412, -2822, -5277, -5991, -5431, -3850, -2301, -2871, -1587, -4193, -5600, -3849, -212, 1472, 1820, 1100, -1256, -2550, -1363, -233, -1095, -3705, -1097, 2901, 1402, -4662, -477, 6857, 7790, 6536, 5301, 2410, -3525, -6647, -3984, -7605, -10976, -9014, -5632, -3890, -1727, -264, 415, -1298, -2944, 1665, 5592, 5998, 2548, -3453, -3565, -1659, 517, 2072, 1039, 3669, 1162, -2610, -4112, 508, 2660, 2175, 4760, 2502, -1902, -2951, -3085, -6646, -7575, -9222, -5475, -4147, -6509, -3702, -3764]
7645c764l749m045J925K717J90N806L10j429l660M673M58n069l071J612l822j14
7629a1032L039K56J07P77K052j146J904O840K882l232l167K697L308l045J086
7614C326L93l292j924k844m73j099k705n89J868P43N342L511j098K589L991J26
7598G865k13j372n337n180R28J04l229Q03J452j778L145K142m550j254j160J176
7582f458M1k54j98N73Q76k184n37l98M750N590L627n450r70J334K264m392j897
7565c683P52J604j01m008j191r54r50K749J492K64p28Q36J394m65j285Q48j897
7548e323K06J145K11j354K881j361j985R13K117j486n40J570K382k01j568k730
7532e123j402J451k353K365k594j631r03l885K150p45j267J919M591L113n27l098
$$ y = [-3764, -7513, -11558, -9633, -6916, -6726, -920, -610, -2039, -5699, -1026, -568, -5637, -8708, -7096, -10918, -11032, -7993, -7737, -7630, -6853, -4801, -5947, -4043, 2797, 5679, 2447, -720, 1977, 5285, 2240, 3326, 3719, 427, -1497, -4341, -4814, -5913, -8618, -9207, -7339, -6596, -1254, 2257, 1159, 3748, 7739, 7865, 7652, 6280, 943, -4237, -3309, -3205, -6434, -5631, -4179, -5957, -2812, -670, -5220, -6474, -7634, -6458, -6417, -6671, -6869, -6296, -5420, -7604, -8141, -8539, -3789, 1801, 5428, -22, -992, 342, 2606, -1786, -3683, -2931, -1327, -1428, -5436, -6627, -7581, -8531, -5782, -4290, -4026, -4754, -3918, -2524, -2989, -4274, -3426, -5323, -5117, -3972, -3761, -5115, -2234, -3595, -5580, -4667, -2550, -4036, -4576, -3006, -624, -825, -2393, -5123, -6525, -5074, -7427, -5062, -7656, -9287, -10190, -14075, -11925, -12670, -13937, -12018, -7427, -4314, -4841, -7939]
7516g939j050Q95K533j834q21M264J112j606k032k420j752k240J270J842L95J014
7500h369J835M508n28j049O17L38n86n55j662K943j339j370J291L355K948k689
7484c12m056L272J275m793j494M704J856K74J018K66R13n773k767j420J19K570
7468d348k537k917J315N932J747l797n881J707O68j665m64O24L632O087k002n263
7452g162J35o05K307k19m202L621K952R51q46M144P5m794j503R11M32N37J473
7435a793p641J506J374Q43l69k029L166L257j1J982o47r25j430j133J865N9m923
7418f849m509m541k313j44M283K51L370K349j3K062J594J741J440n45R49O16l222
7401c481j131l618K10L030K073k859k88L515K391m98k593Q20Q43j033k517P37
$$ y = [-7939, -8989, -8094, -5561, -7395, -8216, -3952, -2840, -4446, -6478, -8898, -10650, -12890, -11620, -9778, -9383, -8369, -6534, -2026, -2554, -3603, -2986, -2648, -3234, -3789, -5451, -2508, -3847, -5217, -3926, -571, 2377, -312, -4368, -1096, 179, -4614, -6108, -1404, 452, 726, 1744, 2010, 2923, -2850, -5617, -7037, -6918, -4348, -6885, -9802, -8487, -2555, -808, -4605, -10486, -8779, -8111, -9776, -10240, -9616, -5984, 103, -1899, -7162, -7027, -7632, -5325, -5544, -9746, -6125, -3173, -2222, -3068, 1076, 1151, -3643, -5146, -4235, -3803, -3266, -1793, -9434, -7928, -6554, -5711, -6080, -8109, -4943, -1686, -1697, 285, -362, -1287, -2717, -3850, -1985, -1926, -6849, -11358, -15899, -18212, -18356, -14073, -13822, -10452, -8103, -8116, -6054, -4460, -2719, -1279, -1824, -875, -259, -3481, -4612, -8230, -8020, -4990, -2917, -5776, -6064, -2549, -158, -656, -3249, -2429, -1586, -2619, -5136, -4399]
7385d399J545K043q4K757K73K515M125m928k917k080J975M98j51J897j570k675
7369a176j299k427J397l17j439m550l812L090M806K754k866n295J879K766M267
7354b222J840k962q03L18K33k961R71M048l445L49j638k101n72k835K936O082
7338b762K342K107L82n637n249K659O471J442k829n338j710r6N25Q94j104Q22
7322g081J757J915J86q86q5K235K37J168l20k509m016Q07N339Q86k454m785j453
7305i059N86K818M354K51l06j433m266j838J262k95K005R949K504l783J121n40
7289C330k956m737j644K837L77m39k192j338Q78O74K125L97M990K34o50k398j574
7272b086k248j543j091l770L933M03O76J387j151L71J756K730l129m665N08J87
$$ y = [-4399, -2854, -811, -895, 1862, 2135, 4650, 8775, 3847, 930, -1150, 825, 1323, 1172, 3069, 1499, -1176, -2475, -4902, -3505, -3822, -5261, -9811, -13623, -10533, -5727, -2973, -5839, -11134, -9255, -6489, -2222, -382, -3344, -4147, -3829, -3596, -6557, -5586, -1538, -4983, -4634, -6272, -8373, -8945, -11780, -8844, -2762, -420, 1687, 2069, -3568, -8817, -6158, 313, 1755, -1074, -6412, -8122, -8218, -7693, -6799, -7903, -7081, -5324, -3409, -3223, -4109, -4194, -1959, -1722, -554, -874, -3383, -7399, -6592, -1253, -367, -2821, -7606, -9059, -8473, -5655, -1301, -1050, -1356, -2789, -7055, -8893, -7631, -7926, -5921, 4028, 6532, 2749, 3870, 3330, 374, -4363, -6007, -3170, -2793, -3232, -5424, -6762, -5884, -5210, -3085, -2688, 2302, 2536, 1886, -512, -2086, -4334, -5877, -6968, -10738, -6805, -6402, -5726, -4339, -5490, -5119, -3363, -633, -3762, -8427, -7919, -7732]
7256g732K33P04J001J63j142j772N51j1n49J565K264l381K851R96J093K218j847
7239b795M161N51q029p96J699R72M341k3j914m999Q73M100J494o98ok020j694
7222d783P83J285K109l23l413j246j820M058K139P3J702j243q011m232k730L132
7206a2520L590J13j281L01J837J587K128J202J137J590K152k183l918q17k85K428
7190b939J101j030K411K795N74k552k340k280j572j056K052Q54M19l584k992q35
7174a0974K644K73J82K284K09m036O86k733P64M035J680L139L213k70j426j019
7158a349l754k132K379q87R39Q7J378L29n86J453M188j673L147K33k851l887l070
7141f056k607J148K473R33j270j552R39o56K026L317j324l480q67p77p08M058
$$ y = [-7732, -7499, -6795, -5794, -5631, -6773, -8545, -7994, -8005, -8554, -6989, -4725, -8106, -5255, -4259, -3166, -948, -2795, 1366, 1917, -6112, -6908, -5209, -4237, 104, 81, -1833, -6832, -5959, -1859, -365, -1063, -1069, -3089, -4783, -4000, -2715, -606, -929, -4342, -5588, -7408, -3350, -1211, -1138, 564, -679, -8690, -12922, -15652, -12520, -8930, -8817, -10098, -9797, -7960, -6373, -4245, -3043, -1906, -316, 1836, -347, -4265, -5082, -5367, -2939, -1838, -2868, -457, 2338, 2912, 360, -1980, -4260, -5832, -6888, -4836, -3982, -3563, -7147, -10139, -10974, -8330, -8057, -7875, -5591, -5382, -9418, -8732, -11465, -10701, -6666, -4986, -1847, 1366, 1096, -330, -1349, -5103, -7235, -4856, -5743, -4804, -4717, -3339, -3010, -3596, -2143, 2045, 372, 3519, 3752, 901, -2986, -6056, -8663, -7515, -5042, -4109, -5379, -6931, -5992, -6648, -4622, -1305, -2629, -6109, -6976, -7753, -8461, -4403]
7125d403K605R77J490K535l907n451k575M687L806m366J756L665m60l496j006
7110d143L428n97N80L53j878k639n150k894Q65K40K362l878j278N409O80P20J662
7093f158J162K611O37m04M55k343j541m8m54J319M719M24n167l530K514K666j958
7076e096O63J337j975k366J326M020K390l55l378k362R51j657M258L292n589n75
7060e116L01r16k62K03L47K88m116l855M487R62N76k33j501j17J788N21k235O41
7042h237l090j248L093J231K482K064m06k377k264Q59k18J192L759J243Q65j570
7026b622j423j949J106L790j094j939N90n41j451p49n90J50M80K978j030j458
7010e752K001j102m011N16K33N882K741j093r50k056o194j915K285J446n40M935
$$ y = [-4403, -1798, -821, 669, 3204, -703, -6154, -8729, -4042, -236, -4602, -2846, 819, 359, -3137, -4143, -715, -1312, -732, -379, -2257, -4896, -10046, -12940, -12075, -11835, -9473, -13351, -14629, -9220, -8540, -7820, -6158, -4996, -2385, -1748, -2152, -1697, -4040, -5581, -5629, -6083, -4764, -45, 379, -4788, -8318, -5804, -3138, -5096, -4433, -3096, -5071, -7437, -6111, -2091, 299, -56, -3434, -5796, -4845, -6502, -2244, 1048, -4541, -5116, -4815, -5731, -5993, -5790, -5443, -5155, -9271, -13126, -8639, -7677, -7101, -7334, -8835, -8952, -7164, -6643, -8878, -8237, -11327, -12575, -9482, -8251, -5769, -3705, -4111, -6488, -8752, -7893, -8111, -6919, -3160, -1917, -1052, -2622, -4045, -5994, -4888, -1098, -2192, -4131, -3541, -4082, -5533, -6282, -6872, -6722, -6242, -3264, -4294, -5752, -3751, -4853, -8864, -8348, -8115, -2233, 508, -585, -1535, -3591, -9785, -11700, -9415, -7969, -8509, -3574]
6994c574N18n567l745k760L005m06K572N397K44p62l722k120L50l81K842K963
6978e146J68R16no74j777R26K035P72n170K645L070n482j378P051J311j332N23
6961a547r00j836l063J173J749n41K599m342q33K335j456L200J627p47m161k975
6945i718N589J924L74m797j609Q29M106K102q52J625k361k939M781L126k809o709
6929g338o9M574l763o86K673J549j607O56M77k68K568J554k981r62K206l760J265
6912c912N004K856n58k489N07o4K364k798K180m292j22n30k26l515L69n57r38
6895f721J343J659K266o21r8K147r15M01J857J195k515l867o595K039L38J832
6879f255L275m76k911K197K913J500k97K62l75K107j383m444k227o9J987k151
$$ y = [-3574, -3056, -8623, -12368, -15128, -12123, -12529, -9957, -4560, -4316, -5078, -8800, -10920, -10570, -10951, -8109, -5146, -4978, -4062, -4067, -4741, -6518, -5592, -3557, -2785, -7955, -5310, -2240, -7722, -9100, -2049, -738, -2070, -1547, -2447, -4283, -7346, -6173, -4424, -4965, -2366, -6708, -7541, -5206, -6662, -3462, -1835, -2582, -6743, -9718, -4129, -2205, -1831, -6628, -8237, -7408, -3302, -1200, -2052, -427, -2788, -5727, -946, 2180, -629, -7338, -7407, -2833, -6596, -7282, -4609, -3060, -4667, -4011, -3534, -3802, -1234, 320, -2661, -3623, -1417, -5177, -3912, 1092, 3948, 3390, 901, 1408, 1344, 3708, 910, 3090, -1202, -1324, -1854, -2080, -5595, -5226, -5783, -6721, -5378, -3719, -1453, -2074, -2172, -25, -940, -539, 1318, 2513, -2, -3869, -10464, -8425, -8087, -6255, -2980, -3456, -6367, -4170, -1257, 243, -54, 208, -167, 1940, 557, -3887, -6114, -6183, -4196, -6347]
6863f347J365j957m332K29K292JJ585N74K086L23K040l9j196m189Q98M049K215
6846d03l530k959J570L206K026K329o31K8P2j691n189m191N533J949n767l248
6830a0896M582K51k672J143K741L943J652m86j111r85K724Q17L351n843l111L658
6814b42K804l240k943L480K475q0j817p744p98L937j122P91L566j107k586M41
6798d185j30l63k881M152q84m916K769M831j097J604K698K125l61k3k727k159
6782a547l434m205r68r13L728L735n5L850O24l549n215j76J132J094k395O92J906
6765e696K317l413j274L30O962M194p504l620k033o37K624Q80K722L176j47P60
6749c59k647j374L461L996k783m588j277M167M682j604j342n95m926l933N061
$$ y = [-6347, -4982, -6939, -11271, -11042, -8750, -8749, -7164, -6590, -4504, -4181, -2141, -2180, -3376, -7565, -6667, -2618, -403, -3933, -6892, -5322, -2116, -90, 2239, 1608, 1636, 1708, 17, -5172, -9363, -3830, -1881, -7648, -10896, -6314, -6063, -8735, -7592, -4851, -908, 744, 258, -853, -1838, 886, 1703, 5054, -789, -3900, -242, 2562, -678, -3621, -141, 2334, 2254, 437, -7307, -8105, -4168, -5290, -4499, -933, -2040, -4626, -4185, -4315, -4678, -7559, -3407, -4291, -9207, -6438, -1607, -2704, -1100, 1598, 3723, 3362, 3339, 612, -1547, -4981, -9186, -10154, -11067, -7339, -3604, -3659, 191, 815, -2734, -7949, -8125, -6993, -5899, -8294, -7602, -5696, -3379, -6792, -8066, -7736, -774, 3420, -4084, -7704, -9737, -10374, -7750, -6870, -4148, -972, -1119, -359, -3006, -4380, -919, 3077, 294, -4294, -5571, -1404, 3278, 1674, 332, -263, -5189, -9122, -4061]
6734d061K362J637l20Q46Q74j298J271P87m86J413j844K83J906k8J371K36P21
6717E670k422j761J886K255k581j018j275j722k361q71k486j567J915O643K679
6702B984J906k063o685M43k420M544O739N343K713J207J72r54L40J1N175Q294
6686B7749N545Q198m596l422o495p087o954l295k719j659l257n569l930L461O0
6671c970k339j148L109L784j673j564N02L25j301j907K144M105j263o22J240J514
6655I36m299n576K312L151K951j293l075o81o58p92J368K02j516K187j174j85
6639f142L898j886q61j311n42N064K846j859o27N386J74k869j39l482J688Q99
6623B37j502r92N25L764N92j745m152l834k80P58j433L634L138J119J920k311
$$ y = [-4061, -1699, -62, -382, 464, 1338, 40, 1311, 2098, 1612, 3025, 1181, 1464, 3370, 3342, 4713, 4949, 5670, 3248, 1487, 3373, 5628, 3047, 2029, 754, -968, -3329, -4200, -6686, -8253, -6338, 305, 2984, 4890, 2827, -3858, -3415, -5835, -1291, 5448, 10791, 13504, 14711, 14883, 13929, 14269, 14280, 19455, 27749, 33294, 41492, 36896, 33474, 26979, 19892, 12938, 9643, 6924, 5265, 2008, -3561, -7491, -4030, -3970, -6309, -7457, -4348, -564, -2237, -3801, -3299, -2974, -4275, -6182, -4038, 67, -1196, -1818, -578, 936, -3363, -8939, -6627, -3476, -525, -1818, -4893, -5574, -6232, -7024, -5656, -5454, -6970, -4783, -5957, -6142, -2244, -4130, -4991, -6302, -6844, -1780, 1066, -793, -1420, 3966, 4140, 1271, 1132, -2350, -662, 237, -1265, -2257, -1732, 2032, 2624, 879, -3273, -7107, -7387, -6629, -8062, -4428, -1290, -171, 1749, -562]
6607e62L74l033j000j890n632M88N81K766L032n31o91L540k97k287J641J750K146
6590C95k098k164J470P35L051J191J610n331m139L741J257k461l434K058K390
6575a729J722J075Q70K05J404p02k620K038K064j124p176j356L653R25Q16Q8j910
6558a757j574n40J41J987l66j962J352L90J060J170k62j674N8k095j219P62J333
6541c196j686J185j612J989r42J186j363J838M883k593n780r24L47o7R08M2k172
6524g957M110M549n795p56m14J012r71o6K27J241L212L186M57k823n047L77N22
6507d936Q50J788K355Q58m85r1J16m031m876N08J590N039M44k703j84J832k441
6490d367j03L294M581J110m391l267k810L088J302M960J482k44m75o56o61N038
$$ y = [-562, -188, -3221, -4221, -6111, -11743, -11255, -10674, -7908, -4876, -5407, -6098, -2558, -2855, -5142, -3501, -1751, 395, -1703, -3867, -2397, -1662, 1389, 2580, 4190, -1141, -5280, -1539, -282, -2743, -6177, -4119, -1729, -7, 1068, 1938, 2143, 3547, 2845, 225, 2263, 4327, 3203, -3973, -5329, -1676, -751, 65, 153, -1757, -3331, -3871, -3730, -1743, -2109, -4071, -2719, -2329, -1269, -99, -361, -2035, -1977, -4072, -5291, -4529, -3196, -4882, -3697, -5309, -3320, -4262, -3076, -4439, -2601, 2282, -311, -6091, -7015, -6668, -6735, -5827, -5785, -7957, -3847, 702, -5093, -5849, -6263, -5251, -6222, -6288, -6061, -4820, -1608, 1578, 2035, -788, -5835, -5458, -4936, -4086, -2298, 57, 915, 430, 339, 455, -3576, -8452, -7944, -6354, -1315, -871, -3574, -3758, -1926, -4367, -4470, -1176, 3405, 4515, 124, -3143, -5953, -2865, -1563, 3397, 4879, 4635, 4160, 3504, 2843, 7881]
6474G881K48o471m847L461J089j298N00j784j023L90j924k024M256K861l744k656
6458e085k262L138N025L653j969l340k85j66Q68l22m41N98k861m271J171k129
6442h678R10n70m586J799r78K831K848k654J158k72k15N458L022Q34J620m10r07
6425A210M692l697k818P85k469l959K968K496o01m838Q32J275P702K37m229l977
6409d391J420J578l947J81L596K849l827k659o96L53L98J587j522l127l51K431
6393f127K822l513l759K48k304o74M577J206M065L736l67r70R27J401j942k758
6377c432J645j889l243M401j66K814J69m629k693J065m37j311J069P24k259M6
6361h126L272J778n15o30O70K571r28l655K440l05k202J767M503j711j503m750
$$ y = [7881, 8129, 1658, -3189, 272, 1361, 63, 563, -1221, -2244, -1854, -3778, -5802, -1546, 1315, -2429, -5085, -7347, -4209, 816, 4469, 2500, -840, -1125, -1291, -423, -745, -1186, -588, -3449, -7720, -6549, -8678, -7768, -8338, -12924, -11125, -12103, -9272, -6424, -9078, -7920, -8192, -8407, -2949, 73, 907, 2527, 2117, 1210, 5902, 2205, -613, 172, -2297, -6256, -3288, -792, -1393, -6231, -5399, -4124, 3578, 3815, -414, -4391, -2971, -1393, -5340, -5159, -1563, 1286, -2541, -5200, -5896, -5543, -5145, -3558, -5080, -8207, -8558, -6127, -3305, -6818, -10577, -10329, -12633, -13307, -8730, -7524, -3459, 277, -90, -1060, -133, 1268, -674, -3432, -1787, -3676, -6919, -2518, -2684, 130, 299, -4330, -7023, -5958, -6395, -7706, -6637, -5913, -8172, -8126, -4854, -3076, -3591, -4221, -3551, -980, -1908, -5563, -3123, -3428, -5630, -3863, 640, -1071, -2574, -7324]
6345g324J400P72k157k403J018K595J911j60j27j28L41k41k492n17M042J423q48
6328b895n570j392L161J441k102k36L276L923O62j644q66M35m718k439J011n71
6312h524R08N118L120J335j949j737L158j310q85m001J014j972Q42K689j358q71
6296d423L007J42n010j036K380R74L044K39M12P73q01J318K770p85m578k506j193
6279e273M632N493l222p273l829L462K735J45q66k432O548j03j88j445m869j036
6263g521L13k975K616M301K388k51j246m741l324J682M336J749J053k102m688
6248h410l734J983K175j070l70P44K830k189n58l125r47K124J20Q61K191L320
6232d055K388j280j606L62l769N99K751k233k28P54j30l407J1r2L223J564K879
$$ y = [-7324, -5924, -5152, -7309, -9712, -8694, -6099, -4188, -4348, -4475, -4603, -4262, -4503, -6995, -7512, -3470, -2047, -2895, -8465, -9857, -6696, -5255, -7357, -7593, -4317, -394, 268, -1376, -2242, -1807, -6525, -8964, -7953, -8524, -7616, -2498, 622, 1957, 8, -1729, 1429, 119, -766, -4767, -3753, -5725, -4883, -2194, -3552, -4423, -1416, -1274, -6284, -7320, -4940, -3966, -922, -683, -271, 502, -299, 1019, 3789, 3004, -1574, -4080, -5273, -641, 4852, 1630, -5643, -9472, -6010, -3275, -3130, -3996, -6428, 120, 17, -171, -1616, -6485, -7521, -7208, -10183, -7567, -3266, -878, -1129, -2375, -7116, -10440, -8758, -4422, -2673, -1620, -3722, -8410, -12144, -10161, -7986, -9056, -9426, -8682, -5852, -8041, -8599, -11724, -12671, -10547, -10427, -9566, -7375, -4055, -1667, -2947, -4553, -4191, -7960, -7361, -4610, -6843, -7071, -6317, -6447, -9854, -9843, -9935, -6712, -5148, -2269]
6215b269J027J318n085m62L130K572j332k58J712l137n050j875M159J650j228
6200e128k287q22J042P68m92P95J506K671K954N119J776o988k617j772K60K510
6184g05J17p88L838k129j571m267k002J690M105K030j915N1o2P39k068L34J17
6167b486n060K365O515P01k909J476l18K01J203j25J472J20l750K18l128Q19k8
6150b714N634Q82n85l862k571l114k613R34k4N84p64K545n85N526K755N13j748
6133G93j634L625r66p829l646M023L93j28J032J971j276L559L288j786k509M2
6117a048l89j415j166M200P58l327l796K310J122r66l396k34K717O03r98J218
6101c807n87k879O14J582J604K856P4k724j669K624j004j554Q47J657l570k334
$$ y = [-2269, -1242, 76, -5009, -5471, -2341, 231, -1101, -1359, 353, -2784, -7834, -9709, -5550, -3900, -5128, -7415, -8237, -7195, -6427, -6919, -6124, -4618, -1947, 1007, 6126, 7902, 914, -1703, -3475, -3215, -705, -588, -1376, 2462, 333, -1238, -5505, -7507, -5817, -1712, 318, -1597, -1546, -1608, -869, -2937, -2603, -2486, -7546, -5181, 1334, 2035, -874, 602, 284, 485, 1688, 1563, 3035, 3155, -595, -377, -3505, -2686, -2714, 2920, 3802, 3217, -645, -3216, -6330, -8943, -8009, -8033, -7449, -8213, -5668, -6253, -727, 2028, 2541, 793, -841, 2784, 1818, -6011, -9657, -5634, -5241, -5369, -4337, -2366, -3642, -83, 3205, 1419, -1090, -1048, -1437, -2852, -4018, 182, 940, -2387, -6183, -3873, -2751, -3717, -7113, -7347, -4630, -4027, -5025, -3807, -4394, -7273, -6659, -5077, -3473, -617, -543, -3267, -4936, -2312, -3316, -4870, -4023, -2366, -5936, -8270]
6085h270L271K732j880l213k700l403Q77M465K293j552n97J554M049J930N174
6070D730J100m708k507l116m521K998M693k349r85M277k361n890J874K265K764
6055a736K817j335K574K008K970l34m816k609R07R55K015q69j113N836k764k605
6039A901P33j400Q01K27O21N88j031l106k289m60L108j601j545J940L308N556
6023G351K066o651k980n52n948J055M240J910j535L860j19k276l916l679q10k024
6007a0008l95J767J652K249J396N534M159j340n489n880o84R27N451l5j185j458
5991c339J481J456L26j867k113p24l05k95J715L796J753k286K16J39J194N136
5975F283j280j837J543J26k763j709j965M018L85k650n347l799J636K858j91N18
$$ y = [-8270, -4999, -2267, -4147, -7360, -10060, -13463, -12586, -8121, -5828, -7380, -7977, -6423, -2374, -444, 4730, 5830, 1122, -1385, -4501, -9022, -6024, -1331, -3680, -4665, -388, -2749, -8639, -6765, -4500, -1736, 1081, -254, 2320, 4328, 7298, 6964, 2148, -461, 446, 1401, 3416, 2547, 1434, 7270, 4506, 1901, 2634, 1234, 2035, 2262, 2883, 3471, 2440, -666, -2955, -3415, -307, -1908, -3453, -1513, 1795, 7351, 9417, 2766, -214, -766, -6714, -5659, -1419, 491, -1044, 2816, 2697, 421, -3495, -7174, -7984, -10008, -10403, -8636, -6984, -4735, -3339, 2195, 6354, 5014, -475, -6355, -7039, -6112, -661, -696, -1881, -3339, -1858, -402, -76, -1943, -4056, -4780, -5085, -5380, -3665, 131, 1884, -402, -186, -47, 1147, 6283, 5003, 3166, 4709, 4835, 2072, 363, -1602, 2416, 2801, 151, -5196, -8995, -7359, -4501, -4692, -4174]
5959d174P12K358j828o11L372r79j067r98L958M345K952m843m269j05K625j82
5943A266l763j134O36P42j182N394O54l521j427r11O87K89M045r8j587J392j747
5926b65j747M08L418j873p085j435L141M497J104k652j574k096J28J122J013K920
5910i76m409m013M88Q38J134k71L48N50K56k901K4L339M850J410j447j203k274
5893d257R84l397J482k07J437J400J034L95j656j739J457j357N08K795n64m653
5877f338J481K532O89n81n72K82J321l642m393k705k159K927O351J775j113k336
5861f481K805Q47P07J518J979r20l590k32N324M10m599l733j816J934J724M134
5845A1n5J95j417r45k569p51K552j023l042L05N606P42J423K529q97m131k263
$$ y = [-4174, -3462, -1104, -2932, -3543, -171, -1150, -2217, -3215, 743, 5088, 8040, 3197, -1072, -1177, 1448, 1266, -2497, -3631, -2995, -2253, -3435, 1959, 2613, -908, -2335, -3246, -2559, -2270, 1775, 1677, 90, 1482, -265, -2012, -1604, 1814, -59, -7144, -8579, -5438, -941, 163, -2489, -4063, -6159, -6031, -4909, -3896, -976, -5385, -9398, -8910, -8072, -6938, -7209, -6861, -6311, -6055, -8956, -8932, -5593, -743, 667, -780, -1983, -4257, -3273, -6670, -5188, -5395, -3958, -2558, -1524, -1129, -2785, -4524, -3067, -4424, -3916, -1121, -1685, -6338, -4857, -2325, -1636, -2217, -2789, -2507, -1186, -4828, -9221, -11926, -14085, -11158, -4807, -3032, -4145, -6481, -3676, -2829, -2122, -604, 1375, 455, -3135, -3367, 1957, 2367, -2232, -5965, -7781, -5847, -4123, 11, -44, 151, -1266, -2211, -4780, -5531, -2979, -4002, -7044, -6739, -1133, -391, 1032, 3561, 2664, -1467, -3730]
5828c730k712K750o82m499J008J869K9q96m687K284N196l51j25l613K82K904L718
5811a255J556r71l725k28K227L966k080k099n98K284J024k603p99J02j342p80
5795e321m54J346k5k047R66J514p64J826M791J331o076J157k18j056r33O70j16
5778c409k933J174n61M26Q49P08R4J642k89L528L549k825n381l517J087r51j650
5761h459R36Q95L26k70J698k600k381K609K040O426M622R65k344J757l725l892
5745a397p89j673J48k864j83l323J476J510J105R9l1J051M038q85k938k50K337
5728b569j678n21M034J871j296l297l619J738L717j09k219K306J18m222m228o96
5712a0670j208Q83M920K120L63L94o98O5j211L853L298j68m946j232O71J328K044
$$ y = [-3730, -6442, -3692, -4374, -8873, -7865, -5996, -5967, -6863, -11550, -9266, -4070, -4421, -4546, -8159, -7877, -4973, -1255, 301, -670, -4395, -4623, -2396, 1570, -510, -2609, -3207, -923, 101, -2502, -3301, -3199, -4541, -5321, -5775, -4429, -4454, -6501, -5535, -4021, -4785, -2959, 1832, 3163, -2913, -1756, -1974, -3030, -3963, -3293, -3409, -6342, -5168, -5729, -5303, -4454, -3746, -3652, -2010, -2299, 1229, 4778, 1953, -3428, -6945, -5858, -6809, -8459, -7523, -6628, -6302, -6572, -4874, -7474, -9855, -7246, -5206, 1220, 5842, 6807, 4463, 6220, 2495, -1397, -2186, -3859, -3711, -6575, -6758, -10081, -8605, -7095, -5990, -5891, -5922, -4871, -833, -1718, -4656, -4906, -2569, -4247, -4768, -734, 1137, -159, -3456, -7075, -5337, -1620, -1729, -3948, -1642, -1524, -5746, -9974, -10670, -11878, -10995, -6075, -3955, -3592, -3198, -3896, -3831, -5042, -1189, 2109, 1941, -3005, -4237, -3566, -2238, -194]
5695a94J917m435j590J414k328l239J65j434J406O017J65n607k58K260L172L342
5679G73j063P37m55J157K975n23m826P05J621K57o36n238P44K6P74j422M425J566
5661A597n317K027j273l871j300J089J036L657J109M081L255j18l035J682j504
5646C115L49n239n48J175L113j784J488k35R72l465j386K576K244n03L661K695
5630H228n221K13j221l17K447O21l824k28l820l267J673J134j699J677j727Q78
5614d453j213J235K357k409L686R51j661J323O41J822n460J905J362j708L773
5599B151K73k755j477j23o6L132M85K519J925j127l97j173j763j15l626l143L800
5582a480L726p670N42J106L022L345p76n50R08l187m101Q94M3J959L22M07j546
$$ y = [-194, 1723, -2712, -4302, -2888, -5216, -8455, -8290, -9724, -8318, -2301, -2136, -7743, -8001, -5741, -2569, 773, -290, 447, -8, 1149, 4124, 3601, -1225, -520, 1101, 1358, 722, -4516, -3772, -3746, -2972, -4394, 31, 1597, -3720, -1693, -2966, -6837, -8137, -7048, -6012, -2355, -1246, 2835, 6090, 5972, 2937, 4619, 3115, 3464, -1775, -2323, -1148, 1965, 181, 1669, 1434, 2406, -1059, -2445, 131, 2375, 1872, 5533, 8228, 3007, 3220, 1999, 1682, 4129, 4750, 926, 698, -3122, -6389, -4716, -3582, -5281, -3604, -5331, -4453, -5666, -4431, -2074, -4483, -797, 154, -1507, -184, 457, 2279, -3181, -1276, 86, -1622, 2151, 2424, -331, -1808, -1931, -1997, 1135, 1620, 4139, 6064, 4937, 4540, 3367, 1604, 1489, -2137, -5280, -1480, 2246, -5424, -4882, -3776, -754, 2591, 1815, 1265, 2173, -1014, -5115, -4221, -4178, -2219, -1897, -1490, -3036]
5565c036P72l87o90j083L243O282P27l099m23J621p63m03k964k554K206K716j046
5548A119J134K072k167r27K474J913j971P53j277k851j811l924k179j47J845L298
5532b646M723J836k224J730r01l423k788J709o84J748P6j90j130Q02R61j041L424
5515A982k65l978j168L038j437k099j401P63L903M17N837r50Q81n590k359l359
5499e785k900L007K017J363j272K146j676q9j391J601j218K614l92j690J093K904
5483C32j42J798K354r05k441j400k38k213K664K200K97k960Q0J498J610j005K140
5466C669L012Q07l029l320r78Oj674j800J0J799o54j922J065J848K864j046m843
5449d186K70J217M2j37P6j198K244K206J200K711P04l793l961j521N879K459j439
$$ y = [-3036, -2264, -2651, -3341, -4424, -1181, 5101, 5828, 2729, 2306, 3927, 3164, 2761, -203, -2757, -551, 2165, 1119, 2253, 4325, 2158, 1231, 3705, 5618, 3647, 4400, 3123, 272, -1539, -5463, -7642, -7789, -5944, -2646, 2077, 3913, 1689, 3419, 2518, -905, -3693, -1984, -2668, -920, -844, -1034, -2164, -1362, -401, -1442, 1982, 1717, -2261, -3429, -391, -1828, -3927, -5328, -4565, -662, -245, 5592, 4642, 5523, -67, -2426, -5785, -8685, -5678, -3661, -2298, -3570, -1424, -3100, -3189, -4580, -2979, -4197, -1583, -1975, -3665, -2572, 332, 190, 1988, 4342, 3437, 996, -404, -642, -2855, -191, 2009, 2306, -654, -574, 924, 2534, 1529, 3669, 6681, 7488, 4459, 1139, 161, 167, -1507, -3307, -3297, -1498, -2152, -4074, -3009, -1161, 1703, 657, -4186, -3916, -2699, -2657, -2794, -2718, -3916, -1672, 534, 1734, 4445, 5149, 1356, -2605, -4126, 1753, 4212, 2773]
5432B773q15k747k101L589J439J596j931k126J249j762J883J442j18j861j746
5417a236K267J760O42l756p468k673L536L661L749L056k169K007K317m70k047
5402C176J579K592J867j28R83p87l213j438J82p62l259j526L381J100L371j336
5386E782m436l401j620J597j229l183N55J821j851J170m45J001L177k092l917
5371g071O9K149N850R62L382j423m793m58J494N85j755L168R13j268r04j362j21
5354e83k419L289p0j446J475K666n185k777K658L731M74j259J293r47j112l604
5338c816j525J830M032K023q94N92K52K471l732j40J812N17k906j803j62J816
5322C67K609O431k301n116l108o64j296r35j700j75L362Q36L01K328J183N999
$$ y = [2773, 1958, -789, -2890, 699, 2138, 3734, 1803, -323, 926, -836, 1047, 2489, 2371, 510, -1236, 1031, 2791, 3433, -323, -7791, -10464, -6928, -3267, 482, 3538, 1369, 3376, 5693, 5223, 3176, 4755, 7347, 9214, 9086, 10069, 9282, 6069, 4631, 4813, 4051, 792, -734, 2647, 3747, 7118, 5782, 1346, -2055, -3675, -2078, -3307, -6490, -5935, -4114, -5965, -4795, -5240, -4239, -1062, -3154, -7071, -7002, -4853, 997, 1959, 5341, 3918, -875, -1333, 161, 746, -1009, 2159, 3072, 1804, 900, -462, -583, -3002, 287, 217, -1229, 246, 2912, -2273, -5050, -2392, 1339, 1813, 554, 1847, 900, -212, -3816, -5341, -3511, 521, 2544, 1650, 2242, 2494, 4965, 1233, 1093, 2905, 3422, 516, -1287, -1449, 367, 2976, 9407, 7106, 1990, -1118, -1782, -3078, -4013, -5713, -5888, -2526, -1690, -1389, 939, 2122, 8121]
5306H121m318m357l952J062K680l86J896P01j979k49k25j618k435l078P813N070
5290D746K76k063j7l11K40J822Q3n28k010l210J832k376N06K388j984k618K231
5273i93J208j440J72K158L209q24r12j613j004j103k261J274J963M708j071n618
5257b147l089M49J345R65L56j853N998L563k106k940r41K147k711k685j099j591
5241f339p78Q949J285j298j233l801K51J272N047J73o163n9q45k221J078k031
5225f713k89J964N58L621L152j193j537k026n60j230K468M786L00K172L862k618
5209F717k114k384J364N54j718n188l295K298r10J801L62k957M319K094l379J443
5193i93K310l423m204n9L250J01m91k50m65J438k523m20L515J863j145K75K976
$$ y = [8121, 3803, -554, -4506, -3444, -764, -1150, 746, 1447, -532, -781, -1006, -2624, -5059, -8137, -324, 4746, 5022, 2959, 2942, 2631, 2871, 4693, 4776, 4248, 2238, -972, 860, -1516, -1010, 1378, -606, -3224, -993, 215, -1225, -1053, 1105, 4314, 3490, 2578, 965, -39, -1142, -3403, -2129, -166, 4542, 3471, -2147, -5236, -4787, -3442, -2477, -2121, -3974, 2024, 5587, 3481, 541, -400, 1747, -964, -3649, -4748, -6339, -7117, 1832, 3117, 1819, 586, -3215, -2964, -1692, 3355, 3528, -2635, -2694, -3539, -5760, -4682, -6713, -7002, -5038, -4480, -859, 2293, 1100, -437, -2463, -3023, -4253, -1785, 3001, 3301, 5473, 9335, 6717, 4603, 2219, 3583, 4137, 2419, -2769, -6064, -3766, -4676, -2875, -2513, -5470, -1151, 943, -2436, -993, 1317, -2106, -6310, -6369, -3119, -3018, -3509, -3759, -4224, -2786, -5309, -5729, -2214, -351, -1496, -1221, 1755]
5176A755j201j497O61L553k27j216P92j380J597J812j324k45j242J395l184Q34
5160H83N04L419p01k416l451k142J513R3Q752k03o288J693k351k989J233K456
5144Ek630M331J088l894k321k331M263K223L121J323J747M11k535O2L080k631
5128E312k091k76J031J022j779k541J998j578k395m60O564L04O06j420k717K37
5112A817L805N3l599p665J215n55j880K723J729K160M20k685n9M076P08R46p03
5095B506J316k648k120j31ol661n18l35L940J128Q47k144j631rJ738K165j99j436
5077a198n202l45M693J924K410p83J980j464j548j35j98k663M13L60J476O224
5061E944j454j488J79n11l365j499L482J350K909Q67k166k966j651k499j212N116
$$ y = [1755, 554, -943, -282, 3271, 3044, 1828, 2620, 1240, 2837, 4649, 3325, 3080, 1838, 3233, 49, 883, 1387, 4806, 4105, 1689, -1762, -3904, -2391, -2298, 6454, 6251, -37, 1656, -695, -3684, -2451, 5, -2625, 1706, 2794, -1100, -3421, -5752, -1489, 734, 3855, 5178, 6925, 7336, 4801, 4863, 7943, 5312, 3221, 2945, 3976, 4998, 3219, 678, 2676, 1098, -1297, -1757, 4807, 5111, 5717, 4297, 1580, 1817, 5622, 5675, 2076, -5589, -4374, -4929, -6809, -4086, -2357, -197, 223, -2462, -2521, 1555, 2263, 3209, 2506, 3822, 1174, -946, -1077, -1083, -4744, -5262, -5597, -1657, -529, 318, -1826, -3457, -3466, -1728, 437, 238, -1198, -6400, -6745, -2052, -128, 2282, 1499, 3479, 2015, 467, 332, 134, -2529, -2116, -1756, -280, 5944, 4490, 3002, 3181, 2670, -695, -2194, 1288, 2638, 5547, 6414, 4248, 1282, -369, -2868, -4080, 1036]
5045A036M333k391Q18j50m94j588m194j872k361L605K840j865J959o97J552L819
5029D350J015m349m207q23K408K04K705q38J952j466k944j912O00L401K255k168
5013A83J066M95J71J016q40l773k942J21K621L181j890o57K026l143m693M43K453
4996d162L300L463j484l792k703L502L631K687m387K545K222J298L658j071l649
4981E058l347l832q37J443L692J934q562j52K47L269K90j995N290p50l569J821
4965@J204j000Q65o28q3K855j60L08l177l646M62K061j534n60R47K560N22l187
4947b191o56Q7j119o021j996M560M159Q74j913K893J286l658j1M87J645k381n3
4930d008M884l751l774j431K284O97K900M170m10N17J539k62L079r37j338j785
$$ y = [1036, 5369, 2978, 3796, 3646, 3152, 1564, -2630, -4502, -6863, -3258, -418, -2283, -324, -1021, 531, 4350, 5365, 1016, -3191, -4014, -1606, -1402, 1303, 465, 2417, 951, -1993, -3905, -3305, 96, 2351, 183, 1249, 1744, 1915, 2931, 2091, -1682, -4624, -4503, -1882, 1299, -591, -1248, 778, -2365, -7058, -6615, -4162, -862, 2601, 1117, -2675, -5378, -1876, 1755, 4442, 55, 2600, 4822, 6120, 9778, 8707, 5058, 1711, -2121, -2958, -1515, 2177, 4111, -4451, -4603, -4356, -1087, -797, -2792, 2498, 1748, -1821, 0, 1204, 204, 1069, 441, 358, 3213, 3053, 3361, 184, -3462, -3000, -939, -2473, -3033, -2086, 474, 996, -2191, -2847, -2760, -3879, -9900, -11896, -7336, -3177, -2303, -4216, -1323, -37, -3695, -3706, -3219, -1574, -3955, -4008, 876, -2875, -6649, -8080, -5796, -5099, -2199, 1971, 1561, 2078, 3617, 3355, 6434, 5497, 4159, 2374]
4914B374M03j650j52J370N118Q87n614J091R70j869m363j93k258J79r7k391J422
4897d773J861r08m05M866P55k05L23M45k915l665l53L862L080J946p35l753N74
4880@J423J48J743K64k427l052k95L497j225r32J849Q33l226r14K532P19m39j453
4862i55K146j593J618j215k734J71J655l520J944K941K178K855k659j627R96R60
4846C161n162l535M02k372R27O31N068j68K051N65O111J976L8m13l836m20Q53
4829E877M83O32k71J412R24j706o235k048j333K004L06K005M871m757J024O74
4813C862k075l64k732J104j33P61r04K983M25m542O09l64q98Q30k30M31m01m30
4795b068M380J507j725L1j556k527J681K951j862k317M482j960n04j366K64K424
$$ y = [2374, 2777, 1127, 975, 2345, 7463, 8350, 2736, 3827, 4797, 2928, -1435, -1628, -3886, -3707, -3804, -6195, -4773, -2912, -3820, -4225, 641, 1396, 1191, 1514, 1959, -956, -4621, -4974, -1112, 1968, 3914, 3179, -574, 0, 1423, 1571, 3314, 3578, 1151, -1901, -2196, 1301, 76, -856, 993, 1826, -1400, -2314, 218, 937, 498, -955, 1191, -402, 1216, 1, -2733, -2562, -907, -4427, -2483, 458, 2636, 5491, 2832, 1205, 2201, 3161, -2001, -5536, -5134, -7506, -6579, -5948, -880, -1048, 1003, 1568, 7679, 9655, 9693, 9280, 5444, 5024, 5877, 6360, 6992, 6721, 8133, 9057, 7351, 1116, -932, -2265, -261, 45, 2050, 6921, 2164, 3188, 3862, 1787, 1423, -1309, -205, -338, 423, -481, 2502, 2927, -1615, -1006, -1370, -2268, -1438, -1668, -1237, -1638, -2068, 2312, 3819, 2094, 2125, 569, -1958, -277, 2674, 812, -1505, 2977, 1017, 513, -853, -589, 1835]
4779A835J197j167j145l99J276J559J970j928L174k074l859l004k304k298K404
4764d763j944K663L35j66K480Q94m259k851m160L62Q389N206J696k664k16J309
4748B311k304p17l00J396L635J618R73p118k034N427J508k630O79J594M34L65
4732D837l603o45o20j317K858r2l916J189J54k749J058m29j295l77J891Q08J224
4715a024q4k935J1J531L089k385J609l90j51O13q10n158K513K320j983k813K895
4698c152k01j608k979O763j397r13J686J731l73j305M348j714j974J368j837m309
4682e866k255L218M002N066k351o440k87k17N677K489j652L091J751j542j560
4667C124q39Q20J402J336k525K030m9P01J059j27j491o299m829K77L42L16L151
$$ y = [1835, 3032, 1865, 720, 321, 1597, 3156, 5126, 3198, 6372, 4298, 439, -2565, -4869, -7167, -4763, -6707, -4044, -3709, -3875, -1395, -501, -4760, -7611, -11771, -11409, -3020, 2186, 3882, 1218, 1002, 2311, 7, -710, -1010, 386, 4021, 5639, 6612, -506, -2540, 2887, 4395, 1765, 2444, 4038, 4472, 4837, 1234, 589, -31, -1348, 1510, 1418, -2498, -1309, -1155, -3904, -2846, -3275, -4570, -4947, -3056, -2248, -1024, -1108, -4043, -4032, -2501, 588, -1797, -188, -578, -729, -116, -926, -6084, -3571, -1251, -3234, -6047, -3152, -3353, -4961, -7940, -1177, -2574, -3487, -1801, -70, -443, -1748, 2600, 886, -1088, 280, -1557, -5866, -8121, -4903, -901, 4165, 1814, -4626, -4913, -5130, 547, 3036, 1384, 4475, 6226, 4684, 3124, 2285, 3105, 4507, 5843, 3318, 5348, 5299, 6000, 7059, 6932, 5441, -858, -5687, -5410, -5068, -4752, -1601]
4650a601L995J350n19n356Q55K127K267K712j733K396R29m549r64j735j184N259
4634D249O510K305k420m229J04j885j942k710q31m205n35o0K783N168L21m037
4618a414j163m20K192O448K990k923n978n78J877K617L469j539J34j745l29L31
4602C969o77N333R49o051j115M06L635J205l955k583o67Q6j71k10j77R41J430
4585B348P95L45n71K6o627j311M83k720k660Q82L768N254J677J785J175o58k759
4568A232J372j989j779l5k376O8K327K953j823m32m66j910k890L366N590m52j854
4551I02J195K32J153k182K274J199L074m28k1l270l000j329j341j134j711j652
4535f039J002L910L744J683m686q63o90L99M328k357r73L372J587m856k271L399
$$ y = [-1601, 2394, 3744, 3225, -2131, -1276, 851, 3118, 5830, 4097, 6493, 7422, 2873, 1909, 174, -1010, 4249, 10759, 13064, 10644, 6415, 6519, 4634, 2692, -18, -849, -5054, -5589, -5649, -2866, 2302, 2623, -1414, -2577, -2997, -805, 5643, 8633, 5710, -268, -846, 1031, 3648, 7117, 5578, 5712, 3967, 3638, 3969, 3292, 8625, 9574, 3523, 2408, 2814, 6449, 7654, 3699, 1116, 449, 535, 364, 154, -23, 918, 2348, 3143, 3488, 2917, 2943, -3684, -4995, -4512, -7232, -9892, -9010, -5242, 12, 1689, 3474, 4649, 3991, 1232, 2604, 615, -1164, -1199, -3575, -3507, -1180, 1773, -50, -482, -948, -2858, -5748, -2382, 3208, 2756, 902, 2097, 2329, 3482, 1300, 3574, 4773, 7847, 7419, 7398, 4128, 1128, -201, -1542, -2676, -4387, -6039, -5037, -1127, 2617, 4300, -386, -1249, -1939, -1540, 2788, 431, -542, 2830, 4417, -439, -2710, 689]
4519F89M375M050j02l159p103J901L641L659j043Q64l93p026n334R12k177J755
4503d491K614J680J966k64J622K054k104J262K410n478l125J424J749O55M187
4488F161L866J656m584m395l987L437L163l86m091m243j880J392n37J127L182
4473a19J932J226J574N20j906N77r47j748M930K271l970m236Q05o23j72J417k478
4456i47l53k950l05j85O37J662K881P56R00Q83K010l887j560L682j399m06K37
4439A656J440J801l950n195j250k532K714N322k252o26K752L071l584q69L537
4424B035O787J147J38R81o14p052k949K738k204J08J801l56j637J69l61j03j926
4407a298l458j335J41K620O181R81o686l094k227J197M560j10m497K320j67K304
$$ y = [689, 5064, 9114, 9012, 5853, -1250, 651, 4292, 7951, 6908, 7772, 7379, 353, -4981, -4069, -6246, -4491, -1877, -197, 1769, 1505, 3127, 5181, 3077, 4339, 6749, 1271, -1854, -430, 1319, 1974, 6161, 10027, 11683, 7099, 2704, -1283, 2154, 5317, 4931, 840, -3403, -5283, -3891, -4428, -3301, -119, 1813, 3039, 4613, 5133, 3227, 3804, 2857, 1109, 6039, 8310, 4340, 104, 909, 286, 114, 1531, -947, -1300, -4250, -4555, -4740, -4103, -2441, 440, 1196, 2096, 2979, 4989, 1102, -458, 3224, 1825, 1419, 1656, 3096, 4897, 947, -4248, -5498, -8030, -5316, 6, -2246, -2872, -120, 2951, -633, -1502, 2035, 8822, 9969, 10107, 11088, 10474, 3422, 473, 3211, 1007, 1115, 2916, 2560, 923, 1092, 731, 628, -1298, -4756, -6091, -5950, -3330, 2851, 3832, -2854, -5948, -8175, -6978, -2418, -2528, -7025, -4705, -4872, -2568]
4391b568J210j09K527R0n247j043j880O31o13K411L76j723L260k316J599L535
4375A40K010j298j034N398J158q26j099k548o6K073R31J684k394r75l940L643
4359B857P60j525J293Q16K160q32K226K261m328q63r84k08N20R41l431K458K530
4342F651R04l424j386J61j526j654k398j710k763m08M237L311K123l863l777N254
4326b68jl672J999j40J197O2N62n59k508J507q18k265K398K099j612o140J046
4309g113K032J382K686k208n22j053j17L51Q13K998M31J55Q0J552P89l147K733
4292A842q62j335j69M420N858M146j541n231l740j804L105J771l665k044k04k194
4276a647K093J954J526J27l93l913j39K39k731n94J407K03l401N98k69k287k329
$$ y = [-2568, -1358, -1467, 1060, 1150, -4097, -5140, -7020, -6389, -7002, -4591, -4215, -5938, -2678, -4994, -3395, 140, 2150, 852, -182, 5216, 6374, 5548, 4449, 1901, 1835, 3908, 4839, 6523, 4129, 3154, -786, 2857, 3617, 2092, 3385, 4201, 6361, 5529, 7755, 10016, 5688, 4825, 3841, 3633, 4153, 5094, 1663, 4121, 6651, 7555, 4131, 2745, 2906, 1380, -274, -2672, -4382, -7145, -7553, -3316, -5, 2118, -1745, -5522, -268, -269, -3941, -1942, -2082, -885, -823, -261, -820, -3328, -1821, -2639, -4904, -2506, -407, -2019, -8159, -7113, -5081, -3699, -1013, -3221, -3743, -4796, -4913, -4562, -3749, -751, -320, -165, -85, 1467, 2256, -891, 1842, 980, -355, -524, 3896, 9754, 13900, 12359, 7128, 3388, 1584, 4689, 6460, 2795, 751, 547, -1647, 446, 2400, 3926, 4053, 3660, -253, -392, -153, -2884, -3478, -2071, -1868, -5269, -4671, -4940, -7227, -9556]
4259i556P90L768M842M26k725J893P7P24L209L276j250n349j1K684l063J677p39
4242F73K883l628l277R62l447J864J558M891j100k601L829P354K137l177k322
4227F599k191n218j090N020K323K25j37o34k160k771j427L780Q0p49P06P07L82
4210C445J572n19N984k296p206k688M606J630j704m589j471k004j583k372k287
4195a1482M029N953K77k487j094j759K587N98K096K182L095N487k601l945o87
4180B249o98o69j809j863K125R66P7M00r41o66J817K898k065Q89J834j104n389
4163a949k26O251R1n75R42n83l790m616j71J10LL14K344J141J302J160n24o367
4145e143l175L880P17M318J859J316k024R28j07J75K39m195j454J465M283M55
$$ y = [-9556, -8766, -4998, -156, 270, -2455, -562, -485, 239, 3448, 6724, 5474, 125, 114, 2798, -265, 1412, 673, 3556, -72, -3349, -2387, -5834, -3970, -2412, 2479, 1379, -1222, 2607, 9961, 12098, 8921, 6599, 4408, -810, -1900, 3120, 5443, 5668, 5531, 4897, 2737, -34, -1461, 2319, 2399, 1650, 2356, 3063, 3445, 5017, 4498, 10482, 8186, 980, -1708, 2898, 4528, 2824, -1765, -3236, -5240, -6823, -9195, -11482, -7453, -1500, -1223, -3710, -4804, -6563, -3976, -3378, -1282, 900, 3995, 9482, 6881, 2936, 2249, 1551, 882, -927, -2790, -665, 301, 378, 778, -163, -829, 988, 3886, 1821, 2710, 4544, 3440, -1949, -2175, 4076, 4167, 3592, 4534, 3951, 161, -4455, -4626, -4516, -4513, -4199, -1855, -714, 588, 1748, 1224, -5143, -8318, -4438, -3721, 597, 2456, 3772, 1748, 2676, 2569, 2744, 2983, -1212, -2666, -1201, 3082, 3537]
4129C537L41l485k365M538L682K080k51j128m162l869n34R21j970l451M12O672
4113I68J935J456p73j511O61J190l221n59L759l018m71L401K258l14n42k06p7
4096D936j44k474j175l102l575j939M389N329J187j138j204K087J936J902j963
4081E052n990J017J624k213o18P22M592K954n401m835K249M065n314j71K690K343
4065B766k419m778J602N923O1p63m61p47k635k061l422K719J765K315K97J12L946
4048D220N084j209r12q63l226n40j135m23r06J512J064j785k943j002M130J670
4032B736j843l294K945n5j648K281L517J607p03L539K244l696k909R42n350j761
4016a448p00k419L079M196Pk10q66K960M806K367k247m410k92r62j360L11M549
$$ y = [3537, 3878, 393, -1972, 2566, 6248, 8328, 8077, 6949, 2787, -1082, -1616, -695, -2665, -6116, -5704, 968, 2903, 4359, 3586, 2075, 2736, 3926, 705, 146, 3905, 887, 416, 3817, 6075, 5761, 5219, 5013, 4936, 4792, 2318, 1143, -1959, -5534, -7473, -3084, 2245, 3432, 2294, 1090, 3177, 5113, 7015, 5052, -938, 79, 1703, -510, -1128, -406, 4186, 7140, 1739, -3096, -847, 3218, -2096, -2267, 423, 2766, 347, -4431, -2829, 3094, 3155, 2392, 1931, 1184, -1451, -3512, -6934, -4215, -2450, -135, 162, 274, 4220, 9304, 8095, 7183, 6320, 3094, 2554, 1419, 996, 90, 1602, 2666, 881, -2062, -3064, 1066, 2736, 893, -2401, 544, 489, -1159, 1122, 4639, 6246, 5543, 9082, 11326, 7630, 4721, 5663, 313, -1448, -2148, -4567, -1488, 2708, 2715, 2505, 1639, 4599, 9405, 11772, 9525, 5115, 4823, 3861, 2501, 2812, 7361]
3999G361K966k170l505M73k39M350N593l272m133k454m906n22L454K266n178n61
3983d77N649Qk206l011O996j785m866L154m49J01J32o5l934l504j136J840j588
3966e141K928l45qK901K938J977m443n334o93J836J665L593p28l734j297J39K608
3949a138j40R19o79K68J771j156k93j256J948p29L040q97k554j9n89o2N12L59
3931f95J389J821m86R39J668j168j72l22j540l64M81l664k70j110M690K163l44
3914C016K106j373J76k771K680O93m132k193j267m744M121J091L750J665l32j608
3898H78p70K708O182P29l70k259j47L72p65J004k033n259k837j856J920J251%
3881a252J263N335L92m15k172l059j531L966m81l57k685p20m6m84l62l195J707
$$ y = [7361, 10327, 8157, 4652, 5125, 4886, 9236, 14829, 11557, 7424, 4970, 64, -458, 2996, 5262, 84, -477, 5172, 5180, 2974, -37, 6959, 5174, 308, 3462, 3013, 3114, 3246, 3181, -753, -4257, -5393, -3553, -5141, -2213, -2558, -2566, 335, 3273, 5250, 807, -4527, -5220, -3384, -1719, 1874, 1146, -2588, -3885, -3746, -1138, -1278, -359, -1038, -770, 1001, -155, -448, -1704, 244, -485, 2555, 1658, -896, -915, -1504, -1566, -1054, -695, 694, 2515, 2029, 2968, 4636, 3468, 3296, 2974, 1434, 1070, 1551, -2113, -2383, -3493, 1197, 3360, 3016, 5122, 3749, 3925, 1154, 3834, 4527, 395, -1798, -3065, -7809, -3688, -2597, 1153, 2818, 2486, 878, 108, 2816, 8998, 9727, 9357, 7098, 6951, 7323, 6558, 7562, 5529, 270, -2567, -4423, -2503, -1252, -1252, 11, 5346, 5738, 5323, 3151, 92, -1439, 2527, 2046, 1689, -996, -1716, -1762, -2246, -2608, -5803, -4096]
3864d096O203N85n17L718n933k706M252R41j026j42J244K922n62k186k846L140
3848B991l176j364n54K700P09r76q24k996P46K684k426L031L473J045j074k395
3832A594L038j103r79Q9l263k900k175J83J374L971K623k964j44j64J088L268
3816C536j013O55j969k680j123K215J931K8O24K570O12j009m120k099q33O74L228
3799A227m88N27N21M90K782r63n27l119M212J188j644q46m625l106K435q30K607
3782a59J683j195K425j256J591R9l87j959K439Q67l43Q49K081M600p00l508k400
3765D727o579j405L853L284l001l12N28k406n40O557K899m523j507p70k39m26
3749A40o45M737J023j836k174j758q37j991P3N56O07M81J233K199J01M77j00n408
$$ y = [-4096, 2107, 2692, 2175, 5893, -40, -2746, 1506, 2447, 1421, 1279, 2523, 5445, 4883, 2697, -149, 2991, -185, -1549, -2103, 597, 1306, 330, -494, -3490, -2744, -60, -2486, 545, 4018, 5063, 3989, 1594, 4632, 3529, 2550, 2639, -624, -3524, -5699, -5516, -4142, -171, 2452, -512, -656, -820, 268, 3536, 2523, 3178, 1209, -1471, -2594, -379, 1552, 1580, 2204, 4774, 5386, 4377, 257, -1842, -2675, -2001, 1227, 739, 1266, 1787, 2277, 5059, 4096, 3569, 450, 4662, 5850, 4206, 3360, -1265, -4371, -1936, -2766, -159, 1524, 329, 2754, 1498, 3089, 3188, 2801, 842, 3281, 4148, 3805, 4654, 6735, 11335, 10635, 7127, 4727, -1852, -3257, 596, 3880, 879, 567, 1095, -1311, -1851, 4706, 7605, 3082, 1575, 805, 566, 140, -505, 4232, 5255, 3419, 1245, -513, -1350, -3341, -3268, -2712, -2105, -1624, -391, 1808, 1909, 2386, 2286, -3122]
3731c122R77K094J631l05p12l312m08L173J034J781L49m008j021o35m528K167
3715d845L935L244J037J52J970J832k876m547l522J028j130k935r68O496M249
3700C120K332l057k516j734k021J904l44K545j022l37j194L032K275J750l105
3685A628j345o51j460k314P76L989M052J192m530k597j293N07J093K201r0K443
3669C601j81m178Q37n8j262K10M81K106M376j175R09N109m966r08k80M249o91
3652H179k329k798O45J987k33n697k912Qn57K633K913O2r6J968K590m00k091l156
3634G16l971L940l50J834O4k909j185M077J512k614K20k130k897M158r06r6L63
3617a74l391q53J781N793j091n894q03o8N79L127M3k221M35K104J242k156J678
$$ y = [-3122, -2145, -51, 1580, 1275, 563, -2749, -3157, 16, 1050, 2831, 3180, -828, -1849, -2484, -7012, -4845, -910, 2334, 3371, 3523, 5493, 7325, 4449, -98, -3620, -2592, -3722, -6657, -7625, -1129, 3120, 5452, 2395, -121, -1855, -3876, -1972, -2316, 229, -793, -1130, -2324, 708, 2983, 4733, 1628, 283, -368, -1828, -4142, -3366, 623, 4675, 5867, 1337, -1260, -2553, -2046, -953, 1248, 1158, 3601, 3420, -758, 79, 21, -1241, -1031, -550, 1556, 5932, 4757, 5666, 10775, 5809, 4901, 4621, 8870, 8179, 5850, 3052, 3697, 5684, 5451, -246, -3158, -3150, -3707, -1074, 1839, 1901, 1805, 3773, 6363, 5963, 3872, 716, -3255, 685, 335, 2169, 2233, -676, -1861, 2216, 3728, 1114, 1334, -796, -3693, 465, -441, -537, -174, -3565, -4418, -2637, 3156, 2065, -3829, -4632, -4700, -4121, -994, -951, -3172, -2737, -633, 609, -1547, 131]
3600A31J244l150O53K706L485m05n76M77m757l640j368L704J745M483l76J876
3584F232j887k532J996K99p82k651k364o36L143M69K312K373L197q01l459k186
3568B723m57M829J81k117l816j59k324j49L155k69J550J844J607O52Q38j474n940
3551F74k96N547K400J260Q24j531m515o628l29j411R69J750J263J911J2K224J71
3534D295P38p63M50k686k956L570o71l923K939R10N54K369J17j050k946K939k860
3517A026k006P84l65j183L019K54l474N81M037m440m044q92R53M752J044o12N701
3500E135M533j140m679o042m216m64K46O400L964j359j177j989j467l49q43k496
3484e943m624J666M449L914J266l933k61mj852J704J995J435k208n46k184K017
$$ y = [131, 1375, -1775, -1122, 1584, 5069, 4664, 4088, 4565, -192, -3832, -5200, -1496, 249, 4732, 4356, 6232, 4345, 1813, 3809, 4108, 3326, 675, -1689, -2325, 818, 1287, 3599, 5972, 9169, 8368, 4909, 2723, 2266, 7095, 7276, 5159, 1343, 1184, -1140, -1289, 1866, 1597, 3147, 4991, 6598, 7250, 8088, 6614, 674, 378, 5925, 8325, 9585, 10409, 8878, 4363, -2265, -2594, -4005, -3036, -1286, -23, 1888, 1900, 4124, 4295, 5033, 4270, 4720, 2034, -922, 2648, 1977, -1946, 993, 1903, 2457, 4826, 4943, 3893, 947, 3886, 1026, -980, -196, -561, -1744, 1275, 1529, -1945, -1364, 2673, -1767, -5811, -6703, -5750, -998, 46, -566, 5135, 9668, 8528, 3849, -2193, -6409, -6873, -6627, -227, 3737, 2378, 1201, -788, -2255, -2604, -3447, -5943, -10567, -8901, -4452, -538, 728, -3205, -3466, -3470, -5322, -3618, -1623, -188, -2396, -2942, -5126, -3109]
3468c109J934L50J542k569k366L373m56j759K403M61K293J313L602J82J346J089
3452I629L303k096l422p62j827M25k217m919n02O056j869j936k329L965K225J025
3436D749j634k551J05r95r04L093j742p86K040k081l203j460K116M50K236P17
$$ y = [-3109, -1175, -825, 717, -1852, -4218, -845, -1301, -3060, -657, -196, 2097, 3410, 7012, 7194, 8540, 9629, 12932, 10836, 7414, 6652, 4825, 5250, 3033, -1886, -2388, 3668, 1799, -137, -2466, 1499, 3724, 4749, 3115, 564, 669, -326, -1230, 1863, 121, -665, 1375, -706, -3909, -5369, -3253, -2803, -567, 150]
$$ [...]
##END NTUPLES=NMR SPECTRUM
##END=
