##TITLE=Analysis number 328690
Compound Code cc 50713
Book Reference 525/130/10
Project Code adrs
Chemist Name davec
##JCAMPDX= 6.0         $$ Bruker NMR JCAMP-DX V2.0
##DATA TYPE= NMR SPECTRUM
##DATA CLASS= NTUPLES
##ORIGIN= Bruker BioSpin GmbH
##OWNER= nmr
$$ XWIN-NMR		Version 3.5
$$ Tue Jun 26 12:27:47 2007 GMT Daylight Time (UT+1h)  MAYBRIDGE\nmr@NMR_250MHZ
##.OBSERVE FREQUENCY= 250.131544655141
##.OBSERVE NUCLEUS= ^1H
##.ACQUISITION MODE= SIMULTANEOUS (DQD)
##.ACQUISITION SCHEME= undefined
##.AVERAGES= 16
##.DIGITISER RES= 18
##SPECTROMETER/DATA SYSTEM= dpx250
##.PULSE SEQUENCE= zg30
##.SOLVENT NAME= CDCl3
##.SHIFT REFERENCE= (INTERNAL, CDCl3, 0, 16.4692)
##AUDIT TRAIL= $$ (NUMBER, WHEN, WHO, WHERE, WHAT)
$$ ##TITLE= Audit trail, XWIN-NMR		Version 3.5
$$ ##JCAMPDX= 5.01
$$ ##ORIGIN= Bruker BioSpin GmbH
$$ ##OWNER= nmr
$$ C:\u/data/dgb/nmr/ADRS/2010/pdata/1/auditp.txt
$$ ##AUDIT TRAIL=  $$ (NUMBER, WHEN, WHO, WHERE, WHAT)
(   1,<2007-06-26 12:27:17.29 +100>,<MAYBRIDGE\nmr>,<NMR_250MHZ>,
      <created by zg, POWCHK disabled, PULCHK disabled
       configuration hash MD5:
       76 6E 9A 78 1E 09 19 81 EC 84 63 8F B0 6A 59 2D
       data hash MD5: 64K
       E2 E5 9D 1B 6E 9D 0F 2D EE 66 BC 4F 4B AE 02 1D>)
(   2,<2007-06-26 12:27:35.56 +100>,<MAYBRIDGE\nmr>,<NMR_250MHZ>,
      <Start of raw data processing
       ef LB = 0.3 FT_mod = 6 PKNL = 1 SI = 32K 
       data hash MD5: 32K
       59 FC 88 74 03 79 AA DF 3A B2 AA 6F 49 A0 ED 1D>)
(   3,<2007-06-26 12:27:37.82 +100>,<MAYBRIDGE\nmr>,<NMR_250MHZ>,
      <apk 
       data hash MD5: 32K
       80 3A 65 D8 6D 19 B8 05 48 76 1D 16 F1 88 BC FF>)
(   4,<2007-06-26 12:27:38.64 +100>,<MAYBRIDGE\nmr>,<NMR_250MHZ>,
      <abs ABSG = 5 
       data hash MD5: 32K
       92 35 EC BB 5B 59 76 E4 CB 29 54 C3 C1 97 76 93>)
$$ ##END=
$$ 
$$ hash MD5
$$ DF A1 60 C9 28 D2 C9 80 C3 3E 74 10 DE D0 C0 BF
##$RELAX= 
##$RELAX= 
##$RELAX= 
##$RELAX= 
##$RELAX= 
##$RELAX= 
##$RELAX= 
$$ Bruker specific parameters
$$ --------------------------
##$DU= <C:\u>
##$EXPNO= 2010
##$NAME= <ADRS>
##$PROCNO= 1
##$TYPE= <nmr>
##$USER= <dgb>
##$AMP= (0..31)
100 100 100 100 100 100 100 100 100 100 100 100 100 100 100 100 100 100 
100 100 100 100 100 100 100 100 100 100 100 100 100 100 
##$AQSEQ= 0
##$AQ_mod= 3
##$AUNM= <au_zg>
##$AUTOPOS= <27 >
##$BF1= 250.13
##$BF2= 250.13
##$BF3= 250.13
##$BF4= 250.13
##$BF5= 500.13
##$BF6= 500.13
##$BF7= 500.13
##$BF8= 500.13
##$BYTORDA= 1
##$CFDGTYP= 0
##$CFRGTYP= 5
##$CHEMSTR= <none>
##$CNST= (0..31)
1 1 145 1 1 1 1 1 1 1 1 1 1 1 1 1 1 1 1 1 1 1 1 1 1 1 1 1 1 1 1 1 
##$CPDPRG= <>
##$CPDPRG1= <>
##$CPDPRG2= <>
##$CPDPRG3= <>
##$CPDPRG4= <mlev>
##$CPDPRG5= <mlev>
##$CPDPRG6= <mlev>
##$CPDPRG7= <mlev>
##$CPDPRG8= <mlev>
##$CPDPRGB= <>
##$CPDPRGT= <>
##$D= (0..31)
0 1 0 0 0 0 0 0 0 0.06 0 0 0 0 0 0 0.0002 0 0 0 0 0 0 0 0 0 0 0 0 0 0 
0 
##$DATE= 1182857235
##$DBL= (0..7)
120 120 120 120 120 120 120 120 
##$DBP= (0..7)
150 150 150 150 150 150 150 150 
##$DBP07= 0
##$DBPNAM0= <>
##$DBPNAM1= <>
$$ [...]
##$SUBNAM7= <"">
##$SUBNAM8= <"">
##$SUBNAM9= <"">
##$SW= 20.6930455092707
##$SWIBOX= (0..15)
0 0 3 0 0 0 0 0 0 0 0 0 0 0 0 0 
##$SW_h= 5175.983436853
##$TD= 65536
##$TD0= 1
##$TE= 295.16
##$TE2= 300
##$TE3= 300
##$TEG= 300
##$TL= (0..7)
0 120 120 120 120 120 120 120 
##$TP= (0..7)
150 150 150 150 150 150 150 150 
##$TP07= 0
##$TPNAME0= <>
##$TPNAME1= <>
##$TPNAME2= <>
##$TPNAME3= <>
##$TPNAME4= <>
##$TPNAME5= <>
##$TPNAME6= <>
##$TPNAME7= <>
##$TPOAL= (0..7)
0.5 0.5 0.5 0.5 0.5 0.5 0.5 0.5 
##$TPOFFS= (0..7)
0 0 0 0 0 0 0 0 
##$TUNHIN= 0
##$TUNHOUT= 0
##$TUNXOUT= 0
##$USERA1= <user>
##$USERA2= <user>
##$USERA3= <user>
##$USERA4= <user>
##$USERA5= <user>
##$V9= 5
##$VALIST= <valist>
##$VCLIST= <CCCCCCCCCCCCCCC>
##$VD= 0
##$VDLIST= <DDDDDDDDDDDDDDD>
##$VPLIST= <PPPPPPPPPPPPPPP>
##$VTLIST= <TTTTTTTTTTTTTTT>
##$WBST= 1024
##$WBSW= 4
##$XGAIN= (0..3)
0 0 0 0 
##$XL= 0
##$YL= 0
##$YMAX_a= 475481
##$YMIN_a= -720070
##$ZGOPTNS= <>
##$ZL1= 120
##$ZL2= 120
##$ZL3= 120
##$ZL4= 120
##$ABSF1= 16.46924
##$ABSF2= -4.223932
##$ABSG= 5
##$ABSL= 3
##$ALPHA= 0
##$AQORDER= 0
##$ASSFAC= 0
##$ASSFACI= 0
##$ASSFACX= 0
##$ASSWID= 0
##$AUNMP= <proc_1d>
##$AZFE= 0.1
##$AZFW= 0.1
##$BCFW= 0
##$BC_mod= 0
##$BYTORDP= 0
##$COROFFS= 0
##$CY= 12.5
##$DATMOD= 1
##$DC= 0
##$DFILT= <>
##$DTYPP= 0
##$F1P= 14.0000005364418
##$F2P= -0.99999901652339
##$FCOR= 0.5
##$FTSIZE= 32768
##$FT_mod= 6
##$GAMMA= 0
##$GB= 0
##$INTBC= 1
##$INTSCL= 1
##$ISEN= 128
##$LB= 0.3
##$LEV0= 0
##$LPBIN= 0
##$MAXI= 10000
##$MC2= 0
##$MEAN= 0
##$ME_mod= 0
##$MI= 0
##$NCOEF= 0
##$NC_proc= -4
##$NLEV= 6
##$NOISF1= 0
##$NOISF2= 0
##$NSP= 0
##$NTH_PI= 0
##$NZP= 0
##$OFFSET= 16.46924
##$PC= 1
##$PHC0= -49.91202
##$PHC1= 5.085251
##$PH_mod= 1
##$PKNL= yes
##$PPARMOD= 0
##$PSCAL= 4
##$PSIGN= 0
##$REVERSE= no
##$SF= 250.130013195127
##$SI= 32768
##$SIGF1= 0
##$SIGF2= 0
##$SINO= 400
##$SIOLD= 32768
##$SREGLST= <1H.CDCl3>
##$SSB= 0
##$STSI= 32768
##$STSR= 0
##$SW_p= 5175.98343685301
##$SYMM= 0
##$S_DEV= 0
##$TDeff= 65536
##$TDoff= 0
##$TI= <Analysis number 999999
Compound Code 99
Book Reference 9
Project Code 9>
##$TILT= no
##$TM1= 0
##$TM2= 0
##$TOPLEV= 0
##$USERP1= <user>
##$USERP2= <user>
##$USERP3= <user>
##$USERP4= <user>
##$USERP5= <user>
##$WDW= 1
##$XDIM= 32768
##$YMAX_p= 515567821
##$YMIN_p= -440947
$$ End of Bruker specific parameters
$$ ---------------------------------
##NTUPLES= NMR SPECTRUM
##VAR_NAME=  FREQUENCY,     SPECTRUM/REAL,   SPECTRUM/IMAG
##SYMBOL=    X,             R,               I
##VAR_TYPE=  INDEPENDENT,   DEPENDENT,       DEPENDENT
##VAR_FORM=  AFFN,          ASDF,            ASDF
##VAR_DIM=   32768,         32768,           32768
##UNITS=     HZ,            ARBITRARY UNITS, ARBITRARY UNITS
##FACTOR=    0.157963299565203, 1,           1
##FIRST=     4119.45126568789, 0,            0
##LAST=      -1056.53217116512, 0,           0
##MIN=       -1056.53217116512, -440947,     0
##MAX=       4119.45126568789, 515567821,    0
$$ Real data points
##PAGE= N=1
##DATA TABLE= (X++(R..R)), XYDATA
$$ [...]
$$ plain form
13650 121354 92385 95559 112330 85624 52968 31278 66892 112729 112142 110734 109686 123516
13638 123516 142605 178248 209463 236363 261279 314330 431265 582417 760976 968985 1177054
13627 1177054 1250386 1128011 912104 700041 516375 403494 334607 258427 195762 162133
13617 162133 168592 166302 150356 128093 133468 128561 123094 108484 100118 101031 96871 108314 127853
13604 127853 159157 149124 161752 183508 217230 217198 218229 242303 265901 235051 239140 230728 217075
13591 217075 220570 254065 301895 345186 428643 574504 763275 977946 1192890 1304548 1231480
13580 1231480 1007068 801251 592928 435783 380785 321844 281646 254204 236601 227205 224377
13569 224377 224948 250201 248314 211888 206798 212021 184884 157047 157779 171186 156946 143828 168531
$$ packed form
13650A21354k8969L174J6771k6706l2656k1690L5614M5837n87j408j048J3830
13638A23516J9089L5643L1215K6900K4916N3051J16935J51152J78559K08009K08069
13627A177054P3332j22375k15907k12063j83666j12881o8887p6180o2665l3629
13617A62133O459k290j5946k2263N375m907n467j4610q366R13m160J1443J9539
13604A27853L1304j0033J2628K1756L3722l2J031K4074K3598l0850M089q412j3653
13591B17075L495L3495M7830M3291Q3457J45861J88771K14671K14944J11658p3068
13580A231480k24412k05817k08323j57145n4998n8941m0198k7442j7603r396k828
13569B24377N71K5253j887l6426n090N223k7137k7837P32J3407j4240j3118K4703
$$ plain form
13556 168531 194409 205409 199534 213196 209970 228660 238877 259372 257911 240864 250121 243275
13544 243275 261473 263244 257559 301646 399039 494371 572885 637991 618661 529603 442861 354399
13532 354399 311339 327616 337993 330298 314819 314560 304966 298439 303352 340775 383223 385297 386479
13519 386479 409102 408289 416049 433644 449439 461562 470259 468467 466757 456410 430313 436109 447614
13506 447614 453391 454297 431127 474238 525318 542593 536372 554410 550011 519363 537286 557188
13494 557188 550029 519249 508369 543956 559206 585299 624908 625025 628850 671013 715268 731844
13482 731844 742033 740934 740988 751865 737174 711549 680451 659037 641158 632575 616968 591048
13470 591048 543728 513633 476326 495396 513886 531875 531698 521917 533469 516753 529125 508065
$$ packed form
13556A68531K5878J1000n875J3662l226J8690J0217K0495j461j7047R257o846
13544B43275J8198J771n685M4087R7393R5332P8514O5106j9330q9058q6742q8462
13532C54399m3060J6277J0377p695j5479k59r594o527M913L7423M2448K074J182
13519C86479K2623q13P760J7595J5795J2123Q697j792j710j0347k6097N796J1505
13506D47614N777R06k3170M3111N1080J7275o221J8038m399l0648J7923J9902
13494E57188p159l0780j0880L5587J5250K6093L9609J17L825M2163M4255J6576
13482G31844J0189j099N4J0877j4691k5625l1098k1414j7879q583j5607k5920
13470E91048m7320l0095l7307J9070J8490J7989j77r781J1552j6716J2372k1060
$$ plain form
13458 508065 492780 476386 499203 516102 495723 523019 559089 603094 654856 701804 725143
13447 725143 768071 830628 883185 905605 918854 904589 894186 874208 853171 827125 822579 817281
13435 817281 796882 809453 813959 800030 782199 784164 797010 816531 846788 858608 852649 869569
13423 869569 880150 911445 992157 1057079 1105354 1095415 1088353 1082631 1076366 1059729 1072189 1127664
13411 1127664 1158673 1160106 1173562 1201607 1255073 1294208 1303111 1325748 1384126 1488589 1575189
13400 1575189 1667550 1788022 1901132 2003006 2102622 2207977 2349933 2529797 2729390 2943466
13390 2943466 3211592 3504958 3873036 4290776 4774191 5380893 6195518 7208761 8500677
13381 8500677 10165487 12234199 14669487 17419891 20226853 22915531 25245342 27069471
$$ packed form
13458E08065j5285j6394K2817J6899k0379K7296L6070M4005N1762M6948K3339
13447G25143M2928O2557N2557K2420J3249j4265j0403j9978k1037k6046m546n298
13435H17281k0399J2571M506j3929j7831J965J2846J9521L0257J1820n959J6920
13423H69569J0581L1295Q0712O4922M8275r939p062n722o265j6637J2460N5475
13411A127664L1009J433J3456K8045N3466L9135Q903K2637N8378J04463Q6600
13400A575189R2361J20472J13110J01874R9616J05355J41956J79864J99593K14076
13390B943466K68126K93366L68078M17740M83415O06702Q14625J013243J291916
13381H500677J664810K068712K435288K750404K806962K688678K329811J824129
$$ plain form
13373 27069471 28364617 29274447 29989107 30620960 31179791 31640310 31847336 31608992 30745631
13364 30745631 29309417 27550925 25816753 24393495 23560252 23366663 23864046 25178816
13356 25178816 27329417 30417347 34332837 39002067 44160109 49460540 54599412 59248917
13348 59248917 63096251 65796236 67063975 66790738 65194435 62815540 60096817 57177399
13340 57177399 53848447 49823679 45201401 40348829 35715214 31757662 28742981 26721235
13332 26721235 25648979 25469755 26141424 27508918 29356408 31380718 33187695 34503644
13324 34503644 35207789 35318794 34893705 34176103 33296669 32355250 31450867 30535965 29482036
13315 29482036 28132169 26355401 24106908 21563472 18997799 16660194 14714510 13186675
$$ packed form
13373B7069471J295146R09830P14660O31853N58831M60519K07026k38344q63361
13364C0745631j436214j758492j734172j423258q33243j93589M97383J314770
13356B5178816K150601L087930L915490M669230N158042N300431N138872M649505
13348E9248917L847334K699985J267739k73237j596303k378895k718723k919418
13340E7177399l328952m024768m622278m852572m633615l957552l014681k021746
13332B6721235j072256j79224O71669J367494J847490K024310J806977J315949
13324C4503644P04145J11005m25089p17602q79434r41419r04383r14902j053929
13315B9482036j349867j776768k248493k543436k565673k337605j945684j527835
$$ plain form
13307 13186675 12056826 11286225 10770138 10533287 10555369 10818832 11353119 12197552 13403545
13298 13403545 15015087 17051974 19463313 22116887 24765103 27136365 29057688 30540161
13290 30540161 31660856 32579384 33470157 34425645 35426979 36320534 36939081 37038219 36453736
13281 36453736 35151528 33301742 31201532 29243972 27786217 27061594 27239026 28316793
13273 28316793 30362573 33409998 37453628 42251298 47483796 52591764 57187540 61089584
13265 61089584 64420727 67411353 70053918 72021620 72768909 71936997 69567526 65936761
13257 65936761 61384954 56202675 50690859 45196498 40087158 35698378 32198988 29647200
13249 29647200 28025807 27246265 27260506 28063273 29504086 31366700 33306092 34905671 35932983
$$ packed form
13307A3186675j129849p70601n16087k36851K2082K63463N34287Q44433J205993
13298A3403545J611542K036887K411339K653574K648216K371262J921323J482473
13290C0540161J120695R18528Q90773R55488J001334Q93555O18547R9138n84483
13281C6453736j302208j849786k100210j957560j457755p24623J77432J077767
13273B8316793K045780L047425M043630M797670N232498N107968M595776L902044
13265F1089584L331143K990626K642565J967702P47289q31912k369471l630765
13257F5936761m551807n182279n511816n494361n109340m388780l499390k551788
13249B9647200j621393p79542J4241Q02767J440813J862614J939392J599579J027312
$$ plain form
13240 35932983 36375988 36329985 35942370 35454419 34937680 34373056 33560314 32326829 30511896
13231 30511896 28185102 25381095 22387091 19471123 16849727 14719862 13092050 11943078
13223 11943078 11233239 10916794 10975158 11361118 12096428 13261102 15143586 18135920 22950633
13214 22950633 30551175 41905052 56587287 70319543 75176780 67472806 52487568
13207 52487568 38087592 27680473 20881273 16481301 13553534 11582305 10207588 9107239
13199 9107239 8154290 7361433 6723186 6236070 5874676 5576679 5329138 5197018 5148103 5150668
13189 5150668 5202362 5274529 5416457 5657109 5940684 6314612 6765964 7273481 7880976 8623130
13179 8623130 9552076 10786071 12419402 14644897 17540303 21172606 25777625 32049688
$$ packed form
13240C5932983M43005m6003l87615m87951n16739n64624q12742j233485j814933
13231C0511896k326794k804007k994004k915968k621396k129865j627812j148972
13223A1943078p09839l16445N8364L85960P35310J164674J882484K992334M814713
13214B2950633P600542J1353877J4682235J3732256M857237p703974j4985238
13207E2487568j4399976j0407119o799200m399972k927767j971229j374717j100349
13199I107239r52949p92857o38247m87116l61394k97997k47541j32120m8915K565
13189E150668N1694P2167J41928K40652K83575L73928M51352N07517O07495P42154
13179H623130R28946J233995J633331K225495K895406L632303M605019O272063
$$ plain form
13171 32049688 41267288 55484967 77762407 111391718 157123398 205266885 230384009
13164 230384009 212428840 164041392 114735264 79344062 56922803 42820729 33754210
13157 33754210 27801468 23655449 20432266 17612607 15123121 13099236 11516496 10301707
13149 10301707 9374870 8706942 8207165 7865406 7630657 7445507 7355038 7341291 7448857 7627181
13139 7627181 7859465 8207400 8660958 9210727 9873273 10745614 11884207 13442062 15555727
13130 15555727 18347262 21913218 26448076 32517660 41332282 54840177 75881283 107890457
13122 107890457 152410513 202096126 233394053 222340755 175726609 123593123 84779983
13115 84779983 59985561 44511824 34581687 28042544 23563121 20162574 17201265 14564054
$$ packed form
13171C2049688R217600J4217679K2277440L3629311M5731680M8143487K5117124
13164B30384009j7955169m8387448m9306128l5391202k2421259j4102074r066519
13157C3754210n952742m146019l223183k819659k489486k023885j582740j214789
13149A0301707r26837o67928m99777l41759k34749j85150r0469j3747J07566J78324
13139G627181K32284L47935M53558N49769O62546Q72341J138593J557855K113665
13130A5555727K791535L565956M534858O069584Q814622J3507895K1041106L2009174
13122A07890457M4520056M9685613L1297927j1053298m6614146n2133486l8813140
13115H4779983k4794422j5473737r930137o539143m479423l400547k961309k637211
$$ plain form
13107 14564054 12363276 10630634 9298884 8286563 7487921 6886100 6446376 6087006 5787550
13098 5787550 5553666 5365967 5207419 5078410 4975471 4950886 5014969 5108116 5245248 5471827
13088 5471827 5813625 6287779 6933230 7823270 8934878 10391561 12360064 15208227 19522585
13079 19522585 26209575 36296965 50312176 66066307 76696962 74811144 61357222
13072 61357222 44703261 31325833 22404082 16707783 13018384 10569314 8877679 7575403
13064 7575403 6458689 5513218 4726789 4089726 3575281 3175498 2852185 2586684 2402298
13055 2402298 2253711 2141774 2037253 1935560 1832612 1705678 1614021 1538899 1479867 1409039
13045 1409039 1381452 1385505 1379972 1350120 1317148 1272314 1232766 1173981 1120683 1052954 996259 947185
$$ packed form
13107A4564054k200778j732642j331750j012321p98642o01821m39724l59370k99456
13098E787550k33884j87699j58548j29009j02939k4585O4083R3147J37132K26579
13088E471827L41798M74154O45451Q90040J111608J456683J968503K848163M314358
13079A9522585O686990J0087390J4015211J5754131J0630655j885818j3453922
13072F1357222j6653961j3377428q921751n696299l689399k449070j691635j302276
13064G575403j116714r45471p86429o37063n14445l99783l23313k65501j84386
13055B402298j48587j11937j04521j01693j02948j26934r1657p5122n9032p0828
13045A409039k7587M053n533k9852l2972m4834l9548n8785n3298o7729n6695m9074
$$ plain form
13033 947185 922127 898319 890192 880999 863557 835009 824397 818848 810025 835057 878855 942762
13021 942762 1026393 1094073 1162403 1308420 1528903 1759758 1989564 2162497 2321247 2478071
13011 2478071 2596266 2570022 2464619 2343235 2167816 1947831 1676894 1395226 1171258 1003505
13001 1003505 912705 865660 833643 825235 787237 763615 759513 758987 733432 687922 630180 600564
12989 600564 566262 506824 465211 445542 456309 440226 407404 395260 422292 422066 417124 402605
12977 402605 420793 442833 460797 441525 454249 431697 397628 391275 386795 355278 338531 340479
12965 340479 359687 389083 427329 398285 362629 352819 350135 343756 340911 351515 389546 407267
12953 407267 405877 373033 379391 396172 392381 380712 351629 332535 297240 276392 255467 231799
$$ packed form
13033I47185k5058k3808q127r193j7442k8548j0612n549q823K5032M3798O3907
13021I42762Q3631O7680O8330J46017K20483K30855K29806J72933J58750J56824
13011B478071J18195k6244j05403j21384j75419k19985k70937k81668k23968j67753
13001A003505r0800m7045l2017q408l7998k3622m102n26k5555m5510n7742k9616
12989F00564l4302n9438m1613j9669J0767j6083l2822j2144K7032k26m942j4519
12977D02605J8188K2040J7964j9272J2724k2552l4069o353m480l1517j6747J948
12965C40479J9208K9396L8246k9044l5656r810k684o379k845J0604L8031J7721
12953D07267j390l2844O358J6781l791j1669k9083j9094l5295k0848k0925k3668
$$ plain form
12941 231799 233152 229268 255265 267837 243300 258283 290486 323365 348935 357958 360100 358307
12929 358307 360855 354570 342716 341970 329281 367377 409785 431921 459409 448698 445200 456247
12917 456247 483619 517197 520623 503488 489060 502006 517788 504728 488700 536091 565717 555664
12905 555664 520675 511158 542759 542912 497222 471546 460899 481965 506332 516575 503792 481304
12893 481304 478209 464240 423806 413820 451363 484314 474275 466994 461663 446166 445724 456654 454045
12880 454045 429563 412093 398809 395856 407793 412464 434241 413155 417722 423633 424672 409777
12868 409777 379374 351755 319075 293574 287928 301030 311857 287546 241137 237135 237239 240355
12856 240355 243594 283545 320494 329093 342411 342422 328731 366123 359834 366835 406211 476110 535786
$$ packed form
12941B31799J353l884K5997J2572k4537J4983L2203L2879K5570R023K142j793
12929C58307K548o285j1854p46j2689L8096M2408K2136K7488j0711l498J1047
12917D56247K7372L3578L426j7135j4428J2946J5782j3060j6028M7391K9626j0053
12905E55664l4989r517L1601J53m5690k5676j0647K1066K4367J0243j2783k2488
12893D81304l095j3969m0434r986L7543L2951j0039p281n331j5497m42J0930k609
12880D54045k4482j7470j3284k953J1937M671K1777k1086M567N911J039j4895
12868D09777l0403k7619l2680k5501n646J3102J0827k4311m6409m002J04L116
12856B40355L239L9951L6949Q599J3318J1j3691L7392o289P001L9376O9899N9676
$$ plain form
12843 535786 551026 579627 637149 646793 639417 610098 586423 551115 503413 466089 423865 404994
12831 404994 404231 359664 361029 398243 437256 479845 476310 480992 510746 529942 540155 538036 544569
12818 544569 550499 545374 535116 540200 528257 518444 504453 488293 473862 441510 422070 401331
12806 401331 380051 338766 317922 333245 359106 352599 329973 322887 329741 334683 339239 316724
12794 316724 292040 263895 269828 262734 295730 325716 305653 285978 244516 206709 201251 200918
12782 200918 199613 211384 229165 240031 248584 288440 323911 363680 437781 492334 527764 576416
12770 576416 638223 695495 721418 711860 669127 658019 648300 654421 652714 612917 516874 439524
12758 439524 398050 363172 346620 324034 283887 259365 263716 255489 231884 219375 224432 239562
$$ packed form
12843E35786J5240K8601N7522R644p376k9319k3675l5308m7702l7324m2224j8871
12831D04994p63m4567J365L7214L9013M2589l535M682K9754J9196J0213k119O533
12818E44569N930n125j0258N084j1943r813j3991j6160j4431l2352j9440k0739
12806D01331k1280m1285k0844J5323K5861o507k2626p086O854M942M556k2515
12794C16724k4684k8145N933p094L2996K9986k0063j9675m1462l7807n458l33
12782B00918j305J1771J7781J0866Q553L9856L5471L9769P4101N4553L5430M8652
12770E76416O1807N7272K5923r558m2733j1108r719O121j707l9797r6043p7350
12758D39524m1474l4878j6552k2586m0147k4522M351q227k3605j2509N057J5130
$$ plain form
12746 239562 243519 254683 302559 349891 421691 500440 552853 540670 500890 436362 376768 323274
12734 323274 292305 288405 276278 255405 277152 304471 326302 378938 430722 450806 432793 436233
12722 436233 453404 496271 542112 564920 567425 531149 522824 529594 493999 457001 428357 382219
12710 382219 352481 321858 311736 301450 306758 315632 332793 356705 423754 477511 522574 624614
12698 624614 773181 991400 1251863 1455002 1482400 1355162 1118116 887911 732749 599167
12688 599167 526099 503617 500831 486930 481096 462190 465079 507288 526199 490491 469279 488790
12676 488790 521196 521450 521112 530570 514347 522353 526009 529109 532133 533696 545918 552427 566432 576237
12662 576237 597996 665224 698678 754908 812937 874236 941476 1002968 1120818 1278175 1491272
$$ packed form
12746B39562L957J1164M7876M7332P1800P8749N2413j2183l9780o4528n9594n3494
12734C23274l0969l900j2127k0873K1747K7319K1831N2636N1784K0084j8013L440
12722D36233J7171M2867M5841K2808K505l6276q325O770l5595l6998k8644m6138
12710C82219k9738l0623j0122j0286N308Q874J7161K3912O7049N3757M5063J02040
12698F24614J48567K18219K60463K03139K7398j27238k37046k30205j55162j33582
12688E99167p3068k2482k786j3901n834j8906K889M2209J8911l5708k1212J9511
12676D88790L2406K54l38R458j6223Q006L656L100L024J563J2222O509J4005R805
12662E76237K1759O7228L3454N6230N8029O1299O7240O1492J17850J57357K13097
$$ plain form
12651 1491272 1728363 1970681 2124002 2059570 1843603 1657991 1503639 1393811 1334932 1314782
12641 1314782 1288860 1278708 1302708 1349685 1385344 1432663 1476239 1529697 1620749 1718520 1780671
12630 1780671 1857637 1937107 1994457 2097171 2226132 2344383 2522422 2716912 2911654 3118591
12620 3118591 3329768 3565452 3822474 4063706 4322278 4634605 4970143 5352341 5818130
12611 5818130 6418570 7148846 8020139 9126366 10494445 12187405 14173934 16394005 18752348
12602 18752348 21439280 24640099 28490484 33224589 39314623 47706076 59912396 78064533
12594 78064533 104905624 142586717 189030580 235736553 275152470 308257398 340144906
12587 340144906 367723740 378285175 364594104 334985236 302316458 268934640 229413753
$$ packed form
12651A491272K37091K42318J53321o4432k15967j85612j54352j09828n8879k0150
12641A314782k5922j0152K4000M6977L5659M7319M3576N3458R1052R7771O2151
12630A780671P6966P9470N7350J02714J28961J18251J78039J94490J94742K06937
12620C118591K11177K35684K57022K41232K58572L12327L35538L82198M65789
12611E818130O00440P30276Q71293J106227J368079J692960J986529K220071K358343
12602A8752348K686932L200819L850385M734105O090034Q391453J2206320J8152137
12594G8064533K6841091L7681093M6443863M6705973L9415917L3104928L1887508
12587C40144906K7578834J0561435j3691071k9608868l2668778l3381818l9520887
$$ plain form
12580 229413753 183096143 138040716 102552046 78035114 61635615 50346280 42221480
12573 42221480 36150511 31406459 27437943 23975363 20938411 18348663 16147691 14223096
12565 14223096 12556448 11159870 10024674 9054626 8254729 7559066 6924589 6406296 5938367
12556 5938367 5477312 5045430 4684293 4389410 4109716 3887653 3687897 3511193 3399796
12547 3399796 3272238 3154225 3073913 2972790 2883873 2818648 2745373 2669885 2618765 2600174 2530763
12536 2530763 2448719 2389712 2333885 2263117 2166879 2074570 1961544 1845488 1749782 1677411 1595517
12525 1595517 1463347 1379992 1319796 1270481 1239254 1210667 1187054 1178547 1179486 1168451 1128060 1082747
12513 1082747 1043818 1039554 1049803 1037148 1029507 1033278 997540 962823 908364 852173 817825 808690
$$ packed form
12580B29413753m6317610m5055427l5488670k4516932j6399499j1289335q124800
12573D2221480o070969m744052l968516l462580l036952k589748k200972j924595
12565A4223096j666648j396578j135196r70048p99897o95663o34477n18293m67929
12556E938367m61055m31882l61137k94883k79694k22063j99756j76704j11397
12547C399796j27558j18013q0312j01123q8917o5225p3275p5488n1120j8591o9411
12536B530763q2044n9007n5827p0768r6238r2309j13026j16056r5706p2371q1894
12525A595517j32170q3355o0196m9315l1227k8587k3613q507R39j1035m0391m5313
12513A082747l8929m264J0249j2655p641L771l5738l4717n4459n6191l4348r135
$$ plain form
12501 808690 803031 784499 749950 721924 707822 681973 675035 660895 677357 688747 715305 711903
12489 711903 704405 705973 688407 653997 643867 665329 656720 641627 608126 595733 602027 604474
12477 604474 600007 585248 593947 625059 634569 651532 658968 692052 730120 768325 820834 881030
12465 881030 933920 969225 994304 1024204 1047716 1076948 1114341 1152810 1201785 1235679 1242633 1225975
12453 1225975 1183865 1184288 1231158 1293258 1306003 1326195 1344372 1395560 1448396 1415315 1342846 1279958
12441 1279958 1235210 1228722 1245136 1299707 1390159 1525362 1722166 2000569 2400058 2975340
12431 2975340 3899382 5416941 7846489 11608816 16564837 20702959 21004899 17092386
12423 17092386 11928735 7923261 5455840 3979530 3055711 2445001 2004698 1690632 1506049
$$ packed form
12501H08690n659j8532l4549k8026j4102k5849o938j4140J6462J1390K6558l402
12489G11903p498J568j7566l4410j0130K1462q609j5093l3501j2393O294K447
12477F04474m467j4759Q699L1112R510J6963P436L3084L8068L8205N2509O0196
12465H81030N2890L5305K5079K9900K3512K9232L7393L8469M8975L3894O954j6658
12453A225975m2110M23M6870O2100J2745K0192J8177N1188N2836l3081p2469o2888
12441A279958m4748o488J6414N4571R0452J35203J96804K78403L99489N75282
12431B975340R24042J517559K429548L762327M956021M138122L01940l912513
12423A7092386n163651m005474k467421j476310r23819o10710m40303l14066j84583
$$ plain form
12414 1506049 1402581 1336633 1263333 1153185 1002832 860040 756387 682852 643501 613824
12404 613824 597484 579111 523019 466429 413843 388500 382643 381073 376421 393217 377500 359949
12392 359949 350066 348017 338782 330986 311876 326987 330287 311722 297602 273927 262536 262949 244481
12379 244481 209002 207054 182477 181622 156797 181820 192227 197424 213182 229342 240118 245455
12367 245455 230243 223447 203372 175651 172273 153185 148854 150075 137309 128687 136660 180706 211285
12354 211285 168051 127237 115435 122999 168286 188313 174514 137318 104756 99917 142171 168072
12342 168072 168489 159281 162478 173947 199695 187700 175782 196600 209579 209728 207604 228156 208752
12329 208752 196741 197985 197635 175326 157546 133202 93316 108514 127512 141487 129256 99798
$$ packed form
12414A506049j03468o5948p3300j10148j50353j42792j03653p3535l9351k9677
12404F13824j6340j8373n6092n6590n2586k5343n857j570m652J6796j5717j7551
12392C59949r883k049r235p796j9110J5111L300j8565j4120k3675j1391M13j8468
12379B44481l5479j948k4577q55k4825K5023J0407N197J5758J6160J0776N337
12367B45455j5212o796k0075k7721l378j9088m331J221j2766q622P973M4046L0579
12354B11285m3234m0814j1802P564M5287K0027j3799l7196l2562m839M2254K5901
12342A68072M17r208L197J1469K5748j1995j1918K0818J2979J49k124K0552j9404
12329B08752j2011J244l50k2309j7780k4344l9886J5198J8998J3975j2231k9458
$$ plain form
12317 99798 104596 146227 156996 148725 156376 155344 152592 164839 170855 163139 138585 139126 152423
12304 152423 179347 181941 177734 164785 173859 162875 121902 125589 150163 152463 168245 192786
12292 192786 175281 165896 158477 146975 109860 80598 72769 88791 126409 127708 104449 110522
12280 110522 116512 126707 153610 165634 190299 210082 179916 151382 151866 142528 99916 73911
12268 73911 76805 91164 98050 93943 80745 81780 94321 75048 50282 46066 58094 79208 83803
12255 83803 84774 107392 104914 90015 94366 100524 69717 68296 96415 104440 129452 134713 116559
12242 116559 103913 108169 101892 92786 80211 43807 15576 48836 85458 81899 79221 87255 93631
12229 93631 88884 76482 71237 84096 67303 38673 52540 72850 79544 75740 78557 124422 116825
$$ packed form
12317I9798M798M1631J0769q271P651j032k752J2247O016p716k4554N41J3297
12304A52423K6924K594m207j2949R074j0984m0973L687K4574K300J5782K4541
12292A92786j7505r385p419j1502l7115k9262p829J6022L7618J299k3259O073
12280A10522N990J0195K6903J2024K4665J9783l0166k8534M84r338m2612k6005
12268G3911K894J4359O886m107j3198J035J2541j9273k4766m216J2028K1114M595
12255H3803R71K2618k478j4899M351O158l0807j421K8119Q025K5012N261j8154
12242A16559j2646M256o277r106j2575l6404k8231L3260L6622l559k678Q034O376
12229I3631m747j2402n245J2859j6793k8630J3867K0310O694l804K817M5865p597
$$ plain form
12216 116825 109418 101777 69583 60186 66314 84748 105583 96381 69289 69239 71998 71312 46056 56812
12202 56812 43223 41921 39728 66303 79384 88338 96518 108095 151728 167737 174667 137673 108245
12189 108245 98822 114759 134907 150116 178486 180920 210766 277608 337651 404002 453144 464536
12177 464536 463495 451113 437959 429372 407668 361391 352451 363764 362512 387417 425636 477934
12165 477934 561866 665756 829297 1045467 1320175 1568031 1762961 1985406 2147494 2259094
12155 2259094 2295367 2240774 2146069 2093763 2078268 2022732 1892517 1729004 1536126 1340683
12145 1340683 1156641 991548 839759 738031 647762 566436 497387 440939 403303 362550
12135 362550 323821 287581 280129 289270 313223 304588 275453 259543 249643 236484 219168 231403
$$ packed form
12216A16825p407p641l2194r397O128J8434K0835r202k7092n0K759o86k5256J0756
12202E6812j3589j302k193K6575J3081Q954Q180J1577M3633J6009O930l6994k9428
12189A08245r423J5937K0148J5209K8370K434K9846O6842O0043O6351M9142J1392
12177D64536j041j2382j3154q587k1704m6277q940J1313j252K4905L8219N2298
12165D77934Q3932J03890J63541K16170K74708K47856J94930K22445J62088J11600
12155B259094L6273n4593r4705n2306j5495n5536j30215j63513j92878j95443
12145A340683j84042j65093j51789j01728r0269q1326o9049n6448l7636m0753
12135C62550l8729l6240p452R141K3953q635k9135j5910r900j3159j7316J2235
$$ plain form
12123 231403 262005 259028 263798 250957 242116 283068 306705 338743 388436 452988 579168 741238
12111 741238 890325 1057928 1217406 1274224 1175769 1003344 809582 627124 501898 388767
12101 388767 295695 268455 254611 225398 228888 230570 203312 154667 137705 131191 121445 115694
12089 115694 101363 127027 133348 126120 144989 149223 122441 113258 145091 137725 97954 56269
12077 56269 67351 71008 58638 38211 18464 56876 55272 29599 44546 45769 44009 47578 68078
12064 68078 66747 50104 58245 51978 52520 62777 73620 81353 80281 83155 93865 107198 79574
12051 79574 53048 91370 131073 118016 93220 49345 44162 67198 58930 47319 27998 36743
12039 36743 33290 39066 45028 46421 33423 42629 55135 80702 50447 25199 41718 43291 38342
$$ packed form
12123B31403L0602k977M770j2841q841M0952K3637L2038M9693O4552J26180J62070
12111G41238J49087J67603J59478N6818r8455j72425j93762j82458j25226j13131
12101C88767r3072k7240j3844k9213L490J682k7258m8645j6962o514r746n751
12089A15694j4331K5664O321p228J8869M234k6782r183L1833p366l9771m1685
12077E6269J1082L657j2370k0427j9747L8412j604k5673J4947J223j760L569K0500
12064F8078j331j6643Q141o267N42J0257J0843P733j072K874J0710J3333k7624
12051G9574k6526L8322L9703j3057k4796m3875n183K3036q268j1611j9321Q745
12039C6743l453N776N962J393j2998R206J2506K5567l0255k5248J6519J573m949
$$ plain form
12026 38342 30951 22222 41168 40824 22373 34250 39065 16585 26455 35669 36693 32171 26904 30096
12012 30096 20334 24971 50538 78096 70838 51249 35817 48330 66907 89155 110651 83098
12000 83098 63267 72401 72528 47607 49950 48740 76673 74779 67084 46781 39334 48100 56225 64827
11986 64827 50495 52364 62533 48966 36345 20190 48569 57371 69123 44622 36195 23831
11974 23831 8957 4584 20170 34374 391 -7859 43031 56123 29414 34716 45454 31535
11962 31535 30706 53459 85577 104035 127342 168356 175780 164597 118093 60049 32650 25877
11950 25877 26425 39149 44386 46519 24735 19516 36844 66016 58794 40569 47479 52908 50310
11937 50310 46604 45315 35015 12689 2220 -1041 30292 41955 15304 30336 33306 31172 45917
$$ packed form
12026C8342p391q729J8946l44j8451J1877M815k2480R870R214J024m522n267L192
12012C0096r762M637K5567K7558p258j9589j5432J2513J8577K2248K1496k7553
12000H3098j9831R134J27k4921K343j210K7933j894p695k0303p447Q766Q125Q602
11986F4827j4332J869J0169j3567j2621j6155K8379Q802J1752k4501q427j2364
11974B3831j4874m373J5586J4204l3983q250N0890J3092k6709N302J0738j3919
11962C1535q29K2753L2118J8458K3307M1014P424j1183m6504n8044k7399o773
11950B5877N48J2724N237K133k1784n219J7328K9172p222j8225O910N429k598
11937E0310l706j289j0300k2326j0469l261L1333J1663k6651J5032K970k134J4745
$$ plain form
11924 45917 36045 44291 50732 30520 22609 39605 29589 63495 86202 49529 19250 19356 29256
11911 29256 30414 37386 34019 25712 24138 48499 5004 -25575 -31471 13064 32506 24848 13906
11898 13906 4903 26230 9162 -7723 -2882 1109 -619 15897 34865 40138 12866 4313 4085
11885 4085 -5858 18005 2145 9024 12271 21787 14790 18110 17218 21943 7899 20801 44589 50088
11871 50088 74565 60603 58560 50198 14815 -1191 -1267 18281 36304 30007 29151 18077 5386
11858 5386 14296 8734 19064 4934 18322 52948 65597 42987 56018 43824 32835 46410
11846 46410 95583 105405 85689 64480 62784 58498 38411 24016 28281 41332 39533 49323 54110
11833 54110 57831 56146 61499 58621 42174 31031 38931 18214 25293 41261 31912 18470 17964
$$ packed form
11924D5917r872Q246O441k0212p911J6996j0016L3906K2707l6673l0279J06R900
11911B9256J158O972l367q307j574K4361m3495l0579n896M4535J9442p658j0942
11898A3906r003K1327j7068j6885M841L991j728J6516J8968N273k7272q553k28
11885D085r943K3863j5860O879L247R516o997L320q92M725j4044J2902K3788N499
11871E0088K4477j3962k043q362l5383j6006p6J9548J8023o297q56j1074j2691
11858E386Q910n562J0330j4130J3388L4626J2649k2610J3031j2194j0989J3575
11846D6410M9173R822j9716k1209j696m286k0087j4395M265J3051j799R790M787
11833E4110L721j685N353k878j6447j1143P900k0717P079J5968r349j3442n06
$$ plain form
11820 17964 19255 21022 17594 16133 27355 20426 33325 35197 23584 47507 54913 34414 40440
11807 40440 24701 1958 1961 29430 49118 39091 26545 27134 10079 11741 6321 -24023 3152
11794 3152 5435 14114 8305 -4107 7110 12549 41153 57215 40189 36844 59908 44425 52947
11781 52947 53463 75162 75184 74097 112792 115128 125040 130134 116005 123395 133760 140039 180825 207737
11767 207737 246876 285736 318565 321063 301789 236121 193134 209635 174677 141631 149936 154933
11755 154933 125576 123136 130791 117377 143014 169322 188572 222919 284163 304052 313642 292437
11743 292437 258894 221375 179492 157592 130310 84283 79311 77464 80393 51288 30828 24471
11731 24471 -3925 84 18536 41105 73661 89118 86962 78130 95484 77714 64766 69918
$$ packed form
11820A7964J291J767l428j461J1222o929J2899J872j1613K3923P406k0499O026
11807D0440j5739k2743LK7469J9688j0027j2546N89j7055J662n420l0344K7175
11794C152K283Q679n809j2412J1217N439K8604J6062j7026l345K3064j5483Q522
11781E2947N16K1699K2j087L8695K336R912N094j4129P390J0365O279M0786K6912
11767B07737L9139L8860L2829K498j9274o5668m2987J6501l4958l3046Q305M997
11755A54933k9357k440P655j3414K5637K6308J9250L4347O1244J9889R590k1205
11743B92437l3543l7519m1883k1900k7282m6027m972j847K929k9105k0460o357
11731B4471k8396M009J8452K2569L2556J5457k156q832J7354j7770j2948N152
$$ plain form
11719 69918 63826 41698 30929 22171 2345 1859 -11114 15561 48110 81282 84910 48792 38151
11706 38151 61907 92702 104207 111812 104738 86510 77750 84541 120151 159499 208847 242284
11694 242284 296281 346393 405957 406075 384553 353991 330240 318957 327321 308992 298388 304802
11682 304802 350421 361817 375777 409962 395939 389643 424706 488089 517554 514571 500072 465264
11670 465264 425611 386419 364902 331566 315795 304443 307704 337423 314898 275223 247067 243400
11658 243400 188920 135207 161193 176085 148551 143727 113630 111694 127740 98845 68945 54429
11646 54429 41591 54232 48089 58748 90133 94163 94854 67235 30005 31833 42418 49081 46796
11633 46796 47834 58697 50807 38550 32979 29450 28074 28620 14935 14557 48832 61195 75527
$$ packed form
11719F9918o092k2128j0769q758j9826m86j2973K6675L2549L3172L628l6118j0641
11706C8151K3756L0795J1505P605p074j8228q760O791L5610L9348M9348L3437
11694B42284N3997N0112N9564J18k1522l0562k3751j1283Q364j8329j0604O414
11682C04802M5619J1396J3960L4185j4023o296L5063O3383K9465k983j4499l4808
11670D65264l9653l9192k1517l3336j5771j1352L261K9719k2525l9675k8156l667
11658B43400n4480n3713K5986J4892k7534m824l0097j936J6046k8895k9900j4516
11646E4429j2838J2641o143J0659L1385M030O91k7619l7230J828J0585O663k285
11633D6796J038J0863p890j2257n571l529j376N46j3685l78L4275J2363J4332
$$ plain form
11620 75527 103525 127970 153910 164598 180771 197621 225799 237517 254714 278236 318215 330139
11608 330139 323837 309094 263130 221081 180133 169654 160336 157193 186205 192242 181100 208233
11596 208233 201156 192951 216025 251835 264380 281971 279013 272282 252944 251812 218909 189894
11584 189894 182631 174606 150505 133587 124776 146592 130751 107224 87530 106690 105376 88583
11572 88583 57664 52605 50816 34433 48643 52198 75790 73634 73840 91112 107984 125514 119857
11559 119857 123523 101146 90717 53658 27059 35709 50825 73003 87674 79584 71243 62339
11547 62339 62245 51809 40946 61586 76306 68334 38714 24668 51086 43264 30469 56968 80768
11534 80768 90382 88134 109123 112271 108728 117754 128676 95379 76179 77790 110260 128626 131760
$$ packed form
11620G5527K7998K4445K5940J0688J6173J6850K8178J1718J7197K3522L9979J1924
11608C30139o302j4743m5964m2049m0948j0479r318l143K9012O037j1142K7133
11596B08233p077q205K3074L5810J2545J7591k958o731j9338j132l2903k9015
11584A89894p263q025k4101j6918q811K1816j5841k3527j9694J9160j314j6793
11572H8583l0919n059j789j6383J4210L555K3592k156K06J7272J6872J7530n657
11559A19857L666k2377j0429l7059k6599Q650J5116K2178J4671q090q341q904
11547F2339r4j0436j0863K0640J4720p972k9620j4046K6418p822j2795K6499K3800
11534H0768R614k248K0989L148l543R026J0922l3297j9200J611L2470J8366L134
$$ plain form
11521 131760 131419 110109 84322 67357 89419 96503 97141 94701 100612 116669 137203 141965 160212
11508 160212 186783 173408 149390 159177 129538 84820 77686 108195 148484 127624 99577 130588
11496 130588 165728 147061 132641 157147 184793 185812 188617 182764 134559 116775 121805 130610
11484 130610 135924 141338 145423 165833 137798 148180 131829 140795 154304 142069 128890 138631
11472 138631 141243 135680 123902 129030 126450 115017 107229 123947 140475 158452 145663 128967
11460 128967 99472 106295 151567 143026 153986 170378 188183 201926 213204 203635 238145 212133
11448 212133 170331 139106 142296 168945 180911 191361 198618 216581 214812 184215 171675 193096
11436 193096 221592 207483 205728 204182 202235 200664 192196 219629 207913 203686 222104 225236 218382
$$ packed form
11521A31760l41k1310k5787j6965K2062P084O38k440N911J6057K0534M762J8247
11508A60212K6571j3375k4018R787k9639m4718p134L0509M0289k0860k8047L1011
11496A30588L5140j8667j4420K4506K7646J019K805n853m8205j7784N030Q805
11484A30610N314N414M085K0410k8035J0382j6351Q966J3509j2235j3179R741
11472A38631K612n563j1778N128k580j1433p788J6718J6528J7977j2789j6696
11460A28967k9495O823M5272q541J0960J6392J7805J3743J1278r569L4510k6012
11448B12133m1802l1225L190K6649J1966J0450P257J7963j769l0597j2540K1421
11436A93096K8496j4109j755j546j947j571q468K7433j1716m227J8418L132o854
$$ plain form
11423 218382 215143 259352 252346 253004 291496 307985 308040 294984 291649 269818 265035 302372 319102
11410 319102 296446 289859 288796 297504 346440 336884 362123 405576 446210 443087 422027 417800 436934
11397 436934 446426 426859 438454 450823 467040 491126 495608 505563 532296 561055 579825 620323
11385 620323 635540 641197 649076 686836 714683 726365 772209 826639 847384 893143 942745 1010238
11373 1010238 1088300 1150851 1203426 1283856 1361388 1435170 1491136 1582278 1711218 1891320 2106447
11362 2106447 2305810 2523196 2821167 3204655 3674760 4286415 4980789 5837898 6989116
11353 6989116 8420614 10171588 12280210 14783835 17788963 21429794 25963739 31484054
11345 31484054 37609019 43221684 46699238 47088574 44706449 40757015 36414662 32300180
$$ packed form
11423B18382l239M4209p006O58L8492J6489N5j3056l335k1831m783L7337J6730
11410C19102k2656o587j063Q708M8936r556K5239M3453M0634l123k1060m227J9134
11397D36934R492j9567J1595J2369J6217K4086M482R955K6733K8759J8770M0498
11385F20323J5217N657P879L7760K7847J1682M5844N4430K0745M5759M9602O7493
11373A010238P8062O2551N2575Q0430P7532P3782N5966R1142J28940J80102K15127
11362B106447J99363K17386K97971L83488M70105O11655O94374Q57109J151218
11353F989116J431498J750974K108622K503625L005128L640831M533945N520315
11345C1484054O124965N612665L477554L89336k382125l949434m342353m114482
$$ plain form
11337 32300180 28663522 25685541 23554899 22345045 22079632 22833662 24574604 27254116
11329 27254116 30832437 35052162 39546245 43837960 47166486 48553152 47304487 43671003
11321 43671003 38757649 33774236 29326590 25519019 22207430 19213375 16483061 14019274
11313 14019274 11909308 10172170 8746664 7658463 6840679 6186073 5669651 5269197 4924741
11304 4924741 4658514 4500716 4406269 4368482 4346987 4373258 4401038 4473172 4554264 4561675 4542318
11293 4542318 4515029 4519937 4623068 4802630 5046721 5385256 5779464 6254575 6865511 7617455
11283 7617455 8607746 9872056 11470248 13457370 15828099 18577773 21773718 25568271
11275 25568271 30153438 35670192 42113427 48743102 54195268 57260863 57853564 57015378
$$ packed form
11337C2300180l636658k977981k130642j209854k65413P54030J740942K679512
11329B7254116L578321M219725M494083M291715L328526J386666j248665l633484
11321D3671003m913354m983413m447646l807571l311589k994055k730314k463787
11313A4019274k109966j737138j425506j088201q17784o54606n16422m00454l44456
11304D924741k66227j57798r4447l7787k1495K6271K7780P2134Q1092P411j9357
11293D542318k7289M908J03131J79562K44091L38535L94208M75111O10936P51944
11283G617455R90291J264310J598192J987122K370729K749674L195945L794553
11275B5568271M585167N516754O443235O629675N452166L065595N92701q38186
$$ plain form
11267 57015378 55695640 54458688 53584462 53499265 54814029 57839394 62192924 66634565
11259 66634565 69740983 70895390 70753381 70505192 70907992 72180455 73918236 75017181
11251 75017181 74120514 70626481 65474257 60304115 56427323 54278321 53518829 53576797 54015243
11242 54015243 54412125 54214302 52642693 49212229 44122375 38402297 32932125 28197016
11234 28197016 24263142 20912377 18038511 15522380 13408891 11684074 10307371 9179502
11226 9179502 8272135 7552497 6941822 6445624 6048099 5750117 5476695 5237713 5076965
11217 5076965 4988326 4931653 4859817 4739363 4618089 4524605 4439542 4374782 4339164 4358956 4477645
11206 4477645 4661119 4876542 5140373 5514032 5958838 6567778 7377862 8432832 9837226
$$ packed form
11267E7015378j319738j236952q74226q5197J314764L025365M353530M441641
11259F6634565L106418J154407j42009k48189M02800J272463J737781J098945
11251G5017181q96667l494033n152224n170142l876792k149002p59492N7968M38446
11242E4015243L96882j97823j571609l430464n089854n720078n470172m735109
11234B8197016l933874l350765k873866k516131k113489j724817j376703j127869
11226I179502r07367p19638o10675m96198l97525k97982k73422k38982j60748
11217E076965q8639n6673p1836j20454j21274r3484q5063o4760l5618J9792J18689
11206D477645J83474K15423K63831L73659M44806O08940Q10084J054970J404394
$$ plain form
11197 9837226 11608544 13707236 16139754 18811143 21755127 25051900 28918394 33588368
11189 33588368 38924421 44147267 47741167 48453661 46382943 42595491 38173715 33766742
11181 33766742 29708472 26332444 23888547 22471078 22136759 22841576 24503979 27070346
11173 27070346 30381441 34251528 38455685 42787127 46584311 48551900 47507641 43439688
11165 43439688 37576243 31463420 26168416 21865836 18446111 15683327 13382646 11395107
11157 11395107 9695440 8283981 7095323 6131481 5396441 4805860 4331199 3953644 3632581
11148 3632581 3400554 3238893 3095620 2932718 2793492 2630194 2496203 2372899 2234710
11139 2234710 2098062 2010642 1951535 1888472 1799149 1725765 1677043 1626569 1566131 1518226 1490162
$$ packed form
11197I837226J771318K098692K432518K671389K943984L296773L866494M669974
11189C3588368N336053N222846L593900P12494k070718l787452m421776m406973
11181C3766742m058270l376028k443897j417469l34319P04817J662403K566367
11173B7070346L311095L870087M204157M331442L797184J967589j044259m067953
11165D3439688n863445o112823n295004m302580l419725k762784k300681j987539
11157A1395107j699667j411459j188658r63842p35040n90581m74661l77555l21063
11148C632581k32027j61661j43273j62902j39226j63298j33991j23304j38189
11139B234710j36648q7420n9107o3063q9323p3384m8722n0474o0438m7905k8064
$$ plain form
11128 1490162 1459590 1423164 1340705 1270101 1214868 1163970 1120883 1061750 1015504 968233 930693
11117 930693 933379 899224 870366 846026 808880 767085 738113 721441 696073 659843 640320 634362
11105 634362 607068 603855 576604 584313 578841 554582 580487 592220 591231 586569 559442 524580 520365
11092 520365 516361 494490 514449 515458 496169 497022 485983 511229 495229 473742 479986 482986 520899
11079 520899 546605 537949 553840 590505 628102 660129 679647 711485 764744 839722 889692 908794
11067 908794 911535 920907 943911 947310 968896 944659 886139 869042 826267 784262 774835 786039
11055 786039 806956 829399 843524 857044 864537 849480 851666 862735 873817 873692 824766 790615
11043 790615 755694 702142 613282 552303 513707 459297 411534 389190 366302 358851 326443 306383
$$ packed form
11128A490162l0572l6426q2459p0604n5233n0898m3087n9133m6246m7271l7540
11117I30693K686l4155k8858k4340l7146m1795k8972j6672k5368l6230j9523n958
11105F34362k7294l213k7251P709n472k4259K5905J1733r89m662k7127l4862m215
11092E20365m004k1871J9959J009j9289Q53j1039K5246j6000k1487O244L000L7913
11079E20899K5706q656J5891L6665L7597L2027J9518L1838N3259P4978M9970J9102
11067I08794K741R372K3004L399K1586k4237n8520j7097m2775m2005r427J1204
11055G86039K0917K2443J4125J3520P493j5057K186J1069J1082j25m8926l4151
11043G90615l4921n3552q8860o0979l8596n4410m7763k2344k2888p451l2408k0060
$$ plain form
11031 306383 301547 307820 324041 316915 297468 308666 316675 306864 310094 291242 309806 339345 353632
11018 353632 345940 334000 318109 312071 301067 300237 307653 308496 286281 289961 285205 272299 290385
11005 290385 302448 296479 329782 341951 335526 354231 341705 347976 371071 351772 360063 356017
10993 356017 362538 361297 368300 389228 419785 457426 475312 470857 472820 468172 479668 479742 468807
10980 468807 454483 486991 516588 557934 605719 633503 640822 614542 580047 553458 539140 513399
10968 513399 494831 496766 489812 447073 390437 343970 327314 321205 309780 312264 299872 272655
10956 272655 247133 231522 245133 246393 245452 246377 268090 313911 329420 331126 280482 232769 229273
10943 229273 235756 231833 217486 223646 226500 248153 278670 273202 264983 236134 235579 236986 266915
$$ packed form
11031C06383m836O273J6221p126j9447J1198Q009r811L230j8852J8564K9539J4287
11018C53632p692j1940j5891o038j1004q30P416Q43k2215L680m756j2906J8086
11005B90385J2063n969L3303J2169o425J8705j2526O271K3095j9299Q291m046
10993C56017O521j241P003K0928L0557L7641J7886m455J963m648J1496P4j0935
10980D68807j4324L2508K9597M1346M7785K7784P319k6280l4495k6589j4318k5741
10968E13399j8568J935o954m2739n6636m6467j6656o109j1425K484j2392k7217
10956B72655k5522j5611J3611J260r41R25K1713M5821J5509J706n0644m7713l496
10943B29273O483l923j4347O160K854K1653L0517n468q219k8849n55J407K9929
$$ plain form
10930 266915 272705 251884 252217 248068 224622 192367 215621 227706 211211 201857 203687 237545 262197
10917 262197 286445 287581 335886 400542 408164 425876 397522 361353 353684 368734 404776 417977
10905 417977 421551 429373 410012 402170 380123 388194 412116 419444 404606 391562 421009 411804 386658
10892 386658 350126 337753 306289 249444 196948 181842 193431 225381 251257 235759 209454
10881 209454 221381 240414 267326 261974 245640 250272 252286 222082 195501 185021 164091 163092
10869 163092 164382 170401 177002 141519 150299 133205 117805 128229 158678 173375 161437 145882
10857 145882 124189 151710 143643 157272 174172 177331 205657 231376 236901 232850 268093 306011
10845 306011 333030 358381 377545 412855 448903 477644 466134 448514 409211 381512 394356
$$ packed form
10930B66915N790k0821L33m149k3446l2255K3254J2085j6495r354J830L3858K4652
10917B62197K4248J136M8305O4656P622J7712k8354l6169p669J5050L6042J3201
10905D17977L574P822j9361p842k2047Q071K3922P328j4838j3044K9447r205k5146
10892C86658l6532j2373l1464n6845n2496j5106J1589L1950K5876j5498k6305
10881B09454J1927J9033K6912n352j6334M632K014l0204k6581j0480k0930r99
10869A63092J290O019O601l5483Q780j7094j5400J0424L0449J4697j1938j5555
10857A45882k1693K7521q067J3629J6900L159K8326K5719N525m051L5243L7918
10845C06011K7019K5351J9164L5310L6048K8741j1510j7620l9303k7699J2844
$$ plain form
10834 394356 410419 433817 448055 448227 472723 460661 477884 489754 465410 476042 491254 514793
10822 514793 510679 473258 441511 404163 369220 343269 346539 368543 424674 460182 466955 472042
10810 472042 448031 428959 373450 326964 286559 258433 242809 234170 205652 185154 158525 148851
10798 148851 163141 152383 137372 144537 186987 220849 194560 154587 148778 143612 153114 157046
10786 157046 159757 154179 140242 137773 117486 104637 117710 138801 150847 137994 147994 172777
10774 172777 138988 129780 131111 127302 114337 103040 94896 111119 119480 115015 121281 153892 220514
10761 220514 286484 324627 375430 423865 443436 389428 353617 328410 296119 269299 255792
10750 255792 238780 262011 248552 222584 227764 258565 254329 281444 286870 309877 327782 352182
$$ packed form
10834C94356J6063K3398J4238J72K4496j2062J7223J1870k4344J0632J5212K3539
10822E14793m114l7421l1747l7348l4943k5951L270K2004N6131L5508O773N087
10810D72042k4011j9072n5509m6486m0405k8126j5624q639k8518k0498k6629r674
10798A48851J4290j0758j5011P165M2450L3862k6289l9973n809n166R502L932
10786A57046K711n578j3937k469k0287j2849J3073K1091J2046j2853J0000K4783
10774A72777l3789r208J331l809j2965j1297q144J6223Q361m465O266L2611O6622
10761B20514O5970L8143N0803M8435J9571n4008l5811k5207l2291k6820j3507
10750B55792j7012K3231j3459k5968N180L0801m236K7115N426K3007J7905K4400
$$ plain form
10738 352182 360564 331447 340528 330916 285558 261081 252138 230297 184625 196565 198491 185064
10726 185064 186382 185538 153601 121962 123508 142132 142871 157165 177479 199833 211847 236827 245139
10713 245139 224866 268920 295561 316477 336810 355877 373047 393423 443741 511245 542450
10702 542450 533730 513660 494393 461954 438651 431979 440190 448770 476455 490682 506614 558738
10690 558738 597624 651568 718544 777417 841566 918090 1012450 1193357 1391298 1579683 1794921
10679 1794921 2090576 2421381 2786807 3253808 3831962 4649981 5731284 7042037 8504340
10670 8504340 9832631 10705362 10934909 10434106 9418598 8170475 6910023 5867486 5078286
10661 5078286 4470612 4036678 3835642 3813271 3885378 3982823 4194647 4495952 4941565 5573496
$$ packed form
10738C52182Q382k9117R081r612m5358k4477q943k1841m5672J1940J926j3427
10726A85064J318q44l1937l1639J546J8624P39J4294K0314K2354J2014K4980Q312
10713B45139k0273M4054K6641K0916K0333J9067J7170K0376N0318O7504L1205
10702E42450q720k0070j9267l2439k3303o672Q211Q580K7685J4227J5932N2124
10690E58738L8886N3944O6976N8873O4149P6524R4360J80907J97941J88385K15238
10679A794921K95655L30805L65426M67001N78154Q18019J081303J310753J462303
10670H504340J328291Q72731K29547n00803j015508j248123j260452j042537p89200
10661E078286o07674m33934k01036k2371P2107R7445K11824L01305M45613O31931
$$ plain form
10651 5573496 6436614 7602421 9300855 11557188 14351370 17491846 20445049 22549830
10643 22549830 23225056 22259869 19974755 16994925 13983150 11385212 9350992 7880696
10635 7880696 6872281 6181273 5685946 5289989 5006654 4815016 4716845 4693208 4822698 5144036
10625 5144036 5661261 6455500 7567571 9006753 10698347 12377144 13700288 14302770 14006324
10616 14006324 12911870 11318986 9694702 8369400 7470627 6977323 6789203 6850150 7120020
10607 7120020 7586282 8301066 9348736 10851651 12932665 15666033 18966678 22378955
10599 22378955 25142084 26387122 25777368 23549840 20453154 17241391 14413551 12192477
10591 12192477 10551447 9456822 8790056 8433721 8338587 8481017 8876129 9464881 10301630
$$ packed form
10651E573496Q63118J165807J698434K256333K794182L140476K953203K104781
10643B2549830O75226r65187k285114k979830l011775k597938k034220j470296
10635G880696j008415o91008m95327l95957k83335j91638r8171k3637J29490L21338
10625E144036N17225P94239J112071J439182J691594J678797J323144O02482k96446
10616A4006324j094454j592884j624284j325302q98773m93304j88120O0947K69870
10607G120020M66262P14784J047670J502915K081014K733368L300645L412277
10599B2378955K763129J245038o09754k227528l096686l211763k827840k221074
10591A2192477j641030j094625o66766l56335r5134J42430L95112N88752Q36749
$$ plain form
10582 10301630 11464371 13120720 15464294 18794521 23420093 29432705 36561929 43907688
10574 43907688 49884931 52851444 51899025 47314065 40489145 33117507 26473092 21178799
10566 21178799 17284516 14529015 12618605 11276171 10345540 9712533 9302609 9062785 9063945
10557 9063945 9317191 9878281 10847192 12302727 14327170 16999978 20189026 23536353 26437667
10548 26437667 28114317 28024552 26172397 23066962 19521770 16173795 13374541 11215422
10540 11215422 9675463 8612429 7895421 7487719 7327404 7420301 7857418 8689362 10031620
10531 10031620 11880671 13971177 15904795 17123538 17156256 15985010 13973170 11724718
10523 11724718 9644810 8009033 6846024 6061265 5531434 5237680 5146578 5188163 5321707
$$ packed form
10582A0301630J162741J656349K343574L330227M625572O012612P129224P345759
10574D3907688N977243K966513r52419m584960o824920p371638o644415n294293
10566B1178799l894283k755501j910410j342434r30631o33007m09924k39824J160
10557I063945K53246N61090R68911J455535K024443K672808L189048L347327K901314
10548B6437667J676650q9765j852155l105435l545192l347975k799254k159119
10540A1215422j539959j063034p17008m07702j60315R2897M37117Q31944J342258
10531A0031620J849051K090506J933618J218743L2718j171246k011840k248452
10523A1724718k079908j635777j163009p84759n29831k93754r1102M1585J33544
$$ plain form
10514 5321707 5569790 5952642 6531471 7347238 8482315 10091584 12363577 15451480 19295060
10505 19295060 23527791 27436596 30016033 30459086 28632486 25060490 20752933 16578054
10497 16578054 13094530 10505791 8624343 7292930 6394814 5761798 5325454 5038507 4915303
10488 4915303 4894974 4984906 5202168 5594476 6257837 7264710 8655533 10393270 12316481
10479 12316481 14081824 15297500 15610420 14858288 13250948 11189991 9089096 7257251
10471 7257251 5794862 4673031 3848601 3241180 2781476 2462422 2186768 1953505 1758405
10462 1758405 1575622 1413885 1277921 1182257 1108405 1051178 1004350 957619 916015 871442 812524
10451 812524 760537 728996 705567 651267 609730 575671 564034 550549 497002 459661 463983 434657
$$ packed form
10514E321707K48083L82852N78829Q15767J135077J609269K271993L087903L843580
10505A9295060M232731L908805K579437M43053j826600l571996m307557m174879
10497A6578054l483524k588739j881448j331413q98116o33016m36344k86947j23204
10488D915303k0329Q9932K17262L92308O63361J006873J390823J737737J923211
10479A2316481J765343J215676L12920p52132j607340k060957k100895j831845
10471G257251j462389j121831q24430o07421m59704l19054k75654k33263j95100
10462A758405j82783j61737j35964r5664p3852n7227m6828m6731m1604m4573n8918
10451H12524n1987l1541k3429n4300m1537l4059j1637j3485n3547l7341M322k9326
$$ plain form
10439 434657 414822 404602 387819 407121 412559 398605 366122 329116 323121 365405 396245 385230
10427 385230 351993 313530 278477 270890 260108 272512 273210 250532 234689 216317 234180 238753
10415 238753 225898 204829 208840 195018 191960 219385 233387 244209 203158 189214 174890 175126
10403 175126 173660 188604 196729 197557 198587 181479 177988 167888 155480 155472 164866 146485 136703 150760
10389 150760 159827 173168 189118 198078 241193 252596 239788 249667 222558 200858 187258 201922
10377 201922 210996 208614 200214 161905 127929 156594 188873 159705 168806 169620 152538 141376 130593
10364 130593 136636 149966 168301 180547 157801 156636 142485 140442 164982 180726 187846 164957
10352 164957 134432 133388 149276 151104 146511 168813 164633 143883 137635 112670 107714 123428 152674
$$ packed form
10439D34657j9835j0220j6783J9302N438j3954l2483l7006n995M2284L0840j1015
10427C85230l3237l8463l5053p587j0782J2404O98k2678j5843j8372J7863M573
10415B38753j2855k1069M011j3822l058K7425J4002J0822m1051j3944j4324K36
10403A75126j466J4944Q125Q28J030j7108l491j0100j2408qR394j8381r782J4057
10389A50760R067J3341J5950Q960M3115J1403j2808R879k7109k1700j3600J4664
10377B01922R074k382q400l8309l3976K8665L2279k9168R101Q14j7082j1162j0783
10364A30593O043J3330J8335J2246k2746j165j4151k043K4540J5744P120k2889
10352A64957l0525j044J5888J828m593K2302m180k0750o248k4965m956J5714K9246
$$ plain form
10339 152674 164076 128152 114291 117729 108322 100488 84741 55877 70522 77103 60556 89632
10327 89632 119625 133378 113368 109829 109093 109565 127997 115653 116003 102191 118606 159624 169577
10314 169577 184466 167776 152168 138082 143312 151551 144421 114514 86908 95979 105849 106218 90785
10301 90785 106341 132735 130336 103418 69534 45206 84945 106475 99614 65272 77930 97229
10289 97229 85899 93574 86475 82695 70447 56854 52635 85242 78983 78714 77895 66742 59156 63952
10275 63952 36362 27836 13780 43407 54441 83318 111896 113338 104579 93757 122731 149533
10263 149533 132929 122888 161280 205798 215746 190702 163160 134881 118426 104887 106459 105288
10251 105288 87611 42241 30281 72050 110107 135035 122992 100144 80955 76629 86587 112619
$$ packed form
10339A52674J1402l5924j3861L438r407p834j5747k8864J4645O581j6547K9076
10327H9632K9993J3753k0010l539p36M72J8432j2344L50j3812J6415M1018R953
10314A69577J4889j6690j5608j4086N230Q239p130k9907k7606R071R870L69j5433
10301I0785J5556K6394k399k6918l3884k4328L9739K1530o861l4342J2658J9299
10289I7229j1330P675p099l780j2248j3593m219L2607o259k69q19j1153p586M796
10275F3952k7590q526j4056K9627J1034K8877K8578J442q759j0822K8974K6802
10263A49533j6604j0041L8392M4518R948k5044k7542k8279j6455j3539J572j171
10251A05288j7677m5370j1960M1769L8057K4928j2043k2848j9189m326R958K6032
$$ plain form
10239 112619 147836 178181 194446 179426 168765 166406 180431 150385 130745 133447 141933 164772
10227 164772 186966 170306 149731 176769 197914 184936 186366 178968 213136 237513 227128 227058
10215 227058 267663 273471 271604 237283 227697 243092 219218 210604 229998 246210 259503 250581
10203 250581 221900 224171 268785 303135 282947 248864 264668 298286 310338 313306 314945 359604
10191 359604 406941 420478 426089 412243 376416 371546 329806 288880 288486 285049 264709 266684 303846
10178 303846 335853 323316 331507 333419 318489 334099 340370 369970 423464 449654 492519 512823
10166 512823 485841 442251 423558 379070 352623 334976 337791 316537 288861 258513 254278 245576
10154 245576 243743 229779 217384 225398 243481 255661 272572 297665 318963 342691 382651 429297
$$ packed form
10239A12619L5217L0345J6265j5020j0661k359J4025l0046j9640K702Q486K2839
10227A64772K2194j6660k0575K7038K1145j2978J430p398L4168K4377j0385p0
10215B27058M0605N808j867l4321r586J5395k3874q614J9394J6212J3293q922
10203B50581k8681K271M4614L4350k0188l4083J5804L3618J2052K968J639M4659
10191C59604M7337J3537N611j3846l5827m870m1740m0926l94l437k0340J975L7162
10178C03846L2007j2537Q191J912j4930J5610O271K9600N3494K6190M2865K0304
10166E12823k6982m3590j8693m4488k6447j7647K815k1254k7676l0348m235q702
10154B45576j833j3964j2395Q014J8083J2180J6911K5093K1298K3728L9960M6646
$$ plain form
10142 429297 466503 499767 511349 496573 445126 404582 364434 336671 327108 309920 299512 303154
10130 303154 308651 301182 304339 282001 280586 298812 279617 286188 316971 355246 377409 399610
10118 399610 389223 369365 374342 369152 361333 382893 375947 371206 359641 388593 397265 412968 437080
10105 437080 427878 413727 392447 408642 411573 400699 413426 460902 499632 514067 503986 485862
10093 485862 502120 477992 450302 433857 438988 425685 418185 394849 357671 337299 347621 371032
10081 371032 380480 358402 345018 331538 329145 294450 279284 274278 259315 250398 277550 292102
10069 292102 290686 255241 236120 245006 249288 245006 230141 206375 189097 204118 196275 187680 162465
10056 162465 155487 142257 127037 136057 150985 154528 143264 133069 140657 128734 142124 125050
$$ packed form
10142D29297L7206L3264J1582j4776n1447m0544m0148k7763r563j7188j0408L642
10130C03154N497p469L157k2338j415J8226j9195O571L0783L8275K2163K2201
10118C99610j0387j9858M977n190p819K1560o946m741j1565K8952Q672J5703K4112
10105D37080r202j4151k1280J6195K931j0874J2727M7476L8730J4435j0081j8124
10093D85862J6258k4128k7690j6445N131j3303p500k3336l7178k0372J0322K3411
10081C71032R448k2078j3384j3480k393l4695j5166n006j4963q917K7152J4552
10069B92102j416l5445j9121Q886M282m282j4865k3766j7278J5021p843q595k5215
10056A62465o978j3230j5220R020J4928L543j1264j0195P588j1923J3390j7074
$$ plain form
10044 125050 108262 91324 85483 102121 124385 157766 168307 134177 119311 105027 138521 186116
10032 186116 186888 174116 166927 132931 118572 138414 157032 146020 96334 79944 102623 140262
10020 140262 136868 122797 144297 161875 181714 210164 204403 204588 206364 216114 238283 240030 205935
10007 205935 151856 132979 143751 149474 155313 159614 153370 116857 121751 113150 90722 107141 115606
9994 115606 119146 100482 84541 88114 71890 65508 82959 100389 110636 112770 119727 82694 94662
9981 94662 115484 125577 106421 96171 100437 123014 133488 143744 163745 167079 180910 180866 175588
9968 175588 172032 153898 135379 138306 168720 169458 153476 158243 195449 203772 225088 209690 193593
9955 193593 166219 185761 184370 174456 168927 165308 170929 204960 205242 183374 193537 207870 217219
$$ packed form
10044A25050j6788j6938n841J6638K2264L3381J0541l4130j4866j4284L3494M7595
10032A86116P72j2772p189l3996j4359J9842J8618j1012m9686j6390K2679L7639
10020A40262l394j4071K1500J7578J9839K8450n761J85J776R750K2169J747l4095
10007B05935n4079j8877J0772N723N839M301o244l6513M894q601k2428J6419Q465
9994A15606L540j8664j5941L573j6224o382J7451J7430J0247K134O957l7033J1968
9981I4662K0822J0093j9156j0250M266K2577J0474J0256K0001L334J3831m4n278
9968A75588l556j8134j8519K927L0414P38j5982M767L7206Q323K1316j5398j6097
9955A93593k7374J9542j391r914n529l619N621L4031K82k1868J0163J4333R349
$$ plain form
9942 217219 207975 210488 220680 208218 205802 213977 213512 228031 237559 242943 253871 240630 216682
9929 216682 221026 224103 217362 251483 291767 277898 251274 237609 244678 289333 327939 345325
9917 345325 344923 369801 352351 339831 354009 381634 388768 400904 394557 376609 379471 371419 394422
9904 394422 390923 382765 395040 406147 437106 474754 513850 537416 539894 480430 460780 426393
9892 426393 386930 363897 355399 340936 345964 360962 334629 307735 315027 297648 274313 308178
9880 308178 321590 307189 341227 366218 367189 392953 411250 455024 510355 563058 577987 570329
9868 570329 583590 578492 557329 519311 489153 470837 464389 467033 454325 451877 487800 478795 508453
9855 508453 518278 533356 548306 564411 564373 559722 590268 619310 631174 633280 674496 696066 719432
$$ packed form
9942B17219r244K513J0192j2462k416Q175m65J4519R528N384J0928j3241k3948
9929B16682M344L077o741L4121M0284j3869k6624j3665P069M4655L8606J7386
9917C45325m02K4878j7450j2520J4178K7625P134J2136o347j7948K862q052K3003
9904C94422l499q158J2275J1107L0959L7648L9096K3566K478n9464j9650l4387
9892D26393l9463k3033q498j4463N028J4998k6333k6894P292j7379k3335L3865
9880C08178J3412j4401L4038K4991R71K5764J8297M3774N5331N2703J4929p658
9868E70329J3261n098k1163l8018l0158j8316o448K644j2708k448L5923r005K9658
9855E08453R825J5078J4950J6105l8m651L0546K9042J1864K106M1216K1570K3366
$$ plain form
9842 719432 760793 800101 838816 887373 966372 1006046 1057156 1139291 1216183 1297476 1384068 1494362
9830 1494362 1592684 1759506 1964585 2188677 2454424 2736666 3056066 3402493 3821532 4342810
9820 4342810 5034500 5879836 6871561 7973533 9107006 10168379 11060186 11714643 12247016
9811 12247016 12729001 13205839 13688394 14186354 14700334 15266341 15791726 16083912 16103681 15961856
9801 15961856 15866854 16088621 16723770 17831007 19452731 21529682 23904179 26371315 28810927
9792 28810927 31170413 33265438 34924486 36093394 36751184 37082772 37232299 37233499 37006361
9783 37006361 36443355 35608377 34680739 33636362 32426360 31100276 29811673 28880730 28607985
9774 28607985 29121484 30264088 31773958 33358489 34756921 35866856 36803484 37550982 37985874
$$ packed form
9842G19432M1361L9308L8715M8557P8999L9674N1110Q2135P6892Q1293Q6592J10294
9830A494362R8322J66822K05079K24092K65747K82242L19400L46427M19039N21278
9820D342810O91690Q45336R91725J101972J133473J061373Q91807O54457N32373
9811A2247016M81985M76838M82555M97960N13980N66007N25385K92186J9769j41825
9801A5961856r5002K21767O35149J107237J621724K076951K374497K467136K439612
9792B8810927K359486K095025J659048J168908O57790L31588J49527J200k27138
9783C7006361n63006q34978r27638j044377j210002j326084j288603r30943k72745
9774B8607985N13499J142604J509870J584531J398432J109935R36628P47498M34892
$$ plain form
9765 37985874 38126629 38028473 37748690 37239409 36556054 35686536 34449540 32675438 30498186
9756 30498186 28181369 25964829 23869622 22009058 20465692 19333210 18694843 18596947 18798096
9747 18798096 19119338 19325179 19285761 19006163 18559871 18137631 17872610 17800005 17940829 18351667
9737 18351667 19113842 20160423 21408191 22688126 23756057 24448780 24577351 24312164 23948767
9728 23948767 23745609 23868481 24337158 25083571 26062794 27174627 28267932 29142418 29580484
9719 29580484 29562278 29162402 28638948 28522711 29215199 30812834 33175235 36075144 39253220
9710 39253220 42635028 46177303 49725696 52912185 55408778 57124443 58379557 59396748
9702 59396748 60191477 60629163 60573139 59988331 58876965 57394602 55632457 53557573 51212015
$$ packed form
9765C7985874J40755r8156k79783n09281o83355q69518j236996j774102k177252
9756C0498186k316817k216540k095207j860564j543366j132482o38367r7896K01149
9747A8798096L21242K05841l9418k79598m46292m22240k65021p2605J40824M10838
9737A8351667P62175J046581J247768J279935J067931O92723J28571k65187l63397
9728B3948767k03158J22872M68677P46413R79223J111833J093305Q74486M38066
9719B9580484j8206l99876n23454j16237O92488J597635K362401K899909L178076
9710C9253220L381808L542275L548393L186489K496593J715665J255114J017191
9702E9396748P94729M37686n6024n84808j111366j482363j762145k074884k345558
$$ plain form
9693 51212015 48878038 46954945 45826760 45768274 46709094 48336098 50133950 51687132 52854426
9684 52854426 53839310 54797236 55624344 56240730 56599624 56702790 56601670 56091981 54823820
9675 54823820 52653092 49691719 46145822 42339205 38553249 35014789 31879538 29240800
9667 29240800 27204901 25865355 25146075 24870418 24769426 24528171 23980943 23130952 22189743
9658 22189743 21338101 20647063 20082906 19591932 19069165 18376133 17489663 16321708 14866530
9649 14866530 13206781 11534914 9961664 8540629 7384936 6490129 5737287 5130494 4639103
9640 4639103 4221632 3848908 3536423 3290224 3052630 2826456 2655215 2522116 2378611 2240936
9630 2240936 2106696 2000100 1908421 1814469 1765911 1727317 1657628 1575927 1534927 1530632 1527075
$$ packed form
9693E1212015k333977j923093j128185n8486R40820J627004J797852J553182J167294
9684E2854426R84884R57926Q27108O16386L58894J03166j01120n09689j268161
9675E4823820k170728k961373l545897l806617l785956l538460l135251k638738
9667B9240800k035899j339546p19280k75657j00992k41255n47228q49991r41209
9658B2189743q51642o91038n64157m90974n22767o93032q86470j167955j455178
9649A4866530j659749j671867j573250j421035j155693q94807p52842o06793m91391
9640D639103m17471l72724l12485k46199k37594k26174j71241j33099j43505j37675
9630B240936j34240j06596r1679r3952m8558l8594o9689q1701m1000m295l557
$$ plain form
9619 1527075 1495924 1489094 1484511 1466396 1445259 1411221 1352598 1292701 1225993 1166859 1112112 1110831
9607 1110831 1074229 1020888 984825 960998 927771 902358 907559 891721 856664 823711 808204 834119
9595 834119 840156 839645 845842 839967 834366 809546 767753 754720 765684 772414 794813 813771 789657
9582 789657 749408 745564 713595 700241 690768 658380 647795 670393 664760 653850 672850 674378
9570 674378 644730 634308 675130 670990 651118 667364 675618 702448 726690 739024 754990 742137
9558 742137 704800 695745 698705 704256 712980 703756 698879 720886 738635 734439 748807 751886 775058
9545 775058 763723 761470 754656 738528 755993 725292 731999 765906 802976 843829 879107 908508
9533 908508 944481 954828 955398 973570 1007561 1044712 1014833 1013746 1029434 1052480 1082771 1135435
$$ packed form
9619A527075l1151o830m583j8115k1137l4038n8623n9897o6708n9134n4747j281
9607A110831l6602n3341l6063k3827l3227k5413N201j5838l5057l2953j5507K5915
9595H34119O037n11O197n875n601k4820m1793j3033J0964O730K2399J8958k4114
9582G89657m0249l844l1969j3354r473l2388j0585K2598n633j0910J9000J528
9570F74378k9648j0422M0822m140j9872J6246Q254K6830K4242J2334J5966j2853
9558G42137l7337r055K960N551Q724r224m877K2007J7749m196J4368L079K3172
9545G75058j1335k253o814j6128J7465l0701O707L3907L7070M0853L5278K9401
9533I08508L5973J0347N70J8172L3991L7151k9879j087J5688K3046L0291N2664
$$ plain form
9521 1135435 1177082 1215944 1249605 1268312 1329444 1398322 1453541 1514080 1612784 1703569 1788779
9510 1788779 1903708 2022244 2146155 2298430 2491560 2696987 2969351 3309051 3686748 4138076
9500 4138076 4746767 5489412 6453309 7674098 9165439 10986034 13126414 15644851 18618311
9491 18618311 22106145 25826931 28982201 30670750 30442299 28640103 26030094 23227923
9483 23227923 20540446 18058866 15845789 13880421 12232359 10965295 10046666 9438594
9475 9438594 9144715 9162934 9505990 10151550 11165161 12636000 14555868 16884794 19555310
9466 19555310 22396662 25252154 27952231 30011295 30696574 29580262 27180953 24424026
9458 24424026 21908605 19750364 17880534 16035142 14115152 12234256 10525613 9086153
$$ packed form
9521A135435M1647L8862L3661J8707O1132O8878N5219O0539R8704R0785Q5210
9510A788779J14929J18536J23911J52275J93130K05427K72364L39700L77697M51328
9500D138076O08691P42645R63897J220789J491341J820595K140380K518437K973460
9491A8618311L487834L720786L155270J688549k28451j802196k610009k802171
9483B3227923k687477k481580k213077j965368j648062j267064r18629o08072
9475I438594k93879J8219L43056O45560J013611J470839J919868K328926K670516
9466A9555310K841352K855492K700077K059064O85279j116312k399309k756927
9458B4424026k515421k158241j869830j845392j919990j880896j708643j439460
$$ plain form
9450 9086153 7980013 7121552 6508604 6065324 5763508 5527483 5343093 5226896 5158371 5147726
9440 5147726 5186479 5249796 5327107 5440040 5610471 5847723 6156550 6585275 7093808 7697221
9430 7697221 8456690 9447888 10703280 12310330 14414077 17073968 20329063 24216698 28777438
9421 28777438 33958420 39581832 45255863 50185267 53492710 54462473 52954726 49774712
9413 49774712 46094964 42668660 39807707 37495584 35616149 34169972 33315781 33166620
9405 33166620 33685683 34522519 35191407 35128432 34419854 33778527 33790204 34735340 36661918 39605127
9395 39605127 43406336 47781692 52142252 55817320 57993914 58067527 55931818 52226750
9387 52226750 47974291 43968901 40426075 37308777 34492216 32003172 29997800 28582263
$$ packed form
9450I086153j106140q58461o12948m43280l01816k36025j84390j16197o8525j0645
9440E147726L8753O3317P7311J12933J70431K37252L08827M28725N08533O03413
9430G697221P59469R91198J255392J607050K103747K659891L255095L887635M560740
9421B8777438N180982N623412N674031M929404L307443R69763j507747l180014
9413D9774712l679748l426304k860953k312123j879435j446177q54191j49161
9405C3166620N19063Q36836O68888o2975p08578o41327J1677R45136J926578K943209
9395C9605127L801209M375356M360560L675068K176594P3613k135709l705068
9387E2226750m252459m005390l542826l117298k816561k489044k005372j415537
$$ plain form
9379 28582263 27705012 27189433 26571613 25351526 23421547 21115177 18848604 16771666 14948767
9370 14948767 13323499 11916922 10689018 9704819 8925471 8332423 7925775 7627578 7450149
9361 7450149 7412772 7478288 7630273 7903098 8332616 8927760 9764255 10846551 12235127 13932267
9351 13932267 15901468 18106369 20560833 23188586 25827010 28020515 29240762 29383062
9343 29383062 28916657 28489583 28387885 28697867 29311465 30163749 31268365 32757720 34766830
9334 34766830 37224891 39696125 41404702 41676833 40450001 38176303 35534530 33172011
9326 33172011 31393917 30270850 29919541 30382419 31579936 33258206 34871734 35603400 34973264
9317 34973264 33309653 31425374 29966471 29207439 29041560 29314326 29897988 30808606 32174615
$$ packed form
9379B8582263q77251n15579o17820j220087j929979k306370k266573k076938j822899
9370A4948767j625268j406577j227904r84199p79348n93048m06648k98197j77429
9361G450149l7377O5516J51985K72825M29518N95144Q36495J082296J388576J697140
9351A3932267J969201K204901K454464K627753K638424K193505J220247J42300
9343B9383062m66405m27074j01698L09982O13598Q52284J104616J489355K009110
9334C4766830K458061K471234J708577K72131j226832k273698k641773k362519
9326C3172011j778094j123067l51309M62878J197517J678270J613528P31666o30136
9317C4973264j663611j884279j458903p59032j65879K72766N83662R10618J366009
$$ plain form
9308 32174615 33991296 35862204 37056474 36785127 34759120 31388300 27413568 23499151
9300 23499151 20023549 17028337 14493609 12401744 10645911 9264082 8173769 7311138
9292 7311138 6617797 6060053 5611455 5252264 4918919 4613229 4362494 4176730 4045754 3941237
9282 3941237 3869760 3792753 3754661 3736800 3764653 3810814 3877086 4003439 4183941 4430593 4797057
9271 4797057 5323947 6044845 6922201 7962154 9018779 10088681 11159350 12270636 13553728
9262 13553728 15037506 16473064 17449456 17438363 16396803 14794339 13079462 11416520 9833414
9253 9833414 8426055 7313256 6461548 5844968 5453426 5228335 5200466 5334478 5588697
9244 5588697 6036321 6649847 7447525 8436318 9589809 10914380 12375034 13861622 15292526
$$ packed form
9308C2174615J816681J870908J194270k71347k026007l370820l974732l914417
9300B3499151l475602k995212k534728k091865j755833j381829j090313q62631
9292G311138o93341n57744m48598l59191l33345l05690k50735j85764j30976j04517
9282C941237p1477p7007l8092j7861K7853M6161O6272J26353J80502K46652L66464
9271D797057N26890P20898Q77356J039953J056625J069902J070669J111286J283092
9262A3553728J483778J435558R76392j1093j041560j602464j714877j662942j583106
9253I833414j407359j112799q51708o16580l91542k25091k7869J34012K54219
9244E588697M47624O13526P97678R88793J153491J324571J460654J486588J430904
$$ plain form
9235 15292526 16473511 16970121 16369327 14810231 12720772 10657004 8947007 7547629
9227 7547629 6396627 5422223 4611458 3924624 3382035 2979119 2675161 2408255 2185109
9218 2185109 2022231 1904183 1759751 1601233 1513933 1426321 1340232 1275372 1238502 1185153 1149393
9207 1149393 1103763 1040740 1002046 979284 950894 904209 901212 888663 870534 876582 867889 825499
9195 825499 804140 802113 792686 755598 736367 721554 720410 727382 713518 679199 664370 658397 671841
9182 671841 664048 633947 625364 634776 595045 570247 570749 573305 534434 515574 535557 563146 558860
9169 558860 546273 568289 566954 538104 510225 479772 481595 500702 492820 485028 476195 478181 457574
9156 457574 455943 471097 511362 521900 523960 509020 513313 527332 530074 527322 528377 522145 533996
$$ packed form
9235A5292526J180985M96610o00794j559096k089459k063768j709997j399378
9227G547629j151002r74404q10765o86834n42589m02916l03958k66906k23146
9218B185109j62878j18048j44432j58518q7300q7612q6089o4860l6870n3349l5760
9207A149393m5630o3023l8694k2762k8390m6685k997j2549j8129O048q693m2390
9195H25499k1359k027r427l7088j9231j4813j144O972j3864l4319j4829n973J3444
9182F71841p793l0101q583R412l9731k4798N02K556l8871j8860J9983K7589m286
9169E58860j2587K2016j335k8850k7879l0453J823J9107p882p792q833J986k0607
9156D57574j631J5154M0265J0538K060j4940M293J4019K742k752J055o232J1851
$$ plain form
9143 533996 540064 538416 548914 552845 543747 542280 536313 546973 520649 495542 505759 525295 524735
9130 524735 520844 504906 518358 542126 549551 559672 558517 584068 591636 606915 625811 655891
9118 655891 654330 643611 648597 646498 650806 664658 669434 668297 647521 661329 667434 642772 624329
9105 624329 600448 557736 534104 565734 574224 568275 582454 561243 560420 560270 538805 500034 511025
9092 511025 550629 564272 564060 566611 574271 598994 613758 606963 612241 593672 605316 644613 658368
9079 658368 655091 667903 699508 735819 755341 769831 775067 774255 778048 752759 712992 664407 664237
9066 664237 688075 686579 662472 659177 694828 691172 693453 690210 682380 727541 733881 748099 764199
9053 764199 765364 760658 779136 796288 817682 835487 866203 856389 822395 829370 813345 777957
$$ packed form
9143E33996O068j648J0498L931r098j467n967J0660k6324k5107J0217J9536n60
9130E24735l891j5938J3452K3768P425J0121j155K5551P568J5279J8896L0080
9118F55891j561j0719M986k099M308J3852M776j137k0776J3808O105k4662j8443
9105F24329k3881m2712k3632L1630Q490n949J4179k1211q23j50k1465l8771J0991
9092E11025L9604J3643k12K551P660K4723J4764o795N278j8569J1644L9297J3755
9079F58368l277J2812L1605L6311J9522J4490N236q12L793k5289l9767m8585j70
9066F64237K3838j496k4107l295L5651l656K281l243p830M5161O340J4218J6100
9053G64199J165m706J8478J7152K1394J7805L0716r814l3994O975j6025l5388
$$ plain form
9041 777957 751365 746909 761643 755574 749578 767522 798287 808172 791957 781723 786776 827503 859219
9028 859219 872532 904701 926485 964343 1000044 1051094 1137164 1224391 1393707 1637728 1917773
9017 1917773 2150321 2189919 1994625 1713140 1484735 1372354 1335877 1302871 1290287 1299571 1302618
9006 1302618 1352231 1372697 1399955 1426852 1474507 1522151 1507674 1471850 1468522 1462964 1446420 1443685
8994 1443685 1469458 1508408 1541473 1590863 1591264 1584572 1600636 1624731 1649941 1664088 1694640 1694029
8982 1694029 1706445 1749675 1797691 1896773 2070516 2235147 2453499 2763138 3188415 3756049
8972 3756049 4357430 4520982 4074009 3436409 2935360 2644764 2480719 2373493 2306665 2264898
8962 2264898 2249447 2244857 2256253 2299491 2312014 2315178 2321565 2353734 2383063 2425870 2450055 2509452
$$ packed form
9041G77957k6592m456J4734o069n996J7944L0765R885j6215j0234N053M0727L1716
9028H59219J3313L2169K1784L7858L5701N1050Q6070Q7227J69316K44021K80045
9017A917773K32548L9598j95294k81485k28405j12381l6477l3006j2584R284L047
9006A302618M9613K0466K7258K6897M7655M7644j4477l5824l328n558j6544k735
8994A443685K5773L8950L3065M9390M01o692J6064K4095K5210J4147L0552o11
8982A694029J2416M3230M8016R9082J73743J64631K18352L09639M25277N67634
8972C756049O01381J63552m46973o37600n01049k90596j64045j07226o6828m1767
8962B264898j5451m590J1396M3238J2523L164O387L2169K9329M2807K4185N9397
$$ plain form
8950 2509452 2560600 2589943 2646960 2727225 2786720 2855236 2945483 3007532 3059214 3138210 3258577
8939 3258577 3364295 3434427 3529696 3664047 3768052 3922976 4117630 4317639 4572442 4894314
8929 4894314 5301778 5788893 6294754 6612074 6558064 6313550 6104551 6003254 5998444 6085935
8919 6085935 6226735 6372889 6542556 6740503 6968445 7115361 7311431 7595303 7869833 8190060
8909 8190060 8530237 8899899 9264583 9680326 10144486 10635910 11135402 11654421 12209803 12851385
8899 12851385 13538299 14267493 15046393 15912670 16879803 17912588 19040169 20279034 21571253
8890 21571253 22991333 24570679 26321686 28270034 30422258 32828784 35555877 38590900
8882 38590900 42014647 45896457 50265909 55199011 60757929 67058108 74182823 82257177
$$ packed form
8950B509452N1148K9343N7017Q0265N9495O8516R0247O2049N1682P8996J20367
8939C258577J05718P0132R5269J34351J04005J54924J94654K00009K54803L21872
8929D894314M07464M87115N05861L17320n4010k44514k08999j01297m810Q7491
8919F085935J40800J46154J69667J97947K27942J46916J96070K83872K74530L20227
8909H190060L40177L69662L64684M15743M64160M91424M99492N19019N55382O41582
8899A2851385O86914P29194P78900Q66277R67133J032785J127581J238865J292219
8890B1571253J420080J579346J751007J948348K152224K406526K727093L035023
8882C8590900L423747L881810M369452M933102N558918O300179P124715Q074354
$$ plain form
8874 82257177 91328171 101464610 112670476 124850031 137730058 151069053 164214862
8867 164214862 176342490 186540678 193859764 197534607 197142016 192720327 184831904 174246293
8859 174246293 161966453 148884698 135771356 123160881 111330828 100476392 90703243
8852 90703243 81957431 74153029 67233704 61142789 55726159 50934082 46664951 42859414
8844 42859414 39462950 36452119 33742137 31334269 29152421 27162024 25343458 23719476
8836 23719476 22221659 20880102 19650859 18548363 17547685 16611867 15741744 14970635 14280104
8827 14280104 13668538 13088715 12437200 11800597 11274273 10777301 10314360 9894746 9477901
8818 9477901 9060443 8663099 8294536 7972210 7678459 7393660 7100047 6834332 6583473 6379601
$$ packed form
8874H2257177R070994J0136439J1205866J2179555J2880027J3338995J3145809
8867A64214862J2127628J0198188P319086L674843l92591m421689p888423j0585611
8859A74246293j2279840j3081755j3113342j2610475j1830053j0854436r773149
8852I0703243q745812p804402o919325o090915n416630m792077m269131l805537
8844D2859414l396464l010831k709982k407868k181848j990397j818566j623982
8836B3719476j497817j341557j229243j102496j000678r35818q70123p71109o90531
8827A4280104o11566n79823o51515o36603n26324m96972m62941m19614m16845
8818I477901m17458l97344l68563l22326k93751k84799k93613k65715k50859k03872
$$ plain form
8808 6379601 6182633 5965715 5772542 5599952 5444446 5257384 5077861 4918023 4788223 4660563
8798 4660563 4529609 4391311 4256833 4134799 4009774 3933303 3843123 3780076 3720826 3631653
8788 3631653 3552752 3480865 3397016 3309194 3265719 3228168 3185794 3163541 3105760 3010552 2890422
8777 2890422 2793540 2730337 2680380 2611434 2546681 2447535 2405493 2378068 2327337 2273864 2248360
8766 2248360 2236346 2216915 2224837 2194843 2141714 2112454 2073037 2044237 2027494 2013685 2002739 1977047
8754 1977047 1964712 1941459 1931854 1920367 1904282 1931490 1945690 1940428 1958877 1923411 1857402 1838060
8742 1838060 1802414 1758877 1745025 1732017 1727098 1732807 1723018 1714361 1681932 1617350 1572209 1527508
8730 1527508 1514280 1503428 1478048 1448345 1439098 1431686 1405519 1384395 1392253 1385390 1371572 1334749
$$ packed form
8808F379601j96968k16918j93173j72590j55506j87062j79523j59838j29800j27660
8798D660563j30954j38298j34478j22034j25025p6471r0180o3047n9250q9173
8788C631653p8901p1887q3849q7822m3475l7551m2374k2253n7781r5208j20130
8777B890422r6882o3203m9957o8946o4753r9146m2042k7425n0731n3473k5504
8766B248360j2014j9431P922k9994n3129k9260l9417k8800j6743j3809j0946k5692
8754A977047j2335k3253r605j1487j6085K7208J4200n262J8449l5466o6009j9342
8742A838060l5646m3537j3852j3008m919N709r789q657l2429o4582m5141m4701
8730A527508j3228j0852k5380k9703r247p412k6167k1124P858o863j3818l6823
$$ plain form
8718 1334749 1339380 1312348 1305407 1305232 1321551 1334703 1317055 1296492 1303447 1298654 1285413 1324226 1365265
8705 1365265 1403533 1447478 1495644 1519854 1510773 1410697 1303583 1253108 1267076 1220804 1169501
8694 1169501 1155218 1125428 1117500 1157752 1191786 1208010 1227995 1218572 1199933 1188000 1189607 1198619
8682 1198619 1222234 1256924 1288295 1306635 1314259 1281510 1263299 1239993 1240020 1251644 1287210 1317667
8670 1317667 1329698 1320625 1338922 1370466 1382377 1466872 1573939 1652950 1675313 1702797 1724849
8659 1724849 1744458 1794792 1876878 1977171 2016530 2047267 2082231 2146324 2171613 2271287 2357407
8648 2357407 2450398 2558395 2681400 2806393 2937262 3093255 3251208 3431207 3669641 3994767
8638 3994767 4396718 4871240 5442483 6085546 6837643 7694788 8717684 9929293 11200229
$$ packed form
8718A334749M631k7032o941j75J6319J3152j7648k0563O955m793j3241L8813M1039
8705A365265L8268M3945M8166K4210r081j00076j07114n0475J3968m6272n1303
8694A169501j4283k9790p928M0252L4034J6224J9985r423j8639j1933J607R012
8682A198619K3615L4690L1371J8340P624l2749j8211k3306K7J1624L5566L0457
8670A317667J2031r073J8297L1544J1911Q4495J07067P9011K2363K7484K2052
8659A724849J9609N0334Q2086J00293L9359L0737L4964O4093K5289R9674Q6120
8648B357407R2991J07997J23005J24993J30869J55993J57953J79999K38434L25126
8638C994767M01951M74522N71243O43063P52097Q57145J022896J211609J270936
$$ plain form
8629 11200229 12535002 14293204 16817554 20385290 25478069 32921884 44191214 61783190
8621 61783190 89592959 131881847 188542781 241011117 250139211 206521540 146232375
8614 146232375 99386745 69439506 50795469 38806094 30750632 25223185 21344587
8607 21344587 18506592 16395448 14826472 13679858 12842288 12130850 11397456 10680207 10085376
8598 10085376 9681063 9469162 9405275 9518315 9832295 10290967 10906786 11691705 12649031 13827611
8588 13827611 15318347 17199638 19403328 21665905 23971974 27014129 31453299 37830054
8580 37830054 46873296 60045992 80067056 111627278 162530416 242895143 358531602
8573 358531602 480039661 515567821 429340385 300215839 199940459 136673693 97896962
$$ packed form
8629A1200229J334773J758202K524350L567736N092779P443815J1269330J7591976
8621F1783190K7809769M2288888N6660934N2468336R128094m3617671o0289165
8614A46232375m6845630k9947239j8644037j1989375q055462n527447l878598
8607B1344587k837995k111144j568976j146614q37570p11438p33394p17249n94831
8598A0085376m04313k11901o3887J13040L13980M58672O15819P84919R57326J178580
8588A3827611J490736J881291K203690K262577K306069L042155M439170O376755
8580C7830054R043242J3172696K0021064L1560222N0903138Q0364727J15636459
8573C58531602J21508059L5528160q6227436j29124546j00275380o3266766l8776731
$$ plain form
8566 97896962 73253990 56830148 45573144 37660753 31870983 27515790 24239493 21874533
8558 21874533 20158342 18662314 16963098 15141478 13622047 12538591 11795914 11261142
8550 11261142 10874514 10614154 10463072 10368821 10379734 10544011 10853724 11297138 11944232 12776627
8540 12776627 13774081 14915361 16401213 18496499 21489052 25793984 32023833 41428966
8532 41428966 55972209 78877540 114282211 164324925 218956171 244371395 216141364
8525 216141364 158277267 107083411 73182138 52236744 38974611 30093526 23937681
8518 23937681 19612787 16446928 14057430 12213984 10830760 9831253 8960791 8016675 7074671
8509 7074671 6290854 5703206 5262618 4903186 4553051 4285765 4025731 3757472 3536628 3303587
$$ packed form
8566I7896962k4642972j6423842j1257004p912391n789770m355193l276297k364960
8558B1874533j716191j496028j699216j821620j519431j083456p42677n34772
8550A1261142l86628k60360j51082r4251J0913J64277L09713M43414O47094Q32395
8540A2776627R97454J141280J485852K095286K992553M304932O229849R405133
8532D1428966J4543243K2905331L5404671N0042714N4631246K5415224k8230031
8525B16141364n7864097n1193856l3901273k0945394j3262133q881085o155845
8518B3937681m324894l165859k389498j843446j383224r99507q70462r44116r42004
8509G074671p83817n87648m40588l59432l50135k67286k60034k68259k20844k33041
$$ plain form
8499 3303587 3076236 2903102 2796588 2696710 2582084 2505198 2473159 2435333 2319925 2156805
8489 2156805 2053845 1978915 1870248 1758273 1700455 1698493 1717797 1700487 1661589 1584907 1523937
8478 1523937 1545102 1593622 1614613 1537870 1447192 1395852 1329953 1241618 1181262 1151471 1123848
8467 1123848 1082416 1020128 992185 998921 1006569 1011356 1001940 975059 957819 965084 950659 938556
8455 938556 945029 949002 1006301 1072044 1105741 1132278 1154975 1199922 1240963 1242820 1084546 916904
8443 916904 798290 737761 727149 670186 624385 622020 623810 606659 603896 608669 609501 591892 574787
8430 574787 562081 588129 625699 637114 623489 600870 585983 589222 571444 573909 540727 520321
8418 520321 549272 540534 541490 533750 548024 548824 537384 515989 490303 486127 522369 543036 565493
$$ packed form
8499C303587k27351j73134j06514r9878j14626p6886l2039l7826j15408j63120
8489B156805j02960p4930j08667j11975n7818j962J9304j7310l8898p6682o0970
8478A523937K1165M8520K0991p6743r0678n1340o5899q8335o0356k9791k7623
8467A123848m1432o2288k7943O736P648M787r416k6881j7240P265j4425j2103
8455I38556O473L973N7299O5743L3697K6537K2697M4947M1041J857j58274j67642
8443I16904j18614o0529j0612n6963m5801k365J790j7151k763M773Q32j7609j7105
8430E74787j2706K6048L7570J1415j3625k2619j4887L239j7778K465l3182k0406
8418E20321K8951q738R56p740J4274Q00j1440k1395k5686m176L6242K0667K2457
$$ plain form
8405 565493 593001 609365 601016 602125 612535 570338 520750 465321 449263 436355 434538 415991
8393 415991 410457 427615 388737 373619 390856 395019 359169 320810 296986 304705 326978 365844
8381 365844 414826 432461 443296 451484 455018 405045 364095 378543 399792 401592 386010 354299
8369 354299 353433 335500 308540 299820 278751 268314 289098 297069 308836 287149 269669 269839 283201
8356 283201 329632 333127 314934 336490 336044 313880 286429 281038 281308 288153 268533 234717 238481
8343 238481 276614 289136 273461 258651 246207 246341 239318 247361 256276 280025 296416 273835 268058
8330 268058 244566 267010 309423 337921 337749 343192 352354 327483 253934 224317 225995 226371 236944
8317 236944 236215 219210 222187 235989 239025 230874 211085 214982 238894 295302 307313 305798 250336
$$ packed form
8405E65493K7508J6364q349J109J0410m2197m9588n5429j6058j2908j817j8547
8393D15991n534J7158l8878j5118J7237M163l5850l8359k3824P719K2273L8866
8381C65844M8982J7635J0835Q188L534m9973m0950J4448K1249J800j5582l1711
8369C54299q66j7933k6960q720k1069j0437K0784P971J1767k1687j7480J70J3362
8356B83201M6431L495j8193K1556m46k2164k7451n391K70O845j9620l3816L764
8343B38481L8133J2522j5675j4810j2444J34p023Q043Q915K3749J6391k2581n777
8330B68058k3492K2444M2413K8498j72N443R162k4871p3549k9617J678L76J0573
8317B36944p29j7005K977J3802L036q151j9789L897K3912N6408J2011j515n5462
$$ plain form
8304 250336 216145 197656 212189 189775 174379 157573 180459 201305 183249 164041 179120 187519
8292 187519 222132 209295 191654 182969 201681 219430 209359 186422 173972 180118 208945 248529
8280 248529 233616 192272 169922 184596 198106 198648 210724 225962 216207 234287 242525 221089
8268 221089 205075 199048 190236 196985 223968 235048 228084 206158 189761 174589 145717 163767
8256 163767 165980 190938 213189 229373 223662 224955 223812 234631 224513 206742 155412 148870 176382
8243 176382 193053 192763 178575 182378 179923 189647 191646 181418 182957 176503 177788 164156 163694 129922
8229 129922 126031 141129 188179 213171 207758 223160 223624 234206 253787 287574 313952 401151
8217 401151 533908 694849 921393 1184445 1403161 1385331 1139077 838681 613593 457562
$$ packed form
8304B50336l4191j8489J4533k2414j5396j6806K2886K0846j8056j9208J5079Q399
8292A87519L4613j2837j7641q685J8712J7749j0071k2937j2450O146K8827L9584
8280B48529j4913m1344k2350J4674J3510N42J2076J5238r755J8080Q238k1436
8268B21089j6014o027q812O749K6983J1080o964k1926j6397j5172k8872J8050
8256A63767K213K4958K2251J6184n711J293j143J0819j0118j7771n1330o542K7512
8243A76382J6671k90j4188L803k455R724J999j0228J539o454J285j3632m62l3772
8229A29922l891J5098M7050K4992n413J5402M64J0582J9581L3787K6378Q7199
8217D01151J32757J60941K26544K63052K18716j7830k46254l00396k25088j56031
$$ plain form
8207 457562 336279 289793 264288 257778 235428 183242 146945 133319 138175 175059 197383 175150
8195 175150 143111 136432 140950 155856 192570 203085 179977 171547 159631 154986 187957 233995
8183 233995 255457 218286 204461 202486 268388 296224 302080 340385 407788 466976 560476 770463
8171 770463 1107513 1596963 2228665 2745309 2697433 2149145 1551812 1083713 779284 620053
8161 620053 489456 427292 372299 325211 279866 265414 253587 220401 211262 209170 186597 175476
8149 175476 167597 160378 161511 183703 168761 157927 150145 137725 138561 125425 111677 118806 138634
8136 138634 155134 152754 178963 198905 231292 262485 295223 349248 396593 462293 600847 791350
8124 791350 1047629 1268346 1313307 1124202 799625 592087 464008 375038 336400 290992
$$ packed form
8207D57562j21283m6486k5505o510k2350n2186l6297j3626M856L6884K2324k2233
8195A75150l2039o679M518J4906L6714J0515k3108q430j1916m645L2971M6038
8183B33995K1462l7171j3825j975O5902K7836N856L8305O7403N9188R3500K09987
8171G70463L37050M89450O31702N16644m7876n48288n97333m68099l04429j59231
8161F20053j30597o2164n4993m7088m5345j4452j1827l3186r139k092k2573j1121
8149A75476p879p219J133K2192j4942j0834p782j2420Q36j3136j3748P129J9828
8136A38634J6500k380K6209J9942L2387L1193L2738N4025M7345O5700J38554J90503
8124G91350K56279K20717M4961j89105l24577k07538j28079q8970l8638m5408
$$ plain form
8114 290992 264350 251470 201567 159810 125691 120202 132654 138224 132649 122286 149627 152400
8102 152400 141442 126731 112202 88788 86181 99381 90148 73246 70270 118265 130662 130629 95985
8089 95985 79488 67457 61172 99108 125433 130290 124148 107628 81783 100750 115098 96501
8077 96501 84628 82159 102675 100495 78906 91035 113980 116070 120281 98234 76017 89446 102557
8064 102557 114127 110430 71987 94721 136217 115762 87714 76593 68713 81158 87963 77754
8052 77754 64189 73307 82009 72686 43374 60134 53407 56671 73000 82344 86339 70429 77869
8039 77869 92792 94903 86462 79406 81257 65257 24319 6630 3728 23608 38498 37963 47699
8026 47699 45572 55071 73319 96979 80952 59301 57289 68330 79653 75874 70214 73343 61277
$$ packed form
8114B90992k6642j2880m9903m1757l4119n489J2452N570n575j0363K7341K773
8102A52400j0958j4711j4529k3414k607J3200r233j6902k976M7995J2397l3l4644
8089I5985j6497j2031o285L7936K6325M857o142j6520k5845J8967J4348j8597
8077I6501j1873k469K0516k180k1589J2129K2945K090M211k2047k2217J3429J3111
8064A02557J1570l697l8443K2734M1496k0455k8048j1121p880J2445O805j0209
8052G7754j3565R118Q702r323k9312J6760o727L264J6329R344L995j5910P440
8039G7869J4923K111q441p056J851j6000m0938j7689k902J9880J4890n35R736
8026D7699k127R499J8248K3660j6027k1651k012J1041J1323l779n660L129j2066
$$ plain form
8013 61277 68393 111932 114099 120608 103944 82143 74751 62116 87002 100198 85517 114923 145775
8000 145775 113199 89969 75854 100350 119868 122690 107161 94819 88659 83326 85752 94151 113566
7987 113566 136583 126604 102247 86340 97301 105517 134500 109370 99729 120969 113339 97291
7975 97291 88451 90124 114274 94659 92999 107789 134983 120420 139649 155474 148440 157614 157102
7962 157102 134400 124300 95843 91279 103123 135765 129282 98907 113713 104176 129746 139771
7950 139771 134685 108464 100032 88846 105692 134414 148731 166231 162059 125142 106230 106832 101885
7937 101885 118307 144551 175081 167562 152696 139502 136432 125474 105063 106108 104027 111747 122106
7924 122106 112092 112177 129306 144233 152229 142259 129851 111324 124081 125786 107316 92988 88314
$$ packed form
8013F1277P116M3539K167O509j6664k1801p392j2635K4886J3196j4681K9406L0852
8000A45775l2576k3230j4115K4496J9518K822j5529j2342o160n333K426Q399J9415
7987A13566K3017r979k4357j5907J0961Q216K8983k5130r641K1240p630j6048
7975I7291q840J673K4150j9615j660J4790K7194j4563J9229J5825p034R174n12
7962A57102k2702j0100k8457m564J1844L2642o483l0375J4806r537K5570J0025
7950A39771n086k6221q432j1186J6846K8722J4317J7500m172l6917j8912O02m947
7937A01885J6422K6244L0530p519j4866j3194l070j0958k0411J045k081P720J0359
7924A22106j0014Q5J7129J4927P996r970j2408j8527J2757J705j8470j4328m674
$$ plain form
7911 88314 115826 120817 116015 127270 104651 91166 94917 83360 84208 95815 101678 107369 104714
7898 104714 127732 128377 127397 115912 113506 102111 108655 142161 146392 125122 98793 89156 100366
7885 100366 111590 107298 114781 136915 143455 119849 118122 103923 78206 80267 87402 113868 117406
7872 117406 116746 131830 108385 68698 62671 64390 77236 57886 33820 33860 37132 50449 76033
7859 76033 53739 28323 27271 51908 27536 4736 -6551 19457 48325 52191 50353 49808 45059
7846 45059 48784 77660 69477 78043 80650 97543 119171 111739 89276 64882 61336 70598 73396
7833 73396 94205 72423 53802 58928 61245 67497 46010 31638 20699 25730 56315 70300 65918
7820 65918 54104 61000 66796 50642 54970 38055 54071 68645 46822 23319 37136 46332 57776
$$ packed form
7911H8314K7512M991m802J1255k2619j3485L751j1557Q48J1607N863N691k655
7898A04714K3018O45r80j1485k406j1395O544L3506M231k1270k6329r637J1210
7885A00366J1224m292P483K2134O540k3606j727j4199k5717K061P135K6466L538
7872A17406o60J5084k3445l9687o027J719J2846j9350k4066M0L272J3317K5584
7859G6033k2294k5416j052K4637k4372k2800j1287K6008K8868L866j838n45m749
7846D5059L725K8876q183Q566K607J6893K1628p432k2463k4394l546R262K798
7833G3396K0809k1782j8621N126K317O252k1487j4372j0939N031L0585J3985m382
7820F5918j1814O896N796j6154M328j6915J6016J4574k1823k3503J3817R196J1444
$$ plain form
7807 57776 59138 55295 66837 61405 49718 26881 -7562 -25127 -13215 12087 37414 60472
7795 60472 77665 59668 46821 44968 54517 84863 96454 87813 74738 35267 18596 6863
7783 6863 36502 49788 37400 51521 55242 31445 9319 10084 13454 36284 67850 93762 94128
7770 94128 65082 60695 49092 71463 74646 51598 55249 60437 51794 37869 -3795 -11320 20572
7757 20572 34988 27871 23535 10083 7340 40791 38715 18736 31934 50627 65095 52759 59475
7744 59475 50212 43357 31896 33272 31412 37557 40330 21538 5313 11967 47112 39331 19337
7731 19337 23549 26855 26220 21107 13520 -468 17393 44020 33330 22849 21061 14885 -5972
7718 -5972 1627 -3917 19833 1636 -10544 18034 1012 -9074 4114 3462 17705 22696 6938
$$ packed form
7807E7776J362l843J1542n432j1687k2837l4443j7565J1912K5302K5327K3058
7795F0472J7193j7997j2847j853R549L0346J1591q641j3075l9471j6671j1733
7783F863K9639J3286j2388J4121L721k3797k2126P65L370K2830L1566K5912L66
7770I4128k9046m387j1603K2371L183k3048L651N188q643j3925m1664p525L1892
7757B0572J4416p117m336j3452k743L3451k076j9979J3198J8693J4468j2336O716
7744E9475r263o855j1461J376j860O145K773j8792j6225O654L5145p781j9994
7731A9337M212L306o35n113p587j3988J7861K6627j0690j0481j788o176k0857
7718e972P599n544K3750j8197j2180K8578j7022j0086J3188o52J4243M991j5758
$$ plain form
7705 6938 11560 -954 -18438 -27900 -27589 -6242 22104 47281 58520 48093 30401 26189 36441
7692 36441 38494 40462 55779 57469 27748 2550 11994 33532 44705 32373 9432 -33261 -48516
7679 -48516 -23844 -29641 -25930 -11614 -530 -12629 -17083 790 -7407 -8089 -26145 -17864 -1139
7666 -1139 39442 46731 23488 14331 22731 24295 15069 1847 1348 29803 62711 71906 61304 43055
7652 43055 28582 38091 53015 44822 30505 30358 39692 15357 -7089 -19126 -38385 -43696 -29586
7639 -29586 -22154 -21424 -11511 1518 -14057 -5485 -3748 17680 27520 35467 48357 56131 40643 24347
7625 24347 14203 653 2121 577 5090 26497 26722 39126 63459 23314 -19552 13780 25652
7612 25652 20726 25776 3091 -28230 -30036 -21507 -18084 -13828 5203 37510 47528 14421 -5491
$$ packed form
7705F938M622j2514j7484r462L11K1347K8346K5177J1239j0427j7692m212J0252
7692C6441K053J968J5317J690k9721k5198R444K1538J1173j2332k2941m2693j5255
7679d8516K4672n797L711J4316J1084j2099m454J7873q197o82j8056Q281J6725
7666a139M0581P289k3243r157Q400J564r226j3222m99K8455L2908R195j0602j8249
7652D3055j4473R509J4924q193j4317j47R334k4335k2446j2037j9259n311J4110
7639b9586P432P30R913J3029j5575Q572J737K1428R840P947J2890P774j5488j6296
7625B4347j0144j3550J468j544M513K1407K25J2404K4333m0145m2866L3332J1872
7612B5652m926N050k2685l1321j806Q529L423M256J9031L2307J0018l3107j9912
$$ plain form
7599 -5491 -31449 -25899 -4741 -3333 -12200 -14639 -10609 254 2471 -25167 -15335 -1530 28056
7586 28056 29487 23588 16657 19139 41642 50777 48530 19832 -9225 -10125 -11875 5612 8984 -4929
7572 -4929 -1995 14981 15500 -21729 -1958 1697 -20730 -23627 8014 627 -8548 -5644 -23751 -32552
7558 -32552 -18066 -18709 -15580 20082 48748 40728 16763 27570 36501 13030 -22202 -10723 30769
7545 30769 42050 29933 11332 1826 14408 30847 14490 -787 5774 1700 4043 23414 44334
7532 44334 59562 40135 11762 17925 35063 17724 22097 41210 57678 62706 39689 15897
7520 15897 40110 27833 5027 1575 -14115 -14597 -27638 -31836 -33667 -2026 14099 29206 30101
7507 30101 3083 5347 738 -1664 -1495 -16046 -17969 174 -11687 -17230 -13854 -24987 -19896 -4592
$$ packed form
7599e491k5958N550K1158J408q867k439M030J0863K217k7638R832J3805K9586
7586B8056J431n899o931K482K2503R135k247k8698k9057r00j750J7487L372j3913
7572d929K934J6976N19l7229J9771L655k2427k897L1641p387r175K904j8107q801
7558c2552J4486o43L129L5662K8666q020k3965J0807Q931k3471l5232J1479M1492
7545C0769J1281j2117j8601r506J2582J6439j6357j5277O561m074K343J9371K0920
7532D4334J5228j9427k8373O163J7138j7339M373J9113J6468N028k3017k3792
7520A5897K4213j2277k2806l452j5690m82j3041m198j831L1641J6125J5107Q95
7507C0101k7018K264m609k402J69j4551j923J8143j1861n543L376j1133N091J5304
$$ plain form
7493 -4592 2291 24473 14085 6498 9960 20166 17013 37842 12263 -19178 -7898 38228 17118
7480 17118 -16 32716 27843 2652 -28235 -43184 -25646 -23928 -32046 -7066 648 7085 29930
7467 29930 35872 13522 34383 70158 78658 48270 19423 38051 31614 22213 2942 8613 9527
7454 9527 15104 9980 13927 9255 10998 7922 11831 -1237 13634 5469 3647 27194 30680 4219
7440 4219 25639 34231 13507 -16593 -29822 -17395 10234 24811 32315 39735 30571 14274 -10633
7427 -10633 -5643 3735 26814 16202 12146 510 4378 11237 9190 16386 27855 -4620 -21048
7414 -21048 -25418 -13283 -9660 53 -5085 8538 17254 23027 28943 14713 -18719 -16938 10417
7401 10417 1642 -4868 12372 -1371 -223 -11870 2399 10079 6360 1971 9379 192 -9400 -2507
$$ packed form
7493d592O883K2182j0388p587L462J0206l153K0829k5579l1441J1280M6126k1110
7480A7118j7134L2732m873k5191l0887j4949J7538J718q118K4980P714O437K2845
7467B9930N942k2350K0861L5775Q500l0388k8847J8628o437r401j9271N671R14
7454I527N577n124L947m672J743l076L909j3068J4871q165j822K3547L486k6461
7440D219K1420Q592k0724l0100j3229J2427K7629J4577P504P420r164j6297k4907
7427a0633M990R378K3079j0612m056j1636L868O859k047P196J1469l2475j6428
7414b1048m370J2135L623R713n138J3623Q716N773N916j4230l3432J781K7355
7401A0417q775o510J7240j3743J148j1647J4269P680l719m389P408r187r592O893
$$ plain form
7387 -2507 30768 67667 78564 92809 74776 43732 16687 6720 -10529 -11493 994 -10355 1065
7374 1065 6571 -22241 -32412 -29892 5528 14435 31627 13966 6405 4757 -19854 -25047 1568
7361 1568 9764 26842 34175 13763 -4181 -11974 -23125 -13 4417 -388 21921 30343 25168
7348 25168 11368 33437 63167 35223 14440 24888 23792 9712 18691 20452 11598 -11044 -43525
7335 -43525 -32592 -22037 -6919 13572 14094 896 -16828 6812 22463 22899 16681 23951 -6604
7322 -6604 -24793 -15591 -41680 -23003 -5739 4063 19593 1131 -20702 -31896 -14929 -6891 -7584
7309 -7584 -28144 -27836 -20878 -5385 14643 19803 -4946 -27139 -57488 -40237 -40887 -41005 3168 28086
7295 28086 8138 -19490 -15812 5569 11835 8452 -2948 -22887 -36664 -39548 -35925 -23690 -19271
$$ packed form
7387b507L3275L6899J0897J4245j8033l1044k7045r967j7249r64J2487j1349J1420
7374A065N506k8812j0171K520L5420Q907J7192j7661p561j648k4611n193K6615
7361A568Q196J7078P333k0412j7944p793j1151K3112M430m805K2309Q422n175
7348B5168j3800K2069K9730k7944k0783J0448j096j4080Q979J761q854k2642l2481
7335d3525J0933J0555J5118K0491N22j3198j7724K3640J5651M36o218P270l0555
7322f604j8189R202k6089J8677J7264R802J5530j8462k1833j1194J6967Q038o93
7309g584k0560L08O958J5493K0028N160k4749k2193l0349J7251o50j18M4173K4918
7295B8086j9948k7628L678K1381O266l383j1400j9939j3777k884L623J2235M419
$$ plain form
7282 -19271 -21239 -18550 -32849 -35511 -48371 -41637 -29726 -24558 -6728 -8561 9526 28575 31246
7269 31246 20013 21917 5577 1159 9120 14946 30043 32602 8776 22816 41288 32250 30615
7256 30615 35001 32536 44477 43576 34052 -2599 -26215 -38915 -58995 -49202 -24050 2717 24679
7243 24679 -1824 -11270 -21154 -36714 -29618 -28319 4183 31929 12922 -6987 -27341 -40999 -45215
7230 -45215 -12859 -1357 -9494 -816 36097 57966 74700 54536 29745 35451 6448 -21812
7218 -21812 -29728 -24062 -23168 -35436 -18439 -21662 -17327 -25568 -26134 -46508 -62372 -33905 -9487 19807
7204 19807 13810 13043 27026 29363 26113 -6818 5368 17629 13542 3598 -26432 -57953 -58775 -31351
7190 -31351 -6426 -205 -6161 7612 29982 31509 13644 -2624 -20108 -16539 -18921 -28667 -16178
$$ packed form
7282a9271j968K689j4299k662j2860O734J1911N168J7830j833J8087J9049K671
7269C1246j1233J904j6340m418P961N826J5097K559k3826J4040J8472r038j635
7256C0615M386k465J1941r01r524l6651k3616j2700k0080R793K5152K6767K1962
7243B4679k6503r446r884j5560P096J299L2502K7746j9007j9909k0354j3658m216
7230d5215L2356J1502q137Q678L6913K1869J6734k0164k4791N706k9003k8260
7218b1812p916N666Q94j2268J6997l223M335q241n66k0374j5864K8467K4418K9294
7204A9807n997p67J3983K337l250l2931J2186J2261m087r944l0030l1521q22K7424
7190c1351K4925O221n956J3773K2370J527j7865j6268j7484L569k382r746J2489
$$ plain form
7177 -16178 -614 -46 4705 11677 23924 22391 16899 24509 26474 43169 38141 28415 90 -16110
7163 -16110 -8891 -27844 -20075 7030 15423 -12582 -32051 -33768 -10741 15469 15845 11079 -8908
7150 -8908 23772 26341 15567 4809 -25197 -27957 -31264 -12884 -6120 -18822 -16513 5028 -9030
7137 -9030 -43025 -56769 -39332 -34056 -19605 6649 4686 11511 18660 10092 9559 23329 25175 6701
7123 6701 -5718 -15844 -15783 -39123 -55486 -62574 -34785 -7698 9043 6854 -11154 -24149 -10077
7110 -10077 -16889 -15777 10449 17423 10246 9252 8124 -13216 -10294 6840 24373 4752 -15956
7097 -15956 -15243 -11518 8621 -11104 -1524 7394 1129 -17592 -24053 -14654 -14879 -13677 -14997 -19633
7083 -19633 7660 36140 23756 9709 -17217 -29186 -2427 6849 3853 -22493 -53054 -41368
$$ packed form
7177a6178J5564N68M751O972J2247j533n492P610J965J6695n028r726k8325j6200
7163a6110P219j8953P769K7105Q393k8005j9469j717K3027K6210L76m766j9987
7150h908L2680K569j0774j0758l0006k760l307J8380O764j2702K309K1541j4058
7137i030l3995j3744J7437N276J4451K6254j963O825P149q568n33J3770J846j8474
7123F701j2419j0126O1k3340j6363p088K7789K7087J6741k189j8008j2995J4072
7110a0077o812J112K6226O974p177r94j128k1340K922J7134J7533j9621k0708
7097a5956P13L725K0139j9725R580Q918o265j8721o461R399k25J202j320m636
7083a9633K7293K8480j2384j4047k6926j1969K6759R276k996k6346l0561J1686
$$ plain form
7071 -41368 -26861 3500 19065 30139 57375 45377 42145 58248 36942 12792 33342 41219
7059 41219 31344 19972 13755 8390 8183 9696 7040 -26259 -16398 28005 51369 53928 41107 20279
7045 20279 24817 39773 51737 25008 2682 -27001 800 46064 45424 33277 12143 10759 36273
7032 36273 64093 63915 22951 13737 -2715 -23201 -17908 -9514 -12422 -22844 -9359 -10063 -8621 -10376
7018 -10376 -33452 -46183 -41220 -34950 -21484 -12711 -8617 -21344 -37575 -48731 -21913 17758 38240
7005 38240 22661 31690 27964 39429 57088 37307 -3680 -41274 -44602 -33080 -18250 -21027 -28793
6992 -28793 -19793 -31019 -41364 -38179 -10254 862 10598 1125 -1340 5639 -5506 -2018 29950
6979 29950 38452 15541 -4166 -7851 30411 40125 38134 43035 37693 33090 44405 59069 61400
$$ packed form
7071d1368J4507L0361J5565J1074K7236j1998l232J6103k1306k4150K0550P877
7059D1219r875j1372o217n365k07J513k656l3299R861M4403K3364K559j2821k0828
7045B0279M538J4956J1964k6729k2326k9683K7801M5264o40j2147k1134j384K5514
7032C6273K7820j78m0964r214j6452k0486N293Q394k908j0422J3485p04J442j755
7018a0376k3076j2731M963O270J3466Q773M094j2727j6231j1156K6818L9671K0482
7005C8240j5579R029l726J1465J7659j9781m0987l7594l328J1522J4830k777p766
6992b8793R000j1226j0345L185K7925J1116R736r473k465O979j1145L488L1968
6979B9950Q502k2911j9707l685L8262R714j991M901n342m603J1315J4664K331
$$ plain form
6966 61400 27892 30316 31083 -12239 -24589 16306 46662 31128 3178 26303 55395 48896 58104
6953 58104 49914 22424 16582 34039 25979 4739 -26390 -12261 -28054 -40148 -16893 -20958 -20520
6940 -20520 -7549 18309 -6670 -27308 -25301 -27926 -10170 -2145 1620 -11851 -24930 -23678 -20551
6927 -20551 -17060 7960 20023 1252 -6716 13962 9459 -37084 -23518 13579 29030 31357 33425
6914 33425 26966 -18453 -14675 -16317 -33501 -50361 -25622 23752 18465 5000 -8810 -1891 -13184
6901 -13184 -11472 -2331 6980 13566 -2437 -16838 -7233 16467 -2847 -10635 -7860 -14583 1293
6888 1293 -2317 14360 9471 -3379 5737 6500 -13404 -9294 -24771 -14073 -6892 -18439 -29734
6875 -29734 -21406 -16794 -31334 -33374 -24166 -13700 -10985 -12354 -23328 -28692 -21077 -31515 -50769
$$ packed form
6966F1400l3508K424P67m3322j2350M0895L0356j5534k7950K3125K9092o499R208
6953E8104q190k7490n842J7457q060k1240l1129J4129j5793j2094K3255m065M38
6940b0520J2971K5858k4979k0638K007k625J7756Q025L765j3471j3079J252L127
6927b0551L491K5020J2063j8771p968K0678m503m6543J3566L7097J5451K327K068
6914C3425o459m5419L778j642j7184j6860K4739M9374n287j3465j3810O919j1293
6901a3184J712R141R311O586j6003j4401R605K3700j9314p788K775o723J5876
6888A293l610J6677m889j2850R116P63j9904M110j5477J0698P181j1547j1295
6875b9734Q328M612j4540k040R208J0466K715j369j0974n364P615j0438j9254
$$ plain form
6862 -50769 -35740 -20087 -14464 -14880 -7498 -16411 -14903 -17475 -20586 -10899 9516 -18040 -27916 -12429
6848 -12429 -10841 -1732 16751 2604 18775 28591 33680 25640 23476 16142 -31969 -19097 6394
6835 6394 -987 17543 15835 8566 7902 18529 8320 -23279 -7378 26896 5727 5110 17844
6822 17844 17318 -4178 -3731 7520 -6513 18489 9858 -28252 -42638 -17431 33 8449 7916
6809 7916 -12826 -7116 5904 10703 6931 -8435 1728 -3641 -42186 -20227 2335 5730 -6203
6796 -6203 -31405 -9481 3506 4826 23825 34671 40274 32594 30628 12290 -21102 3064 13458
6783 13458 -6185 -13461 9611 16476 -10924 -49139 -32567 19821 21708 19859 40487 56960 70448
6770 70448 63654 38469 34805 34362 27627 10216 3377 2139 20159 11724 -20422 -11337 -44041 -57805
$$ packed form
6862e0769J5029J5653N623m16P382q913J508k572l111R687K0415k7556r876J5487
6848a2429J588R109J8483j4147J6171R816N089q040k164p334m8111J2872K5491
6835F394p381J8530j708p269o64J0627j0209l1599J5901L4274k1169o17J2734
6822A7844n26k1496M47J1251j4033K5002q631l8110j4386K5207J7464Q416n33
6809G916k0742N710J3020M799l772j5366J0163n369l8545K1959K2562L395j1933
6796f203k5202K1924J2987J320J8999J0846N603p680j966j8338l3392K4166J0394
6783A3458j9643p276K3072O865k7400l8215J6572N2388J887j849K0628J6473J3488
6770G0448o794k5185l664m43o735j7411o839j238J8020q435l2146R085l2704j3764
$$ plain form
6756 -57805 -19671 1430 -22293 -37176 -47826 -44717 -39419 12293 30549 3917 -28131 -8535
6744 -8535 21985 20679 19179 39206 33118 15485 5871 -2293 15725 36324 31255 19046 37783
6731 37783 35011 43075 53941 64282 75878 50009 49624 53584 56260 73381 89607 73748 69702
6718 69702 95757 129938 140466 131356 131498 129178 122301 94838 85423 95042 96926 96733 112594 116395
6704 116395 124479 115145 129416 159648 165871 188148 236664 283296 357283 445676 595546 769071
6692 769071 1015869 1333100 1735717 2001660 1947767 1581326 1084843 726467 514413 371467
6682 371467 254723 187780 155079 136266 102559 103124 96754 82200 58510 60836 81438 82141 62114
6669 62114 32535 34809 68359 102446 87864 30149 12049 29647 55512 81800 84590 75090
$$ packed form
6756e7805L8134K1101k3723j4883j0650L109N298N1712J8256k6632l2048J9596
6744h535L0520j306j500K0027o088j7633r614q164J8018K0599n069j2209J8737
6731C7783k772Q064J0866J0341J1596k5869l85L960K676J7121J6226j5859m046
6718F9702K6055L4181J0528r110J42k320o877k7463r415R619J884j93J5861L801
6704A16395Q084r334J4271L0232O223K2277M8516M6632P3987Q8393J49870J73525
6692G69071K46798L17231M02617K65943n3893l66441m96483l58376k12054j42946
6682C71467j16744o6943l2701j8813l3707N65o370j4554k3690K326K0602P03k0027
6669F2114k9579K274L3550L4087j4582n7715j8100J7598K5865K6288K790r500
$$ plain form
6657 75090 63557 71117 59207 42140 43141 27697 22560 23928 53376 26520 -6934 -29331 -15915
6644 -15915 -14254 -25047 -31854 -35089 -47862 -62085 -60354 -54327 -25054 -1774 5590 1671 7989
6631 7989 -7519 -19274 -36880 -53376 -13247 16482 19690 24194 26830 24776 1699 -26737 -8814
6618 -8814 -2391 22923 25096 -6042 -4420 -7983 -16924 -21128 -20808 -8674 -6756 -2945 5708 -1061
6604 -1061 -25457 -29171 -339 40017 17739 -12339 -15672 2989 23307 28874 -5868 -36602 -47188
6591 -47188 -35965 4189 13751 14810 -1187 -12174 -12564 -1963 17241 10525 620 -25366 -1620
6578 -1620 10923 5849 -17473 -35481 -39887 -32926 -15727 11608 3589 4400 15858 22549 29918 16924
6564 16924 6706 18913 28599 32831 33088 16688 -8841 11461 6204 -11285 -8477 -906 -10856
$$ packed form
6657G5090j1533P560j1910j7067J001j5444n137J368K9448k6856l3454k2397J3416
6644a5915J661j0793o807l235j2773j4223J731O027K9273K3280P364l919O318
6631G989j5508j1755j7606j6496M0129K9729L208M504K636k054k3077k8436J7923
6618h814O423K5314K173l1138J622l563q941m204L20J2134J918L811Q653o769
6604a061k4396l714K8832M0356k2278l0078l333J8661K0318N567l4742l0734j0586
6591d7188J1223M0154R562J059j5997j0987l90J0601J9204o716r905k5986K3746
6578a620J2543n074k3322j8008m406O961J7199K7335q019Q11J1458O691P369j2994
6564A6924j0218J2207R686M232K57j6400k5529K0302n257j7489K808P571r950
$$ plain form
6551 -10856 -52588 -56672 -35981 10800 36259 18914 19842 29777 71591 27234 -3127 -7939 -3726
6538 -3726 21772 10466 2961 -2207 -58912 -54515 -32598 -31870 -40436 -20524 24807 30960 12271
6525 12271 14963 22504 12669 5451 17435 -6705 -27088 -29695 -27036 -6215 -21680 -27150 -29026
6512 -29026 -28635 -11602 5129 2814 -19009 -47033 -60267 -63830 -53396 -53217 -55377 -42368 -11362
6499 -11362 -6588 9648 -3946 -9924 -17501 -7426 -6567 2743 12760 35935 9223 -12006 -17371
6486 -17371 3693 17637 -6246 -3339 1094 -21590 -11946 -8126 -29852 -12512 13609 -10439 -16138
6473 -16138 -44719 -53700 -13756 -15691 -21055 -4272 22657 23879 30595 38516 30139 -17954 -25836
6460 -25836 -20521 -28069 -50491 -18424 6261 -7961 -5204 13829 -8291 -30984 -29365 10640 22206
$$ packed form
6551a0856m1732m084K0691M6781K5459j7345R28R935M1814m4357l0361m812M213
6538c726K5498j1306p505n168n6705M397K1917P28q566J9912M5331O153j8689
6525A2271K692P541r835p218J1984k4140k0383k607K659K0821j5465n470j876
6512b9026L91J7033J6731k315k1823k8024j3234l563J0434J79k160J3009L1006
6499a1362M774J6236j3594n978p577J0075Q59R310J0017K3175k6712k1229n365
6486a7371K1064J3944k3883K907M433k2684R644L820k1726J7340K6121k4048n699
6473a6138k8581q981L9944j935n364J6783K6929J222O716P921q377m8093p882
6460b5836N315p548k2422L2067K4685j4222K757J9033k2120k2693J619M0005J1566
$$ plain form
6447 22206 9520 13942 27742 27839 27188 36395 60452 45301 17581 10883 8463 23649 29133 27954
6433 27954 14489 -2815 8108 13060 3097 22080 14242 -17690 -14153 -28591 -23977 -5076 518
6420 518 -2249 -22544 -14782 17506 6638 -5528 -22404 -43962 -62086 -78220 -46434 -9720 -6721
6407 -6721 -4332 14587 12069 9172 -3456 -18853 -10251 3642 -14562 -29299 -40214 -6151 32514
6394 32514 30139 9172 -19935 -16684 -5153 -18877 -25522 -37619 -43838 -48323 -42752 -29824 -15074
6381 -15074 -15345 4881 26660 14945 11226 24783 15205 17591 20151 11953 11098 3864 -3 -21994
6367 -21994 -43013 -46801 -39512 -54727 -61844 -16664 -7541 -8483 -19507 -29379 -50232 -35508 -1771
6354 -1771 17640 12209 -12235 -16974 -18462 -23432 -29573 -17230 -31375 -30368 -34617 -41156 -42938 -23536
$$ packed form
6447B2206j2686M422J3800R7o51R207K4057j5151k7720o698k420J5186N484j179
6433B7954j3465j7304J0923M952r963J8983p838l1932L537j4438M614J8901N594
6420E18k767k0295P762L2288j0868j2166j6876k1558j8124j6134L1786L6714K999
6407f721K389J8919k518k897j2628j5397Q602J3893j8204j4737j0915L4063L8665
6394C2514k375k0967k9107L251J1531j3724o645j2097o219m485N571J2928J4750
6381a5074k71K0226K1779j1715l719J3557r578K386K560q198q55p234l867k1991
6367b1994k1019l788P289j5215p117M5180R123r42j1024r872k0853J4724L3737
6354a771J9411n431k4444m739j488m970o141J2343j4145J007m249o539j782J9402
$$ plain form
6340 -23536 -30542 -35481 -15676 -29570 -40383 -13695 -4932 -18613 15979 21626 21557 13519 -1927
6327 -1927 -38232 -35233 -41004 -16718 8876 9002 29090 8766 -12971 -22013 -28482 2081 16119
6314 16119 14938 29418 37815 23711 8667 -9196 -6059 7585 -3812 4965 12516 27453 18190
6301 18190 35542 40839 23978 15105 20393 7086 4000 -8302 -41077 -67556 -51218 -37309 -31845
6288 -31845 -12394 -7694 -1580 -19153 -36705 -33245 -32236 -2482 -72 16087 10238 -12679 -25842
6275 -25842 -21015 -8663 -4694 -1258 -3396 -35001 -25023 -10677 -11098 -35799 -39875 -28650 -16777
6262 -16777 -4286 -18405 -21934 -28281 689 -10470 -17990 -4245 1425 -16398 -13248 803 19670
6249 19670 35804 27674 16274 10432 14550 -7437 -35132 -39351 -16083 6679 -5199 -5757 -21372
$$ packed form
6340b3536p006m939J9805j3894j0813K6688Q763j3681L4592N647o9q038j5446
6327a927l6305K999n771K4286K5594J26K0088k0324k1737r042o469L0563J4038
6314A6119j181J4480Q397j4104j5044j7863L137J3644j1397Q777P551J4937r263
6301A8190J7352N297j6861q873N288j3307l086j2302l2775k6479J6338J3909N464
6288c1845J9451M700O114j7573j7552L460J009K9754K410J6159n849k2917j3163
6275b5842M827J2352L969L436k138l1605R978J4346m21k4701m076J1225J1873
6262a6777J2491j4119l529o347K8970j1159p520J3745N670j7823L150J4051J8867
6249A9670J6134q130j1400n842M118k1987k7695m219K3268K2762j1878n58j5615
$$ plain form
6236 -21372 -30306 -44507 -20788 -2983 -4352 6300 -6086 -32680 -37650 -26237 -23178 -38602 -4114
6223 -4114 33558 10689 -4198 -20932 -20690 -5872 -16202 -20963 -1643 -2708 -1318 -4912 -15231
6210 -15231 -19085 -21377 -23349 -22726 -31170 -22714 -42576 -60607 -42836 -10948 14204 27816 27899 32967
6196 32967 27438 -358 -16273 -16467 -39659 -36706 -58731 -56887 -38985 -2273 16417 21084 4855
6183 4855 33575 93897 84663 59541 5968 -6132 21037 13824 -7391 -2036 -1692 -23030 -36559
6170 -36559 -29370 -6694 -2875 12157 3128 -2209 -11477 -30000 -50218 -36583 -13089 15159 15422
6157 15422 32038 24281 -575 -35237 -40281 -27315 -12641 -24028 -36966 -11575 1117 -4706
6145 -4706 -11842 -7489 3311 -2906 1310 17035 26723 55400 35707 16572 22058 17351 -16212
$$ packed form
6236b1372q934j4201K3719J7805j369J0652j2386k6594m970J1413L059j5424L4488
6223d114L7672k2869j4887j6734K42J4818j0330m761J9320j065J390l594j0319
6210a5231l854k292j972O23q444Q456j9862j8031J7771L1888K5152J3612Q3N068
6196C2967n529k7796j5915j94k3192K953k2025J844J7902L6712J8690M667j6229
6183D855K8720O0322r234k5122n3573j2100K7169p213k1215N355L44k1338j3529
6170c6559P189K2676L819J5032r029n337r268j8523k0218J3635K3494K8248K63
6157A5422J6616p757k4856l4662n044J2966J4674j1387j2938K5391J2692n823
6145d706p136M353J0800o217M216J5725R688K8677j9693j9135N486m707l3563
$$ plain form
6132 -16212 -38815 -28640 -30453 -32796 -15997 -6062 -19464 -23336 -27240 -473 35536 41192 17412
6119 17412 -3543 -24176 -28285 -63731 -62122 -63388 -31496 -11030 -37980 -24237 -23669 -18751 -10798
6106 -10798 -16653 -21965 -26328 -21934 -40481 -25381 -36132 -30211 -7182 602 -13277 -2855 -6363
6093 -6363 -6738 -12174 -11914 14414 19183 1007 2336 12907 -1163 -19177 -4645 4510 -10512 -4852
6079 -4852 13581 13303 15238 -25688 -37838 -15033 3216 9417 -19407 -35161 -11897 4891 9044
6066 9044 4721 -1965 -13035 -18621 -2942 1359 15916 -10931 -17893 -22610 -36010 -41747 -35669 -31106
6052 -31106 -30755 -22001 -14097 -30345 -34184 -1161 -5202 -32706 -47187 -25551 2519 588 -9019
6039 -9019 -21129 -21653 -13350 -27695 -38126 -21994 -5637 1940 17174 18368 -17193 -66348 -67669
$$ packed form
6132a6212k2603J0175j813k343J6799R935j3402l872l904K6767L6009N656k3780
6119A7412k0955k0633m109l5446J609j266L1892K0466k6950J3743N68M918P953
6106a0798n855n312m363M394j8547J5100j0751N921K3029P784j3879J0422l508
6093f363l75n436K60K6328M769j8176J329J0571j4070j8014J4532R155j5022N660
6079d852J8433k78J935m0926j2150K2805J8249O201k8824j5754K3264J6788M153
6066I044m323o686j1070n586J5679M301J4557k6847o962m717j3400n737O078M563
6052c1106L51Q754P904j6248l839L3023m041k7504j4481K1636K8070j931r607
6039i019j2110n24Q303j4345j0431J6132J6357P577J5234J194l5561m9155j321
$$ plain form
6026 -67669 -34624 -8653 -13516 -306 9355 26876 16284 -20106 -5276 -8501 -18327 -7228 -17964
6013 -17964 -38115 -39164 -41418 -59998 -69755 -78134 -62063 -34726 -23231 -38454 -28989 -26365 -48738
6000 -48738 -3965 36806 21232 17371 -22324 -23573 -30007 -4659 27944 28258 27040 57650 40925
5987 40925 1062 1027 -4152 -26069 -69887 -50896 -25963 -33136 -24197 -12425 -18173 -55787 -66525
5974 -66525 -42512 -48087 -33856 -23624 -28849 -21103 9546 16319 1612 7467 23256 7286 7990
5961 7990 29498 48229 38080 28280 11317 -7642 -95 5792 13313 1615 12704 -5283 8724
5948 8724 -603 -1815 -16963 -41902 -58251 -49724 -36924 -17337 4267 1848 -20183 -30125 -31797
5935 -31797 -33314 -34267 -15324 21214 3917 -3206 -14251 -20105 -20240 -8013 -4703 -2279 9316 -8841
$$ packed form
6026f7669L3045K5971m863J3210R661J7521j0592l6390J4830l225r826J1099j0736
6013a7964k0151j049k254j8580r757q379J6071K7337J1495j5223R465K624k2373
6000d8738M4773M0771j5574l861l9695j249o434K5348L2603L14j218L0610j6725
5987D0925l9863l5n179k1917m3818J8991K4933p173Q939J1772n748l7614j0738
5974f6525K4013n575J4231J0232n225P746L0649O773j4707N855J5789j5970P04
5961G990K1508J8731j0149r800j6963j8959P547N887P521j1698J1089j7987J4007
5948H724r327j212j5148k4939j6349Q527J2800J9587K1604k419k2031r942j672
5935c1797j517r53J8943L6538j7297p123j1045n854j35J2227L310K424J1595j8157
$$ plain form
5921 -8841 -19113 -28015 -51299 -71653 -44438 -16983 -16426 -6874 2744 -9053 -25205 -11410 9018
5908 9018 17905 3821 -8203 -28913 -11906 -1050 -483 -10572 -31277 -31937 -6828 -10508 -10455 -19632
5894 -19632 -8843 8758 -1148 22802 -2900 -9951 -32311 -24084 -6895 8110 20741 7406
5882 7406 25274 9977 -10848 -16161 -27238 -32483 -37577 -41199 -26983 -20142 -51332 -68745 -75192
5869 -75192 -70536 -48068 -15052 -5292 8207 5694 11197 2378 -16754 15 1920 -12460 -17583
5856 -17583 -25211 -36521 -40827 -40608 -37623 -7557 23018 33142 35509 20127 18031 14588 32722
5843 32722 2070 7362 6223 25598 6949 -1892 -14197 -1224 17262 15350 19904 27439 42447
5830 42447 22805 -2244 15868 18718 -15991 -16553 -3361 15915 15971 -11226 -16097 -3703 -4121 -11238
$$ packed form
5921h841j0272q902k3284k0354K7215K7455N57R552R618j1797j6152J3795K0428
5908I018Q887j4084j2024k0710J7007J0856N67j0089k0705o60K5109l680N3r177
5894a9632J0789J7601r906K3950k5702p051k2360Q227J7189J5005J2631j3335
5882G406J7868j5297k0825n313j1077n245n094l622J4216O841l1190j7413o447
5869g5192M656K2468L3016R760J3499k513N503q819j9132J6769J905j4380n123
5856a7583p628j1310m306K19K985L0066L0575J0124K367j5382k096l443J8134
5843C2722l0652N292j139J9375j8649q841j2305J2973J8486j912M554P535J5008
5830D2447j9642k5049J8112K850l4709n62J3192J9276N6k7197m871J2394m18p117
$$ plain form
5816 -11238 -32407 -60238 -47118 -19477 -2958 17370 18489 -12228 -11188 -2948 -4603 -13390 -24050
5803 -24050 -7412 6892 -10413 -4287 20749 10541 5618 35031 25173 14408 25142 38388
5791 38388 37452 16843 -21252 -33056 -17087 -21680 -13626 -5804 11020 11103 2328 11615 4763 1564
5777 1564 2078 3189 8376 26921 35462 37451 50733 20664 -11404 13496 23823 12281 -18452
5764 -18452 3003 17185 12919 20806 31753 7906 -19456 -3234 -23571 -24338 -13234 -15208 -15605
5751 -15605 -24706 -17289 -3367 2475 10170 24037 -437 -13264 2586 3128 16470 24805 13417
5738 13417 4584 6402 -10729 13825 17386 -24003 -18247 9809 8583 3430 -15369 -31115 -61005
5725 -61005 -69803 -51088 -42698 -20852 -10453 -17622 -21459 -13829 -18668 -21081 -35200 -37721 -28676 -13859
$$ packed form
5816a1238k1169k7831J3120K7641J6519K0328J119l0717J040Q240j655q787j0660
5803b4050J6638J4304j7305O126K5036j0208m923K9413r858j0765J0734J3246
5791C8388r36k0609l8095j1804J5969m593Q054P822J6824Q3q775R287o852l199
5777A564N14J111N187J8545Q541J989J3282l0069l2068K4900J0327j1542l0733
5764a8452K1455J4182m266P887J0947k3847k7362J6222k0337p67J1104j974l97
5751a5605r101P417J3922N842P695J3867k4474j2827J5850N42J3342Q335j1388
5738A3417q833J818j7131K4554L561m1389N756K8056j226n153j8799j5746k9890
5725f1005q798J8715Q390K1846J0399p169l837P630m839k413j4119k521R045J4817
$$ plain form
5711 -13859 -21244 -10190 -18075 -19827 -20712 -31322 -31076 -35412 -50887 -12106 2133 31485 29716 10967
5697 10967 -17311 -26807 -18297 -21952 -34564 -38497 -33014 5559 29047 5194 -39027 -45348 -44326
5684 -44326 -33284 -21877 -14127 5066 13734 9377 3201 6433 9440 -20973 -31616 -6645 -9714
5671 -9714 -16308 -16376 -33000 -29352 -37488 -47744 -41433 -22093 -11964 -9517 -35380 -35612 2592 -8387
5657 -8387 -2808 16516 -12747 -56275 -59456 -46873 -24066 -52036 -65191 -51960 13785 22588 5262
5644 5262 -721 12412 -6231 -19567 -35031 -23668 -7890 -40071 -37897 -9391 -9308 1290 -13262
5631 -13262 -22367 -9952 4373 -25015 -62095 -57055 -37868 -45151 -41048 -31324 -31154 -28457 -32970 -17191
5617 -17191 -14240 -9799 -32811 -40073 -22464 -44125 -72376 -62279 -28932 -12189 -27466 -17501 -8013
$$ packed form
5711a3859p385J1054p885j752q85j0610K46m336j5475L8781J4239K9352j769j8749
5697A0967k8278r496Q510l655j2612l933N483L8573K3488k3853m4221o321J022
5684d4326J1042J1407P750J9193Q668m357o176L232L007l0413j0643K4971l069
5671i714o594o8j6624L648q136j0256O311J9340J0129K447k5863k32L8204j0979
5657h387N579J9324k9263m3528l181J2583K2807k7970j3155J3231O5745Q803j7326
5644E262n983J3133j8643j3336j5464J1363J5778l2181K174K8506Q3J0598j4552
5631a3262r105J2415J4325k9388l7080N040J9187p283M103R724J70K697m513J5779
5617a7191K951M441k3012p262J7609k1661k8251J0097L3347J6743j5277R965R488
$$ plain form
5604 -8013 -18132 -39388 -43567 -33894 -11367 -6598 -19768 -45464 -42584 -39305 -19384 -26408 -26133 -21022
5590 -21022 -2522 -9477 -33981 -31620 -21430 16946 21344 -15181 -38127 -29850 -38945 -35270 -31517
5577 -31517 -24944 -20458 5516 28116 36413 33881 28281 25169 12251 4617 -2769 -9913 -4773 10524
5563 10524 35128 35855 22050 15841 -18524 -27994 -26780 -8250 -6983 -31784 -47483 -28734 -14625
5550 -14625 -39073 -49720 -26374 -4574 22778 5940 5870 7061 -1704 -26777 -36393 -36109 -38349 -12737
5536 -12737 6233 17901 4649 -30190 -27984 -6877 -5808 -22023 -19312 -3046 -972 -25756 -23711
5523 -23711 -6305 -18704 -15111 -2347 10671 31464 52750 33565 16293 -14568 -6220 16486
5511 16486 -17633 -20204 -18162 -22306 -11252 -25058 -2107 -1929 -26468 1692 19856 20509 25996
$$ packed form
5604h013j0119k1256m179R673K2527M769j3170k5696K880L279J9921p024K75N111
5590b1022J8500o955k4504K361J0190L8376M398l6525k2946Q277r095L675L753
5577c1517O573M486K5974K2600Q297k532n600l112j2918p634p386p144N140J5297
5563A0524K4604P27j3805o209l4365r470J214J8530J267k4801j5699J8749J4109
5550a4625k4448j0647K3346K1800K7352j6838p0J191q765k5073r616K84k240K5612
5536a2737J8970J1668j3252l4839K206K1107J069j6215K711J6266K074k4784K045
5523b3711J7406j2399L593J2764J3018K0793K1286j9185j7272l0861Q348K2706
5511A6486l4119k571K042m144J1054j3806K2951J78k4539K8160J8164O53N487
$$ plain form
5498 25996 30521 -2642 -28948 -56885 -75838 -70298 -60386 -53726 -30515 -18253 -26362 -51747 -48008
5485 -48008 -21973 -20348 -23898 -21212 -15723 -4819 -2025 -29261 -42103 -44353 -35022 -26792 -44280
5472 -44280 -51054 -40005 -25679 -29924 -14485 1731 -5982 -1914 -4264 -18627 -19298 -6761 -13953
5459 -13953 -25980 -23317 -6728 -11638 -39322 -27406 7588 -5117 -31360 -21967 -35902 -42171 -30230
5446 -30230 -26270 -27301 -38031 -34375 -15192 -3787 -18686 -42647 -18344 11106 4030 -32205 -25261
5433 -25261 -32179 -20548 -6230 -68 1865 -21090 -47396 -69452 -61903 -52071 -46462 -43073 -23874
5420 -23874 1134 22753 19640 15838 15427 3211 -7873 -3987 11283 8523 24230 23685 -6996
5407 -6996 -3807 -4220 -21012 14578 49836 36688 -5704 -16039 -38648 -32732 -20295 -37500 -34915
$$ packed form
5498B5996M525l3163k6306k7937j8953N540R912O660K3211J2262q109k5385L739
5485d8008K6035J625l550K686N489J0904K794k7236j2842k250R331Q230j7488
5472d4280o774J1049J4326m245J5439J6216p713M068k350j4363o71J2537p192
5459a3953j2027K663J6589m910k7684J1916L4994j2705k6243R393j3935o269J1941
5446c0230L960j031j0730L656J9183J1405j4899k3961K4303K9450p076l6235O944
5433b5261o918J1631J4318O162J933k2955k6306k2056P549R832N609L389J9199
5420b3874K5008K1619l113l802m11j2216j1084L886J5270k760J5707n45l0681
5407f996L189m13j6792L5590L5258j3148m2392j0335k2609N916J2437j7205K585
$$ plain form
5394 -34915 -7750 11767 -11970 -27131 -28662 -26099 -4818 14169 23577 -1561 -23924 12028
5382 12028 14385 3521 -16866 -3493 -2312 -1206 24145 19624 25708 14340 19159 14820 166
5369 166 -22583 -30256 -15119 -3138 -10872 -1410 18603 12875 9398 14478 -19719 -21363 -14488 11676
5355 11676 -5489 -30735 -42452 -52282 -15019 -8563 8475 -1403 -13368 -1529 -7196 2679 19316
5342 19316 -839 -2942 -17337 -4984 -9027 -29590 -14549 35470 32466 18384 -1644 -1823 -753
5329 -753 6967 22340 52602 54115 26859 2218 -17030 -27024 -8555 -10688 -24667 -536 4965
5316 4965 -6287 -14015 -42959 -70378 -36994 -27965 -23 -16769 -14122 -17997 -22267 -7585 22726
5303 22726 18319 -10939 -34848 -20654 -27812 -34517 -35847 -53407 -86300 -49615 -18289 -2921 -17912
$$ packed form
5394c4915K7165J9517k3737j5161j531K563K1281J8987R408k5138k2363L5952
5382A2028K357j0864k0387J3373J181J106K5351m521O084j1368M819m339j4654
5369A66k2749p673J5137J1981p734R462K0013n728l477N080l4197j644O875K6164
5355A1676j7165k5246j1717r830L7263O456J7038r878j1965J1839n667R875J6637
5342A9316k0155k103j4395J2353m043k0563J5041N0019l004j4082k0028j79J070
5329g53P720J5373L0262J513k7256k4641j9248r994J8469k133j3979K4131N501
5316D965j1252p728k8944k7419L3384R029K7942j6746K647l875m270J4682L0311
5303B2726m407k9258k3909J4194p158o705j330j7560l2893L6685L1326J5368j4991
$$ plain form
5290 -17912 -15455 -25408 -34697 -38463 -28135 -26334 -10803 16872 34223 20292 2697 -14721 -24616
5277 -24616 -28653 -13125 -7319 -19493 10833 19687 36060 44298 30573 33649 29095 19405 -3098
5264 -3098 21506 -5135 -9599 -13965 -34845 -28312 -44723 -67869 -43074 2607 16641 10853 -10008
5251 -10008 -9210 -18437 -50258 -49189 -45587 -44631 -7282 6478 7581 -16166 -38144 -41243 -11931 7520
5237 7520 8742 5667 10501 24504 33083 3686 -20270 -13998 -13990 -23651 -16128 -21164 -15550 -1552 16623
5222 16623 7779 10128 -16055 -25326 -16925 -8767 5922 33035 25462 4553 3386 21199 34365
5209 34365 6169 -18675 -50033 -74107 -63968 -47939 -49914 -34592 8598 8173 573 5438 -2613
5196 -2613 -20509 -17038 8027 17426 12639 10308 8157 -13755 -31565 -31692 -17624 10821 511
$$ packed form
5290a7912K457r953r289l766J0328J801J5531K7675J7351j3931j7595j7418r895
5277b4616m037J5528N806j2174L0326Q854J6373Q238j3725L076m554r690k2503
5264c098K4604k6641m464m366k0880O533j6411k3146K4795M5681J4034n788k0861
5251a0008P98r227l1821J069L602R56L7349J3760J103k3747k1978l099K9312J9451
5237G520J222l075M834J4003Q579k9397k3956O272Qr661P523n036N614J3998J8175
5222A6623q844K349k6183r271Q401Q158J4689K7113p573k0909j167J7813J3166
5209C4365k8196k4844l1358k4074J0139J6029j975J5322M3190m25p600M865q051
5196b613j7896L471K5065R399m787k331k151k1912j7810j27J4068K8445j0310
$$ plain form
5183 511 -33879 -49644 -35205 -28816 -7951 1225 -1301 -4206 -26416 -33591 -17465 -871 -7714
5170 -7714 -2123 2196 -10157 -38145 -54852 -48490 -38588 -57953 -45819 -23176 4535 37789 56926
5157 56926 32383 37739 35501 15466 -30042 -16446 1416 189 -7072 -49638 -69506 -8042 34002
5144 34002 28267 24875 22461 -1321 7606 11288 -14902 -39777 -72241 -69479 -56746 -24892 10663
5131 10663 17516 29973 8218 -9428 -938 -24449 -45723 -43181 -28763 -14267 6996 25570
5119 25570 -3279 -7698 12966 8791 -4461 -25048 -43733 -33345 -6361 -17715 -14594 -10375 -4873
5106 -4873 -9271 9427 -511 13218 23586 103 -9068 -24226 -26734 -38521 -15950 -10271 -43534
5093 -43534 -64694 -96260 -94437 -70231 -51696 -19619 -4750 7079 -18592 -14981 -8561 -11357 10259
$$ packed form
5183E11l4390j5765J4439O389K0865R176k526k905k2210p175J6126J6594o843
5170g714N591M319j2353k7988j6707O362R902j9365J2134K2643K7711L3254J9137
5157E6926k4543N356k238k0035m5508J3596J7862j227p261m2566j9868O1464M2044
5144C4002n735l392k414k3782Q927L682k6190k4875l2464K762J2733L1854L5555
5131A0663O853J2457k1755j7646Q490k3511k1274K542J4418J4496K1263J8574
5119B5570k8849m419K0664m175j3252k0587j8685J0388K6984j1354L121M219N502
5106d873m398J8698r938J3729J0368k3483r171j5158k508j1787K2571N679l3263
5093d3534k1160l1566J823K4206J8535L2077J4869J1829k5671L611O420k796K1616
$$ plain form
5080 10259 35743 27318 31086 27790 9725 -5015 -23279 -28385 -37282 -19049 -13153 -46665 -39816
5067 -39816 -13445 -29869 -21486 -19875 -38920 -22655 8361 5882 8172 12041 -2440 9762 29949
5054 29949 33118 16347 10476 8834 2973 13373 19301 9483 -28167 -61055 -43184 -8705 6351
5041 6351 17036 29223 24629 -1689 -492 591 -43910 -63282 -64239 -68717 -53833 -21759 6947
5028 6947 -7826 -3516 2341 4597 5441 -9389 -36009 -7279 -1943 -9191 -20469 -26809 -30114 -38077
5014 -38077 -6441 4121 -4910 8207 -1006 -10622 -26134 -31405 -9745 19433 30779 46155 70903
5001 70903 40883 15813 -9129 -15150 7872 26077 9406 -14179 -39171 -45541 -51313 -49773 -24135
4988 -24135 -8751 -4347 -29964 -39731 -14641 -2565 -252 -4493 -21938 -4904 13333 1446 10400
$$ packed form
5080A0259K5484q425L768l296j8065j4740j8264n106q897J8233N896l3512O849
5067c9816K6371j6424Q383J611j9045J6265L1016k479K290L869j4481J2202K0187
5054B9949L169j6771n871j642n861J0400N928r818l7650l2888J7871L4479J5056
5041F351J0685J2187m594k6318J197J083m4501j9372r57m478J4884L2074K8706
5028F947j4773M310N857K256Q44j4830k6620K8730N336p248j1278o340l305p963
5014c8077L1636J0562r031J3117r213r616j5512n271K1660K9178J1346J5376K4748
5001G0903l0020k5070k4942o021K3022J8205j6671k3585k4992o370n772J540K5638
4988b4135J5384M404k5617r767K5090J2076K313m241j7445J7034J8237j1887Q954
$$ plain form
4975 10400 3870 -5132 -13430 -27202 -22824 -27058 -13403 -3807 -12486 -17292 -25007 -12627 -20593 -30421
4961 -30421 -48378 -37394 -2059 -1044 -15319 -11527 -13919 -23607 -26331 -14059 -28231 -43664 -35872
4948 -35872 -20922 -15822 -33875 -43793 -33838 -47594 -51191 -40571 -23324 -1440 2017 -7663 -21187
4935 -21187 -27177 -2760 -1160 -22270 -33873 -28916 -28960 -10411 -11904 -17791 -15411 9751 24461 -4543
4921 -4543 -35001 -5191 3695 4499 20565 31131 25576 5475 -1614 29990 27193 4819 6736
4908 6736 -12718 -25921 -28573 -23205 -49268 -42432 -9452 -9661 -16262 15480 11875 -17957 -33545
4895 -33545 -29860 -20610 -39707 -39449 -39124 -37744 -33359 -24345 -36775 -44076 -24805 -51283 -62556 -30754
4881 -30754 -19069 -4889 -7131 5465 13199 3088 -23887 -20599 4863 -8416 -720 -19497 -42309
$$ packed form
4975A0400o530r002q298j3772M378m234J3655R596q679m806p715J2380p966r828
4961c0421j7957J0984L5335J015j4275L792k392r688k724J2272j4172j5433P792
4948c5872J4950N100j8053r918R955j3756l597J0620J7247K1884L457r680j3524
4935b1187n990K4417J600k1110j1603M957m4J8549j493n887K380K5162J4710k9004
4921d543l0458K9810Q886Q04J6066J0566n555k0101p089L1604k797k2374J917
4908F736j9454j3203k652N368k6063O836L2980k09o601L1742l605k9832j5588
4895c3545L685R250j9097K58L25J380M385R014j2430p301J9271k6478j1273L1802
4881c0754J1685J4180k242J2596P734j0111k6975L288K5462j3279P696j8777k2812
$$ plain form
4868 -42309 -24317 -37695 -1108 5626 -10431 -18163 10393 5415 -3710 -9879 -8882 7206 11778
4855 11778 18563 -7576 -29392 -18118 -30128 -29448 -10141 27131 40143 39702 36254 17059 13075
4842 13075 20526 589 -29504 -6577 -12762 -7588 7714 25715 20642 8363 -19251 -37763 -46055
4829 -46055 -31293 -19947 -18057 -26455 -34042 -61337 -40761 -24658 -33077 -27073 -7775 10610 8883
4816 8883 15585 7265 -158 -8608 1651 1368 -26593 -38423 -47717 -36145 -12092 -17501 -19712 -2338
4802 -2338 4977 7873 957 -11793 -14821 -8924 13336 20482 18468 9513 8461 9210 -10936 -31829
4788 -31829 -54541 -40404 -40929 -42838 -36443 -42222 -47471 -41013 -36717 -28062 -18523 -1587 23177 36547
4774 36547 30642 24342 -9455 -39300 -32973 -2233 -16988 -22099 -22469 -34679 -17047 -19022 -25115
$$ packed form
4868d2309J7992j3378L6587O734j6057p732K8556m978r125o169R97J6088M572
4855A1778O785k6139k1816J1274j2010O80J9307L7272J3012m41l448j9195l984
4842A3075P451j9937l0093K2927o185N174J5302J8001n073j2279k7614j8512q292
4829d6055J4762J1346J890q398p587k7295K0576J6103q419O004J9298J8385j727
4816H883O702q320p423q450J0259k83k7961j1830r294J1572K4053n409k211J7374
4802b338P315K896o916j2750l028N897K2260P146k014q955j052P49k0146k0893
4788c1829k2712J4137n25j909O395n779n249O458M296Q655R539J6936K4764J3370
4774C6547n905o300l3797k9845O327L0740j4755n111l70j2210J7632j975o093
$$ plain form
4761 -25115 -31683 -36833 -16798 -7632 -17623 -13354 -25432 -33400 9825 44346 32664 -2011 -11130
4748 -11130 -43961 -55390 -37010 -32608 -51444 -30134 -12288 -714 -25845 -26935 -8208 3067
4736 3067 40 34152 36520 15602 21155 11368 5217 -22599 -29841 -3104 7384 19867 8904
4723 8904 21148 23684 22219 1760 -40957 -51349 -47776 -18001 9424 3638 -40448 -37692 -31715
4710 -31715 -7768 17671 12688 -2765 -12586 -23278 -21579 -20795 -19317 -13857 -17033 -10009 -27534 -33714
4696 -33714 -10702 -4753 -25841 -45784 -54732 -87142 -64693 -31248 -5917 21434 24500 -9303
4684 -9303 -8105 -14916 -28563 -20423 5548 18540 29331 21274 -19918 -37546 -12279 -32059 -54470
4671 -54470 -43746 -16138 21792 15203 16216 393 -4263 3105 4934 -7791 -10037 12595 22937
$$ packed form
4761b5115o568n150K0035R166r991M269j2078p968M3225L4521j1682l4675r119
4748a1130l2831j1429J8380M402j8836K1310J7846J1574k5131j090J8727J1275
4736C067l027L4112K368k0918N553r787o151k7816p242K6737J0488J2483j0963
4723H904J2244K536j465k0459m2717j0392L573K9775K7425n786m4086K756N977
4710c1715K3947K5439m983j5453r821j0692J699P84J478N460l176P024j7525o180
4696c3714K3012N949k1088j9943q948l2410K2449L3445K5331K7351L066l3803
4684i303J198o811j3647Q140K5971J2992J0791q057m1192j7628K5267j9780k2411
4671e4470J0724K7608L7930o589J013j5823m656P368J829j2725k246K2632J0342
$$ plain form
4658 22937 27129 30821 21216 9747 -13000 -17752 -23523 -38376 -30070 -6223 11546 -476 16576
4645 16576 23684 6233 4272 14873 28792 18565 6680 -14617 -29061 -48040 -43876 -30700
4633 -30700 -15731 -21951 -32676 -41051 -23813 726 26317 47131 22718 -16661 -41850 -10442
4621 -10442 -11345 -34316 -43406 -33378 -25643 -8176 -302 -2696 -15519 6363 25055 30870 28062
4608 28062 20979 -8093 -18010 3724 -28422 -39349 -37834 -7335 11256 -13493 -32915 -20075
4596 -20075 2671 -16427 -28932 -12433 -8198 -34610 -37594 -7 19455 150 -7120 -8958 -8043
4583 -8043 -15563 -17847 -1812 -1077 -10284 -10685 -4127 1411 -2064 6046 4062 -29471 -45385 -38091 -44431
4568 -44431 -60978 -57841 -26146 360 4149 -4994 -6483 -6112 -9753 8373 22861 38998 2979
$$ packed form
4658B2937M192L692r605j1469k2747m752n771j4853Q306K3847J7769j2022J7052
4645A6576P108j7451j961J0601J3919j0227j1885k1297j4444j8979M164J3176
4633c0700J4969o220j0725q375J7238K4539K5591K0814k4413l9379k5189L1408
4621a0442r03k2971r090J0028P735J7467P874k394j2823K1882J8692N815k808
4608B8062p083k9072r917K1734l2146j0927J515L0499J8591k4749j9422J2840
4596b0075K2746j9098j2505J6499M235k6412k984L7587J9462j9305p270j838R15
4583h043p520k284J6035P35r207m01O558N538l475Q110j984l3533j5914P294o340
4568d4431j6547L137L1695K6506L789r143j489L71l641J8126J4488J6137l6019
$$ plain form
4555 2979 -13335 -26675 -8932 -3242 -30230 -54564 -55829 -41540 -19852 2513 -8648 -10840 -363
4542 -363 -5120 -23662 -7481 12732 31387 36616 50621 48096 14151 13017 26163 41420 5021
4529 5021 -8822 -5841 10165 30721 43368 39155 41546 28710 15359 25454 61304 41231 26371
4516 26371 16808 -11521 -41015 -26766 -35443 -42074 -56945 -38983 1161 20560 -31 -6075 990
4503 990 8016 -14692 -4875 -21479 -8635 -20932 -27142 -30060 -38520 -31914 -39538 -20311 12609 21769
4489 21769 24061 17778 -16677 -15051 99 -29477 -27947 -47805 -43609 -4969 -26894 -18565 -20109
4476 -20109 -21809 -12756 -6635 3090 2077 23776 37812 24287 -17034 -40922 -58471 -56705 -54469
4463 -54469 -68054 -60975 -28771 -14132 -2908 -16191 -33557 -22351 -37714 -42340 -48172 -26619
$$ packed form
4555B979j6314j3340J7743N690k6988k4334j265J4289K1688K2365j1161k192J0477
4542c63m757j8542J6181K0213J8655N229J4005k525l3945j134J3146J5257l6399
4529E021j3843K981J6006K0556J2647m213K391j2836j3351J0095L5850k0073j4860
4516B6371r563k8329k9494J4249q677o631j4871J7962M0144J9399k0591o044P065
4503I90P026k2708R817j6604J2844j2297o210k918q460O606p624J9227L2920R160
4489B1769K292o283l4455J626J5150k9576J530j9858M196L8640k1925Q329j544
4476b0109j700R053O121R725j013K1699J4036j3525m1321k3888j7549J766K236
4463e4469j3585P079L2204J4639J1224j3283j7366J1206j5363m626n832K1553
$$ plain form
4451 -26619 -753 13250 6098 -15874 -27645 -32813 -43917 -41037 -23151 -21742 -27869 9895 12575
4438 12575 18534 38379 5042 -39784 -41449 -31892 -18646 -11967 -19614 -38989 -26716 8001 36944
4425 36944 32815 3448 16752 16920 -35706 -33535 -20872 -49378 -69172 -60615 -62767 -55743 -54474
4412 -54474 -49928 -36228 -10655 8890 1959 -12731 -36569 -12475 -20987 -30658 3818 5956 13937
4399 13937 18324 20092 22510 27380 -13288 -11491 -15249 -27730 -30629 -19197 -3952 20826 23436
4386 23436 7989 -13122 -16627 -19994 -19698 -12046 -5643 6745 13446 -923 -13465 -20565 -12305 4034
4372 4034 26183 35168 21940 25117 -4302 -20651 -2486 -459 -18283 -4218 22884 17553 -17871
4359 -17871 -20878 -33243 -54326 -43922 -4065 11880 -11335 -34157 -50142 -42467 -22555 -11081
$$ packed form
4451b6619K5866J4003p152k1972j1771n168j1104K880J7886J409o127L7764K680
4438A2575N959J9845l3337m4826j665R557J3246O679p647j9375J2273L4717K8943
4425C6944m129k9367J3304J68n2626K171J2663k8506j9794Q557k152P024J269
4412e4474M546J3700K5573J9545o931j4690k3838K4094q512r671L4476K138P981
4399A3937M387J768K418M870m0668J797l758j2481k899J1432J5245K4778K610
4386B3436j5447k1111l505l367K96P652O403J2388O701j4369j2542p100Q260J6339
4372D034K2149Q985j3228L177k9419j6349J8165K027j7824J4065K7102n331l5424
4359a7871l007j2365k1083J0404L9857J5945k3215k2822j5985P675J9912J1474
$$ plain form
4347 -11081 -9651 1555 -622 -13988 -36382 -21847 354 -9250 -24947 -18171 -13735 -20107 -23961
4334 -23961 -19862 -9654 -1943 10560 14033 -26169 -35645 -554 23215 35723 46109 42578 33673
4321 33673 4198 -1518 -13227 -29746 -27094 -18345 7950 20354 19310 8457 -10226 -23595 -59883
4308 -59883 -49270 -26076 -1659 2475 -1963 27043 13562 7111 -974 8499 13508 -4761 939
4295 939 35854 46799 -2440 -34450 -39617 -38453 -6402 2066 -9380 -9050 3298 3926 9654 34177
4281 34177 49682 52529 42855 30248 -5051 -21768 6941 28133 15288 17912 -6392 -11614 -4498
4268 -4498 -32201 -41222 -31400 -28490 -21454 -4410 6581 13720 -1431 -4399 -1297 5049 -11955 -41285
4254 -41285 -43811 -36911 -15514 11854 -2559 -19839 3427 8906 15048 5560 -319 -6944 -44338
$$ packed form
4347a1081J430J1206k177j3366k2394J4535K2201r604j5697O776M436o372l854
4334b3961M099J0208P711J2503L473m0202r476L5091K3769J2508J0386l531q905
4321C3673k9475n716j1709j6519K652Q749K6295J2404j044j0853j8683j3369l6288
4308e9883J0613K3194K4417M134m438K9006j3481o451q085R473N009j8269N700
4295I39L4915J0945m9239l2010n167J164L2051Q468j1446L30J2348O28N728K4523
4281C4177J5505K847r674j2607l5299j6717K8709K1192j2845K624k4304n222P116
4268d498k7703r021R822K910P036J7044J0991P139j5151k968L102O346j7004k9330
4254d1285k526O900K1397K7368j4413j7280K3266N479O142r488n879o625l7394
$$ plain form
4241 -44338 -28601 6032 948 -31992 -43414 -33254 -34115 -7797 3232 -49445 -78025 -33972
4229 -33972 23976 30741 7530 8570 19425 20578 21280 40102 52721 26081 43621 39083 1094
4216 1094 -8504 -7493 -25925 -27751 -24378 -27368 -36784 -33129 -26570 148 20565 35365 37507 14508
4202 14508 -17205 -12855 -3720 -20774 -16196 -22821 -3 17096 26831 44647 36079 46226 51442
4189 51442 41102 36836 22131 22443 17362 784 -11328 -16277 2070 25811 49973 55420 24147
4176 24147 4868 -11602 -17538 -2599 -7944 14774 17504 35328 41735 22600 3806 -3255 7091
4163 7091 -12577 -17414 20266 43899 14746 4265 13510 10729 -10725 -6521 2119 294 -10288
4150 -10288 -20866 -32331 -40053 -18952 -24218 -29361 10743 19260 11880 3877 -1339 -6216 -18892
$$ packed form
4241d4338J5737L4633n084l2940j1422J0160q61K6318J1029n2677k8580M4053
4229c3972N7948O765k3211J040J0855J153P02J8822J2619k6640J7540m538l7989
4216A094r598J011j8432j826L373k990r416L655O559K6718K0417J4800K142k2999
4202A4508l1713M350R135j7054M578o625K2818J7099R735J7816q568J0147N216
4189E1442j0340m266j4705L12n081j6578j2112m949J8347K3741K4162N447l1273
4176B4147j9279j6470n936J4939n345K2718K730J7824O407j9135j8794p061J0346
4163G091j9668m837L7680K3633k9153j0481R245k781k1454M204Q640j825j0582
4150a0288j0578j1465p722K1101n266n143M0104Q517p380q003n216m877j2676
$$ plain form
4137 -18892 -22959 -16105 4492 35862 50612 35126 21089 18877 58670 68824 34625 17177
4125 17177 14987 17945 -2559 -10150 -5245 3864 5581 31449 869 -14188 15930 20374 41334
4112 41334 28097 -15004 -30311 -17714 -22636 -7323 3396 30856 50770 34603 -3002 -43295
4100 -43295 -30394 -8954 -16246 22802 45226 12342 699 251 -3102 9757 4465 7374 -4586
4087 -4586 -21196 -20285 1452 8485 -2516 -9568 -18317 -5513 -10803 -10176 18129 30070 21286 4874
4073 4874 6814 5626 1958 11802 15458 15531 -10121 -31746 -21162 -6292 17538 5257 -3570 -7341
4059 -7341 18312 9618 10150 32843 39803 -21005 -54729 -44484 -4605 20887 3177 -25929 -44523
4046 -44523 -26792 -835 -2024 -5921 3325 -5251 161 -1621 -12224 -19543 2357 46774 21883
$$ packed form
4137a8892m067O854K0597L1370J4750j5486j4037k212L9793J0154l4199j7448
4125A7177k190K958k0504p591M905R109J717K5868l0580j5057L0118M444K0960
4112D1334j3237m3101j5307J2597m922J5313J0719K7460J9914j6167l7605m0293
4100d3295J2901K1440p292L9048K2424l2884j1643m48l353J2859n292K909j1960
4087d586j6610R11K1737P033j1001p052q749J2804n290O27K8305J1941q784j6412
4073D874J940j188l668R844L656P3k5652k1625J0584J4870K3830j2281q827l771
4059g341K5653q694N32K2693O960o0808l3724J0245L9879K5492j7710k9106j8594
4046d4523J7731K5957j189l897R246q576N412j782j0603p319K1900M4417k4891
$$ plain form
4033 21883 1491 14014 -7245 -32966 -37127 -15269 22606 50122 67777 92955 74325 18381
4021 18381 12840 44211 50929 23233 -700 2558 -18467 -2638 23506 37797 28209 13994 4526
4008 4526 60 -218 -17797 -20392 -11943 19250 19261 25010 29397 27251 22264 18443 37774 7286 -11182
3993 -11182 -31629 -33088 -33735 -12944 7146 -8201 -20841 -45137 -53353 -44192 -29414 19637 99531
3980 99531 126122 119467 55194 3107 -40872 -48181 -41104 -46691 -36699 -20995 -2771 16620 15484
3967 15484 3502 1778 -23709 -8039 13132 -7416 -8642 1046 28162 7096 -20257 -36217
3955 -36217 -18874 6609 -13660 -43372 -43042 -14864 -26978 -45078 -12623 16924 39441 20377
3943 20377 26186 39982 46116 37382 6626 -29147 -26129 -3708 22420 29486 7771 -2332 11992
$$ packed form
4033B1883k0392J2523k1259k5721m161K1858L7875K7516J7655K5178j8630n5944
4021A8381n541L1371O718k7696k3933L258k1025J5829K6144J4291r588j4215r468
4008D526m466k78j7579k595Q449L1193J1N749M387k146m987l821J9331l0488j8468
3993a1182k0447j459o47K0791K0090j5347j2640k4296q216R161J4778M9051P9894
3980I9531K6591o655o4273n2087m3979p309P077n587R992J5704J8224J9391j136
3967A5484j1982j724k5487J5670K1171k0548j226R688K7116k1066k7353j5960
3955c6217J7343K5483k0269k9712L30K8178j2114j8100L2455K9547K2517j9064
3943B0377N809J3796O134q734l0756l5773L018K2421K6128P066k1715j0103J4324
$$ plain form
3930 11992 11395 994 -24385 -28887 -32550 -47139 -49732 -11122 4858 12116 4128 -6381 -30963
3917 -30963 -32525 -30925 -20016 -37450 -51748 -21756 9944 25541 16124 12111 31528 33405 51001
3904 51001 34021 18858 26004 28311 12775 3626 724 -10998 -11647 -1524 7580 14088 -1398
3891 -1398 -12954 -2265 -22039 -5829 -2773 17778 12406 13265 23360 14525 86 4465 -10433
3878 -10433 -23061 -18604 -27978 -17681 -28544 -6334 17963 35653 27631 19207 25907 27508 -7652
3865 -7652 1097 13195 16348 11973 2939 48131 67032 51994 12855 21914 18378 13302 36323
3852 36323 41675 37438 4802 -6200 -5492 21755 13525 20654 9142 -3532 -3478 -12045 2981 -7043
3838 -7043 -19379 -21491 -39417 -22431 -9445 -25642 -13293 15672 -7677 -20488 -40376 -50429
$$ packed form
3930A1992n97j0401k5379m502l663j4589k593L8610J5980P258p988j0509k4582
3917c0963j562J600J0909j7434j4298K9992L1700J5597r417m013J9417J877J7596
3904E1001j6980j5163P146K307j5536r149k902j1722o49J0123R104O508j5486
3891a398j1556J0689j9774J6210L056K0551n372Q59J0095q835j4439M379j4898
3878a0433j2628M457r374J0297j0863K2210K4297J7690q022q424O700J601l5160
3865g652Q749J2098L153m375r034M5192J8901j5038l9139R059l536n076K3021
3852C6323N352m237l2636j1002P08K7247q230P129j1512j2674N4q567J5026j0024
3838g043j2336k112j7926J6986J2986j6197J2349K8965k3349j2811j9888j0053
$$ plain form
3826 -50429 -50991 -37452 -29437 -41217 -52589 -46440 -41701 -17121 -17538 -25927 16723 30832 25796 21897
3812 21897 27428 -3251 -13964 -5177 -5563 -780 8396 15539 29202 26739 22118 3092 781 -6323
3798 -6323 9011 30020 20683 80 3599 -3873 15000 10376 -11814 7687 8725 17453 32188
3785 32188 29573 8477 13342 16089 -22661 -24594 -20419 -37331 -43158 -61191 -45848 -21158 -12980
3772 -12980 -8835 -6732 7474 13758 15912 20160 21899 -1947 -32781 -28280 -24418 -39772 -9329
3759 -9329 25786 -11245 -25911 -7559 9099 -16579 -21698 -14514 -3074 1537 -9981 -26353 -10525
3746 -10525 18418 5598 -444 -8924 -25525 -47650 -65097 -47162 -40222 -34857 -12208 6064 3204
3733 3204 -6390 -34152 -56138 -32675 -32769 -51764 -75519 -66846 -30057 -10730 18676 25497 997
$$ packed form
3826e0429n62J3539Q015j1780j1372O149M739K4580m17q389M2650J4109n036l899
3812B1897N531l0679j0713Q787l86M783R176P143J3663k463m621j9026k311p104
3798f323J5334K1009r337k0603L519p472J8873m624k2190J9501J038Q728J4735
3785C2188k615k1096M865K747l8750j933M175j6912n827j8033J5343K4690Q178
3772a2980M145K103J4206O284K154M248J739k3846l0834M501L862j5354L0443
3759i329L5115l7031j4666J8352J6658k5678n119P184J1440M611j1518j6372J5828
3746a0525K8943j2820o042q480j6601k2125j7447J7935O940N365K2649J8272k860
3733C204r594k7762k1986K3463r4j8995k3755Q673L6789J9327K9406O821k4500
$$ plain form
3720 997 -1710 -26778 -12703 22664 36699 18207 -10067 -37100 -52522 -41738 -30905 -23785 -24641
3707 -24641 -22225 -14317 -44249 -50330 -51029 -63801 -81425 -47469 -24266 -27515 -21858 -4879 -7956
3694 -7956 -2186 13780 29056 18569 -6409 -38629 -27023 -14861 -1887 -5541 -17802 -24123 1466
3681 1466 -6902 -33427 -68486 -50978 -57572 -51650 -54346 -77107 -56067 -38948 -17589 -15700 -13332
3668 -13332 -5648 28374 23961 -1621 3270 -12256 -12130 -10824 9644 3164 -2600 12313 13325 3190
3654 3190 6570 16750 33823 13216 -22087 -50900 -82495 -62841 -25652 6055 21511 23806
3642 23806 28907 52505 48889 35242 19869 -5225 -16334 -41517 -34251 -21823 -31029 -49734 -38245
3629 -38245 -19956 -11102 -16454 -25345 -23356 -29267 -32863 -40367 -40233 -76828 -91141 -76924 -57137 -51738
$$ packed form
3720I97k707k5068J4075L5367J4035j8492k8274k7033j5422J0784J0833P120q56
3707b4641K416P908k9932o081o99j2772j7624L3956K3203l249N657J6979l077
3694g956N770J5966J5276j0487k4978l2220J1606J2162J2974l654j2261o321K5589
3681A466q368k6525l5059J7508o594N922k696k2761K1040J7119K1359J889K368
3668a3332P684L4022m413k5582M891j5526J26J306K0468o480n764J4913J012j0135
3654C190L380J0180J7073k0607l5303k8813l1595J9654L7189L1707J5456K295
3642B3806N101K3598l616j3647j5373k5094j1109k5183P266J2428r206j8705J1489
3629c8245J8289Q854n352q891J989n911l596p504J34l6595j4313J4217J9787N399
$$ plain form
3615 -51738 -7530 17573 12471 1087 2565 952 -21749 -26167 -22986 -5370 -10142 -14909 -23345
3602 -23345 -44196 -9752 -14537 -20620 -5867 -14694 -21602 7854 9727 -4666 -20521 -3026 1447
3589 1447 15433 17431 3522 13973 23863 10021 1055 -12429 11994 1829 -15673 -14175 -2903
3576 -2903 -16697 -24893 -27727 5024 8919 15198 -1585 -37768 -47512 -23198 -19348 6390 41115
3563 41115 61525 42744 38919 6135 -14359 -15528 -37902 -58880 -62668 -44083 -29454 -23415 -19929
3550 -19929 -12481 -934 -5894 6951 19896 16848 12250 3889 27103 19104 -9432 -24792 2856
3537 2856 -5687 -41271 -62377 -54983 -27348 -16335 -8237 -3285 -9239 -6914 -44974 -50126 -26197
3524 -26197 -14141 -36033 -31213 -6606 4823 547 1882 12232 10897 47159 85757 71210 34734
$$ packed form
3615e1738M4208K5103n102j1384J478j613k2701m418L181J7616m772m767q436
3602b3345k0851L4444m785o083J4753q827o908K9456J873j4393j5855J7495M473
3589A447J3986J998j3909J0451R890j3842q966j3484K4423j0165j7502J498J1272
3576b903j3794q196k834L2751L895O279j6783l6183r744K4314L850K5738L4725
3563D1115K0410j8781l825l2784k0494j169k2374k0978l788J8585J4629O039L486
3550a9929P448J1547m960J2845J2945l048m598q361K3214p999k8536j5360K7648
3537B856q543l5584k1106P394K7635J1013Q098M952n954K325l8060n152K3929
3524b6197J2056k1892M820K4607J1429m276J335J0350j335L6262L8598j4547l6476
$$ plain form
3511 34734 18253 20099 -6833 -2120 10671 15150 20653 7688 -11027 -28902 -16572 7678 5710
3498 5710 1948 -8218 3839 18017 -13339 -34361 -13006 -24462 -34509 -35124 -37868 -33433 -35652
3485 -35652 -35131 -20238 -7839 -35461 -50464 -36098 13169 5498 -28618 -29225 -19209 -9136 -16007
3472 -16007 -7526 2563 20458 24317 40964 38422 16041 6427 -9510 -9713 -29168 -32851 -25816
3459 -25816 -36305 -48679 -14873 5722 7328 16191 25040 24374 12972 -12375 -57086 -59150 -38512
3446 -38512 -32808 -14336 -26480 -40280 -28088 -8818 25808 11250 -4406 -29562 -16448 -14356
3434 -14356 -19278 -13038 -36473 -64187 -56890 -21468 -4633 -299 7236 -560 2804 -6105 -5919 -10002
3420 -10002 -28511 -31421 -22066 -37341 -12757 -9728 7908 26489 4146 -23123 -14007 -19151 -15861
$$ packed form
3511C4734j6481J846k6932M713J2791M479N503j2965j8715j7875J2330K4250j968
3498E710l762j0166J2057J4178l1356k1022K1355j1456j0047o15k744M435k219
3485c5652N21J4893J2399k7622j5003J4366M9267p671l4116o07J0016J0073o871
3472a6007Q481J0089J7895L859J6647k542k2381r614j5937k03j9455l683P035
3459b5816j0489j2374L3806K0595J606Q863Q849o66j1402k5347m4711k064K0638
3446c8512N704J8472j2144j3800J2192J9270L4626j4558j5656k5156J3114K092
3434a4356m922O240k3435k7714P297L5422J6835M334P535p796L364q909J86m083
3420a0002j8509k910R355j5275K4584L029J7636J8581k2343k7269R116n144L290
$$ plain form
3407 -15861 -11546 -1059 -24021 -33560 -60712 -68280 -36958 -28167 -8739 11937 -1734 -15235 1265
3394 1265 6064 -22772 -34961 -29149 -29897 -13358 6882 -5244 -17799 -23154 -26536 -26379 -13385 -22465
3380 -22465 -20013 -24304 3073 43452 47448 37537 9506 9012 10494 -11624 -5537 -1456 7727 11968
3366 11968 13899 -5655 -35714 -46925 -35691 -40521 -61610 -62947 -56880 -47283 -36563 -31020 -13369
3353 -13369 2390 18808 -21 -20701 -30508 5782 10693 -2319 8045 22771 15751 -24743
3341 -24743 -66642 -76921 -81267 -30967 -3935 -10408 -14225 -32125 -14286 -25698 -22415 -7822 -8101
3328 -8101 2604 28342 27859 859 20088 44775 38074 26254 2628 -12941 -1916 -3135 -21341
3315 -21341 -33473 -50706 -33150 -28219 -43474 -26999 -34562 -45544 -31221 -4341 3028 -6713 -7710
$$ packed form
3407a5861M315J0487k2962r539k7152p568L1322Q791J9428K0676j3671j3501J6500
3394A265M799k8836j2189N812p48J6539K0240j2126j2555n355l382J57J2994r080
3380b2465K452m291K7377M0379L996r911k8031m94J482k2118O087M081R183M241
3366A1968J931j9554l0059j1211J1234m830k1089j337O067R597J0720N543J7651
3353a3369J5759J6418j8829k0680r807L6290M911j3012J0364J4726p020m0494
3341b4743m1899j0279m346N0300K7032o473l817j7900J7839j1412L283J4593k79
3328h101J0705K5738m83k7000J9229K4687o701j1820k3626j5569J1025j219j8206
3315b1341j2132j7233J7556M931j5255J6475p563j0982J4323K6880P369r741r97
$$ plain form
3302 -7710 12558 9404 13084 -5394 -24720 -14356 -8979 -1042 7264 8615 32125 46039 36106
3289 36106 10403 -16690 -24139 -45140 -25725 -19815 -20463 -19436 -34177 -40989 -57388 -75177 -50950
3276 -50950 -53261 -18290 -4896 -13108 -6964 -4841 21162 13974 16898 6985 -4910 -21982 14913
3263 14913 32731 17285 11380 -1419 -9390 4971 -8638 -15469 3474 -8481 -6943 2207 3753
3250 3753 -9486 -5348 1271 10335 26857 28031 -2742 2035 22038 42100 36959 21433 26197
3237 26197 9512 6172 8736 19060 17594 7081 16499 52275 62309 16820 13624 3864 -11125
3224 -11125 -17614 -37052 -21246 -4390 -14663 -18559 -28488 11236 45383 57051 65536 63033 42175
3211 42175 13815 864 3761 3757 -5891 -18070 -19176 -2786 39359 47412 20692 13212 31273 36696
$$ packed form
3302g710K0268l154L680j8478j9326J0364N377P937Q306J351K3510J3914r933
3289C6106k5703k7093p449k1001J9415N910o48J027j4741o812j6399j7789K4227
3276e0950k311L4971J3394q212O144K123K6003p188K924r913j1895j7072L6895
3263A4913J7818j5446n905j2799p971J4361j3609o831J8943j1955J538R150J546
3250C753j3239M138O619R064J6522J174l0773M777K0003K0062n141j5526M764
3237B6197j6685l340K564J0324j466j0513R418L5776J0034m5489l196r760j4989
3224a1125o489j9438J5806J6856j0273l896r929L9724L4147J1668Q485k503k0858
3211D2175k8360j2951K897mr648j2179j106J6390M2145Q053k6720p480J8061N423
$$ plain form
3197 36696 47222 32906 32321 12893 12272 16978 26893 10610 6706 2275 -2884 19434 17759 8136
3183 8136 -3795 -24351 -43153 -66753 -39708 -29154 -54842 -63077 -60018 -41563 -33735 -2074 -1469
3170 -1469 -9944 -24062 -35916 -50267 -29639 -7384 11308 9061 2288 -79 -25497 -47086 -33929
3157 -33929 -21882 -233 16248 3920 -3487 -17448 -23472 -30896 -22823 4423 -9007 -40053 -36261
3144 -36261 -12203 14850 -56 -21649 -11714 -3464 -9742 1090 5486 13933 18468 10033 -13397
3131 -13397 -27426 -49232 -33518 -23679 -4558 -7802 -30509 -15663 -15864 -26021 -30767 -8745 -2618
3118 -2618 -21960 -47846 -42038 -34511 -37156 -50536 -52188 -68008 -70854 -61372 -52990 -16209 -12115 -17631
3104 -17631 -25372 -3802 19620 9000 -15519 -19583 -21207 -12746 -6049 -29740 -19452 -1888 187
$$ packed form
3197C6696J0526j4316n85j9428o21M706R915j6283l904m431n159K2318j675r623
3183H136j1931k0556j8802k3600K7045J0554k5688q235L059J8455P828L1661O05
3170a469q475j4118j1854j4351K0628K2255J8692k247o773k367k5418k1589J3157
3157c3929J2047K1649J6481j2328p407j3961o024p424Q073K7246j3430l1046L792
3144c6261K4058K7053j4906k1593R935Q250o278J0832M396Q447M535q435k3430
3131a3397j4029k1806J5714R839J9121l244k2707J4846k01j0157m746K2022O127
3118b618j9342k5886N808P527k645j3380j652j5820k846R482Q382L6781M094n516
3104a7631p741K1570K3422j0620k4519m064j624Q461O697k3691J0288J7564K075
$$ plain form
3091 187 29413 25867 26206 1540 -10456 -25304 -22767 -47972 -56038 -49007 -30116 -28893 -32781 -37603
3077 -37603 -5253 -10543 -16859 -14722 -9627 10403 1949 16084 7443 1710 7506 -1294 -31268 -41157
3063 -41157 -17016 -2190 3413 3373 -14296 -22041 -1890 35932 51450 27960 2346 15245 27698
3050 27698 45616 48628 12686 -3481 -9729 554 17182 16695 -21377 -8181 -992 -173 18980
3037 18980 5257 12167 25689 1082 -8260 12692 13654 18042 23871 31650 33419 29368 14372 -1058
3023 -1058 -6338 -1363 10136 11732 1016 19249 26842 4687 -14687 -17993 2421 12585 6781
3010 6781 -1247 -14489 -16668 -16305 -16268 -25842 -19194 -12423 27766 21276 -8124 -53817 -51973 -29235
2996 -29235 -25553 -19094 -27569 -4169 32017 30510 19252 40659 31604 41244 40249 27499 26974 38234
$$ packed form
3091A87K9226l546L39k4666j1996j4848K537k5205q066P031J8891J223l888m822
3077c7603L2350n290o316K137N095K0030q454J4135q641n733N796q800k9974r889
3063d1157K4141J4826N603m0j7669p745K0151L7822J5518k3490k5614J2899J2453
3050B7698J7918L012l5942j6167o248J0283J6628m87l8072J3196P189Q19J9153
3037A8980j3723O910J3522k4607r342K0952R62M388N829P779J769m051j4996j5430
3023a058n280M975J1499J596j0716J8233P593k2155j9374l306K0414J0164n804
3010F781q028j3242k179L63L7r574O648O771M0189o490k9400m5693J844K2738
2996b9235L682O459q475K3400L6186j507j1258K1407r055R640r95j2750n25J1260
$$ plain form
2982 38234 60824 57945 39385 14508 -19050 -12319 3203 3606 25658 41118 15063 -11385 -26107
2969 -26107 -34885 -27166 -8941 5391 3529 -3024 -26358 -20578 9350 45324 24610 1503 -1067
2956 -1067 12872 37750 26784 38924 33245 4322 -10511 -7247 -261 -45081 -53242 -32809 -17186
2943 -17186 -4938 16816 17378 7535 10668 7635 4817 24438 9750 -12295 -36013 -24752 -445
2930 -445 31368 39821 22351 11553 23031 15932 22134 5795 -16150 2114 414 13634 6630
2917 6630 1400 36589 70374 74002 28055 40451 30925 15773 -2450 111 -6071 15434 28352
2904 28352 29892 26222 17737 635 -2379 30541 23911 18046 10242 2192 -5008 11978 -3455 -6930
2890 -6930 1334 13254 8209 21246 23316 11489 -6480 -7684 -22392 -11840 -9762 161 16260
$$ packed form
2982C8234K2590k879j8560k4877l3558O731J5522M03K2052J5460k6055k6448j4722
2969b6107q778P719J8225J4332j862o553k3334N780K9928L5974k0714k3107k570
2956a067J3939K4878j0966J2140n679k8923j4833L264O986m4820q161K0433J5623
2943a7186J2248K1754N62r843L133l033k818J9621j4688k2045k3718J1261K4307
2930d45L1813Q453j7470j0798J1478p099O202j6339k1945J8264j700J3220p004
2917F630n230L5189L3785L628m5947J2396r526j5152j8223K561o182K1505J2918
2904B8352J540l670q485j7102l014L2920o630n865p804q050p200J6986j5433l475
2890f930Q264J1920n045J3037K070j1827j7969j204j4708J0552K078R923J6099
$$ plain form
2877 16260 27556 15378 -6440 -393 33159 63500 75215 51381 14809 17691 19222 13336 -15783
2864 -15783 -47129 -25001 507 17499 17538 -1670 -18432 -4743 11322 4201 -580 5238 30167
2851 30167 42645 17121 -13264 -19062 -9212 -16346 -27634 -29139 -15603 -20678 2214 20612 14974
2838 14974 5092 9172 19593 9180 -14633 -46630 -28528 -5537 -2805 -24863 -30729 -26317 -29898
2825 -29898 2828 5342 10822 24258 6746 -11284 -13189 -33481 -59115 -58565 -58086 -70627 -68723
2812 -68723 -59898 -36469 -24933 -27811 -52475 -58852 -20497 31632 40299 29994 22509 1007 3200
2799 3200 7140 -3068 -5474 4798 7105 -1671 4279 -1401 -3737 -16254 10551 15330 8206 2294
2785 2294 739 -17522 -16177 33949 21822 15820 9299 -13285 -23156 -13096 1259 39775 39449
$$ packed form
2877A6260J1296j2178k1818O047L3552L0341J1715k3834l6572K882J531n886k9119
2864a5783l1346K2128K5508J6992L9j9208j6762J3689J6065p121m781N818K4929
2851C0167J2478k5524l0385n798R850p134j1288j505J3536n075K2892J8398n638
2838A4974r882M080J0421j0413k3813l1997J8102K2991K732k2058n866M412l581
2825b9898L2726K514N480J3436j7512j8030j905k0292k5634N50M79j2541J904
2812f8723Q825K3429J1536k878k4664o377L8355N2129Q667j0305p485k1502K193
2799C200L940j0208k406J0272K307q776N950n680k336j2517K6805M779p124n912
2785B294j555j8261J345N0126j2127o002o521k2584r871J0060J4355L8516l26
$$ plain form
2772 39449 44546 62907 65148 45532 22309 14732 15793 6465 -133 -4638 48 -18870 -12650 4138
2758 4138 22756 6240 5118 37941 53962 15360 -8650 -40314 -55322 -30688 -20670 15534
2746 15534 24605 19170 49586 48501 10390 21941 40083 30045 13667 13841 30570 30977 19585
2733 19585 12031 -3017 -33571 -46694 -17465 -3240 623 23565 5149 27649 39427 37103
2721 37103 32561 16107 -20113 -48605 -41507 -6914 16582 13639 38321 54894 28006 20128 18406
2708 18406 5715 7986 7807 -167 -8943 -3580 -1130 -1060 1925 12425 8671 2162 -10870 16326
2694 16326 4532 470 24097 15665 19910 13561 -6623 -15621 -3062 -7432 -7719 604 15090 5696
2680 5696 -10164 2134 -4043 -11814 -38870 -38914 -5558 -54 7138 56513 58934 28136 -5251 -17086
$$ packed form
2772C9449N097J8361K241j9616k3223p577J061r328o598m505M686j8918O220J6788
2758D138J8618j6516j122L2823J6021l8602k4010l1664j5008K4634J0018L6204
2746A5534R071n435L0416j085l8111J1551J8142j0038j6378J74J6729M07j1392
2733A9585p554j5048l0554j3123K9229J4225L863K2942j8416K2500J1778k324
2721C7103m542j6454l6220k8492P098L4593K3496k943K4682J6573k6888p878j722
2708A8406j2691K271j79p974q776N363K450P0K985J0500l754o509j3032K7196
2694A6326j1794m062K3627q432M245o349k0184q998J2559m370k87Q323J4486r394
2680E696j5860J2298o177p771k7056m4L3356N504P192M9375K421l0798l3387j1835
$$ plain form
2666 -17086 -169 8838 -15696 -33264 6709 24483 6568 -19828 5033 2183 4804 17191
2654 17191 5926 -8652 -14097 -9516 -27914 -27893 -5808 -15025 -6103 3626 2173 -26460 -24069 1572
2640 1572 5371 -9847 -18181 -19142 -17063 9529 29866 60869 65046 27030 -5478 5428 -20504
2627 -20504 -38559 -12548 -18375 -4935 32241 27432 24655 20033 15314 26726 14592 -174 5480
2614 5480 -12699 18447 22402 -4405 3382 2283 -3653 -23217 -31442 -22274 -41537 -56950 -24063
2601 -24063 28339 40340 29221 16891 7349 9658 6229 7408 36407 58690 56772 70412 64184
2588 64184 75797 65427 45284 26706 10714 7686 48022 56703 49310 44057 52709 36690 21866
2575 21866 16891 9008 -17779 -9057 -9307 -19078 -5203 -16691 -11266 19737 3261 -44734 -49824
$$ packed form
2666a7086J6917R007k4534j7568L9973J7774j7915k6396K4861k850K621J2387
2654A7191j1265j4578n445M581j8398K1K2085r217Q922R729j453k8633K391K5641
2640A572L799j5218q334r61K079K6592K0337L1003M177l8016l2508J0906k5932
2627b0504j8055K6011n827J3440L7176m809k777m622m719J1412j2134j4766N654
2614E480j8179L1146L955k6807P787j099n936j9564q225R168j9263j5413L2887
2601b4063N2402J2001j1119j2330r542K309l429J179K8999K2283j918J3640o228
2588F4184J1613j0370k0143j8578j5992l028M0336Q681p393n253Q652j6019j4824
2575B1866m975p883k6787Q722k50r771J3875j1488N425L1003j6476m7995n090
$$ plain form
2562 -49824 -39680 -29220 -22737 -13294 -7033 -28000 -36682 -44840 -64120 -51397 -40469 -19451 11784
2549 11784 6752 -3359 -4734 22256 37246 50732 17290 -15872 -21250 -19315 -176 10152 -1521
2536 -1521 -6597 -15794 -31162 -32984 -31773 -30808 6123 25910 22615 22809 12102 -7341 15215 2438
2522 2438 14936 28836 38231 719 -14808 -14746 -8524 -14855 -29337 -23739 -18010 -4206 -1905 -21235
2508 -21235 -14868 -19271 -34970 -46879 -46574 -28153 4847 34850 57564 32687 23516 35796 30852
2495 30852 855 -3743 -25317 -34045 -18742 -29548 -49873 -42438 -10895 4429 12215 1539 -6007
2482 -6007 -13097 -17881 -24803 -29268 -18243 -12753 -978 26750 551 2647 7909 5163 19315 15898
2468 15898 18412 -4975 -6874 4868 -4511 -6044 -6489 -4631 -7262 8990 25579 28772 17746 3975
$$ packed form
2562d9824J0144J0460O483R443O261k0967q682q158j9280J2723J0928K1018L1235
2549A1784n032j0111j375K6990J4990J3486l3442l3162n378J935J9139J0328j1673
2536a521n076r197j5368j822J211R65L6931J9787l295J94j0707j9443K2556j2777
2522B438J2498J3900R395l7512j5527O2O222o331j4482N598N729J3804K301j9330
2508b1235O367m403j5699j1909L05J8421L3000L0003K2714k4877r171J2280m944
2495C0852k9997m598k1574q728J5303j0806k0325P435L1543J5324P786j0676p546
2482f007p090m784o922m465J1025N490J1775K7728k6199K096N262k746J4152l417
2468A5898K514k3387j899J1742r379j533m45J858k631J6252J6589L193j1026j3771
$$ [...]
##END NTUPLES=NMR SPECTRUM
##END=
