##TITLE=Analysis number 329535
Compound Code cc 52901
Book Reference 423/162/3
Project Code adrs
Chemist Name bruced
##JCAMPDX= 6.0         $$ Bruker NMR JCAMP-DX V2.0
##DATA TYPE= NMR SPECTRUM
##DATA CLASS= NTUPLES
##ORIGIN= Bruker BioSpin GmbH
##OWNER= nmr
$$ XWIN-NMR		Version 3.5
$$ Tue Sep 11 14:15:32 2007 GMT Daylight Time (UT+1h)  MAYBRIDGE\nmr@NMR_250MHZ
##.OBSERVE FREQUENCY= 250.131544655141
##.OBSERVE NUCLEUS= ^1H
##.ACQUISITION MODE= SIMULTANEOUS (DQD)
##.ACQUISITION SCHEME= undefined
##.AVERAGES= 16
##.DIGITISER RES= 18
##SPECTROMETER/DATA SYSTEM= dpx250
##.PULSE SEQUENCE= zg30
##.SOLVENT NAME= DMSO
##.SHIFT REFERENCE= (INTERNAL, DMSO, 0, 16.522)
##AUDIT TRAIL= $$ (NUMBER, WHEN, WHO, WHERE, WHAT)
$$ ##TITLE= Audit trail, XWIN-NMR		Version 3.5
$$ ##JCAMPDX= 5.01
$$ ##ORIGIN= Bruker BioSpin GmbH
$$ ##OWNER= nmr
$$ C:\u/data/dgb/nmr/ADRS/1330/pdata/1/auditp.txt
$$ ##AUDIT TRAIL=  $$ (NUMBER, WHEN, WHO, WHERE, WHAT)
(   1,<2007-09-11 14:15:12.72 +100>,<MAYBRIDGE\nmr>,<NMR_250MHZ>,
      <created by zg, POWCHK disabled, PULCHK disabled
       configuration hash MD5:
       76 6E 9A 78 1E 09 19 81 EC 84 63 8F B0 6A 59 2D
       data hash MD5: 64K
       1B B0 EC A2 56 A3 87 99 49 05 A9 49 30 E9 CC DE>)
(   2,<2007-09-11 14:15:24.31 +100>,<MAYBRIDGE\nmr>,<NMR_250MHZ>,
      <Start of raw data processing
       ef LB = 0.3 FT_mod = 6 PKNL = 1 SI = 32K 
       data hash MD5: 32K
       D2 04 C1 2F 0E 25 1F 2B 15 AB 43 34 A2 67 73 6F>)
(   3,<2007-09-11 14:15:25.89 +100>,<MAYBRIDGE\nmr>,<NMR_250MHZ>,
      <apk 
       data hash MD5: 32K
       47 55 D2 7F 26 71 99 93 D9 78 D7 50 EC 33 D5 EC>)
(   4,<2007-09-11 14:15:26.67 +100>,<MAYBRIDGE\nmr>,<NMR_250MHZ>,
      <abs ABSG = 5 
       data hash MD5: 32K
       B6 AD 82 AA E7 25 7F 26 C3 E5 B5 3E FA F0 D1 29>)
$$ ##END=
$$ 
$$ hash MD5
$$ 20 C9 EC 2A EE 91 7B 56 83 34 71 ED E0 19 4F A0
##$RELAX= 
##$RELAX= 
##$RELAX= 
##$RELAX= 
##$RELAX= 
##$RELAX= 
##$RELAX= 
$$ Bruker specific parameters
$$ --------------------------
##$DU= <C:\u>
##$EXPNO= 1330
##$NAME= <ADRS>
##$PROCNO= 1
##$TYPE= <nmr>
##$USER= <dgb>
##$AMP= (0..31)
100 100 100 100 100 100 100 100 100 100 100 100 100 100 100 100 100 100 
100 100 100 100 100 100 100 100 100 100 100 100 100 100 
##$AQSEQ= 0
##$AQ_mod= 3
##$AUNM= <au_zg>
##$AUTOPOS= <25 >
##$BF1= 250.13
##$BF2= 250.13
##$BF3= 250.13
##$BF4= 250.13
##$BF5= 500.13
##$BF6= 500.13
##$BF7= 500.13
##$BF8= 500.13
##$BYTORDA= 1
##$CFDGTYP= 0
##$CFRGTYP= 5
##$CHEMSTR= <none>
##$CNST= (0..31)
1 1 145 1 1 1 1 1 1 1 1 1 1 1 1 1 1 1 1 1 1 1 1 1 1 1 1 1 1 1 1 1 
##$CPDPRG= <>
##$CPDPRG1= <>
##$CPDPRG2= <>
##$CPDPRG3= <>
##$CPDPRG4= <mlev>
##$CPDPRG5= <mlev>
##$CPDPRG6= <mlev>
##$CPDPRG7= <mlev>
##$CPDPRG8= <mlev>
##$CPDPRGB= <>
##$CPDPRGT= <>
##$D= (0..31)
0 1 0 0 0 0 0 0 0 0.06 0 0 0 0 0 0 0.0002 0 0 0 0 0 0 0 0 0 0 0 0 0 0 
0 
##$DATE= 1189516511
##$DBL= (0..7)
120 120 120 120 120 120 120 120 
##$DBP= (0..7)
150 150 150 150 150 150 150 150 
##$DBP07= 0
##$DBPNAM0= <>
##$DBPNAM1= <>
$$ [...]
##$SUBNAM7= <"">
##$SUBNAM8= <"">
##$SUBNAM9= <"">
##$SW= 20.6930455092707
##$SWIBOX= (0..15)
0 0 3 0 0 0 0 0 0 0 0 0 0 0 0 0 
##$SW_h= 5175.983436853
##$TD= 65536
##$TD0= 1
##$TE= 298.16
##$TE2= 300
##$TE3= 300
##$TEG= 300
##$TL= (0..7)
0 120 120 120 120 120 120 120 
##$TP= (0..7)
150 150 150 150 150 150 150 150 
##$TP07= 0
##$TPNAME0= <>
##$TPNAME1= <>
##$TPNAME2= <>
##$TPNAME3= <>
##$TPNAME4= <>
##$TPNAME5= <>
##$TPNAME6= <>
##$TPNAME7= <>
##$TPOAL= (0..7)
0.5 0.5 0.5 0.5 0.5 0.5 0.5 0.5 
##$TPOFFS= (0..7)
0 0 0 0 0 0 0 0 
##$TUNHIN= 0
##$TUNHOUT= 0
##$TUNXOUT= 0
##$USERA1= <user>
##$USERA2= <user>
##$USERA3= <user>
##$USERA4= <user>
##$USERA5= <user>
##$V9= 5
##$VALIST= <valist>
##$VCLIST= <CCCCCCCCCCCCCCC>
##$VD= 0
##$VDLIST= <DDDDDDDDDDDDDDD>
##$VPLIST= <PPPPPPPPPPPPPPP>
##$VTLIST= <TTTTTTTTTTTTTTT>
##$WBST= 1024
##$WBSW= 4
##$XGAIN= (0..3)
0 0 0 0 
##$XL= 0
##$YL= 0
##$YMAX_a= 304374
##$YMIN_a= -391143
##$ZGOPTNS= <>
##$ZL1= 120
##$ZL2= 120
##$ZL3= 120
##$ZL4= 120
##$ABSF1= 16.522
##$ABSF2= -4.171173
##$ABSG= 5
##$ABSL= 3
##$ALPHA= 0
##$AQORDER= 0
##$ASSFAC= 0
##$ASSFACI= 0
##$ASSFACX= 0
##$ASSWID= 0
##$AUNMP= <proc_1d>
##$AZFE= 0.1
##$AZFW= 0.1
##$BCFW= 0
##$BC_mod= 0
##$BYTORDP= 0
##$COROFFS= 0
##$CY= 12.5
##$DATMOD= 1
##$DC= 0
##$DFILT= <>
##$DTYPP= 0
##$F1P= 14.0000005364418
##$F2P= -0.99999901652339
##$FCOR= 0.5
##$FTSIZE= 32768
##$FT_mod= 6
##$GAMMA= 0
##$GB= 0
##$INTBC= 1
##$INTSCL= 1
##$ISEN= 128
##$LB= 0.3
##$LEV0= 0
##$LPBIN= 0
##$MAXI= 10000
##$MC2= 0
##$MEAN= 0
##$ME_mod= 0
##$MI= 0
##$NCOEF= 0
##$NC_proc= -5
##$NLEV= 6
##$NOISF1= 0
##$NOISF2= 0
##$NSP= 0
##$NTH_PI= 0
##$NZP= 0
##$OFFSET= 16.522
##$PC= 1
##$PHC0= -78.21248
##$PHC1= 9.372562
##$PH_mod= 1
##$PKNL= yes
##$PPARMOD= 0
##$PSCAL= 4
##$PSIGN= 0
##$REVERSE= no
##$SF= 250.13
##$SI= 32768
##$SIGF1= 0
##$SIGF2= 0
##$SINO= 400
##$SIOLD= 32768
##$SREGLST= <1H.DMSO>
##$SSB= 0
##$STSI= 32768
##$STSR= 0
##$SW_p= 5175.98343685301
##$SYMM= 0
##$S_DEV= 0
##$TDeff= 65536
##$TDoff= 0
##$TI= <Analysis number 999999
Compound Code 99
Book Reference 9
Project Code 9>
##$TILT= no
##$TM1= 0
##$TM2= 0
##$TOPLEV= 0
##$USERP1= <user>
##$USERP2= <user>
##$USERP3= <user>
##$USERP4= <user>
##$USERP5= <user>
##$WDW= 1
##$XDIM= 32768
##$YMAX_p= 373997740
##$YMIN_p= -507814
$$ End of Bruker specific parameters
$$ ---------------------------------
##NTUPLES= NMR SPECTRUM
##VAR_NAME=  FREQUENCY,     SPECTRUM/REAL,   SPECTRUM/IMAG
##SYMBOL=    X,             R,               I
##VAR_TYPE=  INDEPENDENT,   DEPENDENT,       DEPENDENT
##VAR_FORM=  AFFN,          ASDF,            ASDF
##VAR_DIM=   32768,         32768,           32768
##UNITS=     HZ,            ARBITRARY UNITS, ARBITRARY UNITS
##FACTOR=    0.157963299565203, 1,           1
##FIRST=     4132.6476996994, 0,             0
##LAST=      -1043.33573715361, 0,           0
##MIN=       -1043.33573715361, -507814,     0
##MAX=       4132.6476996994, 373997740,     0
$$ Real data points
##PAGE= N=1
##DATA TABLE= (X++(R..R)), XYDATA
$$ [...]
17244a48792m885j29993o4446R1566P7917o222J680j4654r7374n7339K2417j4693
17232c44818m0839J34052J48960k8541m1792K5305j0619L9265P913j7106j10424
17221b38644L858P7297N2196j07760K1602J70892k8763j49649L764M0016l4426
17210a89617k0829Q0900J82576k290j75764Q9156r42m4470L1542J21169O8825
17199A40256q0759n5142k2853J11657n7782j84107n1577J1604m5828j4705P0810
17188a78426k865j7471M5369L8814l5823k1757n0988p6891L2753Q6249J0934P5359
17176i4743N9806J0005N758j18520L1791k3381L8310l276j85189K02938J26984
17165E0483n0513r0584M1196q836k02931l9759q4660r7795J71110J82389P6234
$$ y = [-148792, -153677, -283670, -348116, -256550, -178633, -184855, -183175, -197829, -295203, -352542, -330125, -344818, -385657, -251605, -102645, -131186, -172978, -147673, -158292, -119027, -111114, -128220, -238644, -234786, -157489, -105293, -213053, -191451, -20559, -49322, -198971, -195207, -155191, -189617, -210446, -129546, 53030, 50740, -125024, -35868, -36810, -81280, -49738, 71431, 140256, 59497, 4355, -18498, 93159, 35377, -148730, -200307, -188703, -234531, -249236, -178426, -181291, -198762, -153393, -114579, -150402, -172159, -223147, -300038, -267285, -181036, -170102, -94743, -34937, -24932, -19174, -137694, -105903, -129284, -90974, -94250, -279439, -76501, 50483, -30, -90614, -49418, -58254, -261185, -300944, -385604, -483399, -312289, -129900, -53666]
17154e3666q2246p8097O8798j0868n8012J2378o4258o9093N0884K29829M3923
17143a0428j44463J6221O1419n064j8340Q8793j2705L3571j1489r0976o5618r4920
17131b53999L562J31409O9099k6338M1186n3369r0101p6926k7208P0813O0286
17120a51586j0689K3261K4339q368j19995m3005K0522J54149Q1089l6135r5633
17109a62051N863M0472J20017L9772L3898k8694J05616O5479n6158O7881P206
17098B39301j57644P998P8610j6555j6135K7350o8035o9541J1054N8367M4632
17087A39402J10899N514l506L9539l5464l4148q5451j06216L2290K8239l0826
17076F0272J3848P0556j40597M8920p069m4838l8928k2699m2531j5647q730K3195
$$ y = [-53666, -135912, -214009, -145211, -156079, -214091, -201713, -265971, -335064, -284180, -54351, -10428, -154891, -138670, -77251, -82315, -100655, -11862, -24567, 9004, -2485, -93461, -159079, -253999, -250437, -119028, -49929, -76267, -35081, -88450, -178551, -255477, -282685, -211872, -151586, -162275, -139014, -114675, -123043, -243038, -286043, -265521, -111372, -30283, -66418, -162051, -156188, -115716, 4301, 44073, 77971, 49277, 154893, 220372, 164214, 232095, 239301, 81657, 89655, 168265, 151710, 135575, 162925, 94890, 25349, 36403, 94770, 139402, 250301, 255815, 252309, 291848, 256384, 222236, 136785, 30569, 62859, 91098, 60272, 74120, 144676, 4079, 52999, 45930, 1092, -37836, -60535, -103066, -118713, -127443, -104248]
17064a04248q2300l5327k6885M0734j5267Q2763M64N2256N3730K1639K762K8845
17052A9166J6969L7947o8955N3608M4636L0220J49211J937j4748j06121j24276
17041C9594l709N3480R902J4741r9441q297J37283M1103j6425L025m335k4535
17029A42386J39574L3066j12871N5028n4048j61314p2232N6582p123j33005j05334
17018b19291M3262L7297L2915k1675k2228q0561j7781J13807N5661k1777O1532
17007c8839L6453j06805N8114P9665N3122j89159r7714n5022O3951J1483k8838
16996b13589J22870O9281p2891j49234O9344P6998n8167r3235K0699k9760N3239
16985b04445P1608l9825K13310M0459j44256r9652l653l5593L8202M1401J36425
$$ y = [-104248, -186548, -221875, -248760, -208026, -223293, -140530, -140066, -87810, -34080, -12441, -9679, 19166, 36135, 74082, 5127, 58735, 103371, 133591, 282802, 284739, 269991, 163870, 39594, 35885, 89365, 99267, 114008, 14567, 6270, 143553, 184656, 168231, 171256, 166921, 142386, 281960, 315026, 202155, 257183, 203135, 41821, -30411, 26171, 19048, -113957, -219291, -176029, -138732, -105817, -127492, -149720, -230281, -248062, -134255, -78594, -100371, -38839, -2386, -109191, -51077, 28588, 81710, -107449, -205163, -260185, -196234, -184751, -213589, -90719, -21438, -94329, -243563, -174219, -97221, -155388, -248623, -227924, -257684, -204445, -132837, -172662, 40648, 81107, -63149, -162801, -166454, -202047, -163845, -122444, 13981]
16974A3981K4367j53300J4594J47r2177M9237N8742j0128n8345O4946M9619L8309
16962hP6556r1539N2666q6705p7193m0836O302K4903r907K492o1787n849l6005
16949b46910l6571J26431Q3311o3543k8004m7449q4186K0173k992J34465N9649
16938h5626j58858p1088K1544M1045J12383o0785j00827K2008j3187J0827L0576
16927b51988J40044P6748n9927o345J1834P8541j0639M4817p9060K2570j06359
16916a39764j8070r0337M3474l1226l4258j8803l351J38540J88017j0803o274
16905A7145q4007r3164m6737P3691O7057M9814K4713O9697l9219M426R4492j38745
16893h37p1246O645n7618J7975J0926K3120P7626J7499p3569o1706J06064r200
$$ y = [13981, 38348, -114952, -100358, -100211, -192388, -143151, -84409, -94537, -152882, -87936, -38317, -8, 76548, -14991, 37675, -49030, -126223, -167059, -160757, -135854, -145761, -143269, -205056, -210905, -246910, -283481, -157050, -73739, -137282, -165286, -212735, -296921, -276748, -279740, -145275, -85626, -244484, -315572, -294028, -252983, -140600, -201385, -302212, -280204, -293391, -282564, -251988, -111944, -35196, -95123, -101468, -89634, -11093, -21732, 23085, -55975, -33405, -139764, -157834, -248171, -204697, -235923, -270181, -288984, -292335, -153795, 34222, 23419, 17145, -66862, -160026, -206763, -133072, -66015, -16201, 8512, 78209, 38990, 43416, 137908, -837, -72083, -65438, -123056, -105081, -94155, -71035, 6591, 24090, -49479, -111185, -5121, -14321]
16881a4321o6571o378q0391q9725J6639J01423r683m7889o0570j4966O0620J30987
16869h0825O5708J5567l7130n7589J1774J19465p8762P1358m5815j33347r6196
16858b45792J1923M2731p4692j604R3923o3613m1132K1022Q75K4117Q3264O7432
16846h1546M2109j0432K7064j7635K4938J0390k5882q7737o2001R2718J40989
16835E2975N7987j9952q6587j57875L8065R3253j07190J6859j8743l7515r7247
16824b65970j0794L4661K1148M6147l6017j4529j24201q0803Q5676q3262p9870
16813e07814O2638J52806O5598J3876N5868L6437p2631j18723p5829J9944n548
16802c73378K730M5762N3217j37223l4003O5923K6595R5273l6275J69526K1153
$$ y = [-14321, -80892, -87270, -167661, -257386, -240747, -139324, -149007, -196896, -257466, -272432, -211812, -80825, -15117, 450, -36680, -94269, -82495, 36970, -41792, 29566, -16249, -149596, -245792, -233869, -191138, -265830, -267434, -173511, -237124, -278256, -257234, -256359, -232242, -148978, -81546, -39437, -49869, -22805, -40440, -15502, -5112, -30994, -118731, -180732, -88014, 52975, 110962, 91010, 4423, -153452, -115387, -22134, -129324, -112465, -131208, -168723, -265970, -276764, -242103, -220955, -174808, -210825, -225354, -349555, -430358, -344682, -427944, -507814, -445176, -292370, -226772, -212896, -157028, -120591, -193222, -311945, -387774, -367830, -373378, -370648, -324886, -271669, -408892, -442895, -376972, -350377, -255104, -291379, -121853, -100700]
16791a00700j39519n7167O8017P5078j2562l3013N7140K5702m993K3325K330L3940
16779f2422P0135j5052J1703n1643j27865j06398J5895J4316P8074J7473j3597
16768a69381Q6778J33234j39002l7503J2063J5875l592J8808o3029l4091j5599
16757a95439j34612K3717P9390P2395O7976J1891l1842P0743l8700j6152m206
16746i4839J18270k6542r7882n4549j8694O71O5208P5325l6777J5193N8699L3879
16734C7962L4256p0862p1751L6852k6104j68659N056R8522k2847K6660Q539o607
16722a18983j8495K6823O6497L8554k9606j23802o5361Q8602J04131L1844r053
16711h849p630R854m5647j34346P2218P9837J943k35n8247j04553L5867J55314
$$ y = [-100700, -240219, -297386, -229369, -154291, -166853, -199866, -142726, -117024, -122017, -98692, -96362, -62422, 7713, -7339, 4364, -47279, -175144, -281542, -265647, -251331, -173257, -155784, -169381, -82603, 50631, -88371, -125874, -113811, -97936, -101528, -82720, -145749, -179840, -195439, -330051, -306334, -226944, -154549, -86573, -74682, -106524, -35781, -74481, -90633, -94839, 23431, -3111, -100993, -155542, -174236, -173565, -108357, -33032, -69809, -54616, 4083, 37962, 72218, 1356, -70395, -33543, -59647, -228306, -223250, -124728, -147575, -120915, -112376, -118983, -137478, -110655, -44158, -5604, -35210, -159012, -224373, -135771, -31640, 204, -8849, -16479, -6625, -52272, -186618, -114400, -34563, -32620, -32855, -91102, -195655, -159788, -4474]
16699d474p5023n6773J6083P6977j05799n3847N1738q5516m5091q977J14772J6849
16687a59081q145L419P455K0955j7755j1066p3514J7754M7140L3270M7464J6507
16675g5597q0147o2373n7842K8417N2114O5814q481l2695j06265J4073k7971K3524
16663b67429K7907L7510K4625J4863N491R2926J31372j40548n9934m7107P739
16652a72585k3186J06453k8575n2154n1166K0421K2367L2408j2414j5027N5388
16641a18070N4170P1091L0375j35560j16235l190k3623j714j5559p4210m5260
16630c77785J47145O6066N7195j6408k9623O430q7100J0384K0254L7231K6565
16619a39646O810k2242K9398P1342k9776j6151l575j59987J840Q1354j3437m5465
$$ y = [-4474, -79497, -136270, -120187, -43210, -149009, -202856, -151118, -236634, -281725, -290702, -175930, -159081, -167226, -163807, -156352, -135397, -153152, -164218, -237732, -219978, -172838, -139568, -92104, -75597, -155744, -218117, -275959, -247542, -195428, -129614, -138095, -170790, -277055, -262982, -290953, -267429, -239522, -202012, -177387, -162524, -157033, -64107, 67265, -73283, -133217, -180324, -172585, -195771, -89318, -117893, -170047, -221213, -200792, -178425, -146017, -158431, -173458, -118070, -63900, 7191, 37566, -97994, -214229, -217419, -241042, -242756, -258315, -332525, -377785, -230640, -164574, -107379, -123787, -153410, -146980, -234080, -223696, -203442, -166211, -139646, -132836, -155078, -125680, -54338, -84114, -100265, -103840, -263827, -261987, -180633, -194070, -239535]
16607b39535j2703O4313O9890R5298m3162l3154M6054l3843J3360J7572l4648
16596i0558o1847j16916k0954K0082l4695Q2160K7185O9134O9422l3501M6928
16585d3560J646K2760M308n1919o845M151L2992K475j23024l4407P5050J0777
16573a05596j1452J4986o4855j2414R1545J47604J57574q2374j20331l6739k7643
16562d9695j04394j5242Q1878P4752J9096N4521q5650j02381p9924Q1078O2822
16551f3139m9480K2713j10822L9331M4061m7887q840M5771N6001j5898J15109
16540B6920M2430j63254j63653L6684M3155n3077N7114J3688M4174r477P6558
16529d8738P3540j00059J13980k353m1331N720m4203m2808M5984o2167O3017J02243
$$ y = [-239535, -252238, -187925, -118035, -22737, -65899, -99053, -52999, -86842, -73482, -55910, -90558, -152405, -269321, -290275, -270193, -304888, -222728, -195543, -126409, -56987, -90488, -43560, -41914, -19154, -14846, -66765, -73610, -69459, -36467, -33992, -157016, -191423, -116373, -105596, -117048, -102062, -166917, -179331, -87786, 59818, 217392, 135018, 14687, -22052, -49695, -154089, -169331, -87453, -12701, 6395, 60916, -24734, -127115, -207039, -125961, -63139, -112619, -89906, -200728, -161397, -117336, -165223, -174063, -128292, -72291, -88189, 26920, 69350, -93904, -257557, -220873, -177718, -230795, -173681, -159993, -115819, -125296, -48738, 24802, -75257, 38723, 36370, -4961, 759, -43444, -86252, -40268, -102435, -39418, 62825]
16517F2825m5675j07957j13176r9265O5015P3101r3586l8038m2435M5341o8787
16506c62637M3442J92098K1558K4358M912r6155O684j02q4339j9264Q1053j3524
16494b01916J17882J960l1552M2476j0155l1639J9547j7743J1427q5941m0782
16483b26436M5251Q1081j9655k462N3622M2609O7647j73023j03901N1293N9982
16472a23992L6266K3648Q5754P9736l3815j2314j36474p8648r111J04950j2954
16461g6954K5239K9316l3553J4490m543n082l7075n210j2501R663P8060q5224
16449a03374o5000m7802m3818N9254J10525Q6621k2852j54002J22847J375j19182
16438a75408Q536M3275J46176n0499j67057n1818P0226L4202O9025j0101k0887
$$ y = [62825, 17150, -90807, -203983, -303248, -238233, -165132, -258718, -296756, -339191, -293850, -362637, -319195, -127097, -105539, -81181, -76269, -172424, -165740, -165842, -250181, -269445, -188392, -201916, -84034, -82074, -113626, -71150, -81305, -112944, -93397, -111140, -99713, -185654, -226436, -181185, -100104, -119759, -122221, -68599, -25990, 41657, -131366, -235267, -183974, -123992, -87726, -64078, 21676, 101412, 67597, 55283, -81191, -159839, -168950, -64000, -76954, -51715, -22399, -55952, -41462, -46005, -51087, -88162, -93372, -105873, -96210, -18150, -103374, -168374, -216176, -259994, -200740, -90215, -3594, -26446, -180448, -57601, -56226, -175408, -166872, -123597, 22579, -27920, -194977, -246795, -176569, -142367, -73342, -83443, -104330]
16427a04330L8560j6337L1581l91j4088k067m5178R2858J29769j1281j11973j38169
16415a51046O8846l5168r7859K7451j5262o8951m740M0844J5093O4190N845j8030
16403a68787k4936M0820J4084q9881P1661K0319j6314M7410J96897Q3666j18792
16392E6147o2083r488l7822l5923n8673l9966K3210N619j5509r967Q3894j1334
16380a11895p100j8479L9445o6507n3852O6617m4255K3882J60024K4959n134j91418
16368a83713p0627J00688N5116j30153J1205L1744J53591O0588j8525M7859M3749
16357A01522o0051j03945q5242j7240J2624j5708N711O5822K3702k097q5388r8934
16345b59224Q3945R6151o8808P1189M1692r1642j32358J1798J34451J03635j02140
$$ y = [-104330, -65770, -82107, -50526, -50917, -65005, -67072, -112250, -19392, 110377, 99096, -12877, -151046, -82200, -117368, -215227, -187776, -203038, -271989, -276729, -235885, -220792, -156602, -150757, -168787, -193723, -152903, -138819, -228700, -157039, -136720, -153034, -105624, 91273, 174939, 56147, -5936, -15424, -53246, -89169, -147842, -187808, -164598, -158979, -174488, -184455, -100561, -111895, -118995, -137474, -98029, -164536, -218388, -151771, -196026, -172144, -12120, 12839, 7705, -183713, -254340, -153652, -98536, -228689, -217484, -185740, -32149, 28439, 9914, 57773, 101522, 41471, -62474, -147716, -164956, -152332, -168040, -162329, -96507, -72805, -74902, -160290, -259224, -175279, -79128, -147936, -76747, -35055, -126697, -259055, -247257, -112806, -9171, -111311]
16334a11311p5363M7022L0136n671N6447Q6423r8373J0j18748j7363k3017l4253
16322b64061l3302O8269O837K4499n1455J27211q525k6373k7994k3085Q3093J4729
16310a10157k7249j3923j4131n621O9507m673J6280j8341r0031j3469R69R0823
16298a20016M3319q4074J3502P1492R3840k4308m2332K5396o0088n8932j5407
16287a57608K3279l8306J0903P8910j56868j25919N0487J39126J09403o2454P708
16276a21339j54833r05N2600N599J11445O7243j8464O0957K9133O7273j61527
16265f2818j16533j01747k2558O4024J91266Q2795r5652L6122n9290j19252M9939
16254a53704J54022L8381o2779J3622q1164j07946P4881O0145o3557L0407q0135
$$ y = [-111311, -186674, -139652, -109516, -115187, -58740, 27683, -70690, -70680, -189428, -206791, -229808, -264061, -297363, -229094, -222257, -197758, -249213, -122002, -130527, -156900, -184894, -207979, -124886, -110157, -137406, -151329, -165460, -171081, -101574, -106247, -89967, -108308, -198339, -211808, -210839, -120016, -76697, -160771, -147269, -75777, 18063, -6245, -48577, -23181, -83269, -142201, -157608, -134329, -172635, -161732, -82822, -239690, -365609, -315122, -175996, -66593, -129047, -121339, -276172, -277077, -224477, -218878, -107433, -40190, -58654, 2303, 31436, 98709, -62818, -179351, -281098, -303656, -239632, -48366, 34429, -61223, -25101, -84391, -203643, -153704, 318, 38699, -24080, -10458, -91622, -199568, -124687, -64542, -128099, -97692, -177827]
16243a77827P3037J5540r1681n1185N4502Q8338j17325l3387M4496O0986r7241
16232b31747j27646n9061J34410O9817P661J13649o9617q5251J574L2750K3747
16221a89714p4328l2582K4899M564N0184m9216k5262K02347m704q7799L8865J07425
16209c5321p672j6914k2457L8713J2504Q923o4431L6523j2992r6316p8183j6310
16197b53933Q5718P3034L5170l8170l8348p0130P6518K1597K4361l2360q500j48916
16185b73959M3503N4162q474M8864L1484N8014k9124P7804m5388o2568k8406m3597
16173a77685L1177L328j951N8946K2854j0352j00444k3659n6398L0701N5870K9323
16161a38290M9160M7988M8175Q6012j24679J9696M4774o8638j4530N4552M7043
$$ y = [-177827, -104790, -89250, -180931, -232116, -177614, -89276, -206601, -239988, -195492, -134506, -231747, -359393, -418454, -284044, -214227, -206566, -92917, -162534, -247785, -246211, -213461, -189714, -264042, -296624, -271725, -267161, -216977, -266193, -291455, -89108, -93812, -181611, -142746, -35321, -42993, -59907, -82364, -43651, -31147, -22224, -86655, -50132, -63124, -159440, -237623, -253933, -168215, -95181, -60011, -98181, -136529, -206659, -130141, -108544, -84183, -116543, -125043, -273959, -230456, -176294, -184768, -135904, -104420, -46406, -75530, 2274, -43114, -105682, -134088, -177685, -146508, -143180, -145131, -86185, -63331, -73683, -174127, -197786, -254184, -223483, -167613, -138290, -89130, -41142, 7033, 93045, -31634, -11938, 32836, -35802, -50332, 4220, 51263]
16150E1263l9117j13030o6005l6574J4626Q3228j4684L5287k2935m4753J46939
16139e755J4198m0169r4856j0890O5663R746k8422o737o8533o1997P985r3556
16127c13323l1502Q5233J02418k5444J3685O2625k5317M2041J0107m3231O0416
16116f2292M7899K4894L026k665r7676n8908O545O9699R6465N9771j2148q2502
16104g892j10532q3194j00064P2756r954n1649L2481m4704J04615M5089m2017
16093a95065N9877j31945o2507K4031J04097P3047l6519j45183R300M5301J01883
16082a53683R5431O711N683k8693j03224N8459R8449O7685q8540l5187p8941k7645
16070a83495l4065L3929k2582K8372M1701J4779m2607J24791j6220l5911o1961
$$ y = [51263, 12146, -100884, -166889, -203463, -188837, -105609, -120293, -85006, -107941, -152694, -5755, 8443, -31726, -126582, -137472, -71809, -62063, -90485, -97222, -165755, -227752, -219767, -313323, -344825, -259592, -157174, -182618, -168933, -106308, -131625, -89584, -79477, -122708, -62292, -14393, 10501, 13527, 10862, -86814, -145722, -139177, -69478, 26987, 86758, 74610, -7892, -118424, -201618, -301682, -228926, -238880, -290529, -258048, -302752, -198137, -153048, -195065, -135188, -267133, -329640, -305609, -201512, -128465, -164984, -310167, -300867, -255566, -153683, -58252, -51541, -45858, -74551, -177775, -119316, -20867, 46818, -41722, -76909, -155850, -183495, -217560, -183631, -206213, -177841, -136140, -121361, -163968, -39177, -55397, -91308, -153269]
16059a53269j8864N7822P1656J04969j0249j324M309j1156K4375k4709o9636j21025
16047a47101N5122L6847j0870k1728r891j17003Q11L3944n237o2820l4362M4769
16035b37519Q4034L6872K8207n2785q055O5064P1715q0344l5189J95525Q0451
16024A47976K3593J44174m9319j48654j77806O8772N952p9111n443M0123p3285
16013a03028o9854M3795o381N4365L9333n341m0717M9654J66521k3991k1655p2044
16001A0657n0289J9649k499m8207K5264O7972q0673Q269j5312o6806m0758J4752
15989a57981r6653M83R2776M0147J16683Q2934k3122L6190m0948m6897n7463K7294
15977b6557l7159j04122j02128N4509N1973P9561K5593k4452n9311J711P7867
$$ y = [-153269, -172133, -114311, -42655, 62314, 52065, 50741, 55050, 43894, 68269, 43560, -26076, -147101, -91979, -55132, -66002, -87730, -97621, -214624, -213813, -179869, -185106, -247926, -282288, -237519, -153485, -116613, -88406, -141191, -149246, -84182, -12467, -92811, -128000, 67525, 147976, 171569, 315743, 266424, 117770, -60036, 8736, 14688, -64423, -69866, -29743, -103028, -172882, -129087, -135468, -81103, -41770, -47111, -87828, -38174, 128347, 104356, 82701, 10657, -39632, -19983, -22482, -70689, -45425, 22547, -58126, -49857, -65169, -131975, -172733, -157981, -254634, -254151, -161375, -121228, -4545, 78389, 55267, 91457, 50509, 3612, -53851, -26557, -63716, -167838, -269966, -215457, -163484, -83923, -58330, -82782, -142093, -140382, -62515]
15966f2515R7064k7860m1341L7544r755m1547j6615M1975Q2647J08043p2907j10995
15954a6262J6830l611j5488j52240l8498Q8300N6756r3007J00297K1688k5498
15943f0733k9862o1360M1625K3495o3999l7344J05811J21416P3493l1737o4471
15932A6334L9793M4967n6869l9689J4396M8069M842j50222j38102m0821N040k2081
15920b74343N6602M0498J4993r1214o629j28184P2134R5187m3381j16210P3082
15909c07465J29612r062M7581N9950P1717k1585n935m0867L4262q9317j03890
15898b34999J61975J04273j45220p2430N3645L6534K325j93P5713m1007k0040
15887g9424j1694M6630L5203M2m1911n2482K4899M6495M312o5232K2288P3001
$$ y = [-62515, 34549, 6689, -34652, 2892, -6863, -48410, -65025, -23050, 59597, 167640, 94733, -16262, 568, -3043, -18531, -170771, -209269, -120969, -64213, -157220, -56923, -35235, -60733, -90595, -151955, -110330, -86835, -150834, -188178, -82367, 39049, 112542, 80805, 16334, 56127, 101094, 44225, 4536, 18932, 67001, 71843, -78379, -216481, -257302, -252262, -274343, -217741, -177243, -162250, -253464, -260093, -388277, -316143, -220956, -264337, -380547, -307465, -177853, -186915, -139334, -79384, -7667, -29252, -35187, -76054, -41792, -131109, -234999, -73024, 31249, -113971, -186401, -132756, -96222, -93897, -94090, -18377, -59384, -79424, -91118, -44488, -9285, -9243, -51154, -103636, -78737, -32242, -27930, -93162, -70874, 2127]
15875B127N3183M1918J456Q066m9519K4880l520p8051r067N8353l103q0308q4105
15862a17690P5727J07210J10915m1855j61515k9510N9604M3148j29208j93232
15852b76406p8693R8721J36131L7656q453j8548j07403K2016m742L6783Q235n1621
15840b06324K5028Q4787Q7252P3521j13766p2496Q829O1196k5564K8254n5087
15829a04370o8078O1694P7423J4830R315k246k1451m8244O61q7824l2056M4690
15817a55656L1821m8170Q3694M7593m9200p3571K8749Q9803j17139j7699P7996
15806a01779m8602L8389J48250p8377q9812m159J2260j02225J4612R5440O9820
15795d6183p2511L3398l5464J24447N7318K8274j22932j63198j13805Q7373J30542
$$ y = [2127, 55310, 97228, 98684, 106750, 57231, 82111, 78591, 540, -8527, 49826, 46723, -33585, -117690, -41963, 65247, 176162, 134307, -27208, -56718, 2886, 46034, -83174, -276406, -355099, -256378, -120247, -82591, -91044, -109592, -216995, -194979, -199721, -162938, -154703, -206324, -181296, -96509, -9257, 64264, -49502, -121998, -113169, -51973, -77537, -49283, -104370, -172448, -110754, -33331, -18501, -9186, -11432, -32883, -81127, -80466, -168290, -200346, -155656, -123835, -172005, -88311, -40718, -89918, -163489, -134740, -44937, -162076, -179775, -101779, -150381, -111992, 36258, -42119, -131931, -136090, -123830, -226055, -211443, -116003, -46183, -118694, -85296, -120760, 3687, 61005, 89279, -33653, -196851, -310656, -223283, -92741]
15784i2741j06093j01983Q3260M7262P2051P3699M3853L7598O7119n1637L5530
15773A07918r321j64765m9579J5006J33862o95q6634p2712l6489M2037P3350q9771
15761a37793O9750K057n9217j6061m7264M621k46m0926O0585J7657N7642N9952
15749b9243J0890Q4659O9041j2012q5479j48632L0662J31195R1206o6965j12718
15738c7396m0786m0152K4325k3656k2166l5240R3976J15367o9000o2662o4341
15727a61731M446L3635j4795k9950n019R1058J44762N2517M9756j47055j29215
15716a11591j3347J47400o8840L0145j6610M4108J0033l0111n0885j21901J248
15705a80351J41312J02225M0858j14343o5911j14778j05080L1400L4060k765O3938
$$ y = [-92741, -198834, -300817, -217557, -170295, -98244, -24545, 19308, 56906, 124025, 72388, 107918, 98597, -66168, -115747, -100741, 33121, 32426, -54208, -126920, -163409, -121372, -48022, -137793, -68043, -65986, -125203, -141264, -188528, -183907, -184153, -225079, -164494, -146837, -89195, -29243, -18353, 66306, 135347, 123335, 37856, -110776, -80114, 51081, 142287, 75322, -37396, -78182, -118334, -94009, -117665, -139831, -175071, -81095, 34272, -34728, -97390, -161731, -157285, -123650, -138445, -168395, -173414, -82356, 62406, 114923, 164679, 17624, -111591, -124938, 22462, -46378, -16233, -32843, 11265, 21298, -8813, -59698, -181599, -180351, -39039, 63186, 104044, -10299, -76210, -190988, -296068, -264668, -230608, -233373, -169435]
15694a69435k3979r3185q148J08302r4714J41905J8885k2843N4680o5158J7163
15683a36527P6804J36793O6195l5943L1492m2162q8877J34650N7267M3879k4630
15672B18941j46913n3735L1580o9327n4278p7506l4246N1026J6326n379j54478
15661b77989Q8724R9123L5880J3848n8607p0461l2634N151O1355P8793P9411q7652
15649f5058o0980J9704N2783K99Q9904m6612P360M5349K1567k8776r7820j28824
15637a91104l8070K5975o7231R3872R3468o6065j8834J43410J0026q813j05107
15626a28473J1776J22434k0214K1880N2966k4301r0419n7117Q8730p0636o1102
15615a54476L8869l8209j24939M2827O6905J52150P9654l3973l3963J01095J7452
$$ y = [-169435, -193414, -286599, -294747, -186445, -281159, -139254, -120369, -143212, -88532, -153690, -136527, -59723, 77070, 143265, 107322, 138814, 96652, 7775, 142425, 199692, 243571, 218941, 72028, 18293, 49873, -19454, -73732, -151238, -185484, -134458, -118132, -123511, -277989, -189265, -90142, -54262, -40414, -99021, -169482, -202116, -196965, -135610, -56817, 22594, -65058, -126038, -106334, -53551, -53252, 36652, -9960, -2600, 42749, 64316, 35540, -62280, -191104, -229174, -203199, -270430, -176558, -83090, -149155, -167989, -24579, -14553, -23366, -128473, -116697, 5737, -14477, 7403, 60369, 36068, -54351, -111468, -22738, -93374, -154476, -115607, -153816, -278755, -235928, -169023, -16873, 62781, 28808, -5155, 95940, 113392]
15604A13392j20776j32895p1332J163J06440J46649K9999j31670p4110J7005M5226
15593g0909J22170J6795j17141q3817O2557M1181P0197m9794p1474j8643O582
15582i2296R969k3080P6543m5772n9501M3241K2175M1898m4805P583O0381p2822
15570g6486j5003k9744J6051Q7732L6303n2891k9677n6932L7918K7809m0608j50031
15558b45559q550M321J9852j8756J8574P7955J3635p747o5740M9811J23506p2124
15546a10822K3211L514m0294R6461K5597O5898J07808l1669k4214N0449r1850
15535G4089O375j6697p4842j53157O4610J96033l4958j4195q6819p0064P1261
15524c8364R6648P3001n8028j09825o4566J29935J31783j944j0503p4078l1333
$$ y = [113392, -7384, -140279, -211611, -210448, -104008, 42641, 72640, -59030, -133140, -116135, -70909, 51261, 68056, -49085, -132902, -70345, -29164, 41033, -8761, -80235, -98878, -92296, -82327, -105407, -28864, -74636, -134137, -90896, -68721, -26823, -71628, -64045, -3664, -76486, -91489, -121233, -105182, -17450, 18853, -34038, -63715, -120647, -82729, -54920, -95528, -245559, -254109, -249788, -229936, -248692, -230118, -152163, -138528, -146275, -212015, -162204, -38698, -110822, -87611, -84097, -124391, -27930, -2333, 63565, 171373, 139704, 115490, 165939, 74089, 80464, 63767, -11075, -164232, -99622, 96411, 61453, 47258, -39561, -109625, -38364, 58284, 131285, 73257, -36568, -101134, 28801, 160584, 158640, 148137, 74059, 42726]
15513D2726o5939q9761K5514k0163N4446k1959O503M4723O3661L5482K7586q0626
15501B2193p1929l9640L4156J41897q7322L6801P0126m5987L550k7004m8726J9125
15489G240R5163l8996q4285k6532j6453j05298n7397L0247J16154K7748K0073
15478c2336l7278k2638j9283M5335R701o1413N4764O0831j06484K0562J564p8804
15466a65479L7268R4008J03399q5688n7364L228K4169N2888l7608N8000p1733
15455d4912p5736O2043q6513k1591M2912m3221K6497J42812O341p4025m3526J40000
15443C1081R1339q0j24802j9260O9862M0159r3659l6227k7748j16209N101l5715
15431b16158L4414L2717O7911M1408K1437M1612q4106l7909K5520J62006K5501
$$ y = [42726, -23213, -112974, -87460, -107623, -53177, -75136, -68633, -23910, 39751, 75233, 102819, 22193, -49736, -89376, -55220, 86677, -645, 36156, 106282, 60295, 63845, 36841, -11885, 7240, 102403, 63407, -20878, -47410, -63863, -169161, -226558, -196311, -80157, -52409, -32336, -69614, -92252, -111535, -66200, -56499, -117912, -63148, -2317, -108801, -88239, -86675, -165479, -128211, -34203, 69196, -16492, -73856, -70628, -46459, 6429, -31179, 26821, -44912, -120648, -58605, -145118, -166709, -123797, -167018, -140521, 2291, 8632, -65393, -108919, 31081, 122420, 122340, -2462, -21722, 48140, 88299, -5360, -41587, -69335, -185544, -180443, -216158, -181744, -149027, -81116, -39708, -18271, 23341, -60765, -98674, -73154, 88852, 114353]
15420A14353l7862J6751J17573J21166o5080j51605k00575k2721O6898J02807
15410F1705p3n8858n2873o3052O8176N8374r4318N5886M7983Q62j096l9368l1239
15397d7891P9888r1752p7252l8370M2968r8255N9512J83914M690j04055J8357
15386f8246J06379K8469R706m5803l3606R4493k7416l3548m7314j6428n8489p749
15374i9552P3054Q3838m7049j24450K4749K8862N6187k2798M208Q769J8122q3858
15362g9918Q5479P4305k1180k1161p7203O9981o869n5030J4547k4470q9274m5416
15350a76209J36917m8470j11215M5266K22886J05189o0464O4669r7310k6597R9184
15339A53846o0150J9833j05077j57435N8118J15194j3474j3557O955K4526j5450
$$ y = [114353, 76491, 93242, 210815, 331981, 266901, 115296, -85279, -108000, -41102, 61705, 61632, 2774, -50099, -113151, -44975, 13399, -80919, -25033, 22950, 23812, 22716, -16652, -47891, 31997, -59755, -137007, -175377, -132409, -230664, -171152, 12762, 17452, -86603, -68246, 38133, 66602, 76308, 30505, -3101, 91392, 63976, 30428, -16886, -33314, -91803, -99552, -26498, 57340, 10291, -114159, -89410, -60548, -4361, -27159, -22951, -14182, 3940, -79918, 5561, 79866, 58686, 37525, -39678, 30303, 23434, -31596, -17049, -41519, -130793, -176209, -39292, -87762, -198977, -153711, 69175, 174364, 113900, 178569, 81259, 54662, 153846, 93696, 113529, 8452, -148983, -90865, 24329, 10855, -2702, 4253, 28779, 13329]
15328A3329k672q2081M2781M7721j38387l7055P3611k4040k9510Q0716M6153j2894
15316b2328J2800L06m2258m2041Q19J3776P365q2310q4672J03081L3284L8184
15304f3994O7m7639j8488J7358Q6114K4450M1853j74406q5237J7997N8206N5858
15292h7861J7725p174L9630j2115K7828M712l2145M5655M3343P955J6589j25789
15280f1647O828m5473O5908p7881l0783n475M5459J3959P398L7241L3582N6210
15268D5326m6982j6426L5262j07737L1200l7917q9039P9821N9247j4965o2919
15257a25129N6641Q0651R0155J6439o9489m1096o8981J6682R1996R2830l6051
15246A04648j71367j17044O8658J32760P2936o7339n0516j7553l4254K60M5396
$$ y = [13329, 10657, -71424, -28643, 19078, -119309, -156364, -82753, -106793, -136303, -55587, -9434, -22328, -9528, -9222, -51480, -93521, -92702, -78926, -71561, -153871, -238543, -135462, -102178, -63994, -63927, -111566, -130054, -112696, -26582, -2132, 39721, -134685, -219922, -201925, -143719, -87861, -70136, -77310, -37680, -49795, -21967, -17255, -49400, -3745, 39598, 47553, 64142, -61647, -54819, -100292, -34384, -112265, -143048, -148523, -103064, -89105, -81707, -44466, -10884, 45326, -1656, -18082, 17180, -90557, -59357, -97274, -186313, -106492, -47245, -62210, -125129, -68488, 12163, 102318, 118757, 49268, 8172, -60809, -44127, 47869, 140699, 104648, -66719, -183763, -115105, 17655, 90591, 23252, -27264, -44817, -79071, -78811, -33415]
15235c3415L1581O181o7248L2379N8432K8357o2090o1432j11435J1717J5470N0839
15223a00664J5154o9437O2799O6624j5072n9055j0487L1188N5333P0306o5995
15212a9306J162R7961l7146r6263p1617l2973O4299R5137O6023k5479K5954N9869
15200A27621l7438n5698j01742o9597k9211N3269N6571L9007O295l6995M5627
15189b291N2349J57618O1158Q25q4810n0511j3390L5163L4024p1264p4977J48133
15177A92027j8641r7712j6944J9238M2513Q3055j32236n7621q8661n0555Q8560
15166c6977l518p7988n291j12140j1425R112J16904L7663J34620O8124p4480j37457
15154i2853j2371L3605l0819l9419J45109Q1389k758j4738J11578N0728k39858
$$ y = [-33415, -1834, 4347, -62901, -30522, 27910, 56267, -5823, -67255, -178690, -166973, -151503, -100664, -85510, -154947, -92148, -25524, -40596, -99651, -110138, -78950, -23617, 46689, -19306, -18144, 79817, 42671, -53592, -125209, -158182, -93883, 1254, 67277, 41798, 67752, 127621, 90183, 34485, -67257, -136854, -166065, -112796, -56225, -17218, -10923, -47918, -2291, 50058, 207676, 268834, 269659, 184849, 134338, 120948, 156111, 190135, 118871, 43894, 192027, 173386, 75674, 58730, 77968, 120481, 203536, 71300, 13679, -74982, -125537, -36977, -40495, -118483, -123774, -235914, -247339, -238227, -121323, -83660, 50960, 119084, 44604, -92853, -105224, -71619, -102438, -141857, 3252, 84641, 81883, 67145, 178723, 229451, -10407]
15143a0407j71893N3185N7438M2217J6926N5655O7720K6136k8047j86482n0952
15132a28504O3726M2476O0183n1204m3246k3354O7969k4809m7479J15134o03j9164
15120A1125L7239m2426o283J8432n4320p792M8522O4995j11560l9612Q8985Q6668
15108I3973q2725n2380J04122Q2542J8643k9986q3641M6614L4235p4428O552k9376
15096C4145q8785k458P3745k9697R2517J05944q6229j6430K8205j229m2534j8314
15084D8880N4107P0053n2201k26199j09176m3252P4579J04214J5419P9077m8726
15073c3225j51794j07250Q0773J67826l571L971R1653J013o8657l4098L6785O0722
15061D4148P832R4221O0633l2129r0786K0220j6955j6409N6120J3133P4207j15339
$$ y = [-10407, -182300, -129115, -71677, -29460, -12534, 43121, 110841, 136977, 108930, -77552, -128504, -64778, -22302, 37881, -13323, -56569, -79923, -11954, -36763, -84242, 30892, 30289, 11125, 48364, 5938, -345, 18087, -36233, -44025, 4497, 69492, -42068, -81680, 7305, 93973, 11248, -41132, 62990, 145532, 164175, 134189, 50548, 97162, 131397, 56969, 63521, 34145, -54640, -57098, 16647, -13050, 79467, 185411, 99182, 82752, 110957, 109728, 67194, 48880, 102987, 173040, 120839, -105360, -214536, -257788, -183209, -78995, -63576, 15501, -33225, -185019, -292269, -211496, -43670, -47241, -43270, 48383, 49396, -19261, -53359, -16574, 44148, 51980, 146201, 206834, 174705, 83919, 104139, 87184, 70775, 126895, 140028, 214235, 98896]
15049I8896j40215Q7629L8214m6390n1049o0169m3316P8040K20948K9104p2059
15038A39633o6451N3082M612m5876j10734j10590o4355J28808M5780n6053Q9703
15027G559p6879n6008K8160q6571J09611O1231p5291q5803l8132J21772R9998
15016I647M7485n3109l8683n9016N8807N6689J00270o1742j18274q962q5189n6628
15004b08705J01368j4799l646M2427J03926P6267n3482o4209p3370r9468K3925
14993a69766O2682L4947j3718M085J1125M804K5449K2338M566l3992p4890O9249
14981e3121Q8042Q2800n6015k5221k348j3661m7088r6854m3632j3753L6074q6023
14969b30800O0365K7750K7900L7867o4763n6134N2937L0894l8175o5359J0142
$$ y = [98896, -41319, 46310, 84524, 38134, -12915, -73084, -116400, -38360, 182588, 211692, 139633, 73182, 126264, 130876, 85000, -25734, -136324, -200679, -71871, -26091, -82144, 7559, -69320, -125328, -97168, -183739, -74128, -12897, -88188, -173991, -212123, -90351, 9647, 57132, 4023, -34660, -93676, -34869, 21820, 122090, 60348, -57926, -66888, -152077, -208705, -107337, -122136, -125782, -83355, 20571, 96838, 43356, -20853, -94223, -193691, -169766, -107084, -72137, -85855, -81770, -70645, -65841, -40392, -18054, -13488, -47480, -122370, -53121, 34921, 117721, 61706, 36485, 34137, 20476, -26612, -123466, -167098, -180851, -144777, -230800, -170435, -142685, -114785, -76918, -141681, -197815, -144878, -113984, -152159, -217518, -207376]
14958b07376M550k7810M5117n2452Q2018O9714J43066Q5010p2463n3271P2451
14947H8554N5685k2838j09886o027L7614r223l6302k23K2539K7551j5162L2936
14935F5218K3204q2697m6514j620o492O1829O0936j1005n2260k1579M9966J8411
14923E7397K2517j3884k8815l247r0488k7049n6148J68621J00305k761o9257M7048
14911A04239M9203J1938j15886Q2787J05420p292l7504o2361O149R3432k9397
14900B00728j63504m5274J63281P4971J6990q5050o62m3657k9554J31686R6863
14889C16818j24260p8694k9580L1510j1442j10886P8319P3929l582K2084k5259
14878A38957n8212l2783J9224o6561n5262j9277J37907o8609j29204N4007K0554
$$ y = [-207376, -202826, -230636, -185519, -237971, -155953, -86239, 56827, 141837, 69374, 16103, 88554, 144239, 121401, 11515, 5488, 43102, 33879, -2423, -2646, 19893, 47444, 32282, 65218, 88422, 5725, -40789, -42409, -48901, 12928, 73864, 62859, 10599, -10980, 38986, 57397, 79914, 66030, 37215, 33968, -56520, -83569, -139717, 28904, 129209, 126448, 57191, 104239, 153442, 165380, 49494, 132281, 237701, 230409, 192905, 130544, 136693, 230125, 200728, 37224, -8050, 155231, 230202, 247192, 162142, 161480, 117823, 88269, 219955, 316818, 192558, 113864, 84284, 115794, 104352, -6534, 71785, 145714, 142132, 164216, 138957, 80745, 47962, 67186, 625, -54637, -73914, 63993, -4616, -133820, -79813, -59259]
14867e9259n7537R84J74253J5013N412L1630R8253r4117r9094m4341M7067m7977
14855b9713O9550K9498O043k0886n4989L7919Q9318O8571k2316o3269j5822J9346
14843A13250k528J395o1358q8807n6659L6731K0681J2437J9500j6044j2516O9815
14831C5897M6208n4985k39k0772j8198Q0799N341j06911K4583P0210J43663J7023
14819B22619j22524m3056n4347J6424J76152p5148j75452m2578K9981J22465R432
14808F3968j75042k4895L1307J10317O6420L9276N835K3480O4330M084K2989l3272
14796A98797n7827P43L9365n8683p8011l7751J07942J84731j7103j9928j39232
14785A23043Q088p2068n2206J5554L5276k0968k5227j09577P4570O293n3901L9811
$$ y = [-59259, -116796, -115812, 58441, 73454, 78866, 110496, 208749, 114632, 15538, -28803, 18264, -29713, 39837, 69335, 75378, 54492, -497, 37422, 126740, 195311, 172995, 109726, 93904, 113250, 110722, 112117, 50759, -38048, -94707, -57976, -37295, -24858, -5358, -21402, -33918, 35897, 82105, 27120, 26881, 6109, -12089, 68710, 74051, -32860, -8277, 61933, 205596, 222619, 100095, 57039, 2692, 19116, 195268, 120120, -55332, -97910, -67929, 54536, 63968, -111074, -135969, -104662, 5655, 72075, 111351, 117186, 140666, 204996, 209080, 232069, 198797, 140970, 141713, 181078, 122395, 44384, 6633, 114575, 299306, 282203, 262275, 123043, 131131, 59063, 6857, 22411, 57687, 36719, 11492, -98085, -23515, -17222, -71123, -31312]
14773c1312J14634J6170m3841l8393j2726L873p7399K3304Q5662J8295j2533k482
14761D3252m3315J24058k4658j70043J5019L9790N148O5442J20753l9030p8286
14750E8130n2131n0982J59202R1749l1604k3010o3698r1853K5659M8833O705q0036
14738c036m6348l297M9346Q3102q9940K6746L8513n4526l27L8589K4268j1160
14726E1930r6720l2248P3527M9401j0097o5619J8731J41693m6292r5877k2640
14715c4211J6153o1665L4413O442M3434k8042n4498K005R5258J02257J36041J3335
14703B70922o2555r2533j05397o1527k4353R1053P003O8651M3433M7060n8681
14692A23076k5926r271L1999K4680p4242q9497O2872P7627j720o2425k3980m6564
$$ y = [-31312, 83322, 99492, 55651, 17258, 4532, 8405, -68994, -45690, 39972, 58267, 45734, 43252, -63, 123995, 99337, -70706, -55687, -15897, -10749, 54693, 175446, 136416, 58130, 5999, -44983, 114219, 205968, 174364, 151354, 87656, -4197, 21462, 70295, 77000, -3036, -49384, -52681, -3335, 79767, -10173, 16573, 55086, 560, 233, 38822, 63090, 51930, -44790, -77038, -3511, 45890, 35793, -29826, -11095, 130598, 84306, -11571, -34211, -18058, -79723, -45310, -38868, 4566, -23476, -77974, -75969, 19289, 121546, 257587, 270922, 208367, 115834, 10437, -51090, -75443, 15610, 22613, 91264, 134697, 181757, 123076, 97150, 87879, 119878, 144558, 70316, -19181, 43691, 121318, 119598, 57173, 33193, -13371]
14680a3371L704J72646n3779j13459N1778P8694r1365r649k5507J4508j13937
14669i9737J06195J04520K3325O1688M1163m2890m2619P1598j09470p4202K8290
14658F7861J4828j31814m2002k5044R3634O5547p8978o3465R6820K0797p716j5884
14646e416K2760J33858J6774m2863r9086P9595J17244o1382n2367Q1544q717o2649
14634A19295J5257O4073J869j37829p0765n7121O539P9691P1081l3180K6026O7010
14622A51946j9316p3522m347M2542m4554m5619N6276P2385Q718k4646J0892R2905
14610B23660m5744o4345l4252j29008J6657k3231l3399l8859J75896J60679P5323
14599B83377j0514r8847l0426m9803o746o6709n4431k5551O2180R7238K7992n5930
$$ y = [-13371, -9667, 162979, 109200, -4259, 47519, 126213, 34848, 25199, -308, 14200, -99737, 6458, 110978, 134303, 195991, 237154, 194264, 151645, 223243, 113773, 39571, 67861, 82689, -49125, -91127, -116171, -22537, 43010, -35968, -99433, -2613, 18184, 10468, -5416, 17344, 151202, 167976, 125113, 26027, 105622, 222866, 161484, 109117, 190661, 181944, 119295, 134552, 198625, 200494, 62665, -8100, -65221, -58682, 21009, 92090, 58910, 84936, 151946, 132630, 59108, 54761, 97303, 52749, 7130, 63406, 135791, 144509, 119863, 130755, 223660, 177916, 113571, 79319, -49689, -33032, -56263, -89662, -128521, 47375, 208054, 283377, 272863, 174016, 143590, 93787, 87041, 20332, -34099, -59650, 2530, 99768, 127760, 71830]
14587G1830l1576P3489L2161J0401j02832m5556L4322l4580j6571P714P3597j433
14575G0966m2267K4204q269j6659j37926o192R5947Q9067L0535j0707N5483N278
14563A49460P1778Q1012n9475l9617K4369o2508q2893n0635j4299K2218K1300
14552F0710J426m5298N825K0799J27259k2586K4202r153P1899K836R0706n0213
14540B78412n6904K0008j02729r0671P4783P451J92024N4369j14471j13194n0916
14529I8162j2674P8739K4098j1971K1493P241p3221o8263L9282J29920m7929p6781
14517A08096r835K7922M1278N0090j19570o9987J9098J03485M0424J3138k3595
14506A80544p6007O4039J01447K4905O197l2603j45372p6195p9522q5779K6973
$$ y = [71830, 40254, 113743, 145904, 156305, 53473, 7917, 42239, 7659, -8912, -1198, 72399, 70966, 28699, 52903, 44634, 27975, -109951, -116143, -20196, 68871, 99406, 88699, 144182, 149460, 221238, 302250, 242775, 203158, 227527, 165019, 82126, 31491, 17192, 39410, 60710, 62136, 16838, 22663, 43462, 170721, 148135, 172337, 163184, 235083, 237919, 328625, 278412, 221508, 241516, 138787, 48116, 122899, 130350, 322374, 376743, 262272, 149078, 98162, 85488, 164227, 188325, 176354, 197847, 205088, 131867, 63604, 102886, 232806, 184877, 108096, 98261, 126183, 167461, 217551, 97981, 27994, 47092, 150577, 191001, 204139, 180544, 104537, 168576, 270023, 294928, 301125, 268522, 123150, 46955, -32567, -118346, -91373]
14495i1373q403R2717Q0268L2307N0615R7788j9321J3971j21481k7662j4491q2926
14483B009Q1230M4607j1827J49526k0501r1053q2189p1492l7182J18628K0532
14472A02288J25862m416Q0702p0044j16172L2258l6256Q599Q45j10498K2902k3645
14460A2425m6984r773K1883N5862j0474l5823K566r4950P131M3669N9666o717
14448a519q5517R1891J21875j1357O9755O894j2319m1467L2844M4209J2966r402
14436B18853r7177l9742m7677O1284J30394n5047l2105m0040n4761q4923m243
14425d5184M9751Q8591J95975k7033j38975L9665L9782q1220j22985m3253Q7285
14414D2399J03887l511O888k3788l0768J62722m5527r9445l4479P8489p501M09
$$ y = [-91373, -99776, -7059, 73209, 105516, 156131, 253919, 234598, 248569, 127088, 99426, 84935, 2009, 83239, 127846, 116019, 265545, 245044, 153991, 71802, 310, -36872, 81756, 102288, 228150, 223734, 304436, 234392, 118220, 150478, 114222, 122821, 123666, 13168, 36070, 12425, -34559, -44332, -22449, 33413, 22939, -12884, -10318, -105268, -98137, -54468, 5198, -1519, -87036, 4855, 126730, 115373, 185128, 192022, 179703, 138236, 171080, 215289, 228255, 218853, 121676, 81934, 34257, 95541, 225935, 170888, 138783, 98743, 43982, -40941, -45184, 4567, 93158, 289133, 262100, 123125, 162790, 202572, 121352, -1633, -44886, 42399, 146286, 142775, 149663, 125875, 95107, 257829, 212302, 112857, 78378, 156867, 149366, 149775]
14402A49775K1954J9232K9755j03366m8921L7148K3055R8280L6633o4079J25924
14391C25390j07817j55877l1834J2152J50528K5392q2251K1370m0687j8527J12016
14380B09855N1736j5630k9587q2594N1313K8109K6894M6529J77828p0373o8668
14369C25412j8093r3050j40137O0694M8659q4339m8655N8026L3736N5015N857
14358B03125R631l6059L5882m5284n9971P1374L8573q3845j3227j2485K0981l6801
14346I1894L8035N3517J0685q0468r832J07594m8665o218P7546n9o362m3242L1717
14333B16142N4462r3706p6720J4255N6L084P6198Q3669N0658l0092q3176j26340
14321H8490j02709Q5657j07987n4226O7902P0514R4018K1239J7414j60909J2884
$$ y = [149775, 171729, 190961, 220716, 117350, 68429, 105577, 128632, 226912, 263545, 199466, 325390, 217573, 61696, 29862, 42014, 192542, 217934, 135683, 157053, 116366, 97839, 209855, 261591, 245961, 216374, 133780, 185093, 213202, 240096, 286625, 464453, 394080, 325412, 307319, 214269, 74132, 134826, 183485, 99146, 50491, 108517, 142253, 197268, 203125, 212756, 176697, 212579, 167295, 107324, 178698, 217271, 133426, 120199, 107714, 128695, 91894, 129929, 183446, 194131, 113663, 103831, 211425, 162760, 156542, 234088, 234029, 227667, 184425, 216142, 270604, 176898, 100178, 114433, 114489, 117573, 193771, 277440, 328098, 298006, 214830, 88490, -14219, 71438, -36549, -90775, -22873, 47641, 141659, 162898, 180312, 19403, 32287]
14310C2287O2954l3905K9960p000l2006M9144J19271O0127P991l0468J2410o7398
14298B03367n4564q3615j7254J3312j4328P5266J33047K7461r2162q0136J436
14287A11830k7121J0767r2321o6966n0900j1251J26496J28953j30821j03394O5397
14276c9331J68732J33553R6395k28805k6251J00002Q5259m6480j1995Q2926n669
14265C08336p9110J33L556K7277j1586j858Q3812q7548O8350J00645j02650j43330
14253A66027m6104n825J33873N4297q4832r9233M4904M8984m6906K1901r4285
14242I2801j46031p2143J3435M8389L5441N8151J10661L993q2718m5789J15720
14231A31910Q8045q3855j20576j7420K995M5165m5529j38565P3403J10684L7719
$$ y = [32287, 95241, 61336, 91296, 84296, 52290, 101434, 220705, 280832, 288823, 258355, 270765, 203367, 148803, 65188, 47934, 61246, 46918, 122184, 255231, 282692, 190530, 110394, 111830, 84709, 95476, 3155, -63811, -114711, -125962, 534, 129487, -1334, -104728, -39331, 129401, 262954, 359349, 130544, 104293, 204295, 289554, 243074, 231079, 314005, 308336, 229226, 229359, 232915, 260192, 248606, 246748, 330560, 243012, 311362, 412007, 309357, 166027, 119923, 114098, 247971, 302268, 217436, 118203, 163107, 212091, 165185, 187086, 92801, -53230, -125373, -111938, -63549, -28108, 30043, 140704, 144697, 61979, 16190, 131910, 219955, 136100, 15524, -1896, 1099, 46264, 735, -137830, -64427, 46257, 83976]
14220H3976L4729p5176L1843Q3590J85600L4952n7134j04838o6879O6271O2201
14209B79135l7347j06269j5312P6856n0020J4192L2433r970O6681k2047n6300
14198A72032n6161P6783M8251p5419j15636P8886J4917J9509n4187j655r4249
14187A3071J29205J31614o2214L115k7336p7354o9923j4310O5356L4715o6253
14176E9686O1126P8663M6040j20135L174j2320l4494o9319K9711R3776J18635
14165B54543J8297j60182K6375j8499k2197L12k705J28710O0033l7839n4780o0009
14153A32059m2880O968n4704J70434M4388n7830k3513j1141O4965J40057k0834
14142C47969m3717q3762p4794l5860J28138p7961j44757l1518k8388R2534Q0666
$$ y = [83976, 118705, 43529, 75372, 158962, 344562, 379514, 322380, 217542, 150663, 216934, 279135, 241788, 135519, 120207, 197063, 147043, 161235, 193668, 183698, 250379, 228332, 172032, 115871, 192654, 240905, 165486, 49850, 128736, 143653, 163162, 108975, 107320, 13071, 142276, 273890, 211676, 214791, 187455, 110101, 40178, 25868, 91224, 125939, 59686, 120812, 199475, 245515, 125380, 128554, 116234, 81740, 12421, 42132, 135908, 254543, 272840, 112658, 139033, 120534, 98337, 98649, 95944, 224654, 284687, 246848, 192068, 132059, 89179, 96147, 41443, 211877, 256265, 198435, 174922, 163781, 228746, 368803, 347969, 304252, 220490, 145696, 109836, 237974, 160013, 15256, -16262, -44650, 47884, 128550]
14131A28550K3560M9176O7424J6303q405j30256m9024Q1655j143p8985l5253L6257
14119I9859O5485K6429K4118m6789M5693P9155L8323l3902j71303n1066Q0930
14108A56932L4727j35283l0751N4772k9692k7464o848J627O3516n3209N441J21570
14096A55338M4609R9614Q059q6292q7713j4161N4584M6745M0656m4073m3594K8753
14084B02525Q4524K2839n9200r3498l6391j2281P1010P3639l0972l5645j12683
14073G3867j8773J34219K5846o2048o514J01151P423o9231Q091p3132m6224P2666
14061A47341r6089K4821M8782j07230J7330M9758J9011j5611O1841m8521q1440
14050A9993L1664J30419O7032k0978l5548L7652L9558J1227M7116j24317k6105
$$ y = [128550, 152110, 201286, 268710, 285013, 276608, 146352, 97328, 178983, 177840, 98855, 63602, 99859, 165344, 191773, 215891, 169102, 214795, 293950, 332273, 298371, 127068, 76002, 156932, 191659, 56376, 25625, 80397, 50705, 23241, 16393, 18020, 81536, 28327, 33768, 155338, 199947, 299561, 307620, 221328, 133615, 119454, 174038, 220783, 261439, 217366, 173772, 202525, 287049, 309888, 250688, 157190, 120799, 108518, 179528, 253167, 222195, 186550, 73867, 55094, 189313, 215159, 153111, 146597, 247748, 255171, 185940, 194031, 120899, 74675, 147341, 51252, 76073, 124855, 17625, 34955, 84713, 103724, 88113, 149954, 101433, 19993, 51657, 182076, 249108, 228130, 192582, 230234, 269792, 281019, 328135, 203818, 177713]
14039A77713Q03N748J19175J9736n7182q9264m8330k3693K6677M2608M9899M9199
14027B73089p8139r6060K9958L7893N2426K5353j6096L0364j28220j9546P6905
14016A87927O6790p9580k5018J80058R7027o6632p3358l786L7808M6360n6620
14005C10976J0925o9978k3382N0084L0292o7000K2036j6371k7690O172p250L6232
13993B55046P5606j730M4485r5899k7049J8173L3140l1504l7504n060j01339j0874
13981A15491r6679R2336R8203N7152L1269p5752o1540K5956Q8886P674l7943J0275
13969B55328R716j364K1122K0737q9064k3741l6923K227m414J19538N4713r1868
13957B36007L9695J19793o846p1462p9185O253l0555j63546M1892J07386J02235
$$ y = [177713, 178516, 184264, 303439, 323175, 265993, 176729, 128399, 104706, 131383, 173991, 223890, 273089, 194950, 98890, 128848, 166741, 219167, 244520, 228424, 258788, 130568, 111022, 187927, 254717, 175137, 150119, 330177, 427204, 360572, 287214, 283428, 321236, 367596, 310976, 321901, 251923, 228541, 278625, 308917, 241917, 263953, 247582, 219892, 226064, 218814, 255046, 330652, 328922, 373407, 277508, 250459, 268632, 301772, 270268, 232764, 227704, 126365, 115491, 18812, 111148, 209351, 266503, 297772, 222020, 160480, 186436, 275322, 282996, 245053, 255328, 265044, 263680, 284802, 305539, 216475, 192734, 155811, 158038, 153624, 273162, 327875, 236007, 275702, 395495, 388649, 317187, 238002, 244255, 213700, 50154, 92046, 199432, 301667]
13946C01667l9994p3029Q5907N785n3824k878J4678K1230N8675M5836k6742o8641
13934B68670j78792l0385N3015j35741O9857M6156j09174m173L7082l5026p373
13923b5884J7298R0181O2394J16772j09441j38873M6697K17613O6707J5258q0951
13912B77771j06166n1148J05740P3867k4041O4380k8238M992K0508O395p5334
13901B68726l8871p8577j963K6410k0690J2988n3378J338R3880N7995j773o3846
13889B02239N8032J9788K7056q3699j8711o303J20998M4506k2910j15340n927
13878B19729O9818o2606j1562O782l9000M387Q0663K5599Q5968L0571J1828j1177
13866D11000Q8407O3509j02370q6993p0635k0946k5794k9834O3550J58741o293
$$ y = [301667, 261673, 188644, 274551, 280336, 226512, 223634, 238312, 259542, 318217, 364053, 337311, 268670, 89878, 59493, 112508, -23233, 46624, 92780, -16394, -20567, 16515, -18511, -25884, -8586, 81595, 143989, 260761, 151320, 12447, 59144, 276757, 343464, 358722, 277771, 171605, 120457, 226197, 300064, 276023, 340403, 312165, 317157, 337665, 344060, 268726, 229855, 151278, 149315, 175725, 155035, 168023, 114645, 115983, 209863, 267858, 266085, 202239, 260271, 280059, 307115, 223416, 204705, 198402, 319400, 363906, 340996, 225656, 219729, 289547, 226941, 215379, 222161, 183161, 187548, 268211, 293810, 379778, 410349, 422177, 411000, 499407, 562916, 460546, 373553, 302918, 281972, 256178, 226344, 289894, 448635, 442342]
13855D42342j05838j44831Q6649q4728q3549P9878R1184N3300P7363J6695L1993
13844D60458J1088m3047j47529j08661n0989J35162O6231o262O0399Q3791p5881
13833C84760m8638p1163p8942Q2386j072p9172l3977j12615l3209J51000J43583
13822C02941p790j72854N9498P4831J91194N4028j14752n8032j831K9139j07392
13811B48980l9251J40399J21448o9129m054j87100l928q5732m0828p440J06587
13800A79952P436j9063j22854j4077M0778J02073O7404p8574J2891M2098L6750
13789B54814p9850r291K7105j565L0704N0705N1856o4457k3619l7214J12673J6831
13777C28692k5639n2719k4521K4011O1084J14660n2710L7060L427n4221l4166
$$ y = [442342, 336504, 191673, 278322, 193594, 110045, 189923, 281107, 334407, 411770, 428465, 460458, 471546, 428499, 280970, 172309, 121320, 256482, 322713, 316451, 376850, 460641, 384760, 336122, 264959, 186017, 268403, 267331, 188159, 154182, 41567, 8358, 159358, 302941, 295151, 122297, 181795, 256626, 447820, 501848, 387096, 329064, 327233, 356372, 248980, 209729, 350128, 471576, 402447, 398393, 211293, 207365, 121633, 80805, 73365, 179952, 187388, 168325, 45471, 31394, 72172, 174245, 241649, 163075, 175966, 218064, 254814, 174964, 165673, 192778, 191213, 221917, 272622, 324478, 260021, 236402, 199188, 311861, 328692, 303053, 250334, 225813, 249824, 310908, 425568, 372858, 409918, 413345, 359124, 324958]
13766C24958j14201l6165j3430P6109L5066M0940N7945J4781o023j51522o4038
13755A64420J4334K660M5608J84661N5114L0916M6735j99417r8015q1731R0926
13744B56211J19151q777q3175p9251n8698P8587j1773J21220O5047J4733n5736
13733C57539r3720l3876R9979k2329j48487q222Q6314P8333k0795r7837q211J7892
13721B06580J03437q367l5709k5797k7883M0400R4237j2057M0596L134j6184j0098
13709C52289L1972j1675n5494J2473j8769J12686O1913r8478K1832n8139k7066
13698C23544q6306J21173J12424L7307k7563r9684m1250m0958r02j444Q8460R7822
13686D82623n270m3932j72768q0553J60814J68365j42139j75056n8061J02455
$$ y = [324958, 210757, 174592, 161162, 237271, 272337, 313277, 371222, 386003, 379980, 228458, 164420, 178754, 181414, 227022, 411683, 466797, 497713, 544448, 345031, 247016, 165285, 256211, 375362, 366585, 283410, 204159, 145461, 224048, 212275, 333495, 398542, 413275, 357539, 263819, 229943, 329922, 307593, 159106, 150884, 237198, 315531, 294736, 196899, 188688, 206580, 310017, 301650, 265941, 240144, 212261, 252661, 346898, 334841, 375437, 378571, 362387, 352289, 384261, 372586, 317092, 329565, 310796, 423482, 485395, 386917, 408749, 350610, 323544, 237238, 358411, 470835, 508142, 480579, 380895, 339645, 298687, 297785, 296341, 384801, 482623, 477353, 433421, 260653, 180100, 340914, 509279, 367140, 192084, 134023, 236478]
13676B36478j7520k8515R4654p350n6256j9871N6618m5277n7841N8223N2564N8729
13664C24636m7134m1998Q8362J8002n5877l0240J3040j04997r9079J6811J0177
13653I1703Q2622J23778K4269n2984j11779J3276J16143P3996J3730r1090j77280
13642A06384L267R4762l6844j01822J10132R511J0286J44841P1936j21132N9193
13631C50514R7707r755K2864n7493N4583N4123l8823L6696j8421o7445O281n8244
13619C72587l9850k9662j04047P0200N537Q7651L2211k4705o3717q5994J9074
13608B39285P1053Q0149m8717j8360N3829N742o613J16450L8107l5394L5468j08084
13596D22915m02k1347L9250K8993j31066l5533J05950N4966O6965l3135M1647
$$ y = [236478, 218958, 190443, 285097, 277747, 221491, 201620, 258238, 212961, 155120, 213343, 265907, 324636, 277502, 235504, 323866, 341868, 285991, 255751, 268791, 163794, 64715, 81526, 91703, 174325, 298103, 322372, 269388, 157609, 170885, 287028, 361024, 374754, 283664, 106384, 109651, 204413, 167569, 65747, 175879, 185390, 195676, 340517, 412453, 291321, 350514, 448221, 438466, 461330, 403837, 458420, 512543, 473720, 510416, 491995, 424550, 430831, 372587, 332737, 303075, 199028, 269228, 274765, 362416, 394627, 369922, 306205, 220211, 239285, 310338, 390487, 341770, 323410, 377239, 382981, 376368, 492818, 530925, 495531, 530999, 422915, 422513, 401166, 440416, 469409, 338343, 302810, 408760, 463726, 530691, 497556, 539203]
13585E39203J4663m1475p8936J12884K0735l6459p6053j08517P2224q8982q9189
13574B40098L8931N8935R3844q4973O9658N1672p2472o8917n6570j7690r131K2059
13562B65444J78115J19885o8232n7415k9894J6350n1167o9388n7218o6033J5659
13551A96106J37789J33883K4953j51426k2143L8500P5570J08737k0254q2473l1296
13540D07946m6310o6782M8817R0865J54985j8282L0984o9159o967j9314m8725
13529D58058K7911l9384k2318o1025P6155j16910k2739K8590J02726n4525j11149
13518B65390J06578J15294n6831m4104m7512o4506L7247O4172M8768n1435n5638
13507C17423p9511M3611K4000P5752K5509k172k6819j15539l747N1425O3266n7210
$$ y = [539203, 553866, 512391, 433455, 546339, 567074, 530615, 454562, 346045, 418269, 329287, 240098, 279029, 337964, 431808, 346835, 416493, 468165, 395693, 326776, 270206, 252516, 243385, 265444, 443559, 563444, 495212, 437797, 407903, 424253, 373086, 303698, 246480, 180447, 196106, 333895, 467778, 492731, 341305, 319162, 357662, 433232, 541969, 521715, 439242, 407946, 361636, 294854, 343671, 434536, 589521, 571239, 602223, 533064, 526097, 506783, 458058, 485969, 446585, 424267, 363242, 439397, 322487, 299748, 328338, 431064, 376539, 265390, 371968, 487262, 430431, 386327, 338815, 274309, 311556, 375728, 424496, 373061, 317423, 237912, 281523, 305523, 381275, 406784, 404612, 377793, 262254, 258507, 309932, 373198, 315988]
13495C15988p742N6684K7817P7841k21k3999r3648K7427O0977L4417p691M0346
13483E08196r4933k8531p281J4631L1436j996J83040P7146o6412l8337j4261r5636
13471D67062J2010j5277j10041K6685l2820M967M9006J3291J54353J34545O811
13460G10592l9758p6943N9915r1050j38329R985J34799o7877j26434M355M9716
13449D28971M9468K4124P3389L5279k4414r1074J2889P0518p4574j614j46771
13438C56191K7672k9790O0981J08562J8874o858l855m6226o0136o5128j4924K8084
13426C73447N5855M7265p124J625o477K4904n8909j7570m2357P8005M5333P2768
13414E66765N7597p6393r9444J8768m2807k6081k5276p0173J07026O5002L5467
$$ y = [315988, 308246, 364930, 392747, 470588, 470367, 446368, 352720, 380147, 441124, 475541, 467850, 508196, 413263, 384732, 377451, 392082, 423518, 421522, 604562, 681708, 615296, 576959, 562698, 467062, 479072, 463795, 353754, 380439, 347619, 352586, 401592, 414883, 569236, 703781, 710592, 670834, 593891, 653806, 562756, 424427, 434412, 569211, 501334, 374900, 379255, 428971, 478439, 502563, 575952, 611231, 586817, 495743, 508632, 579150, 504576, 502962, 356191, 383863, 354073, 415054, 523616, 542490, 535632, 531777, 485551, 425415, 360287, 345363, 373447, 429302, 476567, 469443, 471068, 464591, 489495, 430586, 413016, 370659, 448664, 493997, 566765, 624362, 547969, 448525, 467293, 424486, 398405, 373129, 302956, 409982, 474984, 510451]
13403E10451j05884j39298l3705R8057J05778J4391o5915K3790j7971l923o6415
13392C19356j0584M5814P6351J43018m824n9836j5103m9080j2243M1369N8625
13381E32863K4065M644l2904j5064o0243L4644M6999n8629p716k622j198q0110
13369C84729N1797O8809j0190L3284Q350p8338n185j9748O1160M0124K3119l1206
13357E26705P694K8597M2114m4359l4544R388R1240L3917l1078p0192p5245K7869
13345E12106j7872K4098m6588m1647K0464K5833k4898J2775M5186k0234N1174
13334E40397J17002p122j03161K7203P720r399q528n3542J8215L1617L2061N9241
13322F51704M0565j3069r783Q710l3992J8554P0241M6313j49014r2130O308p0480
$$ y = [510451, 404567, 265269, 231564, 329621, 435399, 449790, 383875, 407665, 389694, 385771, 319356, 308772, 354586, 430937, 573955, 569131, 509295, 494192, 445112, 432869, 474238, 532863, 556928, 561572, 528668, 513604, 453361, 488005, 535004, 476375, 468659, 466037, 464839, 384729, 436526, 505335, 495145, 528429, 536779, 458441, 453256, 433508, 494668, 534792, 557911, 526705, 534399, 562996, 605110, 560751, 526207, 535595, 626835, 660752, 629674, 559482, 484237, 512106, 494234, 518332, 471744, 430097, 450561, 476394, 451496, 464271, 509457, 489223, 540397, 657399, 650277, 547116, 574319, 582039, 572640, 564112, 510570, 528785, 560402, 592463, 651704, 692269, 679200, 669417, 678127, 644135, 662689, 732930, 779243, 630229, 538099, 544407, 473927]
13310D73927J022j12120P1747L5829O6079j42045j08538m436M0870J04871j6780
13299D10426K0150L4100L3860m8428O10J16690P5146k4014N405k556j7078N1410
13287F55721l8558j17287K8598j9148o5143K9845J32261l4225N7448N800q2758
13276E52554L406N4678J36311j1700Q6785l8364j04343j53256m4411J42285Q4276
13265G08221M8395j1037L7564l0424j04642j44787O9452k3911o0212j58080l2335
13254B98204J41981J8620m3226o9631o863N3134Q563K2559J09225J01619L648
13243F37833p2852Q748N8723p2614l6167M0206J7003L2375K8481k9501R874N3896
13231F76005J72147J27850j35948m3502l2419n7973p2674m9133Q2958O7009q185
$$ y = [473927, 474949, 362829, 434576, 470405, 536484, 394439, 285901, 281465, 322335, 427206, 410426, 430576, 464676, 498536, 450108, 450718, 567408, 642554, 618540, 623945, 621389, 604311, 655721, 617163, 499876, 528474, 509326, 444183, 474028, 606289, 572064, 629512, 635312, 552554, 555960, 610638, 746949, 735249, 822034, 783670, 679327, 526071, 481660, 623945, 708221, 756616, 745579, 783143, 752719, 648077, 503290, 572742, 548831, 488619, 330539, 298204, 440185, 458805, 415579, 345948, 339085, 392219, 400782, 423341, 532566, 634185, 637833, 564981, 573729, 632452, 559838, 523671, 563877, 580880, 613255, 641736, 612235, 622109, 676005, 848152, 976002, 840054, 796552, 764133, 706160, 633486, 584353, 667311, 734320, 726135]
13220G26135P3801K1319R740j29304K1473R7634n0417j01406M160O188J38206
13209H17529j3270j41309j3054Q6974P238j964R1049j00789m8330l7610K1911
13198F68375j4639Q5380k738l561n4809q1816M2666P5525k4330L6633m3855m3632
13186F39199k2933k9584n8129J1052Q5954O0390j09421l0048J44777j6435j13945
13175E60877N96J1673J19851N2927l5071o1470q392K6029r1928j18169k3084j3611
13163D20228J43081Q8048N4603l9944j24222k4899J7576q739k6769j6981J25960
13152F07942J05040P9785N2536j8997l3747j14767r8788O5367j9259r0095j3682
13141E21335o4784o6775N4904P9481J46708J15122l0215K2081K7895r6181j29592
$$ y = [726135, 799936, 821255, 830995, 701691, 723164, 820798, 770381, 668975, 673135, 679323, 817529, 804259, 662950, 649896, 736870, 744108, 742144, 833193, 732404, 684074, 646464, 668375, 653736, 739116, 736378, 732817, 678008, 596192, 638858, 714383, 690053, 726686, 682831, 639199, 616266, 586682, 528553, 539605, 625559, 685949, 576528, 546480, 691257, 674822, 560877, 561473, 573146, 692997, 745924, 710853, 649383, 640991, 667020, 575092, 456923, 433839, 420228, 563309, 651357, 705960, 666016, 541794, 516895, 534471, 525732, 498963, 481982, 607942, 712982, 792767, 845303, 826306, 792559, 677792, 579004, 644371, 625112, 535017, 521335, 456551, 389776, 444680, 524161, 670869, 785991, 755776, 777857, 805752, 709571, 579979]
13130E79979n0092l759Q9403j8555J83316J71552P3987k0938j25418j17962M6847
13119H08360P7969l9233r9042k5816R115P217k7691J04347P4856p2278p1163j03037
13107F43604J08314J03131j5402o2742j14437K931n8415j01877L116P2633P9268
13096F60124J18042q51q1600o6270R3494L0784K5981J13955p042p0844p3109m2345
13084G00319K8161l2780j0106Q5712J06409N5946m3363o0877N218k3199m413R539
13072H16566j19339J05406k582r6105l5567Q0079M5718j00075o759L7902n1472
13061F73772k2500K8296j9483q39J13371O1118l8925l3548Q1996M5545o3456Q3850
13049I09197J44967j03695p6199p1557N7220k2220P041P1557O9219r6947q6801
$$ y = [579979, 529887, 526128, 615531, 596976, 780292, 951844, 1025831, 1004893, 879475, 761513, 808360, 886329, 847096, 748054, 722238, 731353, 738570, 710879, 815226, 890082, 817804, 746641, 643604, 751918, 855049, 839647, 776905, 662468, 665399, 606984, 505107, 508223, 580856, 660124, 778166, 777315, 695715, 629445, 722939, 753723, 779704, 893659, 886617, 815773, 742664, 700319, 728480, 695700, 685594, 771306, 877715, 933661, 890298, 829421, 834639, 811440, 807027, 816566, 697227, 802633, 800051, 703946, 668379, 748458, 794176, 694101, 687342, 725244, 673772, 651272, 679568, 660085, 659246, 772617, 833735, 794810, 761262, 843258, 888803, 825347, 909197, 1054164, 950469, 874270, 802713, 859933, 837713, 844754, 916311, 985530, 888583, 801782]
13038H01782o1429m5172r9627J2011L9423K24987L2022o3096k4050J02548n7643
13027H61756j02905N0233J5047p175m9855p9892K4677K5677r1631J1263J16349
13016G73544l6212J3142Q4191n7201m462K4889K29223k5271j74777j37747O3463
13005G52782Q7226k7883l3021m4348n3521P819R4140J00313J5036j63517p398
12994G27628n0421m0976J8196L1131M2229J32601l7947k02081n6220R0013N3500
12983G07653q830Q0727N0424m4705n7826n3187J7371P0289k910k6503o7510m5107
12971F19886R3276R5023j9045N899j4996o4898J8378m4748n063J2036N4312Q2435
12959H32495N8302j91090j37307J34578M5920k7613P51L598j5899K249L8131j7780
$$ y = [801782, 740353, 695181, 595554, 607565, 646988, 871975, 903997, 840901, 816851, 919399, 861756, 758851, 809084, 824131, 816956, 767101, 687209, 711886, 737563, 645932, 657195, 773544, 737332, 750474, 834665, 777464, 773002, 797891, 1027114, 1001843, 827066, 689319, 752782, 840008, 812125, 779104, 734756, 681235, 689054, 783194, 883507, 898543, 735026, 727628, 677207, 636231, 654427, 685558, 727787, 860388, 822441, 620360, 564140, 654153, 707653, 698823, 779550, 829974, 785269, 727443, 674256, 691627, 761916, 759006, 732503, 664993, 619886, 713162, 808185, 789140, 795039, 780043, 715145, 733523, 688775, 683712, 695748, 750060, 832495, 890797, 699707, 562400, 696978, 742898, 715285, 716036, 719634, 703735, 705984, 744115, 726335]
12947G26335j10773P6967J44197O9826q8403l482L9764j16528j9430J08674N6079
12936H83226K8378n9431R054O6368j3099K7152M2688m2854j0552O6795l8024n4254
12924I05447m5369J2826J64922J5129j07136n7121j9508J3607j84370m7268N6388
12913G07547K2945R714R737J17788R6621R1935J0718o9343o6721K3225j24275
12902H29891N495j3625J10656J21834m0991l1189J9626N4803J57597k6329j08455
12891A079313l0273k1427j23331K7987N8628O3854J8882m0257q5580m7991M6872
12880I46677K3615n7467l250l508o230o7565N577J21502j23187p9713n8768N3347
12868G51030J05935J7666j4672O6056O6110J48295n8017r0541j1275O9234O305
$$ y = [726335, 615562, 692529, 836726, 906552, 818149, 814667, 854431, 737903, 718473, 827147, 883226, 911604, 852173, 861227, 927595, 914496, 941648, 984336, 941482, 930930, 997725, 959701, 905447, 860078, 872904, 1037826, 1052955, 945819, 888698, 869190, 882797, 698427, 651159, 707547, 730492, 740206, 749943, 867731, 964352, 1056287, 1067005, 997662, 930941, 954166, 829891, 835386, 821761, 932417, 1054251, 1013260, 982071, 1001697, 1056500, 1214097, 1187768, 1079313, 1049040, 1027613, 904282, 932269, 990897, 1054751, 1073633, 1033376, 947796, 899805, 946677, 970292, 912825, 909575, 906067, 899837, 832272, 837849, 959351, 836164, 756451, 697683, 751030, 856965, 874631, 859959, 926015, 992125, 1140420, 1082403, 991862, 980587, 1049821, 1056126]
12857A056126j75270p6333Q5111R7392j2247k1279n6128J18973l4321K175N0777
12846A034976j6501q0508K8314m2835o308J339J52353k6269k5451j4817j802P7782
12834A080273p0823L9599n4923r1219p0094M5003K9563j4478j753K3195K1507
12823I35850l2852K0703J505n9688L162K5990O239K1580o8592N2384N4583J7338
12811I78202N8452J9160J25597o7249q5407o9918R1616J49062J29671k4068n959
12800A299159O9746r4938o1272k8256j3207r8610p9314j689P3651J9737j518l7650
12788A045839m5783j1454N332P8914M6976m447l2881K0093M0912l938p9712K9469
12776A089320n0282L2877L3397k2090l8106j5427K9255Q3498j8508L7326o0157
$$ y = [1056126, 880856, 804523, 889634, 987026, 974779, 953500, 897372, 1016345, 982024, 984199, 1034976, 1018475, 937967, 966281, 923446, 917138, 918477, 1070830, 1044561, 1019110, 1004293, 1002491, 1080273, 1009450, 1049049, 994126, 902907, 832813, 877816, 907379, 892901, 891148, 914343, 935850, 902998, 923701, 925206, 865518, 868680, 894670, 900909, 922489, 853897, 906281, 960864, 978202, 1036654, 1055814, 1181411, 1114162, 1028755, 958837, 1050453, 1199515, 1329186, 1305118, 1299159, 1368905, 1273967, 1212695, 1184439, 1171232, 1072622, 993308, 991619, 1065270, 1085007, 1083489, 1045839, 1000056, 988602, 993934, 1072848, 1119824, 1115377, 1082496, 1102589, 1143501, 1139563, 1059851, 1089320, 1039038, 1071915, 1105312, 1083222, 1045116, 1029689, 1058944, 1142442, 1123934, 1161260, 1101103]
12765A101103J2890Q1094M0398j24252j89531M0828N3021M5523r429m8325R7304
12754A100624J65808L6167K2017L332k884q5383k08184p6876j5773O0742J74091
12743A173681J2610q8098r4198K3767j04766l5112O4522J33789J53759M8734K1120
12732A309808O212j35804q0042o708j8366J0825J11503r788J2350m7907j52388
12721I99695j556J03396L9837o2749R014k4297P141M1321J46146O6093o4606r312
12709A250123j9858q4572R6724O2284o2232o1818K2049L4668k405K7507M2417
12698A304887q2299j3345m2116j33871J3553J01862J16612k65J29272k8229n360
12687A360701O6778n8995j16769r1845P6273P696q3971K3188R1040J8331K6497
$$ y = [1101103, 1113993, 1195087, 1235485, 1111233, 921702, 962530, 1015551, 1061074, 1051645, 1003320, 1100624, 1266432, 1302599, 1324616, 1327948, 1325064, 1239681, 1031497, 954621, 938848, 999590, 1173681, 1186291, 1098193, 1003995, 1027762, 922996, 887884, 952406, 1086195, 1239954, 1288688, 1309808, 1316020, 1180216, 1100174, 1093466, 1075100, 1085925, 1197428, 1187640, 1199990, 1152083, 999695, 998139, 1101535, 1141372, 1078623, 1087637, 1063340, 1070481, 1111802, 1257948, 1324041, 1259435, 1250123, 1230265, 1145693, 1242417, 1304701, 1242469, 1180651, 1202700, 1237368, 1234963, 1262470, 1304887, 1222588, 1209243, 1167127, 1033256, 1046809, 1148671, 1265283, 1265018, 1394290, 1366061, 1360701, 1427479, 1368484, 1251715, 1159870, 1236143, 1243839, 1159868, 1183056, 1274096, 1292427, 1318924]
12676A318924M9464j1027K3295J822j79620l5865K973j29374N6954P3708j06390
12665A064864o0072N6174P3336R3943M5066K4045M1685p191J0992n6474j9197
12654A267171M867R1777L3457K0743M8927m4423k3420k3027m711O591l1384P2426
12642A418994o6267l8469N8347Q975l8134J2586J03848q2557j2633M0405k3434
12631A381661r6912J5482J6612m0509k9939J3603j3598l5378J44296m9089r7306
12620A208923o0639N5062P8429o9020P1881M3469P883N9569J910k9035j47274
12609A221158J2221L8575m549O5493J699M2385m547j6013J0927R9103N6527n6030
12597A466949o5076m8333M2147R5873R1078k4020j39300q6491m383j4759j897
$$ y = [1318924, 1368388, 1357361, 1380656, 1382478, 1202858, 1166993, 1169966, 1040592, 1097546, 1171254, 1064864, 1004792, 1060966, 1134302, 1228245, 1273311, 1297356, 1339041, 1331850, 1342842, 1286368, 1267171, 1272038, 1363815, 1397272, 1418015, 1466942, 1422519, 1399099, 1376072, 1371361, 1377952, 1346568, 1418994, 1352727, 1314258, 1372605, 1381580, 1343446, 1356032, 1459880, 1377323, 1364690, 1405095, 1381661, 1284749, 1300231, 1316843, 1276334, 1246395, 1259998, 1246400, 1211022, 1355318, 1306229, 1208923, 1148284, 1203346, 1281775, 1212755, 1284636, 1328105, 1335988, 1395557, 1397467, 1368432, 1221158, 1233379, 1271954, 1267405, 1332898, 1334597, 1376982, 1372435, 1356422, 1367349, 1466452, 1522979, 1466949, 1401873, 1353540, 1395687, 1491560, 1582638, 1558618, 1419318, 1332827, 1328444, 1313685, 1311788]
12586A311788j38174q4668K12117J14376m1411m3889l1400J49824p9423r2102
12576A277038M9868J72981K6733o1549j09875l3236L8938j0955j1123L2384P096
12565A378300k8803K5852N7774M0408l4570q7090p1373O4603J54728M0554j6987
12554A523396K1465m005q1892k9844N84n7720l5018r7418l7697R5999J6751j8383
12542A296218n755Q5146P9756J8646j3316K3272J69051J27870j05706j59028J5294
12531A531448Q633k7547m735Q7097n2444o8059j3197K6650Q1834m4234m4281M4110
12519A525275k7110k1685J27376M7180O9684R1027l4349q6251p3680j27274j3767
12508A476426J74260J0591k9794j13502J870l7952p3348M7018O918n2711N9426
$$ y = [1311788, 1173614, 1088946, 1301063, 1415439, 1374028, 1330139, 1298739, 1448563, 1369140, 1277038, 1326906, 1499887, 1526620, 1465071, 1355196, 1321960, 1360898, 1349943, 1338820, 1371204, 1378300, 1349497, 1375349, 1433123, 1473531, 1438961, 1351871, 1280498, 1345101, 1499829, 1540383, 1523396, 1544861, 1540856, 1458964, 1429120, 1429704, 1371984, 1336966, 1239548, 1201851, 1297850, 1314601, 1296218, 1290463, 1375609, 1455365, 1474011, 1460695, 1483967, 1653018, 1780888, 1675182, 1516154, 1531448, 1540081, 1512534, 1507799, 1594896, 1542452, 1474393, 1461196, 1487846, 1569680, 1525446, 1481165, 1525275, 1498165, 1476480, 1603856, 1651036, 1720720, 1811747, 1777398, 1691147, 1617467, 1490193, 1476426, 1650686, 1661277, 1631483, 1517981, 1519851, 1481899, 1408551, 1455569, 1462487, 1409776, 1469202]
12497A469202P9477Q902j6573k0620j06074J09531M8351j3823l2696J8900j00307
12486A444270j00875o338K6952K1921P4716J35940M2743J0803J18661k4101j17754
12475A626938j20567L2484m0227J05823k2726j1889n084j0994m3912q2436M6877
12464A474287O6558J8858K2852J3155P2870L72O6837L0076m359K9923O2714p1374
12452A782769j42669l5623j7308M9396l250n3009L3197m3022n6168k2479L1656
12441A523490O8484O3624P0960J28309M2201m5883n7266N2107O2349m7819m7467
12430A813089K3205j1974J3144m4086m511r317M6837R1636k2541N4956M5287J270
12418A996995p5422k9566J6216P6934k849o646p490J5495j251m619N0040J16611
$$ y = [1469202, 1548679, 1557581, 1541008, 1520388, 1414314, 1523845, 1572196, 1558373, 1525677, 1544577, 1444270, 1343395, 1337057, 1364009, 1385930, 1460646, 1596586, 1639329, 1650132, 1768793, 1744692, 1626938, 1506371, 1538855, 1498628, 1604451, 1581725, 1569836, 1564752, 1553758, 1509846, 1427410, 1474287, 1540845, 1559703, 1582555, 1595710, 1668580, 1668952, 1735789, 1765865, 1761506, 1791429, 1854143, 1782769, 1640100, 1604477, 1587169, 1636565, 1633315, 1580306, 1613503, 1570481, 1514313, 1491834, 1523490, 1591974, 1655598, 1726558, 1854867, 1897068, 1851185, 1793919, 1846026, 1908375, 1860556, 1813089, 1836294, 1824320, 1837464, 1793378, 1788867, 1779550, 1826387, 1918023, 1895482, 1950438, 1995725, 1996995, 1921573, 1892007, 1908223, 1985157, 1982308, 1975662, 1968172, 1983667, 1982416, 1977797, 2027837, 2144448]
12406B144448K4819m1151k635J93650R5905L657K8526l1105r8054j26276q2500
12395B109284J03694J80875O1923n4021j43533r1784N8269J11596K6275n3639
12385B308939q3659N6900m5598P0012o3441j58222q4117J2490R3051Q1098Q7197
12374B274650J50613J30506P8188K7274J06368J44618L7759M700J82206J89037
12364C325919J50620j1849m1490p7223j15969n3048j50770j60689p1551k4476
12354B769474j43962p4664Q1458J19799p1218j17613m6149n5770m679m0945p7266
12343B338465q9587M7286Q2368K2745m0550j02377J9617K0334j6008l9706m0569
12332B202018p4905L9937Q8124r6060J1368J58116P4313P3155L2111O8777M2579
$$ y = [2144448, 2169267, 2128116, 2125481, 2319131, 2415036, 2418693, 2447219, 2416114, 2318060, 2191784, 2109284, 2212978, 2393853, 2455776, 2401755, 2258222, 2166438, 2224707, 2336303, 2362578, 2308939, 2225280, 2282180, 2236582, 2306594, 2243153, 2084931, 2000814, 2013304, 2106355, 2187453, 2274650, 2425263, 2555769, 2633957, 2661231, 2767599, 2912217, 2949976, 2954676, 3136882, 3325919, 3476539, 3464690, 3423200, 3345977, 3230008, 3176960, 3026190, 2865501, 2793950, 2769474, 2625512, 2550848, 2632306, 2752105, 2680887, 2563274, 2517125, 2461355, 2456676, 2415731, 2338465, 2248878, 2296164, 2378532, 2401277, 2360727, 2258350, 2277967, 2298301, 2282293, 2242587, 2202018, 2127113, 2167050, 2255174, 2159114, 2170482, 2328598, 2402911, 2476066, 2508177, 2576954, 2619533]
12321B619533P2416J2023j55704j6593p9285j08135n1744j8766J8370j88371k28150
12310A875594p7522R8191J22425Q7403k898j29757m3813J3159P9170K1769n7162
12299A986559o735L0164r2610k4218J35122P6779o4249j47467k8192k0661L02
12288A844794q4325O7127J7822K0501J03625q7665p5412r7607N4020M8223M7420
12277A858523J4767J5723R8641R0571j7705p8938n7731K743j30361l5000L8592
12266A799825q0345L9815J55591Q1669p4O2354L7584K6335q4397j0799N5188l8030
12254B044716q3680l9026J22536K5003l3801K7620N4947Q806L0772l7104j02445
12243B018344r6232L2406K00315N1741p0924m5948N7820P7037m2406j13653J6391
$$ y = [2619533, 2691949, 2703972, 2548268, 2531675, 2452390, 2344255, 2292511, 2273745, 2292115, 2103744, 1875594, 1798072, 1896263, 2018688, 2106091, 2103193, 1973436, 1929623, 1942782, 2021952, 2043721, 1986559, 1979824, 2009988, 1917378, 1893160, 2028282, 2105061, 2040812, 1893345, 1865153, 1844492, 1844794, 1760469, 1827596, 1845418, 1865919, 1969544, 1881879, 1806467, 1708860, 1762880, 1811103, 1858523, 1873290, 1889013, 1987654, 2078225, 2060520, 1981582, 1923851, 1926594, 1796233, 1761233, 1799825, 1719480, 1759295, 1914886, 1996555, 1996481, 2058835, 2096419, 2122754, 2038357, 2027558, 2082746, 2044716, 1961036, 1922010, 2044546, 2069549, 2035748, 2063368, 2118315, 2127121, 2157893, 2120789, 2018344, 1922112, 1954518, 2154833, 2206574, 2135650, 2089702, 2147522, 2224559, 2182153, 2068500, 2084891]
12232B084891k3510m2484K8591q7871J20063J70427n9702o5539K2528n0214j22269
12221A974911L8899J40843K2384K9343k7542Q5656p9744o8499J1494L4715M4430
12210B206890q39p2575j4917O2432n613m6514J0864N3294k0695O2154J06278O5061
12198B405820p9710q5845p5930q5709l9894O5800q0552K9064P0105Q9830L241
12187B216220j14702l6096K0890J14319M1482k663N3901M0606p571k0818Q2493
12176B388061J52264K3340r4775j69256N7792o210j24174o9295N0061J4150Q2954
12165B304912Q0236J8596J9659j62231j44697M5683J25755K6888q937m7501K4183
12154B282546j1296N2847J29704J1101o2946q6952l180O6786J03757N1978Q406
$$ y = [2084891, 2061381, 2018897, 2047488, 1959617, 2079680, 2250107, 2190405, 2124866, 2147394, 2097180, 1974911, 2013810, 2154653, 2177037, 2206380, 2178838, 2264494, 2184750, 2116251, 2127745, 2162460, 2206890, 2206051, 2133476, 2118559, 2180991, 2175378, 2128864, 2139728, 2193022, 2172327, 2234481, 2340759, 2405820, 2326110, 2240265, 2164335, 2078626, 2038732, 2104532, 2023980, 2053044, 2123149, 2212979, 2216220, 2101518, 2065422, 2086312, 2200631, 2242113, 2239450, 2293351, 2333957, 2326386, 2305568, 2388061, 2540325, 2563665, 2468890, 2299634, 2357426, 2351216, 2227042, 2157747, 2207808, 2221958, 2304912, 2385148, 2403744, 2423403, 2261172, 2116475, 2162158, 2287913, 2314801, 2305864, 2258363, 2282546, 2271250, 2324097, 2453801, 2464902, 2401956, 2315004, 2311824, 2378610, 2482367, 2534345, 2542751]
12143B542751m3624j7673l3436m6114Q3206o8666P5706J18248j1538j32683p8328
12132B387849j21391j33313N0753N8436M3068K0776o8811Q306n6260k723p920
12121B178770Q8594j357r0466J0147R5015O176j2029K1771q064j6308J46329J42634
12109B561212j1632K5549P2440R054L1908J04687N3723l984R0779l7513j49037
12098B747186o6741j467Q628P8788P0359K0930o5694M162j2440M0974J12312n1693
12086B885304j7039m6467J4299n3664j1368P6196n485n6901J8560K2230K5671
12075B851336j7108L2584O3255L8307L1579n6785K6101J01624J01005J6418N9245
12064C247561K3975M9895J94039J02788n589R8476Q6387M9299p518P373P1861
$$ y = [2542751, 2499127, 2481454, 2448018, 2401904, 2485110, 2416444, 2492150, 2610398, 2598860, 2466177, 2387849, 2266458, 2133145, 2183898, 2242334, 2285402, 2306178, 2237367, 2245673, 2189413, 2186690, 2178770, 2267364, 2266007, 2175541, 2185688, 2280703, 2286879, 2274850, 2296621, 2288557, 2272249, 2418578, 2561212, 2549580, 2575129, 2647569, 2656623, 2688531, 2793218, 2846941, 2842957, 2933736, 2896223, 2747186, 2680445, 2678978, 2687606, 2766394, 2836753, 2857683, 2791989, 2796151, 2783711, 2824685, 2936997, 2885304, 2868265, 2821798, 2836097, 2782433, 2771065, 2847261, 2841776, 2784875, 2803435, 2825665, 2851336, 2834228, 2866812, 2930067, 2968374, 2999953, 2943168, 2969269, 3070893, 3171898, 3188316, 3247561, 3271536, 3321431, 3515470, 3618258, 3612669, 3711145, 3797532, 3846831, 3839313, 3846686, 3918547]
12053C918547j17786L3429J55127J29616P8759J15652R3608N4588Q4630O2092
12043D608262L1461J05728J11958K04091J87789L0256J4188P5960J92932J85621
12033E748246K25816J50771k4004j29066l530j40429o4812J65357J26573M1978
12023F096900Q0308J12763P8614Q2009J30545K05181R1457J8151O0683L6209j07103
12012F885717r0050j7813N0422J04831J51794R5127Q7743J77414L07837L28481
12002H081503K62713L00168O49046N83206N22557N20782M85137M73626O26942
11993A2505680P00378P01368O92654O77670Q18231R58329J112041R89315J076254
11984B0231920J104221J046392J059978J096343J031602J054524J296604J396679
$$ y = [3918547, 3800761, 3834190, 3989317, 4118933, 4197692, 4313344, 4406952, 4461540, 4546170, 4608262, 4639723, 4745451, 4857409, 5061500, 5249289, 5279545, 5293733, 5369693, 5562625, 5748246, 5974062, 6124833, 6100829, 5971763, 5968233, 5827804, 5762992, 5928349, 6054922, 6096900, 6177208, 6289971, 6368585, 6450594, 6581139, 6786320, 6877777, 6895928, 6956611, 6992820, 6885717, 6795667, 6777854, 6828276, 6933107, 7084901, 7180028, 7267771, 7445185, 7753022, 8081503, 8344216, 8644384, 9293430, 9876636, 10399193, 10919975, 11405112, 11878738, 12505680, 13206058, 13907426, 14600080, 15277750, 16095981, 17054310, 18166351, 19155666, 20231920, 21336141, 22382533, 23442511, 24538854, 25570456, 26624980, 27921584, 29318263]
11976B9318263J724668K108403K723492L511390M478074N713127P358805R032883
11968F5969105J0563194J1952594J2633306J1864494R484354N333943M80234l969717
11960A24311507o904874q011182p464651n878119m055383k198422q05955J65421
11952H9158342J078296J955764K335143K348966K137057J735701J677377J540901
11944A03967547J671123J940996K331594L066468L514284L577493L276346K649283
11936A25995134J970044J129390Q85294R50170J689909K900175M947622P651760
11928A48119498J1342198J6299021K2250756K8811065L4605596L7786970L5086333
11921C34301437K4046231O196669j3653996k9310983l6523566l6387066l1712106
$$ y = [29318263, 31042931, 33151334, 35874826, 39386216, 43864290, 49577417, 56936222, 65969105, 76532299, 88484893, 101118199, 112982693, 122467047, 127800990, 128281224, 124311507, 117406633, 109395451, 101930800, 96052681, 91997298, 89798876, 88992921, 89158342, 90236638, 92192402, 94527545, 96876511, 99013568, 100749269, 102426646, 103967547, 105638670, 107579666, 109911260, 112977728, 116492012, 120069505, 123345851, 125995134, 127965178, 129094568, 129979862, 130930032, 132619941, 135520116, 140467738, 148119498, 159461696, 175760717, 198011473, 226822538, 261428134, 299215104, 334301437, 358347668, 364544337, 350890341, 321579358, 285055792, 248668726, 216956620]
11914B16956620k5300884j8998506j3545142r084955n677369l292731j813527
11907A39243506j227007j104269j612814k341848l220198l926325l957559l716906
11899A18136580l040853k428505j805551j262019j251458j254966j185759j220444
11891A04687025r83847o35658m10533k36670J10948Q77587K169419L828510N789774
11882A15196555P539483Q232827P303056M205298o30894n913291j0282965j2869081
11874A12780988j3568010j2956391j1571282r755191p748570o051545m739074
11867D6390925l681844k879705k286798j809857j614080j413565j271918j106790
11859C0326368j133652j200031j293261j363696j302141j225649j079291j051749
$$ y = [216956620, 191655736, 172657230, 159112088, 150027133, 144349764, 141057033, 139243506, 138016499, 136912230, 135299416, 132957568, 129737370, 125811045, 121853486, 118136580, 115095727, 112667222, 110861671, 109599652, 108348194, 107093228, 105907469, 104687025, 103703178, 103067520, 102656987, 102420317, 102531265, 103408852, 105578271, 109406781, 115196555, 122736038, 130968865, 138271921, 142477219, 141846325, 135933034, 125650069, 112780988, 99212978, 86256587, 74685305, 64930114, 57181544, 51129999, 46390925, 42709081, 39829376, 37542578, 35732721, 34118641, 32705076, 31433158, 30326368, 29192716, 27992685, 26699424, 25335728, 24033587, 22807938, 21728647, 20676898]
11851B0676898q48737o96138o41154n61979o51784p48160q52711r02583q93926
11842A3879726r38640r58299q93066n60117m83236m55165m41450l19053k25574
11833H605126k29811j01034j87772j67943j33966r1314j90j7693Q882L6240m4443
11822G676082j78491j64380q2367j25772j7471j04594n9479m5012j51144j20829
11812F626543J8010M2523o2495j71191K7608K3253q4576j32666j79907l02825
11802E804277l26626l69630j76186j05073r5922j85133j51425j71904j94997q7316
11792C940065j4214q9876o1314n2391N8332M8910l7267m3427k8989K884o0136
11781C662577j31373j22706R559J1363M4185n6603l3893k2035m8985r048J3414
$$ y = [20676898, 19828161, 19132023, 18490869, 17928890, 17277106, 16528946, 15676235, 14773652, 13879726, 12941086, 11982787, 11089721, 10529604, 10046368, 9591203, 9149753, 8830700, 8605126, 8375315, 8274281, 8086509, 7918566, 7784600, 7693286, 7693096, 7675403, 7684285, 7720525, 7676082, 7497591, 7333211, 7250844, 7125072, 7107601, 7003007, 6943528, 6898516, 6747372, 6626543, 6644553, 6687076, 6624581, 6453390, 6480998, 6504251, 6419675, 6287009, 6107102, 5804277, 5477651, 5108021, 4931835, 4826762, 4730840, 4545707, 4394282, 4222378, 4027381, 3940065, 3925851, 3835975, 3774661, 3722270, 3780602, 3829512, 3792245, 3748818, 3719829, 3722713, 3662577, 3531204, 3408498, 3418057, 3429420, 3473605, 3417002, 3383109, 3361074, 3312089, 3303041, 3316455]
11770C316455o377j26327r7046J7634m5174q8166l3047L4523n9554q720K399n9603
11758B846997m9464K0169k4247k6960m5093M5611l2136l062Q1353Q2243n7600
11747B837811j12759m0384r5184r8300l7778L5401Q8768P254J15971K369j3380
11736B689789O064m3103j54188j2700R9191j15228n4865K1932N1435P3524l9363
11725B522488O0552r185j02716q2398m9391q58J35520m8780p4497o2194m0636
11714B247905K3974Q8287m9019m5862M6440J03374j25298k3407k0722K7468K4361
11703B297501p6508q8137j08139j15350J4428J05448P7587m7049O9115N9475M2275
11692B230646j05934n6082K8839j1763p1699l2737j09361O678J66393M8415k2949
$$ y = [3316455, 3310078, 3183751, 3086705, 3104339, 3059165, 2970999, 2937952, 2972475, 2912921, 2904201, 2906600, 2846997, 2797533, 2817702, 2793455, 2766495, 2721402, 2767013, 2734877, 2731815, 2813168, 2895411, 2837811, 2725052, 2684668, 2589484, 2491184, 2453406, 2488807, 2577575, 2584829, 2700800, 2703169, 2689789, 2695853, 2652750, 2498562, 2485862, 2585053, 2469825, 2414960, 2436892, 2488327, 2561851, 2522488, 2583040, 2573855, 2471139, 2388741, 2339350, 2338492, 2474012, 2425232, 2350735, 2288541, 2247905, 2271879, 2360166, 2311147, 2265285, 2311725, 2415099, 2289801, 2266394, 2245672, 2273140, 2297501, 2220993, 2132856, 2024717, 1909367, 1923795, 2029243, 2106830, 2059781, 2128896, 2188371, 2230646, 2124712, 2068630, 2097469, 2085706, 2014007, 1981270, 1871909, 1878587, 2044980, 2093395, 2070446]
11681B070446L1289m673J3373k2073n3339m6551Q3913N7181j19153j26165P0383
11670A954631J58025m9508o0627r5378k3134o9603l7548J39537J39589r5443q2656
11659A877885m2043J7355q550p728J16237N0342p9389n3604K8979K3852j6860
11648A906476n1863j43168m3386L8879M0123j255M1809N4867L8194m2606J00039
11637A938109P1959n814j89836r2710Q5463l499q4875P2679J29110o5900j04338
11626A750348j024m6020o8393q6838j9427J4933R1810j4071Q2950k0989P1003
11615A754282O3848o1921j63194j18242J0277k9684J5084J20112J00818j04932
11605A586448o679N4284N2438q4357r9619R8731Q9220Q3029K4838N4495M0619
$$ y = [2070446, 2101735, 2097062, 2110435, 2088362, 2035023, 1988472, 2072385, 2129566, 2010413, 1884248, 1954631, 2112656, 2063148, 2002521, 1907143, 1884009, 1814406, 1776858, 1916395, 2055984, 1960541, 1877885, 1835842, 1853197, 1844647, 1836919, 1953156, 2003498, 1924109, 1870505, 1899484, 1923336, 1906476, 1854613, 1711445, 1668059, 1706938, 1747061, 1745806, 1787615, 1842482, 1880676, 1838070, 1938109, 2010068, 2004254, 1814418, 1721708, 1807171, 1803672, 1718797, 1791476, 1920586, 1854686, 1750348, 1749324, 1703304, 1634911, 1548073, 1528646, 1543579, 1635389, 1621318, 1704268, 1683279, 1754282, 1818130, 1756209, 1593015, 1474773, 1485050, 1455366, 1470450, 1590562, 1691380, 1586448, 1579769, 1634053, 1686491, 1602134, 1502515, 1601246, 1690466, 1773495, 1798333, 1852828, 1893447]
11594A893447j10505l4527O1459K9855j25330j23278j6476J5131R8221P5294O1265
11583A824556j10185R2694M5016q4795q8487j59786R512J51550P037r8461p1181
11572A517470N0983N7482l1767P7061q217j41171M2946N8980O1267L9292K2270
11561A746596p0904o0987j8298l3524k6568j7948j31945J4637J2858k9767Q8906
11550A473056Q5373o7661J4848J39421P8871p8891k37675p8476J22647J15407
11540A566920O9049J17607J0124k9108j69202j3543J04464P0827P2071K1982o9951
11529A751240p5911p499N326n0795O7342L2401M1215L7843R9688k5607p03Q313
11517A882853R8498L1459o8479N2687o7436j7901k8610Q9357p761O785o8636l0584
$$ y = [1893447, 1782942, 1748415, 1809874, 1839729, 1714399, 1591121, 1574645, 1589776, 1687997, 1763291, 1824556, 1714371, 1807065, 1852081, 1767286, 1678799, 1519013, 1528525, 1680075, 1687112, 1588651, 1517470, 1568453, 1625935, 1594168, 1671229, 1663012, 1521841, 1564787, 1623767, 1685034, 1724326, 1746596, 1675692, 1614705, 1596407, 1562883, 1536315, 1518367, 1386422, 1401059, 1413917, 1384150, 1473056, 1558429, 1490768, 1505616, 1645037, 1723908, 1645017, 1407342, 1328866, 1451513, 1566920, 1635969, 1753576, 1763700, 1734592, 1565390, 1551847, 1656311, 1727138, 1799209, 1821191, 1751240, 1675329, 1667830, 1673156, 1622361, 1689703, 1722104, 1763319, 1801162, 1900850, 1875243, 1874540, 1882853, 1981351, 2012810, 1944331, 1997018, 1929582, 1911681, 1883071, 1972428, 1964667, 1971452, 1902816, 1872232]
11505A872232J3887r236k8341n727K9493k1609l7919M3624N7207R2530n9634R8608
11493B045115J950j2757o1795k1851J25105p736L1045N2678l651p0844k7482O6087
11481B115864J18207J45077J31419N4262P2285P6173k9590M9073K42142J11862
11471C086774N561K9413r18j34052k36631j27223j31849j82797j09219k704j34756
11460B061599j13845o917m2462Q1216Q9881q9461j19300L527Q2460n741p2327
11449A868630n6984Q8550K1358l8656n0524R4749P7200J2505j01826j09516Q5310
11438A890796j2447k448J08942J33253J22661K4684j54532n0898J10735P4040
11428B244786n8424j02674q2300p9389j61280k9279P338j54481J660Q792j87971
$$ y = [1872232, 1886119, 1876883, 1848542, 1842815, 1872308, 1850699, 1812780, 1856404, 1913611, 2006141, 1946507, 2045115, 2047065, 2034308, 1972513, 1950662, 2075767, 2068031, 2099076, 2151754, 2148103, 2077259, 2049777, 2115864, 2234071, 2379148, 2510567, 2564829, 2637114, 2713287, 2683697, 2732770, 2974912, 3086774, 3092335, 3121748, 3120830, 2986778, 2750147, 2622924, 2491075, 2308278, 2199059, 2196355, 2061599, 1947754, 1940837, 1898375, 1979591, 2069472, 1980011, 1860711, 1864238, 1946698, 1940957, 1868630, 1811646, 1900196, 1921554, 1882898, 1832374, 1927123, 2004323, 2016828, 1915002, 1805486, 1890796, 1878349, 1875901, 1984843, 2118096, 2240757, 2265441, 2110909, 2060011, 2170746, 2244786, 2186362, 2083688, 2001388, 1921999, 1760719, 1731440, 1738778, 1584297, 1585957, 1594749, 1406778]
11417A406778j08585Q5647N7535K57n6485l7362L5570p2933N4918K3792J9903
11406A409035o2991j28757j20741k0464J01933J80479j36326j11819K2879j9926
11396A113302J13841j5950J1508L1036k1153m9780p9113O6420J02025m1321o9227
11385A161588m0154q3342n622R9169O2959m5205l0865O1693j04220N8881R8537
11374A233419j29848k6737R5017Q9175J026M2280k9274J9542j6407J3984o424
11363A285753j28309l4535K20910j04570j52256M2369L7431n557o9946k8431k5227
11352A037632q86J8264N6188J22417Q795M3100j06608j03085l0534L9698R9368
11341A184349K0532p6888k1120J04204O5003j1781m0157j04149n6615J38009R920
$$ y = [1406778, 1298193, 1383840, 1441375, 1441632, 1385147, 1347785, 1383355, 1310422, 1365340, 1389132, 1409035, 1346044, 1217287, 1096546, 1076082, 1178015, 1358494, 1222168, 1110349, 1133228, 1113302, 1227143, 1211193, 1222701, 1253737, 1232584, 1182804, 1103691, 1170111, 1272136, 1230815, 1161588, 1121434, 1038092, 1032470, 1131639, 1194598, 1149393, 1118528, 1180221, 1076001, 1134882, 1233419, 1103571, 1076834, 1171851, 1261026, 1262052, 1304332, 1275058, 1294600, 1278193, 1292177, 1285753, 1157444, 1122909, 1343819, 1239249, 1086993, 1129362, 1166793, 1161236, 1091290, 1062859, 1037632, 1036746, 1055010, 1111198, 1233615, 1242410, 1285510, 1178902, 1075817, 1045283, 1084981, 1184349, 1204881, 1127993, 1106873, 1211077, 1276080, 1264299, 1224142, 1119993, 1063378, 1201387, 1211307]
11330A211307r6097p1840O4599R7755n436M2886j8721p0288m1540K5126R2712
11319A230463p1550j74126r7813Q2408J08052p538j3441o6475N763O1328K0191
11308A077262j4292K1615r7153k481O5024q3062q5298j3438O1097R4304M9977
11297A073555J08078q5796j33333q7608P6201K5518m039q135L0868R7246m0879
11286A051676j63131k220O8987O9609o5620N6361J544q1611k3950l0426l7297
11275H43922J22803P6170N5118k94m6978J14471l1958j62817j04821k4476Q2928
11264I24068R1479R551k3403l9284l3399r855j02198q3078K1180L8812o601L3009
11252H20281N9602l0811K7163l5k046R8662k6620N9703P1773j53314J08246K6218
$$ y = [1211307, 1115210, 1043370, 1107969, 1205724, 1200288, 1243174, 1224453, 1154165, 1112625, 1137751, 1230463, 1158913, 984787, 886974, 969382, 1077434, 1069896, 1056455, 989980, 995743, 1057071, 1077262, 1062970, 1084585, 987432, 984951, 1049975, 966913, 881615, 868177, 929274, 1023578, 1073555, 1181633, 1095837, 962504, 874896, 951097, 976615, 972576, 964441, 995309, 1092555, 1051676, 888545, 886325, 955312, 1024921, 959301, 1015662, 1017206, 935595, 911645, 881219, 843922, 966725, 1042895, 1098013, 1097719, 1050741, 1165212, 1133254, 970437, 865616, 841140, 924068, 1015547, 1025098, 1001695, 962411, 929012, 919157, 816959, 733881, 755061, 793873, 787272, 820281, 879883, 849072, 876235, 876200, 874154, 972816, 946196, 1005899, 1077672, 924358, 1032604, 1058822]
11240A058822l2095n3528k4450q7431l5684J60616Q4462n5128J8128J63998m6849
11229A150861j56166K2049k7149j11924l9590K7651m8903M9560N8540M5190j1759
11218I58360p9644n3788j7045L5532O0373l3816j1410M7142K5186J1827J5516
11207I58233j0178j65593m5067j15734r754J95535M6085K2629l886J62658p716
11196A027212j36441q1882m7894k0320l6052m3644l3130M027J86900Q3967j91156
11185G11587m7207J87237N8214j8910k6570J09752M6068k8778j08387j00334k5379
11174G57293O0526O3257M4057j64696j09773M0654N6600n6064J2245N746O9433
11163G79278K4898j4533j87170J17641L0525q0739N5968Q1043j28541m7892m8989
$$ y = [1058822, 1026727, 973199, 948749, 861318, 825634, 986250, 1070712, 1015584, 1033712, 1197710, 1150861, 994695, 1016744, 989595, 877671, 838081, 865732, 816829, 866389, 924929, 970119, 958360, 878716, 824928, 807883, 843415, 903788, 869972, 858562, 905704, 930890, 942717, 958233, 948055, 782462, 737395, 621661, 611907, 807442, 853527, 876156, 872270, 1034928, 1027212, 890771, 808889, 760995, 740675, 704623, 660979, 627849, 631876, 818776, 902743, 711587, 664380, 851617, 909831, 890921, 864351, 974103, 1020171, 991393, 883006, 782672, 757293, 817819, 881076, 925133, 760437, 650664, 691318, 747918, 691854, 704099, 709845, 779278, 804176, 789643, 602473, 720114, 750639, 669900, 725868, 806911, 678370, 630478, 581489]
11152E81489J17119M8922o7812n9373j9323K9227O3919n8888m4244P9765R5050
11141G65851o1534p0080j4585J30820N3275l8422o7338N172O5694m546p5748q9608
11129E98951J5557K013p6423K9130J20448M4820J2390l5022p5635l3110J33841
11118G36960P893r8732K8809P5096J4942l9360p4676k001K1324J0256M5332j8903
11106G06940p2833m472L4268J48372J30782q3058N453j2236j4728k8403j13349
11095F96736j1331J03189L493n7055k5136Q0170k9381o1653o1831Q894Q2254K1350
11083G49699k5883N8911M1174k9916o639p9488r257J6730k9550N5230q402m3542
11071F89067n865P0076J42208n5862j16889N4444P1341k4508l6575K2654l9413
$$ y = [581489, 698608, 747530, 679718, 620345, 601022, 630249, 694168, 635280, 591036, 670801, 765851, 704317, 634237, 619652, 750472, 803747, 765325, 697987, 703159, 768853, 764307, 688559, 598951, 614508, 616521, 540098, 569228, 689676, 734496, 746886, 711864, 636229, 603119, 736960, 744853, 646121, 674930, 750026, 764968, 725608, 650932, 648931, 670255, 680511, 725843, 706940, 634107, 629635, 663903, 812275, 943057, 859999, 865452, 853216, 838488, 810085, 696736, 685405, 788594, 792087, 735032, 709896, 790066, 760685, 699032, 637201, 646095, 728349, 749699, 723816, 782727, 823901, 793985, 787346, 707858, 698601, 715331, 685781, 741011, 732609, 689067, 683202, 753278, 895486, 839624, 722735, 777179, 848520, 824012, 787437, 810091, 770678]
11060G70678Q083j79408o2955P1809J17296J2084q1548K10710J24173K4419L5350
11049A050691P6559J56487o482r2571j21543j283r547p7158R9061P9911Q7376
11038A241501Q7934P032N703J04152Q3032N4661j44073j58793q601J01142O9317
11027A443007j1009L1745J9597J96709J33853l9479k46033j37296O6548j15029
11017A342613n8734j1823O396J35559O8039L4323O0584k9318q5498j07159m2771
11006A312211j03236j42250k5261R7798m4696l0554m5802K9639N1324p0097j82522
10995H46554j11362j8635J19102m7311m8344j801j11641j11114j03903j7234O4154
10984D58465J75068J22553n233l0152o2623r2149k4771m8976N603O8672p5780
$$ y = [770678, 778761, 599353, 536398, 608207, 725503, 737587, 656039, 866749, 990922, 1015341, 1050691, 1127250, 1283737, 1277255, 1184684, 1063141, 1061858, 1052311, 975153, 1074214, 1154125, 1241501, 1329435, 1336467, 1342170, 1446322, 1529354, 1584015, 1439942, 1281149, 1272548, 1373690, 1443007, 1431998, 1463743, 1483340, 1680049, 1813902, 1774423, 1528390, 1391094, 1457642, 1342613, 1283879, 1272056, 1278452, 1414011, 1482050, 1516373, 1576957, 1547639, 1462141, 1354982, 1312211, 1208975, 1066725, 1041464, 1139262, 1094566, 1064012, 1018210, 1047849, 1099173, 1029076, 846554, 735192, 716557, 835659, 788348, 740004, 738203, 626562, 515448, 411545, 394311, 458465, 633533, 756086, 750853, 720701, 658078, 565929, 541158, 492182, 497785, 566457, 490677]
10973D90677n2769n157J01229o1847l2342n8584N6743Q7875j2880P8556J40212
10962G31713j6776M9326m3399r1532j63561o7980R2096O7785M6766J48349N1547
10951H04334p7922n0043j02784j23095K6553K3721j1241p647J8392L8371k2938
10940E15701N1935J20313Q5707O8387k196m1664K5151r9441o5091m4089q1335
10929E33378L8186q8573o7335q540N6733N4989L7405K0862o8585n9765R757M8698
10917E07210r412j8018J3908M7883J2261L5410k1373K5765K9669p466J0300o340
10905F19797M2360j2861m0618l8621o3679O1548J417j03442j15514L7685J3734
10894D01806J1852R2252P580k8686K5264j07527q0256J30562N4598K0698J4423
$$ y = [490677, 437908, 432751, 533980, 472133, 439791, 381207, 437950, 525825, 512945, 591501, 731713, 714937, 764263, 720864, 629332, 465771, 397791, 489887, 557672, 604438, 752787, 804334, 726412, 676369, 573585, 450490, 477043, 500764, 489523, 481876, 500268, 538639, 515701, 567636, 687949, 773656, 842043, 839847, 798183, 823334, 723893, 658802, 614713, 533378, 571564, 482991, 415656, 407116, 463849, 518838, 556243, 577105, 508520, 448755, 458512, 507210, 497798, 479780, 493688, 541571, 553832, 589242, 567869, 593634, 623303, 615837, 626137, 619797, 662157, 649296, 608678, 570057, 506378, 567926, 569343, 465901, 350387, 388072, 401806, 413658, 505910, 513490, 484804, 510068, 402541, 322285, 452847, 507445, 528143, 542566]
10883E42566M0702o119q452l6385j08549m6717L3849J61569N4814m4045j4603
10872E68630P9088N667L2847j20226k0900L4163Q0115k5306j557p472M7232k9633
10860F42648m3588N8071L1634o7957Q9963O5172n3025j37878n7167l1961J09818
10849F05730j145o8110J05737j0142l4388k3390j06181M5408J0141J1680K6321
10838E61661M0070K013o615j8000o2356l9910k9145M7093k3228p0339J08075l9373
10826D69946L876J13108O4710M0779o5741n2963n3383j63787n5785l0919n8387
10815B11454R4040N8025N002K4889M8378n2886m3617Q5935M8919k2239L5569p0496
10803D22973j7852j4775r1154J1933k5250N3624R1267o4626k2615j04215q357
$$ y = [542566, 583268, 577149, 568697, 532312, 423763, 377046, 410895, 572464, 627278, 583233, 568630, 647718, 653385, 686232, 566006, 545106, 579269, 659384, 634078, 632521, 625049, 672281, 642648, 599060, 657131, 688765, 620808, 710771, 775943, 722918, 585040, 527873, 495912, 605730, 604585, 536475, 642212, 632070, 597682, 574292, 468111, 513519, 523660, 535340, 561661, 601731, 603744, 597129, 579129, 516773, 476863, 447718, 494811, 471583, 401244, 509319, 469946, 473822, 586930, 651640, 692419, 626678, 573715, 520332, 356545, 300760, 269841, 211454, 305494, 363519, 368521, 393410, 441788, 388902, 345285, 431220, 480139, 457900, 493469, 422973, 405121, 390346, 299192, 311125, 285875, 339499, 430766, 366140, 343525, 239310, 230953]
10792B30953p0628p425Q0102J73029N9408L2054o9982l721J24184j22962j65210
10781B59802q509P0957m1928K8882R5178O5639n928o3345o981r2952Q1500R2031
10769D74346k5557l7186m0149j9427J10707m7390J10677J5778j6058L6524M1226
10758F03491P5510l4666q7308o1839n0023O0636J28052N5723m2505R809n3113
10747F03767j19260m2635k9461l4046K03228J44179L4678k7385N7745K9880o8241
10736G52449j53469o6372P5537m6818N017N6100L3362j14057M7157Q0501L9606
10725G09013k3588m0597K4074M220K3848J02980M1006Q0895J5240j9267j0488
10714I07336k950q5499M0030l5073j17480M7788J40751o8429P106K6143P56n4098
$$ y = [230953, 160325, 152900, 233002, 406031, 465439, 497493, 427511, 423790, 547974, 425012, 259802, 251293, 322250, 280322, 309204, 404382, 470021, 464093, 400748, 393767, 300815, 382315, 474346, 448789, 411603, 371454, 352027, 462734, 415344, 526021, 541799, 525741, 562265, 603491, 679001, 644335, 557027, 495188, 445165, 505801, 633853, 689576, 647071, 656880, 603767, 484507, 441872, 412411, 378365, 581593, 725772, 760450, 733065, 790810, 820690, 752449, 598980, 532608, 608145, 561327, 566344, 622444, 655806, 541749, 588906, 669407, 709013, 685425, 644828, 668902, 673122, 696970, 799950, 840956, 921851, 937091, 917824, 907336, 904386, 818887, 858917, 823844, 706364, 754152, 894903, 826474, 833580, 859723, 860479, 806381]
10702H06381q3508J0089Q5129J04689j7365n9645O5843L5014N2082p8371k3944
10691H96394p9037k6248M8672p4134l1890j3901J1463Q5477O2073j2272P8954
10680I45551j1058r6403m4495N2850M6021J2328R1466N0482P907J10727j2458
10669A152918O8910J35066J36252K3663J0052j71724k2046Q021K9723J04712J02712
10658A578259o7835j06427M8138P4685J15603k7511m2651J138Q6340k5502K7459
10647A661696J36633J27377M7285O0559J76219K25334K02842J47985K69595K69781
10637C325306L09523L28210M65599O64455O88953N53615L37649L41436N96256
10628G611002Q67875J134675J501533K133864K915348L877187N299795P023896
$$ y = [806381, 722873, 732962, 818091, 922780, 905415, 845770, 911613, 946627, 998709, 920338, 896394, 817357, 791109, 839781, 765647, 733757, 719856, 731319, 816796, 878869, 866597, 945551, 934493, 838090, 793595, 846445, 892466, 904794, 996260, 1046742, 1054649, 1165376, 1152918, 1221828, 1356894, 1493146, 1516809, 1526861, 1355137, 1333091, 1341112, 1370835, 1475547, 1578259, 1510424, 1403997, 1452135, 1526820, 1642423, 1614912, 1572261, 1573399, 1659739, 1634237, 1661696, 1798329, 1925706, 1972991, 2033550, 2209769, 2435103, 2637945, 2785930, 3055525, 3325306, 3634829, 3963039, 4428638, 5093093, 5782046, 6335661, 6673310, 7014746, 7611002, 8478877, 9613552, 11115085, 13248949, 16164297, 20041484, 25341279, 32365175]
10620C2365175Q867963J0871982J2027409J0429310N398674j115939m861948m711453
10612F9271173k178006J653676N997988J0894632J6659953K2102780K4330233
10605A48732429J9621578N881326j0233291j8059541j6168888r634002k095442
10598A18044169N529517J3537922K1644463K8678237L0274256K1225331l90984
10591B38542911k3617666l3135302k9133136k0114063j1223432l165517M327813
10584A22481608J0867721J5620964J5804718Q565353o528872k1162855k6029704
10577A19618933k2108184j5369404r212618m350861l52772K726016M395879L855209
10569G9202198K00887n825173j1012180j2649365j1177651q655911o278588m467474
$$ y = [32365175, 41233138, 52105120, 64132529, 74561839, 79960513, 78844574, 73982626, 69271173, 67093167, 68746843, 74744831, 85639463, 102299416, 124402196, 148732429, 168354007, 174235333, 164002042, 145942501, 129773613, 120139611, 118044169, 123573686, 137111608, 158756071, 187434308, 217708564, 238933895, 238542911, 214925245, 181789943, 152656807, 132542744, 121319312, 118153795, 122481608, 133349329, 148970293, 164775011, 173340364, 166811492, 145648637, 119618933, 97510749, 82141345, 72928727, 68577866, 68225094, 70951110, 75346989, 79202198, 79403085, 73577912, 62565732, 49916367, 38738716, 30082805, 23804217, 19336743]
10561A9336743l223751k389375j980234j598411j128687q40730p33103o01615
10553F840837o83489p28265m92655k61139k17172k51016k21842k40822k72315
10544C472122l12999k16401j94315j90339j31454l3767l8803j56311j21594o7519
10534B008620n5757j32636j60342j31356M8035l7449j10339L6097J9031p4180
10524A409724l5378J7415o0748j12810M3666l5748n1299Q1776k6038j0248P40
10513A221052M8150N4417l9325J10891j2917j10165r8114l9403l2446o9135L1322
10502A064327R529L4844m7885J1732L1322r1249j05597p2550N086o646j17432
10491G15481O1961L5146j70618k0122J12560L7313j03439K7205J4576m8841l173
$$ y = [19336743, 16112992, 13723617, 11743383, 10144972, 9016285, 8175555, 7442452, 6840837, 6157348, 5429083, 4936428, 4675289, 4458117, 4207101, 3985259, 3744437, 3472122, 3159123, 2942722, 2748407, 2558068, 2426614, 2392847, 2354044, 2197733, 2076139, 2008620, 1952863, 1820227, 1659885, 1528529, 1576564, 1539115, 1428776, 1464873, 1483904, 1409724, 1374346, 1391761, 1331013, 1218203, 1261869, 1226121, 1174822, 1256598, 1230560, 1220312, 1221052, 1269202, 1323619, 1284294, 1395185, 1382268, 1272103, 1173989, 1134586, 1102140, 1033005, 1064327, 1073856, 1108700, 1060815, 1072547, 1103869, 1012620, 907023, 834473, 839559, 832913, 715481, 777442, 812588, 641970, 621848, 734408, 771721, 668282, 695487, 710063, 661222, 658049]
10480F58049j9059P6825j09847O9108P0457Q8975J020q4209k6706M07j88900j73216
10468C62904M1010o982J09598K0298q1998l9861L1528J6612M8608J25414P316
10457F34447j33124j56781j02469Q5525N9190J56372Q2616n3343n1283l1177m6963
10446D43010M9443K0438l5224L4898p080l8384J74732Q7965o3066J0876l784M130
10434F77954k4567n8546m2995n9932l6996P51j4468K7886o541K8374O8745O597
10422E66262q6794m6992O8299L2913m997j2707K5476l4003k5346n4331L3082p652
10410D53210J49300M6496l7900r7867p8403r1978j8375O3020K3065R4078k8114
10399D76532k529M216k4228L2048p3222r1630l0973l2286j0406P840n0928j6756
$$ y = [658049, 638990, 715815, 605968, 675076, 745533, 834508, 835528, 751319, 724613, 725020, 536120, 362904, 403914, 396932, 506530, 526828, 444830, 404969, 436497, 453109, 501717, 627131, 634447, 501323, 344542, 242073, 327598, 386788, 543160, 625776, 572433, 521150, 489973, 443010, 492453, 512891, 477667, 512565, 505485, 467101, 641833, 729798, 666732, 677608, 673824, 677954, 653387, 594841, 551846, 491914, 454918, 455669, 441201, 469087, 462546, 490920, 559665, 566262, 479468, 432476, 500775, 533688, 528691, 515984, 541460, 507457, 482111, 427780, 460862, 453210, 602510, 649006, 611106, 513239, 434836, 342858, 324483, 387503, 410568, 504646, 476532, 474003, 478219, 453991, 486039, 412817, 321187, 290214, 257928, 247522, 255362, 204434, 187678]
10387A87678Q115K0811J00269J07000J2038m9353m4350p0178m56J6593q0909K147
10375B09405J16986J18697K7234j14700j87529O9852k1645k4111J8539J03075
10365C15803R1481k7316l0732J1679N5819R7551m9412j23719j31333P2984J41171
10354D23976O7299p1448j02546p502j0202j6871m392J3484P2831k8173j13372
10343B23084l1324M7002J741j262M119R8892N6447m0932o9566j10176q2186P5564
10331A71403J24375N8623q5745m4097M6782k2391o838k08q1788n3589N5719K00331
10319C62577O0023O9371q7881q2818K6635O3601q7040j1965O3850p2280j74528
10308A29545J4584R1122R759j9355k4984p4115j3832Q9188N7537o0286o7448M7595
$$ y = [187678, 195793, 216604, 316873, 423873, 435911, 386558, 342208, 272030, 271574, 288167, 207258, 209405, 326391, 445088, 472322, 357622, 170093, 239945, 218300, 194189, 212728, 315803, 407284, 379968, 349236, 360915, 416734, 514285, 464873, 341154, 209821, 282805, 423976, 491275, 419827, 317281, 309779, 299577, 282706, 278314, 291798, 364629, 336456, 223084, 191760, 238762, 240503, 239241, 243360, 342252, 398699, 357767, 288201, 178025, 95839, 171403, 295778, 354401, 268656, 224559, 271341, 248950, 242112, 241904, 160116, 106527, 162246, 362577, 422600, 491971, 404090, 321272, 347907, 411508, 324468, 312503, 376353, 304073, 129545, 144129, 235251, 245010, 225655, 200671, 126556, 112724, 201912, 259449, 199163, 131715, 179310]
10296A79310J68542J0232n3748o5555j48150K1414Q3927R6307Q900r5451K5038
10285B30766o8811j52404O7978N2098J7156N7133k9450r9087j20173P6738K27394
10274B59338J22854R8584o4887j14587p9393P1801J01523n812j2035L0526q7185
10263C20727l5369p827J02717j5532j0252o9194O9760l9275l7273J4789O3280
10252C56551O2249P473O9654m2368K6792l0653K1409r3349r3472K0689k6677N5033
10240C33331l042n8142J2060l6964L3439R6632O709p8736N3543J52776N9406K03288
10228G74300K54111n0129o7765J38980J13530J02191J45377K2703n5898p622Q9733
10217A459511o5535k39557j45950M9433j41323j92289j51241j20650J5080O9999
$$ y = [179310, 347852, 358084, 304336, 238781, 90631, 112045, 195972, 292279, 301179, 205728, 230766, 161955, 9551, 77529, 129627, 146783, 203916, 174466, 75379, -44794, 31944, 259338, 382192, 480776, 415889, 301302, 221909, 293710, 395233, 389421, 377386, 407912, 320727, 285358, 277531, 380248, 364716, 354464, 285270, 355030, 315755, 278482, 293271, 356551, 418800, 426273, 495927, 453559, 480351, 449698, 471107, 377758, 284286, 304975, 278298, 333331, 330289, 272147, 284207, 247243, 280682, 377314, 384023, 305287, 358830, 511606, 571012, 774300, 1028411, 978282, 910517, 1049497, 1163027, 1265218, 1410595, 1433298, 1377400, 1369778, 1459511, 1393976, 1154419, 1008469, 1057902, 916579, 724290, 573049, 452399, 467479, 537478]
10207E37478P787L1987j20115j25559L6875R8322l6868L2320l5686j21988j0872
10196B93681K4227M6414K1578O107R5777l409K2099J71426J49843N6122J32858
10185A016723L6587P6632Q5044J67039K13460K93865K10162J52814l0147p7015
10175B145164q6835j90986j19174J5690M9689L6535k2610j59132j32984p6426
10165A458931p1875o8394m2918M9043m2135J00001K38996K38708N6052m0498p9830
10154A796081J1378j75338k07461j57030k4630r7965P8515Q9661L6128J99581
10144A548920P2724J8951p7311j46895j8098P6350m2146O7234J04835j3770P9233
10133A670027O2396O730j15270j40318j73945j62563j47018q1021j39476o7112
$$ y = [537478, 545265, 577252, 457137, 331578, 368453, 466775, 429907, 462227, 426541, 304553, 293681, 317908, 364322, 385900, 392007, 487784, 484375, 506474, 677900, 827743, 883865, 1016723, 1053310, 1129942, 1214986, 1382025, 1595485, 1889350, 2099512, 2252326, 2222179, 2145164, 2058329, 1867343, 1748169, 1763859, 1813548, 1850083, 1827473, 1668341, 1535357, 1458931, 1387056, 1318662, 1275744, 1324787, 1282652, 1382653, 1621649, 1860357, 1916409, 1875911, 1796081, 1807459, 1632121, 1424660, 1267630, 1243000, 1145035, 1223550, 1313211, 1349339, 1548920, 1621644, 1640595, 1563284, 1416389, 1398291, 1474641, 1432495, 1499729, 1604564, 1590794, 1670027, 1732423, 1739153, 1623883, 1483565, 1309620, 1147057, 1000039, 919018, 779542, 712430]
10123G12430O972m5360k4745N7087m3311o6821j16546q7928j72133n2777P4127
10112B40995J20916M7646P8887j1996j11580j3471k2273J1144O0082j52307K1623
10101B69666K2965P123J5203N9285J07101J1788o9951M8575R3808J6055k0465
10090E61153M0598J2331j00438j42636n9605q0828J3970Q1339R544K8618Q593
10079C72639J8693j20053j14718M4703k4056p9838j1317J13809J921K5107K7424
10068B54314m3724L4715P9156k1944n4822K8329O6982P0750l3914r9928j8372
10057B61542O0349J34000L4768L1349j4863j5702k48p9734j27270r29l9990M278
10045B47550J14740Q9806Q3990q0609n6580M222m0338K4632M9920J51353l3493
$$ y = [712430, 719402, 674042, 649297, 706384, 663073, 596252, 479706, 391778, 219645, 166868, 240995, 361911, 409557, 488444, 476448, 364868, 351397, 329124, 340268, 400350, 248043, 269666, 292631, 299754, 314957, 374242, 481343, 493131, 423180, 471755, 565563, 581618, 561153, 601751, 614082, 513644, 371008, 311403, 230575, 244545, 325884, 335428, 364046, 372639, 391332, 271279, 156561, 201264, 177208, 97370, 86053, 199862, 201783, 226890, 254314, 210590, 245305, 324461, 302517, 247695, 276024, 343006, 413756, 379842, 279914, 261542, 321891, 455891, 490659, 522008, 507145, 491443, 491195, 411461, 284191, 283262, 243272, 247550, 362290, 452096, 536086, 455477, 398897, 403119, 362781, 387413, 437333, 588686, 555193]
10034E55193j67629p5084J6688O9550R1227l2374o7337L3124J7655r8250k6198
10023C16565R3522m8027j2388J7056p743Q8465K477n9668J50787R0382n3169q4188
10011D94071j7822q4023j07888O9564L2821o5352p8664J29846P6340r3726j02551
10000B52616j1500N7973J14602J13875o0999n5270J2765k8919j98179l4126R4570
9989B57408N3643J01531K4793k8088j0642o87J4762K8604L8038r0058r3080L6567
9977C32791j51k5226r118l2286L815L8350p7050J01037N8257p2889j9438L9446
9965C37538J0490P345k429M378N1687o7173j17476L2873J25513j3975m7373r2440
9953B28958l8926J3067J4905J09108J23573o0933p4830N0400J47152n081r6776
$$ y = [555193, 387564, 312480, 329168, 398718, 489945, 457571, 390234, 423358, 441013, 342763, 316565, 410087, 362060, 349672, 366728, 358985, 447450, 449927, 390259, 541046, 631428, 578259, 494071, 476249, 392226, 284338, 353902, 386723, 321371, 242707, 372553, 448893, 355167, 252616, 241116, 299089, 413691, 527566, 466567, 411297, 424062, 395143, 196964, 162838, 257408, 311051, 412582, 437375, 409287, 398645, 397958, 412720, 441324, 479362, 389304, 296224, 332791, 332640, 307414, 298296, 266010, 269825, 308175, 231125, 332162, 390419, 317530, 298092, 337538, 348028, 355373, 352944, 357322, 409009, 341836, 224360, 257233, 382746, 368771, 321398, 228958, 190032, 203099, 218004, 327112, 450685, 389752, 314922, 365322, 512474, 507393, 410617]
9942D10617K4510L3477n3670m6463m2475J891J65280J32807p9438p8735J788J14549
9930E84138K16795O6228k4119O720J6420j00078O4101n9239j5834k2277P3147
9919H06002L9900o9048p6075R1883J4457o8964m6947M3549j637o1695L4233K66107
9907I71765J19343N7410r6114Q4283J28417J12306k0197k4427r1898J6722o316
9896A251294j21083Q1032J05851J8512m6973J32390J52000J23695K06466J38442
9886B041626J38878K10072J04390N119M2210J00633K31884K11609P7805K78070
9876C442296L35108J08928J19950J87472K64046J50406J08664L46386J51051K5036
9866E239343J18809J65642P9264j00164j22336R621k1236j03760N0005K36866
$$ y = [410617, 435127, 468604, 414934, 368471, 325996, 327887, 493167, 625974, 546536, 467801, 469589, 584138, 800933, 867161, 843042, 849762, 866182, 766104, 830205, 770966, 755132, 732855, 806002, 845902, 776854, 700779, 792662, 807119, 738155, 691208, 734757, 733120, 671425, 705658, 971765, 1091108, 1148518, 1052404, 1136687, 1265104, 1377410, 1357213, 1332786, 1240888, 1257610, 1251294, 1130211, 1211243, 1317094, 1335606, 1288633, 1421023, 1573023, 1696718, 1903184, 2041626, 2180504, 2390576, 2494966, 2500085, 2542295, 2642928, 2874812, 3086421, 3164226, 3442296, 3777404, 3886332, 4006282, 4193754, 4457800, 4608206, 4716870, 5063256, 5214307, 5239343, 5358152, 5523794, 5603058, 5502894, 5380558, 5390179, 5368943, 5265183, 5315188, 5552054]
9856E552054L7682O38P0805K44906L79632M10516N74908P50514Q59760Q46681
9846I728096Q91220Q66847Q19551N21486L30545K36005m5016o5877k07016m17631
9836A2658210m38855m24334k93948l43149k67761j73995j82243j04715K47202
9827A0676412L14122L82437M64530O31647O68769Q92076J046696J076422J171267
9818A7324378J386457J692340K105094K447851K974449L729798M533445N648639
9810D1842451P242657Q828231J0631838J2505961J4158528J4797696J3642283
9803A23649645J0063632M482972j989208p243727j0093972j0616416r376878p684799
9795I1191249n667731l460099j464338O34800K337586M088337N532059O651104
$$ y = [5552054, 5589736, 5590374, 5661179, 5906085, 6285717, 6696233, 7271141, 8021655, 8881415, 9728096, 10619316, 11486163, 12305714, 12827200, 13157745, 13393750, 13348734, 13282857, 13075841, 12658210, 12219355, 11795021, 11501073, 11157924, 10890163, 10716168, 10533925, 10429210, 10676412, 10990534, 11372971, 11837501, 12469148, 13137917, 14029993, 15076689, 16153111, 17324378, 18710835, 20403175, 22508269, 24956120, 27930569, 31660367, 36193812, 41842451, 49085108, 57913339, 68545177, 81051138, 95209666, 110007362, 123649645, 133713277, 138196249, 136207041, 128963314, 118869342, 108252926, 98876048, 91191249, 85523518, 82063419, 80599081, 81233881, 83571467, 87659804, 93191863, 99842967]
9787I9842967P631415Q032264P947330P205802N956436M626268L401822K009581
9779A46653885P59559o39902j631749k114905k610347k677487k354868j306008
9771A34078178K85291K560868N717976R859239J5252012K1984271K9476533L6391998
9763B55606366M0499625L9037897K9012366R841486j3545615l1270426l8678102
9756B90503597l8488814l4002620k7697948k1064811j5308383j0293321o320065
9749A37327635k891288m97823J053278J969127K336498K402113K293479K041015
9741A46034034J295455J972j482608k919318m466330o066396p698665q724372
9733A15973772q927775q296556p449954o146519m387604k842194j210754O85029
$$ y = [99842967, 107474382, 115506646, 123453976, 130659778, 136616214, 141242482, 144644304, 146653885, 147413444, 146773542, 145141793, 143026888, 140416541, 137739054, 135384186, 134078178, 134363469, 136924337, 142642313, 152501552, 167753564, 189737835, 219214368, 255606366, 296105991, 335143888, 364156254, 373997740, 360452125, 329181699, 290503597, 252014783, 218012163, 190314215, 169249404, 153941021, 143647700, 137327635, 134436347, 133938524, 134991802, 136960929, 139297427, 141699540, 143993019, 146034034, 147329489, 147331461, 145848853, 142929535, 138463205, 132396809, 124698144, 115973772, 107045997, 98749441, 91299487, 85152968, 80765364, 77923170, 76712416, 77397445]
9725G7397445K744848M645905O428369Q246845R482666R429889P634472L921866
9717A29932305j413040p208541j1752045j3972621j3887430j2462150j0567733
9710E8668745q804712p185900n660754m553429l580077k902666k258736j910405
9702B1812066j819707j571261j335594j072597r87885r56862q68848o06467m87706
9693A2105139l65911k67462k02404k31446j23075N8925R4017J93981K19682L04153
9683A1785599K76839L34972L00613J72733n2412k56494m36334n30124p31832p87789
9673A0075771p75941p33829q03591n81229n00614l08444k67495l15417j58657
9664E630554k2541J8626N4902l027M1824p4603j6648M9651J9384J03052J21410
$$ y = [77397445, 80142293, 84788198, 91216567, 99463412, 108946078, 118375967, 126010439, 129932305, 128519265, 121310724, 109558679, 95586058, 81698628, 69236478, 58668745, 49864033, 42678133, 37017379, 32463950, 28883873, 25981207, 23722471, 21812066, 19992359, 18421098, 17085504, 16012907, 15025022, 14068160, 13199312, 12592845, 12105139, 11739228, 11471766, 11269362, 11037916, 10914841, 10973766, 11067783, 11261764, 11481446, 11785599, 12062438, 12397410, 12698023, 12870756, 12818344, 12561850, 12125516, 11595392, 10863560, 10075771, 9299830, 8566001, 7762410, 7181181, 6680567, 6372123, 6104628, 5789211, 5630554, 5608013, 5626639, 5681541, 5678514, 5720338, 5645735, 5629087, 5678738, 5698122, 5801174, 5922584]
9653E922584q720k40114l29667k27874l05372k58716j74117j91591j21192j87333
9643C877888k43009j24371j49886j31455l21715l14024k33178k01298k07820j93319
9633A757813q5298l4465J53622N4399j6315Q99j04367j71895P6433k8295K0611
9622A623142k17457o8484j3017L5431j21216j28641m5564K2454O6289N657K9165
9611A187759m6592o1060J0337J44873L3565L6240O9989l9216j84891q992M1880
9600A183892m149o7535N1025L8048j79761q1714m5126p4596j13804M0640N7586
9589H04506j3365J64059P9265J451J41787j1308j82694n9108P095j6619K3595
9578I38664P016J20700L1859l2627r6191j09322k2586M7092R567P4587j9313n6930
$$ y = [5922584, 5913864, 5673750, 5344083, 5116209, 4810837, 4552121, 4378004, 4186413, 4065221, 3877888, 3634879, 3510508, 3360622, 3229167, 2907452, 2593428, 2360250, 2158952, 1951132, 1757813, 1672515, 1638050, 1791672, 1846071, 1829756, 1830655, 1726288, 1554393, 1630826, 1602531, 1623142, 1405685, 1337201, 1324184, 1359615, 1238399, 1109758, 1064194, 1086648, 1152937, 1158594, 1187759, 1141167, 1080107, 1090444, 1235317, 1268882, 1305122, 1375111, 1335895, 1151004, 1142012, 1183892, 1179743, 1112208, 1163233, 1201281, 1021520, 939806, 894680, 820084, 706280, 746920, 804506, 791141, 955200, 1034465, 1035916, 1177703, 1166395, 983701, 924593, 931688, 915069, 938664, 945680, 1066380, 1098239, 1065612, 969421, 860099, 837513, 884605, 894172, 968759, 949446, 892516]
9566H92516M4020k7054K1009j3546j7400j8251n8102p4696q7772j9220N9087J9731
9554G20322l5971m3643k2316O9631M1880j6233o4565K4394J42150J68295m0793
9543I43151o7891j05237j37455J8902K6421q7728j11244p050Q2761o9123M3651
9532E29158R8202o5435q6502J5359R3387m4043o9921Q2558L1418n8614k6685K3688
9520E22570O2896N2009J1852m1046p2879m8636K4341M6066J6221r0719P0577J07350
9508F60602K7879O675n330p6814o1976Q789J3895O448l3401J0590J0708p9609
9496D88456m540q8760q1069P7248K9888J08339N9434p4941l3462j47002l3416
9485C00175P3039m1087L5106K3875J03868p8108n0404P8178J6433j07987p2614
$$ y = [892516, 936536, 909482, 930491, 916945, 899545, 881294, 823192, 748496, 660724, 641504, 700591, 720322, 684351, 640708, 618392, 688023, 729903, 713670, 649105, 673499, 815649, 983944, 943151, 875260, 770023, 632568, 651470, 677891, 590163, 478919, 471869, 554630, 485507, 529158, 627360, 561925, 475423, 490782, 584169, 540126, 470205, 552763, 584181, 525567, 498882, 522570, 585466, 637475, 649327, 608281, 535402, 486766, 511107, 557173, 573394, 482675, 553252, 660602, 688481, 695156, 689826, 613012, 551036, 559825, 573720, 580168, 546767, 557357, 568065, 488456, 483916, 395156, 314087, 391335, 421223, 529562, 588996, 514055, 480593, 333591, 300175, 373214, 332127, 367233, 391108, 494976, 416868, 366464, 444642, 461075, 353088, 280474]
9474B80474J12352k3146o5132r860K2056k3902p3023M33m35k814j1677n2092L2865
9461A86099j2399M3983o442J4170J67640j07459L974N9996O7906j0588R565o5298
9449C51147N8784o1862j17685n8857R1087J11118k2340K7206N1271j18173L2299
9438C43995L6093l3536l4690j9057p2822j8396M2192J27246R0252m9362J4332
9427D26247R8027J27530q6070k0426n484j1608J9536J32895o8712p0574L543k9925
9415E14979r502m4074m5916o1934l7026M0981Q9148M0085k085R742r4803o1151
9403C38444o0285L7356Q692Q4353J8602p2657r7785J82883J47278r8902j8K2101
9391E10062Q7011M9284K7883J49959J14573k041o9481J94669J45795J97749J11707
$$ y = [280474, 392826, 369680, 304548, 294688, 316744, 292842, 219819, 220252, 219817, 217003, 205326, 153234, 186099, 173700, 217683, 211241, 225411, 393051, 285592, 289566, 349562, 417468, 406880, 416445, 351147, 409931, 348069, 230384, 171527, 262614, 373732, 351392, 378598, 429869, 311696, 343995, 380088, 346552, 311862, 292805, 219983, 201587, 243779, 371025, 461277, 411915, 426247, 524274, 651804, 565734, 545308, 539824, 528216, 547752, 680647, 611935, 541361, 544904, 514979, 505477, 461403, 415487, 353553, 316527, 357508, 446656, 486741, 484656, 494398, 399595, 338444, 278159, 315515, 324207, 408560, 427162, 354505, 256720, 439603, 586881, 487979, 487961, 510062, 597073, 646357, 674240, 824199, 938772, 936731, 867250, 1061919, 1207714, 1405463, 1517170]
9380A517170O7799M3681k45943j07705m7141k12160j02780j01396m6306K3151
9370G88370r2543q1444m4406M4769l3970l8923J37211J14612j12938j12617o8553
9359D99568K1981k7057o6082K4040m526O188R7534j8419k7953L3489J02111L0122
9347F70996j3917j9547N9222J15058J49714R6501J97010J10815P8149Q2261m475
9336A521787k6629o7784J0623L2321q1611j96022k20904k08831n1671j42598M003
9325E72684L4473k419k9798o5167j19866k7678n1889M9379L7548q4165j28460
9314A84642p4457J9984k4058J52270Q6291o0611M5304M3652j9371R7088Q7257
9303E37991P9848n6058m997P8695J52712R2318O4728J34230J05236r5105k16815
$$ y = [1517170, 1584969, 1628650, 1382707, 1275002, 1227861, 1015701, 912921, 811525, 765219, 788370, 695827, 614383, 569977, 614746, 580776, 541853, 679064, 793676, 680738, 568121, 499568, 521549, 494492, 428410, 452450, 447924, 454112, 551646, 533227, 505274, 538763, 640874, 670996, 657079, 637532, 696754, 811812, 961526, 1058027, 1255037, 1365852, 1444001, 1526262, 1521787, 1495158, 1427374, 1437997, 1470318, 1388707, 1192685, 971781, 762950, 711279, 568681, 572684, 607157, 604738, 574940, 509773, 389907, 362229, 310340, 359719, 397267, 313102, 184642, 110185, 130169, 106111, 258381, 344672, 284061, 329365, 373017, 353646, 450734, 537991, 617839, 561781, 556784, 635479, 788191, 880509, 945237, 1079467, 1184703, 1089598, 872783]
9292H72783p5858K5829J3648L1400n7727k21240j22159L8937O260j04025m7003
9281C60845m3672Q9808o1983j08322j9510P4165L2827m0480k714O7065k7687j34173
9269A86169j4476J63066O0649q615J3504n9937j04567j22775q0644O7074M4913
9258A44361k8726J3337M9743J28575N1850k3918L0310j00630J208O2336M0069
9247C68515n1693j5585j8255n4812k4989r271L124l42l8532O983Q4366K85p0571
9234A79223j12036P098J20103L2663J20232m4171k8005l7603N8354k3668j27893
9223A44297p3733K6604J7429q1856j02844J9248N4654l866o4227O69J61317R9454
9211A97146o7207L1340N211j05647o6018K3459J68623Q4532m6000O2658k5041
$$ y = [872783, 796925, 822754, 836402, 867802, 810075, 588835, 466676, 505613, 511873, 407848, 360845, 317173, 406981, 344998, 236676, 217166, 291331, 324158, 283678, 280964, 348029, 320342, 186169, 171693, 334759, 395408, 386793, 400297, 340360, 235793, 113018, 32374, 99448, 144361, 115635, 128972, 178715, 307290, 359140, 335222, 365532, 264902, 266110, 328446, 368515, 316822, 301237, 282982, 228170, 203181, 193910, 197034, 196692, 158160, 165143, 249509, 249794, 179223, 67187, 74285, 194388, 227051, 347283, 303112, 275107, 237504, 295858, 272190, 144297, 70564, 97168, 114597, 32741, -70103, -50855, 3799, -67, -64294, -63625, 97692, 197146, 129939, 161279, 166490, 60843, -5175, 18284, 186907, 271439, 225439, 288097, 263056]
9200B63056l8658O352l4935r0000M3103m9834m0607P684O1368n3482N9466J35272
9188B68785M1882M3695M448M9048k9520m7051k5728n9979N7089k4369q7551j3644
9176A77105k4895P5390n1638j37460k3910L3564M0632J0598K186L312m4837j46848
9164h6801N1666J04781J7500j8958J44774n9822j65554K0991R4178r7702p2635
9153f7582N894R8723J11438K3351q4946l3683J0852P6329j1816p155R6248L092
9141B20745k05025j3587J43370L6289j66701m5313P7784l3934k4430M0569J09605
9130A39372J03455L2953l5851o7908J1906P0063k648o9205p7057k0854j2075j11865
9118c9714m843Q9992N5244Q155J161K5629J5422j2245K8217M2523M6877r1736
$$ y = [263056, 224398, 230750, 195815, 105815, 148918, 99084, 58477, 66161, 127529, 74047, 133513, 268785, 310667, 354362, 358810, 407858, 378338, 331287, 305559, 245580, 302669, 278300, 190749, 177105, 152210, 227600, 175962, 38502, 14592, 48156, 88788, 99386, 101572, 104884, 60047, -86801, -35135, 69646, 87146, 68188, 212962, 153140, -12414, 8577, 102755, 5053, -67582, -61688, 37035, 148473, 171824, 86878, 53195, 64047, 140376, 128560, 121405, 217653, 220745, 15720, 2133, 145503, 181792, 15091, -30222, 47562, 13628, -10802, 29767, 139372, 242827, 275780, 239929, 172021, 183927, 253990, 251342, 182137, 105080, 84226, 72151, -39714, -44557, 45435, 100679, 108834, 109995, 135624, 151046, 138801, 167018, 209541, 256418, 164682]
9106A64682l0025P5432l5439j01240j38692m4830R4222M2956N4067O6240L9404
9095A86777N5088j6397r7516J01390R1700N0602n5413q0984j7119j797j29829
9084H6502M2191M8284r1000q0971M0593L9427N9013j3888o3454K263k2061O1880
9072A08779O2102j5243K4885P0716k7384k2795N4195j2463p6849q4918o8788q7553
9060g5316K9916J07919l1604k5029J54462m4582n6051j13996N9199R5820Q1580
9049A82318l9293j26414L6726m6866k6801m5341p2577r4066J10921J3453r778
9038a17718P2690K8918P8100K0962K8466m1068j02910Q8585j962J491K1730l8341
9026C8943o4722p1914P0742Q250j23373k3087j9874k8111L3957P3237J4372j7235
$$ y = [164682, 134657, 210089, 174650, 73410, -65282, -110112, -15890, 27066, 81133, 147373, 186777, 241865, 225468, 127952, 229342, 321042, 371644, 316231, 235247, 218128, 216331, 86502, 128693, 176977, 85977, 5006, 45599, 85026, 144039, 130151, 66697, 68960, 46899, 108779, 170881, 155638, 180523, 251239, 223855, 201060, 255255, 242792, 165943, 81025, 12237, -75316, -45400, 62519, 30915, 5886, 160348, 115766, 59715, -54281, 4918, 100738, 182318, 143025, 16611, 53337, 6471, -20330, -65671, -138248, -232314, -121393, -107940, -117718, -45028, -16110, 61990, 82952, 111418, 70350, -32560, 56025, 54063, 55554, 77284, 38943, -25779, -97693, -26951, -18701, -142074, -165161, -185035, -213146, -179189, -105952, -91580, -108815]
9014a08815p8391Q3256M9525R0213M4266K4388L8848m788q1091j11740m5916l9354
9002a39599J09717N8697J3453R262k3309n1857L0430k0522K3576P9425l122l2785
8990E3366r2103m4419J5039L9663J7754Q161l9810P169Q4358J6405j57467j78449
8978b70333J02157J41406J476p291j7482m0529M3393K0653N5058M3814L4998P0765
8966A78085L0292K3299j6633j08929j09421P1374R6360l4738L9298l6817p0935
8955F1235P7305M8926n0433l9450J370p07q5393l7938k8705L7713R896o4453J16866
8942D6232M4294o2848m4155J39705p273m874k0971j96679q2746J22308J26404
8931E9397J24313O4932l9602j05864j10817j0790k6325m6041l4737j2334J77426
$$ y = [-108815, -187206, -103950, -54425, 35788, 80054, 104442, 143290, 138502, 57411, -54329, -100245, -139599, -29882, 28815, 42268, 51530, 28221, -23636, 6794, -13728, 9848, 89273, 86151, 53366, -38737, -83156, -68117, -28454, -10700, -2539, -42349, -35180, 49178, 65583, -91884, -270333, -168176, -26770, -25294, -32585, -50067, -90596, -47203, -26550, 28508, 72322, 107320, 178085, 208377, 231676, 215043, 106114, -3307, 68067, 164427, 129689, 168987, 132170, 61235, 138540, 187466, 137033, 97583, 98953, 98246, 12853, -25085, -53790, -16077, -6181, -70634, 46232, 90526, 27678, -16477, 123228, 115955, 111081, 90110, -106569, -189315, -67007, 59397, 183710, 248642, 209040, 103176, -7641, -18431, -44756, -90797, -125534, -137868, 39558]
8920C9558K5848j08019Q506M8151l9421M0012J5037P8313R071R877K3528m0206
8908A10255j1433L4271J62786K695q6784K843M357q9069o1708l1048P4263j2257
8896I9171R6210J41306L7806o3762q3627j00462P5273O211M3278l3057r0041n2163
8884G6143l1898K6482j7469j1302N0746j9260l2645K605p7501O544J46904k5681
8872I3668r7984K066r9881l0573M1801M3947o1857Q6285O4322R1704J0613J5641
8860A59752l4507k7030L7489j07356J02711J01773R23p9918N3921J4674k090Q9957
8848C10299q0649m1359o5706N2400O4294J12716l6025p0141P303J7950Q1025k025
8836C50082N0515m6670o69Q4401j39257j73157j51098P9145J26823m0870J5390
$$ y = [39558, 65406, -42613, -34107, 14044, -25377, 14635, 29672, 107985, 117056, 126933, 150461, 110255, 98822, 133093, 295879, 298574, 211790, 214633, 218990, 129921, 68213, 37165, 111428, 99171, 195381, 336687, 374493, 310731, 227104, 126642, 201915, 208126, 251404, 218347, 128306, 76143, 44245, 70727, 53258, 41956, 92702, 73442, 40797, 43402, -34099, -27555, 119349, 93668, -4316, -2250, -102131, -132704, -90903, -46956, -108813, -22528, 41794, 133498, 144111, 159752, 125245, 98215, 135704, 28348, 131059, 232832, 233755, 153837, 207758, 222432, 220342, 310299, 229650, 188291, 122585, 174985, 239279, 351995, 315970, 245829, 253132, 271082, 352107, 350082, 400597, 353927, 353258, 437659, 298402, 125245, -25853, 53292, 180115, 139245, 154635]
8825A54635j21440m2605j9297J22727O5739J58775N8065p3789n5068p9302r7250
8814G1190J8168L6401O2157J18957J9416j6570j42898j11623K6685k5815N6025
8803A12093L5680N2012K7482N741J1908K0843K5644J01574J13263Q823j43250
8792C71813p9002j5642l5742l2236j06796n7189k0431K8849n8823Q0065K0906
8781I5772J17451m0603o987j373j7571L5047q4877n6901M1946K952K3964j11534
8769b714J16352M9763K0818k3163N6131Q80m8634Q9682K0470r5035L1787k8198
8757A88139k15604n6584J03836M6857L119L266R9787N5287M0791L8105k4904q087
8745B74008p7379m4820j5518p2732Q0993O0010j3972j5459j2495J472n8781K4690
$$ y = [154635, 33195, -9410, -28707, 94020, 159759, 318534, 376599, 302810, 247742, 168440, 71190, 89358, 125759, 187916, 306873, 326289, 309719, 166821, 55198, 81883, 56068, 112093, 147773, 199785, 227267, 233008, 244916, 265759, 291403, 392977, 506240, 515063, 371813, 292811, 277169, 241427, 209191, 102395, 45206, 24775, 53624, -5199, 74866, 95772, 213223, 172620, 165633, 164260, 146689, 181736, 96859, 39958, 81904, 84856, 108820, -2714, 113638, 163401, 184219, 161056, 217187, 218067, 169433, 259115, 279585, 184550, 216337, 188139, -27465, -84049, 19787, 66644, 69763, 73029, 172816, 228103, 268894, 306999, 282095, 274008, 196629, 151809, 136291, 63559, 144552, 204562, 190590, 175131, 162636, 164108, 105327, 130017]
8733A30017j591o1327K4962P6504O4827j4688o9468l6197p2990l2138J76130J25839
8721C09880r0820m1748k2263k3371L2728O9309k0804k1406n3142j09031n3267
8710b3935Q7569O9716l013m8743l9490J24761J04L968o0038l5307j6648Q2172
8698A41116P1656j0781r805r1788j01878N2671M9708N8749n7128R086l1471k7151
8686E2984r6218J12662k2809J4934O8049Q3602N4166m0424l0196K9318l6324K3606
8674B13350P3807j44542j03336l2324K3996K3766o1998k298j0647N3189J2563
8663D5526O0235r561m7590N7200P213N7177M6282r3287k3260K9750q2548J8389
8651F5526L6617j32462o0211K1923j0698Q3143R0006k3447n9505n7714J8199j6391
$$ y = [130017, 128426, 67099, 92061, 168565, 233392, 218704, 149236, 113039, 40049, 7911, 184041, 309880, 219060, 177312, 155049, 131678, 164406, 233715, 212911, 191505, 138363, 29332, -23935, 63634, 133350, 130337, 81594, 42104, 166865, 166969, 170937, 110899, 75592, 58944, 141116, 212772, 201991, 192186, 100398, -1480, 51191, 100899, 159648, 102520, 111606, 80135, 52984, -43234, 69428, 46619, 61553, 129602, 213204, 267370, 226946, 196750, 226068, 189744, 213350, 287157, 142615, 39279, 6955, 30951, 54717, -7281, -9579, -20226, 32963, 45526, 105761, 96200, 48610, 105810, 113023, 170200, 216482, 123195, 99935, 129685, 47137, 65526, 102143, -30319, -90530, -68607, -79305, 3838, 93844, 70397, 10892, -46822, -28623, -45014]
8639d5014k4563Q757R9922Q3397k1453m7324n8913k3817O4657l1810P8403J01437
8627A83679L8048j3950k341j4182m6284j6798o24K7940L6987j36604j14810J9729
8615c9210J2560k1550j7600J55236p1191L1718k773J1207j2285P5624n0991m2433
8603B8312K5755O64J23373J2766j38934M7176L035J2326j1251O7417l526k1308
8591A45805M6661P3020l2067J2014J15651l3273J4751j28173o5187p3470N1382
8580A27114J7894o7517O2929J09308j351n583M128p992n3790k3835p4150L2234
8568A19389O5446n2857q3484m4801o2612Q3642P0188k2697L5414L1967l3156J712
8556A08151j6998n9479J27002k647J4393L0856K5653j38754M8230l3137Q312R6258
$$ y = [-45014, -69577, -60820, 39102, 122499, 101046, 53722, -5191, -29008, 35649, 3839, 82242, 183679, 221727, 207777, 205436, 191254, 144970, 128172, 127548, 155488, 192475, 55871, -58939, -39210, -26650, -48200, -65800, 89436, 18245, 49963, 47190, 58397, 46112, 121736, 70745, 28312, 54067, 54731, 178104, 190870, 51936, 99112, 102147, 114473, 103222, 170639, 167113, 145805, 192466, 265486, 233419, 245433, 361084, 327811, 342562, 214389, 149202, 75732, 127114, 145008, 77491, 140420, 249728, 248377, 242794, 246922, 238930, 185140, 161305, 87155, 119389, 184835, 131978, 48494, 3693, -58919, 24723, 94911, 72214, 107628, 139595, 106439, 108151, 91153, 31674, 158676, 156029, 170422, 201278, 226931, 88177, 136407, 103270, 111582, 207840]
8544B07840J08025m8378j20110k9289J16497j2568j68686o5567j8280M6046K9539
8533D5069L3088m8702K6713M7397m1114l4195N0322Q548q7790Q6321J11615p8869
8521A18403n4627m6532L4575m4406K0179J04122N3342o2097m4391L2247l4866
8510G5949q8381L6681J9013N2778J6201L5345O4086k7489q5237N818P9567L8177
8498B22508J16719O096j01809Q7357j715p0186M1400K8677r8309r0347N7238l389
8486A94240j76945j0753Q8938P2626J4841m3178k7730N1900L7439p377J1423m3514
8474A61910m2888o37m0790k3886J46408N1835o1785n767O3223p7704m7092K2728
8462A45555L7532N2733m0118Q5972R667k2765k3581m2532M7145M7107L8769J9198
$$ y = [207840, 315865, 267487, 147377, 118088, 234585, 222017, 53331, -12236, -30516, 15530, 45069, 78157, 29455, 56168, 103565, 62451, 28256, 78578, 87126, -664, 85657, 197272, 118403, 63776, 17244, 51819, 7413, 27592, 131714, 185056, 122959, 78568, 110815, 75949, -12432, 24249, 43262, 96040, 112241, 147586, 211672, 184183, 98946, 104764, 184331, 222508, 339227, 345323, 243514, 330871, 329156, 258970, 300370, 329047, 230738, 140391, 197629, 194240, 17295, 6542, 95480, 168106, 182947, 139769, 112039, 163939, 201378, 194001, 205424, 161910, 119022, 118385, 77595, 53709, 200117, 251952, 190167, 184400, 247623, 169919, 122827, 145555, 183087, 235820, 195702, 281674, 291341, 268576, 244995, 202463, 249608, 296715, 335484, 354682]
8450C54682K500K2318l6038k8812q4583j53342J9451O3454J1171P2415K8074Q1695
8438C52985m5481j4279J4934N7361n1171p6136J6952M8926K7888q7874l1457L7762
8426B50410K4505J52169L9514o1160o1640j18189n6697l0339J35462P957p3791
8415B08201o0190l3828J3054P5746O2391M2972j2895j08075R3767Q9129P5023
8404D45295Q9217r5267K5375q6595k5438k6633j25969j87558J4565J07804L3404
8393A68200M0524j1951l2237j2556Q232O4108N3301m8809M7977j3445m3025j29623
8381I0696j02379m7080M4686J89308R4366n2085q5271n1301L7546J6025N5379
8370A89890P1343k423n6962R5850j0140N0665R9701O7791r1017o7850K0715K5835
$$ y = [354682, 357182, 379500, 343462, 314650, 230067, 76725, 96176, 159630, 170801, 243216, 271290, 352985, 307504, 293225, 308159, 365520, 314349, 238213, 255165, 304091, 331979, 244105, 212648, 250410, 274915, 427084, 466598, 405438, 343798, 225609, 168912, 138573, 274035, 281992, 208201, 148011, 114183, 127237, 202983, 265374, 308346, 295451, 187376, 281143, 370272, 445295, 534512, 439245, 464620, 378025, 352587, 325954, 199985, 12427, 26992, 134796, 168200, 208724, 196773, 164536, 151980, 160212, 224320, 277621, 228812, 276789, 263344, 220319, 90696, -11683, -58763, -14077, 175231, 269597, 217512, 132241, 80940, 118486, 134511, 189890, 261233, 258810, 201848, 297698, 287558, 338223, 437924, 505715, 414698, 346848, 367563, 393398]
8358C93398o4703j09567K073K5835j9445P5798J3378j1963N4708R4286p189M5202
8346D91811J06582N149k08867j21314p2037P0326Q2896Q675m2625N0037J09704
8335D80337J3851q1363j06689p4891k8084J2459m1856j14371M1760K8895P7386
8324B07434K7492J32197m4173j9924J9007j9794J5345r7044K5480J77854M8593
8313D72467l2498q9449o7925P1142J15199Q9250P420K9979K49630J71703K24943
8302A241861K05364j9730l59964m00737l0810N5492j10288j62069m4823K2522
8292C96818m7166j32619k7939R5877P4253J01877l6641q511l0115j02347J13185
8281C96672P7229q8998N7276l3837J1238Q9033J8935j05130o8628N6718Q7686
$$ y = [393398, 328695, 219128, 221201, 247036, 227591, 303389, 316767, 304804, 359512, 453798, 446609, 491811, 598393, 603542, 394675, 273361, 201324, 271650, 354546, 363221, 320596, 370633, 480337, 494188, 412825, 306136, 231245, 203161, 215620, 173764, 59393, 101153, 130048, 207434, 234926, 367123, 322950, 303026, 322033, 302239, 317584, 220540, 246020, 423874, 472467, 439969, 350520, 282595, 353737, 468936, 558186, 565606, 595585, 845215, 1016918, 1241861, 1447225, 1427495, 1067531, 666794, 635984, 691476, 581188, 419119, 374296, 396818, 349652, 217033, 189094, 284971, 359224, 461101, 424460, 415949, 385834, 283487, 396672, 473901, 384903, 442179, 408342, 419580, 508613, 527548, 422418, 353790, 410508, 498194]
8270D98194L1577j9901J2012j19947q2153M2756m2692o7293K6493R5524J83917
8259E58487J87810O0411N1959l5387j58084k04385n0134K3559o9533j55499J34538
8248C43742j1292k3366p6861q955O3379R1508K7267j6338k4787p8042p0933J18316
8236C33638M6452l0724j7046j01545o9986K4231J05029L8229j6506L9743m6656
8225C04859l1005o2398l1891p2319q4945R1318N1364J33677k0105N3328M9586
8214C81469j0439n9835K5984j17620m9091Q0768o5689q794k334J33043J02773
8203D10235M6312k2529p1378p7504k5045K9033n5313J6426P8111K7020j03667
8192B51701J7035P7131K6370J1191R126k9456j02094m682k2779q3092r1875L0379
$$ y = [498194, 529771, 509870, 521882, 401935, 319782, 362538, 319846, 252553, 279046, 374570, 558487, 746297, 806708, 858667, 823280, 665196, 460811, 410677, 434236, 364703, 209204, 343742, 332450, 309084, 232223, 223268, 286647, 378155, 405422, 389084, 364297, 286255, 215322, 333638, 380090, 349366, 332320, 230775, 160789, 185020, 290049, 328278, 311772, 351515, 304859, 273854, 211456, 179565, 107246, 22301, 113619, 164983, 298660, 278555, 331883, 381469, 371030, 311195, 337179, 219559, 170468, 251236, 185547, 176753, 174419, 307462, 410235, 456547, 434018, 362640, 285136, 260091, 289124, 233811, 250237, 328348, 355368, 251701, 268736, 345867, 372237, 383428, 392554, 363098, 261004, 256322, 233543, 150451, 58576, 88955]
8180H8955L4156P5264N0229o006L9634n6792j31573o5277R6421R3700r038J2294
8168B21967K3259n5768r183j3946k4195k6602K9180m4959N8882q7962j40049J9298
8156e0078M8138N5656N4778L7192K7162J3453L4068N1371O6232m4801j3914j3048
8144B66209q1309o1591K6012k2008q0727p2236O0108M4951J08889N8670p4355
8133A72613k4467R2990l7838p534k422J1762L3624l4205n3543q77P9049M1283
8121B70435p1579l8002m5333j3096N0485l1107k7939M9020K6979R772J2106k5402
8109A66339q0670j12481j25909M079L7284J10110k1917P4266M3846k6746k4777
8098D3424K6610j46012j62224j8078M1834J6226Q6771J8696O4321k3688L9456
$$ y = [88955, 123111, 198375, 248604, 242598, 282232, 225440, 93867, 28590, 125011, 218711, 209673, 221967, 245226, 189458, 180275, 166329, 142134, 115532, 144712, 99753, 158635, 70673, -69376, -50078, -1940, 53716, 108494, 145686, 172848, 186301, 220369, 271740, 337972, 293171, 279257, 266209, 184900, 123309, 149321, 127313, 46586, -25650, 34458, 79409, 188298, 246968, 172613, 148146, 241136, 203298, 195764, 193342, 205104, 238728, 204523, 150980, 150103, 229152, 270435, 198856, 160854, 115521, 102425, 152910, 121803, 93864, 142884, 169863, 179635, 191741, 166339, 85669, -26812, -152721, -148642, -111358, -1248, -23165, 51101, 94947, 68201, 43424, 70034, -75978, -238202, -256280, -214446, -198220, -111449, -92753, -28432, -52120, -12664]
8087a2664J26266J9637M3784r0716l666l902j0671Q478M5804K9297Q9906q3153
8075A58400n0970k0441n1553N897K0025P9406j18771p0427o9790J14476l0776
8064c4524j11663J3347N757M6617P6533j9981l6511J1953k3833o281O0642l782
8052b1726K7530n1421Q588Q8126O3086o252j64586l4567L4033R0869J26837j4284
8040A46233k476p5428j30810j03531L9872J17361M4691L484J10110J3631O695
8029A69832M848j01567n1205M1564k3520p6302k0076J03318M9463K3595L9542
8018A59492r1019q6485q8230m1490n5623l9328M7304Q1423P0872l3830l0132O8702
8006c8344K9381M2296N0829K6349N9049o5358j11783K1634Q083M7427o617P5050
$$ y = [-12664, 113602, 133239, 177023, 86307, 82641, 78739, 68068, 76546, 122350, 151647, 241553, 158400, 107430, 86989, 35436, 41333, 61358, 140764, 21993, -48434, -118224, -3748, -34524, -146187, -132840, -127083, -80466, -3933, -23914, -60425, -48472, -72305, -78586, -17944, -21726, 5804, -45617, -37029, 51097, 114183, 107931, -56655, -91222, -57189, 33680, 160517, 146233, 143757, 68329, -62481, -166012, -126140, -8779, 35912, 39396, 149506, 163137, 169832, 174680, 73113, 21908, 63472, 39952, -36350, -56426, 46892, 96355, 119950, 159492, 68473, -18012, -106242, -147732, -203355, -242683, -195379, -113956, -43084, -76914, -107046, -38344, -8963, 33333, 84162, 110511, 169560, 104202, -7581, 14053, 22136, 69563, 62946, 137996]
7994A37996n2417j37007j2281N9376j03946j31216N9970J5153R769m3263l6013
7983b33879j5435R5592Q5256m0266j3371J1205M0062q2716k6820M3034J00174
7972c7164J1906n1621J25364M1921k8071P564P2238O2p8776M259J5206N689o0573
7959B8004l1553n8363j05417J5130J4838o933R3025p1180K163J30028O4085l2591
7947D1236M7560l5907R986J4888r0536o2046K3019n2058L0696P5625R7624L6741
7935A36828m7717r0225n044P8081Q433L7981o1489k0477J2798K6967l0482N2752
7923I8406j7654r510m4898p9581p7716j59020J31367R7888J8050J26665M3460
7912A27457j22219n9536J02106n8320K4378R6359l2411M0801R097q7334j62005
$$ y = [137996, 85579, -51428, -63709, -4333, -108279, -239495, -179525, -164372, -154603, -197866, -233879, -249314, -153722, -68466, -108732, -122103, -110898, -70836, -153552, -180372, -137338, -37164, -25258, -76879, 48485, 90406, 62335, 69899, 142137, 142199, 63423, 67682, 82888, 88577, 28004, -3549, -61912, -167329, -152199, -137361, -144294, -51269, -122449, -120286, 9742, 73827, 41236, 88796, 52889, 62875, 77763, -12773, -74819, -51800, -103858, -73162, 2463, 100087, 136828, 89111, -1114, -6158, 71923, 80356, 118337, 56848, 36371, 49169, 76136, 45654, 98406, 80752, 71242, 26344, -53237, -130953, -289973, -158606, -60718, -42668, 83997, 127457, 5238, -54298, 47808, -10512, 13866, 110225, 77814, 118615, 127712, 40378, -121627]
7901a21627q3905q8696N2882J31469J646n8298o6493j16952M3953P0154j8544
7890b54411K8542R5657Q6648L2756Q8051L2202o8543o2819j5943Q0732N4598j95507
7878i8037m9989N993p919O8508R639P0713Q2210q2750r9430m5082J13616M7410
7866A4882m3626J279K3079j03845q8008O926N5160P9105n2640k1899Q4048O6321
7854B0782J533q4995o876L2514J35327P825o5655o952n8487j3842j07379m1580
7842a87785Q9810R5173m2157j8721j6293j5093N8616P5833N1159J3576j07480
7831c362K6996R6070M702k25894n1731N2078M9674P917q375O5898q322J3457J0098
7818B9206p5540j09J9346m8509p3472N1519l9562l9607Q6626J11221j4134n2279
$$ y = [-121627, -205532, -294228, -241346, -109877, -108231, -166529, -233022, -349974, -306021, -235867, -254411, -225869, -130212, -43564, -10808, 77243, 109445, 40902, -21917, -37860, 42872, 97470, -98037, -148026, -142033, -149952, -81444, -71805, -1092, 81118, -1632, -101062, -146144, -32528, 14882, -28744, -27465, -4386, -108231, -196239, -189313, -134153, -55048, -107688, -129587, -45539, 20782, 22315, -62680, -69556, -37042, 98285, 106110, 40455, 33503, -24984, -38826, -146205, -187785, -97975, -2802, -44959, -63680, -79973, -95066, -36450, 39383, 90542, 104118, -3362, 23634, 119704, 124406, -101488, -153219, -101141, -51467, -43550, -51925, 13973, 5651, 19108, 29206, -46334, -46443, -27097, -75606, -149078, -97559, -137121, -176728, -90102, 21119, 6985, -45294]
7806d5294p565r4879M1889J6281J28M1956j16327l0442J1810J17967j2461k4213
7794a01150j2858O7276m0162j28342J0368Q9482L1274M6949N9238l528M2412L955
7782F4914q4722j10516p800k2184m1846Q8686P2650p765M5389M2051m2961q3002
7770h7106J7504L6344K0963m0727P1765O3749r835j13979p7283J01713L6199k8881
7758i574P655p3941l3959J41831k5414p7172P2250N0515l9466p9175j6967k5201
7746a08618N5583K4274o2990Q8655p827J6730R494P1071P1791j06597j19523J21989
7734E4032R4667Q831K5903n6432p7798p5430Q3650L9927m3052p4006K7178M8171
7722E5641L7265o9345m9201o3766k2795Q3779R8448O6287O4540L8089Q751o2313
$$ y = [-45294, -52859, -147738, -105849, -89568, -89440, -47484, -163811, -194253, -182443, -64476, -76937, -101150, -114008, -46732, -86894, -215236, -204868, -115386, -84112, -37163, 22075, 18547, 60959, 64914, -19808, -130324, -138124, -160308, -202154, -113468, -40818, -48583, -3194, 38857, -4104, -87106, -69602, -33258, -12295, -53022, 18743, 82492, 72657, -41322, -118605, -16892, 19307, -9574, -1919, -75860, -109819, 32012, 6598, -70574, 1676, 52191, 12725, -66450, -83417, -108618, -53035, -28761, -91751, -3096, -10923, 5807, 15301, 86372, 158163, 51566, -67957, 54032, 148699, 157530, 183433, 127001, 49203, -26227, 57423, 97350, 54298, -19708, 7470, 55641, 92906, 23561, -25640, -89406, -112201, -28422, 70026, 136313, 200853, 238942, 247693, 185380]
7710A85380r7407j41402m8160P9318M2195l4045p8006K7813q1958R7631O0341
7699A1700m3122m9309J2216m9508P2280N4686N9346l988J5557n8969o5942j3120
7687e8173k4126p3931q6528O20N644J18164J2998J2958N1373J62553J19751j17135
7675A24168r3340j02295k3589J5470Q6684p4661j5146M0730L552n8962q5713o6867
7663b49969o857J33581L0774j11152J10437P8567j02666o231l3330K7359L1967
7652i7520P6861J05594O8044n4102k7694l3427m4104m8561n8356J48505J36274
7641A71514o211J1671p8708N279M2957o1011o6396R2725n9186j06432M1902J27752
7629A15856n1289j46420K9359k2389L0705J5273J117K3763o4458M354q0912l5304
$$ y = [185380, 87973, -53429, -101589, -22271, 19924, -14121, -92127, -64314, -146272, -48641, 11700, -31422, -80731, -68515, -118023, -45743, 8943, 68289, 64301, 79858, 20889, -45053, -58173, -82299, -156230, -242758, -242138, -236494, -118330, -105332, -92374, -41001, 121552, 241303, 124168, 30828, -71467, -95056, -79586, 7098, -67563, -82709, -41979, -38427, -97389, -183102, -249969, -256826, -123245, -92471, -203623, -93186, -14619, -117285, -123516, -156846, -129487, -97520, -20659, 84935, 152979, 98877, 71183, 37756, -6348, -54909, -113265, 35240, 171514, 165303, 176974, 98266, 103545, 146502, 85491, 19095, 111820, 52634, -53798, -11896, 115856, 64567, -81853, -52494, -74883, -44178, -28905, -27788, -4025, -68483, -64129, -145041, -180345]
7617a80345R7010J07841L7369l0705O8265k3784o2258r6058J4060J1663O5708
7606H766J1500o4200N6231J22266L2309R0883m1348j9190l6313p4153J8021n8735
7594D6037l4435j37755r7581m0601O2334M8943N0247K3772N7145L5293K2073k3811
7582A1661K7311J7823m4723N5650k13214o3157J03529J714q297O7897J20645J00547
7570A77386R1747J1465j27655k11989k1992l9674N3169L3036N4119L0999J5167
7559F5778R65j22148q4771P2163O0542K3396L5283q9306j18791O6808r6475m5084
7547b31640K509O8808L7223Q6989J21077k4070r3428k04560P7820J2107l973K1764
7535a29374L6895K0190q511P465J33306R7487l0080j43446r6647L0818J4856r6546
$$ y = [-180345, -83335, 24506, 61875, 31170, 99435, 75651, 13393, -82665, -68605, -56942, 8766, 20266, -43934, 12297, 134563, 166872, 257755, 216407, 197217, 160904, 86751, 104772, 46037, 11602, -126153, -223734, -264335, -202001, -153058, -102811, -79039, -21894, 13399, 35472, 11661, 38972, 56795, 12072, 67722, -145492, -208649, -105120, -103406, -111703, -43806, 76839, 177386, 269133, 280598, 152943, -59046, -81038, -120712, -67543, -34507, 19612, 50611, 65778, 66743, -55405, -140176, -68013, -7471, 15925, 51208, -38098, -156889, -90081, -186556, -231640, -229131, -160323, -123100, -36111, 84966, 60896, -32532, -237092, -159272, -147165, -151138, -129374, -92479, -72289, -80800, -73335, 59971, 157458, 127378, -16068, -112715, -81897, -67041, -163587]
7523a63587J3574J0125J6714M8223n1918k3553N3948O0435p8230l1482l7053J4836
7511a67968Q0344O3009J20966l2187j18252J47469J701j63658N6844R8621j85457
7500i8568j03287m3447K3191L2191k9899O7490J23808n3990j7032N2560j748J08721
7488E9990l3345N5177p1989o5197q818Q3201J1007m9144q7082O1423J2980o7324
7476i9121l3465J2323J07593N9393r9506m1505p7104J9944K9140J16218j08696
7465a14786n6729N4496J04497j6678j52978o2711Q5610R1837P0957R1101L5396
7454A30012M719q5719R3496R0448j46189j11156q0076j01476P020J23592K551
7443g2778M9444j6802o5487R9894J6283j39015j09261P9344N8255l3323P0519
$$ y = [-163587, -150013, -139888, -123174, -74951, -126869, -150422, -96474, -36039, -114269, -145751, -182804, -167968, -87624, -24615, 96351, 64164, -54088, 93381, 95082, -68576, -11732, 86889, -98568, -201855, -245302, -222111, -189920, -219819, -152329, -28521, -82511, -99543, -46983, -48731, 59990, 26645, 81822, 9833, -55364, -64182, 19019, 30026, -19118, -106200, -44777, -31797, -99121, -132586, -120263, -12670, 46723, -52783, -94288, -171392, -151448, -122308, -6090, -114786, -171515, -117019, -12522, -29200, -182178, -244889, -159279, -67442, 3515, 94616, 130012, 134731, 49012, 142508, 232956, 86767, -24389, -104465, -205941, -198921, -75329, -72778, -23334, -40136, -105623, -5729, 10554, -128461, -237722, -158378, -100123, -133446, -62927]
7432f2927O8457P2220J14785j02760o3663j4537L5994n3736n154N5792j11384
7421f6913M4584L0266m4519R5915n9050j21990o71J32725L1093N915N236n4770
7409b179q0881l5545j9190j9706j21579L2685l1509N8538J49275J23724k5384
7398B8249Q1855k4771k22369r5128O8228L954R3884P2680K142q6233R6443Q654
7386B7588p2755K6750O3607j00098m596m3898k1270K5580M166N717M7005O7190
7374B4986L0317o1435j6850M0296O8144N6388o5792k7102q6915j56476j58395
7363c52834J09822J49767n6239P6635O8724R704p6501r7750l1498k8925N2009
7352a77086J01470R3320N6987o5025j27055K3188L0863l6618l3488J41675J7226
$$ y = [-62927, 5530, 77750, 192535, 89775, 26112, 11575, 47569, -6167, -11321, 44471, -66913, -22329, 7937, -36582, 59333, 283, -121707, -122378, 10347, 41440, 47355, 52591, -2179, -83060, -118605, -137795, -157501, -279080, -246395, -277904, -219366, -70091, 53633, 28249, 110104, 85333, -137036, -232164, -163936, -159982, -66098, 6582, 8724, -77509, 18934, 27588, -45167, -18417, 45190, -54908, -59504, -103402, -124672, -99092, -94926, -89209, -42204, 24986, 55303, -6132, -22982, 17314, 85458, 141846, 76054, 48952, -37963, -194439, -352834, -243012, -93245, -149484, -72849, -4125, 5579, -70922, -168672, -200170, -229095, -177086, -75616, 17704, 74691, 9666, -117389, -94201, -63338, -99956, -133444, 8231, 25457]
7341B5457j03951o5126R8916O7534n7069r8410m6628n0005Q9095J66681N507O5443
7329I7444K2753j17986J6809N3897L2822p8215J3065m4277j11869K1091K1603
7318g2863p6537l2629J40184J09660R2267j28476k0105l2842l3469J06989j23381
7307g1202r9443J26858J59139N400k9391M2614p6201k5993n2691J3163N367j55135
7295a57515j62939P1699N7072M7171j7687q8755R4099N0183J6880J2196k2128
7284i9724J17244J9588j448N4663l8264j27789J23262m143j1266J0594N9069L0536
7272A32322J759O2348q8466j16926j62789j1722j962K9591L579k39P7082j2502
7260h7925K2237p4129k4269n8707O1920n4523O821J16136O0627j26134L199K2060
$$ y = [25457, -78494, -143620, -44704, 22830, -34239, -132649, -179277, -229282, -140187, 26494, 32001, 97444, 120197, 2211, 19020, 72917, 105739, 27524, 40589, -3688, -115557, -94466, -72863, -149400, -182029, -41845, 67815, 160082, 31606, 11501, -21341, -54810, 52179, -71202, -170645, -43787, 115352, 120752, 91361, 133975, 57774, 31781, -20910, -7747, -2380, -157515, -320454, -248755, -191683, -144512, -162199, -250954, -156855, -106672, -89792, -77596, -99724, 17520, 37108, 35660, 90323, 52059, -75730, 47532, 43389, 32123, 42717, 101786, 132322, 134081, 196429, 107963, -8963, -171752, -183474, -185436, -155845, -152266, -152505, -75423, -87925, -65688, -139817, -164086, -222793, -160873, -215396, -208575, -92439, -31812, -157946, -154747, -132687]
7248a32687J20383K2577n830L6751r5408j18917j3351R3920N6093n0750J5776
7237g1443K0515j12557l1151j6306Q9678J01537j9757q4783k5041J0855k3375
7226a61828j17691N9491L7087l5004r1676K4535J32844R690n4903M6182n3759
7215b05032N8162J4722q5919j09601P2358K11764M9913j58319j24954j5854m8368
7204c41128Q1331P1867k4569p666p1812m6348R5064J42445J48509k7959m1618
7193b1884n8377r2644Q0350j1463j9782Q0826J5406k7692j12179Q3648J03691
7182A9900Q595k1192l4402j5580R100j3762k5772q7810q4652P439O8865J6940
7170a52331J00838j8597M149O9608J2796j47411j47732Q5580L4925L9827l3724
$$ y = [-132687, -12304, 10273, 4443, 41194, -54214, -173131, -186482, -92562, -36469, -87219, -71443, -50928, -163485, -194636, -210942, -121264, -19727, -39484, -124267, -149308, -138453, -161828, -279519, -220028, -182941, -217945, -309621, -285086, -152242, -142552, -197455, -151273, -205032, -146870, -132148, -218067, -327668, -255310, -43546, 6367, -151952, -276906, -292760, -341128, -259797, -187930, -212499, -220165, -291977, -338325, -243261, -100816, 47693, 19734, -21884, -80261, -172905, -92555, -104018, -123800, -42974, -27568, -55260, -167439, -83791, 19900, 28495, 7303, -27099, -42679, -33579, -47341, -73113, -160923, -245575, -238136, -169271, -152331, -51493, -70090, -65941, 3667, 16463, -130948, -278680, -193100, -158175, -118348, -152072]
7159a52072j02092j7373N9974l3068l9J04931R1439L6050o8633M325j778J9661
7147e8675K3830p0552q1484n6457J64405J07114K2541r3501k7120n3476r6598
7136b19973m7157M3558M6405k8736J18550R0133L6840k079K5183r4668q8349L0211
7124i0082J3304P7813q6828n2708k6827O7997m4850j14725k8569Q5974Q9172M3208
7112f7121Q882o255n1386j9215o6429K7678J7624k7789M6553M3779N5339j23284
7100a61624j26979j6711O3530p80m1846L6102q834R6625K1868N9318Q7192R8720
7088A06581k1878j77965o0543J00414j305M9803N6859k7370m7858M6730K5538
7077D9006k7966o7965j5993J23448k803j39589l1716J04249J91544K0032r1279
$$ y = [-152072, -254164, -271537, -211563, -244631, -244670, -139739, -48300, -12250, -80883, -76558, -78336, -58675, -34845, -105397, -186881, -243338, -78933, 28181, 50722, -42779, -69899, -123375, -219973, -267130, -223572, -177167, -205903, -87353, 2780, 39620, 37541, 62724, -31944, -120293, -90082, -76778, 1035, -85793, -138501, -165328, -97331, -142181, -256906, -285475, -199501, -110329, -67121, -58239, -64494, -115880, -135095, -201524, -173846, -156222, -184011, -137458, -93679, -38340, -161624, -288603, -305314, -241784, -242564, -284410, -248308, -257142, -160517, -138649, -79331, 7861, 106581, 84703, -93262, -153805, -53391, -54696, -4893, 51966, 24596, -23262, 23468, 49006, 21040, -46925, -62918, 60530, 57727, -81862, -113578, -9329, 182215, 202247, 110968]
7066A10968j66520p3646K0483J22083n1700j70656p3415K1100N4903m5820O5767
7055a86453O2974J20646o9138J0609K8585Q4951j7961j36424k7356L9746j3394
7044a03215k5755J81230J05070r3204j92789r9760K069l203O8461M7393j62142
7033b75845n2803L4781J0010R3346M8483j2375m7150j11783L8590M2543K8105
7022b04098j0247j0506j5250j6319p634J27945M7396j9141l2883J24995N0275
7011C4533p037r7309n0261p4878K9133J6732j0575M3822Q620k2411K7539J09065
6999F973J6508K1052L4488P1626O8232o8274q7443p0591p3747o2837N1642Q4036
6987h335l7885r9066p8517m0755N4510J04385o6210o4815m067r1270j00241j1047
$$ y = [110968, -55552, -129198, -108715, 13368, -38332, -208988, -282403, -261303, -206400, -252220, -186453, -123479, -2833, -71971, -61362, -32777, 52174, 34213, -102211, -129567, -89821, -103215, -128970, 52260, 157330, 64126, -128663, -228423, -226354, -229557, -161096, -113703, -275845, -328648, -293867, -283857, -190511, -142028, -154403, -201553, -313336, -274746, -232203, -204098, -214345, -224851, -240101, -256420, -264054, -136109, -88713, -107854, -140737, -15742, 34533, 27496, -69813, -120074, -194952, -165819, -149087, -159662, -115840, -107220, -129631, -102092, 6973, 23481, 44533, 79021, 150647, 218879, 150605, 63162, -7429, -81176, -144013, -92371, -8335, -46220, -145286, -223803, -264558, -210048, -105663, -171873, -236688, -240755, -332025, -432266, -443313]
6975d43313L491J46075R5709P5183l3160j0713j6864O3678k5912n3232l0460N2070
6963a77448L0971r0815o4528Q3545R1661K2912k3113R0199K2007l7776j6395n5280
6951a24060N1158J19003l5781p3966r5296n8836k0808j5807j2018Q4939J61787
6940a9685j1386n2042m638l8585r6137k2597P8481J14388N9614k4025j4851j71011
6928b02474K2728J07173o0544k1255M2516R0168l0697j3496N0490m1626o028K4376
6916c8669L0307m4762l5614j8734j8370o5648n0326L1122L2041O2362L0099J82993
6904I6801P8307j03826n6644j3049l6163l2202j08899j35374N4031K2020o5291
6893c00289k1996L2832L0950m8081k3730l1413J2908J38973j9895O0086o8019
$$ y = [-443313, -439822, -293747, -198038, -122855, -156015, -166728, -183592, -119914, -145826, -199058, -229518, -177448, -146477, -237292, -301820, -218275, -126614, -103702, -126815, -36616, -14609, -52385, -68780, -124060, -72902, 46101, 10320, -63646, -158942, -217778, -238586, -254393, -266411, -181472, -19685, -31071, -83113, -87751, -126336, -222473, -245070, -166589, -52201, 7413, -16612, -31463, -202474, -179746, -72573, -133117, -154372, -111856, -21688, -52385, -65881, -15391, -57017, -63045, -38669, -8362, -53124, -88738, -107472, -125842, -191490, -241816, -210694, -178653, -116291, -86192, 96801, 175108, 71282, 14638, 1589, -34574, -66776, -175675, -311049, -257018, -234998, -300289, -322285, -289453, -258503, -306584, -330314, -361727, -348819, -209846, -229741, -169655, -237674]
6882b37674j49058Q0789J12031K8376l6657L5357J48786L5684o4100P227K4940
6871a4299n0363j08615j37162m2898J61386J20990o3216n9378N7940R6744k1788
6860f0659p5361q4035o1186R5777J02452j0513R116j13858q3373J60966P9034
6849d1640R0090K8658j28592j11766J816J2654l8536N3375P9203o3629M3406m7831
6837a22792j13279j5382P5959K9408m813k3056L1570O9004R7235j3337j20631
6826a10114r0171m6865Q4069J22029Q6279J4558j41315r7952J36k4469Q8859n2110
6814a67066k3930J5468R1795J51564O3474j28713l2137J9280r0991p8059M7198
6803a32117M4113J4159J02089k5712p9434q1054k1865n4397N713J9988n818Q5536
$$ y = [-237674, -386732, -305943, -193912, -165536, -202193, -166836, -18050, 17634, -46466, -39239, -14299, -64662, -173277, -310439, -353337, -191951, -70961, -134177, -193555, -135615, -38871, -60659, -136020, -220055, -281241, -185464, -83012, -93525, -84409, -198267, -281640, -120674, -41640, 48450, 77108, -51484, -163250, -161434, -148780, -187316, -133941, -54738, -118367, -74961, -122792, -236071, -251453, -175494, -146086, -150899, -173955, -142385, -73381, 23854, 10517, -110114, -200285, -247150, -163081, -41052, 45227, 59785, -81530, -179482, -179346, -203815, -114956, -167066, -190996, -175528, -83733, 67831, 131305, 2592, -29545, -10265, -101256, -179315, -132117, -88004, -73845, 28244, 2532, -76902, -157956, -179821, -234218, -228505, -208517, -214335, -128799]
6791a28799Q9843K137q1827o5628J26180J65760J22756j14043j16162r9299j4365
6780a13447R5319l5283j8842p6889J02610R35n8106R4928J3970l0810n5121l0319
6768a11055n5468J0583m5741m9119O5253K9873Q096l9096Q5080R1304k9963j21187
6756a61440j7597n0238j29959r513O933m1449K23030J59434l721j45466K8736
6745a41250N8856K2707q4738J1742J0092K6913p8975J669n0464p9199J13299K16658
6733B7310n5770j25056m4569L4792P238j9283j14124k2278R2357L6741L4598l0354
6721a78398K3128k7216P3912J8250L8847R7217M7155l0855k4709m2400p5038p8831
6709a58938p0173J28449K6559P6618L0254m811K2775J45164p2245j42566j36446
$$ y = [-128799, -38956, -36819, -118646, -184274, -58094, 107666, 230422, 116379, 217, -99082, -113447, -18128, -53411, -72253, -149142, -46532, -45597, -103703, -8775, 5195, -25615, -80736, -111055, -166523, -155940, -201681, -250800, -185547, -155674, -147578, -186674, -101594, -10290, -40253, -161440, -179037, -229275, -359234, -368747, -361814, -403263, -180233, -20799, -24520, -169986, -141250, -82394, -59687, -144425, -132683, -122591, -95678, -174653, -172984, -223448, -302647, -189348, 27310, -28460, -153516, -198085, -163293, -156055, -175338, -289462, -311740, -219383, -182642, -148044, -178398, -155270, -182486, -108574, -90324, -51477, 45740, 92895, 62040, 37331, -5069, -80107, -158938, -229111, -100662, -74103, 2515, 32769, 27958, 50733, 195897, 123652, -18914, -155360]
$$ [...]
##END NTUPLES=NMR SPECTRUM
##END=
